##TITLE=	Nov04-2021.22.ser
TM-VI-146repeat solid dmso d6 hsqc

##JCAMP-DX=	6.0	$$ MestReNova 14.3.0-30573
##DATA TYPE=	LINK
##BLOCK_ID=	1
##BLOCKS=	2    
##ORIGIN=	Mestrelab Research S.L.
##OWNER=	hrzepa
##$MNOVA/LINK_BLOCK_TYPE=	ITEM	$$ NMR Spectrum
##$MNOVA/ITEM/POLYGON=	(XY..XY)
5321,5835
8722,5835
8722,8208
5321,8208
5321,5835
##$MNOVA/ITEM/Z=	0
##$MNOVA/ITEM/ANGLE=	0
##TITLE=	Nov04-2021.22.ser
##JCAMP-DX=	6.0	$$ MestReNova 14.3.0-30573
##BLOCK_ID=	2
##DATA TYPE=	MNOVA NMR VIEW DATA
##DATA CLASS=	MNOVA VIEW DATA
##$MNOVA/2D/THRESHOLD=	4.8524003028869628906
##$MNOVA/ITEM/ZOOM/X=	-0.57569381887933257502,	10.597560000003785063
##$MNOVA/ITEM/ZOOM/Y=	-9.5463849045685140737,	230.0176000018207958
##END=	
##TITLE=	Nov04-2021.22.ser
##JCAMP-DX=	6.0	$$ MestReNova 14.3.0-30573
##BLOCK_ID=	3
##DATA TYPE=	nD NMR SPECTRUM
##DATA CLASS=	NTUPLES
##NUMDIM=	2
##ORIGIN=	Bruker BioSpin GmbH
##OWNER=	nmr
##.OBSERVE FREQUENCY=	400.20200099999999566
##.OBSERVE NUCLEUS=	^1H
##.SOLVENT NAME=	DMSO_weak
##.PULSE SEQUENCE=	hsqcetgpsi2.ph
##LONGDATE=	2021/11/04 16:45:00.000
##.ACQUISITIONMODE=	SIMULTANEOUS (DQD)
##$ORIGINAL FORMAT=	Bruker XWIN-NMR
##$MNOVA/SCALES_VERSION=	9
##$PARAMETER FILE=	(acqu2s, ASCII, /private/var/folders/f6/rjf_tdyn2v98c5c0wvkgn4s80000gn/T/GJRoFGbHT5yv0MhQF$+syw/22/acqu2s, 0)
$$ ##TITLE= Parameter file, TOPSPIN		Version 3.2
$$ ##JCAMPDX= 5.0
$$ ##DATATYPE= Parameter Values
$$ ##NPOINTS= 241	$$ modification sequence number
$$ ##ORIGIN= Bruker BioSpin GmbH
$$ ##OWNER= nmr
$$ $$ 2021-11-04 16:54:04.883 +0000  nmr@CZC2439F63
$$ $$ /opt/topspin/data/agmb/nmr/Nov04-2021/22/acqu2s
$$ $$ process /opt/topspin3.2/prog/mod/go
$$ ##$ACQT0= 0
$$ ##$BF1= 100.63037
$$ ##$FnMODE= 6
$$ ##$NUC1= <13C>
$$ ##$NusJSP= 0
$$ ##$NusT2= 1
$$ ##$NusTD= 240
$$ ##$O1= 11069.4607123918
$$ ##$SFO1= 100.641439460712
$$ ##$SW= 240.006397974962
$$ ##$SW_h= 24154.5893719807
$$ ##$TD= 240
$$ ##END=
$$ 
##$PARAMETER FILE=	(acqus, ASCII, /private/var/folders/f6/rjf_tdyn2v98c5c0wvkgn4s80000gn/T/GJRoFGbHT5yv0MhQF$+syw/22/acqus, 0)
$$ ##TITLE= Parameter file, TOPSPIN		Version 3.2
$$ ##JCAMPDX= 5.0
$$ ##DATATYPE= Parameter Values
$$ ##NPOINTS= 12	$$ modification sequence number
$$ ##ORIGIN= Bruker BioSpin GmbH
$$ ##OWNER= nmr
$$ $$ 2021-11-04 16:54:08.295 +0000  nmr@CZC2439F63
$$ $$ /opt/topspin/data/agmb/nmr/Nov04-2021/22/acqus
$$ $$ process /opt/topspin3.2/prog/mod/shimcntl
$$ ##$ACQT0= 1000000
$$ ##$AMP= (0..31)
$$ 100 100 100 100 100 100 100 100 100 100 100 100 100 100 100 100 100 100
$$ 100 100 100 100 100 100 100 100 100 100 100 100 100 100
$$ ##$AMPCOIL= (0..19)
$$ 0 0 0 0 0 0 0 0 0 0 0 0 0 0 0 0 0 0 0 0
$$ ##$ANAVPT= -1
$$ ##$AQSEQ= 0
$$ ##$AQ_mod= 3
$$ ##$AUNM= <au_zg>
$$ ##$AUTOPOS= <52 >
$$ ##$BF1= 400.2
$$ ##$BF2= 100.63037
$$ ##$BF3= 400.2
$$ ##$BF4= 400.2
$$ ##$BF5= 400.2
$$ ##$BF6= 400.2
$$ ##$BF7= 400.2
$$ ##$BF8= 400.2
$$ ##$BYTORDA= 0
$$ ##$CAGPARS= (0..11)
$$ 0 0 0 0 0 0 0 0 0 0 0 0
$$ ##$CFDGTYP= 0
$$ ##$CFRGTYP= 9
$$ ##$CHEMSTR= <none>
$$ ##$CNST= (0..63)
$$ [...]
$$ 0 0 0 0
$$ ##$ShimPowMaxUC= (0..63)
$$ 130000 130000 130000 130000 130000 130000 130000 130000 130000 130000 130000
$$ 130000 130000 130000 130000 130000 130000 130000 130000 130000 0 0 0 0
$$ 0 0 0 0 0 0 0 0 0 0 0 0 0 0 0 0 0 0 0 0 0 0 0 0 0 0 0 0 0 0 0 0 0 0 0 0
$$ 0 0 0 0
$$ ##$ShimPowMaxUG= (0..63)
$$ 524287 524287 524287 524287 524287 524287 524287 524287 524287 524287 524287
$$ 524287 524287 524287 524287 524287 524287 524287 524287 524287 0 0 0 0
$$ 0 0 0 0 0 0 0 0 0 0 0 0 0 0 0 0 0 0 0 0 0 0 0 0 0 0 0 0 0 0 0 0 0 0 0 0
$$ 0 0 0 0
$$ ##$ShimPowRcbType= 3
$$ ##$ShimPowRes= (0..63)
$$ 1e-20 1e-20 1e-20 1e-20 1e-20 1e-20 1e-20 1e-20 1e-20 1e-20 1e-20 1e-20
$$ 1e-20 1e-20 1e-20 1e-20 1e-20 1e-20 1e-20 1e-20 0 0 0 0 0 0 0 0 0 0 0 0
$$ 0 0 0 0 0 0 0 0 0 0 0 0 0 0 0 0 0 0 0 0 0 0 0 0 0 0 0 0 0 0 0 0
$$ ##$ShimPowRng0= (0..63)
$$ 1 1 1 1 1 1 1 1 1 1 1 1 1 1 1 1 1 1 1 1 0 0 0 0 0 0 0 0 0 0 0 0 0 0 0 0
$$ 0 0 0 0 0 0 0 0 0 0 0 0 0 0 0 0 0 0 0 0 0 0 0 0 0 0 0 0
$$ ##$ShimPowRng1= (0..63)
$$ 1 1 1 1 1 1 1 1 1 1 1 1 1 1 1 1 1 1 1 1 0 0 0 0 0 0 0 0 0 0 0 0 0 0 0 0
$$ 0 0 0 0 0 0 0 0 0 0 0 0 0 0 0 0 0 0 0 0 0 0 0 0 0 0 0 0
$$ ##$ShimPowRng2= (0..63)
$$ 1 1 1 1 1 1 1 1 1 1 1 1 1 1 1 1 1 1 1 1 0 0 0 0 0 0 0 0 0 0 0 0 0 0 0 0
$$ 0 0 0 0 0 0 0 0 0 0 0 0 0 0 0 0 0 0 0 0 0 0 0 0 0 0 0 0
$$ ##$ShimPowRng3= (0..63)
$$ 1 1 1 1 1 1 1 1 1 1 1 1 1 1 1 1 1 1 1 1 0 0 0 0 0 0 0 0 0 0 0 0 0 0 0 0
$$ 0 0 0 0 0 0 0 0 0 0 0 0 0 0 0 0 0 0 0 0 0 0 0 0 0 0 0 0
$$ ##$ShimSysFunc= (0..63)
$$ 1 2 3 4 5 7 9 11 15 16 8 10 12 14 6 17 13 18 19 20 0 0 0 0 0 0 0 0 0 0
$$ 0 0 0 0 0 0 0 0 0 0 0 0 0 0 0 0 0 0 0 0 0 0 0 0 0 0 0 0 0 0 0 0 0 0
$$ ##$ShimSysMatrix= 0
$$ ##$ShimSysType= 1
$$ ##$TFXNUM= 0
$$ ##$TRIPLO2= 0
$$ ##$VTU= 2
$$ ##$VTUETH= <149.236.99.20>
$$ ##$VTUTY= <no>
$$ ##$WBREFAM= (0..15)
$$ 135.5 97.7 100 100 100 100 100 100 100 100 100 100 100 100 100 100
$$ ##$WBREFLM= (0..15)
$$ 0 0 0 0 0 0 0 0 0 0 0 0 0 0 0 0
$$ ##$WBREFPH= (0..15)
$$ 72.26 -67.22 0 0 0 0 0 0 0 0 0 0 0 0 0 0
$$ ##$WBSGU= (0..15)
$$ 0 0 0 0 0 0 0 0 0 0 0 0 0 0 0 0
$$ ##$XFAC= 2
$$ ##END=
$$ 
##$DECIM=	4464
##$DSPFVS=	20
##.ACQUISITIONSCHEME=	ECHO-ANTIECHO
##NTUPLES=	nD NMR SPECTRUM
##VAR_NAME=	FREQUENCY1,	FREQUENCY2,	SPECTRUM
##SYMBOL=	F1,	F2,	Y
##.NUCLEUS=	13C,	1H
##.OBSERVE FREQUENCY=	100.64143946071199309,	400.20200099999999566
##VAR_TYPE=	INDEPENDENT,	INDEPENDENT,	DEPENDENT
##VAR_FORM=	AFFN,	AFFN,	ASDF
##VAR_DIM=	512,	512,	262144
##UNITS=	HZ,	HZ,	ARBITRARY UNITS
##FIRST=	23146.756194512010552,	4241.1435120000014649,	0.28133004903793334961
##LAST=	-960.65624510154020754,	-230.39266631542668051,	-0.10205376148223876953
##MIN=	-960.65624510154020754,	-230.39266631542668051,	-2.2494623661041259766
##MAX=	23146.756194512010552,	4241.1435120000014649,	50.13071441650390625
##FACTOR=	1,	1,	0.0048334350577425647111
##PAGE=	F1=23146.8
##FIRST=	23146.756194512010552,	4241.1435120000014649,	0.28133004903793334961
##DATA TABLE=	(F2++(Y..Y)), PROFILE
$$ [...]
##PAGE=	F1=5125.17
##FIRST=	23146.756194512010552,	4241.1435120000014649,	-0.013769216835498809814
##DATA TABLE=	(F2++(Y..Y)), PROFILE
-230f2
##PAGE=	F1=5030.81
##FIRST=	23146.756194512010552,	4241.1435120000014649,	0.2178774029016494751
##DATA TABLE=	(F2++(Y..Y)), PROFILE
4241fJ5qq5N7k4p2J15J1K2o5kQ5j97M0N5M5P2pQ6k38J39J0k2nj17RP6j6O2l5K3l8j6K6l4j2
3926e1j5M8M3J07j42j29Q3L5K6o0K5n9J28n6N4Nj04JJ39l6j44J01P7j3Pj05O6L3m0p9m4l7
3646a36J23r1N7R6j09J2N1l7R8k3R3k29J28l4l0m5k7J72q5J14q3j5m2R9j37R9k8j25J91j25
3384f8J6j1J25j33qm5J14J%p8R0O6n0j54R4N6Kj27j2K13k6q6r4J41n4N9k8n4jn1J76J26j20
3095G9p6o8J38j25j5k8p5K04r1J15o9J21j21r6J06k4m7j32J00J73o9l2J29q4m4P2m8k0M9k
2832B0M4j78N1N3l2l3M1j18K44j22j3%n7J44LL1m8L0P2j14m4M5k6n3K4l4J37p7j2k3ro3J47
2544C0j2o2J24j22K2m9J05rr6j8J97j29lJ53J4%j19r9O6K2M6o7l1M0J87r0j40J0L6N6p6J43
2264A29n5j58J63n2P3j24n8l9K8P7L1N6p2QJ05q6M3j7r2O6j43J74j09K1R2M5j00N9j30L6J62
$$ plain form
4241 -6 9 1 -84 -27 -51 -123 -8 3 25 -40 -42 43 -154 -114 -59 -14 58 51 137 -101 38 48 26 21 -96 -87 -11 -27 35 0 23 -15 -31 -5 -39 -51
3926 -51 -66 -18 25 132 -10 -139 -56 -21 5 -55 -30 -89 39 -17 37 42 -62 -61 78 42 -102 -1 76 63 70 -35 31 64 24 -55 -99 -136
3646 -136 -13 -104 -47 49 -60 -48 3 -34 64 41 134 -95 33 -1 -31 -76 -103 69 -16 98 15 0 -42 57 -80 19 -9 -134 57 -68
3384 -68 -52 -63 62 -71 -79 -124 -10 -9 -9 -87 3 69 19 -135 -41 15 17 -110 -122 91 65 -21 -115 26 -28 31 3 -51 -52 -103 73 199 79
3095 79 3 -65 73 -52 -67 -95 -170 34 -57 58 -11 110 -11 -107 -1 -25 -72 -204 -104 69 0 -32 97 13 -31 41 -7 -27 22 20
2832 20 64 -114 -63 -10 -42 -75 -34 -152 92 -30 -43 -43 -100 44 47 78 30 60 132 18 -26 19 -7 -60 -36 -70 67 -10 -22 -45 -54 -117 30
2544 30 18 -44 80 -42 -20 -69 36 27 -69 -87 110 -19 -22 131 145 145 26 -73 -7 15 61 -6 -37 3 190 100 -40 -30 6 62 -14 129
2264 129 74 -84 79 27 100 -24 -82 -121 -93 -16 15 71 -1 7 112 26 69 52 -40 26 -117 57 -52 -31 61 106 6 65 -65 -29 133
1992A33r1j3k0r2J36m6n1j79J66O8qN3j4K9o7q3P9R3l8m2qJ12J4j03o0M7k0N7p0J10j8j23
1712d9O2o1N9R4j81J07j06k7Q4P1j14R8Lo5M4p1qO6qK9R2l2mj73N5j3n3j6O6J09l5o5k5Q8
1415B1Q0J31k10q8O7q4K7P5l4lM4o3P6J2k3l0n0OJ00l2J35q2L9m8j30P3n6M7j9J2k7r0J92
1126F8j26k3K16r5o3o1J85o6Npr1N7p5R4J07j46P5o5o5J01P9n0r6L8NK3R5jj16pr5J02j11
837a09J02R2l5p0Qol6N4J18j37M4o1j18K52p3J0J11k22n0Q5P0n1j08K28m9K4j47J24Jm6L6
566D1m5j9p3J7M4J07J9l4k1m3l1j13J32K2N0k2o0K36j86m8N4j05P4J8j39J02o0M9P0o8p7O9
286d0Q2M4j13O8K0J01k33M5O7J37m4k02J9k2J28m4n9q3J09m3P9o7rmJ68q5M6j2p6L1L3j52
6a11J46l7M7m0J24l4j89M4L8N6P3j47jJ5MN0N1M5j63r0L7P6m0L5J03k8j02
$$ plain form
1992 133 42 29 9 -83 53 7 -44 -223 -57 11 3 56 42 71 4 -79 0 93 55 13 5 117 131 28 -32 15 -5 52 -18 92 74 -49
1712 -49 13 -48 11 105 -76 31 -75 -102 -18 53 -61 37 40 -25 19 -52 -60 6 -2 27 119 87 83 -90 -35 -48 -101 -117 -51 58 23 -42 -67 21
1415 21 101 232 22 -66 1 -83 -56 19 -15 -18 26 -37 39 51 28 -2 -52 -46 54 22 157 75 114 66 -64 9 -47 0 -19 -7 -34 -124 68
1126 68 -58 -81 135 40 -23 -84 101 35 40 33 -58 -1 -76 18 125 -21 54 -11 -76 25 104 54 -42 -4 1 24 119 118 2 -5 -100 2 -109
837 -109 -7 85 50 -20 -12 -18 -54 0 118 -19 25 -36 -154 98 25 35 146 -76 -126 -41 29 -22 -130 98 49 73 -74 50 51 5 41
566 41 -4 -23 -96 -79 -35 72 91 57 36 -7 -38 -151 -19 3 53 31 -29 207 21 -27 27 -78 -4 14 -125 -23 -83 -34 36 -32 -109 -40
286 -40 42 86 -27 41 61 162 -71 -26 41 178 134 -68 -49 -71 57 13 -46 -129 -20 -63 16 -51 -60 -64 104 19 65 53 -23 8 41 -111
6 -111 35 -2 45 5 129 95 -94 -50 -12 44 117 -30 -31 -16 -12 38 89 134 -29 -119 -82 -6 -46 -11 92 64 -38
-230c8
##PAGE=	F1=4936.46
##FIRST=	23146.756194512010552,	4241.1435120000014649,	0.16210158169269561768
##DATA TABLE=	(F2++(Y..Y)), PROFILE
4241hj0mo9N1k1l5Q8J2op8QR0j58O4L9lJ21l4Nj42J31po4K5r3J7P8m5R3n1Q0j06%N0n5q9Q1
3917d5K2J6J07j02j66J26N0J0j14M6q9J48l8OQ2j54K5J27j3j39J23N9l3l0o2N3J2Nj21k0l
3646a12N8l9J02J9m4j3J8NJ03l7M2k12J72j10j1j0qJ29o9J34p0q7J3N0o4R3p3r8J79r0mj9
3366e3P2j05J6p6J35k1Q2r3L0N3n1j22R2P1m7j03k0K52j3j53j01J76n8L9k0k8m1m6K18N1j09
3095B7o5j8J12p8k0m9o8J46j8P5j04J63r6j38O5JoL7n8J36q0J7R3j17j9Q7k9k1L4N2j3j46
2815i8P3K2K2q6P5j55K01n5m1L9j02J19K9N7p7J1J23j85n2P4lk6K7o7R9j8j0rk0o8R0jNO1
2517E4p4k8j2P5J1j35L9J68j09J6J00N1lj64r6Q9M9O5p8l9J9J45o8j36nQ0M2k4R4p3j53J30
2237C0n9J66k01o2O9K1L8J6L2m7j7J31j20M5pp3O7j58J59j12P1O9K3k3k5j11P8J34j17M3o6
$$ plain form
4241 -8 -18 -22 -91 -40 -61 -96 -8 4 -2 -80 -72 18 -140 -76 -37 -40 81 47 52 -90 41 34 -30 -5 -98 -81 -3 -48 45 -6 74 -32 -32 18 -37 -126 -45
3917 -45 -23 -7 100 -2 -168 -42 8 18 -96 -50 -139 9 -29 -23 59 -95 -70 57 44 -95 28 87 54 24 -38 15 27 32 -89 -109 -112
3646 -112 -54 -93 9 28 -16 -29 -11 -6 97 60 102 -110 62 -48 -59 -69 -77 52 -17 117 47 -40 -27 23 -41 52 -21 -119 60 -30 -34 -53
3366 -53 19 -86 -70 -146 -11 -32 50 -43 -13 40 -11 -133 -41 30 -17 -120 -140 112 99 -54 -155 21 -37 2 -18 -46 -87 -133 85 136 27
3095 27 -38 -56 56 -22 -42 -91 -159 -13 -31 44 -60 103 7 -131 -66 -65 -71 -34 -92 44 -36 -19 74 -43 -62 25 -4 -25 9 61 48 -98
2815 -98 -25 -3 19 -67 8 -147 54 -1 -42 -3 -105 14 43 100 23 34 157 -28 -80 -6 -9 -35 -8 -75 24 6 -4 -13 -33 -101 -11 -12 -7 54
2517 54 -20 -48 -60 15 26 -109 -70 98 -11 5 105 156 153 -11 -107 -18 31 96 18 -21 -2 143 75 -61 -66 14 56 32 126 53 -100 30
2237 30 -29 137 -64 -126 -57 -36 2 18 50 3 -14 117 -3 42 35 -38 29 -129 30 -82 -11 58 81 58 33 -78 0 134 17 60 -6
1966fq5J46ro1j69J47N5L4k0J2Pn5m4N0R9k1j09M3R1Kj12m1M3n7R5n2N4k0n7P7j12Q6Q9j32
1668c2K6np7mJ18o7O0J8j09O7q3NQ6KK5O0oj2k11P4P4q4o0N7J38m7n6m0O5P6P8n4j18N2j02
1362h6M2R1j5m7M6l4K7J7j1nk0lP1n3J17q8M3k8j40J21r5L2M1j0m9j23K13j38j4K10r7k4p4
1073h3K28o1km0r7J01j46J14J13j61P9m8o0J10K8j0m6n2M1QQ7N7j25n9o1Q5q9Q0O0m9mj6M
785a4l4L7J77j98K3m6r9K28l9k0Q9k16l5R6P9m1j03K06n2K2j20J42n1l5M4m3j5p4k5J01J01
513H5jm1M2o3n5n2N4J3P8p7k2K33j26p3ml8O6l4l5L6k3RL7j6n5O3O4J5r1M3M0R5k22O4M6J00
198A55n4j52j7l1J35j3p5n0J25p1J07p8o8rJ80p5j0P1m4m8M0j16J26k2N6m0J17l1k09O0kQ8
-82D5k0r6O9J8o1J5O9Q9j55m6N3O8r4N9J11n8q4
$$ plain form
1966 -6 -91 55 46 -15 -184 -37 18 52 32 44 51 -4 -48 2 101 80 -29 14 105 107 -5 -46 -3 -60 35 -17 37 17 -40 37 -75 11 100 -32
1668 -32 -6 -11 -88 -92 26 -41 19 37 -72 -5 -88 -83 3 5 30 90 84 72 -139 -65 9 -75 -135 -78 60 13 -43 -83 -18 58 136 82 -36 16 -86
1362 -86 -44 47 32 -15 31 -3 24 41 30 25 5 2 73 20 137 49 92 64 -76 45 -50 -18 23 13 -36 -159 54 -84 -98 112 15 -9 -83
1073 -83 145 84 82 42 -55 46 -100 14 127 -34 45 -3 -63 47 75 65 19 -33 8 16 103 160 35 -24 -85 0 -89 -9 51 2 -2 -18 -14
785 -14 -48 -11 166 -32 -9 -55 -154 74 35 15 104 -112 -147 -51 28 -13 -116 90 38 60 -60 82 31 -4 40 -3 -18 -92 -117 -16 85
513 85 84 43 85 22 -33 -85 -31 -18 60 -17 -39 194 68 -5 -9 -47 19 -15 -50 -14 -37 -28 9 -7 -62 1 65 80 -11 32 72 167 -55 9 55 155
198 155 101 -51 -68 -99 36 23 -52 -102 23 -48 59 -19 -87 -96 84 9 -1 70 26 -22 18 -98 28 6 62 22 139 108 -101 -41 -43 45
-82 45 25 -71 -2 16 -45 -30 39 128 -27 -73 -20 48 -46 13 124 66 -18
-230a8
##PAGE=	F1=4842.11
##FIRST=	23146.756194512010552,	4241.1435120000014649,	-0.062395740300416946411
##DATA TABLE=	(F2++(Y..Y)), PROFILE
4241Fm0rm8L7j0J6J6M3m4q6L4Q5j05N1L7j8J26n4o9l6J12k7q1N6q6L7N7o1J03o5J23j67J6
3952e1O1o8j10J44J1k8J14o7j50J04P9oj43N2q9J04J0l1J37j87L4R6L7j26J19K5k2n9l7M8
3690Aj6L5j49QN5lK4J20q7K0k5oM8R9l6m3j30J80j71NqL6Q6o2J23m8j21N5PoQ9j10n1J40n0
3384Ij5l8L3p8L3q1J20j0J42j19j5L6p6l4L6Q2p1p5k2K56k9j57p3J79n9LqJ5q9k2K11j3p1
3095@o9M0M3j4Pn7m8M7M4M8j24J77n6j51J0L2J52Q13r12Mn2N3O9j71jJ18j1j2OQ8m5r3N8J2
2797EP2j11P2j62J38Jp1Q1j59J05P1M4p9j4J74k13r5J13MMN8r7L4M8%orp0%JQ7k2Jp5K9K8
2482a3Pr7O0J13r1N4N5P3l2j86n3Q0P2P5o0p3j0J05m0r0l0J01J0J7P4j08r1O6m5K28k72o1
2202a62J85k4NRL2jo2J28j35J3L0n8M9j20R7o8J02%RM5p6p6J02R8j29R2j10n5J27K9n4j49
$$ plain form
4241 6 -34 -43 -91 -54 -64 -48 -32 11 -33 -119 -85 0 -105 -54 -17 -35 91 37 -32 -68 44 17 -64 -8 -94 -57 0 -61 42 -23 100 -67 -51
3952 -51 10 -58 -168 -24 -13 -41 73 6 -144 -40 39 33 -110 -58 -147 -43 -33 -64 73 -114 -80 16 53 -73 46 71 49 -10 -47 1
3690 1 -15 20 -129 -121 -66 -69 -45 75 -12 8 -17 -23 25 124 88 45 -85 95 -76 -71 -79 -43 43 -19 104 56 -65 -10 -3 -9 80 -30 -81 59 9
3384 9 -6 -44 -11 -89 -56 -137 -17 -27 115 -4 -19 17 -59 -93 -57 25 -46 -121 -143 113 84 -73 -146 33 -26 -23 -31 -16 -105 -127 84 71 0
3095 0 -69 -29 14 0 7 -50 -98 -51 -7 41 -83 94 38 -113 -103 -71 81 894 -18 -14 -66 -13 56 -115 -116 2 -9 -21 -15 73 28 -65 -7 5
2797 5 77 -34 38 -124 14 15 -56 25 -134 -29 42 86 7 -7 167 -46 -141 -28 -24 -20 38 -59 -25 23 23 17 8 -62 -62 -61 26 4 5 -70 -41 -13
2482 -13 -6 -103 -43 70 -21 33 88 161 129 -57 -110 -30 42 117 57 -16 -26 79 39 -51 -81 20 30 47 121 13 -78 -12 -57 171 -101 -162
2202 -162 23 -1 4 13 45 44 -18 110 -25 -12 18 -40 9 -111 -14 -82 20 20 29 74 -2 -78 24 122 -7 85 -25 -80 47 76 22 -127
1922a27J16K8P2r7N4Ok4j4%O3jj58J12M9k6r6k2M4p5J18k6l4J1J0O2j09O1Q7o3q1P2p9o5J33
1625Ak0J1M8j08M7r3J2J02OK6NL5j3k08O6J61j07j10M0J29k2m2n2M3P1RN1j17N6r5O7P6%r5
1327b0L5%J6qPK9k6L4Kl7O1n0J8k1j41J79j09j6J02l7n9j44J90j02j2J79n7j3q1K53n6k7l6
1038E3j15J40j63J05P9j35Q6n2p0J28k5N3j4j15N9j9Q9P1r3r9nM7p4O0L7l9J1k6k2NL7J86
758A80k34K9k2p5J65j2o6Q9j72l6J24O7m2q7J74o2L8p1J12r4qM2j5l3n4p7J52Q9m1m0R2l7
478G5j13J2j3oJ06j21MK04l7o5q1K1O4q4N7k8J2n3K4L8k9N5L8j2p2K4N7J05k17O3J6N6m8q1
181b9k8n4J16Qo8j8J34q7J49j03j16j2J57n3n3J31mj15L3o3R3j0P7n5Q7ok07P0k9J10j12m1
-99i8J10M0j15k1P4J08j28OP6K3j23O7J20o9q1
$$ plain form
1922 -127 -11 17 89 -8 46 52 28 14 14 77 76 -82 30 79 53 -43 -65 -21 -96 22 -4 -38 -27 -17 45 -64 -3 84 21 -60 12 -67 -132 1
1625 1 -19 -8 40 -68 -21 -114 -102 0 6 32 37 72 59 -149 -83 78 -29 -139 -99 30 8 -34 -86 -43 28 37 88 -29 27 -68 -1 75 75 -20
1327 -20 15 15 31 23 30 59 33 67 69 32 93 43 61 40 -101 78 -31 -47 55 18 -41 -185 5 -97 -109 70 13 0 -81 172 116 89 53
1038 53 -62 78 -85 20 99 -36 50 -2 -72 56 31 84 70 -45 14 -5 84 155 62 -37 -42 5 -69 -9 28 -11 0 -26 -48 -43 -6 180
758 180 -54 -25 -47 -122 43 31 -35 54 -118 -154 -30 37 -5 -92 82 20 58 -13 99 5 -3 39 24 -9 -63 -140 12 101 60 20 112 75
478 75 -38 -26 -39 -45 61 -60 -56 148 111 46 -35 -14 50 -34 23 -5 7 -46 -22 16 -13 42 80 68 -4 20 77 182 -35 28 44 100 52 -29
181 -29 -57 -111 5 13 -55 -73 61 -26 123 20 -96 -108 49 -4 -57 74 70 -45 -12 -75 18 8 85 30 117 111 -96 -26 -55 55 -57 -98
-99 -98 12 52 -63 -84 -10 98 -30 -24 52 75 -48 19 139 70 -11
-230a1
##PAGE=	F1=4747.75
##FIRST=	23146.756194512010552,	4241.1435120000014649,	-0.27555331587791442871
##DATA TABLE=	(F2++(Y..Y)), PROFILE
4241C0o7ll6J5KO6p0P8q5p3P3N5m7ON1JR3o4j14N6Q0n2o0O6r3O4J9n3Q9q5J48j88J4N8o0p9
3926a65J51Jn4J24l2j07L3J12j5j46L4m1LO6k9J58j85J1M8Q7j03R8q%p1l0O0l8L5j51K2J08
3646b4l7Q6Q3j83P2j4j0P4R2k0j22l7J42j63J4m5R5L4m7O7k3j00P3k8K0R5j33kJ02k9j7n4
3366c9K1n7L8o4P3L2J56j37l0K3j17O4m4Q3p1m6j3K32o6j09k3J49n4m0LM8r9J2J58n8j3q7
3086g5Q0k9L2N6o4k6k8O4L1j08J44jj17m6O6M38K211k511j89LM5P4k20nJ55kRm0J11l9n6J9
2806a8K4R9r5L6j40P9K1q0J13j94J04R8Jo5k7J98j92j43J49j3L9J03j29j7R0J0k1K6o9p2k3
2535a08J51q9Q0j07N8j3l4%M3M8q4J18J7Q5q1j75KN5R9N2k9j18k0O9rl0l9R3m9M6P4j42J0
2246b7Jk9K25k71o4K64r9j2J7N4L7j21J16j30j9P6n3K2n6kJ2J06q4J0P3r1j5R3P4j28J13j17
$$ plain form
4241 30 -37 -40 -76 -61 -59 7 -63 15 -70 -143 -70 -15 -62 -56 -5 -4 89 25 -89 -33 47 -5 -65 1 -92 -28 -9 -62 27 -58 90 -98 -84 -26 -86 -165
3926 -165 -14 -13 -67 57 25 -82 -49 63 48 -98 -64 -105 -102 -36 -65 93 -92 -81 -33 54 -49 49 41 41 -30 -60 0 -38 -3 -154 -132 -24
3646 -24 -61 25 108 -75 -3 -17 -27 47 139 119 -3 -40 102 -61 -47 -92 3 37 -10 57 34 -66 7 -21 -1 94 -39 -41 61 32 15 -39
3366 -39 -18 -75 -37 -101 -28 4 160 23 -7 16 -101 -37 -81 2 -69 -115 -128 104 38 -71 -94 55 1 -39 -36 12 -87 -75 83 25 12 -75
3086 -75 5 -24 8 64 0 -26 -54 10 41 -67 77 76 -41 -87 -21 417 2628 117 -72 -69 -24 50 -170 -175 -20 -22 -13 -53 58 19 -37 -18
2806 -18 6 105 10 46 -94 -15 6 -74 39 -155 -51 47 48 -17 -44 154 -38 -181 -32 -45 -6 97 -32 -49 41 51 30 56 -13 -85 -108
2535 -108 43 -46 34 -73 -15 -28 -62 -62 -19 29 -55 63 80 165 84 -91 -89 -34 65 117 88 -30 -50 19 10 -20 -59 34 -15 31 105 -37 -27
2246 -27 -26 -55 170 -101 -165 99 0 -12 5 59 96 -25 91 -39 -58 18 -35 -13 -69 -71 -59 47 -37 -27 46 -45 -60 33 107 -21 92 -25
1966b5l3Q6N1l4j26R2mQ2j31R2J9J0Ll8qJ5j74J59Ln5m7j1M8o8J07Lj17M7O5K0n9OQ4Qj77
1660a07J03l4p3Q9J0l5J02o6j2r0LR7L0K0p2Q6nj69N2K04j12j53K7Q4K7k9o4N0O0n3O9p3O2
1371B8p3J00K9Pj22J7M4K8m4K0N7o4Q8o6Qj0Rk0l3j21K11r6o7J36o8m7j38J38m4k5J49Ql7
1082Bq2K44n8l8kj21J39j29O3L5p2Q4p1q6J45o3J11j5j35P5n8R4M3l9j03N6ko7M6K6j1l4j5
793c8n8N9N3J32k18K9J8m7Q5Kj00R3j10m3J53M5n5p0J55o8M4k6N2j06K6M3Np1oj15J71Q0p6
505C8l0J02J8j74O2n7j8J06j22J5J52M2l7j25L5O3j01J02p1L7j04K7O5rM5K5l1p2mQ6J26k18
225b7N5mMl4qlq4Q2J2m1kJ37r5K00j32j42LR6l9n0J41L0j40p%M2QJ12q5M5L6k00Q0l3J23j74
-90i4rJ01Q0j18n3N8P5p6N8R6n0j04M3J10n0q6
$$ plain form
1966 -25 -58 28 79 45 -81 11 7 89 -42 50 69 79 82 44 36 51 -123 36 39 -16 -63 -74 -26 -94 13 16 -101 -54 11 31 -28 -22 62 70 -107
1660 -107 -4 -38 -111 -22 -12 -47 55 -11 -23 -113 -110 -13 17 37 -35 51 46 -123 -71 133 21 -132 -105 -21 6 -23 -87 -37 23 -30 39 -34 28
1371 28 -45 55 84 91 -31 -14 30 58 14 34 91 27 115 49 57 47 56 36 3 -118 93 -3 -70 66 -2 -49 -187 -49 -93 -118 31 39 2
1082 2 -80 164 106 68 66 -55 84 -45 18 53 -19 65 -6 -92 53 -10 101 86 -49 26 -32 62 105 66 -37 19 17 -50 -4 22 11 -23 -38
793 -38 -96 -37 16 148 -70 -41 -23 -70 15 17 -83 10 -100 -143 10 55 0 -70 85 17 61 35 87 -19 7 50 55 -16 -22 -137 34 114 38
505 38 8 110 128 -46 16 -41 -59 47 -75 -60 92 134 97 -28 7 70 -31 71 0 37 -67 -40 25 16 61 86 55 -17 -21 65 191 -27
225 -27 28 24 28 -6 -14 -17 -101 -19 -7 -48 -50 87 -8 192 60 -82 -79 17 -22 -72 69 99 -41 -48 -48 -6 2 114 29 74 110 -90 -10 -43 80 -94
-90 -94 -103 -2 78 -40 -93 -35 40 -36 22 118 68 -36 7 117 67 -19
-230a9
##PAGE=	F1=4653.4
##FIRST=	23146.756194512010552,	4241.1435120000014649,	-0.25287592411041259766
##DATA TABLE=	(F2++(Y..Y)), PROFILE
4241E4q3K3l5j1MJ06j42Q5j13l4J10J2%m3O4M0M2o0j19J13L5q3j6N9r8P8k2j7N2j02J55j62
3961a08pN8l5l5J14k1m1J26Kp1l3J29k2j28JL0j04J03J1J48j45m2kJ03n9P6l0Ro4k5O6l9J2
3672b3j23J7J29m1J25Jk28J02J1PQ0Q1lj64K1P8q0K2j00J50l5rk3%m1P1n3K1R9j38L1Q0l2
3384C3j4n6L7m8L1l9K0P5J21j24j8J2j49J24r9P2n9j4lJ96j02n1K2J11l9q7J4O0o2L5R6r4
3104AN7j10R1q3M9J00p0k5l4M8J2o1Q0N6m5r0R2P57L675m241l51N2mR9k37l4J79KL5r5J28
2832C3j3n5j8N2R5n0mj03K8K4p2J23j79J12Q3n5m8rJ70j39j58J68m6P4J31j52k6Q7J9n6O7
2561H3n0r9p6J73j04J34j12N8k7r8J02NMq6J83k6J06j24j50M6L2J26Jrj50ML1K3J0k5P3j31
2281g3P2Q4j71J12l2l4J57j68o6K66j73j7M3O9N2j64J04j05k2R9n4%nj00R9Q2j45L5M3p8N9
$$ plain form
4241 54 -29 -6 -41 -52 -48 58 -84 1 -112 -146 -36 -24 -24 -67 -3 37 79 19 -100 13 48 -35 -51 8 -90 -12 -34 -51 1 -101 54 -108
3961 -108 -115 -57 -92 -127 -13 -34 -75 51 53 -18 -51 78 56 -72 -71 -41 -145 -42 -31 117 -28 -70 -72 31 -28 48 18 27 -37 -62 4 -35 -23
3672 -23 -146 -129 0 -41 84 85 -143 -41 -30 -23 57 138 135 -29 -8 70 -10 12 -88 62 27 18 -5 -5 -46 25 -28 -7 92 -46 -15 65 33
3384 33 19 -37 0 -48 -17 -56 -36 39 160 36 18 30 -119 5 -94 -22 -81 -95 -98 98 -4 -55 -33 78 39 -48 -34 26 -36 -1 95 1
3104 1 58 -52 39 -44 5 105 35 10 -24 24 36 -25 55 111 66 -24 68 825 4500 259 -92 -40 -44 55 -182 -216 -37 -35 0 -95 33
2832 33 20 -35 -53 -1 94 44 40 -63 -35 -11 -83 40 -139 -27 56 1 -47 -56 114 -25 -183 -15 -61 13 144 -8 -34 53 72 16 83
2561 83 33 -66 -142 31 -73 61 -51 7 -20 -118 -16 -11 -7 -93 90 64 170 46 -104 -58 -26 100 101 92 -58 -54 -23 0 10 -15 58 -73
2281 -73 -1 83 -88 24 -8 -42 115 -53 -119 147 -26 -43 0 69 121 -43 61 -44 -66 33 -21 -21 -26 -126 -27 55 -90 -55 -12 -90 -31
2010c1O3O5j14R8p9l8L7N1j4j00R2l4O0j07J00K7L5J1l9q1K2j57J57l2o7J4nM8m1O6K5j57
1730a25N5J08l4Ml5P1O3k31Q6K4k1j2K2o5J68k0p2p0j7O5Q5kj53J30J9j22N5J81r9j77K1J4
1450h4Q2k2o9Q4M1q5K7mN0m9J30m1J3j19NQ9L7n9J9O3j01J15r9N9o3N0m3n3q6J91o9p7J36
1161F8j05k6r7Q2On4J35P4p6r1J98n8k0L9j01Q9o5LPOO6q8r3J44q3J45l1j34J10r0P4kNn4
863a7R5n3o4L8K3K5r8Pr2J12O3M7j56lQ4k5J0J0j03Q6n7n2J59L1p4n1J48n8K6J2k0r0O1M8
566G2oj10N9j20J31Q1p5j6P7O6k05Q7p8j6P5q1J6R8Q4j9j19K2M9q3R6r0N7j24L2N7KL3L2m1
268D3q5m8J28J38k16N6jn1k2M0N3j14N6Jj1LJ41j08K36j46j43K9K1l8LJ01M1j11q5P1l4M5
-12gJ42r7nO8j86Q8k2J28j86rN0J25p4p9L8j1pJ03R7j16m6pP2j0q0
$$ plain form
2010 -31 32 97 -17 81 2 -36 1 52 38 -62 30 -4 56 -51 49 76 111 122 83 2 24 -133 24 -8 -75 -61 -66 -18 -59 7 32 -125
1730 -125 -70 38 4 8 -27 44 107 -124 -38 -14 -35 -47 -25 -90 78 58 -14 -84 -101 -36 49 47 -106 24 43 -79 -24 157 58 -119 -98 -84
1450 -84 -2 -24 -93 -9 32 -53 -26 -30 20 -29 101 60 73 -46 -41 48 85 26 45 108 7 122 23 82 19 69 26 -27 -113 78 9 -68 68
1161 68 -37 -63 -160 -78 -72 -126 9 83 7 -84 114 56 36 75 -26 63 -2 1 8 14 80 -8 -101 43 -40 105 74 -60 50 -40 34 32 37 -17
863 -17 78 25 -39 -1 22 47 -51 -44 -136 -24 39 86 -70 -73 11 -14 -4 6 -97 -11 -68 -120 39 70 -4 -55 93 35 61 73 53 -37 24 72
566 72 66 -44 15 -105 26 107 32 16 93 159 -46 41 -37 -53 22 -59 -43 55 139 120 1 23 72 -11 85 -5 52 -72 -40 17 19 52 84 43
268 43 -42 -90 38 176 -40 16 15 -36 -58 -18 35 -79 -23 -22 -33 -30 111 3 239 93 -50 -21 0 -38 -35 66 107 -4 -89 -18 -52 -7
-12 -7 135 38 33 101 -85 3 -19 109 -77 -86 -36 89 15 -64 -26 -37 -44 59 156 40 -6 -13 59 49 -31
-230c1
##PAGE=	F1=4559.04
##FIRST=	23146.756194512010552,	4241.1435120000014649,	-0.096808500587940216064
##DATA TABLE=	(F2++(Y..Y)), PROFILE
4241F6q2O0l7l1j0J27j82N6j17J7J32j7J9n9M9Q6ln1r2J29j5j11K0N1q2O1m3L2oj03J46j08
3961i8l2P7j0j2O1n4OJ17K3o1n3J22l5r5k6P2j61J21M8J18q0j06k4P1oP1n2J0n2lN1k5j4p4
3664a05KJ18l2J28r7k02J12L4L3O3O4Jj53K7K0L0L1j41J91j09M5j15J0L0N4n9J3Q2j22L9O9
3392F1l8k1l7O9n4J0rj4P9O2p5J0Mj58J30r5M4m0K5j5J54j15j6M0R5j4j39L2N3j0M2N8j23
3104eJ06j11P4j12M6J17p6m9K5J5pj4L0Q8K6j02R5R54M383n154l97P6o0J12k16p0J80MP0j57
2841a29J43Pq9k1Q2P2j0k0o6j7L7o1J07j21J16L2j04k8L8Q7q4j28J73q7J09J10j44kM8L7j06
2570a9Q9Jr7j35J54o2J44p6K2k2j48J62l8Jq7K11o9J41j36j35O8J6J44m8qj60N6j0M0K4oP0
2290H7k18R8R9j89J83m0n8O0on5J95k25kO9N4M6j59R7p5PP9n3kNj59J57M7j64Q0l3m3J12M2
$$ plain form
4241 66 -16 44 7 -24 -34 93 -89 -33 -150 -133 -1 -18 1 -58 -9 77 74 23 -69 60 45 -66 -46 5 -77 -16 -59 -27 -33 -136 10 -98
3961 -98 -130 -53 -63 -75 -14 -68 -62 55 78 17 -36 86 51 -44 -70 2 -159 -38 10 128 48 -58 -82 -11 -17 54 2 12 -40 -43 8 -17 -31 -105
3664 -105 -103 15 -17 111 14 -188 -76 -42 -9 54 118 119 -34 -7 13 43 74 -67 124 15 60 -55 -45 -15 39 -20 -7 75 -47 -8 61
3392 61 23 2 -35 34 -20 -10 -19 -33 46 108 33 43 47 -111 19 -76 -32 -72 -47 -62 92 -23 -39 1 96 82 -57 -25 28 18 60 118 -5
3104 -5 101 -10 64 -48 -2 115 39 -10 15 30 23 9 39 127 153 51 146 1100 5483 329 -68 8 -52 60 -156 -226 -46 -42 28 -129
2841 -129 14 21 -68 -89 -7 65 55 35 -31 -48 -11 -72 35 -86 30 62 -42 -70 -32 55 -29 -157 16 -71 38 148 4 2 50 87 -19
2570 -19 70 71 -26 -161 -7 -69 75 -1 21 -1 -149 13 -25 -24 -111 100 31 172 36 -99 -31 -15 129 81 73 -87 -31 -41 -1 23 17 87
2290 87 -131 -33 66 -123 60 20 -38 22 16 -39 156 -69 -71 -2 52 98 -61 36 -39 -32 47 -6 -8 -3 -162 -5 42 -122 -42 -75 -118 -6 36
2001C6N3q8P0k4o4j1L7%p5J11n3K8n0O6J7M3K4j0j22K0j18J10n5n0N2J1L4mJ9K1j33K3J38
1712E6p9M4l6N0R7k42M6O2N2j23K5p5K14%r7m2l2J8J51l3k05J49N9r5P2J12q5j68J7n4J21
1441b1k4n5J18J2p2k0N9J5l4J43j08J9q5KJ14K6k7LM5j13R6r7Q9p3M8k9p0n1J28m0l1J06j31
1152e8k8k7M7K5q9J31J22j03j07J22m8K3O4o2J8qm4NO7L7q9q0J19q9J45m3j28J62r4J6m3K5
872a2K8R6r4o1M3J6N3j23K1j18J50M5k3p7o0J66k3m8K6o9O0k5o5J25L5q1k9J37l2j2N8q9o6
583d8Q5N6m1j24J13r3L5Q7l6RL6Q6k02Q1p5kK7k1J5N5Q9k5q7J7K0m6O4r6Q2j22K6L5J1J3N3
277G7m2r6r6J63J28j98O8J5r5oM4J14j28M4j5J0RJ41j29K36j33j24M5l4m6Q1L8K6m7j81J39
6Hj12Q7J51o2n6O5j49Q1j8J32j54k8j0J54j8r7K9j14P0J16P9j46J7o0K8J7n4
$$ plain form
2001 36 89 1 71 47 -17 -28 9 9 -66 45 -8 20 -30 36 53 96 120 110 -12 8 -110 0 -55 -105 -53 -42 -8 -12 7 28 -105 -82 56
1712 56 -23 21 -15 35 132 -110 -64 -2 50 -73 -48 -123 91 91 -6 -48 -80 -62 89 56 -149 0 59 -36 36 148 63 -105 -88 -142 -21
1441 -21 -45 -100 18 30 -42 -62 -3 12 -22 121 13 32 -53 -51 63 89 62 65 110 -3 93 -4 85 12 60 31 -39 -90 38 -2 -33 73 -58
1152 -58 -86 -113 -66 -41 -130 1 123 20 -87 35 -13 10 74 12 30 22 -22 -17 50 87 -2 -82 37 -52 93 50 -78 84 -10 6 -37 -12
872 -12 16 112 18 -43 0 16 69 -54 -33 -151 -1 44 21 -56 -116 50 27 -21 5 -64 -4 -29 -94 31 66 -15 -44 93 61 49 107 18 -48
583 -48 37 93 52 -72 41 -52 -17 70 34 43 79 165 -37 44 -31 -33 -6 -27 -12 43 132 107 20 37 57 11 75 -21 61 -61 -35 0 11 24 77
277 77 35 -61 -157 6 134 -64 4 19 -76 -82 -38 76 -52 -8 -23 -13 -4 137 8 244 111 -13 32 -2 -48 33 71 97 50 -131 8
6 8 -104 -17 134 72 16 81 -68 13 -5 127 -27 -55 -65 89 71 -26 3 -111 -41 75 154 8 25 -35 -7 10 -44
-230d4
##PAGE=	F1=4464.69
##FIRST=	23146.756194512010552,	4241.1435120000014649,	-0.096804030239582061768
##DATA TABLE=	(F2++(Y..Y)), PROFILE
4241E9o0Q6l0m1k5J13j86Kq8N4J33j6J2k9nJ25k3n0n1J06n1j14K7N2m3J1l1P1p9p7J21n3m2
3952a22J09Kj0J5q5O0R7K4p5k4R9n3o4k8N5j41J33M2P4j2j52%kL6R1q2J5n3M0J6nk7j4j6Q7
3646C0k9J05j78j19J05M6M7L8M2j6j01Pj8J04L3j38K18j61Q1j76NR1K9m2ML5q1K4N7k7m0n
3366c0R3o3k1K1j5K6J1rM3Nj54J02l1mj4O5n2R5r1rL1J07J5j79M3M1K3L5N4j42J16q9N2j21
3069d6L7J04q5q5J08j0j4JL0P6N2p1O9R29L882m692l05O8q2R1j74r2J54J7J19k26J48J7j42
2815a22K6R6M1Oj0l2n7P0o2P2n3J14k2j38j0R9k1m6q5J87j28J36L6q6J8rP3j49Q4O4r2j71
2535a71J09J8J16j0l1k3j58J72p0K8p7J79q8J73j09j33N7PJ36n5k3j50J02l8L5J9NR0k81J17
2272e4J15j92K07l3q6k4J28k0Q8k36K8P9J2K5r8Q8m9M4K3m6J0j7j60J69J6j45J23j11LJ20
$$ plain form
4241 59 -1 85 55 14 -11 102 -84 -82 -170 -116 17 1 13 -16 -21 104 81 31 -20 86 35 -79 -52 0 -43 -32 -63 8 -71 -148 -27 -80 -122
3952 -122 -13 -11 -21 -6 -91 -31 66 90 15 -9 90 37 -27 -55 0 -141 -8 34 108 96 -56 -56 -58 -22 69 -13 2 -51 -11 5 0 -27 -41 -57 30
3646 30 1 106 -72 -191 -86 -40 7 45 87 71 -30 -23 -41 63 96 -42 176 15 96 -80 -75 16 45 3 7 42 -39 -15 42 15 -25 -30
3366 -30 63 0 -21 0 -15 11 22 13 56 61 -93 9 -22 -26 -40 25 -27 68 -23 -32 -1 106 121 -58 -15 26 49 84 138 -4 112 23 75 -46
3069 -46 -9 95 10 -75 33 23 9 10 40 116 168 97 166 1095 4977 285 -20 48 -34 57 -117 -209 -55 -38 81 -145 3 20 -122
2815 -122 -96 0 41 47 37 5 -52 18 -44 28 -25 89 67 -71 -81 18 -3 -49 -134 53 -75 61 97 11 29 20 93 -56 28 92 0 -171
2535 -171 -62 -44 72 62 31 8 -150 22 -48 -20 -97 82 -6 167 58 -75 -18 -11 125 70 47 -103 -1 -39 -4 15 20 110 -171 -54
2272 -54 61 -131 76 43 -43 -67 61 41 129 -107 -79 0 12 37 -61 27 -22 22 45 -1 9 -8 -168 1 17 -128 -5 -116 -113 7
2010GM7J9m7N3J3r5m7K1J4o1J29n0OoNnM4M3J7j18J4p5L7n9j1M8M2ML3rj3o2k7J43r7M4jL8
1677C8J08k27RP2R7j87K2o1K07lq5j1l4k2J90o0k03J39R8r5Q6L4p7j25Qq6J24k7k3J21k2k7
1397b2k4P9k3l3J34j43K7l1kJ07lM8k1J1r6N0q9Q4m0LK2o6l1M8k0M7O2j22o9N3L8J6j14J17
1100cJ45r9j19L5l1O8O6k0l9K1o5K9Q8J0p5n5Q4r0J19m1j19K08o3n6q5K3J10O0j14n2O5KO2
811F9r1J9j37J71kn4j2j09K25l3q8N7k1L1j1p7N0N1o4lJ10om7J19j50m6Q4O0o9j02J27m5p9
522g3Q5J1N5mQ0j81N3n8J9j7K2K5K6P0m8o7N1j8j1L5r5J09j14MK3L0j4O9l4r3j27J74Q9j51
225g5P0K7j06J5MJ54j13L3k6K5K0J24j43J94r2r0L0n1n2J57j8oJ4k52J84j60J13J27J9r9K0
-47D7p7M4k8J34r9m4m7J57J0r3K8j83J33P9N5j34N4r2LJ2j6
$$ plain form
2010 7 54 73 26 79 92 -3 -50 -29 -15 -76 53 3 9 3 8 3 47 90 107 -11 3 -72 -35 -94 -105 -57 -15 -11 22 13 0 -62 -89 54 -43 1 0 38
1677 38 146 -81 -72 0 97 -90 -68 -129 78 75 -10 -21 -55 -77 113 53 -150 -11 87 -8 78 112 35 -90 -82 -168 -44 -71 -94 27 5 -22
1397 -22 -46 33 10 -23 111 -32 -5 -36 -38 69 66 114 93 104 8 58 -31 53 13 16 38 -28 -59 -11 -31 16 78 -44 -113 -60 -22 -6 -120 -3
1100 -3 142 43 -76 -41 -72 -4 62 42 3 24 -41 -12 76 86 11 -44 40 -50 69 28 -91 117 54 -2 -87 -64 46 106 -8 -60 5 7 69
811 69 -22 -3 -140 31 29 -25 -37 -146 79 46 -42 15 -6 25 14 -63 -13 38 -26 -29 81 75 28 147 -3 -49 35 95 26 -76 51 6 -73
522 -73 12 23 78 74 154 -27 26 -32 -13 -30 -8 17 43 113 65 -2 49 31 20 55 -40 69 -45 -41 -18 12 -2 67 33 -60 -187 -13 76 -75
225 -75 -5 22 -84 -69 -65 89 -24 9 -17 8 28 152 9 203 111 21 51 0 -52 105 87 81 95 -157 27 -133 -20 107 126 27 47
-47 47 -30 14 -14 120 21 -23 -70 87 97 4 32 -151 -18 61 116 -18 36 -56 -53 -41 -57
-230e7
##PAGE=	F1=4370.34
##FIRST=	23146.756194512010552,	4241.1435120000014649,	0.047722034156322479248
##DATA TABLE=	(F2++(Y..Y)), PROFILE
4241B9k2Q6nm1k6N9j60m7l6N8J20PpK3p3J43ro2k0O3o4p8J0N2Pn0OQ9j47l8Q3j3l5J35jmj9
3917A3j05R5P2J9j09K6P6p0m8Oj3o4J46j2K3L8j60N4p6L9J33j20L8p2Q7j1Ok2L9l4N8m5P9
3629H6k31j5R5M6L6J8K4m9l5jm7J07K7q7K31j69P2j93rJ33njnk8k3mM0No4K7Q3n4o1N3J1o2
3314d9j8N3O8K0j56P7O0o7QJ03j02J9l7pNJ27M3j90L0L7K0L0O3j31Q5o8N0j15L1O8r3j04J59
3025A9j9Lk1P6K4K1j5L1P17K472l147j43L1m6M0j35q2J03N0J66k89J39K8j90J13P9J4pNNq2
2754d0R9o4K9j1J06m1j50oJ52j13k7p0K18j52J45o5J1Po1J20j59N5J14j03j69O4R4P7N3p4
2491C9m1j34J53p7N3n3J05o9J73n4j28J5kJ06j2m4j27J11m5QJ6PJ18k97J19J24j79J93k8r1
2229d1p0J60L7pk02O5O3k4mj6P5k9O6m0m2K0m3j17J44Mj13J40j50M2R3P2m1LN8K1j16o2MK9
$$ plain form
4241 29 7 93 88 47 21 80 -80 -127 -163 -105 15 22 15 38 -35 108 99 37 17 80 16 -62 -52 0 7 -43 -37 52 -95 -133 -50 -63 -98 37 36 32 13
3917 13 -92 3 75 94 -15 11 87 17 -31 -25 -38 -102 44 32 55 93 -67 -13 -89 -50 83 -37 1 -71 16 5 11 -11 28 -6 52 7 86
3629 86 -145 -160 -65 -19 17 35 59 10 -25 -26 -73 34 61 -26 205 36 108 -85 -94 39 34 33 28 0 -23 -27 13 18 -46 -19 64 10 -51 2 13 -49
3314 -49 -67 -14 54 74 -82 -5 55 -12 -4 99 -3 16 -21 -28 -23 104 147 -43 -13 24 44 74 137 6 91 23 73 -42 -11 57 -36 -140 19
3025 19 0 3 -18 58 82 103 88 119 836 3308 161 18 49 3 43 -92 -174 -71 -21 145 -144 -5 23 -167 -54 25 39 32 37 42 -40
2754 -40 59 -5 24 13 119 78 -72 -78 74 -39 -66 -136 82 -70 75 10 21 28 -33 87 -72 -17 97 -6 -175 -111 -17 60 113 39
2491 39 -2 -136 17 -60 -7 -60 45 -24 149 95 -33 -18 -20 86 74 30 -97 14 -31 -23 -7 0 118 -179 -60 64 -115 78 50 -41
2229 -41 -111 49 86 79 -123 -58 5 -19 -23 -39 36 7 73 33 -9 11 -32 -149 -5 -1 -114 26 -124 -82 11 83 42 45 103 124 8 -54 -50 -21
1931b1o1J33k5OKn8j7M1N9J4p8Ql6m4m6L4J7P2l1O3po3J1n4J08q0J7L7M3R8k03qP7P8j73J0
1616g7k3J41jn9J6k5m1J75o9j56J10J21j08P1j4p4o3ko7Q2k0J9Q1m4J3J4N1m0m3J11j30L8
1336a3K1j6P5l0J33m9j6o9J0j04N4Qn7Q6l6l0k3KJ03K8p9j33J18M5kj12P5J41o3j14l5j7Q3
1047a6O2Ln3J3o0O6P0om6m0N6q7Q1l1j03K23pj04j26QJ53J0j12l2J02j8N5k9%j45J77n5n9
758e0L5j26K26l3j18R3K0J4nq2l9O7k4J6O9J3o8J74j95l0O1M6n9n6R9Mj57O3K7J20l9P2j64
470b6J9l5L8m1L0N5lM5o5q4J22n3QL0r0J24j04l1K8O6m2O7k5o7j31J54K7p5N1K4q5M1n6J59
172G5p1%j7M3L0Q3j41J34m0m7j5l1n4K04m6l7L8k61J89j50J00P9J06j24l9J2j7m5J34m3n2
-99cm8J38Jn4J4j88J61RL6j04O4j00J3k6K0
$$ plain form
1931 -21 -82 51 26 32 34 -24 -41 0 59 73 -5 3 -33 -77 -123 -89 -72 0 -31 32 25 -38 -27 -81 27 -53 -36 1 44 142 -61 -69 8 86 -87 -77
1616 -77 -100 41 40 -19 -3 -28 -69 106 37 -119 -9 112 4 75 61 -13 -76 -78 -145 -63 -83 -64 17 -27 -14 0 51 11 -32 79 -51 -13
1336 -13 8 -8 67 37 170 121 105 36 46 -58 -4 4 -53 33 -3 -33 -56 -54 49 77 -2 -135 -17 28 26 -86 -11 130 67 -47 -82 -99 -16
1047 -16 46 49 -4 9 -51 15 85 79 33 -7 49 -38 43 12 -91 132 125 21 -105 -97 56 66 -46 -78 24 6 61 32 32 -113 64 9 -50
758 -50 -15 -141 85 52 -66 27 47 61 56 -26 -65 2 -22 -6 63 76 8 182 -13 -43 18 64 5 -51 48 52 -105 -42 -15 105 66 138 -26
470 -26 -7 -42 -4 -45 -15 40 37 82 17 -67 55 2 10 40 -50 74 -30 -61 -33 33 -9 58 33 -34 -165 -11 16 -59 -8 16 -69 -28 -84 75
172 75 4 4 -13 30 60 143 2 136 96 49 34 3 -51 153 107 70 108 -153 36 -114 -14 65 171 47 8 20 3 -42 92 49 -3
-99 -3 -51 87 88 34 48 -140 21 30 66 -38 26 -74 -61 -87 -67
-230f7
##PAGE=	F1=4275.98
##FIRST=	23146.756194512010552,	4241.1435120000014649,	0.38331910967826843262
##DATA TABLE=	(F2++(Y..Y)), PROFILE
4241a1J5N1M2m1jk3j18o4K2L2R7K4j4O2j17J28L0p3j6K1n7j1rL1N5r5M4Q5j77mL4J2k7J43
3944G0j7L4m6j18J03M4K8j51P0O4q6n4O7q8J7J62q5k1N2j28J03j17NJ76j49O6j00J25j1Oo
3672A5P6o4M6p9O8k46O5R6L9oK1J6q2J3J6p8N5J8j0K20j26K5j84j7J51l8M2qq4L6l3K6M3p3
3375d1L9L3j1j07Q7M1j41l4R5Q5M2j73P2J43j31J5J33j44n4K2J5k5J16P2j67lL7%L8N9q8L4
3095E9p7Q4r1J8L2j09q8J60k0M7o0J25l5m1L3KM49R56j410jk6M0k7j05m4L8R2J87l16J08N7
2824C7k16K07L2rl1OL7p7R7n0qlQ6nj43k5J72j53j8r6K53j47J32j50J09k7j02J61j24J0J31
2552H6j20j35L0J38N1P4q2o5j00J30n3N2j9K3j6J28Oj07l8j4O6N5o2j01Q0m3k1K0K2J24k60
2281a51R4J14j51J63k3o3q1R1Q8n5j36R0K6j6m0M1N7oO6p9m5Jm5o0J04J2q1J21j43N8O1R4
$$ plain form
4241 -11 4 55 97 56 55 32 -86 -150 -128 -96 1 25 11 73 -44 84 114 41 25 46 -11 -22 -31 0 55 -40 4 89 -88 -92 -58 -46 -73 70
3944 70 53 87 41 -77 26 70 98 -53 17 81 -5 -59 8 -80 -63 99 14 -7 45 -83 20 -97 -92 84 -65 1 -99 26 15 21 15
3672 15 91 27 73 -6 62 -184 -119 -23 16 10 31 47 -35 -22 -6 -84 -29 -11 -21 199 73 98 -86 -103 48 10 52 44 -40 -4 -37 -11 32 -41
3375 -41 -2 31 20 -87 0 41 -100 -134 -39 46 88 -85 -13 130 -1 14 147 3 -51 -29 -14 -39 77 149 -18 -21 16 16 54 113 25 59
3095 59 -18 66 -25 -7 25 -84 -172 -12 -32 15 -45 80 45 4 37 39 488 1444 34 33 7 47 20 -85 -129 -91 1 188 -128 -20 37
2824 37 -179 28 60 51 20 26 63 -14 83 33 25 22 108 103 -40 -65 107 -46 -64 -160 93 -54 78 -72 37 10 -92 69 -55 -45 86
2552 86 -34 -169 -139 -1 50 124 42 -23 -123 7 -46 6 -13 10 -6 122 128 21 -17 -31 35 90 28 -73 7 -36 -57 -37 -15 109 -151
2281 -151 -57 57 -94 69 46 -17 -98 -7 81 26 -110 -20 6 -10 -50 -9 48 42 108 29 -16 -15 -60 -120 -16 -4 -85 36 -107 -49 12 106
2001A06j07N2P2J8j22n2j9L6o3J17J3J9j7r6j3L8O4k9k4J1mj17k3P0jO8n5P6K5j16N1l4M7
1712im9j1N1N8Q0j79pR2Qr3j5K8M2K3m0L8j7m0J17n8j06Q3J20j09K0k1p4J0qj7OMN8J8m4J7
1397b4O4rk1n9Q7p6N3N0m4M0l2J83p8j7m9j1j36J6M1j04J36J2m4o4K7J08K2l7j74J47N7j0
1117E4q5J4J05qr3n5j7N7O8ol2j0m6R8M0j4j6m3M6p6M2k2p9K03M3r8j59j4J50l1r8kJ38l6
820A8M2J9k1j39J59p8o2P6j15J66nj42J15M6Ojp3j04P6J9J7L0L0p6J90k15j2L0J5j6rM6M2
531G4j70K0KJ82o7Q2j58pqM3l7LJ02m5K8o2j23K01q7J4M4p9J23q5p3M2J11n8M2k7j8j12J08
242El8RK1Rn4O3j02J35j6o9K4O0L6K4j23Q7Jrn5on1K13m0n6J8k07J61r0N0J8J57j22p3Q1p5
-64a4n5J26ko1j3J06k6J4k0j43J47n4K9q1O3j03M7o4L4
$$ plain form
2001 106 -1 51 123 141 19 -33 -52 -16 -79 38 51 70 53 -43 -56 -18 46 17 -7 4 0 -117 -140 -70 -71 -3 -58 18 43 -73 -22 -56 -9
1712 -9 -58 -69 -18 40 120 -59 -66 26 34 -59 -74 -46 -4 19 -21 17 0 -40 77 19 -87 -4 116 7 27 6 -68 -58 -66 -83 -77 -73 -15 3 -41 -24
1397 -24 40 31 10 -49 38 -38 15 65 21 61 29 212 134 117 68 57 -79 -63 -22 -126 10 22 -22 -86 -59 49 71 34 -140 7 64 54
1117 54 -31 -17 88 80 -13 -68 -85 -28 40 34 2 -8 -54 44 84 70 54 11 57 -19 23 1 -78 125 168 70 -89 -103 47 16 -82 -84 54 18
820 18 60 79 58 -81 78 0 -62 14 -101 65 60 -82 33 79 85 84 11 -93 -17 2 19 49 79 3 193 -22 -34 -4 11 -5 -14 32 74
531 74 -96 -76 -74 108 41 123 -35 -42 -50 -7 -44 -41 61 16 44 -18 -141 60 -27 -13 31 -48 75 -10 -83 -41 70 12 54 27 9 -103 5
242 5 -33 -24 -3 6 -48 15 -87 48 32 -37 -13 47 83 107 -16 71 72 63 8 2 -49 164 124 68 86 -121 40 -50 0 18 175 53 -20 61 -14
-64 -14 -69 57 55 -6 -19 87 61 75 55 -88 59 5 34 -47 16 -87 -40 -104 -70
-230g0
##PAGE=	F1=4181.63
##FIRST=	23146.756194512010552,	4241.1435120000014649,	0.58262515068054199219
##DATA TABLE=	(F2++(Y..Y)), PROFILE
4241d1L6j1R8l8K9r4p8m6O4%P7J1kO4j11P7P7o4m1km2M8poP8j03O3O5j45Nj1K7l7J35m0J02
3926A37o7j30Q5K1N5j80R5O1j08o9J33j27N9J65j33n0L8p7J22j11m3J93j54P9j14J38K0KJ4
3672E4P9r9M5j12O7k18R4J14L1p2N0K3j05K8M1j11nJ6O5J70m5k2j72k4J46n5O8Lj18P2m7J6
3392b3P3n8K6l3M5j43J14N6j73n0J05J05N9k05R2J88j73LJ54j69j01O3O2n5N7R9j16l5L3j0
3130a0N4L4l1mj27J48n5qJ1j29m3J17j6J06q1J24o7q7M3j4K58kk49N7q2J37r2o8%k2J21J74
2850A97k84M9R4k13K77l1k7n3qO0m8O5j4l4j4N6O5j23o5J51j31rj36K50j05J04j92J72n3j28
2587a28J77o0m9J24j28q4MJ47M6M2o1o3q3J13oK7J4l5M1N3N2p2p3k7L4J00o6p7K9n5k9K7N2
2299a4R8j82M5Q0j15J39rj9o9k3J10n3o2Q8j8M6p4M8K4K8N6p4n3n5k1j4O3L3m5P1j17N3N1
$$ plain form
4241 -41 -5 -16 82 44 73 -21 -99 -145 -81 -81 -4 7 5 69 -42 35 112 48 7 5 -37 11 4 -2 76 -27 36 101 -44 -39 -50 -23 -60 75 35 137
3926 137 70 -60 25 46 101 -79 16 77 -31 -100 33 -94 -35 130 -3 -53 -15 -92 30 -81 -124 69 -85 -6 -120 18 38 40 54
3672 54 133 34 79 -33 34 -184 -90 24 55 -17 33 56 -49 -21 20 -91 -96 -80 -15 155 110 88 -84 -108 38 -17 51 54 -64 8 -39 -23
3392 -23 50 -8 18 -15 30 -113 1 57 -116 -166 -61 44 103 -102 -10 178 5 8 162 -7 -108 -45 17 -38 19 118 2 -33 0 -10
3130 -10 44 78 47 43 -84 64 9 1 12 -117 -160 -43 -59 47 -34 90 23 -64 -21 -35 223 221 -28 29 -53 84 -8 -76 -76 -98 23 197
2850 197 -87 -38 56 -157 120 89 62 9 1 61 13 78 64 30 16 72 137 14 -51 100 -31 -40 -176 74 -31 73 -119 53 0 -128
2587 -128 49 -11 -60 64 -64 -148 -144 3 49 91 30 -33 -116 -3 -9 18 32 -3 38 91 143 71 -2 -29 5 105 39 -38 -9 -64 -93 -66 -14
2299 -14 84 -98 -53 27 -88 51 42 23 -46 -69 41 -12 -74 14 -4 42 -32 16 40 68 124 50 -3 -58 -79 -93 -30 3 -42 29 -88 -35 16
2010A6Q9j48Q6O8L0j16k0m7K7n6R3N1K1l4r9OL0N1q9K4K4K9j67pQ6K6Ln6P3P3j57N1Rkl2r
1695g3K7O9O5j50mJ14o4km2P1n7O2k2N4j6l9N4l3r1O5J01q1n0jp1P8%K0p3M2Q3l4k8j1Q7o2
1380a2K0o9O0qP3L7o7J9kJ68r8J0m2k0j51j8M4j13J48O2o6o9M8O9N0m2j57J43N6Qn6m7N4M7
1082G9q1j0k8JQ7m1Kl1k6J01K6j9Nm8M3n6J2j8o4J68O7n6j56l9J16n7p9K5J54m0K3L3k6j22
785e5J21n7p5J26j05P9M1j54J09N7Pon0j22P3M7KkO5q9J56k04RJ0k4L1K7rO5j32k8l7K13q9
487@J07j49j9J9L2j3l9J49j05K6l5j55K52j23J2O0o0J15n8j11N5J50n7mm2N1q5N5r6P0Ppl9
198c7P5j14J03J7j47R4N7M7l4j06P6J6Nn1kn1J92qo2k4j27J23j8mm4J55q8p2R8r7m7J06K0
-90E1q3M7O5m8R0o6p7R7p2L0p8P2j17P7p6K7
$$ plain form
2010 16 105 -43 43 111 141 25 5 -42 -15 -71 22 73 94 60 -39 -33 -3 48 -41 -17 7 36 -131 -138 -52 -26 -23 -79 -6 67 -90 -39 -30 -32 -64 -73
1695 -73 -46 23 88 -62 -66 48 -16 -18 -60 11 -46 16 -6 48 32 -7 47 14 -77 -12 89 8 -42 -43 -114 -36 -36 -16 -89 -47 36 2 -26 -37 50 -12
1380 -12 8 -61 -1 -9 64 101 34 53 51 219 121 131 89 69 -82 -100 -56 -169 -21 41 -25 -94 -46 23 73 31 -126 17 73 81 25 -22 32 79
1082 79 -2 -12 -40 -39 48 7 9 -22 -48 53 79 60 65 17 60 4 16 -2 -66 102 169 113 -43 -82 34 -23 -102 -77 77 37 60 93 67 -55
785 -55 66 9 -66 60 -45 34 75 -79 30 87 94 88 38 -84 -11 36 38 36 101 12 168 -36 -27 -17 -41 -10 17 8 73 -59 -87 -124 89 0
487 0 107 -42 -61 -42 -10 -23 -62 87 -18 8 -27 -182 70 -53 -41 19 -41 74 16 -95 -40 110 53 49 7 58 -27 28 -68 2 9 2 -37
198 -37 38 -76 27 44 -103 -9 48 95 61 -45 31 47 52 1 -1 -52 140 132 70 46 -81 42 24 20 -24 131 43 -29 69 -28 -75 31 51
-90 51 -32 15 80 32 122 56 -21 76 4 34 -44 28 -89 -12 -88 -61
-230f1
##PAGE=	F1=4087.28
##FIRST=	23146.756194512010552,	4241.1435120000014649,	0.41010391712188720703
##DATA TABLE=	(F2++(Y..Y)), PROFILE
4241d6L3p7J39k2L8j21n6qP7j6P2l0K1L5p0MJ15l1p3jl3O5J4m1O9p7O0M2n9j3m1M4p2J15n6
3935@J68q1j36N0J5Q0j76J00N7j33q0J77j13N2J49j41n9J2l1J14p1p1J58j31O7r5J19O6%K4
3672I0N8j34N1j24O2j50P0J43K3j49R4N1j18QN6j41k4K0J14P8M7k5j65m9J25m6P0L3j35P3
3410Fm1J2Q4k2Kq7P7j48J25M4j43o9Q1J26O0k33J23J97j81j6J62j89j04O6J18q0l1J19n7l8
3147c7K2JO3jJ1j3j84K12k3l4Kj43MO0JJ47o9O0n9r3J5k1J78k81J65M0j15K02j43j3K4o1J18
2859C5J60j99m8J16j81L01q1m6n8k2O4j9L4K0m1k2K3J22r4j03J03p3Jj49J84m8Q1j82J80m7
2596A1j36J61Rj24J14j13k6l1J37N2j8l5k1q5R3M4JL6o1P7k3P7m9o1m1J5J05n2o6oq8lK0Q7
2299@M8q9j3L2p5J25J4J8n2j00R3l0oO5n8J33r5K5k8O5N5l9m8j27PQK2N9jJ1j01L7O9N1j37
$$ plain form
4241 -46 -13 -90 49 27 65 -56 -112 -120 -43 -59 13 -17 4 39 -31 -27 88 57 -16 -17 -50 15 29 -12 57 -20 40 82 23 10 -31 13 -59 56 0
3935 0 168 87 -49 1 16 96 -80 20 77 -56 -136 41 -72 -20 129 -12 -71 -59 -90 24 -47 -118 40 -91 -24 -119 0 66 66 90
3672 90 148 14 65 -59 3 -147 -77 66 89 -60 34 85 -33 -25 31 -110 -134 -114 0 78 125 100 -65 -114 11 -35 35 68 -67 6
3410 6 -35 -23 61 39 41 -46 31 -117 8 52 -91 -160 -79 47 107 -126 -3 194 13 -3 159 -30 -134 -68 50 -30 -61 58 1 -37
3147 -37 -15 -14 49 48 59 46 -138 74 51 17 19 -124 -120 -60 -59 88 19 79 20 -73 -58 -79 99 -182 -17 23 -92 110 -33 -46 -22 -83 35
2859 35 195 -4 -52 64 -117 184 103 57 -1 -23 41 22 56 76 35 13 36 158 64 -39 64 -9 -8 -157 27 -21 60 -122 58 11
2596 11 -125 36 45 -79 35 -78 -104 -135 2 54 36 1 -20 -105 -12 32 33 69 8 85 62 139 90 29 -12 3 108 56 -10 -16 -104 -107 -87 0
2299 0 48 -41 -54 -22 -97 28 42 60 8 -92 1 -29 -35 30 -28 105 10 35 7 72 127 88 40 -87 -80 -72 -50 9 8 19 -82 -45 24 75 -62
1992f2R2L2O1j04J8p2J4m4P6P3kk3p2K0J3K9j39O5L6O6j79mP4R2r8m7O1J19j82L2L2Pn6K7
1695d5j6N9O4j14j4J28r9N3n7R6j33R0QN9j6n5K5nj18N2P5k3j16K4o1J28J8J1j15P9R1n3j4
1406Fl9P1q6N9o1J9M3R8j4p4J6M6R6j02M8l1l1j20n1L0q4J17R5q0m2M7K0R4j03q2J12M1M5
1117A03m0r4J3Q7r3P5m1n1J01q2K6l2nO6L9k2Ql3M1m2mk0o3J40O4k4j01o0P2p1n4L1J40l1
820D3JK9oj08P7lr1J69j03PP0j40P3N9J4k0l0r1O2M0qk7J20j16R6j73K5K0o0N4N3m9P4q1p1
513i1n1K01j00J21j17k1M2J4J2o7J70j73M3Qj63K57j49nO5l4J09k8j35O3J62m6n0o2J24n7
251D2Qj34Q9K1k0m9P2q1P2J5j97J68K4O9p2j03R2Qj1Nk1n9J57L6o4o0o4R8K2k2j00J19k2n8
-47b0O2o2l4Q2J7j10J11J3n2J44r8j9L1m6L4q8R8j48Q5n1R
$$ plain form
1992 -62 30 62 123 19 37 -35 -21 -65 11 84 82 59 -13 7 20 49 -90 -25 11 77 -102 -106 -32 60 -38 -85 -24 95 -87 -55 -23 -16 -72 -45
1695 -45 -61 -2 62 -52 -66 62 -37 16 -41 55 -78 12 20 79 63 8 33 28 -90 -38 37 14 -102 -78 -139 -11 7 18 -97 -18 73 20 6
1406 6 -33 38 -48 11 -50 -31 12 110 96 22 38 84 180 78 126 95 64 -56 -107 -77 -161 -44 51 -29 -71 -24 -4 90 -13 -95 17 58 103
1117 103 63 -31 -18 69 -24 51 10 -41 60 -22 4 -28 -33 33 72 50 58 25 66 24 20 0 -63 77 141 117 16 -44 28 -43 -97 -66 74 43
820 43 44 73 67 -41 36 33 -58 111 8 15 85 -55 18 77 91 71 41 -50 12 52 44 17 137 21 117 -56 -31 -11 -71 -17 36 -13 61 -20 -91
513 -91 -142 59 -41 80 -37 -58 -16 -2 10 -57 113 -60 -17 -9 -172 85 -64 -69 -4 -38 71 43 -92 -29 133 87 37 -25 99 42
251 42 50 -84 5 26 6 -43 29 -52 20 35 -162 6 30 99 27 -76 16 24 13 18 -3 -62 95 131 67 7 -57 41 63 41 -59 60 38 -20
-47 -20 42 -20 -54 28 45 -65 46 59 7 151 53 34 65 19 53 -35 63 -85 0 -51 -42
-230d2
##PAGE=	F1=3992.92
##FIRST=	23146.756194512010552,	4241.1435120000014649,	-0.028303265571594238281
##DATA TABLE=	(F2++(Y..Y)), PROFILE
4241c1J7j16J37J2K3r8o0K2O2lQ6p8L7Pl6p3J47Or2K0k9K9L9n4L2k8M2K3M2m4n3P2j16Q8n8
3935b6J97q5j26J2L2P3j33R2M1j44q4J84n6J5J16j23n1lj5J05k5n9P1r0L8m5O2J12KJ2M1j56
3655a6N3j05M5n9J4J61J8k13J35Q9j26l5N9j61PK2J34k6J17K9j57j12J03j2N7O9j48M7j9J5
3392a5P1J8j7r4M9j15J18J2o9q3L2J37N1k49J51J91j64k5J56k07p5L2J56r2j04J21j0JQK0
3130EM9k4K2Jk03K40j0m5jj37L2PL8J48l3l6k9p1j8k3J58k04J63mj10K14j73N2J1o8P7J76
2850B04j00j62J16j40K86j04o4n3k1N7j4L1K6l3j5LJ33o8j18O2j6Jj11O7mP5j34J44k1j22
2587i5J27O4k09J17p2K5q0J23N5o5k4M1q5O3P5j0L5n4Q1o9P6n1on9NQ5k0p8jj26M7oR8jj1
2281en8rl1J10L9K7l8r1M5j4J5M1q9J93q7Pq6Q5N9Krj87K1J0l0Q5M8m3j00K2J03Kq8P8k1Q9
$$ plain form
4241 -31 -14 -130 7 19 42 -56 -116 -94 -32 -35 51 -27 10 17 -19 -92 55 61 -31 -11 -40 -11 28 -26 6 -22 20 43 85 41 -12 60 -56 32 -26
3935 -26 171 86 -40 -28 4 77 -56 36 77 -67 -151 33 -23 -8 108 -15 -66 -69 -84 21 -4 -63 8 -82 -44 -89 -27 85 87 99 140 -16
3655 -16 37 -68 -23 -82 -68 93 111 -102 33 122 -4 -39 20 -141 -134 -112 22 -4 113 142 -15 -127 -24 -36 21 90 -58 -11 -30 -15
3392 -15 56 74 57 -37 12 -103 15 27 -42 -125 -93 44 95 -154 -3 188 24 -1 155 -52 -127 -95 61 -31 -135 -14 -24 -23 -15 5
3130 5 54 30 52 53 -150 90 80 35 34 -103 -71 -64 -26 122 89 53 24 -47 -65 -88 70 -134 29 25 -85 129 -44 8 19 -49 28 204
2850 204 104 -58 58 -82 204 100 36 -17 -38 19 5 36 62 29 14 17 150 82 -36 26 10 11 -100 -33 -37 38 -96 48 27 -95
2587 -95 32 96 -113 4 -68 -43 -123 0 55 -10 -34 7 -78 -15 60 50 85 31 112 43 119 68 62 3 8 93 73 -5 -6 -132 -85 -91 7 6 -5
2281 -5 -63 -72 -103 7 46 73 35 -56 -11 -25 -10 31 -58 135 48 55 -31 54 113 115 106 -81 -60 -50 -80 5 53 10 -90 -68 35 37 -51 27 6 95
1966I5r5L4p3J4m0O9P4l9Qk9K3njj49R6K6J07j48qK6J67j80m6N9J39j93K0J0P2j12P8n0K6
1677b5Q0p5l7J22r3N8n4R4j72R7M6N4or2L6J7j57L4N3M6j55L9m5J46L8l9j03R9P8l7j3m2L8
1388C0q0P4k9l9O2J20q3n6J4Q6Rq7P0nl2n6r1K4l8N9J00p0kK1j7J31j86J5O9J2Q9m1j27QJ06
1082F0j24J46m2o9Q7r9K6j5J7J4N7j7j2J4L8n6Ol2o9J34M6l1j5o6L2q4j4J1J02j6k1L2K9j06
785c7N2M9r8J79r2l5N3r4K2N6K9m1k2l4M8nJ4m9J73j58N1j39K8N8q0M4P3o5P5n1r9l0J62j00
487f3R5n6j6M5J0K0o5J53k21O6N6j47K12j41m0N5j0J08Kj38O5J41m0p7o9J76k9k1j48O8N2
216D3l0p0N5k2M2pj92K13k8R8q6j13J09nn2Q2l4p2J13Q5p1p6l9Q6J0J7j42P6P0o8NJ5l0O2
-82D4oj27J59m5m2J59r7J5j7j4L5r4J28j77P0nj0
$$ plain form
1966 95 0 34 -39 -25 -65 4 78 39 47 18 41 36 35 -114 -18 8 115 -33 -41 -15 152 -28 -74 -15 124 -69 -49 -39 33 -79 -1 -51 -25
1677 -25 55 -20 -57 65 -28 30 -24 70 -102 -5 41 95 89 -3 33 50 -107 -73 -20 26 -129 -90 -135 11 49 10 -93 6 84 47 34 -8 30
1388 30 -50 24 -5 -44 18 138 55 -1 13 99 108 21 91 86 54 -2 -93 -69 -107 -48 52 -18 -20 1 -16 115 -71 -56 13 25 114 73 -54 -46 60
1082 60 -64 82 40 -29 58 -41 -15 -30 -13 1 58 41 29 43 81 25 31 -1 -70 64 110 79 64 -2 30 -54 -68 -57 45 29 8 40 69 -37
785 -37 15 64 -34 145 53 18 71 -23 -1 55 84 43 21 -13 35 30 44 -5 168 10 61 -78 -50 8 -72 -28 45 -20 55 4 -95 -125 37 -63
487 -63 32 -24 -40 5 15 35 -30 123 -98 -32 24 -123 89 -52 -92 -37 -47 61 63 -75 -10 131 91 14 -55 121 92 71 -77 -9 43
216 43 13 -57 -2 -24 18 11 -181 32 4 102 16 -97 12 7 -45 37 3 -69 44 129 58 -18 -57 29 39 56 -86 -10 60 -8 -3 12 -18 44
-82 44 38 -89 70 25 -17 142 45 60 43 29 64 -30 98 -79 -9 -14 -24
-230b4
##PAGE=	F1=3898.57
##FIRST=	23146.756194512010552,	4241.1435120000014649,	-0.080512769520282745361
##DATA TABLE=	(F2++(Y..Y)), PROFILE
4241a9Oj04Q5N6Nn8q5L2L3K7J13j02L1kk9j33J76J7q4N2k4l4M8m3j0K0K1NJ15o4n5J05j35
3952c4N2m5J78q3r5j1O6K9p7Q0J1j28q5J57J4j9P4j00l4%l3J14Nj4l8n2J7J1k3J49Kk3N9j63
3655c9M6o4K3K8m6J56J7k45J58J17j36p5O0j63N8J0J42j05J44J13j48j98R0L7M4Q9j62J4Q
3401b7K2L8M8j5o4k8n5R6j8Rq7j4J20M7k56J74J81j41j5J35k11l2k8J61q7j16Q5J1P0mL6O
3121D1k6J5J9j67K24l3k6qj02M4m0Q5J13lj08j0m9k4j2J34j14J13l3p4J84j75J05l5n6J7K00
2850A99k5k32J06j08K45j01p6n0%M7l1N4kj7LRR3n3j09N8J4j5m6m4J6P5p1Q9jq7R1R3k67J26
2552a7j8N6j31J00O1p7k9Q5n7K2P6oKk3O9p7N5p6O2p6kO7J7j13M4j43R4m5Q2l7L8q1k6J3Q6
2246eM8K0l9lj2k1jM4j16J94m9J8j28P7N2K6O0k10K1jq8J03Q3p8r2J1J30k3m5P2o9R9j07K2
$$ plain form
4241 -19 -13 -117 -32 24 29 -29 -114 -82 -49 -22 91 -11 20 18 -11 -144 32 49 -35 17 -7 -41 7 -36 -46 -26 -5 0 115 51 -4 101 -34
3952 -34 18 -27 151 68 -27 -38 28 57 -20 60 71 -57 -142 15 29 10 84 -16 -50 -50 -83 31 36 22 -16 -68 -51 -40 -63 86 88 65 124 -39
3655 -39 7 -57 -34 -6 -52 104 121 -124 34 151 15 -60 0 -163 -105 -95 47 -58 86 199 51 -147 -57 -20 24 113 -49 -35 -27
3401 -27 -5 33 81 66 2 -26 -81 15 -3 6 -81 -95 25 72 -184 -10 171 30 15 150 -61 -93 -121 40 -47 -163 -78 -67 3 -1 35 41
3121 41 15 30 49 -118 106 73 47 39 -63 -19 -59 26 139 136 28 18 -31 -55 -67 67 -47 66 33 -41 143 -32 73 38 -18 -1 199
2850 199 174 -58 48 -60 185 84 8 -42 -42 5 -26 28 26 9 12 21 114 61 -48 10 24 9 -37 -81 -65 10 -61 28 27 -60 31 124 -143 -17
2552 -17 -35 21 -110 -10 51 -26 -55 30 -27 -5 71 65 67 44 113 36 91 15 77 1 -1 66 83 -30 14 -129 -35 -80 2 -35 3 -78 -104 -91 -5
2246 -5 43 63 24 21 9 -12 -13 31 -85 109 60 78 -50 27 79 105 165 -45 -24 -25 -113 -10 73 -5 -97 -86 44 21 -24 48 -21 78 -29 -7
1948gm3L5n9O8N6n6K9J9Rj0k6j18J13j6J42r4km9K13j96n4O7J26j97K5l8J49j67J14n3k4J03
1668E9l6o0R7o9L1m2P6j71Q5O9N2J8j42P4J6j66QL9J00j55M4l3J38M4q9o0R8M6mk2k0J4n9
1380b0O5K0r8N0J32j43j7qR8m8o2O3L5oOj43L6NmQ6l6L3k0l3J40k31Q1K3k5J20k9j54M0R8
1082E4j45J50l1l4L6o6kJ1K8j7N1Jn0Q1L6r5L4n7n7J37K9o7N2m9Mj00M1k4O1j5k2M8N4j13
785c6N9O9r0J47o0n7nk4l0N2M9n7k5K6K8o7P2p3J88j90L8j20K3J13q5J8Q0m7P3m9j10LJ17
496C0q7K2K0j0K6L4jl3J06k26Q7Q9j23J26p4r4M6KJ02L4j25O0R2m0o8n5J85j2k6j36L4P0l5
207B0q4K4M0Pj6j39K05o1J10q6j22J08pj00J28qp8O0J33q8q1l4P6m1R5j65M1J66j06m1R8m7
-73GO1l8j21J74j00k1J41p0K6l3j3L5q6J50j89M6L5k2
$$ plain form
1948 -7 -50 -15 -74 -6 50 -6 23 42 51 41 15 -103 10 -6 136 42 40 -9 204 8 -46 21 147 -50 -25 -63 86 -81 33 -20 -44 59
1668 59 23 -37 60 -9 22 -20 56 -115 -30 39 91 109 -33 41 57 -109 -101 -62 38 -117 -73 -106 32 76 -13 -73 25 71 67 45 25 39 -20
1380 -20 45 65 -33 17 149 6 -11 -19 79 31 -31 32 67 61 67 -76 -40 -35 -39 47 11 44 24 -9 131 -100 -19 4 -21 99 70 -84 -44 54
1082 54 -91 59 28 -6 30 -36 -38 -27 1 -16 35 36 -14 67 103 8 42 -15 -72 65 94 27 79 30 34 -66 -25 -49 12 -3 -25 23 77 -36
785 -36 23 92 2 149 89 32 27 3 -27 25 74 17 -8 18 46 -21 51 -22 166 -24 14 -106 -83 30 -55 -37 43 -4 69 20 -90 -87 30
496 30 -57 -35 -15 -25 1 35 34 1 107 -119 -32 57 -66 60 -14 -108 -62 -60 42 76 -49 11 103 63 -5 -60 125 113 87 -49 -15 55 20
207 20 -64 -40 0 7 -9 -148 57 -4 106 20 -102 6 -1 -101 27 19 -59 1 134 46 -35 -69 7 -34 61 -104 -63 103 -3 -44 54 7
-73 7 68 30 -91 83 -17 -38 103 33 59 26 13 48 -38 112 -77 -31 4 -18
-230a8
##PAGE=	F1=3804.21
##FIRST=	23146.756194512010552,	4241.1435120000014649,	0.1948086470365524292
##DATA TABLE=	(F2++(Y..Y)), PROFILE
4241c3J1m8QR4Ol5j13K5RN2J34q7LKl2j61K00j2n6Q3j6q0L7k8l3M7Jj4J44o3o2J38j12K2l7
3935fJ30q0n7lR9k9m4O8j8r5q4J15P3l5L5q1j4Ro5J30J5L6j21l6J8M5j07J67Ko4J14j62L7
3646hk9J2P7q1J31J5k29J55J15j42q9O5j48Q7j2J43j21J19J82j44k60Q2Q5M5P0j60nK2L1j0
3384bO8Jk7j09PO9l0O1q9k8P0O0k59J88J66j29J6J01j79Mr4J37p1o4J9%J48k4M7n4pRK6j01
3086g0J83q5J5j2m5N2q7J19O2J3j28k1m5J0J6Q5j14J16k7l2J42j54J36r2m2m4J82J3j96J03
2824E3j00J90q8o9o1K9M5m2P5m5nK1L7L2m5j02R0J8m6J1r0K1N2j3L8mm0O5R2k62J29K2O1j65
2526i6O6P6o1l1P6Oj6N3ln1J9N4n1J6r7J10q6rN8M1j49J05j27J17q3N3o0O5q8j9M6N6M1J4
2229D5n9J21o2m8l6P4j36J43NM7j31M3K2K8J32j95K0j9j32J07R4r7m8mJ31Nn9R4q7Q5j39r
$$ plain form
4241 -33 -22 -70 -62 32 38 3 -110 -85 -76 -24 110 23 26 28 -4 -165 35 23 -33 50 34 -46 -9 -37 -70 -23 -22 -36 108 45 -17 121 9 31 -6
3935 -6 124 44 -13 -16 83 54 10 78 60 -35 -119 -4 69 34 69 -12 -26 -17 -82 48 63 99 -22 -58 -40 5 -102 65 67 3 117 -45 -8
3646 -8 -37 -25 52 -29 102 117 -112 43 158 16 -73 -8 -156 -69 -81 62 -59 60 242 98 -162 -80 5 50 120 -40 -45 -23 8 -2
3384 -2 66 67 40 -69 -62 7 -23 38 -51 -79 -9 51 -208 -20 146 17 33 134 -45 -41 -135 2 -69 -133 -114 -114 34 10 57 3 -4 5 31 -70
3086 -70 113 28 43 31 -14 38 -49 70 132 145 17 -4 -49 -39 -23 62 -52 64 37 5 147 -7 129 37 -5 -49 133 146 -50 53
2824 53 -47 143 55 -14 -75 -46 -1 -43 32 -13 -18 3 40 72 27 -75 15 33 -13 -2 -92 -71 -19 -32 6 2 -38 27 119 -143 -14 8 69 -96
2526 -96 -30 46 -15 -46 30 36 20 73 70 19 38 92 41 57 -40 70 -16 -25 33 74 -75 30 -97 20 -63 -10 -70 -5 -93 -112 -66 -10 31 45
2229 45 -14 107 45 -3 -39 35 -101 42 47 94 -37 6 28 56 188 -7 13 -6 -138 -31 63 -34 -82 -86 45 50 -9 85 -2 83 -56 -65
1948f5RN9r0N7M0l5K0N1j8J5l3o9J14q3J68m5J7j29K12j42o2Q2Q0j98M3p0J78j80J16k9q0
1677f7J17Qo6O0n2Ml6N1j29O4N0P0N1j85J15j9j23k1L0J19j16M2k5J07L6j05k4P8NK7k4MJ4
1388F0m6M8O7j29K6J25j74K9n3P5n0m5M1P4M0M0j95N3K9m7O8QN4n7l5J18k08R0k1o1J32K0
1108G6j80Q1O9j34Q0j0L5m0K4n2L4J6pJ9K6r5J42L4j20M8q2j8J28J2q9O4j6qj22R6n0M9m7
820c7PO9N0j22Q6N1o3R0k0o7p2M1o2M3P0o8l0Q4pj12J42r0J34j82L9j19L2J56q1%O9rP2n4
522D0j03J1Q5o8o8Q9ooP1l9J6M9j79Q9R9j02K2M2j54N2lQ4O3j04N3K9l4l4l0J52j3j0j03J2
225BN7k7q8rQ1l3jo3J53n4R1q4j20R7jj37J15N7o2JJ70j08r1k2O3j04J74j67J4K26j42n6J47
-64G9o9P4n7r6J51j36RJ07l7J9k1m5L6o6J53j72J8N6k7
$$ plain form
1948 -65 -56 3 -87 -30 10 -25 -5 46 28 43 10 -59 55 -28 140 95 112 -17 195 53 -9 73 153 -45 -2 -72 106 -74 42 13 -67
1677 -67 50 58 -8 52 0 4 -32 19 -110 -46 4 74 125 -60 55 36 -87 -108 -78 41 -75 -33 -58 49 85 -20 -44 34 39 66 42 46 60
1388 60 14 62 129 0 26 151 -23 6 -47 28 -22 -67 -26 48 88 128 -67 -14 15 -32 36 44 98 41 6 124 -84 6 -15 -76 56 76
1108 76 -104 -23 46 -88 -8 -18 17 -23 1 -51 -17 -1 -8 11 37 -58 84 118 -2 46 -36 -54 74 86 -3 61 45 37 -85 11 -39 10 -37
820 -37 -30 39 89 -33 53 104 41 131 111 44 -28 13 -49 -6 64 -4 -34 50 43 -69 73 -17 117 -65 -26 -145 -113 43 -38 -38 31 22 94 40
522 40 -63 -52 33 -35 -103 -14 -20 -26 45 6 22 71 -108 -19 80 -22 0 42 -112 -60 -63 21 84 -20 33 62 28 -6 -36 116 103 93 -10 2
225 2 59 32 -56 -65 16 -17 -18 -81 72 18 109 25 -95 2 1 -136 -21 36 -26 -25 145 37 -54 -76 -13 -117 57 -110 -96 130 -12 -68 79
-64 79 10 84 27 -69 82 -54 -45 62 25 44 23 -22 14 -52 101 -71 -53 3 -24
-230b4
##PAGE=	F1=3709.86
##FIRST=	23146.756194512010552,	4241.1435120000014649,	0.27319040894508361816
##DATA TABLE=	(F2++(Y..Y)), PROFILE
4241g4K5K2n2J16K3m1j26J6KN6J36l9m3%j4j52K10p2k1R7%r1J2k0k4M0j3l6J47n1q0J66o0
3952E9J4n5R0q3l1L2J13o9m8N8k9p7p3P6J09l0Qo6ORp4J22J8N9j39o0N1M2j59J54J0q5J71
3664A23j60L2j5K0P0p8J01J0j72J20Q6j37o2N9j16P3k8J40q0O2J98j56k49P3J22N1J1j15j3
3410c0K4L4o3Q3K0k2j43M8M3j7O5r1LoR8k64J95J35j33O0O4j08K5j47J03n9J5m6m0K17n7M9
3130E5j06K7QK4m7J46j42O1j2J4O3j31J19K7K4j10n7m6O4M7L6j35R7KmJ07j16J48j29m2q8
2859i6J12L2p9J08j12J33q4l1r4N5M1j1O7p7mL3P3j7m1j14J22K2q6M2n1K3j1L1Oj9JM1O3j81
2561a03J22K2M2j66K7R8l2k2K4P9l8J6nr7M9M2j0l1r1J26p8j3L5M9j59J50r1J14j13L5o8P2
2281a5q4rN8L7K8K1r6K21r1p3o7J01j33P4N5O4r4Ll1K8J68j54K7l7j44R4Q3j03K5j5R3P8j39
$$ plain form
4241 -74 -49 -27 -79 37 60 19 -107 -91 -89 -33 103 64 21 21 7 -145 65 -7 -28 69 69 -22 -10 -30 -54 -14 -27 -63 84 33 -47 119 59
3952 59 73 18 108 25 -6 26 139 70 22 80 51 -26 -99 -23 86 56 64 -2 4 13 -61 61 79 138 -1 -61 -10 32 -127 27 37 -48 123
3664 123 -37 -5 -20 0 70 -8 93 103 -69 51 137 0 -62 -3 -119 -46 -74 66 -14 48 246 90 -159 -86 36 87 98 -17 -30
3410 -30 -6 28 -35 48 68 46 -97 -49 -6 -23 42 -49 -46 -52 46 -218 -23 112 -21 39 103 -5 20 -127 -24 -83 -68 -114 -154 63 6 55
3130 55 -51 -24 -16 8 -39 107 -35 26 14 28 91 -40 79 106 130 20 -37 -83 -19 28 64 -71 26 28 24 131 15 163 34 -8 -96
2859 -96 16 48 -31 77 -35 98 14 -17 -111 -56 -15 -26 41 -36 -40 -7 66 49 8 -106 16 38 -48 -6 -57 -34 -45 -14 -8 -27 -26 15 78 -103
2561 -103 19 41 83 -83 -56 42 10 -12 12 91 53 69 64 -33 16 58 48 17 -74 52 -26 -39 -4 45 -114 36 -55 59 -54 -19 -87 -15
2281 -15 -99 -108 -50 -13 15 36 -60 161 70 -3 -70 31 -102 -28 27 91 -3 0 -31 -3 165 11 38 1 -143 -49 34 -69 -44 -59 34 112 -27
1992b7J43p4O5j70m0O5N8j10K9M2J6k1N3n5P1j0l5J00j45J90l3L8j81J70n7o1R2K3j95O2o1
1721e8J37j37Q2Qj30J09N6m8K2m6km7L4o8L6mJ10Q5k11J50q3m3m6K7J01n9L5j3O6K1q2k0M5
1432B7l1M7rRL0l9L2R0j15RR8j75O7j06L0j0m1K5R8P9M5k26N8L3o3N6M7O0p9k3P4j33N6o5
1135d5p5J18J03k00R3L4q7k5J2R6j12J55j08M7l0L8j6N1j30J68K5r4K0q9L7R4j6o4L1PPj48
855a03J21m7P6j08O4P3L0j28R9J0j9M6ko7j12P4o0K6P8p2j8J26n7j15J89r7K6j21K4j19O2
583a21J66p7JM8K8O2m4p5j7O2m6j29J30ol6R8p0N8Nj07O9R5r0o5J62k03O9j7O6O8p8N0l3j2
286A1Oj7J10m3J5n8J0K3oq9k6Q3o8K6J3Q8j7M4q0j08R2Lj52M9J29k5n4J87j11j15J2M9j49
-3a68K20j59kK15j35n0J50p2Q5m9o6R7j38L3P9j6Prp5L8m4J38j31pM6k0
$$ plain form
1992 -27 116 42 107 -63 -103 -38 20 -90 -61 -19 -3 -24 29 -26 45 35 0 100 -45 145 112 150 -31 139 82 21 113 136 -59 3 -58
1721 -58 79 -58 24 32 -98 11 67 19 41 -5 -7 -54 -20 -88 -52 -56 54 139 -72 78 -5 -48 -94 -67 34 -25 10 -3 63 84 2 -18 27
1432 27 -4 43 34 43 73 34 66 156 41 50 148 -27 40 -66 -36 -46 -87 -62 36 115 160 -66 -8 25 -38 18 65 125 46 23 97 -36 20 -45
1135 -45 -120 -2 101 -99 -6 28 -59 -84 -72 24 -88 67 -41 6 -24 14 -2 49 -81 87 112 18 38 -51 -14 80 64 0 31 38 45 -103
855 -103 18 -29 47 -61 3 76 106 -22 77 87 68 114 112 45 -67 7 -53 -27 51 -21 -39 87 30 -85 104 7 33 -88 -64 -183 -121
583 -121 45 -32 -31 17 45 107 63 -12 -29 33 -13 -142 -12 -18 -54 44 -26 32 37 -70 -1 94 4 -61 101 -102 -33 -50 16 84 6 56 23 11
286 11 17 0 110 67 82 24 34 57 51 -38 -64 19 -49 -23 -10 78 61 105 25 -83 9 12 -140 -91 38 13 -41 146 35 -80 -68 -19 -168
-3 -168 52 -107 -109 106 -29 -79 71 -1 84 35 -31 66 -72 -39 40 24 31 22 -53 -15 -59 79 -52 -59 -13 -33
-230c3
##PAGE=	F1=3615.51
##FIRST=	23146.756194512010552,	4241.1435120000014649,	0.35720941424369812012
##DATA TABLE=	(F2++(Y..Y)), PROFILE
4241a19L8O1o6J25L3n6j15J0QM2J17K4r3k3M1j18K01j39J7Q3J5p6j4j7NJ2k0n9J44l9r4J76
3961A04rL5j06Q0r3k4P4J02p9o7M0qr9m5N4J24j1qn3K6j0l3P0L0L8r2j18J09J0j62J06K6p4
3672f3J92j53L8k0M6Kl8P4Pr6M8N8j22JL2q1L5l0J31j9OJ57j74j60N5J42M8o2k4k4K1K4j00
3384d9R2K9n5j13N9J8QK9q5N9q2J43k60J93Q3j46J14L2k2L0j73P1o3P7p1r0K65j09N1j38P1
3112c2nK7l0J21j70J01j2N7O2j60Q9K1M2q9q5l9J12N4J6j11NL8oQ9p4J50j19o2j12M4M6K8
2832dJ09j24Q0r2L4j39O8K4O2L2q4j0L1J04l8l9j36J10N3j18N6L3K0r3M9kk4K8LJ6n6J23k9
2544D7Rj32%J10%nl6J22m2k3Kj07M5L2K6p4m9J21m3k9j7N6j33J52n8R6j26L5n9O5p9j3M7M6
2246a4K4K7j30K51r3o6q0Q9r7J7R1M4l8k2q5L9J56j00L0m3j27O5O5r8R1oL0J52k45J88l4M8
$$ plain form
4241 -119 -81 -20 -86 39 72 16 -99 -89 -81 -39 78 102 9 -14 27 -91 110 -29 -12 71 86 10 -4 -21 -16 -4 -24 -83 61 22 -72 104
3961 104 95 130 24 104 11 -13 61 163 84 17 57 49 -50 -95 -41 83 72 64 11 37 27 -6 64 94 132 40 -78 31 41 -121 -15 11 -63
3672 -63 129 -24 14 -6 40 42 4 78 85 -11 37 95 -27 -26 6 -75 -40 -70 61 42 48 205 31 -129 -74 68 116 54 30 6 27 51 -49
3384 -49 43 72 17 -96 -37 -19 -11 18 -67 -8 -90 53 -207 -14 69 -77 37 69 47 77 -96 -25 -88 -11 -82 -172 93 -16 35 -103 -32
3112 -32 -37 -10 -40 81 -89 12 0 57 119 -41 48 69 111 22 -63 -102 10 64 80 -31 -26 12 6 95 21 171 52 -10 -122 -78 -32 -4
2832 -4 105 -19 61 -31 3 -136 -68 -44 18 50 -34 -44 -13 91 53 14 -122 -12 41 -77 -21 12 32 -61 -12 -14 -38 -10 -7 9 -47 76 47
2544 47 56 -76 -76 34 34 29 -7 115 73 50 52 -55 -10 22 48 -26 -75 46 3 -26 -43 13 -120 32 -26 70 -56 -21 -80 -15 -94 -107 -60 -14
2246 -14 10 37 -93 158 65 -1 -81 8 -89 -72 19 63 25 3 -82 -43 113 13 43 0 -127 -62 3 -95 -4 -10 20 172 -73 115 81 129
1966A29j68o2J09K3j03j6P2O6p1J8r6J44L6l4P9j70K12o5M6j85J01K2o0R6k3j82P8k6N4o9
1703d5M0L4j60Q1R6rj1m1Ro3K7j9mo6J61J18k16J73j52M7p1L0O5j0K4LL4Nm2l6Nn7O3QKM3
1388F6l3K5P6o0PN4j50P0j39j8M6m6L8R5Q9L5k26N1K1n3N2P0N6q7%K2m8J5r9o1Q3J77j98N6
1091a4Rk1j01K6J07j49K76j39M5r5Q6l0P1j41J46Qoo0n9P6M3o1J1j1KM4j69R4j7J27j68J23
811E3N5K0j33P4k2L2L1k2m7j16O6k5PN9o8J8J40j12p5J92r0r4k1k0r8R6J36p6J7M1L7L0ml5
513D6o8M2k4j31J37rn1R7q0Q5k0n2K7J07q2j12K34k26P3j7O2K7m4N7p5J7L5l2R3r4L2j1J3
225E6mJ5q7j1M8r3M2P5L9J2Kp2r0R9j0j41k9J68J9r3J74q4j46N7M3j60K22j48jJ34q0m6J20
-64C0m0Q3k8l6K9r7L0O3pKk0o5L3k0J03p8k6QJ
$$ plain form
1966 129 -39 -101 8 31 -72 -88 -16 50 -21 -3 -99 45 81 47 126 -44 168 103 149 -36 65 87 27 123 100 -82 -4 -30 24 -45
1703 -45 -5 29 -131 -50 46 37 26 -15 -6 -69 -42 -61 -65 -131 30 148 -68 105 -47 0 -71 -41 24 14 38 41 75 80 38 2 7 -50 13 21 23 66
1388 66 33 58 134 74 81 135 -15 55 -84 -102 -56 -102 -64 31 120 155 -71 -20 1 -52 0 70 126 39 39 61 13 28 -71 -132 -49 128 -70 -14
1091 -14 -5 -26 -127 -101 6 -143 133 -6 39 -56 30 0 71 -70 76 84 78 18 -41 35 78 17 28 17 19 63 -106 -12 -29 98 -70 53
811 53 108 128 -5 69 47 79 110 88 41 -75 -9 -34 -27 32 -36 -18 122 10 -65 127 37 -57 -78 -98 -196 -100 36 -40 -23 18 55 85 81 46
513 46 -22 20 -4 -135 2 -7 -58 39 -41 44 24 -28 -1 106 24 -88 146 -80 -7 -24 38 65 21 78 3 20 55 23 116 22 54 43 56
225 56 52 67 -20 -31 17 -76 -34 41 80 92 94 22 -68 31 21 -120 -149 19 38 -55 119 35 -111 -54 -11 -171 51 -97 -98 36 -44 -90 30
-64 30 -10 73 45 9 38 -59 -29 34 27 29 9 -56 -23 -43 60 -18 -44 -36 -35
-230c5
##PAGE=	F1=3521.15
##FIRST=	23146.756194512010552,	4241.1435120000014649,	0.37605464458465576172
##DATA TABLE=	(F2++(Y..Y)), PROFILE
4241a36L6N0m2J30K2n3q8RPL1Q3Q1j30o3J10p4J80j93N4M7K4n2m6kK4lk0p6J35l4q2J64QO7
3944A68j56Q6j01k7R7P6p1p3J4L5j45qM6J31Oj3m5L7l4M5j0N7j5j5j81J71k9j27K9M6l8J59
3664A15j29N6k9P7j02K5M5Qk9n3O3j07P7rn8Jj7J22J9k0P9j72m6L6J41K8j10Q3m6K1Oj14Q7
3375D8K9r8m6M2lK5j9n8J02j31J63k30J76K5j51J65RM0K2j60L8p9R7l8j23K75j66N5j47J16
3112b2l5L6m0R8j47J27j7O4L9j65N7L3O5r2p1j8J36K0K4n7j05O9k8P8l3J43o1r8j29j0N2J02
2832A5J03j19M2j07J15j85O9j5J46pp1j8K0J15k9m0j46M5J16j33P0J05kj53L5J5mL3o1k1O1
2561fJ37j07k3p4j0J00L1Op3J17l6n2K9p1MK8L9j03J7J13J1p0q0P6q7J08m1P1j19L9l3N4p3
2272g8l5K6P1L9J3j44K09p4rp8K9l0j8J06oQj5j20O1J12n0J8l6r8K9M7q0J11L2k3J69l10K03
$$ plain form
4241 -136 -100 -50 -92 38 60 7 -81 -72 -65 -34 49 130 0 -63 47 -27 153 -40 14 61 85 33 -13 -15 9 6 -14 -90 45 11 -71 93 101 168
3944 168 12 98 -3 -30 67 143 72 -1 13 48 -97 -105 -59 72 78 65 20 57 23 68 58 115 100 85 -96 75 46 -81 -52 -6 -44 115
3664 115 -14 42 13 90 -12 13 58 66 37 -16 47 -60 17 8 -50 -49 -66 56 75 55 134 -38 -84 -48 93 121 11 94 48 69 75 -39 48
3375 48 77 -21 -67 -25 -28 -3 -22 -80 22 -109 54 -176 0 25 -126 39 48 88 110 -50 -12 -91 6 -32 -155 120 -46 9 -138 -22
3112 -22 -57 -21 -61 37 -110 17 0 64 103 -62 -5 28 93 1 -70 -88 48 68 92 35 -70 -1 -29 49 16 159 98 0 -129 -139 -87 15
2832 15 118 -1 41 -66 49 -136 -67 -82 64 57 -14 -32 -12 103 74 34 -112 -67 49 -84 -14 91 89 -64 -29 -14 -18 15 -46 -67 -6
2561 -6 131 24 1 -73 -83 17 48 54 -19 98 62 10 39 -32 -28 0 39 -64 -47 66 77 7 -73 3 -84 24 -17 54 -65 -26 -59 -5 -78
2272 -78 -113 -87 -16 23 36 -108 101 27 18 -60 -31 -61 -79 27 21 29 14 -106 -45 67 17 35 -1 -99 -70 -23 -103 8 40 17 186 -124 79
1983G9J0M2j19q1J39l0p4p1J25Q5j05l9j23K03P9n5N6j48K33j23L7j45L0P4q3J13n6j49Q4
1730a2Rk4j5J3L6j60N0J14K7k9k9K0o4K9j1n0j00J90J53k04J82j88J09r7L7L6J6%K5J7j5l
1450F2m0k9p3P7KLL8j9K2L8PJ8Nj09K8j44m5R4m9P6P0O8K7k04M9ll1N2Q3M1r0L3k5J3qj14
1135g7k5L5J94j57j4pM7j14K5O5j44L40j22K0j48J11j2Q4j30Q4qJ01j52kP9jj10R1j9k9P8
863H3j74K4K5J64j91J56K9L4j43K3k3P0K9n6j2r7L4J9%On0O9J19j50k0J60p5j73P3p2n0J07
583f2Q1p7L9O3J4k8N2Qj13J9kq5J17j0n2P5p0R0k6m5k0J49o8j12K26k15M1RQ6o0nP2q5L1N5
277I2p0J13j48K8K8OjJ4p4L5Kj19M4J15J7Mrn7o8J00l3j11q0J62M8j12J40k6j77R3M1j40J93
-12E0j27J3K6qn7P8K5O7k3j1l0k1mM7LNn3pJ7MN6l5l2l4L1
$$ plain form
1983 79 89 131 12 -69 70 40 -34 -105 20 105 0 -39 -162 41 120 65 121 -27 206 83 120 -25 5 79 -4 109 53 -96 -12
1730 -12 -3 -27 -42 -29 7 -153 -103 11 38 9 -20 0 -64 -35 -46 -96 -196 -6 147 -57 125 -63 46 -51 -14 22 38 38 63 80 65 62
1450 62 22 -7 -80 -3 -1 2 40 21 43 81 88 106 111 2 30 -114 -159 -65 -114 -38 32 100 127 -77 -28 -31 -62 -10 73 114 24 57 32 45 37 -77
1135 -77 -102 -67 127 -30 -44 -51 -4 -118 -93 -28 -172 168 46 66 -82 29 17 101 -29 55 47 148 -4 -6 73 72 -38 53 34 5 83
863 83 -91 -67 -42 122 -69 87 116 150 7 30 7 77 106 50 38 -59 -25 -6 -6 0 -50 19 138 -12 -32 128 53 -120 -47 -119 -169 -62
583 -62 19 -58 -19 44 58 30 82 90 -23 -4 -6 -91 26 16 -36 39 -31 59 33 -12 -32 117 49 -63 163 -52 -11 -2 84 24 19 91 6 37 92
277 92 22 135 -13 15 43 49 48 62 -12 23 25 -94 -50 65 82 86 77 20 -48 52 19 -92 -172 -10 38 -74 66 40 -137 -44 -3 -143 50
-12 50 -77 -64 -38 -46 -103 -25 0 67 44 33 3 -18 -22 25 28 33 -20 -27 -10 -6 50 15 -17 -51 -20
-230b0
##PAGE=	F1=3426.8
##FIRST=	23146.756194512010552,	4241.1435120000014649,	0.13976295292377471924
##DATA TABLE=	(F2++(Y..Y)), PROFILE
4241a10J3Nj1J29Mk5o0J3j7L7M5J27j50r1J54m1J55k23Q9NK0k9p9K3K0K2j5q7J01k3l9J28
3961I0pP9j64P3r9j7Q6M9n8o0mO7j70J8M1J41Prm4L2m0J09p7R1p5N0k02K00m7q5n1N3KR7q4
3655hP1k4J04k12R3J1J7Rj59J02r9J45n1n1qkJ22J3r%j38L0K5J13Oj07J54o7K2oj11O1L2j14
3357c6J6ooK6n1j2J08j39J35j69J44k1j40J96jM3K1j09kj00R1K7j16K33k07O5j42J49o7M5
3095b5n6O8q1J38l2L6Kj54N4M1P0j07j0KJ31l9M1j6j52P9m7P2KJ15J4j31j57j19L8K32J06
2824A15j01K4j18J86k12O2p5K01k3n8j1RQ5Qm4j31l3J85j33R4J24m6j69JM6L5K4j39l5J31
2561BJ54j65m8qj6P7N2%p5Q2l7o1P9j8m8L0L1j13Q2J01O8j30j20J12m7L2l6L6r1K9NM6o3n7
2264a15J2Q8O3k6j29J23m2Q7p2n3M2l7J03o1K7K1j29Q1O7j6qk0p7oL1n4Q1Q3k8J02k94J83
$$ plain form
4241 -110 -97 -92 -103 26 30 5 -55 -42 -59 -22 23 150 0 -91 63 22 177 -46 43 48 68 39 -40 -17 3 25 10 -77 24 1 -38 90
3961 90 83 162 -2 71 -28 -45 41 90 32 -28 -32 35 -135 -117 -76 65 72 63 19 51 11 120 43 134 59 109 -93 107 60 -25 -76 -23 -21 76 -8
3655 -8 63 39 143 -69 24 35 52 61 -98 4 -95 50 -1 -52 -60 -62 60 73 64 64 -74 -44 -19 94 100 -7 147 80 102 96 -15 46 78 -36
3357 -36 -20 -26 -32 -6 -57 -69 39 -100 35 -134 10 -11 -151 45 44 87 108 -1 -3 -103 -12 15 -101 132 -75 -10 -152 -3 -70 -25
3095 -25 -81 -13 -94 44 12 48 50 -104 -50 -9 61 -46 -56 -54 77 38 79 63 -89 -10 -57 15 17 132 146 15 -142 -261 -223 9 115
2824 115 14 38 -80 106 -106 -44 -119 82 59 1 -10 -1 84 92 48 -83 -116 69 -64 30 154 108 -61 -60 -14 21 45 -94 -129 2
2561 2 156 -9 -57 -65 -81 -4 48 48 -27 55 18 -43 36 18 -30 0 31 -82 0 101 169 39 -81 31 -16 16 -20 16 -75 -46 -41 5 -58 -115
2264 -115 -103 -15 48 22 -107 16 -26 61 -11 -64 -22 -59 44 -17 10 31 -98 -17 50 34 26 6 -71 -77 -46 -100 -19 64 36 138 -156 27
1983B7M2M3m2j01J53p1m6j19J76O6j09q4j26K28Q4o8L6r8K43j74K1q7j9J04j40J56r0r2P8
1730iK4p4RQJ8j37M3R8M6l3pJ5m2L2m0q6r2J73J91j81J70j70J25j17L8K6K7l6L7K1m8L8k4
1441D3m8p4Q3m3L2J1LJ7JO0L3l5o2m3j29m9J25m1J19L2M0J9j76O7l0j7N6R3Rq6O3m8L5j1j10
1135f1J9k0J40p6q1j5R5p3J3Kj12L27n5l2j57J06J6R8j08Mj8J74k02N7L9rj43J34J2o0P5j52
855f3m7M9J59j58J46J7N7j54j8JQ0Pn9K1q2J7L6J7o4k6J16O9j48J0J23n5j82J10r9J2P4L5
575Ap6N9J00k1r8J00L8j34lK3k9Q2mn1N4m9P4j7q2n4K03l3q3J51j75k8N5J34j61K8P6n8J5
286C7Q3j11J45j86ON6j2L1j6m2Q8l0j52M9J16J8l2J3m8l5P6n1p4q5J24O3j27J10L3j99J11
15d1L0j00J54q8L0n6L9p7L2R8N2m9Kn8O3m1J0K5Oq7P3j3L4J1k3k4n1N5
$$ plain form
1983 27 69 112 70 -31 122 51 5 -114 62 128 19 -65 -191 37 121 53 89 -9 234 60 81 -6 -25 79 -61 95 5 -87 -9
1730 -9 15 -59 -50 -42 -24 -161 -118 -20 26 -7 -14 1 -41 -9 -49 -135 -227 -54 137 -44 126 -44 81 -36 2 28 55 19 56 77 29 67 43
1441 43 -5 -79 4 -39 -7 4 7 24 25 85 118 83 21 -22 -151 -200 -75 -116 3 35 75 94 -82 -15 -45 -62 -6 87 96 10 73 25 60 49 -61
1135 -61 -42 -62 78 2 -79 -94 1 -72 -59 -57 -169 158 103 71 -86 20 36 134 26 30 12 186 -16 41 80 71 -72 62 74 14 89 -63
855 -63 -110 -61 98 -60 86 103 160 6 -12 -11 69 76 17 38 -44 -27 9 26 -38 -64 52 121 -27 -17 106 51 -131 -21 -120 -108 -34 1
575 1 -75 -16 84 63 -35 65 103 -31 -34 -11 -40 42 38 -13 41 -8 66 49 -33 -87 116 83 0 151 -24 -52 3 137 -24 4 80 22 37
286 37 120 9 154 -32 -26 30 18 49 33 -9 79 49 -103 -54 62 80 48 61 13 -22 54 3 -71 -156 -32 31 -96 14 47 -152 -41
15 -41 -11 -111 43 -45 -15 -71 -32 -109 -77 21 73 24 26 -32 31 -10 0 25 31 -56 17 4 38 49 26 2 -49 6
-230F
##PAGE=	F1=3332.44
##FIRST=	23146.756194512010552,	4241.1435120000014649,	0.060535971075296401978
##DATA TABLE=	(F2++(Y..Y)), PROFILE
4241e3k1m3jJ13MJ3m3K8o6N1J6J62j56p7J47k9J27k25J14k2%jj08M3LP8%j01M6mJ4Q0l6O0
3944A13j13K4q0J1M7L7n2m3mO3j37J9L0J46rMm3J4k1J04r0J11j15Q4j60J74l4o1j10M7L2M0
3664B8l1O8oJ18k86J52k5L2J1k35J46r5J86q2m7jRJ36k4J7n0q4L2K5O0Pn4J62p5J7nj04K1
3375B3M6q1M0p9K2J4n0K9P6j10P2q9J00n1j10J89Rj5M3l7n0j14Q0Q4p1J44k23R1j35J58o3
3104e8L8o6L7mJ29l9k2k3j47R0K9M5j08P3PR8q0M1Nj23N7m0O8K5P0N7j40j94k90QM40J27q2
2815B8J4j15K30k15N2j39K06mn8QJ3J3O2m9j00p2K26j27J17R6r5j52l3P5P3J0j95k9J53J47
2552A40j71o3M9m0O5N5k2n1M8m5m9J31J8p5K8K3j08J13P4J14j85j14J54l1n2k8j2n2PL6N6
2281A3n2o5K2P4P8p0r6L9j4J83o7j13Q1m0Q3r4J9O8j15Q4L7nl2Lo8l6K1l6L1J10K7k1k14J53
$$ plain form
4241 -53 -74 -117 -118 -5 -1 12 -31 -3 -69 -18 -2 160 4 -73 74 45 172 -53 61 39 39 38 -70 -27 -24 54 54 -47 -1 -5 9 89 53 113
3944 113 0 24 -56 -45 2 39 -13 -56 -60 3 -134 -115 -85 61 52 56 13 27 6 110 20 131 16 100 -60 114 80 19 -91 -44 -12 28
3664 28 -3 65 59 177 -109 43 18 50 61 -174 -28 -123 63 -19 -66 -67 -58 78 54 71 21 -63 -31 -6 54 61 7 169 94 111 106 2 23
3375 23 69 -12 28 -51 -29 -15 -65 -36 40 -70 2 -87 13 -38 -148 41 50 35 78 41 -9 -123 -43 41 -30 114 -109 -18 -153 5 -58
3104 -58 -20 -86 -49 -53 76 37 15 -8 -155 -65 -36 9 -99 -26 -19 79 -1 40 45 -78 -21 -61 7 32 102 159 19 -175 -465 -457 -17 110 28
2815 28 42 -73 157 -58 -6 -145 61 57 -1 7 20 33 95 46 -54 -126 100 -27 90 186 91 -61 -94 -19 54 64 -131 -160 -7 140
2552 140 -31 -94 -45 -85 -20 35 13 -38 10 -35 -84 47 65 -10 18 41 -67 46 120 234 49 -65 89 58 6 -22 -34 -86 -79 -43 13
2281 13 -39 -104 -82 -8 70 0 -96 -57 -71 112 45 -68 13 -27 56 -38 -19 49 -66 18 55 50 18 21 -47 -83 -62 -98 -67 43 70 49 -165 -12
1983a2M7M7K4j13J55r2l1j44J92K7q4q9j04K09M9n0J4m5K24j89Ml4k9J18k06K09j30k4N7K8
1721B8j01J2J1pj02O7N7M4l0K4rj5L1o6j01n1J13K18j49J28j01R6j17K1L3M0p7L3L6q8R1j2
1441E7m3n6O9j11P3j9K6Mj0Q4M0n4k3j02j05m6J36j8J41jJ5J0j48R6n1k0O3R7l1p6Q2l2J7
1152F4nr6N3p3M7L1j19k1J19k2Ll8q3K56L4j00j09Q0K3J20q6p1k1J93j81Q9l0J7j42J22O3
881A17o6J9j09p4M4J10q6R7M0N3j60k3L0O6m7qL8r2M6ON5j23j1J37J5r8nR9l4j28P4q7N8J9
583b8J7p2Q1J09l8j45J12M9j31j8M8LM9J0n5M7l0M0Lj23o2K27K3m9M5j13j08J02J89k33L9
312a2M8jk3J32j33J50j96k9Q6l9O8n7OJ16l7j82O9P4K8n6L8o2J7K9m7m9n5Q2P7j54J12N7k09
23a52J11Po0J25l1K9o9L3q7j7J51M2q6pm8J29n1n1M7Jr6J35n1O5j4n3kl1O3
$$ plain form
1983 -12 35 82 106 -7 148 56 25 -119 73 100 16 -73 -177 32 81 31 45 0 224 35 39 5 -24 94 -112 97 -33 -57 0 28
1721 28 -73 -61 -50 -57 -159 -92 -35 9 -21 3 -6 -21 10 -56 -157 -208 -95 123 -26 102 1 97 -20 1 34 74 -3 30 66 -22 69 57
1441 57 14 -42 27 -84 -11 -30 -4 0 -10 74 114 60 37 -65 -170 -216 -80 -98 43 42 57 67 -81 15 -36 -56 7 104 73 -3 79 47 64
1152 64 59 -37 16 -57 -10 21 -98 -119 0 -22 -19 -57 -140 116 150 50 -59 21 44 164 78 7 -14 179 -2 87 57 74 -68 54 117
881 117 51 70 -39 -113 -69 41 -45 52 92 145 -15 -38 -8 58 11 3 41 -51 -5 1 56 -67 -78 59 74 -24 -29 70 36 -92 -18 -105 -47 -28
583 -28 -11 -83 -2 107 69 -76 36 85 -46 -64 -16 -13 36 46 -9 38 8 48 51 -72 -134 93 116 67 112 -1 -109 -7 182 -51 -12
312 -12 36 35 12 144 11 161 -35 -64 22 -17 51 -6 0 116 79 -103 -34 40 68 12 50 -12 5 34 -13 -62 -117 -35 42 -112 0 57 -152
23 -152 -41 -34 -94 31 0 29 -40 -7 -94 -111 40 82 -4 -11 -59 70 19 -32 15 16 -80 55 4 69 55 2 0 -31 32
-230C2
##PAGE=	F1=3238.09
##FIRST=	23146.756194512010552,	4241.1435120000014649,	0.15695676207542419434
##DATA TABLE=	(F2++(Y..Y)), PROFILE
4241Cm7o6k1Q0L1M0m0N9j18M8LJ86j53j6J00m4R7k01J18k3l3L9j22M0qJ26L3j22qJ5N3L2n2
3952B9J8k5m0n5M8jM2n3m3K0J9n1JQJ37l7K5k9j2J2K7m1R3j19R3q0J08kn9j35K9N8PRM9J5
3637F5J12l04J91n0N0rk64J60p9J95j02l6NJ2J59o0L1n8m9j7K8lM2L0J13o9Nkr7j3O0pK7j61
3340i5P9jk1L4L4o3J5k2M7o5o9J41M4j07R3K6q5j20O8J07j6L6k10J31j23J38j1J1p6L0L8J03
3060I1k5r0j4j56J47Mop1J34oL9p1J9K2o5J0nP0K6K7M5j09j95k51k3M26J42p9Nj03K47j98
2780a3L7j87J81L9q6L8L7m9R0n7p1m8K14j22J23N8j21j39m3Q6R8nj90k8J39J07j21o0P6q2
2517i9P7L6m6k0L7n1k4J62J7o1J4K9r5R5J8J48k02p1J83l4j15j8o8j5pM9P5m4n2N7L0P5r5
2229a5o5j0QK28n8j35P3k3N6r4j3J03q5P1J2j1l9L1o0n7J7l9J0Q4J11j35j24J31K8N4N2j01
$$ plain form
4241 3 -44 -110 -131 -51 -20 20 -20 39 -79 -31 -28 158 5 -11 89 45 142 -59 59 36 3 42 -80 -40 -48 78 111 -11 -19 -4 49 81 29
3952 29 47 22 -18 -73 -25 -26 16 -37 -80 -60 -41 -92 -91 -83 54 17 42 13 1 13 40 -1 92 -27 66 -14 94 92 33 -102 -73 -15 -8 1 50 65
3637 65 177 -127 64 14 64 55 -209 -49 -128 67 -35 -71 -66 -54 105 45 76 18 -31 -48 -20 -23 19 49 162 93 98 96 -1 -14 46 39 66 -95
3340 -95 -16 -17 -38 -4 30 -33 -18 -40 7 -58 -127 14 58 -49 44 70 -15 -135 -67 40 24 60 -150 -19 -142 -4 -15 -4 -80 -50 -12 91
3060 91 66 -24 -38 -194 -47 -43 -49 -120 14 8 47 -24 -5 17 -48 -38 -43 27 53 80 125 16 -179 -430 -453 -27 115 36 41 -62 185 -13
2780 -13 24 -163 18 57 -29 9 46 -3 87 30 -41 -89 125 3 126 184 63 -76 -119 -33 65 60 -130 -158 -19 88 -33 -93 -17 -99
2517 -99 -22 14 -32 -52 -15 -66 -90 72 89 28 42 71 -24 71 89 237 35 -36 147 113 -2 -20 -88 -103 -110 -61 14 -30 -82 -25 5 80 -15
2229 -15 -80 -90 -82 146 88 -47 26 3 59 -35 -48 55 -30 41 53 42 3 34 -26 -83 -66 -105 -95 -11 100 -35 -159 -28 0 54 106 5
1948EJ45j01l5j30J55pn1m6p5J60KmroJ66j56j9LLJ14k34K35j71L7K4L3j23K1Lk1p0J00J7
1660c5L0k1N8m8j2L8o1r5KM0K14j14O3lL6r1j4M3O7j11K2M5j15J39k3k1k1K9j59J00l9M6j5
1371b6QQ5L2n1lj16p4n5J27J4J25j2j6Lj13J19o2l7O9Q9o6n5Q4J5k3lq3O9j13m3J40j24k9
1082a25J25KJ0l3p7J68J07j57j8L8mJ48p2j19l1J84j02Q1j02N0j11P6J01l4q1n8m2J8M9j9
820b8K6R8Rj58OM2M4j05P3M0j35J26n8R8j43k1J20j5j7n2Q5j6m9om7P1k6L0p2J06O7k5j44
531g6P6M1j12j8O9NK4L6o6M3j6jK9j28m7J93P7k3n0m8j52J18K37k52K3j0O4n9J82j21J09j79
251c2o4J30p1Q8r2O6R9l2j82R0RL1k7L4j05Q6k4k1m0j5M9R7j86J43L0j98J00j7l8J15K6Ok5
-38C0rp7o5J60L5r0m0j0J52k3j16M7Kp6J52q6Q6rj05J4J6N2
$$ plain form
1948 5 150 49 14 -116 39 32 -19 -65 -140 20 22 18 9 3 169 13 -6 -3 0 114 -120 115 -56 -19 5 38 -85 -64 -61 -82 -152 -52 -35
1660 -35 -5 -26 32 -16 -28 10 -51 -146 -144 -104 110 -4 59 56 92 1 -13 30 97 -14 8 53 -62 77 54 33 12 41 -118 -18 -57 -11 -26
1371 -26 -18 67 99 48 45 -71 -145 -200 -73 -59 66 54 38 41 -72 47 -15 -52 17 106 40 -15 69 84 61 58 -25 44 -69 -112 28 -96 -125
1082 -125 0 2 12 -21 -98 70 177 20 2 40 36 184 112 -7 -38 146 44 125 23 73 -38 38 139 105 24 -34 -76 -58 -9 -28
820 -28 -2 96 105 -53 -47 -5 39 -66 7 47 -88 38 -20 78 -65 -86 34 19 2 -50 35 19 -30 -36 -83 -12 -38 -8 -80 26 93 68 -76
531 -76 0 41 -71 -89 -20 -15 9 45 -21 22 6 5 34 -94 -141 52 129 106 56 8 -144 -26 211 -41 -18 -28 36 -23 159 38 147 -32
251 -32 -96 34 -37 51 -41 25 124 92 -90 0 9 40 13 47 -58 28 4 -17 -57 -72 -23 74 -112 31 61 -137 -37 -54 -92 23 49 55 30
-38 30 21 -56 -121 39 74 -16 -56 -66 86 63 -53 -6 -4 -80 72 -14 72 63 -42 -28 -12 40
-230D0
##PAGE=	F1=3143.74
##FIRST=	23146.756194512010552,	4241.1435120000014649,	0.099987506866455078125
##DATA TABLE=	(F2++(Y..Y)), PROFILE
4241C6n1o2n5M1O6N2m6R5j48J9RJ89j42O6M3p9P0j57R6po5Q7j22K3kJ23P8j41l1K6N5mm7j6
3944aN5p7m5P7m0N9o0o0N1m1M6j7j3J10o1L7Mm1M1o4L2L8r2Q9qL5L2o2j38PR1pK6K7L0Q4k63
3620a19J95n4O6l1k47J30m0J74j09k8jJ1J85o9J5l4n6o9L0o2J00J19M3o4j1j1r3j9O7P8j2
3349H4k12J43j8MOJ0k2kJ0kp7k0O8R7j90J50N1q0j21L9J02K0n1j77J71j02R3P4l5q2M8L2O7
3060G8J2j48K3j69J92j1n7jJ37k3l3j9j3M3k2m4M5O7QJ8j3l1q7M77n7l51R9q7qq6K42j71J9
2771B9k04J54Q1j32N5O9LK7p6n1J0J64j24J04M8j11j52k1P9J06k2j22n1J08M6l9l6N7j14J04
2509a1Qo0JM0l5nJ63nk1k2N2q1L9o0J76j69k4J91m7j40qj14PPM2Q6m3k7J01j5N7q9n9j4K4
2202e5J99l5j35K7K7L2p4o0J12n1N5k5j6k6N9m3o5K7o6M0J1J67j76p7J20jO2M4n6J25j12n1
$$ plain form
4241 36 -15 -77 -132 -91 -25 27 -19 76 -72 -53 -44 145 3 69 112 33 103 -54 42 35 -30 57 -65 -42 -44 79 157 16 -15 11 66 62 15 -1
3944 -1 54 -23 -68 9 -31 28 -32 -92 -41 -82 -36 -53 -66 44 -17 20 24 -17 24 -40 -8 30 -62 27 19 54 86 24 -114 -107 -16 -23 3 30 60 144 -119
3620 -119 76 22 88 57 -190 -60 -100 74 -35 -63 -64 -53 132 63 78 44 -12 -81 -51 -113 -13 106 149 85 74 63 -30 -49 18 96 84
3349 84 -128 15 -3 1 7 17 -5 -7 3 1 -76 -96 -28 69 -121 29 80 0 -121 -82 20 40 -11 -188 -17 -119 -26 48 13 -69 -21 11 78
3060 78 90 -58 -35 -204 -12 -23 -80 -81 56 33 0 -19 -32 11 -11 -55 -10 57 65 83 70 39 -48 429 372 21 120 33 25 -61 181 10 29
2771 29 -175 -21 60 -72 -17 52 55 82 6 -45 -35 129 5 109 157 46 -106 -127 -48 58 36 -86 -137 -29 17 -22 -58 -1 -115 -11
2509 -11 -3 -63 -62 -22 -57 -62 101 96 75 53 105 24 63 3 179 10 -14 177 130 -10 -18 -132 -125 -118 -76 10 -33 -60 41 26 83 -6 -65 -79 -55
2202 -55 144 109 -26 1 28 60 -14 -74 38 -13 42 17 1 -25 34 -9 -74 -47 -113 -73 -62 105 -71 -148 -28 -29 33 77 21 146 34 -17
1922a7q1Q0k4l2K3n9J03k3N1k5J7P6r1n8K2P1Q8k01K12j91O6oM3j44M2j9j6m2J06LMKR0q6
1625a6m9O5l0p2M2j1J71q4rR3k5m8o1N0J01j28K3L0j03J47n0jJ6l0j48R5l6O5m6M4P2Rl4o
1327C6p9l5p7R7M8P5jn6Jo2J13o1n4O6P4p7k8P0N6n5j0p2N9j24j04K25j13l5J26qM1jr5R7
1030C7J41j73P6j7m9J68o4j29n3J87mL5j56N0n9K8J10K5j88j7K8j7J4J4m9J66m9j41K7M0K8
758Ij27J33L5j85K28j28J27j19n6P7j5P1j08P5j6J8p6%M9l7N7q7J36j8Rr6kK8q7nQ9j1J3O9
461E0p8J9nk9M5q2k3J11J04nj07Jj39R5K63k28lp6J18p5K00p6L2j40q8J82j00P8j06J23N0
190A11m1j33R1m3J7N3lj63J53n5Rl9J2K4J09j94J76l4j54Q2l2l8J21O3m0M5n2n2r5J21J8l4
-90Cp7K4J39Pj50J4K5m0J26j15R3J9j43J0N8L4
$$ plain form
1922 -17 -98 -18 -42 -74 -51 -110 -7 -30 21 -4 13 89 -2 -60 -38 33 121 -80 132 -59 7 1 44 -100 -58 -77 -93 -135 -29 -26 -22 -20 70 -16
1625 -16 -65 0 -30 -102 -60 -71 100 16 7 100 75 27 -34 16 117 -11 12 42 -61 86 36 35 51 21 -127 -32 -68 -3 -49 -5 67 76 42 36
1327 36 -43 -78 -155 -58 -10 65 64 8 9 -53 60 -1 -55 11 85 8 -20 50 106 51 41 -31 28 -96 -200 25 -88 -123 3 -5 36 35 -60 37
1030 37 178 5 81 64 15 183 119 -10 -63 124 120 155 -1 49 -10 18 128 153 -35 -52 -24 -41 -27 -13 -62 104 55 -86 -59 -19 9
758 9 -118 15 50 -135 93 -35 92 -27 -83 -6 -21 50 -58 17 1 19 -57 -57 -8 -45 12 -75 61 43 52 -44 -46 -18 -105 -110 -21 -32 -19 50
461 50 -28 -9 -14 -43 2 -80 -103 8 112 107 0 1 -138 -43 220 -8 -11 -87 31 -44 156 80 112 -28 -116 66 -34 44 -62 61 111
190 111 70 -63 28 -15 2 55 52 -111 42 -13 -4 -43 -31 -7 102 -92 84 50 -104 -22 -54 -92 29 92 52 97 45 -7 -102 19 37 3
-90 3 -74 -50 89 96 -54 -40 -15 -55 71 -44 49 68 -75 -65 -7 27
-230B7
##PAGE=	F1=3049.38
##FIRST=	23146.756194512010552,	4241.1435120000014649,	-0.038245167583227157593
##DATA TABLE=	(F2++(Y..Y)), PROFILE
4241C8k8m5q5K2P9N4n7J17j45j5K6J53j09J32Jj21M9r8N0J2p7J30j17J0J4O7J16j39k7L1K6
3970F4k7l1k4J01o4o4R4o2P2p1q0O8q0J07k1j9Q1p7K7M4o9N3r5P8l5l9P1K5j4N2n2j38j7J31
3672a1oJ5K6L7M2j86J53m2P3k8k09Q0J2J27r9l8j4PK13n3k3Lr0r1L0j03J46J91j6p4k9l1q0
3384f8PO0J36n2k03J83l7jk5J7rK4Pm2q2K8KJ36k25J88K7k9j15j9R0J9r0j31J91o9M0J48q4
3095B2p7P1lL1N9j81N7j61J98Pq5O9Q3k4j10M6l2N8oq1Q8N5k0N2p2P6J59K130j21k157k4r3
2815A4j7o6K18j39rj78J44R7j77L7Q9K46j65j16k9N0J06j30P0O8o7j86K1O4J07m7k6r0O2o
2552e5M5jnr4J17j2n7JL4O%J40j9J9p3O5o6j4j30J90j07J1J74o2j22mj34NM9L8O5m7kJ30l8
2246D7L7o2q5J6M6J11Kj36l9J06K6o3r9R9k6M7p9mqQ1j1n7M3j02J05p2J61j24q9J05k7P2K0
$$ plain form
4241 38 10 -35 -120 -98 -19 35 -22 95 -50 -65 -39 114 5 137 138 17 66 -32 18 30 -47 83 -34 -24 -10 57 173 34 7 38 64
3970 64 37 6 -18 83 19 -45 49 -13 59 -12 -92 -24 -104 3 -18 -37 44 -33 -6 38 -31 22 -73 5 -30 -69 2 27 13 65 13 -125 -142 -11
3672 -11 -17 -2 24 61 103 -83 70 28 101 73 -136 -56 -44 83 -16 -54 -68 -61 152 99 76 79 -11 -102 -72 -175 -29 162 146 72 43 12 -68
3384 -68 -61 -1 135 83 -120 63 26 25 0 17 8 32 39 -3 -85 -57 -55 81 -144 44 71 42 -73 -92 -2 17 -73 -204 -13 -82 -42 106 22
3095 22 -55 16 13 44 103 -78 -21 -182 16 23 -62 7 90 66 -44 2 -30 28 22 -59 29 84 64 116 44 120 279 2409 2288 131 107 14
2815 14 -3 -69 149 10 1 -177 -33 64 -113 -76 13 259 94 -22 -51 -1 105 -25 45 113 46 -140 -119 -55 52 5 -21 -111 -49 -55
2552 -55 -10 -11 -16 -110 7 -5 -62 -61 -27 -21 -21 119 100 119 46 111 45 31 -99 91 -16 -5 169 107 -15 -19 -153 -148 -99 -61 4 -43 -45 85 47
2246 47 84 22 -63 -47 -1 110 112 -24 -63 43 69 6 -93 6 -20 27 -52 -56 -64 17 6 -51 -8 -110 -5 -77 84 -40 -129 -24 -51 21 41
1957D1J1R3j12q5j2kk1l9Q5o8O4k3J08l4L1k4l0r5K7J41M6j19J46j74O1k5N3j52N6l4lqO6
1668c1J0k9M7J09j09j08J11ql8N7k1R9o1o5J53o0qr9N9J19j27M5pn2R0n7lL1q1p7N7oQ1q0
1371e9P2N6k2j1k6j9Pr0N5P1QJ4q5NlP7n1n9M2P0n6rN0N2n0k7n9K8r8j38K71j01n0J35k7Q0
1056E3K9j17N3J36j33J26p0q6J63m8j11p9K14P2l2j78P%JR1Q0k64J2R3m9K2J0j10K09p8j08
785i2OM5K2r7J28K5j99K96j67J32p2r1K8oJ50j53O7l1M6r4L3J2l0Q6j21J66j09M2k7r5K0o1
505a41K5J03k8J0J06r1l2jk3M1mj5K9R3Pj18K8r3N5K55j86j7j16J50p1J63j8n2q4r2K19j20
225a8M3j03J73np6m6O1m9j3J46m5k12J96o2K8l1K1%R0j52J67r2p6O1l9m9J31O7r3J01o8k2
-55C4r4N3j1O8q8J8J16kj36l4O7rQ1j33Q3M5j27k0P1K5
$$ plain form
1957 41 52 145 33 -52 -64 -66 -87 -126 -41 -109 -45 -68 40 6 37 13 -17 -112 -85 56 102 -17 129 -45 16 -9 44 -108 -52 -86 -89 -97 -31
1668 -31 -21 -50 -3 106 -3 -111 0 -8 -46 11 -10 89 28 -37 116 56 48 -51 8 127 0 45 38 -14 76 19 16 47 -34 -111 -54 -60 21 -59
1371 -59 13 69 47 36 10 -9 -2 -92 -37 34 42 56 -29 -24 -27 50 -1 -60 -18 52 -4 -13 37 89 39 12 -47 -19 -117 -255 16 -85 -135 0 -27 53
1056 53 82 -35 18 154 21 147 77 -9 154 106 -5 -84 130 202 170 -8 -1 -1 0 91 171 -93 -81 12 -37 -15 -5 -115 94 16 -92
785 -92 -86 -41 -19 -116 12 37 -162 134 -33 99 27 -64 -36 -42 108 -45 22 -9 37 -57 -24 -12 -42 44 -77 89 -20 22 -5 -100 -80 -141
505 -141 -116 -13 -41 -31 75 -16 -48 -49 -72 -31 -35 -50 -21 72 79 -39 -11 -104 -49 206 20 3 -113 37 -34 129 111 59 -25 -117 102 -18
225 -18 25 -78 95 90 14 -32 29 -20 -33 113 68 -144 52 -10 18 -13 8 8 98 -54 113 21 -55 6 -33 -82 49 116 23 124 56 34
-55 34 -60 -7 -18 50 -38 -20 96 94 -42 -76 -9 -18 63 -70 13 58 -69 -89 -18 7
-230G
##PAGE=	F1=2955.03
##FIRST=	23146.756194512010552,	4241.1435120000014649,	-0.12759920954704284668
##DATA TABLE=	(F2++(Y..Y)), PROFILE
4241B4Nk9j01L5N6N5o4J12j24j8L7P3m2J51j5j51L0l5oK1n7J61j22J6K3jJ18j03k1L2pm1j9
3952gkJ15j5j07R9o5O6q7q5P1q5J18j9LP4r1j7P7q7M8m5O5r7L8L4K0l1N1k3j49l1J53J9k3
3655a5N2L5J5j11O7k1O5Oj67M0M5O8n9p8k6NK41l0o6L9j15q6L5j17J50K33n7r3m9m3o0N0M7
3366@J45p7j35J79m8n0k7N6k6N5qp0p1O4l3J32j95J88l3N2j05r1Q4jr4q4J91l4nJ76j26m2
3086c3P5m4J6Q8j79N5j19J61O1q3J01%Lj79R9k8O1or2J16L1m6J10r5J69M87M227k39m469j78
2824G0q1k8l5J74j06m0j13J49P6j96k4Q0O28m29j73LM2P3j39L4R9nk14N0O1J09q0M2j12Kl8
2552a21J19K7r5pJ06j7m4k4J1N1MJ04qL9j19M5n1k0j64J76m6L3J35p3p9lj30j0J03M7J4n4
2272e1J5J22l1K3k9j30N6P5J7L5j41j05J92L5p0j12Q2j9M7j41K9RQ4K7l3M7j28J66j22R7n
$$ plain form
4241 24 29 0 -101 -66 -10 45 -19 93 -31 -49 -12 61 19 170 155 4 34 -1 -7 14 -43 118 -4 12 35 34 152 49 28 60 53 12 -7
3952 -7 -9 106 91 -16 83 18 84 -3 -88 -17 -102 16 -3 0 74 -17 -34 43 -44 4 -41 24 -73 -35 -1 19 -12 39 16 -133 -164 -11 8 -15
3655 -15 37 72 87 -24 43 22 87 93 -74 -34 11 79 20 -58 -84 -79 162 132 66 105 -10 -96 -61 -178 -28 205 148 55 6 -37 -97 -47 0
3366 0 145 68 -67 112 64 14 -13 43 17 72 64 -6 -77 -13 -46 86 -109 79 46 98 -7 -98 -14 -15 -109 -193 -2 -36 -41 135 9 -33
3086 -33 42 -2 14 102 -77 -22 -141 20 81 -2 99 99 102 -77 22 -6 55 49 -43 73 104 58 168 73 242 729 4956 4717 248 70
2824 70 -11 -39 -74 100 -6 -46 -159 -10 66 -130 -154 -74 554 125 -48 -45 -3 70 -69 -35 64 59 -155 -105 -44 65 -15 27 -85 -83 -121
2552 -121 -2 25 -70 -77 29 12 -32 -56 -45 6 10 114 106 145 26 71 20 0 -164 12 -34 -1 134 61 -18 -21 -151 -161 -58 -11 3 -51
2272 -51 -36 86 55 78 49 -81 -25 50 67 102 -39 -144 48 83 13 -99 -17 -36 11 -130 -101 -92 -8 19 -14 33 -95 71 -51 46 41
2001D1j33P1m1Q7mP0N2q2j30M4n9jp0J19r2N3k2J63l4L5j11Oj03J5J83Ml2P3j24L1l1O6j46
1712a02M6j4nL4oK5o6J04J07j04j51J60l1ON0oK1l6r3J56n1Pj15Q6J06j18P5m6J4rl0k5J7
1423Fj09J2J3L7R5j04P6M4n5J4n5L2L7p1J3P8n0Qp5J2L9K9m1n2kR8j4rL6j0Qn7m4j3m4j54
1108b72K72q4q3J50k5J00L6j22K9J12n3J13j03j00J33k1q2r5K43J10r4j68o2O6j2O0J00k78
863a30K7J22p2N5nj48K06n7n7o0O9K1l7N9Kj45K89j62J26l7j00pj2K08j72O2m9L9o0M0k0k8
583c3J10j61J87j75O3K4j64J9l1O4J06m0J0J31j06q6nJ3J4P7l2j3N9J5r0K9n5L0K06j39qj21
303a02J61n2Q2K0j11k2p8K15j17Lr3K10m6j22M0J9j2n3K11o1k33K02n6L4j8L3k7L1n9R3j13
32b1J8M3m5n6J34M1j34J19m6Mo7j4m0J66n6m0J13n5r0o5R8RM2j40O4M4n2o1O1L1
$$ plain form
2001 41 -92 -21 -62 25 21 91 143 61 -69 -25 -84 -85 -155 -36 -128 -75 -97 66 32 67 -44 -38 -141 -126 57 61 29 102 -22 9 -22 44 -102
1712 -102 -56 -70 -75 -41 -47 -22 -88 16 123 19 -132 28 -3 3 53 47 68 32 -61 95 44 51 -64 22 128 10 85 39 53 44 14 -11 6
1423 6 -103 -91 -78 -41 54 -50 26 70 15 29 -26 6 43 -28 -15 63 13 21 -54 -42 -3 26 -15 -67 -69 29 15 6 42 32 40 -17 -61 -74 -118 -272
1108 -272 0 -84 -167 -17 -42 58 94 -28 1 113 60 173 70 -30 103 82 0 -95 148 258 164 -4 -66 0 -12 48 148 -130
863 -130 -103 19 -53 2 -3 -151 55 -2 -59 -119 -50 -29 -66 -7 -5 -150 139 -23 103 66 -34 -41 -53 155 -17 45 -4 35 -25 15 -5 -33
583 -33 77 -84 103 -72 -9 15 -149 -130 -161 -97 9 -31 -21 110 4 -82 -87 -74 -60 17 -15 -28 31 46 -44 -15 -70 -40 166 27 19 -102
303 -102 59 7 89 109 -2 -24 -102 113 -4 -1 -94 116 70 -52 -12 7 -5 -58 153 92 -141 61 5 39 21 54 27 58 -1 92 -21
32 -21 -3 40 -5 -61 73 114 -20 99 53 57 -10 -24 -64 102 46 6 119 64 -26 -91 7 16 58 -82 -18 26 -26 -87 -26 5
-230E
##PAGE=	F1=2860.68
##FIRST=	23146.756194512010552,	4241.1435120000014649,	-0.10801493376493453979
##DATA TABLE=	(F2++(Y..Y)), PROFILE
4241A0K0j1j03P8%N7o5R2j09K2K6k7N2J18pj58NK2n7K1j3J83j37L1K1m0P8m1l6K3j8m9j9L5
3944DJ20K4j40R6n4L5j05p4Q0o4R2k8N3R0j06p7R5r1L6L6Kj25J27k0Pl3L9Rj62k4J37P6p8
3655b3Q3J7K5o7l1%M3O0j28K3L8J2Pj32l5J1K58k2r3P0j02p5M2r8J03K37q4j12o3l4l7R0L9
3366B2J06p7m3J29l9j19nJ18o2O0j4q4m4Q0l1P5j15J60j02J25r3j34P1j4q9n0J84j2k4J47
3104A26j46K0M7o9L0P8j41J0n7J01J29o3Q2p5N7k35J32rN8j1q0J31Rp2J61q2K11P50N711l81
2841F422o123k72n6m6J0J14p3o9j9J52K6j71j13M5R65o28k26M1jO8j40%J13O1k19M8P5J14
2596I8j19N9r0o1n3J77K6j87J23Q2j1m0o0j7P8K3O6MM6j42nl8K7j44J26oM4R1p9l5Jj15k5
2307a56J47O0l8n7K1P4qJ1mj62P9J11m5M9j34j56K53M2q5q5P4k9N1k00P1K3N7P0mL0j31J88
$$ plain form
4241 10 30 19 -84 -6 -6 51 -14 78 -31 -9 17 -10 42 160 153 -5 0 22 -35 -14 -27 156 19 50 71 31 109 68 32 55 37 -12 -31 4
3944 4 124 148 8 104 50 85 -20 -94 -14 -78 14 -14 39 129 23 -54 41 -50 -14 22 24 -101 26 6 13 -20 19 28 -134 -158 -21 55 -23
3655 -23 60 77 102 35 4 4 47 107 -21 2 40 52 59 -73 -108 -97 161 139 46 116 14 -61 -19 -117 -14 223 139 27 -36 -70 -107 -17 22
3366 22 128 51 8 137 98 -21 -26 92 30 90 76 -8 -52 28 -3 72 -43 117 15 140 47 -87 -16 -30 -119 -169 15 3 -21 126
3104 126 -20 0 47 -22 8 86 -55 -45 -102 -1 128 65 147 72 129 -106 26 17 75 64 -16 115 124 52 213 131 342 1092 6803 6422
2841 6422 299 27 -29 -75 -65 49 -24 -93 -112 40 66 -105 -218 -173 792 164 -62 -21 -22 46 -94 -94 19 80 -139 -91 -16 98
2596 98 -21 38 -52 -113 -166 11 37 -150 -27 55 44 4 -56 -73 5 28 94 98 144 2 -3 -41 -14 -158 -32 -38 6 97 18 -17 -16 -131 -156
2307 -156 -9 51 13 -44 -23 51 43 54 50 -112 -33 78 33 82 -52 -208 45 87 2 -83 -9 -38 13 -187 -116 -93 -36 34 30 60 -71 117
2027A17j25J1J26j70K9m8J06k1R3J7k3j74P2r3L0j00J20j12O9m6K06k7K6j66J8o8rJ81k8K7
1765C8K5o3%l6Q7j35J1M7l9P4p4L6r4J45P9o2j47J80r0N4L3Nl7nq8J02j1%j11J36N9r8Q1o4
1467C8O7r9J3n3kj10N7rO9J05j02N2M2q2L8q8O8M4k8j6P2q2k8j5K6L7j7l3l9n4J50M2l5M0
1170F8j03R5r6l5m5J5j43K22n0j30J58J0P7K2r8J4Q2L4N3j05q8Q2K0n7r4K41J09j21j43j10
907a16J32k6L3P0k24K8J11q4Q3j0j64J66rRj39J05K8Ol3l9k8K06j30J26l0p4k0m6K39j58N8
636G0m4O%K4m0m0J25j84J90k03N9M8j85K2MJ00R1n3J4J24j13j09k1O1k8J44p6oK9K3m5J6n7
347e4L1J31r0J9j08J55j8j3J2j30L8o0J67q2l0p9K32p1j49Q8rL0q1K24m2k12J69m7L0lN7n5
67E0m1M9k0r9R5K9m8n0J21Jj50J06lJ9l1m8n9K18Qj29J33j15m2o3Q7J6K3j28L5J9M6r1N4L8
$$ plain form
2027 117 -8 3 129 -41 -12 -60 46 25 118 135 112 -62 10 -83 -53 -153 -33 -145 -76 -122 84 57 83 -83 -65 -133 -142 39 11 38
1765 38 63 0 0 -36 51 -84 -73 -26 -65 9 -65 -29 -123 22 101 39 -108 72 -18 36 69 74 37 32 -56 46 35 35 -76 60 119 21 102 38
1467 38 105 6 19 -34 -36 -146 -89 -98 -29 76 -26 26 68 -14 24 -64 4 48 20 4 76 -6 -34 -49 -23 14 -3 -36 -75 -129 21 63 28 68
1170 68 -35 60 -36 -71 -116 -101 -244 -22 -72 -202 -44 -34 43 65 -33 -19 63 97 150 45 -43 39 59 2 -92 149 258 137 -6 -116
907 -116 16 -10 23 93 -131 -103 8 -76 7 -3 -167 -1 -10 -1 -140 -35 -7 -1 -34 -73 -101 105 -25 101 71 -3 -23 -69 170 12 70
636 70 26 32 32 56 16 -24 101 -83 107 -96 -37 11 -174 -152 -148 -48 43 -10 4 128 15 -94 -115 -54 -82 62 -14 -20 9 32 -13 3 -54
347 -54 -23 108 18 37 -71 84 66 53 65 -65 -27 -87 80 -2 -32 -111 121 50 -99 -11 -20 10 -71 153 111 -101 68 21 51 48 105 50
67 50 9 58 38 -61 34 63 15 -35 86 87 -63 43 40 59 28 -20 -79 139 147 18 151 36 -6 -69 18 34 57 -71 -36 -17 29 -62 -8 30
-230C0
##PAGE=	F1=2766.32
##FIRST=	23146.756194512010552,	4241.1435120000014649,	0.07317046821117401123
##DATA TABLE=	(F2++(Y..Y)), PROFILE
4241AJ0J5r4J26p1N5n8Q2j18Q1Jj15J45N7Rj38k9O8r0J3L3K00j41J9K4l6J8J7o3oJn7j9P1
3944A1J24K4j36R2m0rj22n8J13m3N8n3J11J09j16j29J03p4K2P2o2j15K00o9%k8J6L1j52OQ3
3672c1J47j29Q4j9Q0o4r2J7J3J07r1K4rk3P4j73m6L5K45l9r3R9n2p8M3m9J9K12r9j23o2pk9
3384a09J15L9M2m6L3M5mj73J9J83r2L5or1j3P8j4ok4J35j57J57p7j25L5Nj01l5J91j3j4Q0
3104I2j43Q5Np2N9K6o9n4qM2J77l2K8j22J22k73J59MN4j7n9J41Kj04J81n7J87Q16N700m78
2841F392o137k45m0p4N9N5m2r2Q4J39k6j14j91jJ066o43k51P8m5P4j31k5R8J12k01J9R8J19
2596A35j53L1j6j11o7K17pk52K32O7%m8r4k8P9N4L5qN1j36n7l0R4q3N5J5M5N3p2j6J0r9k7
2307a31J69N7o4n2J7QJ8j0Oj52P3J29n3M3j06j78K70K7q3l5P7m4N0k43R9M2NJ15J4j2j00J64
$$ plain form
4241 1 11 26 -68 58 -13 42 -16 66 -52 29 30 -85 60 117 126 -12 -41 27 -63 -50 -17 183 42 61 85 49 67 84 21 15 16 -41 -60 11
3944 11 135 159 23 115 75 66 -56 -114 -1 -44 14 -39 72 181 65 -64 39 -35 -13 59 -3 -118 82 13 13 -15 1 32 -120 -114 -31
3672 -31 116 -13 71 52 132 68 -24 -7 6 113 22 46 37 14 88 -85 -131 -96 149 110 17 116 64 -14 29 -20 -1 211 112 -11 -73 -80 -109
3384 -109 6 45 87 41 74 119 115 -58 -39 144 52 87 81 -10 -23 55 41 35 11 146 -11 146 69 -56 -21 -16 -117 -152 39 26 12 92
3104 92 -51 34 39 -33 26 52 -17 -71 -79 -37 140 108 136 14 136 -137 22 26 80 63 4 145 147 43 224 167 354 1170 6870 6392
2841 6392 255 10 -30 -104 -45 10 -32 -124 -40 99 73 -41 -232 -233 833 190 -61 17 -28 46 -85 -110 -12 100 -101 -82 16 135
2596 135 -18 13 -3 -114 -181 36 29 -223 9 76 76 28 -66 -94 -15 39 74 66 117 -19 -76 -106 -12 -95 -40 -25 20 73 1 -15 -5 -104 -131
2307 -131 38 95 31 -21 -4 4 22 12 18 -134 -61 68 15 58 -48 -226 44 71 -12 -47 30 -14 36 -207 -108 -66 -61 54 68 56 -44 120
2027A20r4o1K13j73Mn4J23l1O9J1L3j94P1j23O1j07J10j14R3r2K11j3Oj77J8%l7J46m8M7J0
1756B8nj8n6J16j36k3J21r4R3j13M8r6J42L2Rr6J53j50R4K6j5n8L3o4K0L5k1r5J96j0o2M5
1476G9n5J01j37K9o1kr6K4QP2J13o9ON2j03O0j13R2L0J9l1O2r1p7P1M4%n5k7k7j02J97R6p1
1178C8O2j75J69j28n0n3N5r1J24Mj68J49O4J2%n1lN5R8j2q5o3K9N9l4p8J93P6r3j25j09J84
898E3m5J8Kj24J4P7p2P3Mj62J11K8P7j92J27M6Or5q1R4Q8r3J36m1l1j8r3K35j02M1ll7N6j2
601H5m5n4J27j83J81j97K6N0j57K2M5J15N7o4K2P8r9q4m9J02p3J93j33K6J8L9j3Or2M7N3l9
321A0M9j02J34L1r4l8j06Q2n1R6k5m5o5K34p9j36Q0j3M4q1J92qj54J13m1L2NQ8p8r4J31j16
41ep8J28J7l9l9R5l4j30P9L2K0Mm5o9K10P1k02J57j35k1l4L2J8K0r2kj4J21r5O5L4
$$ plain form
2027 120 26 -35 178 5 9 -45 78 47 116 127 160 -34 37 -86 -25 -132 -22 -136 -43 -135 76 63 69 -108 -90 -90 -127 19 -29 18 28
1756 28 23 5 -51 65 -71 -94 27 -67 26 -87 -39 -135 7 39 48 -48 105 -45 49 75 60 2 35 -29 -9 26 5 -90 106 96 34 79
1476 79 24 125 -12 17 -44 -46 -142 -118 -110 -38 75 6 12 64 -39 21 -92 0 30 49 18 80 -11 -88 -17 27 27 -28 -55 -82 -184 13 109 38
1178 38 100 -75 94 -34 -84 -137 -82 -173 -49 -45 -213 -64 0 12 12 -39 -42 13 111 99 14 -49 -20 39 5 -73 120 196 103 -22 -131 53
898 53 8 26 28 -96 -82 -5 -77 -4 0 -162 -51 -23 54 -138 -11 35 41 -54 -135 -41 47 -46 90 49 18 0 -93 142 40 81 78 41 97 85
601 85 40 -14 113 -70 111 -86 -60 -10 -167 -145 -100 15 72 8 30 108 9 -75 -124 -22 -95 98 -35 -9 9 48 35 41 -51 -4 49 10
321 10 59 -43 91 122 28 -10 -116 -34 -85 11 -14 -59 -124 110 31 -105 -25 -38 6 -75 117 109 -45 68 27 59 64 152 74 -20 111 -5
41 -5 -83 45 62 23 -16 79 45 -85 -6 26 46 50 5 -64 146 217 15 172 37 16 -18 14 32 52 -40 -42 -56 65 -30 35 69
-230F9
##PAGE=	F1=2671.97
##FIRST=	23146.756194512010552,	4241.1435120000014649,	0.085264146327972412109
##DATA TABLE=	(F2++(Y..Y)), PROFILE
4241ij0M7o7J47j44N0m3R8j49J24k2j57J99oK1j03n8Q7q8MN2K12j18l3M4j2k4M0p6m8L5n9
3961f6j3Q9J20j0r5R7l0m8j36m7J62l5L1p7J45J01j06j48J10m4J4K6p8q6K27q4j0j3j6M2j06
3690h4L8J6J97j47L5n4J49r0q6K8j0J21n0K4o5l1J06j81o1Q1J88o9o8J23Or3L3J6p0J75r6
3419H1j32l7J3l8J19L7rJ0P1n8M5j80J8K32r3LOj03RO4Op5L2J39j89J45n3q0j7M4j17l5K05
3130F3k9J7kj15J23k8n0P1n2K4j00LJ2J77lk0j41J73k84J86j4N2k1l1J40J1j36J64m4J22O58
2859I26M212m66m522j19n1r9R6J4k1j05J70J03n0m8k29l6Q87m77k42J14p0P6j16l7N9J37j73
2622f7j1J17J17j74j4R3j36q7K30m9k73K63P2J5o6j11qO0P8K0n3N7j07q2k5J30plK0K9L7n0
2342A5l3K0p9rJ65K1n9l3J0m6L8m6Rj01M1J15k2K8o1j65K42j6m7QP6m9M5k64R9O7n1J58Po5
$$ plain form
4241 -9 -19 28 -39 108 -36 14 -29 69 -80 44 22 -135 64 58 79 -24 -82 5 -83 -79 -27 185 67 34 78 66 42 82 6 -42 -7 -66
3961 -66 -79 10 130 120 25 122 92 44 -92 -139 23 -12 19 -58 87 188 82 -66 44 0 14 40 -38 -124 103 19 9 -4 -20 22 -84
3690 -84 -46 -30 167 20 55 1 150 60 -26 2 -8 113 63 87 22 -9 97 -84 -145 -64 124 55 -13 110 116 23 56 72 2 177 81
3419 81 -51 -88 -75 -113 6 43 34 44 115 57 102 -78 -60 172 79 82 88 -15 -6 58 64 -11 21 160 -29 116 63 -17 -34 10 -107 -142 63
3130 63 34 51 49 -66 57 29 -21 50 -2 22 -78 -75 -63 114 111 91 -50 123 -161 25 11 63 42 11 151 162 26 190 146 268 926
2859 926 5138 4672 150 31 -20 -119 -23 -9 -30 -135 35 138 88 40 -189 -225 662 185 -57 57 -13 63 -53 -90 -31 106 -67
2622 -67 -78 39 156 -18 -32 61 -75 -162 68 19 -254 9 81 96 30 -81 -89 -29 49 69 16 73 -34 -116 -141 -11 -18 -21 -1 28 65 15
2342 15 -18 2 -77 -86 79 100 41 8 18 -28 10 -36 -27 -128 -87 28 6 34 -27 -192 50 34 -13 -5 71 22 67 -197 -98 -31 -82 76 83 18
2045A8l2J09n1j05K27j45J5o0J26k9J3M5M5j79N8j60Q1q7J04r5J13j31J56J3k1j47K0O0n2
1791i1J02n8L9J9L5j9r2J38j41l7J63j40Q2j16O9p0J01k0Q1k7Q4j68J10L5o1m4O2m0m6O8l9
1520b1p9K35q6nj6l3J30j30Kl7K7q8o8O5L9J21k0l8N9j11P1j18J11LM8m5O6q7j10J36N7l7
1240D1q2k2j8j35K09J28r1Q8j85J89j31r8l8O9%JN9j67J21J08p1j0mk3K8J26m3n3m0j6P9j0
960Im8J10K5j6j34o0K02n2J4o5k7nL5l0J9L3j45O0K5J30j96J18O8k7r6r7J54j1o8J44n0J0
680B9j6j21J88j7PO0q0J02n9m3m9J10j64J68j70k2M4j00J7Q8R2J0o4L3Rn4k9p9J30j20K32
408A32j93N7J8P4j3Oj26N2kOP2j09R5Q8j52r6m9J03n6L4K9l7o2K13p3q8L0MK2n6J41J1p4N7
111E8l5M6J1J04r7j08J63j49o9J04J2j7l0N9n2p9O0L0J0M0j4q7J59J11k23J59j04k5nl2J1
$$ plain form
2045 18 -14 95 44 -61 166 21 36 -24 102 73 86 131 176 -3 55 -105 -24 -111 -7 -102 11 -120 36 49 28 -119 -99 -39 -91
1791 -91 11 -47 -8 11 46 27 -65 73 -68 -105 58 -82 0 -116 -47 -117 -16 -36 45 18 102 -66 44 79 18 -26 36 -4 -50 18 -21
1520 -21 -100 135 49 44 28 -5 125 -5 -3 -40 -13 -101 -169 -104 -65 56 36 -2 57 -54 17 -101 10 13 61 16 82 -5 -115 21 78 41
1240 41 -41 -63 -81 -216 -7 121 30 118 -67 122 -9 -107 -145 -76 -76 -75 -16 -183 -62 46 -25 -35 -39 -62 -34 92 49 -4 -44 -60 19 9
960 9 -39 71 96 80 -54 -114 88 36 50 -15 -42 -47 -12 -42 -23 10 -135 -75 -50 80 -116 2 70 43 -53 -150 4 -7 -75 69 19 29
680 29 13 -108 80 63 70 130 50 152 93 50 1 111 -53 115 -55 -77 -33 -133 -116 -28 64 74 10 43 52 -2 -31 -110 20 -100 132
408 132 -61 -4 14 88 75 81 -45 7 5 11 83 -26 69 157 5 -91 -140 -37 -93 -59 -30 -67 -129 84 11 -77 -47 -43 -21 -77 64 75 1 58
111 58 23 69 80 184 87 -21 142 -7 -76 28 40 23 -7 52 0 -79 -19 11 21 61 47 -40 119 230 7 166 62 37 32 0 11
-160A1K4l9m1k7J34p0Q5J2
$$ plain form
-160 11 35 -4 -45 -72 62 -8 77 89
-230H9
##PAGE=	F1=2577.61
##FIRST=	23146.756194512010552,	4241.1435120000014649,	-0.30903410911560058594
##DATA TABLE=	(F2++(Y..Y)), PROFILE
4241b6j4O9k3J25k01M9k3J25j84J33k6j43J94n4K3o5o6P5o0MM1K01o8j01P1Qk6K3p4p8O7n2
3961g6LQ1R7m8m9J21k6o7j41m5J97l8Qp8J39N7o7j31J16k2K3o7l6n8J94n9l3J2n7O1l9M2l5
3672b1J96j12n2n9J85j18j7L3k6J05j3J3r4k5R7j69p2J41R4r3k5J35M5j11J3P7j30J41p0j39
3410g1mJ0n5R5L3k9P5P4j54Q3j38oK50o1j3J1j21K0M4J7j12L3J80k03J09j1m9o0P3j04m1K02
3130G7l9N2q1p2J20l2j0L7j25J25j06k1RJ33J0k4j36J84k66K06n2M2k5KJ21J8j42J18m0N8
2867A41L78K141l50k262K8r2r9J07kj5j04K27M4l5mk19m8N55k51k08J50p3P7j11k9J5J18j38
2622e9j5J18J03j69n7K04j42j06K14o8k46J97R1L7p8j13L2L8P8J9j04N7p2p5j6J07O3k7J0
2369B1QL6k6o8K7m9K5J31l1m4LJ1p8M9q6J2l5MP0J3K5k2j21J87p0J5J9O0l9M0k55O4R2r0J89
$$ plain form
4241 -26 -40 29 6 131 -70 -21 -44 81 -103 30 4 -139 55 1 24 -41 -107 -32 -92 -88 -47 154 86 -15 56 64 38 61 -13 -91 -24 -76
3961 -76 -73 8 105 57 8 129 103 36 -105 -150 47 9 17 -61 78 135 68 -63 53 31 54 -13 -49 -107 87 28 -5 7 -50 11 -28 14 -21
3672 -21 175 63 11 -48 137 19 2 35 9 114 101 114 20 -5 92 -77 -149 -8 86 -7 -32 103 148 37 50 127 -3 138 68 -71
3410 -71 -75 -65 -120 -25 8 -21 54 128 -26 57 -81 -87 163 102 89 100 -21 -1 43 60 -52 -19 161 -42 67 56 7 -53 20 -84 -125 77
3130 77 38 90 9 -63 57 25 15 52 -73 52 -54 -75 -66 67 77 53 -83 101 -165 41 -11 31 6 8 129 147 5 123 83 141
2867 141 519 2660 2310 48 76 -16 -115 -8 -10 -25 -129 98 142 107 103 -116 -164 391 140 -68 82 9 86 -25 -54 -39 79 -59
2622 -59 -74 44 147 -22 -79 125 -17 -123 91 23 -223 -26 65 102 24 -89 -57 -19 59 78 -26 31 -41 -116 -132 -25 38 11 21
2369 21 29 65 39 -29 -2 -51 -26 105 74 30 33 44 -34 15 -71 -59 -94 -90 -20 -7 18 -4 -125 62 -8 7 26 86 47 87 -168 -104 -12 -102 87
2062H7j9j08O4N0k4j21J75j05N4n8J07j0m6J03jj32M8j91Q4o2J06o1J29j42N6M8m8q7J6Q1
1800gm8P0m9MM4N5j3j29J31j26l0J40j42M4q8R5k5N2o4J27K7kj40R6N6j02j2O3k6o4P5m6n9
1511i3K22j43N1n7k9J71j11m5QO5r2j70J44j4J31J2n6N3j01O8r2J12k9N8o4Q5q2j04J49M1
1248H8l2r0j4k1j44J76J25p7R6j25J44r7j60k1P0R4j04Q6j20Q4J26j39JK1m3KJ23k8k1k5m2
977f7O5J3%J2k2P3j67J1J74l4J8r5K7j8nK8n0O0j09J8j8J53j51Q2P2o0m3p1J32o7n4J36n1
688hL7k1j07J12O4l4J18j18J35r3m4j7P2j47J63j33o3L4m1J4J20L3k9n7N0o0J7K0j00J56j71
417i8K58k40P7PJ26n1K3j28L7l2L3Q6j15M4J30j82j25J8J04o3nN5qp8J73n6k9l0K8j3k3R5
137A8kJ2J8l7P0K7Q7j08r2J47j10p8M5K1Mk8K2m9j7O5k2%Q2J6j20R5J28j87J26n1l9J4o4r
$$ plain form
2062 87 68 -40 24 74 50 -71 104 -1 53 -5 102 92 46 149 148 16 64 -127 -43 -105 1 -60 69 -73 -17 31 -17 -104 -88 -7
1800 -7 -55 15 -34 -30 14 69 56 -73 58 -68 -98 42 -100 -56 -144 -49 -74 -22 -86 41 68 66 -74 22 78 -24 -36 27 1 -63 12 -34 -93
1511 -93 129 -14 37 -20 -49 122 11 -34 -26 39 -53 -223 -79 -93 38 50 -6 47 -54 14 -78 34 5 63 -1 84 2 -102 47 88
1248 88 56 -34 -48 -69 -213 -37 88 11 107 -18 126 29 -131 -152 -82 12 -92 -6 -126 -42 84 -55 -54 -33 -76 -74 49 21 0 -25 -67
977 -67 -2 11 11 23 1 74 -93 -82 92 58 76 -19 8 -10 -15 13 -37 23 -86 -68 -86 67 -84 -2 70 10 -33 -104 28 -39 -93 43 -8
688 -8 29 8 -99 13 77 43 161 43 178 85 41 24 96 -51 112 -21 -84 -50 -91 -77 43 76 47 -10 40 -20 -3 17 -83 73 -98
417 -98 160 -80 -3 4 130 79 102 -26 11 -21 12 98 -17 27 157 -25 -150 -132 -28 -91 -96 -41 -49 -127 46 -10 -39 -69 -41 -54 -77 18
137 18 16 28 46 9 79 106 193 85 -7 140 30 -48 -3 18 22 -6 16 -33 -50 15 -7 -7 75 91 -29 66 194 7 133 82 43 57 -7 -16
-160a6K4J0p0pQ7k9R1j8
$$ plain form
-160 -16 8 18 -52 -59 28 -1 90 72
-230G2
##PAGE=	F1=2483.26
##FIRST=	23146.756194512010552,	4241.1435120000014649,	-0.64213359355926513672
##DATA TABLE=	(F2++(Y..Y)), PROFILE
4241d5J3N8L2O3k25N3LJ37k03J24j9r4J46q2K1l7m7L4k1J4J5J55nj48Q4J9Mj1r0n6Q7m5K3
3952d3N9N3o4k6J47j9o4j27n3J95m1j6n0R4Mj2r1J07k2N0j33L1m7J18no1L2r7J02J0J4o0J46
3664A31l5j40k2J63j28P8K4l5Q3Pnq2k5P2j67n7J87lj03K6J29M9j21%J11j50J27k9j42J5j1
3392e3n9L8L1k4J28N4k11Q6p0l0K36j0j4Oj31K6J7L1j25j8K45k09P8M8o7o9O1l7n4J73l3P9
3112A23j48l0R5qL3m8j55K00p0n8K3O7lK7j09J41k22J99q2K3k9L6Q1Pj00O2l4K5J20N31j97
2841E00n11J25j41o4Q8Lk1q5K42k2Ojj75m0K66j06j58J77o8R1j29Lk1N8r2J1R4Q1j36q8K77
2570A64j45j08J83m8j86O1J19N8o8j16P5J6O6J5j28N0m7n7jN0J17k3j6jL5k3q7K4oO7P1o8
2290D3m3M4K6r6N2j04J6J2k1J8K2M0Jo8J28j12Q0NK8k5M1k17PJ01r9J95m4j24J60Rk7j10Q6
$$ plain form
4241 -45 -32 26 58 121 -104 -51 -48 89 -114 10 -9 -103 43 -39 -18 -55 -102 -68 -89 -75 -60 95 90 -58 26 45 49 38 -52 -108 -21 -66 -43
3952 -43 16 69 5 -21 126 107 43 -84 -137 58 17 1 -49 45 49 37 -54 53 31 81 -52 -21 -68 50 45 -16 16 -81 21 31 45 -15 131
3664 131 96 -44 -66 97 -31 47 71 36 119 126 121 39 14 86 -81 -138 49 46 -57 -31 98 147 26 26 137 -13 114 85 -57 -42 -53
3392 -53 -112 -74 -43 -67 61 115 -96 -10 -80 -110 126 116 102 108 -23 3 20 51 -74 -92 153 -56 22 70 3 -66 -5 -42 -96 77 44 123
3112 123 -25 -55 40 32 65 17 -138 62 -8 -66 -43 24 21 48 -61 80 -142 57 -25 -2 -31 5 86 93 -7 55 21 46 166 697 500
2841 500 -11 114 -27 -91 -3 0 -21 -106 136 114 120 119 -56 -96 170 64 -94 83 15 106 -23 -20 -41 17 -75 -64 30 111 -25 -113 164
2570 164 19 -89 94 46 -140 -79 40 98 30 -86 -11 5 71 86 -42 8 -39 -96 -97 -47 70 47 31 30 65 42 -45 -21 -27 40 111 43
2290 43 0 44 70 -26 26 -78 -62 -50 -71 -53 -31 9 10 -58 70 -42 38 43 71 46 87 -130 -123 -22 -121 74 30 -94 66 75 48 -62 24
2001B4p0R4m4P2K5q0J40o6p4M3j94P4n3J02k2J43j20m4Q0p7j9jO3l1O0k4n6Q3N3j2j41R0p7
1712e9j3O0r7Mm8J11J2M1r3J25M8p3q6N7P1j08K5K6j7l9N8l5l7J55j62P6m1n6K17j05p4M9
1432hQ7j05k29K07n4J35J0l9L0p5N3l7Q9o2O3r2J08p4p2J21j3K0o7ln2j15J17Q2l2Q0l0N9
1152A02l8j98l0P0J53j53O9m7M6J18j60K6J2n1k2J04J3J8k3m2J5K9O0p6m1J20k00P0J09J2
890F5K4p4K2j5l9Q0j01P6n5k7p3J39o8L1M9o7K8j6O4q5m4J01m8N3k7n4L5J05o5J51j52J58
610A71j01n4L1K5j42J69j04p0J4KJ9J37m5m9m6O8j08R6L2j04J82k15K59k60R6k5J72j02M8
356I6r7J4n0L7R4j04pJ41j83j08O8R7n3k9L5L7j04J17l5J4p1N3k5pO1l6Q9jm9Q5N4N0j20o2
58AJ14l6r5j4M9Ok9nm2L8R8j21LJ25K8j56L9J40j24P1j5m5J8n1l8K3L0p6L9J4J0P0m1
$$ plain form
2001 24 -46 48 4 76 101 21 161 95 21 64 -130 -56 -109 -7 -29 114 -6 -50 30 -47 -66 -67 -4 -35 25 1 -55 28 81 69 -72 18 -59
1712 -59 -72 -12 -109 -105 -153 -42 -30 11 -82 43 91 18 -68 -11 60 -48 -23 3 -14 -53 5 -30 -67 88 -74 2 -39 -95 122 17 -57 -8
1432 -8 79 -26 -255 -48 -102 33 43 4 34 -41 12 -25 64 2 65 -27 81 7 -65 56 43 63 -4 -7 -59 -174 -57 25 -7 73 43 102
1152 102 64 -134 -164 -94 59 -94 -25 -72 -26 92 -68 -42 -30 -81 -103 1 14 32 9 -33 -18 11 71 -5 -46 74 -126 -56 53 65
890 65 89 15 37 22 -17 63 -38 38 -17 -44 -117 22 -46 -15 34 -33 -5 -21 43 -42 -86 15 -33 20 -7 -61 -26 79 14 165 13 171
610 171 70 16 47 72 -70 99 -5 -75 -61 -59 -40 97 52 3 -43 25 -83 13 45 -59 123 -92 167 -93 3 -22 150 48 96
356 96 -1 13 -37 0 94 -10 -17 124 -59 -167 -99 -2 -55 -84 -49 -12 -116 1 -34 -20 -91 -38 -63 -70 -9 -45 44 43 -6 79 133 183 63 1
58 1 115 79 -16 -30 19 25 -4 -9 -51 -13 85 -36 -33 92 120 -36 3 143 19 90 75 30 48 -3 -41 -18 12 -64 -25 -11 -1 69 28
-230B8
##PAGE=	F1=2388.91
##FIRST=	23146.756194512010552,	4241.1435120000014649,	-0.59090840816497802734
##DATA TABLE=	(F2++(Y..Y)), PROFILE
4241e5N6J1P4kk09N6M0J15j97J17k5l4R2r5K1j3k3j0NK7lP9M4j42O4L6L8l4j48J9R4m8M0M3
3944C3Mn0l5J52rm2r5o0J58m3l5j4L3j8L1m5P4m1Q5j27O7m6L9M8o7K4j18J52J6k8o1P8M7j94
3646h7M2Q9j15J56jm0Q3Mk5m4l7O7j95oJ96o6j05O6J14K0j17J3J08j33J23Rj32Lk5l8l5K5
3366h3j0J49K2k06N0nl4K03L1j4jj16M2k7N8j39p7K95k12O7J05j21m5OP3q0J33j6R7k01%P7
3086B1K6O0j47j30K27j7p7L1J5m9J10o5O3j67J49o6j6k2O1K9j8j7J6k5K4k5j71q2K31J54j64
2815d1j8M7J9k5m7K17p5M7l6j22j7J24q8j02J83o9J22j66O0m8k1l2M5M8O0q3j02K79j47r0
2552g8J50Pj18q5J50O7m2j22R6oP1j5j11M5m3m6J6MJ52j3n0J2K2n2o7J3L8J03Jo7o4P3N1j16
2255b4M1p9K2K2l4oKN6J4l4Q3j26J24j5kj9N1j69m3Q4q1J69m2j09K11jo0p8Qm1J00j8K8P2
$$ plain form
4241 -55 1 12 86 84 -125 -69 -29 86 -111 6 -19 -53 39 -56 -35 -48 -71 -81 -76 -49 -52 27 71 -71 -7 29 67 33 -115 -96 -2 -50 -10 33
3944 33 37 -13 -48 104 95 53 -42 -102 56 13 -22 -36 -3 -21 10 -35 39 -2 83 -44 23 -23 16 64 -3 21 -97 55 71 43 -18 60 107 -87
3646 -87 -45 44 -71 85 84 44 127 131 106 62 25 92 -103 -109 87 21 -84 -18 96 116 -1 12 120 -13 110 119 -13 -10 -35 -73 -108 -83
3366 -83 -93 56 78 -128 -78 -83 -117 86 117 103 102 -14 28 1 59 -80 -157 138 -74 -7 98 -23 -68 -62 11 -69 64 48 145 -56 -56 21
3086 21 47 107 -40 -170 57 40 -37 -6 9 -40 70 5 68 -99 50 -16 -32 -54 7 36 18 1 17 -8 16 -9 -180 -262 -31 123 -41
2815 -41 -59 -12 7 -18 -65 152 77 124 88 -34 -51 73 -15 -117 66 -3 119 -47 13 -35 -56 -88 -43 5 65 -18 -120 159 12 -78
2552 -78 72 79 -39 -124 26 93 51 -71 25 19 90 75 -36 9 -34 -80 -64 -60 92 79 29 41 63 11 -56 -43 -5 98 99 32 -32 41 92 -24
2255 -24 17 -62 -40 -18 -52 -58 -56 0 14 -20 63 -63 61 46 44 25 76 -93 -136 -52 -133 36 -6 -115 96 95 35 -43 -35 -76 24 6 34 106
1957A06q4J20r5j9K3j56N5n7P5J5J55p8r3Q9j15L9k1L1k5O7Qj31J28L7k3j15M1j4Kl5l1k2
1677a23qR5K7R3j19Q9M1j10l4NO8p0M6k9lrK6kj6O5j35M9L4j11K43j09n7N8Q3j15k25K21n9
1388i1J32k3M%m8M0K2N6r0O9j16J09n1m2Q3q6Q5j8J2j18m1N1K5J9M9N3k4K2j85p6P7J52j32
1100h1K0J3J0J04j32N1k2l4m3Q1N7N3k4k0m8K4J14j34k7J06k10R9M1N7K7j1k8Kn8J01j09P2
820E1Ko8j16R8K5j6J4n7Q5L8Mq8l1N0m9N6j5J3k1R4p9J63j81J68q6o7P3j2j44J78r8l4k4L1
522d3L6J28j05m6l9P6j27J61Kr5J90k18K19k40J30p7J83j32O7n3Kp0K9R8q0m2J22j55o1R0
260e0Q8k8m9k0Q5j23O5k1K7q3P5j3qL8p2J52rp0P8P9K0j40k4R0K0j07l9Q7k1j7k6l7O8J46
-38A61k27K1J42K8j71KJ54o9J3pm3J5j4n6K0J6n7R2n1L4L5m6
$$ plain form
1957 106 22 142 47 28 51 -105 -50 -107 -32 -17 138 60 -33 56 -59 -20 -41 -10 -35 32 40 -91 37 74 51 -64 -23 -37 -35 -70 -101 -123
1677 -123 -131 -36 -9 84 -35 54 95 -15 -49 -44 24 -46 0 -29 -32 -41 -15 -17 -33 32 -103 -54 -20 -131 112 3 -54 4 87 -28 -253 -32 -91
1388 -91 41 18 22 22 -26 14 36 92 2 71 -45 64 13 -29 54 -32 53 35 47 -71 -112 -61 -36 -17 32 85 61 83 -102 -178 -101 51 -81
1100 -81 -61 -48 -38 66 -66 -15 -37 -71 -114 -33 24 77 53 33 -15 9 123 -11 -38 68 -142 -43 -2 55 82 71 43 45 -13 88 -21 51
820 51 53 -15 -131 -33 -8 -24 -10 -67 18 56 60 -28 -59 -9 -58 -2 -17 -4 -25 69 -10 153 -28 140 54 -13 60 48 -96 82 -16 -50 -74 -43
522 -43 -7 121 16 -30 -69 7 -120 41 43 -52 138 -80 139 -101 29 -48 135 3 70 17 19 -51 -22 76 -4 -46 76 -79 -140 -50
260 -50 38 10 -39 -59 26 -97 -32 -53 -26 -109 -34 -47 -55 -17 -89 63 54 -16 62 141 161 21 -3 87 107 0 -39 48 27 10 -16 -53 15 161
-38 161 -66 -45 97 125 -46 -44 110 41 54 47 4 19 5 -51 -31 -15 -72 20 -31 3 38 -8
-230h
##PAGE=	F1=2294.55
##FIRST=	23146.756194512010552,	4241.1435120000014649,	-0.4439633786678314209
##DATA TABLE=	(F2++(Y..Y)), PROFILE
4241d7R2n5Q0l6j59N2Q7O4j65J14n6J1O2r5K7J5k1l4QL0mPN8q6J3O5N6l8k19J03R3p1N1M4
3944D6l1j2n7J16Lj0o4n3J12m8m5J0j7PM3j1K8o0J10o1M6m6rQ1m2qj11J79j3n3n2K7J03k06
3646i8R0Pr1J95l9l9J09k0m4jn6R5k39P0J57p8j09Q2J02k8r8N7P7j04J15L2j12k7j1%r4Pk
3357i5J33j2j41oL7k1J67M1k1oo5O3q3R9j62j07K93k03O8J37j66oo0J72j18J10pJ10k31J5
3095f5Q1N2N8k14o3K01K5p3L0j0j15J83j4j5j13O8j0o6J0O3k1l3P4ql3L8o1k13k8K44J31j42
2815c9J0mL5j5jJ66r9O8r0p0J0J07j46m4J57q3J53j91J31p2r0L5O3j2M8k9r0K03j37o4J21
2544C1P5o4j88J80O0j8j22Q3k9J13p7p2M8n0m2K3oJ67j6p0L6Kj04j6KO7J15m7l8r1P5P6j45
2255d2J8j4L3Lm8J0k6N5K1l0N8j13J45l2j4k0O5j36o1M9n1J20j0p3J90J5j01l6k9j4O7J3j8
$$ plain form
4241 -47 45 -10 70 34 -125 -73 14 78 -87 27 -29 -18 44 -51 -24 -9 -30 -64 -56 -26 -30 -23 35 -51 -38 27 83 45 -174 -71 22 -49 2 46
3944 46 15 3 -54 62 65 55 -9 -62 50 2 -43 -33 -50 -43 0 -11 17 -43 67 6 52 6 -3 78 36 28 -83 96 83 30 -22 5 108 -98
3646 -98 -8 -1 -92 103 64 25 134 114 70 69 13 108 -131 -61 96 18 -91 -9 93 65 -33 24 101 -3 112 144 32 5 -6 -6 -100 -93 -95
3357 -95 38 26 -115 -121 -84 -105 62 103 82 76 11 74 -9 90 -72 -179 114 -89 -21 116 -50 -56 -116 56 -62 48 41 151 -80 -65
3095 -65 16 68 126 -88 -151 50 75 2 32 22 -93 90 76 61 -52 16 6 -60 -50 13 -8 -41 33 25 -8 30 -31 -244 -272 -28 103 -39
2815 -39 -29 -33 2 -13 -14 152 53 121 31 -39 -29 78 -68 -112 45 -38 115 -76 55 -17 -107 -72 -9 -21 27 -2 -92 111 -26 -90 31
2544 31 106 42 -146 34 94 76 -46 37 8 121 44 -28 20 -30 -72 -49 -55 112 96 26 62 64 -40 -56 -54 13 128 81 43 -48 27 103 -42
2255 -42 -24 -38 -5 -2 -50 -40 -66 -11 10 -20 38 -75 70 38 24 4 69 -67 -128 -79 -130 -10 -20 -93 97 112 11 -25 -54 -68 -1 12 -6
1966fJ18o7M3n4K0l0q8L0n1K7L8J60l0p9N9j58P4j9Rl6P9J8j86J64J4l8o6K0K6Rr6K3l7J5
1668i5N0J7J91j47N1K1j15Nm2M8j0M2o9J6mj8N2jkq6j5J27j61K28r9qL0O0j10j78J83l1J22
1380E2o3M7k4l2L5O0L7j01O4j23Q2qm0O4j39J18L3K5k01O5j3oN2K5Q4p4O1j23j38Q2J05o4
1100e8l4M2k9J00p7N7n2Po1O1Q9O6k5K0j02OJ37j45LM9j90R7MP1K0O3q0K0n6R1q3M9M7r9j31
793a23M3R8m3ln1J10O4j7q7k0Mn5L7L7N8n1N6q3J60k01J68o5p3R7l2j31J68j05K7p7M9N9R6
505A14j24k8k9O6j23J88m8p7J59j58J44j86J74j20J39j17O5j8Or4K3J03o2n3R2j14j1Q8Q3
251H2op3q0J29j30M7k6J7p2Q0Pj5K5q9J92j2q8M5Q7J6j71K1Q8L2j10k3J14o2J8m9m4Q0J85
-38B15k89L6J12L3j49k1J64m0l2j2l8PK1m7J9j9k4J37r6M2Pl8
$$ plain form
1966 -6 112 45 88 34 54 24 -64 -34 -85 -58 -20 140 110 31 90 -68 6 -13 -4 -40 39 57 -129 35 49 11 -55 -35 -9 0 -96 -73 -110 -95
1668 -95 -45 -28 163 16 67 88 -27 -22 -64 -16 -26 16 -53 -37 -41 -59 -7 -8 -10 -96 -111 16 -145 83 -16 -24 6 66 -44 -222 -39 -70 52
1380 52 -11 36 12 -20 15 75 112 11 75 -48 34 26 -14 50 -89 29 62 87 -114 -49 -62 -68 -16 9 93 19 80 -43 -181 -99 6 -58
1100 -58 -92 -50 -79 21 -56 1 -51 -44 -105 -44 45 111 86 106 4 10 147 2 5 54 -136 -39 -35 36 56 119 39 59 3 94 11 60 107 8 -123
793 -123 -80 18 -25 -28 -79 31 95 78 -9 -29 -25 -80 -43 -6 52 1 57 -26 134 -67 101 36 -37 60 28 -103 65 -40 -13 -90 -41 18 114
505 114 -10 -38 -67 -1 -124 64 16 -61 98 -60 84 -102 72 -48 91 -26 39 21 27 -67 -44 59 -3 -56 36 -78 -89 -1 82
251 82 76 3 -77 52 -78 -31 -57 -40 -112 -32 -25 -40 -15 -104 88 76 -12 33 120 136 -35 -14 74 106 -4 -27 87 25 43 -6 -50 30 215
-38 215 -74 -38 74 107 -42 -63 101 61 29 17 -21 -14 7 -40 -21 -40 -64 73 -23 19 26 -12
-230a2
##PAGE=	F1=2200.2
##FIRST=	23146.756194512010552,	4241.1435120000014649,	-0.28105026483535766602
##DATA TABLE=	(F2++(Y..Y)), PROFILE
4241b6J01j02M7k9r3M0J29Rj15J02j01K7O1p9L0N0m4l7pJ8Rl1L7rm6R5N5l6k46J47Q1j10O0
3952a3N6m3L6p3N8LK5n8j9P4n6m2J2l9N6K6Krn4J08J4j6l7j9R4km3q1J56l9m8m6QJ29j94R6
3637B2m4p4K01p8k7J42n9n9L1o8J37k63J31R0n4j07O2R9p7o5J13M0q6R6L7r1m7K4L8j13k5
3366g4KQ6l6n2n1N5j3J40K2k8j0QP0j28J32j74r5K29j73O6J30j62J8r0K01j50J14j1J14k34
3104i4K9R4N6L8k23LJ45M4n7K6j6j68K08J8n3n7j5M7j08O3L8n6k2J34j0o8N6m5p7lO3P9q5
2815a6Km2M3OL6J11q8O3j39j3K9J18j80lJ07j03J54j71J88r1j20Q4N6o7M2Pn0Q1j08m7R7J30
2535A16l0k25J94M8j6j05L7l5J68j49l3M5m3l6J6J1J57l0n8N2j2j59L9kP8Q1l9j0j04N6Q9
2264A01j71j3O6N1k6p3N5m3L2J8m3M7q0J50n4pj8P7j31l7J0k1P3L6m0J10L9j17j2j4QJ6M7
$$ plain form
4241 -26 75 -27 20 -9 -102 -62 67 76 -39 63 -38 -11 50 -29 1 51 7 -30 -37 -19 -10 -41 -4 -13 -59 36 91 55 -191 -44 37 -73 -13
3952 -13 43 0 36 -37 21 24 49 -9 -28 46 -10 -52 -40 -79 -23 3 5 -4 -58 50 64 48 11 -8 86 84 41 -40 116 77 29 -17 -9 120 -74 22
3637 22 -22 -96 105 27 0 142 83 24 55 -13 124 -139 -8 82 28 -79 -17 82 5 -60 53 93 7 103 140 49 2 26 64 -49 -74
3366 -74 -72 14 -22 -74 -125 -70 -83 57 79 51 41 49 119 -9 123 -51 -146 83 -90 -24 106 -56 -38 -128 73 -77 37 26 140 -94
3104 -94 -65 29 85 123 -100 -97 48 92 35 61 45 -123 85 103 50 -7 -22 25 -83 -20 18 -38 -60 74 64 -4 52 7 -70 -73 -10 69 -16
2815 -16 -14 -56 -13 -7 29 140 52 115 -24 -37 -8 110 -70 -73 34 -69 85 -86 102 11 -109 -25 31 -36 6 13 -37 44 -64 -111 -14 116
2535 116 86 -139 55 103 87 -18 19 -16 152 3 -30 15 -28 -64 -48 -37 120 90 32 84 72 -87 -48 -50 28 109 70 60 -44 12 101
2264 101 -70 -83 -17 34 8 -65 -10 -53 -21 -3 -46 1 -79 71 17 10 -8 69 -62 -99 -89 -110 -37 -1 -41 69 108 -9 -21 -35 -27 -11 36
1975C6p3J48l4n6M1M1j13k5Nj5j9L9J47Ok4jj89Q6K0%n6Q7oj88J71om2k5M5J9Jr7M3m9Pko
1651h4K88j70M2jr5K3o5J8M1J2o6K3k3o3J14Jj4m8p7J87j77J72p1N1j5K5q5j18J14J0J12q7
1371b6O6m2k9L6O1N8r3L9j10M0M8o5O8j45J00N1L2k57J66q2K4N3K2N6q3P3m2j81P8M5No7M6
1082e5o8J08l0M5n6N4p6M8J01M1k2N9j28rJ21j07K2nj57P7J4M4mJ27j06K7k8O5m8J0O4j04
802B4j21pJ26m4J3o1R8O6pq2j8k1n4nJ22O5o6K2q3J36j99J68n4o5R7l6r6J33j06P7j31N7Q8
513C6M8j05jj0L6j02J60p6o6R6n0O7j25K06j31M9n9M5oJ9j11K0J11n2m9O6q0J9Q2Q4j4q8j13
225i4J56j30Q4n5Ln4N5J0qK2q4K00pr2KP2L5k04O9R4J4j07J7J13r6O9q4n0Q2J97k74K7M5M9
-73G6r4l8J52k3o7om4%M0j0K0m6NJ58j24L5Rk9
$$ plain form
1975 36 -37 111 77 21 62 103 -10 -35 -30 -45 -64 -25 122 128 104 103 -86 0 20 20 -36 51 45 -143 28 22 -20 -45 0 19 20 -77 -34 -83 -76 -78 -84
1651 -84 204 34 76 75 -20 3 -62 -44 -3 9 -57 -34 -57 -120 -6 -5 -19 -67 -144 43 -134 38 -33 18 3 28 -57 -175 -61 -51 61 -26
1371 -26 40 -2 -31 5 66 124 31 70 -40 0 48 -17 51 -94 6 57 89 -168 -2 -84 -60 -7 15 71 -12 61 19 -162 -84 -39 -34 -101 -55
1082 -55 -123 -15 -45 0 -56 -2 -78 -30 71 112 90 149 21 12 133 26 48 43 -114 -37 -23 21 17 144 38 65 37 102 54 64 128 24
802 24 -97 -104 22 -22 -9 -70 28 94 87 5 -13 -34 -88 -93 29 94 28 50 -33 103 -96 72 18 -47 50 14 -82 51 -55 22 -109 -52 36
513 36 84 -21 -22 -32 4 -98 62 -14 -80 16 -34 33 -92 114 -17 32 -27 18 12 31 -80 -60 51 -1 -50 16 -64 -45 37 121 107 19 -94
225 -94 62 -68 16 -39 -36 -90 -35 -25 -33 -11 -95 105 98 6 8 80 115 -89 -20 74 88 -19 -2 111 15 84 0 -50 32 229 -45 -18 27 76
-73 76 -18 -56 96 73 6 0 -44 -44 -4 -14 6 -40 -35 123 -1 34 43 14
-230A4
##PAGE=	F1=2105.84
##FIRST=	23146.756194512010552,	4241.1435120000014649,	-0.045271899551153182983
##DATA TABLE=	(F2++(Y..Y)), PROFILE
4241cQ6j05nml4L0J40k8n2P2j31J5O5m6K2Q8p6m0k1qL4k5nN8q7R9M8n0j83J34N1j47O3O4l0
3935a1O9p4K2j0M8q0L7L7o2k9Ml2Q9oKk6j1P9N5p3k9%R2K2n5n2R4l0k0n1QJ37j78P8n7p4J87
3611A00j02kJ54j02o9N4o6J61k40J35K8j9p7RR5j13k8J54J4p7O5K9p8m0O3O8j06n0J0K3l9
3340d6K0p1O1k0J19j0k7j7P5N3j37J32j48o2J23j17N1R8j09J2o0J42j55J35k7R8k09N4Q6M6
3077I0K1j91L4R3N2n8L7k5j77J74J8m2Jo2N8j11J10%p7J5J39Lj18P7k5j9K7k8J7j9k8n3M1
2789b6K0N4O5m7M3j73N5L7Q7j46QN9j18J07r7K04r1j03Q8M1r4K5K4kl6o1m9P4J56qk08J81
2509F9M6l5p7j9j9J97j92lJ2nk3jL1J25m0k2N2j7j86O4OP2NK8kr5L6Q5j82l6J24Q0n2j02J00
2202B4m5lom6L9l9J53r4J3j2P9j44J6j4kN4O5l5K3M9q5k4L7Rj3Q7j41J47Qj20J29M8j93Lj7
$$ plain form
4241 -3 83 -22 -27 -31 -65 -35 105 77 25 97 -34 -19 46 0 22 110 34 -6 -27 -35 -1 -26 -31 27 -60 39 87 37 -146 -12 39 -108 -45 19 -11
3935 -11 58 -16 6 -4 44 -36 1 38 -24 -53 -49 -81 8 2 4 -22 -33 46 101 28 -1 -1 91 113 58 6 100 70 50 -1 7 144 -34 44 -13 -87 100
3611 100 -2 -4 150 48 -21 33 -33 128 -112 23 51 32 -45 -36 59 -54 -82 72 86 9 74 103 25 -15 48 116 10 -40 -30 -7 -46
3340 -46 -26 -97 -36 -56 63 53 26 9 84 137 0 132 -16 -78 45 -72 -21 77 -32 -20 -80 62 -93 42 15 113 -96 -42 44 90
3077 90 111 -80 -46 47 99 41 78 53 -124 50 68 26 27 -35 23 -88 22 22 -55 -40 99 102 -16 61 36 17 44 16 33 14 -14 -67 -26
2789 -26 -6 48 113 66 109 -64 -9 28 115 -31 -23 36 -82 25 -72 132 41 -62 26 67 -27 -2 22 20 -16 -77 -126 -52 104 96 -112 69
2509 69 115 80 3 -16 -35 162 -30 -33 -21 -26 -49 -50 -19 106 66 44 96 79 -107 -43 -37 35 40 68 66 -29 7 92 -90 -126 -2 78 26 -76 24
2202 24 -21 -24 -30 -76 -37 -76 77 -17 -4 -16 63 -81 -65 -79 -81 -27 38 3 26 75 -10 -34 3 12 -1 86 -55 92 100 -20 109 157 -36 -33 -50
1896e0M3l8J7J18J2L1n6j86P9Q9j4o1Q6n5j30J42j9k8oR7k3k6n3L5o5l3k5l3L34j71O9k8n9
1607gK4n6j2O7l5k5Ml8r6J65j2K8m3j07J86j47J00m3J01n1j1m8p5N8L6J03q3N6o3l2L7L9R9
1318A19o8Kq5J0J00r3P1j08N3K0L1k49K17j46J11K1L8ko6O0K7j78O0j0N0p2M7r6J08j0K4k3
1038c7P7q2L9R2qj6P6j27pQ2l7J3k3j29N5N4nm0J67r8J7J9M1l2k9N7q7r8l5J05k1M8p7N4O1
732F9J2o7l1k3l9n4K10L6p8J0p4Q3j68J68n1m2P2l3m9Q1p8R3j68M9J17%p1K5J8Op6P8n3o9
435i7L7N0K4r1K02j05m8J9K4j8L2j17J6J17l9m0N1p1K8Q8Q5n6q0j03J60j38J67j06Rm1moJ2
146c9K8o6J69J4p6l3M7N4k11R8Q7lj04N4R4j13J13j25m5Q5J77j93j2j8O4l3n5J15%r8K2o6
-134f9jM3M0K7n4K0J48j44K3M0l0
$$ plain form
1896 -50 -7 -45 -28 90 102 133 77 -109 -30 59 45 -16 70 15 -115 27 8 -20 -26 71 48 22 -31 4 -61 -94 -119 -152 182 11 80 52 -7
1607 -7 17 -39 -51 16 -19 -44 -40 -78 -174 -9 -21 7 -36 -143 43 -104 -4 -47 54 3 -8 -56 -131 -73 -37 66 -17 39 -24 -56 -19 20 119
1318 119 51 53 -32 -22 78 -15 56 -52 1 21 52 -197 20 -126 -15 6 44 42 -24 36 63 -115 -55 -65 -15 -87 -40 -136 -28 -38 -14 -37
1038 -37 40 -42 -3 89 81 65 141 14 7 89 52 65 42 -87 -32 22 17 -23 144 46 63 82 123 91 62 119 32 -66 -101 4 -17 31 -46 8 69
732 69 81 14 -17 -40 -79 -133 77 113 35 45 -29 54 -114 54 3 -39 33 0 -49 32 -46 47 -121 -72 45 45 -26 -1 17 23 -53 25 -28 -97
435 -97 -60 -10 14 -77 125 20 -28 -9 15 -3 29 -88 -72 45 6 -34 17 -54 -26 62 147 91 11 -92 68 -70 97 -9 0 -41 -45 -51 -39
146 -39 -11 -77 92 106 30 -3 44 98 -113 -15 72 69 -35 19 113 0 113 -12 -57 28 205 12 0 -18 46 13 -42 73 73 -25 -3 -69
-134 -69 -70 -27 13 40 -14 6 154 10 33 73 43
-230D3
##PAGE=	F1=2011.49
##FIRST=	23146.756194512010552,	4241.1435120000014649,	-0.088778272271156311035
##DATA TABLE=	(F2++(Y..Y)), PROFILE
4241EO7p0m3J4KL2J04m0J5K8j23j6N0kLJ21r2o6k5l0O7Kl7J01j07O7M3p4o1R6lj54N9N2%O9
3926E4p5M8l7N7j10J02k2n3j7Mj9R0l7Jk2M7M3N9r1m3K9Q3J7l8m7K8K2Ro8RJ39j63O4n2q4
3620g3J62r2K5J36j39p6P4m9J45j65O9pjOo3P8j33KJ57J2o3K8J2p1j6R1Q6r6m4K6m4k2N2o3
3322e6O6l6R4l1k1k3J05J5j01Q9q1l1K1n5K8O5m3j1J4L1j29J53m5O3j70Q3M6M6Qj61L8O3P4
3034A08r1O2m4j33R8mpN4m6Jo1J25l5r0N3J02J7j50J00j9pO3n6m0L1n4l5M1ON2L1OJ8j88J28
2727C6L8J2o9j1L7j12K0JJ70o2m9M3L0q1j8L8K9j00k1n5N3J48Rj68J53M8m9n9o0RJ73j81K7
2439b1o5O0j2j6M6Q2l6J4M7k9j66M7L0M4q0J18j3o2L5O5j76l8J34J14p7j07J20n3k6m7k6L3
2159f1mJ52j41L4qO9j56P2j9PO8O6o3k8L7j9o7R4j2mJ26k01J15M6j24J57N2k24j8k9R0k1j5
$$ plain form
4241 5 72 2 -41 -27 -25 7 111 71 86 114 -9 -25 25 23 26 147 55 -11 -36 -66 1 3 -34 67 -40 27 70 -4 -65 31 28 -126 -67 -15 -15 54
3926 54 -21 27 -10 47 -63 39 17 -36 -53 -49 -68 22 -15 -14 -36 11 54 113 22 -21 8 91 108 70 23 51 73 82 14 23 162 -1 63 11 -73
3620 -73 89 -3 22 158 19 -57 17 -32 113 -52 17 10 9 15 -48 30 -103 -101 56 68 5 33 45 -26 -42 49 135 39 -5 21 -23 -45 7 -56
3322 -56 10 -26 68 37 16 -7 98 113 12 101 20 -11 10 -45 -17 48 5 -6 8 39 -90 63 18 81 -89 -6 40 86 94 -67 -29 34 108
3034 108 17 79 35 -98 0 -4 -11 43 -3 -2 -63 62 27 -63 -10 92 109 -41 59 40 33 96 40 0 31 -23 -58 -17 -11 41 72 78 96 -92 36
2727 36 74 86 17 6 43 -69 -49 -48 122 60 11 54 84 3 -15 23 52 -48 -69 -124 -71 77 86 -82 71 119 70 11 -49 -40 133 -48 -21
2439 -21 -86 -26 -38 -54 -8 74 38 52 99 70 -96 -49 -19 25 -55 63 50 -12 23 88 -88 -126 8 122 45 -62 58 5 -21 -68 -94 -61
2159 -61 -65 87 -54 -20 -28 41 -115 -43 -62 -55 13 79 16 -12 25 6 -61 33 21 17 143 -58 57 103 -21 136 188 -36 -54 -83 7 -14 -29
1870b9Q0j4N6o9j37N9J50m6l9Q0r7m9R2k9KqJ46p0p1OJ4p6r2On6K98j34J07o1j6J3k7l7P9
1572C1q3K5l8k1j11J84k6R2o3j11J45r2L9l7J39n6n2po4M5M0Q4m7K7r5k9K7K9J11l2k5o2L
1283c0J43j07N2o1J7l8K0j74K00j78K04k6M6m5m0L2O7j27K8n4O8n9O5j07Q9j9PL6O1q0L4O0
1003H4n0qO8j11LN0L5j5j6j07M5R1l9q2J81o6j2O9K7l4n5L2n5q3k8N9RP0p3j5O7K9n2n3qj4
688e7q5K58j1q0Nm1Pj15J51l4j4L3l6j2L8k4P0j74L0J46l8n5M2M8nn2l7K7q7J9Q3L2r7J57
391I2n7j20R2J7m3M5j15OJ13j0m0M4p8J8J09P8j03m2o1J31j50K41j55M0k9q1k8L6L2m2J07
120D7M7n7l7K4O0j70Q4O1lj05P3P6j16J30j58k4R1J33r1o9l4O2Po8P2K8j32O4r6J6L7P5L8
-169F5m7K4J07j52J4Q3m9
$$ plain form
1870 -29 51 37 93 24 -113 -54 96 50 11 91 -6 -55 37 8 10 2 148 78 7 13 27 -49 -141 -135 -191 107 -27 80 19 3 16 -11 -48 31
1572 31 -52 -27 -65 -86 -197 -13 -39 53 -10 -121 24 -68 -29 -66 73 17 -35 -42 -106 -61 -21 63 16 43 -52 -81 -54 -25 86 54 29 -33 -30
1283 -30 113 6 58 -3 14 -24 -4 -178 22 -156 48 22 68 23 -17 15 82 -45 -17 -71 -3 -62 3 -104 -15 -34 -27 9 70 -10 24 84
1003 84 34 26 94 -17 -14 36 71 56 40 -67 -22 69 30 -52 129 63 51 120 147 113 58 90 35 -48 -76 -17 -8 62 -11 -26 41 70 18 -35 -43 -57
688 -57 -142 116 105 25 30 -11 -4 -119 32 -2 -16 17 -19 -31 7 -17 53 -121 -91 55 17 -38 4 52 47 -5 -42 -15 -102 -83 0 32 -65 92
391 92 35 -85 7 24 -19 26 -89 -83 30 20 -20 24 -54 -36 73 151 48 6 -55 76 -74 167 12 52 23 -58 -86 -50 -18 -60 47
120 47 94 37 0 24 84 -86 -2 59 56 -49 24 100 -16 114 -44 -68 23 156 65 -4 -38 24 31 -37 35 63 -69 -5 -101 -85 -48 27 65
-169 65 18 42 149 -3 11 94 45
-230D5
##PAGE=	F1=1917.14
##FIRST=	23146.756194512010552,	4241.1435120000014649,	-0.52176380157470703125
##DATA TABLE=	(F2++(Y..Y)), PROFILE
4241iO4k9m0QJ2M9K3l0P7j7q0m9J4L5j3J42q2j16j9l9J12J1m0J21j13QM2q9M7P6p4j10M5K1
3944d2L5L1q7J28o4N6j16J41j01k3j2J5k4P6n9J4j8J01J7M8p1q7N4O5lqp2kR3K3q9%J31j49
3646AQ3n7q3J21l9L8R6j60q3R9k7R4o6l4j9jJ27j29M0j32K2J19K4k7pj1p0J3R7R8j04kN1j10
3349c8PM4l6P9n0O3l3k4k4R6k8l8J9Oj6m2j3J1M5Nl3R7p4r3J66o6L0j39R3lP0j5j66M6N9J15
3034A20j39Q4o1n7Nk0J6P8L5j02K9J03n7j04O9N1K2j33J17k4M1Q5j14p2N4n6oN4l3L8KN3l
2745G5j87J85M3p0nl5M3q1q3Q2J08j4K0l3K5l1p9N9K4r4j2m2L9J05K3j33J33M7l5p2o7K1J09
2456F8j23O5j70J23j0k2O7M5k0K7M3n9j00RO0oj34J81k6k0N8L4j58j3R4J38r8p9J11p6l1q0
2176a02J0L4QJ34j56N0j9N3j57J09j5QR7N0j06l2J5M0j12J24m0L3J54k22O3O0p6J13O3j87
$$ plain form
4241 -9 55 26 -14 -6 6 55 78 48 125 108 28 -21 -7 28 15 157 75 -41 -60 -99 13 24 -16 105 -8 0 42 -47 0 76 2 -108 -63 -42
3944 -42 -7 24 -63 65 1 57 -59 82 -19 -42 -54 -39 -63 13 -46 -32 -50 51 68 116 45 -42 12 77 74 66 -6 -8 85 108 19 19 150 1
3646 1 84 27 -56 65 26 64 160 0 -83 16 -11 83 17 -17 -36 -37 90 -39 1 -131 -109 10 34 7 0 -11 -81 -68 29 127 23 21 72 -38
3349 -38 -31 13 -23 56 6 69 36 12 -12 84 56 18 37 43 27 -15 -28 -17 28 33 0 97 23 -70 96 30 60 -79 14 11 81 66 -100 -54 5 120
3034 120 -19 65 4 -53 -48 -68 -52 26 61 -41 -12 91 34 -70 -1 50 72 -61 56 32 73 158 44 -28 26 -30 -36 18 -15 23 25 78 75
2745 75 -112 73 116 46 41 6 49 -32 -115 -33 75 61 81 48 73 42 -37 22 46 -48 -60 -102 -63 42 65 -68 65 112 77 5 -62 -41 68
2456 68 -55 10 -160 -37 -47 -69 -2 43 23 50 93 34 -66 -57 3 -3 -137 44 18 -2 56 90 -68 -81 13 151 53 -26 85 9 -22 -102
2176 -102 -92 -58 -50 84 -72 -22 -41 12 -145 -36 -51 -43 54 104 -2 -34 -19 21 -91 33 -7 26 180 -42 21 81 5 118 181 -6
1913fp1l2J02J1l8M8n7M6l1n3L2J75r4jQ0j18J4M1l7L2j2J63r3j23O1j4o7j48Q7o4J81n8J17
1625G3r1L2ojo4J00j16N5p3K1j11J65k8J37p4j13J01m7Qn7J63l1r3K6q0P0L0M7J6nj30j6J0
1336h2M1N8J4k2n5J6J79j04Kl8K3q9jo5J36j52K46p1K7m5j5JQ0n6qr5P7m1R8j01N2m2mJ02
1038F6J5p4L4J6o6QL7r1PM2Q6m2j7p7N1R4l6j12J64k6n0J05J7l5o2Jk4q9K4J4K0O3l9r1Q7
732B0M8n0p3J3J3q1K41n5o2j1J3o7n2J01mJ5Jn6JL1K6K9j47QJ73o5o7M4O3J6l8j45J33j07
435i1N4L3O7j27R5k4j45J49J9o0O5j10j0Q9K1m6M7q2pJ41N2j18J6j4O9j51K50j74R0j4j50
163f6m1N3K9j9L9P3n6kMN6q9K5L6Oj11P1P7j16J19j62mJ01P6j7j18J1L4J5o4M5M6j64J05j28
-134a36N0K7P6N9m1K2M7j44K2J14p7
$$ plain form
1913 -6 -77 -109 -7 4 -34 14 -43 3 -28 -81 -49 126 32 31 111 -7 7 48 11 43 31 194 101 -22 39 25 -42 -190 -103 -167 14 -44 73
1625 73 -18 14 8 7 -57 43 -73 -18 -91 -70 -181 -16 -44 93 19 -94 7 -40 -32 -89 74 43 -50 -24 -104 -34 -4 43 59 54 -76 -92 -82
1336 -82 -41 17 31 9 -46 -30 149 45 47 9 32 -57 -58 -123 13 -139 107 36 63 18 3 4 84 28 20 -75 2 -39 59 -42 10 -32 -36 66
1038 66 81 7 41 57 -9 -1 36 -55 -48 -6 80 38 21 -56 -5 89 53 -59 105 79 29 134 151 116 54 55 31 -58 -34 -20 0 63 24 -67 20
732 20 68 18 -55 -42 -29 -110 131 76 14 3 16 -51 -103 -2 -6 9 10 -46 -45 -14 12 41 -106 -98 75 10 -57 -13 50 66 28 -117 16 -91
435 -91 -37 -4 63 -64 31 7 -138 11 30 -30 35 -75 -85 4 25 -21 26 -56 -63 78 130 12 28 14 83 -68 182 8 98 84 -66
163 -66 -107 -54 -25 -44 -5 68 12 10 14 70 -19 6 42 48 -63 8 85 -31 88 -74 -78 23 99 82 -36 -25 9 24 -40 5 51 -113 -8 -136
-134 -136 -86 -59 17 76 35 57 104 -40 -18 96 19
-230A9
##PAGE=	F1=1822.78
##FIRST=	23146.756194512010552,	4241.1435120000014649,	-0.60749590396881103516
##DATA TABLE=	(F2++(Y..Y)), PROFILE
4241d4Q2j0Lj2QN8o4qJ20n4j4p6k2M0qJ52n0j77rl5J58j4k1J31j19m7M3p5P6Q7j36j9J8qM9
3935Cj4j12K07p2N5q5J33j74J9pK3o3Q1p0M8l8J35J5M1m0j49O9L6pJ2j12J1J52J4j01j1J06
3655A05j29J21p6n6N9N2J2O2j57r4J29j2L4K1j27k1j1K36j64oj12M5N1L6K7l4l9p2L3Q7J03
3384A03j16N1P4j65L4J2nJ01n3L2k7m0j1O0n7K2n3P5Mo6mKL2K6l3J49j27p1J80q9J9j28O9
3095@k9J14o4k02Q4P7J48j74Q5n5J6p4j0PN2J51k02J19O9o9j17N3J0J8o8J15l7J19P8j82p8
2824d6N3k9PQ1p7K4l0Q1j7j66K03N6j19Ql2N6l4j67J16N6K9P2j03J5L3j33Q5pm0l6kL8L6K4
2526C5j13J39L9Lj09m1nM6n2J04k62J54j5j9J00K9qK1L3r9j2j7Q1p5j24J77k8J8Q9mj29K9
2246a5K4J43j08l5Q6j03k1q5L4M8mR1j11N2l8M2j52J21k2J0J09L6j28j1lM7j13J07n2O4J65
$$ plain form
4241 -44 38 28 31 19 27 85 21 13 133 79 65 -11 -33 7 -1 151 101 -76 -85 -120 38 24 3 134 15 -32 11 -64 12 99 -37 -56 -38 -46 3
3935 3 -11 -123 84 12 67 -18 115 -59 -40 -47 -24 -87 -6 -76 -28 -66 69 84 125 85 -64 5 41 34 46 -66 -55 97 111 10 -1 105
3655 105 -24 97 21 -35 24 76 88 150 -7 -101 28 16 50 71 -56 -77 -88 148 -16 -22 -134 -89 -38 -2 25 -9 -48 -120 -87 0 103
3384 103 -13 38 112 -53 -19 -7 -12 89 36 68 41 1 -10 50 -7 15 -38 37 41 -25 -29 -27 5 31 -2 147 20 -51 129 40 59 -69 0
3095 0 -29 85 21 -181 -97 -20 128 -46 39 -16 0 -74 -84 -77 -25 126 -76 43 112 43 -74 -21 -11 7 -61 54 17 136 214 32 -46
2824 -46 7 -22 -15 66 -11 13 -17 64 47 -119 84 140 21 29 -3 53 19 -148 -32 24 53 125 22 37 70 -63 22 15 -25 -61 -63 -25 11 35
2526 35 -78 61 100 103 -6 -47 -52 -6 -58 46 -216 -62 -77 -96 4 33 25 46 79 -20 -32 -49 32 -43 -167 10 -18 0 89 85 -44 -15
2246 -15 9 152 44 9 95 -8 -29 -114 -80 -32 -36 55 -56 -4 -42 0 -152 -31 -53 -43 66 102 -26 -37 -40 7 -106 1 -51 13 178
1975A78j82J2L6j2L0Q2j07j23k9P4M1m0K7r0J8K3M4JJ61j36K4R9j22M1mm0M0rJ60r9j59J06
1695D5l9m2j81J84m2K0L3P1j00Q0j9nq7J32j30O0o8N7j08J22j4J42n4j26P6l7J8r0J67Qj24
1423e1M0j03J04J7kR0k4j58KoO5n5P2Ro3L3K08r5n7n1O8j11k3K6O7p4K05r4j9qJ7k2P0Qm1
1117D4j34R1k5J28q5K1p2k1J58k6o6K8j6o4L3mo0nN1J05n0m2l7O0O4%j21J22Op9J10J0j7n5
820E2l8Nj08J06j6KL4J3j43J05N9n9q3M5K6n4J74p9l3l5O7j04%K1K4M5j5r0kO1N1j2r8pK00
513A14q9j06L4O4O0l9k02K12j11J07n5Q8j48M6l0j24J89Pm7Q8r5k7M6K3m6O3p6l9J77Or3Q2
233G9J5k0j27J84j50J36Jj77n0O6J5%kO9q1O2j5N0j1m4M2pj12N3R7j18R9j30lJ07K2Mj40Q5
-64anLl5M3L3j81J36j54Q5K0M3R2n1K5j3j21M4J19r7
$$ plain form
1975 178 -4 8 44 32 62 144 37 -86 -115 -41 0 -40 -13 -103 -85 -62 -18 -17 144 8 32 131 9 50 46 6 46 37 197 98 -61 45
1695 45 6 -36 -217 -33 -75 -55 -22 49 -51 29 10 5 -82 50 -80 -20 -88 -31 -139 -17 -31 111 57 -69 7 -30 -12 -102 65 73 -51
1423 -51 -11 -114 -10 7 5 95 71 -87 -85 -91 -26 -81 -9 0 -63 -30 178 83 26 -25 43 -68 -91 -65 2 -72 133 39 20 12 29 7 77 85 44
1117 44 -90 1 -24 104 19 40 -32 -53 105 79 13 41 25 -39 -6 -10 -70 -75 -24 81 31 -11 -48 12 76 76 -45 77 83 4 114 124 107 52
820 52 14 19 -89 17 1 3 37 50 -93 12 71 12 -71 -26 0 -54 120 41 8 -27 40 -64 -64 -43 -19 26 11 -79 -81 -20 31 19 -79 -86 114
513 114 25 -81 -47 17 77 38 -164 48 -63 44 -11 77 -71 -25 -55 -179 10 17 -30 58 -37 -64 -18 5 -41 22 -54 -93 84 90 -3 79
233 79 94 74 -53 131 -19 117 118 -59 -109 -43 -28 -28 -30 39 -42 20 5 55 44 0 42 35 -77 -24 73 -45 54 -76 -79 28 50 54 -86 -1
-64 -1 -6 -3 -38 5 38 -143 -7 -161 -76 -56 -13 79 28 53 40 -81 -37 82 -15
-230a5
##PAGE=	F1=1728.43
##FIRST=	23146.756194512010552,	4241.1435120000014649,	-0.04543096199631690979
##DATA TABLE=	(F2++(Y..Y)), PROFILE
4241h2J10k5O2k1lM3j17J7J32q6O1q7l4kJ8J46lk27Lk5J84n8kJ35j24p9M8l1K9J02j67Q9j4
3952hj9K7l2j33K30n5O3m1P9j95N3MJ6j25J09n8Q7q6J48L4L8k3j94P3%J9J0j37M1J78k1r2
3672a0nO7j09J45r0lk2J51n2N6j35j09J63qj1O1j64k1k3K72j51m2p4Q2l4L9P9m3o3p6L6P3
3392b1R2j09Q4Q7j98N3l2K0J34n6J5k7o5J7J9p0O4j08J04M7o9j5oOL3nJ53j25o2J90j10L5
3112G5j36K7j6J44j34k29J38J12J36j72O6k7O3j23K4k3j1K47k55J74N3p9j24Oj0J8J7R5o0
2859dJ64N2j81p3K9J3pJ05r7J5o5R0j8j22J74O6j23k2MN9J0k12J13L6M4Q7j43JQ7j58R5l3
2579a4K1p5N4N2m2Kj05J61L7L9j47Oo3J7jJ21k93J39k1rJ37L0j0J6%j20O5j0O9j32o1J07k4
2290e4M5J10m4q3O7n0J32r8rO5j10qn7K2P1k6K7lL0m9L2j38J13n0J5Q9L6j05Kjqn4M8l9O4
$$ plain form
4241 -82 28 3 65 44 41 84 -33 -16 116 30 91 4 -30 -32 -14 132 129 -98 -95 -120 64 6 4 139 15 -64 -16 -47 -18 84 -83 6 -8
3952 -8 -27 0 -32 -165 65 10 73 32 111 -84 -31 -27 -11 -136 -27 -85 2 -84 64 98 136 113 -81 -8 -8 11 21 -116 -75 103 82 -10
3672 -10 -15 52 -57 88 -2 -5 -27 124 72 128 -7 -116 47 39 28 89 -75 -96 -119 153 2 -40 -114 -32 -66 -27 52 9 -54 -130 -94 -21
3392 -21 71 -38 46 133 -65 -12 -44 -24 110 54 69 42 -23 -6 13 -57 7 -101 3 50 -19 -34 -40 -34 -1 -6 147 22 -40 150 40 75
3112 75 -61 -34 -50 94 -40 -269 -131 -19 117 -55 11 -16 47 -76 -52 -75 -86 161 -94 80 133 54 -70 -64 -74 -56 -39 56 -4
2859 -4 160 212 31 -42 -13 0 -7 98 1 16 -49 41 23 -99 75 141 18 -4 0 59 69 -143 -30 6 50 137 -6 -5 82 -76 19 -14
2579 -14 7 -68 -14 38 -4 -2 -107 54 91 130 -17 -11 -74 -57 -58 63 -230 -91 -112 -121 16 46 36 52 52 -68 -3 -13 56 -76 -137 -30 -54
2290 -54 -9 101 57 -26 41 -9 123 25 16 81 -29 -37 -94 -72 -1 -27 0 -3 27 -22 10 -128 -15 -65 -50 39 75 -30 -28 -29 -37 -91 -43 -82 -18
1983a8J62r9k4j1K9l4R0l4j37k6L1M7j9J3q1j7M9J20k5J31j45J4J36j17L1l3m0J6mJ59j04
1712F0j63J39n1j8j84K54J4j37J13k8p4J25k2m5r0J56j32O2k1O0j05P6JJ14j2j33N7m8N8j18
1450i2J45M2j35K9j09J25Lm6J48k2j74K1j2P4j82J27N2p2M7K26r0j01q7J32j10l6P3K4OJ03
1187A09q4o6K9O2l0M2M7n7j65J05oJ34o3J0r8n1J88l1o3Qj2o6O6n4qj5N2R5m3p1kO0K2L6j03
881b3P4J9q0Q0RJ2m0p9K8j21J96m1l6%N5j44J12M0o2q4R0K5l4J00p9j5n0R6r3L0n2K1P5j4
583A5j27JJ10L2k8n1k3K35j20j48K7N6R8n0j89K24r1J34j10O4j35J9o9p4K19l4oJ07o5m2J
312b0j1m4R7o9o7K09m8n5J44J8j12q5Q6r5J62Qj58n7P8kJ0KK6j21J33l0M6J4q3Q8m9r2K0J13
15E6j14R5q2k3J06k0j1j34J39l4qMN4nj74J51j68J01L0j3J36p7L5n3r8O8R8r4
$$ plain form
1983 -18 144 45 21 10 39 5 95 61 -76 -102 -71 -24 -43 -30 -111 -128 -79 41 16 147 2 16 152 35 66 33 -7 9 5 164 60
1712 60 -103 36 -15 -33 -217 37 51 -86 27 -1 -75 50 28 -17 -107 49 -83 -21 -42 18 -87 -11 -10 104 92 -41 16 -32 26 -92
1450 -92 53 95 -40 -11 -120 5 8 -38 110 88 -86 -65 -77 -3 -185 -58 -6 -78 -31 195 105 4 -83 49 -61 -97 -24 0 6 109
1187 109 25 -41 -12 50 20 62 109 52 -113 -8 -14 120 57 67 -31 -82 106 75 12 20 8 -58 8 -46 -54 -69 -17 78 35 -36 -38 22 44 80 -23
881 -23 51 70 -10 70 79 91 51 -28 0 -121 75 34 -2 -2 53 -91 21 61 -1 -85 5 30 -4 96 17 2 -48 48 -45 -15 -67 -46 29 15
583 15 -112 -111 -1 31 3 -48 -71 164 44 -104 -77 -21 77 27 -162 62 -29 105 -5 59 -76 -57 -126 -200 19 -15 -21 86 21 -21 -20
312 -20 -31 -75 22 -47 -114 95 47 -8 136 154 42 -43 43 -52 110 118 -40 -97 -19 -21 -11 -9 17 -104 29 -1 45 59 -24 64 15 -77 -57 56
15 56 -58 37 -45 -68 38 18 7 -127 12 -22 -30 -26 28 23 -151 0 -168 -67 -37 -50 86 9 44 -9 -107 -39 59 -35
-230c5
##PAGE=	F1=1634.08
##FIRST=	23146.756194512010552,	4241.1435120000014649,	0.32377395033836364746
##DATA TABLE=	(F2++(Y..Y)), PROFILE
4241a01J28o3J10j2pJj19L6J13j15J36q0j2p8M9J13N3k54J6j3J73r2oJ31j15q1N5K5m3Q8j56
3970a20J73l7j6k4pj29J76j8P7k0Qj48O7K0nj80J36j7J09j46J43O5K8l4j85O8k8O3j6j23N1
3699f9J67o7o9L5K4r6J30p8N5j05K19j33Q5j04j22J96j8l0N1j42j4l0K11r5n6k6J25j16L6
3445c6J02j7q1o9J1O9O0p4Q5Q1j99O1o8K8J74o7J3l8r2N4pp2Q5j46J04J12p4k1k4m1L6M4J17
3156A10r5m0J76j19N5j40JK2J26j96k08J69J58O2j39N1JQ5j46O7m7p4K72k40J71P3r4j13o6
2902a18lK5R3O8r0J64K2q8q6j4N8l9J01q0J6j00Q7nn5J17M7r1o1O4L0L7k07R8L7L5O2j53%
2614b9J14j51P4l4O3j07R4R2j16l8q9J62N3M8j65N4j15K4K0J00k50R0k1J0J49L8k9L1o3r0
2351h1R4K5K4j49J5Rk3N8J15q2k3Q8j09J19o9k7O9q8%j4l0Q4l3l0J25j6m0K3j12R3r2K2M3
$$ plain form
4241 -101 27 -36 74 62 55 56 -63 -27 86 -29 107 27 15 -63 -14 99 152 -102 -86 -99 74 -18 -24 107 -8 -89 -34 -9 -52 36 -120
3970 -120 53 16 0 -24 -31 -160 16 -2 75 55 63 -85 -18 2 -3 -183 -47 -64 45 -101 42 107 135 101 -84 -16 -44 19 3 -120 -69
3699 -69 98 31 -38 -3 21 -75 55 -23 32 -73 146 13 98 -6 -128 68 50 20 71 -71 -85 -115 96 1 -55 -81 44 -72 -36
3445 -36 66 49 -32 -101 -90 -21 39 -35 50 131 -68 -7 -75 -47 127 60 73 35 -57 -3 -10 -82 3 -143 -39 73 -1 -22 -46 -87 -51 -7 110
3156 110 15 -25 151 32 87 -53 -52 -30 96 -100 -308 -139 19 81 -58 -7 -6 79 -67 0 -47 -121 151 -89 82 155 61 -52 -118
2902 -118 -121 -96 -3 65 -25 139 161 73 -13 -27 31 -8 93 13 29 -71 16 11 -44 73 120 29 -32 32 62 99 -108 -10 27 62 124 -29 -29
2614 -29 85 -66 8 -26 37 -70 24 116 0 -38 -127 35 88 136 -29 25 -90 -66 -46 54 -196 -106 -127 -117 32 70 41 72 9 -81
2351 -81 13 38 62 -87 -72 -63 -86 -28 87 5 -18 70 -39 80 11 -16 53 -35 -35 -49 -79 5 -28 -58 67 51 11 34 -78 15 -77 -55 -12
2062a2M4l9oJ6r1M3k9j3L4J54j4m5m5K7m6P0mr8k9ML2J0Ll8l9K4J53l5J00j15k3J77j03lm0
1756B4l8l4nJ74j23j29J49m0j6j57K69Q5k44J62j44k2J54j3j04n4J41j25Q5L5K7r2N0mP4K3
1493A08j11K0m8J08j39R9O6j21pq6J35j9p2J67%j78M0mM5k63J48R1o8O2K21q0j17j18J77j00
1231d4l0P8QM0j3m4q9L5J23l5J3N5m3j82J01K2J09m2K6j12q6J82Mo6l0K9q0J01j10O2JK3P0
942G6l9o4LM0oM0n6M3Qn1L1J1L2k1j11M1j07K59o6p8k3O5q9J11k5m7p2J37J3l8M8n4k4l8Q6
636C5n7M6p9j8R3j1j40J5J51k1j1k6m6K73j58j65L4M5J10o5j23J68n5J17r8Jq1oj05j5K36
365D4r4L8J18k4o1j7o3m8J42p4p4K18q5m0J87Pj83l9J8m0J58Lj07o2Q5j2J0L5l5j47J84l9
85CM2l5o3J45j03m2k5J04r2J13m7m8R7m6k5j14J49m4pK7N6m2j39J44j64Q7O4o7J75j08N0p1
$$ plain form
2062 -12 32 -7 -13 3 -88 -45 -74 -87 -53 101 87 42 -3 24 -22 48 44 -54 -83 -79 -47 -37 -34 -72 -111 -87 66 31 131 16 -7 170 67 64 24
1756 24 -14 -48 -53 121 -2 -131 18 -22 -38 -195 74 159 -85 77 -67 -89 65 52 -52 -106 35 -90 -5 30 57 -35 15 11 85 108
1493 108 -3 17 -31 77 -62 37 103 -18 -25 -111 24 5 -67 100 100 -78 -38 -42 3 -260 -112 -21 -89 -27 194 114 -3 -121 56 -44
1231 -44 -74 4 12 52 39 -5 -94 -59 64 29 42 97 54 -128 -27 -5 104 62 88 -24 -110 72 76 10 -20 9 -71 30 -80 -18 -17 6 76
942 76 37 -27 -24 16 10 50 -6 37 45 -6 25 36 68 47 -64 -23 -130 129 63 -15 -38 27 -62 49 24 -23 -95 42 55 17 65 11 -13 -51 35
636 35 -22 24 -55 -73 20 9 -131 -116 35 14 3 -23 -69 204 46 -119 -85 -40 70 5 -118 50 -5 112 14 15 -66 -72 -177 -192 44
365 44 -50 -12 106 82 21 4 -59 -107 35 -39 -113 105 20 -20 167 174 -9 -48 -30 -70 88 91 -16 -78 7 -5 5 40 5 -142 42 3
85 3 45 10 -53 92 -11 -53 -78 26 -66 47 0 -48 49 3 -22 -136 13 -31 -38 -11 45 3 -136 8 -156 -69 -5 -72 103 -5 45 -26
-195b6q5P9N8n6
$$ plain form
-195 -26 -111 -32 26 -30
-230c0
##PAGE=	F1=1539.72
##FIRST=	23146.756194512010552,	4241.1435120000014649,	0.27196025848388671875
##DATA TABLE=	(F2++(Y..Y)), PROFILE
4241h6J25j12J33J0Jn2p9M5O8j43K08o0L1j42N3M6J11k51K6MJ25j02k9J17q3o0N8P0q8L3j09
3970a32K00k8j5q7M7j00P9K5Q0l7m5n9O9L3k9k02J35M3R9j84J13R6Ro5j11N6l7R5n3p0K7J29
3690H1r9m5R8j0r0P6l4Q8j59K18j88J32q1j25K21l4l0J2r2Pk9Q6k0m8J5J53j76M0Q6L7q0l8
3410b8m6P6J3k8P2N2j71N6p5J0K14p6J4n9j18R0j5o7R3j73R6J82q8j6m9r1L5R1O8o7J2J27
3130A34j14O1j24K0M1O4k22j30J45K01m5j04O0QR5j55R9m9r1K10j73J22J15j10q1j50K3M8
2885a02J37M0j10J57j2M2j25o9R4o2O4l9K4j23Q0J8J5O5pm3p8J13k4M9j64Q4L8J9K2j51L3
2614a5J07j33K8pP6j19R6J55j70p5n7J17Q2K6j66R4j21M5J6N3j53K4rL4J18M6o0O1j38j1O7
2342A1O5l3j18O2o5k7N5J06j05L1Q1j35J14l4q5J02n0%K1r2P1j6n3K21o8j8Ko3O7j25K5nM3
$$ plain form
4241 -86 39 -73 60 70 71 19 -60 -15 53 -90 118 58 89 -53 0 46 157 -94 -68 -64 61 -41 -70 47 -36 -96 -38 32 -56 -23 -132
3970 -132 68 40 25 -62 -15 -115 -36 -11 69 32 -13 -72 -3 30 1 -201 -66 -23 76 -108 5 101 110 45 -66 -10 -47 48 -5 -75 -48 81
3690 81 -18 -63 35 25 -65 11 -23 65 -94 124 -64 68 -13 -138 83 49 19 31 -61 -54 -83 3 -17 -65 -50 103 -73 -33 53 90 10 -28
3410 -28 -74 2 15 -13 59 111 -60 -4 -79 -69 145 69 83 24 -94 -4 -19 -86 7 -166 -70 112 24 8 -41 -132 -97 -6 62 -5 7 134
3130 134 20 81 -43 -23 18 82 -140 -270 -125 76 31 -73 -13 -5 90 -65 34 -15 -106 104 -69 53 168 58 -23 -173 -150 -102
2885 -102 35 75 -35 122 110 152 27 -42 52 -10 54 15 39 -84 -4 14 29 94 87 44 -34 79 55 104 -60 24 62 81 103 -48 -15
2614 -15 92 -41 -13 -20 56 -63 33 188 18 -57 -114 3 85 111 -55 39 -82 -37 -21 32 -121 -97 -106 -72 46 92 32 93 -45 -56 11
2342 11 76 43 -75 -13 -78 -105 -50 56 -49 -18 63 -72 42 8 -77 25 -25 -25 -4 -96 -25 -41 -94 127 59 41 43 -20 47 -78 -53 -58 -15
2054a5M0k2L3j47J26q8JJJ37L3n2m0pk0L0j6j9m6QRL1pJ4l8k9J31k4P2o2o1K01o9n4j9l9q9
1738i6j3J97j45o7J20ml8j14K30J36k79J78k26K8J55Kj49J6P4j03J26O2j9n9N3l6M2K5n8l9
1476aj2J33j50M0Q4q3n3m9J45m7p5J40K8j71O3Qj0k70J08J21n0Q5J92n4j14j24J84r0rP5L
1205D7Mr3j1o7QJ81n0OM0mj81O6O0N8j8N3j02j04J30N4p1p6R0r6J21j57J33M4l9M9m7rk7J
907grOJ0L8j7j3nJ1K5Jj17L4o6K78q5j15l1M6oJ04j09j8m9J57Nn9K1j3n4%M4k3O0n2p5R0j6
583ij11K4J68q7L2l2p0K95j89j40N3L3R3p3m5Q5l4P7l3p5Jn2j07L8K31j36N2J22Qq3Qr5p1
295a22J80q7n7J94r6n6K01jk17pJ1j2J28jn4o1Q9k5J4O4q4j34J89l1L1j27JJ70j36K6p6P1
15a5m6J36m1o1Q7n8j9q9J21l9JJ8M3n6q1J16j49N3J07j01J92j25O2p1p9O2J9K
$$ plain form
2054 -15 25 3 36 -111 15 -73 -72 -71 66 99 47 7 0 -20 10 -6 -25 -71 -63 -54 -23 -30 -16 -54 -83 48 24 96 34 -27 174 105 51 32 -7 -96
1738 -96 -109 88 -57 -124 -4 -8 -46 -160 70 206 -73 105 -121 -93 62 64 -85 -69 5 -98 28 90 71 12 65 29 71 96 38 -1
1476 -1 -13 120 -30 10 94 11 -42 -91 54 7 -68 72 100 -71 -8 0 -10 -280 -172 -51 -101 -16 176 122 8 -116 68 -22 -31 44 47
1205 47 51 -42 -53 -120 -112 69 19 25 65 61 -120 -54 6 64 46 99 -3 -107 23 77 6 -70 20 -76 45 -112 21 65 26 75 28 19 -8 -7
907 -7 -16 -10 0 38 21 8 3 14 39 40 -77 -43 -109 169 84 -31 -62 -16 -22 82 -27 -45 -94 63 68 9 30 17 -37 -37 7 -16 44 -8 -83 7 -9
583 -9 -120 -96 72 -15 17 -15 -85 210 21 -119 -66 -33 60 -13 -58 27 -7 70 37 -38 -37 -89 -196 -158 73 -63 -11 111 119 36 44 -51 -122
295 -122 58 -29 -86 108 12 -44 157 156 -61 -68 -57 -69 59 58 4 -57 32 7 21 85 1 -133 56 25 56 -71 -70 100 -36 -10 -86 -15
15 -15 -61 75 34 -27 60 2 -17 -106 15 -24 -23 -5 38 -18 -99 17 -132 -79 28 -73 119 -6 56 -15 -94 -32 -13 -11
-230a1
##PAGE=	F1=1445.37
##FIRST=	23146.756194512010552,	4241.1435120000014649,	0.3077506721019744873
##DATA TABLE=	(F2++(Y..Y)), PROFILE
4241d4J02j57J38K8J9r6k1M6J2j69K64l3O8j57K5m1J54k18K3L0N7r0n1R6k7l2M4J00j00m1
3979g1m2J63J9k7j35R5o3j3O0O2p0o9K7P5L6m2j84R7R7O3j72N5J16j3r1pL9k3Q9p9Jj7P9r7
3681d2k9J55l0r0J1K3Q2j60J42j92J69p2j08K27m5k1k7n5L4j0m3M5l1L3J44j90O1L9R6n3Q
3410G1j18R3m0KO9Lj29M0l9l0K40o5jp8j45J18j4n6R2j90J04K23r7j7o8j22K9J17K8n3Q9M9
3130A05j01N3q4O5K1Jk05l0P2K19j22r2R7j6J05j65J14l6n2R0q7N6J53j18l7k26N2Q7J47P
2867G3j03J66o1J47j68j12J09o0J4%L6j22O7L9O9M1p9Mo8J26p9N4j11P1J9J4Oj52R0O9j24
2596b5j4K9P3j20O5K23j95q5j3L7R5nj66J22p1N2PJ0m8m5J6N4N9N1r4P9j86Q3nR4p1o3O6q0
2299g1l4L5R3j03N4N3j24J13nj49J51k9%L6j27K8J6l4K50j02Ll0jL8j28K5k6J5J03l7L5j44
$$ plain form
4241 -44 58 -99 39 67 86 -10 -31 15 27 -142 122 89 157 0 25 -16 138 -80 -57 -27 30 -60 -111 -15 -42 -74 -30 70 -30 -71
3979 -71 -113 50 69 42 -93 2 -61 -74 -14 48 -22 -91 -64 11 47 5 -179 -82 15 78 -94 -39 77 64 -27 -34 5 -18 71 -8 -7 -24 55 -42
3681 -42 -71 84 54 -36 -25 -2 80 -80 62 -130 39 -33 -141 86 41 20 -7 -62 -28 -38 -81 -36 -67 -34 110 -80 -19 20 116 63 71
3410 71 -47 46 6 8 77 80 -49 -9 -48 -78 162 97 96 18 -127 -9 -23 -79 13 -177 -73 150 53 36 -32 -154 -125 -8 20 -33 56 105
3130 105 4 57 -27 38 59 60 -145 -175 -103 116 -6 -98 -1 -17 88 -77 37 1 -51 39 -48 8 161 43 6 -220 -168 -81 66 73
2867 73 -30 136 75 222 54 -58 51 -9 5 5 41 -81 -14 25 94 135 56 60 -8 118 39 93 -18 53 72 86 92 -60 30 99 -25
2596 -25 -39 -10 63 -57 8 231 36 -49 -62 -25 70 65 -101 21 -50 2 9 19 -29 -74 -58 -4 55 106 12 91 -95 -12 -17 77 6 -57 9 -71
2299 -71 -105 -70 23 -80 -26 27 -97 16 11 -138 13 -16 -16 20 -107 -79 -63 -97 153 51 54 24 23 61 -67 -42 -68 -53 50 13 48 -96
2019i6J57j03qj3R9L8m0nm8Pmm1O9q1L6j0L7k3M6no8O2QL6j8p5J95pj11K3m6j24j8K06j53
1712g8OM8M8p5o4J62J36k52J69k31M5J24J9j62R1k4o0J62M3n8NO8p6K7m%j02N4J13j43k5J03
1432F9k4r6k2J55o5o5Q7M5j50Q7Qo4k10J8J45l6J15J49rj04j12J55p0LR1kp0j23j2j4k3K12
1152F8q2L4J6M2j58oJ05jNO7n4q8L6Q6p5j07J38r3J18j78J78R7j18M6o4O9p2m6Jm4Q2M7l6
863A3NoKkJ6q2lk0K56p1j58k5J7O4R3j64Qk0J36Lp3%L4p5L8qj0Q3Kj18O1k5m5PJ53j36P7n0
531b3p5K68j93p9O9K1O0o3PK5n3N1L4j36Q7j19o4P2J96j27K9J14K4j09O5q3j13J87r1j7J31
260I5q8p2J78%k07OM8j3Q0Oj0o1Q9m9K8P1j00q1J42rJ6k05P8J31j22P8j15K1K6J43o9n2Q9
-29G2o7Qo5Q4l2kj5L2m5j6P7j37K7J27j12J79j11O0o0p0K7j1N2
$$ plain form
2019 -96 61 -42 -50 -63 36 74 34 29 -19 -12 -16 -57 12 -69 -33 -43 -6 -29 17 12 -56 6 14 50 32 -43 152 145 34 57 11 -113 -131 75 -78
1712 -78 -72 -24 24 -51 -115 47 183 -69 100 -131 -86 38 57 -105 -14 -38 -98 64 107 49 54 122 46 73 69 69 -33 21 134 -9 -34 69
1432 69 45 -51 -73 82 17 -48 39 84 -66 21 29 -35 -245 -227 -82 -118 -3 146 137 33 -79 76 6 9 100 98 28 -95 -107 -121 -144 68
1152 68 -14 20 36 78 -80 -86 19 18 23 90 36 -52 -16 70 -5 -112 26 -67 51 -127 51 148 30 76 12 81 9 -37 -36 -80 2 49 13
863 13 18 12 14 12 28 -54 -57 -77 179 108 -50 -75 -58 6 99 -65 -57 -77 59 62 -11 -11 23 -52 -14 -22 -32 51 53 -65 -4 -29 -74 -67 86 -50 27 -23
531 -23 -98 170 -23 -102 -33 -12 48 -15 -8 17 -36 15 49 -87 0 -119 -183 -111 85 -42 -13 101 125 16 81 -2 -115 72 -19 -36 95
260 95 7 -65 113 113 -94 -88 -40 -53 27 33 23 -38 51 2 30 101 1 -80 62 53 69 -136 -58 73 -49 29 -86 -65 -39 104 35 -17 72
-29 72 5 13 -52 32 0 -2 -17 15 -30 -46 31 -106 -79 48 -64 115 4 64 4 -66 -39 -50 2
-230B
##PAGE=	F1=1351.01
##FIRST=	23146.756194512010552,	4241.1435120000014649,	0.33729192614555358887
##DATA TABLE=	(F2++(Y..Y)), PROFILE
4241AP0j82J37K7M3j22K9N6m7j89K96j0P4j18j8j17J68j57JN6%p5n0P7L2oMJ18r8r2K2Q9Q0
3952I9m7j58J20m9o0P3K7p8p2P7R1K8m5j44M8J20K3j14k0J23k1j00P5J9RL2o6O5n4L3o5j8
3672d9J68l5r1l8P2M5j13K9j48J68p4o5K12n1j5m3m4M8K6j26R1k9K5J04j54R8j6J25j0N4j75
3401a1J06q0OP3n1r0L0K1p5K43l0m2q5j62J36k1l9Q0j84J19K28q9m1p1j22J7J17J3m8J47k4
3130G1r0N1l8R6l2j5j62M8j7K00j25r7J39n2J04j72J11k6J2k8k2J8J57j12Pk65N9J38J25l6
2867D7o2J75j31K05j91j13R3l4k1K7L4q7N0M2Q4N0j37M3m3J00r6N0q2M4jJ8L1j56J39J2j20
2596c0k5M7O4j15K9K65j92o7L0l4O8k0j77J39RL1J2j1K5j07N1N7PN2j17O4j74J42r0J12p7
2325c2k0N1l7m3lQ2p3L2K2q6J09J4j81J80l3PL4j22k2L8RK11j01J6o9N8J2j04K6j2l7J38n0
$$ plain form
4241 1 71 -111 26 53 96 -26 3 59 12 -177 119 109 183 65 47 -70 98 -59 -58 -2 -2 -77 -127 -50 -18 -24 -20 98 0 -92 -70 19 99
3952 99 52 -106 14 -35 -95 -22 5 -73 -145 -68 23 51 6 -138 -90 30 53 -61 -81 42 21 -79 -4 15 24 56 -10 55 1 34 -31 -49
3672 -49 119 84 -7 -45 27 72 -41 -12 -160 8 -66 -131 81 30 15 -28 -72 -24 2 -124 -33 -62 -37 67 -87 11 -5 120 110 164 -11
3401 -11 95 15 21 94 43 -47 -17 4 -71 172 142 100 15 -147 -11 -32 -71 9 -175 -56 172 83 42 -29 -151 -134 -17 -4 -52 95 71
3130 71 -19 32 -6 90 58 43 -119 -71 -88 112 -13 -110 29 -23 81 -91 20 -6 6 -22 -44 -26 131 19 26 -239 -180 -42 83 47
2867 47 -15 160 29 234 43 -70 23 -11 -32 -5 29 -58 -8 34 118 168 31 74 31 131 35 85 3 47 46 64 95 -61 78 90 -30
2596 -30 -55 -8 56 -59 -30 235 43 -24 6 -28 40 20 -157 -18 -9 22 34 23 48 -59 -8 49 56 108 -9 55 -119 23 -67 45 -32
2325 -32 -52 -1 -38 -81 -84 -2 -75 -43 -21 -107 2 16 -165 15 -18 -11 23 -99 -121 -83 -74 137 36 52 -17 41 53 -51 -25 -37 -74 64 14
2036A4K0r0J24p0k2j3L7K7pK3o7kmm2J30j33P2j9L3m7N3N3p5k5M6j1ln6J63O1j50O4n9j26
1738a01j3J86j31P3m8R6j10j4R4Q6j95J46j59K7O7L3j45J36j18NJ62Kq4Q7O9r1K5m3L1j34
1476f1J22M6j07r4J28L6j14k1J49n9m9L9L8j14J05j4q5j25p5J57l4J33J10M2r4j03J17l4j4
1222B5J31j1j30j09o3M6l0K00j18R2nO8j12j00J48m6J9N5K6m6p6R0q0r7J48o5Q9j61J81J26
960A95j74N8p4J23r7q9J5q6J38N0l7j1K3rk9J8j3o7PK13j2k12j4PQ4P6j50J6MR0Jp5k5P6o2
653d2N8o1qJ05M9j26Rj4K7l6J09j50R7n7l9J77j70pP0RL6k7J5J1j17O7O4j67J44j74KQ5J27
365F6o2qQ3L4j31J25m6j55J52p4L1N0p0o0J24Lj60%Q7k0L0K1J9o9R2q3M6O4q6qN5J9Mk20J34
58a3L7o9R0j32k7J06J24j10k7J06q3M4m6O2l3k4m4M3k7L4M2j40L0J01j05J39n6L4l6n7ok4
$$ plain form
2036 14 34 -56 68 -2 -24 -37 0 27 20 43 -24 -26 -30 -72 58 -75 -3 -22 11 -36 17 70 -5 -30 16 5 2 -54 109 170 20 84 25 -101
1738 -101 -114 72 -59 14 -34 62 -48 -62 32 118 -77 69 -90 -63 4 37 -108 28 -90 -85 77 79 -5 82 151 60 85 42 73 -61
1476 -61 61 107 0 -94 34 70 -44 -65 84 25 -24 15 53 -61 44 30 -55 -180 -255 -98 -132 1 111 153 59 -44 73 39 25
1222 25 156 145 15 -94 -157 -111 -141 59 -59 33 28 96 -16 -116 32 -14 5 60 86 40 -36 54 -26 -123 25 -40 49 -112 69 195
960 195 21 79 5 128 31 -58 -43 -129 9 59 22 11 34 25 -4 14 1 -66 -59 154 142 -70 -84 -77 7 83 -67 -51 -47 43 44 -31 -56 20 -42
653 -42 16 -45 -53 52 101 -25 -16 -30 -3 -39 70 -80 17 -40 -79 98 -72 -79 -9 0 36 9 24 35 -82 -15 49 -118 26 -148 -146 -61 66
365 66 4 -4 79 113 -18 107 61 -94 58 -16 15 65 -5 -65 59 62 -98 -98 -11 -31 -1 20 39 -30 62 -21 25 89 3 -5 50 69 73 -147 -13
58 -13 24 -45 45 -87 -114 -8 116 6 -21 85 2 46 0 62 29 5 -39 4 -23 11 53 -87 -57 44 -61 78 22 56 20 -37 -43 -67
-222f7P2
$$ plain form
-222 -67 5
-230E
##PAGE=	F1=1256.66
##FIRST=	23146.756194512010552,	4241.1435120000014649,	0.089580915868282318115
##DATA TABLE=	(F2++(Y..Y)), PROFILE
4241C3L0j69J31PO7j30O2P6r4j97K92OM0n9m2j45J39q0l3O5k9n7l1P4O1J7n1J29j04q7O3J7
3961AJ13o0j56J21o5o3O3lm1p4R0J00K3m9j03J5R7Nm4p3J15j1q0R3oN2o2j5J12o6Kl3KJ26
3664A26k9q7n7R6Km9o7q2J19p5%J78n6j1k5n7L6O7j51J21m9LN5q1J34n8J02K8Q2j86J00r6
3384C3oO7r4o3M4P4j09K26Pr7p4j53J37l7k3N8j43J19K07o5q5n4j03MJ04J0m0J57o7q5P4l
3104B0O8p4K4j12P4q8J48n1r6J65p8P4j61R0k9O1r6mL3J25r5L5k46L3J83Q1p9nJ61k00K15
2832A76j83n4L9kk4L7J1j6K6K4N4P8j62P4j4N2o2L7r1PpK1P9j49J46m4j04JL4M8r5J0K56j61
2535D2m2N9n8Qj5j90J37Q1j2M3j5M7j50Q5M6k0M6j19L0j08J39j48J15o0qM1M1n6n0O9k1k1
2255f4Om9J09K3j64J61m9K7J7r0n3M1L8J41q0L1j04R4jp2K5K3q4J51o4rk2N3j4k1j1k7J9L8
$$ plain form
4241 33 63 -106 25 32 99 -31 31 107 13 -184 108 114 154 95 53 -92 47 -33 -66 -1 -30 -87 -118 -44 17 34 -17 112 8 -79 -16 1
3961 1 114 54 -102 19 -46 -109 -46 -49 -90 -164 -74 26 49 0 -103 -88 9 14 -30 -103 12 1 -79 14 8 60 -2 -17 95 29 31 -2 0 126
3664 126 97 10 -47 49 51 2 -65 -147 -28 -103 -103 75 19 8 -17 -74 -38 29 -122 -1 -50 -47 8 -73 61 3 105 133 215 29 129 33
3384 33 27 94 0 -63 -19 55 -54 172 179 82 8 -145 -8 -45 -68 -10 -153 -34 173 108 23 -31 -134 -130 -26 -16 -56 101 34 -51 23 20
3104 20 88 14 38 -74 0 -88 60 9 -87 78 0 74 -87 3 -26 35 -61 -65 -32 93 -2 33 -213 -180 3 84 5 0 161 -39 176
2832 176 -7 -61 -22 -24 -48 -11 0 -16 10 34 88 166 4 78 64 116 54 91 0 7 0 21 100 -49 97 53 -51 -50 -16 32 -63 -53 203 42
2535 42 0 59 1 9 -6 -196 -59 22 10 53 38 85 -65 20 66 46 92 -27 3 -105 34 -114 1 -59 -67 -26 15 -41 -91 -22 -43 -64
2255 -64 -58 -107 2 25 -139 22 -27 0 17 -73 -126 -85 -47 94 14 45 -59 35 34 -38 -13 10 -74 77 13 4 -18 35 21 0 -11 -38 -19 19
1957A9J9n2m8K6nJ41j81J05k0K5p4M3J19o6r4P0n5j6j4J17J03j48Q5p6j05QJ36q4J27j38J16
1686H3j24L5M1J6j42J23n1j0OM2j23J42j68O5J23l2j05J72L9o9K9p1L1j26J67l9n1j52J45
1432dP7j01l2J10l1l0K2J5q1J05m8o1n9j12J49m6J24Q1Q5q8j15J00Qo5J86k7j42o6j41Q8r
1161a08J49j35J47j0N3m8j84J82o9J9J7J16Kj70P2q4m4J16k0L7j12J44J20j70O4o8J28r2j06
907e4K1j03J67L6k8m5M9om5QP0j37%J69P0k56j2L1M3N9p2PJ1N2j3o5m8J03j9O3j12qJ12O9
610A17j06m4K5P3p3M2j26P7l5K7M7j30M2N8LK4L7j3K1j91J12O4j67J41j84O0Q4L3M2l4J8N7
330A01j42J58j0j75P7l7P3k1m4j7N1%r1k0R8j0rK8L5q6J00j02M8O0o5N8l5M5jj76J57o4j0
41b6O2j21o3J57R7j42RJ24j04P1l7N3l9m9n1Q0j7N7J8j54O4K7q8Q4L2rom4j7k4N6
$$ plain form
1957 19 38 -14 -62 -36 -41 100 -81 24 4 29 -45 -2 117 51 -43 27 -28 -44 -58 59 162 14 99 23 -82 -74 62 -22 105 -33 83
1686 83 -41 -6 35 51 -91 32 -19 -29 -23 19 -104 38 -130 -65 58 26 -79 93 132 63 92 21 52 -74 93 54 3 -149 -4
1432 -4 73 -28 -60 50 19 -11 11 26 -55 50 2 -59 -118 -230 -81 -127 -3 78 163 75 -40 60 68 3 189 162 20 -46 -187 -99 -108
1161 -108 41 -94 53 43 96 48 -136 46 -23 -4 13 129 131 -39 33 -51 -95 21 1 38 -74 70 190 20 84 16 144 52 -54
907 -54 -33 -136 31 67 39 -6 43 37 -8 0 70 -67 -67 102 172 -84 -96 -65 -22 37 -35 -28 -17 35 22 -43 -91 12 -7 56 -56 -64 48 117
610 117 11 -33 -8 65 -8 34 -92 -15 -50 -23 24 -106 -64 -6 -3 21 58 45 66 -125 -13 51 -116 25 -159 -99 -15 18 60 26 44 101
330 101 -41 117 107 -68 9 -28 45 24 -20 -37 14 14 -77 -97 1 -9 -18 10 45 -41 59 -43 5 65 0 58 23 68 67 -109 48 -16 -26
41 -26 36 -85 -148 9 106 -36 -27 97 -7 64 27 80 41 -8 -59 21 4 61 79 -75 -11 16 -72 12 44 35 29 -15 -32 -56 0
-230@
##PAGE=	F1=1162.31
##FIRST=	23146.756194512010552,	4241.1435120000014649,	-0.16939207911491394043
##DATA TABLE=	(F2++(Y..Y)), PROFILE
4241D5j4j15J18k3Q4j22P6R7j20j86K55J6k5j7l2j16P8j2n6M2k7k9mP7M8L0r4J32j08l3P2
3970C7j9Q4o2j32J11r3l8L0j4K9p8Q1Q1L1o1o9JM4J6lp2R1J5m2N7l5R5j62M9J40n9qk8M3M8
3664A08j9p5n2R1k1lj07k5L3o0P5J26o6mK5p8%R1j32J36p7j9K5mJ51o8L0L7R3j43O2q3k4M4
3366F7j09m6Q3Q6j23K07J9j44m8j09J15n1j7L2o9Q4J82l8j21l0r0JR5Kk9J28q0p8J07K0j4
3095C2p4Q0o6N5j27Q2O4p7J66q0Mj14N5l8O3r5l4R3P9q3M7j79j5K08K4r9M8J22k39J84j58
2824g2M6m5K1LL5l1O8PpoJ02j48J04MjJ0J9j31j5%J3J12j22J10q1n9L7LK0n1J1J95j06m0O2
2517F7j8n7jj90J18J18o0R2j8K5j58J02K5j2J9q8jk7Q5j50J01l9k5N2J11p1q8N3L0p2J1l7
2237a03J23K2j12R8n6N2j1n7n1K9L2Q3o5N6j25J02Ln4K1N4j01J54p1m7K2j7M0jk0n1JP6pj5
$$ plain form
4241 45 31 -84 34 11 95 -27 49 146 26 -160 95 111 86 69 37 -79 -1 -13 -69 -27 -54 -83 -87 -10 38 68 -26 106 -2 -35 37
3970 37 18 102 40 -92 19 -74 -112 -82 -96 -67 -145 -64 17 48 -13 -82 -81 -37 -21 -24 -96 -5 10 -32 25 -10 85 -77 -28 112 53 45 17 60 108
3664 108 89 14 -38 53 32 29 -78 -103 -70 -130 -55 71 5 1 26 -52 -52 39 -93 43 -34 -53 -28 -32 119 51 81 118 211 68 130 47 23 67
3366 67 -42 -88 -5 81 -42 165 184 40 -8 -117 -2 -53 -70 -38 -107 -23 159 121 0 -30 -120 -119 -24 -22 -51 77 -3 -81 26 46 32
3095 32 -42 38 -28 27 -100 -18 46 -31 135 55 59 -55 0 -38 25 -70 -104 -11 68 -15 32 -147 -162 46 70 -29 19 141 -98 86 -72
2824 -72 -26 -71 -50 -47 -12 -43 25 32 25 19 121 -27 77 81 80 90 109 -22 -37 -37 -24 88 -34 76 -5 -64 -27 -24 -4 -55 -44 151 45 5 67
2517 67 49 -8 -9 -199 -81 37 -23 69 51 76 -82 20 45 33 52 -36 -37 -64 21 -129 -28 -67 -92 -40 71 0 -88 -35 -5 -77 -66 -103
2237 -103 20 42 -70 28 -28 24 13 -44 -95 -66 -34 49 -16 40 -85 17 20 -34 -13 41 -60 94 23 -24 -2 -19 21 20 0 -51 -50 26 19 4
1940Dj05N7N8R9j91J26j3J5q9K2J71o6j23O3p5l4L3P1R9j06Q2q7q6L7P1k7J61j96R8j03P7
1668D3Pm3j07J12L2m0m2N2j18J21j57R4O7m7j23K44j9k9L5q5K2r4J88j12J0j84J30R1o2k4
1406c8L7JpK9Lp0P6o4qm2o5J16o2Q0O6J10q8j41J11M3j29K30n0j13qk05J02J5Q5j19J70lO
1117F8J4k20J97o9Mk8J83L1k16N4q8K9N7K8k8m8Q4R0r2L8n1R7p3q4J5r7J70J1l4o1M2K4n4
828gpJ38j82k5J26J34k59l3Q7m2N4J8mNM5m2n2n3J09J7P5j58lR0P1p6q1Q0Q5p7l0q6L0J1Q6
522D4o5r8N2M5%K7J07n7K5k31J61N7j48P9j39Q6Q1o9J48l9p2R8j33J54Oj66rNQ9n1kK4k1j0
225b2k3m8Q8J4k2RL7r9J05p8J6O9o2J04q9N2Mj10J53j25K2K3r5p6J53P9j51N2J21j20Q4l7
-55B8L9m6n8l4J31k0M9Qj65J12n8p5L6J19m9J6m0jj2J8
$$ plain form
1940 4 -101 -44 14 113 -78 48 35 50 -39 -17 154 88 -35 28 -47 -81 -48 23 122 16 98 11 -75 -38 33 6 167 -29 69 -34 43
1668 43 50 7 -100 12 44 4 -38 14 -104 17 -140 -46 21 -26 -149 95 76 47 82 -3 19 -75 113 1 11 -173 -43 48 -14 -38
1406 -38 -1 0 -7 22 25 -45 31 -33 -41 -83 -148 -32 -94 -14 52 162 74 -67 44 87 -42 188 138 25 17 -188 -86 -71 14 -105 65 62 68
1117 68 82 -138 59 -10 -6 -34 149 180 -36 18 -70 -41 16 44 16 -32 52 142 50 88 37 134 61 -23 -8 -105 65 76 42 -19 23 47 -7
828 -7 -14 124 -58 -83 43 177 -82 -115 -28 -70 -16 2 -2 3 48 6 -46 -99 10 27 102 -56 -59 31 102 26 -55 25 110 33 3 -83 -53 -42 44
522 44 -21 -119 -67 -22 -22 5 112 55 80 -151 10 67 -81 -2 -141 -55 26 -43 105 66 -6 92 -41 113 119 -47 -56 -51 38 -13 -15 9 -12 -22
225 -22 -45 -93 -5 9 -13 -4 33 -66 39 -39 -23 46 -16 88 -1 51 55 -55 98 -27 -5 18 -77 -153 0 79 -72 -20 101 -19 65 28
-55 28 67 21 -37 -71 60 40 89 97 -68 44 -14 -89 -53 66 17 33 -7 -8 -20 -2
-230b
##PAGE=	F1=1067.95
##FIRST=	23146.756194512010552,	4241.1435120000014649,	-0.23823884129524230957
##DATA TABLE=	(F2++(Y..Y)), PROFILE
4241D9n7m1R1m3Q8j00P4J00j21j57J95K7q7qnn0JK8m6jj0J5J9O6PK0r7J30j04M3N8j2no2q2
3935g7R0r6j1j5%Q6p0O5K7N2p3m0j7oM8j1j6N2M6qJ0o7J26k22Q7J50n3%m5Q7j8j8m5m3O3j4
3620B4Pq9J0o3k2J41O0q4J6Q9r8l3Q1j01J38r1l3J9N4J39m9n8J1J05p2om8m6J9r6k7J22N2
3331G1j21K05%j61k6l7O1m1k4J1J9J9J65k4j22j7r2MR9k3k2J01q5o0J20M4j07l4J06k3J5j30
3051a09J7J65m8J55o3q6l4Ol1K4m9q8J59M8q2M8r6o1K01k5q2P9P4k28J23j29J35j29K6M2K7
2780a1p8J34%l4o8J12j02J43j5m9P9J3j66nmpJ10p7N6q9RM7j2k7J3J9J02l4o5L9N2r3J7j75
2482a66Q6J18q8J29k8j5j24R3%K2l6k6j9L3J3q7N9j6n7P2J43p2j00K9O2r8K6n3J53Mn0K5m5
2194a3O8m3l6k8J4kO0p3Q7j19Q4K1n0MN8p1J47n9r0L5o8P6K6k7k1m6R3l3K6j37N4J26J8j43
$$ plain form
4241 49 -8 -49 42 -1 87 -13 61 161 40 -117 78 105 18 10 5 -45 -44 -16 -62 -63 -73 -58 -39 27 34 54 -43 87 -17 26 84 72 67 5 -77
3935 -77 13 -83 -94 -109 -109 -23 -93 -28 -1 51 -22 -62 -79 -85 -37 -48 -64 -12 34 26 36 -31 95 -127 -40 110 57 57 12 99 81 63 18 -25 38 24
3620 24 31 -58 -48 -111 -133 8 68 -16 0 89 -9 -42 39 -62 76 -15 -48 -29 25 164 115 57 68 173 101 95 47 1 20 -76 -103 19 71
3331 71 -50 155 155 -6 -32 -69 -8 -49 -73 -62 -43 -24 141 117 -5 -22 -114 -110 -11 -34 -56 45 -40 -100 20 64 -43 -77 29 6 21 -109
3051 -109 -92 73 25 180 117 31 -3 3 -28 -4 -53 -141 18 66 -16 32 -64 -125 76 51 -31 48 122 -106 17 -112 23 -106 -80 -38 -11
2780 -11 -89 45 45 11 -57 55 -47 96 81 32 111 124 -42 -47 -51 -58 52 -25 31 -58 -49 -2 -14 -41 -28 -9 93 59 -6 33 85 -8 9 -166
2482 -166 -80 38 -50 79 51 36 -88 5 5 27 -9 -35 -54 -21 -8 -95 -36 -52 -109 -37 106 34 -66 -37 25 -73 -47 -100 53 57 7 32 -13
2194 -13 55 12 -24 -52 -38 -40 20 -53 34 -85 -1 20 -30 -26 32 -39 108 49 -41 -6 -74 2 28 1 -20 -66 27 -6 20 -117 -63 63 81 -62
1896f2J27%Qq2KJ80p5j21K9n7l5O3L2N7n7P6q1r1P1KK3J69k06M1l6J02j4p5q6J17N1m9o7O6
1598B2j39J02r8P9L3o3j30K94p8j1M6q9K7o4J89j51M9j68P1Q6j3J0m0J3K3L8K2q8J8l4M0o8
1318g2L6P3p2J0N7J19r7j57J29O9j77K45q0p4N5k30R5J8L7p8J51Om4M9j88J84n3j4o8K12L9
1047A80k13M6r1R1lO3q2NK2O6K5l0l2O2n8k8np5J61j7o7l5jP3o4j4J61j75m6P8J47k01q2J61
750B2j35O0P9k2RN6o9l7l8R3K2J05j90%M6P0o0r1J30P6m5q2n8qM5J12j18q8L4M4mL4J53r1
452E4Mk12J87O2j25j1n7P3Q2j52K27m4j56J40r9J22Rj38p8M0P3l4N2L3p3k1K9p7P1M0j3l1
172b3K3q6R0kn0Q2p8J27r1L1K0n9J23j14RJ1p2o1Q5P9j30Q9Q6j12Q1m5J2m9l8j2J70l2L0N
-125I9j59J56j24p1RJ67o6J2l0K1J0k1
$$ plain form
1896 -62 65 65 73 -9 -7 173 98 -23 6 -51 -86 -23 9 66 9 85 4 -87 -16 -14 9 178 -28 13 -23 79 65 -10 -96 21 72 23 -44 22
1598 22 -117 -15 -113 -34 -1 -64 -194 100 22 11 57 -32 -5 -69 120 -31 18 -150 -79 7 -6 4 -36 -23 0 38 60 -28 -10 -44 -4 -72
1318 -72 -36 37 -35 -25 32 151 54 -103 26 95 -82 163 83 9 64 -166 -71 -53 -16 -94 57 63 19 68 -120 64 11 -3 -71 141 180
1047 180 -33 13 -78 13 10 73 -9 -4 18 84 109 79 47 109 51 23 18 -57 104 87 20 -15 -16 57 -7 -21 140 -35 -81 -3 144 -57 -139 22
750 22 -113 -53 26 4 13 69 0 -37 -75 18 40 145 -45 -45 1 71 11 -80 50 126 81 -1 -59 -67 -22 90 -28 -116 -82 -38 -42 -8 145 54
452 54 58 -154 33 95 -30 -41 -98 -25 57 -95 132 88 -68 72 -27 95 104 -34 -112 -72 1 -33 19 52 -21 -42 -13 -90 -19 21 8 -23
172 -23 0 -86 4 2 -48 34 -44 83 -8 23 43 -16 107 -7 2 13 -59 -120 -35 44 -86 3 89 -23 58 13 25 -24 -62 -74 96 64 94 99
-125 99 -60 96 -28 -99 -90 77 11 23 -7 14 24 3
-230C
##PAGE=	F1=973.598
##FIRST=	23146.756194512010552,	4241.1435120000014649,	-0.35537159442901611328
##DATA TABLE=	(F2++(Y..Y)), PROFILE
4241E2q9J7O1m1P5o8O2P2r5j26J29M5j13j5JK1n8K6ll8QO0L8K7l2j4o3J30r1J00L9K5j13o9
3944d0j0N0o0J0o0K9R4l4L9l7Q0p5ro1k6P8m8N7LO7J0kj01J35k17P7J39n7J2n6J15m5k3%m1
3637gK1J5qn2L0j44L8J77j2j03N1J41j15l4L8p9J24q1l2K2R4R7k1j24k5J22nr3mo5No3JJ34
3340D3j2j06K19l5j44j7L1j3jl6KQ5l9J51k7r3j9j03LJ11n8k6J10r9l1R6P4j65K3Q2J8k5j05
3051a06k7K14l3J47m4j53M9n0Kk9Lj32J93M4q4M2l1q0J60m7l8Q5L2j77O0r9J60j74QQ2J2j13
2771a24J57Qm4j02J04l2J88q6q4J10K9j64L0l9k6Q4l4J3o3O7J5J1p3P0J5MM2j02J1J09r6M4
2491D2j61N4J00q7J19k9m4o2O8l5O5j10N8l6N6m5K5oPr0Q5J36m6q6mO9r1K7p5J76k9Jj3k6
2194A3N1n9j8oql1O9q8J00q5M2M7m6k2L3j2J27k6j30K7q8Q7M4j4L6j18R7n5N7j29J6J72o8
$$ plain form
4241 52 -37 -20 41 0 75 7 69 141 46 -80 49 94 -19 -34 -33 -12 -70 -44 -47 -85 -77 -17 21 48 16 2 -61 69 -22 78 117 142 29 -40
3944 -40 -50 0 -60 -50 -110 -81 13 -21 18 -19 61 -14 -23 -84 -110 -32 -80 -23 -20 47 57 55 -46 89 -128 -51 88 31 43 -13 102 57 34 34 -7
3637 -7 14 29 21 -31 -1 -145 -107 70 58 -45 6 147 32 -2 36 -43 81 0 -32 -10 84 181 160 36 11 133 128 35 31 -34 -29 -92 -91 43
3340 43 31 -75 144 109 -35 -52 -21 -34 -35 -71 -69 16 -23 128 101 8 -11 -114 -111 0 -58 -84 26 -73 -104 -8 66 -99 -76 6 24 -1 -106
3051 -106 -133 81 48 195 151 -2 47 -3 -1 -30 -27 -159 34 78 -6 36 5 -75 85 38 0 85 117 -60 0 -99 61 -113 -105 -23 -11 -124
2771 -124 33 41 -3 -105 -1 -33 155 69 -15 95 124 -40 -10 -49 -75 9 -25 -12 -75 -8 7 18 -55 15 30 34 76 -26 -15 94 -2 42
2491 42 -119 -65 35 -52 67 38 -6 -68 0 -35 30 -80 -22 -58 -2 -47 -22 -28 -21 -111 -26 110 64 -22 -26 43 -48 -21 -96 80 51 52 39 13
2194 13 64 5 -13 -19 -27 -58 11 -77 23 -62 -20 27 -19 -41 -8 -20 107 81 -49 -22 -110 -23 21 7 43 -75 22 -33 24 -105 -89 83 15
1905A5m7R6J5J4n7j1J33o5j19Jj5j5N9QQl7Q3n6j18J08o6N7J52j74l5N9J02k3r2n8J33Pm4
1616A8o8Q7j71R4k5L9L7r0j23L15j10l2O3q8M0m1J72j63O7j07k1P8K9N1r1NN4K2P3j20n9N1
1336a4M9j02J30M2q0o0M6J16j06j41J23R0j86K25j09n0J06k14P7oK1l6J08Oo0M3j08J40k4
1082B6k6q8J98M4j82L9r3J27m1P3j02L1k4O4J17j14j9M8n2L8l6m2J44m1j13K3n2J22p4rJ28
811A14j21m3K2J17j07j33K29k08O9R4n1L7N8p4j7j4N6oJ50j94j1RP1p3p7J54P7j2r3n9qM0
531dJ01r8j08J7N1qL4J51r6l0j43J77P1j12p0K6K8Q2j86K54o7j92J52m1Q2J1j09j08N4L5J7
260b9R7Kr0k4N9r9N3N6Qo7rm2N0R7j14P5r1J29o2j5M9l8P2m7l2L8o1k0k0Q8q9J10K5p5O7n3
-55bj9n5PjJ88n3K2Jj42J81j48p9J6J54n7j8kK9L7m1
$$ plain form
1905 15 -32 64 79 93 36 25 158 93 -26 -25 -40 -55 4 12 20 -17 66 10 -108 0 -66 -9 143 -31 -66 -7 95 72 -20 -78 55 62 18
1616 18 -50 37 -134 -40 -65 -26 11 -79 -202 113 3 -29 34 -54 -14 -55 117 -46 21 -86 -107 -29 0 51 -40 -35 19 41 114 -6 -65 -14
1336 -14 35 -67 63 105 25 -35 11 127 21 -120 3 93 -93 132 23 -27 79 -135 -58 -64 -43 -79 29 35 -25 18 -90 50 26
1082 26 0 -88 110 154 -28 11 -82 45 4 77 -25 6 -18 46 163 49 30 78 26 64 28 -14 130 89 -24 -1 -53 69 -5 -14 114
811 114 -7 -50 -28 89 -18 -151 78 -130 -61 33 -18 19 77 3 -14 -28 28 22 172 -22 -33 -24 47 -26 -103 51 128 116 23 -36 -44 -4
531 -4 97 -1 -109 -92 -41 -49 -15 136 40 10 -133 44 115 3 -67 -41 -13 69 -117 137 70 -122 30 -11 71 82 -27 -135 -81 -46 -29
260 -29 68 70 -20 -44 15 -84 -31 25 33 -34 -43 -85 -35 62 -52 23 -68 61 -1 -16 33 -5 67 20 -12 26 -35 -55 -75 13 -76 34 59 -16 51 -2
-55 -2 -21 -76 -69 -70 118 65 87 88 -54 127 -21 -100 -84 70 13 -5 -7 22 59 18
-230A8
##PAGE=	F1=879.244
##FIRST=	23146.756194512010552,	4241.1435120000014649,	-0.30269387364387512207
##DATA TABLE=	(F2++(Y..Y)), PROFILE
4241E3r6K6N3j7M3l5M1K6n1j17P7O7q7k1m0Q4p3j0M7m3J4Q1N6k7l8o6k0J39q3J16K9O2j78
3952A2q6P0j1nK2q9O2N3J3Qp6J03n7J6j22j4Q7p0Q6l9P2J1L3j34J19j58L8J09o6J4l7J10l2
3664D2k9N7n3k0M4k1l4L9j91J06J69p2j09R2J50j23Pj1q1R6n9oJ7J18M3pj50k9J23M4j72K7
3384Gp4Lk1L3J09q0p5K25o2r9k6O7q1N9n1RJ07n6J33m2n4l5j06j5J23q1n0J49j18PL8J09j67
3095a15O5L0N1o1n7m6K07m4J48l9j62J01j01N7p0K4j41J84M8o8L2J0q1R4l3J5O8Mj09J2o4
2824d1J11j54k6J10pj31J40K0m5q1P2L5K27j88r2J02N9j21N8r1m1O8j3pqP9l5O2r9R8%q5J04
2535H0j25NJ17q8Q6j56L2P7n6M9pm4jM8q6J02j74J39o5N5p1J38p0K5j15Q4J13jo0l8N6n6l
2246a0p9J66p1M2kqlm2LMm6l2R0q1P5l2j7P2k9m4oM4R4Oj48J8q0P4M5K5P4j83J06q5P9r4l3
$$ plain form
4241 53 -43 -17 36 19 62 27 68 94 43 -74 3 70 -17 -38 -78 6 -67 -77 -30 -73 -59 22 78 51 13 -53 -73 66 -17 99 128 190 12
3952 12 -74 -4 -15 -20 2 -87 -25 28 41 49 -27 76 19 35 -87 -101 -14 -84 2 -37 35 46 79 -55 64 -94 -56 53 -13 1 -36 74 42
3664 42 13 70 17 -3 41 20 -14 25 -166 -60 109 37 -72 20 170 47 54 43 -38 58 -1 -7 10 128 171 164 14 -15 108 152 -20 7
3384 7 -67 -64 -85 -52 57 -23 -98 127 65 -34 -60 7 -74 -15 -66 -57 50 -6 127 85 31 -4 -110 -125 -2 -83 -133 16 -102 -95 -57 52 -115
3095 -115 -50 -20 31 -30 -87 -133 74 30 178 139 -23 78 -23 34 -36 -12 -153 31 79 11 43 53 -28 66 33 48 116 120 11 23 -41
2824 -41 70 -84 -110 0 -7 -138 2 22 -23 -104 -32 3 230 42 -50 52 111 -10 48 -43 -84 -16 -29 -36 -44 35 0 62 -37 61 61 -24 80
2535 80 -45 -40 77 -11 75 -81 -49 28 -28 21 14 -30 -31 17 -69 33 -141 -2 -67 -12 -83 55 -15 10 -105 -21 92 91 31 -7 49 -7 -10
2246 -10 -89 77 6 48 46 38 35 -7 -4 0 -46 -78 12 -69 6 -26 -43 29 0 -44 -50 -6 88 94 -54 -36 -116 -42 3 28 102 -81 25 -60 19 -75 -108
1922a08J75j19N7L1K9M3l4j2L7j4j29NJ5J6K8jj9o1J10k8j40J46j33P3J23j25j00J46Q3k3
1660G1j06j7J40o0l2n2J03j87R4K7NP3j28j08L05j04q1Q8q1M1j9J33j57O9l0j08P6N9N9r5
1397b2pP5k5J28j34j34J59J7j07J65L2q5j10L4J03j01r3Q4R9j48J75j24n0J35j71N3l7L3j7
1143g3O6%l3J0l1Q1Nk5r0J58O2j41J3r5J39m6N4p1K4m9Q2J31j69j1N6m1P3o6JJ19o0j46Q0
855Gp6J48p0LM8n0j2l5Q1k4j50K60k41O6Q0r3Q6L5n1KNMl3J84j64l7mP4j13n2J51J01qo3p9
548b0K5j3Q1l5j51L0N4pJ8J00n9n1o6J37O3j08o7Q5k9O9j55K22r7j70J22K3N0J9r1j03M2m
268h6P7J12m9p4rQ2j22L2O8J4p4m9J5nJ72j34M3p7J04m0o1Q6l7J1L6q2R4n5K5j12R0m6J02
-20E1l2k5N1m8m2o3N7j0J87q6M0lj36J89j38r3N0R2l0n7M3J9N6l6
$$ plain form
1922 -108 67 -52 5 36 65 108 74 62 99 85 -44 -39 -24 -8 20 19 0 -61 49 21 -119 27 -106 -33 90 -35 -135 11 94 71
1660 71 -35 -52 88 28 -4 -56 47 -140 -46 -19 -14 59 -69 -177 128 24 -57 31 -50 -9 -28 105 -52 17 -13 -121 -45 14 73 -22
1397 -22 -29 46 21 149 15 -119 40 57 -50 115 147 62 -48 -14 89 -12 -105 -21 78 -70 105 -19 -69 66 -105 -52 -89 -56 -73
1143 -73 -7 -7 -40 -30 -61 20 25 0 -90 68 130 -11 2 -93 46 0 54 -17 7 -42 40 171 2 -9 47 6 79 13 14 133 73 -73 7
855 7 -69 79 9 12 60 10 -2 -37 44 20 -130 130 -111 -45 35 -58 28 63 12 14 19 23 -10 174 10 -27 -31 43 -70 -122 29 130 122 59 -20
548 -20 5 -8 73 38 -113 -83 -29 -36 -18 82 23 -28 -94 43 106 -2 -69 16 -13 56 -99 123 26 -144 -22 1 51 70 -21 -124 -82 -86
268 -86 -9 103 54 -20 -29 53 -69 -37 31 45 -29 -78 -63 -68 104 -30 13 -64 40 0 -61 25 -12 -1 35 -47 47 -8 17 -95 -5 -51 51
-20 51 19 -6 45 -3 -45 -108 -51 -61 126 40 80 77 -59 130 -8 -101 -51 41 11 -46 -3 16 72 36
-230C6
##PAGE=	F1=784.89
##FIRST=	23146.756194512010552,	4241.1435120000014649,	0.12211295217275619507
##DATA TABLE=	(F2++(Y..Y)), PROFILE
4241D3p8nP6OQk2K9j6kj41M8R0k6k1j14J36l8n9P2j3PO6N9n8j4j11lJ57q7R7L1O8j61j03J29
3935E0p1L0K6r5R4j3N0j7p5J14k1J9j67J1O9m9M4n8O0J7Q3j59Q8q4lP5o5JJ0P9j1k7J13p0
3637D8n5O0j5m5M1k01J58J20j07q8J20J11j20P4l3j08O2m2M9nJ25mk0j40J7R3P3k20L6n3j2
3366h1J6O5O2j34j9J95p7m0m5O6j11J10p0K9Q4k1J04n7k4m9j02n0J25o1r4J83j34M8k2J33
3104B9j24P4j2O5r2lm8J68o5J55n9j07J00j29J17r6Rj11J49L2k2J7L2p9K1PO2K8%m0k4k7K9
2815E6q4n8J16k7j31J12J3m8j1K4O6K42k68o2P3Q0o4O2j35m6Q1k7jO0M0p9J04q6R2j3j58J34
2535E7j25N0O8r3J32j52K6N4rn5L1j6L2M7j40J13j96J89j01N6p3K07j03K1j24P9J00L2l6o1
2272A0L2pn5n9J14j03Q4L5nn8nK3Mr5pJ02l6J7J4p2Q9Ln2m1O9N9J0j27J6n1M1L3P5O6k02J28
$$ plain form
4241 43 -35 -40 36 42 50 28 57 41 39 -102 -54 36 10 -11 -125 11 -27 -86 -14 -27 -20 46 105 47 33 -78 -81 76 -11 86 117 185 24 -79 50
3935 50 -21 9 35 -60 34 21 71 54 -21 93 72 91 -76 -65 4 -45 -1 -59 1 18 101 -58 30 -54 -57 18 -47 -46 -36 43 32 5 118 48
3637 48 -7 53 38 -7 34 -167 -9 111 4 -84 36 147 27 101 68 -40 22 -20 29 24 149 145 125 -15 2 95 168 -52 -16 -69 -81
3366 -81 -65 0 62 -72 -91 104 27 -13 -58 8 -103 7 -63 -34 50 29 133 76 52 3 -99 -149 -24 -85 -179 4 -130 -82 -104 29
3104 29 -95 -21 -33 32 -60 -63 -111 57 -8 147 88 -19 81 -48 69 -27 -18 -129 20 52 30 47 79 0 21 28 90 118 118 78 54 27 56
2815 56 -28 -86 30 3 -128 -16 -3 -51 -62 -38 28 270 2 -60 13 93 29 91 -44 -90 -9 -36 -37 23 63 -16 88 2 94 81 -77 57
2535 57 -68 -18 50 -43 89 -63 -37 17 8 -47 -16 -32 0 47 -93 20 -176 13 -88 -32 -105 102 -1 20 -104 -25 75 107 71 10
2272 10 42 35 -20 -79 35 -68 16 51 46 -12 -17 6 10 -85 -92 10 -26 -9 5 -67 22 25 -27 -68 1 60 70 -57 -41 -92 -51 -18 57 123 -79 49
1957D9j31R5n9o1J35j20J33m9L3Q9k8mp1O2j35M5MM0rkj6r6J38j9j30J74j89P1J01q4j27J82
1677B1O8l0j17K4J23j07rk9R8j68J00L2lJ17j57r8K66p0j22J08o2J5J1P6j36O0K7j50P9O5
1415C2K6n9pP1q1J57j07j94K44l8o3J30L2q3j22K0Q7p2l6K3P9o9J13j26n8J42j14K4n5N7k9
1143g6L4MK4l0jL6K8k3q5J13R3r4m4r4J38k6J3knn1J01O5j59j8Q1j3N2p3M2Q3o5j50J06o0
846e6J32l5J5m9JK4p1P3J2j18K35k29M8N8j25J25kj6RJ2m9l0J84r8p8J6O8j60l3J36J37l1
566A05k4q8N7q6P2L8k05P7M2Nj4K5J5n3rQ0L2j17pJ16p4L2o5J43j04j18O3P6L1K8q1q7Qk1
268a08J18J00r2m5K7J07j50KQ4lm7r0O2m8J89r9jl6N7m8p5J16m1l9Q8j10J42m2N5j64P4pP2
-20D8o4J0M0k5m3p2Q7k4J73j33Q2nj51J75j06j06Q9K8mp3P5KN4n
$$ plain form
1957 49 -82 13 -46 -107 28 -92 41 -8 25 114 86 82 11 73 -62 -17 -13 27 18 16 0 -96 42 23 -107 67 -122 -51 50 -34 -161 21
1677 21 89 59 -58 -34 89 -18 -27 -56 42 -126 -26 6 3 120 -37 -135 131 61 -61 47 -15 0 11 87 -49 11 38 -112 -33 32
1415 32 58 -1 -8 63 -18 139 32 -162 82 44 -19 111 143 60 -62 -42 45 -27 -63 -40 39 -30 83 -43 -101 41 -73 -49 -104 -47 -76
1143 -76 -42 -38 -14 -44 -45 -9 19 -4 -89 24 117 23 -21 -115 23 -3 10 8 3 -48 53 118 -41 -59 22 9 61 -12 30 113 48 -102 4 -56
846 -56 76 41 56 7 8 32 -39 34 46 -72 163 -66 -18 40 -85 40 38 22 31 43 -6 -36 148 50 -28 -12 56 -104 -137 -1 136 105
566 105 81 -7 50 -36 36 74 -131 -54 -12 -7 -21 4 19 -34 -43 37 69 -48 -55 61 -13 19 -46 97 -7 -125 -62 14 45 73 -8 -95 -87 -108
268 -108 10 110 18 -27 0 107 -43 -41 43 40 -7 -97 -35 -83 106 7 6 -30 27 -21 -96 20 -21 -60 28 -82 60 18 73 -91 -17 -24 48
-20 48 -16 -6 34 9 -34 -106 -19 -43 130 -3 79 74 -77 98 -8 -114 -25 3 -1 -74 1 3 57 52
-230E2
##PAGE=	F1=690.536
##FIRST=	23146.756194512010552,	4241.1435120000014649,	0.32361710071563720703
##DATA TABLE=	(F2++(Y..Y)), PROFILE
4241A8n0l9J19Pj1m2L8l1L5j85L4J16L4k4j81J74K4r0N4K4KK0L9l7J5j25k5J72r4O8L3K9o9
3952E2j07J49j05K4J9p8J20p2O0j6m5J08J8j5j53K5K7Kn0m0M1M3J04j66O2l5k6N1m1l0O8M4
3672C8j4j9J53q1q1O8ko4L7j82J74N6j14m5J26L7j04J33j4j39K6l8J24m3J09k6n6j18J08L3
3410H2Q1k17J8Nn5M5Q7J6j62N5J21r1K5o2M5q8J33j04N5L5M6O8o4jn9r5q7J18Kj41J77j39
3130a51Q1n3J33o3N4k0M7j14L4m3J31p2J57r8k3N9j19J58j10k9n6J12j5L8PM5r0l7N1R7l1
2859H0L4J7o8J2l3j6o4R4l3j19R9k9n4P8l0N6K38k91j4M8P4k2M1j50m4J18p4K9J19k7r6R6
2579F9l6P4j3k07J21j10J46k1j10J55j28L5K9M2j56O3K4L1O0j72Q9j59J93j20O0n9K05r4j2
2325aj06P8J04K3k2n4LM0j03k9M0j14J37N3j7p5K4L4Pj42K1R8L1m8L4r6R3L6m6n7O5K7k6p0
$$ plain form
4241 18 -32 -71 48 55 44 2 40 9 44 -141 -107 9 43 19 -162 12 36 -54 0 24 26 46 85 48 63 -62 -87 85 -9 59 92 121 52
3952 52 -55 94 -11 13 32 -46 74 2 62 46 1 109 127 112 -41 -16 11 13 -37 -77 -36 7 111 -55 7 -28 -54 -3 -44 -74 -6 38
3672 38 24 5 158 77 -4 64 62 -2 35 -147 27 83 -31 -76 50 87 -17 116 102 -37 -11 -49 75 32 141 115 59 -59 49 82
3410 82 163 -54 -36 -31 -86 -41 46 62 -100 -45 76 -15 10 -52 -7 -95 38 -66 -11 24 70 138 74 73 14 -81 -168 -50 -48 -189 -12 -151
3130 -151 -70 -123 10 -53 1 -19 28 -86 -52 -95 36 -36 121 23 0 59 -60 98 -12 -41 -97 15 0 38 45 90 0 -37 14 111 80
2859 80 114 131 63 75 42 26 -38 56 23 -96 3 -26 -80 -2 -32 24 262 -29 -43 5 79 57 98 -52 -96 22 -52 -23 96 69 -27 69
2579 69 33 107 94 -113 8 -102 44 23 -87 68 -60 -25 4 46 -110 -47 -23 8 68 -104 -15 -174 19 -101 -41 -100 105 11 -1
2325 -1 -107 -29 75 98 76 22 25 65 -38 -67 -27 -141 -4 49 32 -43 -19 15 22 -120 -99 -1 30 -18 16 -80 13 49 3 -54 11 38 12 -58
2027e8K3j7lJ5J21J9j65J53j77J04m4n6O8p8J62j13L2J21l6J0j57J21j09R3m1M6k8lJ1j14
1765a00J45l0q2J77k23M7J08o9j09J53P4n1j16M4P3j09L4j0O7j22J11%J3J40j58r7K09l8j28
1511d7J05k5k9N1J5j01M1M3j33Q1M4k1qjL8j17J56n2k28K77q9PO3K6o6j02J3P1k6Ol5J7K9
1222CO2j27n5J38m8rn6P6n7J1K1P8n9k7L1M1l8p9Q2J22m4j24q8J39pk7P3l5m1J04l4q5m4J09
$$ plain form
2027 -58 -35 -52 -55 -40 81 100 -65 88 -89 15 -29 -85 -17 -95 67 -46 -14 107 71 81 -76 45 -64 29 -12 34 6 3 14 -100
1765 -100 45 15 -67 110 -113 -66 42 -27 -136 17 91 40 -76 -32 41 -68 -34 -44 23 -99 12 12 25 165 7 -90 119 81 -47
1511 -47 58 33 4 55 70 -31 10 53 -80 1 45 24 16 15 53 -64 92 40 -188 89 0 7 70 96 30 -72 -59 12 -14 -8 -43 -26 3
1222 3 65 -62 -117 21 -27 -36 -92 -16 -73 -62 -41 37 -22 -49 -18 23 -15 -94 -12 110 66 -58 -146 -7 -14 -41 32 -3 -44 60 26 -59 -103 6
$$ [...]
-230b1
##END NTUPLES=	nD NMR SPECTRUM
##END=	
##END=	
