##TITLE=	Nov02-2021.63.fid
TM-VI-147 13C

##JCAMP-DX=	6.0	$$ MestReNova 14.3.0-30573
##DATA TYPE=	LINK
##BLOCK_ID=	1
##BLOCKS=	2    
##ORIGIN=	Mestrelab Research S.L.
##OWNER=	hrzepa
##$MNOVA/LINK_BLOCK_TYPE=	ITEM	$$ NMR Spectrum
##$MNOVA/ITEM/POLYGON=	(XY..XY)
5321,5835
8722,5835
8722,8208
5321,8208
5321,5835
##$MNOVA/ITEM/Z=	0
##$MNOVA/ITEM/ANGLE=	0
##TITLE=	Nov02-2021.63.fid
##JCAMP-DX=	6.0	$$ MestReNova 14.3.0-30573
##BLOCK_ID=	2
##DATA TYPE=	MNOVA NMR VIEW DATA
##DATA CLASS=	MNOVA VIEW DATA
##$MNOVA/ITEM/ZOOM/X=	-31.150195598113686657,	251.15679998888273872
##$MNOVA/ITEM/ZOOM/Y=	-272.183624267578125,	2817.55224609375
##END=	
##TITLE=	Nov02-2021.63.fid
##JCAMP-DX=	6.0	$$ MestReNova 14.3.0-30573
##BLOCK_ID=	3
##DATA TYPE=	NMR SPECTRUM
##DATA CLASS=	XYDATA
##NUMDIM=	1
##ORIGIN=	Bruker BioSpin GmbH
##OWNER=	nmr
##.OBSERVE FREQUENCY=	100.64143946071199309
##.OBSERVE NUCLEUS=	^13C
##.SOLVENT NAME=	CDCl3
##.PULSE SEQUENCE=	zgpg30
##LONGDATE=	2021/11/04 01:35:00.000
##.ACQUISITIONMODE=	SIMULTANEOUS (DQD)
##$ORIGINAL FORMAT=	Bruker XWIN-NMR
##$MNOVA/SCALES_VERSION=	9
##$PARAMETER FILE=	(acqus, ASCII, /private/var/folders/f6/rjf_tdyn2v98c5c0wvkgn4s80000gn/T/7hvJl61CQwO+wbhsp+eMJg/63/acqus, 0)
$$ ##TITLE= Parameter file, TOPSPIN		Version 3.2
$$ ##JCAMPDX= 5.0
$$ ##DATATYPE= Parameter Values
$$ ##NPOINTS= 11	$$ modification sequence number
$$ ##ORIGIN= Bruker BioSpin GmbH
$$ ##OWNER= nmr
$$ $$ 2021-11-04 01:35:37.110 +0000  nmr@CZC2439F63
$$ $$ /opt/topspin/data/agmb/nmr/Nov02-2021/63/acqus
$$ $$ process /opt/topspin3.2/prog/mod/shimcntl
$$ ##$ACQT0= -2.26890760309556
$$ ##$AMP= (0..31)
$$ 100 100 100 100 100 100 100 100 100 100 100 100 100 100 100 100 100 100
$$ 100 100 100 100 100 100 100 100 100 100 100 100 100 100
$$ ##$AMPCOIL= (0..19)
$$ 0 0 0 0 0 0 0 0 0 0 0 0 0 0 0 0 0 0 0 0
$$ ##$ANAVPT= -1
$$ ##$AQSEQ= 0
$$ ##$AQ_mod= 3
$$ ##$AUNM= <au_zg>
$$ ##$AUTOPOS= <33 >
$$ ##$BF1= 100.63037
$$ ##$BF2= 400.2
$$ ##$BF3= 100.63037
$$ ##$BF4= 100.63037
$$ ##$BF5= 100.63037
$$ ##$BF6= 100.63037
$$ ##$BF7= 100.63037
$$ ##$BF8= 100.63037
$$ ##$BYTORDA= 0
$$ ##$CAGPARS= (0..11)
$$ 0 0 0 0 0 0 0 0 0 0 0 0
$$ ##$CFDGTYP= 0
$$ ##$CFRGTYP= 9
$$ ##$CHEMSTR= <none>
$$ ##$CNST= (0..63)
$$ 1 1 145 1 1 1 1 1 1 1 1 1 1 1 1 1 1 1 1 1 1 1 1 1 1 1 1 1 1 1 1 1 1 1 1
$$ 1 1 1 1 1 1 1 1 1 1 1 1 1 1 1 1 1 1 1 1 1 1 1 1 1 1 1 1 1
$$ ##$CPDPRG= (0..8)
$$ <waltz16> <> <waltz16> <> <mlev> <mlev> <mlev> <mlev> <mlev>
$$ ##$D= (0..63)
$$ 0 1 0.00345 0 0 0 0 0 0 0.06 0 0.03 2e-05 3e-06 0 0 0.0002 0 0 0 0 0 0
$$ 0 0 0 0 0 0 0 0 0 0 0 0 0 0 0 0 0 0 0 0 0 0 0 0 0 0 0 0 0 0 0 0 0 0 0 0
$$ 0 0 0 0 0
$$ ##$DATE= 1635989736
$$ ##$DE= 6.5
$$ ##$DECBNUC= <off>
$$ ##$DECIM= 704
$$ ##$DECNUC= <off>
$$ ##$DECSTAT= 4
$$ ##$DIGMOD= 1
$$ ##$DIGTYP= 12
$$ ##$DQDMODE= 0
$$ ##$DR= 21
$$ ##$DS= 4
$$ ##$DSPFIRM= 0
$$ ##$DSPFVS= 20
$$ ##$DTYPA= 0
$$ ##$EXP= <c13>
$$ ##$F1LIST= <111111111111111>
$$ ##$F2LIST= <222222222222222>
$$ ##$F3LIST= <333333333333333>
$$ ##$FCUCHAN= (0..9)
$$ 0 1 2 0 0 0 0 0 0 0
$$ [...]
$$ 90 74 58 42 26 10 0 0
$$ ##$Sgu3PowerLevels= (0..7)
$$ 0 0 0 0 0 0 0 0
$$ ##$Sgu4PowerLevels= (0..7)
$$ 0 0 0 0 0 0 0 0
$$ ##$Sgu5PowerLevels= (0..7)
$$ 0 0 0 0 0 0 0 0
$$ ##$Sgu6PowerLevels= (0..7)
$$ 0 0 0 0 0 0 0 0
$$ ##$Sgu7PowerLevels= (0..7)
$$ 0 0 0 0 0 0 0 0
$$ ##$Sgu8PowerLevels= (0..7)
$$ 0 0 0 0 0 0 0 0
$$ ##$SguType= 3
$$ ##$ShimPowMaxUA= (0..63)
$$ 130000 130000 130000 130000 130000 130000 130000 130000 130000 130000 130000
$$ 130000 130000 130000 130000 130000 130000 130000 130000 130000 0 0 0 0
$$ 0 0 0 0 0 0 0 0 0 0 0 0 0 0 0 0 0 0 0 0 0 0 0 0 0 0 0 0 0 0 0 0 0 0 0 0
$$ 0 0 0 0
$$ ##$ShimPowMaxUC= (0..63)
$$ 130000 130000 130000 130000 130000 130000 130000 130000 130000 130000 130000
$$ 130000 130000 130000 130000 130000 130000 130000 130000 130000 0 0 0 0
$$ 0 0 0 0 0 0 0 0 0 0 0 0 0 0 0 0 0 0 0 0 0 0 0 0 0 0 0 0 0 0 0 0 0 0 0 0
$$ 0 0 0 0
$$ ##$ShimPowMaxUG= (0..63)
$$ 524287 524287 524287 524287 524287 524287 524287 524287 524287 524287 524287
$$ 524287 524287 524287 524287 524287 524287 524287 524287 524287 0 0 0 0
$$ 0 0 0 0 0 0 0 0 0 0 0 0 0 0 0 0 0 0 0 0 0 0 0 0 0 0 0 0 0 0 0 0 0 0 0 0
$$ 0 0 0 0
$$ ##$ShimPowRcbType= 3
$$ ##$ShimPowRes= (0..63)
$$ 1e-20 1e-20 1e-20 1e-20 1e-20 1e-20 1e-20 1e-20 1e-20 1e-20 1e-20 1e-20
$$ 1e-20 1e-20 1e-20 1e-20 1e-20 1e-20 1e-20 1e-20 0 0 0 0 0 0 0 0 0 0 0 0
$$ 0 0 0 0 0 0 0 0 0 0 0 0 0 0 0 0 0 0 0 0 0 0 0 0 0 0 0 0 0 0 0 0
$$ ##$ShimPowRng0= (0..63)
$$ 1 1 1 1 1 1 1 1 1 1 1 1 1 1 1 1 1 1 1 1 0 0 0 0 0 0 0 0 0 0 0 0 0 0 0 0
$$ 0 0 0 0 0 0 0 0 0 0 0 0 0 0 0 0 0 0 0 0 0 0 0 0 0 0 0 0
$$ ##$ShimPowRng1= (0..63)
$$ 1 1 1 1 1 1 1 1 1 1 1 1 1 1 1 1 1 1 1 1 0 0 0 0 0 0 0 0 0 0 0 0 0 0 0 0
$$ 0 0 0 0 0 0 0 0 0 0 0 0 0 0 0 0 0 0 0 0 0 0 0 0 0 0 0 0
$$ ##$ShimPowRng2= (0..63)
$$ 1 1 1 1 1 1 1 1 1 1 1 1 1 1 1 1 1 1 1 1 0 0 0 0 0 0 0 0 0 0 0 0 0 0 0 0
$$ 0 0 0 0 0 0 0 0 0 0 0 0 0 0 0 0 0 0 0 0 0 0 0 0 0 0 0 0
$$ ##$ShimPowRng3= (0..63)
$$ 1 1 1 1 1 1 1 1 1 1 1 1 1 1 1 1 1 1 1 1 0 0 0 0 0 0 0 0 0 0 0 0 0 0 0 0
$$ 0 0 0 0 0 0 0 0 0 0 0 0 0 0 0 0 0 0 0 0 0 0 0 0 0 0 0 0
$$ ##$ShimSysFunc= (0..63)
$$ 1 2 3 4 5 7 9 11 15 16 8 10 12 14 6 17 13 18 19 20 0 0 0 0 0 0 0 0 0 0
$$ 0 0 0 0 0 0 0 0 0 0 0 0 0 0 0 0 0 0 0 0 0 0 0 0 0 0 0 0 0 0 0 0 0 0
$$ ##$ShimSysMatrix= 0
$$ ##$ShimSysType= 1
$$ ##$TFXNUM= 0
$$ ##$TRIPLO2= 0
$$ ##$VTU= 2
$$ ##$VTUETH= <149.236.99.20>
$$ ##$VTUTY= <no>
$$ ##$WBREFAM= (0..15)
$$ 135.5 97.7 100 100 100 100 100 100 100 100 100 100 100 100 100 100
$$ ##$WBREFLM= (0..15)
$$ 0 0 0 0 0 0 0 0 0 0 0 0 0 0 0 0
$$ ##$WBREFPH= (0..15)
$$ 72.26 -67.22 0 0 0 0 0 0 0 0 0 0 0 0 0 0
$$ ##$WBSGU= (0..15)
$$ 0 0 0 0 0 0 0 0 0 0 0 0 0 0 0 0
$$ ##$XFAC= 2
$$ ##END=
$$ 
##$DECIM=	704
##$DSPFVS=	20
##XUNITS=	HZ
##YUNITS=	ARBITRARY UNITS
##FIRSTX=	25274.001712016048259
##LASTX=	-3134.6557087493106337
##DELTAX=	-0.43348832563920586258
##XFACTOR=	1
##YFACTOR=	0.085599524705208193676
##FIRSTY=	7.2799711227416992188
##MINY=	-16.042510986328125
##MAXY=	2561.4111328125
##NPOINTS=	65536
##XYDATA=	(X++(Y..Y))
$$ [...]
13660A53mk3l3k8j5jJ2K0J6Jj2j1LK0L3L3K6K0K2K4J3j6m5n4m2k6j5%K3M8N2K5j5l5k2NL0
13644A82M3M5L2kl6m4k1J0K1J5Mj0k7m1l9k4j0nn%PJ1J4J7J4Kj2j7qKKprkNLLOQmj9j8omj3
13624F3j3MJ5Lj5j2J0K4J8J0J1J2J1J0J0Ork0j7lJ0J4J5J6K2K2J3JjJ2K3J3nnJ4L1K6J0oj7
13607C26l0l5k7j2oj4k5l2k9j3QK3J6jj3j3j6k5k7qK8N8O5M7J7j1k9l3k1LK0J6kj3oKKjOJ2
13589B07ml4m5k7JJ2J1J2J5Oqj4j4k3m2n0k9LK5K9K0Qrk1j5J0K9K5J3J5K9K5%j9qK3M5M7L5
13572B83J3j6l9m2k8j5qkRJ6J4K2M4O1M2nl8l9k6k8m3m2j3J8K8Qj1j2OK0K0J2J0J2J3Okml
13556B41pj7k5k0lJ5J5jk4l8l9l8l1j7PL4M9N0L7J9Kj3k8m0m7l4pJ9L1K4J5J1Pjj4k1j8rl
13539H1kjJPJ3J8J7Qrk1k1j2lLQJ8K4J4j2l6l4kL6N5M6K7K1L0L3J0k2l3k0j1k2l5l0j2kLJ1
$$ y = [153, 149, 126, 93, 65, 50, 49, 61, 81, 97, 98, 86, 75, 78, 98, 131, 164, 190, 210, 232, 256, 269, 253, 208, 154, 112, 86, 71, 71, 94, 142, 194, 219, 204, 169, 147, 152, 182, 225, 270, 302, 300, 264, 220, 199, 209, 230, 245, 249, 239, 212, 171, 132, 108, 98, 93, 88, 88, 95, 106, 120, 137, 151, 153, 141, 124, 116, 118, 120, 113, 104, 102, 107, 110, 113, 119, 127, 123, 104, 86, 80, 76, 63, 50, 54, 69, 72, 57, 45, 55, 79, 97, 107, 118, 130, 141, 151, 161, 167, 158, 138, 121, 118, 128, 142, 157, 173, 195, 217, 230, 231, 230, 242, 265, 278, 273, 268, 282, 313, 339, 349, 343, 326, 296, 261, 234, 222, 216, 202, 177, 145, 116, 103, 111, 134, 150, 149, 136, 123, 107, 82, 55, 47, 75, 133, 198, 245, 262, 251, 222, 189, 168, 171, 191, 207, 205, 192, 186, 188, 190, 189, 195, 207, 203, 169, 124, 97, 98, 110, 121, 133, 148, 154, 146, 132, 118, 95, 53, 3, -26, -23, 2, 31, 51, 59, 50, 29, 14, 24, 53, 78, 91, 106, 135, 160, 160, 141, 133, 156, 201, 248, 283, 296, 280, 241, 199, 171, 156, 148, 146, 155, 171, 185, 207, 251, 312, 354, 349, 311, 272, 246, 218, 175, 133, 120, 138, 166, 174, 163, 151, 157, 177, 197, 209, 219, 231, 244, 250, 248, 244, 241, 234, 217, 192, 172, 169, 184, 199, 198, 174, 136, 97, 59, 28, 11, 18, 52, 101, 151, 188, 207, 209, 196, 168, 128, 81, 47, 40, 59, 90, 114, 129, 140, 147, 146, 132, 111, 93, 84, 81, 79, 78, 79, 86, 99, 117, 134, 142, 133, 112, 91, 79, 76, 79, 87, 105, 129, 143, 131, 95, 61, 59, 95, 150, 196, 223, 244, 274, 307, 317, 295, 262, 242, 231, 209, 174, 144, 132, 130, 133, 144]
13521A44J5ll0m0k3nrj4JL3M9L6J1pj2rlMROpk2k9j8jQMKPJj9l2j4K1M2L2J5PRJ1J6J9J2j
13502B16nPJ6Qj7m0n5n9n0k8j0lomLJ2J4Q%nMJ7K0Qqj7k3k9l2k4j1JJ1K8L9L4K1J3J8J8J1
13484A01MOJ6K0J6NpoPK1K3J7J3J4Lj9l4k8j9k0k7k4j4omLJ6K3K2J9J6J1JnJJ4K7L4L5L0J6
13466C21nk2k7k3k1k3k2rOJ5J7J8J9J2%onmj5k9l0j1J5K9K4Mj6k9k7j6kONKNJ6K6K1Lj7k3
13448A82j4%OJ1J5J9J6Mj2j7j2nj2l0m2l4qK1L9L8K0rk7k4rJMNJ0J0M%L%j2k0j1PK2L3L8K8
13430B38Kj7rJ3J5rl3l6k8k7k5j0J0J3MkOOj2l4l8j6RJ7Lj7k1%K8L9K4%j0KK3L7L4J7jj4k2
13412A59k1pJ0J2oj8nJ8K6J1JLQjj7k2j7lJ6L5L9J8j3l0k7j0J0K6K7J2mqJJ1J8K2J6mk6l4
13395B26j9jMkj1j8k4k1qPJ5J3J0J4K2K7K4J3kj8k9k7j6j1k0l1k5JK4K8K1J8J3KmMJ6J7PN
$$ y = [144, 159, 156, 126, 86, 63, 58, 49, 35, 36, 69, 118, 154, 165, 158, 146, 137, 134, 138, 147, 153, 146, 124, 95, 77, 76, 84, 88, 90, 97, 98, 79, 47, 33, 54, 96, 128, 143, 150, 159, 170, 186, 205, 217, 216, 211, 218, 234, 242, 225, 185, 130, 71, 21, -7, -17, -20, -26, -30, -27, -15, -1, 7, 7, 2, 6, 23, 43, 51, 43, 26, 3, -26, -58, -82, -93, -92, -81, -53, -14, 20, 41, 54, 72, 90, 101, 105, 111, 127, 147, 163, 168, 161, 155, 162, 183, 206, 223, 236, 250, 253, 234, 200, 172, 153, 133, 106, 82, 68, 62, 58, 61, 77, 100, 122, 141, 157, 168, 169, 164, 165, 179, 206, 240, 275, 305, 321, 316, 294, 267, 244, 223, 200, 178, 169, 175, 190, 207, 225, 244, 256, 256, 250, 245, 241, 226, 197, 167, 156, 171, 200, 224, 228, 212, 183, 156, 140, 138, 144, 149, 151, 156, 172, 198, 219, 222, 205, 182, 168, 168, 174, 185, 200, 219, 235, 239, 227, 210, 198, 193, 181, 151, 109, 75, 67, 88, 127, 165, 185, 176, 149, 125, 116, 117, 121, 126, 136, 146, 150, 150, 153, 153, 141, 121, 110, 117, 139, 172, 210, 238, 240, 223, 214, 227, 242, 233, 200, 164, 136, 109, 84, 74, 84, 97, 101, 99, 105, 111, 99, 65, 27, 11, 20, 37, 40, 23, 2, 2, 30, 69, 93, 93, 83, 85, 108, 145, 179, 196, 195, 181, 159, 138, 131, 141, 153, 147, 129, 124, 142, 168, 179, 180, 183, 191, 190, 173, 151, 134, 131, 147, 182, 221, 239, 226, 196, 169, 159, 169, 195, 222, 234, 230, 222, 223, 234, 252, 274, 290, 286, 260, 226, 207, 206, 210, 208, 197, 179, 155, 134, 126, 133, 148, 161, 171, 185, 207, 234, 258, 271, 269, 251, 222, 195, 179, 168, 148, 117, 92, 93, 117, 145, 166, 184, 197, 199, 195, 199, 215, 232, 239, 244]
13378B44Olj9j7J2L2J7k2m0k5JOj6l7l0KK9K4JnJ5L1K0pk2j8qOJ7J8MplNJj1j9j5qnKJ1Ql
13359A72j0nLJ3K1K7K3Qrj7j8j3mRJ6J3Mnj4j4%J7J7mk8m2m8m7l2LL7M1J8mj1olkKJ1J2kk5
13340A04l6j8J8L9K3qk5j8rnKJ5J8Mj3j3LJ3J1KMJ5K2J6LkJ4L2L0Nj9k1j0jLJ1K0J6%j4j4
13322B17mRJ8J6Kj7k6k0j2j5k4k6k2j6mJ7L6L3Pj4j4LJ5J0nj4j2kLnk8m5l7pK6L7K1nk0j5
13305F1jJ1J5J5Rkj4j9j2%RJ5J5QJLJ3J6P%PK3K7J5%opqj0j5k4l1k7j4jKoj4j6p%JlOK4L1
13285I7J4j6l3l7k5%L8N5K9j3k6lJ3Lj2nJ2J4Jj0q%J3K6K7J3LJ2K1Rj7l3l3l1k9k4j1jNJ7
13268E5K8K2NlJMpj5jK0K7J6MLJ1J8K4K5J8MkLJ2Qj4l7l9j3K0L1K6J7J4Lk1m2m5l4k4j4KK1
13249A31L2K8J1j1l6n0m6k5MK8L8K8Kj3KL8N8M4J1j1j0JROj1l0m4m1k1NK5L2K5J7J4J1Lj2
$$ y = [244, 250, 247, 228, 211, 223, 255, 272, 250, 210, 185, 186, 192, 176, 139, 109, 111, 140, 164, 165, 160, 175, 206, 226, 219, 197, 179, 171, 177, 194, 212, 216, 209, 206, 211, 212, 201, 182, 167, 159, 154, 156, 167, 175, 172, 162, 157, 160, 173, 194, 221, 244, 252, 243, 226, 208, 195, 191, 200, 216, 229, 233, 228, 214, 200, 200, 217, 234, 230, 202, 160, 112, 65, 33, 36, 73, 114, 132, 128, 117, 111, 108, 106, 108, 119, 131, 129, 104, 68, 50, 68, 107, 130, 122, 97, 79, 70, 65, 67, 82, 100, 104, 91, 78, 81, 94, 105, 107, 111, 126, 148, 164, 167, 165, 179, 211, 241, 246, 227, 206, 196, 195, 198, 209, 229, 245, 245, 231, 217, 213, 222, 240, 256, 258, 241, 215, 195, 183, 168, 144, 118, 96, 80, 76, 93, 129, 162, 169, 155, 141, 144, 159, 169, 164, 150, 138, 136, 139, 134, 106, 61, 24, 17, 43, 80, 101, 96, 76, 61, 60, 71, 86, 101, 110, 108, 94, 75, 63, 63, 72, 87, 102, 110, 111, 114, 127, 143, 150, 150, 157, 180, 207, 222, 222, 216, 209, 201, 191, 176, 152, 121, 94, 80, 79, 81, 75, 61, 45, 38, 38, 39, 36, 42, 66, 97, 111, 95, 62, 25, 0, 0, 38, 93, 122, 109, 83, 80, 93, 96, 84, 79, 91, 105, 106, 96, 88, 88, 101, 127, 154, 167, 170, 182, 203, 212, 195, 162, 129, 98, 69, 45, 34, 33, 38, 55, 83, 105, 110, 107, 108, 112, 105, 90, 89, 109, 136, 152, 156, 159, 170, 188, 212, 237, 255, 259, 257, 260, 272, 280, 266, 229, 190, 177, 197, 228, 254, 271, 285, 288, 267, 225, 180, 146, 122, 108, 110, 131, 163, 191, 202, 191, 155, 105, 59, 34, 38, 66, 104, 132, 134, 121, 123, 161, 219, 263, 274, 263, 253, 254, 263, 269, 258, 228, 184, 143, 122, 127, 152, 184, 209, 226, 240, 251, 254, 242]
13233B42k1j9j2qoKJ1J2Jj1j3j2j0rMJ9K0Lj6k0rlj0j4qRK0J9J3O%rk1k7k2jK9N3N8L5Kk5
13215B52l6l4k5j9j4j2mJ5K9K1ok5j8OK1K3K7K9J5j4k4jL2L9K0nk1k8l2k7j5nkKLmj5j7j0
13198A21qj5j7mJ9L2L4K5RnoMJ2Opj2j2j2nOJ0mk2k1njj3k8k4rQK0L3L7K9J6Lj2k9l8k0J2
13180A07L1K6J5J3J8Rj3k5j0J1J6jj6j2%jk2m0l4mK5L2K4J2Pjj1j6j3oorj2j4j6j2jQLlLJ3
13161G5QooK0M0L1NnOJ8K5L0L3K0kk1l3m1m2k7qmj7k4j3JLJNJ0PLPJ3J0Lkj1l0m4l2jK2K1
13142D8J2QP%jNQlj0jJ6K1J3J3L0M6M1J7j0k7l0j6NJ8J1JMJ5J5LjJ1K3J9Jj2k0l3n2o3n4k9
13124D9LK8L6K8J4kj9l9m3k4RK7K1J2J2K0K2J3jj4k2j6JJ7K2J6Npj5j2lLqk2k5oK0M2N2M9
13107B43L0Lj5j7j4j9k8l1k2j3qjOJ4J5J4J6K4K8K5J3rl5m9m0j0Ppl1l4oK5K5Mj5j3QK4K4
$$ y = [242, 221, 202, 190, 182, 176, 178, 189, 201, 202, 191, 178, 166, 156, 147, 151, 170, 190, 193, 177, 157, 148, 145, 135, 121, 113, 122, 142, 161, 174, 180, 180, 171, 150, 123, 101, 100, 129, 182, 240, 275, 277, 252, 216, 182, 157, 138, 124, 112, 108, 123, 152, 173, 167, 142, 124, 130, 151, 174, 201, 230, 245, 231, 207, 206, 238, 277, 297, 292, 271, 243, 211, 184, 169, 164, 162, 164, 167, 163, 148, 131, 121, 113, 98, 81, 77, 96, 128, 162, 187, 196, 191, 185, 189, 201, 207, 200, 188, 176, 164, 159, 165, 175, 171, 149, 128, 123, 122, 109, 81, 57, 48, 56, 76, 109, 146, 175, 191, 194, 182, 153, 115, 95, 107, 138, 164, 179, 192, 210, 219, 206, 181, 171, 182, 198, 197, 181, 169, 169, 168, 146, 106, 72, 68, 93, 125, 149, 161, 168, 167, 156, 140, 127, 121, 115, 106, 94, 80, 64, 52, 51, 59, 62, 59, 62, 75, 83, 77, 71, 91, 131, 162, 167, 162, 168, 186, 211, 241, 274, 294, 292, 271, 238, 197, 155, 128, 120, 116, 99, 75, 62, 63, 66, 67, 72, 82, 89, 92, 99, 112, 122, 125, 123, 112, 82, 38, 6, 5, 27, 48, 60, 68, 75, 75, 74, 79, 87, 84, 74, 73, 89, 110, 123, 136, 166, 212, 253, 270, 260, 233, 203, 187, 192, 210, 221, 222, 226, 241, 256, 259, 258, 269, 292, 311, 312, 300, 280, 247, 195, 132, 78, 49, 52, 80, 116, 144, 158, 156, 137, 98, 55, 31, 40, 67, 88, 100, 112, 132, 154, 167, 166, 152, 130, 114, 115, 132, 154, 170, 175, 168, 153, 141, 138, 141, 133, 111, 86, 80, 100, 142, 194, 243, 273, 276, 261, 244, 230, 211, 183, 152, 130, 117, 109, 108, 114, 128, 143, 157, 173, 197, 225, 250, 263, 254, 219, 170, 130, 120, 127, 120, 89, 55, 49, 74, 99, 103, 88, 75, 83, 107, 131]
13090A31Nk3m1m0k8j7j2pk%LJ9M1N7M7J5j5k4j1J0K4K4J3komkj0j6kK5L8K0rj3QK4J7kj2p
13072B16MJ4J8J4Kmjjj9m6n9n1l5k0lJ8L1K4OoLJ8J9PnjJ3K3J7%j7k0j1OJ8K0J4PJj3k8l6
13054A37k6qJ1K0K0J1NQJ3Mk3m4l7rJ4K0J3Jj5k6l0k7k8k9k5oJ5K9L0L0K8K4K2K4K5K5J9J2
13037B27MKQJ5J1qk8l4j7J0K0Mj9k5lK8M3L5J4j1l3m4l8j6J0L5M7L7Pk4l5l0k3j9j2JLlml
13020A32j1k9l0KM1N2L1Kj8l3m8m9l2j0JJ1K9M6M4K2NQJ5Mj8k3qLoqJ4M4M5J4j7k6k4j9rJ1
13003A58K9L3K6J4nk8l7k8k5k9k0J5M4L2qk0OL8M3K7J5RKkkkj1j9j6qklnom%ONmj6k1k0j3
12984A48JJ5K1J7Nkrj1oPK1K6J5qk8l2j7JJj1j5rnj7k2oK0L1K0QRJ9K8L1K7J5ORJ5Pj8l7k9
12966B41kJ1kk1k1nRJ2J1J5K5L1K8K3K0J6Kj6k8l0l4m2m6l7k2j0nNJ2Mj4k2jK9M7M3L3K1M
$$ y = [131, 136, 113, 72, 32, 4, -13, -25, -32, -34, -34, -31, -12, 29, 86, 133, 148, 133, 109, 98, 108, 132, 156, 169, 167, 161, 157, 155, 145, 129, 127, 152, 190, 210, 201, 188, 196, 220, 237, 235, 223, 216, 220, 234, 252, 266, 268, 264, 263, 262, 243, 197, 138, 87, 52, 32, 29, 47, 78, 102, 108, 102, 105, 123, 142, 149, 144, 143, 156, 179, 196, 196, 179, 159, 148, 154, 172, 192, 206, 213, 214, 201, 173, 137, 111, 103, 114, 134, 154, 165, 170, 178, 191, 195, 172, 128, 91, 82, 96, 116, 129, 130, 115, 89, 59, 32, 4, -25, -50, -56, -41, -12, 18, 48, 76, 100, 122, 146, 171, 196, 215, 227, 231, 233, 241, 256, 267, 259, 231, 197, 180, 190, 210, 214, 195, 170, 167, 195, 238, 273, 287, 276, 243, 199, 161, 145, 155, 190, 237, 274, 281, 257, 222, 192, 169, 150, 138, 139, 142, 139, 135, 132, 121, 92, 62, 64, 105, 157, 188, 190, 172, 139, 91, 42, 10, 0, 1, 12, 41, 87, 131, 153, 158, 166, 181, 185, 167, 144, 136, 139, 133, 125, 139, 183, 228, 242, 225, 199, 175, 156, 147, 158, 187, 220, 246, 260, 255, 227, 190, 162, 137, 108, 88, 103, 147, 179, 171, 151, 157, 195, 238, 265, 280, 289, 291, 289, 287, 285, 274, 255, 239, 231, 229, 226, 221, 215, 211, 211, 217, 222, 218, 202, 181, 161, 148, 149, 164, 185, 202, 207, 205, 196, 185, 179, 186, 207, 233, 248, 240, 212, 180, 163, 164, 165, 154, 139, 130, 125, 108, 86, 80, 100, 131, 151, 159, 168, 187, 215, 246, 273, 288, 294, 303, 318, 325, 307, 270, 241, 239, 250, 248, 227, 206, 201, 210, 222, 233, 248, 273, 304, 332, 355, 375, 391, 393, 377, 349, 319, 285, 243, 197, 160, 138, 128, 123, 128, 140, 144, 130, 108, 107, 136, 183, 226, 259, 280, 284]
12949B84j6k6k5k0j7j2p%PJ8K3J4LJ3L4L5J1oNJ9J1nKK5L0J4KJ5M0N9P0P8P6O4O1P6J06J36
12932A197J67J99K30K57K61K07O9j16k68l31l17k72k19j60j11r8j06r9o4l4l8n5n3k6rj2k1
12920A78j3JJj9k9j6QJ4MnjRRLpj3j2KK2K8J2qqJ4L7M0K1nk1j9j0orj3j0j2k4l7l5j5J2L1
12902I9L2J9KrrkPK2L0J9rk6j5PJ6Jj8k7k4j5rj4k9k8jL5M5K6QKnk3l7k9mK4M3N0L6J0j1j4
12884A75poj6k0j2NJ9K1J5MjJMJnoKJ7K2J0j9l6k7mRNnpj2k4l2k6j2mnrj2mRL4M9M6L1J7R
12865A94OKlpj1oLLrk3k3mJ6K1Qj8l7l6j5MPLNJ2J2Mpj3j6j5pjlj1pJ1K7K5J0LQJ1NnpJJ1
12844A28J8K3K6K8J8lk8m0l2rJ1J9J0%orj2j3lJ7L1L3K1Mj3k2k0j4j6k7l1j4J3L6M8M9M1K3
12828B85Kj4k4k4j7mjj3k3j5QK2K4K0K1K1Nk6n2n4l0%J4J2QJ6K6K6J2rk9l5k0PK4K0N%%JO
$$ y = [284, 268, 242, 217, 197, 180, 168, 161, 161, 168, 186, 209, 223, 226, 239, 273, 308, 319, 313, 318, 337, 348, 343, 345, 370, 400, 414, 416, 431, 471, 530, 600, 678, 754, 818, 879, 955, 1061, 1197, 1364, 1563, 1793, 2050, 2311, 2518, 2587, 2471, 2203, 1872, 1555, 1283, 1064, 904, 793, 695, 589, 490, 426, 392, 354, 299, 246, 220, 211, 199, 178, 165, 166, 167, 148, 119, 103, 111, 125, 129, 124, 123, 132, 141, 144, 137, 124, 112, 114, 136, 164, 176, 168, 160, 174, 211, 251, 272, 267, 246, 227, 217, 211, 202, 189, 179, 167, 143, 106, 71, 56, 68, 99, 131, 150, 152, 143, 134, 132, 139, 161, 191, 210, 201, 175, 160, 167, 183, 184, 166, 139, 115, 100, 91, 77, 48, 20, 19, 54, 99, 125, 133, 135, 130, 107, 70, 41, 37, 61, 104, 154, 190, 200, 189, 175, 168, 162, 146, 126, 114, 119, 138, 159, 174, 178, 177, 178, 182, 183, 178, 172, 174, 191, 213, 223, 204, 168, 141, 137, 146, 151, 146, 139, 127, 103, 71, 45, 33, 29, 24, 15, 3, -1, 8, 42, 91, 137, 168, 185, 194, 200, 202, 199, 192, 181, 175, 178, 181, 172, 149, 126, 122, 138, 159, 167, 149, 112, 76, 61, 65, 72, 75, 80, 92, 104, 108, 101, 88, 72, 57, 50, 49, 46, 35, 28, 39, 66, 91, 101, 104, 112, 123, 128, 123, 116, 117, 128, 146, 169, 195, 223, 241, 238, 210, 170, 138, 129, 140, 159, 169, 169, 163, 154, 142, 129, 126, 143, 174, 207, 228, 232, 219, 197, 177, 163, 147, 120, 89, 75, 88, 124, 172, 221, 262, 285, 287, 273, 249, 225, 208, 204, 203, 190, 167, 152, 160, 182, 206, 226, 247, 268, 273, 247, 195, 141, 111, 111, 125, 137, 145, 161, 187, 213, 225, 216, 187, 152, 132, 139, 163, 183, 188, 188, 188, 189, 195]
12810A95J3Rj8m9n3l3j5j1kK0L3K3LjQJ8J3jj4j9mJ9K6Mk3k0J5M8N2K4pk5k6j6qj0k1k9k4
12793I4oJ0J2Kqj0lNJ2K0K8L4L5L2J6j1l5m0k7j3nllk%QJ0mk1j8KPj1l1k6pnj5j0J7M6N5M6
12774A77K8J0j1l1m4m6l6k3j4j3qRK5K4QkKJ3K1K2K1J1NJ5M1O2N4K3j5m2n0m1k2nLJ4K7L5
12758B47K1rl5m1l4k4j9rQK2J7jj2pORKl%jj1j9j4jRJ0OOJ3J9J2j1l2l2j1J3K2J3joLJ6J7
12739A58kk9l7k3o%klNK2M5N9M8Rk6l1j1MMnrj5k7l6l2j1J8M0M6M1K8J5lk0k2lK2L1K7K2J7
12721C08%l5n7m2kK7L0K1J7J5Lj9l7m4l6k0njjkOJ6K2K2K2K0J2Jj0j8k4l4l8l0j0J1K3K5K2
12705A58J5Jj4j9j5j0mKNmk3k5lK1J6j6l4j4J9L3J9MNQRJ0J2Pmj8j9j1NK9N1N7L9J4%JJ5L0
12686C52M8N7N5M5L3K2J4J2J2Jk0l2j7J2K2Oj3j9j6j9k7m2o2p7o9m4k2j8j4lPNjOJ5Oj6k8
$$ y = [195, 208, 217, 199, 150, 97, 64, 49, 38, 36, 56, 89, 112, 115, 114, 122, 140, 153, 152, 138, 119, 115, 134, 160, 164, 141, 121, 136, 184, 236, 260, 253, 228, 202, 186, 178, 168, 147, 118, 94, 88, 98, 110, 112, 104, 94, 91, 96, 108, 128, 156, 190, 225, 257, 273, 262, 227, 187, 160, 147, 142, 139, 136, 134, 134, 142, 152, 148, 127, 109, 111, 118, 107, 76, 50, 43, 38, 23, 13, 30, 76, 131, 177, 205, 215, 204, 173, 129, 83, 47, 24, 10, -3, -11, -2, 23, 47, 55, 53, 55, 68, 89, 111, 132, 143, 148, 163, 204, 266, 320, 343, 328, 286, 236, 195, 173, 168, 171, 185, 212, 247, 268, 259, 224, 183, 149, 125, 106, 97, 105, 127, 144, 143, 131, 124, 130, 139, 141, 138, 138, 137, 126, 107, 93, 92, 101, 111, 117, 123, 136, 155, 167, 156, 124, 92, 81, 94, 116, 129, 128, 122, 125, 141, 158, 156, 127, 90, 67, 61, 61, 59, 56, 61, 83, 128, 187, 235, 244, 218, 187, 176, 180, 184, 179, 170, 155, 128, 92, 60, 49, 67, 107, 153, 194, 222, 237, 234, 214, 192, 189, 211, 242, 269, 291, 308, 308, 273, 216, 174, 172, 199, 229, 250, 267, 282, 285, 266, 229, 185, 149, 129, 124, 123, 122, 120, 126, 142, 164, 186, 208, 228, 240, 241, 231, 213, 189, 155, 117, 87, 77, 88, 111, 136, 158, 173, 174, 160, 141, 126, 116, 112, 114, 119, 115, 92, 67, 64, 85, 101, 85, 51, 37, 56, 89, 108, 112, 117, 125, 134, 144, 156, 163, 159, 141, 122, 111, 116, 145, 196, 253, 292, 306, 306, 307, 322, 352, 400, 457, 512, 557, 590, 612, 626, 638, 650, 651, 631, 599, 582, 594, 616, 622, 609, 590, 574, 555, 528, 486, 424, 347, 278, 234, 212, 194, 180, 177, 184, 189, 188, 194, 209, 215, 199, 171]
12670A71k1j0jQJ5J1mj6k1k1j8LL5N7M7K0RJ7K0Mj9l0k7k5k8k5j7j2j7j6ML2M1J4k6m6l5q
12653F5J8L1L1J9J6K3L0K1jrJ0L2L3J2j3k7k6j8j3j3j6k0k0j5nQJ5J4OOJ7K6J9Nnj0j3j2%
12637B21J8K5Rj8l4l6l0k3k0j9j4oOJ2Kj4k3j3MJ3RJmk%J%k%ORPRK3M1N1M3K5Pj0k7l7l0j2
12617A68k%jKJjNK2L5K6Lj3rNJ4J7J9K3J9Nrj5j7k1l0l4k5j1nqnNJ0kk1l0k5j1LJ5K0K0J6
12599A58J1KnnPJ7J5%j0j0MK0K4Kl1m4j7J7J8j4l5k3JQJkOJ8K7K7J0k0l8k7LK1J8Nqj8k3j7
12581I3kRJ2J5K0K0J3LmnJJ3K5K3Pj1j6pLMpk0k1LL2M4K6lk3k8k7k6k7k7k4j1J1L2L8L2K8
12563B18K9K6Ok1l6l0j5okmoj2j3pOJ2%k1k7j0J2K0J3MMJ1J3J0Koj0qJJ2J7J1lk0k6j9pmp
12544A07j2j3j1qonmlLRJ1J2K1L5L6J4k0m0l5j3J2K7K9J5rl2m3l3rJ5K6K7L0M1M5K6ql1l0
$$ y = [171, 150, 140, 139, 147, 162, 173, 169, 153, 132, 111, 93, 96, 131, 188, 235, 255, 264, 281, 301, 305, 286, 256, 229, 204, 176, 151, 134, 122, 105, 89, 93, 125, 166, 180, 154, 108, 73, 65, 83, 114, 145, 164, 180, 203, 233, 254, 253, 244, 254, 286, 319, 331, 318, 291, 265, 247, 234, 221, 205, 185, 165, 150, 145, 153, 168, 182, 188, 194, 211, 237, 256, 261, 256, 246, 233, 221, 221, 239, 264, 273, 255, 221, 185, 155, 132, 112, 93, 79, 73, 79, 91, 93, 79, 56, 43, 47, 60, 69, 70, 66, 64, 64, 65, 65, 63, 63, 69, 78, 85, 94, 117, 158, 209, 252, 277, 284, 274, 247, 210, 180, 168, 166, 166, 165, 167, 168, 167, 172, 194, 229, 255, 258, 245, 236, 241, 255, 272, 291, 314, 333, 338, 329, 314, 297, 276, 246, 212, 187, 176, 171, 163, 158, 163, 173, 171, 150, 120, 95, 84, 87, 102, 122, 142, 158, 169, 171, 166, 161, 168, 185, 200, 200, 190, 180, 184, 204, 228, 230, 199, 155, 138, 155, 173, 159, 124, 101, 102, 110, 111, 109, 115, 133, 160, 187, 197, 177, 139, 112, 115, 136, 154, 159, 151, 133, 110, 93, 91, 100, 112, 127, 147, 167, 180, 183, 179, 174, 175, 188, 213, 236, 243, 232, 216, 209, 212, 216, 209, 189, 168, 171, 203, 247, 273, 270, 247, 219, 192, 166, 139, 112, 88, 77, 88, 120, 158, 190, 218, 247, 273, 279, 258, 222, 192, 177, 171, 169, 165, 159, 147, 134, 127, 133, 145, 145, 124, 97, 87, 99, 119, 132, 136, 140, 151, 164, 174, 176, 170, 160, 152, 153, 165, 182, 193, 190, 170, 144, 125, 118, 114, 107, 95, 82, 71, 63, 57, 52, 48, 45, 48, 57, 68, 80, 101, 136, 172, 186, 166, 126, 91, 78, 90, 117, 146, 161, 152, 120, 77, 44, 35, 50, 76, 103, 133, 174, 219, 245, 237, 206, 176]
12527A76j3%QOkk0l5l7k9j6o%LQJ8L1L3J8jpLJ5J7Npj0jPMj2k6k7j5%Mmj6k0rRK1K0J7J9J9
12508A48Lk1l3k9j7kJ7K9K2jj7pJ0J8J1RJ5K1J4OKLJ0K0K5J2j8m0l6j6oj2j4JK5L4K2kj7j3
12490A76OJ8J7OjJjqj1mRJ4Kj3j7j1ooLK1L1K1Kj0j3k4m2m6k3J2L2K8J7J0Okrj4j4j0l%jN
12471A48K2L7L3J7Ljj1k5k9j4NNrj1KK1K9K8J9Opj8k9l9l2rLj0l8m0j2J7K1PkjJNJ4K8L6L2
12453B02K2Ork0k3j7qLPmk3k5jK7K4nk3pK0K3lk2k0rqrJJ9K6K1J4Qpl3m9l3MK9K6Qpk0k7j8
12434F0QL3L5J3pj1%ROlj4j0J5M5N3K4k3m7l1NK7K1%j3qRJ5Lk1l4k7nJ1J3J3J6K0J2nj7k2
12416A68k1j4MK6L6K3Lmlkpj3j5j7j6rOK0K3J4kj0rkNMNKqk3k4oJ1J0lkJ0J9J2Ljkpj4k2j9
12396A29nJ7K3%k6k6%J4ml1l5j1J9L9M7M0K3J7K1K1Kk2k8k0j7k0j8j1j2k1k7j9j2j0pPJ5Q
$$ y = [176, 163, 163, 171, 177, 175, 155, 120, 83, 54, 38, 32, 32, 35, 43, 61, 92, 125, 143, 142, 135, 138, 153, 170, 175, 168, 158, 157, 164, 168, 156, 130, 103, 88, 88, 92, 88, 72, 52, 43, 52, 73, 93, 110, 129, 148, 151, 130, 97, 68, 51, 49, 66, 95, 117, 116, 99, 92, 102, 120, 131, 140, 155, 176, 190, 196, 198, 201, 211, 231, 256, 268, 250, 210, 174, 158, 152, 140, 126, 127, 152, 186, 208, 206, 189, 176, 182, 200, 217, 223, 222, 223, 222, 214, 203, 199, 208, 222, 224, 211, 194, 183, 177, 171, 174, 195, 226, 247, 249, 239, 226, 202, 160, 114, 91, 103, 135, 163, 180, 190, 196, 194, 185, 171, 157, 147, 144, 144, 143, 148, 170, 207, 240, 257, 260, 259, 248, 223, 194, 180, 185, 190, 181, 170, 172, 193, 222, 250, 269, 275, 268, 250, 221, 182, 150, 141, 144, 134, 96, 56, 44, 61, 82, 89, 87, 86, 87, 92, 106, 134, 170, 202, 224, 230, 221, 201, 178, 161, 153, 156, 163, 159, 136, 111, 110, 137, 161, 156, 133, 126, 146, 169, 166, 144, 124, 115, 107, 98, 99, 118, 144, 165, 179, 187, 180, 147, 98, 65, 69, 98, 124, 132, 125, 105, 78, 60, 68, 101, 136, 149, 142, 131, 131, 140, 146, 143, 129, 119, 134, 179, 232, 256, 233, 186, 155, 160, 187, 208, 208, 195, 187, 196, 211, 214, 193, 159, 132, 127, 138, 151, 164, 180, 200, 212, 207, 190, 168, 147, 133, 137, 163, 199, 222, 225, 221, 218, 216, 209, 196, 181, 164, 148, 139, 145, 165, 188, 202, 200, 190, 181, 179, 184, 188, 193, 195, 187, 164, 140, 134, 145, 155, 152, 150, 160, 179, 191, 194, 193, 191, 184, 170, 148, 129, 124, 141, 164, 164, 138, 112, 112, 126, 122, 91, 56, 45, 64, 103, 150, 190, 213, 230, 251, 272, 274, 252, 224, 204, 187, 167, 149, 138, 126, 105, 78, 59, 47, 37, 30, 37, 52, 60]
12380F0qj5lK3M5N0L2Kj9k0q%NRJ5J9J8J5J2P%j1k5l4l0j7j0j0rLJ9L0L4K8J1j3k1qJ0Pj8
12362A75l5k4JJ8K2K7L0J8j1l5l4j4%KKJ1J7J3Lkkknmj%lonnkQK6L2J6rk0j7j0nKJ8K6K0K
12343B38j1j0mpj6k0j7j0plLPJj0rMJ6J9J6K0K4J6nj8j0RRj8m6m6j5J7K9K0PKKMKqk2l0k1
12324A02kJ5K3L3M3M5L2J7OLlj2k2k9k9k2j2qnJQMj6l3l4j9kJ1J6J0lj0nNNlmllkPJ7J7Jj3
12304A27k2k2j4QL1L4J6JMQLkKJ1J2J2J6J7Kj7j9lJ2K0L3N3N7K8j5m0l5j4PK0K1Qj2k4k1j
12287C02L0O0O8N1K7J4J2Jj8k7j0K0M4N5O3O5N8M2K4J4Mln%Kmj5k5k5k2j8k1l1m3m6l2j5q
12271E88j2j5j1j0k2l7l7k6j8k2l1l4k9k0j0jlj2j8mJ5K0Pooj3l6n5l9OL5K3mj3LK1K5K2K0
12254B41J9J9K2K2Pj4k6j8opj8k2j3onrrmOJ7K0J2oj5pJ1J6%k6m2m3l2j7NL3M3K4j0k5oK0
$$ y = [60, 52, 37, 34, 57, 102, 152, 184, 186, 167, 147, 139, 139, 144, 153, 168, 187, 205, 220, 232, 239, 239, 228, 203, 169, 139, 122, 112, 102, 93, 96, 115, 145, 179, 207, 218, 205, 184, 176, 186, 193, 175, 140, 116, 117, 135, 157, 184, 214, 232, 221, 186, 152, 138, 138, 140, 142, 153, 170, 183, 186, 184, 182, 180, 175, 171, 170, 170, 167, 161, 156, 151, 149, 157, 183, 215, 231, 222, 202, 185, 175, 170, 172, 190, 216, 236, 238, 227, 217, 213, 206, 190, 170, 153, 143, 136, 133, 136, 143, 144, 134, 125, 129, 145, 164, 180, 200, 224, 240, 235, 217, 207, 216, 225, 207, 161, 115, 100, 117, 146, 166, 173, 175, 177, 181, 183, 175, 153, 123, 102, 100, 115, 138, 171, 214, 259, 291, 308, 314, 317, 314, 302, 280, 251, 222, 200, 188, 180, 175, 176, 184, 188, 172, 139, 105, 86, 84, 95, 111, 121, 118, 108, 103, 108, 113, 110, 106, 103, 100, 98, 105, 122, 139, 140, 127, 105, 83, 69, 77, 108, 142, 158, 159, 163, 171, 174, 172, 174, 185, 197, 209, 225, 242, 244, 227, 208, 205, 217, 237, 270, 323, 380, 408, 393, 353, 318, 304, 311, 331, 352, 360, 348, 324, 303, 302, 332, 392, 460, 511, 538, 552, 564, 565, 547, 520, 510, 530, 574, 629, 692, 757, 815, 857, 881, 895, 899, 896, 891, 891, 893, 889, 874, 849, 824, 802, 784, 763, 732, 689, 643, 611, 596, 588, 576, 561, 550, 540, 518, 481, 444, 418, 400, 378, 347, 313, 284, 264, 254, 253, 250, 238, 220, 216, 231, 251, 258, 252, 246, 233, 197, 142, 103, 109, 144, 167, 163, 150, 153, 174, 199, 221, 241, 260, 279, 301, 323, 330, 316, 290, 272, 266, 259, 241, 219, 206, 200, 195, 186, 177, 173, 179, 196, 216, 228, 222, 207, 200, 211, 227, 227, 201, 159, 116, 84, 67, 72, 105, 148, 172, 162, 137, 131, 151]
12236A51K4J1NRQrk3k0j4j1pJ2L3L8K6J3Pkj9l2k9k6l4m3l4pJ9L1L0K0J0RK3M0L9J3j4j7n
12219B25lk0l9m0k9j8j7j7j4j3j2jK7N7O3L7Jj3j0j0j5j4KJ4J1%j3k6l7l8k4j0jJ3L7N5M8
12203A56K2LmmrrnmnkJ%plJ0J9J5Jj4k7k5kK6L4J9Ljmj0kK3M3M2K4Qj1l4m6k9JJ0ok0j6ml
12183A54qj3j1p%NNkqpjPJ1J2OkKJ5K8L3K4kl5n9n2k2NJ9K7M1M4K5pl0l5k6rRJ6J0jkQK1K2
12164B10Qj2k5k4j4njPK0K4J4KjKK%%%jMJ7K8J7rl3m0l5k7j8oNJ1J4J4J2Loj5j8j2LK0L2K9
12145A96J6Jrj6j7j4pqj6k9k8pK2M0L3J4NJ3K1J4jj8k7l4l5k2JJ6J2jqolmKK0L7L7K2Nj1k5
12126A81l2k2kJj7l2k1RK2Mj8k1JK0K2J1JKJ5K7K9J7%lNJ0%j9l3l6l7l1j3J1J3j0k9j9OJ5
12109B7OPK5L4K2Kpj5k7k9qK4L3K0Kqj3j4jK4L7K7NjJ0K1J2j2l3k6LK4K3Lj5k5k8k3r%j2l1
$$ y = [151, 175, 186, 191, 200, 208, 199, 176, 156, 142, 131, 124, 136, 169, 207, 233, 246, 253, 251, 232, 200, 171, 145, 111, 68, 34, 27, 46, 77, 107, 127, 137, 146, 169, 209, 248, 261, 247, 230, 225, 222, 202, 163, 123, 94, 76, 59, 42, 28, 15, 3, 2, 29, 86, 149, 186, 187, 174, 164, 154, 139, 125, 127, 141, 152, 152, 139, 113, 76, 38, 14, 4, 3, 16, 53, 108, 156, 178, 181, 177, 173, 164, 155, 150, 146, 141, 139, 140, 140, 133, 130, 140, 159, 174, 175, 161, 134, 109, 107, 133, 167, 186, 189, 188, 184, 174, 172, 195, 238, 280, 304, 312, 301, 267, 221, 192, 193, 203, 197, 177, 161, 157, 154, 146, 133, 122, 115, 115, 120, 125, 123, 115, 108, 107, 114, 125, 137, 143, 141, 143, 158, 186, 219, 243, 241, 206, 147, 95, 73, 78, 97, 124, 165, 209, 234, 227, 197, 162, 136, 127, 136, 152, 162, 161, 159, 167, 188, 210, 218, 206, 181, 157, 143, 138, 137, 144, 164, 188, 202, 204, 203, 205, 207, 207, 207, 207, 206, 210, 227, 255, 272, 263, 230, 190, 155, 128, 110, 104, 109, 120, 134, 148, 160, 163, 157, 142, 124, 112, 115, 135, 167, 196, 212, 213, 204, 188, 171, 157, 150, 142, 126, 97, 69, 62, 84, 124, 157, 171, 176, 189, 210, 224, 223, 205, 178, 144, 109, 87, 88, 104, 116, 115, 107, 101, 98, 94, 96, 116, 153, 190, 212, 217, 206, 181, 149, 127, 125, 126, 109, 77, 56, 65, 87, 91, 73, 52, 53, 73, 95, 106, 107, 109, 124, 151, 180, 197, 197, 194, 199, 209, 209, 190, 157, 121, 84, 53, 40, 51, 64, 54, 25, 6, 12, 27, 33, 40, 65, 99, 121, 123, 116, 101, 74, 45, 37, 61, 94, 114, 116, 108, 95, 81, 80, 104, 141, 168, 173, 172, 182, 203, 215, 203, 170, 144, 147, 171, 194, 197, 182, 157, 129, 106, 97, 97, 85, 54]
12091E4l2j5mqpJ5M5N1L2Nj9l7m1l1j1LJ6K5K5J1mjJ1J5J2J4K6K8Rj2j4JJ4J6Qmj6k3k4j8
12073A15j8k7m3m6k4J8M6L5%k1pJ8J8kj4lJ4K3K7L4L7K1j1l7m9m6l4nL1N2M4K2RQMknKPPR
12056B07J6J3JqkOjk3m4n5n1l3nJ8K3J8K1K7J9ql8n3m3j6J1K1J7PQK3L9M7M4L1J4Jnrj8k4
12038A96j8pnj6k7l3l7l9k2NK1J4lrjJ0K5L6L6J6j0k5k0mJ8L8M5L5J7jj7k9k6j1%kmRK3J5
12021A93jmQJ1lj1okoqmj0l0m1l1k1k6k8lL9O1M7K9K7L5K8Kl1m5m3l4l5l7k7j0jm%K4N1N6
12003A09M1K4QorQK6J8oj5MK3K2J6J2Nj1j3LJ2ol3l5j7nppnqj3jK0K7J7NkpqNL1L9K3%j6k1
11984B47k7k6j5kKjlorlPJ0Lm%Lrk7l5k9j5%J7L0L0K0J6J8J6Npj0rj7l2m0k6NK4J5kJK3L5
11965A73J3k8n1m8k7lJ9L2K6Opm%lpkQPrk3k2j1nprNK8M6M2J8pk0j1KLqj5oNLnNL1M4K3qk6
$$ y = [54, 22, 7, 3, -5, -12, 3, 48, 99, 131, 136, 117, 80, 39, 8, -3, 0, 16, 41, 66, 77, 73, 72, 83, 98, 110, 124, 150, 178, 187, 175, 161, 162, 176, 192, 200, 196, 180, 157, 133, 115, 97, 70, 27, -19, -43, -25, 21, 56, 56, 35, 28, 46, 64, 62, 48, 45, 59, 82, 109, 143, 180, 201, 190, 153, 104, 58, 24, 19, 50, 102, 146, 168, 177, 185, 189, 187, 182, 184, 191, 198, 207, 223, 236, 237, 229, 227, 233, 232, 209, 165, 110, 59, 26, 21, 39, 62, 80, 101, 128, 147, 139, 101, 48, 5, -11, 0, 21, 38, 45, 53, 76, 115, 162, 206, 237, 251, 252, 247, 238, 220, 196, 178, 171, 166, 150, 123, 90, 53, 14, -8, -3, 18, 32, 29, 20, 19, 29, 54, 90, 126, 142, 132, 107, 87, 83, 101, 139, 184, 219, 236, 235, 218, 189, 163, 152, 152, 150, 146, 155, 178, 193, 192, 188, 196, 207, 204, 193, 187, 185, 179, 171, 167, 157, 127, 86, 55, 34, 8, -20, -23, 16, 77, 124, 153, 180, 215, 243, 245, 214, 169, 126, 92, 57, 20, -7, -17, -18, -22, -22, 2, 53, 109, 150, 174, 182, 176, 167, 175, 201, 219, 213, 198, 202, 225, 247, 263, 275, 280, 269, 256, 259, 271, 265, 232, 197, 180, 175, 168, 161, 156, 148, 135, 134, 154, 181, 198, 203, 201, 194, 186, 191, 222, 261, 284, 284, 268, 247, 220, 194, 179, 177, 179, 178, 175, 169, 160, 157, 164, 174, 177, 173, 173, 176, 167, 140, 105, 76, 61, 61, 78, 108, 138, 158, 174, 192, 208, 213, 206, 196, 187, 170, 138, 98, 72, 77, 101, 116, 114, 115, 138, 173, 186, 158, 107, 59, 32, 29, 48, 80, 106, 112, 105, 101, 101, 98, 91, 89, 97, 104, 95, 72, 50, 39, 34, 27, 18, 23, 51, 97, 139, 157, 150, 130, 119, 121, 124, 116, 101, 95, 100, 103, 98, 103, 134, 178, 201, 193, 167]
11944A67k5k3j9nJ0J0oj6j1LJ1J7K1K2K1J6Rok7l8l9k8j2MJ5K1K8L8M1K8J4QRjj3j6qj2k6
11927A82k5%K5K0rm1o0o1l5QM1L9J9PPkk1l5k8j0NJ4J3lk0k0MK9L5K3Poj4k0j9j3mNJ2J5J7
11910H1K1K5K6K5K8L2K8J0mnkj2l1l5j4J3K4K1J8K0Rj5l8l6j5OJ9K4K4J4lj1mKlj1rJKj1k9
11892A85l3j9J1M1N3M2J6ok0k8l3l3k8j5LJ0jj9j8QK9K3OLR%j7j3J9L6J6j6k3nJ0J2RNkmN
11874B18J0jj9k2nQJ3J9K7K5RjNJ3Lj9l1k4r%NPMoj6k1j4jPJj8k8k2mJ2J9K4K8K1Kj9k8k3
11855A49j6j2lQJ0%j4j9j3mMJ9L2K8OqjK0K6J4krj1j8l0l4k3JK1K1MrnNJ1RRKj4k8k1KK5L1
11836A63L1L1K2Qmpj4k8l4j6J0J9Nj4k5k9k4rQJ4QJ1K0J6pk8j9PJ9Mk2l4k6j3qmOK1K1ml6
11819C9m5k9lJ5K3L0K6J1KJ5L6L6J6NJ6K9K2jj5j8j3j0mmj7l2k8JL0L5J0k3m4l2JL2L1Kk5
$$ y = [167, 142, 119, 100, 95, 105, 115, 109, 93, 82, 85, 96, 113, 134, 156, 177, 193, 202, 196, 169, 131, 92, 64, 52, 56, 71, 92, 120, 158, 199, 227, 241, 249, 258, 257, 244, 228, 220, 208, 182, 157, 157, 182, 202, 193, 152, 92, 31, -4, 4, 45, 84, 103, 110, 117, 115, 94, 59, 31, 21, 26, 40, 53, 50, 30, 10, 14, 43, 78, 101, 108, 102, 88, 68, 49, 36, 32, 37, 49, 64, 81, 102, 127, 153, 178, 206, 238, 266, 276, 272, 267, 265, 253, 222, 187, 173, 186, 210, 231, 249, 269, 278, 263, 225, 189, 174, 180, 199, 223, 247, 261, 258, 247, 243, 245, 242, 231, 222, 223, 225, 214, 185, 152, 133, 144, 185, 238, 280, 296, 290, 270, 242, 209, 176, 148, 133, 136, 146, 145, 126, 108, 116, 145, 168, 174, 177, 186, 186, 169, 156, 175, 211, 227, 211, 188, 183, 193, 205, 214, 219, 217, 213, 218, 228, 227, 208, 186, 181, 189, 202, 221, 248, 273, 282, 281, 286, 299, 302, 283, 252, 228, 219, 219, 224, 231, 235, 229, 213, 192, 178, 177, 184, 185, 167, 139, 117, 113, 125, 144, 168, 196, 217, 219, 200, 172, 149, 133, 121, 118, 126, 136, 136, 122, 103, 90, 86, 90, 109, 141, 169, 175, 167, 166, 186, 212, 226, 224, 215, 204, 186, 156, 122, 99, 100, 121, 142, 146, 137, 132, 137, 148, 157, 166, 168, 154, 126, 105, 107, 132, 163, 194, 225, 247, 255, 251, 244, 230, 202, 168, 152, 162, 181, 186, 172, 147, 118, 94, 85, 93, 107, 115, 126, 146, 162, 155, 127, 108, 115, 134, 138, 116, 82, 56, 43, 35, 31, 37, 58, 79, 75, 39, -6, -35, -38, -23, 0, 30, 56, 67, 69, 84, 120, 156, 172, 177, 193, 222, 244, 243, 228, 210, 197, 187, 183, 179, 162, 130, 102, 103, 133, 168, 178, 155, 111, 79, 80, 112, 143, 145, 120]
11802A20k3mQLpj0j0j7k4j9kJ8K9L5M1M1K9Qoj0j8l6m8l5nRok5k3pOMmqpKJ6L1L3K6K3K0J1
11783A59JkMOJmLJ0Poj4rllqqnjkoj0j6j9j6pOOok0j8lOJmQK8L5K0Jj0qnmJOOnj2nJ1K2J9
11760A28J0Lkqj6j7j3j2j2pQK0J5mk0j8nPQNJnj3k2k2j3lPJ7L3L9K8Lk0k9k3j3LK3L6K8Lj9
11742A09k0jJ7K1Pj3l1l8k8j0OJ2J3J6K3K5J8QOQMj3l8n2m7k5%K0K7K3J3QJ2J7J1%mOJ2%j3
11724A09pK1M2L7J3llMJj2k3k1pJj2l4l4rJ6J2j1k5j6lJLJ2K9L6K2pl5m2k4nKKJ2K9L0J2l
11706A10OK2K5J1lrj1qRL2M1K2rk6j7qk1n1o4m1oLrj3J4N0O0M0J2qk0k7k6j5jOOQJ2J8J2%
11688A26pKJ5J3jpPK2J7KplJLJ0K0J5%j5j9j9k4k8k5j2KJ1RK%QJ6J4OOJ0O%jKkrq%mk3l9m2
11667E0m2m4m1j5K2M6N2M7L6K0J1K0L5L4Pk2l2k3rmqj0olmqjJ7K7J8OJ0K9M6M4L0J2Jnj1k4
$$ y = [120, 97, 93, 101, 104, 97, 87, 77, 60, 36, 17, 15, 33, 62, 97, 138, 179, 208, 216, 210, 200, 182, 146, 98, 63, 58, 67, 61, 36, 13, 6, 12, 16, 12, 4, -3, -1, 15, 46, 79, 105, 128, 148, 159, 160, 158, 162, 168, 169, 165, 168, 178, 185, 179, 165, 156, 153, 150, 142, 134, 129, 128, 126, 120, 110, 94, 75, 59, 52, 58, 64, 58, 38, 20, 17, 23, 24, 20, 28, 56, 91, 111, 112, 102, 94, 89, 85, 86, 92, 98, 93, 81, 76, 87, 109, 128, 138, 141, 139, 131, 115, 98, 85, 73, 61, 54, 62, 82, 97, 93, 73, 55, 50, 57, 65, 70, 71, 66, 53, 31, 9, -4, -7, 0, 17, 50, 89, 117, 120, 100, 71, 48, 35, 38, 61, 97, 125, 128, 109, 89, 88, 105, 126, 133, 120, 89, 51, 23, 13, 19, 31, 44, 60, 83, 108, 126, 134, 140, 148, 152, 139, 101, 49, 2, -23, -23, -3, 24, 47, 60, 68, 80, 97, 108, 108, 104, 110, 122, 122, 109, 102, 123, 165, 202, 215, 212, 209, 213, 214, 202, 179, 158, 151, 152, 140, 106, 72, 63, 79, 91, 80, 55, 39, 36, 37, 40, 52, 81, 117, 139, 132, 97, 55, 31, 26, 28, 30, 42, 71, 101, 113, 110, 116, 138, 163, 174, 171, 162, 151, 143, 152, 184, 225, 247, 238, 212, 195, 187, 166, 115, 51, 10, 4, 7, -2, -15, -1, 49, 109, 149, 161, 153, 133, 106, 80, 65, 64, 70, 76, 84, 96, 114, 126, 126, 119, 121, 136, 149, 148, 141, 148, 170, 187, 189, 182, 179, 180, 183, 193, 213, 228, 228, 213, 194, 175, 151, 123, 98, 86, 88, 99, 108, 110, 110, 118, 134, 148, 154, 160, 170, 176, 176, 175, 177, 175, 166, 158, 158, 154, 131, 92, 50, 8, -36, -77, -92, -70, -24, 28, 75, 111, 131, 142, 162, 197, 231, 238, 216, 184, 161, 152, 148, 140, 130, 124, 121, 117, 109, 108, 125, 152, 170, 176, 186, 215, 261, 305, 335, 347, 348, 343, 332, 308]
11649C08m5n8m9l1k6l0k6nJ4J5PMJ2J9J4mk7m1l3rJ3J8J4J8L7N6N2K1k1m5l8j8jNRJ3J1Lk
11632A54LOKpj0rj0j0kJ4K6K1Mpojlj4k4k5j9j1KJ6K2K0J6K0K2J3oj6j7j3nJ6L8L2om7o0m2
11614G7k0j0ollmkkqj1mJ4L0M3N9O7N1J0k6l8l2k7k5j8qkjMJ4K3K1J7J4J0Jj5k8l0k5j4mN
11596I4J1J5J0kj2oRK6L5K9Qj9l8l7k7k3k3j2J1K7L0K6K7K4J4Kmqj2j5j0lJPJ4J6Okmj2l2
11578A41m5l4j0%o%J8K2Nq%J5K0J9K8L4K7J1Lmk7n5o9o0l9j8%Lrj9rJ0J2JLK5L7K2jnJ4K9
11560H1K7J0j3l6m9m6l3k0j1ommjOJ8L2M2M0K9K0K3K4Qj8k7j1Ljj0ML0M5M2L1J7kk2l2k6r
11542A51QJ8Rj7l8l9k3qJJ1J8Qn%K0L2K1MNQjk0l0k9l2l4j9J2L1K1JlJ3K8L1K4K0K1K4K4J9
11525B85Pj0k8l6k5lJ3Rpj6j5j4k1k5pJ8K2jk1j4QJ1rj6OL1K9RJJ3J4qk5j2K4M2K2j1k8j9
$$ y = [308, 263, 205, 156, 125, 99, 69, 43, 38, 52, 67, 74, 78, 90, 109, 123, 119, 92, 51, 18, 9, 22, 40, 54, 72, 109, 165, 217, 238, 217, 172, 134, 116, 115, 120, 129, 142, 153, 156, 154, 157, 163, 165, 158, 148, 139, 129, 119, 117, 131, 157, 178, 182, 175, 169, 168, 165, 151, 127, 102, 83, 72, 74, 90, 112, 132, 148, 168, 190, 203, 197, 181, 164, 151, 146, 162, 200, 232, 226, 179, 119, 77, 57, 47, 41, 38, 35, 31, 29, 27, 19, 8, 4, 18, 48, 91, 150, 217, 268, 278, 252, 214, 182, 155, 130, 112, 104, 102, 101, 105, 119, 142, 163, 180, 194, 204, 205, 190, 162, 132, 107, 93, 89, 94, 105, 120, 130, 128, 116, 110, 119, 145, 180, 209, 217, 198, 160, 123, 96, 73, 50, 38, 49, 76, 106, 132, 159, 183, 197, 199, 195, 187, 175, 160, 150, 147, 148, 155, 169, 185, 191, 189, 185, 173, 141, 96, 62, 52, 52, 46, 46, 64, 86, 91, 83, 83, 98, 118, 137, 165, 199, 226, 237, 240, 236, 209, 154, 85, 25, -14, -32, -32, -29, -38, -57, -66, -56, -44, -43, -40, -15, 22, 44, 43, 38, 52, 81, 108, 118, 105, 69, 20, -26, -59, -79, -90, -96, -100, -104, -105, -99, -81, -49, -7, 33, 62, 82, 105, 129, 137, 119, 92, 81, 84, 83, 73, 77, 107, 152, 194, 225, 242, 240, 218, 186, 160, 151, 159, 177, 186, 169, 131, 92, 69, 61, 62, 73, 91, 99, 94, 94, 114, 146, 167, 171, 176, 184, 183, 163, 133, 104, 72, 38, 19, 31, 62, 83, 84, 81, 94, 122, 153, 177, 197, 218, 242, 266, 285, 292, 282, 254, 218, 193, 190, 203, 212, 205, 189, 174, 160, 139, 114, 107, 125, 147, 146, 125, 111, 119, 130, 121, 105, 111, 142, 171, 180, 181, 194, 208, 200, 175, 163, 187, 229, 251, 240, 212, 193]
11507A93jJ2K3L3K8mm7p2o1l2j1pnjKPJ6K6K6J4QRPoj5qLMKJ4K8K0ok3j8j2j6j9qJnj8j5J
11488F7RJ0J9L3K5kk0j2Jok3k9j6kQJ9L7M8M4L0J0pj6j5j4k2l1k7j1LQJ0Pmj2qLLmKK5M5M0
11470B25K3Pkj4k0j2KOnj6j9j5rj1k5m3m3j8J4K4J3NQRLJOJ4J4J5J6Ok0l1rL3N0K7rk6j4Q
11451A68J4Jk2l5k6lK1L3K5Lk1k5oQjk9m0k6kJ4K0J9J3NKjj0k1j6J3M1L9J2j2qJ1K6K9K1J1
11434B45kj1j2qlnj2k2k8l3l9l7k7rMJ7K8L3K9J6QJ4K6L3K3Pj3k9l7l6k0mKLJ0L4N5M5Ll6
11417B12m4k3lnj6j3PK5K5J4QJ1J1kk5m2l7k0kQJ6K6K9J9Korj6k8k6jK6L1J4qk3m1n5m9j5
11399b5K4L4J7ljK0L6K7NrlJ2Ok1m3l5nJ3Pl%J3K0J3jj2j4j1rj3j3jK0K8J4mjJ7K9K0KmNJ7
11380A68J6Mj1j7j2%J3J4%k1l8m0k5nJ1J4O%RL0M2L3J4LKjrj3njmroLOOM%j3k6k4j3lJRJ6
$$ y = [193, 192, 204, 227, 260, 288, 284, 237, 165, 104, 72, 61, 54, 49, 48, 50, 57, 73, 99, 125, 139, 147, 156, 163, 157, 142, 134, 137, 141, 143, 157, 185, 205, 199, 176, 158, 146, 130, 111, 103, 104, 99, 81, 66, 67, 76, 86, 105, 138, 163, 161, 141, 129, 130, 124, 101, 72, 56, 54, 62, 81, 118, 166, 210, 240, 250, 243, 227, 212, 198, 176, 145, 118, 107, 110, 118, 128, 135, 131, 119, 111, 114, 117, 113, 115, 140, 185, 225, 248, 255, 253, 239, 219, 207, 209, 215, 210, 194, 175, 160, 151, 140, 115, 72, 29, 11, 25, 49, 62, 67, 75, 84, 87, 88, 94, 108, 122, 137, 153, 159, 139, 108, 99, 132, 182, 209, 200, 174, 160, 168, 182, 183, 161, 126, 100, 97, 118, 151, 176, 179, 158, 133, 127, 135, 134, 105, 65, 39, 37, 51, 71, 90, 103, 108, 110, 109, 99, 78, 62, 75, 116, 155, 167, 155, 147, 158, 184, 213, 234, 245, 243, 232, 220, 212, 209, 204, 192, 170, 142, 109, 70, 33, 6, -3, 1, 18, 46, 79, 108, 124, 132, 146, 172, 205, 228, 235, 222, 193, 156, 120, 100, 96, 98, 101, 111, 145, 200, 245, 248, 212, 168, 145, 142, 137, 121, 108, 115, 140, 165, 179, 187, 198, 209, 207, 182, 140, 103, 83, 81, 89, 105, 131, 160, 179, 181, 175, 166, 150, 122, 96, 95, 121, 152, 166, 158, 135, 94, 39, -10, -25, -1, 33, 50, 47, 46, 66, 102, 129, 134, 125, 122, 134, 140, 119, 76, 41, 36, 49, 56, 53, 53, 66, 86, 99, 98, 86, 72, 61, 52, 39, 26, 25, 45, 73, 87, 83, 82, 99, 128, 148, 150, 146, 151, 168, 184, 188, 177, 160, 148, 148, 161, 175, 175, 154, 116, 76, 51, 46, 57, 71, 77, 77, 86, 116, 158, 191, 205, 208, 210, 209, 200, 187, 182, 181, 177, 168, 162, 165, 171, 177, 181, 181, 168, 142, 118, 105, 102, 103, 112, 128]
11360A28J0JMK0L0K0Kj3k6m1m5k8NK5J9JokLkj2j9j7j1lJLJ%LJ3K1K2J2nk4l9m0k2%J1OJJ1
11341A8K8L7K3%j2kJ4J6%j0mNLrj1JK1L3L3J8j5m3m3j6J1J1qj8j1QK4L1L2K9K7K4J2nj6j4
11324B22%J2J7J8J4QMjj2k9m3m3l3j8kJ5K9L3K1kk9m7m8l8j9KK5L5K7Lj3qNJ4J2jj9l2k3L
11307E9J8RrpORPJ8M4N4L3jj5oPRnk5l3j7J1K5J8J0J4J7jl1l8j8QJ1jj0qrj4j5LL0L9K7J2
11288B35QJ1Lj2k0j7j4k1k1j0QJ3NmJJ7K3J1qj2%Qkk1l0k3j6j6j4jK0L4L8K8J7J2Qlk8m6l6
11270A25pJ3J2L%J%NRol9o0m0LK5J1rrNJ9L1M3M6K9jk7l6l4k5k0j6j1lPJ3J5J1Jqj0kJ2K4
11252A00K6K5K0J2kk3l5k6%K7K8Mj9j7JJ3J3Ojpj2j3j3j4j6qJ1K8L4L4K6J1pj1KJ7J5lj5j2
11234A99kOJ2J5Qpk1j7KK0K2Qmj1j4j5j4j0ppkNRJ1J2J3Rnj9k0r%kj0j4j4j4j1nPK5L9M2L5
$$ y = [128, 138, 139, 143, 163, 193, 213, 215, 202, 176, 135, 90, 62, 67, 92, 111, 112, 106, 104, 107, 105, 93, 74, 57, 46, 43, 44, 47, 48, 48, 51, 64, 85, 107, 119, 114, 90, 51, 11, -11, -11, 0, 6, 7, 18, 46, 83, 106, 106, 94, 92, 106, 122, 122, 112, 108, 113, 116, 107, 96, 97, 118, 151, 184, 202, 187, 144, 101, 85, 96, 107, 99, 81, 70, 78, 102, 133, 165, 194, 221, 245, 257, 252, 236, 222, 222, 234, 251, 269, 283, 291, 295, 294, 282, 253, 210, 167, 134, 116, 114, 129, 158, 191, 212, 210, 181, 134, 86, 48, 29, 31, 56, 91, 118, 121, 108, 100, 105, 119, 131, 130, 111, 79, 56, 59, 77, 86, 77, 70, 76, 85, 92, 110, 154, 208, 241, 240, 225, 219, 226, 235, 230, 205, 172, 155, 166, 191, 209, 219, 233, 250, 249, 218, 180, 162, 170, 181, 180, 170, 162, 153, 139, 124, 127, 157, 196, 223, 235, 243, 254, 257, 245, 225, 208, 194, 173, 152, 142, 150, 163, 168, 164, 165, 182, 205, 216, 208, 196, 196, 204, 202, 181, 151, 128, 112, 96, 82, 81, 101, 135, 173, 201, 218, 230, 238, 235, 207, 161, 125, 118, 131, 143, 146, 146, 147, 147, 152, 161, 155, 116, 56, 16, 19, 44, 55, 46, 37, 42, 61, 92, 135, 181, 210, 209, 182, 146, 112, 87, 67, 51, 40, 37, 44, 57, 72, 83, 84, 76, 66, 64, 76, 100, 126, 151, 171, 183, 181, 158, 123, 97, 97, 124, 152, 156, 137, 120, 121, 134, 147, 153, 152, 145, 133, 120, 107, 93, 77, 69, 80, 108, 142, 176, 202, 213, 206, 195, 197, 214, 229, 226, 211, 199, 197, 203, 215, 230, 238, 231, 210, 193, 195, 215, 237, 245, 241, 230, 216, 201, 187, 177, 170, 163, 161, 166, 175, 186, 198, 211, 220, 215, 196, 176, 167, 167, 165, 155, 141, 127, 113, 102, 97, 104, 129, 168, 210, 245]
11215B45K4J5J0KjL%j2l0l6l1l0m1m6l1%K8L8K8Qnj0oprkJ5K9K6Rj5k6j6PK2Rj9l6l0j8j2
11197D9rKK1L3L4L1K2Qj4l1l8l1j4%NKQK0K3J1mj0j1k0k8k1KK0K5K4K3J4nj8j3nj3l2l7j7
11180FORmj0mQJ5J8K5K9K6K2K3K6J7j2l9m4k2QK9L8L1J4knMPlj3j7k2k6k3lJ9K2RJRJ9J4p
11161A98k9l5k4nPJj2j6LK7M1M1L7L2J8ol0l9l5k7k2j9j9j9j4kRJ2Qlqj1j1qnolMK2L7M0K2
11143A51kj5oRJ0nj8pJ3J5j0l1k0J0L1K9J6%j4k7k7j5mnj4k0j7kJ8L2K0j0k5mL0L7J6nlKm
11125A29j2qNOpj9k0j6j7j9k2l1l9l1kK9M2L0Mj5k5k2oJ4K9L1K7K0K0K2K2J6RRJ2Opj5rPJ8
11108A65K1J2lj6k1k0k4l4l1j2RJ0kmJ3L1L4J8mj7j6JJ4J3%%J7L2K5nl8n6n1k5LJ2%j6j3J
11090B3J0Jrj2j1j2j7mK3M6M2J2j3j1MJ6J8J9J9J0kjJ2J3j0l4l1j1jorkLJKJ7K7K2J5K0L4
$$ y = [245, 269, 284, 294, 296, 295, 298, 298, 286, 256, 220, 189, 159, 118, 72, 41, 41, 69, 107, 135, 143, 138, 128, 122, 115, 106, 104, 119, 148, 174, 183, 168, 142, 126, 133, 155, 164, 145, 109, 79, 61, 49, 40, 42, 63, 96, 130, 161, 183, 191, 177, 146, 108, 77, 63, 63, 68, 70, 78, 98, 121, 132, 128, 118, 107, 87, 59, 38, 40, 60, 85, 109, 132, 146, 141, 123, 110, 105, 92, 60, 23, 6, 12, 21, 17, 7, 3, 11, 26, 44, 69, 98, 124, 146, 169, 195, 212, 200, 161, 117, 95, 103, 132, 170, 201, 215, 213, 208, 212, 219, 216, 203, 186, 164, 138, 115, 112, 131, 153, 162, 163, 172, 191, 205, 198, 169, 134, 110, 105, 112, 113, 101, 85, 88, 115, 156, 197, 234, 266, 284, 278, 248, 209, 174, 147, 125, 106, 87, 68, 54, 52, 61, 73, 81, 78, 70, 59, 48, 40, 35, 29, 26, 30, 52, 89, 129, 151, 149, 134, 128, 137, 147, 142, 124, 117, 130, 145, 135, 104, 84, 94, 125, 154, 170, 170, 156, 129, 102, 87, 83, 78, 64, 44, 27, 25, 43, 75, 95, 85, 60, 56, 86, 123, 139, 134, 131, 133, 129, 117, 109, 114, 120, 113, 94, 74, 58, 41, 22, 0, -31, -70, -101, -103, -74, -32, -2, 2, -13, -38, -60, -66, -52, -23, 8, 35, 55, 75, 97, 119, 135, 144, 153, 165, 171, 164, 149, 140, 147, 165, 186, 198, 195, 179, 158, 138, 114, 80, 49, 37, 46, 56, 54, 50, 63, 94, 128, 146, 142, 125, 109, 110, 124, 137, 137, 137, 154, 186, 211, 206, 168, 112, 61, 36, 39, 51, 51, 35, 22, 23, 33, 34, 25, 13, 2, -10, -27, -31, -8, 38, 80, 92, 79, 68, 72, 88, 106, 125, 144, 154, 152, 151, 163, 176, 166, 132, 101, 90, 89, 83, 74, 72, 75, 76, 78, 95, 122, 144, 159, 179, 213]
11072B13L2Pj7k2pmk8n9o2k6K1M1K9J2J1J9K3J7QNPOmj8k5k1j2j1j9k0j2jkopl%KQK0L1L5
11054A61K7J7RNL%%%KKJJoj7k6k2j5j7j9pK1L9K9Lj4j3mJoj3j2lKoj5rJ1K0Oj8k8j8pmpnJ
11034E0Llj0kK4M9M8J4k3l0pK7M6L4Jk8l6l1k7k3lK9M4K5j0k6k0j3rJJ2J2mj5j0MJ5J6Qjp
11016A24nJMkj5k5k7j3J1K5J6LOK1K8K0RMmj9k8k8j9j3j0opj0rKJ5K1K3J8R%l%jJJ1K6K3j
10997A76k2j8jMqj6pJ3K8K6Ll1m9m1k0j0r%J4J6M%J3K7K5Nj2j4nPJ7K0J9J1Loj5k1j7pJMj
10978A06nJJ6K5J1j8m0l3jK8L9L1J8Qrl0m4l5j0J5K9K9K2J1JjKlj4j7mMrl5m4k9rLNJ3K3K8
10960G8K3J4Kqj2pNJ4J7R%ml%%mpllnj2j8j4%J7K3J9J6J7J5PMJ5K5J4qj4m%j5l4l3j5JJ3K6
10940A51M0M3K8%k5k9j2QLk5m9l6JL3M0K6Oj0j8pRJ3jj1jJ8J9jj7j3%Nmj0qJNKnj3j6j5j3
$$ y = [213, 245, 252, 235, 213, 206, 202, 174, 115, 53, 27, 48, 89, 118, 130, 141, 160, 183, 200, 208, 213, 220, 226, 222, 204, 179, 158, 146, 135, 116, 96, 84, 83, 81, 75, 68, 65, 65, 67, 75, 95, 126, 161, 188, 205, 214, 219, 222, 222, 222, 222, 224, 226, 227, 228, 222, 205, 179, 157, 142, 125, 106, 99, 120, 159, 188, 191, 177, 164, 160, 161, 155, 142, 130, 127, 129, 123, 108, 99, 110, 130, 136, 118, 90, 72, 65, 61, 54, 49, 50, 53, 50, 40, 38, 62, 111, 159, 173, 150, 120, 113, 140, 186, 220, 221, 193, 157, 126, 99, 76, 73, 102, 146, 171, 161, 135, 115, 102, 93, 94, 106, 118, 114, 99, 89, 93, 108, 124, 132, 131, 124, 119, 120, 124, 122, 107, 82, 55, 42, 53, 78, 94, 97, 103, 124, 152, 172, 181, 185, 181, 162, 134, 106, 87, 74, 64, 58, 51, 41, 32, 34, 49, 70, 93, 111, 120, 120, 117, 117, 116, 117, 128, 154, 177, 176, 154, 136, 135, 139, 131, 115, 108, 121, 149, 175, 178, 147, 98, 57, 37, 27, 18, 18, 32, 48, 52, 52, 65, 92, 117, 122, 110, 96, 91, 98, 115, 135, 154, 165, 168, 162, 147, 126, 109, 102, 103, 107, 106, 101, 102, 118, 143, 154, 136, 96, 63, 62, 90, 129, 160, 178, 186, 177, 147, 103, 68, 58, 73, 102, 131, 153, 164, 165, 164, 166, 163, 149, 132, 128, 132, 123, 88, 44, 15, 6, 9, 14, 27, 50, 78, 101, 115, 117, 109, 97, 90, 95, 109, 126, 135, 135, 131, 128, 128, 128, 124, 117, 114, 111, 106, 94, 76, 62, 62, 79, 102, 121, 137, 154, 169, 176, 180, 195, 220, 234, 226, 212, 208, 208, 193, 159, 126, 111, 112, 125, 151, 191, 234, 262, 262, 237, 208, 196, 204, 207, 182, 133, 97, 98, 131, 171, 197, 203, 193, 175, 168, 177, 190, 189, 178, 177, 195, 214, 213, 196, 183, 183, 188, 184, 174, 166, 167, 172, 174, 169, 156, 140, 125, 112]
10922A12j8k5j4K1O1Q2O8L2jj5j2j2k9n0m9k2RJ9J5J1J2OmnPJ4J0PJ1J4RNJ3K0J4K%%j7m2
10904B59n1k8JJ7J0LNJ7K8K3PnlKrl2m8m3k7rMJ4J6J3RKj6m0n3m5k8j4PL9O3N6K3rk7l2k8
10887G1j5NJ3P%%QJ2J7J9J2mj0PL6M4J8k0l9k9nJ3J4Lj1j8j9j6j9j9rOJ1Ln%J2J6J8K9N3O8
10868B77O1L7J9Pql1n3n8m7k7oJnj4mJ8K7J2j0k0j0RK3J9lk9l1qJ1Jk2k5nOkpJ0L2L0Ok0l4
10850A27l5k6j3m%QJ9K4J7K0M2N6L9ml6m1l3k2KL3M1K0pj4j4k4l6k9j3j4l3l9j9MJ4J8J9J1
10834E8mj3jJ9K0Jk2k5j0J0J9J4JjJ3L6M4L0ml2l8j4J4K2Oj6k3j5okLJ2J5J6J8J9J2JPL0M6
10816B60K6j9m5l5pNlrmOJ0J0Njmprj8j7nPlk4l1j6nj0j4LL0L9L7M0M0J8k5m9l9j6oqJJ3J3
10797A34mk2k0mJ7L0L3K9K0Rrk4k4pJ3J6Lj3k0j6rpj1j7j8j3plQK7M2L4Jl3m1k2OK0J5OJk
$$ y = [112, 94, 69, 55, 76, 137, 219, 287, 319, 318, 303, 291, 279, 250, 200, 151, 129, 138, 157, 172, 183, 195, 201, 197, 192, 199, 213, 223, 230, 241, 255, 264, 269, 282, 302, 316, 318, 318, 318, 301, 259, 208, 180, 181, 198, 208, 211, 216, 233, 261, 284, 291, 286, 283, 285, 276, 244, 196, 153, 126, 117, 121, 135, 151, 164, 173, 175, 159, 119, 66, 21, -7, -21, -14, 25, 88, 144, 167, 158, 131, 99, 71, 56, 61, 74, 81, 81, 81, 89, 101, 118, 137, 149, 145, 135, 142, 178, 222, 240, 220, 181, 152, 147, 160, 174, 177, 166, 148, 129, 113, 94, 75, 66, 72, 83, 86, 81, 81, 93, 109, 127, 156, 209, 277, 338, 375, 394, 401, 393, 362, 309, 251, 204, 177, 171, 172, 167, 153, 149, 167, 194, 206, 196, 176, 166, 175, 198, 217, 214, 185, 154, 146, 157, 158, 136, 111, 106, 112, 110, 103, 113, 145, 175, 181, 161, 127, 92, 66, 53, 49, 49, 57, 76, 100, 117, 137, 179, 235, 274, 270, 234, 193, 160, 138, 140, 173, 214, 234, 227, 213, 199, 175, 139, 110, 97, 83, 50, 11, -8, -4, 10, 28, 47, 58, 54, 41, 40, 59, 79, 80, 58, 33, 23, 33, 52, 66, 67, 66, 79, 115, 159, 189, 185, 153, 115, 101, 115, 137, 143, 127, 104, 89, 83, 81, 84, 96, 111, 127, 145, 164, 176, 177, 184, 214, 260, 286, 267, 222, 187, 180, 185, 182, 173, 169, 175, 185, 195, 200, 199, 195, 188, 179, 161, 144, 139, 146, 143, 119, 88, 72, 67, 57, 43, 46, 76, 115, 152, 192, 232, 250, 225, 176, 137, 121, 115, 107, 108, 121, 134, 130, 108, 88, 84, 101, 131, 164, 193, 213, 222, 213, 189, 165, 158, 171, 187, 190, 177, 157, 141, 132, 125, 114, 97, 79, 66, 59, 56, 64, 91, 133, 167, 168, 135, 94, 72, 78, 98, 113, 119, 120, 118]
10779A18mnkMQJ7K9M0L4J2rj6j3qjOROLJ0J8J6Krj3j5j7j6j1rj2j9j4kRQnj8k0j3lJKLKnj6
10758H2j9j0NJ1RL%JRK1K9K4Qlmmj6k6k3j1pj1qMMj4l2k3mMlnRK5K5J8K0K5K2J2J0J5K4K8
10739B24K5J0j5l8m4l6k3j4kJ2K6K7J7J0J5L0L5J6j6l5l0j8j8k4j7LJ6J5Ook0l3l4k1pJ%k
10723C5%LNNMJ3L6N8O4N1K8Kk0k4j5j4l6n4l5J3M2K9jj1qj2j7nK4M0L5J2j2l1l9m0l8l3j7
10706C7OJ9J1JPK5K6QpLK7M0L0Lj9j8KJ9J5lj2j7k2l0k9k4k7l2k4lNnj4jK4L6K7Ok0m0m3j9
10688c2J7L5K1j3l2k1NJ8J2QK0L3K6J0J3L5L9Ol4m2k3m%NJ0Jj5k0qOKomRK0K3K1Rqk1k6k4
10669G1k5k3j6mRJ9J8PjNK4L5K6J4J2J4Jk1k8k1j0ojRPj5m1m1rK8M4L6J3j0j5mJ1Qj0k4k4
10652F2j7j2mMRKokJ3L0L9M0K8Qoqqj7k5j4J0K6K3Rkj7l0k8rOLj0j1JJ2J3J0%j7l0k6oJ2J7
$$ y = [118, 114, 109, 107, 111, 119, 136, 165, 205, 239, 251, 242, 226, 213, 205, 204, 210, 219, 225, 228, 238, 256, 272, 274, 265, 252, 237, 220, 204, 193, 184, 172, 153, 139, 137, 146, 154, 149, 131, 111, 98, 95, 96, 98, 101, 103, 98, 82, 63, 53, 58, 69, 78, 81, 81, 82, 91, 112, 141, 165, 173, 170, 166, 162, 146, 120, 97, 86, 79, 68, 60, 64, 68, 54, 22, -1, -5, -1, -4, -9, 0, 25, 50, 68, 88, 113, 135, 147, 157, 172, 196, 224, 249, 259, 244, 206, 162, 126, 103, 89, 87, 99, 125, 152, 169, 179, 194, 224, 259, 275, 259, 224, 194, 176, 158, 134, 117, 120, 136, 151, 157, 151, 131, 98, 64, 43, 36, 37, 37, 35, 35, 38, 43, 48, 52, 65, 101, 159, 223, 274, 302, 304, 284, 260, 245, 231, 195, 141, 106, 119, 161, 190, 189, 178, 170, 158, 141, 136, 160, 200, 235, 247, 235, 204, 165, 125, 87, 54, 37, 43, 62, 73, 74, 81, 106, 132, 140, 133, 136, 163, 203, 233, 236, 217, 199, 201, 220, 235, 232, 220, 203, 181, 151, 122, 98, 71, 39, 15, 12, 17, 12, -2, -3, 21, 57, 84, 90, 70, 30, -13, -32, -15, 20, 41, 28, -4, -25, -20, -2, 10, 18, 38, 71, 97, 107, 120, 155, 194, 200, 166, 124, 101, 97, 97, 102, 112, 113, 98, 78, 70, 76, 78, 72, 68, 77, 97, 120, 141, 150, 142, 121, 95, 71, 46, 23, 7, 3, 12, 31, 49, 56, 55, 60, 84, 119, 145, 159, 171, 185, 186, 165, 137, 116, 106, 100, 99, 108, 115, 100, 59, 18, 9, 37, 81, 117, 130, 120, 105, 101, 112, 120, 110, 86, 62, 45, 33, 29, 33, 42, 44, 38, 36, 49, 79, 118, 158, 186, 194, 188, 180, 172, 155, 130, 116, 126, 152, 175, 184, 182, 165, 135, 107, 98, 104, 107, 97, 86, 87, 99, 112, 122, 122, 105, 75, 49, 43, 55, 72]
10633G2J5J0kj6j1OJ3ol1m0k9j5kJ9M2N1M4L2K0%k7l7k6rprKK5L9L1J6Lqk2l3l6k8j8nMMm
10614B7j1j1nKJ7K5J4oj3QL5M0K9K5K6J2j6l4k5rlOK4L5Rl3n2l1NK5K9L0K6J7QJqj7j6KJ8
10597B05J2rk3k0j4j1j0oj0k3k8j7PJ8J3K%%mj4k4k7k9k9j6J1M0N3M8K7jk5l6k5PL3L4J0q
10580A11mJ2J1qk5k3rj%MQMj3k9k7kL0N3M9K0j3k7j7okkQK3K8J0j9m1l7rK4L9L2K6L3L3J0
10562B54k2l2j2NQQJ3Qqj9rLok4j9NK1Rj2k4k9l3l4k8j5LK6M5M7K9J2J2J3%j9j4RK2Kk8l4
10544A33nK3K3mk6k2LK2K0Mrrkpk2l0j8MJ9J5MkjLLkj3k7l4k6oJ1J3%j0nJ3K5J9RJ1K6L3K2
10525A78Krj4k8m2m0j7PJ4Kj0j6j2jJ3K1J6Mpj0omoj1j0nJ%lKJ1K0K4K4K0Nj1j6j1qj4k2j8
10506A3lQJ0O%JKmj8k9k9j8j0nJ2L9N3L9RqJJ5J8Ppj4j4o%qk5l1j2J8M5M9L7K0Ll%J1J6Qr
$$ y = [72, 87, 97, 95, 79, 68, 74, 87, 81, 50, 10, -19, -34, -36, -17, 25, 76, 120, 152, 172, 172, 145, 108, 82, 73, 66, 57, 59, 84, 123, 154, 170, 173, 165, 143, 110, 74, 46, 28, 23, 27, 31, 27, 16, 5, 0, 2, 19, 44, 58, 52, 39, 47, 82, 122, 151, 176, 202, 214, 198, 164, 139, 130, 127, 133, 157, 192, 201, 168, 116, 85, 90, 115, 144, 174, 200, 217, 225, 226, 218, 201, 185, 187, 205, 217, 208, 185, 165, 151, 140, 130, 124, 114, 91, 63, 46, 53, 71, 84, 86, 86, 86, 82, 68, 44, 17, -12, -41, -57, -46, -6, 47, 95, 122, 121, 96, 60, 35, 42, 75, 109, 119, 111, 107, 119, 130, 122, 97, 74, 65, 64, 64, 68, 76, 80, 67, 38, 11, 9, 39, 92, 141, 161, 148, 121, 104, 98, 96, 94, 102, 125, 153, 163, 144, 103, 66, 57, 81, 120, 152, 178, 211, 244, 254, 232, 200, 188, 193, 201, 209, 222, 230, 222, 203, 194, 197, 191, 167, 148, 153, 174, 183, 171, 147, 118, 85, 51, 23, 8, 11, 37, 82, 129, 158, 170, 182, 195, 195, 176, 162, 171, 193, 195, 167, 133, 128, 151, 174, 170, 144, 122, 125, 147, 167, 171, 162, 153, 151, 144, 122, 92, 74, 78, 97, 112, 116, 114, 113, 116, 119, 117, 104, 77, 43, 17, 11, 22, 35, 35, 25, 20, 33, 58, 77, 86, 97, 123, 156, 178, 180, 171, 157, 129, 87, 47, 30, 37, 51, 53, 43, 27, 15, 14, 27, 48, 64, 68, 61, 51, 45, 41, 35, 24, 14, 9, 10, 10, 7, 9, 20, 40, 64, 88, 108, 113, 102, 86, 75, 67, 53, 31, 13, 10, 18, 28, 34, 34, 35, 37, 33, 15, -14, -43, -61, -71, -76, -64, -25, 28, 67, 76, 68, 69, 84, 102, 109, 102, 88, 74, 68, 68, 60, 35, 4, -8, 10, 55, 104, 141, 161, 164, 161, 161, 172, 188, 196, 187]
10487A87k0rRJ4lk0j8qmj2k3l0l8l3j3J0J6LqjJ1K2L3M3M5L0J8J8K6J6qk1j3jmk0l0k2kJ4
10470A54J9J0oj3pRJ5Qj1k8l4k9j7kRKj9l7k8JK9L4K3J4J0jj8k5j3jok3l0j5J3L2L5L0K1O
10452A11qmK3M8M3Rk0k2j4j6k3pL0N2L9J4%jpj7j9j4j9l8n0l5kK0K0Orj3qJ1L4M7L6Ok0j5
10435A68J4M1L9Pk5l4k4j2j6k7l4k8j8j4j0OL2N2M8K2mj8k6l3l2j7LJ1Mpj0pmJRJ3Nj1j7q
10417C9QJ6J3PNOQJ6K1J6MMK8M9L7%k7j7KKj3j8j5j9l8m2j8J0J9Qoqj2k0k5k4j2LK4L7L8K9
10399A35K1K3L1K8J1j8m2n0m5l1j2J4L3L2J4JMPmj8k0j4j3j5%K2K8J1LK3M0K7lj4%J7K0Nk1
10382B30m5m8k7lOjLJ5K0J4QJk0m5n2l9k3k1qK1M5M7K6Kk0l4k8jJ6Qp%K4L4K0Lpj6k6j8QK7
10364H9K5J0lj2k0k5j8oPK2L4L3K0RJ1K0K3J2qk6l0j4NOj0k1j5lok0k4j3LJ8L4N0N3M0J9K
$$ y = [187, 167, 158, 167, 181, 178, 158, 140, 132, 128, 116, 93, 63, 25, -8, -21, -11, 5, 8, 0, -1, 10, 32, 65, 108, 153, 183, 201, 219, 245, 261, 253, 232, 219, 218, 214, 194, 164, 142, 140, 154, 173, 183, 177, 164, 157, 166, 181, 189, 178, 150, 116, 87, 70, 68, 77, 79, 60, 23, -5, -4, 25, 59, 82, 96, 106, 105, 87, 62, 49, 48, 42, 19, -11, -26, -13, 19, 54, 84, 105, 111, 103, 99, 122, 170, 213, 222, 202, 180, 166, 150, 127, 120, 150, 202, 241, 255, 255, 254, 247, 230, 211, 197, 178, 140, 90, 55, 53, 73, 93, 99, 90, 77, 69, 80, 114, 161, 197, 203, 183, 168, 182, 223, 262, 269, 244, 210, 186, 174, 158, 131, 97, 69, 51, 37, 27, 33, 65, 117, 165, 187, 183, 165, 139, 106, 74, 57, 60, 71, 75, 68, 58, 51, 47, 48, 57, 70, 75, 64, 47, 39, 47, 63, 76, 83, 88, 94, 102, 118, 139, 155, 159, 163, 191, 240, 277, 277, 250, 233, 235, 237, 224, 206, 191, 172, 134, 92, 74, 84, 103, 111, 105, 97, 85, 65, 40, 16, 4, 7, 31, 68, 106, 135, 156, 179, 210, 238, 249, 231, 189, 139, 94, 63, 51, 65, 98, 130, 144, 145, 149, 156, 152, 134, 114, 100, 87, 72, 72, 94, 122, 133, 136, 159, 199, 226, 223, 209, 209, 226, 246, 251, 230, 185, 137, 110, 107, 113, 112, 115, 130, 150, 164, 172, 173, 153, 108, 56, 17, -6, -27, -35, -14, 31, 78, 104, 106, 86, 52, 24, 23, 39, 47, 40, 40, 64, 98, 118, 121, 114, 98, 72, 54, 62, 89, 114, 124, 121, 109, 89, 64, 46, 40, 47, 69, 103, 136, 156, 165, 176, 196, 219, 231, 223, 197, 167, 153, 158, 164, 154, 133, 118, 115, 109, 89, 65, 52, 55, 73, 107, 157, 210, 250, 269, 271]
10347B71j1k1k5j8rnj1j8j9j4ojOJ6K5K9K3J1Jj0j9k6k5j7JK3M0M0K3mk7l9m0l1j7OK7L5K5
10330A89Kj0lJ3K2J4%j5k3k1oJ3K1J8J2Mj0k4k4j3j1k8m5m2l1k5l0k7j2KRJ0J1J1J2K3L3M1
10313F0M1M4M4L1J5J2K3K5Nk2l1j9jJ1Prk4k2j2j4l2l9j8J7K8J0j1j1%Lj1k5k6j3%NJJPJ7
10296F7J8Qoj4j4j5k1k9l2j7J1L3L6K5J5J6J4Jj7k2qJ2K2K3J8J0jj0j3rnoprj2j3mRJ2LkO
10278G3J9K1J5Ook8l9k3QK0MqRL6L7J6lJJ3K2K1J5Kqj0kKrk6l2k3oMLj1j8j0J3L3L6K2J1J5
10259B15L3M3L3Lk1k5j8j8k0j6kLj1k6k8j6kOJ0J5J5Mrj5j0JOJj0j8j6kPLj7l1k7j0KKoj0
10241A8plNJ9L4M7N2M8L6J8Jj1k5m2n3m6k1MK3L2L0J6mj1mNNLJkrj2j2j0j1mJ4K6J9NLJ0N
10222A92j9l7l2j0QJ4J1lk1l1k3nQJ5J9J6jk1k0OL2L8K7J8J1JrlJ6K7J6j3m0m8m1k6j1lOJ3
$$ y = [271, 260, 239, 214, 196, 187, 182, 171, 153, 134, 120, 114, 113, 119, 135, 160, 189, 212, 223, 224, 214, 195, 169, 144, 127, 128, 151, 191, 231, 254, 250, 223, 184, 144, 113, 96, 102, 129, 164, 189, 191, 181, 178, 191, 213, 227, 227, 212, 189, 168, 162, 175, 196, 214, 226, 230, 220, 196, 172, 159, 148, 120, 75, 33, 2, -23, -53, -80, -92, -90, -81, -71, -60, -49, -37, -14, 19, 60, 101, 145, 189, 220, 235, 247, 270, 295, 300, 278, 247, 228, 227, 238, 245, 236, 212, 190, 178, 164, 132, 93, 75, 92, 120, 130, 119, 108, 108, 111, 100, 75, 49, 36, 36, 41, 42, 43, 50, 67, 85, 93, 87, 73, 59, 44, 23, -6, -38, -55, -44, -11, 25, 50, 65, 81, 95, 96, 79, 57, 49, 61, 83, 106, 124, 134, 133, 123, 110, 101, 96, 90, 83, 74, 62, 49, 45, 54, 66, 69, 67, 73, 92, 113, 128, 134, 128, 100, 61, 38, 46, 66, 70, 62, 71, 107, 144, 160, 157, 158, 171, 193, 214, 229, 231, 223, 213, 211, 213, 204, 178, 146, 123, 117, 121, 124, 113, 95, 85, 98, 131, 167, 189, 200, 215, 248, 291, 324, 327, 306, 281, 263, 245, 225, 209, 207, 210, 199, 173, 145, 129, 127, 133, 143, 158, 173, 177, 168, 153, 143, 144, 150, 151, 141, 123, 107, 105, 112, 115, 98, 67, 40, 30, 32, 34, 28, 18, 11, 8, 13, 32, 66, 113, 165, 213, 249, 267, 268, 257, 232, 190, 137, 91, 70, 74, 97, 129, 159, 175, 171, 160, 156, 161, 166, 169, 170, 168, 159, 147, 135, 125, 114, 110, 124, 150, 169, 174, 177, 187, 192, 173, 136, 104, 94, 102, 116, 127, 124, 103, 72, 49, 44, 52, 67, 86, 102, 101, 80, 60, 66, 98, 136, 163, 181, 192, 193, 184, 181, 197, 224, 240, 227, 187, 139, 98, 72, 61, 58, 64, 77]
10205G7J9J4J0J6K9L3J7j1l2l8l1j5mnj1qJ2K7K6J6J5K0J4%j1qmooonqpnj0j4lQNj3j6LJ4
10186I8Jk5l1k4j8j2LK6L5K6J4J1RRJ1Rlj7j7pKKMPjj1oJ6K7J3pj1noj4j5j0qj5k2k6k0kK5
10167A5M0L2K5M0O1N5J3k7l4k0j8l5m5l6j4%LJMJ3K4L0K5J2LMROj0k9k9qJ4J4j1l2k7KK8K7
10150A25Mj8k4k0j6j4nJ0K1J4nk6l4l1k0kJ6K2J1pj9j5%J3J3QJ0J6J9J7J5K1K9K6J3Klj3k9
10133A24l6j3K8O1O0L5Lj9k6j3J0K3J6%ojjj2k2k6k7k6j8KJ3Pm%J5J7ol1l4j4RK1K3K2J4K
10116A70oLJ9K4J7PM%j7l9m9l3nJ2J3MkoqoPK4L6L6K9K1J2ml1n4n3k9opk3k8j2J1K3K1J5J4
10098A04J7J6Kj5j4RK9K1nj6lOj2l5l4qJ2J5J1J8K6K6J5Kj2k4k7j8j2j5k2j7NL0M3M0L3K1
10081B12Jk5l7k6lJ1Ojlmj4k3k1qPJ0MjKJ1K0J7Kj9l2l3k1mJ0J9K7L4L4J7j0k6j4J0L3M1L9
$$ y = [77, 96, 110, 120, 136, 165, 198, 215, 204, 172, 134, 103, 88, 84, 79, 68, 60, 72, 99, 125, 141, 156, 176, 190, 190, 179, 171, 167, 161, 155, 149, 144, 136, 129, 124, 114, 100, 97, 105, 110, 97, 81, 84, 98, 99, 74, 43, 19, 1, -11, -8, 18, 53, 79, 93, 104, 113, 122, 133, 142, 139, 122, 105, 98, 100, 102, 106, 113, 112, 101, 95, 111, 138, 151, 144, 133, 128, 122, 108, 93, 83, 75, 60, 38, 12, -8, -10, 15, 55, 87, 112, 152, 213, 268, 281, 254, 220, 200, 182, 147, 102, 66, 52, 52, 55, 56, 60, 73, 97, 127, 152, 164, 167, 171, 180, 186, 176, 147, 118, 110, 124, 138, 127, 95, 68, 70, 98, 125, 129, 111, 87, 67, 51, 37, 32, 42, 63, 77, 72, 46, 12, -19, -39, -41, -25, -3, 8, 1, -18, -33, -33, -20, -7, 1, 11, 27, 46, 63, 78, 99, 128, 154, 167, 169, 166, 153, 124, 88, 75, 103, 164, 224, 259, 262, 243, 217, 204, 214, 237, 253, 253, 247, 246, 245, 233, 211, 185, 158, 132, 114, 116, 129, 136, 132, 132, 147, 164, 158, 127, 93, 79, 88, 109, 132, 154, 168, 170, 164, 167, 186, 210, 227, 234, 238, 238, 221, 182, 133, 100, 95, 107, 120, 124, 122, 116, 108, 102, 109, 133, 169, 205, 234, 255, 267, 263, 232, 178, 125, 96, 90, 83, 60, 32, 20, 31, 54, 75, 90, 104, 121, 137, 139, 124, 110, 119, 148, 169, 164, 148, 145, 151, 139, 104, 70, 62, 74, 89, 100, 118, 144, 170, 185, 187, 175, 151, 124, 106, 94, 79, 57, 40, 45, 75, 118, 158, 191, 212, 213, 188, 151, 125, 122, 133, 139, 138, 135, 131, 117, 94, 73, 65, 72, 82, 86, 85, 87, 98, 118, 135, 137, 118, 86, 53, 32, 28, 38, 57, 84, 118, 152, 169, 159, 133, 119, 129, 162, 203, 242]
10063B42K3jk5k7oJ1Ok0m0l3qNmj9k0j0qj5j2RK9K9J2KKMNJ1J9K0J6Rjj4k0kK7M0K9Rmj4k0
10045B36j9qnj6k2j7j4k1j6J7N0M0j3n3m6j6jqj0KJ5J3Lnol%J0K5L6L2J2pj6j7j9j3KJ4Oj2
10027A30k1j3moj3qQK1L3M7N3M3J5j5k6j5KNj4l8m6l3j4mnrj4j7j3kJ7K7K2J0KLNLjJPNnj0
10008A13o%ok0l1k9j6OK6L0K2J5K0K5J2j1k1nJ4J6Nlmqj8l0l1j5PK2J3j3l6k9NL9N7N7M7L5
9991B54K7K3J4%j3j6k0l5n2n2k5LJ3RRRkj9k3j2qj6k2j2NJ0%nQL1M4L3J3KJ0K6K9J1j2l1l9
9973A69k7kJ8J0j7k7mK4J7j8n0o2o0n0k4RK7K5K1K8L5K8J1%kJJ2K2J9ok6k4qJOJ9L3K9Rpo
9955A53nj0j2kMkpNJ8J2j5l4k9j1jJRK0K7K2J5J7K3K8L4M3M0J6k0l7l0j7j5j9j8k1l6n0m4
9938E2k2mOJ3J2LjJ6L8L4PmPJ1pk0pQml0l3j2krj4j1j4j5JL9N8L7LoOJ2Kj3j8qJ1K4J5j2l1
$$ y = [242, 265, 264, 239, 212, 206, 217, 223, 203, 163, 130, 122, 127, 123, 104, 84, 74, 66, 51, 39, 48, 77, 106, 118, 120, 122, 126, 131, 142, 161, 181, 197, 206, 205, 191, 171, 169, 196, 236, 265, 274, 270, 256, 236, 217, 209, 204, 188, 166, 149, 135, 114, 98, 115, 165, 205, 192, 139, 93, 77, 76, 68, 58, 60, 75, 88, 91, 86, 80, 77, 77, 87, 112, 148, 180, 192, 185, 169, 152, 133, 120, 122, 136, 142, 130, 109, 96, 92, 86, 73, 65, 73, 94, 127, 174, 227, 270, 285, 270, 244, 229, 231, 236, 222, 184, 138, 105, 91, 87, 82, 73, 59, 42, 29, 27, 44, 71, 93, 103, 105, 108, 113, 116, 115, 116, 123, 128, 123, 113, 107, 107, 101, 81, 50, 21, 5, 11, 37, 67, 89, 104, 124, 149, 161, 150, 129, 124, 138, 154, 159, 156, 152, 144, 126, 96, 65, 50, 57, 79, 92, 79, 43, 14, 19, 58, 115, 172, 219, 254, 281, 304, 318, 318, 305, 289, 269, 234, 182, 130, 105, 108, 121, 130, 139, 148, 146, 127, 104, 92, 84, 68, 46, 34, 39, 49, 49, 44, 52, 83, 127, 160, 173, 175, 185, 211, 240, 251, 239, 208, 169, 142, 140, 158, 168, 151, 124, 120, 144, 161, 143, 93, 31, -29, -79, -103, -94, -67, -42, -21, 7, 42, 70, 81, 81, 79, 80, 92, 114, 133, 127, 101, 77, 69, 70, 76, 95, 128, 157, 166, 159, 153, 148, 138, 126, 124, 128, 126, 119, 124, 142, 154, 139, 105, 76, 65, 64, 65, 74, 94, 121, 143, 158, 175, 198, 226, 260, 303, 343, 359, 339, 302, 272, 255, 240, 221, 203, 182, 146, 96, 52, 30, 26, 32, 45, 57, 60, 59, 75, 113, 147, 154, 150, 157, 168, 161, 141, 134, 142, 138, 108, 75, 63, 61, 52, 38, 27, 13, -2, -1, 38, 96, 133, 136, 130, 136, 148, 150, 137, 119, 111, 122, 146, 161, 149, 118]
9919A18k1J0K9K0nk9l3j5K0N0N4L0jj7j3oj0j8j3OJ8jl0l6j1J1J3MRK0J4rk3j8nJJ1K6M0L4
9901B24J6Kmj0j8k0j4m%klnj1k6l8l4j5PK5L7M3L7J7j4l8m4l7k7j1J1L1L4K1Lorj5k0j9r%
9883E5OQJ1J3J5J8K2J3j0l4l6j5J0K0J2MjKRJ9K5J7jj9l0l2k7j3JRONJ5L4M2K4mk5k2j3j4
9866A19l1l9k4KJ9J8J7K5L3L0J4jj1k2l1k6pJ2J8J0lj7l0l6k6kK2L1K4R%MJ8K8K3OomKKlr
9847A58j5j5pNJ1JlQK3J9mk0j5qj0j7j9j7j2JJ9K4Nj1kK1K5Pj0j0nj0j6j2onmNJ6J5Kj0j3
9829H9lQJ2%j4j8j8k4l6l7j5J2K6K8L5M4L7J4j0j4kJ9L4K6ol8l9j2J2J3JjRJ0LKJ5K4J4nk0
9811A75j9rnnj0j6k5k9k0NL0M0L1J0oj6j3OL3M5K1k2n0m3k5k2l1k6mK1K7K1J5Pnk1k2lK6M8
9794A14M9K7%j5j1%Kj0k0k1j1nnmOJ7J9J0KKOOM%nj0pMNj3l8m0j5J6L0K6J8Poj1kJ3J6Pml
$$ y = [118, 97, 107, 136, 156, 151, 122, 89, 74, 94, 144, 198, 228, 227, 210, 197, 191, 181, 163, 150, 156, 174, 173, 143, 107, 96, 107, 120, 124, 133, 153, 167, 158, 135, 117, 112, 113, 124, 150, 190, 224, 240, 242, 238, 228, 210, 190, 176, 172, 172, 170, 167, 162, 151, 125, 87, 53, 38, 45, 70, 107, 150, 187, 204, 190, 152, 108, 71, 44, 33, 44, 75, 109, 130, 133, 127, 118, 103, 83, 64, 55, 55, 61, 69, 80, 93, 108, 126, 148, 161, 151, 117, 81, 66, 76, 96, 108, 112, 111, 113, 122, 141, 166, 183, 182, 163, 133, 101, 74, 61, 62, 71, 77, 82, 97, 131, 173, 197, 193, 168, 146, 133, 119, 88, 49, 25, 27, 46, 64, 81, 106, 139, 169, 183, 182, 171, 149, 118, 92, 85, 97, 115, 125, 122, 105, 75, 39, 13, 11, 33, 64, 88, 97, 97, 101, 119, 147, 170, 176, 170, 166, 168, 170, 167, 158, 143, 128, 121, 126, 137, 138, 135, 143, 166, 185, 181, 161, 146, 138, 128, 111, 92, 75, 63, 64, 83, 107, 112, 101, 99, 120, 145, 152, 142, 132, 127, 117, 101, 89, 83, 78, 74, 79, 95, 110, 112, 102, 89, 86, 94, 106, 106, 92, 74, 56, 32, -4, -41, -56, -44, -18, 10, 45, 89, 126, 140, 130, 116, 114, 133, 167, 193, 187, 149, 110, 98, 110, 123, 124, 123, 132, 142, 145, 147, 162, 186, 200, 195, 175, 156, 147, 142, 137, 127, 111, 86, 57, 37, 42, 72, 112, 143, 153, 147, 131, 118, 124, 157, 202, 223, 201, 151, 108, 83, 61, 30, 4, 0, 21, 48, 69, 84, 91, 86, 65, 43, 40, 66, 114, 163, 190, 190, 175, 164, 164, 166, 156, 136, 115, 104, 99, 94, 90, 96, 113, 132, 142, 144, 146, 152, 158, 162, 162, 157, 147, 140, 144, 149, 136, 98, 58, 43, 59, 89, 115, 133, 140, 134, 123, 121, 134, 150, 157, 153, 150]
9774A50KJj2k9m0l5j0J6K9K1OnlNJ5K0J8J4R%j6k7k0JJ8J8Lj3j2LK4K6Pj8k4j1Kjj4k1j7l
9756G7NJrj0k%j0j9j5qj1k1j5NK1J6J5K6L8L6K1Pjj1j6j3jJ0J4Qlj4j6oOJ6K5K7J4mrklk2
9736A47l4k3oj0k1qK1L2J3kQK3J6ok0j7pLONOJ1J3ql6m0j0K0J7mqPJ7J1JJMKmojRJ6J5NJJ4
9716A73K7K3Nj4k5l2l6l0j8j4j3mJ0Ok1l7j7J6K9J9LNK0L2K8Oj4j8kJ3Poj3oMJ1J4J2PNJ3
9698A68K0J6KmJNMMKqk1k4j4l%%MLj2k5k3j8k4l9l7j8OK6M0M8L8J1j2j8j6j7j2MJ6Roj5j3
9680D8j8k9k8pK3M3N5O3O2M3J3rj2JJ4J2kj8k3j7j4k0k6j4J0K0Jl6o2n9k8RL1K5ol7l5pK0
9663a4J4j2l1k4nPJ1J7K4K7K5J8J3K0L6M7L6Lk6k8j4rk6l7k1J4L4K8Roj3j8k3k1j4JK5N4P5
9646A96P4M7Qk5l9l3k0j1j2j7j7j1nllqj8k2k0pNJ3J7J2NlmJPJ0J0Mrk4k6j0K1M1M0J9nj5
$$ y = [150, 152, 153, 141, 112, 72, 37, 27, 43, 72, 93, 99, 94, 91, 96, 111, 131, 149, 163, 172, 172, 156, 129, 109, 110, 128, 146, 149, 136, 124, 127, 151, 177, 184, 166, 142, 131, 133, 132, 118, 97, 80, 77, 82, 83, 74, 64, 62, 62, 52, 33, 18, 10, -1, -22, -37, -32, -11, 5, 20, 46, 84, 120, 141, 148, 147, 136, 120, 107, 106, 116, 130, 138, 135, 121, 105, 99, 105, 121, 146, 173, 187, 183, 174, 172, 169, 147, 113, 90, 84, 74, 53, 45, 66, 98, 111, 109, 117, 140, 156, 150, 130, 113, 106, 109, 115, 120, 126, 137, 150, 142, 106, 66, 56, 76, 93, 89, 81, 88, 105, 116, 117, 118, 122, 124, 120, 114, 113, 122, 138, 153, 158, 159, 173, 200, 223, 228, 214, 189, 157, 121, 91, 73, 59, 46, 42, 52, 58, 37, 0, -17, -1, 28, 47, 50, 55, 75, 107, 135, 141, 127, 109, 107, 120, 127, 121, 108, 102, 106, 117, 131, 143, 150, 155, 168, 188, 204, 206, 202, 203, 208, 212, 216, 218, 210, 189, 165, 151, 148, 148, 148, 152, 155, 143, 118, 95, 77, 53, 14, -23, -41, -35, -9, 31, 79, 117, 128, 116, 98, 82, 65, 53, 57, 73, 82, 76, 61, 48, 30, 1, -27, -34, -11, 32, 87, 150, 212, 255, 268, 259, 247, 248, 262, 274, 272, 254, 231, 214, 200, 180, 154, 140, 150, 170, 171, 135, 73, 14, -14, -5, 26, 51, 45, 8, -27, -34, -14, 0, -12, -43, -67, -72, -65, -54, -37, -13, 14, 39, 57, 70, 90, 126, 173, 209, 212, 186, 158, 144, 135, 109, 72, 51, 65, 99, 127, 136, 130, 117, 99, 76, 55, 41, 42, 67, 121, 196, 270, 317, 325, 300, 261, 228, 208, 197, 185, 168, 151, 140, 135, 132, 129, 121, 103, 81, 61, 54, 59, 72, 89, 101, 106, 103, 99, 100, 107, 117, 127, 131, 122, 98, 72, 62, 83, 124, 164, 183, 178, 163]
9628A63oKkj8l0k9l0l6l9k7jK2K8J9J1PQJj0j3OL6N3M1K1J0RLlLJ3Qrj9j3j0j5j2RK6K3J1
9609B11J0J1jk1k5qOJj0j2mOQjj7k9l1l2l7k8J0N6O5L3lj2j0j9k9k1KJ2OlkPJ3J8K3L1L2J9
9591B25ql6m5l3k2k1k1pPOlkJ4L1M0L6K0nk1k0j8l0l8k1J2K1lk7j9J0K5J8%j7j7KK8L1Rj1
9574I0%K5K9J4%jkj3j6oPNpj1JJ7K9K8J1j6l8m0k3%J1Nqj9k5k7k0JK9M5L3Kk6l4k4rJQJ0P
9555D3KJNJ3K3L4L9L6K3Pmj4k1k2rLKj2j8oRQrk3k3k5l2l1rK4M4M2K7J6Ppj7j0J3K8K1%k2
9536A56l4m0l3j8MJ4OnpJOQJ3K3K8K4J2Kj0j7j2jMpj6mJ8K6J5Kj%K%nj1j4pkmrJK5L4J4j6
9516A65k3oJ1J2Jj0j8k1qJ7L6K8mm2n6m5j8LQ%rqoqj4oJ3K3K1QKMJ1K4M0M4K3mj1LOj6l1k0
9497A19J%j1%K9M0J6j6l2l5l9l1mK3K1mj8j1kj2k9k8j1MLpqPK3K8K2J9K4L3K7Nj4j9j0npj4
$$ y = [163, 157, 159, 157, 139, 109, 80, 50, 14, -25, -52, -53, -31, -3, 16, 27, 34, 42, 43, 33, 20, 26, 62, 115, 156, 177, 187, 196, 199, 196, 199, 212, 220, 211, 192, 179, 169, 154, 142, 151, 177, 200, 211, 221, 232, 231, 210, 185, 177, 183, 184, 174, 162, 158, 164, 172, 171, 154, 125, 94, 62, 25, -3, 7, 63, 128, 161, 158, 146, 136, 117, 88, 67, 69, 81, 87, 84, 82, 89, 102, 120, 143, 174, 206, 225, 217, 181, 136, 103, 81, 60, 39, 32, 39, 45, 42, 40, 54, 85, 125, 161, 181, 176, 155, 135, 117, 87, 49, 28, 40, 61, 58, 31, 12, 22, 47, 65, 65, 48, 31, 33, 61, 92, 101, 90, 90, 115, 144, 158, 158, 157, 155, 142, 126, 120, 127, 132, 125, 114, 115, 132, 161, 189, 200, 184, 146, 106, 83, 83, 94, 99, 91, 72, 47, 20, 0, 1, 30, 75, 108, 110, 84, 50, 26, 17, 18, 26, 36, 43, 45, 46, 51, 64, 87, 121, 160, 196, 219, 226, 222, 208, 187, 165, 156, 159, 161, 149, 131, 125, 134, 142, 133, 110, 87, 62, 30, -1, -10, 14, 58, 100, 127, 143, 150, 143, 126, 116, 129, 157, 178, 178, 156, 122, 82, 49, 31, 35, 49, 55, 50, 43, 44, 50, 58, 71, 94, 122, 146, 158, 160, 150, 133, 121, 120, 124, 117, 101, 97, 115, 141, 156, 158, 157, 157, 159, 159, 154, 143, 129, 122, 120, 116, 107, 108, 133, 167, 181, 165, 142, 136, 147, 159, 160, 150, 132, 111, 103, 120, 156, 184, 180, 138, 82, 37, 19, 22, 30, 30, 21, 13, 7, -1, -15, -21, -8, 15, 36, 44, 46, 50, 61, 85, 125, 169, 192, 188, 177, 180, 186, 170, 139, 119, 120, 120, 109, 109, 138, 178, 194, 178, 146, 111, 72, 41, 37, 60, 81, 77, 59, 48, 46, 34, 5, -23, -34, -30, -27, -34, -42, -35, -12, 16, 38, 57, 81, 114, 141, 146, 132, 113, 103, 98, 91, 77]
9479G7j3%J9L3L4J9Jr%J2Rj1l2l8l6k8pL2O5O1J7l0n2m9m0k8rJ1L0L4L6L3K6J4Kj3l2m5m1
9462E2j7NJ5J2Mpj5j4nok4l9k6J6M9M7J7pj0lJMOKonJ3L6L6J3qr%%rj2JJ7J3oj5%K0K3RMJ4
9442A86K0Jk5l1j1RJ6J6J0pk9l7k0NJ6J1NNMmj7l0l3k6pPRM%nj2j3MK8L8L5K9K3Rj4l0k7j0
9423A02RK4K9K5J0%kjll%%rk2k5j8q%lj5l4l8j6J7L1J9MPJ7J3j2m0m2k0MJ2Q%nj0j0JK4L9
9404E9L2J7J2J8J7%j7j9j2prj0pkJjpj3oJ7L6L4K3K7M8N4K6k1m9m8l5k8k0rjoj4j4KK4L8M1
9386A71L6K9J7ml5o4o6l8nRM%J1K1J3rj8kK7M5M0L0K8K6Nl3n6m3j2J1J5J4J0mk1k4j5j0j1
9369I2kK2L7K7Jj2qjjnj0j9k6k0kJ2QlmJ7M3N6N1M1M3N0N1N0O2R0J06Q6L3k2o1q1p9o2m4l3
9352D83l6m2m5m9n0m4l2k6k6k7k4j8j9k0rJ5M2N3M5K5Jj5j8rKN%JJ4J6ql6l8j4PJ5K1L6L8
$$ y = [77, 64, 64, 83, 116, 150, 169, 170, 161, 161, 173, 182, 171, 139, 101, 65, 37, 30, 62, 127, 188, 205, 175, 123, 74, 34, 6, -3, 8, 38, 72, 108, 141, 167, 181, 183, 170, 138, 93, 52, 35, 40, 55, 67, 71, 64, 49, 35, 30, 24, 0, -39, -65, -49, 0, 47, 64, 57, 47, 44, 45, 49, 55, 57, 51, 46, 59, 95, 131, 144, 136, 127, 127, 127, 118, 106, 107, 124, 137, 131, 116, 116, 136, 159, 168, 172, 186, 206, 207, 182, 151, 140, 149, 165, 181, 191, 184, 155, 118, 98, 103, 119, 130, 135, 140, 144, 140, 123, 93, 60, 34, 27, 34, 43, 47, 47, 42, 30, 17, 21, 49, 87, 122, 151, 174, 183, 169, 139, 112, 102, 111, 135, 164, 189, 199, 199, 197, 196, 193, 190, 190, 190, 181, 159, 134, 116, 108, 108, 105, 90, 56, 18, 2, 19, 50, 69, 73, 80, 97, 110, 98, 58, 16, -4, 0, 12, 20, 20, 15, 5, -5, -4, 20, 59, 91, 108, 120, 138, 155, 155, 138, 119, 107, 100, 91, 81, 74, 72, 73, 72, 65, 52, 46, 63, 99, 133, 156, 183, 231, 285, 311, 290, 241, 193, 158, 130, 110, 101, 100, 94, 80, 66, 68, 92, 130, 171, 207, 236, 253, 249, 214, 150, 84, 46, 41, 50, 54, 54, 65, 86, 99, 90, 72, 70, 97, 142, 182, 212, 240, 266, 271, 238, 182, 139, 127, 138, 153, 167, 177, 173, 152, 128, 113, 103, 92, 90, 112, 149, 176, 177, 165, 157, 156, 155, 150, 140, 121, 95, 75, 73, 85, 93, 90, 86, 103, 146, 202, 253, 294, 337, 387, 438, 488, 550, 640, 746, 832, 865, 843, 782, 701, 622, 560, 516, 483, 447, 405, 360, 311, 261, 217, 185, 159, 133, 106, 82, 64, 45, 25, 16, 31, 73, 126, 171, 196, 197, 182, 164, 155, 157, 162, 162, 163, 177, 193, 185, 149, 111, 97, 104, 119, 140, 176, 214]
9335B14Rk0k3onk4l1j1J9L2L4L6M4M4L3J5jj7l2l8k9j5rj7k9l0j9j4j7j0J4M2M9L6K2J4Mr
9318B55j7j9k1j8%K3L2J7ok8m4n6n1k8lPOJqrOL6N8N5L4J3NPRMpj0NK2J6j2l5l3j8oPJ8Rk3
9299A93m6l3JJ2jqMJ9J9J2J2J2N%mj1j9k1j3ok%OJ0PLJok0l2l8m1l9k8jK7M2M5M5M2L0Rj2
9280A75k1j7rprj0jJ0J4RPMmk2l5l6k5pNOkLK4M8M4J2k0k8j3RL1M4L6Ll9p0p9o2k1L1O5O2
9262A05L1jk0k1qJ7M3N6N0K2j8n4n3j9J6J2j9l3j1K4L3J6lpLJ2J3Pkj0j6j8j8j8j9j1%QMo
9245H7oMJ6J9J3O%jMJ2J7J5J2Jk1m0l1%K1J5nj3j3j5j3NK3K3Opj4j6jK5L4Ml5l5mKl1n4l3
9226b4OK5K8L3L6J7j0k0j2nnmKNRJ7K2J1mlJ4K3J4OJ1J8J0j0j9j7j1j3k0j9nJ8L4L7K9K2J4
9208B60lk0l4m1m1l6k1j1j2j3%K2L6M3N2O1M4jm2n1l3j9k4l2k8j3MJ7J4mk1j8NK7L4K9K4K4
$$ y = [214, 223, 203, 180, 174, 169, 145, 114, 103, 122, 154, 188, 224, 268, 312, 345, 360, 359, 342, 310, 272, 243, 228, 219, 202, 173, 143, 124, 110, 93, 83, 97, 139, 188, 224, 246, 260, 264, 255, 238, 219, 198, 180, 180, 203, 235, 252, 246, 218, 174, 118, 67, 39, 36, 43, 49, 50, 42, 33, 39, 75, 133, 188, 222, 235, 240, 247, 256, 260, 253, 243, 248, 270, 286, 274, 239, 206, 188, 182, 189, 207, 216, 193, 147, 114, 115, 127, 126, 118, 122, 141, 160, 172, 184, 196, 201, 201, 197, 186, 167, 146, 133, 127, 125, 125, 131, 141, 148, 151, 152, 146, 126, 94, 56, 15, -24, -52, -53, -26, 16, 61, 106, 148, 178, 187, 175, 154, 137, 128, 121, 112, 102, 101, 111, 125, 134, 141, 145, 141, 119, 84, 48, 23, 16, 21, 27, 25, 28, 52, 100, 144, 156, 136, 108, 95, 104, 135, 179, 215, 218, 179, 109, 30, -32, -53, -22, 43, 105, 136, 135, 115, 94, 86, 103, 146, 202, 252, 274, 256, 202, 149, 130, 146, 158, 139, 106, 95, 119, 152, 168, 165, 158, 161, 173, 186, 193, 191, 181, 165, 147, 129, 111, 92, 81, 81, 89, 93, 87, 81, 85, 101, 120, 133, 139, 139, 138, 142, 154, 171, 186, 198, 199, 178, 138, 107, 107, 128, 143, 138, 125, 112, 97, 84, 89, 112, 135, 141, 134, 120, 104, 103, 128, 162, 166, 131, 96, 92, 94, 63, 9, -24, -18, 7, 35, 68, 104, 121, 111, 91, 79, 74, 69, 65, 67, 72, 81, 98, 120, 131, 127, 124, 138, 161, 175, 181, 192, 210, 220, 210, 191, 174, 163, 150, 130, 111, 106, 124, 158, 195, 224, 246, 260, 257, 237, 203, 162, 121, 85, 64, 53, 41, 28, 28, 50, 86, 129, 181, 242, 286, 285, 243, 192, 159, 140, 116, 84, 56, 43, 47, 64, 78, 74, 53, 35, 40, 67, 101, 130, 154, 178]
9192A78K2Nk5n0n5l5rJoj5j5j2j1j1oJQJ3J9K2J9J2J0K0K9K4QkPK1K7J6jj7k6k4j7j1j0r%
9174I5J0QknJ0L2L5J4j6k9k2pLLPJ7K8K8J6kj5k0k2j8oQJ4J2PLnj7k5j5JMj5l9m4l0pJ0K4
9156B8K9J8KoLK1L3L4K2Lj3rRJ9Nj2j1Kjk3l8l3j6j2j4j0kjj0j4j2j2j9k0qJ4L4M6N0M0J5
9138A31j8l6k7oOKnjOPKQJ7J6Jj5j9j7j1jJ8K7J7OJ5L6L8J0k4l5k5mJ3K5K2Kj8j9okj5k8l1
9119F2k9k9k0kJ7K0J2OJ5K0J0qj2J0M3O2N3K5mj6j2KJ0R%j1j5qknj2j6qmqj3j2qprlNNoj1
9100I6kN%j2j4j1j5k2k3qJ1L2M1L2J0onPR%oKPlk1k8k2j6j5j1%J1J7J4O%loj2j2%J5K2J3j
9080G6nKJ4K0J9J2kj8l0k4LL2M2K7Lrqrj1oOJ2Mrj3pMJ0Poj6j1MRK%J1J9Nj9k5j4kMJ5K6K5
9060A69MqKJ6J1j3l0k5qLRJ7K4J9O%MPlj9k4j5rj6k5j9nlj2qJ3K9J7j4l0j8J0L4M3L2Lk3k9
$$ y = [178, 200, 205, 180, 130, 75, 40, 31, 32, 26, 11, -4, -16, -27, -38, -44, -43, -35, -22, -3, 19, 38, 50, 60, 80, 109, 133, 141, 139, 146, 167, 194, 210, 209, 192, 166, 142, 125, 114, 104, 95, 95, 105, 113, 111, 106, 116, 148, 183, 197, 181, 152, 130, 123, 126, 129, 136, 153, 181, 209, 225, 223, 208, 188, 166, 148, 142, 150, 164, 176, 183, 186, 181, 164, 139, 124, 125, 129, 114, 75, 31, 1, -6, 4, 28, 57, 75, 77, 71, 74, 95, 128, 162, 184, 187, 174, 165, 174, 193, 198, 186, 175, 177, 176, 153, 115, 82, 66, 54, 40, 30, 28, 27, 17, 3, -9, -21, -40, -60, -68, -54, -20, 26, 76, 116, 131, 113, 77, 50, 44, 50, 52, 47, 46, 52, 59, 61, 69, 86, 102, 103, 88, 69, 52, 41, 40, 58, 85, 102, 108, 123, 159, 197, 207, 183, 148, 123, 119, 132, 157, 179, 181, 163, 144, 138, 136, 121, 93, 62, 33, 4, -16, -18, -1, 19, 31, 37, 52, 72, 82, 74, 62, 72, 115, 177, 230, 255, 251, 235, 223, 225, 235, 244, 244, 233, 218, 210, 208, 203, 191, 175, 167, 163, 155, 142, 130, 122, 115, 106, 103, 108, 113, 107, 96, 94, 99, 99, 87, 73, 62, 47, 25, 2, -6, 5, 37, 78, 110, 120, 114, 109, 116, 125, 125, 119, 121, 128, 125, 104, 76, 54, 38, 23, 12, 12, 23, 40, 54, 60, 60, 57, 51, 39, 27, 27, 42, 64, 77, 76, 71, 73, 87, 107, 126, 138, 136, 118, 88, 64, 67, 99, 141, 168, 171, 162, 154, 145, 134, 128, 134, 146, 150, 141, 128, 121, 125, 135, 142, 136, 120, 109, 113, 122, 124, 124, 135, 154, 159, 140, 115, 101, 99, 103, 118, 144, 169, 173, 165, 167, 183, 194, 181, 151, 126, 118, 121, 130, 147, 171, 190, 196, 196, 200, 207, 204, 185, 161, 146, 137, 121, 96, 77, 72, 69, 57, 49, 62, 91, 108, 94, 64, 46, 56, 90, 133, 165, 168, 145, 116]
9041A16j7moj2pMNjkOJ3RPJ7K9K8J6QLj5m7o8n5j8J3K4J7Kj1j5j3j1j2j4j4q%J3K6L5L0K1
9023I2J8J9J7J1Njj4k6k9k4k2k3j2J0K6K4Nj1j5oJ5L9M1J3k2l2j1J7K6J8J6K1K2Rj2k5k2j1
9006A46prj5j6j9k3k2j0NJ6K0J9J0ok2k5j5LJ7K1J3mj1NL4M7L4Rj1k3l7n0n4m4k6nJ5K5K0
8990EJ1RJ9L0K2%k2l1k3j1JJ9M0M4J6k7m2j6K0K4ll0l1j9j6k0j4RL3M4M0K5J2Moj9l3l4j6
8973A4J3L4L8K6Mk2m0m8l6j3K0M6N3L1nl0l0qJ4K2J9J4RKpj3nJ0J8QnoKPPRK0J9kk8l4k2j7
8954H8k8l2j0K6M1J7k2l4mM0N7M3K0J3J2Mj0j2nrk4k5kK3K0pk1j4knj9k7k5j7nRJ7Rj1k2o
8936D1K2L5K5J1J9M1N4L6kl1l2j1PMj7m2m9l7j6lPK1L4L4J5qk3k7k2j0J0K7K9J4lj1j2j7l0
8919H3l0pK5L8K5OJM%ojROj7l8m1k8j3NK6L8K8Mj1pJ1K0J5K%J0J5jk8m2k8mJ1J9L1M0K5j1
$$ y = [116, 99, 95, 89, 77, 70, 74, 79, 78, 76, 82, 95, 104, 111, 128, 157, 185, 201, 209, 212, 197, 150, 82, 27, 9, 22, 46, 63, 65, 54, 39, 26, 15, 3, -11, -25, -33, -33, -20, 6, 41, 71, 92, 110, 129, 146, 157, 162, 161, 147, 121, 92, 68, 46, 23, 11, 21, 47, 71, 76, 65, 50, 44, 59, 98, 139, 152, 130, 98, 87, 104, 130, 148, 164, 185, 207, 216, 204, 179, 157, 146, 139, 130, 115, 99, 80, 57, 35, 25, 30, 46, 66, 85, 95, 89, 67, 42, 27, 30, 47, 68, 81, 77, 66, 71, 105, 152, 186, 195, 184, 161, 124, 74, 20, -24, -50, -55, -40, -15, 5, 16, 25, 44, 74, 96, 96, 74, 43, 20, 9, 10, 29, 69, 113, 129, 102, 60, 44, 64, 88, 85, 55, 24, 5, -11, -31, -45, -36, -3, 41, 81, 106, 118, 122, 116, 97, 64, 30, 14, 27, 61, 99, 125, 129, 107, 67, 19, -17, -30, -10, 36, 89, 120, 115, 85, 55, 47, 61, 83, 102, 116, 125, 127, 120, 107, 102, 112, 130, 138, 133, 127, 129, 136, 143, 152, 172, 191, 189, 161, 127, 105, 88, 60, 28, 18, 44, 85, 102, 80, 46, 42, 82, 139, 182, 202, 215, 227, 231, 221, 209, 204, 195, 171, 146, 144, 167, 187, 180, 159, 145, 143, 138, 119, 92, 67, 50, 45, 54, 71, 80, 69, 47, 41, 63, 98, 123, 134, 153, 194, 248, 284, 282, 251, 219, 208, 215, 219, 202, 160, 111, 74, 58, 55, 62, 83, 117, 151, 166, 158, 135, 108, 86, 76, 86, 113, 142, 156, 153, 142, 130, 113, 83, 53, 46, 71, 109, 134, 140, 141, 145, 145, 139, 138, 147, 153, 136, 98, 57, 29, 16, 21, 47, 85, 113, 117, 106, 99, 110, 130, 145, 147, 147, 157, 172, 171, 143, 101, 73, 69, 80, 99, 130, 170, 195, 184]
8901A84l7l4j6oqr%RPJmoqj3j7j0LJ5K3K8L4L4K3Nj6l6m5l4mJ8J5koPJ4NqkJ8L4L1J5lj6k0
8881A63j9k1j6KK9M1K0j3k7j6mj0k4j9MK4K4J0nj1j0%J0J8J5J3J6K5K5Rj3l1l7l4j9kOjj3
8864A09j7j4j0oNJ5J9J0%kQJ7K0Rqj9j6pllLJ4J3NPK4L8L1Nj4j9k1k6l1k2%K1K6J5pk6l4l1
8846G8k0plnpnMQONPNOJ5K9K8Pj1mK2L5L0K0J3qm1o1n3l1k0j9pJ7K6J2%J0L3L8K2PJ4L3L6
8827B64J0k2m3m4l8k6j1KPRRMnj6j7j5j2rkQJ4J8K5K6J3j7m4n1m0j9J2L8M8L3QJPJ0JplJ4
8808A40K8L1K3J2QRJ3J1Lpj6k6l2k9pK2M4M3K3MkJJoqJJ2Rj5m7o9o1l2LK2K2J2QJ5K4K2J2
8790B21oj8k2j5rqpoorj3j3j0mLJ0J4J0MLOOQJ8K6K2%j7j9j1rj2j1%J0Oj1l1l5j8LQqk2rJ6
8770C5L0K3J0Njqj1njpj2j0lmrlJ0J7J3PLjlLJ8K5J7Jj6k9l8k7NL4L6J9K%LJ0K3L2K8Qj5k5
$$ y = [184, 147, 113, 97, 91, 83, 74, 74, 83, 90, 91, 87, 81, 73, 60, 43, 33, 36, 51, 74, 102, 136, 170, 193, 198, 182, 146, 101, 67, 63, 81, 96, 94, 88, 95, 109, 114, 106, 104, 122, 156, 187, 202, 199, 183, 163, 144, 123, 107, 109, 138, 179, 199, 186, 159, 143, 139, 129, 105, 86, 90, 114, 138, 148, 143, 132, 122, 122, 132, 150, 165, 178, 194, 219, 244, 253, 240, 209, 172, 138, 119, 117, 123, 122, 109, 92, 78, 68, 62, 67, 82, 101, 111, 111, 109, 117, 134, 154, 163, 155, 136, 120, 113, 110, 107, 110, 124, 137, 142, 149, 173, 211, 242, 247, 233, 214, 193, 167, 136, 114, 114, 135, 161, 176, 169, 143, 109, 78, 58, 51, 48, 43, 36, 31, 35, 43, 49, 54, 61, 66, 72, 87, 116, 144, 151, 140, 136, 158, 193, 223, 243, 256, 248, 207, 146, 93, 62, 42, 23, 16, 33, 59, 71, 71, 81, 114, 152, 174, 181, 195, 228, 264, 274, 252, 209, 165, 127, 101, 90, 92, 99, 108, 117, 121, 116, 100, 83, 68, 56, 47, 45, 53, 67, 85, 110, 136, 149, 132, 88, 37, -3, -22, -10, 28, 76, 109, 117, 118, 125, 135, 136, 129, 126, 140, 168, 199, 222, 234, 242, 251, 264, 275, 278, 271, 255, 229, 197, 168, 161, 183, 227, 270, 293, 297, 295, 296, 297, 291, 283, 284, 296, 305, 290, 243, 174, 113, 81, 84, 106, 128, 140, 148, 163, 187, 209, 221, 215, 197, 175, 160, 151, 143, 136, 130, 124, 115, 102, 89, 79, 75, 78, 88, 102, 112, 116, 119, 125, 131, 139, 157, 183, 205, 205, 188, 169, 158, 149, 137, 126, 126, 136, 142, 131, 100, 65, 47, 50, 58, 50, 28, 19, 35, 65, 88, 98, 103, 102, 94, 83, 78, 77, 70, 58, 48, 45, 41, 32, 29, 39, 56, 69, 76, 79, 78, 75, 78, 96, 121, 138, 139, 123, 94, 56, 29, 34, 68, 104, 123, 125, 125, 128, 138, 161, 193, 221, 229, 214, 189]
8750A89k9l3l2j9LK1J9Jk1l1j9OK6L1K2Oj1k9l3k1LK4K5J2jomj0k1k1jK5L6L4L4L3J4k1m0
8733A61k5PK4J6%j2j3pklj5j9j1kj0l6n0l9j3Knj9j3K1N4N4K7%kRJ2MOK2K8J5jqpj0j1j0j0
8715A09j1pNJ7J4jj6j9r%Lj%J2K3K5K1K5L0K3Lj0pMMkoj5k8l8l3k1j9k0oK1L6K2qk1qRJ2M
8696A16KJ1J1rl0k3J1M3N0M2L0J7mk2k2k0k9m5m6k6pJJJKjkKLJMJ7K3J3krqj3k1j6QL4M2L0
8677A60J3lrj0ooj2j7j3kQJ0Nlj0j3oQJ9K0J1lj3j5j0jLok1k9k2pK%n%J3K3J9Kj0j0nJJ0K6
8657H6L6K2j3l4k5okqrloq%J2Pj1j0J5L4K5JmMKj3k0j3nqj1lORRJ3J6J3MjOJ4J4Kj2k1k3k5
8636E6k1mK2L9L5K1J3J8K3K1Kk6m9m9k4OK4K7K4J9Nqj0LPok7l5k2MK5K4Jk3k4pRROOKj1k1
8618H4j0J1K3J8J0Lnj4j5oLNNRJ6J8Rmj7l0l2k0QL4M0K2%j2j1j0j0oNJ5J4Mklj1k5l2j7J2
$$ y = [189, 160, 127, 95, 76, 79, 100, 119, 120, 99, 68, 49, 55, 81, 112, 134, 140, 129, 100, 67, 46, 49, 73, 98, 110, 109, 103, 99, 89, 68, 47, 46, 71, 107, 141, 175, 208, 222, 201, 161, 136, 143, 167, 183, 183, 171, 158, 151, 149, 146, 131, 112, 101, 99, 89, 53, 3, -36, -49, -47, -52, -71, -84, -63, -9, 45, 72, 72, 70, 79, 91, 95, 101, 123, 151, 166, 165, 157, 150, 140, 129, 119, 109, 98, 91, 96, 113, 127, 126, 110, 91, 82, 82, 85, 84, 84, 96, 119, 144, 165, 190, 220, 243, 246, 236, 229, 233, 237, 235, 229, 214, 186, 148, 115, 94, 75, 55, 49, 70, 106, 128, 120, 99, 91, 100, 112, 116, 118, 129, 140, 131, 101, 78, 89, 132, 182, 224, 254, 271, 267, 245, 223, 203, 174, 129, 83, 57, 50, 51, 52, 53, 55, 54, 52, 54, 57, 58, 62, 79, 102, 115, 113, 104, 96, 83, 62, 46, 54, 88, 130, 160, 173, 170, 161, 151, 145, 139, 127, 110, 97, 95, 103, 113, 118, 115, 105, 92, 86, 94, 113, 133, 144, 141, 128, 113, 103, 102, 105, 99, 78, 49, 27, 20, 22, 22, 17, 17, 30, 53, 72, 74, 64, 54, 49, 50, 60, 86, 122, 144, 131, 97, 72, 66, 64, 56, 47, 44, 38, 30, 30, 42, 49, 38, 28, 43, 77, 102, 103, 99, 103, 105, 92, 72, 59, 54, 46, 35, 32, 38, 47, 56, 69, 85, 98, 102, 101, 107, 121, 135, 137, 125, 104, 81, 56, 35, 31, 53, 92, 127, 148, 161, 179, 202, 223, 225, 199, 150, 101, 77, 83, 107, 134, 158, 177, 182, 174, 164, 167, 174, 168, 141, 106, 84, 88, 113, 137, 138, 115, 91, 84, 93, 102, 108, 114, 116, 105, 84, 74, 85, 108, 126, 136, 139, 134, 120, 105, 99, 102, 107, 112, 121, 137, 155, 164, 160, 143, 113, 81, 61, 69, 103, 143, 165, 165, 153, 142, 132, 122, 116, 121, 136, 150, 154, 152, 149, 138, 113, 81, 64, 76]
8599G6L1K6RKONrk2j6LJ2Kj0j0j1k6l7j4L1N5L6MrKJ0J1J6K2J6ol0l5k5j0NJ0jj7j1K1N2N1
8581B15K5N%mk1l6l0JK9K8nm0m3k0jok7l6k7j2jJ2K6L1K3Rpj8k3j2LMooJ8M7N6M0J9J0QP%
8562B35j4k2j9kJ6K5K6J9Kj7l1k9k0j3qqj8m3o4n6k1J6L6L8L0J1j0j1J0L4M6M1L1K0J5J3Q
8546B66ql3m8m5l3k6k2j7j0rj5j9k0rJ8M3M9K7Jj5k0k3j9nONLJ4L1K8Rrj6k4k8j6J5L3K0r
8529G0k2j5j2j4r%Kj0k4k3j1LJ3K4K7J6lj5pJ1J8Kj4oJ9L6L6K9K4J4rl2l8k8j3lOJ2J3J2J2
8511I1J1PNJ2J8J1LJ2L0L2Nk2l2l5m1l5jM1N1K8MjKnj2qjnj8k3j3MJ3J2OPJ5K1Rj7l0j2RM
8492A52k5m0k0J1K2J1jJNNJkl%RJ5Qoj3nJ0J9K1K1Rj4l2l0j1Jmj3pKnk3l0j6LLprMJ2Q%KJ3
8471E2K8L7L1Qk3l5k0OJ9J4Nmj0pMJ3Pj0j5pKQJ6K2J1j6l0j4J0J7J3J6K6K1mk6l4l1l1k7j3
$$ y = [76, 107, 133, 142, 144, 150, 155, 146, 124, 108, 111, 123, 125, 115, 105, 94, 68, 31, 17, 48, 103, 139, 143, 134, 136, 146, 157, 173, 195, 211, 205, 175, 140, 115, 105, 110, 120, 119, 102, 91, 112, 164, 215, 240, 245, 245, 241, 220, 184, 154, 155, 184, 212, 207, 167, 124, 104, 103, 97, 70, 34, 7, -5, -6, 6, 32, 63, 86, 95, 88, 70, 47, 35, 38, 42, 36, 30, 48, 95, 151, 191, 210, 220, 228, 235, 235, 221, 199, 180, 178, 194, 219, 245, 264, 266, 249, 218, 189, 169, 156, 148, 140, 122, 79, 15, -41, -62, -46, -10, 28, 58, 69, 59, 48, 58, 92, 138, 179, 210, 230, 245, 258, 266, 258, 225, 177, 132, 99, 73, 51, 34, 24, 15, 0, -19, -39, -48, -30, 13, 62, 89, 90, 75, 55, 32, 13, 8, 14, 19, 22, 36, 67, 95, 104, 95, 79, 55, 27, 11, 26, 59, 79, 70, 48, 33, 21, 7, -2, -2, 0, -10, -34, -57, -68, -65, -52, -28, -1, 15, 12, -3, -10, 1, 19, 21, 7, 1, 20, 56, 92, 121, 145, 159, 150, 118, 80, 52, 39, 36, 42, 54, 67, 79, 91, 102, 109, 114, 126, 144, 155, 158, 170, 200, 232, 237, 215, 183, 148, 107, 72, 71, 112, 163, 191, 195, 194, 196, 191, 179, 171, 170, 165, 147, 124, 111, 115, 128, 140, 146, 153, 168, 189, 198, 181, 151, 139, 148, 152, 127, 87, 67, 78, 100, 111, 110, 111, 116, 121, 122, 120, 117, 117, 126, 141, 149, 143, 130, 125, 135, 154, 175, 196, 205, 191, 159, 129, 118, 119, 115, 102, 95, 97, 92, 69, 39, 23, 26, 29, 22, 13, 17, 29, 37, 37, 39, 52, 80, 117, 148, 156, 133, 98, 78, 84, 103, 117, 122, 118, 108, 101, 105, 118, 125, 115, 100, 93, 95, 103, 119, 141, 152, 136, 106, 92, 102, 119, 132, 148, 174, 195, 191, 165, 131, 100, 69, 42, 29]
8453B9LJ2J1OMJ2K7L9L0Jk1j6jkk3l3j7MMj6k8j3RK1K3K6K5Pj6k2oMpk0pK3M5M1K0Jj2j8j5
8435A34lOQNJKRJ6Pj5k5pK3L0J4lj2k8n8p6n4j5J6K9L6K9Kk9l0ML8M6L7K7J4ok1j6JMnnJ7
8416A47L6L1PoLJ8J6mk1k3j6j6k5k8j9lPRNjj0j1%J6K3K1Rok6m4m9l9k3j5j2rNJ7K3J6J1J5
8398B9K3K6J9Pkj0j4j0JRKj1j1LJ1Kj4j5JJ5J5NmjQJ7J6J1NLmj7k0%K5L3J3j0j9j9k6k8j1
8379E3J8K7Rj7k4j3KRJ3J2Lj0k4l1k7j1QJ9K2J6J0NNJ3K3K1Nj0oLKnqj0k6m2l0OL1K3KKJ6
8361H4J2rj5NK8K9Rj1k3l4l9l1pK0L7L6K4Nqj1oLPLmq%J5K7K9J6rm2o5o1l0mjk1l2j9LJ6J4
8342f8J6K8L7L4J8QJ3K3K2Poj1qqj0nLQQQJ1J3Pqk2k8k1qjJKRJ9K5K9L0K4Rrj8j4ojqk2l5
8322I5l9k8j3pj5k5k4j4kJ2K9M2M1L1K0Oj9m1k9J5O0O7M0J2kpj3j9k4k4k2j5kPRLnj5k1k2
$$ y = [29, 32, 44, 55, 61, 65, 77, 104, 143, 173, 174, 153, 137, 136, 134, 111, 78, 61, 65, 69, 53, 25, 12, 21, 42, 65, 91, 116, 123, 107, 85, 79, 83, 76, 56, 49, 72, 117, 158, 178, 179, 167, 149, 134, 131, 137, 145, 150, 151, 153, 162, 178, 185, 170, 145, 138, 161, 191, 205, 202, 190, 162, 104, 28, -26, -41, -25, 4, 40, 69, 71, 42, 12, 16, 54, 100, 137, 164, 178, 172, 151, 135, 136, 140, 135, 130, 147, 183, 214, 221, 215, 218, 236, 252, 248, 227, 204, 188, 172, 147, 119, 100, 97, 104, 113, 118, 117, 107, 96, 96, 112, 135, 156, 165, 159, 133, 89, 40, 1, -22, -37, -49, -58, -53, -36, -13, 3, 14, 29, 52, 78, 97, 104, 102, 92, 78, 68, 69, 78, 80, 69, 58, 61, 72, 74, 60, 45, 46, 61, 76, 81, 77, 76, 84, 101, 117, 128, 133, 136, 132, 115, 95, 95, 120, 153, 166, 156, 137, 118, 92, 64, 53, 71, 98, 107, 90, 66, 53, 55, 64, 77, 89, 92, 82, 58, 27, 0, -11, -3, 16, 38, 54, 64, 69, 74, 87, 110, 131, 136, 126, 120, 123, 125, 120, 112, 102, 76, 34, 4, 10, 41, 64, 66, 68, 84, 96, 87, 72, 77, 105, 134, 143, 132, 109, 75, 36, 5, -2, 18, 55, 91, 115, 120, 112, 101, 95, 98, 105, 108, 104, 96, 96, 111, 138, 167, 183, 174, 132, 67, 6, -24, -28, -29, -50, -82, -101, -98, -82, -68, -52, -24, 13, 47, 65, 73, 86, 109, 131, 138, 132, 121, 113, 105, 95, 90, 93, 101, 109, 117, 128, 141, 148, 140, 118, 90, 69, 61, 60, 61, 63, 72, 91, 116, 145, 175, 199, 208, 199, 181, 167, 161, 160, 152, 130, 95, 56, 28, 15, 8, -7, -32, -56, -70, -72, -60, -31, 11, 52, 83, 103, 109, 90, 49, 20, 35, 95, 162, 202, 214, 212, 205, 192, 173, 149, 125, 103, 88, 86, 93, 102, 105, 100, 85, 64, 42]
8304D2j7j3j0KJ6K1J1JJJ0J3J2J8K5K1ll1l9k3kJ4K1K1J7Norooj6k7k2JK8M2M3M2L6J6j4l2
8286B03k0PJ9J2mj3j2rlKJ1J9J8Kj7k2rLlk0k4j4ljlomjOOqj9pK8M8L5J1QK2K2pn0p1o0k5
8267D7J5L3K2kj1MK1K5J7J5J5J2Kj7l6m5l6qJ8K7J3rk5l2k5rQJ1KqpKQLpj2kJ1J5Mj3j7rL
8248B3J7L0L7K1j4m4n0l3j8j5j8j6nJ1K5L1K3J2pk6l8k7RM5N5M0J9J3J3J2J0J4J7J3MKM%p
8231A82rkLMPJ5J4Jj3j0LPpk2l1l1l2l3l2k2oJ4K6K8K1J0j0l4m2k4J8N2N9M2J1k2m4m6k7J
8214A9J9K6K6K0Onj2j2rlJ2L3M5L5Jl2m4l1j3ljPJ8K1J1jj2j4kK8N3M9J9lRL0K8kl0l7l2k4
8195A93j9j7j9k5k7k6j9j2mjnq%J9L4L9L8K6ll6m1j1J9K5Roj5k4k5oK1K7J0j0j8j5j1kPQl
8178F7pNJ8J3rk4k1mJ0J5Qlj1qlkqj5j6j0KK5M8M5J8j0j8j2j4k5k6j4k%oonqqJJ7K3J3nj3
$$ y = [42, 25, 12, 2, 4, 20, 41, 52, 53, 54, 64, 77, 89, 107, 132, 153, 150, 119, 80, 57, 55, 69, 90, 111, 128, 133, 127, 118, 112, 106, 90, 63, 41, 42, 70, 112, 155, 197, 233, 249, 235, 203, 183, 190, 209, 221, 217, 204, 192, 183, 180, 182, 193, 212, 230, 232, 215, 193, 184, 187, 184, 164, 140, 126, 123, 122, 119, 113, 109, 108, 114, 120, 112, 93, 86, 114, 162, 197, 208, 216, 238, 260, 253, 203, 132, 72, 47, 62, 95, 117, 115, 104, 108, 129, 154, 171, 186, 201, 213, 215, 198, 162, 117, 81, 73, 91, 118, 131, 122, 97, 65, 40, 31, 39, 50, 52, 44, 37, 39, 47, 50, 43, 31, 29, 40, 55, 59, 46, 29, 20, 23, 40, 70, 107, 128, 114, 70, 20, -13, -31, -46, -64, -80, -85, -74, -49, -18, 5, 17, 10, -16, -54, -81, -72, -27, 28, 68, 87, 100, 113, 125, 135, 149, 166, 179, 183, 185, 189, 189, 182, 173, 171, 174, 178, 185, 200, 214, 215, 202, 192, 195, 202, 195, 173, 142, 111, 79, 46, 14, -8, -14, 0, 26, 54, 75, 85, 75, 41, -1, -25, -7, 45, 104, 146, 157, 135, 91, 45, 18, 19, 38, 64, 90, 110, 116, 111, 99, 87, 78, 75, 87, 120, 165, 200, 201, 169, 125, 94, 81, 78, 77, 84, 102, 123, 134, 133, 121, 107, 105, 133, 186, 235, 254, 251, 260, 290, 318, 316, 286, 249, 217, 193, 174, 157, 138, 113, 86, 60, 41, 29, 25, 24, 19, 11, 11, 30, 64, 103, 141, 167, 164, 128, 87, 76, 95, 120, 129, 123, 108, 84, 59, 53, 74, 101, 111, 101, 83, 68, 57, 55, 62, 70, 67, 60, 65, 83, 96, 87, 63, 42, 38, 48, 63, 71, 68, 57, 49, 46, 44, 36, 21, 5, -5, -3, 22, 70, 115, 133, 123, 105, 93, 79, 54, 28, 14, 12, 12, 6, 0, -5, -13, -21, -20, -3, 20, 33, 28, 15]
8158A5pOJ0NmoKJ1J5J3J1J5K0J7lk7l2mL3M8K9Jj4j5j6k1j9j0qj6k4k5k3j3NL0M0K7Kj3j0
8140D5OK1K6K2J2kj5k2j0K1M8M3J3j2j5j0j3j7j4qj2k2j7%J1R%mlJJ0J9K0J9K2K7K0Kj6k3
8123A82j9mJ6K3Nk3k5NL6L8J6jnmnkKkj0j4j0qnOK0J4j4m0l8j4NLjMJ2J3Jj4k5k9k8j4NJ6
8104F8J1jljmj5k0oJ1J9J5J1NklOJ9J7kk9m7m3k1JMrj7oJ2J7J2RJ1QLQJ1MoOL6M9K8ql0l2
8084I6k6rRJ2rl3l2qJ1K2K1J6POJ6K9K3Mj5k3k3j1J4L1K3jrJ3M0M6L4J4rl6n4n3l5j3JKj1
8066H0k6k3jK1K7J2pk7m1l5j2J2J2kr%RRM%ok0k4j6KJ8L0L5L4K0jj6j5NK8L2J3qj7j4j1pK
8048F7J0RQJ9L1K5Kj0ppj7j8MK5K4Rjpk1k9j7OJ5Qjpj7k5j3J1K2Qnl%j0j8jK8M1K8Oj0j2l
8028A47J4K5J3qj6nJpk4l3l8m0l3j2J8M4N1M2K0kj4j2mj%PJ5Nk1m0l7j5PJ7Rj7l7k9jK0J8
$$ y = [15, 8, 14, 24, 29, 25, 19, 21, 32, 47, 60, 71, 86, 106, 123, 120, 93, 61, 57, 90, 138, 167, 168, 154, 139, 123, 102, 83, 73, 65, 49, 25, 0, -23, -36, -31, -1, 39, 66, 68, 55, 45, 51, 72, 98, 120, 132, 130, 115, 93, 83, 104, 152, 195, 208, 196, 181, 171, 158, 141, 127, 119, 107, 85, 68, 68, 79, 88, 88, 84, 81, 82, 92, 111, 131, 150, 172, 199, 219, 221, 205, 182, 163, 159, 175, 198, 203, 180, 155, 160, 196, 234, 250, 249, 244, 240, 235, 233, 235, 233, 223, 209, 199, 191, 186, 192, 212, 226, 212, 172, 134, 120, 125, 128, 127, 131, 143, 156, 157, 143, 118, 89, 61, 47, 52, 68, 79, 78, 75, 74, 70, 55, 35, 29, 40, 59, 74, 85, 90, 88, 85, 91, 110, 127, 125, 96, 49, 6, -15, -14, -10, -19, -36, -42, -30, -13, -1, 8, 19, 27, 30, 38, 49, 53, 47, 53, 89, 138, 166, 158, 128, 96, 70, 61, 70, 82, 73, 40, 8, 0, 11, 33, 54, 70, 77, 83, 99, 128, 151, 155, 140, 117, 94, 83, 97, 128, 151, 150, 141, 154, 194, 240, 274, 288, 279, 243, 189, 136, 101, 88, 89, 91, 80, 54, 31, 30, 51, 78, 90, 83, 56, 15, -20, -32, -20, -8, -10, -19, -19, -10, -1, 3, 3, -3, -23, -47, -63, -61, -43, -13, 22, 56, 76, 75, 59, 44, 49, 77, 109, 122, 114, 97, 83, 72, 65, 67, 77, 86, 94, 113, 144, 169, 171, 161, 154, 147, 130, 112, 116, 141, 165, 174, 173, 166, 145, 116, 99, 105, 120, 128, 127, 120, 103, 78, 65, 76, 98, 106, 101, 98, 98, 88, 70, 69, 97, 138, 166, 172, 162, 150, 147, 161, 186, 199, 191, 175, 170, 171, 164, 140, 107, 69, 29, -4, -16, 2, 46, 97, 139, 159, 157, 143, 131, 127, 126, 126, 133, 148, 153, 132, 92, 55, 40, 47, 64, 73, 56, 19, -10, -11, 9, 27]
8010B7QJ6L0K4lj7nJ6K4J5lk2l8l5j4OJ5J6J7J2kj4j2j0j5qK5O0O2K9jrj0j6j1J1L2L1J2k
7993B41qj3j8k0j8rJ1L2L5J4plJ0Qrk4j7jPOnj7j8pOQKLOLj4l5m6l7j3O%k7l9j8K2L7J8pj0
7973C5QK8L6L2K4J1Jqj0kJ0J2nl2m4l3mK0K7J7%pmkj2k5k0okolNPkJK1M1L7K1J0PMnrpmjK
7953A64%j3k7l1k1j4j5k3k3j2QJ8J8J5K4L8M2K8J2PJ2J9K3K4Pk1m8n9o0n3l2NL7L7J5qj7k4
7936E2k8j9jJ4J6J6K1K2J4J0J2J1kj8k4j5nLPOKLJ2K6L4L3K5J0j1l3l7j2K6M7L4kk8k8j8j4
7919A61j6j0KROPJ3J3Kj3j6j0%RJ3J3NlmLJ1Oj4l3l6k3nMOJpj5j5%J2RnpJ2K8L1K6K1J1j0
7899A92l1k9j0RRnk9m7m9l2j3MJ5K1K0J0NNJk0m2m0j7j%PK5L4J5j0j6%J8K3K1J7J7J9K2J7
7882A35MmNK0K5J5Koj5k2j6PK6J9rk5j8nj1l2m3l2j7j5j8pJ9M5O3P0O1L6jk4k7k3k5l6l9k5
$$ y = [27, 35, 51, 81, 105, 102, 85, 80, 96, 120, 135, 132, 110, 72, 37, 23, 29, 44, 60, 77, 89, 87, 73, 61, 51, 36, 28, 53, 113, 175, 204, 203, 194, 184, 168, 157, 168, 200, 231, 243, 241, 233, 220, 202, 182, 164, 155, 166, 198, 233, 247, 240, 237, 247, 255, 246, 222, 205, 204, 211, 217, 212, 195, 177, 170, 176, 184, 186, 189, 195, 198, 184, 149, 103, 66, 53, 59, 59, 32, -7, -25, -3, 34, 52, 45, 35, 43, 71, 107, 139, 163, 174, 175, 167, 157, 155, 165, 177, 172, 140, 96, 63, 59, 79, 106, 123, 123, 116, 112, 110, 98, 73, 53, 47, 45, 39, 36, 41, 48, 46, 47, 68, 109, 146, 167, 177, 184, 188, 183, 174, 167, 163, 162, 164, 164, 151, 124, 93, 72, 58, 43, 20, -3, -15, -7, 11, 29, 44, 68, 106, 148, 176, 188, 195, 207, 226, 249, 273, 280, 259, 211, 152, 92, 39, 7, 12, 49, 86, 101, 93, 76, 52, 24, 5, 4, 18, 34, 50, 71, 93, 107, 117, 129, 140, 138, 120, 96, 81, 76, 79, 86, 92, 94, 97, 109, 135, 169, 202, 227, 237, 226, 193, 156, 144, 170, 217, 251, 249, 221, 193, 175, 161, 145, 135, 137, 146, 152, 159, 172, 185, 187, 174, 158, 148, 148, 157, 170, 183, 188, 185, 181, 184, 195, 201, 187, 154, 118, 95, 90, 94, 100, 101, 94, 79, 64, 64, 76, 85, 80, 73, 85, 113, 144, 170, 191, 202, 192, 161, 132, 122, 131, 140, 135, 106, 59, 10, -22, -35, -31, -16, 5, 25, 35, 40, 45, 46, 26, -16, -56, -73, -74, -74, -67, -42, -8, 7, -3, -19, -19, -1, 22, 43, 60, 77, 96, 118, 135, 139, 135, 140, 160, 185, 200, 202, 196, 181, 159, 143, 150, 176, 195, 186, 161, 143, 138, 127, 95, 52, 20, 3, -12, -30, -37, -18, 27, 90, 160, 221, 257, 256, 232, 205, 182, 157, 121, 82, 57]
7865E7LK7L4K3OJPJ3J0nk3l5l1j0K0L5K5Lj1j4j0ojQJ7K2K0J2MLQRKqj3j1lPQql0l7j9KJ1
7845A22RJ5K5K3%k4k9k5k3k5j8mOjj2j0NJ6J0llJ5L5L9K9J6O%mj0j9k2j0J0J8jl3m9l8j2J4
7827C8L1L5K4J1RJ8K6K4K1K7L5K8%k6l4k2rj1k7l3j1K3L4J8jLK4L8L3J8Olj4l0m4m7l3rJ0
7810A80K1K7L2K6J4OQPj0k9k6jK7M3M7M6M3L7K9J8J4K2L5L8L6L7M6N1M7M5M7N1O0Q2J05J05
7795A366Q6P5Q5J05J33J78K31K72L22M27N81P25Q82J152J583K143K874L841M718M621K833
7786B9233k51l178m663m593l758k879k150j546j100q41o74n12l72k99k59k14j74j51j10m0
7777A469J0J2MK9N4L5k1p3j01j10j00p7n6l9j5J0J5RJ9M7N5L2Oj0k7k8J5Q0J06Q2O1O8O4L8
7762A663L5P5J17J45J91K54K91L11L82N31P06R14J247J732K353L181M236M997M460K102j248
$$ y = [57, 60, 87, 121, 144, 150, 151, 158, 171, 181, 176, 153, 118, 87, 77, 97, 132, 157, 160, 149, 135, 125, 119, 118, 126, 143, 165, 185, 197, 201, 204, 212, 221, 223, 215, 202, 191, 188, 195, 203, 195, 165, 128, 109, 111, 122, 131, 146, 171, 194, 194, 170, 141, 116, 93, 68, 50, 46, 52, 51, 39, 29, 34, 50, 60, 57, 54, 69, 104, 143, 172, 188, 194, 194, 190, 180, 161, 139, 129, 139, 157, 156, 123, 74, 36, 24, 38, 69, 104, 128, 139, 148, 166, 192, 216, 237, 264, 299, 327, 327, 301, 267, 245, 236, 225, 198, 165, 154, 177, 211, 229, 228, 231, 255, 293, 326, 344, 350, 347, 333, 303, 259, 212, 179, 170, 180, 201, 228, 260, 286, 300, 306, 314, 321, 311, 282, 256, 255, 282, 325, 372, 418, 461, 498, 527, 545, 559, 581, 616, 654, 690, 727, 773, 824, 871, 916, 963, 1014, 1074, 1156, 1261, 1366, 1452, 1527, 1612, 1717, 1850, 2028, 2259, 2531, 2853, 3280, 3861, 4586, 5468, 6620, 8203, 10346, 13220, 17061, 21779, 26400, 29233, 28982, 25804, 21141, 16548, 12790, 9911, 7761, 6215, 5115, 4274, 3600, 3088, 2716, 2417, 2158, 1944, 1770, 1619, 1509, 1469, 1479, 1491, 1495, 1524, 1578, 1613, 1592, 1519, 1418, 1308, 1208, 1131, 1075, 1036, 1021, 1031, 1046, 1055, 1074, 1121, 1176, 1208, 1214, 1204, 1177, 1149, 1164, 1244, 1350, 1432, 1493, 1561, 1625, 1663, 1698, 1773, 1890, 2035, 2226, 2480, 2771, 3082, 3464, 3995, 4701, 5615, 6862, 8594, 10947, 14128, 18364, 23361, 27821, 29923, 28675]
7753B8675l927m902m462l528k671j966j400j022q03o31m66l57k98k42j82j52j44j16q7r4j10
7744A115q8m2k4l1k7j4j9k6KL8L6%j7j1qqJ0L0K5NNJ5J1QL2N4N1M7P4R9Q2N9R6J60J81J71
7729B091J94K53L02L58M70O22P76J004J396J932K581L430M405M838L780J072k156m340m823
7720A8185m146l186k384j764j290r66p43n59m20l49l10k52j91j60j44j13q3p5p7o4m5m0m7
7710G77m3l8m3n1m8m2l8l3j7mnqk%j2k2j6LJ4J2Nmj8k1j6j8l5m8l3KK5K6J8J6J3Nml%lj3k5
7692B53l0k5j4omqj5j8j2KJ5J5Plrj5j2MK1K5K5L7M8M0Qk2l4l9m5m4l0j7j7j5%J3Oj1oJ8L4
7674A20K3%j2lJ9L7L7K0%j4k1k2j5JO%j1rlmqjJ2J1nj5roj8l5l5j6KLk%J4L0L8M1M5M2K2j3
7655B46m3n5m9l9k7rQJ5P%jKMRJ4J4OLPRkj8k2j2LRRKj2k9l6k4%K6M4M3K6Nrqpj2j7qJ3K9
$$ y = [28675, 24748, 19846, 15384, 11856, 9185, 7219, 5819, 4797, 3994, 3363, 2897, 2540, 2242, 2000, 1818, 1666, 1522, 1406, 1319, 1225, 1115, 1027, 985, 961, 930, 903, 889, 870, 844, 846, 884, 920, 920, 903, 892, 884, 876, 886, 916, 941, 946, 951, 966, 977, 985, 1017, 1071, 1122, 1169, 1243, 1342, 1424, 1483, 1579, 1739, 1920, 2091, 2285, 2538, 2840, 3198, 3668, 4290, 5066, 6070, 7466, 9398, 11979, 15409, 19814, 24652, 28432, 29504, 27348, 23008, 18185, 14039, 10853, 8469, 6705, 5415, 4449, 3706, 3147, 2727, 2378, 2068, 1816, 1625, 1465, 1321, 1208, 1125, 1050, 973, 909, 864, 824, 777, 734, 696, 653, 602, 554, 512, 474, 441, 424, 420, 415, 407, 405, 405, 393, 371, 355, 358, 372, 384, 389, 385, 367, 346, 330, 312, 277, 229, 196, 198, 223, 249, 267, 283, 296, 301, 297, 294, 294, 291, 278, 253, 223, 198, 184, 178, 174, 166, 151, 133, 121, 123, 138, 153, 160, 157, 148, 133, 121, 125, 146, 171, 196, 233, 281, 321, 329, 307, 273, 234, 189, 145, 115, 98, 81, 66, 66, 79, 85, 74, 68, 86, 120, 143, 143, 131, 128, 147, 184, 221, 241, 241, 227, 206, 184, 169, 170, 176, 176, 165, 156, 153, 149, 141, 140, 152, 163, 158, 143, 134, 128, 110, 75, 40, 24, 26, 29, 27, 27, 41, 71, 109, 150, 195, 237, 259, 246, 203, 148, 99, 60, 33, 24, 32, 47, 54, 54, 53, 55, 59, 68, 82, 96, 102, 105, 112, 121, 119, 101, 79, 67, 70, 79, 88, 90, 78, 49, 13, -11, -11, 15, 59, 102, 128, 133, 124, 116, 109, 97, 80, 72, 85, 114]
7635A14K6Pj2k5l1k8k0j3j7k2j8JJ7J9POJ5K6K9J9Ooj2j4j0jJ0J6J8J0lj5j4mLpj6rJ1J6K
7618H1j2pMmj6pK7M7M2K2Mj6m1n1l6j7j2j4qJ0K0K5K8L0K0Kqprj2rPK0K0Pknorj3j3j2nOJ4
7598H5J6Qnj6j3mONJlkjNRNnqJRP%KPPjlOJ2J0kj5k4k6j4J1L1L3J2j3k9k7oJ7K5J5ol0m3l7
7577A2j3QJ8J7K0K3J6LlOJ6K0K6L6L2Qj7k2j5j9m0n7m8k2MJ1NJQJ3Oj1j7j4plRK2J7j0l3k8
7559b2j1lj2j4nPJ8K9L5L0K0K6M8O2M8J7lmKMlrj0n%lj3k0k5l1l2k3oPRPPPJpj5j8j4KK7M5
7539A50L7J3nrnpj4j3lJ2K2K2J4nk6l6l1j8plOJ7K2J9J1jj5k5k4j3kOJ5K1J7lj4mJ3J4kj9
7520A27k2j7rMJ8J8Nnmpj8k1mK3L7L2J9Oj2k5k2mMqk2k0MK9M1L5J5j2k6k1nPJ3K1K7J9kk2
7502A96k3j5j7k7l5l3k2mK0M3M6K4j0k7j5J5L5K7%k0j3NJ6Qqk2l5l7j9J1K6J2mjRLj1oJ4K4
$$ y = [114, 140, 147, 135, 110, 79, 51, 31, 18, 1, -21, -39, -38, -21, -2, 5, 11, 26, 52, 81, 100, 106, 100, 88, 74, 64, 63, 73, 89, 107, 117, 114, 99, 85, 81, 84, 77, 61, 52, 63, 79, 81, 69, 62, 66, 62, 46, 39, 66, 113, 155, 177, 181, 165, 124, 73, 37, 20, 8, -6, -14, -4, 16, 41, 69, 99, 119, 121, 113, 106, 97, 85, 76, 83, 103, 123, 130, 128, 123, 117, 108, 95, 82, 70, 65, 71, 85, 101, 109, 104, 88, 75, 71, 77, 82, 83, 80, 78, 77, 82, 91, 96, 91, 83, 84, 93, 100, 100, 102, 109, 116, 115, 112, 118, 130, 140, 138, 123, 99, 73, 59, 70, 101, 134, 146, 133, 104, 77, 71, 88, 113, 128, 122, 92, 49, 12, -1, 7, 25, 42, 62, 85, 101, 104, 101, 107, 123, 143, 169, 205, 237, 245, 228, 206, 191, 172, 132, 75, 27, 5, 9, 20, 25, 26, 34, 47, 53, 42, 25, 11, 4, 1, 10, 32, 49, 39, 6, -22, -33, -36, -48, -62, -67, -60, -42, -13, 22, 52, 72, 98, 146, 208, 256, 273, 270, 266, 268, 272, 269, 260, 250, 245, 245, 242, 229, 209, 184, 153, 121, 98, 92, 99, 108, 115, 122, 129, 130, 123, 108, 90, 76, 78, 105, 150, 187, 200, 195, 186, 181, 174, 160, 147, 144, 156, 178, 200, 214, 209, 183, 147, 116, 98, 91, 88, 94, 111, 133, 152, 163, 162, 147, 122, 98, 85, 83, 89, 104, 125, 142, 139, 125, 121, 134, 148, 146, 127, 105, 88, 79, 83, 101, 119, 124, 119, 115, 108, 90, 69, 65, 88, 125, 157, 176, 182, 170, 145, 123, 119, 123, 115, 93, 73, 77, 106, 147, 182, 197, 185, 159, 138, 133, 140, 153, 174, 201, 220, 218, 196, 173, 158, 141, 114, 79, 46, 24, 20, 40, 83, 129, 153, 143, 116, 101, 116, 151, 178, 178, 158, 145, 150, 166, 174, 166, 144, 109, 72, 53, 64, 90, 102, 98, 97, 106, 109, 98, 92, 106, 130]
7485A30J2lpprrj1k1l2j9K5N6M5Rj2o%nj1j2j4k4k5j7pqj1lRJ4J7K7L8L3J4mj0j2k7m6m1q
7467HK6K7lk1mK9M3L7L1L6L8K6Rkj2k5l7m0l0j5nJjj%kj4k4k1kJ1Jj2j0PJ7J2KmpoJ0K9L1
7448A33Qj5j6jOjj3j7j8j7j9j5nQJ2Jk1l1k0KJ4J7J9K3J9J1J3J7J2oj7j5rkJ2L7M6K3rj7J
7430A50Qnk0j0OJ1JlMRPM%ql0n6o6m4mK8L3J8JoKJ4K1J9J3J0J8K1J0rj5jJ7K6K5K2J5Kj4k9
7411A95m2m7m0k6j2pmkMRJ0MlMK0K9J5%RL4L9Nl8n1l6j6mQJ8J4mk6l6k6lJ9K0KrLK3K3Mrp
7391F3%NJ1J4Nj3k8l2k5rJ9M1K4j7l5j0K8L7K5J8K6K8J1j2k0j7p%Jpj7k1j3opj4j7oJ2J8J
7374E4k7l9k7pjokJ7L4K8PpkJ1Rnj6j2lllKJ3Mk1m0k7LK7L2K3Pj4l0l7k9j5LJ8K2J4LLM%r
7354d4pOJ3RknkkmkOJ5J9J5kk3l4j8J4M0M1K5ROPPOJ1J8J6Pnj3j9j9mJ9K8J1j6l0l1l2k9j1
$$ y = [130, 142, 139, 132, 125, 116, 107, 96, 75, 43, 24, 49, 105, 150, 159, 147, 141, 141, 136, 125, 113, 99, 75, 50, 33, 26, 18, 7, 4, 13, 27, 44, 71, 109, 142, 156, 152, 142, 130, 103, 57, 16, 8, 34, 61, 58, 37, 33, 62, 105, 142, 173, 209, 247, 273, 282, 280, 268, 243, 206, 166, 136, 121, 116, 117, 116, 115, 115, 113, 99, 75, 54, 52, 63, 64, 52, 42, 49, 66, 78, 80, 76, 69, 63, 73, 102, 133, 141, 126, 110, 109, 115, 114, 101, 84, 66, 49, 30, 15, 10, 18, 30, 31, 10, -21, -41, -39, -25, -8, 11, 34, 53, 64, 77, 94, 106, 100, 83, 68, 59, 57, 69, 106, 152, 175, 166, 149, 150, 158, 153, 133, 123, 129, 140, 141, 138, 142, 151, 158, 162, 162, 154, 124, 68, 2, -42, -46, -18, 15, 33, 34, 28, 30, 44, 65, 84, 97, 107, 125, 146, 156, 147, 132, 131, 148, 174, 199, 221, 236, 238, 224, 195, 153, 106, 66, 40, 28, 21, 17, 15, 19, 28, 38, 42, 39, 43, 63, 92, 107, 107, 116, 150, 189, 194, 156, 105, 69, 53, 49, 57, 75, 89, 85, 59, 23, -3, -6, 13, 33, 35, 26, 29, 52, 75, 79, 70, 63, 63, 68, 79, 93, 98, 85, 57, 25, 0, -9, 10, 51, 75, 58, 23, 13, 41, 78, 103, 121, 147, 175, 186, 174, 154, 137, 130, 130, 131, 124, 107, 86, 73, 67, 60, 46, 29, 23, 35, 53, 54, 27, -12, -39, -46, -47, -53, -55, -38, -4, 24, 31, 24, 22, 33, 42, 37, 21, 9, 6, 3, 0, 2, 15, 19, -2, -42, -69, -66, -39, -7, 16, 23, 9, -21, -58, -87, -102, -99, -81, -59, -45, -42, -39, -35, -35, -44, -51, -45, -32, -23, -25, -30, -32, -34, -38, -40, -34, -19, 0, 15, 13, -10, -44, -62, -48, -8, 33, 58, 67, 73, 80, 87, 93, 104, 122, 138, 145, 140, 127, 108, 89, 85, 104, 132, 143, 127, 97, 66, 34, 5, -6]
7334fJ5K8J7OJ3L0K8Kj5JK9L0jl6m4l4k2j3LJ2Kj8j9MK7K3Q%KjJJ9M3M2J6j6k7k7k4k6l1l5
7316Fl5k0RL4M1L6K6J5J2J6J4%k2l3k5pOQJj4k5j1K2M5L4Oqpqj8k3j0NKj2k1j5JJ5J9J0qk1
7297D0j8jK1L2K8J8Opj7qJ5L1K1pk1rJ2K7L1K3Jk3k8j1Klj5j0QJ7Rmj2j3j1qqj3j5j1qqmM
7278E3Nj0k3j1J8L5L5L1K7Ok3k6J0N0N1J8rpPMj5l0l0k3k3k9l4k6j1mjJ0L1M4L4Jl5n9n5k9
7261d3NL1M1M8N4M2J0k2k9j4mnlJ3K7J9JlRJ3pl4l7j9kj0k6k4LK8L1J5KKJ2K8L8L1Ok2l0k1
7243A54j5k3l0k3qMLLRJ7K1J9J3NnmLOql3m5l2qOJ1K0L4M2K9QjJ%mmpk2m4m3nM2N5K8ql0m7
7223H4o0n2j4L5N8N5L8J8pl1l9k5mPJ0ROOJ4K8L2K0lk1k8k5j4oj4k9k5J5O0P1M5J3KJjrj3
7205B07k1l3m3l2pJ0J6J5J3Ppk4l2k0kOqk8k7oJ6J8RKJKOK7N5P0N2J0l1m8m2k3jJ2J1Jj2j9
$$ y = [-6, 9, 37, 54, 60, 73, 103, 131, 133, 118, 119, 148, 178, 177, 141, 97, 63, 41, 28, 31, 43, 45, 27, 8, 12, 39, 62, 70, 70, 72, 71, 72, 91, 134, 176, 192, 176, 149, 122, 98, 72, 41, 6, -29, -49, -40, -6, 35, 71, 97, 112, 124, 140, 154, 154, 132, 99, 74, 67, 73, 81, 82, 68, 43, 32, 54, 99, 133, 139, 131, 124, 116, 98, 75, 65, 70, 72, 60, 39, 24, 25, 40, 59, 69, 61, 40, 22, 21, 42, 74, 102, 120, 126, 119, 102, 94, 109, 140, 161, 154, 133, 124, 136, 163, 194, 217, 218, 195, 167, 156, 158, 155, 140, 130, 138, 155, 164, 160, 148, 135, 124, 116, 108, 95, 80, 69, 61, 53, 49, 53, 58, 48, 25, 14, 32, 67, 102, 133, 160, 166, 143, 117, 127, 177, 228, 246, 237, 230, 237, 241, 226, 196, 166, 143, 120, 91, 57, 31, 20, 16, 15, 25, 56, 100, 134, 135, 100, 41, -14, -43, -38, -7, 34, 82, 136, 178, 188, 166, 137, 123, 119, 114, 111, 124, 151, 170, 171, 168, 177, 190, 183, 149, 112, 93, 91, 81, 55, 31, 34, 62, 93, 108, 110, 112, 124, 152, 190, 221, 227, 205, 175, 154, 139, 116, 86, 63, 55, 59, 62, 65, 74, 91, 112, 131, 144, 149, 144, 140, 143, 149, 141, 108, 63, 31, 23, 29, 40, 60, 94, 136, 165, 173, 172, 173, 173, 169, 165, 158, 136, 92, 49, 44, 86, 141, 169, 161, 131, 84, 24, -28, -42, -7, 51, 106, 144, 162, 155, 124, 85, 60, 56, 63, 73, 82, 88, 94, 108, 136, 168, 188, 185, 164, 136, 111, 97, 91, 77, 48, 23, 38, 98, 169, 214, 227, 229, 230, 229, 220, 207, 186, 153, 110, 78, 71, 81, 97, 112, 125, 132, 125, 101, 69, 49, 47, 53, 45, 17, -10, -16, 0, 18, 27, 29, 30, 32, 38, 65, 120, 190, 242, 252, 221, 173, 131, 108, 107, 119, 130, 131, 119, 100]
7187A00k2j8rJQPnk3l6l6k4LL2M9M6K5Ooj4k3k1nJ9K7J4j3l3l6k2j0j3l0l8k6jJ9K7K6K3J8
7169a4J4J8K1K0J7K4L0K3jk6m0m0l0qK3L8K4kj1MK8M0L2Pk3m1k8LK1Qj0rJ1K6K4J9K0J8Ql
7152B35kKJJJ1J6Pj1j7j3j1j3kJ8K3Kk0k2j2qj2j1j1k6n0n1j8K0L7K6J3J1J9K3J5%pmjqk0
7134A30k4k3l1l7k3OK4J2j6k7j4PJ9K2J8Pqk0k1j6j3j4k2k0JL3M8L5J2%NJ1J1J0ROLKjj0j7
7116G4j2QK1J5lj4j3pljMJ1J7K1J6Lj4l0l7l1j8%J0J4J4J4J7K2K3J6Kj0k0k5k9k5j1J0K5K8
7099H2K6K1J4KnpJJ3K2J9kk9m6m4l2j6mJkqnQK3K7K1J9K2K4J7Nqk1l4l4j7J0K4K3J2Kj0k1
7081I3k6k0j3rmJjj7k4nL8O6N5K4MLNNJpj8k4j5lNQJ2J5J2PNNjqj1qqlRJ5Kj5qJ8L1J1k1l7
7060A44m0l8k1J2L7K4jlK4L7K0qj9j4j5j9k2j5rjNQMkLK1L5L3J3j2k1j3kJjJPJ0%j4k1k0k2
$$ y = [100, 78, 60, 51, 52, 60, 67, 62, 39, 3, -33, -57, -54, -22, 27, 73, 98, 104, 98, 84, 61, 40, 35, 54, 81, 95, 82, 49, 13, -9, -19, -32, -62, -100, -126, -127, -108, -81, -55, -32, -14, 0, 18, 39, 59, 76, 100, 130, 153, 152, 126, 86, 46, 16, 8, 31, 69, 93, 91, 80, 84, 112, 152, 184, 191, 168, 127, 99, 102, 123, 131, 121, 112, 123, 149, 173, 192, 212, 230, 238, 235, 233, 235, 236, 237, 248, 264, 271, 260, 243, 230, 219, 206, 204, 222, 245, 247, 227, 205, 193, 185, 173, 162, 151, 125, 75, 24, 6, 26, 63, 89, 102, 113, 132, 155, 170, 170, 163, 159, 158, 150, 130, 106, 83, 52, 15, -8, -2, 22, 34, 18, -9, -23, -16, 3, 25, 43, 50, 42, 22, 1, -15, -28, -42, -64, -84, -83, -50, -2, 33, 45, 45, 50, 61, 72, 82, 91, 97, 100, 102, 101, 91, 74, 62, 70, 91, 106, 103, 89, 76, 69, 66, 65, 69, 80, 97, 118, 134, 137, 123, 93, 56, 25, 7, 7, 17, 31, 45, 59, 76, 98, 121, 137, 139, 129, 109, 84, 55, 30, 19, 29, 54, 82, 108, 129, 143, 145, 140, 133, 134, 147, 169, 188, 186, 157, 111, 67, 35, 19, 15, 16, 14, 6, 1, 9, 32, 59, 80, 99, 121, 145, 162, 167, 159, 138, 104, 70, 53, 63, 87, 110, 122, 124, 114, 93, 67, 47, 34, 25, 21, 22, 21, 4, -20, -25, 13, 79, 134, 158, 162, 165, 170, 175, 176, 169, 151, 127, 112, 109, 114, 122, 134, 149, 161, 168, 173, 178, 177, 169, 158, 150, 142, 139, 148, 163, 165, 150, 142, 160, 191, 202, 181, 144, 104, 66, 45, 57, 94, 118, 117, 114, 138, 175, 195, 187, 168, 154, 139, 120, 98, 83, 74, 73, 78, 86, 90, 88, 91, 112, 147, 180, 193, 181, 160, 147, 145, 146, 145, 146, 153, 163, 163, 149, 128, 108, 86]
7041H6k7k8j4MJ2Kj7k6k3j4lJ1L0M2L6J1j4k2j1LJ2K0L5N1N5M1J7lj2j6j8j9k2k7k7j9j1j0
7025H5j6j4ojmq%J3J6J2J5L0L8K4ql7m6l5j9rmQK6L5K6J0JlmlLmk5m7m4j4RRjqj1j1oNJ2O
7005erk1j9jL0N5N7L7J3lj4k3k7k6k5k3j3J2K3J3JJ3M0M6J8j1k4k5k8k2KL0L9K3M%RJ6Qrk2
6987A39k4k2k8l8l9k5pPRQPJ6L3M1K8Om%OKnj1k3m1n2m0rJ4K2K3K4K1J0jMK0L6L3J2qj0jl
6969A30k2l9l6j9mJ0K9M8M7K3kj0qqj1oNRLnpqj7k9k9j5NJ1NKQJ7J7QNQJ1J2J5J6Jk1l0j5
6950A04RK0Pj5l7n1m9l1mJ4K2K6L2L2K3J7RKmlLpl1n0m2j4J1J0qk7l1k0%J3K2K5K6J8Jj3j2
6932cLJ9J8JrNL3M2J4l0n2l7qQJ4J8K1K5K7K8J6mj9j0J2J9Jk6m2m0k9j7j3rlOJ2QOJ3K3J8
6914E9%j3rKPKnj3j8j1QJ8J2mj2j4j6j3NK8L3J3pj0%OM%KOJ3J5J0jj0qljormLPQJ1K3L4K9
$$ y = [86, 59, 31, 17, 21, 33, 35, 18, -8, -31, -45, -48, -37, -7, 35, 71, 82, 68, 46, 35, 38, 50, 70, 105, 156, 211, 252, 269, 266, 254, 238, 220, 201, 179, 152, 125, 106, 95, 85, 69, 55, 49, 48, 44, 36, 36, 49, 65, 77, 92, 122, 160, 184, 176, 139, 93, 58, 39, 30, 26, 34, 60, 95, 121, 131, 132, 129, 125, 122, 125, 121, 96, 49, 5, -9, 0, 9, 8, 0, -11, -22, -28, -23, -11, -5, -14, -35, -54, -55, -25, 30, 87, 124, 137, 134, 120, 97, 70, 44, 19, -4, -17, -5, 18, 31, 32, 45, 85, 131, 149, 138, 114, 89, 61, 39, 41, 71, 110, 133, 137, 137, 146, 162, 170, 161, 139, 115, 93, 65, 27, -12, -37, -44, -37, -28, -20, -13, 3, 36, 77, 105, 111, 107, 107, 113, 115, 110, 99, 76, 35, -17, -57, -66, -52, -30, -7, 17, 38, 48, 47, 51, 71, 107, 140, 152, 144, 134, 133, 130, 108, 69, 33, 14, 10, 20, 49, 97, 144, 167, 165, 155, 147, 139, 128, 122, 127, 136, 139, 134, 127, 119, 102, 73, 44, 29, 34, 45, 50, 52, 60, 77, 94, 102, 107, 115, 126, 138, 153, 169, 170, 149, 119, 104, 113, 133, 140, 125, 88, 37, -12, -43, -47, -33, -11, 15, 47, 79, 102, 119, 128, 130, 126, 123, 126, 119, 88, 38, -4, -18, -7, 3, -5, -32, -63, -83, -83, -70, -48, -23, 3, 21, 22, 9, -3, 0, 19, 37, 38, 29, 34, 67, 109, 123, 93, 41, 4, -4, 4, 18, 36, 57, 82, 109, 137, 153, 149, 130, 120, 132, 151, 152, 126, 84, 44, 15, -2, -15, -24, -27, -21, -9, -1, 5, 18, 41, 59, 59, 46, 37, 39, 46, 48, 43, 30, 12, 1, 9, 27, 39, 35, 23, 9, -7, -20, -15, 13, 46, 59, 52, 42, 42, 48, 52, 52, 54, 60, 73, 88, 98, 97, 87, 79, 76, 75, 69, 60, 56, 59, 66, 74, 85, 108, 142, 171]
6893A71Nk4l5k7j2JJ3K6K8J9Krj3j7j9j8j7j9k0j1J4M4N0K2k0m3l2j0ok0l0k7k1k0j0J2K7
6877d6Qk7m5k5J5M6M7K4pk2j4J0K4K1J5J4K4L4L7K6ll3m2j8J9M4M8M2L4J9Jp%Mj0l7n1l7l
6860A29K8M6M9L8J5pj8j6j6k6l4k4jJ8J6jj4j2kJ1J5J1Ljkmj2j6j6qPK2L0J9mj9j8j4j5j5
6843A42jJ8K4J5Kqk3m3n7n2l0nK3M9N1L0kj7j8k4l8m0j6K0L5K3RQJ2Qmj0rqrJJ5Qk7o4o7l4
6824a13LJ7J5J6J7J1J%J1J9J3J2K5L9L4Rj4j7nJ1K2J6j1m2n0k2K1L7K0j0k4j8nJ1K1K4J8O
6808A18pj9k2rJ5L0K6J2Jmo%J4K0J2kqlNJ4J9J1j6l9l8j6oj7k6j2J9M0M0K6Lj8k1oNnk3j9
6790H8PK5J6KNJ7J0j7l9l5j0J0J0mj8k1j9j9j7j1%J3J1MjKJ0QKloj2j8j5NK2K9K4K5K2Pj1
6771I8j1J0K8K3%k0k8k4j4KJ1Pj%Lkj7k3j2%Mkomjlj2k1k7k3oJ6K9K0mk3k2pNJ1J2J5J2J1
$$ y = [171, 176, 152, 117, 90, 78, 79, 92, 118, 146, 165, 167, 158, 145, 128, 109, 91, 74, 55, 35, 24, 38, 82, 132, 154, 134, 91, 59, 49, 43, 23, -7, -34, -55, -75, -85, -73, -46, -38, -65, -110, -135, -120, -74, -27, -3, -10, -32, -46, -36, -12, 9, 24, 38, 62, 96, 133, 159, 156, 123, 81, 63, 82, 126, 174, 216, 250, 269, 270, 263, 263, 267, 257, 220, 169, 132, 129, 157, 203, 252, 290, 305, 298, 280, 264, 248, 222, 188, 164, 163, 181, 197, 196, 182, 170, 168, 179, 194, 205, 208, 207, 205, 201, 189, 173, 157, 149, 156, 178, 208, 227, 223, 204, 186, 172, 157, 142, 141, 159, 183, 198, 200, 192, 169, 126, 69, 17, -13, -18, 5, 54, 105, 135, 133, 116, 98, 74, 36, -4, -20, 0, 35, 58, 67, 75, 87, 95, 91, 81, 72, 64, 55, 56, 71, 79, 52, -12, -79, -113, -110, -93, -78, -62, -45, -34, -33, -33, -22, -3, 10, 22, 47, 86, 120, 129, 115, 98, 93, 104, 126, 142, 131, 89, 39, 17, 38, 75, 95, 85, 61, 43, 38, 49, 70, 94, 112, 118, 111, 92, 70, 61, 76, 106, 132, 144, 145, 141, 135, 135, 149, 169, 181, 179, 171, 168, 173, 187, 206, 217, 201, 162, 124, 108, 102, 85, 59, 47, 66, 106, 146, 172, 175, 157, 136, 130, 135, 130, 107, 88, 95, 120, 136, 138, 143, 160, 170, 153, 114, 79, 69, 79, 89, 85, 67, 46, 27, 8, -9, -20, -20, -7, 4, 8, 7, 9, 19, 27, 29, 26, 20, 8, -10, -25, -20, 2, 31, 55, 80, 102, 109, 98, 87, 97, 125, 148, 148, 128, 100, 76, 62, 64, 75, 82, 81, 81, 84, 82, 65, 42, 30, 30, 34, 32, 26, 22, 21, 18, 6, -15, -42, -65, -71, -55, -26, -6, -10, -33, -55, -62, -57, -46, -34, -19, -7, 4]
6752DJ8K8J9j1l4k3J6M5M5L0K0J3%k1l6m0l1j5NK4L3L0J2orMJ9J5%j2j7k6l8l3pJ3Rj1j3N
6735B4L1N1O1N2K0k3m7l7j4KNNQOmj5j9j3jPNmj1oLQkj6k2j6kJ1J9K0K0K1J8Oj3k6k1j0rj7
6716E5k0j3k%pj3j3j0qj0rkJ2K5K9L4L8M0K3qk9k7j3%QK0K9K8K3K3K3km2o3m6j8j1j8j7jJ0
6698A8NooOJ5J9J9J5Rok9m6m5k1QK1K3J9J7J1RK1M1N1M1K1lk9m5m3k4j3j6k0j9j8k5k4qJ1
6681d6J6J7K4L0J8rk7k6j0J5M4N7M0Pj5j7j7l0m1l2j1J0J6J2JrrPK6L2K7J8J2PPRJ0Jrj5j4
6663A26j4k1k8k9k0mJ4L1L9M0L7L5L3K5J2ok0j9j0j1l1n3n4l2rJQK0L6L6K5Rkj5k5l0k5j2
6647E7JJ3J3%j8k8k8k4k2j4LJ5J4RJ3K6L5L1J5lj7k3k5j9qJ2L2M5M2L3K1J2NPJ9K7J5rk7l3
6629B17k9k9l0l3l2j9jJ0Lrj0jJrpJ3L4K5ml1l2j6KJ2J7K4L4L5K0lk0k4k9m0m3k8kJ2Ooj4
$$ y = [4, 22, 50, 69, 58, 24, 1, 17, 62, 107, 137, 157, 170, 170, 149, 113, 73, 42, 27, 32, 56, 89, 119, 131, 125, 116, 120, 139, 154, 154, 142, 125, 99, 61, 28, 21, 34, 43, 32, 19, 24, 55, 106, 167, 219, 239, 216, 169, 132, 118, 120, 125, 130, 138, 144, 140, 125, 106, 93, 92, 99, 104, 100, 89, 83, 86, 94, 92, 76, 54, 38, 36, 47, 66, 86, 106, 127, 145, 151, 138, 112, 91, 81, 72, 55, 35, 22, 20, 20, 13, 0, -13, -23, -31, -41, -50, -52, -40, -15, 14, 48, 86, 126, 149, 141, 112, 85, 72, 72, 80, 100, 129, 157, 180, 203, 226, 224, 182, 119, 73, 55, 44, 26, 9, 8, 18, 23, 17, 11, 17, 32, 51, 70, 85, 94, 88, 59, 13, -32, -53, -45, -24, -1, 18, 35, 46, 55, 76, 117, 168, 209, 230, 227, 198, 153, 110, 86, 73, 57, 37, 18, 0, -25, -49, -57, -46, -30, -13, 11, 41, 59, 50, 23, -3, -13, 2, 46, 103, 143, 150, 135, 118, 101, 71, 30, -2, -13, -3, 13, 25, 26, 17, 8, 15, 41, 73, 100, 118, 130, 137, 144, 153, 163, 164, 155, 140, 126, 112, 91, 63, 34, 14, 10, 24, 55, 94, 134, 171, 206, 239, 264, 276, 270, 250, 231, 221, 210, 179, 126, 72, 40, 31, 32, 40, 60, 96, 132, 157, 166, 164, 149, 124, 94, 69, 57, 58, 71, 84, 84, 66, 38, 10, -14, -36, -50, -47, -32, -18, -9, 4, 30, 65, 96, 111, 108, 91, 68, 43, 24, 16, 28, 60, 105, 147, 180, 201, 213, 218, 225, 244, 271, 286, 277, 250, 217, 188, 159, 129, 96, 64, 45, 44, 54, 57, 48, 38, 37, 38, 29, 22, 35, 69, 94, 90, 59, 27, 11, 13, 25, 42, 66, 100, 135, 155, 152, 132, 108, 79, 39, -4, -32, -34, -22, -16, -22, -36]
6611c6j3%K0L5L7K3Plj0rmJ%lkLLmo%%rk1j9j1KQQLLQRkj8j9nRJ0OOKm%K2M4M1J9KLJ0J3J0
6589A69mk7m9m2kM3N7L4ml3m7m5l0j0Lkj2j4KJ8K2J2PJ6K7K7J1lqnpj7k6k0OL7M9M0K2Qpk8
6571A68l7k2JQ%OL0M9L8J2mj1k2m0m7l7k1j0%J5K1J2oj2lRJ1lk1l6m6m9m6l0rRJ6K0K8L8L4
6553A3J4j3k4j6KJ4J0kj3mJ3K6K6K5L1M2L8J9Kmoj3k0j5mjj0k5l3l1j7JNrk4k1MK3K3Qlrj4
6534Hj6j2jOJ5L2N1N4M0J9kk3m3m4k8qkpqjJ1J8J6O%NK0L1K4Jj9k4k3k6l9m8m6k1J1L3K9R
6516bolJ0J4Mj5k0j1KPJ0J6K8L4L1K6K1J3NMJ4K6L3K3nm1o1m7j3QKj0nJ3J5lj6%L0M8M4K7
6498B50Qj2k8l0j9rj2k9m4m6k9kJ8K6J9J0PPPOJ2J8J8J1MLL%lmj0k2k9k1lROJjJ%MJ3J7Nj6
6478A14k5j5LJ0Noj3j6j6j9k1j4jJ2J0J%J1J6QkMJ4Ml0n1m3j6%KJ1K3K6J0jk%qqJ0K5J9pj7
$$ y = [-36, -49, -49, -29, 6, 43, 66, 73, 70, 60, 51, 47, 48, 48, 45, 43, 46, 49, 45, 39, 39, 39, 30, 9, -10, -21, -19, -11, -3, 0, 3, 11, 20, 18, 0, -19, -24, -15, -5, 1, 7, 9, 5, 5, 27, 71, 112, 131, 133, 136, 146, 159, 169, 165, 138, 89, 47, 45, 88, 145, 179, 175, 142, 95, 50, 20, 10, 13, 11, -1, -15, -13, 5, 27, 39, 46, 62, 89, 116, 127, 124, 116, 111, 104, 87, 61, 41, 47, 84, 133, 173, 195, 203, 196, 168, 131, 109, 110, 118, 118, 124, 154, 203, 241, 253, 249, 238, 216, 176, 129, 92, 71, 61, 61, 76, 97, 109, 103, 91, 88, 97, 108, 105, 84, 48, 2, -47, -93, -123, -132, -123, -107, -87, -59, -21, 13, 27, 14, -10, -26, -24, -10, 0, -2, -15, -19, -6, 20, 46, 71, 102, 144, 182, 201, 203, 199, 193, 180, 160, 145, 141, 140, 130, 105, 72, 41, 24, 25, 30, 21, -3, -24, -20, 3, 26, 34, 31, 22, 8, -8, -20, -21, -15, 0, 32, 83, 137, 177, 196, 194, 171, 128, 84, 56, 48, 46, 39, 31, 30, 41, 59, 75, 81, 81, 86, 106, 137, 161, 162, 143, 119, 96, 70, 31, -17, -63, -84, -73, -40, -11, -2, -8, -11, -1, 13, 17, 2, -18, -29, -27, -20, -10, 6, 34, 68, 99, 125, 146, 159, 164, 168, 182, 208, 241, 264, 259, 218, 157, 110, 97, 105, 107, 97, 92, 105, 120, 117, 101, 101, 131, 179, 223, 250, 258, 246, 218, 188, 169, 160, 148, 119, 75, 29, 0, -2, 16, 42, 61, 71, 78, 85, 92, 98, 110, 128, 146, 157, 161, 164, 167, 167, 164, 160, 150, 128, 99, 78, 75, 84, 90, 91, 90, 91, 91, 95, 108, 125, 130, 114, 89, 74, 77, 87, 92, 86, 73, 57, 41, 22, 1, -13, -14, -2, 8, 9, 9, 20, 36, 44, 42, 46, 60, 64, 34, -17, -60, -76, -76, -74, -63, -40, -14, -4, -5, -7, -7, -15, -23, -13, 12, 31, 24, 7]
6459GjJ7K6L2L9L7J9MJ%k1m6m8k8rMJ8L4L3Rj9k6j3oj0j4lJ6K5J1j3k5j9j2j9k8k4nONQK5
6441a3M3M5K8Qnj0j1nJQJ0J6J7J5OKMJ2J4J0Ljlqk0k9k0NK8K5%k1k1j0oj5j5jJ7J3j1l3l0
6422D2j3jJNJ4J9J4Kj0k4l5k8nK4M3M5L8K1lk3k5j7j8l0l6k0%J1J1J8L0L6K6Nj3k2k4k0j5
6405B3nLJ1J5J7J0j0l0l4j9lLKJ2L1M3K8LpMJ4Jk1k3MK7K2jqjmk6m1k1J8L8K5OPK5L9L2Rj8
6386B00l0k7j7qJOJj1j6jJ3J3jjJ2J7Nj2j9k0j7oJ5K8K6J8J9J7jk1j7J2L5L2J0llOJ3J1LJ
6368B83RJ5mm3o8n9k2PJ1LjLNKpj7j6lJ5K1J0rj8pJ2K3K0J3QMqk3l0j9jJ2J5J1OLNJ2K1K3
6349B17J9J1kj6k3j2PJ1jj9k6k3k3k4j2QJ9Pj7k8k2rlmkLNkj0j0LJ4J6J3J6K5K5J1j0k9m2
6331F1m4k2RL4K5lk5k7j9j3rjJ2K2J7pl2k9J0N2O1M0K1J6Nk0l2j4J8L0K6K4K6J3j3l1k9k1
$$ y = [7, 6, 23, 49, 81, 120, 157, 176, 180, 181, 181, 160, 114, 66, 38, 29, 33, 51, 85, 118, 127, 108, 82, 69, 63, 53, 39, 36, 52, 77, 88, 75, 50, 31, 19, 0, -28, -52, -57, -51, -46, -38, -13, 30, 75, 103, 111, 106, 96, 85, 80, 81, 89, 99, 115, 132, 147, 153, 155, 159, 171, 185, 195, 198, 197, 194, 186, 166, 137, 117, 122, 150, 175, 175, 154, 133, 123, 117, 102, 87, 86, 103, 116, 105, 72, 42, 29, 28, 29, 34, 48, 67, 81, 83, 73, 49, 14, -14, -19, 5, 48, 93, 131, 152, 149, 126, 101, 84, 66, 36, 0, -20, -20, -9, 2, 20, 50, 86, 112, 117, 104, 82, 58, 38, 23, 18, 21, 32, 47, 64, 74, 64, 34, 0, -19, -22, -19, -17, -5, 26, 69, 97, 100, 93, 97, 111, 112, 91, 68, 72, 99, 121, 120, 112, 111, 107, 81, 40, 19, 37, 75, 100, 106, 113, 138, 177, 209, 218, 200, 170, 143, 126, 118, 119, 125, 126, 115, 99, 98, 111, 124, 123, 122, 134, 151, 156, 144, 125, 105, 88, 82, 97, 125, 151, 169, 188, 205, 204, 183, 166, 178, 213, 245, 255, 252, 249, 255, 268, 279, 282, 283, 292, 307, 303, 260, 192, 133, 111, 118, 129, 132, 131, 134, 139, 141, 134, 117, 101, 98, 113, 134, 144, 135, 117, 110, 122, 145, 165, 178, 186, 190, 182, 159, 129, 110, 109, 121, 136, 147, 153, 156, 161, 173, 194, 217, 236, 247, 245, 229, 206, 194, 201, 212, 211, 192, 166, 143, 120, 96, 84, 92, 111, 118, 101, 73, 51, 42, 39, 35, 33, 36, 41, 39, 29, 19, 22, 36, 52, 65, 81, 106, 131, 142, 132, 103, 61, 17, -5, 4, 38, 63, 60, 35, 8, -11, -24, -33, -34, -22, 0, 17, 10, -22, -51, -41, 11, 72, 112, 133, 149, 154, 134, 102, 88, 106, 136, 162, 186, 212, 225, 212, 181, 152, 131]
6315A31j1opk1l4k0J7M5M1J5jLJ2J0ql5n3m9k7nLKLMjqqrq%J7K7K7K1K6L1K2PJ3L7N1L5ll2
6295B54l8k8j6mMJ0J4Oj8m0l6pJ5J0qj3lKpj0%J3J5P%oj3j5j0%JmqkJ0K3K8J6oj9j4jNKkk
6276A05rk2k7j0J3K0Oj1j7j4j3j5j0MK2L7L8L1J9Qjqj0lQJ2LjOJ9J8Jj5j5ojljOOnj4k0k4
6256A07l0l4k6rJ0K3K7J9OJMJj8l8l7rJ5K1Oj5k3j2NJ8J8J0J0J8J9PkOJ9J8%j1mJ1J5J1RN
6238A71pk2k7j8qkQK2K8J0j1j0RJ0j7m2l0NJ8nl9m0rK4L7K7J3J2K0J7nk7l0j6mkLJ6K4J3k
6220A14jJ2J6Jj6j9j4pJJ3K1J6Kj2j7j0KJ2J5J2QP%j3k4k2%K5K9J0j5k5j4%QOkj6l2l4j8K
6202B1ROJ0K1J7ml0l7k2kJ7K5J2j6l0j4J5K0lk2j8NK0J5Lrj7j7rNJ9L0L8L6J4j9m1m2k6j3
6185c3rrnKJ0J3J3J4K0K9K9J9OJLJoj0pjKNOjj6k7k3nRJ5J3RMMJ1K1K4K1J0j1l4l6j1J9J8
$$ y = [131, 120, 114, 107, 86, 52, 32, 49, 94, 135, 150, 149, 152, 164, 174, 166, 131, 78, 29, 2, -3, 0, 2, 5, 9, 8, 0, -8, -17, -25, -25, -8, 19, 46, 67, 93, 124, 146, 153, 166, 203, 254, 289, 286, 254, 216, 188, 172, 168, 172, 182, 196, 202, 184, 144, 108, 101, 116, 126, 118, 105, 102, 104, 97, 87, 87, 100, 115, 122, 122, 116, 103, 88, 78, 78, 79, 75, 67, 65, 75, 98, 126, 142, 136, 117, 103, 102, 107, 109, 107, 105, 96, 74, 47, 37, 50, 70, 76, 65, 48, 34, 21, 6, -4, 0, 22, 59, 97, 128, 147, 155, 154, 146, 136, 133, 141, 153, 156, 155, 161, 180, 198, 199, 184, 169, 163, 162, 159, 158, 164, 170, 165, 151, 131, 107, 77, 43, 17, 8, 18, 41, 68, 87, 93, 94, 98, 99, 81, 43, 6, -3, 12, 33, 39, 24, 1, -11, -6, 12, 30, 40, 50, 68, 87, 94, 92, 98, 117, 135, 135, 124, 120, 131, 146, 157, 166, 171, 164, 142, 115, 97, 89, 87, 95, 117, 145, 155, 144, 134, 143, 153, 136, 94, 64, 69, 87, 82, 43, 3, -6, 18, 55, 82, 95, 107, 127, 144, 139, 112, 82, 66, 62, 60, 63, 79, 103, 116, 114, 113, 125, 141, 142, 126, 107, 93, 86, 87, 100, 121, 137, 139, 127, 110, 100, 102, 114, 129, 141, 149, 156, 156, 143, 119, 97, 97, 122, 151, 161, 146, 121, 107, 107, 115, 121, 119, 103, 71, 37, 19, 21, 30, 36, 46, 67, 84, 80, 50, 13, -9, -11, 6, 31, 43, 27, -3, -17, -2, 18, 15, -7, -25, -20, 0, 15, 18, 9, -8, -25, -34, -29, -10, 20, 58, 94, 108, 89, 48, 6, -20, -33, -42, -51, -56, -54, -44, -31, -18, -4, 16, 45, 74, 93, 99, 100, 103, 104, 98, 88, 81, 80, 82, 87, 93, 92, 76, 49, 26, 21, 30, 45, 58, 67, 71, 75, 86, 107, 131, 152, 162, 151, 117, 81, 70, 89, 107]
6165A07qk4j0J3K0J5J5J1mk5l2k1rJJ8L4L6J7qk3k4j7nMMjkQJ9K3J9Oj2k6k5rMLkMJ7J9Kk0
6146A12k1jL0M9M9K7%j2%K0K5J1j1k3k9l3l3k2j3j3j9j3OJ2mk1j1K2M7M1J3j5k5j2J7M3N3
6130B46N1M9N0M7M6O1Q8J17J43J71J84J45M5p6j55j80j70j55j29r3o0m2l8l2j9%J1Kj6l1k3
6117B37nNjojPJj4k1j5nlorj4k3l0k3LL2L9J6j9m2m3l4j9pPJ9K8L3K6Mk5l9k6KK3K9K5J6J
6098A23j6k5k1j1rj1j0mPJ9K8K5J3MRK0K0Lrj0oj0j5j6k0l1l0mL4M4K2nrKJ2J7J9Rj6m4m5
6080E3j5K4M8M4K6Kj1j1%QKj6l8m7l4j2LQJ6L9O2O3M1J3rk5l9m4l6k1j2okmj2k1k3k0k4l2
6063f2l5k1OL5M8M1L0K9L5L0Qj3qJ8L6L1J1rk7m0m1k3PK8K8J2mj0%K3L9L3J1njOnk6l6k7n
6045A47J6K6K1Jk0k8j9q%J1K2K1OpmOJj1j4p%jkpk3m1l9j2J1J0kKJ9L3L1K2Rj3m0n0l3oJ1
$$ y = [107, 99, 75, 65, 78, 98, 113, 128, 139, 135, 110, 78, 57, 48, 49, 67, 101, 137, 154, 146, 123, 99, 82, 77, 81, 85, 84, 82, 90, 109, 132, 151, 157, 145, 119, 94, 85, 89, 92, 90, 94, 111, 130, 132, 112, 91, 90, 120, 169, 218, 245, 245, 233, 233, 253, 278, 289, 278, 255, 226, 193, 160, 138, 125, 112, 93, 80, 86, 98, 94, 73, 62, 84, 131, 172, 185, 170, 145, 133, 150, 193, 246, 297, 346, 396, 443, 489, 550, 638, 755, 898, 1069, 1253, 1398, 1443, 1367, 1212, 1032, 862, 707, 578, 485, 425, 383, 345, 313, 294, 294, 305, 307, 291, 260, 237, 232, 237, 236, 230, 229, 236, 237, 223, 202, 187, 182, 179, 173, 164, 150, 127, 97, 74, 77, 109, 148, 164, 145, 103, 60, 26, 7, 0, 7, 26, 54, 87, 113, 117, 92, 53, 27, 29, 52, 81, 106, 122, 123, 107, 82, 61, 50, 41, 30, 20, 16, 23, 42, 70, 95, 108, 112, 121, 141, 161, 164, 155, 145, 139, 129, 114, 98, 78, 47, 17, 13, 47, 91, 113, 108, 99, 101, 113, 130, 149, 158, 142, 98, 53, 38, 62, 110, 154, 180, 182, 171, 160, 160, 168, 170, 154, 116, 69, 35, 23, 26, 34, 50, 89, 151, 214, 255, 268, 259, 234, 195, 151, 115, 94, 82, 76, 74, 70, 58, 37, 14, -6, -30, -62, -97, -118, -112, -77, -29, 12, 42, 71, 106, 136, 144, 131, 123, 141, 177, 208, 219, 210, 183, 143, 102, 79, 86, 114, 142, 154, 150, 140, 140, 163, 202, 235, 246, 241, 240, 246, 241, 215, 179, 152, 147, 163, 189, 210, 211, 191, 163, 144, 136, 136, 147, 169, 190, 196, 189, 185, 191, 192, 181, 167, 160, 160, 159, 157, 150, 127, 86, 47, 35, 46, 56, 54, 56, 75, 108, 139, 161, 170, 157, 117, 67, 34, 28, 39]
6027C9J1RJ3J6J2PQJ0OmqnjJRK9M0K7ql9m7l8k9l0l1k4kK5M1M1L0J8Rnk3k9j5NOj0k1j2PJ7
6008E5Qrj4rjNJ1K0K3J7OkkMJ5K5K1Kj5j6onj2j9j7pLJ1J3Lo%J7K7J8Lmj0k0k7j8jQ%rlJ6
5987I9L9N7N3K8nk5k5j7j5k4l0k7j6oqk0k8j9oJlj0j3r%J2K5L8M4M0L2K7K9K6Ml3n2l4LJ6
5970A48qm2n7l9nJ9K2Lj2pQJ5J1J5L0L6K1rl5m5l6j0J8K7J3qk1k7k8k3oJ2J5PKjnqKK0L0K6
5952F8J4Olj4j5pLNNJ9L9M2K1mrKJ1Lj5k4j7jQjk3l8l1j1%ok1k7k2nJ9L9M8L4J0nmOJ1Pqk4
5932H5l0j9MK1K7K2J1Jpj0nRK2K0MmJ0L0K4j0m2m1k2qmOJ8J6kj6j4j0j1j2oNJ6K8L6K3%j4
5914A51j2j3k5l6l0k0j9k3j8oQK9N5O8M4OrjRPJ2K3L1K4Rok7m9n8m9l2j4OL1M9N1L7J3j5l7
5896A64l8j9OK0J9J6K0L6O2Q1R4J27J95K45J92K0j66k48k07j30r2q0o6m8l4j9J2L2J6j6j9
$$ y = [39, 50, 59, 72, 88, 100, 107, 115, 125, 131, 127, 119, 114, 113, 114, 123, 152, 192, 219, 211, 172, 125, 87, 58, 28, -3, -27, -29, -4, 37, 78, 108, 126, 135, 130, 107, 78, 63, 68, 74, 64, 43, 31, 38, 55, 63, 54, 40, 31, 30, 35, 46, 66, 89, 106, 112, 110, 108, 112, 127, 152, 173, 175, 160, 144, 138, 133, 121, 102, 85, 78, 81, 92, 105, 108, 102, 102, 119, 146, 164, 167, 163, 153, 133, 106, 88, 87, 95, 95, 86, 83, 99, 138, 195, 248, 276, 271, 246, 221, 204, 189, 165, 135, 108, 92, 86, 78, 58, 30, 11, 5, 6, 3, -7, -20, -29, -29, -17, 8, 46, 90, 130, 162, 189, 218, 244, 248, 215, 163, 129, 132, 148, 140, 98, 41, 2, -3, 16, 38, 41, 29, 22, 30, 45, 56, 71, 101, 137, 158, 149, 114, 69, 33, 23, 41, 68, 81, 73, 52, 25, -3, -26, -32, -20, -5, 2, 4, 3, -2, -10, -8, 12, 42, 68, 82, 88, 85, 71, 56, 49, 52, 57, 62, 81, 120, 162, 183, 179, 170, 172, 183, 186, 171, 147, 130, 129, 137, 136, 113, 75, 44, 33, 33, 27, 6, -21, -43, -48, -29, 10, 58, 92, 102, 97, 93, 99, 110, 117, 109, 85, 55, 36, 40, 61, 88, 110, 121, 122, 115, 105, 100, 109, 131, 151, 155, 151, 161, 191, 215, 205, 163, 122, 100, 92, 88, 94, 112, 128, 126, 110, 96, 86, 75, 63, 57, 62, 78, 106, 142, 165, 165, 151, 139, 126, 101, 65, 35, 15, -4, -27, -45, -51, -43, -14, 41, 109, 153, 159, 150, 149, 158, 165, 177, 200, 231, 255, 264, 258, 231, 182, 124, 75, 43, 29, 35, 66, 115, 166, 203, 216, 201, 164, 126, 107, 113, 133, 152, 168, 188, 224, 286, 367, 461, 588, 783, 1028, 1220, 1240, 1074, 826, 619, 489, 397, 317, 251, 203, 169, 150, 162, 194, 210, 194, 175]
5883A75J2L0Rk2l1k2k0j7NK8K1j1k4oJ0lk2j8KOlqjkj3k0j2jJKOJ0J1NJ%PK2M0M4L1Nk1l0
5864A76k2jRKj2k2k3j9nJ6L4L7L6M1M1K1qj9j4j3j9j0QQj8l6k5pj1k6k9j9j4j0NK0J6lj2p
5846F6pj8k0lJ1J0Kj%llQK3K4RmnJJ3L2N0N0K0j9m4m0k0pnqj4k1k4j1LOnpRJ7Nj2j0NJ0nj8
5826D0j2NJ4Mj2j5mJ2J4RNOlj8j4K1N6O2M9L5J8j7n5o2l9k2k6k3QM0M3K2J3K3L2K1lk5l4k8
5809A40j7qm%Ljj2j9j8j3rJJ3J4JmJ3L3L2J0rj5j1kJ8L6L9K3Okpj6k3j9mJ0J2Okkjoj6k5l1
5789A14l5l0nL8P0O7L7J0oj3j9j4lmj9l6l8k7j8j1JJ7K5J6qk8k8j1RRpk5l0k6j1NRONJ4L2
5771C2L4J5qj4pJNRJ1Jk0k8rK5L7J3j6k1qpk3l0j3J0J6J1J8L8M8M1K8J8J0ok2k6j9j0j1j9
5754A04k5j6PJ6nl6m0qK1L0K5K8K9Ok3k4J3N3O1L9J0rj5j6j0qj3k6l3k7j6j1k1l5l6j6J3L2
$$ y = [175, 187, 217, 226, 204, 173, 151, 131, 114, 119, 147, 168, 157, 133, 127, 137, 134, 112, 94, 96, 102, 99, 91, 90, 88, 75, 55, 43, 42, 43, 45, 51, 61, 72, 77, 78, 78, 85, 107, 147, 191, 222, 227, 206, 176, 154, 153, 162, 164, 152, 130, 107, 88, 83, 99, 133, 170, 206, 247, 288, 309, 301, 282, 268, 255, 236, 226, 234, 242, 224, 188, 163, 156, 145, 119, 90, 71, 57, 47, 52, 72, 88, 85, 73, 66, 59, 41, 21, 18, 29, 39, 41, 40, 40, 37, 34, 42, 65, 89, 98, 94, 89, 90, 103, 135, 185, 235, 255, 236, 192, 152, 132, 125, 120, 112, 98, 77, 53, 42, 45, 51, 46, 39, 48, 65, 70, 58, 48, 53, 63, 58, 40, 28, 33, 47, 51, 39, 24, 20, 32, 46, 55, 60, 66, 63, 45, 31, 52, 108, 170, 219, 254, 272, 255, 200, 138, 99, 77, 51, 28, 36, 76, 119, 141, 154, 177, 209, 230, 227, 202, 168, 140, 123, 115, 111, 111, 114, 113, 101, 82, 64, 51, 42, 43, 56, 70, 71, 67, 80, 113, 145, 155, 146, 131, 120, 118, 136, 172, 211, 234, 240, 238, 231, 215, 192, 173, 169, 179, 191, 197, 195, 193, 192, 186, 170, 145, 114, 79, 49, 44, 82, 152, 219, 256, 266, 260, 247, 228, 214, 211, 207, 188, 152, 114, 87, 69, 58, 59, 76, 101, 117, 109, 81, 53, 42, 51, 60, 53, 28, -2, -28, -39, -34, -25, -19, -14, 0, 32, 66, 81, 73, 59, 52, 53, 58, 67, 78, 79, 59, 31, 22, 47, 84, 97, 81, 60, 52, 45, 22, -8, -21, -11, 5, 16, 34, 72, 120, 161, 189, 207, 217, 211, 189, 163, 144, 134, 123, 104, 79, 63, 70, 86, 81, 45, 5, -3, 18, 48, 73, 101, 130, 136, 113, 89, 102, 155, 216, 255, 265, 256, 241, 225, 215, 207, 194, 168, 135, 108, 92, 81, 60, 25, -11, -27, -14, 18]
5738A8L5K1J4K2M1M2J4k4m4l1j1oj4j5qmmNK3L1K3J3J7K7J9mk0j2KMmj1j4k1l4l7j6J6L2K5
5720A10Lj7k8l0k9k5k2oK0M5N3L6J4J1K3K5Oj8k7j9j1j3j8j4nkoj4j6j5j0MK6L9K6nl1l5k8
5703cl3l7k8rLKOK9M5L4QlOKk2m0j7K2L1OnJ5M5M7K8J3J3Pj4l1k3MK9K9Pk4m3m4k9rJ0K5L2
5685H4K9K0J2N%qj6k4k9l0k2pOOmj1jK4M2L3Kk1j8JJ3J1Llj0j7j2NK2J7lk5l3k1OL7N1M1K0
5666A75Mok1l7m0k9j7j2rMK3L0J9MlJJ0K0K6K5J5jj1j3j6k4k8k2j1ojNRjj1JK2K1j4m7l9j0
5648a5J2J5K5L9L2kk8j8J2K2Oj2j8j7k5l3k4RL9M4K1oj2%J2J7J9J7Oj3l1l2k0pJQJ9K5J6o
5630I7k4k7j2LQ%pojMLnk4m3m6k6OL3M6M9M3K2ok0j2J2K5J3pj7j1pj1j3nQQok0k4j4JJ3J0
5611A0mj5j0LJ1RJ2J5Rmj0plqoQJ8J5OQJ7J3Lj%ok2k6rJ1J6J6J9J8Lj5k1j0jmrkJ0J7J6J6
$$ y = [18, 53, 74, 88, 110, 151, 193, 207, 183, 139, 108, 97, 91, 77, 62, 54, 50, 46, 51, 74, 105, 128, 141, 158, 185, 204, 200, 180, 168, 170, 174, 170, 159, 145, 124, 90, 53, 37, 53, 85, 110, 113, 96, 68, 38, 9, -16, -38, -44, -24, 21, 74, 110, 124, 135, 158, 183, 189, 171, 144, 125, 114, 101, 83, 69, 64, 62, 56, 42, 26, 11, 1, 5, 31, 70, 96, 91, 60, 25, -3, -36, -73, -101, -110, -107, -105, -99, -70, -25, 9, 17, 14, 20, 22, 0, -40, -57, -35, -4, 2, -3, 12, 57, 104, 132, 145, 158, 165, 151, 120, 97, 101, 130, 159, 166, 142, 99, 55, 26, 17, 27, 52, 84, 113, 133, 145, 150, 150, 142, 126, 102, 73, 43, 21, 14, 20, 26, 22, 11, 10, 34, 76, 109, 111, 90, 72, 73, 86, 97, 100, 97, 87, 70, 58, 63, 85, 102, 99, 74, 41, 20, 26, 63, 114, 155, 175, 179, 173, 152, 115, 75, 46, 29, 17, 8, 12, 35, 65, 84, 88, 85, 86, 96, 116, 142, 167, 182, 181, 170, 157, 141, 117, 89, 67, 56, 50, 49, 54, 63, 62, 51, 52, 74, 95, 81, 34, -5, -15, -3, 12, 37, 76, 108, 106, 78, 60, 72, 94, 100, 88, 70, 53, 28, -5, -29, -20, 19, 63, 84, 78, 66, 66, 78, 95, 114, 131, 137, 124, 93, 61, 41, 34, 35, 43, 62, 87, 103, 97, 73, 46, 34, 37, 45, 45, 38, 32, 31, 35, 38, 33, 9, -34, -80, -106, -100, -67, -21, 28, 71, 93, 87, 67, 55, 67, 92, 105, 98, 81, 70, 63, 52, 39, 34, 42, 50, 44, 24, 0, -14, -13, 0, 10, 6, -9, -19, -16, -5, 4, 16, 31, 40, 36, 26, 19, 16, 8, 2, 10, 28, 43, 49, 57, 74, 87, 90, 89, 89, 83, 61, 35, 26, 37, 53, 69, 88, 106, 109, 94, 73, 63, 62, 58, 49, 47, 57, 74, 90, 106]
5591A06J0nk5l0j9qmJK9O0O3K8j5l3k3oPJ5J9J4Jrj1rpkJjj0j4nPQok5l7m0l5k4nROj0k0q
5572f2J6L2L7M1M0K8NplJpj2pmk0m0l2mK0K0J3J0Kj6l2k0PK5J5krmnnLK0L0K4J7J9J5pl4k8
5553H0OK9J2j8j8PJ5KnJ0K0RpkJ5J9Lj2j2mkklmjJ1K5L2K3Mj3j9k1k9m3m7k7PK8K7J9J2Lj5
5534A14l0k8mK9N1N6M0Pk5l8k8j2qj5k0k0j9k4k9k3jK1K5K2J7K0J9RKOJ2PllJ3L2L9K5ml9
5516A93n7m7k1KJ3J8J6O%J1L7M8L1kk7l7m2l5j1K4L6J6j3j6MK4K4J0lnKJ5K6K8Rj9l5k8j3
5500A82oj3k3l0k3nJ5K4K0Qjoj0j1rqj6k5k5k2j8j1JJ0%j4j7j1rj3oJ6K6J4onJ3K2J5KkKJ2
5481C7K6L8L6K1OLN%j0j4j0pj0j6j6pjKLNnk0k0ML4L7J5MK0M1L7J3nqqrj1j8l6n5n0j8J3K2
5462F8J4Mjrj6j9j3mJ2K9L5K1MkMPnj5j4lRJ5Qj1l0k9lK3K1%j3oQJ5J6J8J7Nqj3j6k3k8j2
$$ y = [106, 116, 111, 86, 56, 37, 29, 25, 26, 55, 115, 178, 206, 191, 158, 135, 129, 136, 151, 170, 184, 185, 176, 165, 156, 149, 147, 148, 147, 137, 123, 118, 125, 133, 127, 102, 65, 25, -10, -34, -39, -30, -24, -34, -54, -62, -46, -14, 23, 64, 104, 132, 137, 130, 127, 128, 121, 109, 102, 98, 78, 38, 6, 2, 22, 42, 55, 65, 67, 51, 19, -1, 6, 31, 46, 44, 35, 31, 26, 21, 24, 44, 74, 98, 115, 134, 149, 142, 108, 80, 86, 115, 127, 109, 91, 98, 113, 115, 110, 120, 140, 149, 142, 140, 155, 174, 177, 165, 153, 149, 147, 145, 142, 138, 137, 148, 173, 205, 228, 232, 219, 200, 179, 150, 107, 60, 33, 40, 68, 95, 114, 126, 129, 114, 84, 56, 52, 81, 132, 188, 228, 235, 210, 172, 144, 132, 124, 109, 89, 69, 50, 26, -3, -26, -27, -6, 19, 41, 58, 78, 97, 106, 108, 114, 126, 133, 130, 127, 140, 172, 211, 236, 232, 193, 136, 89, 68, 70, 83, 101, 117, 123, 123, 134, 171, 219, 250, 248, 221, 184, 142, 107, 96, 120, 156, 172, 159, 143, 147, 171, 195, 205, 202, 197, 199, 214, 240, 268, 277, 258, 223, 195, 182, 176, 163, 140, 110, 87, 82, 97, 121, 141, 149, 148, 142, 132, 121, 112, 104, 88, 63, 38, 16, -2, -13, -12, -2, -2, -16, -33, -44, -53, -66, -72, -56, -30, -16, -22, -27, -14, 8, 23, 25, 23, 25, 37, 63, 101, 137, 158, 164, 167, 172, 172, 162, 148, 138, 131, 121, 105, 89, 82, 81, 83, 86, 91, 86, 66, 46, 50, 84, 121, 136, 140, 160, 201, 238, 251, 246, 238, 230, 221, 210, 192, 156, 101, 51, 33, 46, 68, 82, 86, 85, 76, 60, 41, 28, 24, 36, 65, 100, 121, 125, 123, 127, 134, 129, 114, 100, 97, 106, 121, 129, 118, 88, 59, 56, 79, 100, 100, 87, 81, 89, 104, 120, 138, 155, 160, 152, 139, 123, 100, 72, 60]
5443F0J5L0J9mj8k0j9j4lPRPPJ4J5RN%rk0k2j0JJlNK3K3Kk3l0j6jRJ3J2lk5m0l2rK2M3M8L5
5423A13J6RJ8K5J3j3l1l0k4k2k2j1LR%rpJRJ7K1J2mk0j9qMQRJ6K8L6K8J2lqj4k3k2kK2K7R
5405A73oj4k2l4l9k3lQJ7L1L6J1k4k9PM4M7K4QRJ3RJjM%j2k8l7l0oJ4J7%k2l1k5j4kJ1K6K9
5386A37Pk5m1l1j2j2k6l1rK3L9M0L7L0K0J3J6J9Nk4m0k3MJ2kj1lJ1K0K4L0K9J2j0j7mJ1J1
5370B29mk1l0k9k2k1k5k5j3J0K7K6J4PNjj3j6nJ2J4LpqjRJ3J4J5J5Pj2k6k1JJ8J6J0J5K4J5
5352B19pk3j4OJ5J0jj5k4k7k6k7k6rK2L9K0j4k7qOnk1j3Lom0n0j7K8L7J8MJ2J4ql6l3pJ9L2
5334B0L4K7Rj0j7rQK3L0K1kk0j4NJ4Mnmoj7j6NK4J8jplj1k6k8qJ2J6J0OKoj0nmrj1lRJ7J8
5314H0J7Rjnjlj7l4l5k4qJ6M1N5L6Lj4rmj9l6m0k8j4JK2M1M7L8K8K2J3%j0rmqj7j3OK2J7K
$$ y = [60, 75, 105, 124, 120, 102, 82, 63, 49, 46, 53, 62, 69, 76, 90, 105, 114, 119, 119, 110, 90, 68, 58, 59, 60, 57, 62, 85, 108, 110, 87, 57, 41, 40, 49, 62, 74, 71, 46, 6, -26, -35, -13, 30, 78, 113, 129, 138, 156, 181, 194, 181, 150, 120, 96, 74, 52, 41, 44, 53, 53, 44, 37, 38, 47, 64, 85, 97, 93, 73, 54, 46, 50, 58, 67, 83, 111, 147, 175, 187, 184, 176, 162, 139, 117, 115, 137, 164, 173, 167, 153, 131, 97, 58, 35, 32, 40, 57, 88, 124, 135, 111, 82, 89, 133, 180, 204, 212, 221, 234, 243, 244, 243, 247, 247, 235, 207, 170, 140, 134, 148, 165, 165, 143, 112, 87, 73, 71, 82, 108, 137, 144, 119, 78, 47, 35, 23, -3, -34, -43, -20, 19, 59, 96, 126, 146, 159, 175, 194, 199, 175, 135, 112, 116, 128, 126, 115, 112, 123, 143, 167, 197, 226, 238, 228, 211, 207, 218, 229, 225, 204, 174, 145, 123, 102, 77, 52, 39, 49, 76, 102, 116, 123, 128, 127, 114, 98, 93, 105, 119, 122, 115, 107, 106, 115, 128, 142, 157, 172, 179, 167, 141, 120, 121, 139, 155, 165, 180, 204, 219, 212, 189, 175, 181, 196, 206, 205, 190, 166, 139, 113, 86, 60, 51, 73, 112, 132, 118, 91, 83, 89, 84, 63, 50, 53, 47, 7, -43, -60, -32, 5, 23, 27, 39, 53, 45, 9, -24, -31, -12, 20, 54, 81, 90, 80, 63, 54, 62, 85, 115, 136, 134, 114, 100, 105, 119, 123, 118, 114, 108, 91, 75, 80, 104, 122, 121, 114, 111, 100, 74, 46, 38, 50, 66, 76, 82, 84, 78, 68, 63, 59, 50, 39, 36, 45, 62, 80, 97, 106, 105, 100, 99, 96, 79, 45, 10, -14, -22, -6, 35, 90, 126, 129, 115, 106, 102, 83, 47, 7, -21, -35, -34, -12, 29, 76, 114, 142, 164, 177, 177, 167, 158, 154, 146, 129, 116, 122, 144, 161, 163]
5296A63jJ2K6K1Lj6l3m9n8n4l4qJ5K3K0J7K6L5K5qm0m3k4rppkQJ3J7J9J5Mpj3j4j7j9k1j6
5278c8mJ0K3L1M0M6M5L1Pj0j2j2j3j3kJ1J7J8J6Prk1k2j5oj%j%J0K7L3J5j4k8k6j9k0k3j5
5261F3MK3L7L5J4j0j7j3j7l7m8k8RK8K0PJ0K6L4L1K2J0nj5j6j0j4l0m4l8k1qprpOJ6K0Oj7
5244A0k6j3J4K5J9RJ2J2MmLK1K6J0j0j3LJ3Kk1l9l5k2j7j8nJ5K5J7KLJ2Oj5l4m1l5j8J0L9
5226e4N4M6L0J5Nj0k1j7NK6L0Qk0k7kK5K4mk1mK7L7K0mj3roqj2j6k0j9j7j7k2k1j1J1L1L8
5209E7L4K8K6K0Omlkj3k8k8oK1L1J9kj8k1rOJ5J2J0J1Nj4k9k7j3pj4k1j4mKPJ3J7Rpj9j5m
5190B7MJjJ2K8L2J7%lOPkj4j6j2jO%j4k0lJ7K0Kj4j3JJ1J0jj7l1k6nJ4J9J6J7K3L1L3K2nl2
5171A46m4l8k7k0j0J2L8M7L8K5J3Lpj4k1k9l3k5j1jjj0k3l1k5jK2K5J4J3J9J5KJJ6K2PnRL0
$$ y = [163, 162, 174, 200, 221, 224, 208, 175, 126, 68, 14, -20, -28, -13, 10, 30, 47, 73, 108, 133, 125, 85, 42, 18, 9, 2, -5, -7, 1, 14, 31, 50, 65, 69, 62, 49, 35, 18, -1, -22, -38, -42, -32, -9, 22, 62, 108, 153, 184, 191, 181, 169, 157, 144, 131, 129, 140, 157, 175, 191, 198, 189, 168, 146, 131, 125, 124, 124, 123, 123, 133, 160, 193, 208, 194, 166, 140, 121, 101, 78, 63, 67, 90, 127, 162, 176, 166, 149, 136, 119, 82, 34, 6, 15, 43, 63, 70, 80, 106, 140, 171, 193, 203, 198, 183, 167, 157, 143, 113, 69, 31, 10, 2, -5, -14, -21, -15, 1, 21, 27, 10, -16, -29, -15, 10, 29, 38, 50, 62, 66, 62, 65, 86, 112, 122, 112, 99, 102, 115, 117, 96, 57, 22, 0, -17, -35, -40, -25, 0, 17, 19, 22, 34, 40, 25, -9, -50, -85, -103, -93, -54, 0, 46, 76, 91, 96, 86, 65, 48, 53, 79, 109, 117, 97, 70, 68, 93, 117, 113, 92, 88, 115, 152, 172, 168, 155, 146, 140, 132, 120, 104, 84, 65, 48, 31, 9, -12, -23, -12, 19, 57, 91, 119, 145, 165, 171, 167, 164, 162, 149, 121, 93, 87, 108, 139, 158, 156, 138, 117, 108, 114, 129, 141, 151, 162, 167, 153, 124, 97, 84, 77, 63, 42, 28, 24, 26, 33, 46, 63, 72, 65, 46, 31, 27, 31, 32, 31, 43, 71, 103, 120, 120, 117, 123, 130, 128, 114, 98, 86, 85, 91, 91, 77, 57, 54, 71, 91, 93, 79, 66, 67, 78, 88, 87, 70, 39, 13, 8, 22, 41, 57, 74, 97, 128, 161, 183, 178, 146, 102, 64, 37, 17, 7, 19, 57, 104, 142, 167, 180, 183, 176, 162, 141, 112, 79, 54, 43, 42, 41, 31, 8, -23, -48, -49, -27, -2, 12, 25, 44, 59, 61, 62, 78, 100, 107, 102, 111, 141]
5154A41K7OJJ9L7L5K2J0nl8p0q3p2m4j6J1K6K5J5PMnj2j1KJ2J6K2L0L0K1J1J2J5Lj6l2l0j8
5137A08mQJ4J3J5J8J6Lj0rMJ1Oqk4l7m2k7%J5RjkLkj2j0llj1j0NJ5J7K1L2K8Jk7k4LK3J8l
5118A37k3m0m4l0nQJ5K5L8M0K2Jj2k0l0l6k9j2MK4M5N0K6j2l2l3l3l8l0kK6L5K6J8J6J4J0
5102A19Ojj3j8j3nj0k6l5k5j0KOJ1J9K8L4L0K0QlolORKj1j9j9k2k9l0j9j1j5k0pJ1J6RJ2L1
5084IM4L6K2K3L0K2Lj5k2k7k3j0J4L1L8L2J6j1l4m3l6k4j1QK7L1Qk9n7n2j8K1L7K5OMJ7K8
5067A20K0MppmKJ2K5L3K2jj7j5%RKj4k5k2j2j%oj3j5k0l0l0qK3L6J9%mMPNJlrj7j8j4j3j1
5048Hrj1rJJ9K5J7PJ1J0rl0k8oMKPJ8J6lj9j8j3j6rRK1J4NL%j0rJ3L9M0K0J1J3QloLMj1k5
5028A04k2j2j1j1lJ4K6K4J0nj4j4j0rq%J3K1J5jj8l4m4m1k8oPRKjJ3L4M5L7J5kj1j6j9j2k
$$ y = [141, 168, 174, 175, 194, 231, 266, 288, 298, 293, 255, 185, 102, 30, -14, -30, -19, 7, 32, 47, 54, 58, 53, 41, 30, 32, 44, 60, 82, 112, 142, 163, 174, 186, 201, 204, 188, 156, 126, 108, 104, 112, 126, 139, 154, 172, 188, 191, 181, 172, 176, 187, 193, 185, 161, 124, 82, 55, 55, 70, 79, 78, 76, 79, 77, 65, 55, 52, 49, 38, 28, 33, 48, 65, 86, 118, 146, 147, 120, 96, 99, 122, 140, 137, 114, 74, 30, 0, -5, 3, 18, 43, 81, 121, 143, 144, 132, 112, 82, 46, 17, 5, 9, 33, 78, 128, 154, 142, 110, 77, 44, 6, -24, -26, 0, 35, 61, 79, 95, 109, 119, 125, 124, 111, 93, 80, 75, 65, 39, 4, -21, -31, -29, -23, -12, 7, 35, 69, 99, 119, 127, 124, 118, 115, 121, 130, 132, 121, 102, 83, 61, 32, 2, -17, -28, -43, -63, -70, -59, -43, -34, -22, 9, 53, 89, 111, 134, 164, 186, 189, 174, 152, 125, 102, 92, 106, 137, 175, 207, 223, 212, 178, 135, 99, 75, 64, 72, 99, 130, 138, 109, 52, 0, -18, 3, 40, 65, 71, 75, 92, 120, 140, 144, 137, 130, 126, 128, 140, 165, 198, 220, 219, 202, 187, 187, 196, 198, 184, 159, 137, 125, 124, 124, 118, 105, 90, 70, 40, 10, 2, 25, 61, 80, 80, 76, 80, 87, 92, 93, 90, 81, 64, 46, 32, 19, 8, -1, -12, -21, -20, -1, 24, 41, 48, 59, 69, 60, 30, 2, -4, 0, 2, 9, 27, 43, 40, 21, 3, -10, -26, -35, -26, -5, 9, 14, 17, 17, 7, -2, 11, 50, 90, 110, 121, 134, 142, 139, 133, 136, 140, 129, 104, 82, 70, 59, 48, 45, 59, 85, 109, 119, 114, 100, 86, 76, 67, 59, 59, 72, 93, 108, 107, 89, 55, 11, -30, -58, -64, -57, -48, -46, -47, -34, 0, 45, 82, 97, 95, 84, 68, 49, 37, 35]
5010C5%oj2mJ4L4M7M4K9Pj2k5l2k8j1J2K6K5J2kj9l4m2l7k1LL1M6L7J4oj6k1k9k9k1j5j4p
4993b7PJ4OjPK2K1J2J0J4R%jO%k0l1k0nqj9j8KJ8J1kmPJ0LmJQkk3k8rJ2Qj7k3%K8K8Qpqj0
4972a5k0k1KL9O0M6Pk7m1l0pRJ1jj7k8k8j1J8M8N4L4Mj6k0j7qJ1K9L0Rj3j4OK6L2J8jpPK1
4955A79J8%rm%j3k8k0KJ7J5RRLj3k9l0j8pnrqKJ8K9K8J8P%j%MMok2l1k5j2ljjJKjprlQJ6J6
4933I0%k6m1l4j5oj2k0qJ6K6J5jjJ0J1jj6j6LL1M7L8J2j0j2kPPJqj9k0pPMj2k6k4j8rNK3K8
4914A7K1OJMNKjjJOJ1Nrk0j8pj%%Mkj6l4m5m6l9k2oOJ6L0M2L5Qk1l0rK6N8P4O4L0j1l5k7k
4894G0J9J9OqqLJ3J2JkQK0J3j1l2l0j4jlj1j9k0j5mRJ9K2K2K3K3J4nk6l1j6PJ4Jj8k4j2%L
4875C1jo%K0M4M9K0k1m1k5MJ8J8Rnk4l9l6k4j3mJ2K8L7L3K1Nj6l3l0j0PJ6K1K9K9J2pj4j1
$$ y = [35, 35, 29, 17, 13, 27, 61, 108, 152, 181, 188, 176, 151, 119, 91, 80, 92, 118, 143, 155, 153, 134, 100, 58, 21, 0, 3, 34, 80, 117, 131, 125, 109, 88, 59, 30, 9, -6, -20, -27, -20, -6, 0, -1, 6, 28, 49, 61, 71, 85, 94, 94, 93, 99, 99, 79, 48, 28, 23, 15, -4, -22, -20, -2, 9, 7, 3, 10, 20, 23, 19, 20, 28, 26, 3, -25, -34, -22, -14, -31, -54, -54, -26, 2, 10, 3, -5, -15, -35, -56, -54, -15, 45, 91, 98, 71, 30, 0, -7, 2, 13, 12, -5, -33, -61, -72, -54, -6, 48, 82, 86, 70, 50, 33, 25, 36, 65, 95, 104, 91, 77, 83, 109, 141, 159, 158, 151, 158, 179, 197, 197, 188, 184, 184, 171, 143, 123, 125, 142, 157, 166, 175, 178, 165, 136, 106, 88, 81, 76, 67, 59, 61, 79, 108, 136, 154, 161, 161, 160, 160, 164, 168, 162, 140, 109, 84, 72, 69, 68, 67, 68, 70, 69, 62, 53, 50, 58, 74, 90, 90, 64, 23, -11, -26, -32, -44, -64, -72, -56, -30, -15, -16, -17, -7, 4, 3, -13, -29, -26, 5, 52, 90, 102, 92, 80, 78, 85, 92, 93, 85, 66, 46, 39, 46, 50, 38, 12, -12, -30, -39, -34, -11, 17, 38, 44, 45, 49, 54, 56, 55, 54, 55, 61, 72, 77, 68, 48, 30, 23, 22, 22, 22, 26, 24, 8, -26, -71, -117, -156, -178, -184, -178, -162, -132, -90, -55, -47, -68, -98, -107, -81, -23, 51, 115, 145, 134, 99, 72, 70, 89, 108, 114, 106, 98, 101, 114, 126, 127, 125, 133, 153, 166, 155, 123, 93, 79, 78, 75, 64, 45, 25, 10, 6, 15, 34, 56, 78, 101, 124, 138, 133, 107, 76, 60, 67, 81, 82, 64, 40, 28, 28, 31, 30, 24, 24, 44, 88, 137, 157, 136, 95, 70, 74, 92, 110, 119, 114, 90, 51, 15, -9, -22, -26, -14, 14, 51, 84, 105, 110, 94, 61, 31, 21, 28, 44, 65, 94, 123, 135, 128, 114, 103]
4858A03j5k5l2k7j0NJ5J8Pnj0mNNj%J1K8L5L6L5L8K8mm4o5n2k1PK3L0K9J8Mk%krj9k7k5j3
4840F8KJ2Rmj5k2k5k5k1oJ0J9K5L0M0M4L0kl8n6n0k4LK3K8J4pk8l6l4j9%J5J5NmjLJjJ0K7
4822A5L7L1K0J1lj8k1oROqj2l%qj2lJ1J1%pJJ5J8Nrrmpj9j9JK8L7K4J0kj5l4m3k9kJ9J7mk4
4802El0j4J4K7J9OJ2L9N4L4ql7l0LL0L6K4Pmj0j7k7l2k6j0NKj5l2l0j4NQKnm%jnj0rjPLmj
4782c4J8L5L6J9MJLPJ6K3K0Nj2k1l1m0m2l2k1j1kJ2K0J1LJ4M0N1L5Qj4l0m8n4l4J1N0O3M6
4765A25J9jj0j1j2j4k0k4k6j9jJ6J9Oj0j6nJ0K3K4K0Qj0l1m2l3j4pk0l2j6K1M6L9J5mj3j9
4748a9j7oJ9M1N1M3K4NkMJ1QLKOKj3k9l5k9j8j7k5l2k4jJ6J4LKJ3K4K4J5Kpj0%J6K7K5J7P
4730A40KNJ1J4Poj8k9l4k6lJ6J4jrqj2k2k4j2ljjJjrmK2M1K3j3k2LL2L3J8NkpqJRMj2j8lJ9
$$ y = [103, 88, 63, 31, 4, -6, -1, 14, 32, 39, 34, 24, 20, 25, 30, 29, 29, 40, 68, 103, 139, 174, 212, 240, 236, 192, 127, 75, 54, 61, 84, 114, 143, 161, 165, 163, 163, 161, 152, 133, 106, 81, 68, 70, 82, 91, 87, 72, 50, 25, 0, -21, -27, -17, 2, 27, 57, 97, 141, 171, 169, 131, 75, 25, 1, 4, 27, 55, 69, 62, 34, -2, -36, -55, -55, -40, -25, -20, -24, -25, -22, -21, -22, -12, 15, 52, 83, 103, 114, 111, 93, 72, 66, 75, 81, 73, 61, 58, 58, 50, 38, 35, 46, 57, 57, 50, 51, 66, 84, 89, 80, 71, 67, 60, 41, 22, 23, 51, 88, 112, 122, 120, 105, 71, 28, -1, -3, 16, 33, 29, 5, -25, -39, -25, 2, 21, 27, 39, 78, 132, 166, 158, 121, 91, 94, 124, 160, 184, 191, 187, 177, 160, 133, 101, 75, 65, 70, 72, 57, 25, -5, -19, -14, -6, -4, -9, -13, -13, -14, -19, -29, -38, -39, -32, -29, -33, -34, -16, 19, 55, 74, 78, 79, 82, 89, 105, 128, 148, 153, 141, 120, 89, 49, 7, -25, -46, -57, -59, -47, -27, -16, -13, 1, 41, 92, 127, 135, 121, 91, 43, -11, -45, -34, 16, 79, 125, 144, 143, 133, 122, 110, 96, 76, 52, 26, 7, 6, 22, 41, 47, 37, 21, 16, 26, 49, 73, 93, 101, 91, 60, 18, -15, -29, -36, -56, -88, -104, -83, -37, 2, 17, 13, 0, -19, -36, -42, -23, 18, 69, 112, 136, 141, 139, 143, 154, 162, 165, 167, 173, 175, 162, 133, 98, 69, 51, 34, 9, -23, -47, -48, -32, -18, -15, -13, 0, 24, 48, 63, 65, 58, 48, 48, 64, 91, 116, 133, 140, 142, 147, 158, 172, 179, 173, 155, 126, 92, 66, 63, 79, 93, 92, 83, 75, 63, 41, 17, 5, 2, 1, 0, 1, 0, -9, -13, 9, 50, 73, 60, 38, 41, 73, 106, 124, 129, 127, 120, 112, 113, 122, 126, 114, 96, 93, 112]
4709A12K7J3pj1m%rj9qJ6K7Rj4j7KJ5Jk5l9l4j8mRJ9K8K7J3j0k7k9j0J7L8M4L4J7kj2j2qj0
4692A39j1JJ5J4j1l9m8l8k7k5k0rkMJ1K1K3J3OPPkj5j3jMPJ3K7L1J3j6l0k1oKkkQJ5PokK1
4672F3L3J7j1k4j6qkPK3K6Qj5k4j6lJ4K5K2OrnJ2K1J8RNJ0J9K6K2Ppj5k1l3l5j8J2K1Lj5r
4654A43RJ3lj6j2JLnoOJ8J5MOJ8J8jk2j4J9M0K9lk6l4l7l8k8qJ3K1K0K3K9K5J1mrmlqj3k0
4636A70l1m2m1j7J7L5L6K3NqrNK4K6J2jorj8k7k5j2%MNOJ1K7M1M1K4J0QKk4n5o5m7l2l0k6
4618GLL9N3L3OoMK0K0Kj8j4PK1Lk6l5k0nj0j8qRRj1k9l0j9pj%j0k2k1%K9M2L5K0J0NPJ5K4
4599A13K3J2LMJ1Rql1m0k5LK2J8LpkMkj5k1j0RK8L8L6J6j1k0nJ8J8kj5pJ6K4J2j0k3j7KJ9
4581A90K4J6PQJ5J7Nj7l9n1n1m3l2j8okj0j9j6nnj8j7J2L8K8lj6NK9K7OmKKj0k0j6pKJ5L5
$$ y = [112, 139, 152, 145, 134, 130, 130, 121, 102, 94, 110, 137, 146, 132, 115, 117, 132, 133, 108, 69, 35, 17, 13, 22, 41, 69, 96, 109, 99, 72, 43, 33, 50, 88, 132, 166, 183, 181, 169, 157, 149, 139, 128, 129, 144, 158, 147, 108, 60, 22, -5, -30, -50, -59, -61, -57, -46, -25, -2, 11, 17, 24, 31, 29, 14, 1, 0, 4, 11, 24, 51, 82, 95, 79, 49, 28, 22, 24, 22, 20, 28, 43, 50, 44, 42, 63, 96, 113, 102, 78, 62, 54, 52, 59, 82, 108, 116, 101, 77, 61, 58, 72, 97, 119, 125, 116, 111, 123, 144, 162, 171, 176, 186, 205, 231, 253, 260, 253, 238, 217, 184, 149, 131, 143, 164, 167, 152, 143, 152, 165, 162, 146, 134, 135, 138, 133, 127, 133, 151, 166, 170, 176, 194, 212, 211, 189, 175, 194, 234, 263, 260, 234, 200, 163, 125, 97, 89, 102, 123, 143, 166, 195, 220, 231, 227, 218, 214, 211, 203, 190, 170, 139, 97, 56, 39, 56, 91, 127, 150, 155, 147, 138, 143, 167, 193, 205, 204, 198, 189, 171, 144, 119, 107, 107, 111, 116, 122, 133, 160, 201, 242, 266, 276, 284, 286, 262, 207, 142, 95, 63, 33, 7, 10, 49, 102, 135, 141, 135, 139, 159, 179, 181, 163, 149, 156, 177, 180, 154, 119, 99, 94, 84, 66, 58, 67, 76, 65, 36, 6, -13, -20, -21, -21, -31, -53, -74, -74, -45, -3, 32, 52, 62, 67, 74, 89, 113, 136, 148, 151, 155, 166, 175, 167, 136, 96, 71, 74, 96, 114, 117, 110, 108, 112, 110, 95, 74, 64, 73, 101, 139, 175, 191, 180, 160, 155, 173, 191, 189, 174, 167, 183, 207, 219, 209, 186, 169, 171, 190, 214, 230, 237, 245, 260, 277, 282, 265, 226, 175, 124, 81, 49, 31, 25, 23, 13, -6, -22, -27, -32, -50, -67, -55, -17, 11, 8, -8, -3, 26, 53, 59, 55, 57, 59, 49, 29, 13, 6, 8, 23, 58]
4562E8M7L4Lk0k2rMJ2J7J4Mqj1kLlj4j7mRJ0pk9m2l7j9nqj6j1QJ8OnNK6L0K4K4L3K9Jk7l5
4543F8k2pLJ2J6Roj8k0j2LJ8K2J4LKPPKkopj1k0l4m6m1j6J4L3L7L3J8KnOJ3Kk0k2kJ1nl3l8
4524c8j8J2K6J9NkKJ1J5J3J1J1OKKJ1J8J8J4Mj2l6n0m0rJ7K8K0QNJ5K7K8J1j7l2k2MJ7ll7
4506F4m7j6K6L6Rj7j6%Qjj6k8l2k6oJ1J3Mpj4j5nJ3K6J7mj3mNNLJ0J8K5K9K3Mk2l5k4lRK0
4487B7L2L3J3j2j7JJ1Kj1oRJ2nk1k5j8j2j0lOJ3Pnj0KK2L0K0Lpooj1j1KK1K1Lj3j0OQj1l4
4468D0m0k6j3njNJ2J8K0J4nk5l4j8J3L1L1K2J7J6J7K0K1J7Mj3k0j5q%NQKnmQJ3%k3l5k9j4
4450B1%J9M5N9M2jm5o3n3k9j4ojJ0J9K0J1%kOJ8K6J7ok4j8MK1J9QMKmj2j5j0qj1j3pLPJqj0
4431B2nMJ2J7K5L2K5Kk1k1OL2L1Jl5m4k2J4M2M3J9rk2j9j0j0j0KK0K2jl1m0k5onk0l0l0j5
$$ y = [58, 105, 139, 142, 122, 100, 91, 95, 107, 124, 138, 142, 134, 123, 121, 124, 121, 107, 90, 86, 95, 105, 98, 69, 27, -10, -29, -34, -42, -58, -69, -61, -43, -37, -42, -37, -11, 19, 43, 67, 100, 129, 130, 103, 68, 46, 39, 42, 54, 70, 79, 73, 55, 35, 23, 26, 44, 66, 80, 83, 85, 92, 99, 101, 99, 93, 86, 75, 55, 21, -25, -66, -82, -68, -35, 2, 35, 53, 55, 50, 56, 69, 71, 51, 29, 27, 38, 33, 0, -38, -56, -44, -18, 1, 6, 4, 6, 17, 32, 45, 56, 67, 73, 75, 77, 88, 106, 124, 138, 142, 130, 94, 44, 4, -5, 12, 40, 60, 68, 73, 88, 115, 143, 154, 137, 105, 83, 87, 104, 101, 64, 17, 1, 27, 63, 72, 55, 39, 39, 47, 46, 30, 2, -30, -56, -62, -51, -38, -34, -41, -55, -70, -75, -62, -36, -19, -23, -36, -40, -35, -30, -27, -17, 1, 26, 55, 78, 82, 60, 25, 1, -2, 7, 27, 59, 92, 105, 93, 76, 77, 88, 90, 79, 73, 82, 94, 89, 68, 43, 25, 13, 3, 0, 6, 19, 26, 21, 11, 13, 35, 65, 85, 88, 81, 75, 69, 58, 47, 49, 70, 91, 94, 81, 71, 77, 85, 74, 40, 0, -26, -39, -44, -45, -40, -28, -10, 10, 24, 19, -6, -40, -58, -45, -14, 17, 39, 56, 72, 89, 109, 130, 147, 151, 138, 118, 103, 95, 95, 100, 108, 110, 105, 101, 109, 122, 122, 99, 64, 35, 21, 21, 40, 85, 144, 186, 185, 140, 77, 24, -5, -19, -25, -26, -16, 3, 23, 34, 34, 32, 38, 56, 82, 99, 93, 69, 51, 55, 76, 95, 103, 107, 109, 105, 93, 78, 68, 60, 49, 36, 29, 32, 39, 40, 32, 22, 17, 21, 33, 50, 75, 107, 132, 134, 113, 92, 98, 130, 161, 162, 127, 83, 61, 75, 117, 160, 179, 170, 148, 129, 119, 109, 99, 101, 121, 143, 142, 111, 71, 46, 40, 35, 15, -15, -45, -60]
4413f0%PRJ3J5J3OLM%j1j9j0PJ6J0RJ7K5J9Mprj0j3j3rlRK1J6j8n3o2l2RL4L9L5L7M0L7K1
4395A46rl9n0l6j1J1L0M2M0K7J2OJ1J8K2J7%k3l6l0j4mrj4j0MJ0jk4l4k5j2j8l4l1pRkk1j8
4377a07jJ6K8M2M8L5J3LJ0J1jj5j8j5j0jJ2J4PPK0K9J9qk5k4j2JJ0J4J6J0jj7k2j0OKk6n2
4360Hn1l3j2KJ4K6K8J9J5J8K4K2Mk0l5k9nJ8K8K4J9J9J6J3RLpj0LK9M6L9Rk3l9k9mJ5J2ok0
4342A59k5k6k6j8qj1k7l4j9QK0J8J9K4K0Mp%J9L5M0L9L0J0j5l2l1j5j%j0k9m1m3k8lK2L6L6
4325I0L0K3J6J0Lpk0l2l3j8%J1J8K7L2K4Nppoj5k2j6omj0rjKpj6j1MK1L7N3N9M1Ll5m8l6j9
4307A24j2j4j3qJLLJkoqm%KMOkj9l0k0NK0J5Plj8l4l5rJ4J3LQK8M0L2K1J2jj4j1OJ2jj0LK3
4286A32K0kk6l8m0k9mK3L6L8M0L2Nl2m6k8jJ0PLJj1l0l6j9OJ7%k6l3j4J6K9K5J8J8K2J7Lj4
$$ y = [-60, -60, -53, -44, -31, -16, -3, 3, 6, 10, 10, -1, -20, -30, -23, -7, 3, 12, 29, 54, 73, 77, 70, 61, 51, 38, 25, 16, 13, 22, 43, 59, 41, -12, -74, -106, -97, -63, -24, 11, 48, 88, 125, 146, 137, 98, 48, 12, 1, 12, 42, 84, 124, 151, 163, 169, 180, 198, 220, 237, 237, 214, 178, 148, 134, 130, 121, 107, 97, 101, 111, 110, 86, 52, 27, 15, -3, -37, -68, -75, -66, -68, -89, -107, -108, -92, -64, -22, 26, 61, 74, 77, 87, 98, 97, 82, 64, 49, 39, 38, 50, 64, 71, 78, 98, 127, 146, 138, 113, 89, 77, 78, 88, 102, 118, 128, 127, 110, 88, 78, 84, 86, 60, 8, -43, -76, -88, -86, -72, -46, -18, 1, 16, 34, 58, 80, 84, 64, 29, 0, -5, 13, 41, 65, 84, 103, 119, 132, 141, 144, 137, 127, 130, 159, 205, 244, 253, 230, 191, 162, 158, 173, 185, 179, 159, 134, 108, 82, 64, 56, 45, 18, -16, -35, -27, -7, 11, 30, 54, 74, 78, 71, 71, 90, 125, 165, 204, 234, 244, 229, 197, 166, 151, 150, 150, 140, 111, 70, 27, -1, -4, 18, 54, 90, 120, 143, 159, 169, 172, 165, 145, 113, 80, 62, 62, 73, 91, 118, 150, 174, 179, 172, 165, 159, 144, 122, 106, 100, 96, 86, 77, 76, 78, 71, 55, 44, 48, 69, 106, 159, 218, 259, 262, 227, 179, 143, 124, 112, 98, 85, 77, 78, 81, 84, 85, 83, 77, 69, 65, 65, 67, 71, 77, 75, 56, 26, 6, 11, 31, 46, 53, 50, 32, -2, -37, -46, -32, -19, -16, -8, 20, 60, 92, 113, 125, 124, 110, 99, 105, 117, 116, 106, 109, 132, 152, 150, 124, 86, 46, 17, 13, 36, 72, 110, 150, 182, 187, 155, 109, 81, 80, 90, 97, 100, 101, 90, 60, 24, 5, 11, 28, 28, 2, -31, -45, -29, 0, 25, 43, 61, 83, 100, 103, 89]
4269H9k9l8l7l0j9pJ3L0L0J5LOJ8K6K2J5Nlo%J0J0MLONj0k9l4k2njj4k6k0ML1M4L7J8pk2j5
4250G0J0K9K7J7K0K4J4j3l5l7k9k3j8rjKJ1K4K5Oj1oJ0J5Olj%orJJ4J8J4J2J2Q%oj4k7l4k1
4232H6MJ6%k0k0nJj3k6k6j5mjoj4j5mNmj7rK2M7M5L2K4J4mj9j4ljolOLj1j4JJ1Ojnrj9k4j7
4211b6poqoKPPMnj5qJ3K0NoQL2L6J8QJ1Mj5k7j7jNMPJ1RPQNj2k9k9j0NMkLJ8K7K1Jj2j3rq
4190C9j1p%Kjml%%MRNj2l1l5j7jL%NJ5J5KoNK4L0J2j1j9j4oQL1M3L0Jj3LK6L0J0j5k8k4lK4
4169A15L7K6kl4m8m3k3lRJ9K7K7J2j2k0rJ0K0J5Mpj2j1j3k5l7k7LL0L0Kj8j2J0L0L7L4K3R
4152A73qk3l1k7j4%M%n%J0J8J2j0l8n2m5k2NK2K8K6J7Jk0l0k3JJ8J5NMJ1J7J9K2J7kk6k5m
4135D0Jk1l5j7J8L2K3J5J0lk5k8mK5L2J5j6m8o4n5k4LOmpPL1M8M3J9%LJ6J5jj5j7k0k6k4j0
$$ y = [89, 60, 22, -15, -45, -64, -71, -58, -28, 2, 17, 20, 26, 44, 70, 92, 107, 112, 109, 103, 103, 113, 123, 127, 130, 136, 141, 131, 102, 68, 46, 41, 40, 26, 0, -20, -16, 15, 59, 96, 114, 107, 85, 70, 80, 109, 136, 153, 173, 197, 211, 198, 163, 126, 97, 74, 56, 47, 46, 48, 59, 83, 108, 114, 103, 97, 107, 122, 128, 125, 124, 124, 118, 109, 110, 124, 142, 156, 168, 180, 188, 188, 182, 168, 141, 107, 86, 90, 106, 106, 86, 66, 61, 62, 49, 23, -3, -18, -22, -23, -29, -43, -58, -62, -57, -61, -78, -87, -65, -18, 27, 59, 83, 97, 93, 74, 60, 57, 56, 50, 47, 53, 56, 45, 31, 32, 43, 49, 48, 43, 34, 15, -9, -26, -33, -39, -47, -53, -51, -44, -37, -33, -38, -53, -61, -48, -28, -23, -29, -21, 11, 47, 65, 73, 84, 88, 73, 46, 29, 28, 33, 37, 44, 55, 64, 71, 79, 84, 72, 43, 14, 4, 9, 13, 11, 14, 32, 59, 80, 81, 69, 56, 47, 39, 28, 21, 21, 23, 22, 18, 15, 15, 15, 19, 28, 33, 21, -10, -45, -62, -63, -60, -60, -55, -40, -25, -23, -29, -24, 0, 30, 42, 31, 12, -2, -8, 0, 31, 74, 104, 105, 92, 95, 121, 151, 161, 146, 118, 94, 91, 115, 152, 178, 176, 142, 94, 51, 28, 25, 34, 53, 80, 107, 119, 107, 87, 78, 88, 108, 123, 127, 120, 108, 97, 84, 59, 22, -5, -2, 28, 58, 60, 42, 30, 40, 70, 107, 141, 164, 173, 165, 142, 111, 84, 70, 70, 74, 74, 69, 69, 79, 97, 109, 99, 61, 9, -36, -58, -53, -31, -3, 23, 40, 41, 21, -9, -32, -31, -13, 2, 7, 11, 22, 39, 58, 80, 97, 95, 69, 44, 40, 41, 20, -15, -32, -14, 18, 41, 56, 66, 63, 38, 10, 6, 31, 63, 78, 62, 14, -50, -105, -129, -126, -120, -124, -131, -124, -93, -45, -2, 17, 17, 20, 36, 51, 50, 35, 18, -2, -28, -52, -62]
4117f2JLMJ0J2RJ4K8L1J1j3j7j2j7k3j4PK1K0J7J2mj7j2RL1L8L2Qk8n8n6l2kJ7K9L4K4Jj7
4099C9k0j5mJ1K9K9J0jKRJ1RJ2Qpk6l5l1k4j5j2j6k1j1J0K7L1K7K1Mk0l1k3pllMJ8K5K5J9
4082E5J4J0J1J3Pj1k7l2l9n2n8m1j3PK0L2L9L0K3L1M5M1J8%%OPMmj6k0nJ2Pj4j7LK0J4NNK
4063A32j7l6l2j5kJ0K8L9L0J1%oj8k7j6LJk3l7k5oPJ4K2L1L2K4Ok1l5k1J0K1jk4j3K5N6N6
4047A83L2Kj9k2j4j0j6k2j7qlkMOJj1j8j4mOJ0KrqJ4L4K3j7n1n2k7pjjQK2L4L8L3J8nk1j9
4028G2lRJj2j6j0j3j9j4MJ4P%J2K3Ok6l6j7OJ6K5L7M1K7QL%rj9rJ1K2Qj9m0m8m2k8j4JJ3K1
4009gJ5mj7mK5M6L9J8L%LJ0J6J6Rjj5k8l8l4j9n%KNJ0J0O%l%J2K3K0Kj0rmoj0mLkj3j4jRJ3
3988F7K0L2L5J8j0k9l8m0l7k6j5jJ3L0M2M3L7K7J5JlkJjmlkmpqlOJ5J8J1kqlJrk6l6l3k1k
$$ y = [-62, -61, -58, -54, -44, -32, -23, -9, 19, 50, 61, 48, 31, 19, 2, -21, -35, -28, -7, 13, 30, 42, 38, 21, 9, 18, 49, 87, 119, 127, 99, 41, -15, -47, -49, -32, -3, 31, 55, 56, 39, 19, 4, 0, 11, 40, 69, 79, 78, 80, 89, 100, 109, 121, 129, 122, 96, 61, 30, 6, -9, -21, -37, -58, -69, -59, -32, -1, 26, 47, 51, 31, 0, -23, -30, -33, -36, -32, -14, 11, 36, 55, 69, 79, 90, 103, 110, 99, 72, 40, 1, -51, -109, -150, -163, -156, -136, -104, -65, -35, -12, 19, 64, 105, 123, 123, 123, 129, 136, 140, 136, 120, 100, 95, 107, 114, 100, 83, 86, 106, 120, 125, 130, 132, 115, 79, 47, 32, 30, 40, 68, 107, 137, 148, 148, 142, 124, 97, 81, 84, 85, 62, 25, 0, -6, 1, 15, 37, 68, 100, 124, 130, 109, 74, 53, 63, 84, 83, 59, 46, 71, 127, 183, 215, 217, 198, 176, 162, 152, 136, 114, 97, 89, 86, 84, 88, 94, 95, 84, 66, 52, 48, 54, 64, 66, 57, 49, 63, 97, 120, 103, 52, 0, -27, -34, -35, -36, -28, -6, 28, 66, 99, 117, 112, 91, 72, 69, 78, 79, 67, 51, 41, 28, 9, -5, -1, 13, 20, 20, 32, 55, 61, 35, -1, -18, -12, 4, 29, 66, 107, 134, 142, 145, 145, 136, 117, 108, 119, 141, 149, 130, 90, 42, 0, -28, -42, -41, -28, -7, 8, 4, -13, -17, 8, 54, 93, 111, 114, 114, 117, 127, 143, 159, 168, 167, 152, 124, 86, 52, 33, 28, 28, 30, 35, 45, 55, 61, 61, 58, 58, 70, 93, 113, 115, 105, 96, 92, 86, 76, 72, 75, 73, 60, 46, 45, 54, 67, 87, 119, 154, 172, 162, 133, 95, 55, 18, -8, -23, -24, -11, 19, 61, 104, 141, 168, 183, 184, 181, 179, 180, 179, 175, 172, 170, 166, 159, 151, 148, 154, 169, 187, 198, 196, 188, 185, 186, 177, 151, 115, 82, 61, 59]
3969E9J6K2Rornoj4j5o%koj1k0l0k6kK2K8K0K2L4M5L9K0KJJ0J5Nj1j6j1j0j2j2oKRK0L4L3
3950B31Pk3l3k8k2j9j0J0K3K2J0%j1j9k4k7k4j0J7M2L7jm5o5n7l4j0QNj6l7l4j0J6K9L3L3
3934c6K3Orqkkrj1olj0j4kK2M1L9K8J6Mqj9k2j7oKPOnj7j5NJ9Rj6l3k4JK6L4K8J6RJ0J8K2
3915I7J5Mrj7k2k1j7nJ9N1O9N9K2k1m2l6k1j2j5j8j4j1j4j7j3JJ0J2J3J6J7J2RJ8L4M1L0J4
3898B38jj4k8l5l0j8j4j9k2j6j0lQK3K8J2j7l3k6oLNJ2K9L5K0ok1j7j1j1j5j1KJ9K5J3j0k9
3881D9l2k2j3oNJ3Oj8l6k5J1M0M2L4K2Qj4k9k4JK2K4Qqj7j6j0pj1j6nJ9L5L0J1pj7k3k2j0
3864hlqk3k6lL5O0O3M6K5J4J3Pj0k9k7pMnk1k2j5j9l3l6k6j7j8k7k9k0jK2M1N1N8O2M9J6j7
3847A16j7QK3Mk6l6k8j6oRK4K7J7RJ2J5J2NKnk1m0m1j9J1K1Oj5j4MRpk1j8nqj2%K5M0K8J4
$$ y = [59, 75, 97, 106, 100, 91, 86, 80, 66, 51, 45, 45, 43, 37, 26, 6, -24, -50, -52, -30, -2, 18, 40, 74, 119, 158, 178, 180, 181, 191, 206, 211, 200, 184, 173, 163, 151, 139, 133, 135, 144, 164, 198, 231, 238, 215, 182, 154, 132, 113, 103, 113, 136, 158, 168, 168, 157, 138, 114, 87, 63, 53, 70, 112, 149, 148, 103, 38, -19, -53, -63, -55, -50, -66, -103, -137, -147, -131, -102, -69, -36, -13, -7, -16, -24, -26, -28, -37, -48, -54, -57, -67, -81, -83, -61, -20, 19, 47, 63, 67, 59, 40, 18, 1, -5, -3, 4, 10, 5, -12, -27, -22, -3, 6, -10, -43, -67, -66, -40, -6, 22, 38, 47, 57, 75, 97, 112, 116, 107, 90, 68, 47, 30, 25, 44, 95, 164, 223, 245, 224, 182, 146, 125, 113, 98, 80, 66, 55, 41, 24, 11, 12, 22, 34, 47, 63, 80, 92, 101, 119, 153, 194, 224, 238, 237, 223, 195, 160, 130, 112, 98, 79, 57, 41, 31, 28, 36, 59, 87, 99, 82, 49, 23, 17, 20, 25, 37, 66, 101, 121, 115, 94, 77, 66, 55, 40, 29, 31, 50, 75, 88, 78, 49, 17, -5, -18, -24, -19, -6, 0, -18, -54, -79, -68, -28, 14, 48, 70, 78, 64, 35, 11, 12, 34, 58, 66, 58, 41, 25, 15, 8, -3, -19, -24, -5, 30, 60, 71, 64, 47, 24, 2, -8, -11, -19, -42, -68, -71, -36, 24, 87, 133, 158, 172, 185, 192, 182, 153, 126, 119, 123, 118, 97, 75, 60, 41, 8, -28, -54, -71, -89, -116, -145, -165, -166, -144, -103, -52, 6, 68, 117, 133, 116, 99, 107, 130, 134, 108, 72, 44, 28, 22, 31, 55, 82, 99, 108, 120, 135, 147, 152, 154, 149, 128, 88, 47, 28, 39, 60, 66, 51, 37, 41, 50, 43, 22, 4, -1, -9, -21, -21, 4, 44, 72, 86]
3828H6QRkj5j8kK0K8J6pk7l3l2k8j8lJ2J6J9L1M0K7rl2k6rpj1KK8L2Ll4m1k4j0j0j7j6nPJ2
3810d0Ork0k0kK3K9J2rrJ2L2L4K2Oj3k8l1j7LJ2ROLnj0lJ3J8RjmormJ4K8K4J1QJ8L0L4K6J0
3791B12pj5j6j6k0k2k2k4l2l4j9jRN%mj0j6j4oNJ0J3J1J0RK1L5L8K2lj6pJ3K0Qj2k4k4j9j3
3773D5KK4L9L0Nk2l4k6mJ8K1%k6k9j0NRJ0J6J9J3QJ4K1J4mj6j6j1rj2j9k9l1j9%J9L5M5M8
3756A43L6Qj6k4j8j5j5j6j4j7k1j9%K4L7K9Kk1k8j2J0K0J4J%J2K4K3J5RJ2Qrk5k4pKqk7l4
3738E9k2mJ0K1L0L2J8mk2k7k6k3j7nNMPK2L6K8Lj3oOKn%J2J8J2PJ0J2J1Pkj3j5KL3M6L1Mj5
3719B69k5k9k5j3mqj9k3j9j1mklprj0j1j5qNJ6J7J4J5J9K0J8J5Qrk7l3j9LK7M4M4K4rl1l2
3701A53j6%Jj3k7k4j0oj9k8j4LJ0J0J6J7ol6k8RL7K7J0J7L2K0j0k2mK1K7J4nj5j0OJ5RJjJ
$$ y = [86, 94, 103, 101, 86, 68, 66, 86, 114, 130, 123, 96, 63, 31, 3, -15, -18, -6, 10, 29, 60, 100, 127, 118, 86, 60, 51, 44, 33, 35, 63, 95, 98, 64, 23, -1, -11, -21, -38, -54, -59, -52, -40, -34, -43, -63, -83, -85, -62, -33, -21, -30, -39, -27, 5, 39, 61, 67, 54, 26, -5, -22, -19, -7, 2, 8, 11, 6, -4, -7, 6, 24, 33, 32, 28, 22, 13, 9, 23, 51, 75, 86, 94, 112, 142, 176, 202, 212, 205, 190, 174, 158, 138, 116, 94, 70, 38, 4, -15, -16, -7, -2, -2, -6, -16, -32, -46, -52, -47, -37, -24, -13, -3, 6, 27, 62, 100, 122, 119, 103, 96, 109, 129, 137, 125, 101, 77, 58, 45, 47, 71, 110, 140, 145, 123, 89, 63, 59, 77, 98, 98, 72, 43, 33, 38, 47, 57, 73, 92, 105, 113, 127, 148, 162, 158, 142, 126, 115, 106, 94, 75, 46, 15, -4, -4, 15, 50, 95, 143, 179, 187, 171, 147, 129, 114, 99, 83, 69, 52, 31, 12, 12, 36, 73, 102, 104, 83, 55, 43, 53, 73, 87, 88, 88, 100, 124, 147, 162, 171, 183, 191, 182, 157, 133, 126, 128, 120, 93, 59, 37, 33, 43, 64, 94, 126, 144, 140, 118, 91, 65, 42, 25, 20, 25, 29, 36, 58, 94, 122, 125, 112, 106, 112, 114, 109, 109, 121, 139, 151, 158, 168, 180, 191, 198, 196, 183, 168, 170, 203, 249, 280, 284, 269, 244, 215, 190, 177, 173, 165, 146, 123, 104, 93, 89, 87, 84, 77, 68, 58, 47, 32, 24, 29, 45, 62, 76, 91, 110, 130, 148, 163, 171, 162, 135, 102, 83, 86, 113, 157, 201, 225, 216, 185, 153, 137, 137, 138, 125, 98, 74, 64, 58, 39, 11, -3, 0, 10, 20, 36, 53, 47, 11, -17, -8, 29, 56, 66, 83, 115, 135, 125, 103, 99, 120, 147, 161, 156, 141, 131, 137, 152, 161, 162, 161, 162]
3684A62qk1k1j2j3j9j3J0K3J3oj5j8k1k5j6kJ0J6J1mk0j6LK0K3J7K1L0K7Mk0l0k6j7roqq%
3666A6J7L0L0J9Qjj2k8m2m5l2lK9M5L7J5pj7k0j9j3JJ9K6J8POJ2Oj4k8k1jOmj2KK7L8K4kk3
3648I4l0l0l0k8k2mJ6L1L7L5K6J3jj0j5j4oL%j2j6nRJ0%KJ8K9J9%oKJ2J3J2J4J9K1J4ql7n3
3630A22m1j6knq%%j9m0l3KK8K3OolKLL%nrmjkj0j4j1JJ9L8M2K3JJK4L6J7j5l0j8jPQPJj3l4
3609G4m5l6j5J0K7L6L2J7kj5j2%NkqLK3L6L6K7Rk0m8n7l6lK5M0M6L6Qk2l0j1J3J4nk2k2j2
3592I4lMJ7K8J9rl3l3j6kPJ5J5jj8j4J4L0J0k3k9lJ8J0j9l6l1j2%JkolKQJ0Nj4m1n3l9mL0
3573a07N1N5M9M3L9K9Pk5m1k5KJ4NLJ9L1K6J6J7K2J5kj7k3k7l0k2nPpl7n8m7j6J2J8J6K3L2
3556F2K4lj7qQLj8k7j4RK2K0J2PQQLnpLOqj9rRJ0mML5M5J0l9n1l0rrj3j2j1j1oOR%mjJ0K1
$$ y = [162, 154, 133, 112, 100, 87, 68, 55, 65, 88, 101, 95, 80, 62, 41, 16, 0, -2, 8, 24, 35, 31, 11, -5, -2, 18, 41, 58, 79, 109, 136, 140, 120, 90, 64, 47, 38, 32, 24, 16, 16, 33, 63, 93, 112, 120, 119, 107, 79, 37, -8, -40, -43, -14, 31, 68, 83, 76, 59, 39, 20, 7, 8, 27, 53, 71, 78, 84, 96, 102, 88, 60, 39, 38, 44, 40, 28, 30, 57, 95, 119, 117, 94, 64, 34, 4, -24, -46, -50, -34, -3, 34, 69, 95, 108, 107, 97, 82, 68, 62, 65, 65, 53, 37, 32, 41, 51, 51, 53, 71, 100, 119, 119, 113, 115, 127, 140, 152, 166, 185, 206, 220, 212, 175, 122, 81, 65, 63, 58, 50, 50, 50, 31, -9, -42, -40, -12, 11, 17, 11, 8, 10, 13, 16, 16, 11, 2, -2, -3, -5, -15, -29, -40, -39, -20, 18, 60, 83, 84, 85, 109, 145, 162, 147, 117, 99, 98, 105, 113, 120, 121, 108, 74, 29, -7, -22, -12, 15, 51, 83, 100, 98, 83, 71, 71, 76, 74, 66, 69, 92, 128, 164, 191, 200, 180, 132, 75, 39, 36, 61, 101, 147, 183, 191, 169, 139, 128, 141, 155, 150, 128, 106, 94, 91, 95, 112, 140, 159, 150, 117, 84, 68, 66, 73, 88, 103, 102, 84, 70, 84, 114, 124, 101, 72, 69, 87, 97, 78, 42, 11, -1, -1, 0, -2, -8, -11, -9, -1, 9, 14, 0, -41, -94, -133, -137, -107, -56, -1, 48, 91, 130, 159, 166, 141, 100, 75, 77, 91, 96, 99, 118, 149, 175, 191, 208, 230, 245, 243, 226, 203, 176, 146, 124, 119, 126, 119, 82, 24, -23, -39, -27, -9, 7, 30, 62, 86, 83, 66, 58, 66, 69, 51, 24, 10, 19, 41, 61, 73, 80, 88, 96, 99, 94, 87, 90, 96, 88, 69, 60, 69, 79, 75, 79, 114, 159, 169, 130, 79, 49, 40, 31, 18, 6, -5, -16, -22, -16, -7, -7, -11, -12, -2, 19]
3535A9L4L5J7pj8pLjlJ0K6K8J3ok4l5k6kJ6J2lpkLJMROmqpllJLJJNJ1Jj6k4j5nKJ1J9J4mj9
3514E6j5nkLJ4J9J1lj3j7j8j2PK5K4J8K1K8K0KoNRj0l7m5l1j6qmNJ2J6J5J0Kj3j9j1NJ3jk4
3495C0l4l1k3j5kJ9L6L5K4J3RN%k%lrnQK2K1J1M%JOK1L3K6ll2m0k5j0oj0jJ5K5K2J7J8J9P
3476A96qj2prj6j1MPj5l0j8J2K4J1oj0n%OJ5K0J9J3QOLnk5n2o9n2rK8L4J6jn%KKkj7l6m7m4
3457h5l4k3rJ5L9M4K9Kj5k3k5k8k6j5MK1L1K9K0J4K0K6K5J0jJJ3J9J3Lj1k7m2l7j2J9L7L5
3440E6K0lk0k2lK5M4L8J4j4k9l3l3l4l0k2oJ1K5K8K5K1J6Rmj1kK4L9L1J1NJ3J2j1l4l6j6J2
3423A16K5J8rl6m0j5J1J3JJJ2J6LqLK9M4M0J8j1l7m5l4j8j4j7j2QK4K1MmOK0J7Jj3j2nJKK
3405A26mj3k4k5qJ7J9j3n6o5l0K3M9M3L4L3K4Jj8j2PJ3Mj0k1l4m1l2j3JMOJ3J0pk5k0QL5M1
$$ y = [19, 53, 88, 105, 98, 80, 73, 76, 75, 72, 82, 108, 136, 149, 143, 119, 84, 58, 56, 72, 84, 81, 74, 72, 75, 76, 80, 89, 95, 91, 83, 76, 73, 70, 71, 74, 75, 76, 81, 92, 93, 77, 53, 38, 33, 35, 46, 65, 79, 75, 56, 41, 36, 34, 37, 51, 70, 81, 78, 65, 48, 30, 18, 25, 50, 74, 92, 113, 141, 161, 163, 157, 162, 171, 161, 124, 79, 48, 32, 24, 20, 25, 37, 53, 68, 78, 80, 67, 48, 37, 42, 55, 54, 30, -4, -35, -58, -73, -75, -56, -20, 15, 39, 52, 61, 66, 66, 64, 64, 61, 52, 47, 55, 77, 98, 109, 113, 113, 114, 120, 141, 174, 200, 197, 165, 125, 100, 90, 84, 74, 73, 88, 113, 135, 152, 170, 189, 196, 188, 176, 169, 160, 144, 133, 137, 144, 129, 99, 81, 93, 117, 128, 122, 112, 107, 107, 113, 128, 148, 167, 180, 188, 194, 197, 192, 167, 115, 46, -6, -15, 13, 47, 63, 62, 57, 57, 59, 61, 59, 42, 6, -41, -85, -119, -142, -151, -136, -97, -53, -24, -22, -37, -60, -85, -113, -139, -154, -150, -129, -98, -69, -49, -35, -15, 11, 36, 46, 45, 46, 59, 78, 91, 94, 83, 56, 14, -23, -35, -16, 21, 56, 76, 73, 53, 31, 28, 53, 97, 135, 149, 135, 106, 73, 40, 6, -24, -46, -52, -41, -16, 12, 37, 58, 74, 83, 79, 68, 66, 90, 129, 160, 171, 176, 189, 201, 190, 156, 120, 104, 116, 141, 159, 150, 114, 74, 59, 70, 83, 84, 85, 97, 113, 116, 108, 111, 140, 184, 224, 242, 231, 194, 149, 115, 97, 83, 66, 54, 62, 86, 107, 111, 107, 113, 133, 150, 151, 138, 126, 121, 122, 124, 126, 122, 109, 85, 60, 52, 69, 88, 75, 19, -46, -76, -53, -4, 39, 73, 106, 130, 131, 113, 101, 108, 121, 125, 115, 94, 60, 19, -13, -26, -25, -21, -15, -2, 8, 1, -24, -44, -36, -1, 40]
3388D0L4K2J3NJLJ2K0J8kl0m0k5MJ8J2kkMkj9l2k0LJ1MNK3L7K7KqJJ0Jj4k1k4k8k6rJ4J9J
3369F0k0k4j3JQJ0J0J0RJ0J7K0J7jk2k6pJ9L2K6J4jk0l9l9j8PJ6Poj0lQJ7J4NjQK4K7J3j1
3350A48k4j6QL1L5J5pj7j4j6k7l0j6QJ8J1MMkk2m3m8l6j7MK7N0O0M8K3lk5l8l8l0j8j2j1o
3333b2MJ5J9K0J6J1QQJ1J3J4J1O%lqj5j9j8pKJoj4j6j2lOOJkjlj3j8j1PJ5J4J3J7J7QkKJ2
3313H4J6J1Kpj5j5jJ6J7mk4k2kJ6J5%j3k0k2j8nJ7L0K5J4J4K3J8nk3k2j3j2rRL1L9K4Mj0k0
3296A43k8l0k1nQJ0jk5m0l2j0M%jJ1K4J9%j7k1j4PL5N1L9Lk8l6k6r%OJ0J4J5J3J2J4J8J3n
3278A20k8m2l9j7J2M1M2J8j1j9oRK0J9Rj2k8k6j8j7j9qJ6K8J7lqJRJ0J0J4K1K3J9Oj0k1k0
3261A12oJ0J3ql8m7j7K6M9L4Lj5j8j4j6j9k3k2j2JJ5K4K5K0J0Kk%LMPOok1j8jLj8m1l8j7k
$$ y = [40, 74, 96, 109, 114, 115, 118, 130, 150, 168, 166, 136, 96, 71, 75, 93, 105, 103, 101, 105, 103, 84, 52, 32, 35, 46, 50, 55, 78, 115, 142, 144, 136, 137, 147, 148, 134, 113, 89, 61, 35, 26, 40, 59, 60, 40, 16, 3, 4, 12, 22, 32, 42, 51, 61, 78, 98, 115, 114, 92, 66, 59, 78, 110, 136, 150, 149, 129, 90, 51, 33, 40, 56, 63, 57, 47, 44, 52, 69, 83, 88, 87, 95, 119, 146, 159, 148, 124, 108, 116, 147, 182, 197, 190, 173, 159, 143, 116, 86, 70, 78, 96, 107, 111, 115, 113, 91, 48, 0, -36, -53, -49, -22, 28, 88, 136, 159, 156, 131, 93, 55, 25, 7, -5, -16, -22, -18, -3, 16, 36, 52, 63, 71, 79, 90, 103, 117, 128, 134, 134, 131, 123, 108, 89, 71, 64, 66, 67, 61, 47, 31, 19, 16, 22, 28, 29, 27, 26, 23, 10, -8, -19, -12, 3, 17, 30, 47, 64, 72, 70, 72, 84, 100, 111, 113, 106, 91, 76, 75, 91, 108, 104, 80, 58, 56, 72, 87, 87, 74, 54, 32, 14, 9, 26, 56, 81, 95, 109, 132, 150, 145, 122, 100, 87, 75, 66, 75, 106, 145, 169, 173, 163, 143, 115, 85, 64, 59, 67, 77, 76, 51, 11, -21, -31, -27, -27, -28, -17, 7, 26, 26, 9, -12, -26, -19, 16, 67, 106, 109, 81, 45, 19, 10, 10, 16, 26, 40, 55, 68, 80, 94, 112, 125, 120, 92, 50, 11, -6, 6, 47, 89, 107, 96, 77, 71, 80, 100, 119, 128, 116, 88, 62, 44, 27, 8, 0, 16, 44, 61, 58, 50, 51, 60, 70, 80, 94, 115, 138, 157, 163, 153, 132, 112, 106, 116, 129, 121, 83, 36, 19, 45, 94, 128, 131, 116, 98, 84, 68, 49, 26, 4, -8, -7, 8, 32, 57, 77, 87, 89, 87, 87, 90, 94, 101, 107, 101, 80, 62, 61, 64, 46, 5, -33, -50, -52]
3243e2JNJ4K1K3K6K1Prj1oqj4j0J3K9K6J6J7K6L1K3J2L%nk0l8m7l2j1oj7j9qMJnKJ4K2K4K5
3224H8J7Mpj2j9l3l8j5J5K7K2J6J5J2QJ1J3Mj2j5qrj8j8%J6J4%j0j6k1j6lJ1J4J5J9K2J2m
3207A01j3mJ2J5kk7l3j1J8K6QokROj5l1l1j8nK%omNJ0J3J8K9L8L3K5K4K5J7%j3k3l0l0j5l
3189A12nj9j8ppk2k5jK9L3J3prmrj7j3QK6K8J3jmJOJ4J6J2%ppqj3j4NK1J6nj4j0j0k2k2jK1
3169G3J7JlMNknnj2j8j2JKj6k4j2JJrj5j4j1lJ1K3K3J7J4K1K4J9J0LKkj5k5k5rPJ1PPJ7K8
3150A12K3Prj3mJ0J5Nj6l4l9l1j5LK0L0L4K9K2RjnMJ4J6Opj2pJKj2l4m3l1qRJ1NKNOLnj7k3
3130C7j3J3L9M5K3rl4m4m0j8QK4J0j4j5RL4L8K5J4Qkj2mJ5K9K1Kj6k7k7j9pkoj4j9k3k3j7
3112a1j2pKJ6L0L5L0K9L1K2Jj9k7l2l8l3nJ8J3j3k8j6JJ1J8K7K5J2KJ3K4J7j0l6l4pK0K1j4
$$ y = [-52, -51, -46, -32, -11, 12, 38, 59, 66, 57, 46, 40, 32, 18, 8, 21, 50, 76, 92, 109, 135, 166, 189, 201, 204, 204, 199, 179, 141, 94, 62, 51, 45, 28, 9, 1, 5, 6, 1, 3, 17, 39, 63, 88, 105, 109, 102, 90, 71, 38, 0, -15, 0, 27, 49, 65, 80, 92, 100, 111, 124, 128, 116, 101, 93, 84, 66, 48, 48, 64, 78, 78, 68, 52, 31, 15, 12, 23, 37, 52, 71, 93, 105, 101, 88, 84, 96, 111, 109, 82, 49, 38, 56, 82, 90, 84, 82, 91, 97, 82, 51, 20, 2, -3, -1, -1, -7, -11, -6, 4, 17, 35, 64, 102, 135, 160, 184, 209, 226, 226, 213, 190, 160, 130, 115, 112, 107, 88, 70, 63, 56, 34, 9, 8, 37, 70, 83, 76, 67, 63, 54, 37, 24, 32, 58, 86, 99, 98, 94, 95, 101, 115, 131, 143, 143, 136, 129, 121, 108, 94, 99, 120, 136, 131, 117, 107, 97, 75, 53, 52, 73, 90, 91, 88, 92, 97, 95, 90, 85, 73, 55, 43, 44, 46, 30, 6, -6, -5, -4, -13, -28, -42, -53, -56, -45, -22, 1, 18, 32, 53, 77, 96, 106, 109, 111, 109, 94, 69, 44, 35, 42, 53, 60, 67, 84, 112, 135, 142, 133, 120, 116, 126, 141, 146, 130, 96, 57, 26, 11, 14, 34, 64, 98, 127, 149, 158, 157, 152, 156, 170, 186, 192, 185, 173, 166, 167, 169, 157, 123, 80, 49, 41, 50, 61, 66, 68, 73, 79, 82, 77, 60, 37, 24, 37, 76, 121, 144, 135, 101, 57, 17, -1, 7, 31, 41, 27, 12, 21, 55, 93, 118, 132, 140, 138, 126, 122, 137, 166, 187, 189, 173, 146, 119, 100, 93, 91, 85, 71, 52, 29, 6, -11, -23, -30, -28, -12, 18, 53, 83, 112, 143, 165, 166, 147, 120, 88, 50, 17, 12, 30, 43, 30, 2, -14, -13, -2, 16, 43, 68, 80, 82, 95, 119, 136, 126, 90, 56, 49, 69, 90, 76]
3095G6n6o4k8K2N0M7L7K9K0PlkOOok5l3k3nKj2l1m1l6j5J1L2K9Lk2k3mJ9L4M2L0Lk4k5nJ4
3078C6J5QNOKprpkOJ2Onj1lOKmkOLrj5oRJ0jj2j2jQPKJOJ0Lpj2j3j6j6pPJ1RLjomJ2L5L9J6
3054A13qj2oj2k5l0j9rpmPK1L1L8M0K7Oj3j7j1mjlj0k6l6l3k1kRJ0jj1j0kOJ0J0QMoqlNRJ4
3034A8J7J2%j1j1pnJJ0J5Mj1j3njnlQJ7Qj0j7rJ1K4K1Orqlnj4j4jJ9L4L8L2J8RRQj0l3l7k2
3014G5olJJ1J6J2J1J8K1Rj1k4l4m4l8j2J2Rqj3noj2LL2N0L7J5NOQPjj5k5j4RJ3%o%ol3m6k3
2995eOJ3kjJ2J6Kj0qojJ3L6M7L7J8Lmprj0j3j5j4j3j7j8qNLj6k7j8j0j7l0k3J1M7N8M4J7K
2976H8J%j1k7k7j5jNJ1K1L5M4M8M2K2nk2k6k8l5l8l3k9k6j8LK2J9kj3nMORJ9K1Jl2m7l1KK2
2958b6K2K0K5K7J5JkMJ0Lpj1rnjJ%ljJ1K5L0J9LpkRJ1j0l7m8l3j6j1j5j4%J5K3K7K2J1nj3
$$ y = [76, 20, -44, -72, -50, 0, 47, 84, 113, 133, 140, 137, 135, 141, 147, 141, 116, 83, 60, 55, 57, 45, 14, -27, -63, -78, -67, -35, -6, -3, -25, -48, -52, -33, 1, 43, 73, 76, 52, 27, 22, 36, 51, 59, 64, 70, 72, 65, 56, 49, 47, 53, 65, 71, 66, 55, 52, 58, 60, 56, 54, 60, 63, 54, 39, 33, 42, 52, 51, 39, 27, 26, 34, 41, 43, 44, 50, 60, 63, 56, 44, 31, 15, -1, -8, -1, 10, 19, 22, 21, 15, 11, 23, 58, 97, 113, 105, 93, 87, 75, 50, 20, 1, -8, -15, -19, -12, 9, 40, 78, 118, 145, 151, 138, 121, 110, 106, 105, 102, 92, 66, 30, -3, -24, -26, -17, -7, -8, -19, -29, -31, -25, -15, -5, 3, 7, 1, -7, -10, -5, 4, 18, 35, 47, 47, 36, 25, 18, 13, 14, 24, 39, 43, 32, 19, 14, 13, 8, 5, 13, 30, 38, 28, 11, 2, 13, 37, 58, 64, 55, 47, 44, 39, 25, 11, 10, 29, 63, 101, 133, 151, 160, 169, 177, 167, 134, 97, 75, 69, 66, 67, 78, 94, 106, 117, 135, 156, 165, 154, 130, 96, 52, 14, 2, 14, 23, 15, 2, -3, -9, -21, -18, 14, 64, 101, 116, 121, 127, 135, 142, 141, 126, 101, 87, 96, 109, 109, 103, 103, 97, 64, 18, -5, 1, 14, 12, 11, 23, 39, 41, 31, 23, 17, 16, 29, 65, 112, 149, 167, 170, 166, 159, 150, 140, 127, 112, 98, 85, 68, 50, 42, 47, 50, 34, 7, -11, -21, -38, -68, -91, -80, -33, 25, 69, 86, 88, 89, 89, 78, 51, 24, 9, 8, 13, 24, 45, 80, 124, 172, 214, 236, 231, 209, 183, 155, 120, 82, 49, 20, -6, -24, -21, 1, 20, 18, 5, 0, 4, 10, 19, 38, 59, 60, 28, -19, -50, -48, -26, -4, 16, 41, 68, 83, 84, 82, 86, 96, 99, 92, 81, 72, 67, 66, 67, 67, 64, 63, 74, 99, 129, 148, 151, 144, 142, 151, 162, 152, 115, 67, 34, 18, 7, -8, -22, -22, -7, 16, 43, 65, 76, 71, 58]
2939E8qJ0K5L2K5J5RNqk6l6k9k0k2k6j4J1K5J5oj2MK4K9J5%lkj2l3m5l9k5j2NK9L9J8j2k0
2922a7qOQOQRLMK2L7L1Pj3k1k3j6jJ5K3K1J3Kj7l6m2l0pJ4K3K0Ok%Ljo%K1M2N3M7K7Mj0j4
2902B11j2j0j3j9k9m0m3l1j2QK6L3K1pk9k5mJ8K8K9K6J7QQJ5J8J4jj7k7k3kJ9L1L0J8kk6l4
2885A72j9NJ3ONJ6J8ml7n3m1j5PK3L9M6L2Kk0j2J1Pk5m9l7pJk0m1l7k7j8j6r%J1K6L6L4K4
2868D7J1Loj3j4lQJ6K2J9Jk3l4k9k8l1j7J7L2J0j5mL1M8L3J3LjlQK3K0KoJ4L5L7J9ql6n6n2
2850I3k3kj0l7m2j9J2K6J7NJPQ%j5j7oLPMjorkJ5K2J2llQJ4J8K5L3K5Kj8k0j5j8k8l4k1RL7
2830E4M0J0k6l3j1Pmk6l0j5jnj9k5j7jJ4K0J0jKK8N0M5J2j6j6PK1J3mj1jJ1J8J5J3J5J7J3
2813A73lj6j9j2j2k7m0l6j8rpqnOK1L7M1K5jj0LJ4J0%%QOj0k1j6lJ%MK0L2K5Lj1pJ0K0K1J3
$$ y = [58, 50, 60, 85, 117, 142, 157, 166, 171, 163, 137, 101, 72, 52, 30, 4, -10, 1, 26, 41, 35, 23, 27, 51, 80, 95, 95, 92, 90, 78, 45, 0, -39, -64, -76, -71, -42, -3, 15, 3, -17, -25, -19, -11, -5, 3, 12, 15, 19, 41, 78, 109, 116, 103, 82, 59, 43, 42, 57, 80, 101, 114, 116, 99, 63, 21, -9, -16, -2, 21, 41, 47, 45, 45, 48, 47, 41, 41, 62, 104, 157, 204, 231, 235, 225, 211, 199, 189, 176, 157, 128, 88, 45, 14, 2, 10, 36, 69, 90, 83, 54, 29, 25, 43, 71, 100, 126, 143, 151, 159, 174, 192, 206, 205, 188, 161, 138, 136, 155, 186, 216, 234, 232, 206, 172, 153, 158, 171, 177, 182, 198, 216, 212, 175, 122, 81, 66, 73, 96, 135, 181, 213, 215, 195, 183, 194, 201, 176, 127, 90, 83, 84, 64, 23, -14, -41, -59, -75, -84, -84, -73, -47, -11, 23, 47, 58, 61, 55, 42, 28, 25, 33, 49, 71, 90, 91, 68, 34, 5, -23, -54, -71, -54, -22, -12, -27, -31, 0, 48, 81, 94, 97, 96, 93, 101, 124, 144, 146, 140, 154, 189, 226, 245, 237, 201, 145, 93, 70, 68, 58, 21, -21, -40, -28, -2, 15, 20, 21, 28, 36, 36, 21, 4, -2, 1, 8, 12, 11, 5, -4, -6, 9, 31, 43, 40, 37, 45, 59, 77, 102, 135, 160, 162, 144, 124, 109, 91, 63, 29, 8, 17, 54, 94, 104, 78, 45, 34, 41, 37, 11, -19, -34, -35, -40, -59, -84, -101, -102, -88, -68, -58, -59, -57, -29, 21, 66, 78, 62, 46, 53, 74, 87, 83, 72, 71, 82, 100, 115, 128, 143, 160, 173, 170, 154, 135, 123, 111, 84, 44, 8, -10, -19, -26, -34, -39, -33, -12, 25, 66, 91, 90, 80, 83, 97, 107, 107, 107, 115, 121, 111, 90, 74, 71, 72, 72, 76, 96, 128, 153, 156, 145, 138, 148, 168, 189, 202]
2794B02Omj7l4m7n0l6qJ9L1K0Lj0j2oKJj0k0j4PK5K5Roj2mJ0J8J0oj2%Qnk2j8%Mrj5jJ4Rp
2774C8j8j9j6j1NK4L6K9Rj2l0l6k8j2NJ7L1M1L8J6j0k9l4k7j4lLPJ0Rnj8j9lJ5J8RjmllJQ
2756A4J0Npj1qkmj0j1nMJ5K6L0J2k0m1l6j0J1J9K0K1J9K0K8L5L0Pj8l6l5k3j2j0j5j0J0L2
2739D4L7K4J1Lpj8k2j6j0m%Kmj7j8nJkj6j9j0kkoj2j2lJ2K1J7J4K2M2N0M1K1Jj4k0j8j0mK
2720I4Jrk0j9%J9K2J8K2K1Lj4pJ8K4kk4j9pj9m4m8j8J8L9L7K4J2MLLkqj1oKPNmj2j1%QQLL
2700A14RJ1QOJ1K1K9K1nl1l1lK6K5jk6l7l9l5k0%J0OLNQLpj3k1k9l2k8j8mJ5L5M3L7K1Qmj8
2681G3l0k4pLkpOL8O0N2J9j8l3l0j8mRJ8J4lj7j5%J2J3NJKQRK%NJ0%j9k7j4jok2k9j8jJ3J7
2662D4J1klJ3K9J5k0l7k6romJ3K7K0JjR%k6l9j2K7N2N6N2M2J8j3l1l0k2j3jJ0J7J3Kj0j7j0
$$ y = [202, 208, 204, 187, 153, 106, 56, 20, 12, 31, 62, 82, 85, 75, 63, 57, 59, 60, 50, 30, 16, 23, 48, 73, 82, 76, 64, 60, 70, 88, 98, 92, 80, 80, 88, 83, 61, 43, 43, 47, 38, 23, 22, 36, 45, 38, 20, 1, -15, -26, -21, 3, 39, 68, 77, 65, 35, -1, -29, -41, -36, -19, 12, 53, 91, 107, 97, 68, 34, 7, -7, -10, -7, 0, 10, 19, 14, -4, -23, -26, -11, 7, 16, 15, 11, 8, 5, 6, 14, 24, 29, 22, 11, 3, 1, -3, -13, -24, -29, -25, -10, 16, 46, 58, 38, -3, -39, -49, -38, -19, 1, 22, 41, 61, 89, 124, 154, 161, 143, 107, 72, 49, 37, 27, 12, 2, 12, 44, 81, 105, 116, 119, 112, 94, 72, 56, 46, 42, 42, 44, 40, 23, 5, 0, 1, -1, -17, -36, -46, -48, -50, -56, -68, -80, -83, -71, -50, -33, -19, 3, 45, 95, 136, 157, 158, 144, 124, 106, 96, 92, 94, 95, 86, 66, 47, 47, 66, 88, 106, 128, 149, 152, 138, 131, 149, 173, 171, 147, 128, 121, 102, 58, 10, -8, 10, 49, 86, 110, 122, 126, 129, 132, 130, 122, 111, 105, 107, 114, 119, 115, 103, 92, 92, 100, 108, 111, 114, 123, 134, 142, 148, 159, 180, 209, 230, 225, 194, 163, 160, 186, 211, 210, 184, 147, 108, 73, 53, 53, 63, 69, 72, 77, 85, 88, 81, 68, 47, 18, -14, -42, -60, -64, -49, -14, 29, 66, 87, 95, 91, 73, 43, 19, 12, 15, 13, 6, 12, 50, 110, 162, 181, 163, 130, 100, 82, 78, 87, 105, 119, 116, 99, 84, 84, 96, 109, 114, 115, 117, 125, 134, 136, 136, 141, 151, 151, 132, 105, 91, 90, 84, 62, 33, 15, 14, 27, 44, 55, 53, 50, 63, 92, 107, 87, 50, 24, 15, 9, 5, 18, 45, 65, 66, 65, 74, 74, 48, 9, -3, 24, 76, 132, 184, 226, 244, 231, 200, 170, 148, 135, 134, 144, 161, 174, 176, 166, 149, 139]
2644A39LRjj5j6porrpqj3rMRNNJ6K2Rj0j8j1pqnKkj9l9m6l7k0kRJ3J3J3J0OMJ0J7J8K2K7K4
2623H5Pj9l3l1k1j4okpj0mJ0J5OljPROJ1J7J2%%J5L5M0K2jj2JJ5J0j3k4nK4L2J7%KOjk3l8
2604A36l6j9JMrj9j3MQmrJJ1%k0k1jJ9K7K8K2Pj7k7j3OOoj1qrj1kJ8K8J8NJ2L2L9K2ok9l4
2585A30k5nJ3J8J8J6J0j1l4l5qK1K6J0jmj1k1k1mJ2J2kj6k2k1j3mPK0K8K4Kk1l0k1j3j5j6
2568goJ4K0Oj5k0j0MRLmlJLmqj0olkMJ2J9J9J7Roj8j4J5M6N8M2K6K4L0K1ok9l5k1okpj8k2
2548A20j5mmj9l2k6jK6M2M3L2J7Mmj1k1k8k2rJkmKJ0Qmj0kJ5K4J7%j6k3j9pOJ8K5K6K1J2J
2529A87j0k1k6k5j5kOLqj5j1jJj3l1k8jL1M2K1nrlnj0mK1L8L0J3%rk2l0k4j0npmJJmqj0k0
2510al0k1OK7K1Pnj6k9l0j4J1K6L0L3M0M2L5J6pk0j1NR%kJ0J5Kj9l2m2n5n7l4JK0K1K0J8K
$$ y = [139, 142, 151, 150, 135, 119, 112, 106, 97, 88, 81, 73, 60, 51, 55, 64, 69, 74, 90, 112, 121, 111, 93, 82, 75, 67, 62, 64, 62, 43, 4, -42, -79, -99, -101, -92, -79, -66, -53, -43, -37, -33, -23, -6, 12, 34, 61, 85, 92, 73, 40, 9, -12, -26, -32, -34, -41, -51, -55, -45, -30, -24, -27, -28, -21, -12, -6, 5, 22, 34, 34, 34, 49, 84, 124, 146, 145, 133, 134, 149, 159, 146, 122, 117, 141, 173, 190, 190, 192, 198, 197, 174, 136, 100, 81, 82, 86, 77, 58, 45, 49, 57, 53, 44, 45, 56, 56, 36, 15, 14, 33, 60, 88, 110, 117, 100, 73, 60, 66, 72, 66, 55, 47, 38, 27, 25, 43, 71, 89, 94, 106, 138, 177, 199, 193, 164, 130, 105, 100, 113, 131, 149, 165, 175, 164, 130, 95, 87, 108, 134, 144, 143, 139, 128, 107, 86, 82, 94, 106, 104, 88, 66, 45, 32, 28, 35, 55, 83, 107, 109, 88, 58, 37, 24, 9, -7, -13, 1, 21, 27, 12, -8, -18, -14, -5, -2, -6, -9, -8, -5, -9, -17, -27, -33, -36, -38, -34, -22, -3, 16, 33, 42, 36, 18, 4, 19, 65, 123, 165, 191, 215, 245, 266, 260, 231, 196, 175, 169, 167, 160, 142, 120, 105, 101, 97, 78, 46, 20, 19, 45, 87, 130, 162, 179, 183, 179, 168, 147, 119, 97, 88, 89, 87, 83, 85, 95, 103, 99, 89, 87, 102, 126, 143, 143, 127, 104, 85, 78, 84, 102, 127, 153, 174, 186, 187, 177, 156, 130, 105, 90, 88, 94, 97, 89, 74, 63, 62, 63, 50, 19, -9, -10, 21, 63, 84, 79, 70, 67, 62, 52, 48, 69, 107, 137, 150, 150, 141, 119, 89, 65, 55, 50, 43, 39, 40, 41, 37, 29, 19, -1, -31, -52, -46, -19, 2, 9, 4, -12, -41, -71, -85, -74, -48, -18, 15, 55, 97, 132, 148, 141, 121, 110, 115, 124, 124, 122, 132, 147, 149, 130, 98, 56, 1, -56, -90, -89, -69, -48, -28, -10, -8]
2492hj8j0K1M2L0PlNROOPPOQJ0Lm%J1J8J3Knmljmoj0j4k2k4j5%Omj6j1QK4K8K5J9Qqk1k6k2
2471G0j4qkOJ5K1K6L3L9L5J6mj3j5j7k1j1LPpj9k1j7k4l7l9k7j3jOJ3J9K9M1L8J8oj7j5j1
2453G6oJJ4K0J7Pmj1pPJ6Nk1l6k8pLok2k3jK7L8K1JlPQkmNJ4Ooj1j3k0k8k9k1j5pLJ6J9J4
2434A4J2J1J6J7J6Jk3m8n4m1j6J1L0M3M4L9K9J6Krj1lNOkrpNJ4Oj6k9k2lN%pnJ0K9L9L1Ok0
2414A32k8k0mOJ0J0LnkJ2K1J1qj5lJ4K6L7M0K3nj6LK9K4rm2n2m9m7m0j6J2K2Pj4k2j0OJ2O
2397E9jKJ2J8J5J4J4J3PMRJ0POJ5K1J0j1j7j5j6k6k2kPqk6k8k2k5k2OM5N7K5j8m2m4m2m0l0
2379h1j5kJ0K2L3L1J3qj7j5%J2J2QRJ3J2MjNJ8K5K0Nj2k4k1oRQqk2k0jJ3J0mj2lJ5K4J9Jj8
2360F1j9lJ7J8%j5j1QJ4MlMJ9J6rl4l7j8QJ9J6J3J2%j8l1k4qmoLK2L3K1LlKQRJ0J3QkrpJN
$$ y = [-8, -26, -36, -15, 27, 57, 64, 61, 66, 75, 81, 87, 94, 101, 107, 115, 125, 128, 124, 124, 135, 153, 166, 168, 163, 159, 156, 155, 151, 145, 135, 121, 99, 75, 60, 60, 66, 62, 46, 35, 43, 67, 95, 120, 139, 147, 139, 118, 92, 70, 56, 48, 46, 52, 67, 88, 114, 147, 186, 221, 237, 233, 220, 205, 188, 167, 156, 159, 166, 159, 140, 119, 102, 78, 41, 2, -25, -38, -39, -33, -20, -1, 28, 69, 107, 125, 119, 102, 87, 76, 70, 71, 85, 105, 122, 129, 125, 114, 107, 114, 130, 135, 114, 78, 50, 43, 46, 40, 18, -5, -6, 21, 59, 80, 81, 78, 85, 93, 91, 87, 92, 106, 112, 106, 95, 82, 62, 34, 5, -16, -31, -38, -35, -19, 0, 14, 26, 37, 53, 70, 86, 87, 64, 16, -38, -79, -95, -84, -54, -11, 33, 72, 101, 117, 119, 110, 99, 96, 101, 107, 105, 96, 89, 94, 108, 114, 98, 69, 47, 44, 49, 49, 42, 37, 47, 76, 115, 146, 152, 132, 104, 84, 80, 86, 96, 106, 109, 104, 102, 114, 135, 146, 138, 123, 120, 134, 160, 197, 237, 260, 255, 239, 242, 271, 295, 286, 244, 192, 143, 96, 56, 40, 52, 74, 81, 67, 45, 35, 41, 53, 59, 58, 60, 72, 90, 105, 119, 133, 146, 153, 157, 166, 176, 183, 189, 204, 225, 235, 224, 207, 192, 176, 150, 128, 126, 133, 125, 99, 71, 49, 24, 2, 8, 53, 110, 135, 117, 75, 31, -11, -51, -81, -96, -98, -88, -66, -33, -2, 11, 3, -14, -29, -29, -17, -5, 3, 12, 25, 37, 41, 40, 45, 63, 88, 108, 113, 101, 77, 56, 50, 59, 67, 59, 37, 17, 16, 29, 39, 35, 23, 20, 35, 59, 78, 79, 61, 42, 39, 56, 74, 74, 59, 48, 56, 70, 74, 71, 75, 94, 110, 101, 67, 30, 12, 20, 39, 55, 68, 80, 80, 62, 31, 7, -1, -5, -11, -8, 14, 47, 68, 71, 68, 70, 78, 87, 97, 110, 118, 116, 107, 100, 101, 106]
2339A06jj5k7k5j0%nj7j6p%oj3j4j5j5%K8N2N0L5K6L1K7J1npnnnLQLkMJ2Nj9l9m3l4k6j6r
2320@pqoLJ2J2MkkRK8L9K5nk0qJ2J2pj9j4kJ3L0L5J5k4n1n2m2m0l7k1jK0M0N9N7L3QOJ7J6
2302A37%j2j4j6j7j0MPnj4oRJ3RQJ1J4J2Qnk4l3k4lQPQJ6L1M2L6J0k8n2n0k9jK8N0N3K5j6
2284A87m1m1k7j1QK1J8LnJPNQK1K4Nj6j4LQnj4j0j3k8l6k2KJ5J9K5K9J7oj9pJ6L3L1J7lj8
2265A87k5k8l3l9l4k0rj1j2KJ8K0RJJ0K0J1qqJ6L4K3lj3n%rj3jJ8J9Ooj1j6k7l0j7KJ5J5R
2247E7KkKJ0J0mk4k7pJ9L0K6J8Qok7m3m3l4k4j8lK9O3P8O3L1Nj2k8m3l9j8NJ4J8K3K8J6ql0
2229A15l3k4j4nQJ5Qqj1kN%qjJ7L0K5Mj4k1j6pkqj7k7l1k2ML4M4L2J5J3K1J5kj5j1JPPRRP
2210A46%prpjOOmj1jJ6K5J0k1m6m8l0q%lponj3k3k6k2j4oMQRJ3K0K2J7QQJ0JroRK5J9Jj3q
$$ y = [106, 105, 90, 63, 38, 28, 28, 23, 6, -10, -17, -17, -23, -36, -50, -65, -80, -80, -52, 0, 50, 85, 111, 142, 169, 180, 175, 168, 163, 158, 153, 156, 164, 167, 165, 169, 181, 186, 167, 128, 85, 51, 25, 9, 0, -7, -15, -21, -18, -6, 6, 10, 8, 6, 15, 43, 82, 107, 102, 82, 74, 86, 98, 91, 72, 58, 56, 69, 99, 134, 149, 125, 74, 22, -20, -60, -97, -118, -119, -99, -59, 0, 57, 90, 98, 104, 121, 137, 137, 125, 111, 95, 78, 68, 72, 79, 74, 60, 54, 63, 76, 85, 93, 104, 118, 130, 138, 133, 109, 76, 52, 49, 57, 64, 72, 88, 119, 161, 197, 207, 179, 127, 77, 48, 47, 75, 125, 178, 203, 187, 146, 105, 78, 67, 75, 96, 114, 117, 112, 113, 120, 125, 133, 154, 178, 183, 167, 153, 156, 164, 159, 145, 135, 122, 94, 58, 36, 38, 53, 72, 97, 126, 143, 137, 118, 111, 127, 160, 191, 208, 205, 187, 162, 134, 101, 62, 28, 8, -1, -12, -24, -22, -4, 16, 25, 26, 36, 56, 67, 59, 51, 67, 101, 124, 121, 108, 103, 103, 94, 81, 80, 98, 117, 123, 117, 106, 90, 63, 33, 16, 18, 33, 48, 57, 59, 57, 59, 69, 79, 75, 51, 24, 17, 36, 66, 92, 110, 118, 112, 85, 42, -1, -35, -59, -77, -80, -51, 12, 90, 153, 184, 189, 177, 149, 106, 67, 49, 54, 68, 86, 109, 137, 153, 145, 115, 82, 58, 44, 39, 47, 62, 70, 62, 51, 49, 54, 54, 46, 45, 62, 92, 117, 121, 107, 86, 70, 63, 61, 53, 36, 9, -22, -44, -40, -6, 38, 70, 85, 98, 119, 134, 132, 117, 106, 107, 114, 121, 130, 139, 146, 146, 139, 130, 123, 122, 128, 134, 130, 119, 118, 134, 159, 169, 148, 102, 54, 24, 16, 16, 13, 6, 0, -5, -18, -41, -67, -89, -103, -109, -105, -97, -88, -75, -55, -33, -16, -8, 0, 10, 11, 2, -4, 5, 30, 49, 50, 37, 29]
2189B9PK4L0K7J9J6K0K8L0J5qk9l4k4j9k5l2l1j8nMPLoj1jJ8K9K0jk1k7j8mJ0J4RJrj5j3l
2171FQJ6K1K4K0%k3l4k9j5lQJ5J9K2L3M4L5Pj7j6lMlrj1j4j8j9nJ4K5J5j6m3m1j7PMj1j7l
2153b0J7K1Rj1j4NL1L8K6J5K1K4%l5l9mL9N0K6pl1l9l3k3j4qrj9l1l3j0J9L2K0LjJ0K3K6J0
2135H4j4k8k3nKpj4j1kLPJ4K7L4L1J6nj6pJ1J7Pnj1j2j4j0PJ9J2j0k4k7k4k0j3pjMJ4K0K1
2117D0J7K1L4M2L5J6%j3k4l4k8oJ8K9J7nj5mJ8L5M0K7Kl1n7n8m0j4KJ1J8J9Pj7m2m0nM0N8
2100A13L4ol1k6kK1L0J5j5l9l9k1%J1J9K3K0Oj0j9j3jONNJ2J8J1j4l8m3l2k2rPK1K0R%nrj1
2082AmNPjlJ6L5M0L0J7Mpj5j2qrj4j4nJMNPO%j3l1l9k3NL0L7L1K5J3j4m1m4k3pnmJ4L7M9L8
2062A21J2j8m3m9l3j1QJ9K6K3J0kjJ3K5K3J1Jorj0okoj7l1l4j6J2L8M7M0L6L8L6J6j4l6l5
$$ y = [29, 36, 60, 90, 117, 136, 152, 172, 200, 230, 245, 237, 208, 174, 150, 131, 106, 74, 43, 25, 20, 24, 31, 34, 28, 17, 16, 34, 63, 83, 82, 61, 34, 16, 12, 22, 36, 45, 46, 37, 22, 9, 6, 14, 30, 51, 75, 95, 95, 72, 38, 9, -6, -9, -1, 14, 33, 55, 88, 132, 167, 174, 157, 141, 138, 142, 139, 130, 119, 105, 87, 68, 63, 77, 102, 117, 101, 58, 17, 0, 7, 11, 0, -17, -20, -3, 18, 27, 16, 2, 7, 38, 76, 102, 117, 138, 162, 162, 127, 88, 84, 123, 173, 199, 192, 161, 122, 89, 66, 52, 44, 35, 16, -15, -48, -58, -39, -7, 13, 16, 15, 25, 48, 74, 84, 70, 42, 19, 14, 16, 9, -5, -16, -18, -15, -8, 6, 33, 67, 98, 114, 109, 93, 86, 97, 114, 121, 116, 105, 93, 79, 69, 76, 95, 107, 97, 73, 46, 22, 2, -11, -18, -19, -15, -1, 19, 40, 57, 78, 112, 154, 189, 205, 205, 192, 168, 134, 106, 100, 118, 147, 164, 159, 144, 140, 158, 193, 233, 260, 262, 231, 174, 116, 76, 62, 64, 75, 93, 112, 119, 102, 60, 20, 15, 55, 113, 147, 141, 110, 84, 82, 103, 133, 148, 133, 94, 55, 34, 34, 45, 64, 87, 107, 113, 103, 84, 71, 70, 76, 81, 86, 98, 116, 127, 113, 75, 32, 0, -22, -31, -24, -3, 17, 26, 26, 21, 12, 1, -3, 2, 9, 8, 5, 21, 56, 96, 126, 143, 147, 140, 125, 113, 105, 96, 82, 68, 63, 64, 68, 73, 80, 86, 86, 73, 42, 3, -20, -15, 15, 52, 83, 108, 121, 107, 66, 22, -1, -8, -13, -17, -3, 34, 83, 121, 133, 115, 72, 23, -10, -21, -13, 6, 32, 55, 65, 63, 62, 75, 100, 123, 134, 135, 129, 120, 110, 104, 102, 96, 79, 48, 14, -2, 10, 48, 95, 135, 171, 209, 245, 261, 247, 211, 176]
2045A76k3j3pKJ2J3Jj2j7j4j0nMJ2J3J1J5J9Pk3m9m9k3J0K8K8J1j0k0j2%NJkKJoj1lJ3K3K1
2027A19J9J8J2kj9k5j5KJ8K1J0j3l4m2l8k6j1OK8M2M0K0%j4k1k6k3j1OJ3%k0l4k4LK5K9J3
2010D6mj0rnKJ3J8J6J4J9K5K1NnlKkj2k3k9k6j2RK8L4L1K4J5JroOQpk2k3qOJ5J8J7Nj8l6k9
1991A00pJ0PkKJ7K4Oj9k9j7%RJ0QMnqjJ3J9Rj0k5l4l7k9qJ9L9M6M0J9rk5k2mkk2l9k4J4M2
1972G9L7J7OP%k5m8m1j6jpj9j5%PKkKQJ0J3J5J6J5J7K3K4J1mj3j7k9l9l3qRJ3J3K0L4L5K3
1954A39J1QJ4J4Lj5k7l0k4j7j3j6j8j4lOR%j1j9k4j8qNJ2J1MLJ1K2K8J9PPJ9K4Qj8k3KK7K4
1936A39LmPKk9o0n6k0J1J7J5J4J8K4K7K1Lj7j5J3M2M7L3K3K2Rk5n9o1k6J0J8lk0j8j0j5k9
1919E1l2j5OJ8J2kj7k4j1K3N0M1Nk6l0j4MK0L2L3K0Lqqnqj2j7k4k6j8JJ5Qj7l3k5jJ3J2J0
$$ y = [176, 153, 140, 133, 135, 147, 160, 161, 149, 132, 118, 108, 103, 107, 119, 132, 143, 158, 177, 184, 161, 112, 63, 40, 50, 78, 106, 117, 107, 87, 75, 75, 80, 81, 79, 81, 82, 76, 65, 62, 75, 98, 119, 138, 156, 168, 166, 147, 122, 107, 109, 127, 148, 158, 145, 111, 69, 31, 5, -6, 0, 28, 70, 110, 130, 130, 116, 95, 69, 46, 35, 41, 54, 54, 34, 0, -24, -21, 4, 33, 46, 42, 32, 23, 18, 20, 33, 51, 67, 81, 100, 125, 146, 151, 146, 143, 145, 143, 131, 108, 79, 53, 41, 50, 78, 112, 143, 167, 182, 183, 174, 168, 174, 182, 175, 153, 130, 122, 128, 143, 161, 178, 183, 165, 129, 100, 93, 103, 110, 108, 110, 127, 151, 157, 138, 109, 92, 92, 101, 111, 119, 123, 118, 110, 109, 122, 141, 150, 140, 115, 81, 44, 15, 7, 26, 65, 111, 151, 170, 161, 136, 114, 110, 108, 86, 47, 23, 37, 79, 116, 133, 139, 146, 146, 121, 73, 32, 16, 15, 8, -11, -26, -26, -19, -17, -19, -17, -9, 1, 14, 29, 45, 60, 77, 100, 124, 135, 131, 118, 101, 72, 33, 0, -8, 1, 14, 27, 47, 81, 116, 139, 150, 158, 172, 186, 189, 174, 147, 117, 93, 76, 63, 47, 29, 15, 12, 18, 27, 27, 16, -3, -27, -45, -53, -48, -36, -25, -21, -18, -7, 15, 43, 62, 69, 76, 95, 119, 127, 109, 86, 88, 115, 139, 142, 138, 145, 147, 118, 58, 2, -18, -7, 10, 25, 39, 57, 81, 108, 129, 132, 115, 100, 113, 155, 202, 235, 258, 280, 289, 264, 205, 144, 118, 128, 146, 143, 123, 105, 95, 80, 51, 19, 4, 10, 28, 40, 38, 21, -3, -14, 9, 59, 100, 105, 79, 49, 35, 39, 59, 91, 124, 144, 147, 139, 131, 126, 118, 106, 89, 65, 39, 21, 22, 37, 45, 28, -5, -30, -31, -18, -6, 4]
1902DK2L2K3kj8j4pj0j8j2NK4K6J9Onj7k2k0mJ7L1K4jk5k7j2Kkj5j9oJ7L6M2L0Rj9l8l8j3
1884EK5M7L3nl1k8j4j5l0l6j4J9L8L7L2K0Mj0qQJ7Pnpqj8l4l1qK1K9J3oqNJ3PkJJ0J0koQK6
1864A09K3Jk3k7rL4Q2J10J20J65K65L49K89O0j99l22k81j74j02p4n9m7m8m6k5MJ6QLJ2K2K2
1850B58J3%k3m8n5l2PL0K1mk1j9oJpj7j6jJ3Pj0j5%J6J3nk0k2j6oRJ9J2qj4JK3K6J6Plj9l3
$$ y = [4, 26, 58, 81, 79, 61, 47, 40, 30, 12, 0, 5, 29, 55, 74, 80, 75, 58, 36, 16, 12, 29, 60, 84, 83, 58, 31, 19, 21, 19, 4, -15, -21, -4, 32, 74, 104, 113, 94, 56, 18, 5, 30, 77, 110, 105, 74, 46, 32, 17, -13, -49, -63, -44, -6, 31, 63, 83, 87, 77, 69, 77, 94, 101, 96, 89, 81, 63, 29, -2, -10, 11, 40, 53, 47, 39, 44, 57, 64, 62, 63, 73, 83, 81, 75, 83, 109, 132, 133, 110, 83, 74, 108, 190, 300, 420, 585, 850, 1199, 1488, 1548, 1349, 1027, 746, 572, 470, 396, 337, 290, 242, 196, 171, 175, 191, 199, 202, 214, 236, 258, 271, 271, 248, 200, 145, 113, 120, 150, 171, 167, 146, 127, 121, 122, 115, 98, 82, 81, 94, 101, 91, 76, 76, 92, 105, 100, 80, 58, 42, 36, 45, 64, 76, 68, 54, 55, 78, 104, 120, 127, 124, 105, 72]
$$ [...]
-3135G6
##END=	
##END=	
