##TITLE=	Nov02-2021.60.fid
TM-VI-147

##JCAMP-DX=	6.0	$$ MestReNova 14.3.0-30573
##DATA TYPE=	LINK
##BLOCK_ID=	1
##BLOCKS=	2    
##ORIGIN=	Mestrelab Research S.L.
##OWNER=	hrzepa
##$MNOVA/LINK_BLOCK_TYPE=	ITEM	$$ NMR Spectrum
##$MNOVA/ITEM/POLYGON=	(XY..XY)
5321,5835
8722,5835
8722,8208
5321,8208
5321,5835
##$MNOVA/ITEM/Z=	0
##$MNOVA/ITEM/ANGLE=	0
##TITLE=	Nov02-2021.60.fid
##JCAMP-DX=	6.0	$$ MestReNova 14.3.0-30573
##BLOCK_ID=	2
##DATA TYPE=	MNOVA NMR VIEW DATA
##DATA CLASS=	MNOVA VIEW DATA
##$MNOVA/ITEM/ZOOM/X=	-4.0107147498308073352,	16.011019999997905927
##$MNOVA/ITEM/ZOOM/Y=	-651.91233956813812256,	7155.5333251953125
##END=	
##TITLE=	Nov02-2021.60.fid
##JCAMP-DX=	6.0	$$ MestReNova 14.3.0-30573
##BLOCK_ID=	3
##DATA TYPE=	NMR SPECTRUM
##DATA CLASS=	XYDATA
##NUMDIM=	1
##ORIGIN=	Bruker BioSpin GmbH
##OWNER=	nmr
##.OBSERVE FREQUENCY=	400.20240119999999706
##.OBSERVE NUCLEUS=	^1H
##.SOLVENT NAME=	CDCl3
##.PULSE SEQUENCE=	zg30
##LONGDATE=	2021/11/02 17:18:00.000
##.ACQUISITIONMODE=	SIMULTANEOUS (DQD)
##$ORIGINAL FORMAT=	Bruker XWIN-NMR
##$MNOVA/SCALES_VERSION=	9
##$PARAMETER FILE=	(acqus, ASCII, /private/var/folders/f6/rjf_tdyn2v98c5c0wvkgn4s80000gn/T/6ndz88F7TgKvWMjSPAUL$A/60/acqus, 0)
$$ ##TITLE= Parameter file, TOPSPIN		Version 3.2
$$ ##JCAMPDX= 5.0
$$ ##DATATYPE= Parameter Values
$$ ##NPOINTS= 11	$$ modification sequence number
$$ ##ORIGIN= Bruker BioSpin GmbH
$$ ##OWNER= nmr
$$ $$ 2021-11-02 17:18:34.640 +0000  nmr@CZC2439F63
$$ $$ /opt/topspin/data/agmb/nmr/Nov02-2021/60/acqus
$$ $$ process /opt/topspin3.2/prog/mod/shimcntl
$$ ##$ACQT0= -2.10084033613445
$$ ##$AMP= (0..31)
$$ 100 100 100 100 100 100 100 100 100 100 100 100 100 100 100 100 100 100
$$ 100 100 100 100 100 100 100 100 100 100 100 100 100 100
$$ ##$AMPCOIL= (0..19)
$$ 0 0 0 0 0 0 0 0 0 0 0 0 0 0 0 0 0 0 0 0
$$ ##$ANAVPT= -1
$$ ##$AQSEQ= 0
$$ ##$AQ_mod= 3
$$ ##$AUNM= <au_zg>
$$ ##$AUTOPOS= <33 >
$$ ##$BF1= 400.2
$$ ##$BF2= 400.2
$$ ##$BF3= 400.2
$$ ##$BF4= 400.2
$$ ##$BF5= 400.2
$$ ##$BF6= 400.2
$$ ##$BF7= 400.2
$$ ##$BF8= 400.2
$$ ##$BYTORDA= 0
$$ ##$CAGPARS= (0..11)
$$ 0 0 0 0 0 0 0 0 0 0 0 0
$$ ##$CFDGTYP= 0
$$ ##$CFRGTYP= 9
$$ ##$CHEMSTR= <none>
$$ ##$CNST= (0..63)
$$ 1 1 145 1 1 1 1 1 1 1 1 1 1 1 1 1 1 1 1 1 1 1 1 1 1 1 1 1 1 1 1 1 1 1 1
$$ 1 1 1 1 1 1 1 1 1 1 1 1 1 1 1 1 1 1 1 1 1 1 1 1 1 1 1 1 1
$$ ##$CPDPRG= (0..8)
$$ <> <> <> <> <mlev> <mlev> <mlev> <mlev> <mlev>
$$ ##$D= (0..63)
$$ 0 1 0 0 0 0 0 0 0 0.06 0 0 0 0 0 0 0.0002 0 0 0 0 0 0 0 0 0 0 0 0 0 0 0
$$ 0 0 0 0 0 0 0 0 0 0 0 0 0 0 0 0 0 0 0 0 0 0 0 0 0 0 0 0 0 0 0 0
$$ ##$DATE= 1635873513
$$ ##$DE= 6.5
$$ ##$DECBNUC= <off>
$$ ##$DECIM= 2496
$$ ##$DECNUC= <off>
$$ ##$DECSTAT= 4
$$ ##$DIGMOD= 1
$$ ##$DIGTYP= 12
$$ ##$DQDMODE= 0
$$ ##$DR= 22
$$ ##$DS= 2
$$ ##$DSPFIRM= 0
$$ ##$DSPFVS= 20
$$ ##$DTYPA= 0
$$ ##$EXP= <proton>
$$ ##$F1LIST= <111111111111111>
$$ ##$F2LIST= <222222222222222>
$$ ##$F3LIST= <333333333333333>
$$ ##$FCUCHAN= (0..9)
$$ 0 2 0 0 0 0 0 0 0 0
$$ ##$FL1= 90
$$ ##$FL2= 90
$$ ##$FL3= 90
$$ ##$FL4= 90
$$ [...]
$$ ##$Sgu3PowerLevels= (0..7)
$$ 0 0 0 0 0 0 0 0
$$ ##$Sgu4PowerLevels= (0..7)
$$ 0 0 0 0 0 0 0 0
$$ ##$Sgu5PowerLevels= (0..7)
$$ 0 0 0 0 0 0 0 0
$$ ##$Sgu6PowerLevels= (0..7)
$$ 0 0 0 0 0 0 0 0
$$ ##$Sgu7PowerLevels= (0..7)
$$ 0 0 0 0 0 0 0 0
$$ ##$Sgu8PowerLevels= (0..7)
$$ 0 0 0 0 0 0 0 0
$$ ##$SguType= 3
$$ ##$ShimPowMaxUA= (0..63)
$$ 130000 130000 130000 130000 130000 130000 130000 130000 130000 130000 130000
$$ 130000 130000 130000 130000 130000 130000 130000 130000 130000 0 0 0 0
$$ 0 0 0 0 0 0 0 0 0 0 0 0 0 0 0 0 0 0 0 0 0 0 0 0 0 0 0 0 0 0 0 0 0 0 0 0
$$ 0 0 0 0
$$ ##$ShimPowMaxUC= (0..63)
$$ 130000 130000 130000 130000 130000 130000 130000 130000 130000 130000 130000
$$ 130000 130000 130000 130000 130000 130000 130000 130000 130000 0 0 0 0
$$ 0 0 0 0 0 0 0 0 0 0 0 0 0 0 0 0 0 0 0 0 0 0 0 0 0 0 0 0 0 0 0 0 0 0 0 0
$$ 0 0 0 0
$$ ##$ShimPowMaxUG= (0..63)
$$ 524287 524287 524287 524287 524287 524287 524287 524287 524287 524287 524287
$$ 524287 524287 524287 524287 524287 524287 524287 524287 524287 0 0 0 0
$$ 0 0 0 0 0 0 0 0 0 0 0 0 0 0 0 0 0 0 0 0 0 0 0 0 0 0 0 0 0 0 0 0 0 0 0 0
$$ 0 0 0 0
$$ ##$ShimPowRcbType= 3
$$ ##$ShimPowRes= (0..63)
$$ 1e-20 1e-20 1e-20 1e-20 1e-20 1e-20 1e-20 1e-20 1e-20 1e-20 1e-20 1e-20
$$ 1e-20 1e-20 1e-20 1e-20 1e-20 1e-20 1e-20 1e-20 0 0 0 0 0 0 0 0 0 0 0 0
$$ 0 0 0 0 0 0 0 0 0 0 0 0 0 0 0 0 0 0 0 0 0 0 0 0 0 0 0 0 0 0 0 0
$$ ##$ShimPowRng0= (0..63)
$$ 1 1 1 1 1 1 1 1 1 1 1 1 1 1 1 1 1 1 1 1 0 0 0 0 0 0 0 0 0 0 0 0 0 0 0 0
$$ 0 0 0 0 0 0 0 0 0 0 0 0 0 0 0 0 0 0 0 0 0 0 0 0 0 0 0 0
$$ ##$ShimPowRng1= (0..63)
$$ 1 1 1 1 1 1 1 1 1 1 1 1 1 1 1 1 1 1 1 1 0 0 0 0 0 0 0 0 0 0 0 0 0 0 0 0
$$ 0 0 0 0 0 0 0 0 0 0 0 0 0 0 0 0 0 0 0 0 0 0 0 0 0 0 0 0
$$ ##$ShimPowRng2= (0..63)
$$ 1 1 1 1 1 1 1 1 1 1 1 1 1 1 1 1 1 1 1 1 0 0 0 0 0 0 0 0 0 0 0 0 0 0 0 0
$$ 0 0 0 0 0 0 0 0 0 0 0 0 0 0 0 0 0 0 0 0 0 0 0 0 0 0 0 0
$$ ##$ShimPowRng3= (0..63)
$$ 1 1 1 1 1 1 1 1 1 1 1 1 1 1 1 1 1 1 1 1 0 0 0 0 0 0 0 0 0 0 0 0 0 0 0 0
$$ 0 0 0 0 0 0 0 0 0 0 0 0 0 0 0 0 0 0 0 0 0 0 0 0 0 0 0 0
$$ ##$ShimSysFunc= (0..63)
$$ 1 2 3 4 5 7 9 11 15 16 8 10 12 14 6 17 13 18 19 20 0 0 0 0 0 0 0 0 0 0
$$ 0 0 0 0 0 0 0 0 0 0 0 0 0 0 0 0 0 0 0 0 0 0 0 0 0 0 0 0 0 0 0 0 0 0
$$ ##$ShimSysMatrix= 0
$$ ##$ShimSysType= 1
$$ ##$TFXNUM= 0
$$ ##$TRIPLO2= 0
$$ ##$VTU= 2
$$ ##$VTUETH= <149.236.99.20>
$$ ##$VTUTY= <no>
$$ ##$WBREFAM= (0..15)
$$ 135.5 97.7 100 100 100 100 100 100 100 100 100 100 100 100 100 100
$$ ##$WBREFLM= (0..15)
$$ 0 0 0 0 0 0 0 0 0 0 0 0 0 0 0 0
$$ ##$WBREFPH= (0..15)
$$ 72.26 -67.22 0 0 0 0 0 0 0 0 0 0 0 0 0 0
$$ ##$WBSGU= (0..15)
$$ 0 0 0 0 0 0 0 0 0 0 0 0 0 0 0 0
$$ ##$XFAC= 2
$$ ##END=
$$ 
##$DECIM=	2496
##$DSPFVS=	20
##XUNITS=	HZ
##YUNITS=	ARBITRARY UNITS
##FIRSTX=	6407.6102040000005218
##LASTX=	-1605.0880428824991668
##DELTAX=	-0.12226593800080109986
##XFACTOR=	1
##YFACTOR=	0.020005266893400618089
##FIRSTY=	6.3772435188293457031
##MINY=	-1.4092878103256225586
##MAXY=	6505.0302734375
##NPOINTS=	65536
##XYDATA=	(X++(Y..Y))
$$ [...]
2759 513 535 552 565 577 584 583 581 578 562 535 527 555 595 610 605 604 604 579 531 501 514 547 566 577 602 640 652 618 559 519 510 512 508 507 524 554 571 569 572 598 639 664
2754 664 651 604 550 514 508 525 552 577 590 577 538 496 472 468 470 484 513 541 536 506 491 502 506 478 442 431 434 423 403 399 414 432 450 474 494 492 460 410 363
2749 363 342 363 406 426 407 382 376 369 339 318 343 386 395 380 390 429 450 445 453 478 482 456 447 478 504 493 475 482 490 465 426 405 399 392 393 400 378 310 250 256 306 336
2744 336 336 341 358 361 348 353 382 407 419 432 439 418 382 372 386 377 334 305 315 320 277 220 214 265 322 347 344 335 337 350 364 363 351 353 375 389 372 342 333 348 359 355
2739 355 345 331 300 261 246 276 323 339 308 267 264 306 356 367 331 278 245 249 277 299 300 298 324 374 405 396 382 400 436 442 420 420 460 490 461 392 342 337 360
2734 360 395 428 440 419 390 397 445 491 498 467 424 392 385 414 470 513 504 442 376 359 398 450 468 440 400 383 397 413 402 363 331 339 380 415 419 407 401 393 355
2729 355 300 273 298 344 366 352 322 298 282 272 270 282 316 364 401 402 374 356 377 421 449 440 409 383 375 378 375 357 338 338 354 367 359 330 293 270 285 333 375
2724 375 374 346 337 356 368 356 357 398 448 452 402 337 289 265 263 279 302 328 363 405 435 441 448 463 453 399 342 331 339 305 240 228 294 365 376 356 364 395 400 367
2720 367 328 304 290 280 279 280 279 289 324 360 362 334 319 341 374 379 357 339 344 357 356 342 334 345 355 339 307 287 296 318 342 376 418 445 444 440 454 461 420 342 284
2715 284 275 291 301 310 339 380 408 409 399 398 411 426 421 385 332 290 282 305 345 378 386 362 326 306 314 338 360 370 359 329 302 307 342 367 349 305 272 257 241
2710 241 228 253 324 396 417 391 374 403 463 509 518 496 457 411 372 355 358 364 353 334 325 325 306 261 231 268 351 392 340 249 218 264 320 334 331 348 364 334
2705 334 270 235 259 307 337 352 375 404 417 402 368 332 310 310 333 363 380 381 374 371 374 385 400 415 420 406 373 333 303 294 303 322 345 364 369 356 342 351 376 386
2700 386 358 312 287 296 321 332 324 316 319 328 332 340 370 413 431 403 360 339 337 321 288 270 282 307 332 356 370 360 344 362 420 462 449 408 386 384 376 369 390 424
2695 424 424 377 329 318 326 313 274 245 252 281 295 271 238 246 304 363 382 381 394 403 370 309 284 318 360 368 366 389 418 414 387 378 396 416 421 420 415 403 395 411 430 404
2690 404 329 266 272 329 368 360 340 342 357 352 320 283 256 237 220 211 218 244 292 366 453 514 514 463 408 376 356 323 287 272 285 297 282 239 199 187 209 246
2686 246 287 329 377 419 434 407 350 286 238 217 221 236 245 241 230 230 248 279 305 317 324 339 363 388 417 458 493 479 406 330 314 346 360 325 280 271 300 344
2681 344 391 424 409 339 271 266 322 372 375 356 361 393 412 394 362 350 356 348 318 300 330 392 437 446 440 436 425 399 367 340 313 287 279 295 318 330 336 344 352 367 399
2676 399 427 415 366 331 335 345 334 329 357 386 375 338 313 296 268 255 287 330 330 305 316 359 364 325 324 403 485 494 448 414 407 407 413 432 435 395 337 303 293 290
2671 290 301 340 379 370 315 259 233 244 288 346 376 356 328 339 377 391 377 373 389 393 374 366 382 391 366 329 311 321 345 358 339 286 241 249 297 326 308 271
2666 271 245 229 229 273 349 396 377 330 310 319 326 332 358 399 421 419 418 425 418 392 374 378 387 373 338 305 289 284 278 271 273 294 324 336 320 293 275 269 274 299 337 354 324
2661 324 278 269 299 315 285 250 257 294 312 301 291 297 290 255 237 282 365 409 382 335 321 325 302 253 225 243 284 316 328 325 308 291 291 305 312 309 311 313 281 219
2656 219 188 231 294 306 273 263 280 263 191 140 168 232 256 243 259 314 345 313 257 236 255 282 304 331 365 390 398 390 367 332 306 307 333 358 367 361 349
2652 349 345 373 433 481 461 378 310 309 337 319 256 212 221 249 254 246 252 270 282 284 284 285 292 319 368 408 406 364 308 258 226 225 256 297 321 321 302 266 223 207 241
2647 241 298 331 331 324 323 315 301 306 328 340 338 355 409 463 469 425 377 367 398 441 458 435 391 358 345 341 344 365 395 403 377 341 320 312 308 320 351 381 383 363 343
2642 343 338 341 343 333 296 244 217 246 319 391 431 436 414 378 342 311 282 259 266 307 344 341 316 318 351 369 348 314 299 296 279 259 277 350 439 490 484 451 426
2637 426 410 380 342 331 360 395 395 367 349 358 386 424 466 495 492 466 441 425 406 380 352 330 313 308 319 328 320 310 320 331 304 242 205 236 309 368 385 370
2632 370 343 320 310 307 296 282 292 332 368 364 322 274 243 241 267 310 339 336 311 283 267 276 316 370 405 407 400 399 391 369 366 407 455 452 395 336 308 292 262 221
2627 221 187 170 178 210 255 292 315 334 356 378 399 415 407 373 340 349 400 456 481 471 434 388 358 361 373 356 318 311 351 388 375 339 343 391 422 394 337 309
2623 309 327 360 377 383 400 435 471 492 484 439 365 309 328 417 494 485 418 370 369 369 340 314 327 361 383 392 398 400 398 411 439 449 420 382 378 394 381 340 315 325
2618 325 344 353 371 411 440 423 378 354 373 398 378 303 221 196 244 312 337 304 257 240 260 297 332 359 378 388 388 389 409 450 476 442 359 298 311 359
2613 359 366 321 273 256 249 234 218 214 214 224 266 329 370 368 360 368 366 333 304 316 336 316 282 296 348 357 290 213 199 241 288 315 327 317 277 232 218 246 290
2609 290 323 335 334 334 347 367 376 374 386 417 432 400 347 320 322 309 268 238 261 323 372 381 360 338 322 298 259 221 218 250 277 262 224 220 271 336 367 362 352
2604 352 356 368 368 343 300 268 268 290 301 289 281 298 324 333 331 346 382 407 395 354 324 331 360 369 335 294 306 380 447 445 385 328 312 330 378 452 513 494 390
2599 390 284 258 299 339 342 337 357 392 417 425 423 410 377 326 278 264 301 369 415 396 328 275 282 331 377 402 428 465 484 458 412 398 431 466 449 381 310
2595 310 278 288 311 318 304 291 308 361 421 458 461 435 394 358 356 390 418 402 361 345 362 369 341 309 303 315 323 330 338 327 294 276 303 339 334 300 287 296 287 251
2590 251 235 269 324 356 354 330 295 280 317 396 456 457 422 394 384 387 412 456 473 424 341 293 294 302 283 257 249 251 254 266 291 315 331 355 400 440 438 394 347
2585 347 332 349 374 388 384 366 344 329 328 345 373 396 405 404 401 396 385 368 353 337 313 289 291 333 386 402 366 314 287 295 316 329 336 350 376 398 400 381 361 359
2580 359 376 395 403 403 404 407 400 384 383 420 485 533 526 466 388 328 298 293 301 313 328 341 338 309 267 247 272 321 355 369 384 398 381 328 285 302 367 426 437 407
2575 407 363 324 301 292 282 258 229 226 262 321 384 435 453 423 357 301 280 274 263 260 286 326 349 362 398 449 465 422 359 326 337 371 402 407 373 324 308
2571 308 345 405 444 448 420 365 311 312 384 460 464 401 343 326 322 311 317 351 373 339 268 220 223 256 283 284 268 257 269 292 301 280 247 225 225 238 253 253 232 213
2566 213 225 271 315 336 340 343 340 330 325 321 299 261 241 262 298 320 334 358 383 383 363 343 329 315 312 331 351 342 311 292 294 300 298 294 291 289 305 350 398 413 404 405 417
2561 417 407 370 342 340 347 353 361 360 337 316 332 366 360 310 280 297 318 311 317 362 399 385 355 367 397 391 361 363 391 392 359 338 346 353 346 341 326 279 231 248 329 387
2555 387 373 327 306 304 303 321 364 382 341 289 296 358 404 401 372 349 339 348 377 400 385 343 312 308 316 331 363 397 393 346 303 305 341 370 374 362 354 362 390 426 447
2550 447 447 429 392 334 284 292 363 426 415 346 293 300 345 386 408 406 375 333 319 351 400 415 381 328 289 277 288 320 366 405 414 389 351 336 360 400 421
2546 421 415 400 389 375 361 369 404 430 412 365 337 335 323 289 271 296 327 321 291 288 323 361 392 438 501 531 494 422 379 377 381 360 314 263 225 223 260 305 324
2541 324 322 334 366 387 381 373 380 376 346 324 348 389 382 321 263 240 220 179 165 226 337 426 471 500 515 487 418 363 357 373 369 347 336 351 386 434 485 519
2536 519 521 492 438 366 304 293 342 403 418 387 356 359 388 412 410 385 363 375 418 445 426 379 344 327 315 310 330 352 335 279 245 275 342 385 376 335 294
2532 294 267 250 237 238 268 326 376 388 377 386 420 434 392 318 261 246 257 275 287 287 284 297 329 351 338 297 258 237 225 217 221 249 290 318 321 316 332 367 385
2527 385 358 305 270 262 255 240 244 282 328 348 342 331 332 355 407 469 497 460 375 287 225 202 226 286 340 353 338 333 349 357 333 295 282 313 365 399 395 375 368
2522 368 366 342 304 307 372 442 455 420 403 428 464 480 474 447 405 369 364 379 370 326 281 261 250 225 206 226 282 337 366 375 384 400 417 425 422 412 391 351 295
2518 295 250 240 270 325 386 434 446 421 387 372 368 356 338 322 298 262 245 276 320 315 271 264 327 400 417 391 371 360 326 266 214 202 230 272 286 241
2513 241 160 116 146 212 252 265 287 320 329 297 247 206 190 216 281 352 386 379 363 352 330 298 286 310 348 371 378 382 385 378 363 350 343 334 320 312 328 371 412
2508 412 419 395 372 369 372 364 359 373 396 406 402 391 377 371 399 457 492 453 369 318 327 356 366 367 376 373 343 306 293 310 348 398 441 441 388 322 298 327 371 386 361
2503 361 313 271 258 278 310 335 350 354 337 297 268 302 402 499 525 493 469 476 459 377 276 245 297 352 357 344 358 384 379 347 330 343 361 370 371 362 350
2499 350 364 414 452 422 348 306 321 346 350 358 390 417 412 392 375 355 336 341 360 342 283 252 294 355 370 366 403 466 480 440 410 416 414 373 329 318 331 350
2494 350 388 445 485 481 448 424 415 407 392 364 317 271 269 323 387 406 382 360 361 357 327 289 277 286 282 248 213 213 247 286 319 358 399 403 352 286 266 293 318 311
2489 311 299 314 340 333 280 213 182 202 247 277 281 283 304 328 327 310 311 343 386 421 446 456 439 395 352 332 335 345 348 335 308 293 309 339 347 327 304 295 292 293
2484 293 307 329 337 323 307 302 298 297 314 340 340 307 286 306 338 346 341 354 370 356 319 297 297 300 304 334 391 442 463 457 436 408 383 371 371 376 394 419 419 373 320 315
2479 315 350 365 336 301 290 287 275 279 316 349 336 282 227 198 201 236 296 352 384 401 419 426 408 374 342 321 313 320 321 284 213 169 193 247 271 267 285 333 375
2475 375 391 405 422 410 354 294 274 296 341 397 446 460 431 397 403 448 485 467 391 297 244 252 281 279 253 257 307 348 334 291 266 260 241 209 193 201 219 243
2470 243 275 302 309 314 344 383 384 340 296 286 293 296 298 304 304 306 330 373 393 371 349 369 406 408 370 337 336 351 354 336 304 270 255 273 315 356 380 387 380 360 326 276
2465 276 218 187 223 315 391 398 363 349 369 378 343 281 229 213 243 307 358 361 338 339 368 383 368 356 370 388 393 399 414 409 366 318 306 326 344 353 368 386 390
2460 390 384 386 397 403 403 407 412 410 406 410 416 411 389 362 344 351 389 433 433 377 319 312 338 337 303 289 326 374 389 379 375 376 355 313 287 310 380 457 493 467 401 345 332
2455 332 363 409 430 406 360 346 387 435 437 402 380 387 388 359 318 291 287 316 383 453 468 417 354 322 308 299 319 377 422 405 352 320 319 317 314 339 381 392 362
2450 362 340 354 375 366 338 331 353 376 377 364 363 392 439 457 418 343 291 290 320 343 353 361 369 361 328 287 264 276 305 320 310 294 295 318 358 411 464 486 460
2445 460 409 369 355 358 374 397 406 388 369 386 430 467 487 502 500 453 374 325 333 358 359 346 348 362 373 384 396 393 369 344 330 305 263 246 290 357 375 338
2441 338 310 333 378 400 388 362 349 369 415 443 415 355 332 364 392 366 320 326 388 442 441 404 376 374 385 396 403 395 366 347 389 491 563 518 390 305
2436 305 319 352 318 261 283 380 441 404 334 306 307 287 251 243 263 278 287 316 359 377 361 350 369 394 398 392 399 411 401 367 324 284 254 249 273 294 267 202
2432 202 165 197 255 274 260 272 326 376 390 396 413 409 360 307 304 332 329 289 253 237 217 207 259 364 431 405 346 336 358 338 271 226 243 289 326 355
2427 355 387 413 416 394 352 299 257 239 240 257 307 396 471 469 401 349 360 386 369 322 301 328 375 408 412 383 337 302 299 316 328 331 332 332 330 336 359 377 362 327
2422 327 317 348 385 383 345 311 303 306 287 242 196 180 199 238 283 328 361 367 346 314 300 323 375 420 418 367 317 316 356 388 390 379 375 369 356 360 397 443 454 419
2417 419 360 306 272 260 264 273 281 294 318 342 344 320 288 272 279 298 303 293 292 323 368 392 392 397 408 390 334 287 283 295 282 257 256 279 301 319 339 335 291 259 303
2412 303 394 435 396 350 361 399 413 419 450 486 477 427 396 419 473 519 527 494 447 431 455 475 442 368 306 287 300 330 368 396 397 390 407 446 468 452 417
2408 417 391 379 384 406 433 440 422 406 414 437 449 439 413 376 337 313 313 331 357 397 447 484 483 448 407 377 357 354 383 436 474 467 435 416 417 410 382 353 347 357
2403 357 371 398 447 489 486 443 408 407 422 424 416 414 418 418 420 435 462 485 481 439 377 332 329 347 346 325 319 335 334 300 282 322 386 412 399 398 427 449 441 419 402 383
2398 383 359 350 373 415 447 452 425 386 365 379 411 427 426 423 412 366 292 238 240 280 322 352 369 367 354 354 369 372 350 324 318 328 344 369 400 405 371 329 317 331
2393 331 330 301 270 267 291 314 313 290 284 320 373 390 364 347 374 404 389 341 306 291 269 242 249 302 361 388 387 385 385 371 327 271 243 267 320 350 347 347 373 396
2388 396 390 379 387 384 331 255 224 252 290 308 323 344 347 320 293 290 300 310 324 342 356 369 390 401 377 339 326 327 291 229 222 301 390 408 382 375 379 356 328
2383 328 347 395 405 370 364 430 528 596 608 563 475 393 365 382 391 379 383 411 415 376 352 392 455 471 439 414 421 434 435 433 428 407 378 367 380 391 387 380 380 377 367
2378 367 367 382 399 403 397 382 349 313 311 350 381 357 303 284 318 360 368 351 342 348 351 336 303 268 263 306 369 396 362 301 267 281 332 396 444 444 401 361 357 371
2373 371 366 350 352 364 357 335 326 327 313 297 324 389 434 430 419 436 447 418 384 389 419 428 421 431 451 443 409 387 381 355 302 268 279 312 337 353 362 357 344 351 389 435
2368 435 469 495 510 495 449 409 402 408 389 349 314 295 283 282 307 356 398 407 392 380 388 403 397 359 313 283 270 275 311 373 411 381 310 273 294 331 365 428
2364 428 518 563 511 414 361 358 344 301 268 271 284 284 281 295 320 340 345 340 341 359 375 354 297 260 289 351 384 379 372 378 373 350 333 330 323 312 319 346 365 364 369 391 407
2358 407 402 394 401 415 424 433 439 430 418 426 449 448 423 421 461 483 439 356 293 264 253 262 295 332 351 374 417 439 398 335 326 369 386 347 305 307 335 359 388 428 450
2353 450 438 430 460 499 495 452 421 431 465 490 491 467 428 395 386 405 442 479 486 444 380 351 377 408 397 365 362 389 402 385 366 362 355 343 361 427 496 510 471
2349 471 426 392 341 263 202 199 235 256 244 236 266 321 362 375 378 387 397 404 415 437 464 474 454 417 396 413 452 466 428 365 325 326 347 367 383 398 409 415
2344 415 415 392 344 300 301 335 343 297 247 249 286 301 281 267 287 321 346 357 353 336 321 336 373 394 384 377 404 445 457 428 391 370 364 363 365 373 386 392 382 365
2339 365 369 405 443 439 394 356 360 379 374 351 353 398 457 479 444 375 326 335 380 395 349 286 263 277 287 289 327 417 510 544 507 438 381 363 386 431 472 489
2334 489 475 428 366 326 329 357 388 430 489 515 447 321 259 317 405 415 363 339 360 369 352 366 438 515 538 516 486 467 460 472 490 472 407 344 332 361
2330 361 390 407 422 425 403 379 386 417 430 414 394 378 351 315 301 325 361 379 376 353 301 229 183 201 259 298 290 259 237 236 249 268 287 302 307 302 295 295 307
2325 307 322 328 320 309 306 307 312 326 347 363 371 380 396 407 404 396 392 389 383 388 414 435 426 399 387 386 364 326 313 336 355 343 328 331 322 278 241 272 344 363 296 217 198
2320 198 223 228 203 189 210 251 296 333 346 313 254 218 224 237 224 204 223 280 324 325 315 343 404 447 440 408 398 418 436 427 408 403 408 402 381 356 335 309 290
2315 290 305 359 417 449 468 505 545 539 475 405 377 377 369 357 365 392 410 417 436 459 444 378 308 276 273 275 293 340 377 359 309 297 341 385 399 420 479 533
2310 533 527 470 421 400 381 351 336 355 396 440 479 501 490 453 418 397 370 326 278 247 245 278 342 404 410 357 307 318 363 376 346 329 367 433 474 470 441
2306 441 417 409 409 400 378 363 380 426 471 482 457 414 382 382 404 408 370 316 297 323 360 391 436 501 540 512 447 412 433 479 507 505 478 441 422 433 446 416
2301 416 355 322 347 389 399 386 392 420 433 411 383 374 378 372 357 349 351 356 364 379 394 388 362 336 322 310 282 241 213 215 251 308 359 370 332 276 252 270 301 322
2296 322 342 365 366 332 296 301 331 343 340 373 444 486 448 376 349 377 398 375 339 337 374 424 461 473 461 445 446 455 438 386 336 325 352 385 401 387 349 312
2292 312 311 347 380 385 381 403 443 465 449 405 347 288 253 263 303 331 329 318 320 327 321 304 291 294 320 365 405 414 400 400 436 480 495 477 442 401 359 337 360 412
2287 412 451 447 415 387 381 389 398 417 463 532 580 569 516 479 482 492 468 412 350 296 262 267 301 317 295 281 314 351 331 285 295 363 394 352 309 327 357 332
2282 332 288 304 378 434 434 415 407 406 407 421 444 460 474 498 519 506 473 466 497 532 541 527 501 473 463 486 505 472 409 388 423 451 432 413 439 482 482 442
2278 442 403 384 376 377 375 339 268 221 240 274 252 199 201 277 351 377 391 433 474 474 437 391 342 298 284 309 346 373 411 472 523 522 489 490 542 592 581 515
2273 515 454 449 503 572 612 610 587 563 544 530 521 504 469 428 410 420 434 428 413 402 385 355 336 357 408 444 439 405 374 366 377 383 363 328 312 334 368 374 347
2268 347 319 310 320 339 354 356 343 340 365 404 420 389 325 258 218 217 240 259 275 310 364 398 385 363 383 429 449 445 473 544 587 544 452 384 360 350 338
2264 338 339 359 379 386 383 371 353 345 366 401 410 375 324 295 294 302 311 335 375 400 376 313 261 260 301 350 385 397 374 320 272 268 299 322 317 299 277 248 233 269
2259 269 341 381 364 339 356 382 369 333 322 330 317 304 350 440 478 424 354 352 401 429 415 402 415 426 411 370 315 253 199 181 209 256 287 289 270 254
2254 254 256 284 331 376 394 379 356 358 388 410 391 348 321 319 313 300 312 361 397 378 332 328 376 417 413 395 411 453 474 451 405 369 360 379 410 428 419 396 391
2250 391 411 424 405 357 307 268 238 219 226 258 295 317 324 321 306 287 293 347 442 529 564 536 466 393 339 308 286 269 270 292 321 335 336 348 380 423 456 460
2245 460 428 376 335 326 335 338 329 315 300 289 301 342 388 404 388 368 348 321 305 324 363 372 341 320 341 378 391 387 385 375 341 306 301 318 331 337 336 307 253 226
2240 226 268 337 356 329 335 403 474 493 479 464 441 385 325 308 343 392 423 436 450 472 492 496 490 493 509 512 479 435 428 463 497 498 474 434 374 315 305 352
2235 352 408 430 437 460 471 431 368 353 404 459 458 408 355 326 313 289 245 201 193 230 279 301 307 332 380 417 426 432 459 493 502 471 417 368 344 350 373 399 415
2231 415 416 397 362 332 330 354 376 374 350 327 320 331 350 364 367 360 342 309 273 262 288 328 344 330 317 335 377 415 435 437 429 409 382 363 363 376 380 362 342 341
2226 341 350 341 322 331 384 444 467 456 436 417 395 387 411 447 452 421 396 397 393 358 313 296 316 351 385 411 419 404 374 343 321 313 326 359 400 439 475 503 511 499
2221 499 487 489 498 497 476 437 392 370 395 451 488 481 464 479 514 515 454 371 327 344 389 407 378 332 316 343 382 413 448 489 505 465 389 329 309 319 344
2216 344 374 392 385 366 364 381 383 361 343 352 370 368 348 338 347 355 339 308 285 285 298 314 334 363 383 369 327 302 323 362 366 332 315 357 427 469 468 455 450 440
2211 440 409 369 351 362 377 361 315 280 303 375 441 463 466 505 585 640 603 492 391 366 404 453 487 516 553 584 583 541 471 396 354 375 450 521 530
2207 530 475 405 365 351 332 295 264 273 319 359 357 321 300 319 349 346 303 257 241 251 263 266 267 275 290 304 318 338 371 404 418 415 415 418 404 365 327 310 303 284
2202 284 266 278 323 370 401 420 428 413 384 364 368 390 428 483 529 522 464 413 417 456 479 462 423 382 358 365 401 437 449 450 452 429 363 296 300 377 445 437 382
2198 382 351 361 374 369 365 369 359 320 290 311 368 396 371 336 345 387 412 394 355 323 310 322 362 415 452 459 451 430 383 329 329 416 533 579 526 439 394 404
2193 404 430 436 409 366 329 313 304 282 246 228 248 298 345 362 355 349 367 408 441 443 424 419 441 469 474 446 400 366 356 362 354 324 289 276 287 312 355 411 448
2188 448 447 433 451 495 511 480 445 442 456 457 449 441 415 358 301 290 314 332 335 355 401 437 433 411 404 416 422 416 413 427 454 487 521 551 560 533 479 433 423 440 450
2183 450 436 416 416 436 457 465 452 422 389 371 370 371 373 399 454 498 492 453 419 393 346 291 281 324 368 374 371 398 429 417 369 340 346 354 341 338 374 434 476 478 441
2178 441 374 289 219 205 250 311 340 324 288 262 256 271 301 336 359 365 368 377 380 361 339 343 370 379 351 326 348 414 477 501 484 442 402 395 428 467 474 453 441
2173 441 447 434 387 342 341 373 390 360 298 235 194 195 244 332 426 487 497 467 435 434 459 481 482 467 452 443 446 466 493 508 509 515 535 547 526 479 436 414 407 411
2168 411 420 418 386 337 310 325 358 371 352 330 342 392 435 421 354 295 290 334 387 426 436 406 354 335 382 452 467 426 397 422 464 478 458 418 365 323
2164 323 333 387 418 392 361 386 435 432 379 345 365 406 434 457 483 491 473 451 442 434 414 391 374 359 345 349 379 424 467 497 494 442 371 340 367 408 417 402
2159 402 404 441 498 541 533 453 335 257 265 324 364 358 323 283 253 242 248 248 233 227 250 279 287 286 307 350 389 412 425 413 368 326 340 398 436 424 406 421 439
2155 439 417 365 332 326 319 292 263 253 261 273 284 305 345 397 435 437 406 366 343 349 382 420 423 377 317 299 334 384 420 450 477 473 428 382 380 406 413 388 350
2150 350 311 269 243 271 346 408 416 395 391 410 420 410 401 411 426 430 424 417 406 380 350 349 387 434 453 440 424 419 421 425 439 471 504 511 472 384 279 217 251 355
2145 355 436 432 386 375 411 439 430 412 415 421 401 358 320 295 282 291 330 377 399 392 377 365 350 340 365 429 484 484 440 408 410 417 398 371 375 402 403 360 313 311 355
2140 355 392 389 360 349 377 428 467 472 449 418 392 375 378 405 432 430 403 395 431 472 474 445 426 426 415 387 371 385 397 379 351 351 379 400 396 389 407 447 483 494
2135 494 491 499 520 522 491 463 485 536 547 497 448 453 481 477 449 440 439 392 301 239 249 293 327 365 432 490 491 452 432 441 429 376 339 370 439 467 430 379 369
2130 369 393 407 392 372 373 390 397 388 379 382 385 370 346 338 361 399 427 430 423 427 446 451 422 375 356 384 424 429 395 361 353 370 399 432 448 434 405 396 402 378 310 256
2125 256 276 349 408 427 442 467 471 444 432 472 526 519 439 346 299 302 329 361 390 402 390 358 325 312 331 370 410 438 465 491 495 463 421 408 422 421 381
2121 381 340 335 358 377 391 421 467 497 494 474 452 429 402 375 349 323 313 340 393 422 396 349 336 364 386 375 347 327 308 276 244 240 270 308 330 328 318
2116 318 329 376 432 446 408 365 362 385 391 384 400 444 470 459 446 460 476 458 418 395 394 393 394 414 447 459 441 412 386 354 321 311 334 366 382 383 385 395 415
2111 415 440 446 411 354 330 361 406 426 437 471 499 471 402 378 439 523 547 509 468 450 424 373 338 364 423 444 402 356 373 446 504 496 430 359 329 352
2107 352 405 446 456 462 488 511 488 424 374 366 358 307 242 232 289 362 404 410 399 382 357 328 313 332 390 450 457 399 331 321 370 426 447 435 408 384 376 387
2102 387 395 377 352 355 388 413 412 409 425 448 458 454 439 411 382 376 391 401 395 392 404 413 404 394 395 381 341 307 312 328 311 275 275 322 362 353 319 311 345 394 424 423 410
2097 410 414 437 449 427 398 407 449 483 488 477 467 458 454 464 480 484 481 491 507 494 449 408 391 371 328 292 299 339 377 403 429 448 452 450 453 446 406 353 333 363 410
2092 410 438 434 405 363 324 306 308 317 324 332 349 381 424 459 452 403 355 343 350 337 315 326 379 432 449 436 413 384 363 373 416 455 460 437 407 375 344 329 333
2087 333 332 306 280 293 348 407 435 426 403 384 366 331 287 271 308 354 351 311 307 354 378 324 254 249 294 314 301 313 357 377 356 349 386 422 404 346 289 247
2083 247 226 246 309 374 402 410 433 470 489 474 432 376 325 300 302 306 307 330 380 418 413 390 381 368 328 294 310 358 379 356 324 307 302 323 386 451 453 390 331
2078 331 323 341 350 352 357 360 370 407 457 474 446 413 403 395 375 372 393 385 316 244 248 317 381 416 448 477 475 444 432 449 454 429 417 453 502 503 461 438 472 532 562
2073 562 547 518 507 511 506 488 478 482 483 468 454 457 474 487 482 451 392 329 311 353 411 442 453 473 497 494 470 454 451 434 396 358 333 319 323 354 389 397 390 407
2068 407 444 459 442 428 432 426 397 380 398 421 415 398 399 407 387 339 297 292 334 416 496 519 476 421 408 424 429 416 399 370 317 265 257 290 331 375 438 498 502
2063 502 440 364 324 320 330 346 362 366 364 381 421 455 463 461 472 484 474 450 437 440 446 450 470 503 525 521 504 496 492 480 467 467 461 408 310 238 255 332 380 366 335
2058 335 328 323 297 279 301 337 343 334 348 373 362 320 304 335 376 399 420 440 426 370 325 337 382 407 408 415 438 459 467 460 420 342 266 250 300 361 382 364 346
2053 346 354 387 430 460 459 424 375 345 351 379 397 388 372 369 373 360 333 324 342 357 354 358 391 428 431 398 360 335 319 315 329 348 358 362 378 396 393 368 351 354 358 347
2048 347 332 340 381 430 444 397 321 293 348 431 454 404 348 338 364 402 450 493 483 408 327 302 317 311 278 272 320 374 380 345 323 343 389 431 458 482 519
2044 519 563 580 542 464 398 383 402 416 413 412 419 417 406 409 436 458 446 419 421 448 453 420 395 416 456 465 444 430 436 432 411 393 389 379 353 339 357 388 399 388
2039 388 375 364 346 332 331 337 339 343 354 357 341 338 387 460 486 442 394 399 427 418 380 381 436 474 440 371 333 333 331 321 341 398 443 439 418 426 449 437 386 344 340 352
2034 352 360 381 419 432 385 322 312 361 403 400 384 399 432 453 460 460 438 385 341 357 422 473 477 462 457 447 419 400 415 444 443 406 366 347 346 366 406 440 440
2029 440 417 407 416 417 406 412 437 447 423 395 388 379 353 340 377 433 455 437 420 416 417 429 460 474 430 364 359 424 474 455 415 407 409 381 354 381 448 492 493 484 480
2024 480 472 470 494 516 489 422 387 417 469 499 515 534 532 493 456 469 522 559 549 506 460 429 422 427 419 397 401 449 498 486 426 381 383 397 397 404 429 439 408 381
2019 381 418 507 573 581 561 541 502 432 372 363 380 361 303 268 291 333 345 345 377 431 452 411 337 278 256 273 326 393 433 430 409 396 378 333 271 235 244
2014 244 271 284 282 290 321 371 422 458 465 445 410 377 355 342 340 356 393 437 465 463 429 371 306 269 285 346 399 406 379 358 354 342 309 272 255 260 281 322 375
2010 375 415 412 376 341 334 349 366 370 355 338 349 400 460 485 464 427 396 371 349 335 336 339 340 352 388 440 483 507 515 510 484 437 385 349 341 360 398 439 459
2005 459 444 409 389 404 435 449 439 418 396 367 340 339 368 390 374 346 347 377 400 407 420 442 442 413 386 385 393 400 420 445 423 338 268 293 371 398 353 320
2000 320 352 402 419 420 439 457 445 425 429 440 422 400 421 470 481 432 376 355 353 345 339 343 341 331 333 354 363 339 311 312 327 319 287 272 295 342 381 393 384 377 402
1995 402 460 516 536 520 492 461 423 390 388 418 455 471 457 427 403 414 458 494 480 433 407 423 448 447 421 389 360 350 378 440 490 491 457 427 418 422 437
1991 437 464 486 479 441 398 371 366 382 419 461 491 504 513 518 506 464 406 355 330 327 325 310 296 311 354 385 378 356 363 397 416 406 398 419 455 476 475 458 435 413
1986 413 403 402 393 378 381 401 402 364 320 314 335 344 343 373 438 486 476 430 394 378 367 359 356 349 337 343 388 450 489 506 533 564 549 468 379 354 386 406 379 327
1981 327 288 268 263 276 291 276 238 234 300 388 415 369 329 350 398 408 379 366 396 435 442 420 393 368 344 332 357 421 487 514 492 448 417 405 397 380 357
1976 357 336 317 308 325 375 429 448 423 389 373 371 369 366 365 351 317 291 308 367 434 486 528 558 553 505 441 397 385 397 418 433 429 414 415 440 461 454 425 398
1972 398 378 362 359 376 390 376 353 362 403 429 413 377 356 356 361 359 345 320 298 300 315 316 297 288 298 296 264 238 263 336 415 468 479 441 373 322 305 290 255
1967 255 243 293 362 371 328 323 387 457 467 442 433 446 455 451 439 416 389 381 396 405 398 410 463 513 513 486 486 514 522 498 481 491 501 486 461 446 440 435 432 436 443 446 446 442
1962 442 431 419 409 394 367 348 363 401 423 421 431 469 504 504 483 475 473 443 381 328 319 341 360 360 350 337 324 313 318 353 410 466 496 489 454 408 367 335 315
1957 315 302 289 265 225 185 180 222 283 317 317 308 313 323 331 339 343 322 283 270 307 356 366 339 320 331 355 383 424 478 523 538 527 501 474 464 481 501 489
1952 489 440 385 356 359 390 430 453 458 478 530 566 529 448 405 429 463 468 468 481 470 415 364 371 415 440 431 411 396 392 417 460 471 418 350 337 378 408 394
1947 394 358 326 306 311 345 384 403 426 481 537 529 455 381 353 350 342 338 354 382 411 441 462 463 464 500 554 558 482 377 314 317 374 457 524 530 479 431 428 448 458
1943 458 465 473 464 432 412 420 418 379 337 338 362 359 332 324 336 346 365 416 471 462 392 342 362 407 413 388 378 400 432 456 468 468 456 442 426 397 347 290 253 260 315
1938 315 397 476 526 542 522 467 396 346 335 338 328 322 353 411 446 442 434 458 502 531 527 492 439 390 366 364 365 369 385 406 406 389 387 402 407 388 374 382 388 373 358
1933 358 379 429 480 510 507 464 406 386 421 454 431 377 360 386 402 386 374 390 402 375 331 320 350 389 408 411 416 422 421 411 402 403 403 389 364 346 341 341 345 359
1928 359 377 382 373 370 371 351 316 323 399 483 498 448 401 386 373 349 336 344 347 335 334 356 368 342 303 286 292 304 326 362 389 388 384 415 472 512 515 500 488 477 461
1923 461 441 426 418 420 430 433 419 401 398 411 431 457 494 520 506 455 410 401 411 409 392 380 384 394 399 403 415 431 451 476 498 496 457 404 379 393 409 396 367 345
1918 345 323 285 255 282 357 418 426 413 419 432 425 412 430 475 503 493 456 403 338 287 279 308 332 332 339 376 427 455 456 446 436 419 386 342 307 308 346 389 405
1913 405 402 406 416 402 360 318 287 242 187 172 234 331 399 429 449 460 437 396 392 442 498 511 491 477 477 466 435 402 394 409 422 399 339 281 259 275 305
1908 305 342 392 430 417 360 331 380 468 524 533 533 533 497 420 361 365 405 421 408 404 415 411 375 343 347 375 387 364 321 287 277 293 318 332 332 334 346 358 361 357
1904 357 346 323 296 299 343 385 371 317 287 312 345 331 280 247 261 296 315 308 303 325 371 407 408 390 388 409 415 389 362 372 410 436 434 413 384 348 328 340
1899 340 363 353 305 270 283 328 366 387 402 418 435 452 458 435 394 374 390 404 387 374 415 487 512 464 408 405 438 455 453 462 481 472 434 415 440 475 473 447
1894 447 435 443 435 395 354 356 408 474 503 470 409 383 421 479 491 452 419 426 434 398 342 327 362 396 394 370 354 349 353 380 429 464 453 409 376 367 359 335 315 331
1889 331 383 434 454 449 449 461 461 431 389 364 354 341 331 351 395 423 414 395 396 406 400 386 392 416 428 410 377 351 337 332 328 325 330 350 374 378 365 365 388 392 345 288
1884 288 290 354 417 431 419 418 425 423 421 432 444 442 436 443 454 446 420 393 377 377 401 440 462 448 425 429 454 459 431 400 391 398 414 445 473 459 394 337 345 395 418 389
1879 389 366 402 475 514 488 432 396 394 408 421 432 445 458 469 474 468 450 427 408 396 388 389 398 396 364 313 276 269 276 277 279 298 335 377 413 431 418 379 345 341 361
1874 361 383 400 413 411 385 362 376 421 448 438 419 416 417 401 387 408 460 500 502 473 436 411 411 440 476 493 484 471 474 498 536 570 573 531 468 427 422 432 434 436
1869 436 448 458 439 396 366 372 396 401 380 352 338 330 309 272 237 222 230 251 274 298 328 362 389 395 384 376 378 373 347 330 352 395 401 358 334 387 481 530 509
1864 509 475 472 483 476 456 446 438 412 375 350 350 361 367 355 315 258 222 245 318 388 408 384 356 351 359 359 346 340 347 348 324 291 283 306 335 351 370 399 413 395 374
1859 374 395 449 488 493 487 487 478 453 442 468 511 521 480 419 385 402 459 516 526 473 389 325 311 336 366 380 389 418 465 486 447 369 298 250 209 184 213
1855 213 297 373 395 387 400 425 419 380 351 339 310 262 246 299 382 437 455 462 469 462 447 442 449 449 440 443 462 472 449 412 397 414 434 429 401 376 369 367 357 352 369 396
1850 396 404 393 400 449 509 535 521 494 466 435 411 416 431 411 346 291 302 367 427 452 459 469 483 506 550 608 645 636 586 522 467 441 453 484 492 460 433 457
1845 457 512 525 465 379 328 311 298 288 312 375 432 436 392 348 340 370 413 446 459 453 439 429 417 395 370 366 391 417 411 378 369 415 483 515 497 462 438 418
1840 418 393 372 359 337 307 298 335 400 461 504 531 533 508 482 477 478 471 478 530 594 608 575 565 604 626 578 506 488 522 541 516 481 466 456 436 414 409 429
1836 429 471 521 552 544 513 485 464 431 395 383 400 422 446 491 552 582 554 504 482 482 465 428 409 429 457 460 444 440 458 470 454 422 404 413 440 471 503
1831 503 532 540 519 481 455 454 470 488 497 486 447 399 376 399 447 483 479 445 422 441 494 546 580 612 649 656 607 535 496 481 432 337 261 257 304 355 400 439
1827 439 444 396 336 323 353 373 361 355 380 413 428 432 445 461 463 447 427 414 422 458 503 520 488 431 394 392 406 413 413 419 428 425 409 397 401 404 394 391 421 462 451 382
1822 382 327 344 399 423 410 405 417 414 390 382 397 402 388 402 464 521 517 473 446 448 454 466 499 530 514 453 406 400 404 392 389 432 498 532 510 456 409 400 437 495
1817 495 517 477 415 389 396 381 331 307 359 453 511 515 508 515 509 465 408 382 388 389 365 331 309 302 303 311 336 381 425 435 403 368 373 406 409 358 304 304 353 404 437
1812 437 466 497 516 528 550 568 553 513 496 519 540 523 487 466 459 448 433 430 432 436 461 521 583 598 567 536 532 536 529 516 505 487 464 452 461 473 476 487 517
1807 517 537 510 442 381 367 393 425 439 433 421 420 444 486 516 509 477 453 451 452 438 421 425 451 479 497 507 511 503 493 492 493 472 433 407 416 444 468 490 518 539
1802 539 534 507 475 446 420 408 415 428 426 412 402 393 369 335 321 343 387 421 424 398 369 367 396 420 411 383 373 393 417 427 432 437 428 397 367 362 377 388 385 386 411
1797 411 459 498 497 465 446 462 483 468 426 402 413 427 419 404 403 411 402 364 314 285 308 374 433 438 400 363 346 323 285 264 285 322 340 338 334 333 328 320 316 320 333
1792 333 354 363 340 305 314 388 465 471 414 362 361 396 426 432 422 412 402 384 349 316 311 324 318 286 277 323 387 414 403 393 400 406 412 437 472 484 460 421 389 378
1787 378 402 452 480 451 399 384 401 398 377 398 472 527 516 482 477 482 451 406 396 417 431 434 454 484 481 441 411 425 456 463 438 403 388 407 447 474 468 440
1782 440 418 405 400 416 465 524 549 534 513 512 524 542 560 558 506 425 378 396 438 443 409 388 406 443 469 469 446 408 377 376 401 419 402 357 317 314 349 398
1778 398 439 453 437 400 374 390 437 471 466 452 477 534 571 568 559 569 584 590 596 600 563 475 398 394 432 431 384 355 370 374 333 294 303 325 306 274 296 374 435 436
1773 436 407 388 378 369 371 385 392 382 377 391 404 406 424 474 514 493 423 370 371 404 430 431 407 360 313 297 321 359 387 410 441 472 484 469 444 425 417 414 405 382
1768 382 346 314 311 341 379 394 375 349 348 375 407 425 435 450 461 460 454 455 448 409 346 296 283 302 336 380 430 470 490 493 482 459 427 401 386 376 376 403 454
1763 454 492 493 476 473 480 465 429 412 436 473 486 472 448 426 404 386 374 361 340 326 340 378 405 397 372 366 395 438 473 490 493 487 475 454 417 374 360 393
1759 393 442 451 415 393 419 451 442 416 433 487 512 482 445 440 445 435 440 489 541 534 478 444 460 478 456 421 426 467 488 458 409 391 408 423 415 409 431 459 453 418
1754 418 401 428 473 498 498 495 504 527 548 535 473 396 363 380 398 392 401 449 494 490 463 458 463 446 437 485 557 564 495 434 428 429 401 383 410 435 408 362 360 379 351
1749 351 283 261 326 410 428 382 339 347 391 432 454 466 476 478 466 463 489 531 546 521 481 455 441 432 436 448 434 384 347 376 444 474 442 403 413 460 498
1744 498 508 509 519 534 538 520 484 455 461 501 539 535 476 395 344 354 397 419 409 416 471 536 546 501 463 471 497 505 495 489 487 480 472 475 486 500 515 534 555 574 583
1739 583 567 519 458 427 443 480 499 493 482 483 496 515 536 556 573 583 579 559 545 570 630 672 646 568 504 496 529 558 567 567 566 552 523 499 500 508 484 422 372
1734 372 382 441 499 529 544 555 551 528 515 533 559 553 504 448 423 441 492 556 607 632 649 684 741 784 777 722 661 629 627 640 669 729 809 855 818 722 646
1730 646 639 679 715 742 776 810 801 743 685 681 715 727 690 642 634 662 688 688 677 667 650 617 586 587 617 645 640 604 555 516 511 552 620 671 674 647 626 630 645 652
1725 652 650 647 657 685 730 777 807 809 792 781 797 836 879 906 917 921 917 891 837 773 727 712 711 705 696 694 697 682 642 606 605 623 615 573 551 588 651 676 653 620 599
1720 599 574 548 550 590 632 647 639 614 559 486 452 487 545 553 523 521 566 599 579 542 542 578 606 607 598 598 602 593 563 525 511 543 601 638 636 630 657 702 721 695 647
1715 647 608 590 589 597 599 579 549 531 535 550 567 590 618 633 621 585 540 493 449 415 395 384 384 410 468 528 550 529 499 488 488 482 477 490 525 562 589 603 608
1710 608 613 626 639 633 598 551 513 496 508 557 631 683 667 593 516 475 458 447 447 467 486 475 439 422 456 532 604 626 591 543 532 566 605 615 604 605 626
1706 626 651 662 647 601 547 526 552 585 579 544 532 563 604 624 632 642 636 592 524 480 490 539 585 605 607 614 626 620 580 524 496 512 544 558 551 542 543 547 539 520
1701 520 511 533 593 670 724 731 697 657 649 674 702 702 681 670 678 678 651 617 609 617 609 580 567 593 638 667 671 663 651 633 604 569 538 521 523 535 541 545 570 625 683 712
1696 712 713 712 726 740 740 725 710 701 695 693 694 688 661 612 569 565 604 658 697 706 686 649 623 635 678 706 682 627 596 619 676 726 747 751 762 784 793 772 749 764 812
1691 812 829 792 760 795 861 874 825 788 806 839 838 815 800 789 770 773 819 872 877 840 815 826 839 820 786 772 789 809 798 758 729 740 774 790 786 797 839
1686 839 875 870 851 863 902 920 896 860 847 854 865 879 906 949 993 1019 1013 981 950 950 997 1075 1139 1150 1122 1104 1126 1152 1135 1087 1067 1084 1091 1061 1024 1011 1002 984
1681 984 999 1071 1147 1152 1096 1057 1070 1101 1119 1139 1178 1222 1252 1263 1264 1268 1282 1292 1260 1183 1126 1148 1208 1216 1166 1145 1199 1261 1269 1262 1314 1413 1477 1475 1460 1479 1510 1506 1471
1677 1471 1451 1476 1520 1540 1541 1565 1627 1683 1690 1677 1699 1757 1797 1795 1794 1820 1849 1848 1841 1870 1936 2000 2045 2093 2171 2274 2370 2427 2438 2430 2428 2430 2430 2448 2504 2575 2616 2641 2707
1672 2707 2829 2946 3010 3036 3070 3120 3179 3250 3331 3399 3450 3523 3643 3777 3882 3970 4078 4212 4351 4486 4618 4736 4838 4957 5119 5305 5481
1669 5481 5652 5843 6058 6288 6539 6805 7055 7292 7581 7972 8416 8814 9149 9495 9913 10402 10933 11496 12085 12707 13396 14185 15052
1666 15052 15949 16876 17867 18912 19964 21014 22094 23198 24253 25201 26029 26706 27161 27355 27331 27136 26777 26261 25650 25002 24322
1663 24322 23603 22881 22197 21548 20925 20372 19929 19567 19232 18936 18744 18664 18631 18601 18604 18700 18900 19176 19501 19865 20283 20791 21409 22119 22882
1660 22882 23692 24593 25622 26782 28061 29463 30993 32654 34460 36459 38683 41116 43711 46459 49400 52553 55870 59247
1658 59247 62577 65766 68706 71268 73324 74765 75509 75515 74811 73478 71593 69219 66453 63457 60395 57357 54384 51520
1656 51520 48815 46281 43912 41736 39796 38079 36522 35100 33844 32770 31845 31041 30373 29846 29426 29099 28895 28828 28860 28962
1653 28962 29183 29576 30111 30719 31392 32194 33168 34301 35567 36966 38514 40228 42131 44245 46576 49123 51877 54799 57815
1651 57815 60877 63965 67009 69841 72274 74195 75533 76180 76032 75105 73521 71395 68800 65835 62636 59315 55953 52652
1649 52652 49512 46546 43698 40978 38491 36284 34269 32357 30576 28997 27602 26316 25128 24082 23182 22378 21647 21004
1647 21004 20444 19936 19487 19133 18874 18671 18505 18397 18354 18352 18384 18478 18657 18902 19185 19511 19901 20369 20917 21536 22208 22914 23657 24445
1644 24445 25246 25997 26650 27180 27542 27674 27557 27241 26770 26132 25297 24297 23209 22084 20922 19729 18545 17423 16394 15451
1641 15451 14579 13761 12992 12274 11611 10993 10406 9842 9316 8848 8449 8108 7794 7473 7136 6808 6530 6316 6140 5961 5762 5560 5376
1638 5376 5207 5038 4868 4716 4589 4474 4370 4289 4223 4124 3957 3769 3637 3571 3502 3395 3304 3285 3285 3212 3061 2918 2833 2772 2700 2640 2616 2595
1635 2595 2535 2452 2392 2365 2344 2323 2310 2280 2192 2056 1946 1914 1935 1954 1951 1942 1945 1961 1982 1994 1982 1956 1938 1933 1911 1853 1776 1713 1672 1644 1628 1626 1628 1612 1565 1494
1631 1494 1430 1417 1474 1548 1560 1505 1467 1503 1559 1545 1470 1417 1414 1397 1320 1234 1212 1252 1292 1295 1273 1258 1271 1305 1325 1298 1244 1220 1245 1270 1241 1177 1137 1139 1141 1106
1626 1106 1052 1029 1069 1149 1210 1210 1175 1158 1159 1126 1043 972 966 995 1002 994 1022 1087 1138 1147 1141 1136 1108 1049 998 982 985 985 988 1002 1002 974 954 985 1045 1067 1026 973 956 968
1621 968 972 957 947 957 970 965 944 929 927 918 890 860 857 884 913 929 942 964 984 990 982 962 920 854 792 775 805 849 873 871 850 813 769 736 717 701 679 675 713
1616 713 781 841 867 867 850 812 761 726 737 776 798 784 763 768 798 824 829 814 793 784 802 836 855 846 826 816 807 772 711 660 648 665 682 682 681 701 747 793 809
1612 809 793 774 774 787 790 773 748 734 734 733 711 666 624 612 629 653 672 689 695 678 657 671 714 721 656 576 564 618 666 667 651 645 640 629 623 623 602 559 530 526 523
1607 523 506 512 564 628 658 656 659 672 674 661 645 624 585 543 529 546 568 578 579 577 572 575 599 633 643 610 558 522 518 534 549 547 536 544 590 651 687 689 692 725 766
1602 766 762 694 606 559 562 573 563 551 563 579 565 526 505 523 558 597 643 679 665 609 574 592 616 595 559 566 606 622 601 587 606 633 640 631 620 612 615 627
1597 627 620 577 539 559 618 641 597 531 493 482 489 520 567 586 568 563 599 633 615 563 531 530 537 548 572 586 554 497 469 489 523 551 583 613 604 550 496 488
1592 488 513 536 558 601 656 682 658 604 549 506 481 488 530 580 609 619 626 628 601 550 522 548 601 631 630 630 651 681 715 751 764 719 639 597 626 676 687
1588 687 665 649 639 611 581 595 649 681 656 607 582 592 623 663 697 694 648 605 618 689 757 769 729 686 673 682 689 688 697 724 749 749 720 681 661 680 735 795
1583 795 827 839 866 907 917 875 838 866 935 973 968 967 981 965 904 860 875 912 913 884 870 863 826 772 755 792 834 834 803 784 791 805 804 791 789 809 833 826 778
1578 778 725 700 697 685 666 671 705 735 741 742 767 810 846 862 871 892 925 951 941 895 851 852 894 944 991 1053 1125 1160 1131 1076 1045 1047 1059 1079 1107 1110 1062 984 923
1574 923 882 836 801 828 911 968 955 919 910 895 821 722 681 711 738 716 678 672 696 728 756 774 769 757 772 811 814 744 656 633 683 739 755 761 797 856 896
1569 896 900 887 881 882 878 862 843 827 799 744 683 654 670 704 726 741 754 757 748 758 809 869 881 830 756 703 688 705 736 747 718 668 632 608 570 535 553 634
1565 634 716 743 726 709 705 704 712 733 748 727 685 656 645 626 592 577 604 653 682 676 659 664 690 708 687 639 612 639 689 703 663 612 591 595 585 555 532 536
1560 536 554 562 570 597 632 633 592 551 541 533 487 432 442 531 628 660 628 580 550 549 569 578 538 460 408 424 469 479 452 433 437 426 388 360 391 477 565 601
1555 601 585 562 579 630 665 653 612 568 519 471 461 500 536 521 487 498 546 559 518 479 471 463 431 413 441 485 510 523 538 541 521 506 506 479 402 343 373
1551 373 459 506 487 473 506 546 540 498 464 460 475 489 487 457 410 379 375 376 367 361 374 393 394 377 356 345 345 357 384 414 428 419 411 435 498 565 595 586 576 582 580 544
1546 544 491 460 446 419 375 355 382 431 462 456 422 379 358 381 440 500 537 567 606 644 649 614 565 531 517 496 445 374 328 338 384 422 432 427 416 399
1541 399 383 389 424 473 513 526 508 481 492 547 577 507 375 304 351 444 493 508 537 570 559 519 508 536 555 538 511 490 467 453 478 533 567 560 554 580
1537 580 608 598 556 509 463 416 388 389 393 376 357 378 439 506 550 567 556 523 498 501 515 514 507 525 563 581 560 515 468 434 443 515 609 644 601 545 529 524
1532 524 489 450 461 504 509 457 400 384 405 452 522 587 596 541 484 481 514 528 514 504 510 523 543 571 589 576 552 555 580 588 568 556 573 585 555 501 469 478
1527 478 506 533 553 573 589 583 542 480 455 508 597 639 609 573 583 608 603 597 643 711 714 639 569 565 593 599 593 608 641 659 663 669 677 667 637 605 577 554 543 546
1523 546 549 550 580 658 752 801 797 783 784 784 766 753 777 835 896 936 950 949 952 974 1011 1040 1042 1022 997 980 981 998 1015 1018 1012 1019 1046 1078 1108 1146 1200 1254 1289 1306 1316
1518 1316 1330 1359 1421 1510 1585 1608 1596 1600 1646 1713 1774 1833 1896 1947 1971 1991 2057 2184 2334 2465 2582 2713 2851 2966 3051 3147 3282 3443 3606 3790
1514 3790 4023 4291 4557 4820 5127 5503 5923 6361 6832 7370 7982 8636 9293 9923 10515 11103 11730 12392 13011 13503 13854 14095 14245
1511 14245 14294 14246 14118 13923 13681 13436 13229 13051 12872 12705 12600 12560 12529 12483 12465 12522 12636 12763 12915 13132 13420 13750 14119 14558 15073
1508 15073 15633 16213 16828 17499 18212 18925 19600 20232 20840 21449 22045 22579 23021 23416 23858 24406 25054 25778 26594 27552 28685 29987
1505 29987 31429 32974 34573 36169 37698 39081 40238 41102 41635 41825 41683 41256 40609 39796 38859 37857 36870 35954 35107 34305
1503 34305 33558 32912 32401 32031 31791 31668 31637 31667 31764 31980 32370 32938 33645 34451 35338 36307 37368 38535 39799 41117 42421 43655
1500 43655 44780 45755 46515 46998 47181 47090 46765 46233 45524 44710 43910 43244 42785 42556 42557 42791 43250 43894 44644 45402 46080 46616 46971
1497 46971 47101 46956 46503 45764 44807 43704 42503 41244 39977 38742 37557 36432 35399 34496 33733 33086 32540 32117 31843 31717
1495 31717 31704 31770 31914 32165 32557 33096 33746 34473 35276 36182 37188 38238 39262 40214 41060 41744 42201 42382 42258 41796 40970 39800
1492 39800 38369 36796 35174 33556 31975 30466 29081 27866 26833 25959 25216 24592 24076 23632 23203 22744 22230 21650 21003 20296
1490 20296 19555 18814 18113 17478 16894 16321 15736 15175 14682 14261 13876 13525 13239 13027 12852 12689 12559 12481 12440 12419 12448 12570 12770 12986
1487 12986 13191 13412 13671 13943 14182 14366 14491 14550 14532 14420 14194 13842 13369 12799 12156 11456 10725 9995 9274 8560 7867 7234 6685
1484 6685 6204 5767 5373 5029 4721 4427 4145 3877 3612 3345 3110 2956 2873 2784 2629 2428 2256 2156 2111 2076 2030 1975 1925 1886 1857 1831
1481 1831 1795 1744 1687 1634 1585 1541 1509 1498 1486 1436 1336 1226 1154 1131 1137 1154 1176 1191 1184 1163 1149 1146 1132 1094 1051 1025 1010 993 973 963 961 961 956 947 920 872 822
1476 822 798 804 819 820 801 773 756 778 842 914 947 930 897 879 869 849 822 805 801 795 782 771 768 759 728 684 654 645 638 611 573 554 568 600 633 663 682 670 629
1472 629 603 632 692 719 691 648 627 626 624 621 622 615 592 573 582 612 636 642 636 618 587 561 562 573 562 528 515 543 575 568 532 510 518 537 550 562 581 607 632 644
1467 644 622 557 484 459 498 553 575 573 597 664 737 765 743 694 640 588 546 529 548 589 622 615 572 523 497 491 485 477 478 480 459 411 382 413 494 565 586 567
1462 567 545 538 535 517 470 410 383 426 522 602 613 564 500 451 415 398 414 459 498 503 488 483 494 495 476 462 477 501 491 438 390 396 448 491 486 449 423 433
1457 433 476 539 599 623 591 519 461 459 502 538 528 487 459 467 495 516 525 536 557 580 592 576 526 458 417 430 472 487 459 433 451 497 528 529 521 518 516 510 502
1453 502 485 451 415 405 425 455 483 515 545 538 483 425 422 478 536 548 518 487 479 484 488 483 473 464 459 461 475 492 490 454 401 369 385 439 505 556 578 565 536 528
1448 528 559 597 594 543 492 479 497 517 526 533 538 530 511 499 509 528 534 524 511 502 485 447 401 381 409 469 509 496 445 399 386 404 439 479 507 505 473 442 444
1443 444 468 483 482 489 509 504 443 360 324 358 416 448 463 494 540 561 542 517 521 543 554 555 575 613 628 589 521 477 476 498 518 533 538 517 477 460 499 576
1438 576 638 657 653 647 634 601 553 523 536 582 623 619 578 548 564 601 606 572 543 548 569 585 615 672 717 703 649 623 652 701 728 726 699 641 569 531 556 605
1434 605 619 595 585 626 692 728 713 672 633 608 595 599 626 670 710 723 698 648 602 597 637 685 695 661 630 635 652 644 617 606 609 597 577 590 645 696 716
1429 716 737 781 809 777 711 671 671 688 725 789 832 797 716 683 727 774 764 741 763 807 815 787 771 779 779 762 740 717 687 673 702 754 777 764 763 795 821
1425 821 798 741 692 663 643 631 635 650 659 654 649 660 687 709 701 671 659 686 724 724 683 641 625 626 633 645 654 641 611 594 602 616 621 631 648 654 651 668 711 730 692
1420 692 636 622 653 682 682 662 630 594 581 605 628 605 550 518 515 500 465 454 487 515 499 471 471 478 454 415 415 459 495 492 471 465 474 484 499 531 578 616 620
1415 620 594 574 584 611 618 598 577 564 537 487 454 482 554 612 624 605 566 501 424 376 381 413 425 413 409 433 462 461 429 395 385 397 413 422 417 392 357 354
1410 354 410 496 552 556 531 491 418 325 280 324 405 439 415 394 415 454 478 480 471 462 465 485 505 502 477 444 397 334 292 317 388 436 435 426 437 445 436 440 468 475 435
1405 435 394 402 430 420 387 393 445 484 484 476 478 455 392 335 335 380 424 450 469 484 486 478 474 468 452 431 424 430 431 419 411 427 466 501 508 486 458 448 462 483 500 510
1400 510 521 537 554 560 545 510 470 435 401 369 346 340 338 327 314 312 317 318 319 335 357 363 365 394 445 468 442 414 435 493 535 536 513 487 466 454 452 442 409 371
1395 371 360 388 428 457 478 494 490 449 383 332 340 410 498 545 532 502 499 518 524 505 483 470 465 481 531 588 596 542 470 413 357 300 288 353 438 460 418 380
1391 380 374 368 352 366 418 447 410 356 348 373 372 348 355 396 413 388 383 437 501 503 460 441 461 463 421 381 384 400 381 348 356 411 454 453 442 468 516 535 517 504
1386 504 523 548 538 489 436 408 406 415 424 425 417 397 368 346 352 396 452 474 447 408 399 412 413 400 406 438 457 437 410 413 426 408 372 371 414 442 419 385 395 437
1381 437 458 451 450 467 467 431 395 406 462 519 543 530 491 432 359 290 250 257 298 337 349 347 364 399 419 414 419 459 509 522 489 447 423 419 429 448 454 429 405
1376 405 431 506 560 540 475 429 418 414 407 412 425 423 406 405 436 473 492 499 513 532 537 514 460 399 374 413 484 510 460 389 369 406 453 479 489 482 451 414 402
1371 402 411 405 380 381 429 479 483 463 474 524 560 554 534 541 567 584 580 574 579 594 613 630 637 632 618 600 571 528 489 479 497 513 501 467 433 401 366 344 372 455
1366 455 541 570 537 488 469 486 513 521 498 460 440 457 493 509 492 460 433 412 398 397 394 360 300 264 292 358 407 417 414 413 406 397 405 426 425 392 365 381 430
1362 430 470 476 455 420 383 364 381 415 429 406 377 380 414 431 398 341 319 348 385 388 373 385 422 430 385 328 303 303 303 305 330 364 373 359 356 376 387 370 351
1357 351 357 387 425 468 510 535 530 512 505 511 528 559 602 626 603 539 475 437 419 407 399 407 445 515 583 600 559 509 505 539 564 556 526 474 394 314 283 303 322
1352 322 312 302 315 314 268 227 256 339 396 402 408 436 443 396 345 360 429 474 450 387 345 353 399 453 481 477 458 444 434 423 418 433 455 446 395 333 307 330 371
1347 371 396 399 403 422 440 434 411 399 411 425 425 426 443 459 447 431 464 551 620 600 507 426 408 428 429 392 343 317 325 351 379 403 423 435 431 414 392 374 369
1342 369 378 395 400 388 376 393 424 421 367 310 306 342 359 333 300 291 295 294 304 348 409 442 432 400 365 331 305 312 360 419 444 420 363 303 258 244 268 324 385
1338 385 422 427 418 422 446 477 501 514 516 494 453 427 444 479 480 442 418 437 458 436 392 375 382 372 354 376 442 495 505 514 556 590 564 502 467 462 434 377 358
1333 358 419 509 545 506 442 412 430 469 486 470 451 460 485 483 446 408 395 396 401 425 465 472 420 363 381 466 528 514 459 418 395 373 365 389 421 428 418 420 431
1328 431 422 395 390 411 408 359 317 333 375 368 303 252 267 312 325 299 277 278 288 301 334 392 442 458 444 416 380 347 348 395 451 453 392 324 304 329 363 380
1324 380 376 348 303 274 295 347 376 363 347 368 409 432 435 438 436 410 378 381 413 418 379 344 354 386 400 402 408 387 317 257 290 393 450 413 361 376 432 457
1319 457 443 436 448 464 487 527 549 507 427 393 427 461 426 346 290 279 292 316 355 395 404 381 365 382 404 387 342 324 365 420 422 361 292 267 276 276 251
1314 251 222 215 248 316 394 438 429 394 375 375 364 329 290 268 262 266 280 308 347 390 424 430 411 397 415 443 445 436 459 501 490 409 340 357 417 431 398 388 419
1310 419 424 375 339 387 481 519 468 391 358 374 398 394 360 325 324 371 444 503 529 527 509 475 422 374 368 423 515 589 603 565 520 495 481 451 410 393 424
1305 424 482 517 502 452 408 397 417 443 455 455 463 481 484 456 413 391 398 412 417 417 411 388 363 372 416 442 414 369 368 400 403 366 347 377 409 403 386 398 421 415 393
1300 393 399 437 463 454 430 418 420 433 450 457 447 436 437 436 409 374 365 383 397 407 445 512 556 536 477 435 432 450 466 468 459 447 440 430 406 375 351 327 284 229
1295 229 202 225 276 321 341 330 296 271 283 318 330 318 335 404 480 504 479 433 371 294 250 286 374 443 463 461 461 455 438 425 414 388 346 312 304 323 362
1291 362 399 400 358 321 333 372 390 402 460 547 577 522 452 434 442 431 414 428 465 498 535 589 628 611 554 504 462 398 325 285 283 283 284 323 408 481 493
1286 493 454 405 364 333 323 340 371 401 426 440 427 382 332 311 329 373 416 426 390 338 324 358 399 404 381 365 369 382 389 387 369 332 290 272 299 363 426
1282 426 448 429 412 441 497 521 495 471 494 533 526 463 401 383 397 408 408 415 431 432 396 348 340 388 436 419 352 311 341 399 425 416 401 383 354 326 314 312
1277 312 315 346 413 463 445 383 345 347 348 335 347 390 414 396 384 409 432 406 359 352 386 404 369 299 240 232 283 355 390 373 349 363 395 413 431 479 532
1272 532 542 516 505 528 553 549 523 481 427 393 415 466 476 423 372 374 394 381 349 348 382 413 427 443 458 449 414 389 390 402 409 417 427 420 390 363 362 368 341 288
1268 288 259 286 331 333 293 280 338 421 451 422 397 424 474 493 472 441 425 423 422 416 406 401 409 425 433 433 434 444 449 445 439 429 408 385 391 432 473 482 475 487 511 506 458
1262 458 401 380 411 469 510 503 468 459 494 523 498 429 366 328 304 302 340 395 421 412 410 423 410 358 321 346 403 426 409 401 430 461 452 398 341 323 352 391
1258 391 399 380 378 408 432 413 375 365 384 387 358 329 333 365 407 446 462 434 374 344 390 478 527 499 436 398 402 428 459 490 505 475 403 331 314 365 449
1253 449 503 491 427 362 338 341 332 304 296 331 380 401 394 385 380 370 364 387 429 442 405 357 356 409 469 487 454 405 383 401 431 447 455 473 493 491 473 466 472 469 460 474
1248 474 513 533 516 497 499 484 423 354 335 356 353 313 288 315 368 403 403 381 366 387 436 464 430 364 345 407 502 564 568 527 472 439 451 478 466 404 345
1243 345 330 340 345 351 376 395 374 327 309 337 377 393 397 413 438 446 430 414 414 419 411 388 365 353 351 356 375 402 412 387 351 345 378 421 450 457 438 385 319 284
1239 284 292 311 311 307 320 337 328 297 282 311 371 437 480 484 449 395 349 328 339 382 434 452 422 374 346 339 329 322 342 384 404 377 333 317 334 357 358 331 292
1234 292 272 293 348 402 424 425 429 439 433 403 373 377 421 470 481 445 393 370 389 425 448 448 438 429 421 414 412 414 413 407 407 427 448 441 403 376 397 448 476 450 391 340
1229 340 318 327 354 380 392 387 371 343 310 301 350 440 509 516 481 444 415 383 360 366 396 418 412 391 373 367 370 378 386 396 410 418 400 359 325 317 318 313 324 370 414 405
1224 405 355 333 365 419 461 506 558 580 542 483 460 477 485 457 412 379 366 366 373 388 409 438 472 491 473 417 355 325 344 382 391 359 332 363 445 512 519
1219 519 488 464 454 436 407 394 405 413 392 352 329 343 386 422 425 398 376 388 431 469 474 455 449 472 504 514 497 468 432 380 320 289 300 321 319 307 316 337
1214 337 338 323 326 362 406 436 447 430 376 321 318 355 366 334 331 398 461 437 365 353 418 468 440 377 347 359 371 368 366 378 396 404 394 376 365 363 353 334 329
1210 329 354 392 419 438 458 456 420 384 389 411 387 316 262 266 301 335 376 429 468 467 433 384 330 299 328 405 466 478 473 481 482 452 422 421 414 360 298 298 354 396
1205 396 392 372 363 353 339 342 363 369 344 316 317 340 360 374 386 391 389 383 374 358 340 327 319 305 295 305 320 315 303 324 372 384 341 309 353 442 490 471 443 447 460
1200 460 442 393 351 347 384 435 458 425 350 290 301 379 466 487 425 340 314 367 440 471 459 443 441 439 434 440 458 459 428 391 388 417 447 450 424 380 335 318 345
1195 345 402 452 480 509 553 589 580 530 486 477 490 495 481 455 422 386 359 342 326 309 310 341 376 384 378 392 429 457 461 460 462 447 402 362 359 384 409 423 428 408
1190 408 365 339 368 428 452 424 391 394 418 428 421 407 376 317 257 249 307 382 417 407 391 395 406 406 405 432 477 493 458 416 421 468 502 491 455 422 391 354
1185 354 320 309 327 352 356 325 286 286 334 377 360 302 278 317 373 390 367 338 325 340 386 434 441 402 361 348 343 334 348 399 432 394 320 290 318 342 331
1181 331 317 330 357 389 427 452 429 374 355 407 474 486 444 402 387 390 395 397 388 372 369 389 413 414 391 357 328 322 353 398 410 380 361 396 453 470 440 412
1176 412 414 422 402 343 265 210 214 275 338 359 351 351 364 369 370 375 362 308 236 196 194 199 204 234 295 357 403 437 455 440 416 421 445 434 387 367 396 418 390 357 367
1171 367 384 348 282 259 295 339 354 356 361 371 391 424 448 441 425 442 485 496 455 401 376 379 392 420 459 485 473 433 395 384 402 420 401 342 289 291 330
1167 330 340 300 264 286 353 403 398 353 309 297 322 365 406 439 460 451 409 365 356 378 389 372 351 346 343 324 302 300 324 362 393 404 396 388 395 400 390 378 386 399
1162 399 388 363 362 378 363 311 280 309 366 408 439 476 492 452 380 340 364 425 471 459 388 312 294 321 319 270 248 315 416 459 436 404 386 363 344
1158 344 355 368 333 269 258 319 383 399 389 386 376 344 311 295 280 261 262 290 314 321 343 394 424 396 355 365 414 427 382 330 319 346 381 411 436 455
1153 455 459 442 403 363 358 393 425 410 363 334 345 364 363 350 341 333 319 313 338 383 405 384 353 360 402 428 409 384 402 446 469 468 479 511 529 523 529 558 565 514
1148 514 442 408 421 448 470 483 472 443 435 474 521 517 464 411 391 395 411 426 411 358 308 304 327 328 318 351 423 469 452 413 395 394 395 409 437 453 444 433 430
1143 430 415 379 359 374 400 405 404 413 414 386 349 332 323 312 324 385 457 472 423 366 350 370 398 413 407 387 376 380 374 338 299 303 351 395 402 382 361 355 371 401
1139 401 424 428 434 460 478 452 397 370 389 413 404 373 351 352 369 390 393 363 318 297 310 329 343 369 416 451 449 428 419 418 409 401 401 385 331 272 269 332 409 456 483
1134 483 513 537 527 484 435 403 390 391 402 421 441 456 463 465 459 437 403 377 384 426 473 489 472 454 463 487 494 467 425 395 386 381 369 349 330 316 312 320 331 336 332
1129 332 333 345 360 376 401 429 432 400 364 357 368 362 338 322 324 337 367 420 462 442 370 318 321 337 330 327 367 423 439 419 407 414 417 417 437 470 479 465 470 506 526
1124 526 497 442 394 350 310 305 356 427 455 432 398 384 377 358 338 338 358 370 352 307 270 274 320 374 404 416 441 491 542 559 535 491 454 431 415 400 394
1119 394 407 436 461 463 444 425 421 424 417 402 404 437 472 470 440 425 444 461 449 436 462 505 506 449 389 377 405 433 437 426 418 430 454 458 422 375 366 390 401 386
1114 386 378 384 362 301 261 286 335 353 370 443 533 540 452 367 362 404 436 446 435 383 305 270 319 392 406 369 352 374 386 367 363 411 487 541 553 529 484
1110 484 445 443 474 496 476 425 373 329 299 297 327 360 374 385 418 450 438 389 355 361 379 382 389 417 441 425 389 385 433 489 509 492 466 449 441 438 437 439 450 475
1105 475 508 522 502 455 408 378 375 402 452 496 499 458 403 359 329 308 317 370 441 476 459 433 437 448 415 339 277 271 301 327 346 385 443 482 473 426 383 377
1100 377 409 450 466 449 423 413 413 402 386 390 424 461 472 446 400 357 347 378 414 405 345 289 287 328 373 407 446 484 498 485 475 486 500 498 482 460 425
1096 425 374 326 309 326 355 375 382 383 394 419 445 440 392 333 307 329 364 375 357 336 331 336 337 333 333 340 350 358 368 390 427 471 510 524 504 460 418 397 393 393 393
1091 393 393 386 365 343 345 370 396 400 388 381 391 410 423 433 452 480 493 471 431 416 441 463 441 384 336 322 330 350 378 396 384 354 346 373 404 413 408 408 411 416 431
1085 431 452 448 403 349 327 334 341 340 350 375 392 388 373 361 359 374 414 466 493 467 403 344 332 377 449 498 499 468 439 416 386 343 303 284 296 334 376 392
1081 392 368 328 307 304 293 259 229 237 283 340 381 400 402 392 371 352 360 405 457 473 448 422 424 434 429 428 457 490 475 413 364 365 383 381 364 361 368 360 334 318 330
1076 330 363 396 415 428 445 465 475 476 490 522 539 503 438 402 405 409 396 395 412 409 371 352 390 442 441 397 373 384 394 397 418 448 435 375 327 334 359 351 327
1071 327 331 362 378 371 382 444 531 581 556 474 393 354 355 366 379 406 444 457 425 376 358 384 426 455 470 481 488 485 475 475 494 517 517 481 428 388 366 349
1066 349 333 334 357 383 396 403 415 421 404 365 334 337 366 396 405 394 384 392 410 419 417 417 413 389 348 327 351 395 409 389 367 370 383 387 381 372 361 351 352 364 367 345 308
1061 308 280 275 291 322 360 398 428 450 465 471 469 468 472 470 457 449 463 483 480 457 440 435 410 363 349 406 489 514 468 418 411 423 417 396 382 369 344 324 333 360 378
1056 378 387 395 385 346 318 360 458 528 518 473 460 484 500 485 449 411 380 361 356 352 351 376 431 481 486 456 428 406 367 317 302 338 381 378 335 308 336 403
1052 403 451 445 406 387 403 411 370 298 258 281 349 427 485 493 438 352 299 301 323 336 350 373 377 339 297 303 354 399 417 428 443 438 398 345 305 276 244 220
1047 220 230 280 341 383 404 412 411 387 339 289 265 269 282 288 294 304 311 316 330 354 369 364 359 367 368 335 284 258 269 287 293 299 315 335 356 397 456 493 468 398 337
1042 337 323 350 385 403 403 414 448 476 456 398 358 365 384 380 364 367 383 398 420 457 478 453 406 387 404 433 470 517 535 484 401 377 423 450 400 329 313
1037 313 343 365 376 411 460 469 428 377 351 344 340 341 349 363 386 416 435 427 407 401 407 414 429 455 457 401 322 296 339 385 380 344 323 322 324 320 303 258 195 168 209 281
1032 281 313 293 274 301 368 434 472 476 468 470 481 474 436 394 379 392 408 418 422 410 372 328 309 320 334 329 312 302 304 315 326 327 312 286 264 251 249 262 291
1027 291 322 336 332 324 321 321 327 338 345 342 345 379 439 487 481 412 311 230 203 227 264 291 318 357 386 371 329 319 371 441 473 466 461 476 488 470 432 405 402 409 412
1022 412 411 409 389 334 267 246 297 371 395 363 328 330 355 377 388 393 390 380 375 377 382 384 388 392 387 386 410 450 460 416 355 319 310 304 297 303 312 306 295 318 378 432 435 388 333
1017 333 302 292 276 235 187 177 229 313 366 365 341 336 354 371 377 388 413 437 431 400 379 394 429 451 444 421 395 372 366 390 421 422 397 385 397 393 349 308 323
1012 323 369 389 376 373 379 347 276 231 248 285 295 301 345 401 419 402 389 378 335 279 288 382 482 501 445 376 324 285 275 318 392 431 405 353 329 340
1008 340 371 410 447 460 440 406 390 391 390 382 384 403 422 419 392 364 364 403 458 496 505 495 470 427 385 376 396 396 360 338 367 392 338 239 211 289 383 413 404 418
1003 418 444 432 384 345 333 332 342 372 413 444 459 457 421 361 326 351 401 418 404 388 359 300 256 292 384 435 415 394 422 456 457 452 478 502 481 433 401
998 401 384 355 323 310 306 289 266 250 227 195 193 250 316 327 296 286 312 329 324 327 344 341 320 331 388 431 417 385 390 415 414 388 378 387 371 320 284 313 383
994 383 433 435 422 436 479 509 494 443 395 372 362 345 328 331 360 396 418 426 436 444 437 413 403 426 459 461 436 431 466 504 513 508 506 485 420 344 312 323 332 328 335 355
988 355 356 331 316 330 346 340 331 339 360 387 426 461 455 417 410 463 514 499 449 428 426 391 336 339 412 468 439 362 313 309 321 340 367 386 377 357 353 351 327 298 298 322
983 322 338 348 387 451 482 452 411 415 445 443 407 389 407 411 366 308 303 359 419 436 418 405 410 410 386 359 368 416 463 466 432 398 388 396 411 428 435 421 400 402 429
978 429 445 427 395 371 351 327 319 337 356 350 332 336 358 362 345 337 349 357 349 345 351 348 327 315 328 340 326 303 296 293 272 253 275 333 379 381 357 336 322 311 310 328
973 328 354 365 356 358 397 454 475 439 395 401 452 486 469 432 414 405 387 376 402 454 483 465 417 371 344 344 367 388 387 372 376 405 432 431 407 383 381 404 438 453
968 453 439 415 408 420 428 419 399 375 346 318 302 302 319 358 420 481 507 486 436 374 322 304 331 371 378 361 364 398 418 387 338 319 333 356 388 437 475 468 431
963 431 409 411 396 349 307 311 346 374 389 414 454 485 485 462 439 425 418 418 433 457 470 452 418 408 444 502 535 525 491 464 463 484 504 499 468 437 433 450 470
959 470 490 512 521 500 461 438 439 438 430 441 476 487 437 358 313 316 330 338 347 350 326 296 308 363 399 387 382 428 473 443 361 318 334 339 303 286 336 401 403 354 328
954 328 352 389 408 413 408 379 338 324 354 399 420 413 398 396 412 442 465 463 441 422 416 424 447 482 496 450 365 310 325 375 402 393 359 303 237 208 240 292 296 255
949 255 230 255 299 332 361 396 411 389 351 335 342 350 355 367 379 375 357 346 345 332 302 282 291 314 327 321 308 299 302 329 378 418 420 389 361 357 372 394 415 428 419
944 419 396 383 396 422 434 432 435 449 459 453 438 434 445 451 423 364 325 351 416 450 428 401 423 476 510 514 511 494 436 360 330 371 432 467 485 498 485 434 388
939 388 385 397 378 336 324 351 377 381 385 395 390 379 401 458 483 430 354 341 402 463 475 467 478 489 458 393 352 368 411 431 415 393 387 384 362 326 303 309 328
934 328 330 313 307 345 413 453 433 391 392 441 483 478 448 428 416 395 376 387 422 447 447 435 421 401 380 380 408 443 456 439 399 349 302 264 232 208 211 247 295
929 295 329 355 393 439 462 452 429 408 378 339 312 310 319 322 320 311 280 235 224 275 356 410 420 414 405 380 340 315 326 363 405 442 472 483 469 436 404 382 369
925 369 364 367 374 376 362 338 322 333 366 390 384 355 333 326 314 283 264 301 392 477 497 452 395 360 343 335 349 388 420 415 387 374 381 375 341 304 301 343 410 466 487
920 487 476 465 465 450 400 354 358 397 412 396 391 408 405 367 339 357 391 402 407 434 472 494 504 507 483 424 380 394 434 446 435 443 464 459 436 431 435 405 357 348 381
915 381 396 370 351 365 383 389 412 450 451 402 369 390 412 384 349 364 400 393 353 333 336 331 333 376 424 417 378 391 457 485 427 356 342 363 360 335 328 334 322 299
910 299 299 324 346 353 356 362 370 387 419 443 431 387 338 297 258 223 210 222 236 240 244 261 285 305 321 333 341 346 355 372 386 383 360 326 297 292 320 365 397 397 373 345
905 345 317 274 220 185 190 218 231 223 222 248 277 280 265 262 278 288 291 312 362 406 414 401 407 427 421 386 366 394 440 456 440 434 460 494 504 485 456 429 402 378
900 378 373 392 417 411 358 278 212 187 206 256 321 379 412 418 415 411 396 364 335 342 378 397 373 336 332 362 386 392 414 470 517 497 420 356 346 359 348 323 328 372
895 372 416 433 442 464 480 453 387 322 295 304 330 362 393 411 412 412 433 475 511 521 505 475 437 396 367 369 392 403 376 331 305 303 294 262 236 250 299 339 339
890 339 310 281 270 278 300 329 356 374 373 358 356 389 438 454 424 399 426 481 499 466 435 435 433 401 360 340 328 308 297 321 367 400 411 412 400 376 369 404 448
885 448 445 386 322 294 303 339 388 425 426 410 417 441 434 381 329 322 347 368 379 398 439 498 558 590 576 537 513 512 508 496 495 498 475 437 442 512 592 635 668 741 834
880 834 903 947 990 1017 996 951 931 923 869 759 648 570 508 448 406 386 367 344 343 369 393 396 402 418 415 374 326 307 322 359 416 474 484 429 359 339 366
876 366 385 365 328 310 322 347 355 331 295 293 345 418 460 456 421 374 340 342 386 435 449 425 392 363 333 307 301 321 351 373 383 386 389 396 399 394 389 403 438 459 433
871 433 376 343 366 418 443 413 351 308 307 333 351 349 339 331 331 351 392 426 415 363 323 331 367 386 377 360 362 400 467 528 538 511 503 535 554 509 435 404 419
866 419 421 394 386 428 480 489 455 410 383 385 410 433 418 368 332 341 364 348 290 241 238 264 276 264 261 296 361 418 437 412 360 311 299 330 377 396 383 369 373
861 373 378 375 376 384 374 335 306 317 338 327 299 304 341 358 342 335 370 427 468 472 433 357 285 263 289 315 322 331 345 335 301 291 325 355 340 301 281 278 266 255
856 255 263 270 259 261 314 389 414 376 329 315 317 310 300 304 316 321 315 298 277 263 274 311 364 413 432 397 329 293 328 387 400 379 398 476 544 536 470 415 400 408
851 408 406 377 318 255 236 286 376 446 467 440 383 324 292 300 321 322 306 303 319 333 329 319 320 326 315 282 250 250 290 346 381 385 386 414 458 470 419 337 289 293 305
846 305 287 273 317 398 434 381 295 258 282 325 354 366 359 333 318 345 393 403 356 299 270 257 239 235 270 327 366 376 379 384 390 399 417 431 418 381 346 331
842 331 329 332 348 383 420 430 402 360 346 386 464 536 567 560 533 502 488 507 549 565 519 446 414 440 475 491 526 614 711 744 709 681 709 757 772 756 744
837 744 729 682 614 571 560 531 454 381 383 450 504 500 466 454 473 498 505 493 473 456 446 441 442 460 492 508 481 420 364 338 336 348 360 350 313 290 329 412
833 412 461 435 381 367 391 404 394 392 421 458 481 494 511 529 535 523 504 493 497 499 474 428 401 422 475 513 519 512 514 538 593 674 750 777 746 693 658 648 635
828 635 585 490 384 320 319 348 361 359 377 417 441 417 363 318 304 309 324 348 383 423 453 464 466 474 483 471 436 410 413 420 395 353 332 336 336 323 319 327 326 314 317 331
823 331 319 286 289 351 417 429 406 394 387 354 307 294 316 339 355 384 418 425 413 422 456 468 441 413 407 396 356 317 318 349 381 405 419 405 366 339 352 380
818 380 391 389 379 340 269 230 275 360 394 369 349 352 334 297 304 367 401 361 324 368 439 442 396 395 441 441 367 306 324 370 374 352 354 369 361 344 362 404 420 396
813 396 374 376 375 347 311 300 325 370 396 366 292 244 276 348 368 320 277 292 335 351 349 357 369 363 356 377 405 395 362 362 407 444 439 421 427 435 409 365 346 364
808 364 383 377 359 350 357 374 393 407 411 413 426 453 479 488 474 439 393 352 325 308 285 258 245 261 303 356 407 434 428 400 375 362 344 313 299 329 376 379 312
804 312 229 206 262 348 399 394 366 353 360 358 328 296 302 345 386 394 380 361 337 308 297 322 354 357 339 343 381 416 414 383 343 301 261 250 279 316 323 310 320 358
799 358 384 370 336 317 312 300 276 258 261 284 322 360 378 355 300 251 243 275 311 318 295 265 249 254 281 324 368 396 401 397 395 393 388 390 403 416 421 429 450 461 434 378
794 378 348 372 424 458 456 433 405 382 367 350 312 257 219 227 259 273 269 283 330 373 383 374 377 399 418 420 406 378 346 333 354 387 386 335 266 220 206 214 234
789 234 261 281 281 274 288 328 369 384 372 350 326 299 277 269 275 289 321 383 457 497 479 428 384 360 342 331 340 360 362 340 325 344 384 414 424 418 385 319 247
784 247 226 277 358 400 378 323 284 287 322 360 373 362 347 351 364 361 333 310 319 350 366 357 344 351 364 359 332 308 309 334 358 358 331 308 319 352 361 324 285 298
779 298 350 381 365 330 309 296 284 286 311 337 349 352 349 322 274 247 265 296 297 290 311 335 315 269 268 322 362 351 336 356 370 325 249 222 269 336 359 330
774 330 276 236 223 220 203 182 189 231 269 280 290 324 360 370 374 400 421 393 340 326 359 385 374 355 360 374 380 385 389 374 337 305 295 297 308 340 382 404 412 446
770 446 511 549 516 444 387 358 350 370 412 427 383 324 309 324 311 267 240 243 241 222 227 272 318 329 316 302 288 276 287 333 390 426 435 424 389 340 315 339
765 339 387 405 376 337 340 392 450 467 432 380 350 349 366 400 458 523 552 526 472 434 430 453 481 494 484 466 466 490 519 531 513 466 400 348 337 347 336
760 336 304 303 356 416 428 412 424 458 449 374 306 321 405 476 487 461 436 410 373 338 323 310 274 236 249 311 357 349 329 348 377 351 280 241 258 272 244
756 244 225 274 366 429 444 448 461 461 442 426 428 431 415 383 348 319 296 278 281 326 414 501 528 481 407 349 302 254 229 266 352 431 468 468 446 404 348 295
751 295 260 241 234 239 252 271 305 356 406 428 416 379 331 288 269 279 305 336 374 409 415 395 394 434 474 467 437 440 462 445 385 342 343 349 331 315 324 339 343 347 353
746 353 334 295 276 297 319 324 346 398 424 382 328 336 379 366 287 226 248 332 414 446 417 359 328 344 353 305 244 256 336 390 369 325 312 313 310 325 371 389
742 389 338 270 271 336 385 384 381 420 477 493 446 361 285 260 298 363 405 409 396 391 395 407 435 469 477 432 354 296 297 344 386 377 323 274 274 302 301 246 181 166 208
737 208 261 280 261 231 215 221 241 268 303 349 391 401 380 363 373 385 358 311 307 371 451 485 481 489 523 553 555 539 515 476 436 422 438 451 440 427 435 431 371
732 371 275 224 268 360 409 371 285 223 223 261 295 311 336 385 434 446 429 428 462 495 479 413 345 321 337 344 309 260 259 319 387 408 394 395 420 425 391 357
727 357 353 350 311 264 270 325 362 343 306 294 294 273 244 248 287 327 350 372 394 388 344 298 290 308 321 327 353 396 429 441 451 460 451 431 439 489 528 504 435 387 377
722 377 368 340 330 363 400 390 341 306 304 309 305 316 358 399 402 375 362 372 376 357 343 362 400 429 449 479 506 495 446 399 384 383 370 360 374 399 404 385 373
717 373 395 448 501 516 476 407 363 361 370 362 360 393 438 454 445 441 442 424 396 394 416 414 382 364 383 401 386 369 385 411 405 378 380 420 458 459 427 390 373 381 393 385
712 385 366 366 385 386 351 315 318 347 371 387 400 386 344 320 353 401 400 369 384 453 507 507 499 515 515 455 370 321 317 319 309 298 299 319 369 442 502 513 484 456
707 456 456 479 496 485 451 423 435 477 504 485 435 386 359 369 417 471 480 438 393 385 397 394 382 391 419 447 469 494 507 488 450 425 417 413 417 445 478 478 445 424
702 424 442 474 490 489 481 462 430 403 407 444 486 508 503 484 474 473 469 458 462 488 509 493 456 432 414 370 309 291 340 409 441 438 436 442 434 412 396 408 457 533 597
697 597 609 578 562 591 627 622 594 587 606 620 622 634 646 631 586 548 536 538 550 582 614 606 558 524 537 569 585 585 581 561 528 519 547 569 552 532 559 608 616 581
693 581 567 597 632 652 691 759 792 739 637 572 561 553 513 465 457 500 566 606 586 519 460 457 500 541 558 568 583 590 575 552 548 567 584 570 526 494 518
688 518 586 637 627 585 570 587 586 550 521 532 556 554 537 545 583 618 635 651 675 699 717 743 774 789 780 766 763 760 742 715 701 695 669 615 560 543 576 634 677
683 677 683 666 652 650 653 666 700 750 784 780 765 780 828 873 888 874 840 787 735 722 752 778 761 724 715 740 764 775 791 810 802 766 750 783 829 845 842 859 892
678 892 901 875 851 859 894 931 955 961 952 945 958 982 992 985 993 1036 1097 1143 1158 1152 1139 1140 1162 1197 1233 1270 1314 1351 1364 1367 1386 1414 1416 1395 1405 1467 1522 1522 1503 1530 1597
673 1597 1638 1634 1636 1683 1757 1816 1848 1851 1824 1785 1777 1825 1904 1971 2018 2056 2087 2105 2117 2143 2195 2270 2359 2447 2522 2589 2663 2746 2818 2849 2837 2820 2852 2954 3096 3217
669 3217 3292 3354 3450 3576 3692 3785 3888 4018 4142 4221 4269 4343 4472 4636 4797 4938 5069 5208 5357 5507 5647 5786 5939 6109 6296 6505
666 6505 6736 6969 7183 7394 7644 7935 8222 8485 8758 9076 9420 9754 10095 10484 10927 11391 11868 12384 12953 13561 14191 14859 15587
663 15587 16387 17262 18203 19191 20222 21331 22570 23948 25437 27019 28712 30538 32519 34701 37148 39887 42888 46133
661 46133 49670 53568 57834 62415 67243 72246 77322 82344 87184 91709 95746 99102 101616 103194 103781 103328 101804 99232
659 99232 95707 91394 86515 81304 75969 70665 65512 60608 56028 51805 47928 44368 41111 38166 35525 33144 30965
657 30965 28967 27166 25559 24099 22739 21482 20358 19356 18424 17531 16691 15932 15257 14652 14102 13586 13072 12554 12064 11626
654 11626 11223 10820 10409 10017 9653 9304 8969 8665 8402 8150 7874 7579 7305 7072 6857 6623 6366 6119 5901 5702 5510 5332 5180
651 5180 5038 4872 4679 4497 4356 4247 4140 4021 3897 3781 3690 3634 3601 3552 3465 3359 3265 3181 3102 3049 3038 3032 2967 2847 2759 2766 2825 2846 2804 2738
648 2738 2687 2644 2599 2558 2536 2530 2519 2483 2416 2345 2305 2300 2290 2243 2184 2156 2155 2134 2078 2019 1994 1996 2001 1994 1974 1943 1916 1909 1926 1946 1952 1940 1900 1828 1748 1707 1727 1774 1806
643 1806 1817 1820 1806 1764 1710 1683 1689 1693 1662 1605 1562 1568 1615 1662 1672 1663 1680 1729 1757 1725 1668 1649 1675 1688 1657 1611 1590 1587 1572 1545 1529 1531 1540 1547 1560 1587 1621 1647 1642 1592
638 1592 1509 1433 1402 1419 1452 1465 1450 1425 1403 1376 1332 1287 1274 1298 1314 1275 1198 1150 1173 1231 1261 1245 1217 1211 1215 1208 1186 1172 1178 1189 1179 1142 1090 1042 1012 1004 1018
633 1018 1048 1084 1121 1159 1184 1180 1146 1102 1066 1045 1049 1092 1160 1210 1206 1164 1122 1094 1064 1029 1001 982 958 933 928 952 987 1014 1029 1019 967 885 828 826 852 859 849 856
629 856 882 885 845 800 795 829 861 872 880 903 929 928 898 853 804 758 734 758 816 863 874 867 861 837 780 729 733 780 811 813 824 855 862 822 784 794 821 805 750 707
624 707 699 697 677 649 632 632 650 683 713 718 708 715 745 766 746 691 631 597 599 632 679 721 747 745 706 644 601 609 646 661 635 605 608 646 688 706 691 658 634 627
619 627 621 600 584 604 650 680 671 643 616 592 578 594 640 669 650 605 580 574 547 494 457 473 524 568 590 602 607 591 552 506 467 443 450 500 567 598 577 557
614 557 586 640 661 645 643 667 676 653 638 657 676 664 644 652 669 667 659 662 643 575 506 499 529 523 490 511 602 676 677 653 657 665 637 598 583 574 542 514 527 552 534
609 534 493 498 561 618 620 582 541 510 493 498 521 552 583 616 631 602 532 461 432 456 512 565 585 573 556 548 546 551 578 611 602 533 466 464 513 542 533 520 530 541
605 541 537 521 502 485 490 531 574 572 540 530 541 516 442 386 402 458 501 536 590 645 652 605 543 500 481 475 469 448 424 428 465 492 482 461 469 497 510 508 526 565
600 565 591 585 572 579 606 637 653 634 577 518 500 525 552 553 540 535 540 551 565 578 584 590 604 607 578 538 531 567 608 629 642 649 609 510 413 393 441 483 491 501 535
595 535 550 510 445 410 415 433 454 495 557 614 646 654 637 594 546 525 535 541 522 503 509 516 489 437 405 412 433 450 472 505 528 522 506 504 517 531 543 558 564 545
590 545 505 474 477 510 549 560 534 493 472 476 477 469 478 517 554 555 541 545 557 544 517 520 555 571 552 535 549 562 546 529 544 572 573 560 570 593 583 537 503 510
585 510 529 525 508 509 529 546 538 509 486 506 575 646 659 618 584 589 593 556 508 504 536 552 541 553 611 669 680 662 662 692 719 724 718 719 730 744 758 767 770 775 789 809
580 809 834 876 950 1046 1134 1199 1252 1314 1393 1477 1537 1541 1475 1366 1265 1198 1152 1102 1051 1018 1006 998 980 956 937 929 930 947 998 1089 1204 1304 1366 1398 1421
575 1421 1432 1403 1331 1246 1174 1106 1030 967 939 924 885 830 806 829 854 842 814 812 842 877 896 896 876 846 841 896 996 1087 1132 1145 1157 1174 1185 1179 1161 1145
571 1145 1141 1142 1129 1097 1070 1071 1081 1066 1031 1026 1070 1120 1141 1161 1239 1382 1545 1704 1866 2020 2120 2130 2060 1943 1811 1691 1597 1507 1384 1233 1114
567 1114 1069 1076 1092 1106 1128 1145 1139 1122 1113 1106 1084 1069 1104 1186 1270 1332 1396 1470 1524 1538 1550 1604 1685 1733 1726 1696 1675 1651 1594 1507 1423 1366 1330 1290 1237 1186 1165
563 1165 1183 1218 1238 1232 1221 1238 1298 1387 1479 1560 1621 1639 1582 1466 1355 1288 1230 1133 1013 940 933 950 959 979 1016 1026 982 934 949 1022 1100 1171 1266 1393
559 1393 1511 1596 1663 1724 1755 1730 1671 1634 1641 1655 1614 1507 1394 1350 1374 1391 1347 1273 1226 1199 1143 1063 1017 1021 1015 951 868 827 820 795 740 705 723 764 782
554 782 771 765 791 838 875 887 883 874 862 847 836 834 829 810 789 792 819 835 824 808 813 832 836 812 781 769 779 795 802 801 806 815 810 786 768 787 829 854 849 846 865 884 869
549 869 828 790 764 742 728 735 765 800 830 857 877 886 888 891 900 911 922 939 968 1002 1027 1032 1022 1021 1049 1100 1141 1153 1141 1117 1087 1060 1059 1092 1140 1178 1208 1240 1255
544 1255 1230 1185 1180 1247 1352 1424 1427 1390 1364 1378 1422 1464 1491 1516 1560 1618 1662 1673 1656 1638 1637 1657 1690 1725 1750 1760 1761 1768 1793 1829 1855 1862 1863 1877 1906 1945 1990 2041
540 2041 2083 2099 2092 2084 2096 2142 2223 2322 2406 2460 2513 2592 2683 2754 2803 2850 2887 2894 2895 2951 3069 3189 3272 3356 3479 3612 3713 3796 3898 4008 4093 4172 4293
536 4293 4453 4606 4749 4917 5116 5305 5472 5655 5870 6086 6294 6545 6874 7229 7534 7796 8085 8440 8833 9228 9636 10078 10551
533 10551 11040 11546 12099 12713 13370 14039 14713 15411 16147 16897 17624 18314 18982 19641 20283 20886 21436 21927 22357 22730 23049 23301 23468
530 23468 23548 23571 23581 23598 23610 23592 23545 23501 23504 23566 23662 23776 23935 24181 24516 24904 25314 25751 26244 26811 27453 28170 28976 29891 30910 31987
527 31987 33068 34128 35166 36175 37148 38094 39013 39834 40447 40812 40995 41057 40971 40680 40210 39621 38912 38043 37038 35995 34972
524 34972 33948 32906 31886 30934 30048 29211 28425 27693 26992 26317 25706 25194 24769 24396 24070 23811 23623 23492 23394 23319 23283 23313 23405 23505
521 23505 23550 23549 23572 23653 23738 23752 23677 23553 23406 23220 22971 22664 22327 21982 21619 21216 20771 20304 19830 19357 18903 18487 18105 17732 17383 17105
518 17105 16907 16739 16582 16486 16482 16520 16557 16646 16855 17144 17417 17659 17948 18342 18851 19475 20207 21013 21870 22808 23847 24968 26204 27686
515 27686 29526 31756 34473 37920 42347 47969 55224 64873 77530 93148 110967 129462 145856 156300 157863 150907
513 150907 138917 125570 112360 99210 86444 75192 66229 59387 54202 50457 47952 46299 45203 44634 44572 44862 45430
511 45430 46357 47654 49197 50967 53107 55693 58677 62084 66050 70635 75804 81612 88146 95278 102709 110212 117559 124236
509 124236 129571 133200 135150 135523 134464 132429 130105 128028 126613 126504 128455 132990 140704 152879 171067 195858 226336
507 226336 260148 292772 316921 325165 315246 292292 264437 236508 208884 181399 155954 134882 118612 106106
505 106106 96543 89563 84548 80738 77879 76067 75149 74802 74982 75817 77206 78957 81164 84068 87691 91971 97100 103396
503 103396 110948 119713 129824 141460 154483 168449 182841 196945 209591 219385 225297 226948 224509 218597 210157
501 210157 200166 189415 178655 168736 160413 154215 150722 150716 154742 162599 173349 185255 195324 199666 195656 184102
499 184102 168600 152470 136785 121355 106586 93606 83087 74810 68301 63283 59480 56500 54079 52192 50829
497 50829 49869 49218 48879 48836 49021 49414 50071 51024 52283 53915 56008 58581 61627 65228 69485 74351 79645 85212 90898 96365
495 96365 101053 104401 106048 105846 103826 100213 95373 89683 83458 76998 70602 64501 58804 53560 48807 44565 40813 37513
493 37513 34625 32094 29857 27863 26072 24445 22955 21608 20408 19325 18326 17413 16603 15871 15178 14528 13947 13425 12926 12453
490 12453 12046 11698 11352 10981 10626 10317 10020 9690 9350 9047 8785 8524 8245 7974 7737 7527 7322 7117 6925 6754 6592 6412 6213
487 6213 6028 5894 5805 5716 5579 5395 5211 5092 5065 5082 5058 4942 4768 4609 4506 4444 4385 4311 4229 4152 4091 4043 3996 3941 3877 3813 3758 3707 3641 3552
484 3552 3473 3456 3498 3513 3434 3309 3245 3262 3265 3189 3083 3030 3031 3026 2996 2959 2915 2859 2826 2856 2916 2928 2879 2840 2860 2901 2903 2860 2808 2769 2748 2749 2762 2761 2734 2706 2697
479 2697 2688 2644 2578 2540 2548 2558 2516 2434 2367 2339 2312 2251 2191 2193 2257 2308 2291 2227 2168 2128 2090 2050 2028 2033 2054 2077 2088 2074 2042 2016 2002 1972 1911 1857 1858 1900 1929
475 1929 1927 1922 1925 1915 1879 1837 1809 1795 1794 1809 1830 1842 1849 1862 1870 1851 1823 1827 1860 1863 1806 1734 1697 1686 1665 1633 1620 1635 1644 1618 1572 1545 1564 1616 1661 1677 1678 1684 1680 1647 1601
470 1601 1581 1593 1604 1600 1602 1610 1591 1536 1496 1513 1569 1615 1627 1610 1575 1539 1519 1517 1514 1504 1507 1523 1525 1506 1511 1566 1623 1621 1568 1517 1492 1477 1468 1479 1499 1508 1505 1509 1510 1494 1481 1504
465 1504 1545 1554 1524 1495 1483 1463 1433 1427 1451 1451 1404 1358 1361 1377 1348 1286 1263 1309 1382 1421 1403 1341 1273 1245 1282 1352 1392 1368 1302 1236 1202 1217 1274 1336 1364 1360 1359 1378
460 1378 1390 1374 1353 1355 1367 1354 1310 1266 1242 1227 1221 1247 1313 1379 1398 1369 1329 1296 1263 1232 1227 1246 1254 1231 1213 1234 1265 1255 1210 1195 1240 1295 1299 1256 1219 1220 1243 1256
455 1256 1251 1239 1241 1268 1306 1321 1300 1262 1238 1228 1216 1208 1224 1258 1275 1265 1260 1279 1288 1251 1191 1169 1201 1248 1273 1290 1313 1324 1309 1296 1322 1374 1405 1402 1397 1416 1451 1492
451 1492 1551 1639 1743 1845 1935 1995 1991 1914 1798 1691 1608 1539 1481 1431 1383 1336 1310 1310 1310 1286 1259 1273 1326 1370 1375 1359 1351 1362 1390 1428 1450 1426 1377 1358 1387
446 1387 1417 1415 1424 1490 1580 1614 1580 1549 1569 1605 1617 1628 1687 1791 1882 1926 1940 1956 1985 2035 2123 2252 2407 2573 2751 2919 3023 3018 2927 2814 2709 2581
442 2581 2409 2222 2064 1938 1817 1699 1613 1575 1566 1561 1562 1576 1592 1590 1564 1531 1519 1537 1559 1548 1503 1463 1461 1478 1479 1472 1498 1561 1626 1670 1716 1779 1842 1888 1937
438 1937 2006 2080 2139 2194 2262 2323 2352 2354 2351 2339 2307 2281 2304 2382 2478 2564 2622 2616 2507 2323 2156 2070 2030 1968 1870 1775 1719 1697 1688 1673 1650 1625 1606 1583 1541
434 1541 1488 1448 1421 1387 1356 1364 1412 1443 1413 1357 1340 1378 1430 1466 1476 1454 1405 1376 1399 1439 1433 1384 1360 1398 1459 1497 1516 1531 1541 1551 1586 1637 1646 1591 1533 1541 1591
429 1591 1606 1563 1503 1447 1373 1275 1192 1153 1138 1116 1095 1098 1120 1137 1138 1131 1118 1095 1065 1035 1014 1010 1027 1048 1047 1026 1017 1039 1062 1050 1009 981 988 1008 1013 1002 996 1012 1050
425 1050 1090 1102 1078 1039 1007 986 968 966 992 1031 1047 1034 1025 1033 1030 995 955 941 935 892 823 796 850 934 969 933 878 862 893 941 969 964 947 945 957 945 883 800
420 800 759 783 835 876 905 940 974 983 962 933 910 894 892 914 951 974 975 970 970 966 952 941 946 964 987 1016 1040 1026 959 874 826 831 856 873 885 894 879 828 775 771
415 771 814 850 833 788 777 816 861 876 877 894 926 943 948 960 975 959 911 875 874 873 848 834 874 940 976 988 1021 1070 1076 1021 957 925 909 898 922 979 1008 970
410 970 918 916 937 915 861 842 871 897 903 931 985 1002 947 878 854 845 796 728 713 755 790 780 764 785 822 832 807 774 750 741 746 755 743 701 655 644 668 695
406 695 709 727 760 797 816 819 816 810 798 792 804 822 821 797 780 800 839 853 823 780 766 786 809 820 828 839 835 806 789 833 919 963 914 821 776 800 826 805 765
401 765 761 801 851 884 893 873 830 794 796 821 820 771 706 662 646 653 688 752 807 813 776 746 757 793 819 826 826 823 810 792 780 771 749 719 714 750 789 783 733 686 661
396 661 640 618 624 675 742 788 805 806 786 742 705 707 729 726 698 686 704 724 735 762 815 859 863 835 798 756 709 684 692 708 694 657 633 628 626 626 648 693 736 759
391 759 768 765 736 680 622 597 617 671 731 777 806 840 884 911 884 811 748 736 761 783 783 773 764 751 725 694 677 679 682 675 675 710 762 780 740 685 657 645 615
386 615 586 602 651 674 666 693 787 885 906 859 811 792 777 744 712 704 724 760 790 786 748 725 759 819 837 797 765 786 824 817 768 737 757 798 815 797 766
382 766 747 745 753 756 750 736 711 675 640 629 650 688 724 758 789 812 820 814 797 767 740 744 787 838 862 857 847 832 790 712 633 604 653 757 861 912 906 879 866
377 866 855 825 786 764 757 743 729 742 776 786 761 742 766 806 821 819 828 843 834 807 793 802 802 773 738 723 725 728 725 717 709 703 700 696 692 699 726 761 784 791 788 774 748 724
372 724 725 751 784 811 820 790 728 693 732 815 862 856 850 871 873 823 760 737 742 743 748 788 851 901 926 931 911 873 869 924 978 950 866 830 883 955 974 951 926 911
367 911 904 920 956 975 950 905 869 836 796 772 792 836 866 874 874 871 864 867 892 915 901 851 792 753 743 760 785 800 817 864 928 942 881 812 826 918 1009 1054
362 1054 1073 1096 1124 1153 1180 1181 1138 1088 1089 1129 1136 1084 1037 1051 1087 1079 1033 1010 1040 1092 1131 1144 1139 1138 1163 1221 1274 1273 1208 1113 1032 991 992 1008 1000 959 918 903 907 905
357 905 896 887 877 870 885 928 964 970 978 1026 1085 1093 1060 1058 1109 1152 1133 1091 1087 1117 1131 1119 1122 1163 1223 1262 1250 1189 1118 1086 1098 1118 1135 1193 1312 1422 1442 1396 1379
352 1379 1417 1440 1410 1381 1411 1470 1497 1483 1463 1450 1438 1440 1461 1467 1440 1429 1494 1605 1666 1653 1640 1679 1725 1715 1665 1635 1640 1649 1650 1667 1704 1733 1735 1720 1710 1715 1733 1752
348 1752 1751 1725 1704 1720 1772 1819 1836 1834 1842 1873 1927 1996 2056 2083 2080 2083 2118 2161 2163 2105 2021 1971 1981 2027 2059 2052 2026 2025 2061 2104 2112 2090 2074 2089 2114 2110 2075 2050 2072 2126
343 2126 2164 2154 2114 2086 2093 2126 2165 2194 2199 2169 2110 2055 2036 2058 2098 2132 2151 2165 2187 2219 2250 2260 2239 2203 2193 2229 2279 2289 2255 2228 2242 2255 2208 2110 2033 2010
338 2010 2001 1965 1920 1908 1929 1960 1989 2017 2035 2031 2026 2047 2086 2110 2100 2068 2031 2002 1992 1996 1990 1961 1930 1917 1895 1835 1769 1763 1825 1883 1881 1843 1819 1822 1831 1836 1842 1854 1874 1903
334 1903 1922 1907 1866 1846 1882 1949 1998 2008 1991 1958 1912 1862 1817 1779 1757 1766 1802 1835 1844 1832 1806 1762 1713 1693 1707 1713 1682 1644 1628 1613 1566 1515 1511 1545 1558 1532 1498
329 1498 1472 1434 1386 1358 1355 1341 1312 1306 1333 1352 1339 1332 1357 1378 1347 1284 1246 1255 1292 1340 1391 1413 1383 1320 1273 1261 1266 1272 1273 1265 1252 1257 1291 1318 1296 1238 1193 1181 1171
324 1171 1143 1116 1106 1096 1059 1003 962 960 995 1035 1036 984 910 861 840 820 798 803 837 856 835 806 808 824 812 768 725 702 696 707 736 766 772 761 761 768 749 707 695
320 695 738 782 764 697 650 646 644 610 574 581 626 668 678 665 649 637 627 617 603 580 548 516 503 515 530 515 475 469 540 645 696 666 624 635 674 678 643
315 643 620 622 606 547 490 490 537 578 582 562 546 536 521 498 489 510 543 552 531 523 559 607 615 583 563 571 573 558 563 605 637 617 575 569 596 608 590 576 589 604 596
310 596 569 550 558 595 640 656 622 566 527 509 489 467 476 524 570 578 552 520 500 504 533 574 593 579 561 572 612 654 677 671 639 599 576 564 533 473 423 421
305 421 453 473 467 466 489 517 523 512 512 538 571 580 554 513 484 468 450 432 432 460 498 519 515 486 444 414 425 487 566 627 655 655 633 612 624 666 684 635 550
301 550 492 488 512 540 569 583 561 519 507 549 606 627 613 595 584 565 525 473 430 423 465 529 559 530 481 464 480 490 482 487 527 568 559 497 441 442 498 558
296 558 587 589 580 557 517 481 472 481 485 496 542 606 622 570 515 514 542 541 510 499 519 538 550 572 592 564 498 470 517 576 575 537 520 526 506 463 454 496 535 527 498
291 498 498 522 535 522 501 489 490 502 517 529 536 546 562 573 569 556 551 545 521 472 420 395 401 422 439 452 469 486 485 465 449 458 485 506 512 515 514 497 460 422 402
286 402 406 434 481 525 543 540 546 570 577 543 494 467 453 423 394 419 507 599 633 610 569 533 496 462 442 440 445 446 442 435 430 435 455 481 498 503 505 513 521 518 500 470 440
281 440 417 405 400 404 424 456 489 510 522 535 549 546 515 466 432 431 452 466 459 443 438 444 442 417 384 379 415 460 472 453 454 503 562 568 519 466 448 460 490 538 589
276 589 602 567 524 512 509 478 427 396 394 396 401 425 452 451 428 425 447 448 413 387 408 455 488 506 531 562 578 574 552 518 492 504 552 586 571 529 494 468 444
271 444 445 481 506 483 451 480 560 617 620 609 606 576 497 424 408 427 427 410 425 491 564 597 581 544 512 496 493 492 481 458 424 389 366 369 392 417 427 426 435 472
266 472 524 546 504 426 388 427 494 519 500 480 466 433 389 386 438 493 500 467 429 406 409 446 499 519 494 477 515 574 593 571 553 551 537 507 487 490 500 514
261 514 552 605 631 612 595 621 662 663 621 583 570 552 506 466 477 531 568 562 543 537 513 438 345 307 341 393 421 447 497 546 562 554 544 525 477 422 398
257 398 411 437 466 508 551 562 535 503 495 497 484 448 411 402 431 472 486 467 449 460 480 478 461 456 464 467 468 480 491 474 447 451 481 489 454 415 412 432 444 431 399
252 399 356 326 332 358 362 338 329 359 398 409 401 406 424 438 441 438 429 420 425 436 425 392 377 412 471 510 519 510 490 470 476 516 554 561 546 539 539 534 535 543 537 505 483 502 531
246 531 518 472 445 445 444 439 456 488 489 450 416 418 430 420 396 382 386 411 462 516 528 491 443 410 376 334 314 341 386 411 415 420 422 409 396 404 423 433 439 461 493
241 493 507 495 469 436 390 352 363 434 526 583 585 547 499 456 426 409 409 427 450 466 476 492 512 513 489 460 450 451 436 402 379 394 443 493 510 490 455
237 455 430 414 387 348 314 301 307 332 383 445 482 479 455 435 413 388 381 406 429 409 356 323 339 378 407 424 442 469 498 512 498 460 427 421 432 433 420 408
232 408 406 416 440 472 484 460 427 422 430 411 365 336 333 318 277 262 317 404 456 461 450 430 383 324 302 335 387 426 459 491 495 453 398 382 419 475 509 503 459
227 459 392 335 314 321 326 321 336 391 463 510 518 502 470 427 389 384 414 453 485 514 541 545 521 499 499 503 477 425 377 343 316 309 357 458 554 586 549 492 461
223 461 464 470 446 402 388 429 488 514 513 522 540 529 480 431 403 379 352 349 374 387 364 344 367 411 435 450 488 527 526 498 494 518 518 476 441 453 483 489 477 481
218 481 512 549 572 566 525 471 438 438 445 441 448 491 548 564 517 446 407 419 447 453 442 457 516 566 544 460 400 412 452 453 422 411 436 461 467 480 523 574 603
213 603 609 609 606 584 539 488 448 421 401 384 368 355 349 363 407 461 481 453 419 432 480 498 461 434 476 551 563 491 413 393 407 402 377 371 387 386 363 359 401
208 401 451 455 409 366 365 383 378 354 361 422 488 491 435 395 422 482 514 509 496 475 425 364 357 423 494 497 440 395 395 414 424 426 424 404 370 358 391 436 451 440 437
203 437 446 440 418 419 466 525 535 489 430 406 424 449 445 402 341 303 314 360 406 429 438 452 471 476 459 444 463 511 549 547 517 497 499 500 470 418 384 392 421 431
198 431 414 411 463 545 587 554 502 505 573 639 643 590 525 485 474 475 464 430 384 359 378 430 483 510 504 468 419 387 389 411 420 404 389 404 443 471 464 436 421
193 421 433 451 450 439 449 494 557 614 641 627 575 518 494 504 505 470 426 423 462 493 467 396 345 366 445 517 533 510 492 492 484 464 455 466 473 466 478 520 549
189 549 521 464 432 429 419 393 381 397 424 455 487 499 465 421 432 498 546 536 510 513 519 497 479 513 564 548 459 385 389 428 424 375 351 392 458 482 457 440
184 440 466 498 483 434 417 449 472 441 388 369 381 384 365 349 351 366 397 448 489 482 437 408 422 451 457 435 400 364 336 322 317 308 299 301 300 286 286 348 459 538
179 538 521 438 370 364 399 435 445 439 450 501 569 604 585 540 502 472 443 428 433 429 384 307 247 237 268 310 340 347 341 346 381 435 482 502 484 436 386 374 413
174 413 471 509 519 505 463 391 327 312 347 391 422 448 472 470 424 357 316 315 324 315 307 341 414 469 458 404 372 385 405 396 369 353 353 369 411 464 481 436 372
170 372 349 367 381 376 371 371 364 354 358 361 331 280 272 336 429 497 523 513 470 418 395 401 389 331 270 265 309 350 361 363 379 400 405 390 378 401 460 509 489 405 326
165 326 304 324 347 367 392 408 403 403 430 460 454 423 407 404 377 332 326 378 438 455 447 454 467 444 388 360 390 429 416 361 340 398 488 529 502 455 428 423 433
160 433 461 494 494 452 410 404 409 389 368 394 449 473 454 443 458 450 380 286 237 246 276 297 310 325 337 338 327 318 333 376 415 414 380 362 382 410 414 400 393 400 412
155 412 423 427 420 414 424 431 400 336 303 337 382 363 295 269 332 420 445 393 332 331 398 476 504 474 432 431 470 504 498 461 428 427 449 472 484 496 514 523 508 493
150 493 512 552 563 533 504 503 492 437 374 355 370 374 370 405 480 532 514 456 411 395 397 412 433 446 449 446 429 389 341 326 358 403 425 424 426 442 467 484 481 461
145 461 450 465 482 463 414 383 391 413 421 418 413 405 394 391 382 348 317 346 429 474 433 367 356 380 373 340 346 397 430 419 400 386 352 305 306 372 431 421 383 391 439
140 439 455 410 355 347 380 421 447 456 446 423 403 395 393 388 388 409 454 501 524 509 465 412 373 359 369 390 404 408 409 405 385 351 324 324 338 338 316 292 290 304 309 292
135 292 272 285 338 389 384 332 300 329 383 399 376 359 370 388 397 410 430 443 441 436 436 430 414 400 389 373 355 359 389 416 422 422 438 457 460 461 489 537 560 530 471
130 471 433 441 476 494 478 455 455 468 466 448 445 465 474 447 406 385 382 377 375 396 443 486 498 472 428 407 429 459 438 365 308 315 362 397 413 426 423 389 344 324
125 324 333 349 373 411 435 418 393 422 494 529 491 436 423 430 415 388 390 421 441 427 404 401 419 441 451 448 443 450 471 491 488 455 404 364 360 381 390 366 338 344 372
120 372 385 384 412 476 527 530 501 462 410 348 321 351 389 373 318 299 345 402 416 392 372 370 366 346 325 327 354 384 391 380 372 373 368 355 347 354 359 350 339 345 362 379
115 379 395 412 424 429 439 457 471 477 487 506 510 480 434 406 405 425 456 477 450 378 322 341 406 442 422 397 405 432 447 453 455 449 437 444 479 502 464 371 286 268
110 268 315 365 364 327 314 340 359 334 301 321 379 405 374 339 350 390 413 411 409 425 450 466 454 423 403 408 408 366 306 289 326 363 369 372 390 391 352 317 336
105 336 388 418 423 448 505 557 570 546 498 432 371 344 357 387 411 427 433 429 422 427 447 469 474 456 426 407 422 458 478 465 448 456 479 493 500 511 505 455 388 361
100 361 386 418 414 383 353 334 319 304 292 292 318 368 412 430 438 459 470 434 364 319 328 358 376 389 407 415 402 383 369 349 318 312 350 402 418 394 368 364 388
96 388 445 524 582 570 495 420 396 413 431 437 447 465 472 452 421 417 452 500 520 502 468 435 400 365 345 356 398 448 479 470 430 390 370 358 344 349 401 469
91 469 489 450 409 411 433 430 403 375 362 365 382 394 368 316 294 326 359 342 309 324 380 418 422 430 449 442 397 355 347 354 354 358 384 418 441 445 435 414 397 396 400 390
86 390 377 397 446 485 498 512 532 522 473 430 425 431 415 400 415 438 431 408 403 411 409 408 427 435 396 346 358 434 498 511 506 511 502 466 437 437 434 399 360 350 346 313 269
80 269 264 300 343 378 416 444 438 409 395 402 397 374 370 399 422 408 385 403 453 483 470 444 438 446 441 422 415 437 479 507 504 484 479 498 516 505 463 415 385 385 408 424
75 424 401 342 298 317 380 418 401 372 384 435 484 504 501 480 444 413 418 451 460 412 342 322 370 426 430 382 333 319 334 360 388 419 445 461 477 502 532 550
71 550 536 489 434 412 449 508 518 451 368 344 376 396 373 348 356 357 305 226 190 218 264 291 315 358 410 440 439 419 395 382 395 416 411 378 362 397 447 458
66 458 435 427 447 452 416 379 387 426 442 423 409 431 467 478 456 433 436 469 510 535 533 522 526 543 542 507 460 431 418 398 373 361 364 361 356 379 433 470 453 413 407
61 407 443 471 459 421 385 357 332 314 308 303 295 292 305 330 351 349 316 273 264 319 404 447 421 370 342 335 328 331 366 419 447 438 417 404 399 402 424 454 465 456 455 479 504
56 504 499 475 460 461 466 475 500 530 528 474 405 372 391 425 436 427 432 465 506 520 498 457 420 399 392 387 370 339 312 312 340 366 363 337 322 341 376 394 393 403 435 454
51 454 421 354 310 311 318 307 305 340 388 404 390 386 413 448 473 493 510 510 494 475 452 408 357 349 406 485 520 487 412 328 262 243 284 355 401 393 351 322 337
46 337 395 457 479 443 378 334 338 375 404 397 361 334 346 380 392 360 306 261 233 216 221 266 345 420 451 429 381 346 342 352 354 361 395 433 426 372 336 365 420
41 420 435 408 389 390 383 364 369 410 448 446 418 393 385 394 421 456 468 448 423 423 439 451 456 457 447 428 423 451 489 506 510 535 589 649 694 722 736 723 682 624 562
36 562 501 447 411 397 396 402 414 428 439 442 436 422 409 414 439 459 448 415 398 418 454 470 449 402 360 346 359 366 352 343 380 452 503 501 471 447 430 413 410 427
31 427 433 403 363 356 378 387 366 336 312 284 260 274 337 407 436 414 364 320 304 320 339 328 300 310 371 424 418 373 342 327 296 262 268 318 362 369 364 379 406
26 406 431 454 467 452 413 389 396 394 350 293 267 254 207 142 132 204 301 355 363 362 372 381 372 340 298 277 297 336 347 324 311 338 379 391 376 362 352 330 307
22 307 312 338 345 324 313 337 360 342 301 278 277 275 275 295 320 306 261 244 284 339 362 367 374 361 302 242 243 286 292 251 249 331 431 457 417 384 385 390 373 347 326
17 326 315 319 340 356 355 363 401 437 422 377 363 381 368 306 265 299 370 407 399 381 363 338 321 335 363 367 344 322 315 316 322 326 302 239 190 227 350 475 523
12 523 490 428 380 362 366 378 382 382 388 396 389 365 345 340 343 339 326 314 310 316 327 334 338 347 364 369 343 295 262 267 303 348 375 367 340 336 377 431 453 445 444 456 449 414 391 405
6 405 425 418 402 413 447 463 437 386 345 337 352 353 317 268 256 294 338 353 348 351 363 380 413 464 492 464 405 375 384 393 377 355 350 356 361 371 382 374 343 318 327 351
1 351 351 322 299 310 342 360 347 319 297 287 293 324 375 417 422 405 408 432 429 379 332 345 401 445 463 482 498 475 419 387 405 431 426 416 435 468 472 451 438 443
-4 443 435 398 351 319 310 314 318 311 302 317 365 411 415 382 358 364 371 350 312 289 280 266 248 254 294 338 343 310 278 278 304 333 353 364 364 356 358 382 405 403 384 380 388 382 359 355
-9 355 382 395 358 305 290 309 309 274 242 241 247 234 215 222 248 256 221 170 156 194 248 265 240 224 258 321 366 380 391 414 431 428 411 392 373 358 349 346 336 321
-14 321 309 299 283 268 268 284 301 319 347 377 383 369 371 393 393 347 292 277 299 319 331 348 361 347 321 316 332 329 301 289 318 360 381 395 426 465 480 469
-19 469 459 456 440 387 316 273 293 363 421 418 375 358 393 433 426 385 364 382 402 384 335 292 279 285 284 262 244 270 345 411 415 381 378 430 483 479 431 391 367
-24 367 330 269 221 218 251 286 304 308 309 318 336 344 311 237 171 173 245 330 368 364 367 403 449 465 453 450 474 492 463 389 326 318 350 378 389 410 453 485 472 425
-29 425 391 390 396 381 349 327 326 344 372 393 377 318 258 252 299 348 368 378 402 423 417 399 405 425 420 387 369 377 372 328 282 277 297 298 277 272 286 283 250 228 248 287
-34 287 304 300 307 338 366 356 296 213 160 179 259 341 382 394 412 435 436 415 397 392 386 370 357 349 328 299 299 343 398 417 404 383 354 294 219 183 220 301 370
-38 370 399 391 353 298 252 237 240 232 202 176 179 211 249 292 355 432 468 422 328 275 303 354 345 279 236 273 362 433 454 436 409 396 408 433 440 415 379 354
-43 354 342 343 370 415 425 356 245 182 208 275 320 332 332 316 271 214 182 180 186 193 222 284 355 400 411 393 363 342 346 364 362 336 318 324 324 291 258 279 349
-48 349 397 380 333 303 292 276 264 282 320 335 314 295 311 345 365 372 388 403 386 335 294 293 312 305 259 210 200 230 270 292 288 272 262 266 278 284 280 281 302
-53 302 337 362 365 361 363 366 353 328 310 307 304 294 292 315 356 386 388 370 356 356 362 365 372 395 426 436 406 360 341 360 386 388 365 339 326 336 363 383 368 317 268 256
-58 256 272 289 300 315 332 342 346 350 344 313 275 265 290 318 334 348 358 345 314 316 380 463 500 475 425 382 358 352 357 349 328 327 366 406 393 337 299 302 310 305 321
-63 321 375 418 406 364 352 368 364 323 285 286 316 342 349 347 352 370 389 385 348 308 301 336 390 432 443 417 368 329 319 315 287 247 234 250 260 252 257 292 323 311
-68 311 275 263 291 328 351 364 376 383 372 341 291 233 190 184 210 245 269 280 287 295 310 337 375 411 428 412 369 328 316 324 322 303 297 319 340 327 295 281 285
-72 285 285 286 307 326 298 237 216 273 354 387 371 352 344 326 294 262 244 241 266 315 348 335 304 309 350 377 369 358 358 342 302 274 291 328 345 340 336 338 335 335 346
-77 346 355 341 322 327 350 354 321 270 226 196 187 209 249 269 249 211 195 217 261 301 319 309 284 264 255 243 219 199 203 231 258 263 255 259 279 294 287 270 270 297 336
-83 336 370 383 367 333 322 374 463 514 489 431 398 387 365 336 331 355 379 396 418 433 408 353 324 342 368 367 353 345 331 311 320 370 413 401 357 330 314
-87 314 278 235 231 274 321 347 367 392 410 418 426 430 406 358 319 310 324 347 369 364 310 239 218 256 291 279 255 260 281 289 296 321 340 317 268 238 234 230 223 239 280
-92 280 312 315 298 272 246 249 302 380 429 429 415 414 405 366 317 300 319 344 354 357 366 382 391 370 310 232 183 195 249 298 314 306 297 296 296 297 310 334 347 332 310 320
-97 320 365 399 385 342 307 293 294 312 341 344 299 248 254 318 379 398 395 392 382 362 358 373 374 340 304 304 337 379 416 429 389 315 291 359 443 433 331 233 199
-102 199 208 230 269 307 302 254 227 257 298 304 289 287 281 243 200 207 260 289 255 197 181 227 299 345 352 346 354 370 362 321 279 264 277 302 326 333 309 269 255 279
-107 279 305 302 287 296 319 321 297 279 285 302 310 299 268 231 215 232 260 274 280 286 279 245 216 230 265 275 275 328 429 479 411 277 187 179 209 233 248 268 293
-112 293 310 312 313 337 394 445 441 389 348 351 358 335 313 339 400 436 429 414 408 389 345 309 319 372 436 478 486 465 438 425 425 425 419 412 400 376 345 319 295 260 220
-117 220 196 198 221 260 314 368 401 411 411 407 395 378 366 353 329 302 289 292 304 329 368 395 380 342 333 359 369 333 287 284 315 335 326 305 282 252 224 223 259
-121 259 307 328 310 275 257 263 270 265 271 309 350 343 301 293 345 393 382 340 325 332 315 275 254 266 275 256 222 202 220 287 384 444 421 352 321 348 377 370 356
-126 356 365 376 366 350 340 321 285 264 282 304 296 284 315 368 386 356 322 304 287 275 308 382 430 401 333 298 308 318 303 283 274 257 224 198 204 221 206
-131 206 158 123 144 211 287 343 371 376 379 403 449 473 440 367 305 278 265 255 257 274 290 306 345 393 389 312 236 248 322 353 294 213 190 225 273 307 326
-135 326 327 316 316 338 358 354 339 333 326 314 325 375 406 349 231 158 181 233 236 199 185 215 260 299 327 327 288 245 250 295 320 294 249 224 220 224 237 253 244 197
-140 197 146 134 156 182 197 207 207 199 206 253 317 344 319 284 277 302 345 388 402 368 309 282 305 337 338 315 297 284 261 232 211 200 201 229 283 324 318 290
-145 290 286 312 335 347 371 418 461 476 467 443 400 343 304 305 334 364 380 380 372 370 383 391 358 279 202 182 227 291 326 315 280 254 255 275 297 321 353 375 359
-150 359 304 248 222 219 225 240 261 272 269 274 298 315 301 279 291 336 370 369 348 327 303 271 246 242 250 251 244 235 228 218 209 210 225 243 248 233 215 214 221 201 147 108 135
-155 135 214 284 319 346 386 408 381 326 299 332 412 493 516 443 301 179 149 196 251 281 306 338 349 315 256 216 214 234 253 253 237 222 232 282 353
-159 353 409 424 401 362 340 348 374 383 355 310 295 327 364 342 250 157 146 220 299 318 291 273 270 250 212 204 251 305 304 253 217 230 266 289 296 298 287 249
-164 249 203 187 214 249 254 238 249 307 379 410 386 336 291 251 216 201 217 250 276 296 320 331 297 227 168 153 156 140 119 142 216 290 315 299 279 269
-168 269 255 243 266 342 425 447 386 294 231 210 211 224 260 315 367 396 403 395 372 344 336 364 407 423 394 341 296 269 250 228 210 209 225 239 235 224 230 252
-173 252 261 241 212 202 218 244 270 293 300 285 264 258 274 306 353 409 444 424 360 305 295 309 302 264 223 216 250 297 321 309 285 278 284 284 276 272 272 259 239 244 290
-178 290 348 383 389 385 385 390 399 394 357 302 269 269 266 236 217 247 305 332 312 274 243 218 203 201 207 223 281 388 475 459 355 259 224 215 205 228 295 344 325
-183 325 281 278 296 278 234 228 263 274 244 226 253 284 286 292 341 406 433 407 354 289 223 186 200 230 225 208 249 353 431 408 324 281 315 372 391 374 350
-187 350 336 336 348 360 343 295 263 288 345 375 365 358 369 363 323 310 384 499 546 488 394 342 336 340 339 336 321 287 248 227 228 244 279 330 372 376 349 322 317
-192 317 347 407 467 475 419 360 361 409 438 425 403 395 384 369 371 392 399 381 379 415 441 413 361 340 342 321 286 290 341 382 385 379 383 369 316 261 246 264 276 273 267
-197 267 260 255 271 309 329 295 236 214 244 282 289 273 260 265 291 330 366 390 410 426 409 346 280 267 290 283 232 207 254 324 348 331 327 351 365 345 318 322
-201 322 359 399 399 343 270 245 289 343 343 293 245 226 220 216 220 230 230 227 238 255 251 228 225 253 274 259 225 207 208 214 222 229 217 184 158 166 200 243 295 355 390 368
-207 368 310 276 285 309 317 313 313 316 312 306 312 321 310 274 242 252 302 339 324 280 265 285 287 248 220 249 294 284 238 241 318 397 408 370 337 312 264 197 148 140 162
-212 162 201 245 269 258 233 234 270 306 305 275 256 267 285 265 200 146 153 204 231 213 202 239 287 291 264 256 269 261 232 230 274 316 319 301 291 275 230 180 170
-216 170 190 195 173 162 181 195 163 112 114 191 276 281 208 152 187 271 305 257 196 197 248 285 278 249 233 238 257 281 295 291 279 275 281 287 279 259 235 220 226 245 254
-221 254 252 260 288 312 314 313 334 356 342 305 296 322 328 283 226 204 209 218 244 308 381 407 385 361 368 379 363 322 288 290 334 395 432 424 401 409 443 446 395 338 323
-226 323 328 309 277 289 349 394 384 357 362 382 363 307 268 282 323 351 350 326 281 230 207 233 290 340 366 377 376 355 315 261 200 151 149 210 297 345 332
-231 332 296 290 333 401 455 460 412 354 340 375 409 405 375 350 332 317 319 347 377 373 336 298 284 291 299 295 272 235 197 172 166 187 245 323 374 376 356 353 365 363 338
-236 338 298 243 184 163 206 274 301 286 287 321 344 326 299 297 302 291 280 286 291 280 281 313 326 272 197 201 303 406 416 344 270 247 261 272 260 236 221
-240 221 220 214 191 155 120 95 95 142 233 318 346 327 307 301 290 278 292 333 359 343 314 303 304 303 316 359 403 404 368 337 323 295 247 218 239 280 286 246 206
-245 206 214 264 311 316 286 258 262 291 317 329 340 360 374 354 307 274 281 312 333 337 339 342 327 298 287 309 331 319 293 304 353 382 352 292 259 262 273 278 285 295
-250 295 291 272 267 291 324 328 306 291 302 319 325 338 381 434 449 418 386 390 405 378 310 253 248 277 300 295 270 241 225 230 249 267 272 264 249 238 246 269 278 257 238
-255 238 267 335 380 365 317 276 248 228 235 281 331 337 292 236 202 199 234 300 360 372 339 303 281 258 230 222 238 247 236 238 285 347 379 375 356 317 247 188
-260 188 206 289 346 321 262 240 254 261 263 301 374 422 414 383 367 351 318 293 313 359 381 361 338 343 365 376 358 310 250 221 254 327 375 365 330 318 328
-264 328 330 311 286 259 225 184 152 140 149 172 196 209 215 230 259 279 270 253 264 299 318 310 313 354 391 368 291 234 247 297 316 295 278 285 285 250 221 250 329
-269 329 392 404 387 364 323 252 184 161 185 230 286 352 400 396 343 290 269 270 270 266 279 318 360 363 309 242 233 290 345 340 299 275 272 254 229 233 259 263 240 242
-274 242 288 335 347 345 353 356 333 306 295 286 267 268 310 353 345 299 266 255 237 216 227 272 306 309 301 302 300 296 309 332 325 282 253 271 295 272 210 161 146 150 171
-279 171 228 300 332 302 252 237 262 296 321 343 356 341 290 232 204 216 245 261 252 239 248 281 303 287 243 207 198 206 221 251 292 320 316 293 284 300 335 382
-284 382 431 454 434 391 365 362 349 314 279 260 246 235 257 316 363 345 277 226 232 287 359 416 427 386 327 295 301 323 347 369 361 300 218 193 245 308 312
-288 312 268 238 240 243 234 240 271 289 258 203 185 221 263 257 214 186 191 193 166 138 148 191 231 265 318 378 381 304 209 175 206 250 276 300 336 359 348 314 283
-293 283 266 261 268 286 305 321 338 348 328 277 237 255 316 349 313 256 250 296 331 320 301 321 366 389 371 328 273 212 172 181 221 243 232 231 266 304 308 291
-298 291 276 247 177 102 89 136 173 172 194 287 400 439 393 333 313 314 301 278 261 243 206 165 151 171 199 206 190 166 152 162 198 242 263 249 213 171
-302 171 137 121 129 156 185 217 266 322 343 310 266 269 313 341 323 295 308 354 383 367 325 298 309 350 379 351 261 169 145 196 262 286 276 276 299 316
-306 316 306 282 268 266 261 250 249 261 275 277 270 275 307 363 423 463 476 474 461 420 337 245 201 218 256 271 271 283 300 302 298 312 331 315 258 215 229 279 312 314
-311 314 314 333 354 354 330 303 290 289 297 324 383 451 466 396 290 245 293 367 381 326 266 261 306 343 328 263 191 142 111 85 90 159 269 355 387 398 415
-316 415 415 374 326 323 356 379 378 377 383 373 341 311 295 268 215 163 146 162 176 172 170 204 275 345 359 306 238 222 265 305 282 205 139 136 190 244 253 219 188
-321 188 194 220 218 172 123 125 186 264 311 324 326 328 314 280 257 278 331 363 350 320 314 334 365 394 412 403 365 325 304 291 265 225 190 171 174 207 260 293 288
-325 288 276 290 302 266 200 168 182 191 166 148 171 205 206 179 154 139 129 140 183 232 250 241 243 272 306 315 292 248 204 186 201 234 260 267 260 256 274 320 364
-330 364 365 331 317 353 397 393 347 317 330 357 364 346 322 312 320 330 314 266 227 238 279 298 286 283 314 348 350 329 317 317 317 324 348 368 353 319 313 347 368 339
-335 339 291 279 301 308 281 245 216 193 190 229 289 308 269 234 263 325 357 352 346 341 316 282 272 281 268 230 208 217 232 248 285 325 311 248 214 252 296 278
-340 278 228 217 240 244 220 211 239 281 311 325 322 310 313 332 329 277 209 178 190 229 290 354 365 294 215 223 307 372 372 344 314 266 205 180 202 217 189 154
-344 154 162 204 245 271 287 297 311 336 350 330 294 285 304 296 242 187 167 168 163 166 195 245 305 364 385 327 229 194 260 349 374 347 321 296 253 223 243 286
-349 286 300 288 286 284 247 192 175 205 236 249 265 282 270 235 222 247 265 250 234 258 306 336 337 325 317 314 314 319 335 364 387 378 335 303 319 356 364 341 328
-354 328 336 339 330 338 376 410 405 368 322 280 246 229 215 179 127 103 134 193 237 257 261 248 211 173 165 195 226 217 164 106 101 170 278 358 367 317 252 221 240
-358 240 280 297 275 246 242 254 262 272 303 337 340 320 317 334 328 281 235 236 278 328 361 368 343 304 280 277 272 250 233 236 245 255 279 310 311 270 233 242 273 272 236 202
-364 202 195 205 227 266 307 321 299 262 230 207 192 181 169 165 187 227 246 226 207 231 280 299 286 283 294 280 231 196 207 235 249 265 302 330 312 267
-368 267 248 256 254 242 260 319 369 375 359 348 317 237 149 130 184 230 214 177 171 184 174 156 174 222 244 229 217 231 242 237 249 290 314 288 250 250 272 268
-373 268 241 231 238 233 227 255 307 331 312 296 310 323 309 291 282 254 192 145 158 203 221 208 208 231 236 209 185 194 212 205 179 168 189 224 248 243 211 170 148
-377 148 168 226 298 348 343 277 192 151 179 235 258 236 213 222 244 245 224 205 199 200 216 266 339 385 364 305 277 309 360 367 314 245 215 232 263 280 283 284 277
-382 277 253 230 241 277 289 254 210 199 211 207 189 204 265 322 327 286 245 237 253 269 266 240 213 209 240 288 329 350 358 364 376 392 390 346 263 179 130 129 166
-387 166 223 275 291 261 215 201 235 282 306 305 299 296 277 238 202 196 216 226 212 200 225 283 329 325 287 262 277 305 304 277 264 276 273 229 185 200 253 267
-392 267 214 157 159 203 242 274 318 352 334 267 204 177 180 200 232 258 259 248 260 298 332 341 337 327 301 263 243 258 287 303 296 273 243 218 215 232 255 276
-396 276 298 310 297 267 248 251 267 292 334 372 376 346 317 307 298 282 280 293 286 251 217 203 186 162 166 214 259 262 252 268 285 256 202 177 182 181 183 234 329 395
-401 395 385 331 288 272 268 258 224 160 95 73 106 156 186 186 172 162 178 214 235 214 174 158 172 189 199 213 221 206 192 217 270 296 287 289 320 332 296
-406 296 256 263 299 316 308 298 289 269 241 224 226 248 286 315 294 225 167 168 208 241 259 286 321 340 341 338 330 309 293 302 317 304 270 261 294 336 364 395 444 481
-411 481 465 401 337 316 332 354 359 350 333 311 289 284 300 310 281 222 178 177 195 196 181 175 190 215 232 223 184 140 132 170 210 215 198 193 201 200 199 226 279 318 322 311
-416 311 308 309 304 294 277 242 192 152 148 174 201 199 166 130 128 170 226 255 251 233 221 227 251 284 310 323 326 306 243 152 99 131 211 270 292 312 342 360 364 380
-421 380 402 387 334 305 345 418 450 419 357 298 257 234 224 207 179 166 190 242 287 308 309 297 280 271 276 290 307 324 329 296 225 160 143 169 208 255 322
-425 322 395 436 427 388 351 316 274 224 195 214 276 332 339 307 294 327 372 381 360 346 350 347 326 302 293 292 288 276 258 251 275 323 345 303 230 199 226 257 241
-430 241 203 199 239 289 319 325 313 291 274 275 287 292 289 295 316 327 306 271 259 284 324 345 342 334 333 335 342 358 372 359 304 229 180 187 240 301 330 311 267 237 234
-435 234 246 265 294 326 336 315 287 276 274 263 259 285 326 337 297 239 210 224 269 313 328 314 303 322 344 328 283 261 278 288 260 224 223 254 286 298
-439 298 285 245 199 186 216 246 235 208 212 247 264 250 242 266 302 318 315 308 304 300 299 297 286 268 256 254 251 239 224 215 207 200 210 257 325 366 350 306 293 325 336
-444 336 268 159 113 172 261 293 278 285 326 342 300 241 222 251 292 309 284 231 195 220 288 327 292 214 150 110 77 49 56 118 215 299 332 318 306
-449 306 328 356 348 317 321 363 372 308 231 215 243 249 226 227 268 307 307 281 253 229 223 246 274 260 207 172 186 217 222 206 191 178 167 184 239 295 304 275 256
-453 256 268 286 291 289 293 294 278 247 225 236 277 315 307 257 215 224 265 291 283 264 257 267 285 297 278 225 170 158 190 228 238 230 225 234 254 287 326 352 344 301 249
-458 249 220 221 226 202 159 146 194 269 309 292 251 221 205 189 166 140 123 131 167 200 195 157 136 168 233 285 300 284 268 280 323 356 333 266 226 257 319
-463 319 347 334 318 315 303 281 279 297 300 276 264 292 319 284 206 171 219 293 319 304 309 348 367 321 249 225 263 305 301 264 246 272 315 325 281 208 161
-467 161 169 202 213 192 178 204 261 308 320 307 298 316 350 354 307 248 232 256 273 269 289 348 388 361 307 297 335 374 404 448 489 476 409 347 311 265 202
-472 202 178 214 246 222 183 196 244 262 252 259 283 278 249 241 248 205 110 59 119 228 288 285 266 242 190 128 100 111 126 137 171 220 227 172 104 71 63 52
-477 52 50 86 145 185 198 211 242 267 252 201 153 148 190 248 286 299 311 324 313 268 222 204 208 209 210 223 234 224 211 234 290 326 314 280 260 257 262 288 333
-481 333 362 336 269 206 176 175 185 198 202 198 196 208 219 213 194 191 215 251 271 260 225 193 191 214 237 243 244 251 250 226 190 166 152 140 143 180 229 249 239 240 276
-486 276 311 300 245 189 165 168 178 186 195 208 216 209 192 194 229 274 296 281 240 187 134 105 113 144 164 158 138 118 105 104 119 149 190 235 258 229 164 137 184
-491 184 239 215 141 130 217 309 320 277 257 277 300 307 306 296 284 284 288 257 188 148 188 267 298 266 217 189 182 205 257 296 275 215 183 197 210 196 176
-496 176 166 147 114 94 95 97 102 150 239 300 282 222 192 203 220 222 215 205 193 189 199 214 230 261 309 346 349 335 327 310 263 206 182 197 220 236 254 277 290
-500 290 290 295 316 334 327 300 274 267 280 293 283 257 252 287 327 323 272 215 188 188 201 228 273 322 354 360 338 299 263 258 286 320 328 310 292 291 293 273 234 209 219
-505 219 250 266 256 241 236 233 223 213 208 195 171 157 175 206 218 207 201 215 235 235 210 166 129 122 149 181 196 204 221 227 194 147 142 191 238 236 205 182 181 201
-510 201 255 335 391 385 343 311 287 229 149 108 132 173 193 210 247 272 239 168 130 154 204 236 250 263 278 290 306 328 341 328 297 263 232 204 191
-515 191 205 240 278 311 333 329 289 234 200 197 209 227 253 273 265 242 240 266 277 244 196 181 205 235 250 254 264 288 327 368 380 351 302 261 230 195 160
-519 160 150 170 202 228 242 247 257 293 357 408 406 356 308 293 296 294 285 282 288 299 304 293 273 270 294 315 303 277 270 269 230 169 160 233 316 331 297 290 325 344 312
-524 312 267 264 297 323 323 320 341 377 398 393 383 377 357 304 248 229 247 262 258 257 271 278 265 256 274 304 324 335 336 308 245 183 160 165 167 168 184 206 220 244 289
-529 289 315 275 197 153 159 158 131 134 203 290 333 328 312 296 274 257 258 265 264 272 309 352 359 331 312 325 349 349 315 267 241 265 329 381 382 345 300 253 194 145
-534 145 148 201 249 250 217 194 197 217 241 251 230 182 138 116 102 74 50 71 142 214 232 200 167 172 202 211 187 164 176 217 257 289 329 375 390 340 243
-539 243 156 120 132 161 180 186 190 204 228 252 273 294 314 318 298 269 249 243 241 244 266 310 358 384 371 322 255 193 151 123 104 112 165 242 291 290 278 297 332
-543 332 338 314 305 328 353 353 340 336 336 324 305 292 283 267 240 213 188 169 164 176 193 201 199 193 184 178 182 193 188 167 170 226 307 350 325 261 193 135 93 82 106 147
-548 147 186 217 242 258 265 264 250 228 219 248 295 317 298 266 245 228 202 179 162 134 91 63 74 108 143 186 241 272 247 200 197 241 277 270 247 244 253 254 249
-553 249 245 237 223 226 254 283 280 243 198 174 178 197 209 203 202 229 268 284 270 255 255 239 192 146 140 164 190 225 287 354 375 342 300 279 264 244 238 262 292 303
-558 303 300 301 304 291 262 232 210 198 196 197 189 179 193 240 295 322 320 306 277 228 179 163 186 222 251 276 295 288 250 208 188 193 211 229 225 180 113 69 68 87
-563 87 112 169 269 354 355 297 270 307 342 313 248 225 266 315 314 257 188 154 172 216 248 249 232 214 201 204 234 281 302 270 214 180 180 188 182 176 191 242 322
-568 322 403 445 425 360 285 216 150 100 88 121 177 235 280 287 248 199 196 236 254 210 158 168 230 267 246 214 218 243 251 246 266 322 372 373 330 285 271 282
-572 282 296 297 286 270 258 260 278 288 264 216 189 207 246 268 277 307 354 376 350 312 306 329 341 323 289 254 219 193 193 227 276 319 349 363 347 302 259
-577 259 248 266 283 290 306 332 337 304 262 242 236 218 207 245 321 358 307 224 201 252 307 317 315 346 393 400 360 326 342 381 386 348 308 293 279 230 157 108
-582 108 106 125 133 133 141 149 132 96 76 94 132 165 186 198 184 140 105 138 240 341 365 316 258 242 265 299 329 354 362 336 273 201 144 115 121 162 218
-586 218 250 241 220 231 266 280 252 219 220 242 249 242 247 261 250 219 219 275 337 340 294 256 251 253 236 214 205 209 210 204 193 195 231 297 346 329 269 231 239 249 235 231 268
-591 268 306 295 262 273 331 370 360 343 356 377 367 340 326 323 311 295 289 281 249 201 175 188 215 221 201 179 180 200 222 233 232 217 189 154 133 131 136 140 158
-596 158 190 204 174 136 134 152 137 101 123 227 331 352 310 271 241 182 105 66 86 130 175 219 246 227 182 172 209 243 237 226 253 301 324 319 314 323
-601 323 334 345 358 363 338 289 247 232 232 224 208 208 239 287 315 305 272 249 247 263 291 324 346 346 339 344 351 327 275 234 224 224 214 205 209 203 165 118 119 184 265 299
-606 299 278 249 261 308 344 337 308 291 285 273 268 291 313 284 219 189 212 217 155 79 68 114 150 156 163 174 165 152 185 268 342 362 347 333 329 338 362 379 346
-610 346 261 186 172 202 224 220 216 230 255 276 287 295 306 317 316 308 317 345 349 296 225 207 230 223 169 148 199 253 243 220 272 374 419 365 282 231 205 192
-615 192 214 272 314 308 292 306 327 313 275 256 253 230 187 173 207 244 239 212 213 250 282 279 257 240 226 207 200 227 278 315 315 290 250 190 124 93 118 166
-620 166 204 247 322 396 405 342 267 226 210 200 203 216 216 199 204 249 285 264 207 185 222 278 313 318 302 280 275 300 325 320 301 312 352 363 314 241 198 198 215
-625 215 224 212 179 142 120 106 85 76 114 184 214 165 97 94 155 210 220 209 212 233 258 275 270 241 216 223 238 215 155 122 149 202 232 237 238 230 207 195 226
-629 226 279 306 294 277 275 275 261 247 248 254 251 238 218 193 166 147 141 144 152 169 199 236 274 308 335 351 357 351 323 268 209 183 197 220 220 201 184 179 184 202 228
-634 228 244 232 201 177 173 190 226 268 291 278 246 230 241 247 224 183 152 147 171 222 287 337 348 330 311 299 279 247 224 222 221 202 181 184 207 220 222 239
-639 239 273 279 230 170 164 209 242 236 234 270 309 293 230 181 178 190 187 181 200 237 256 241 207 177 167 188 239 294 314 282 223 171 145 146 179 241 294 287 211
-644 211 122 79 86 98 93 99 139 191 213 203 202 243 309 350 336 282 238 240 278 314 323 314 303 288 262 239 238 255 266 257 241 239 259 290 310 296 250 208 211 253
-649 253 282 261 209 176 186 218 244 256 262 265 259 240 219 228 279 347 382 364 323 301 299 298 300 316 339 340 309 269 246 246 266 302 334 327 276 228 233 279 307 285
-653 285 242 216 209 198 175 156 153 157 147 120 99 108 147 184 200 210 239 274 282 254 227 227 235 219 183 159 163 189 234 296 355 374 352 325 321 331 334 323 300 260
-658 260 209 184 208 251 252 204 161 170 209 219 188 161 175 218 251 261 266 288 320 339 317 252 179 145 165 203 213 199 201 240 291 324 341 351 338 293 240
-663 240 218 225 238 252 282 327 365 389 393 363 297 247 263 318 330 273 216 212 235 246 262 304 330 295 240 237 275 282 240 203 197 180 131 98 123 176 205 201
-668 201 187 176 171 187 224 253 253 245 255 268 253 211 168 142 135 147 171 178 150 114 111 138 156 146 138 162 208 239 239 222 211 217 239 270 299 310 292 259 248
-672 248 279 320 324 288 259 263 276 271 265 286 322 335 314 279 252 241 243 245 225 188 170 194 231 239 225 232 273 318 344 360 373 361 318 271 258 285 333 376 391
-677 391 359 293 235 215 222 222 198 164 146 152 175 198 215 230 240 221 165 107 97 146 217 270 297 305 302 294 288 282 272 262 261 258 236 201 184 187 180 148 133 183 287
-682 287 378 407 370 299 231 190 179 179 179 181 191 206 225 258 307 340 318 248 183 167 187 201 185 155 138 150 189 248 301 308 254 179 149 177 205 187 149
-687 149 140 152 144 123 140 201 249 250 239 251 254 207 139 113 131 147 141 149 188 228 232 210 194 203 228 254 273 290 309 319 299 251 206 185 174 147 115 109 135
-691 135 170 196 210 216 213 215 234 256 250 215 184 187 219 250 257 229 180 148 157 187 198 182 174 192 211 204 177 147 117 83 71 104 170 227 256 275 301 318 299
-696 299 243 188 163 164 175 198 235 268 269 251 255 293 318 291 234 199 193 189 182 201 242 257 223 176 161 176 176 147 118 133 195 262 287 264 230 208 181 140
-701 140 124 172 244 264 216 170 171 194 199 199 212 211 162 88 45 52 84 113 133 141 144 158 183 196 178 148 141 153 153 130 109 118 160 211 244 248 248 276 324 341 306
-706 306 264 266 296 304 279 256 249 236 211 198 202 195 161 120 99 95 101 123 169 225 276 324 373 400 371 290 202 158 165 186 187 169 156 159 172 196 229 246 229 199
-711 199 193 207 201 190 237 336 379 306 208 211 298 351 334 315 333 339 312 300 322 326 291 278 328 381 381 366 386 401 350 273 255 292 300 252 205 200 220 252 305
-715 305 351 337 269 213 200 181 121 67 68 101 117 124 158 204 217 200 203 243 274 262 232 222 223 199 148 110 108 129 143 147 153 167 186 207 231 252 265 275
-720 275 284 275 232 177 152 171 197 193 171 164 185 219 248 259 250 237 248 276 276 232 179 159 162 155 145 158 186 205 227 278 328 312 227 158 166 214 228 187 129
-725 129 94 92 112 122 94 51 56 131 219 261 272 300 345 354 309 245 206 193 189 191 206 238 273 289 281 268 262 253 228 200 200 220 225 218 246 313 347 300 234 230 268
-730 268 266 215 179 180 164 109 70 92 142 172 195 241 291 307 299 306 325 313 260 205 181 189 213 233 230 207 205 253 317 324 257 174 144 172 218 255 280 295 304
-735 304 302 275 222 175 181 239 289 286 262 271 305 317 297 292 330 372 368 328 302 306 310 288 250 221 209 210 220 234 242 239 226 209 194 188 195 209 222 239 254 237 163
-740 163 68 35 98 197 245 230 207 220 260 294 304 285 246 211 200 207 206 195 191 186 159 120 108 132 150 140 141 186 244 273 288 328 368 347 267 208 212 237
-744 237 233 214 219 247 274 301 330 336 297 246 239 278 310 305 285 268 239 185 128 95 92 107 140 174 174 126 80 102 191 278 311 302 294 307 330 345 346 333 313 293
-749 293 262 204 135 106 142 197 202 158 129 149 179 170 143 153 202 238 232 218 241 286 302 272 233 228 259 295 310 300 269 222 177 157 162 165 143 116 123 160
-754 160 174 137 96 116 190 242 217 150 116 140 188 220 237 255 273 277 265 262 282 303 290 237 184 166 177 183 174 165 166 166 168 190 234 271 280 276 282 287 272 255 259
-759 259 271 255 216 198 214 225 197 158 153 176 190 178 160 147 133 124 147 201 240 221 164 138 178 241 258 209 149 137 167 182 149 104 98 132 162 165 167
-763 167 185 203 193 172 173 190 181 139 120 167 235 244 191 157 192 242 227 162 137 195 277 307 276 232 209 207 217 234 246 246 236 226 214 199 192 196 195 180 170
-768 170 181 196 184 153 141 157 181 199 225 261 272 239 194 187 223 260 270 259 245 232 214 187 154 122 100 98 126 179 237 272 274 264 276 318 369 404
-773 404 412 388 336 287 276 301 309 264 196 165 189 237 273 282 260 212 163 137 137 158 205 272 318 300 240 194 180 168 149 159 209 241 209 144 103 89 77
-777 77 81 139 233 292 283 244 214 189 162 161 206 263 287 279 268 257 233 210 219 257 277 250 202 175 178 189 199 214 243 280 306 312 303 295 292 280 243 197 179 209
-782 209 256 276 254 219 206 217 225 207 168 132 112 108 119 152 196 223 218 197 188 188 173 144 133 157 191 202 194 196 216 241 252 238 203 163 144 153 162 139 95
-787 95 75 101 155 214 271 319 341 328 298 282 298 340 383 388 333 238 150 96 74 72 86 104 112 120 145 176 176 138 106 126 182 234 263 274 261 226 193 185
-791 185 188 175 162 184 232 257 239 212 202 194 171 142 124 110 97 107 146 179 167 122 102 141 211 256 252 223 213 241 278 282 253 224 214 200 161 128 144
-796 144 204 245 215 134 71 78 149 225 256 242 216 210 226 249 255 231 187 153 159 193 213 198 170 163 178 200 221 235 225 188 151 145 161 167 160 170 206 231 214
-801 214 173 163 200 247 269 279 308 352 368 335 286 266 278 298 318 338 341 306 254 243 285 330 334 319 331 367 388 375 353 343 344 358 399 458 494 466
-805 466 381 285 225 213 228 252 285 326 351 343 324 325 333 307 250 216 236 271 276 253 221 180 136 132 189 261 285 264 240 228 212 204 223 248 242 226 249 298
-810 298 312 279 258 281 308 302 283 273 257 226 206 214 221 198 161 131 101 73 76 111 130 103 79 116 202 276 313 321 301 252 197 162 142 129 147 216 300
-814 300 342 331 294 249 206 187 208 244 261 267 280 284 257 224 231 266 281 269 269 296 319 317 302 293 296 315 338 322 255 201 228 304 334 296 266 294 331 318
-819 318 258 190 132 101 113 153 169 155 167 230 286 276 221 182 172 171 170 169 147 105 89 133 197 218 188 156 145 146 151 166 181 184 187 204 212 195 184 216 254
-824 254 231 157 111 128 158 156 147 176 230 265 275 283 290 271 220 167 144 155 181 200 209 210 209 212 229 269 318 344 329 287 254 248 264 285 296 282 247 214 207 220
-829 220 223 203 178 170 179 185 174 153 137 136 145 166 202 238 234 183 142 167 233 260 232 214 230 217 137 62 78 149 175 139 110 125 150 159 169 180 165 126 117
-833 117 157 200 212 213 225 226 204 191 209 229 212 177 166 186 211 230 249 269 284 287 263 204 134 102 118 138 133 134 162 183 156 108 91 103 107 98 109 145
-838 145 177 182 160 111 48 18 50 108 124 104 108 151 176 152 128 158 215 238 227 232 272 305 290 241 201 198 223 253 277 303 339 375 384 356 301 245 205
-843 205 187 190 202 208 200 179 156 145 157 185 205 208 206 209 206 187 169 181 221 257 269 268 280 314 351 362 326 252 184 157 165 188 221 264 285 259 214 203 231
-847 231 244 213 175 172 191 192 166 130 100 89 112 161 200 218 241 278 288 249 213 236 276 246 153 103 140 182 148 77 61 108 152 167 192 235 244 197
-852 197 149 164 218 246 236 239 285 341 370 380 395 400 370 316 271 237 183 107 51 39 46 47 67 141 244 312 325 326 340 345 319 288 285 300 296 272 253 240
-856 240 207 149 98 89 133 221 320 372 344 271 234 264 306 305 273 247 224 179 125 101 107 113 113 121 117 67 2 1 85 169 185 167 194 263 307 297 267 248 230
-861 230 202 178 172 177 176 157 113 61 42 79 136 161 156 159 173 163 128 118 160 213 230 226 234 241 221 188 171 161 126 79 73 131 215 277 291 258 200 163 182
-866 182 236 269 250 204 163 128 95 76 88 125 162 178 168 148 138 149 163 155 129 119 142 174 179 153 127 126 139 142 128 120 143 180 185 132 66 52 111 192
-871 192 230 209 161 128 126 139 142 141 169 234 281 252 160 85 80 119 160 192 218 219 195 189 233 291 296 251 218 227 235 208 179 190 228 245 219 177 153 163 206
-875 206 261 288 267 228 215 233 238 199 135 96 111 174 249 295 300 284 276 270 248 219 214 233 236 208 189 216 261 263 214 171 179 230 289 328 334 312 290 293 312 313
-880 313 284 246 217 196 189 213 264 306 312 293 259 210 159 149 192 234 221 167 134 145 179 219 258 272 233 167 137 161 202 228 245 261 257 224 196 202 231
-885 231 260 281 288 257 191 137 138 176 197 192 198 235 276 288 267 233 204 193 203 223 239 247 254 256 239 198 151 120 112 114 109 100 103 128 159 174 176 183 201 215 225 241
-890 241 253 237 201 190 215 228 187 136 141 193 218 179 123 106 133 181 240 303 340 328 279 220 171 143 143 157 149 110 79 88 117 120 95 85 121 186 242
-894 242 269 262 227 185 159 155 157 153 157 185 223 236 213 184 186 216 233 211 170 147 154 171 178 170 152 128 105 98 112 130 132 116 94 86 102 135 160 161 160 187 227 222
-899 222 150 75 73 141 204 223 229 258 292 296 272 249 233 217 207 217 229 210 162 136 157 186 168 117 97 136 191 210 199 191 186 155 107 85 110 148 161
-904 161 159 176 202 206 188 187 217 250 260 265 289 310 295 257 242 257 256 208 150 140 190 252 283 278 263 263 279 295 290 261 225 197 180 175 184 202 202 167 120 107
-909 107 142 191 221 231 235 231 206 165 129 116 127 152 174 178 159 134 116 108 109 125 156 186 194 181 163 153 159 186 227 250 231 200 209 263 304 284 222 168 141
-914 141 138 161 215 269 282 258 244 273 321 347 345 342 351 350 311 232 153 122 151 204 234 238 251 291 329 323 281 248 253 276 283 263 231 195 158 133 139 175 214 238
-919 238 259 295 332 340 316 292 291 295 275 234 204 199 197 177 155 160 189 201 179 156 178 233 262 228 157 105 99 128 174 217 233 220 196 180 165 142 126 143
-923 143 178 190 175 171 195 222 234 253 289 311 291 254 238 234 215 196 214 261 283 266 249 262 287 303 317 330 315 262 215 225 276 307 296 279 281 279 234
-928 234 155 98 106 171 236 259 243 220 213 224 246 260 236 167 92 68 98 136 159 189 241 281 276 248 235 236 229 217 219 219 185 129 104 143 219 284 305 269
-932 269 194 131 126 160 178 174 197 269 339 356 329 302 296 308 331 351 340 288 223 174 143 133 163 218 248 233 219 239 245 188 118 127 205 251 224 195 215
-937 215 236 206 154 136 140 120 94 113 172 208 185 131 87 68 68 83 108 140 177 206 206 178 161 182 218 233 230 232 229 200 171 195 265 310 285 225 185 175
-942 175 175 179 188 195 201 218 245 250 218 188 205 264 309 304 262 222 209 218 229 224 210 210 233 261 279 289 296 303 306 304 288 251 216 216 244 258 240 223 237 253 227 171
-947 171 142 160 186 186 169 161 166 172 182 203 234 261 274 274 266 248 220 189 177 195 232 267 288 301 303 287 261 239 218 180 139 133 172 213 215 188 165 150 136
-951 136 132 147 156 143 144 201 283 315 281 238 229 227 200 165 156 174 203 242 290 321 304 242 178 156 188 249 291 284 238 187 152 136 150 196 244 253 228 204 193
-956 193 179 165 187 239 264 231 184 179 204 213 190 156 124 97 89 113 157 203 250 287 277 207 119 80 97 125 136 139 146 147 131 112 107 118 137 147 136 109
-961 109 92 99 122 143 153 144 111 78 83 128 168 173 165 173 176 148 122 146 206 248 258 270 296 317 320 321 321 307 295 317 358 359 300 233 201 189 161 117 84 78 106
-966 106 161 212 216 175 135 137 167 193 206 210 208 215 247 290 300 267 241 266 323 357 344 297 242 200 188 202 222 245 290 355 391 362 294 246 238 242 232 206
-971 206 181 171 181 194 187 172 185 219 219 158 86 64 79 73 40 25 50 80 83 72 77 107 145 166 153 120 110 147 200 225 220 214 210 187 150 139 165 199 211
-975 211 202 179 149 128 139 171 190 191 203 240 269 265 242 226 210 182 152 139 140 138 130 127 132 129 106 64 27 28 81 161 221 241 236 218 189 165 172 209 228 196 146
-980 146 138 184 240 271 287 310 327 302 241 200 218 259 255 204 185 252 347 371 308 245 249 291 303 270 237 226 212 174 133 127 161 203 226 234 249 276 302
-985 302 326 357 386 382 338 298 293 297 274 243 244 267 267 241 229 229 197 135 112 164 229 233 193 169 174 177 181 210 246 245 213 206 244 282 277 238 192 145 101 85 105
-990 105 129 124 106 118 168 218 234 220 198 178 162 167 212 290 356 369 334 289 257 234 210 191 186 196 217 235 222 166 106 94 132 164 156 137 143 160 157 143
-994 143 141 137 100 41 5 7 32 71 123 159 144 99 90 140 204 241 256 267 261 229 203 203 199 161 117 116 152 168 139 102 103 144 194 224 217 178 138 133 168 210
-999 210 222 202 183 189 215 240 252 252 232 192 157 171 236 300 311 290 287 304 281 196 111 96 132 149 124 105 127 156 155 133 126 130 117 92 93 139 195 218
-1004 218 213 207 213 213 188 142 96 85 132 221 294 310 287 269 257 232 205 216 252 253 196 147 160 201 206 171 142 136 140 155 188 221 237 258 303 325 276 204
-1009 204 208 291 336 274 170 121 128 139 145 162 168 132 76 58 103 178 245 274 255 212 193 207 202 150 114 162 257 301 277 259 286 309 285 241 225 236
-1013 236 246 251 267 290 303 299 286 271 264 266 264 239 200 176 184 209 235 261 278 267 224 176 148 135 134 156 196 220 197 144 104 97 107 116 119 120 121 124 134 152 169
-1018 169 173 158 139 139 168 200 208 195 183 171 142 105 88 106 134 154 165 172 167 162 184 227 252 242 238 265 281 232 142 90 102 134 146 148 163 182 188 188 198
-1023 198 211 212 214 240 285 314 294 240 187 156 131 98 68 66 92 124 146 167 194 203 175 132 120 160 222 261 256 215 165 140 151 170 166 148 149 171 172 126
-1028 126 70 51 58 51 23 10 36 83 123 150 166 161 132 100 85 86 90 83 61 28 0 7 52 93 94 70 71 108 140 143 147 177 213 219 204 201 200 164 104 83 124
-1033 124 166 143 84 72 127 173 150 98 105 188 278 303 274 251 256 254 208 133 71 41 39 57 87 110 107 90 91 118 149 167 182 198 194 157 120 126 168 200
-1037 200 196 175 164 164 165 158 138 95 32 -21 -25 27 101 145 154 161 194 229 228 192 153 126 98 73 83 130 166 158 141 160 194 187 147 150 234 333 355 285 185
-1042 185 116 94 107 138 163 158 115 59 31 52 99 129 127 116 123 144 164 177 186 188 182 187 215 244 232 179 130 124 154 180 172 127 78 69 113 165 168 125 92 101
-1047 101 121 107 71 54 72 113 163 213 243 234 193 162 172 209 227 200 152 135 163 198 202 181 167 158 130 95 93 125 145 133 128 160 195 188 150 124 118 112
-1051 112 108 125 149 147 121 111 129 148 142 114 73 26 -7 4 58 112 127 108 82 74 102 165 226 245 219 184 157 128 96 87 109 130 135 151 199 240 227
-1056 227 182 170 208 246 246 221 194 167 137 119 122 127 119 116 143 183 199 184 164 150 131 108 117 169 221 223 187 157 147 131 110 122 178 223 211 165 149 180
-1061 180 219 238 240 233 209 176 167 202 257 292 289 257 213 168 125 91 78 93 122 130 108 88 102 134 143 119 89 74 74 94 138 176 170 129 109 123 130 107 100
-1065 100 143 197 209 192 198 232 256 258 263 273 266 241 224 217 200 172 162 179 192 174 133 101 101 137 181 185 136 89 119 219 310 337 324 310 294 266 238
-1070 238 220 191 135 77 56 70 92 116 152 191 210 212 219 235 233 205 181 201 258 301 284 219 166 172 226 278 300 304 308 304 274 222 178 175 213 253 246 193 153
-1075 153 166 200 195 153 131 141 141 113 99 130 166 168 149 145 142 119 96 100 114 102 79 85 115 134 140 159 179 172 152 170 225 256 229 183 159 149 138 137 154
-1079 154 176 197 226 251 233 177 139 153 183 185 173 174 180 175 182 224 269 275 263 280 324 350 344 339 346 333 285 225 178 144 117 109 124 143 149 137 106 58 15 1
-1084 1 16 41 67 109 160 194 195 178 164 153 141 136 143 150 150 156 184 223 248 243 213 176 153 160 193 235 259 245 192 125 96 130 197 239 234 213 212 218 198 159 142
-1089 142 168 212 228 207 171 142 115 79 48 49 92 162 230 271 274 250 226 227 247 255 239 214 188 152 114 105 134 165 159 124 101 104 118 137 155 159 141 132 166
-1094 166 224 252 235 210 204 206 203 203 205 186 144 108 100 107 109 118 143 173 193 201 201 195 196 217 247 262 266 285 312 304 256 215 198 168 110 78 120 193 219 199 188 206
-1099 206 226 239 262 281 257 187 116 76 59 62 89 126 139 130 126 129 111 77 66 83 85 54 30 43 72 94 130 198 269 304 307 295 243 138 37 20
-1104 20 81 128 104 53 44 87 149 207 261 289 266 198 135 118 142 169 171 149 110 69 49 67 114 159 178 171 141 87 33 23 67 110 105 69 57 76 89
-1108 89 86 100 141 175 184 195 226 253 257 256 270 286 288 294 313 312 260 196 179 214 250 266 287 322 341 326 299 290 294 298 297 293 275 245 227 236 244 221 183 188 256 329
-1113 329 332 259 180 150 154 148 133 152 202 225 183 120 106 146 178 161 114 84 88 112 138 170 216 254 246 189 145 177 253 273 207 142 159 208 182 80
-1118 80 5 6 24 4 -21 1 62 115 146 168 181 177 170 184 206 210 203 207 211 188 146 123 135 154 161 178 227 287 322 330 336 348 340 297 241 208 210 230 249 255 238
-1123 238 200 165 166 207 254 271 257 244 258 296 334 345 314 252 192 169 192 241 288 308 289 240 192 168 170 185 199 203 191 168 152 148 135 98 53 37
-1127 37 58 102 157 216 258 260 236 219 214 203 188 194 216 217 190 181 211 239 219 178 177 220 250 234 206 221 287 361 384 337 258 206 197 197 177 148 124 93 47
-1132 47 16 33 76 84 46 10 25 81 134 156 143 107 73 69 105 161 206 224 219 213 221 239 248 244 233 217 180 130 110 142 182 174 130 121 172 224 218 170 136 135
-1137 135 139 129 120 133 171 217 254 270 275 283 295 294 268 231 201 175 144 114 106 123 142 149 152 171 207 243 266 286 314 340 336 288 220 172 157 150 135 129 157 210
-1142 210 248 246 220 210 233 266 273 247 213 196 198 215 250 292 308 271 204 165 178 206 207 191 197 234 273 285 273 258 249 238 216 189 174 178 182 173 167 186 217
-1146 217 218 181 145 145 164 172 173 191 210 184 115 65 74 113 135 128 115 111 116 131 146 139 116 129 210 300 308 227 145 123 128 113 97 124 176 196 175 157 169 182
-1151 182 174 164 180 219 256 267 239 184 143 145 172 187 192 220 263 268 230 204 219 226 184 139 156 216 242 214 179 169 171 181 211 242 232 194 183 207 205 146
-1156 146 90 96 133 136 108 105 143 178 176 151 143 171 226 269 259 199 144 145 185 217 230 252 285 289 246 192 179 208 234 225 189 162 157 150 118 79 86 151 217 230
-1161 230 212 229 282 302 248 167 133 150 170 173 186 228 268 268 242 230 237 218 148 65 35 79 155 210 224 208 170 119 74 61 95 155 198 199 179 188 235
-1165 235 266 236 176 156 185 205 189 186 229 269 247 186 144 123 86 50 74 157 215 199 151 133 150 167 175 188 200 198 187 184 190 195 204 225 248 246 218 191
-1170 191 192 208 203 160 104 78 87 96 87 92 141 199 198 133 78 87 128 140 124 120 140 153 143 130 138 161 177 166 135 108 116 159 204 226 235 259 292 304 282 243
-1175 243 208 184 176 195 229 242 200 125 77 92 139 161 142 128 157 212 246 249 249 248 215 148 102 127 200 255 263 242 216 189 175 189 219 233 221 206 204
-1179 204 197 162 106 54 22 17 41 86 126 144 155 183 228 265 279 281 280 265 228 177 128 84 52 46 75 109 105 59 9 -9 0 25 69 126 165 161 131 117
-1184 117 130 155 186 223 243 212 147 101 101 112 110 116 150 189 202 206 227 252 249 235 253 297 319 300 272 257 236 195 164 168 192 211 221 224 201 146 104 124
-1189 124 191 239 231 196 178 190 213 223 201 148 94 79 107 143 158 166 196 234 246 230 224 251 277 267 246 264 317 346 322 285 285 311 317 288 250 224 206
-1193 206 194 195 218 250 268 249 195 138 125 165 216 222 183 146 148 174 193 194 183 170 164 171 191 215 234 247 254 249 234 220 208 200 201 216 232 233 222 225 246 263
-1198 263 256 241 229 204 147 81 60 102 162 183 166 158 190 234 250 236 229 245 257 238 203 187 202 230 257 281 291 273 235 200 184 178 167 146 113 84
-1203 84 93 156 228 240 188 135 127 149 170 204 258 294 273 227 227 289 349 344 276 188 121 92 105 142 175 182 171 159 151 141 130 136 177 243 288 275 225 194
-1207 194 209 237 238 220 213 217 200 155 112 100 112 121 116 109 114 130 140 126 102 100 141 198 227 210 169 136 128 151 196 243 266 254 223 200 194 195 184 160 144 160
-1212 160 202 237 245 234 221 206 186 174 184 201 202 180 151 121 85 56 59 96 133 142 126 104 88 77 72 83 116 164 206 225 217 191 160 138 141 170 188 162
-1217 162 114 107 157 200 171 99 64 83 99 73 33 33 79 136 174 179 159 136 124 119 119 134 161 167 123 69 66 109 124 85 52 80 137 160 143 122 104 76
-1221 76 54 73 129 182 199 183 145 105 96 129 164 161 140 156 204 220 174 126 137 185 200 161 123 140 200 249 244 186 118 89 115 163 179 152 120 123 156
-1226 156 175 159 130 122 138 153 155 163 200 262 313 320 286 247 233 228 197 145 129 182 260 294 273 240 214 172 112 71 73 96 121 153 190 195 157 118 123 150
-1231 150 154 140 149 177 190 189 209 254 281 259 207 148 87 43 47 103 164 181 165 163 202 262 300 277 206 143 131 157 176 184 218 272 286 229 153 123 137
-1235 137 156 173 201 227 224 199 187 189 167 114 78 95 145 174 160 127 106 116 154 200 223 212 184 166 167 177 178 175 191 235 282 289 248 201 187 201 211
-1240 211 204 190 170 146 133 158 205 233 220 197 199 221 240 248 251 245 229 219 238 278 312 321 313 300 288 281 284 281 246 184 134 135 185 237 243 187 104 56 75 135
-1245 135 181 191 195 217 246 251 224 183 152 145 161 174 160 131 134 186 231 211 155 144 195 241 228 181 156 155 157 167 199 234 242 232 235 247 237 208 203 232 253
-1249 253 234 195 173 169 162 153 159 176 181 171 171 197 223 211 162 119 123 163 203 229 257 286 284 229 160 129 140 148 122 72 31 23 58 127 191 209 187 169 175 188
-1254 188 184 166 144 116 101 124 181 223 223 213 227 243 219 162 128 144 177 184 165 150 151 154 145 140 161 202 222 194 138 100 96 111 132 156 166 146 124 144
-1259 144 197 225 216 220 259 277 234 182 190 228 217 166 161 222 271 247 185 151 156 170 181 187 178 151 128 135 172 230 299 356 377 358 315 261 203 170 186 213
-1263 213 196 151 159 233 282 245 189 209 272 276 205 146 151 173 169 171 219 285 310 288 261 249 228 172 97 49 64 125 170 151 86 48 86 174 242 249 210
-1268 210 170 156 157 155 152 170 204 219 187 129 95 104 136 161 164 133 78 33 39 97 164 203 210 195 166 136 125 134 140 128 105 86 66 40 23 38 81 121 131
-1273 131 114 102 115 145 162 152 133 131 141 144 136 139 159 182 196 207 219 225 233 261 302 317 287 240 215 208 196 181 176 172 149 120 119 154 188 189 164 138 135 159
-1278 159 200 224 209 173 164 189 207 183 137 115 134 174 207 226 237 246 248 231 192 153 150 185 220 223 209 207 221 226 220 218 228 230 213 201 226 282 314 270 162
-1282 162 68 54 108 159 175 194 243 280 247 163 106 120 169 205 225 242 239 203 160 155 190 226 228 205 191 202 217 202 154 116 124 149 131 67 26 56
-1287 56 117 142 133 137 171 191 172 139 126 132 138 132 124 123 135 159 186 214 252 285 272 187 78 26 53 102 121 124 142 166 165 147 146 170 188 172 133 106 114 138
-1292 138 143 119 101 122 163 185 191 221 272 280 212 131 123 181 228 227 215 229 253 256 240 227 226 218 182 123 74 74 117 153 157 166 211 247 204 105 53 99 179 211
-1297 211 197 184 187 190 190 192 184 147 105 98 125 150 153 157 187 237 283 305 294 258 221 206 212 221 217 198 168 142 138 154 164 150 133 151 200 237 242 232 229 234 242 254
-1302 254 262 249 219 205 225 246 231 196 186 209 227 219 209 222 239 236 227 248 290 305 268 209 173 165 170 183 212 242 249 237 224 200 137 52 11 53 131 174
-1306 174 179 196 235 244 192 121 91 109 141 162 178 190 196 199 200 194 179 169 172 176 166 159 180 218 228 191 140 114 110 101 83 73 75 77 77 81 82 69 57 76 124 162
-1312 162 162 141 131 130 114 84 61 50 41 44 83 148 186 164 120 111 138 151 132 112 122 144 143 120 106 120 149 172 185 195 214 245 282 315 341 363 379
-1316 379 373 337 293 270 265 251 218 192 200 235 271 295 312 321 317 307 308 316 310 275 229 198 184 168 144 127 138 167 184 164 119 93 114 167 213 234 237 237 234 234
-1321 234 247 275 300 310 308 301 279 233 179 144 125 102 77 77 107 132 120 84 73 108 165 201 198 182 188 221 250 248 234 244 285 326 337 328 322 321 313 293 270
-1326 270 245 215 180 146 119 107 115 136 152 159 176 212 246 249 223 195 182 173 157 142 148 175 204 216 211 203 201 197 180 159 154 168 187 196 201 210 222 241 263 271 239
-1331 239 183 158 197 258 268 211 141 111 117 123 111 99 115 166 228 266 267 252 246 251 253 248 234 207 166 139 150 184 204 196 181 174 155 107 46 11 19 58 102
-1335 102 130 150 182 233 273 265 223 198 211 226 206 171 166 196 227 231 219 213 220 236 259 280 276 237 185 158 170 193 186 150 123 129 152 166 178 209 246 248 202
-1340 202 144 116 129 166 201 213 198 170 144 118 91 87 132 204 253 258 243 230 220 221 243 264 241 184 154 173 185 156 129 153 194 194 172 184 217 207
-1345 207 146 94 89 107 131 175 231 259 246 229 230 224 197 183 196 191 136 81 95 173 248 281 282 263 217 162 140 169 217 244 242 226 207 189 176 167 162 158 151
-1349 151 137 128 144 180 203 190 164 157 158 136 100 97 133 156 132 100 120 183 217 182 118 85 90 94 72 44 47 85 130 147 131 106 96 100 100 91 86 101 139 193
-1354 193 250 281 264 218 190 197 198 160 120 134 192 234 237 233 231 192 119 82 122 173 158 107 112 184 237 217 168 151 166 178 172 148 120 111 135 159 135 82
-1359 82 75 137 192 171 113 96 124 139 125 131 181 234 241 212 189 187 183 158 117 88 88 103 107 99 104 129 151 154 149 152 156 151 144 141 137 133 142 164 168 144 129 153 184 177 152
-1364 152 160 195 201 164 137 149 159 127 82 85 146 224 269 263 219 178 174 194 196 163 131 130 140 128 104 102 127 147 137 114 106 121 151 178 186 175 167 179 200 206
-1369 206 195 198 233 277 284 242 184 150 150 171 199 227 243 232 198 176 193 242 286 297 276 239 206 187 182 175 157 128 98 81 90 126 160 154 111 75 77 96
-1374 96 106 125 167 197 170 110 82 86 68 27 31 107 183 193 167 171 193 176 129 120 164 207 215 216 236 242 203 144 112 106 98 90 111 163 208 212 184 153 134 128 131
-1379 131 145 165 181 198 223 245 235 183 128 130 200 276 279 203 117 89 126 176 199 204 223 251 248 197 134 108 114 117 105 106 130 152 153 153 174 199 201 184 173
-1384 173 170 152 120 99 109 138 164 175 166 139 115 122 161 204 220 204 169 136 122 134 163 191 211 220 217 201 181 166 162 167 184 208 223 203 139 54 -8 -8
-1388 -8 51 123 161 172 205 261 273 194 80 25 52 101 126 139 156 152 108 59 51 81 109 117 118 125 133 141 153 162 147 101 56 49 79 114 118 87 48 36 70 135
-1393 135 190 199 164 124 108 107 90 62 52 76 114 141 150 142 125 123 162 220 235 188 140 149 189 195 162 148 174 189 160 119 118 160 205 220 201 173 169 199 222
-1398 222 191 126 93 125 183 222 237 228 183 115 84 123 185 206 191 193 226 246 224 183 155 142 132 119 110 111 125 149 176 197 211 210 186 150 133 146 166
-1403 166 164 149 146 152 146 121 98 93 98 98 92 84 80 81 73 48 18 9 26 46 53 60 79 100 115 134 157 154 115 77 75 93 104 123 167 200 179 137 147 204 234 207 184
-1408 184 213 254 260 245 246 250 222 179 167 188 202 189 172 170 174 170 165 174 190 195 173 132 100 97 116 132 136 143 169 213 259 286 271 219 174 177 213 223 183 140 139
-1413 139 164 168 146 120 99 74 47 34 38 54 76 108 140 161 176 190 197 192 189 196 200 182 151 127 109 90 81 99 124 117 82 61 87 138 173 174 149 122 112
-1418 112 121 132 139 159 208 263 279 250 218 212 218 204 166 126 100 91 81 57 28 30 79 136 159 162 192 250 292 295 290 294 272 211 167 191 249 263 224 190 186 173
-1423 173 125 79 83 131 181 210 224 222 193 143 101 92 106 125 146 180 220 236 206 155 134 156 192 207 204 205 209 194 153 110 86 88 109 144 186 223 250 270
-1427 270 281 265 210 134 72 42 35 36 49 87 136 157 135 106 119 173 212 198 161 157 198 238 240 217 200 193 173 130 77 43 37 50 62 70 87 122 165 199
-1432 199 228 260 286 280 247 229 252 284 271 203 124 79 73 89 109 118 103 74 61 85 129 161 164 140 102 76 94 141 156 97 8 -29 3 51 71 71 60
-1436 60 20 -45 -70 -4 116 211 246 240 208 149 91 72 77 51 -7 -32 16 92 131 132 132 145 160 184 217 225 183 132 136 185 206 173 140 148 167 157 133 128
-1441 128 127 99 61 57 87 101 83 70 84 90 65 48 84 141 150 105 69 76 94 96 108 158 205 191 132 91 91 100 97 107 136 153 141 131 140 131 78 26 32 80
-1446 80 97 62 22 19 46 80 119 158 181 188 205 237 256 241 215 204 201 194 201 244 298 315 283 233 192 154 112 81 86 132 181 186 132 66 46 74 92 69
-1451 69 51 91 163 190 154 114 111 115 82 33 23 69 130 162 164 159 165 179 187 190 198 213 214 189 162 163 182 179 143 110 108 122 131 143 168 175 137 75 37 36 58 99
-1456 99 155 184 146 69 33 59 83 61 42 88 173 217 200 181 201 232 232 210 203 217 222 199 177 189 230 250 214 158 140 168 188 169 150 179 229 240
-1460 240 203 162 137 102 51 33 78 148 189 193 185 173 154 141 154 177 179 157 143 154 173 175 159 136 128 151 200 239 238 211 200 208 198 157 139 191 275 306
-1465 306 247 155 106 116 151 183 209 225 213 171 134 141 186 220 205 159 132 148 185 218 242 264 272 246 194 151 139 152 171 196 231 250 219 149 101
-1469 101 119 177 204 178 145 150 174 175 153 146 167 173 129 57 23 61 142 204 218 205 201 199 173 127 116 169 233 227 152 97 117 169 176 134 110 138 184 202
-1474 202 192 187 206 231 232 202 166 159 196 251 283 270 230 199 194 207 222 231 231 220 197 171 157 160 172 187 207 230 233 205 165 148 166 199 225 241 246 234 203
-1478 203 171 157 164 185 212 235 240 226 207 191 169 143 137 164 198 205 183 150 116 81 56 52 54 44 41 81 148 178 135 63 25 37 72 112 155 188 186 149
-1483 149 117 126 164 190 182 168 189 240 271 253 220 221 248 251 211 166 154 163 162 148 141 149 169 198 222 215 175 144 149 160 134 85 72 104 125 96 48 35 66
-1488 66 112 158 195 201 163 108 93 135 184 188 153 142 192 262 279 225 167 170 223 260 255 241 255 277 270 228 178 143 124 121 132 148 165 188 219 235 212 159
-1492 159 115 100 102 111 137 186 229 232 191 139 111 110 113 99 70 47 47 69 89 82 46 8 1 36 94 149 192 224 237 219 178 144 132 128 115 103 123 179 241
-1497 241 274 272 249 221 206 209 214 198 172 172 214 266 284 263 232 208 187 163 142 125 104 85 90 132 194 244 271 283 296 315 324 298 235 169 148 177 205
-1502 205 183 126 92 110 142 145 126 124 149 169 163 146 141 150 161 174 191 197 180 151 139 144 149 154 189 252 295 280 233 208 214 227 242 269 301 311 302 299 299 266 204
-1507 204 168 192 237 255 260 285 308 279 210 159 145 126 85 62 87 133 161 170 173 155 102 48 48 110 186 233 240 222 200 195 213 236 244 236 220 193 157 140
-1511 140 164 205 215 187 159 160 169 161 147 151 168 171 149 123 111 118 143 183 222 237 221 201 202 214 211 190 185 214 252 262 237 210 198 187 162 135 130 147 172
-1516 172 193 206 208 199 190 192 204 216 229 242 243 229 220 230 235 198 125 70 67 98 125 140 159 183 206 220 219 196 159 140 156 186 203 201 193 171 120 56 25 50
-1521 50 109 167 206 222 213 188 165 160 174 197 216 223 212 192 181 190 211 226 227 220 223 245 275 286 262 215 173 154 159 179 199 204 190 173 168 165 146 117 107 128
-1526 128 154 153 131 122 147 187 202 170 116 90 120 174 193 161 118 110 139 180 215 237 236 207 161 127 123 148 180 198 193 176 168 172 176 169 161 166 181 190 181 154 112
-1531 112 68 46 64 110 154 171 165 154 158 183 215 233 231 225 222 212 188 176 199 238 248 221 193 191 197 179 141 112 110 126 148 171 191 214 255 316 366 362 297
-1536 297 212 156 137 134 132 136 143 139 119 109 138 192 225 215 192 195 219 224 205 196 221 257 266 249 235 237 237 210 161 113 89 92 111 145 199 261 289 251 176 134
-1541 134 158 210 235 231 227 233 233 229 240 259 261 243 232 242 251 245 233 231 237 249 275 312 326 297 250 228 242 265 270 253 226 206 209 226 229 204 180 196 247 286 282
-1546 282 254 236 226 201 147 87 52 54 79 100 107 113 125 132 121 106 114 150 188 214 237 265 281 270 237 198 158 124 110 123 153 183 205 213 197 168 156
-1550 156 182 226 253 259 263 265 246 204 159 126 111 122 163 206 210 185 189 250 318 325 280 241 238 239 209 163 145 171 222 260 263 239 220 225 242 240 214 195 217 270
-1555 270 312 310 265 210 181 190 228 266 270 223 147 96 109 158 182 153 115 119 159 191 202 221 262 292 288 276 293 328 339 314 278 256 238 214 199 211 240
-1560 240 255 240 210 184 165 148 142 149 160 158 147 150 171 185 174 154 148 159 170 177 195 222 228 195 143 117 141 201 266 304 310 301 290 266 214 149 115 131 167
-1564 167 183 175 166 161 149 134 133 150 170 189 207 216 201 169 151 168 208 243 258 242 197 148 132 161 196 195 168 164 207 267 297 283 255 245 258 273 272 254
-1569 254 245 263 300 327 322 292 269 274 292 292 271 250 246 240 215 185 183 211 238 244 247 267 292 297 285 281 296 310 299 265 230 216 227 255 283 296 281 240 199 191
-1574 191 224 265 276 260 248 252 249 230 214 217 228 229 226 228 226 212 207 235 285 316 306 267 224 197 198 217 230 228 229 249 272 273 267 287 326 342 316 277 248 222 194
-1579 194 183 199 223 232 231 233 227 203 180 176 179 167 148 152 185 226 257 267 256 230 213 226 258 281 285 282 285 300 323 344 349 338 326 317 294 248 207 198 212 217 211 226
-1584 226 266 293 275 240 232 258 286 295 303 332 369 374 329 271 244 247 236 192 151 156 195 228 237 239 241 241 248 275 308 307 271 241 253 292 322 328 319 303 280 255 233
-1589 233 224 227 233 226 210 220 272 325 321 264 224 244 292 313 297 269 243 226 230 256 278 278 272 278 287 280 272 282 293 280 256 251 261 253 225 203 189 167 146 163 217
-1594 217 260 271 287 336 382 371 308 242 210 203 207 221 245 270 285 285 277 277 294 319 337 351 374 397 393 363 336 326 307 263 225 226 253 267 261 264 292 325 344
-1599 344 342 317 277 242 233 242 242 233 240 268 289 282 261 247 238 233 242 268 289 285 273 288 331 370 378 360 335 311 293 289 303 328 341 327 290 253 240 250 263 263 255 253
-1604 253 258 257 249 246 252 252 234 217 225
-1605B25
##END=	
##END=	
