##TITLE=	EbzatlE$Sj2s4iNyNmOXug.64.ser
TM-VI-147 hmbc

##JCAMP-DX=	6.0	$$ MestReNova 14.3.0-30573
##DATA TYPE=	LINK
##BLOCK_ID=	1
##BLOCKS=	2    
##ORIGIN=	Mestrelab Research S.L.
##OWNER=	hrzepa
##$MNOVA/LINK_BLOCK_TYPE=	ITEM	$$ NMR Spectrum
##$MNOVA/ITEM/POLYGON=	(XY..XY)
5321,5835
8722,5835
8722,8208
5321,8208
5321,5835
##$MNOVA/ITEM/Z=	0
##$MNOVA/ITEM/ANGLE=	0
##TITLE=	EbzatlE$Sj2s4iNyNmOXug.64.ser
##JCAMP-DX=	6.0	$$ MestReNova 14.3.0-30573
##BLOCK_ID=	2
##DATA TYPE=	MNOVA NMR VIEW DATA
##DATA CLASS=	MNOVA VIEW DATA
##$MNOVA/2D/THRESHOLD=	3.50064849853515625
##$MNOVA/ITEM/ZOOM/X=	-0.47893103590269503478,	14.508270000071124883
##$MNOVA/ITEM/ZOOM/Y=	-9.5608721214139968936,	250.07129999451962021
##END=	
##TITLE=	EbzatlE$Sj2s4iNyNmOXug.64.ser
##JCAMP-DX=	6.0	$$ MestReNova 14.3.0-30573
##BLOCK_ID=	3
##DATA TYPE=	nD NMR SPECTRUM
##DATA CLASS=	NTUPLES
##NUMDIM=	2
##ORIGIN=	Bruker BioSpin GmbH
##OWNER=	nmr
##.OBSERVE FREQUENCY=	400.20280139999999847
##.OBSERVE NUCLEUS=	^1H
##.SOLVENT NAME=	CDCl3
##.PULSE SEQUENCE=	hmbcgplpndqf
##LONGDATE=	2021/11/04 01:36:13.000
##.ACQUISITIONMODE=	SIMULTANEOUS (DQD)
##$ORIGINAL FORMAT=	Bruker XWIN-NMR
##$MNOVA/SCALES_VERSION=	9
##$PARAMETER FILE=	(acqu2s, ASCII, /private/var/folders/f6/rjf_tdyn2v98c5c0wvkgn4s80000gn/T/EbzatlE$Sj2s4iNyNmOXug/64/acqu2s, 0)
$$ ##TITLE= Parameter file, TOPSPIN		Version 3.2
$$ ##JCAMPDX= 5.0
$$ ##DATATYPE= Parameter Values
$$ ##NPOINTS= 129	$$ modification sequence number
$$ ##ORIGIN= Bruker BioSpin GmbH
$$ ##OWNER= nmr
$$ $$ 2021-11-04 01:55:49.703 +0000  nmr@CZC2439F63
$$ $$ /opt/topspin/data/agmb/nmr/Nov02-2021/64/acqu2s
$$ $$ process /opt/topspin3.2/prog/mod/go
$$ ##$ACQT0= 0
$$ ##$BF1= 100.63037
$$ ##$FnMODE= 1
$$ ##$NUC1= <13C>
$$ ##$NusJSP= 0
$$ ##$NusT2= 1
$$ ##$NusTD= 128
$$ ##$O1= 12075.7644147886
$$ ##$SFO1= 100.642445764415
$$ ##$SW= 260.109045168497
$$ ##$SW_h= 26178.0104712042
$$ ##$TD= 128
$$ ##END=
$$ 
##$PARAMETER FILE=	(acqus, ASCII, /private/var/folders/f6/rjf_tdyn2v98c5c0wvkgn4s80000gn/T/EbzatlE$Sj2s4iNyNmOXug/64/acqus, 0)
$$ ##TITLE= Parameter file, TOPSPIN		Version 3.2
$$ ##JCAMPDX= 5.0
$$ ##DATATYPE= Parameter Values
$$ ##NPOINTS= 12	$$ modification sequence number
$$ ##ORIGIN= Bruker BioSpin GmbH
$$ ##OWNER= nmr
$$ $$ 2021-11-04 01:55:53.208 +0000  nmr@CZC2439F63
$$ $$ /opt/topspin/data/agmb/nmr/Nov02-2021/64/acqus
$$ $$ process /opt/topspin3.2/prog/mod/shimcntl
$$ ##$ACQT0= 1000000
$$ ##$AMP= (0..31)
$$ 100 100 100 100 100 100 100 100 100 100 100 100 100 100 100 100 100 100
$$ 100 100 100 100 100 100 100 100 100 100 100 100 100 100
$$ ##$AMPCOIL= (0..19)
$$ 0 0 0 0 0 0 0 0 0 0 0 0 0 0 0 0 0 0 0 0
$$ ##$ANAVPT= -1
$$ ##$AQSEQ= 0
$$ ##$AQ_mod= 3
$$ ##$AUNM= <au_zg>
$$ ##$AUTOPOS= <33 >
$$ ##$BF1= 400.2
$$ ##$BF2= 100.63037
$$ ##$BF3= 400.2
$$ ##$BF4= 400.2
$$ ##$BF5= 400.2
$$ ##$BF6= 400.2
$$ ##$BF7= 400.2
$$ ##$BF8= 400.2
$$ ##$BYTORDA= 0
$$ ##$CAGPARS= (0..11)
$$ 0 0 0 0 0 0 0 0 0 0 0 0
$$ ##$CFDGTYP= 0
$$ ##$CFRGTYP= 9
$$ ##$CHEMSTR= <none>
$$ ##$CNST= (0..63)
$$ [...]
$$ 0 0 0 0
$$ ##$ShimPowMaxUC= (0..63)
$$ 130000 130000 130000 130000 130000 130000 130000 130000 130000 130000 130000
$$ 130000 130000 130000 130000 130000 130000 130000 130000 130000 0 0 0 0
$$ 0 0 0 0 0 0 0 0 0 0 0 0 0 0 0 0 0 0 0 0 0 0 0 0 0 0 0 0 0 0 0 0 0 0 0 0
$$ 0 0 0 0
$$ ##$ShimPowMaxUG= (0..63)
$$ 524287 524287 524287 524287 524287 524287 524287 524287 524287 524287 524287
$$ 524287 524287 524287 524287 524287 524287 524287 524287 524287 0 0 0 0
$$ 0 0 0 0 0 0 0 0 0 0 0 0 0 0 0 0 0 0 0 0 0 0 0 0 0 0 0 0 0 0 0 0 0 0 0 0
$$ 0 0 0 0
$$ ##$ShimPowRcbType= 3
$$ ##$ShimPowRes= (0..63)
$$ 1e-20 1e-20 1e-20 1e-20 1e-20 1e-20 1e-20 1e-20 1e-20 1e-20 1e-20 1e-20
$$ 1e-20 1e-20 1e-20 1e-20 1e-20 1e-20 1e-20 1e-20 0 0 0 0 0 0 0 0 0 0 0 0
$$ 0 0 0 0 0 0 0 0 0 0 0 0 0 0 0 0 0 0 0 0 0 0 0 0 0 0 0 0 0 0 0 0
$$ ##$ShimPowRng0= (0..63)
$$ 1 1 1 1 1 1 1 1 1 1 1 1 1 1 1 1 1 1 1 1 0 0 0 0 0 0 0 0 0 0 0 0 0 0 0 0
$$ 0 0 0 0 0 0 0 0 0 0 0 0 0 0 0 0 0 0 0 0 0 0 0 0 0 0 0 0
$$ ##$ShimPowRng1= (0..63)
$$ 1 1 1 1 1 1 1 1 1 1 1 1 1 1 1 1 1 1 1 1 0 0 0 0 0 0 0 0 0 0 0 0 0 0 0 0
$$ 0 0 0 0 0 0 0 0 0 0 0 0 0 0 0 0 0 0 0 0 0 0 0 0 0 0 0 0
$$ ##$ShimPowRng2= (0..63)
$$ 1 1 1 1 1 1 1 1 1 1 1 1 1 1 1 1 1 1 1 1 0 0 0 0 0 0 0 0 0 0 0 0 0 0 0 0
$$ 0 0 0 0 0 0 0 0 0 0 0 0 0 0 0 0 0 0 0 0 0 0 0 0 0 0 0 0
$$ ##$ShimPowRng3= (0..63)
$$ 1 1 1 1 1 1 1 1 1 1 1 1 1 1 1 1 1 1 1 1 0 0 0 0 0 0 0 0 0 0 0 0 0 0 0 0
$$ 0 0 0 0 0 0 0 0 0 0 0 0 0 0 0 0 0 0 0 0 0 0 0 0 0 0 0 0
$$ ##$ShimSysFunc= (0..63)
$$ 1 2 3 4 5 7 9 11 15 16 8 10 12 14 6 17 13 18 19 20 0 0 0 0 0 0 0 0 0 0
$$ 0 0 0 0 0 0 0 0 0 0 0 0 0 0 0 0 0 0 0 0 0 0 0 0 0 0 0 0 0 0 0 0 0 0
$$ ##$ShimSysMatrix= 0
$$ ##$ShimSysType= 1
$$ ##$TFXNUM= 0
$$ ##$TRIPLO2= 0
$$ ##$VTU= 2
$$ ##$VTUETH= <149.236.99.20>
$$ ##$VTUTY= <no>
$$ ##$WBREFAM= (0..15)
$$ 135.5 97.7 100 100 100 100 100 100 100 100 100 100 100 100 100 100
$$ ##$WBREFLM= (0..15)
$$ 0 0 0 0 0 0 0 0 0 0 0 0 0 0 0 0
$$ ##$WBREFPH= (0..15)
$$ 72.26 -67.22 0 0 0 0 0 0 0 0 0 0 0 0 0 0
$$ ##$WBSGU= (0..15)
$$ 0 0 0 0 0 0 0 0 0 0 0 0 0 0 0 0
$$ ##$XFAC= 2
$$ ##END=
$$ 
##$DECIM=	3328
##$DSPFVS=	20
##.ACQUISITIONSCHEME=	NOT PHASESENSITIVE
##NTUPLES=	nD NMR SPECTRUM
##VAR_NAME=	FREQUENCY1,	FREQUENCY2,	SPECTRUM
##SYMBOL=	F1,	F2,	Y
##.NUCLEUS=	13C,	1H
##.OBSERVE FREQUENCY=	100.64244576441500101,	400.20280139999999847
##VAR_TYPE=	INDEPENDENT,	INDEPENDENT,	DEPENDENT
##VAR_FORM=	AFFN,	AFFN,	ASDF
##VAR_DIM=	512,	512,	262144
##UNITS=	HZ,	HZ,	ARBITRARY UNITS
##FIRST=	25164.767445380970457,	5806.2096540000038658,	0.31124311685562133789
##LAST=	-962.11409912165936476,	-191.66820056731904742,	0.16335557401180267334
##MIN=	-962.11409912165936476,	-191.66820056731904742,	0.0021428666077554225922
##MAX=	25164.767445380970457,	5806.2096540000038658,	17.961284637451171875
##FACTOR=	1,	1,	0.0034213878574563846673
##PAGE=	F1=25164.8
##FIRST=	25164.767445380970457,	5806.2096540000038658,	0.31124311685562133789
##DATA TABLE=	(F2++(Y..Y)), PROFILE
$$ [...]
##PAGE=	F1=1849.98
##FIRST=	25164.767445380970457,	5806.2096540000038658,	0.58491271734237670898
##DATA TABLE=	(F2++(Y..Y)), PROFILE
876B17M3j91l7P1J1jo1Pk3J4J1R%QQ3j11J15p7k4J12k5r1kJ3KJJ20m8o4j4M0q2Q7p5k4K9J65
442B08j18K7j5N4J12k06J21j78Q8J67l9l5n1o1pJ09J33j76m8oj1J8P9q9J32n0r8J2l9J29p3
78H9J01q0l2O5O0k9j6n4kR5PJ14J23k06j67k3O6J65o2j18P5j3o
$$ plain form
876 217 260 69 32 103 114 113 52 59 36 50 61 70 70 78 161 50 165 88 64 176 151 60 58 71 73 74 194 146 82 68 108 26 113 38 14 43 208
442 208 90 117 102 156 268 62 183 5 93 260 221 186 135 74 67 176 309 133 85 79 68 86 165 76 208 158 60 72 33 162 89
78 89 190 110 78 143 203 174 158 104 102 197 204 318 441 235 68 45 111 276 214 96 171 158 152
-192A52
##PAGE=	F1=1747.72
##FIRST=	25164.767445380970457,	5806.2096540000038658,	0.48268479108810424805
##DATA TABLE=	(F2++(Y..Y)), PROFILE
5806A42j8p5L0k1J85j00o1p0R9L2k3M2j06J30O4p4n0k9J41j17L2K5Ok7k2k6N9L2k3o2R8N3
5431B66M3N4k66K4l6L1l1K4j9o5J03pK7j12K12n2j25k5L1P2P2m6n7p4K20K1k55J61j12P9N9
5067B17p3P2m3q0J8M5j5ML6j60K19J26q3j41j1N9j34O1n5P7N8r3j7J40j4j5j82J81m4q6rO0
4691A18L7ol5O8k3N8q3r6K09Q9j37r1q2N0l3R1m3rk7Q0J88p7j03M9m5Q9p1m8j7R0n8j02jJ13
4292A42L9J90k15k7J8l6O3p9J42J6j13k0l9Jl7N0k2n9L7N8o9N6P7j01L8KlMp1J53M3j70%o
3893F2R4R4j32N2J27j10j44J2J12J07Nj01r1oNK7n8K5J40o3l5J16p6o3J10jj07k9n9P5N5q0
3517F3n6NR5R8P7j76O1m7j7L8K0o7J0pRP8K7j36J79j23O7j72R6j08J82j14j2K9P4L9K8m6j6
3130A78Jp4K5n4R5l1l3N3L8j78J83J8j6J19k8q1j60J35p7J02O6K7j6k14L7j8J5J23r7Q5j43
$$ plain form
5806 142 124 49 79 58 243 143 82 12 111 143 120 162 56 186 250 176 126 97 238 121 153 178 184 157 135 109 168 200 177 115 213 266
5431 266 309 363 97 121 85 116 85 109 90 25 128 121 148 36 248 196 71 46 77 149 221 175 118 44 264 285 30 191 79 158 217
5067 217 144 216 173 93 111 156 141 145 181 21 240 366 283 142 131 190 56 117 62 139 197 104 87 227 213 198 16 197 153 67 58 118
4691 118 155 149 114 182 159 217 134 38 247 336 199 108 26 76 43 134 91 82 55 135 323 246 143 192 147 236 165 117 100 190 132 30 29 142
4292 142 181 371 156 129 147 111 174 95 237 253 140 120 81 82 45 95 73 14 51 109 40 96 173 72 110 112 109 113 42 195 238 68 68 62
3893 62 156 250 118 170 297 187 43 55 167 274 279 178 87 81 86 113 55 80 220 157 122 238 162 99 209 208 101 72 13 88 143 63
3517 63 7 12 107 205 282 106 167 120 103 141 161 94 104 97 106 184 211 75 254 131 198 26 122 14 196 82 70 99 173 212 240 194 178
3130 178 179 105 130 76 171 140 107 160 198 20 203 221 205 324 296 215 55 190 113 215 281 308 292 78 115 97 112 235 138 223 80
2766H0J05m2l5K0N3j15J9O5O8O4j17o9J26j79M9n2L8R2l1k1N9j24M3M4L0J82j19k03Q6j0J16
2402B22O2j86%R4Qj58J21j19M3P1pQ9n1k3q5P7L8o8m7O3Q6q6p6J81j89O0j3o3K3N1q2K0Mj1
2003D9oJ27r4nK9j8P6M5n2N6q0m6J28R3k04J3J2k2P1ko5L4j09J40K5q7J7J22k7r3k6J34j05
1616A30J02J0j98J96j3j03J42j15L9J98j78p6J0j4m3m6K6J12q1k6m2R3m1N2j14Q1P3M5o3l8
1264A18M9K1l6j6k3R3j7j43mO2kJN4qm2J5O8L5q2n0k0J5Km7R6J7M7n2l4K6K1o7J72j0j89j6
841E4L1L9j3m8Kn3Q7Pk0k7O2J1p4P8J0j34J94j4j14l4l9N6L0J33m3j34M4K8j00P0p2nQJ97
442B17j00L3o8O3J28j89J35j93Q5J49o1m6k7o0k4J14J94j75p8j1L2l3R2j13J83j7j28k1p1
102A0J19o6J15p4j6O9L7J0q5l7K9LK0J60J34j96j25q8J43J46n4j54J08k6k7
$$ plain form
2766 80 185 143 108 128 181 66 85 150 218 282 165 96 222 43 92 40 78 170 139 118 177 53 96 140 170 352 233 30 116 106 222
2402 222 284 98 98 192 200 42 163 44 87 158 151 240 189 166 81 158 196 128 81 144 230 144 68 249 60 120 107 44 67 118 36 56 60 49
2003 49 43 170 76 71 100 82 158 203 151 207 127 81 209 302 98 111 123 101 172 170 105 139 30 170 195 108 125 247 220 127 101 235 130
1616 130 232 242 44 240 227 124 266 151 190 388 210 134 144 130 87 41 67 179 98 72 30 123 82 134 20 101 174 219 156 118
1264 118 167 188 152 136 113 206 189 46 42 104 102 103 157 149 107 122 190 225 143 93 73 88 90 43 139 156 203 151 117 143 164 97 269 259 70 54
841 54 85 124 111 63 65 12 99 106 86 59 121 132 58 136 146 12 206 192 78 44 5 61 91 224 181 47 91 119 19 89 17 12 20 217
442 217 117 150 82 145 273 84 219 26 111 260 199 153 126 66 42 156 350 175 97 86 118 85 177 64 247 230 102 81 10
102 10 129 63 178 104 88 157 194 204 119 82 111 114 134 294 428 232 107 19 162 308 254 100 208 182 155
-192A55
##PAGE=	F1=1645.46
##FIRST=	25164.767445380970457,	5806.2096540000038658,	0.2256622016429901123
##DATA TABLE=	(F2++(Y..Y)), PROFILE
5806A26J9j06N7m6J92j11j05k3J51K1n2M1j32J84K6o9k4o5J38p6J5K1J7n2o7j0P6N2Kl6M6
5442B10N1J3P5k74N9o2nl8P2k1m4P3K0M1j14J42m1j42M0K8M3Q6l9m5j1J71N1k48O4n3K0O8
5067A90o3Q6m1j06M7j2K5J6K9j34J89J61q5j81N9L7j48k3k2J15M7l7j13K05K0r7j03J49j3
4726A97j21n1P5O8J7o5J11o9R8r5q8J26J39j16q3j33K4RO9oPj3M4J97q8j01K6k6Q0l6r1MP0
4339A79m9q3L4R3m2K29j65j02K9n2P7l8J34l8j9j42L2n0J9KK9l8k7R5p2J10N1p5J2k9K1Lo4
3952F4J26M9j46l5J5Q6R5j45L6J53j29j53N2R7J44l8j44p7M6K6l2o0K3J22n8K5J33q7l3P2
3600B27j2j21n8j5L4Q1n0p8K8RJ14J21j41J7noqO3o6l9J0lN5Rr7K02j65J09j86J15j22J44
3224A66r3qQ9j3M8J12j05NP2r9l6m6Q5j5n2M2K9j71J97M7p7J34j1j22j14J42o5M4M9J26l9
$$ plain form
5806 126 145 39 96 50 242 131 26 3 154 175 123 164 32 216 242 173 149 84 222 146 161 182 199 147 80 70 146 198 200 164 210
5442 210 261 274 349 75 134 72 67 29 101 80 36 109 129 170 56 198 157 15 55 83 126 212 173 128 117 288 339 91 155 102 122 190
5067 190 127 213 172 66 113 101 126 142 171 37 226 387 302 121 180 217 69 46 24 139 186 149 36 241 261 164 61 210 197
4726 197 76 25 100 168 185 120 231 162 260 165 77 203 342 226 143 10 34 43 112 106 113 100 144 341 253 152 178 152 232 196 105 109 179
4339 179 130 47 81 174 132 361 196 94 123 71 148 110 244 206 187 45 77 27 46 48 77 39 12 107 35 145 196 121 133 104 125 128 64
3952 64 190 239 93 58 73 159 254 109 145 298 169 16 68 165 309 271 127 50 96 122 90 30 53 175 117 142 275 188 155 227
3600 227 215 94 36 21 55 136 86 8 36 45 159 280 139 156 151 145 137 200 134 95 105 102 157 166 69 271 106 215 29 144 22 166
3224 166 73 65 154 141 189 301 196 201 273 174 138 92 177 162 110 152 181 10 207 254 177 311 300 178 64 206 141 185 234 360 321
2860C21k27L4m5jJ61j35R3j11R4l2n0L9O6j33L6M1N4O9j59m2J23j55N3J5k8Q1K2q4R1j19L8
2496A10P5k0J62j35j83J01PR8N0j56j9P0N7j58J15j22O0M4m0R9K6r8q0Q0j0On1R9J1r4k5J63
2121B42j79N6m3J5K7L0j26LM3k9K4J24r3o0JM7J04L5o3L0l5q3J29J20j89Mq0Q1L1jj7qj20
1733B0J71M7r3J7J20n9p2n1J20o7J07J4j95J24nk5J46j13k0J75j63p3L7q2k2K5l5J15q0po
1369G0M2n0O1j13J17J5M8n6NJ3ln9L9l1Q5qj08Oj5%L5RN5l4N5K6P5j18j02J5%j1j9M2O0M7
947A93r9J3N2L6o0J57o8j72J2J7L7l1k9Rm1J04Ol3j5O0m4l5P4Q7j89J88%j17J3n6oK1J36l4
548A86j69J05%p9K6o4J6k1J92n3K8r9P5J27j58J33j91O1J35o9n1j8n7J5M3K49j30j31lN3p0
184H1R5j22K15J7j32n8l9K7m3J25o3J4M2PN4j17l0N8o4K6J46J40j64q8j00J69J03k9j35R6
$$ plain form
2860 321 94 128 83 82 243 108 201 90 184 152 102 141 207 74 110 151 205 274 115 73 196 41 94 109 81 162 184 100 191 72 110
2496 110 185 165 327 192 9 110 117 215 265 109 90 160 217 59 174 52 112 156 116 215 241 143 63 143 133 139 88 187 198 104 79 242
2121 242 63 119 76 91 118 148 22 25 68 39 63 187 94 34 35 82 186 221 158 188 153 70 199 319 130 134 54 135 166 165 148 140 20
1733 20 191 238 145 162 282 223 151 100 220 153 260 274 79 203 198 173 319 206 186 361 198 125 162 80 58 83 48 163 83 76 70
1369 70 112 62 123 10 127 142 190 134 139 152 149 90 129 98 183 175 67 73 58 58 93 102 157 123 178 204 279 161 59 74 74 63 44 86 146 193
947 193 94 107 159 195 135 292 224 52 64 81 118 87 58 67 26 130 136 103 88 148 104 69 143 230 41 229 229 112 125 69 63 84 220 186
548 186 17 122 122 43 69 5 21 0 192 139 167 68 143 270 112 245 54 115 250 181 130 112 55 70 113 362 232 101 98 151 81
184 81 176 54 269 286 154 96 57 84 41 166 103 117 159 166 220 103 73 131 67 93 239 379 215 127 27 196 299 270 135 231
-168B31l3l6
$$ plain form
-168 231 198 162
-192A62
##PAGE=	F1=1543.2
##FIRST=	25164.767445380970457,	5806.2096540000038658,	0.34507462382316589355
##DATA TABLE=	(F2++(Y..Y)), PROFILE
5806A11M5j21M9l0J89j21q5kJ52K8p6K6j34K16j0o5J7r7J10n4J1J5K9o7j11N3M3N7K3JrM4
5431B37j5Q0k40P4n4m5jP8l0Lj3M4N1q4P6l5r4M5QK0R5k7k0K8J07P3k29l3Ql8P2m0R2j7j32
5020D4O6o0N3J0J8o7J21J90o9j89P7J4j20o5oJ08M2J8j59K07N4j61j6J06L6j67n3M5Q2L8p5
4656A22J33j11J36r2p9N4J45p0q4j37K1L7J1J4K7K8OJ79r2j04KrP5J5j36LN4l3j9M1O4j26
4280G5K47r8j75O8o6O0KJ09n7Q4k21L3m1J9k5O0Qo1Q3m8J23N5n0l1o0K7K6m3P3L9j05p0M9
3893H9N2J03j12k0J66j37j24O2Q0J81r0j90n4Q8N3o8l7RP3n9Q3J34q7OL3k8j19k2nk5Q0j6
3517I9p3M6n0J07J33j06k3L2J1m3Q9o3r0M0rK6j2j6J71j91J54j77J08j23R5p4J8J14q6M8J73
3154C28j49K7J29j11p7n0O9Jn5K8J1j46J89P1j16J32J0j56o0J18n0qN4K32r9k19J4j9m0J88
$$ plain form
5806 111 156 35 84 54 243 122 37 35 187 215 139 165 31 247 237 172 189 92 202 148 159 174 203 136 25 78 121 178 201 202 193 237
5431 237 222 302 62 136 82 37 36 114 84 87 74 118 169 85 161 126 32 77 85 105 200 173 153 181 288 361 132 99 107 69 141 101 193 176 44
5020 44 110 50 103 113 131 64 185 375 306 117 194 208 88 23 17 125 167 185 26 233 287 126 110 216 252 85 32 77 159 197 122
4656 122 255 144 280 188 109 163 308 238 154 17 38 75 86 100 127 155 161 340 248 144 146 137 212 227 91 94 148 115 96 137 201 75
4280 75 322 224 49 117 51 111 113 222 165 249 28 61 20 39 14 74 82 21 104 56 179 234 184 153 93 120 146 103 176 215 110 40 89
3893 89 141 244 132 112 278 141 17 79 159 340 250 60 6 94 147 79 42 51 124 65 148 282 195 201 234 206 87 65 60 35 115 99
3517 99 26 72 22 129 262 156 133 165 176 133 222 159 69 109 100 126 114 98 269 78 232 55 163 40 135 61 79 193 107 155 328
3154 328 179 206 335 224 147 97 166 167 112 140 151 5 194 265 149 281 291 135 75 193 143 135 189 421 322 103 117 98 58 246
2801B46j08L0p1Q3l8n7P2O8j62O4K0J9O6j51J0P5p6N9J7r1O8Q3j44J08j03K9J00q1J46j17
2449A64j14O9J1N9K3j00k1K4J11j29R1j19Q1k0k3O4R5j44q1Q1m3R8q3J18p1o5O3R8j66M9q4
2085C6J03L4lj40j8N4k8L4J15r1r4M2L4J14L7p3oK3j18J16J56j61nj54J57j3lK6k9r7J73N4
1710B75q6oJ09r2m5o8J09k7R2K2j83O3K7NJ51r2q0J41j38p7P2j14J6N4p4R1p1J3K1j5o4O7
1334I6m8J37n7L8n5L7qk3r3J06l4N2j0k4j5p3j2R1n5J16k4P7%J00j39j51N5rk6K0oP2L4j30
935C9M4P3N8l9J13j22j37K5K4J6m3pK7l4R7J5l5OL4o7j1Q4J30j99J48J3j06L6o4n6LJ18j8
548A65j29J11k5p7K1n4K3j7J24QJ0q5P4J11j22J15j74J9J36p2n2j4k8P5q9K91n9j77j4P0r2
184G3P7j05K25M4j18q6j4n1k1J41m5L8ql0R2j05m0P9n5K3N1J49j26n8m7J25M0Rq5O2k4m1
$$ plain form
2801 246 138 168 97 180 142 85 157 225 63 127 147 166 232 81 91 166 90 149 166 75 143 226 82 190 87 116 216 135 281 164
2449 164 50 119 130 189 212 112 91 115 226 97 188 69 150 130 107 171 266 122 41 122 79 177 94 212 141 76 139 237 71 120 36
2085 36 139 173 170 30 12 66 38 72 187 96 2 44 78 192 229 156 150 173 55 171 327 166 161 7 164 151 148 174 145 48 221 275
1710 275 189 183 292 200 155 87 196 169 261 283 100 163 190 195 346 254 174 315 177 100 172 58 74 128 54 145 74 87 108 93 29 96
1334 96 48 185 128 166 111 148 140 117 24 130 96 148 138 114 99 26 14 105 50 166 142 219 219 319 180 29 84 75 49 69 63 135 169 39
935 39 83 156 214 175 288 166 29 54 78 94 51 44 71 37 134 149 114 120 154 87 76 160 290 91 239 252 146 182 118 62 65 183 165
548 165 36 147 122 45 66 12 35 18 142 150 160 75 149 260 138 253 79 98 234 162 110 96 68 143 54 345 286 109 95 165 73
184 73 150 45 270 314 196 110 96 45 24 165 120 158 150 120 212 107 67 146 91 114 165 314 188 130 83 208 248 257 172 234 210 169
-192A69
##PAGE=	F1=1440.95
##FIRST=	25164.767445380970457,	5806.2096540000038658,	0.53596490621566772461
##DATA TABLE=	(F2++(Y..Y)), PROFILE
5806I2O5j24K5J2J66j25k7jJ17M5q8J0j21K19k9o1M9j20P6m5RJ2L9o8n2L7j3M6M0L6p0M9k8
5419A72N8j64O5l9o5P8M3m8K3r1N3N3l2M6m1m8L7k1J9R2j1rN1M6P6k03j05O2p1N7QO2K4j43
5020C4O3p6N5l%J8L4K07m3j53L4lp0j8l0M9M9N9j39J45P6j76L7O6P6k08l1J3O1N8p4J36j34
4632A12J60p7o3NJ10j1j01j06K4N6m5J1M5R2m2J42q3j14j0LP5P1j41m6L5k0N0M6L4j81K36
4269B67k6k38J22n3j0L5P6k2J45k12m7KMk2N2L7p3O2k0J13O4k2o7q3K5O0j8MJ5n0p9N8MJ25
3870B28n9r3J62j27p1M4O8K11j37k03M6J8P0q1j1J0Rp5J34J23q3N3pl9q1J5k9l8K7K4n1N2
3494A09k5Q3P2q4n1N8L5p0J01n9j36Q1j0Kl9O4J20j96J90j73R4j26O4m3J6J33j34N2J84j64
3142A48M0J67j13r6m5M0J1l6J3qj06J55P9j30J29J6j68j4P4l3l4R5K37j44j74k7O4q6J89o7
$$ plain form
5806 92 157 33 58 70 236 111 84 83 200 245 157 167 46 265 236 175 224 104 180 135 144 156 195 127 75 112 99 145 185 221 151 200 172
5419 172 230 66 131 92 27 105 148 100 123 32 85 138 106 152 111 63 100 79 98 190 179 170 221 267 343 140 35 97 26 83 91 153 177 34
5020 34 97 21 76 73 73 91 125 332 289 136 170 167 97 79 49 98 147 206 67 212 288 112 149 215 291 83 52 65 126 184 110 246 112
4632 112 272 195 132 137 247 236 135 29 53 109 64 75 120 212 170 312 229 115 105 108 183 254 113 67 102 82 132 178 212 31 267
4269 267 241 3 125 72 62 97 173 151 296 84 37 39 43 21 73 110 37 99 79 192 256 234 167 84 109 169 151 155 170 120 41 99 103 228
3870 228 169 76 238 111 40 84 152 363 226 23 69 87 157 76 65 75 84 9 143 266 183 236 229 190 109 124 95 57 84 108 57 109
3494 109 84 167 239 155 104 162 197 127 228 169 33 114 104 106 67 131 251 55 245 72 166 40 104 61 77 210 76 128 312 148
3142 148 188 355 242 146 101 141 152 116 129 121 15 170 249 119 248 264 96 82 156 123 89 184 421 277 103 76 140 54 243 176
2790A76m4l0P9o1n6J11N6j92R5J3m0O0q0N6Oj6O9%j39N9J31j73R4q0K4J07j37J27o9l4K1J
2414A34K7k1m0ml2J67q5N9j20J03j03P8l2J33j47q7P3n4J61j03J09j47M5P9L9j44N2j25J48
2074A63N8m4j10m3K8pJ9J05r3l8N2k3J12M3o6m7P9j45Q3J94j19j6j41J41m3j2N3l1p3J69M9
1710B97o0k1O8j20k0q4J15J0N2L3j62K0O6pJ59o2j30R9j01p9J02p7J6N0q9N3n8L7K6n2n7L8
1334F2L8J30j10L0n6N5j8k6m9P9k7oqM6k8q5mJ00j03J48j6R1j3J12j37j89R3On6N0k1L0K1
947A39q2nQ4Q3k7O9j58o7pL9rk8lM9l5P3M0m7L3pm6j1Q2J50j77R9K5q6L6o8p8J3N1Lo0R1l2
513A26p4L2m8J1j6N3O5k3l1N9R3r0Q1j41l0J47p2o2OL2J01k12K98J5j91m7Q0r5K9p0K26N7
137C09r4r9%o9j2J49l5N0o5p5J13o2n2Q6k3L5o7J58r2l0J5O1l3N4k8K4Lm6
$$ plain form
2790 176 132 102 181 120 64 175 231 39 134 147 107 167 87 143 149 133 202 202 63 122 253 80 174 94 118 225 88 215 146 112 133 134
2414 134 161 140 100 96 64 231 146 205 85 188 85 163 131 264 117 30 103 49 210 107 216 69 114 193 232 88 140 15 163
2074 163 221 177 67 24 52 45 64 169 76 38 90 67 179 222 156 109 188 43 126 320 201 185 44 185 142 130 183 152 79 248 297
1710 297 237 216 284 164 144 60 175 185 237 270 108 128 194 187 346 284 154 253 152 73 175 98 114 164 75 128 70 107 133 81 24 62
1334 62 100 230 120 150 94 149 131 105 56 135 108 102 94 140 112 27 23 123 20 168 152 243 230 342 205 16 109 115 59 109 88 118 139
947 139 57 52 136 219 192 261 103 36 29 68 59 31 28 77 42 115 155 108 141 134 88 77 159 309 132 231 256 170 206 138 60 73 124 127 67 158 126
513 126 52 84 36 47 31 84 149 126 95 154 247 157 238 97 67 214 142 80 86 118 219 7 305 320 129 82 162 67 96 26 252 309
137 309 215 116 116 47 35 184 149 199 134 59 172 110 58 144 121 156 89 247 155 125 140 201 168 222 194 218 221 175
-192A75
##PAGE=	F1=1338.69
##FIRST=	25164.767445380970457,	5806.2096540000038658,	0.63235485553741455078
##DATA TABLE=	(F2++(Y..Y)), PROFILE
5806F7Q3j10K3K6J29j28K0K2O2N7r0Rr2J80k8n2O5j42O5l6j6J8M9o3LJ6n0L4M9M5j34R4k4
5419A51Mr0N7j9p3J34K4o1J9j05QL1L4M5n0l3M0m8L7P8Pk1O2MN5j65q5L7j0l4P8j4P7j47M7
5008G4m2K5J0j9O7l2J83j1r3m7rj2K4m3rP1P4j21J01P2j27L2M0R6k35j0J8kP5o5J20j27J58
4621B36o1k5k5N2M6j34jm0Q4p3k1N5J69r1Q5o3j27j1K4P5J16j08r1%l2J10M8Mj54J59M1k13
4245C4J02j4r4L1M5N9J56k01j02K6K1k3K6M7q1O1jR1O6J3q8q8M5O1No4j8J2m2K1n5J65qj57
3846E1J37j01k6K8O0K27j70j24M8l5N8q5K2K3n1j7Q2J09p8J01m5l8j7J1n3l4l0P0k8M5j6J19
3470B43k0q3o6P6N8q9J05m4j67J06oj2o3J15P2j75K02j77P8j18L8J6l3J52j54P1J35j41K6
3130A45J87j08j00j8%J4kMj4q2J15O8j29J36qj51K9K2nl8J13J31j24q6o3J59r4J28l8r4OQ8
$$ plain form
5806 67 150 40 63 89 218 90 110 132 194 251 161 170 78 258 230 178 243 101 166 130 114 132 181 118 121 137 87 121 170 215 81 175 151
5419 151 155 65 122 103 30 164 188 127 146 41 49 80 114 159 109 76 116 68 105 183 190 169 231 235 290 125 40 77 67 33 111 97 174 27 74
5008 74 32 57 67 48 115 83 266 255 162 115 106 94 118 75 66 137 211 90 191 263 136 168 208 304 69 59 77 75 150 85 205 78 236
4621 236 175 150 125 177 223 89 88 48 132 59 38 93 262 171 256 193 66 55 79 154 270 162 71 71 39 149 197 201 47 206 247 34
4245 34 136 122 28 59 104 163 319 118 16 42 63 40 66 113 32 93 92 183 249 262 174 86 131 192 197 133 115 127 85 106 51 216 208 51
3846 51 188 87 61 89 149 376 206 82 130 95 153 68 90 113 62 45 127 236 158 259 214 176 159 170 117 83 53 123 95 140 124 243
3470 243 223 140 74 150 208 119 224 180 13 119 113 101 38 153 225 50 252 75 153 35 73 89 56 208 54 125 260 119 145
3130 145 332 224 124 106 106 120 118 122 108 26 141 209 80 216 208 57 86 108 103 65 178 309 185 99 36 195 101 229 191 97 103 191
2754A91r1m3J35K8j88J00K7r8L2J2R0l7jP3j3j65N3J56j70N4n4K8R2j64R1oM3l7qK0o7j4L6
2367A05o9K07m7J8j16J18j72J92j25J28j09q7M9n9J88r1P1j93J66M7%j04O3j38J19R3q7o1
2038A06o0j5J0PR2j03M1L5o4J01N0m6n6J00j62L7K24o9k8j49J50n6j8N7k2o3J60M1k0j3pj30
1663A30rj02J59K4rM4j34kQ9k4J54l3j60N1n4o6J16j7qL6r0K2m7N9J5n3l1k0J09R7j42L8n0
1276I2N7k5kkK1j5p0QP3l0p1QQ5j18J50j5J07k0J16j22k13J27K6r3P2k9k2K2j7p5P9J04k6
888A82L8j69J0l7K7k8J4k1O8l8L8Q0p8O2n1Pk8N8J52j25M5L5o4K1o5m7L1m5J7LO3j8m1Rl8
477F7j0k3NJ04p4L9L9Q6o6L5r2o9J50o9q3N5Q6R5k21J99P2j70n8N1o4o2j8K18N4p0r3%m5Q
78G6J42m1N3j14j06Q8kn0P9NO0j27J23o2kO6Jq7P8J4%M4n9
$$ plain form
2754 191 100 57 192 220 32 132 159 61 93 105 195 158 157 230 217 52 105 261 91 145 91 119 211 47 138 132 175 138 130 150 83 69 105
2367 105 36 243 196 214 98 216 44 236 111 239 130 43 92 33 221 130 201 8 174 221 221 117 180 42 161 254 167 106
2038 106 46 31 41 48 140 37 78 113 49 150 200 154 98 198 36 73 297 228 200 51 201 145 127 184 162 99 259 300 280 267 260 130
1663 130 121 19 178 202 193 237 103 101 190 166 320 287 127 178 124 58 174 157 149 185 95 117 70 129 144 91 60 40 149 246 104 142 92
1276 92 149 124 122 120 141 126 56 64 137 107 36 44 129 11 161 146 253 233 349 227 14 141 167 74 146 117 95 117 100 25 104 208 182
888 182 220 51 61 24 51 23 37 16 84 46 84 164 86 148 97 104 76 134 286 161 206 241 177 198 133 86 117 72 89 92 155 137 96 105 67
477 67 57 34 39 143 69 108 147 233 167 202 110 41 191 122 39 94 180 275 54 253 325 155 97 148 84 22 4 222 276 206 113 113 68 76
78 76 218 177 230 116 10 98 96 46 125 130 190 63 186 124 122 188 189 102 180 194 194 238 179
-192A79
##PAGE=	F1=1236.43
##FIRST=	25164.767445380970457,	5806.2096540000038658,	0.6369164586067199707
##DATA TABLE=	(F2++(Y..Y)), PROFILE
5806C9R8q6M6OQ6j31N3N9PN0p9K1n3J10j7l4O2j51Q0j8p1L7N2n7K4J3n3M4L9Qj63J69k2l1
5407A37p8N6Rp9J63J3n7mo9j8n6R7M1m2l7M3o5O3N7K9n7O4nJ2r2k9m3O0r7J25j02J32j42J5
5008D4J4jM5oL6j9Q1K2l7j20MK0N6m4n6J01N7j08Q9M1n3rM5Q6k33PL5o8Q0n5Q4q2J23m9M0
4597A70n5JQ9j56J16j40J14p0l5J5K50j25Ml6j31nN7O9J41o7q8j9q2J27M8k7q7P4Q5j82R1
4233A46L0j03p1K8J54J31j91j15K3N3j2l1M4n2N1RO5N3M9q8o6Q0K3J7j12m8P0Kk1q2J79K8
3858B43j82P5o2jK6M9K25j83n8M6o2J9q8O9L8j07M4QJ00o9J38p1k5L7j8p0k9n9J11j2L3l3
3482A32J77q8j04o9Q6P9j03J10j7j59P7Jk8n8J28L3j30J83j85O3p5j0R6j00J49j41R6M4o8
3142A19l8J95j03r0J7k8ML2J0lp7P8M1j17J41n5j01O0j9M3k5J59j35m7M1jJ48q8L9k1j15L5
$$ plain form
5806 39 137 51 97 103 189 58 111 170 177 227 148 169 116 226 209 175 237 86 166 148 77 114 166 109 133 146 93 137 176 184 21 190 168 137
5407 137 59 115 124 45 208 221 164 160 91 73 17 114 155 113 76 119 54 117 174 203 146 210 205 217 125 96 53 113 16 141 39 171 29 44
5008 44 58 57 102 96 132 113 194 216 179 59 63 83 139 95 39 140 197 89 178 219 166 157 202 288 55 62 97 29 109 54 138 56 179 130 170
4597 170 115 116 205 49 165 25 139 69 34 49 299 174 178 142 11 6 63 132 273 206 118 99 17 144 192 165 78 152 237 55 146
4233 146 176 73 2 30 184 315 124 9 32 85 73 42 86 34 85 94 159 212 261 173 107 187 210 227 115 67 137 139 118 36 215 243
3858 243 61 136 74 73 99 148 373 190 132 178 116 135 47 116 154 47 91 99 199 130 268 197 172 209 191 121 92 33 144 132 165 132
3482 132 309 221 117 48 134 213 110 220 203 44 121 122 94 36 164 197 67 250 65 128 53 43 139 39 188 47 143 187 119
3142 119 81 276 173 83 100 72 76 108 118 115 38 116 157 40 181 126 25 85 66 109 84 243 108 61 102 101 249 161 200 179 64 99
2766I9J03j04l4J43j7j29O3N7q4p3Q3J21m4k5P4j9j63M5J50j41Lk9L6O2j11J8L1J06r3pL5
2402A56n3p4R0m8K04l8l4r3J16j77K40j86R4m1q9K6q8J98n4K6j13J57mj4n0O9j61Q1J23j27
2050A36Jo2o0LL4N5r6J08oq4Q9M8k8j6Q2j76lK38j9l7j80J85o3KL2mp4J45L2K5Qr2j13k2n3
1639C5J81Oq6N0r9jQ1j1J24j8j62kml5J15L9m1J6p9Ll0O2%k5l5l9J37N1j51N4k8M5l5L4K2
1229A74k7nj13L4N0l0m8J6P6r4J24l8J30k3J11j03k20J56L6j28R1l8n9M3J2j13N6J16l3J8
876A71j43N1k2k2k6K0j3P5l5LJ18j09P3o7O1m6PJ48o6j2M6m5Jm6K2K1q1j4M1L0RMm0j4k6l1
454D3j3J21j35Q5K1R3m8j6l3o7J10n2q4Q9J22O3k19J17J05j28k1k3jp1j5J47L7n5o6j7j5N1
78A25J30o7N3j41k1n6M3l3O5K0Q8q5J2l2K6R0k9o9L1K7QQ3q9
$$ plain form
2766 99 202 98 64 207 190 61 124 181 97 24 107 228 184 159 233 214 51 96 246 105 108 79 115 177 66 84 115 221 128 121 156
2402 156 103 29 119 71 275 237 203 110 226 49 289 103 197 156 67 93 5 203 149 175 62 219 215 201 151 220 59 140 263 136
2050 136 137 75 15 18 52 107 11 119 113 29 118 166 138 122 204 28 25 263 244 207 27 212 149 151 183 179 105 250 282 307 315 223 110 88 35
1639 35 216 222 136 186 87 86 167 156 280 262 100 98 94 59 174 213 172 188 109 112 82 144 144 119 84 45 182 233 82 136 108 153 118 152 174
1229 174 147 142 29 63 113 83 35 51 127 33 157 119 249 226 337 234 14 170 206 78 169 131 72 115 127 14 70 186 153 171
876 171 28 79 57 35 9 29 16 91 56 59 177 68 141 74 135 89 96 244 178 166 212 167 168 122 144 165 84 70 111 141 150 154 114 100 74 43
454 43 30 151 16 101 122 215 167 151 118 51 161 109 25 114 236 299 80 197 302 174 153 130 129 58 43 190 227 172 106 89 74 125
78 125 255 188 241 100 79 23 66 33 98 118 206 121 133 101 127 217 188 119 150 177 185 268 179
-192A79
##PAGE=	F1=1134.17
##FIRST=	25164.767445380970457,	5806.2096540000038658,	0.48410981893539428711
##DATA TABLE=	(F2++(Y..Y)), PROFILE
5806A5J04n9O1j2M6j33O9R7k7J9n1L5j5K4qnM4j33J01Kj09N4M0m8PK3k5P1J4o5j8J23m0qj02
5395I1M0K3q9J67Ql7l4l4qm0K5K0j7m4L7o4Q0L5N1r9N5K8n3K6k9j04J08j23J41j34J45j12
5020E9k9O3k5O5PjK1k6M9mj08QpP5l6q9J22K2r8J09j3J0n8Q3M9j76LL4n8K1k1PlN1k4J12q8
4586A06l0J09j06J59k11J01m9nm3K85j26q5ll1ljN8J37l1n7k8r2O7M4n4oJ1R4j51R1O6q9n2
4198G5l2J58Q6j75j02QQ0K3j14K8N1rJ4M1K4P6o7k0J03l2J4j34n1J09L4n0m8J37M3j87Mj0
3823G7mL8K9K07j78pM2o7l4r2J31N1j66R8o4J03o2J58p7jN3n7o6l2n4J35KJ9p6K37j09j40
3447I4p3R9R2j07J17J2j67N3Om8k4J12Pq7J51j81M4j6p1J83j28Q7j00J05m5L0j29J90j07l7
3095F2J6k3k8N3L6J4p7M4K3l3N2p9K2%l9Q2M3L19j78k26L7N8J12q1n7j0j05N1J20r0m8J43
$$ plain form
5806 15 119 60 121 109 155 22 91 188 161 180 129 164 149 173 165 160 204 71 172 174 65 119 159 111 118 141 116 187 201 136 118 241 201 193 91
5395 91 131 154 65 232 240 203 169 135 127 87 112 132 115 71 108 44 124 159 210 111 166 194 141 167 138 34 142 19 160 26 171 59
5020 59 30 93 68 133 140 139 160 134 183 179 71 79 72 147 111 22 144 166 68 177 164 174 116 199 248 72 75 109 51 72 51 58 55 106 82 194 106
4586 106 76 185 79 238 27 128 79 74 31 316 190 105 102 71 68 67 125 262 231 174 146 54 121 165 111 105 116 210 59 150 216 127 75
4198 75 43 201 287 112 10 18 98 121 7 35 86 77 91 132 156 232 165 145 248 216 230 96 45 154 188 138 90 227 270 83 87 77
3823 77 73 111 140 347 169 162 204 137 103 11 142 193 27 125 61 164 102 260 183 182 235 178 112 80 26 161 163 182 106 343 234 94
3447 94 21 120 212 105 222 234 67 120 126 78 54 166 173 86 237 56 100 84 13 196 68 155 55 160 115 145 16 206 99 62
3095 62 78 55 27 80 116 130 53 97 120 87 139 60 82 82 43 125 168 487 309 83 120 178 290 209 152 142 37 88 208 118 70 213
2719B13o5n2J3R4l5j25M9J39k2o1O9j6j36L1J17r6m5j0M3L0k9Rj4J40j37QN1j0j10R2k0K01
2344C16n8r6m1R4j40K31k15O3K8q8Qn6J13lj0m4J41o6oJ0O1j81N1J31j56O5n1q2PN6mj8R5
1956A55n4o0O0K9k7M8N5j86jK03K6m3j79J94p8N6qJ3r9J21K1O3L0j65o1o8M5J83l2j63M2n9
1581F1K5M4M0O6j9j30l5J0%J16Q2p7ro0koL6oJ3o3j6J28%j33O6MK9m8O2L5n8oj13M5J3m8j7
1146B9K3P5m1Q1r4J58k3R7q3j94J59L3j49J00m3o9P1Nj18K7J15l7jq3N1km9pk0L2N5k9k2J39
747A86q2J6nO4n2n1J51l7o9N6l6j0KP5j1o3n4M5kL6M7j01L0l1l1m0J49j04rJ0J07k7o2K6n5
337F8N2j6l2N8J43Rk05P0J08q0L8r9P0n6m9Q8J0n2k6m4QJ07J12j10N6j36M8j7p1l1N2K5J06
-51B04j7r8LM2R0k0l2m0K3N0J04j32
$$ plain form
2719 213 148 96 109 203 168 43 92 231 209 148 217 201 65 96 213 117 72 62 105 135 106 115 101 241 104 112 163 153 43 135 115 316
2344 316 258 162 121 215 75 306 91 154 182 94 102 46 159 156 146 102 243 177 171 181 242 61 112 243 87 152 101 19 26 82 78 60 155
1956 155 101 41 101 130 103 151 206 20 19 222 248 205 26 220 142 198 190 203 104 225 246 309 339 174 113 45 90 273 241 78 120 61
1581 61 86 130 170 236 217 87 52 62 62 178 260 183 174 114 112 106 142 136 149 86 70 198 198 65 131 135 164 116 178 213 155 149 36 81 94 46 29
1146 29 52 127 86 167 73 231 208 305 222 28 187 220 71 171 128 59 130 135 17 44 159 122 121 38 89 87 38 31 11 43 98 69 47 186
747 186 104 120 115 179 127 76 227 190 121 177 141 131 133 208 197 134 80 125 123 159 206 105 135 104 73 33 182 78 69 79 186 159 97 123 68
337 68 120 104 72 130 273 282 77 147 255 175 213 114 184 128 79 167 177 125 99 55 63 170 282 172 228 92 140 123 52 21 73 98 204
-51 204 187 89 92 134 224 204 172 132 155 205 309 177
-192A77
##PAGE=	F1=1031.91
##FIRST=	25164.767445380970457,	5806.2096540000038658,	0.30325475335121154785
##DATA TABLE=	(F2++(Y..Y)), PROFILE
5806B4P4l2N3qJ6j03M9J15l4l1nM0Qn5rL2J5p3R3J2p9M0K4l3k6K2K9Q1j1j45J26Q1o2L0j00
5395A58J9Rj01J51Orn8o%mm4k9J7l7K1n0P4K0O9j31L8R4j29J45o3j30J18j44J56j08J24o9
5020A07n7P7n0O5K0k8M7q6O0Om9j2k6P7k6j17J29j9p8J46p7M4r8J41op6j5J3k6m1M4m6L4n1
4621B6P3J17j13m1J08n3J69k13L2k6L1k3K19r5r7OJ8rn1O3J00pj3m1r5JM0o3P3l4O8j15R1
4233A46Q7o4j5o1J16L7j25j14lR8P0r9j5R7q6K6K2k2Q8k7L2J05q3j1j27j7J25M3o0k2J03M3
3858B87j91n6N0k8N8lJ76j60L6L5n5r0k1J27N4k12J39j22J09n9J61o3K7K9q9l0n7k4J42J4
3506A84J0j38K84r2j59p5R3R9j03J22L6j83L9Lo6K4Q6j4n2J14j57K5L1q2K21j34jm2R5j08
3154F0J16r8P0j23Q5m7Lm0K7N8M0q0PL8N5p6M8K6q4m9R1J74N35j50m83n7Q0Q3q0j38jo3N4
$$ plain form
5806 24 98 66 119 111 127 24 73 188 154 123 118 158 166 111 102 134 149 76 169 181 102 142 166 133 107 129 158 239 228 83 209 290 228 258 158
5395 158 177 186 85 236 242 233 175 169 169 165 121 92 109 72 93 43 117 137 206 75 113 207 78 223 160 30 148 4 160 52 176 107
5020 107 50 127 77 142 162 134 181 95 155 161 112 100 74 151 125 8 137 118 40 186 109 153 55 196 190 114 99 112 86 45 89 43 77 26
4621 26 99 216 103 62 170 117 286 73 105 79 110 87 306 211 114 120 138 129 78 141 241 234 221 180 85 86 126 63 136 102 170 55 146
4233 146 233 169 154 93 209 246 121 7 4 102 172 73 58 155 69 95 117 95 183 156 188 293 210 199 72 55 180 223 163 141 244 287
3858 287 96 40 90 62 120 117 293 133 169 204 149 59 38 165 219 7 146 24 133 74 235 172 199 228 139 109 52 28 170 184
3506 184 194 56 340 248 89 14 107 206 103 225 261 78 117 120 54 78 164 150 98 212 55 80 111 29 250 116 115 73 168 60
3154 60 176 78 148 25 110 63 66 26 53 111 151 71 78 116 171 95 143 169 85 36 127 301 836 686 203 146 226 309 229 91 90 27 81
2766H1J25o0q2J43j04K4m0J29J5j35k3J28K1p6M8qr6J0O9m0p0j3M5J0L1M6q0J37j43J5N2K6
2391A85j02O6%J97r1j63L8N4j01K02j95N2N7q0jmj6M6k3jJ30j30J3O4L8j80L4J08j65J18l2
2027A18q4M5L4o0M2P7q0rK4qm8J14M0j67MJ39O2m4j13J37j00J32n0K8j22Q4NQ4M6k04Pj11
1651B2J17J85p6j91qj7P3j6J02Ol2o3Mo5J7J22J11j04l8l8jK6j4OM4j08M5Q9m1q8N5L9J9o0
1252A22O9M2o8k1r4N2lp7K3J1P9J7M2j76J83j8P3n9j53J47J7j49R5m4n1Q7j6j17K6R4l0j7
876H6k4L7Om3j0K7OK8k9m8J47j0q4R6M6n1r1J63n0j10N4l6nO1R2n1l0p7L4k6N2P8j57R1l0
466A42l0p9J94q3j25KJ21Lr3P5o3LK9J7K0J49n4j79N6Q8l7R5j48J29o3o7O5k5n8J5o3OJ60
78B02Q9j65O4r5Q9M3j39o9L9K3J06N3j86M3M2P5Qk4q5K8R7J12j73
$$ plain form
2766 81 206 146 64 207 103 127 87 216 231 96 73 201 222 146 194 186 90 100 169 129 59 46 91 101 132 178 98 235 92 107 159 185
2391 185 83 149 149 346 255 92 130 184 83 285 90 142 199 119 118 114 98 144 121 120 250 120 133 197 235 55 89 197 32 150 118
2027 118 34 79 113 53 95 172 92 83 107 99 51 165 205 38 42 181 243 199 86 223 123 255 205 233 111 195 200 284 330 126 133 22
1651 22 139 324 248 57 49 32 105 89 191 197 165 102 106 41 58 180 291 187 149 111 110 136 122 128 172 64 109 198 157 69 124 163 182 122
1252 122 191 233 165 144 50 102 99 22 45 56 135 152 194 18 201 183 256 197 44 191 208 59 154 110 59 146 130 13 39 133 103 86
876 86 62 99 105 62 52 79 85 113 84 36 183 173 89 185 231 180 89 252 202 92 146 110 105 166 258 207 177 100 134 108 160 238 81 172 142
466 142 112 33 227 144 19 21 142 145 52 127 64 67 96 113 133 282 228 49 105 193 156 251 103 232 169 102 167 142 84 99 36 42 202
78 202 291 126 190 95 184 227 88 19 58 81 187 240 54 97 139 214 222 198 113 141 238 350 177
-192A77
##PAGE=	F1=929.656
##FIRST=	25164.767445380970457,	5806.2096540000038658,	0.4525890350341796875
##DATA TABLE=	(F2++(Y..Y)), PROFILE
5806D1L7pK4K3Lp2M7Q6k1q3M1L9Rj09k7P3k5J5N4J0rK0J6k0l7j5J01O0l3k02K29M5p3N7p4
5395B23Pk2j08J24MJ7o7J0LL4q5q6M4k3J1l0L6J8P6j30K2J51j89K18r4j24R1j07J25q3J13
5032A79k1r1P9o4M9K8m3N1r6N0J4km0jO2j8j27J03n3k0J56j18L1q4J58n6L0l4j3oo3R5j7J
4632A19o8J12O4j20l8R3l7J70j75m5pO5J3J22m6l5j0J2j4r1Q9M4LL3o1q4n6L2KQ3o4K3p3P9
4233A34Q8k8L2j08Q7Ml4j54j3R5J12o6j3Q8j58M3J1o9P7K5P7Q0j15n5j01M3J31K9n0j5P6L8
3858B91j99q2R1n4P3m3J35j35P8K3k8j37Q0Q5M8j96J27j16O4o1J49l5N5k2r3L5j02L4J03L1
3506A99lj77K87n2j38o3M2J00r0J18M9j95M0j4o5N7O4l3k4P3j16J0N7o3K27j29p5J0P8j47
3154B7J70m8k3o2R9q6Qj8K4QP6q4l6P9J18j82J83Jj51o6P3L48P39j60p49j25O7P2q2j82Rj2
$$ plain form
5806 41 78 71 95 118 121 49 96 182 161 78 119 158 167 58 31 104 79 94 148 158 149 169 185 165 128 113 214 274 241 39 268 313 240 297 223
5395 223 230 208 100 224 228 245 178 188 191 225 140 54 98 75 86 56 92 110 186 56 78 229 40 258 164 40 131 24 149 66 179
5032 179 158 67 146 82 131 159 116 167 71 121 135 133 93 92 154 136 9 112 59 39 195 77 108 24 182 126 156 122 109 103 40 135 118 119
4632 119 51 163 227 107 69 162 125 295 120 75 68 133 146 268 222 187 177 189 175 84 173 217 220 253 192 108 52 84 86 169 105 128 55 134
4233 134 222 194 226 118 205 209 175 21 8 103 215 149 136 224 66 109 120 51 128 153 230 310 195 140 39 82 213 242 192 177 253 291
3858 291 92 10 101 47 120 77 212 77 155 178 150 13 93 178 226 30 157 41 105 44 193 158 213 191 98 133 31 65 168 199
3506 199 196 19 306 254 116 53 95 195 105 223 272 77 117 103 38 95 159 126 102 175 59 69 126 63 290 161 86 96 174 27
3154 27 197 149 126 64 163 77 85 67 91 99 175 91 55 134 252 70 253 254 103 37 110 458 1197 1037 288 163 230 302 220 38 47 35
2778C5N3J09k7j16J33j18Q2r3J59N9j42n4O5P5m7Prn0j6L0J0o6m4M1J2M8Q7j12J07r6j3L7
2402A46M7q3M3J6J80j14k05J05Np0J65j18N5K7o0lM6j49Q3j5K2J21j77K6R7Qj52L1N9q5Q3
2038A34j3o5P3jr6P9M9o6L6qm0n8J42L5j24rP7Q7m3m5P6j23K07p9L3j27L9k0Q8N6j92N3q4
1651G1J00J80j17j50o0kJ15q0J45l6m5J1M2j15j2J28J25j14o9j0lN5p5M0O4j65J33L1o4l5
1299H8K8O6J9o3M7N0o1m3o4M6pn4K6j7Q1P1J2j79J18qM0k2j19J26oj25P5m4j4Q8l7j01K9O6
900A12j2plK9pk1j5Q4k6Km0q0J52P2j65J74L3n0j32J85o7j14K1l6J7R5Q1q7J0q7K0l8N0R3
501B43j80J46l3l0r8K17o6j32k4M3M0r5R3q5k0O0N6j4J43j14j44O6N4lJ30j55J57q4o7Q9n8
137A35o8L7n6mJ69O9k07N6k4J01R4j67j04K4K4Q1J10k40Q6K1N9K8l7j06O2J19J14j94
$$ plain form
2778 35 88 197 170 54 187 69 151 58 217 276 134 80 145 220 173 180 171 121 105 135 145 79 35 76 88 136 223 111 218 122 109 146
2402 146 193 110 153 169 349 235 30 135 140 70 235 117 172 199 139 136 182 33 116 101 123 244 67 93 190 198 46 77 136 51 134
2038 134 121 56 129 128 32 111 160 94 130 122 82 24 166 201 77 68 145 232 189 144 220 97 304 225 258 131 170 150 238 294 102 155 71
1651 71 171 351 234 84 24 22 137 57 202 166 121 132 174 59 47 175 300 186 117 107 104 159 84 124 188 23 156 187 123 88
1299 88 116 182 201 138 185 235 174 131 67 113 106 52 78 61 142 213 225 46 164 156 196 174 55 181 175 50 125 81 67 155 118 17 46 112
900 112 100 93 90 119 112 91 76 160 134 136 96 16 168 240 75 249 282 232 100 285 218 104 125 89 106 201 282 195 205 118 138 100 150 243
501 243 63 209 176 146 48 265 199 67 43 86 126 31 124 39 19 79 135 121 264 150 6 72 126 123 253 98 255 171 104 193 135
137 135 67 104 48 44 213 282 75 131 107 208 302 135 31 55 79 160 270 30 116 137 196 224 187 81 143 262 376 182
-192A82
##PAGE=	F1=827.398
##FIRST=	25164.767445380970457,	5806.2096540000038658,	0.40542620420455932617
##DATA TABLE=	(F2++(Y..Y)), PROFILE
5806D8J5PqP6jp8Q7L7mj08N1M7j2j09OL3q2J02N%P7%K3j6m3n0J70Rm4k22K69J0o4O4l4Lm7
5372B17j04Q4ML6n5QLO7r5j03L2k4K9j7l1K9P6r5K0J58k10K29j06r8M1l4Q3n9R5K3j38P7n5
4985H7K6K5n3L7o7J7M8J1o4N7L7j8j17M9o6M8J39j17k2J8P5p9J16m9l1Km6J10Rj3n2J00Nj13
4586A09k4P8o3J62j07j02nR3M7J8%M1k0j3j8j21J25oOO5q0n5q9J0R3N7q3j4l8N2P1J3Q0j63
4186A19O7J0M8j97k0Q7J26k2j4P1k08N5J0p6L0P6J05L4j25j09l4Q7J25Lk5k6N0L3k07k0M8
3823A01o1P0q4R9j12J08PJ8r4R6L2L1j61J09q2Ko7J26mP9p8l2P3j22P3L9M5k7j19J88pq4p0
3435I2j1R5o8R9O1k01N6m4l7N4N2m7lL3p2kP6m4K18j12r7J8P1j77J95jp0j5O2j00RPO2p7J22
3024B04r3o0J05J60k44K63j8j86q3M3N13Q77j93r63j63L1Q1p9j27J5m6O8P8Lj24R6r9J07j41
$$ plain form
5806 48 63 70 62 138 137 59 146 183 179 71 122 169 157 48 54 87 5 107 112 112 189 189 212 196 153 103 273 282 238 16 285 295 231 295 261 264 217
5372 217 113 197 201 237 182 190 193 260 165 62 94 70 99 82 51 80 156 61 81 239 29 258 152 54 95 61 144 85 180 203 65 142 87
4985 87 113 138 85 122 55 72 120 131 67 124 161 143 26 75 9 57 196 79 57 75 150 71 187 138 107 109 63 173 182 169 117 217 222 109
4586 109 85 163 100 262 155 53 48 141 188 206 206 247 227 214 196 75 200 194 200 265 185 130 41 51 144 201 118 104 66 118 189 202 282 119
4186 119 186 196 244 47 27 114 240 218 204 275 67 122 132 56 86 162 267 301 176 67 33 120 245 248 223 197 247 280 73 53 101
3823 101 40 110 26 125 13 121 128 146 52 148 180 211 50 159 77 79 12 138 134 213 135 103 176 54 127 166 211 184 65 253 246 162 92
3435 92 81 176 108 207 268 67 123 79 42 96 148 101 98 131 59 57 133 89 307 195 98 116 187 10 205 204 134 119 181 81 90 97 159 82 204
3024 204 111 51 156 316 72 335 317 131 48 91 604 1481 1288 325 162 193 274 195 68 83 37 105 183 186 62 158 59 166 25
2684B5J85Q9j49l8m0J35J1m0k0j0m1K2L6o0p6M0J2M0J16j10Q2l8n2RN9p1K7L0J45j12j06L8
2308A38m8m2J21j3O3l8k6lQ3k03M8ML5J12j81RJ02k0j03L7K3J1Plk8P8l7r7P7J1j8P5m2m6
1909H6j6R4L3p7j3QJ02m4J5K4j40K59q8K5j16Jn0P8O8j39N4m5N8J62j47q5l0l6J30j29J61
1545B03n2n4N8P1j29o2J24J24j04r5K3j2P0j31Q9P2j62J72l4o8LkP9L2n4%N9m6o3k1J7k0p
1158H0L2n2Q5J10qj45L1KKK8r7R5k8r2N3m8K8P8m8o8J5M3NK6j3L8l3jk1J35n1j7o1p4J14J42
736B85j74J81L3n3j85J98n9r3j8k0L7Q9N5j09N2q7Jl7L4R1j39J58m2l6r1K12m4r5l9o6O2p0
360C1P9n0J9j5P1l7J31j55l3OJ7K8J25j20J49j11n3J59p8r6M3n2K8J17O0j52m9N7R2J26j64
-4A73j18J2K5M0J43k30R7j2N7J5n7j03J17J07J13j93
$$ plain form
2684 25 210 299 150 112 72 207 218 178 158 148 107 129 165 105 29 69 81 121 237 127 209 171 119 128 187 116 143 173 318 206 100 138
2308 138 90 48 169 156 219 181 155 152 235 32 80 84 119 231 50 59 161 141 38 75 98 109 116 113 85 163 126 29 106 117 99 174 132 86
1909 86 70 164 197 120 107 115 217 173 188 212 72 331 243 268 152 153 103 181 249 110 164 119 177 339 192 107 77 41 171 42 203
1545 203 151 97 155 226 97 35 159 283 179 84 107 95 165 34 123 195 33 205 171 103 106 104 183 215 161 161 220 174 111 90 107 87 80
1158 80 112 60 145 255 247 102 133 135 137 165 68 163 135 43 96 48 76 154 106 38 53 96 101 127 114 152 119 118 97 232 181 164 103 29 143 285
736 285 111 292 325 272 87 285 226 133 115 95 132 221 276 167 219 132 133 96 130 221 82 240 198 162 71 283 239 144 105 39 101 31
360 31 110 60 79 64 135 98 229 74 41 47 64 92 217 97 246 135 82 241 163 67 110 58 86 203 263 111 62 119 211 337 173
-4 173 55 67 92 132 275 45 142 130 187 202 145 42 159 266 379 186
-192A86
##PAGE=	F1=725.14
##FIRST=	25164.767445380970457,	5806.2096540000038658,	0.048638433218002319336
##DATA TABLE=	(F2++(Y..Y)), PROFILE
5806D5J1jNJ08pj12J48pRj18M1O2l8p9M8k0l5N0l9NJ40j6M0k1o4l6J96n3l8k03K44k6l6N3
5407B56NNn4q7L2PM8k1j4J3P5p7p9Jn6O8pj01L9P7m9J9J26j95J95r6n9pL4O9m5N5N6j85O3
4996A11j6J4%o7K1Lk5R1j1n9R8J2k7j10OK3%J26j03l6N8pn8J57n9l3Pk1R9L4j2n5Q1m1r6r
4574I6P8r7J18k3j18l2J15O5p3L4J08k2l7k4j40J56l1PP7r3j0r6k8J61L4q9l0k7K1M3N4J19
4198C16k11M2O3Q9k21j9Q1J07K1k3N1k22M7K1n6pR8J17k1j10j09K5Q4J02k1J1n2K1L3k10M6
3834I3qm0M7n0P7k9j6j2Q3m3R3k6Pj19J06n8m3l2M8K1R5j07N2P4j30J12j9M7o7n6R7K5j8q2
3435A22o1Q9l8O9P3k01Q3p3j2K4N5m9Rlj9k0R1m1K01q5p6j2P3j69J74L8r9Qlj11L2M0J06j49
3036F6J68j10m0R5J78k84L01l2j87r2L2O12R09k26j075j75lJ00n4o6K8j15Q2N4K9j01M8p2
$$ plain form
5806 45 56 55 60 168 161 49 197 190 199 81 122 184 146 67 115 95 60 110 71 76 216 200 240 219 155 119 315 262 224 21 265 239 203 256
5407 256 261 266 212 125 157 164 212 191 177 190 265 188 109 110 54 122 115 14 53 130 81 100 226 31 226 130 71 64 98 167 122 177 233 48 111
4996 111 95 109 109 42 63 66 41 132 121 62 160 172 145 35 41 64 64 190 87 51 109 102 44 201 142 109 116 95 194 228 216 161 242 201 105 96
4574 96 174 77 195 172 54 22 137 202 129 163 271 249 212 188 48 204 173 180 257 164 154 58 30 191 225 136 106 79 100 143 197 316
4198 316 105 147 210 299 78 59 140 247 268 245 296 74 121 142 86 79 177 294 273 163 54 79 163 265 244 255 203 224 257 47 93
3834 93 85 45 92 42 119 90 74 62 145 102 195 169 176 57 163 105 62 30 78 99 194 87 139 213 83 195 176 223 156 100 197 222 204 122
3435 122 61 150 112 181 254 53 136 63 51 75 130 81 90 87 68 48 139 98 299 214 138 126 199 30 204 242 143 151 148 37 69 109 215 66
3036 66 234 124 84 179 357 73 374 342 155 63 95 707 1616 1390 315 140 137 237 183 117 145 30 112 166 195 94 142 70
2708G0J00j58J90R6j60J4j43J84O4p7l6J6n7L5M6o5r2N6k1L0J26q1P3kp6k2O9p1J3M0R5q1
2332A75nl2q7lN7P7P5j09K2j1R8j89k0J6N0J03j53j9P3m1m5M8M7K9n2jJ0N6n7o2M0l4M1J10
1933B07p8j8pO5L0m3nn8J07n0O3j2j43K69q1Or0k4p6O7Q2q9L1%NJ32j66j3mn0J40j50J55l9
1534A63p5P1R2j21j05J09J06q0j06O0l1O5j28J02P2j11J64r1o3K0k3P0N8l3n9O6l0p8L3k1
1182I6n9N3M4q9J03J25k2j02j9qj8N9p5N5m0o5L9m5N6N5m6l7KK4J1N8k9O4n5Ql6J67n9k6q9
771A00k7L7J93j28J31M7o1k37J81k1o6l3NM8N4J9j11R3p7k7k8QP5n4J35n4m6o6J85j2n8n1
395A54p1j0l4O2L6J4o9L1m2J19j32K1m4QN2N8n1J04j29l5K51q3j45M6n7Q9L4P2m4j76R6P7
20B02J27j31j11MK5lJ43j70Q1m4O8l1p5q1J77O9J06j76
$$ plain form
2708 70 170 12 202 298 138 152 9 193 257 180 144 160 103 138 184 119 27 83 62 92 218 137 210 208 132 110 179 108 121 161 256 175
2332 175 170 138 51 48 105 182 257 148 170 159 257 68 48 64 114 217 64 45 118 77 32 80 127 156 104 103 113 169 112 50 90 56 97 207
1933 207 129 111 104 169 199 156 151 93 200 150 213 201 58 327 246 252 162 138 62 129 211 122 153 153 158 290 124 111 107 57 197 47 202 163
1534 163 88 159 251 130 25 134 240 160 54 114 83 148 20 122 194 83 247 156 93 113 90 160 218 185 126 192 162 84 117 96
1182 96 37 90 134 45 148 273 251 149 130 122 104 163 88 143 103 38 77 32 88 143 97 60 62 86 97 155 126 190 135 143 107 274 215 189 100
771 100 73 110 303 175 306 353 292 55 236 215 149 116 121 169 223 242 131 224 147 120 92 100 175 121 256 202 156 90 275 263 205 154
395 154 83 73 39 101 137 151 82 113 71 190 58 79 35 43 95 153 102 206 77 42 293 210 65 111 54 143 177 249 205 29 125 202
20 202 329 198 87 91 116 113 256 86 167 123 191 160 85 4 181 250 356 180
-192A80
##PAGE=	F1=622.883
##FIRST=	25164.767445380970457,	5806.2096540000038658,	0.36013531684875488281
##DATA TABLE=	(F2++(Y..Y)), PROFILE
5806C4J8k0O7J00j8j58K14m9K4j34M7P0n6o5Q3m9j%o9N9J39l2O0k7j10K8J70j09j2j59J84
5442B29p3LL2L0J0l3o5k7J5O1K0n6N0M7l7m1j9j08J06Kq7j8R0j4oQ1j50J43p8j8%M5P6n0L
5032A63P9j94J5M2K2l9p8jR8mN4m3k3R8nm5j09J9N9m7J21j06J3L1p1j4J59n9k1K1j4P3O1p
4632B48p1N7o1p0kR5q0mN5r2n0J01N8j22M0J51j4n0l0j34J47k3J3O8r3L5r1p0K04K3q2m1k6
4245H9oRR0J47k34rJ49Q9k15mO8O8N2m3L0j95K0L9k9k1R5J19o6q4m5J7O9O8l7N1q1j2M1k06
3846B3R4o4J0J1K0J15k7j50k5J47j2Q8p7k5p6J27m7o5%l4L1R3q6R0O9j23J47n4L7j21nM3L2
3459A86M3r7r5Q7qM2Q1k04J20q5j8j4P1l8J2j9L1l6R3o9J86n4m0n2P4j32J37O0j22J7r0jm7
3071A9Q7J35j89K12j42KP4J79l25L11m2j59r2M7O22Q26k36j059j64j7J23rn8N0j53N4N3M9
$$ plain form
5806 34 52 32 99 199 181 23 237 188 212 78 125 195 139 74 157 108 107 107 38 97 236 204 264 237 127 155 325 216 204 45 229
5442 229 156 159 191 221 231 198 133 106 121 182 202 146 196 243 206 165 146 38 144 146 59 41 131 117 111 192 42 185 107 89 89 134 210 160 163
5032 163 242 48 63 105 127 88 10 9 107 103 157 114 91 189 184 139 30 49 108 61 182 76 89 120 49 35 194 135 114 135 121 194 255 248
4632 248 177 234 173 103 101 196 116 112 167 75 25 126 184 62 102 253 239 189 159 25 172 149 162 230 137 172 81 11 215 238 156 115 89
4245 89 83 92 182 329 95 86 235 324 109 105 173 241 293 250 280 85 105 144 115 94 189 308 242 158 113 130 199 267 230 281 200 188 229 23
3846 23 117 53 63 74 94 209 182 32 7 154 142 230 153 128 52 179 132 67 67 33 64 157 71 161 230 107 254 200 237 116 111 154 186
3459 186 229 132 37 124 116 158 239 35 155 70 52 38 109 71 83 64 95 59 152 83 269 215 175 123 197 65 202 262 140 157 67 66 19
3071 19 106 241 52 264 122 124 198 377 52 363 321 162 70 117 739 1565 1329 270 106 89 212 203 145 195 42 96 149 198
2743A98o5K7o7P1j19J55P6j78R6j22J11R4j06m7L0n8L8O1p7q5Q8p3J6J08l0O3J2p6n0Q9q9
2379I1%M2M6m3P0p1q6K4j9J30R3j70Q0k8Q2j59m7NP6R3j30k2K1m1rN4J01jp5pL2J6m8k3Ok1
1956F2K2J38j06L1k6O2K6k7Pj08R4n3R9l2j28K30o3k3m7l7r1O1R7o8KM6n1R7j64M9J0m7J44
1569B06j45J44j2j02M4J11r9j22Q4O5m8r3Q8n5M3l6M5O5o3J58j30o5K4k8L4R3mj10O5k1q1
1205E5R3k5p2K9N8j19J43J02l0n3k0m9%M1m3J5l3m6K3j8N0K1l3j0jjPQ3m1R5o6J0o4J72m5
794B28k8j13L0m1K18n5N3P1p4k32Q6L5l4j8K6N2Ok1r4J28o0o0k0j9M7M2R8o4n7l0J41K6l1
407B36n3l3j03J0O9R4oq7n3k5J08o3Nn5L9M8m0K5M0q7o3L30p7j95M1n7J56n1R1M5k16M9O6
20A88J00p0r1j0L0m1J12r2N4o0Q1q3r6KJ78K0R1j57
$$ plain form
2743 198 133 160 93 164 45 200 276 98 194 72 183 277 171 124 154 96 134 195 118 33 121 48 64 172 142 205 217 141 91 180 91
2379 91 91 133 179 136 206 135 49 73 54 184 277 107 187 159 241 82 35 40 116 209 79 57 78 37 28 82 183 182 107 100 132 148 100 77 83 62
1956 62 84 222 116 147 121 183 209 182 189 81 175 122 221 189 61 291 228 205 158 121 30 91 188 120 122 168 117 214 50 99 109 62 206
1569 206 61 205 193 91 135 246 147 25 109 174 126 33 121 66 109 73 118 183 120 278 148 83 107 79 113 206 202 92 157 136 55
1205 55 148 123 51 80 138 19 162 264 234 181 161 112 112 153 110 125 92 46 69 51 101 122 89 79 78 77 84 167 126 221 155 165 101 273 228
794 228 200 87 117 76 294 239 292 363 289 57 143 178 144 126 152 204 210 189 95 223 163 103 83 64 111 153 251 187 130 100 241 267 236
407 236 183 150 47 57 126 220 214 127 74 49 157 94 99 44 83 131 91 116 156 69 6 336 259 64 105 48 204 153 244 289 73 122 188
20 188 288 218 127 117 147 106 218 126 180 120 201 118 22 24 202 222 313 156
-192A56
##PAGE=	F1=520.625
##FIRST=	25164.767445380970457,	5806.2096540000038658,	0.42311656475067138672
##DATA TABLE=	(F2++(Y..Y)), PROFILE
5806B1K9PQ9P4k7j73K44r2L8j53P6O3o5o8J14p1K3k2p9J09J15m3P1k9j58R4J03j33K5j02J29
5442B09j40L9K1K4J9Pm8p7K7P7M8j04J18k0J3J1l4j43J17Ko3m7R8J7n9L6r1J10p2J4M2J7Q6
5055B54p1m9R3j41p4R9M2o4k8k2J15K2nn9%Q5mo4j05N2N8o6J19j44Q0nj09jJ56m5LM5l5M3
4656A75R0lj00L8m9l0pJ11m6j41J04l5l6M6J8p7qJ50Nm3l1n8L3J3K5M7q9P2o9q6J96K7o3o4
4257A15k0k6k6J21J61k19q3K35N8j81K6M6K3O1o9Mj31j2N2Nl8Q3J20q4o0oJ9M7K5m3R3j07
3881A89m1N5j86J03j08Q4k0N4J67l1k17J7J09pQ7j15o3l1J62m0q1J2o4J5P1m4P7O7q7J57o2
3517B29K3j63J6K9QQ7j12p6P1KM3P3k13J58p9n4QM4l0K0j2N8l8Q4j30J83l0oq2O0o4R6O5j44
3118A24J8p0J46j59L4J36k01K61j85M4N9J73l65K92m4j15p6N8N66O41k09r21j32k6J79J6j01
$$ plain form
5806 21 50 57 146 220 193 20 264 172 210 57 133 196 131 63 177 106 129 107 28 137 252 209 280 251 93 187 290 157 182 80 209
5442 209 69 108 129 153 172 179 131 54 81 158 206 102 220 200 213 224 190 47 164 166 103 56 154 171 112 148 57 167 95 109 151 168 254
5055 254 183 134 227 86 12 111 153 89 61 39 154 176 171 112 112 197 193 129 24 76 134 68 187 43 123 118 9 8 164 119 122 167 132 175
4656 175 265 262 162 200 151 121 114 225 179 38 142 107 71 117 135 58 50 200 205 162 131 73 106 119 144 191 102 174 105 19 215 242 179 115
4257 115 95 69 43 164 325 106 23 258 316 135 161 207 230 291 222 226 95 83 135 140 102 185 305 221 161 155 174 221 246 203 296 189
3881 189 148 203 17 120 12 96 76 130 297 266 49 66 175 168 255 140 77 46 208 168 87 99 35 50 121 77 154 221 134 291 229
3517 229 252 89 105 134 142 229 117 41 112 114 157 230 17 175 96 42 50 94 64 84 72 130 92 176 46 229 199 193 111 171 107 203 268 124
3118 124 142 72 218 59 93 229 28 289 104 148 207 380 15 307 263 148 72 130 696 1337 1128 207 75 49 228 244 143
2801A43P6j34k9P9O6l1L3q0K9p8J30L4j99J98j05M2J03j33m7L5m5K3Q1q8n4J21r8jL6L9L9
2438A85J0n8o7J24j17j6L5J4k8J16p2n5K3p1J39J18k11J37m9L0j06k9m2J16R3j17k1rk4k1
2085B7M6J52l9o6j5L2l2mQj2M0p5J54j15P8n4P0K6k1J2j34O5m6J19l6j09J56m3m7Nl9p1L5
1698F7J08p2k5Q7r7O8o9K2nk5J32j19J34J3j14j9J27o9r9N5mj5n7R6p4J1O1%M1j9J57j48q3
1311F6L0j0l0J23L3j33M2j6m3J24Kn1q5P3p3J32N2m0MNj07L4%pj1j4l0nRL2j1j4RJ2l4jR8
876A65m7J17o8J8r9J42qk8j30R0j06K20K5l3R8r3j56n4O6OJ6L8M6l7n7o7J54l7r1k2l7J8J24
489A73N4o7o8J2Q3O2k3l6J6j64M4R1J11k5r1j46J0R8j8j0m5O1N0q2M7J0j7p8L05o1k10Ol2
102F0J99j07Q6R8k31J2O0N4J1p0l8M5p8O9k2K6n0Q2r0p4%J76k5O6j44
$$ plain form
2801 143 219 85 56 135 201 170 203 123 152 74 204 238 39 237 132 174 277 144 97 132 87 110 191 103 49 170 72 71 107 146 185
2438 185 195 137 70 194 77 61 96 110 82 198 126 71 94 23 162 280 69 206 157 187 81 52 10 126 219 102 81 72 48 27
2085 27 73 225 186 120 105 137 105 101 109 97 137 62 216 101 179 125 195 221 200 212 78 143 97 216 180 71 227 184 137 142 103 32 67
1698 67 175 103 78 165 68 136 67 89 84 59 191 72 206 219 105 86 213 144 45 100 96 81 24 120 46 57 118 118 159 140 297 149 66
1311 66 96 86 56 179 212 79 121 105 62 186 188 137 52 125 52 184 236 196 200 205 98 132 132 125 114 100 70 65 74 106 95 81 90 102 68 67 165
876 165 118 235 167 185 86 228 220 192 62 152 46 266 291 258 356 263 107 53 119 125 141 179 225 188 131 64 218 181 90 68 31 49 173
489 173 227 160 92 104 187 249 226 190 206 42 86 177 288 263 172 26 36 134 116 106 61 122 172 90 137 147 130 52 357 296 86 92 60
102 60 259 152 238 336 105 117 177 231 242 172 134 179 101 170 148 174 124 206 116 42 42 218 193 259 115
-192A15
##PAGE=	F1=418.367
##FIRST=	25164.767445380970457,	5806.2096540000038658,	0.32292923331260681152
##DATA TABLE=	(F2++(Y..Y)), PROFILE
5806B4L2O4P1L3l0j37K16j24M1j50R7N0p0p9J43r8M1j0p6J20J06m5O7k5j70J03K1j08N3m7
5454A13J02j77K6N0l4L1N0m7n4oR3M7j46K05j04N8P3n1j60J16j5m2m5R4N4j23Mm2J09q1L4
5090A32P9j7R1j03r0R8o3r7P9O3o2%n0J29M1o6n9jP6J5p7o1M1M5m1J08j92J26k5p4QO2j7L5
4691A33P0p9K1J14kj31L0j1J4j1J04k8j72N1M4j9j2n1K5m4Q1L9j5k0kj14O7L9K6q3Q9k0p7
4304E6J38M3l8r9jl4n0J32J62j73n3J92J2j34O5J7j1M3r1l2m5j3L3L7o2O4J18o7l8mL8J9j8
3916B06m0J32j25o2P6j50O9p2J05l7M2K04j8k47J8J07k9R6j38j02K9J72k6j08J5p5J6N2l5
3576G5M5O6j5J28m9J9j59j9M9m5J12j28KM2k0P7M7k14J78o7j01Q4j0m0L6oO8k4P2j83J72k1
3200A71J6p9J3L2N6N6j66J6P9J92k41o7J05j66K89k32P4N0J67l02J60l2p5l4M4M66L94j46
$$ plain form
5806 24 56 120 191 224 194 57 273 149 190 40 137 187 117 38 181 83 124 114 38 158 264 219 286 261 91 194 215 107 160 113
5454 113 215 38 64 114 80 111 161 114 60 54 147 194 48 253 149 207 280 229 69 185 170 128 83 177 231 108 112 70 179 98 132
5090 132 211 194 285 182 92 190 127 30 109 172 110 110 60 189 230 164 105 104 180 195 118 57 98 143 102 210 18 144 119 45 53 115 98 133
4691 133 203 124 145 259 257 126 156 145 159 148 252 224 52 103 147 128 116 65 90 46 127 166 151 131 129 15 82 121 147 64 153 133 56
4304 56 194 237 199 100 99 65 15 147 309 136 83 275 287 153 218 235 224 267 176 144 99 86 119 156 94 158 276 209 171 167 205 224 206
3916 206 166 298 173 111 187 37 106 34 139 102 144 348 330 83 101 208 179 275 137 35 64 236 210 102 117 42 58 110 75
3576 75 120 186 171 299 250 269 110 91 140 95 207 79 81 123 103 180 227 13 191 124 23 107 97 57 93 87 155 131 203 20 192 171
3200 171 187 108 121 153 209 265 99 115 194 386 145 78 183 17 306 74 148 198 365 63 223 191 116 82 126 592 986 840
2872H40o90q3m5K72j4j67R9p7r4Q8P6jL9r1j0m6J16k3j61K48r2k5J02j63l2L6k3rR8q6nJ37
2496B14j07Rp8J16kkl6m8J51j46k8J5L5m6J11m8k5J5q8J15J43k20J72n5o2npo8J13J01r9l0
2121A10k0l4l4L2J88p4l4j9J6p5N6L3k5Q2j70J61j03J03o8P2K9j0Nj34K6k9J23l1r9O9k6k1
1745I9L0l6k8j8J18q1n1J16j08N4L8l5m6J1R0q6J25L0r6p5J16m5m7L9p8Qk2Q5q4OJ22j0j7
1358A24K1J60j45j16M5K4m8P9P5j33MlL2J10K7m4j94R6NQ2Jo1O4M0j69O0j9Pj4Lj6l4K6Pl1
947F5MK7L4p3nJ12n9J22o8M1j10O4L9l2j31J43j49K05R1j04J15j18o4j5o3L7M6M8K0o2q4l5
571D1J67rj06m5j5M7J04Ln1q1M7K3Q7l2jO1j80N7J08J00l2q9j78J0P6Pj1l8P2O1o7K7L1j2
172A82r0K58l7j85n4RK17j21L6J18k13KM3J5R5n9q2O9j14L0K3Nj6O8m9o0k9J64n4L3j37
$$ plain form
2872 840 150 67 22 294 280 113 212 135 41 129 205 204 243 152 142 96 212 189 28 276 184 159 261 98 66 102 79 70 168 82 77 214
2496 214 107 116 38 154 152 150 114 66 217 71 43 58 93 47 158 110 85 100 12 127 270 50 222 167 105 100 93 25 138 239 140 110
2121 110 90 56 22 54 242 168 134 115 131 56 112 145 120 202 32 193 90 193 125 197 226 216 221 87 113 84 207 176 77 146 120 99
1745 99 129 93 65 47 165 84 33 149 41 95 133 98 52 63 153 67 192 222 126 51 167 122 75 114 36 44 22 107 23 29 151 141 124
1358 124 145 305 160 44 89 113 65 144 219 86 90 87 119 229 256 212 18 114 119 201 202 141 205 245 76 136 117 124 110 113 97 63 89 96 65
947 65 69 96 130 57 52 164 105 227 159 200 90 154 193 161 30 173 24 229 320 216 331 213 149 134 71 108 154 202 222 160 76 41
571 41 208 199 93 48 33 80 184 187 136 55 102 125 212 180 179 240 60 117 225 325 293 204 26 36 112 119 108 70 142 203 136 163 194 182
172 182 92 350 313 128 74 83 300 179 215 333 120 122 165 180 275 216 134 203 89 119 142 147 131 199 150 90 61 225 171 204 67
-192F7
##PAGE=	F1=316.109
##FIRST=	25164.767445380970457,	5806.2096540000038658,	0.42918175458908081055
##DATA TABLE=	(F2++(Y..Y)), PROFILE
5806D4L2J09M0j5k5r7J72j21J4q9O4M4p6p9J62j17L3L6p3R2J15l5N3k0j50N5n5j1L7pR1j45
5431G8k5Q9j07M0P6o7L2o8R5K0j50K67j71P8J34o3j68J21n0k9j7O8J03j80j2j9J14q1M6J01
5078B55m7Q7j34r7P1K1j09N0Q3m5J5q9J48M2j16m6k3O9N2p3nJ1K1MR4j70Q0j8n4N8p4J5P0
4691A46Q6j29J2J26lj53L5K9N0pP3k7j42l8J31jo5r3P8n7NR1J5lJ0q8l7M9K4p5O9M7o4O5O7
4280B26j4j40L4l1k3Q4J49j20pJ30l3r2J04j3l2Qq2r4L9K8j4N1q5L5J09k4ml7P0j1n3l3J65
3893B90j34p4J04j21K9j9J10n5QK10J6k65RJ35o4J14j58j00O9J41jj41J4q9L0O6o4J3O3P7
3541B13O5k0K6j29q1Q9j13J31j35P7K3o7J23J9j87J66m9j21J26m0o2N1rN9QO3j48R0k8K1l1
3177A30p0J40J5M1j86J3K13K33l06j54M3k8K27k66P7N0J58k02KK0o4J9JL52J34o3m12m4L0
$$ plain form
5806 44 76 185 225 210 185 88 260 139 153 64 128 172 96 17 179 62 95 131 58 150 265 230 283 263 113 168 113 102 139 132 223 78
5431 78 53 142 35 75 151 84 116 48 143 163 13 280 109 187 321 258 90 211 161 132 115 183 286 106 94 75 189 108 154 255
5078 255 208 295 161 64 135 156 47 97 180 135 150 61 209 251 135 89 66 135 187 114 109 120 141 145 239 69 149 131 77 135 61 76 146
4691 146 232 103 115 241 238 85 120 149 199 192 265 238 96 58 189 188 123 30 108 51 56 147 162 159 169 81 44 93 117 42 111 158 94 159 226
4280 226 212 72 106 75 52 136 285 165 158 288 255 163 267 254 222 230 148 54 93 121 107 158 73 108 217 193 189 152 222 211 158 125 290
3893 290 156 82 186 65 94 75 185 130 138 348 364 99 108 243 179 293 135 35 104 245 244 103 117 28 58 124 60 73 136 213
3541 213 278 258 284 155 74 163 50 181 46 123 146 79 202 221 34 200 151 30 156 116 54 105 96 155 163 226 78 168 140 161 130
3177 130 60 200 215 256 70 83 296 529 223 69 112 84 311 45 122 172 330 128 130 150 86 105 106 458 592 529 117 73 103
2837A03K77q2k27J05ko4J7Q4K3K9r2l2k9J08q1n3K21p3j02J07j97jM1j0l5R5o3M4J28j17N1
2473A73j37J33l8l4k3J6J51j62l9mQ8pMk6qjo9P7J59j81J57l1j88J40kq5Q4J07p3m0l6o0l1
2085A4M9J70r7Pj9%j05J02O0m4J01k34J55p5J00o3O8K2K6j6j12Ml2J16k0j02j6KR8k9l2Mp1
1698C1J30q0p5J22o6L7P9o0n3K1J9o3J14M1n5k8K1n0J7L4o0j9m2O9p4O3R9J8j08O2J58j24
1322A78j42O0N0j8j7J13j29l0K8R3Q3L0m2k19R2O5J1l2r7J22O9k09N8J1k0jJ5rm4K6k3l3J3
935E2M6N9j03kJ26q7J11o8P3p6k6N8n5p2J41j69J78J36j45J08j44K1P6j32KN0O0k7o3r3KJ56
560A93J7j06p8L1J01L4n0pq8M3k2R8m9L9R2j69O5J07P3k2q4j41k9M2L3nn1P1P9m7J7N8m2p7
160A26J92mj40j22N0K16j08m3J14j45PJJ2J51n6j37R4j36OK9kK8N1ln3m3J37o2nj17
$$ plain form
2837 103 380 298 71 176 174 110 127 211 234 263 171 139 110 218 137 84 305 232 130 237 40 39 80 70 35 130 67 111 239 122 173
2473 173 36 169 131 97 74 90 241 79 40 36 124 117 121 95 87 86 17 94 253 72 229 198 10 150 148 63 147 254 181 141 105 45 14
2085 14 63 233 136 143 124 124 19 121 181 137 238 4 159 84 184 121 189 211 237 221 109 113 81 197 177 75 59 61 159 130 98 102 31
1698 31 161 81 6 128 62 99 178 118 65 86 105 42 156 197 142 114 135 85 102 136 76 57 15 84 10 73 172 190 82 144 302 178
1322 178 36 96 146 128 111 224 95 65 93 186 269 299 257 38 130 195 206 174 77 199 268 59 117 128 108 107 122 113 69 95 72 39 52
935 52 98 157 54 52 178 91 202 134 207 131 105 163 108 36 177 8 186 322 177 285 141 162 238 106 108 158 218 191 128 35 37 193
560 193 210 104 26 57 158 192 142 135 47 90 68 166 117 156 248 79 144 251 324 302 218 77 48 90 123 118 67 138 217 170 187 245 203 126
160 126 318 314 174 52 102 318 210 167 281 136 143 144 156 307 251 114 208 72 78 107 105 133 184 181 128 85 222 160 155 38
-192C8
##PAGE=	F1=213.851
##FIRST=	25164.767445380970457,	5806.2096540000038658,	0.3603172004222869873
##DATA TABLE=	(F2++(Y..Y)), PROFILE
5806F5L9J34No4j3o0J16p5l6pjN3q0l4J40r0m0J00o8L5J30j6L9j5j37rp6R8j3RP9j13j9R1
5407A67j20K2Q2j06J22j12Q3j6o0K27j91N8J84p1j58J32r7k2K2J9J59k14k3j4J04o2N9J01
5078B75p2P9j54m3j3R6j31M3R7k3K4j26J60K8j47k3l1L1R7m7M1j3pL6Q2j41J6J4m5J19j48
4715G4j9J03Q5j67J6J22lj42L1N3P4JL1k8j04j11K07J5j05l4J4q6J8J14J8J2qj4j19K4M5n0
4339F7nJ08m7lQ9Lj76Q3k6mM6J20p3K9Q8n9p1J28l6m5k6k1q5nQ5n3L2q1j4P8L7M7r0J08m3
3928A85o3l3J88j35q3J39r9J1nJ20p6k9J74O9k67%J74r4J33j82o0Q3P4L0j67J1q8K8R4r3K
3564D1M3J62j0J2M3r8j43J43j67J48r4P1J5j20J61Jj51J44l0r8J11m8o9M6mJ9O0N0j05J8l7
3200A14J8M0j35K09l4K8j96J9K88K64l39k03l6J31J29k64M2O9J31r5j23J22q5L4m8K59q9J4
$$ plain form
5806 65 104 238 243 179 166 106 222 147 111 104 103 156 76 42 182 92 52 152 84 119 249 233 272 257 120 111 35 133 120 129 208 95 76 167
5407 167 47 69 151 45 167 55 138 122 62 289 98 156 340 269 111 243 146 124 146 165 324 110 87 73 177 115 174 275
5078 275 203 282 128 85 72 168 37 80 177 154 178 52 212 240 93 70 39 70 167 120 161 148 141 177 259 118 134 148 103 222 74
4715 74 55 158 243 76 92 214 211 69 100 153 227 228 259 231 127 16 223 238 133 99 113 27 45 159 177 189 181 167 48 72 117 67
4339 67 62 170 123 120 209 212 36 119 93 89 135 255 182 211 299 240 169 297 261 216 190 169 84 79 164 111 143 62 48 126 163 210 120 228 185
3928 185 122 89 277 142 59 198 99 110 105 225 149 120 294 363 96 96 270 176 309 127 67 150 224 254 87 98 10 38 132 39 41
3564 41 84 246 236 248 291 193 50 193 26 174 80 151 166 46 207 208 57 201 171 73 184 136 67 113 109 128 188 238 133 151 114
3200 114 132 172 37 246 212 240 44 63 351 615 276 73 37 168 297 33 75 144 275 180 57 179 94 128 80 339 250 264
2872B64j49n0J16K63j49k18N7N8ro0R4M0kp6l7k9J03j31L6J93m3j88J23j88J7M0j9j1L7j5
2520F7P7R4j29J18j41R9m2q0l5R6J34j59n7mJ15M9o3l9j7k6k7N0J53j19J05J8j56J28lj08
2168I8M8J06l8m6o0n7k6Q7Q7r8M2j2pj10J07Q2n8R5k03Q9m8P6m9O7jR6m5q1Pp4J12pj07k9
1768D3M2J60j01l0K0q6J17o7p3Q3j9RR7n6k3Rl6m8O3M3jN4n0j09P1M2l1l6p4M9k9Q1O4O8j89
1358E7Q8J46q8j45N0O7Or1J35j33m5O3J34N0Rm1j86R5R6p2l7j34J59Q6j95JQ0o9J4K2pl1J2
970I6m1k7OO4P7j03kJ38j12P5o1Q8rl6Kj15M8Q0j61J32J60j55P0j60Q7J60j35m5L2P4q6m6
595I5o5K3J20L6r9j03P1J53k9j02N3q8mk4Q8l7N1R1j38P1Q9L4Np2r3n8JP2rq0N9J03l2K2O3
184B67p4l7J15L5r7j72P3K00q7j22R1k3Lo4N3J64n5j94J12j17Rl0QO9L9K3l1n5J05n2l8p0
$$ plain form
2872 264 115 65 181 444 295 77 134 192 183 123 217 257 255 179 142 113 216 85 121 314 271 83 206 18 35 75 56 45 82 67
2520 67 144 238 109 227 86 185 143 63 28 124 258 99 42 38 153 202 139 100 83 57 30 80 233 114 219 237 81 209 206 98
2168 98 146 252 214 168 108 51 25 112 199 101 143 131 124 14 121 203 145 240 37 126 78 154 105 172 171 267 222 141 148 74 186 179 72 43
1768 43 85 245 144 114 134 48 165 98 25 108 89 98 195 139 116 125 89 41 104 147 146 200 150 41 112 154 123 87 13 62 33 114 178 246 57
1358 57 145 291 203 58 108 175 181 90 225 92 47 110 244 294 303 262 76 171 267 195 158 24 183 269 74 75 155 86 100 122 115 84 96
970 96 55 28 34 98 175 72 70 208 96 171 110 198 189 153 155 40 88 168 7 139 299 144 214 54 141 301 166 121 153 227 141 95
595 95 30 53 173 209 110 7 78 231 202 100 153 65 61 37 125 88 139 230 92 163 252 286 291 219 126 68 69 141 132 52 111 214 182 204 267
184 267 193 156 271 306 209 37 110 310 223 101 192 169 172 108 161 325 270 76 188 71 80 50 58 127 166 189 158 103 208 156 118 48
-192D8
##PAGE=	F1=111.593
##FIRST=	25164.767445380970457,	5806.2096540000038658,	0.12171488255262374878
##DATA TABLE=	(F2++(Y..Y)), PROFILE
5806G9N0J40l2r7jl0N2pq1O2o8P6o9jJ23m8j21J44o5l2J39QL7j1j55l2M6N5n4jO2p8J8O6j18
5395E6J1R6j51J88j35O6m0RJ73j67J4K12p2j22J32j29j4M8m9K11k11l4k2P1k7P1Q4r0P1j51
5043I9J8j01J54j63N3J08mK9j49J62Kj53%L5o5J12qP3k0l8M2P0j07m9O1m2J76j54j00J22O7
4679B30j78K4J08qj01J2N9Q8Qmj2o9j34K16L0j30J9l8p6M8R0kK7m5O4j33j5O0m1o1J26k6m8
4292H8J00Oj83J34l4J0K1P6m0N4P1n7p0J27n1n4m1N6m1r7J20o6j4k3k0m4J01R9j42J39p4l1
3916A20n9K01j24q0J62r1J1k2J35r4n4R2J29k34NJ81r7J44k17pR3j7N3j73Pj9l4J07r8L7%
3553E7K08q2L7O3p2j75J87j74J37n4K5J5j49J74j2j09J20j5o1O8m5n6K6K6n6J24K5o2m0k7
3200A03K7Q7j37K08q7J6j76L2K78K79l36k07m3K07J2k29lJ09O5Jj48J80j03Mq0K04j33k3J9
$$ plain form
5806 79 129 269 237 140 139 109 161 154 73 135 67 143 74 73 196 148 27 171 106 74 213 221 258 247 92 60 106 161 107 106 168 90 108 174 56
5395 56 67 163 12 200 65 131 91 100 273 106 120 332 260 138 270 141 127 175 126 337 126 92 70 141 114 185 269 179 250 99
5043 99 117 16 170 7 60 168 164 193 44 206 208 55 55 90 25 137 129 202 182 144 186 256 149 100 161 119 295 141 41 163 230
4679 230 52 76 184 176 75 87 146 234 242 238 226 157 23 239 269 139 158 120 44 92 182 180 207 162 226 93 78 138 97 36 162 136 88
4292 88 188 194 11 145 111 121 142 218 178 232 303 246 176 303 252 198 157 213 172 75 195 129 115 92 72 28 129 228 86 225 151 120
3916 120 61 262 138 58 220 129 140 118 253 159 105 197 326 92 97 278 181 325 108 101 194 177 230 57 64 45 11 118 20 57 57
3553 57 265 183 220 283 211 36 223 49 186 132 157 172 23 197 185 76 196 181 120 188 143 87 113 139 83 207 232 170 130 103
3200 103 130 217 80 288 201 217 41 73 351 630 294 87 44 251 263 34 31 140 205 206 58 238 135 139 59 263 130 107 126
2860A26r4J62K46j65j42lN3N2j22J05N3n2l5l8m1J01j66R5J65ok69J42j02rK0m2L3k6L4R5
2508A70M6j42J94j45O9k4r3m9J24J10j41p7JJ18J04p3o5m4o2K4L8J32n4L1P4j15J03Lj30M
2156A31J00Jm3q9jm3J07j6n6M7Kjj20R1R0n6O6j45M0k5L8m4P8m0J91p6n1J1j26J09Rr5L4L3
1757A51J57j54k8K6o1Q6n3q6N4K1l9J13k9QNm1k2m0J4N2J39q2j75Q2O1j5m0o4K7j1P9L4J19
1369B88j99O4J21m7j48L3Q0J9j25J26j38m6R1J62J6k7l7j26J07J05j47k5q7R8Q9j29j02J56
1041A72j03J7K4nnmrm6rN9Q8p6mJ45j17K5m0O0O7on3j35R7J1j29O5J67j44Qq1N5K18j11p0
642A31PQ8j23k3k4J7P7M4r2r7Q9J97q0j43J00q8o1K6N0K8J7N0r1P7N6j1M1m9m2p6l6J10k8
254A41r6K5J28j8L1L8q3J5M3P1p0j81O2J71p0j75O1J18j6j36J22J39n4k36J10m8L2j10LR8
$$ plain form
2860 126 32 194 440 275 133 130 183 235 113 218 271 219 184 146 105 206 40 135 300 294 25 167 65 56 76 34 67 41 75 170
2508 170 216 74 268 123 192 168 75 26 150 260 119 42 43 161 265 192 127 83 21 45 83 215 161 192 266 151 254 257 127 131
2156 131 231 232 189 100 99 56 163 147 91 138 140 139 19 110 200 144 210 65 105 80 118 74 152 112 303 227 176 187 61 170 179 84 118 151
1757 151 308 154 126 152 91 177 124 38 92 113 74 187 158 166 171 130 108 68 82 134 273 191 16 98 159 144 104 40 67 56 135 169 288
1369 288 89 153 274 227 79 112 192 211 86 212 74 28 119 281 297 270 233 107 214 319 172 147 60 158 247 118 16 172
1041 172 69 86 110 105 100 96 87 41 32 91 179 103 99 244 127 152 112 172 239 233 180 45 142 153 24 89 256 112 120 39 94 312 201 131
642 131 138 226 103 80 56 73 150 194 102 5 94 291 211 68 168 80 19 45 95 123 140 190 99 176 232 221 262 213 171 95 59 169 141
254 141 45 70 198 180 211 249 166 181 224 295 225 44 106 277 207 32 93 211 195 59 181 320 266 30 140 92 124 14 17 115
-98A15L7J7J2p4P8l5m8n0
$$ plain form
-98 115 152 169 181 107 185 150 102 52
-192E2
##PAGE=	F1=9.33551
##FIRST=	25164.767445380970457,	5806.2096540000038658,	0.26901763677597045898
##DATA TABLE=	(F2++(Y..Y)), PROFILE
5806H8N6J29o4j01mpj5N7q5R4j14R9l4oJ25k6j36J23o4q7J31L4M9j1j96Q5M7%o4l1M3l0N3
5419A38L3j24J9J16j65J96j35M1l0L3J12j26j7K08p1o4J20j27KL9j27K50j72l2m1K4KQ3N3
5078B38j01O3j16N0j11J53j44RJ16OL3j48J48k7j22lJ07o0J3K8R4j6o2J9N8o6q7R2m2K15j33
4715B04j63J19K9j46J6R7k1o4nO3R0J5j4K1m7j35J66M6j34N8o0k7K6O6l3M1r0J32j16k9N5
4351A60n3n9Q8on7R1mj06J34o3J9RK2k2O7P8l7p9J04n9o5l0J12lj41J08o3n8N3J4k4qJ16j69
3952F9J51j09L7j17K14j02n4J54r5J0m2J51j02n1l3J80j44J6J31n6J30k54N3R3r1L7j53JM8
3611G2k7L7o8O8mJ89j35M6P7m1j35J65j67J20l2k8K3j11J35k9p0J02j0k2K0m0l1kP5j07J58
3247B28k0k6q3KN9R0j37K05j37Nj27M4K05K73l02j73qK15r8j63J0J03l5P0j16K03j12m3q5
$$ plain form
5806 88 144 273 209 108 104 97 82 139 54 148 34 133 99 93 218 192 56 179 115 28 159 193 242 231 35 120 167 167 103 72 115 85 138
5419 138 171 47 66 182 17 213 78 119 89 122 234 108 91 299 228 164 284 157 159 198 71 321 149 117 76 100 102 185 238
5078 238 137 200 84 134 23 176 32 41 157 163 196 48 196 169 47 44 151 91 104 132 226 210 148 167 225 159 72 164 122 337 204
4715 204 41 160 189 43 59 156 135 71 66 129 219 234 220 241 194 59 225 271 137 195 135 108 134 200 167 208 118 250 134 105 160
4351 160 107 48 136 130 73 164 160 54 188 125 144 153 175 153 220 298 261 182 286 227 162 132 244 241 100 208 145 87 140 154 130 122 238 69
3952 69 220 111 148 31 245 143 89 243 148 158 116 267 165 114 81 261 117 133 264 208 338 84 137 230 139 176 23 24 72
3611 72 45 82 14 82 78 267 132 178 255 214 79 244 77 197 165 137 160 49 184 155 85 187 177 155 175 135 104 102 177 70 228
3247 228 208 182 99 101 160 250 113 318 181 186 59 103 308 581 279 106 98 313 215 52 62 165 130 200 84 287 175 132 47
2907D7J77j8j13M4n2%K56r2o8j0j9J03j56J10N9j08L6n0n8J04j53R1J33L3k48P3l0mj5n6N7
2543G3l9M6J04mj48K55j39L1lp8m1J05Q4j17q9MJ03J46o2p2p0o7L6K9J15lm3J14q2Q7J8j46
2168A47m2R2L6k6j26P8o3R6j10L6J7K0J5j24N1O9l0K1p7K1oJ4p8J04r1K91r9l7Rj39Q1K3o2
1780A11P3J9J31j87k6K7j2N1m1r9L5N5r0J19QL0J3l7Pr2p5Q7K13r7j69OQ6qk5l6J3k0O4J1
1381A45J55j53J7R2j1j61J7R8J6j26R1j37l4J05J77ro6l6m9J09J01j99j1k7K4P5l0j18J09
1041A64j02QJ1J1K1j4L8o4k5K9R0l2KJ38j10j8qpJ38K4p8j00P3n3r0nJ62j12p8J11q7K35p4
653A98p1rR8r0k3j6LL5L9q3p3J02K21j18j64J15p8m6J9J4Q7nj5l9Q4K1o2P7j4Lq2o1J24n4
254A37o8l0J35%L5j2n7N6oR2o4j56L4J30o3j24L0J76l8j59J55Q7n1k23O5L3N6r8n3Q2M1j2
$$ plain form
2907 47 224 206 93 137 85 85 341 249 181 171 152 255 99 209 268 160 196 146 88 192 39 130 263 296 48 121 91 87 72 16 73
2543 73 34 80 184 180 32 287 148 179 176 98 57 162 246 129 40 44 147 293 231 159 89 22 58 87 202 199 156 270 188 275 293 147
2168 147 105 197 233 207 81 159 96 192 82 118 135 155 170 46 97 166 136 157 80 101 95 109 31 135 44 335 236 199 208 69 150 173 111
1780 111 184 203 334 147 121 148 136 187 146 47 82 137 47 166 174 204 217 180 187 95 20 107 320 223 54 60 146 138 113 77 90 70 134 145
1381 145 300 147 164 256 245 84 101 199 215 89 180 43 9 114 291 282 216 180 131 240 341 142 131 104 128 203 173 55 164
1041 164 62 70 81 92 113 99 137 73 48 77 167 135 137 275 165 147 139 132 270 294 216 116 189 136 46 41 203 91 13 124 37 272 198
653 198 127 118 216 126 103 87 90 125 164 81 8 110 331 213 49 164 86 40 59 73 160 155 140 101 185 206 144 221 207 210 128 67 191 137
254 137 69 39 174 174 209 197 140 196 190 282 218 62 96 226 163 39 69 245 207 48 203 290 239 16 81 114 170 72 19 101 142 130
-121A30O5j04O8k4k6p3
$$ plain form
-121 130 195 91 159 135 109 36
-192C6
##PAGE=	F1=-92.9223
##FIRST=	25164.767445380970457,	5806.2096540000038658,	0.15436463057994842529
##DATA TABLE=	(F2++(Y..Y)), PROFILE
5806A03M4J07r0o7l5J3n2P6m3Q7j13R8J0m0J42l5j22Q8o4p0O3N8P0k2j64J68k1m3m4n5L2J5
5431I4O6J3j38L9J23j83K00j21J4jK2N2q3k3J75p2JR9q6K0lj93K64j10j7n8qnR2J9j08N6n3
5043H7O9j16J54j25m2J20KL9j27J26m8p5l5J68m0p4M5J03rp5j9M0rn9N7n0K33r3j87R0k4o7
4668E9j6Q8l9m7MN8P9L2OM7l9j31Q0O0j13Q4p0J5J2L9o8N0j27J76q1k8M0q0m2O0J1m0N9k5
4269A13j2J46j07J6Ql4j7P1R7j2q8P2o4q0lJ44L4j40N8n7o9J04N2K2r9Q3j54J30j47J16j72
3905A1K14p1k1J23j07Mm3J59r6k6o9J07k2J3N7K2R7k88J09Q6r5n5r8JO6Kk9j8O6J1J50j70
3529I0L6P9J0p7J12j54R1j8p1L3m8J03o2m0R2j8J1ql9j3k8J21q4J36q1jj09L7R6O5j35K03
3154C29j73rp3O1J12K52k59j19J4K04j67o7OQ6j35J02p1K20j19q5o9J46J4j25O8R4n9K9L2
$$ plain form
5806 103 147 254 164 97 62 75 23 99 56 143 30 128 138 98 240 205 83 171 107 37 100 158 228 206 42 210 189 146 102 47 79 94
5431 94 160 173 35 74 197 14 214 93 107 106 128 180 97 74 249 177 178 277 191 211 208 15 279 169 152 94 86 81 173 192 84 140 87
5043 87 156 40 194 69 27 147 149 188 61 187 139 64 29 197 157 83 128 231 222 147 128 168 159 100 157 107 340 247 60 150 126 59
4668 59 43 131 92 45 49 107 186 218 224 271 232 101 181 241 128 212 142 157 169 208 140 190 63 239 158 130 170 90 48 108 119 79 138 113
4269 113 101 247 140 156 164 130 113 184 281 269 181 253 189 109 106 250 284 144 202 145 76 180 232 254 155 238 84 214 67 183 11
3905 11 225 154 133 256 149 153 110 269 173 147 78 185 163 176 233 255 352 64 173 259 164 109 11 12 78 80 51 33 99 110 260 90
3529 90 126 205 215 138 250 96 187 169 98 131 83 186 124 84 176 158 169 161 122 109 81 202 118 254 173 172 63 100 196 261 126 329
3154 329 156 147 74 135 247 499 240 121 135 339 172 105 111 197 62 164 93 313 194 109 40 186 200 75 143 237 178 207 239
2813B39l8J2r6J24j55J01N7j48J26q6o5J08r9L3R8O6j61l1NL1o2j6J8qK5J07m2j22K56j13
2461A64k4J6m6l6Q9N8r9q3J0O6J68m2n7q6m8J7J7J08K7q5J11n7Q7L7j55q8Q9O4Rj71J53p2
2085A41N0j77J45rK9L0j21QJ0J7k5j9K8J4J5j19J05r8L26j08m4Mq5J4L0k4R6jQ4j99k6L0N1
1698A72J7l1j06L1P6r6Q0L9M6L2m8M5j15j07L6K60r9j42p8J03nJ0nql6M0%J63o7l5O9J1j80
1311G2LJ25jj08L5q9%O0J80j7q9m9L3Q6Q4k13pK5l4M7Q3j03Op3Lk2N1L4j9P7o8m7mP9J7K0
888A77J15j05m3J7p5J87M9q2o6M7j05m4n8J39l9k0R2j67J81m4n3j0J07k3l7k4j4nK6o4m7J12
513A24K25j48j59R3n0Mj8k1J17Jp8QR3rj12J05L0L9p9o9J00p1k3m5R3J8L1p4LO8k1Q7p4j14
114G4J8P5o4k3M8J27m8r8J12K0n0j40K5M1Q1q8o9M7M5m6J12j35P8l1J5q2
$$ plain form
2813 239 201 213 117 241 86 187 244 96 222 136 71 179 80 113 211 277 116 85 90 121 59 43 61 53 78 185 143 21 277 164
2461 164 140 156 110 74 163 221 122 39 49 115 283 241 184 98 50 67 84 192 219 134 245 188 275 312 157 69 158 222 231 60 213 141
2085 141 191 14 159 150 179 209 88 96 106 123 98 79 107 121 136 17 122 24 350 242 198 202 117 131 161 137 233 232 316 117 91 121 172
1698 172 189 158 52 83 159 63 143 182 228 260 212 257 142 35 71 331 232 90 12 115 110 120 115 107 71 111 111 274 207 172 241 252 72
1311 72 75 200 199 91 126 37 37 97 277 260 171 122 155 241 325 112 105 130 96 143 226 123 129 56 59 37 88 122 103 180 112 65 61 140 157 177
888 177 292 187 144 161 86 273 322 240 174 221 116 72 14 153 114 94 186 19 200 156 103 93 200 177 140 116 102 97 123 59 12 124
513 124 349 201 42 135 85 89 71 50 167 168 90 98 191 182 70 175 205 244 165 96 196 125 102 57 150 168 199 125 128 196 175 262 188 74
114 74 92 167 103 80 128 255 207 109 221 241 191 51 76 117 198 110 41 88 133 87 199 64 142 111 126 44
-192D4
##PAGE=	F1=-195.18
##FIRST=	25164.767445380970457,	5806.2096540000038658,	0.23463204503059387207
##DATA TABLE=	(F2++(Y..Y)), PROFILE
5806A37OP6j04j2q7L5M2l7J7O1q6Q1N3r5J63o8q8N3o3nLM9R0n2m9J62j09p1nm3J9L7N5J8j52
5395C1M9J23j91K01j10MJ7JJn0oJ20p7N6P5j4L4o3j55J71m1Oo6j3m3R7qj23N4K2J11j59J71
5008B25j30o3J09j7M7r1R7n5l5p6K13j8j23L9R8lp3n1OO3nj6o5K29l9j74M9q8L7n4P0l4m5
4621B7M4J4O2O8L1M7l3j15l1P3p4J02q7L8L2J2j03M7j28J73m2j8K4j03l3P7K2l3K0n4Q8J62
4245C09j43rJ4p9j1N8J13Pq9M8p5r1K3J54P2j16kn3m4J12R3N7j56L8j16R3j87J89j43J46m5
3881A67MQ1j23mpJ45p9Nj2m6P2nMJ08N6l06J49P5n2j52n0PL0L4l0rM4K8J12j89J8O3Q3m0N8
3470B39j34M8qq4K8K6Q5j06j9R0l6L0kk9k6m2J39l3J16j44Qj15O4J23K7j23J91j84k5k6P8
3107A56M3K18k22p0L1J67j64K0l4P2j91Q4j5K18j28j09l8R4k2o3R3L04J34k03j13p7M8j34
$$ plain form
5806 137 143 219 115 103 16 51 93 56 73 134 48 129 182 87 250 182 94 147 84 79 82 131 221 169 120 282 173 102 97 54 73 110 165 183 31
5395 31 80 203 12 213 103 107 124 125 126 76 70 190 113 169 244 230 264 201 46 217 176 182 116 103 60 157 149 26 80 102 213 54 225
5008 225 95 32 141 124 171 80 177 122 87 11 224 206 83 122 220 217 144 93 99 162 157 141 76 305 266 92 141 53 90 36 106 72 27
4621 27 71 85 147 215 246 293 260 145 114 187 113 215 128 166 198 210 107 154 26 199 157 139 163 60 27 104 126 93 113 59 147 309
4245 309 166 157 171 92 81 139 252 259 170 218 143 52 75 229 301 185 183 130 86 198 291 348 192 230 114 207 20 209 66 212 167
3881 167 171 252 129 125 118 263 184 189 177 131 203 198 202 310 366 60 209 284 232 80 30 37 67 101 71 62 106 134 246 57 75 138 221 181 239
3470 239 105 153 145 61 89 115 200 94 75 165 129 159 157 128 102 60 199 166 282 138 146 31 95 218 245 122 313 129 104 78 156
3107 156 199 417 195 125 156 323 159 179 145 217 26 110 95 313 185 76 38 132 110 47 140 444 578 375 262 185 233 99
2778I9R7j13O9M5j13J68j34n0J05m9l0N6R2o7q4k5Q7j10L5m2K9LJ10o3o9J90o3r4L7pk7Q2
2402A64K7r4n7J6J9J69k1k5r5l6PlJ12L2o7N0m3J09N0j56j20Q7Q0O0k09J94o4k4j15J42oK0
2027B03M1j19lq0O9m8QM8K5K5j21O6n1K74j05o5NQn6K4KJ12k8K4j95k8M2J13j0k5j12N5P2
1639A70p9L3N2O2N4p4Q5j29j06l6K71q7j04o5K2kO4J5m2m9J6J5J27M2q2O3J0j99rJ66l3q3
1264H8k9L3j4mJ73np7q9J07L8N3j85rO1p4J3J86q4j06k4J1l9P2K8j4R4n4p8kL4O0M6P9j05
865A84n1L1j19K01O7p2k9K1j39Po2Q1M8J1L7j66P9m2k9QJ16L3n0k5k9m7J3k2k0R7K13j73j27
477D5M6oL6l8m2J01K0j12L8J05k9j36J10P0O1o6o6M8o9Ql9M5L1K0j31P6N8j4N9q9o6L2Pm6
78F7L3O8P0l9k6N7m6n2o6O5l4J01p0p2K3L9o0J30j30Q2o2O1l8
$$ plain form
2778 99 196 83 152 197 84 252 118 68 173 124 94 150 242 175 91 66 153 43 78 36 65 68 178 115 46 236 173 79 116 109 82 164
2402 164 191 97 40 56 75 244 223 198 103 67 74 71 183 215 148 198 155 264 314 158 38 125 205 265 56 250 186 162 47 189 183 203
2027 203 244 125 122 42 111 63 71 119 144 169 48 114 63 337 232 167 172 180 124 148 150 262 234 258 63 35 77 190 180 155 43 98 170
1639 170 91 124 176 238 292 218 303 174 68 32 303 216 112 47 69 67 131 146 104 55 71 86 213 255 173 236 246 47 38 204 171 88
1264 88 59 92 78 74 247 242 165 76 183 221 274 89 80 141 67 80 266 182 76 52 63 24 96 124 110 204 150 72 70 104 164 210 289 184
865 184 133 164 45 246 313 241 212 233 94 101 39 120 168 179 216 50 129 87 58 66 182 215 165 140 111 64 77 55 35 132 345 172 45
477 45 91 85 121 83 41 142 162 50 88 193 164 28 138 208 269 203 137 185 116 124 85 130 161 181 50 126 184 170 229 140 74 106 113 67
78 67 100 168 238 199 173 230 184 132 66 131 97 198 128 56 79 118 58 188 58 140 78 139 101
-192A01
##PAGE=	F1=-297.438
##FIRST=	25164.767445380970457,	5806.2096540000038658,	0.45314761996269226074
##DATA TABLE=	(F2++(Y..Y)), PROFILE
5806A87m7L7r9L1o7jJ18p6J7M5p2O8Q3j59J79j12m3K3n7O1J2MR5r3N2J33j86r0L6p%N0K9L9
5407A90j54L7J19j33J55j10K8Mj5k9l8K8M8o3O8N3P8M0j29q9N8K0K9o3j1p2J01j0r7K5N2J79
5032B99k09J71j52n1Q2m6N5m2N7m8Lj11K31qj41L6P5mn9l6m0J12K8p5q9K05K0j31Rj26J08
4668A23q3M1J1j0L1m8N0J17L7K8l0q8j33R0m1J16j23L7R4j1j33K7n4R0jrJ2p2k8Q1L9n3j3
4280I4p4J67J77j63n3K5r5KK2J14J2p7M3r8n6PJ46J01q2n3n1j3R4J36P0j89Pp2N5j53J74r3
3905A24R3l6RL2j29pN8J10o1L2K5j14Q6l4MJ66J6l05J71O4j4j76p5J4J9L3Lj6J6L8P9j87K5
3517F3jJ66l9K0j01ojl7j9R8O9j47KQ7n7L5L3j0o9k2R7K6J20j87lr4O5J31j9r0J58j64m2R
3118G1Q8K2J81j96n4N4J06r0P1r3N9j73K1M1J78j35j08%L5m5J08j2N50L77l12m35j70Q4j27
$$ plain form
5806 187 140 177 78 109 42 41 159 83 100 145 73 141 224 65 244 132 89 112 55 116 128 132 227 134 186 319 133 43 79 72 72 122 151 190
5407 190 36 73 192 59 214 104 132 136 121 92 54 82 130 67 135 188 266 306 177 88 146 166 195 132 121 49 150 140 43 68 120 299
5032 299 90 261 109 58 140 94 149 107 164 116 119 8 239 231 90 126 201 197 138 102 62 174 202 127 38 243 263 132 141 15 123
4668 123 40 81 92 82 113 65 115 232 269 297 267 179 46 136 95 211 88 125 219 208 75 102 48 138 137 128 140 68 40 121 160 107 94
4280 94 20 187 364 201 148 173 78 80 102 216 228 151 194 96 40 47 193 294 212 159 108 95 189 325 395 206 213 141 196 43 217 124
3905 124 217 181 190 222 93 86 144 254 193 225 250 136 222 188 192 358 374 69 240 304 290 114 39 53 72 105 108 92 108 146 225 38 63
3517 63 62 228 189 209 108 102 101 64 45 143 212 65 67 154 97 132 165 155 86 64 161 187 307 120 117 23 88 219 200 110 268 104 62 71
3118 71 159 181 362 166 112 166 272 182 253 160 219 46 67 108 286 151 43 43 78 33 141 129 679 1056 744 309 139 223 96
2778I6L2l5J5K4J4J29j86lQ7qq3OJ09K1r1q1J28j34O7q3M4j8J18o6j3P8J1j51O9NqQ3j0j05
2379F1j6J1j8J56oJ4r6l7J1k6J15J7mk9n2J48N0j45r9N5P4J23k30J85l8j04k4R8K7qM8j20
2003A41K6r1K9k6oO4K0L0j28M9l4K15q9q8L0R6j08NJ8J18n9l6j65K7RJ39k3k5j21J04L9o5
1628I5J7L8Q6P0j03J16j38r7n8K15n8o7k6m6k8J23K3q0n2nP5L3J48j23P9qk09QJ89p7o1n2
1252B7J30m1n5J51J7m5j35J61k1J1j16jO5j01lK42o4k04M3K4MK4QkQ8l0j08M1m4Q7P5L5j02
865A61m2K4j08J58P7n2PNj53M8n9M1J10J1j8j50M8q1JJ4J24O0o1j0m1q7QL2MN6J96j98o9k
466E4L1L8k8m0M3L7j09M1J20l7j01P3R1P1n1n3j7m5Qk5J8L5%j40J10M8j2K3r3l0P8n5J4QP0
55A75K6qK9Qr7n8j7J15j08J08m1o6LK4m6J15p1N4j01R8K4
$$ plain form
2778 96 128 93 108 132 146 275 89 86 173 165 82 88 197 218 127 46 174 40 107 24 68 50 168 102 89 167 178 27 96 101 93 176 166 61
2379 61 45 56 38 194 188 202 106 69 80 54 169 186 182 153 101 249 299 154 55 110 184 307 77 262 224 120 96 194 221 213 261 141
2003 141 167 76 105 79 73 137 157 187 59 108 74 289 200 112 142 238 130 135 153 271 212 176 11 38 47 186 163 138 17 121 160 95
1628 95 112 150 236 306 203 319 181 84 26 241 183 116 90 44 16 139 162 82 30 25 100 133 281 158 237 229 20 28 217 140 79 27
1252 27 157 116 61 212 229 184 49 210 189 200 84 83 148 47 44 286 222 18 61 85 89 113 121 119 207 177 69 110 66 153 228 263 161
865 161 119 143 35 193 270 218 225 230 77 125 66 107 217 228 210 60 108 27 28 42 166 226 165 155 114 27 35 67 71 127 323 125 56 54
466 54 85 123 95 55 98 135 26 67 187 150 49 122 213 284 233 180 163 118 126 101 119 154 154 14 124 172 160 183 90 60 138 83 97 105 175
55 175 201 193 222 230 133 75 58 173 65 173 132 66 69 93 47 162 91 145 44 142 166
-192A66
##PAGE=	F1=-399.696
##FIRST=	25164.767445380970457,	5806.2096540000038658,	0.26215958595275878906
##DATA TABLE=	(F2++(Y..Y)), PROFILE
5806B38r5lp4M0j1l3J40n7j5N7p4M8R7k22J83j27j8Ol4R7L7k3R1j18R7Q5k14p0J6M2l0Q3k3
5419A16O4j29J7R7n4R8j12P2k6k8l8l5P6m4K5j6L6J73L9j93k6l2O3M8n1j7p0J03J1o4J8J1
5043A32K50k39J55j82k5N4p9N7K0Pk5L2j41K30k0j43N9M1om9J1l3P7M0r7j05J50P3p3j2r4
4679F5P9r7J4N8K2Pj06O9J46K0Jl1n6j22O7n8J29j67J6J75k9j50j1K8kM8j5PRk7M9O7q7l5
4280H3l1J66J77j59j05L7q2J0rR1Lm4M8j32K2j6R8J12n3q0m2lO8J74N4j99Lm3L0p2R5k7O7
3893B41m7j4j4j07jJ16P4n4N3L8j08M1p1N3J85j7k85J76N7kj70j00K8M3j9L4j5qL9M7j43M7
3517I7q5K13p0J3o0o2J0L4p1J47M8j80L4P8p1K6P4Mj04K2OO9J54k11k1n5M6J17o7l9J06j14
3142H8n5K3Q4M4J60j80q1Q4L8NJ00j52M6j40J9M6J07j38o5J8K1P8J13j53P89O16m03p53k80
$$ plain form
5806 238 143 140 66 106 95 62 202 145 130 187 113 161 258 36 219 92 74 80 46 143 180 157 248 130 227 312 98 28 44 86 56 139 116
5419 116 180 51 68 165 111 209 97 169 143 115 77 42 118 74 99 83 119 292 331 138 112 80 143 191 140 123 53 156 167 103 121 132
5043 132 382 143 298 116 91 145 66 123 143 150 125 157 16 246 226 83 142 183 177 128 139 106 183 223 126 21 171 244 171 159 65
4679 65 144 47 61 119 141 148 42 111 257 277 278 247 191 69 136 78 207 40 56 231 202 52 41 69 67 115 100 107 116 89 138 205 118 83
4280 83 52 218 395 236 131 168 86 96 87 178 181 137 185 53 75 59 157 269 216 136 94 91 159 333 387 188 191 148 178 106 201 174 241
3893 241 194 180 166 59 58 174 248 194 247 285 177 218 147 200 385 368 83 259 316 314 144 44 72 115 96 130 115 107 146 193 50 97
3517 97 12 225 155 168 108 46 56 90 19 166 214 34 68 146 75 101 175 179 75 97 103 172 326 115 94 39 85 202 135 96 202 88
3142 88 33 56 140 184 344 164 83 167 205 210 310 158 204 64 83 129 236 98 33 51 72 150 263 110 899 1515 1112 359 79
2801G9J10j05l7O8m8kJ49O9k30N5O4K7j17n3J20Q8p8p7R4j09O1p7J7m2J35o0N9q1J03r9N2
2438A35m3J4Q8m3j18J5jk9J32kN0q9n0K7m7J07%O6o8j01J86M0j20m4J5M3J80k41J44kj59M2
2062A27M2P7m9N3j25Q8p2l5%j4O8KK4j37N3m6J61o2q1P4J32j43k1M1J07r1n7k3K3l1P5j7k1
1675A22j00J22j1o1L2NJ15P4j24J28j36p6k7R5j2m5J8k3n0R0K5r8k3LJ00p8K14j57J18m0j78
1311B2M3J73j22m9J8J29p1o6J04L0j7j53J90o6m3k1K0M5j28L6K06m0j94L8L6L8k5k3K2O1p
947A86j29J02j19Q9J00lq0l6om9O9P7k5M1Lj37N4m3J3J36j0n6j23O7n4K6n0J16N6q0J9m9r1
560A4JO2M3j3J82k20%j4K2K3Rm1j5L5p5K3J36l7o9O2Q7P2l8m0o9j7j6mJ2L9l3o1O2N7m5nn8
125G1k7J31r6O0l7N5jL8N6l0j21o6oJ51j19Q1np0kQl6Q5J3J1j19J11Q2
$$ plain form
2801 79 189 84 47 115 67 65 214 283 53 108 172 199 82 29 149 237 159 82 176 67 128 51 68 26 161 101 160 79 182 83 135
2438 135 92 106 194 151 33 48 47 18 150 148 198 109 59 86 39 146 146 212 144 43 229 269 149 105 120 163 343 102 246 244 85 127
2062 127 169 246 197 250 125 213 141 106 106 92 160 162 186 49 102 56 217 155 74 148 280 137 116 157 264 173 116 93 116 85 160 143 122
1675 122 22 144 133 72 104 109 224 298 174 302 166 90 63 158 146 101 119 96 46 136 161 63 40 43 143 65 279 122 240 200 22
1311 22 65 238 116 67 85 214 143 77 181 211 194 41 231 165 122 101 121 166 38 74 280 240 46 84 120 158 133 110 132 193 186
947 186 57 159 40 129 229 226 146 110 104 55 124 201 176 217 220 83 137 94 107 243 233 177 54 121 67 93 43 159 215 135 154 105 14
560 14 15 77 120 107 289 69 69 55 77 100 109 68 53 88 13 36 172 135 66 128 215 287 249 209 140 123 107 103 115 154 121 60 122 179 134 129 71
125 71 44 175 79 139 102 157 156 194 250 220 99 33 27 178 59 140 135 65 63 71 35 120 133 144 25 136 218
-192B18
##PAGE=	F1=-501.954
##FIRST=	25164.767445380970457,	5806.2096540000038658,	0.17350503802299499512
##DATA TABLE=	(F2++(Y..Y)), PROFILE
5806B72j26k9m0J9M6m7J26k5l7Q1p5J7R2k56J63o7n8RKQ9N2j9Q5j12P6K8j67j3q2R4n5J26
5431A69r7P9p7K8J9L1L6j00J11n9l8l8j3J18j32J30j37L6K36L7k48K4o7O3O3l5l0n2J04L8
5078A99m0K1n0L03k43J38k07kL7j03M2Q9m6J2M3j81K33n8j31J03J5no0N4oK1M1q4r2O9J08
4715B20j9qj05N8r2kP7N5j9j48J28J30j0k1m2l2m2N7j20J43j36L7J26m6j43j5M8p2J14n9R
4351G1Q9k8J1R9j18m4MJ50J61j36j48M4n7Nj3N3j2J3M0j48N8NM3Q5l1p4k8k3N1J94J3j81K9
3963A77n0K7J8qM4O1o4o6m6k4j2J32N6n5N7M2p8j0j11J15J74l6k44J64N0j4j59q6M5O4q1M9
3588A31qj8L0J8o9N1o6J34j18M7k3r7K0O8o9J49L0k06P3O3o7NJ01Lr6M9l5K8K08k28k4j8K3
3200H9R1r3mN1m1m8lO0Q5J67j76j34J13lP1J14j94L4j00M6J2L0j26J6jN0J35J30k89R73P93
$$ plain form
5806 272 146 117 77 96 142 95 221 196 159 240 165 182 274 18 181 114 56 65 67 156 208 189 274 162 238 266 99 86 4 98 43 169
5431 169 72 151 74 102 121 152 188 88 199 140 102 64 51 169 37 167 30 66 302 339 91 115 48 111 174 139 109 57 161 199
5078 199 159 180 130 433 190 328 121 119 156 53 95 184 138 150 193 12 245 187 56 159 174 169 109 163 157 178 219 135 43 112 220
4715 220 201 193 88 146 54 52 129 184 165 17 145 275 265 244 202 170 128 185 65 208 72 109 235 189 46 31 79 7 121 62 71
4351 71 160 132 143 242 124 80 84 234 395 259 111 155 98 103 90 143 131 144 184 36 94 99 142 227 196 122 94 71 122 316 329 148 177
3963 177 127 154 172 164 208 269 205 139 93 69 57 189 245 190 247 289 211 201 90 205 379 343 99 263 313 299 140 54 99 163 82 131
3588 131 123 105 135 153 84 135 69 203 85 132 109 12 32 100 31 180 210 4 77 140 73 78 179 182 86 135 100 128 336 108 84 66 89
3200 89 180 87 83 134 93 45 42 102 187 354 178 44 157 154 225 339 145 179 79 125 137 167 41 57 56 106 241 371 82 1055 1848
2837A848m62r92l47J00r6j2J09r4k2K31Rk61J12L8O3j31o7P3J30n3l5J8n0L7o7qm3J28n2J43
2484B47k25J72n3N1j04K2R4o0j03Nmk7J09j5P4p0o2M0n6Q0PJ07o1j59J84L5q2J3jj6K19k46
2109A15Q8L3j65P3k6J29r8O7j38J67o3p7J4mP0k1Rj43O8p4J35j5k5P5J09j72m5R2P2j26K7
1745A51L2Kn0j5Kln3R0n2n6M6k8J38O3j26J16j18m1Jj9L7l0M9K8o0J7K1o1LRR4j19J85j88
1346F5J71p8j14N4J63j59n1Q2J16r3m9N0K2jj36J94p6r2O1L7K9j56P3J40j7j45J6N5N8p1n5
982I3N5K8Jj35J55j53N6J21j5l7o1n5K8j9O0OO5K3j07J9pj1J29m0o5q7O4j1O2r5R2L6j12N6
583A39n7l3k1N0R5r1J64k20N2j3nJ9N1o9k4Ml3L4J11l6n1P5P1O8l5l1r0Km6J8J8N0p1rL9Q3
160B08j18j8K2l7J47j22Q0o6L6j5Q9N1n5j09p5NJ26o4M6J4r3J8J6o3M2J05l6r4Q6J19
$$ plain form
2837 1848 1386 394 47 147 51 39 148 54 32 263 272 11 123 161 224 93 26 99 229 176 141 159 109 146 79 71 28 156 104 247
2484 247 22 194 141 192 88 110 204 144 41 46 42 15 124 109 183 113 51 91 35 115 122 229 168 9 193 228 146 159 158 142 361 115
2109 115 203 236 71 144 118 247 149 216 78 245 182 105 119 115 185 164 173 30 98 24 159 144 119 194 303 131 86 178 250 124 151
1745 151 183 185 135 120 122 119 66 156 104 48 94 66 204 267 141 257 139 98 99 80 117 87 136 164 104 121 142 81 84 93 187 68 253 65
1346 65 236 158 44 98 261 102 51 133 249 156 107 157 179 178 42 236 160 68 129 166 195 39 112 252 235 90 106 161 219 148 93
982 93 148 176 177 42 197 44 100 221 206 169 108 53 81 62 122 128 193 216 109 128 121 110 239 199 134 47 111 100 162 67 159 195 83 139
583 139 82 49 28 78 173 82 246 26 78 65 60 79 130 61 37 41 8 42 153 117 66 141 212 280 245 214 124 126 80 98 116 166 95 86 125 208
160 208 90 72 94 57 204 82 162 96 132 117 206 257 202 93 18 23 149 85 131 145 52 70 86 23 65 170 134 40 126 245
-192B45
##PAGE=	F1=-604.212
##FIRST=	25164.767445380970457,	5806.2096540000038658,	0.46039223670959472656
##DATA TABLE=	(F2++(Y..Y)), PROFILE
5806B78j38l5pj1Q9m9Q9Pm4J03o5k5P4k30R8K6j14J8K7O3N0RP8r5K4k9o8Po8N2n5J49j70P0
5407A08j5O4r1J00k1o2J21p5n0l0K6J43j66J77j92N4K01L8k85M9k9J2P6k1m3l5R1O6pJ8j07
5043A15L24k24J26k20J3L3j07J6J46r0M7L7k00K14j11q6J29J3jr0P4K3k6M1n7p8K2J12J6K6
4691B37j46L6o3j5O4Q5l7j30J66Q3m6l3o0k1M7O2j69J54p7Q3Po0j18L3Lk1R1j23K1J26k1j5
4316A43J21j37m7J8J33J30r9j71M1k4j3RJ3j1O4K3j16J4M4J5K7k2l6k2n3O2J72l9j23P2j02
3952H6M5J00j14J10O1p8j32j0L9m3J20N9n7M1N2n4m0j30J33J48l7j86J36M3m3j43l2N4O6j31
3600F3N6nj2J8qQM2o1O9j54J08j0p6jM9m9J44K5j87O9N1n3j7J05j7m8N3J6r3K48k46OJ0kO7
3189A68m2n5L2J5m2l9J6J21J91j75j78J25MP8J17k08K6n1N2l3l4n9O1l1O8J60J57l99J064
$$ plain form
5806 278 140 105 98 87 176 127 216 223 179 282 217 192 266 36 134 160 46 64 91 154 204 213 291 196 220 191 123 130 62 114 59 208 38 108
5407 108 93 157 66 166 145 83 204 129 79 49 75 218 52 229 37 91 292 330 45 94 65 77 153 132 89 54 145 211 204 222 115
5043 115 439 215 341 121 134 167 60 76 222 132 179 216 16 230 119 33 162 175 174 84 158 181 155 196 139 61 83 195 211 237
4691 237 91 127 64 49 113 198 161 31 197 280 234 201 141 120 167 229 60 214 137 220 227 167 49 82 85 64 155 32 53 179 158 143
4316 143 264 127 80 98 231 361 262 91 132 108 95 104 117 106 170 193 77 91 135 150 177 155 119 97 44 106 278 239 116 188 86
3952 86 131 231 117 227 288 210 78 68 107 64 184 243 186 227 279 225 185 55 188 336 299 113 249 292 249 106 74 128 194 63
3600 63 119 114 102 120 112 120 162 101 170 16 124 114 38 37 86 37 181 206 19 88 139 86 69 174 157 109 162 178 85 333 87 93 103 101 168
3189 168 126 71 103 118 76 37 53 174 365 190 12 137 141 219 336 128 154 103 155 122 88 29 90 59 127 287 444 45 1109
2848A109Q65m73j096l28L3j09J15P2j12j0K19m3k09R1J3J00j32l2k8J51k0J6o5K5J7p1j9j5
2520F4Q3m7K29k28J16m5O2j41KJ00n2q9j3K7m3R2m7Q4m0n4L4n2L8N7R9m8j70J18N0m5O8Kq6
2132A25K28k45L2O0j31P9r8J69j36J02j74K44o4r7K3J7P3l7j4j18N5n0J31K8j7O2O5k03n6
1792E3J66J8j62J54M2l8o5q0NL4k7N3n0k2nl2J36M1j16Q6p6%J1n6L7NL8P2o9n4J5MNJ1Q5j23
1369I6J22j84J86j16l3M4J60j77o5J28R7j06k2PqOq9J80n8j04R3M6K0j73Q8P2Jr4MP3P0j09
994A55p8Q8Lj4j18J77j51J1J42Prj09r0R5l4jK1O5O3q7m0M3k4R5o9m4n0J3L6J18j23P3J8j51
595C1Q1o4K7l8L3J54j41J12j56M0j8MM7M8j29K1%m3Q6M9n1m0R5N0O6m5k9p6J1n9K7K3O6q8
196I4ML2J10k01j6R3k5J28j39Q7q1L2k7J35L0p8n8r2M4L6pN5Lj17N1M4p9n2J92p7o0N6J21
$$ plain form
2848 1109 1974 1501 405 77 110 1 116 188 76 66 285 242 33 124 137 237 105 73 45 196 176 192 127 152 169 98 79 64
2520 64 147 100 329 101 217 172 234 93 95 195 143 54 41 68 25 117 70 154 114 60 94 42 80 137 236 188 18 136 186 141 209 211 125
2132 125 353 108 140 200 69 148 50 219 83 185 11 255 191 94 117 134 207 170 156 38 93 43 174 202 185 247 312 109 53
1792 53 219 237 75 229 271 233 168 88 93 127 100 153 103 81 76 44 180 221 105 191 115 115 126 70 107 112 150 222 153 99 114 118 123 134 219 96
1369 96 218 34 220 104 71 115 275 98 33 161 258 152 130 137 129 135 46 226 168 64 157 203 223 50 138 210 211 117 121 194 264 155
994 155 77 165 168 154 36 213 62 73 215 222 213 104 14 109 75 74 95 160 223 136 96 139 115 210 141 97 47 60 96 214 91 164 182 31
595 31 112 48 75 37 70 224 83 195 39 79 61 65 112 160 31 52 52 9 95 144 93 53 148 198 264 219 190 114 125 66 93 116 182 94
196 94 98 130 240 39 23 116 91 219 80 167 86 118 91 226 256 178 120 28 72 108 101 156 159 42 93 137 58 6 198 121 61 117 238
-192B38
##PAGE=	F1=-706.469
##FIRST=	25164.767445380970457,	5806.2096540000038658,	0.44106212258338928223
##DATA TABLE=	(F2++(Y..Y)), PROFILE
5806B51j32j9K6m1J07m1M4L1l9J09m3o6M6j66J8R8j24MM3L3L0N3O4p8k8p4L4J3l6J9n2J58
5431B42j92J4L3J05j95J40o1lR5o5o7K0L4J51j69J90k03P4J18M7k97M5K2l5R1om7l1N0R6L6
5067B32Mj44L07j90J18k20K5M3r0pJ70j18O6K4j76J53j64L8P4L1Mj17O2N0n2L9l7n5LJ00K2
4703A95Q1j72j0j6l5L3J04m0p5J81K7q3l4q3j1J19O4j79J56l8J21j01o6q6O3k0J2Q0j50K9
4351F6J03kk1J22j38n2J3J19Q9n5j68K4J4l6M7k4K3P8J7q6o2Q5Ql5k6K3k7o8R0J06q8k1J02
3963B20j46M0J59j79J44M9q3j37P7pp1J01P4n7PQ2n4m0j02O5J17j3j24R8L6p6j10L8M4M5j58
3600C9O6k0RJ2k4O6L2p6L7m6M5j9o9pLk0J42L1j74O9M5l8k4Q0m3QM8Q6j56K18k64O2K4k6N8
3189A74K4j39O8K3m3n9j9J02K18j60j55Q0L3M9J10j85J2JL1q0n0K2O4n3N7J65J77m48J024
$$ plain form
5806 251 119 100 126 85 192 151 195 226 187 296 253 187 233 67 85 183 59 63 106 139 169 222 286 208 180 106 140 153 117 136 84 242
5431 242 50 64 97 202 7 147 86 83 178 113 46 66 100 251 82 272 69 143 261 308 11 56 78 43 134 128 81 50 100 196 232
5067 232 236 92 399 209 327 107 132 175 85 78 248 130 196 220 44 197 33 71 145 176 180 63 125 175 123 162 125 70 73 173 195
4703 195 276 104 94 78 43 76 180 140 65 246 273 190 156 73 62 181 245 66 222 184 305 204 138 52 115 95 107 187 37 66
4351 66 169 167 146 268 130 78 91 210 299 244 76 100 114 78 125 101 124 202 219 133 71 156 164 129 103 126 99 31 121 227 139 118 220
3963 220 74 114 273 94 238 287 204 67 144 137 66 167 241 184 191 273 219 179 77 142 259 246 122 220 256 180 70 108 152 197 39
3600 39 105 85 94 106 82 148 180 104 141 95 140 121 52 45 48 28 170 201 27 96 141 103 79 159 116 124 172 258 102 320 56 118 142 116 174
3189 174 198 59 127 150 107 48 29 131 349 189 34 114 147 196 306 121 133 134 165 85 35 57 121 68 125 290 467 19 1043
2848A043Q16m23j041k83k1l6J18N1j21oJ79p7j24L8j2J36j27Oj00J29K0O2j37R6J8r2j9J1
2520A04K5m5L05k29Q1o8P3j37l2Q4j7r1kN8n8P4q9P9pk7J3m2J2J09O5n4j82O1Q9j8J12K0j53
2132A13K06k31nN8p5O9j09J42q2J09j29J74o8j02L2M2P4m1l3q6K7mJ57M4n2N8K8k42oJ95k9
1768B34j96K52N7r1q0q0m6Q1j2J7oPr0kJ15Rj03M6jK4Pl1J4M6pR5p7j05PO2%J3P4j36J04r1
1346A10Q3j48N6J1J62j74p1J41P1j04jk0n1Rk2J52k9j00J03M8Rj64P8J3J3m2lQ0P6j34p6J01
970A77qm3p4J51j34j2J53L8kj56l2Q0%l0j2K9J12q7j05R2j6M5q7qj7j3K9J67j29N8J1j27K9
583G9m5N3l8QK07j41J4q7J8rO3N0K5j79M6L0q0J34jq2k5J06K4P1o4m0l3K2n3J6K1P6p5j0K8
172A29J31k09k8R0MJ01j42Q8r1N2m8J72J2j10J6j08N3nj5R5j6j06N6O9p8n0J51j02l6L2R1
$$ plain form
2848 1043 1859 1436 395 112 91 55 173 224 103 97 276 199 75 113 101 237 110 116 16 145 165 227 90 186 204 112 93 104
2520 104 129 84 389 160 241 173 246 109 77 161 144 53 51 109 51 125 36 115 108 81 94 52 64 173 238 184 2 63 152 134 246 266 113
2132 113 319 88 83 141 66 135 26 168 86 195 66 240 172 70 102 144 218 177 144 58 85 81 238 282 230 288 316 74 68 263 234
1768 234 38 290 347 256 176 96 50 131 119 136 130 137 47 45 160 169 66 112 111 135 142 111 125 171 164 259 182 77 84 146 146 159 233 97 201 110
1346 110 193 45 101 112 274 100 29 170 241 137 136 116 65 74 52 204 175 75 178 226 235 71 149 162 175 133 130 210 286 152 76 177
970 177 169 126 52 203 69 57 210 248 246 90 58 138 138 108 96 125 237 150 45 137 121 166 79 71 54 41 70 237 108 166 177 50 79
583 79 34 87 49 57 264 123 137 50 68 59 122 172 197 18 64 94 14 148 147 65 40 146 170 241 177 137 104 126 73 89 110 186 111 101 129
172 129 260 51 23 113 117 218 76 164 73 125 77 249 261 151 167 59 112 107 92 187 171 65 121 190 112 62 213 111 75 107 198
-192A98
##PAGE=	F1=-808.727
##FIRST=	25164.767445380970457,	5806.2096540000038658,	0.26649942994117736816
##DATA TABLE=	(F2++(Y..Y)), PROFILE
5806A95j09J3N1o7J02k3NM2k8R4j3r2J2p8o8J36q1l5N5NjJ00L8n8o0q3Q8J9%Lo7J67j90l0
5407D2M4J33j70M8m2K6M1j9p6Q0QJ39j46J81k02R0L4O6k50kM3k0P4Pk9l4j4J04Q5k1j48K55
5032C27j52J08k08L5O7n7k8J59j24O7J2j34P4r2O2oN9J1j20J5P0m1J5l0j2j9R2jJ50j47q8
4668F4K7n2jR8k5j8J82j8j19j8j06O1J00N4j44J41k2J35j76n5o0P3j9K5P4j50L3N1L3j5J04
4304B57j16o6mJ02N0j1j45oN8n5Q5n2O4P2K3p3j34J11Np4m1Q9k7n6R0K3j15P6J18j25k3J86
3928B86j64J25J5p8m3Q3p9p3Q4Q4o0k8J22p8k0p0k9Q1M4p6N6K6r4k9O4J9Nj58Q2n4L8J9k4
3541G6Q6L3j16N4J9lk1p6K0o6PJ40L9j74Q3L8j8j0K5n2L4M9J41j53J43k61J11K8m2M8P0k06
3165D6J12K1m6o8jrK32j17j08L3N0J5J02j37qM3lq1J4k4Q3o4J5J59J77l79Q11O62l19q41k29
$$ plain form
5806 195 86 99 150 83 185 162 167 209 181 275 262 170 182 104 36 172 91 56 111 116 115 215 253 195 135 52 140 159 159 162 95 262 72 42
5407 42 86 219 49 97 55 81 122 103 27 107 115 254 108 289 87 177 211 277 27 25 68 48 122 129 100 66 52 156 241 220 72 327
5032 327 175 283 75 110 177 120 92 251 127 194 206 72 146 54 116 110 169 180 60 75 145 104 119 89 77 58 150 149 299 152 64
4668 64 91 39 38 136 111 93 275 257 138 120 14 75 175 229 85 226 204 339 163 108 48 121 102 127 201 51 84 135 168 153 257
4304 257 141 75 71 173 223 212 67 61 119 64 149 97 161 233 256 183 49 160 165 91 50 139 112 56 146 169 54 130 248 123 100 286
3928 286 122 247 262 184 141 224 145 72 156 240 180 152 274 196 176 106 77 158 202 126 182 208 114 85 149 168 173 15 97 43 81 100 76
3541 76 162 195 79 133 152 149 128 52 72 6 13 153 192 18 101 139 121 111 136 84 118 167 308 155 298 37 148 176 134 182 252 46
3165 46 158 179 133 65 64 55 287 170 62 95 145 160 262 125 117 160 157 76 90 66 149 85 100 259 436 57 868 1530 1211 370 141
2801A41n8J8R4N2j23KJ15q5m7j1m1J64j20N2p1J6M9R4j77J38M0j16j7L3m0m1L51k25O2j00
2449A49P8r6k9OL8q9L7N5o6N4r4L8J6Krk6K6J14L0q1r9rQ5mJ38M8k07J59j97J8j2kK8nJ3O4
2027A71P0j13P5p1r0M0O4O5k9m2p5QK8J85N7r7O5J0k84R0J72n5k14K87Q5j47j00k2j21J11
1675A23%oL5K9j70L0J11k2j00J4P8L0rj3L9O3n9R7q6j23%R3nJ8O1j58J41k5k3j49J12l6J61
1287B51j48m9J14M4r5Nk5r3L3L2J13qj00J12M7j0j28N2k7J7PpO7Q2j41n9R5qp1k5R2j12KJ31
888A90O3Mj88L3O1L6m0m2k5J57j00j36J02J1nq6J4K9O5n0J36j13M4Pq3l7K3J3ll7K43j09j00
501G7m0RM1J09K5Rj63nO8r3J49m0r4oR0j0Q9q4o4K1M4m9MLQ1m9k3K1J35j53n8L6M4P9j23Q3
78A63j02R1p7J91J5j58R3j08K2J4p3J30k5p3L7Q2n6m8R7j07k9J9L5
$$ plain form
2801 141 83 101 195 247 124 126 241 156 109 98 57 221 101 153 82 98 147 241 64 202 242 126 109 142 102 61 412 187 249 149
2449 149 227 131 102 108 146 57 94 149 83 137 43 81 97 99 90 64 90 204 234 153 54 45 130 126 264 312 105 264 67 85 73 71 99 94 107 171
2027 171 241 128 203 132 42 82 146 211 182 140 65 73 101 286 343 246 311 321 37 127 299 244 30 317 402 255 155 133 12 123
1675 123 123 117 152 181 11 41 152 130 30 44 122 152 143 130 169 232 173 270 184 61 61 154 149 167 228 70 211 186 163 14 126 90 251
1287 251 103 54 168 212 117 122 97 4 37 69 182 174 74 186 233 223 95 147 120 137 144 137 204 286 145 86 181 173 102 77 169 57 59 190
888 190 253 257 69 102 163 199 159 117 92 249 149 13 115 126 121 35 49 78 143 93 229 116 160 167 84 47 70 83 80 43 286 177 77
501 77 37 46 87 196 221 230 67 62 130 37 186 146 52 46 136 126 215 131 67 88 132 83 87 90 171 122 99 120 255 102 44 80 124 203 80 163
78 163 61 152 75 266 281 123 216 108 130 144 71 201 176 103 140 222 166 118 215 108 79 98 133
-192A33
##PAGE=	F1=-910.985
##FIRST=	25164.767445380970457,	5806.2096540000038658,	0.21971191465854644775
##DATA TABLE=	(F2++(Y..Y)), PROFILE
5806A20o9N6N6r1Q5Jk0M4k0N6J8q2k1J3j29J15pp5N9j9l2J33Nk8n9k4M0L2K1Or9J78j79l0
5407E4J5J33j04n6O6l8k4N6m6Q7l0J12r3J44j84R0l2Q9j88J5k7O2J8J5Jk8KnJ28n5j13J82
5032B46j22R1j87M9R8k3n0J26j10N4Qq9JK7K0p1Q1K6j06l0P0Om4l3M9m8R0m6K16p8j49K7m9
4644E0J2K0NK2J66m1j49J8p1J00K2L6p7J07k4J23k11j9n4P0mK2O9j40M0%Q0j8Q4p4r3j9P4
4257A26K8K4j16l3R6o5J08o6R5O1L2p7j76J11lq3m3J31qn6P3m8q6R5J28p7r2J87r7Q5m1o2
3881A51N9O8j49m1P9P4p4m6J55j17Qn1o4%J36o1J5J8p2L6O6rn2q2M3m9L0L3rO7M9j63R0K8
3482A66l2jq7P4n8l8J18L5j54P9K6OJ4l9k3%O9J63j23P4k11J15K7m7K0R6k27J30K6n1p2K0
3107I5l4J17m1m3JK9nJ00q7l0O4k9LJ5j01J16o4m4J45J50k58N21M43j78n48j66r7N6M5P3j04
$$ plain form
5806 120 51 107 163 72 157 158 138 182 162 218 236 154 133 146 17 132 125 50 109 90 58 191 196 168 109 85 125 157 178 184 85 263 84 54
5407 54 69 202 98 42 108 70 46 102 56 143 113 225 132 276 92 182 150 239 51 66 39 101 119 134 135 107 109 104 232 177 64 246
5032 246 124 215 28 77 175 152 102 228 118 172 180 91 92 119 139 68 149 175 69 39 109 115 71 38 87 39 129 83 299 221 72 99 50
4644 50 62 82 87 109 275 234 85 103 32 132 154 190 113 220 196 319 108 89 35 105 101 123 192 52 92 92 172 154 238 164 71 52 126
4257 126 154 178 62 29 125 60 168 102 197 258 290 213 37 148 145 62 19 150 142 86 159 111 25 120 248 171 79 266 169 254 213 151
3881 151 210 278 129 88 167 241 167 121 276 159 167 116 52 52 188 127 142 160 88 124 190 181 129 47 90 41 71 104 95 162 211 48 138 166
3482 166 134 133 46 120 62 24 142 177 23 102 128 134 148 109 86 86 155 318 195 269 58 173 200 153 173 269 42 172 198 147 75 95
3107 95 61 178 137 94 95 124 119 219 132 102 166 137 140 155 54 170 106 62 207 357 99 620 1063 885 337 171 74 130 175 248 144
2743A44K0K8n7kl7p9J70j06J04l5o1L9J07j71J33P2j35j5N5j03j0L36k19M9j16P2l0Pj14J05
2391A51n1N8K3p2K9o1NOK1k7kN9Q2Kj17K0j5J1MJ28Q2k43J06j36O7j13O6m0J11r6J91L4j19
2003A64qp0k8JP6M8jm2q7KM2K00O9j30Q1J0l00J57J34o1k20K73J17j92j24N4r7M0J5mL7M4
1628B00j73RJ25m4p5M0N1K8l1j3J13M6j04Q0r3j09nJ00j2K5M8j78J98J2j01q8Q9p6J47j09
1276A00j0P0K9r1nkk1K0OP4or9J16M3l6p4K2m7J1N5j3L8R1j29n1Q1lq2J5K0r5O0N9P3K8j99
853D8Q9M3P1n9o0o3J84j12p6J1N0m4m0MP9J18o9K2p9K5lm4p4R0m0N4p9K43o4j82l9K5R9J34
454B62j7Qj45n9J17r5J26p4m5rN0m7J13p8q3M2P2m6Lm0Q0k1k2J6J17q9q8k0P7P8q3P0j12J26
55A84q9J77L6k15J56q9l8N2r2J06j4m3J3P6j5m4M5j03l0J4k2
$$ plain form
2743 144 164 192 135 133 96 17 187 81 185 150 89 128 235 64 197 269 134 119 174 71 61 397 178 227 111 183 153 160 46 151
2391 151 100 158 181 109 138 77 82 88 109 82 80 139 221 223 106 126 111 122 126 254 336 93 199 63 130 17 83 43 154 58 249 283 164
2003 164 156 86 58 59 135 183 182 140 53 55 97 297 366 236 317 327 27 184 318 257 37 310 427 235 111 165 68 108 123 119 156 200
1628 200 27 36 161 117 42 82 133 161 130 117 230 276 172 252 159 50 45 145 133 158 206 28 226 238 137 49 138 62 209 100
1276 100 90 160 189 98 93 91 70 90 96 170 164 65 181 224 188 114 136 89 100 155 142 180 271 142 91 172 169 87 102 122 27 87 146 219 247 48
853 48 137 180 251 192 132 69 253 141 65 76 126 82 42 46 125 243 174 196 117 142 139 95 21 111 71 125 46 289 225 43 4 29 128 262
454 262 245 253 108 49 166 71 197 123 78 69 119 72 185 107 24 66 138 92 95 55 135 114 92 108 225 136 48 28 105 183 100 170 58 184
55 184 95 272 308 93 249 160 122 174 82 188 174 131 144 220 205 161 206 103 73 87 65
-192F5
##PAGE=	F1=-1013.24
##FIRST=	25164.767445380970457,	5806.2096540000038658,	0
##DATA TABLE=	(F2++(Y..Y)), PROFILE
5806D2rQ9L3j07O8K5k6M0k0kM4k8l1P4j26J4P1r7N0l6m1J33l7K5k9Ok4N7J3K3j36J90j63j3
5407G2jR2k7o5R9j18j7O9j4P4p2P6j2Q1j44O2o6J07j22M1q4J27l0RL1j2N0j36J36q2n1J05
5032A78j05O3r3J7J14lp2Q1q1L7J3n3m0Q9k0q1P4N5j02j8L3N2j06j2Q0o4P2o0K29J3j84ll4
4644F9M0n5K9L0J33m4j69P2m6J12m4J7LN8l9Q8j96L8q4P3MJ0O8j29N4k5J11l0P5k8j27pJ6
4257G7L9M2j00j2Q4o8J16o6J08N4K9q7j82R3j9q0PJ17K2o2M6j01rL1J31k1j40J65pM7j04m0
3881A10J39M7k01QR0M9j01l0J55j50L3l5mn9J52p1k4J2rL4P8k9j14J4j9K2k0M1RK1P7j55O5
3494A35kl9M1r4J32n8o4Q9K4j00L2NL8L1q2J1n9J04J48q3K9j53J03K6l9l7J11j91J09M0o3
3130A44p1M4N3j11M7K5j7k5PR6o6m3O3l0J04j3j78J57o2j00J20J03j17K20K10k3k32j02j45
$$ plain form
5806 42 33 122 155 48 116 141 115 155 135 133 177 149 118 192 66 80 151 54 104 68 27 160 123 148 119 125 101 158 171 194 58 248 85 72
5407 72 71 163 136 71 170 52 35 104 90 164 92 168 156 237 93 155 89 196 74 115 31 158 128 137 168 156 206 70 206 124 73 178
5032 178 73 136 43 60 174 171 99 180 99 136 149 96 56 145 125 44 118 173 71 53 86 138 32 20 100 36 108 48 277 290 106 103 69
4644 69 109 54 83 113 246 202 33 105 59 171 127 144 147 205 166 254 58 96 12 85 89 99 167 38 92 67 178 148 223 195 68 61 77
4257 77 116 158 58 46 130 62 178 112 220 274 303 216 34 127 108 28 35 152 174 112 158 57 48 79 210 189 49 214 207 254 150 110
3881 110 249 296 95 103 193 242 141 111 266 116 149 114 110 51 203 132 108 120 111 145 223 194 80 94 75 97 77 118 127 148 225 70 135
3494 135 133 94 135 41 173 115 51 140 164 64 96 101 139 170 88 99 40 144 292 209 238 85 188 214 175 138 249 58 167 207 144
3130 144 73 117 170 59 106 131 114 89 96 192 126 83 146 116 220 207 29 186 124 24 144 247 130 350 560 537 305 203 58
2790E8Q5k8J09n7M3o0Kql2p1R8q8J61Jr7pJ05j30R1R5j45lP7j42L2K59k06L2j05N1M7M5j76
2402C6J20J2N9k8p2qj6Jj2K5l4J5R3L6k6j39J38l9l8J5P7J17k54N8o1Q7j41P9l6J45j69K50
2027B90%j22m7p0N3o4O6L0L8l4j07NL3K00Q3j43R8K1k81J72R7n3k28K40J42k15j53J30o8j5
1675I8L2J0kN3j33%J22n0n3O5rL0n6l1K15Mj34M5q2q0j2R5k1L0L6j55K00L5j39m7O4p3R5o5
1276H7L8K7L7j07j6M2J5J7j8M8k3r1J06M1o4j6nn1nR7k1J4J08j11p2P4Mp1M0m1m9J01m9O7
876A53P9j93J23L0J01r0p0o5J82j19l3o6Q9o4PJ8R9J36n5j15l4Kk0j2p9J35p3J05r3J96j4
513B60j95k0KJ12J46o2J9j31j01J77j01P2j05N2l8Qm8J08l6k9m3R3l1J4q7N2nlK1P4l2r8J7
125F2JJ06l0M4j15J41p9J33O3k65J95n5j03Q4n7K7Oj9rN1M1l2Mr7l7J9j1
$$ plain form
2790 58 143 115 224 167 210 150 152 144 112 41 139 51 212 213 116 109 214 84 175 270 125 122 199 57 89 348 142 174 69 120 167 212 36
2402 36 156 168 227 199 127 119 103 104 92 117 83 98 191 227 201 62 200 161 123 138 215 332 78 136 75 162 21 100 64 209 40 290
2027 290 290 168 121 51 104 40 106 136 174 140 33 38 71 271 354 211 309 330 49 221 318 265 37 277 419 204 51 181 113 98
1675 98 130 140 138 191 58 58 180 130 77 142 133 163 107 76 291 295 161 206 124 44 32 127 106 136 172 17 217 252 113 66 130 57 152 87
1276 87 125 152 189 82 66 108 123 140 122 170 147 56 162 203 139 123 118 67 62 159 138 152 260 149 77 151 155 84 124 83 34 135 86 153
876 153 232 39 162 192 293 203 133 68 250 131 98 32 121 57 64 82 181 317 262 147 113 115 95 83 4 139 66 171 78 274 260
513 260 65 45 47 159 305 243 262 131 30 207 106 178 73 125 87 95 47 155 119 90 47 140 109 123 36 88 83 80 101 175 143 45 62
125 62 63 169 139 183 68 209 130 263 326 61 256 201 98 182 125 152 158 139 130 181 222 190 194 97 60 79 68
-192F8
##PAGE=	F1=-1115.5
##FIRST=	25164.767445380970457,	5806.2096540000038658,	0
##DATA TABLE=	(F2++(Y..Y)), PROFILE
5806B9PR8rq8L3M1j3L9l4o2N2N8j6J01j21q2J28r1L3m8k4J09r4J03nmo0Q8k9M5j58J97j47
5419G6J2OL4L5l8Q9j75O8oJ3N5j10M0P4Pq2Ro4J07n7N4p0J25o0oN1J4R1k06Q4o5nL9r5L5L0
4996A09k0R4j7q5L9m7K5K2l5k8O7m8k5L7Q9j14KJ4P4j05K2M7p5N0J2J41R7k04l4j7N8o9K2
4609I8J7P7l0j48R5l2J01p7RO8On7M2r1M4r1O1j9jO5j24Q1j1R4m0P8Oj53J8m6P6M0j04L0N3
4198A35p5J15n3J01N1J5r7j62P0l1m4K1R4N4o1J3j31N1rQ3L2j22R3Q4J3j50j1J69L1k24N3
3834A08J08J9j30J2J21j64N2j8N7m5J03p7o0RM9nJ05m2j56R3q7R7n0L9J8l4J07j08kn1nO9
3459A32r5J77n7p4N8J7n1j8k9P0L5p7J5l7O7J09m4J0j05Q6L5k5j17J19j20O9N6q4n1O8J24
3095B63j48k1P3k5r7P8O1q2m0L9QJ77m4k19J75o1j18P1N3%l2QJ36J9m5j94J18j01J28J7N5
$$ plain form
5806 29 36 134 125 37 70 111 98 137 103 41 93 151 135 236 115 33 161 70 103 55 31 140 46 149 144 140 80 168 139 184 26 223 76
5419 76 88 94 128 163 125 214 39 107 101 114 169 59 99 173 180 98 107 43 150 93 147 77 202 142 136 187 201 292 86 170 105 100 139 44 79 109
4996 109 89 183 166 81 120 73 98 120 85 57 124 76 51 88 177 63 65 79 153 48 70 117 42 92 104 245 342 138 104 87 145 76 98
4609 98 115 192 162 14 109 77 178 101 110 178 184 127 169 78 122 31 92 73 72 137 13 94 83 177 137 215 221 68 86 40 116 156 52 82 135
4198 135 60 175 122 223 274 289 192 30 100 69 25 46 140 194 133 146 15 66 57 140 172 50 143 227 240 90 79 248 279 55 108
3834 108 216 235 105 117 238 74 126 108 165 120 223 146 86 95 144 139 244 202 46 139 52 149 99 138 156 122 229 121 119 68 63 132
3459 132 37 214 157 83 141 158 107 89 60 130 165 88 103 66 133 242 198 208 103 189 224 199 82 201 81 150 206 122 71 139 263
3095 263 115 94 167 142 45 123 184 102 62 101 109 286 242 23 198 137 19 90 143 143 111 119 255 274 229 35 153 52 180 197 252
2731B52j15M8m3j2n2Lo1K17K5j23m4Q9p7M3R2j51K3J05j41M1J59j79J0p7K0J12P4j54P5Q1
2379B40M7q4n5o9L7joK2k4RJ21rn8j14J99p3n4K9rJ51k25RPP8j36Q8L2J06k01K28l4r6l4p7
1980D4R9j03K4J7P9k4r8j3J0J87R4j32J10L3k55J56P2m1k29J96J55k13j56J68m8l8M5K0n6
1639A03N2q0J7J07m7n3P3m8L6p5n0L02m9j47ll2n9k5Q5l0L0K3q6J30M9j39j7L6k0J5l5Q6m
1252A45N9j39NO4K4Pl2L9n4n8P4M2q3L0k6m6k2J22k9J1J32j06j17P6J7m5M8n6J1J03j15RJ36
865B26j84J37K4J19j24p8k7J50j20j7q0Q6n8L2M1J01J24k0k33Mj9m1K0m6J35p2J28q7J27L1
513B79j89%j6R3J49r7L7j24r2K07j20Oj00J35q0k1L4K3K1jq2P5jK6p3k2l2M1L0RRp0Q0j24
114A0J53K6J1j05J22m9P1Q4k93K02j3j29Q9k0n6K2%k3J1R7mj7q9m4K9M0
$$ plain form
2731 252 137 185 142 130 78 81 20 237 262 139 95 184 107 150 242 91 114 219 78 119 278 99 109 32 52 164 238 84 159 240
2379 240 287 203 148 79 116 115 109 131 107 116 237 228 170 56 255 182 128 157 148 299 74 83 90 168 32 120 152 258 57 285 251 155 121 44
1980 44 143 40 64 81 160 136 38 25 35 222 316 184 294 327 72 228 300 259 30 226 381 168 12 180 132 94 139 159 103
1639 103 155 75 92 199 152 99 172 124 160 85 35 337 288 141 138 106 47 22 107 77 107 130 44 174 223 84 67 103 83 98 63 149 145
1252 145 204 65 70 134 158 165 133 172 118 60 134 176 93 123 97 51 29 151 122 133 265 159 42 118 135 90 138 82 93 196 81 90 226
865 226 42 179 203 322 198 120 93 243 123 106 26 112 54 86 127 228 352 332 99 103 84 43 63 17 152 80 208 121 248 279
513 279 90 90 74 167 316 219 256 132 40 247 127 133 33 168 88 67 101 124 145 144 62 137 136 162 89 67 35 76 106 115 124 54 134 10
114 10 163 189 200 95 217 168 239 323 30 232 219 90 179 159 103 125 125 102 113 210 206 189 100 56 85 125
-192A25
##PAGE=	F1=-1217.76
##FIRST=	25164.767445380970457,	5806.2096540000038658,	0
##DATA TABLE=	(F2++(Y..Y)), PROFILE
5806G5l8R8n7lm5M4J1N2o5J4n8J18LJ27j17j50J51o5J2n2l0J23j00J16Jl4o2J08p7N5j19J55
5431A91j33N0PJ4N4k9P6j85J13o9L6M0j36K0J25n7ml7m0O4OM8l0R7o8k1N2M7J19k30J0J8p
5043A41rp6L3Q4m0P0o7p7J5l0K8K5l2lKj3J3J1J04j18j3J8Q6p5K9L2j00N3O3P0J46k08o2j
4644I9O3o6K3P%ro4M9rO2p0J6R9l6p2jM0K2p0M5o3J9M3r6Q1LN1m1Q0K5j58L5o5Q9L0j17O8
4210A12K8r0J11l1P0N1kr8j26M6nJ4l4O8P8m4k0r1O1K6n7O1k6j4J41k0j49J2J38K9k07O9J25
3823B26j2j44N9O7j46N3KQ9l9P6o4r4J0Q4n4J43n7j41J20j48J52n8L3J3q7J35n9o3m8O2J3
3459A23r3K06n3o7K4J9k4m5m6O7K1k3MK1k1O9rRp3O4N9pj73R8n1L0O8j09J8N8J53j07j11Q8
3060A87k1j47J61Lj21k0J0P4J97o3k16J65o5j10N9M1Rp8J30m0Q7kk32J62n9J6J02N2j30N4
$$ plain form
5806 75 37 135 78 75 30 74 85 137 72 86 28 146 149 276 159 9 160 95 107 55 25 148 48 164 165 131 69 177 100 155 36 191
5431 191 58 108 115 129 183 154 230 45 158 89 125 165 29 49 174 117 113 76 36 100 106 154 124 221 153 132 184 231 350 120 130 148 141
5043 141 132 56 89 173 133 203 136 59 74 44 72 97 65 62 64 51 64 75 179 61 48 66 152 77 106 138 38 91 154 224 370 162 100 99
4644 99 162 96 119 126 126 117 53 102 93 155 85 101 200 164 92 91 131 153 83 128 65 84 127 31 112 115 166 125 205 230 72 107 42 131 161 44 112
4210 112 140 50 161 130 200 251 249 151 25 71 66 80 46 114 192 148 128 37 98 124 67 128 102 88 229 209 60 72 210 239 32 101 226
3823 226 214 70 129 196 50 103 105 194 155 231 167 73 83 167 113 256 199 58 178 30 182 124 157 170 83 218 159 96 48 110 123
3459 123 30 236 183 116 140 159 135 90 44 111 132 109 113 134 113 182 173 182 109 173 232 225 52 150 99 129 197 88 106 164 317 210 99 187
3060 187 166 19 180 183 62 42 52 126 323 260 44 209 144 34 93 134 143 65 195 155 242 240 8 170 111 127 229 281 151 205
2708B05p7Nk7o5l2K50L1j48n5O3k5J9M5j54O4J31j23K9O4j05J2r4L8R1Q5j09M2J36K6j30n
2344A87j51Q1j4K4K8rj7J37l5r6n6J96j00n0M7j06J79j45m8N3M5j01R9Q5O4j99J38o4qj8r6
1980E0J16j07k1jJ02j5o5l9pJ59R5j01J11M0k24J13O3l7k12J50J51j90o5J09n4l5N4J9r8L6
1628I7k4M8R0l9p4O4m9L9p6pK89r9j43n0N6o2m1O6l6L0Rl5M7O2j19L3j0M3k7m6J18j7P9j70
1229D6N4N6J3j0l7L9q3NK2N3q5M9m6m1J6P6l3L0J57j16j52O5L7j3L9l0M1J03j02m5J26j89
853D5J44K8J22j53q6K8J07j25j3m4N4l9L6O0R2R2K5l03J8k9m6M2k8J24n3J25o3N4O6j87L0
489A23l1O1J43j12N8j28l5J94j48n2K1J00j28j8J14o6O3J4p1L1K7L6m1m9p3O7J8n2K2j1J17
125A94j35J02P3j3q9P4qOR5k63J45L0q7O4k5j07K3J7k2m3J40L9j7p0m4K8O1
$$ plain form
2708 205 128 133 106 41 9 259 290 142 87 150 125 144 189 35 99 230 107 136 200 95 107 13 51 142 227 118 160 296 322 192 187
2344 187 36 117 103 127 155 146 129 266 231 135 79 275 175 125 172 66 245 100 52 105 150 49 148 233 297 98 236 172 164 146 50
1980 50 166 59 38 37 139 124 59 20 13 172 267 166 277 317 93 206 269 232 20 170 321 131 66 175 121 86 140 159 61 97
1628 97 73 121 211 172 98 162 113 152 76 69 358 259 116 66 122 60 19 85 49 79 88 53 100 162 43 76 66 109 82 36 154 137 216 46
1229 46 100 156 169 159 122 161 78 83 105 158 73 122 76 35 51 127 94 124 281 165 13 78 115 102 141 111 152 255 153 108 234 45
853 45 189 217 339 186 100 128 235 110 97 53 107 68 104 164 256 348 373 70 88 59 13 55 27 151 98 223 160 214 280 93 123
489 123 92 153 296 184 242 114 79 273 125 73 94 194 66 48 162 96 159 173 102 133 160 196 155 106 33 100 118 66 88 77 194
125 194 59 161 234 221 132 206 198 204 299 36 181 211 124 188 163 56 79 96 74 31 171 210 193 123 79 107 168
-192A68
##PAGE=	F1=-1320.02
##FIRST=	25164.767445380970457,	5806.2096540000038658,	0
##DATA TABLE=	(F2++(Y..Y)), PROFILE
5806A00n0P0r2R5j20K9L7Q5j00J24o7J3J4J70j14j79J40l5kn4n2J63o7O7Jo9m1J06p8J7m1
5442G0Q4j13R2pL5L3m6O8j52J20j15N0L3j26L5R4r4P7k0p1LN8K6K5N4n9k5K9Q6J29k28m9J09
5055B05j7l6o9M1J04o0N7j28m3J6m9M2J6l6PJQ6n4JQ5q4p4K6J00m8L5L7j00N1N7N9J45j95
4668A78r1J9N6o5M4J2r2J1RjK3J0l1K1J02n1q4j9J21J0m1L0r8O7J5q7P6%Ml4O1M2j34L6m9
4257G0P1K0j27R4J6j10J08nJ6N2j0q1q5J7M5M1q8M4Q4j4m6l6O8N6j09j1P5m8J09m9j08K1O7
3870A47M4j48M2J34m5j27R1Nq4J8K3R5m0O2k9j18OJ02r5J81q0r1J15j84J66m8L0j0j33J63
3517A92k0r2L2P1p7q6K15m3m7rK9k6l2j5jmN1NM3j09M2K6J7n5L9R1J0j48K9k3OP0j12J02J3
3107A84J38o8j53Q2lj12J63n2j50OL6Q9J68o7k00J58p2j14J14O1o3K3J91j64J3K3k06J71L
$$ plain form
5806 100 50 120 28 123 3 32 69 154 54 178 111 124 138 308 194 15 155 120 118 64 12 175 108 175 176 107 66 172 94 111 70
5442 70 154 41 133 126 161 194 148 216 64 184 69 119 152 26 61 155 61 138 118 47 50 108 134 159 213 154 129 158 244 373 145 96 205
5055 205 188 152 83 124 228 168 225 97 54 70 21 63 79 43 50 51 137 83 84 169 85 11 37 137 89 124 161 61 112 169 228 373 178
4668 178 87 106 162 97 141 153 61 72 81 80 103 113 82 103 205 154 70 51 172 182 141 171 73 140 155 68 144 144 148 114 175 217 83 119 70
4257 70 141 161 34 128 144 34 142 137 153 205 195 114 29 46 91 132 44 88 172 158 112 76 144 200 91 80 155 107 216 167 59 80 147
3870 147 191 43 85 219 174 47 138 143 59 77 100 195 155 217 188 70 76 178 83 264 184 93 208 24 190 142 172 162 29 192
3517 192 172 80 112 183 106 20 235 192 145 136 165 139 107 92 91 87 138 143 186 77 119 145 162 107 146 237 247 99 128 105 111 181 69 171 184
3107 184 322 254 101 183 180 68 231 179 29 35 71 160 328 261 61 219 147 33 147 208 145 168 359 195 208 231 25 196 199
2766A99j22J78L6j23K6r0PQm4m8K49J9j68l9L0J3K7l4r3N1J47j04J6j0NN5j41O8pP2n6L6J60
2379C23Jj53P0j83N6m5O7M1Mm6J35l5j32oJ58j02m7O9j44J54m3q9O7Nl6Q8J08L4j63Jq4J44
2003B17m2j26J21r2j0k4P3j3l4n0NJ05Q6n5R8L7j86N7O1m4j71J04J33j49JP7q7k3N4J6j03
1639C6oK4Q7O9k6j08M0oL1n8L4K29j30j30j8Q0p3n7M6m5M3j0Jl4P8o0P0p1Q4no9Q6mQ5j86
1229B7J03L4ok8l9M0r6Q0k9P3q1N2p0l8P9ol1M5J79j22j01k9O1J7J6J0N7J01p8n2Q0k08J53
841A93M6J04j69q9P8O7j35Ol4M6k6K5P1P7N5O9l08ml0qL1l5J14l4J01k6qQ9j92O7m7L1J27
454B52j00P0j35L2J55j77p6J33M0j71L8J43j33Q4J9k9j2L7L9mm6o7N3j9p2OL3J35j17M2J08
90B61k4o8K1K3n0J00j96M5O4rM6q0r3L8qnk0O6Q9lm3l9K0M8
$$ plain form
2766 199 77 255 291 168 194 104 111 119 75 27 276 295 127 88 118 131 158 124 31 82 229 125 141 131 136 191 50 118 111 183 127 163 323
2379 323 324 171 241 58 114 69 136 177 181 135 270 235 103 97 255 153 106 175 31 185 142 53 120 125 89 177 285 319 156 157 73 217
2003 217 175 49 170 78 68 44 117 104 70 20 25 130 216 161 259 296 110 167 228 184 13 117 250 101 102 179 92 69 123 139 36
1639 36 30 54 141 210 184 76 116 110 141 83 117 346 216 86 68 148 75 18 64 19 62 52 53 19 97 37 107 36 120 115 46 132 128 213 27
1229 27 130 164 158 130 91 131 35 115 86 159 78 130 60 22 101 95 64 109 288 166 65 36 97 114 130 140 197 298 220 168 248 40 193
841 193 239 343 174 85 163 230 95 101 67 113 87 112 183 260 315 384 76 72 42 34 65 30 144 110 211 185 177 266 74 141 94 125 252
454 252 152 222 87 119 274 97 21 154 194 23 61 204 71 155 174 145 133 170 209 205 159 92 145 126 54 60 93 228 111 153 261
90 261 237 169 190 213 163 263 67 112 176 167 213 133 40 78 70 65 45 111 200 197 154 115 135 183
-192A83
##PAGE=	F1=-1422.27
##FIRST=	25164.767445380970457,	5806.2096540000038658,	0
##DATA TABLE=	(F2++(Y..Y)), PROFILE
5806A10k1Mn6J22j37rL7J29j21J91n9r3MK26j13j66J09j9mn5m2J60m4K1Oj00j3P8j2o4L2J3
5431A14n8J05k5O3mq3O2r1J07j50N6L1r9O0L1q5J32J4j27m4Q6JP9Qm1j4j3J25J23k06p0J59
5055B46j7m5p1K8J27p9M8j49j6J0n7L8Jl8J0R7R8j13k1M5j2n7l5P4k8M3N8n1J6nJ03J09j68
4668A89j27M8M1p0P7L1j82K8O3n3N6l9K1J8Q8k9q9pJ27J6j5K0j20J14Kj10P9j2l4l3K0P2q7
4280A03K3k9M8Nj10Q6J6j12J03J3n4N0jl0p0j0P8O1j21M1N8J2o2J4P7O3r5r6J28l3M0p5p8
3893D3M2kO4r2J6J26p9q1J02n2j0l0L9Q9m2M7J8j18j4J14j15J99j05l1J03k09J54k7L4m0j01
3529D2J15lp6P6Q8j60p1K05l5j9k8M0n3J3J2o4j8J04J2K5j66J3P6K1m8J3J20K3j11pl7kO0
3142A60o5J40m6R7m4j53O5K8o3J38q0j13k0P8P5J10o3j73J53p7j20J76P2j12N2J83j98k9L8
$$ plain form
5806 110 89 93 37 159 22 13 50 179 58 249 190 97 101 327 214 48 157 138 134 79 37 197 153 174 180 80 67 145 133 69 101 114
5431 114 56 161 136 199 195 112 174 83 190 40 96 127 28 88 119 34 166 180 53 9 95 96 175 183 142 128 115 240 363 157 87 246
5055 246 229 184 113 141 268 189 237 88 72 82 25 63 64 26 36 133 231 118 97 142 130 73 38 112 84 127 185 134 150 145 248 357 189
4668 189 62 110 151 81 158 189 7 35 98 45 101 62 83 101 189 160 71 64 191 207 192 212 92 206 208 98 177 165 131 98 118 190 103
4280 103 126 97 145 150 40 126 142 30 133 146 92 142 141 111 41 31 109 170 49 90 148 160 98 112 189 252 157 61 189 156 196 121 43
3893 43 85 83 147 55 71 197 118 37 139 87 77 47 86 175 133 180 198 80 66 180 65 264 159 128 231 22 176 149 183 143 42
3529 42 157 154 78 154 242 82 11 216 181 162 134 174 121 134 146 82 64 168 180 205 39 52 128 149 101 114 234 257 146 139 102 100 160
3142 160 95 235 189 286 242 89 154 182 119 257 177 64 44 122 197 307 244 71 224 147 27 203 275 163 215 398 200 171 209
2801B09j45J55L7k13K22J8j10k5p6j1N6Qq5K46rj73mpL2N0j07J7j9J45q6J3n3R4J02j86Q4
2438A79p3J2j1O7J38k1j44J48j90Rq3J07M8Po4J18j0j57K6R1n5p5R7p5M3N0j06N6j6J7N9J06
2062B98J8r9j34j7K20r2j55J20p0Ol3L8k0j0m7jP0O8OP6J9j43J0N7o8j08O8J06r6K7P7j11
1686H0l4M5J8m3j2jJ02M0qj47J6O1J2l8N3J61j34j13Q1K7p4q7N5m6M4l2M3J7K0kM3j07P5L7
1287A52o9%L5P5j77J35Pk8l4m0L3n4J03m9Q3r2O4r1j2J04o9l0L8J89j10n6r0O7M2k3N7O0R4
900C14o0m7M7k29J65P5O9j70p9J08L7j33M3p2O3k6lQ4N4K9J01k70l8j6j5M6m3J08k2N4J8n7
524A35J04j98J04o1J2J03p0P2j40Q6J04j96j6J40oj13L4J24j63P9J4K9l9K6L0K9k5n3M4o3
172A26o3K4jJ48r1oJ23k1m4qK2q7J03j34n4Q7O8M1j55j8R5r5J8K1n8J28K2j3k9PJ6
$$ plain form
2801 209 64 219 256 43 265 283 173 148 72 61 117 125 40 286 277 104 100 93 125 175 68 85 66 211 125 138 85 179 281 95 179
2438 179 106 118 107 174 312 291 147 295 105 114 31 138 186 193 129 247 237 80 106 197 142 67 164 89 132 182 76 132 116 133 192 298
2062 298 316 217 83 66 286 194 39 159 89 95 62 100 80 70 23 22 92 160 166 242 261 118 128 185 117 9 77 183 87 114 191 80
1686 80 46 91 109 66 54 53 155 195 187 40 56 117 129 91 144 305 171 58 139 166 92 5 60 14 58 26 69 86 106 104 147 40 115 152
1287 152 83 83 118 193 16 151 158 130 96 56 89 35 138 89 172 80 144 53 41 145 76 46 84 273 163 107 17 84 126 103 160 220 314
900 314 254 207 254 25 190 265 334 164 85 193 230 97 140 68 131 105 102 186 240 269 370 100 62 46 31 77 34 142 120 174 192 135
524 135 239 41 145 84 96 199 129 201 61 147 251 55 39 179 173 60 94 218 55 134 148 177 138 164 194 223 198 145 189 126
172 126 63 87 86 234 143 137 260 239 195 187 209 122 225 91 37 124 192 233 78 60 155 60 78 99 41 169 191 178 149 156 172
-192A72
##PAGE=	F1=-1524.53
##FIRST=	25164.767445380970457,	5806.2096540000038658,	0
##DATA TABLE=	(F2++(Y..Y)), PROFILE
5806A14K3o8LJ03j33LpJ64j33K22m9j46m8K83j13j23O7k2J2o0k9J34k1j6K3j20NK7Q0j24P4
5442A25n3J5R8k7P7n5j18N4j7Q6j72M6K4o6Q7k9j9J35K8j63mJ8J2R0l3k1Qn6J52J08j72n1
5067A07J54j0m3p2%J53r3L3j03l2k0l4L0j9l9M3J46R9j40n8JP7k7o1lj3M9P9K2l4j04J79N9
4679C26j29j62Q3J8p4J05N9j97j8R2q6P0o9O0J1O5K5q0kR2L4KK3j39J51Nj50R0k9n8l5m6J37
4292A74m4Lj3K8j7o3L6K9q4R4J7j14K7L3L4q2k5P4Q2j30O5J5J2o4N4Q0M2o4j28J22oqr9n7
3893B3O5l3N8n0%R9j02l1J06r9N5o8L8Q6l3J0O4r1m2J21j04J75j13K4R1k32J30nN3m7k5jj2
3506A10k8P5J17k22l3J64l1J0k6N1r2O7K1j00%J13Qj8j21k9R4J1m8KJ23L0p9j6n5nM1jJ42
3118B75r6N5m5j23M3O6j9R5o5p6n6J00P0M4n4j33J42p9j01K01O6j19M1J28j91l6M9p3J23L6
$$ plain form
5806 114 137 69 72 175 42 45 38 202 69 291 242 96 48 331 218 95 162 140 152 92 63 197 176 160 183 63 68 95 175 51 125
5442 125 72 87 185 158 235 180 62 116 99 185 13 59 83 17 104 75 56 191 219 56 52 70 82 172 139 118 126 70 222 330 158 107
5067 107 261 251 208 136 136 289 196 229 126 94 74 40 70 51 12 55 201 300 160 102 103 180 153 92 89 76 125 204 226 192 88 267 326
4679 326 197 35 118 136 62 167 226 29 11 103 17 87 18 78 89 154 179 99 97 189 223 225 248 109 260 265 115 205 176 118 83 37 174
4292 174 130 133 120 148 131 68 104 133 49 143 160 46 73 106 140 58 33 107 189 59 124 139 151 87 141 221 263 199 71 193 187 179 80 23
3893 23 88 55 113 63 63 162 60 29 135 36 91 23 61 147 114 124 188 97 55 176 72 247 134 158 249 17 147 142 195 148 123 122 110
3506 110 82 157 274 52 19 183 152 162 136 187 95 162 183 83 83 196 204 186 65 36 130 141 93 95 218 248 169 153 98 93 134 133 275
3118 275 179 234 189 66 109 175 156 251 186 110 54 154 224 268 214 81 223 144 43 244 310 191 232 360 169 133 182 109 232 268
2766B68k35K21Nr2r0l6l2Q8O4j03K23l9j55L2m1K9P0j29O2n3J18o6K4p1J42J45k11Q7p2j05
2414D8J0J36O7k9j04K03j95k0p4R2L9Ko5R2L2j61M0PL6j41J25k2k7J16r9L1lK6K3Q7J7k5j77
2027H7O4J89j39j68J11n6Ql6L4l6K0m2l3M1N6Q0M7j4r9JL5j06l4N6O5l1J2Q3q9o5J4M3OJ8
1628A22k1O6jJ6j63M9N7rk3M7J00j08q9J56k6o0q8O0l3Ll5Q5N1QJ1Pj22L7P3n5j05J00M6j26
1229C0J33k2m7ll4LPP1l7P9j09Q8r7J5R6q3m4K0J71p5l6r3N2N0o5J00N0P7m9l2L0k41J76J07
829B88K6j62n2J15K2j10O3j25R2l0n1R7L2K2J14k19n7K7q5P9m0J03j0k0O3r1J17j89J21p1
477F9J5O6l3O2j35J14O4j62%R9Jk0j3P2j51N9nQ6m1KKM6J6l0L7j07m7Q4j00J68p0l0J12j0
78B20j8lj3j02J10r2o6M3J12L9k11O2J58j82M2K3r3R4M7J7j3j3j6
$$ plain form
2766 268 33 254 259 167 77 41 9 97 161 58 281 242 87 119 78 107 177 48 110 57 175 109 133 62 204 349 138 225 153 48
2414 48 58 194 261 232 128 331 136 116 42 134 173 175 110 202 234 73 113 120 156 15 140 118 91 207 108 139 136 162 185 272 289 264 87
2027 87 151 340 201 33 144 88 96 60 94 58 78 36 3 44 100 180 227 213 114 115 150 44 10 66 131 100 112 195 106 41 55 98 104 122
1628 122 101 167 166 182 19 68 125 116 93 140 240 132 43 199 173 113 25 85 52 55 20 105 156 164 175 182 60 97 170 115 10 110 156 30
1229 30 163 141 94 91 57 60 67 138 101 180 71 159 62 77 173 90 46 66 237 162 126 33 85 135 70 170 220 297 248 216 246 5 181 288
829 288 314 152 100 215 237 127 190 65 157 127 76 173 205 227 341 122 65 92 7 86 46 149 139 119 182 91 208 19 140 69
477 69 84 150 117 179 44 158 222 60 60 159 160 140 127 199 48 107 102 188 147 149 151 197 213 183 220 113 66 150 50 218 148 118 230 220
78 220 202 199 186 84 194 102 36 79 191 230 19 81 239 57 99 122 29 123 170 187 174 161 145
-192A45
##PAGE=	F1=-1626.79
##FIRST=	25164.767445380970457,	5806.2096540000038658,	0
##DATA TABLE=	(F2++(Y..Y)), PROFILE
5806A14O6j06J6P8j10Qj9J65j39K29m2j28j04K90j14o1J6l6M6p1k6J00Nl7M6j20Pm2J64j38
5454E7Q5j09P5Q9kP4j18j08K1N0O6j30l6J2QQ6p9N7J14J1j57L2l6O4K9o3qL5o3J38R0j30j9
5067A35J13%l8p0k7J74r5Nl1n6o6NL5m3j6O2J43R7j36r3k4J52Jq3o4MM6Q5R6q5k06K54J6q8
4668B02j55Q6j0n9J00R2k06l7Q7n5L6l9K2KL7J01n6j0L1N9LM3j57J71K2j93J07n1p1j9k3J30
4292A90l1j6mJ5m7jl7M6m4R2J7j17m9Q6P5j00l5N3J04j28Q9j0j9n3Q0P6Kk8j30R0K3j4j24
3905E1L5J2k4J4j5rN4n3k2R2j02O6n5j5Q9No6R8m2o0J14o3J06r3O1Q4k25Q4JQ9j6J2j01m9
3506E7L3L3J52k32j0J08l8M3oO2j13R4J5j17K1J17j1o7j8oL8k0n2J3R0L1m7j6n5j6K6M7J18
3118B74j00L8p7r1J9J00PM5ko7q5R6P7j0m9q0J19p7o7J94M8j02K5O2j54m5O5mP0Qj84J71%
$$ plain form
5806 114 180 74 90 168 58 66 47 212 73 302 260 132 28 318 204 143 159 123 169 98 72 172 177 140 186 66 73 31 195 57
5454 57 142 33 108 197 195 269 151 43 64 114 180 50 14 26 34 120 41 98 212 223 66 98 62 126 155 92 84 119 56 194 284 154 135
5067 135 248 248 210 140 113 287 192 197 166 110 44 49 84 41 25 87 230 327 191 98 74 226 227 144 80 84 130 215 311 226 20 274 290 202
4668 202 47 133 123 64 164 256 50 13 100 45 81 42 64 66 103 204 148 138 169 228 231 274 117 288 310 117 224 173 102 83 60 190
4292 190 159 143 139 154 107 106 69 115 71 163 180 63 14 100 175 75 40 93 197 69 158 148 129 76 156 232 234 206 76 166 189 175 51
3905 51 86 98 74 88 73 64 118 65 43 135 33 99 44 29 118 123 57 155 113 53 167 104 210 117 178 262 37 121 122 211 195 207 106 57
3506 57 90 123 275 43 33 141 103 146 140 202 89 183 198 81 102 219 208 141 123 117 155 135 83 96 186 217 170 154 99 83 109 156 274
3118 274 174 212 135 44 63 163 170 215 213 146 61 157 234 224 175 95 214 137 70 264 312 210 235 297 143 98 163 159 229 237 53 224 224
2731B24o9j01j6M6k1J13q7J70o3j11N5o6QP3j04M5m3O9l4M2q5J62J78k11P8l4k08MJ95l4j4
2367A61m2K17j93k3n2O1Rj0n1P6P1j44M0n7J15j39P3qm2J50p0LK1Jj3O4K7M2j48O7J53j62
1992A97j53R1o0ml2O7n8N6m9j2k5N8J22K1o2n6K6Lj02qN9J9L4j2O0m3p8j6P6ON3j5J1m7M0
1581A67j17P5kk0j7K3N4n4o7J90n5l2p8M5k4m1j4J06N6OK9k3j31JQ7l2n4K7Jn4J16m6n1N3
1182A24l7j2J3K3lO4j03J02q6K8O8o5o7K9J14k8m6q3O7L7o9R9L3M7l9j0J7j87J34J35j7j50
806A32j4J09K1q3O0j58J17k8j16J09J6L2J07j67n4Q3j01K9l0R5J1r8Q8j06J31j42R0p0L3K0
454A16oM2j17J16O5r9n5L8R0K6o5Jj00L6l6J19j5k0m3L3P5KK9j41mJ36k00J77p2k5Q3pQJ9
55B06n9r1J08o5nrQ3L1j46M2K05k57Q0rk9MM9M3Nl8l4
$$ plain form
2731 224 155 54 38 84 63 176 89 259 196 85 140 74 82 155 51 96 53 122 88 130 45 207 385 174 252 218 10 14 209 175 161
2367 161 119 336 143 120 68 129 138 128 77 153 224 80 120 63 178 39 112 104 62 212 142 145 166 167 154 218 245 287 139 206 359 197
1992 197 44 135 75 71 39 106 48 104 55 43 18 76 198 219 157 101 127 130 28 20 79 98 132 120 180 137 59 43 119 125 178 163 174 127 167
1581 167 50 125 123 103 86 109 163 109 42 232 177 145 67 112 88 47 33 139 195 201 230 207 76 77 164 132 78 105 106 52 168 122 71 124
1182 124 87 75 88 111 108 172 69 171 85 113 181 116 49 78 192 164 118 35 102 139 70 169 202 249 210 200 217 30 164 299 282 132
806 132 118 227 248 165 225 67 184 156 40 149 165 197 304 137 83 166 65 94 64 159 170 72 160 54 185 43 133 63 96 116
454 116 110 152 35 151 216 117 62 100 190 216 151 152 52 88 52 171 156 136 93 126 201 203 232 91 87 223 23 200 128 103 186 179 187 206
55 206 147 56 164 99 94 85 168 199 53 95 300 43 123 114 85 89 138 181 186 148 114
-192A14
##PAGE=	F1=-1729.05
##FIRST=	25164.767445380970457,	5806.2096540000038658,	0
##DATA TABLE=	(F2++(Y..Y)), PROFILE
5806A01J09j09j1N4p8LmJ42j39K16l9p1j02K17j16Ml8m4Q4q4l4O6L1l9P0j09Nm4J47j19Q6
5442A55j43R8Q8L9O1j78m9pO7N0q7o3K1K3O0j03J11Q5l5j01M8k7P3n7p7%N6m0Q8Q0q4KN5Q
5043B17l0o9l4J75q2l5M3o8j11M4N1o6K3N1J06R5j09j13j5J89K2j04r6K6M2O2J52j24j81K09
4691B70j9m8j21P4m1k7O0J30k18m0P3j9L4k7l1j4J3J79k4k5m0Q2j4P8j76J70N0k23J26p9p6
4327G7K0M9Q0m1l3KJ0q1N9q8L5oR5K0j07n9P9R2j12n0M9J22j32R3j6n8l6R3O4m4J0j17M9N0
3928A68K0j43J14m7k0j2Kj4ON4m2O1p9M0k2p9Q1N8j16Q1Ln0R1JPn4P4Q3j93L8j9J33L0K8j57
3517A26n6L7m3J89j84k8N9n9P9K1P3j04Q8qj15L3J32l8r1O1K8mo8o0L1M4K5jk5m3l4K4O4Q0
3118B33l5N0j13r5pJ13J3NQ5q0r5O0Q8l6n1k2Q4o9m0J73K6q0J5J6r5o9Q5M7Ol4q1R0km2j0
$$ plain form
5806 101 210 101 90 144 66 69 65 207 68 284 245 174 72 289 173 177 139 95 179 95 61 127 158 119 189 80 85 41 188 69 155
5442 155 12 110 198 237 298 120 71 64 131 181 94 31 52 75 135 32 143 228 193 92 140 113 186 129 52 52 108 68 156 236 152 154 209 217
5043 217 187 118 84 259 177 142 185 117 6 50 101 35 58 109 215 310 201 88 73 262 284 180 84 110 152 214 366 242 61 270
4691 270 251 203 82 156 115 88 148 278 60 20 93 74 108 81 50 36 49 228 204 179 139 221 207 285 109 279 329 106 232 153 77
4327 77 97 146 226 185 152 154 164 83 142 54 89 83 178 198 91 32 111 203 91 41 90 212 80 173 157 99 63 156 220 176 186 69 118 168
3928 168 188 45 159 112 92 80 82 68 74 128 86 147 68 108 86 7 88 146 30 111 114 64 155 156 163 109 183 266 73 111 92 225 255 283 126
3517 126 70 107 64 253 69 41 100 41 120 141 214 110 198 190 75 108 240 202 111 172 200 196 128 68 99 143 168 167 142 99 65 89 153 233
3118 233 198 248 135 40 33 146 159 164 249 169 74 134 222 186 135 113 197 128 88 261 287 207 222 238 143 74 159 206 212 178 97 187 185 143 133
2708A33o5Q3j13J30l7Q7p7n2P1p9k7N6o4J1%MJ1N2j02J69J97j91N8J5k20M2J20j39K7J3J95
2344C08j79om4M5k7l1l4R5P9j10L2l7R5j00J6l8oJ38k3j4L1l7m1M1M1R1j12M7J18j57j18O9
1968A32q0rl4J25q1Q2o2J7j5O1Q5kr5l2M9j7n2m4O2j3R0j6nPp7j0Q2k5R5jm9q2N3o3Q8n5j5
1534I4j5j1K1J4o7J99n1%p0Poo8NJ08L8jO1l8j28j7O0jL8o6n7K8R0o0l2R0n5qKl6L1N0m3P3
1088A79o6K7L8m7p7N0N5J7r1o4J11Nk1M1J9Ql2J6%j07P7J52n0j39L2R3K9o7M4j59J31k2j51
700C1Q4K5M2Q1j23k8J37j13l3k7Q5L8j30O8p6J21j20O5m8M5k6MJ4r2J10J11p6j14l6K27K7
337B73j10p1l0K6l9Q1L2k7q5k5J37M5K4j63P8J50j97J02j10J0M5k0K6L9r1m5P3l7M4j2J2R
-39A44n0QK19k99J29n8L2oj4O1J9o8k6
$$ plain form
2708 133 68 151 38 168 131 218 141 89 160 81 54 110 46 57 57 61 72 124 22 191 388 197 255 270 50 92 212 73 100 113 308
2344 308 129 123 79 124 97 66 32 127 206 96 128 91 186 86 102 64 58 196 173 159 190 153 112 153 194 285 173 220 338 181 63 132
1968 132 52 43 9 134 53 135 73 90 75 136 221 219 124 92 141 124 72 28 90 77 167 151 146 153 76 66 148 123 218 217 168 86 139 76 164 109 94
1534 94 79 68 89 103 36 235 184 184 114 121 115 47 52 160 198 197 258 220 92 75 135 134 172 106 49 77 167 107 75 165 110 102 104 68 99 149 106 179
1088 179 113 140 178 131 54 104 159 176 85 21 132 137 116 157 176 184 152 168 168 61 138 290 240 101 133 226 255 188 232 73 204 182 31
700 31 115 140 182 263 140 112 249 136 103 76 161 199 69 137 61 182 62 127 79 124 98 102 116 24 134 245 169 55 19 246 273
337 273 163 92 62 88 49 130 162 135 50 25 162 207 231 68 146 296 99 201 91 101 146 126 152 191 100 55 128 91 135 123 135 144
-39 144 94 102 321 22 151 93 125 119 105 166 185 117 91
-192I1
##PAGE=	F1=-1831.31
##FIRST=	25164.767445380970457,	5806.2096540000038658,	0
##DATA TABLE=	(F2++(Y..Y)), PROFILE
5806F7J58r8m9L3n1oK4J08j15J74m1kj02J50j22O6r3k1R7r5l1L5L9k4Q4q7PkO0n6N9j38P3
5419A01R1P8M5k03k3JN8L5n7o0M9mK9j09J47O1q6k2M3J6M1j29n4LM6l1M1Q6l6jkRqq1%J35
4996B09o2p4J03n8p5%O8p8O2K6M3R3p5j05NK00L0j19j07O0L9J7J74j39j25J45m2j8r2P7p1
4632A11KJ0J67k28k8N3JO1l6o1j9nK14J1m7j00J00m3J15j93J45Q3k20J34j10o8O0J02M4n6
4280A99m1PJ3j13J02q1k8K8R5K2j06m3P0R5j19o9P6J31j46P3j6p7k5R1N1p3L6j01RP3P7j48
3905F2J52r9j6rj3%k8J38n1L1p2K5Rr0J0J10p1RLk6O8O7p5l0P0Q3j52J9m8J50P2M4j72l3r
3494A28j17K07j16o3N2o4O8M3Q3r4Q3m1q6L5J41n8o6P1O2k9j21p3M3QJ7N9m6l6m1L0M6M2P7
3107B44O5j27j35k0R4J2pJ55r7q9%R8l1n7K5M6n7k9J48Po8QOm0q1R8P4o0o5L2J3j1j8P1j03
$$ plain form
5806 67 225 127 78 111 60 54 78 186 71 245 204 202 100 250 128 194 101 80 177 82 51 86 125 101 185 98 105 103 163 107 166 28 101
5419 101 192 270 315 112 89 90 148 183 126 66 115 111 140 31 178 239 153 131 174 190 231 102 48 51 97 66 107 193 157 156 154 163 155 74 74 209
4996 209 147 73 176 118 43 43 111 33 95 121 164 257 182 77 82 282 312 193 86 146 185 202 376 237 112 257 215 197 105 182 111
4632 111 113 123 290 62 34 87 88 149 113 52 33 28 242 253 206 106 206 163 278 85 230 313 93 227 117 49 109 211 255 199
4280 199 158 165 178 65 167 86 58 86 181 203 97 54 124 219 100 31 107 238 92 165 149 72 47 138 189 116 152 51 60 133 210 62
3905 62 214 115 99 90 77 77 49 187 136 167 95 120 129 39 49 159 88 97 100 74 142 209 134 104 174 257 105 124 76 226 298 342 170 137 128
3494 128 11 218 102 39 91 27 95 138 221 127 210 169 83 118 259 201 135 206 268 239 118 45 88 96 113 172 126 90 49 79 125 167 244
3107 244 309 182 47 27 121 133 126 281 184 95 95 193 162 105 130 176 119 90 238 245 177 185 191 151 70 168 242 182 117 149 162 151 133 204 101
2696A01R4j18O5L3j3q2J4P6p6o5J8j6M7j0n6N4M6r5J45J99j54L0N7k22R3L7j47PL9J47j44
2332A04J9m0M2l7l3l4J10N0o7K0jL7n3J2l2j5Q5K6pJ4p1n5K0N5J16q4J3Q9j27p7M9j01L3j7
1933D3J28r6P8o6M4j4R7L1k1q0m8M7k3l0o1O6l7J37pq2M9o9lQ0o3J40J1j03j00N0nQ4r1Qj7
1522G7j2j6O3r3J90j2K5o8n2K8n8JQ5J8k5J03l3j07j7nM9J17j48q6Q0N6o0j0J10q0oJ1o6J7
1123G6N5M0J2m2J4J8m3o0N3K9M9j63J7J09l8L9l0J6j8m3L8k4j7J6J55o8j30Q3O9L6o4K4j33
736G5J36j5j29J7O4L7L4q7J2J78j18r4l4P6O3j22K6j5R1j31O1rM1p2J1k8n8J06J68q2j44L
360F1K23J5j38j19L0K8qJP0j8o0L1rR3K9j71J61J37j75L8j65O1Rm6K6M5q8J6NRO7om2l2L6
-51A14j1J94k54J36q9N7L2j01O8K9j01%
$$ plain form
2696 101 195 77 142 175 162 80 94 170 94 29 47 31 78 68 12 66 112 17 162 361 207 237 294 72 165 202 55 62 101 248 104
2332 104 123 83 125 88 55 21 131 181 114 134 133 170 117 129 97 82 167 193 186 200 129 74 94 149 265 181 194 283 156 79 128 27 60 43
1933 43 171 75 153 87 131 117 214 245 224 144 96 143 120 90 29 95 58 195 188 106 155 86 83 163 100 240 251 148 48 98 93 177 86 94 77
1522 77 65 49 112 19 209 197 222 154 102 130 72 73 158 176 151 254 221 114 97 92 141 258 110 24 104 160 100 90 200 120 114 125 59 76
1123 76 131 171 183 141 155 173 130 70 123 152 201 38 55 164 126 165 135 151 133 90 128 104 87 103 258 190 60 143 212 248 184 208 75
736 75 211 196 67 84 148 185 219 132 144 322 204 110 76 152 215 93 119 104 195 64 125 116 157 85 96 68 10 116 284 202 58 61
360 61 284 299 161 42 72 100 92 93 163 145 85 116 107 200 229 58 219 356 181 219 54 115 124 78 104 149 61 77 82 91 158 152 110 78 114
-51 114 103 297 43 179 90 147 179 78 146 175 74 74
-192G4
##PAGE=	F1=-1933.56
##FIRST=	25164.767445380970457,	5806.2096540000038658,	0
##DATA TABLE=	(F2++(Y..Y)), PROFILE
5806C2K01q9q4K0m0j6O3P1o6J04n0O2j07J10j33J21j31K8O5r5J7RqkR0n0J3J3rL5%j33O3Q5
5407A89R9K6j74n6J5N9K1m4n0P4l0or9J63N3r9K9K9O6j5j65lOLn2L1R0Nk4m4NM1j13P4L9m2
4985A01o4J07k2n4l5P4p6R6Ol9R2m5p3J5J99K8j24j14J16L1l6J54j24p9J03n3np2R5r4K3l3
4609I8J93k33jK7jR5m4o7mnJ82L8o7j37J13p1J44j87P0J16j65J14j38j8N9J37J6o8l7J5K2
4245A96j40J18n1r9N8Q7J9j02k9P6Q6j17q4J11J35j59L3j8n2m1P8L9m0J8r3j6Q7J33j41J38
3893B30j35Qkm7L8l0J68n2Jp2L1L3j03o3J47j6nn2oN7J17j05m3N7P6j12L2m4R7J05O4j53k6
3506A95n5q9J26m9r8R3l1j0M5R5r6R7p4l8L3J29o5l3N0Q8m4j64q3L8j0L5R3o7l5j4J2MM3J63
3107B84P4j31j75j7N3K1K1J71j06q1n7R9Lo9N0J5m3l1J17lp0JK2Op0J04P0j13n7J10l4l5m
$$ plain form
5806 32 233 144 60 80 40 24 87 158 92 196 146 208 101 211 78 199 68 96 161 66 83 92 84 82 172 122 135 148 139 174 174 41 104 189
5407 189 288 314 140 84 99 158 179 135 85 159 129 123 24 187 240 141 170 199 265 250 85 82 88 91 39 70 160 165 141 97 102 143 30 104 143 101
4985 101 37 144 122 68 33 107 31 127 133 94 186 141 68 83 282 310 186 72 188 219 183 337 213 134 237 184 179 107 202 108 131 98
4609 98 291 58 57 84 83 178 134 67 63 58 240 278 211 74 187 116 260 73 143 259 94 208 70 52 111 248 264 196 159 174 196
4245 196 56 174 123 24 82 169 188 86 57 133 219 102 18 129 264 105 138 120 68 27 105 144 104 122 29 13 100 233 92 230
3893 230 95 103 101 54 92 62 230 178 179 107 138 171 68 5 152 136 131 79 73 130 247 142 99 156 232 120 152 108 205 310 374 221 195
3506 195 140 51 177 128 30 123 92 82 127 222 126 223 149 111 144 273 208 175 225 313 269 105 22 60 50 85 178 111 76 62 74 78 121 284
3107 284 358 227 52 35 88 109 130 301 195 114 57 156 159 90 140 155 112 81 198 195 125 126 148 154 84 188 258 145 88 198 164 129 125
2719A25J20j16P9o8l6J05j09n9O0O5n8r2K1k3J38o3m3J1L4n4Q9J88j11mQ5k01J31j8n5j01
2367D0M2Q7r0M0j7M4j9j8l4O1J2j9OJ6j9%M5J6q0K3O0J9k0q4n5nO4J19p0k0O3p9m1L3r6O9
1945I3MJ09j00M6n6O4k8J45om5l8q0K5j6l3m9O7m9J56jj32P5n8j0P1q7J82J1j36j05L9M7O7
1557A72j12M6k5K2k5M8r5J37M5L4o9j21P7k6k0M7K2p9J42po4j6p6J18J52k13l9N5J6m4pJ27
1182B22j01j4M6n6m9J00R6o2k0jJ5o3k1L7K9P5k13J06O4p8Q5r1K8Oq7L3m5O0m0J46p0j15J29
794A51L3L6o7J0r3J30j2q2j8R4K3l2o2N8J98j14j45l9O8P1j02LL9N8j56P7L5L0j24M0r2K1
419C7P4J98r4j44M5J63J2j46r3K2L9J7oL4Kk0J01j83J32M3j66K12J09j43j5j79R6l6n1mL1
55H7l1M5o9P2O0mn6q9J03j6J34j55J19q7M1P2j60N8M0j40L0
$$ plain form
2719 125 245 129 208 140 104 209 100 41 101 166 108 16 37 14 152 89 46 57 91 37 126 314 203 199 284 83 214 196 141 40
2367 40 82 169 79 119 102 146 127 109 75 136 148 129 135 151 132 132 177 193 113 136 196 215 195 111 56 51 115 234 164 144 207 128 87 120 24 93
1945 93 97 206 106 152 96 160 132 277 271 226 188 108 133 117 84 35 102 53 209 208 76 151 93 83 154 67 249 260 124 19 58 105 172
1557 172 60 106 81 103 78 126 31 168 213 247 178 57 134 108 88 135 157 78 220 213 149 133 57 175 327 114 75 130 146 102 95 222
1182 222 121 107 153 97 48 148 244 182 162 161 176 113 92 129 158 233 20 126 190 112 197 106 134 140 53 86 41 101 61 207 137 22 151
794 151 184 220 153 163 70 200 188 106 88 182 205 173 111 169 367 253 108 69 137 208 106 109 148 206 50 127 162 192 68 108 16 37
419 37 111 309 215 71 116 279 291 145 52 74 113 130 124 158 160 140 241 58 190 233 67 279 388 245 230 51 147 111 60 56 87
55 87 56 101 32 104 164 160 104 15 118 102 236 81 200 113 154 226 66 124 164 24 54
-192E4
##PAGE=	F1=-2035.82
##FIRST=	25164.767445380970457,	5806.2096540000038658,	0
##DATA TABLE=	(F2++(Y..Y)), PROFILE
5806G5J62q6j08J7l8rR0K8j1L2p0J09j14J06j46J63j19M2J4q4Q3nq7J8R0kK5ml5J15o9j31
5431E1P4O6R7Qj15j03J8O1Om8k5Q7n1m6n5J39O2n7K5J7J08p8j49L1Qm1p9R1M0K9n4l9k4J06
5032A60j07R4p5k1M4NL7o6m2O1o3J20Qj27R2l3k4K6J76J0j12j14J84J1p7R0q5m5Q3m8j1o6
4656H5J24j08L9n8J98k34M0lk3J25l7o8NnJ40N0p8j42J13p7J55j31p7J47o3N8j58O8K0J57
4304B62lq4j9K5L4j64J12k3j28O4P0Op4l0R0O6j00p0J05J37j61kl6Qo4L9L6M4l4q8K4L6J73
3916B51j21P1j54O5j2o6Q0k9J71n4k9p0N5M7j15m3Q1L3Nr0j7O2J35j01o2M7N5q3P7k2qJ32
3541B91Q4j08l8r5n2N6Qj04J17j3o0K3J11j11J31j00%L7J00o5j7M2R2n1j89m6Ql9R1P0p5j5
3165H3J5l4l5J18J53P4j26j96K%N0N8J47j09q0p4Q2M5q2N3ol6k3P2nq3JM0M4m2J09L7j35k1
$$ plain form
5806 75 237 151 43 60 22 13 103 131 120 152 82 191 77 183 37 200 81 123 137 53 136 131 44 62 152 150 175 171 136 251 182 51
5431 51 125 191 288 296 181 78 96 157 163 115 90 177 126 80 25 164 226 169 194 211 319 241 92 123 131 90 11 102 142 171 117 78 54 160
5032 160 53 147 72 51 95 100 137 71 29 90 27 147 155 28 120 87 63 89 265 275 163 49 233 244 167 257 172 127 210 162 151 85
4656 85 209 101 140 82 280 46 86 83 60 185 148 80 85 80 220 270 192 50 163 86 241 110 33 180 117 175 17 85 105 262
4304 262 259 175 156 181 215 51 163 140 12 76 146 152 78 48 138 204 104 34 139 276 115 113 77 85 21 60 96 140 106 18 42 78 251
3916 251 130 201 47 112 100 34 114 85 256 202 173 103 158 205 90 47 128 161 166 76 59 121 256 155 93 140 195 112 189 167 159 291
3541 291 375 267 229 134 82 138 146 42 159 146 86 109 220 109 240 140 140 177 277 212 195 237 329 278 89 43 51 12 103 173 98 83
3165 83 98 64 29 147 300 374 248 52 54 54 104 162 309 200 120 46 128 173 91 144 138 102 79 151 146 63 64 104 148 106 215 252 117 96
2766I6J38m3p4lJ38j07M5J1j40J64j79M4K2L6l0q9Q3j00K00r6m6l7L4k3M6J64p0l3R0j49J36
2402B28j3j1j94O5K3l3N0J9N9j8k0l3jpK1lJ0n6N1Q5O1j45j7N7N0n1o9n1k6N8J10p2k6K7k6
1992A02j0J8o3O2M6P3r1jl2P0n7J95j7p6Kj07Pkm1j3O2m4J25rj30Q2m7l1M6o3J94kj34j12
1592BO0O0L4j13Q3l5M0j5K9p3N3J00K3o9j49J03Qm8KP8j24J21L4j1k4r9J65J39k57NK5k1j3
1205A13l1J46j11k8Q4m9q4J56J19j41kj2J9r4K2J9L5J01j99J42Jj01J00j23M4O0j15pqM3p9
841B0J31n5l8J00j2K5p1Qn2J15j3j6pQ2J3j01m7R3J99r7j79k0N3N3q3NP3J9j69J05P3J6j78
454D5R4q7L2L7J88r9j31N7R1K5j36m0j4N5L8M5n6K9J1J55k75J17N7j59K25P8j04o5j41J18
102A90q9l0k5k7N7M2r4R4L9j0m2p0P8qN3n3R9o7J4R4j73L5N4j29q
$$ plain form
2766 96 234 191 117 114 252 145 190 201 61 225 46 90 112 148 118 29 112 12 212 116 70 33 67 44 90 254 184 151 241 92 228
2402 228 215 204 10 75 98 65 115 134 193 175 155 122 121 114 135 132 142 86 137 222 283 138 121 178 228 177 108 57 31 89 199 127 101 128 102
1992 102 92 110 47 109 155 228 137 136 104 174 117 312 295 219 221 114 121 119 78 65 127 83 208 199 69 151 104 73 119 56 250 248 114 2
1592 2 62 122 156 43 126 91 131 116 145 72 125 225 248 179 30 133 141 93 95 173 49 170 204 193 169 70 235 374 117 122 147 126 113
1205 113 82 228 117 89 173 124 40 196 315 174 172 160 179 85 107 126 161 262 63 205 206 105 205 82 126 186 71 64 56 99 20
841 20 151 96 58 158 146 171 100 108 56 171 158 142 135 217 230 129 82 175 374 277 98 78 131 184 101 106 179 198 29 134 207 223 45
454 45 139 52 84 121 309 210 79 136 227 252 116 76 62 117 155 200 144 173 184 339 64 181 238 79 304 382 278 213 72 190
102 190 101 71 46 19 76 118 24 118 157 147 105 35 113 105 158 105 204 137 151 245 72 107 161 32 24
-192B4
##PAGE=	F1=-2138.08
##FIRST=	25164.767445380970457,	5806.2096540000038658,	0
##DATA TABLE=	(F2++(Y..Y)), PROFILE
5806A35J03q7j10J2j4NQ4j6K6j3j01J41j12J19j35J64q2J8j4p7J35j8j39K5Q0N3M0m6l4J71
5454C13j24j26Q2M6Q3ko0r9QK6j0o8K4P7o7p9J4P3Q7kmK1J27j31r0L7J7p6k4R6l0K7o6J4p2
5043D2J35r3J01j43J3R5r7J15j02l3L6l7J21K6j55N0l9K4O2J16k1q5o5K02j4r4nl1k3P3k8
4679A46l1p2J56j10N3p1J86k29Q9l6m7J38j3q1J0NR2L9p5j05Q6m9J47n6q8K2M5k0r6P4j1J67
4304B65j2j13J0L5M5j90R9pq6K5M7j9on9J03L8o2m8O6J34j47pn4M9m7m6M4J16p5o5M0jJ89
3916B61r0k9j21J03m0j1O9m1J61o0n4o4R1N3j23j6J1O3J2p8n5P4J19r0n5N4J1p2J40Mj32J53
3541B48R7m3o9j26rJ3M7q3R9Pp8j7J30j28J69j14J3L8P3o5pN2P5n8j92J1J2m5Q5J9o6L5Rq9
3142D3J3J47Q5N9j07j90L1l7O7Q1J11j03r1m9O6O8q9L5j1m8J4J4mq7M1kQ0pJ14j8j03j4J44
$$ plain form
5806 135 238 151 41 53 39 44 128 112 138 125 24 165 53 172 37 201 119 137 123 46 181 163 24 49 129 182 222 176 142 313
5454 313 189 63 145 191 274 272 212 113 121 147 137 69 93 170 103 24 38 111 198 196 192 213 340 209 119 156 173 97 73 169 139 166 100 114 42
5043 42 177 84 185 42 55 150 53 168 66 33 69 32 153 179 24 74 35 59 121 237 216 131 66 268 254 160 155 124 101 174 146
4679 146 115 43 199 89 142 71 257 28 117 81 34 172 159 78 88 93 185 224 149 44 130 81 228 172 84 106 151 131 35 109 98 265
4304 265 253 140 150 185 230 40 139 132 46 71 118 99 93 34 137 175 113 65 131 265 118 111 57 106 59 13 57 173 98 33 73 72 261
3916 261 171 142 21 124 84 73 142 101 262 202 148 84 175 228 105 89 100 163 175 97 42 116 235 145 90 144 155 83 223 227 95 248
3541 248 345 302 233 107 98 111 158 75 174 181 103 86 216 88 257 143 156 194 267 202 195 247 322 264 72 83 95 50 135 154 88 123 132 43
3142 43 56 203 288 347 240 50 81 44 111 192 303 200 109 60 126 194 105 140 129 81 95 109 105 18 59 57 137 130 244 226 123 109 253
2754B53k5j11j8J30q0JJ00k33J99j67J04l0mlp3J41j43J95r4p2m3M3l4K2J33l7m3O3p5J07
2402B06N1k3j99P2ql8N6M1R3l7l5k3o8kM1Lj0o9Q3J15Q8j82k4PP6o1l5l6n3L2J00q6L4m1K0
1992H8J5Jl6L2J12J8p2l8oO5r9K36lj14K7j25J6J3l4J2O2m4O6k8p3O8l8l1k3QJ74k5j00j20
1592DR1M8nj00J11l9K3J0K6n5j5J28po4o6L8L6q0k8J67j08J3P0M1l8r4J93R8k83L6km9L0q0
1193E0J66j06m0J03n0o3J89J26k08Kj7J9j13N1OL9J19j77J78o2r8P6j06L9J04j20j5J9k7n7
841B7Q8k5K1N7o7Qo7K1k5Q8j6O5J8M5J1j52m2J05J81o3j97L1K8J2o4K1Q4k6j25J02R6Nk16
454B9J48o9L2JJ44r1j21N0J7N4j13jl7O6N8J03j51N7L4J82k98Q4N4j45J97N2o2j12p7J48j27
90A06k8jl5N1L4o4N8J9k2j8l4L9J1k4J1Q3m0nR6j43J3O5r0o8
$$ plain form
2754 253 228 117 99 229 149 150 250 17 216 49 153 123 119 116 43 184 41 236 142 70 27 70 36 58 191 154 111 174 99 206
2402 206 257 234 35 107 99 61 117 158 251 214 179 156 88 86 127 130 120 51 134 249 337 155 131 138 214 153 118 82 29 61 161 75 109 68 88
1992 88 103 104 68 100 212 230 158 120 114 179 80 316 313 199 226 101 117 130 96 108 170 126 192 164 91 159 121 90 67 75 249 224 124 4
1592 4 95 143 138 38 149 110 133 143 169 114 99 227 220 156 90 128 164 84 56 223 115 128 198 239 201 107 300 398 115 151 149 100 130 50
1193 50 216 110 70 173 123 60 249 375 167 169 152 171 58 109 115 154 273 96 274 212 114 190 84 123 227 107 92 111 84 27
841 27 115 90 111 168 101 109 42 63 38 126 110 175 193 238 249 97 55 160 341 278 81 112 140 152 88 109 193 167 42 144 240 245 29
454 29 177 108 140 141 285 194 73 123 140 194 81 80 43 109 167 270 119 176 210 392 94 178 232 87 284 336 274 162 85 233 106
90 106 78 77 42 93 127 63 121 140 118 100 66 105 116 92 103 186 146 141 237 94 107 172 82 14
-192A4
##PAGE=	F1=-2240.34
##FIRST=	25164.767445380970457,	5806.2096540000038658,	0
##DATA TABLE=	(F2++(Y..Y)), PROFILE
5806A78M8p8q2j1OJR2o0M5k7p2J11p4R9j19J39n1j5Qq3J52l6j29J1N9R8N7r6l5K06j47j10
5431H5P1K9O3Ql1m6J0n6k5j01J03L9p5l0N%J12L4l4N4J10j63j3K6L4r0J2R7q4Mm5N2j15J31
5032A71q0J20j25K0P8j72J94j12n3K9j2R1M4j51Rl4L7J10M6o8m5K4J59l2q3r7J0j1O3km9p0
4656IJ63r7O6q8J68j96J24p1k3R5K2j13J3L4L9Ko0l1K9J2J24Pm5p9P9r5oK7pJ57kj57M0M6
4257A86N0k17J03j5k3j6K2l6O5r9J12Qj2l4J5J19j16J6l8M0j2p0lJ41r4m7N1j8J83n2j01r
3881I9L7p4O3M6o4J46p3p2n2J28N0j21%l3O4Ql3o8O5P7q6j1P5m0q6K00K6k45J70R5K9j12j40
3494F8M2KM9n7N7L5p1n3J38j28J84j15KK9N3n3J5N9M6o7j77O1K8l8M6j6n8R0j6j33Q6J37J2
3107B57K8q0j55O0n1N8R3P5r0j09j6P0P1q6Okq7P0k2j7k1M8r1J23K0J20q1k3m7J35J5j28o5
$$ plain form
5806 178 226 148 66 55 61 62 154 94 139 112 40 151 77 176 57 196 145 130 138 55 207 171 42 53 112 210 267 171 136 342 195 85
5431 85 156 185 248 256 225 179 189 133 108 7 110 149 74 44 49 49 161 195 161 215 325 162 149 175 209 119 131 228 144 148 103 155 40 171
5032 171 91 211 86 106 184 12 206 94 41 70 58 149 193 42 51 17 54 164 210 142 97 121 280 248 165 68 78 67 130 128 79 9
4656 9 172 75 141 53 221 25 149 78 55 150 172 59 72 106 145 147 87 56 85 97 221 228 183 104 183 88 82 109 102 259 257 100 140 186
4257 186 236 19 122 107 84 68 90 54 119 20 132 140 128 94 109 228 112 128 90 130 118 48 45 186 92 45 96 78 261 209 108 99
3881 99 136 62 125 171 107 253 180 108 56 184 234 113 113 80 144 152 119 51 116 193 107 96 171 131 45 245 271 26 196 291 320 208 68
3494 68 110 112 161 104 161 196 125 72 210 82 266 151 153 182 235 182 197 256 302 235 58 119 147 109 155 139 81 171 155 22 108 245 257
3107 257 285 205 50 110 59 117 210 285 195 86 70 140 211 125 131 129 42 112 90 73 52 100 9 132 152 272 191 168 121 256 271 143 78
2719G8J10m8l8J78k34J39j01J19p6m1J4m8J88j55J33o0j03K4L0p1KR6j7rj5ON8J46p3j44P4
2355A62pr6P6K1J41n4n7j6j13J8L4K1l0o1Q4J29R2j77rp6R0l6jnr9qJ03q8J08r2M2L2k2k6
1956H0oJ79m1m9m1NN4j25K38K4j50L2j30N7J6k1K6O9n5Mm1RL9l1Jp7K0J62n4n6j30J07M6m0
1557A21p0J19k7l2N0L5n0n2J21m7n1L5l4N6j09jK10j08m7P4Q5n2q9K14M9k89M7k8o0P8j33
1193A5J68q0n0R9n6j2K03J32k45k7j6J1r0M5%L9J25j45K02j10p4K6n0J1J26j07kJ6r3qO2j
818A14M3K4j23rokj3M7k2J50M4nJ1j67l2P7J47j4k02R4Kl3m8M1P2o4m6P8R4jj99J57n6M3l4
407A62Q1p3j08M5n7Q1p1J2j6L4Q1J44k28P7M9J81k88P3L2j19J29M0k5j50jJ72j24n8K9q%L2
31A28l3J2J1l4lKJ1L6n7jP3nj6Q6q4QN7o8p2
$$ plain form
2719 78 188 140 102 280 46 185 84 203 127 86 100 52 240 85 218 158 55 79 109 38 40 136 119 110 95 101 159 305 232 88 162
2355 162 155 59 135 156 297 243 186 170 57 75 109 130 100 39 123 252 344 167 158 82 172 136 135 130 31 23 126 38 146 54 96 128 106 80
1956 80 74 253 212 163 122 127 181 56 294 318 168 200 70 127 143 122 148 217 162 166 125 134 173 142 143 66 86 248 194 138 8 115 161 121
1557 121 51 170 143 111 161 196 146 94 215 168 117 152 118 174 65 64 274 166 119 193 278 226 137 351 400 111 158 130 70 148 15
1193 15 183 103 53 152 96 84 287 419 174 147 131 142 52 97 97 136 261 116 318 208 134 160 110 121 247 140 138 154 61 53 115 114
818 114 157 181 58 49 43 41 28 75 53 203 247 242 253 86 54 131 278 264 62 156 158 125 77 118 190 126 80 158 252 251 52 209 153 196 162
407 162 243 170 62 107 50 131 60 72 56 90 171 315 87 164 213 394 106 179 211 92 221 261 236 86 85 257 133 75 104 96 96 128
31 128 95 107 118 84 81 83 94 130 73 72 145 140 124 210 126 134 191 123 51
-192E1
##PAGE=	F1=-2342.6
##FIRST=	25164.767445380970457,	5806.2096540000038658,	0
##DATA TABLE=	(F2++(Y..Y)), PROFILE
5806A92On7l9m1J0pJ05r8N2k4j9Q3l7O0j21J12k9m3O5q5J22n2r2LM0J18P5j35n7K22j29q1
5431A19N5ML9L2l3L0K8j52l1l4Q2j0p4L0k6JO4L4n2J19N7j72N8RO1q3J8Q9j14l1%O0j56J14
5032A35n7J49j02J8N0j74K17q4r4M0lN3L8j54QnJ1J47jj09k2J12Q8l3n6r4k3k2M9K0m3LP2
4644A34o7P2j10J49j29J27r7K6K7N5j61K9P3j5n8l6N4l7J02P7M7j4r6N1j40N6l9M8J17K2j89
4280G8M8O1M5k13J16n0M2n6%kO9j26J09j9L8k7l4R3p4M4j3L9K5r5m3J27q8m5O7k0J55j4p7
3893A60J3k7r6J10L4q6J25r2p4m1J56M2j10Km1L8LJ1m9M7K5p8M4Q8o9r2K03M7k58J12P6R8
3517C21j58j06O6J3J1l3J1P0m9o9J27j17J73j03k5NM5j6N3M0J9p8j53R7M2j3j1j2o9J26m4
3154A63j14J00J15m4k1m8r4R0p6N1R2M1o0j23nQ5O5p7k0J7j21R9k0m9L3M6p2R4K3J25j40P1
$$ plain form
5806 192 198 141 102 61 71 64 169 71 123 99 80 163 126 186 65 177 148 105 170 85 207 155 63 66 106 224 299 164 107 329 200 119
5431 119 174 178 217 249 216 246 274 122 91 57 139 129 55 85 59 60 124 158 106 225 282 110 168 177 238 155 173 262 148 117 117 177 21 135
5032 135 78 227 125 143 193 19 236 152 58 98 95 148 186 32 40 35 46 193 192 83 61 173 261 228 172 78 55 33 82 102 59 62 134
4644 134 67 139 29 178 49 176 79 105 132 187 26 55 128 113 55 19 73 36 138 215 262 248 152 203 63 119 80 128 245 267 78
4280 78 126 187 232 19 135 85 127 71 71 69 138 12 121 102 140 113 79 172 98 142 129 168 193 98 55 182 94 49 116 96 251 237 160
3893 160 173 146 50 160 194 108 233 141 67 26 182 224 114 116 75 113 116 127 78 125 150 72 116 204 135 43 246 293 35 147 223 321
3517 321 163 57 123 136 147 114 125 195 146 77 204 87 260 157 132 137 182 166 219 259 278 200 47 144 186 173 162 150 81 207 163
3154 163 49 149 264 220 199 151 57 147 71 122 214 255 195 72 67 152 217 140 120 137 16 115 95 46 79 125 53 147 170 295 155 226
2778B26q6J07O7j22j34Q1j8n6K24j89M1l4J22j06n4JpK11j40L2pj10Q7K1q3l2N7PM4j35P8
2414I3K2K24j30p1P8j5j47J14m4J89n0p9k0j03J9OM5m3n7P6J21P5j33J4j48P7L8%L3j58JP9
2038A06j6Q7j14N9L8m9l0m1K28q9l0j0NM4j00J70M7j78K3j20J17Jj9M4Q3p4m5k5P0Lk0L8p1
1651A32n7J74q6j9j10P6O0o0l3J09jj03R3N3o2o9R0q5k0J15j02P9j33O4K00j22m7M4J19n8
1299B41q6K23Nk78L6m8n1J20r2O1k7o3P9n2L9J97J41k51q5j8Kj7NmL2J17j03K04j30m1l1J3
923A38k0J25p8QRj44L0N3J8N3Lj64J8M0m8kj0kK02O0o0J2j52j4L8Q9M3k01J50k5n7l3M5M9
524A73o0NN9O3lj51J43m8O0o6J7n3p2O2p6K9moL1l3R8J63k66O9O0J56k50Q6jq2L5L8%j53N5
114G8J76r0r6M9K5n1L4nm6K4m4nM4j3O2n4p1O8M0k4P3j4J7K7n4o8
$$ plain form
2778 226 140 247 314 192 58 139 121 65 289 100 141 107 229 123 69 70 63 274 134 166 159 49 136 157 74 42 99 106 150 15 93
2414 93 115 339 209 138 216 201 54 168 124 313 263 184 164 61 80 86 131 88 31 107 228 303 170 184 36 113 151 151 184 26 27 106
2038 106 90 177 63 122 160 111 81 40 268 179 149 139 144 188 88 258 305 127 150 30 147 148 129 173 256 182 137 112 182 185 165 203 132
1651 132 75 249 163 144 34 110 170 110 77 186 185 82 175 228 166 97 187 102 82 197 95 174 41 105 305 183 136 180 299 241
1299 241 155 378 383 105 141 93 42 162 70 131 104 41 120 68 107 304 445 194 109 91 93 76 81 77 109 226 123 327 197 156 125 138
923 138 118 243 165 173 182 38 68 121 139 192 195 31 49 89 41 39 29 27 229 289 229 241 89 75 113 202 245 44 194 169 112 79 124 173
524 173 113 118 177 240 237 86 229 181 241 175 192 139 67 129 53 82 78 72 103 70 168 331 65 134 194 350 100 186 185 103 138 176 176 23 78
114 78 254 164 68 117 142 91 125 120 74 98 54 49 93 80 142 88 17 85 125 101 174 160 177 204 150 82
-192H2
##PAGE=	F1=-2444.85
##FIRST=	25164.767445380970457,	5806.2096540000038658,	0
##DATA TABLE=	(F2++(Y..Y)), PROFILE
5806A79k5k1Np0Rk5J10j22O0k3L1Q0k1K3j31Q2j4o0J29o7N5o4l9jL2J02R3j50r8K16p2m2O1
5419B22l9%N6n0J09N0k32k2J6N8m9o8M6k2M1k1mm0J95k0j64J07lR2o8%P5j21o3M4N2j47N0
5032H0mJ65r8RK9j39K03l6j20M3LJ9Mj47L2kjJ49j4q8o3J76J0j4k4m7n2p2L8L8j1M1j1k1O4
4621A39q1Q8p2J22j11P0l7Q0j76N9P2n8o2M0J1k7J41J2O1Jq9K2j45Q2j02J43L9N0j79J3Q3
4257A89K9j67J21q0Q2q8k1M5L0j27R2m0P8k2p0N8l1N7J6P7M8j36p5J04n2n9P2rJ10K1j6pp8
3870A51j03J18L3q7J01j16n2k8J52L0q7rk8QJ9J9k0M1j0m1N2Q5p3p3J39O7k20M5M3J48j93
3506A11j0K8K8n0j4j4J05j9p0J03j06J43p4o0l2M3N3Q4KQr0j26J15M9K5p0K0r5J34o3o5Q2
3130A75Q9p4p8j3j9J17j23N9P2J4j3j20l2R7N4o7k8M2o8K8qq4P0L4l1P9PJ32j88J53j08O5
$$ plain form
5806 179 154 133 138 68 77 52 162 40 100 77 108 188 167 190 59 141 127 67 196 129 184 120 81 80 112 214 307 157 59 275 203 161 222
5419 222 183 183 239 189 298 348 116 94 110 168 119 51 97 75 116 95 91 51 246 226 62 169 166 258 190 190 265 144 81 125 177 30 80
5032 80 76 241 143 152 181 42 245 209 89 132 135 154 158 11 43 41 40 189 175 87 24 200 210 196 172 125 73 1 39 77 66 107 96 75 139
4621 139 58 146 74 196 85 155 118 198 22 81 153 95 33 73 84 57 198 210 271 272 183 205 60 142 40 183 222 272 93 106 189
4257 189 218 51 172 92 174 86 65 110 140 13 105 65 143 121 51 109 78 135 151 228 276 140 65 169 117 58 130 121 231 252 236 229 151
3870 151 48 166 199 112 213 97 45 17 169 199 112 103 75 83 102 121 101 142 132 91 143 228 155 82 221 288 68 113 156 304 111
3506 111 101 129 157 107 93 79 184 165 95 198 92 235 161 101 69 112 165 249 251 259 169 43 158 207 232 162 182 87 221 158 93 175
3130 175 264 190 112 99 80 197 74 133 205 219 206 86 54 151 205 138 110 152 84 112 104 20 90 124 93 172 179 311 123 276 168 233
2754B33J15j06j96M8Kl7K16j27m4QJ18j09l8m5M5K00j09p7M5o7J08J4q0o1K9M9O3j42J9L6
2402A10K44j79kQ0l4j71J59j25K10k0r3m3n7Rj8O0n6l9N8R2M3p0M3j26KJ23l9O7k16P1K6M9
2027A58L2j33R8L2p5l9o6K40j04k3L8LM2o4Q2M6j93J4m2J22k9l3P1R9q7p4J1Q9l1KN7n2j48
1639D3K07j23J8p2PQ5n3kQ4K9j42J08P2q8p1M4r0J9J50j66J06j45J16J71j39qj0J47m9q7K15
1276C76k2k55On8k4J45k8p6N4n2L0j9N4J66J53k36j57j7oP4l5nRR8n6J81j16j1q2O3l7J00
900B17l6KJ9j85N2L9M8N8pj76N6L8q4J8l0M7J77O1j06J0j28LL8JR0j92J93n6n4j6K3L3qNN1
489B01O%r3J25n0P7r1l3m1KP2p6l7M9k2O2q3R0J65k38QO0J25j76R2k5m4l8J3Rl0KJ41l8j17
78F7N1O6r4L0K0j11N6n3J1O1l7Q0m9m5l3R3l5N9N2K7j4m3n8
$$ plain form
2754 233 348 242 46 94 96 59 275 148 104 112 230 121 83 38 83 283 174 97 142 75 183 197 117 56 85 134 197 55 74 110
2402 110 354 175 173 253 219 48 207 82 292 272 179 136 79 88 70 130 74 35 93 185 228 158 201 75 77 200 161 228 12 83 109 158
2027 158 190 57 155 187 112 73 7 247 143 120 158 161 203 139 221 267 74 88 46 168 139 106 177 276 189 115 126 215 184 186 243 191 43
1639 43 250 127 145 73 80 165 112 110 194 223 81 189 261 173 102 146 56 75 225 59 165 20 136 307 168 160 150 297 248 161 376
1276 376 354 99 105 47 23 168 140 64 118 66 96 77 131 297 450 214 57 40 34 108 73 68 77 175 119 300 184 173 91 154 117 217
900 217 181 183 202 17 69 108 156 214 207 31 87 125 41 59 29 76 253 314 208 218 90 93 131 132 222 30 223 167 113 97 120 153 145 150 201
489 201 207 207 114 239 189 266 175 142 101 103 175 99 62 111 89 151 68 158 323 85 93 153 278 102 194 169 125 87 100 109 79 81 222 184 67
78 67 118 184 90 120 140 29 85 32 43 104 67 147 98 53 20 113 78 137 189 216 202 159 101
-192A01
##PAGE=	F1=-2547.11
##FIRST=	25164.767445380970457,	5806.2096540000038658,	0
##DATA TABLE=	(F2++(Y..Y)), PROFILE
5806A49m6K1L9q6J5n7R7r5M6k7P0P8j8mj37M9Lo7J67k7k5o9J5J9J8M2J15j41j29J80OKQ5q6
5407B02n8O2n9J78O6k80jL3M2p0p0L0K1N9p8o9N6K06r6j38J14lJ20n6k7N8j12q1P3M1q5n9
5032A9Q5J50j13qK4r9J69J8j14K5J0ln0q0K3k1PJ07mk2j06J75n7J9Mj3m4o9NM8kN8p5L0N2
4621A48k6L6o3J08j11J08j04R9j31O8M1r0J5M6o1L4J38m8N2lo9%j28Q8p2J80n7O8j45l7J08
4257A92Qj19J30r9J08j01m7O7j5j03O3n1J09k2q3J4PM7M6J49N6j88r9Q2ko3N1J0N6N2L6l0
3881B61j13j06R8M2n7Q2j43j2k1J16J5n7k2j4KN6j7LN4k4j3L0P4o5n1N7Q3j87K8PJ64k04R0
3494A56l5L7j18KlJ33J0p1Q3r0R2l0r0n1J4J31R3k8J1r8j01J11N1O5j15N0j12J15o9j2N4O8
3118B53q6j17K6M0J38j77P1L7KL7j12p5R8M2o2j0O4j5k3k2r7Q3J0JP8j0J41k19K09j11K8J42
$$ plain form
5806 149 103 124 163 77 92 35 132 37 83 56 126 204 186 182 45 94 97 30 197 170 145 76 91 110 128 170 285 144 15 195 201 203 288 202
5407 202 144 206 147 325 391 111 110 143 185 115 45 75 96 155 77 8 64 270 174 36 150 147 267 211 184 242 130 49 122 163 78 19
5032 19 104 254 141 133 157 58 227 245 131 156 166 163 113 33 56 35 42 149 145 123 17 192 135 154 158 145 101 32 37 85 83 141 66 96 148
4621 148 122 158 95 203 92 200 96 195 64 132 173 83 98 144 83 117 255 207 259 256 187 187 59 147 75 255 198 266 121 84 192
4257 192 200 81 211 112 220 119 72 139 124 21 84 33 142 120 37 51 58 105 151 300 356 168 69 151 149 86 137 147 203 255 291 261
3881 261 148 42 140 182 125 207 64 52 31 147 162 105 83 69 71 127 110 113 167 143 130 160 234 169 118 175 258 71 99 106 270 66 156
3494 156 121 158 40 42 39 172 182 111 194 104 196 166 76 25 39 170 263 235 246 148 47 158 209 274 159 209 97 212 143 131 185 253
3118 253 167 50 76 116 254 77 148 185 187 224 112 37 135 177 115 105 169 154 131 109 12 95 105 106 184 174 315 96 305 194 222 364
2743C64r8k24K7KLJ73o8q2NJ07p7k3o8O9J58p7j53P4lJ00J0o4q4J4R1N5j21o6R0K14k07M7
2367A88P7n9j59J96j56J48L0r2q1rRk7O0p2K6K2L9lj2Q0p4k0J52r8Q1k35J26j1Q9k9j56J53
1992A83J2r0m4l6J65p5l5Q8J1M3m0J0J5j94M1L7R5o5o4J06J13q5q5K8Q2n4L8N1l4k14K45j59
1616H9O2l2q1J08k2K0M8N2j41J01Q9j25n6j8j6J4J48k12J24j43J36J34j41M6p3J62k4q8J90
1276C51l5k26l2k1j6J44M3j87J15j4k9J9M2J18J61k13k18N4JP5n8Kk6O8j5J40p2J0j24R6k9
912A24N2Pj5N1k08N1J2R4N8j6j73P5L3j05L8l2P5J53M7j39J1j13K4O4q9J14j60K09q8l3Nk6
536A00L6M9j5N6o6J1m2J13o0Q2j06n5m9J03N7j03m1O9k9P4r9N5J67j76q4N4J03o5O1k9j5l5
160A21o5rP1k3Q3J1j14L9J09j15RL6j18M3o0P9J7n5Q7m4J9n1L5l4L4R9L5n8l1m3
$$ plain form
2743 364 266 42 69 71 74 247 179 97 102 209 132 109 41 110 268 191 38 112 109 209 219 155 71 85 176 231 110 44 134 348 141 188
2367 188 265 206 47 243 87 235 265 173 92 83 92 65 125 53 79 101 140 137 125 205 131 111 263 165 246 11 137 126 215 186 30 183
1992 183 195 105 61 25 190 115 80 168 179 222 182 192 207 13 54 91 186 121 57 163 276 191 106 134 216 162 200 251 217 3 248 89
1616 89 151 119 38 146 124 144 192 244 103 204 293 168 112 94 78 92 240 28 152 9 145 279 138 184 111 273 249 161 351
1276 351 316 90 58 37 21 165 208 21 136 122 93 112 154 272 433 220 2 56 57 132 74 76 50 118 103 243 171 181 57 153 124
912 124 176 183 168 219 11 62 74 168 226 210 37 112 145 40 78 46 121 274 321 182 193 80 104 168 79 193 33 242 154 121 126 100
536 100 136 185 170 226 160 171 129 242 182 264 158 103 54 157 214 111 70 139 110 184 85 140 307 131 47 101 204 139 200 171 156 121
160 121 56 47 118 95 178 189 75 114 223 108 117 153 35 78 18 97 114 59 146 102 121 70 105 71 105 204 239 181 150 107
-192A07
##PAGE=	F1=-2649.37
##FIRST=	25164.767445380970457,	5806.2096540000038658,	0
##DATA TABLE=	(F2++(Y..Y)), PROFILE
5806A18o3N9N9q0K5r7O4l%j0O4O5k0k7j22J7L1o0J50K2r3o6O1P1j4n6J39j14p3O2Q0M5J10
5419C44j23j19M7n0K25O9k82K2K2L1p7q2%Q5O2j03QK5J86j51q4O0J0J37n3m7M1r0p5P1L6k2
5043A23q3R5J28j34l0L7p1J20O6p7pJ5k2r9mMk9J8L3J1N2r1R6r9N1K5J0j7n6QN3k9O6j11P1
4632A23M2K1K6r3P5r9J44j73J08p2P3Qj18O5O2j24R9J23q2K7j9l9k5j03Q7J4J74j41O4j05
4280A42p4J28j4q0J35j16J38q9q6O6n2p0L6j2R3l0o8j7J0J7P5K35N0k34j12N8M1n0J6L2NP6
3905B49O3m4j32j15O4N3NP7j68K0l2Q7ol2k4j2K6P6n6J7P6k9j4OO2m7k5k1Q3j55M9j8J40j74
3506D9J58j06L0q4lk5J46L1q2P6n5J3K5j02J7l8J16Q7l7K2j00q1R0M4R7j33O2j12P9o0L3K2
3130A79N4r2p9K4O8J49k16P1oJ6O5j01q8O6K4o0L4P4K6k8o0p8O2j8jQ1j8J56k22K25r8PJ38
$$ plain form
5806 118 55 114 173 93 118 21 85 82 82 72 136 201 181 154 32 49 80 20 170 192 99 33 94 165 151 95 234 120 47 109 189 234 344
5419 344 221 102 149 99 324 393 111 133 155 186 109 27 27 112 174 71 79 104 290 139 55 115 125 262 209 162 203 113 38 109 145 123
5043 123 40 135 263 129 99 136 65 185 251 174 167 182 160 61 57 61 32 50 83 94 146 55 151 52 103 128 138 121 65 73 126 97 163 52 123
4632 123 165 186 212 119 194 95 239 66 174 102 175 183 65 130 192 68 167 290 208 235 216 177 152 49 136 150 324 183 247 142
4280 142 68 196 182 102 237 121 259 170 84 150 98 28 64 52 145 115 47 30 40 57 132 367 417 183 71 129 170 120 136 168 173 249
3905 249 312 268 136 21 85 138 143 220 52 72 40 127 121 89 65 53 79 155 99 116 192 163 149 155 217 170 145 124 207 52 101 83 223 49
3506 49 207 101 131 47 44 19 165 196 114 190 135 148 173 71 88 50 166 253 216 238 138 57 147 191 288 155 217 105 184 124 157 179
3130 179 233 141 62 86 154 303 87 158 152 168 233 132 44 110 134 74 108 182 208 180 120 42 104 86 85 166 148 304 82 307 209 216 354
2743C54j06k15M6k9M0J20k4p0k6Q3j9k6n8O1J03n7j35M2N2P5J2m4r4PJ13L8r3j34J38J73k08
2379A19O3O9q0j11K05j28J7Q6p9j21L1K4l0M9p3R5%j9o6K3J21k4qJ57j53O8k00J41l6J10p7
2015A73j49J71j9q7l7PM9no5J31K7M4k8m0l8q0L9K7P5q8q8J21J20o5r0J4O1o3Q5K4k4j58J95
1628B39j93J27rj50J04J6L8OO2j23J01R8j63k7q5P4rJ43j83O9j32J25J00j11R4j13J34J2q9
1287A55J55l6j97n4M8l8J24J04j74N8L8q6M3L0O4J59j89j59P3MJ8o6Ol8K4J0R5j2J9j57J16
923A37%oL9l4R9j86QJJ18N3k6j58P4L6j12N0m2R9J38J8j54K4j14M8Q7j52J15j01J94j17%K1
548A57q8N6Q0k8P2j39M1k3J09p3P2j10m3p6K13J4j36j2O9l2O9q9K2J73j19j59L3J05L8Mj6
184A84Mk7j16l8J11qM0L7j03K6J40j08k4M0p3j2n8J47m4o5Q7l1O6l3m7p%J12L9r3j9k7
$$ plain form
2743 354 248 33 79 50 90 210 186 116 90 173 154 128 70 131 234 177 42 84 136 211 223 179 85 92 205 243 150 16 154 327 119
2379 119 182 251 171 60 265 137 154 240 161 40 71 95 65 114 41 136 136 117 51 74 195 171 163 320 167 235 35 176 140 250 173
2015 173 24 195 176 89 52 59 108 103 38 169 196 240 212 172 134 54 93 120 195 107 19 140 260 195 105 119 180 117 202 226 202 44 239
1628 239 46 173 164 14 118 134 172 178 240 117 218 316 153 126 41 115 106 249 66 135 3 128 228 117 211 98 232 244 155
1287 155 310 274 77 23 71 33 157 261 87 145 183 97 140 170 234 393 204 45 118 122 140 74 80 42 66 76 171 159 178 21 137
923 137 137 131 170 136 235 49 57 58 176 229 203 45 119 155 43 93 51 150 288 306 152 176 62 110 197 45 160 59 253 136 136 157
548 157 69 125 205 177 249 110 151 128 237 164 236 126 83 7 220 234 98 86 155 123 192 103 125 298 179 20 53 158 196 200 184
184 184 188 161 45 7 118 110 150 187 84 110 250 142 118 158 85 73 15 162 118 53 140 109 175 142 95 88 88 200 239 146 127 100
-192A00
##PAGE=	F1=-2751.63
##FIRST=	25164.767445380970457,	5806.2096540000038658,	0
##DATA TABLE=	(F2++(Y..Y)), PROFILE
5806I5p0P8O8n7K9j23L0Q0m0K6K3M1k2n4p4nN8n1Q4O9j29k1N6J42n7j42J32p9j4k7J16Q4J21
5419C67j42j38Rm1K43N5k24L2qJ8p5p7K3P1O8j03P8l3J75j71m3j0L4J33n4n5K6n3n9N1L6K1
5043A54o7N9J13j41l3N3p6O8R9k3m5J6l8j28N7j0j5J2Jk9J19o0J3n0mM2K8J3l6J2O6o7O9j18
4644E4R5L7M7M4j20J2p6J80k25Q7qP1j4j49R0Q3j68J58R1q0Om6Jn9p7Q1J02J55j95L9o8q0
4269F8J30l2n3J30j32J74n0j36M8n9n6L2M4M7m4m3j9k2mQ0L13L2k65j06K8O0k5j0M7l5R2O7
3893C01n0j38r6jN5R0P7j92N6n5P2l4k5j3j6O2P2p8K7R6l5l5j6O2k2Kp3M9q4N0l2R3j00J78
3494B47j65jN7rj10J48L7j01Q5np9Q0r3M0l3M7Q1k3K6r2o2M8L2J14j21N7r8M1m3O4qM2r5r
3095I9MP8J45k26N8m6N4N5p9o2LLn0Q2P0M6jq8p5M5k7m2P1j7J73j75J82p3RJ01j32j75Q9o5
$$ plain form
5806 95 25 103 171 114 143 20 50 130 90 116 139 180 158 104 30 25 83 32 116 185 56 35 91 233 176 34 166 87 73 46 162 246 367
5419 367 225 87 96 55 298 353 129 161 153 171 96 19 42 113 181 78 156 123 298 127 84 74 108 241 187 132 158 105 46 97 133 154
5043 154 87 146 259 118 85 138 62 130 229 206 161 177 139 11 68 58 43 55 56 27 146 86 99 49 45 87 115 128 92 104 170 103 172 54
4644 54 149 186 233 277 157 169 93 273 48 135 127 198 184 35 125 208 40 198 289 209 215 169 170 111 34 115 217 372 177 216 148 68
4269 68 198 166 113 243 111 285 235 99 147 88 32 64 108 155 111 68 49 27 23 103 416 448 183 77 105 165 140 130 177 142 234 301
3893 301 251 113 17 16 71 161 238 46 102 47 119 85 60 47 31 93 165 87 114 210 175 140 124 186 164 166 93 142 58 108 76 169 69 247
3494 247 82 81 138 129 19 167 204 103 188 183 104 184 91 131 98 145 226 203 229 137 75 123 155 269 148 205 107 148 105 169 161 203 108 99
3095 99 103 181 326 100 158 112 166 221 142 80 83 86 36 118 188 234 233 145 70 115 88 46 117 100 273 98 280 207 216 317 185 10 99 34
2696C4O6P0kl2l5L0M0l8m1M4M8n2o7J5P5L5K3k5r0J1J00K3n7j29J14J37j78M1N6r0l9J79q8
2308A78r7J25o6q9MN3m5L7l9J22on2j06J4J41J3J2J57j84K5j40J36n1J18j01r2J19n6o6j3
1956E1M1m6O1j05J61N1L8k2p8r2N6K6k0P1p9m4M8J24m2j03qK7n6J32j6k9p0J49k21K08j4j59
1581D0M6N8M4l6O0j03J17R9j96Rj12J14k7J43j32rr7O8Q0m9J15j03N6M8r1J23l2j73k3N3l1
1217E9R7J36j43qQ7j35N7K1J8J45j63r5R3Lm4n5nk1k0J5N6N2J1j44R9L3m9M3j6J20j48l8L7
829I8P9N0m3j26N3M8j05N1n0J06J28j9j50N2j12N3R0j79J16m7J65j35L1K6j29O5P9k3R2j94
477G0Q8m3J08p8M3j07Lj2K11m5j52K4N5l4M5o4J2J73q2j64oJ10R2n7PJ8m8j26JM8K2M3K9r4
78I0J9J53q7n3K7k4n6l9J89j06o5Q3j0Q6oj27L3j1Q3L7j12oj6
$$ plain form
2696 34 100 170 168 136 101 131 171 133 92 136 184 132 65 80 155 190 213 188 98 109 209 232 175 46 160 297 119 160 216 126 87 266 178
2308 178 81 206 140 51 55 108 63 100 61 183 177 125 19 33 174 187 199 356 172 197 57 193 142 260 159 67 186 130 64 51
1956 51 92 46 107 2 163 214 252 230 152 60 116 142 122 193 114 70 118 242 200 97 89 116 60 192 176 147 77 226 5 213 199 40
1581 40 86 144 188 152 212 109 226 325 129 138 26 140 113 256 124 115 18 86 166 117 232 129 185 233 142 265 233 60 37 90 59
1217 59 156 292 149 141 228 93 150 171 189 334 171 76 169 172 128 73 68 47 27 42 98 150 161 17 116 149 100 143 127 247 99 61 98
829 98 177 227 184 58 111 159 54 105 55 161 289 270 120 172 60 113 203 24 140 93 258 123 154 180 51 116 195 172 264 70
477 70 158 115 223 145 188 81 84 72 283 238 86 110 165 131 176 112 124 297 215 51 45 155 247 190 197 215 167 41 42 90 112 155 184 90
78 90 109 262 175 122 149 125 69 30 219 113 48 131 121 207 201 74 107 96 179 216 104 98 82
-192H2
##PAGE=	F1=-2853.88
##FIRST=	25164.767445380970457,	5806.2096540000038658,	0
##DATA TABLE=	(F2++(Y..Y)), PROFILE
5806G3m2O0P3l1K1j11L9Q5p3O4k0Rj4r9jpN7n2J8R5j07L8J5K03r3p0k9m5K1l6P6J14J16j38
5407B09o9qr7K22K3j15L1m5qp3j9N5qQ5q8J23j02J78j61k7o7N4J12n2m7J5j4n7M5L0M2m2N
5020A30J09j23NN4j27M8R1L1p5Rn0o9L9j0%rP0o6P2k9nJ0p8K8L1L3rJ1Q0r8O9j04R9L1N6P2
4597C26j20p3l8K02k22J0N1O1j8j72Q7R1j51J76M4m8Jp8M4r4n2P2J64J25k22Rl8n7J14m1m1
4233A12J18j37K00Qj89K7k3q5N7Q0on2j7l3m1N1NL62Nk74q2OL5Qj2N0o0R5N4m4j37k1%l6J48
3823A72O9k05J05p8N9o0m4J0j0Q7M9q3M0J06m2o6k0P1NK2r0k5L4km0N3k4J80k00n3J97j1j63
3435D3J37K5j25J07M8j59J25q1J6j6rR5oJ6p6m1qRJ20q2M1q0J6k3P8k6J4r1N8pP0J28k10M4
3036A50p1Q9J6l8k0o0k0J1P6M8M4M1r0q4L0j5l2ml0J80r1J01m1L0L9j67o2P5p7P2K8OJ4mm5
$$ plain form
5806 73 31 91 164 133 154 43 82 167 94 158 138 147 133 34 33 26 83 31 49 144 37 75 90 293 200 130 101 56 77 41 117 231 347 209
5407 209 140 132 35 257 280 165 196 151 143 70 51 106 98 183 95 218 116 294 133 106 39 93 205 153 106 121 107 50 95 125 167 125 130
5020 130 239 116 121 175 48 96 187 218 143 152 102 33 72 62 62 53 123 57 129 100 95 105 27 55 86 119 110 121 201 103 172 68 167 198 254 326
4597 326 206 133 95 297 75 85 136 197 179 7 94 185 34 210 254 206 207 129 173 79 27 99 263 388 166 175 137 80 194 153 112
4233 112 230 93 293 301 112 139 116 31 88 168 162 110 93 60 19 70 75 437 442 168 86 92 127 135 123 173 113 208 262 218 81 60 60 24 172
3823 172 241 36 141 63 122 62 18 28 18 105 154 71 111 217 175 109 89 160 165 187 97 72 106 104 64 117 93 273 73 20 217 206 43
3435 43 180 205 80 187 235 76 201 120 136 120 111 206 200 216 140 99 91 100 220 138 179 99 115 92 170 144 158 67 125 118 188 316 106 150
3036 150 79 168 184 146 126 66 46 57 133 181 225 266 176 92 122 107 75 71 41 221 130 231 190 220 259 92 30 105 28 100 128 134 148 144 99
$$ [...]
-192D7
##END NTUPLES=	nD NMR SPECTRUM
##END=	
##END=	
