##TITLE=	Nov02-2021.62.ser
TM-VI-147 hsqc

##JCAMP-DX=	6.0	$$ MestReNova 14.3.0-30573
##DATA TYPE=	LINK
##BLOCK_ID=	1
##BLOCKS=	2    
##ORIGIN=	Mestrelab Research S.L.
##OWNER=	hrzepa
##$MNOVA/LINK_BLOCK_TYPE=	ITEM	$$ NMR Spectrum
##$MNOVA/ITEM/POLYGON=	(XY..XY)
5321,5835
8722,5835
8722,8208
5321,8208
5321,5835
##$MNOVA/ITEM/Z=	0
##$MNOVA/ITEM/ANGLE=	0
##TITLE=	Nov02-2021.62.ser
##JCAMP-DX=	6.0	$$ MestReNova 14.3.0-30573
##BLOCK_ID=	2
##DATA TYPE=	MNOVA NMR VIEW DATA
##DATA CLASS=	MNOVA VIEW DATA
##$MNOVA/2D/THRESHOLD=	3.3020381927490234375
##$MNOVA/ITEM/ZOOM/X=	-0.57569381887933257502,	10.597560000003785063
##$MNOVA/ITEM/ZOOM/Y=	-9.5463849045685140737,	230.0176000018207958
##END=	
##TITLE=	Nov02-2021.62.ser
##JCAMP-DX=	6.0	$$ MestReNova 14.3.0-30573
##BLOCK_ID=	3
##DATA TYPE=	nD NMR SPECTRUM
##DATA CLASS=	NTUPLES
##NUMDIM=	2
##ORIGIN=	Bruker BioSpin GmbH
##OWNER=	nmr
##.OBSERVE FREQUENCY=	400.20200099999999566
##.OBSERVE NUCLEUS=	^1H
##.SOLVENT NAME=	CDCl3
##.PULSE SEQUENCE=	hsqcetgpsi2.ph
##LONGDATE=	2021/11/02 17:42:00.000
##.ACQUISITIONMODE=	SIMULTANEOUS (DQD)
##$ORIGINAL FORMAT=	Bruker XWIN-NMR
##$MNOVA/SCALES_VERSION=	9
##$PARAMETER FILE=	(acqu2s, ASCII, /private/var/folders/f6/rjf_tdyn2v98c5c0wvkgn4s80000gn/T/FAeVI8WOT$iS0PHWhMaCpg/62/acqu2s, 0)
$$ ##TITLE= Parameter file, TOPSPIN		Version 3.2
$$ ##JCAMPDX= 5.0
$$ ##DATATYPE= Parameter Values
$$ ##NPOINTS= 241	$$ modification sequence number
$$ ##ORIGIN= Bruker BioSpin GmbH
$$ ##OWNER= nmr
$$ $$ 2021-11-02 17:51:09.303 +0000  nmr@CZC2439F63
$$ $$ /opt/topspin/data/agmb/nmr/Nov02-2021/62/acqu2s
$$ $$ process /opt/topspin3.2/prog/mod/go
$$ ##$ACQT0= 0
$$ ##$BF1= 100.63037
$$ ##$FnMODE= 6
$$ ##$NUC1= <13C>
$$ ##$NusJSP= 0
$$ ##$NusT2= 1
$$ ##$NusTD= 240
$$ ##$O1= 11069.4607123918
$$ ##$SFO1= 100.641439460712
$$ ##$SW= 240.006397974962
$$ ##$SW_h= 24154.5893719807
$$ ##$TD= 240
$$ ##END=
$$ 
##$PARAMETER FILE=	(acqus, ASCII, /private/var/folders/f6/rjf_tdyn2v98c5c0wvkgn4s80000gn/T/FAeVI8WOT$iS0PHWhMaCpg/62/acqus, 0)
$$ ##TITLE= Parameter file, TOPSPIN		Version 3.2
$$ ##JCAMPDX= 5.0
$$ ##DATATYPE= Parameter Values
$$ ##NPOINTS= 12	$$ modification sequence number
$$ ##ORIGIN= Bruker BioSpin GmbH
$$ ##OWNER= nmr
$$ $$ 2021-11-02 17:51:12.724 +0000  nmr@CZC2439F63
$$ $$ /opt/topspin/data/agmb/nmr/Nov02-2021/62/acqus
$$ $$ process /opt/topspin3.2/prog/mod/shimcntl
$$ ##$ACQT0= 1000000
$$ ##$AMP= (0..31)
$$ 100 100 100 100 100 100 100 100 100 100 100 100 100 100 100 100 100 100
$$ 100 100 100 100 100 100 100 100 100 100 100 100 100 100
$$ ##$AMPCOIL= (0..19)
$$ 0 0 0 0 0 0 0 0 0 0 0 0 0 0 0 0 0 0 0 0
$$ ##$ANAVPT= -1
$$ ##$AQSEQ= 0
$$ ##$AQ_mod= 3
$$ ##$AUNM= <au_zg>
$$ ##$AUTOPOS= <33 >
$$ ##$BF1= 400.2
$$ ##$BF2= 100.63037
$$ ##$BF3= 400.2
$$ ##$BF4= 400.2
$$ ##$BF5= 400.2
$$ ##$BF6= 400.2
$$ ##$BF7= 400.2
$$ ##$BF8= 400.2
$$ ##$BYTORDA= 0
$$ ##$CAGPARS= (0..11)
$$ 0 0 0 0 0 0 0 0 0 0 0 0
$$ ##$CFDGTYP= 0
$$ ##$CFRGTYP= 9
$$ ##$CHEMSTR= <none>
$$ ##$CNST= (0..63)
$$ [...]
$$ 0 0 0 0
$$ ##$ShimPowMaxUC= (0..63)
$$ 130000 130000 130000 130000 130000 130000 130000 130000 130000 130000 130000
$$ 130000 130000 130000 130000 130000 130000 130000 130000 130000 0 0 0 0
$$ 0 0 0 0 0 0 0 0 0 0 0 0 0 0 0 0 0 0 0 0 0 0 0 0 0 0 0 0 0 0 0 0 0 0 0 0
$$ 0 0 0 0
$$ ##$ShimPowMaxUG= (0..63)
$$ 524287 524287 524287 524287 524287 524287 524287 524287 524287 524287 524287
$$ 524287 524287 524287 524287 524287 524287 524287 524287 524287 0 0 0 0
$$ 0 0 0 0 0 0 0 0 0 0 0 0 0 0 0 0 0 0 0 0 0 0 0 0 0 0 0 0 0 0 0 0 0 0 0 0
$$ 0 0 0 0
$$ ##$ShimPowRcbType= 3
$$ ##$ShimPowRes= (0..63)
$$ 1e-20 1e-20 1e-20 1e-20 1e-20 1e-20 1e-20 1e-20 1e-20 1e-20 1e-20 1e-20
$$ 1e-20 1e-20 1e-20 1e-20 1e-20 1e-20 1e-20 1e-20 0 0 0 0 0 0 0 0 0 0 0 0
$$ 0 0 0 0 0 0 0 0 0 0 0 0 0 0 0 0 0 0 0 0 0 0 0 0 0 0 0 0 0 0 0 0
$$ ##$ShimPowRng0= (0..63)
$$ 1 1 1 1 1 1 1 1 1 1 1 1 1 1 1 1 1 1 1 1 0 0 0 0 0 0 0 0 0 0 0 0 0 0 0 0
$$ 0 0 0 0 0 0 0 0 0 0 0 0 0 0 0 0 0 0 0 0 0 0 0 0 0 0 0 0
$$ ##$ShimPowRng1= (0..63)
$$ 1 1 1 1 1 1 1 1 1 1 1 1 1 1 1 1 1 1 1 1 0 0 0 0 0 0 0 0 0 0 0 0 0 0 0 0
$$ 0 0 0 0 0 0 0 0 0 0 0 0 0 0 0 0 0 0 0 0 0 0 0 0 0 0 0 0
$$ ##$ShimPowRng2= (0..63)
$$ 1 1 1 1 1 1 1 1 1 1 1 1 1 1 1 1 1 1 1 1 0 0 0 0 0 0 0 0 0 0 0 0 0 0 0 0
$$ 0 0 0 0 0 0 0 0 0 0 0 0 0 0 0 0 0 0 0 0 0 0 0 0 0 0 0 0
$$ ##$ShimPowRng3= (0..63)
$$ 1 1 1 1 1 1 1 1 1 1 1 1 1 1 1 1 1 1 1 1 0 0 0 0 0 0 0 0 0 0 0 0 0 0 0 0
$$ 0 0 0 0 0 0 0 0 0 0 0 0 0 0 0 0 0 0 0 0 0 0 0 0 0 0 0 0
$$ ##$ShimSysFunc= (0..63)
$$ 1 2 3 4 5 7 9 11 15 16 8 10 12 14 6 17 13 18 19 20 0 0 0 0 0 0 0 0 0 0
$$ 0 0 0 0 0 0 0 0 0 0 0 0 0 0 0 0 0 0 0 0 0 0 0 0 0 0 0 0 0 0 0 0 0 0
$$ ##$ShimSysMatrix= 0
$$ ##$ShimSysType= 1
$$ ##$TFXNUM= 0
$$ ##$TRIPLO2= 0
$$ ##$VTU= 2
$$ ##$VTUETH= <149.236.99.20>
$$ ##$VTUTY= <no>
$$ ##$WBREFAM= (0..15)
$$ 135.5 97.7 100 100 100 100 100 100 100 100 100 100 100 100 100 100
$$ ##$WBREFLM= (0..15)
$$ 0 0 0 0 0 0 0 0 0 0 0 0 0 0 0 0
$$ ##$WBREFPH= (0..15)
$$ 72.26 -67.22 0 0 0 0 0 0 0 0 0 0 0 0 0 0
$$ ##$WBSGU= (0..15)
$$ 0 0 0 0 0 0 0 0 0 0 0 0 0 0 0 0
$$ ##$XFAC= 2
$$ ##END=
$$ 
##$DECIM=	4464
##$DSPFVS=	20
##.ACQUISITIONSCHEME=	ECHO-ANTIECHO
##NTUPLES=	nD NMR SPECTRUM
##VAR_NAME=	FREQUENCY1,	FREQUENCY2,	SPECTRUM
##SYMBOL=	F1,	F2,	Y
##.NUCLEUS=	13C,	1H
##.OBSERVE FREQUENCY=	100.64143946071199309,	400.20200099999999566
##VAR_TYPE=	INDEPENDENT,	INDEPENDENT,	DEPENDENT
##VAR_FORM=	AFFN,	AFFN,	ASDF
##VAR_DIM=	512,	512,	262144
##UNITS=	HZ,	HZ,	ARBITRARY UNITS
##FIRST=	23146.756194512010552,	4241.1435120000014649,	0.10426351428031921387
##LAST=	-960.65624510154020754,	-230.39266631542668051,	0.57575333118438720703
##MIN=	-960.65624510154020754,	-230.39266631542668051,	-1.545782923698425293
##MAX=	23146.756194512010552,	4241.1435120000014649,	18.074083328247070313
##FACTOR=	1,	1,	0.0048058883838516530673
##PAGE=	F1=23146.8
##FIRST=	23146.756194512010552,	4241.1435120000014649,	0.10426351428031921387
##DATA TABLE=	(F2++(Y..Y)), PROFILE
$$ [...]
##PAGE=	F1=4747.75
##FIRST=	23146.756194512010552,	4241.1435120000014649,	0.12017855048179626465
##DATA TABLE=	(F2++(Y..Y)), PROFILE
3366a5j64J37J23k6jk9m4n6O9n0J47n8K1j5l0m6J23m5j37N7Q8Pk8l9M2m0l0J0L2n8J21o8p2
$$ -15 -179 -42 81 55 54 25 -19 -75 -6 -56 91 33 54 39 9 -37 86 41 -96 -39 49 56 28 -11 31 -9 -39 -29 3 -55 66 -2 -74
3077g4J12k04O7J49q4L1J15p9l3L5r0M2L8r9K34j89J1J18o3m6P1j37J05j22j9o0J02L0J36
$$ -74 38 -166 -99 50 -34 -3 112 33 0 35 -55 -13 25 -74 160 -29 -18 100 37 -9 62 -75 30 -92 -111 -171 -69 -39 97
2824I7j54k8j5K15q6N3j36P1nL0J3J8j12P5q2L1J5j9k4R5j19J81k08R4Q4J1jk2o1l0M8p4P9
$$ 97 -57 -85 -100 115 29 82 -54 17 12 42 55 73 -39 36 -46 -15 0 -19 -43 52 -67 114 -94 0 84 95 94 72 11 -19 29 -45 34
2535C4n1n2N6R8k6k3j12J07j2J07J5k2n6q5L1N0K5p6P3p8MK9Nk7J07j0r2m7L1M2p2r9J50k5
$$ 34 -17 -69 -13 85 59 36 -76 31 19 126 141 119 63 -22 9 59 84 8 81 3 7 36 41 14 121 111 19 -28 3 45 -27 -126 24 -1
2237aO3p3p9J02jn2N6K5n8k2J01n3j5j18J10pM7no2O2p3J8Q6Jj04nK1n1L2L9P9k9j04P6O0
$$ -1 62 -11 -90 12 11 -41 15 40 -18 -40 61 8 -7 -125 -15 -22 25 20 -42 20 -53 -35 51 52 -52 -57 -36 -87 -55 -16 63 34 -70 6 66
1931F6K6p2K6rK2p8n7J4j56J18L2N3Mj18N1J08Rm5Mj1r2J37l0k2l5J27J33k41K2K2j21J86
$$ 66 92 20 46 37 59 -19 -76 -62 -218 -100 -68 -15 -11 -129 -78 30 39 -6 -2 -13 -105 32 2 -20 -55 72 205 -36 -14 8 -113 73
1651G3j83J25M5j73K42q6r9J13M4r8K3j05J54l1O6o3K0j44J35l3K06k31k3J11q8L7j02J6j16
$$ 73 -110 15 60 -113 129 43 -56 57 101 3 26 -79 75 44 110 47 67 -77 58 25 231 0 -23 88 0 37 -65 -49 -165
1397a65O3O2m0M3J7RR2q6K7r4J58J03j07pj00J25j01k3j8L8q3j2R8j17J42l0J4k0J6q1RM9
$$ -165 -102 -40 -80 -37 -20 -11 81 -5 22 -72 86 189 82 75 -25 100 -1 -24 -42 -4 -87 -99 -1 -118 24 -6 8 -12 4 -77 -68 -19
1117a9R8k1r1Ml7L8m9J00j64MJ76m4Kk28R9K63r5m7PM6L4o3l7J8n7K5O6q4J08q0q7Q4mK5K6
$$ -19 79 58 -33 -29 -66 -28 -77 23 -141 -137 39 -5 -3 -231 -132 131 36 -11 -4 42 76 13 -24 -6 -63 -38 28 -56 52 -28 -115 -31 -35 -10 16
811A6M7P4L5n5r2n6M4N9j9k1j61Q6k0N7l7J2k4Q4l4J05j45J0K4oN9l9j05O9J22l9M5j22q3
$$ 16 63 137 172 117 25 -31 13 72 53 32 -129 -43 -63 -6 -43 -31 -55 29 -5 100 -45 -35 -11 -17 42 3 -102 -33 89 50 95 -27 -110
522a10M6J83j09j28J21j30M6k4Q1R3o6J7k7J0l4R6n4o4P2r9J13K8J7J20j14n3M3j86K40r7
$$ -110 -64 119 10 -118 3 -127 -81 -105 -24 69 3 20 -7 3 -31 65 11 -53 19 -80 33 61 78 198 84 31 74 -112 128 31
260C1q4R7p4r5MN9J53n0Pj40O0Q7j18O6k5o5P5R3j06K2Q0m1K3j26P2P4k6j53m1J38J9Mq9J10
$$ 31 -53 44 -30 -125 -121 -62 91 41 48 -92 -32 55 -63 3 -22 -87 -12 81 -25 -3 77 36 59 -67 5 79 53 -100 -141 -3 16 20 -69 41
-38D1l6p0J81r8n9N4J8n9J51p8q0J60r0j0p9N1L1O5j39J05n7l0
$$ 41 5 -65 116 18 -41 13 31 -28 123 45 -35 125 35 25 -54 -3 28 93 -46 59 2 -28
-230b8
##PAGE=	F1=4653.4
##FIRST=	23146.756194512010552,	4241.1435120000014649,	-0.062361933290958404541
##DATA TABLE=	(F2++(Y..Y)), PROFILE
4241h3Q5O2r7oP6o8j9M9O0o5Rj9k7K9j0qJ00l3l0J0j04o3J19lR2j35k0l6J61Q3rk8p1J6P7
$$ -83 2 64 -33 -39 37 -31 -50 -1 59 -6 3 -16 -43 -14 -24 -32 68 35 5 15 -89 -152 -33 -36 56 -79 -99 -135 26 109 100 72 1 17 94
3935I4J4p5m5J7R4q4q2K2J0J13j33N3L1m1k1j4QJ26l1K6j16M1M6n7On9K2o5J53p9J3L6Q3r3
$$ 94 108 33 -12 5 99 15 -67 -45 -35 78 -55 -2 29 -12 -33 -47 -39 87 56 82 -34 7 53 -4 2 -57 -35 -100 53 -26 -13 23 106 13
3637A3M2n5M1k3m2Jl5l3P9r8P9P6m3j3j5K4j13m6J02Q9Kj02k6J31L2l6k7M4p7j06J47k17J70
$$ 13 55 0 41 18 -24 -23 -58 -91 -12 -110 -31 45 2 -11 -26 -2 -115 -161 -59 30 32 -70 -96 35 67 31 4 48 -29 -135 12 -205 -35
3349c5Q4On5K4j02jJ37j44J26l8O1l1K4j20J27K1j33K8P3K0o3j5K2o5lN0Rl8Q1m3j01J31k19
$$ -35 49 55 0 24 -78 -79 58 -86 40 2 63 32 56 -64 63 84 -49 -21 52 72 9 -6 16 -49 -52 -2 7 -31 50 7 -94 37 -182
3060a82P3J67q5K1J29m5m4j1j37J05Jj03K58j90lJ39j0n5l8qO4j42j7rM6k0J82j09k0q6K71
$$ -182 -109 58 -27 -6 123 78 34 23 -114 -9 -8 -111 147 -43 -46 93 83 28 -10 -18 46 -96 -113 -122 -76 -96 86 -23 -43 -129 142
2789A42j33N1r6J17k9M0l7J3r3J1l8k0P7lJ1O8j90J94j94R8Q6j2M8qq6o4J03l7L9p9o9O5J37
$$ 142 9 60 -36 81 52 92 55 68 -25 -14 -52 -72 5 2 13 81 -109 85 -109 -11 75 63 111 103 17 -47 56 19 58 -21 -90 -25 112
2500A12j36N3j12R9JR2QJ3q5m5j1N3N0r9O0p7pP3l8J2J36n7q6n0pO9l7j17J64JM2j15k8P5
$$ 112 -24 29 -83 16 17 109 117 130 45 0 -11 42 92 -7 53 -24 -31 42 4 16 152 95 9 -41 -48 21 -16 -133 31 32 74 -41 -69 6
2202FJ8K2o5N2m8m0J12m8K6j53J46k5J0mk8K3l5LL7K0q1%J7o1M7NJ08k6j03Q2k2Q3j05O2j7
$$ 6 24 46 -19 33 -15 -55 57 9 35 -118 28 3 13 9 -19 4 -31 -28 9 29 -52 -52 -35 -96 -49 -44 64 38 -65 17 -5 78 -27 35 18
1896A8Mo4n8M6j25O6M9Q0p7n2O6Q6j4l2k8J3r2J24Jp1k5J05J65k09j9J09j83J42p3J01K0j75
$$ 18 22 -42 -100 -54 -179 -113 -64 16 -61 -113 -47 39 25 -7 -35 -22 -114 10 11 -60 -85 20 185 -24 -43 66 -117 25 -48 53 73 -102
1616a02K32q9j09J41L7j09J0j02J45K5L6q1O3j46Q7OJ75k68K8P1n2J7m2N2j21n9M8N9M1pJ6
$$ -102 130 41 -68 73 110 1 11 -91 54 79 115 34 97 -49 38 44 219 -49 -21 50 -2 15 -27 25 -96 -155 -107 -48 -7 -14 2
1345BK7l2Mj28J81J21j09K0j43J25p8j7jK3q2lJ48j26Q5l7O9l1k0p4J2Q6P3m6n7m2j6L5o2
$$ 2 29 -3 1 -127 54 175 66 86 -57 68 -10 -27 -28 -5 -87 -90 58 -68 17 -20 49 18 -2 -76 -64 22 95 49 -8 -50 -66 -31 -93
1056i3R8j63N7J30o1K1k25J34K57j10j4l2L1N3p7l8K6p4R2N4j06R2p1m9O3l5K6N3O9K4M1k8
$$ -93 5 -158 -101 29 -32 -11 -236 -102 155 45 31 -1 30 83 6 -32 -6 -80 12 66 -40 52 -19 -68 -5 -40 -14 39 108 132 173 145
776A45j65k4NJ12j6o4j24R4j8Q2j5n6L1L7j9O7j34KK3J1N6K0j33J0J08m1N7p8l0J3J53j14
$$ 145 -20 -44 -39 73 57 -7 -131 -37 -55 27 12 -44 -13 24 5 72 -62 -60 -37 -26 30 50 -83 -73 35 -6 51 -27 -57 -44 109 -5
496ej06J67j43nj7J20P3r7L1j5nkkJ6m0K0p6Q8L5J0J18r6O%j84K32j62l5J08r2r3O6O7Q3n0
$$ -5 -111 56 -87 -92 -109 11 84 -13 18 3 -2 -4 -6 10 -30 -10 -86 2 37 47 165 69 75 75 -109 123 -39 -74 34 -58 -151 -85 -18 65 15
190A5Pp3J9P2o8LM9n1J8Q6r6M5N3LOk00J17M0O5j87n2J11R7m8p5Q2jj10K01p7r6J9N8p2R8
$$ 15 22 -51 -32 40 -28 -25 24 -27 -9 77 -19 26 79 82 88 -112 5 45 110 -77 -129 -18 79 31 -44 38 37 -73 128 51 -45 -26 32 -40 58
-117E8rq7J27q5J4o6P2QO8j49O8m6L9
$$ 58 49 -38 89 4 18 -48 24 32 100 -49 19 -27 12
-230A2
##PAGE=	F1=4559.04
##FIRST=	23146.756194512010552,	4241.1435120000014649,	-0.38309508562088012695
##DATA TABLE=	(F2++(Y..Y)), PROFILE
4241e9N9M9j24K5J20j08J6O3L0q8nJ7j1j3j5M9L4o2kK8p4n4Q0pJ01j02m5qJ09Q7%k2j17K7
$$ -59 0 49 -75 -50 70 -38 -22 41 71 -17 -22 -5 -16 -29 -44 5 39 -23 -25 3 -71 -125 -45 -52 49 -53 -98 -106 3 90 90 68 -49 -22
3944b2R9Jo0p3N3J11q5l2m1RJ18r8MM5k5L1o2r1J82n0J09j23j2J7m4L1j1l4j10J87l1L1J5
$$ -22 77 78 18 -55 -2 109 24 -8 -49 -40 78 -20 -16 29 4 35 -27 -118 64 14 123 0 -12 5 -39 -8 -19 -53 -163 24 -7 24 39
3655C9O5m2Lm3o0M7n5K0n9k9J30j05Q2N1o9j1L7J4j54%O3J01k0l8n8J23k6L8m6L9p8o4J29
$$ 39 104 62 65 22 -38 9 -46 -26 -85 -114 16 -89 -7 44 -25 -36 1 15 -139 -139 -76 25 5 -33 -91 32 6 44 -2 37 -41 -105 24
3366B4k13J63L4K9j03O6j23N7J53j64O7%P7k1P0k11J16O8o3rJ7M5q4kk0l8J6O4j2j6L1rj37
$$ 24 -189 -26 8 37 -66 0 -123 -66 87 -77 -10 -10 67 46 116 -95 21 89 26 17 34 79 -5 -7 -27 -65 -49 15 3 -13 18 9 -128
3077a28J68j33O5R6o7k0J07J8m5o1j24J33m1q3K34j62oJ17M2l2j37J00Rj43j4L9Jn0J81l8
$$ -128 40 -93 -28 68 1 -19 88 106 61 0 -124 9 -32 -115 119 -43 -49 68 110 78 -59 41 50 -93 -107 -68 -67 -117 64 26
2815B6l3j32K77j38L0n1J69n2L0o6j6p7l4j1n4J16J8M8M8k32J51j26J04Q5n1O6K1q7q9J32
$$ 26 -7 -139 138 0 30 -21 148 96 126 60 44 -33 -67 -78 -132 -16 2 50 98 -134 17 -109 -5 80 29 95 116 29 -60 72
2552G2K3l8p9p7O9J29k36J67j01O5J2Q8l1O9r8Jo6KJ06j01M3o6j2J25j04N8J39p7q2m5k7P0
$$ 72 95 57 -22 -99 -30 99 -137 30 -71 -6 6 94 63 132 34 35 -31 -29 77 -24 19 -47 -59 66 -38 20 159 82 0 -45 -72 -2
2272bpj20J60K0J1j09K2M5OP1j40O8n3l8J14k0N1j68J34nl4l6L5prj9PM0p2J9ol5L9l2J28
$$ -2 -9 -129 31 51 62 -47 -25 20 26 97 -43 25 -28 -66 48 28 79 -89 45 40 6 -30 5 -2 -11 -30 -23 17 -55 -36 -42 -77 -38 -70 58
1966E8pr9R9j37J40j32J27n2k7m2l6P2q2%P8J17j69%Q0N5k1j9p7L0n6P6M0q2j6O1J58j39n2
$$ 58 51 -48 51 -86 54 -78 49 -3 -30 -72 -108 -36 -118 -118 -40 77 -92 -92 -12 43 22 3 -74 -44 -100 -24 16 -66 -82 -21 137 -2 -54
1677e4J74k57J10L0N9K7j50J51p1p8J48J2r9j3p5J14Q2K0q5N3j21M4lJ22k37P4K7k2jL1R3
$$ -54 120 -137 -27 3 62 89 -61 90 19 -59 89 101 2 -11 -86 28 110 130 45 98 -23 21 18 140 -97 -23 4 -18 -19 12 105
1406A05j50j44L9J26N0n9L3k2K3j8j31J66J39j20N9j61R3k7k9LL8p2j4J59j21L8l2Q7k1k4
$$ 105 -45 -189 -150 -24 26 -33 0 -22 1 -17 -148 18 157 37 96 -65 28 1 -28 -25 13 -59 -73 86 -35 3 -29 58 37 13
1143A3q0L0J07J5r0Pq9L1K7n8N7j38J25N6p5L6j77J42K25j20Ln8L3O3p5k8K0p6J49J3q4L6
$$ 13 -67 -37 70 85 -5 2 -87 -56 -29 -87 -30 -168 -43 13 -62 -26 -203 -61 164 44 47 -11 22 85 10 -18 2 -74 75 88 4 40
863D0m9l5M1m4RQ5J07l5L7Mk18j5j3J45k2q0o6R5j5M9K9q0M1OkJ0j16L1LLP7M1j36nR2o2O1
$$ 40 -9 -44 -3 -47 -38 47 154 119 156 160 -58 -73 -86 59 37 -43 -109 -14 -29 20 49 -31 10 16 14 24 -92 -61 -58 -55 22 63 -73 -78 14 -48 13
540A3n8K9kJ11j29m3J74j41m6jJ12P7j16L7Jl5M0r8O1J4k3n7L0N4QP9o1P6l7j11J60k07J1
$$ 13 -45 -16 -18 93 -36 -79 95 -46 -92 -93 19 96 -20 17 18 -17 23 -75 -14 0 -23 -80 -50 4 12 91 30 106 69 -42 118 -89 -78
251g8J03j10o5J21K5K6j9k5mPO2m9n0J40k9l2L1n7M6L5L2k6k49J69RJ41k09n1Q2J28p6o6O5
$$ -78 25 -85 -150 -29 -4 22 3 -22 -26 -19 43 -6 -56 84 55 23 54 -3 43 78 110 84 -165 4 13 154 -55 -106 -24 104 28 -38 27
-38B7L1j26K03n0j12l2P8p0N5N6r2Q9o9K7o8J25m9P9j31J8l2J03
$$ 27 58 -68 135 85 -27 -59 19 -51 4 60 -32 57 -12 15 -53 72 23 102 -29 -11 -43 60
-230F0
##PAGE=	F1=4464.69
##FIRST=	23146.756194512010552,	4241.1435120000014649,	-0.3747755587100982666
##DATA TABLE=	(F2++(Y..Y)), PROFILE
4241c5M1J9j42M7J46j20O3N4l5o7j0K7J2k0j9R5j6j17K8L6l3l1K7j3Q5o1n5K3M9N2K7pj37
$$ -35 6 25 -117 -70 76 -44 19 73 38 -29 -39 -12 0 -20 -39 56 40 -77 -49 -13 -46 -77 -50 -63 22 -39 -94 -71 -22 30 57 50 -87
3952h7L1J22Np6r9R0J20m5Pj14jJ35o6m2K8L4N2j09j59J94k6J60j24l6j7n0P5Qr1j24K03M
$$ -87 -56 66 71 -5 -104 -14 106 61 68 -46 -47 88 22 -20 8 42 94 -15 -174 20 -6 154 30 -6 -23 -73 2 10 -81 -205 -2 2
3672BL9LL7J3m5l0j32J14o6K5n6m0J55r4P9K0q0nQ1J2j70N2J6Q9k1J8r2O8l6J00n2K4n9k7
$$ 2 41 44 81 94 49 19 -113 1 -65 -40 -96 -136 19 -75 4 24 -56 -61 20 32 -138 -86 -70 19 -2 16 -76 -8 -44 56 4 28 -31 -58
3375e8P7j60J21PK1j38R0r7R0J27j28J2M1O7RQ3k87J13N6M4j9p2P6q8nn5J5K7L6k2mJJ7j51
$$ -58 19 -141 -20 -13 8 -130 -40 -137 -47 80 -48 -36 5 72 81 164 -123 -10 46 90 71 -1 75 -13 -18 -73 -58 -31 5 -17 -21 -20 -3 -154
3077a54J97q7P2L5l2p2N6P7j8r2o0J00o6m7J69j19J5N7P0J7j91J63n3j07oM2j0m3J34J5n8
$$ -154 43 -44 28 63 31 -41 15 92 74 -18 -78 22 -44 -91 78 -41 -26 31 101 118 -73 90 37 -70 -76 -34 -44 -87 47 62 4
2806Dj38K44j22K3l6K05o0K0o7n4p3n3pn3J26K4P2N7k41O0l3J13P7p8M9M3n4j10J21Q5j12
$$ 4 -134 110 -12 11 -25 180 120 140 73 19 -54 -107 -114 -167 -41 -17 55 112 -129 -69 -102 11 88 10 59 102 48 -62 59 144 32
2535C2n8n6M5Q9k85K75p7QK7Q3p6J18r5M6j32o0J53o4K4m5k0J61j71J12J07n9r7m0j3M1J4
$$ 32 -26 -82 -37 52 -233 42 -35 -27 0 83 7 125 30 76 -56 -116 37 -27 -3 -48 -68 93 -78 34 141 82 -15 -55 -68 -27 -13
2264a3r6J30K9rp9M9L7m6R9j49P0p5pQ5J7N7j43P9L1o2p4R2j4Nn4K0M5p0M2k9pJ9m6J20Qq7
$$ -13 -109 21 50 41 -38 11 48 2 101 -48 22 -53 -60 25 42 99 -44 35 66 4 -70 22 8 13 -41 -21 24 -46 -4 -33 -40 -21 -67 53 61 -26
1948b6J10k24J64j23J82j03n1k4KQ1l8n6Q5J52k22J6R7J1llj24L0K4mO2n5mK0J02n2o0J76
$$ -26 84 -140 24 -99 83 -20 -71 -95 -93 -12 -50 -106 -21 131 -91 -75 22 33 30 27 -97 -67 -43 -47 15 -40 -44 -24 78 26 -34 142
1668A42k96R4P3K2O8j21L9k8k0J21k1o4m8k8O5J24J3o0mp6J2m4O3j57J05Ml5MQ6J22j84j77
$$ 142 -154 -60 13 35 103 -18 21 -7 -27 94 73 9 -39 -67 -2 122 135 75 71 -5 7 -37 26 -131 -26 -22 -57 -53 33 155 -29 -206
1388b06N1J40O4j25N3k9N4l5q3J06J45j28Q2j42N3L3n3j0O6n2l9J31j05K3k8P8qNj07P1J05
$$ -206 -155 -15 49 -76 -23 -52 2 -33 -116 -10 135 7 89 -53 0 33 -20 -30 36 -16 -55 76 -29 -6 -34 44 36 41 -66 5 110
1117A10o1j34Q0j07P6Nk8jj21J95k0q1M3j05J24J82j19ln9L9O9n7j6pn0J81n0k8m0j2n7L0
$$ 110 49 -85 -5 -112 -36 -31 -59 -60 -181 14 -6 -87 -44 -149 -25 157 38 35 -24 15 84 27 11 4 -46 135 85 57 17 5 -52 -22
837b2l2k2J08J30n8K7K8k15m0pJ40l1p5pR0j5j5P7o1NJQm0r8R0l2l0J06L8j07K2O5r6O1o0
$$ -22 -54 -76 32 162 104 131 159 -56 -96 -103 37 6 -69 -76 14 -1 -16 61 0 5 6 14 -26 -124 -34 -66 -96 10 48 -59 -37 28 -68 -7 -67
531f7O7oQ1j57L1J63j28o8J4O8R5j21M0K4p7P1j41O0P2k5o0m6R9LL7m9J33n8J9M2k31N6Q2
$$ -67 0 -6 75 -82 -51 112 -16 -84 -70 -2 93 -28 12 36 -41 30 -111 -51 21 -4 -64 -110 -11 -8 29 -20 113 55 74 116 -115 -59 23
242B3j29j3J46n1jM2p8M6J8N0n8p2K09j5n8l2pJ4L5M0o9k41K02KJ63j99m6O0R2o2o7O2M5r0
$$ 23 -106 -119 27 -24 -25 17 -61 -15 3 53 -5 -77 132 117 59 27 20 34 69 109 40 -201 1 3 166 -33 -79 -19 73 11 -56 6 51 -39
-55c9J77l9j04o6P6m4J3R5q7M9k8Qq1J97j30R2r0k7k4J47
$$ -39 138 99 -5 -71 5 -39 -26 69 -18 31 3 11 -70 127 -3 89 -1 -28 -52 95
-230I5
##PAGE=	F1=4370.34
##FIRST=	23146.756194512010552,	4241.1435120000014649,	-0.14663372933864593506
##DATA TABLE=	(F2++(Y..Y)), PROFILE
4241b1K8j2j40N2J44r9R8L3q7l8jJ7K0Lk3J00pj68N3L1k1Mj2k1O1l9l7M4oLO5%j27L3J18K0
$$ -21 7 -5 -145 -93 51 -48 50 83 -4 -42 -43 -26 -6 -3 -26 74 67 -101 -48 -17 -38 -34 -46 -67 -6 -45 -82 -38 -44 -41 24 24 -103 -70 48 68
3926F8r9j06J18J16PJ9j59k4J63m3p5k2J07M5j34j56J44K4J63j08l1m1p4J16Mj23j00J86K5
$$ 68 -31 -137 -19 97 104 123 -36 -60 103 60 -15 -37 70 115 -19 -175 -31 -7 156 48 17 -24 -98 18 22 -101 -201 -15 10
3672A0K7NNN7p6l6j39J47p2%ro3J47p4O5mn5LP7J8j47R4k9P2nL5j03k5%J35m3kk2k1L4q9O9
$$ 10 37 42 47 104 28 -8 -147 0 -72 -72 -81 -144 3 -71 -6 -10 -65 -62 15 33 -114 -20 -49 23 18 53 -50 -75 -75 60 17 15 -7 -28 6 -83 -14
3349a4J1j6j52R2m0R1Q1q3nO7M6M0N3l15J31mJ20J9j71J07p9j0o4N6L5k4k2jKK5j24J99q8
$$ -14 -3 -19 -171 -79 -119 -28 53 -30 -35 32 78 118 171 -144 -13 -17 103 122 -49 58 -21 -31 -95 -39 -4 -28 -50 -51 -49 -24 -148 51 -37
3060c7Q1oKr8j1J04M2j06K7Pn2k2J03p8N5k4P4O5j87J90j15l1%k1J7JO3K2p2j12J94j19N5
$$ -37 44 38 40 -58 -69 35 77 -29 -2 5 -47 -69 34 -44 11 -13 61 126 -61 129 14 -17 -17 -38 -21 -20 43 65 -7 -119 75 -44 11
2771A1n9K10o2L7n2p4p6n6k0j9J13nQ1J04k27n0N2J18N4o2PL6Kj22Q3J22j50l6oNM3k73L30
$$ 11 -48 162 100 137 85 11 -65 -121 -141 -160 -47 -52 29 133 -94 -144 -92 26 80 18 25 61 63 -59 24 146 -4 -40 -46 -41 2 -271 59
2482E9m5n4M9O7j00J36p8P8j91r3J59J3nk3k9J57k07J64M7j1j28m7K9oL6m7P8K6om9L8N8j17
$$ 59 14 -40 9 76 -24 112 34 112 -79 -172 -13 0 -5 -28 -57 100 -107 57 104 93 -35 -82 -53 -59 -23 -70 8 34 28 -21 17 75 -42
2194d2J09j09O2r5L9K7L3N6p7J5N3o1r0R9OJ9q9O3K2n9N5k8j0Kk5P9Po8J04k38J33p4K01j52
$$ -42 67 -42 20 -75 -36 -9 24 80 3 18 71 10 -80 19 25 44 -45 18 40 -19 36 8 -2 0 -25 54 61 -7 97 -141 -8 -82 119 -33
1896c3n0pL3O8Kr4N1J72k08NJ17m6L5J7j47J2J17q9N3j5K1JJ3K4m5J18k73Q2M1QJ22r5m8J7
$$ -33 -83 -90 -57 11 13 -81 -30 142 -66 -61 56 10 45 62 -85 -73 44 -45 8 -7 14 15 28 52 7 125 -148 -66 -25 -17 105 10 -38 -21
1598b1L3O8m8rq6J2K2J36J0j6p7k3np9J5q2J20Rq1K5J04J28j91j73Q7J12N8j75P9KM1l9JK3
$$ -21 12 80 32 23 -63 -51 -29 107 117 101 24 1 -4 -83 -68 -150 -30 -21 -102 -77 27 155 -36 -209 -122 -10 48 -127 -48 -46 -5 -44 -43 -20
1301b0J32j20P1q9OR3p3l5P3j4o4Q8r4M2l3O1j3M4j30J20P5j12j61J35r3J01l2K3m0j27K47
$$ -20 112 -8 63 -26 -20 73 0 -35 38 24 -40 48 -46 -4 -37 24 11 55 -75 45 120 8 -153 -18 -111 -10 -42 -19 -59 -186 61
1030F1q2p7N2n2R4J35r8k7m4L4Q3m2J2n8LJ79j18M0r5K2j04M1j5n8J12J19k7K3K4j46q4J2
$$ 61 -21 -98 -46 -98 -4 131 33 6 -38 -4 79 37 49 -9 -6 173 55 95 0 22 -82 -41 -56 -114 -2 117 90 113 137 -9 -93 -81
750h1R6l1p0L1R0k4o4J16k2n6J5Ko8q2J48o6o3J20L6n9N4L7j21N6p0P6j6P2j89Q3J60j10p6
$$ -81 15 -16 -86 -55 35 11 -53 63 41 -15 0 2 -66 -148 0 -66 -129 -9 27 -32 22 59 -62 -6 -76 0 -16 56 -133 -50 110 0 -76
461g6J8J2J15j12L4O2j12P0j16K4J09J0q0j15J56nJ5p2J51m7J49q3k32J03N3j48L4J44j21
$$ -76 -58 -46 69 -43 -9 53 -59 11 -105 -81 28 38 -42 -157 -1 -6 9 -63 88 41 190 107 -125 -22 31 -117 -83 61 -60
207f0pJ16j18N8L7K3o7o5K26k4n5n3L4m5M6L2r3j85K00K1J18j51l2M3Krp8O5L8j0J37o5p3
$$ -60 -67 49 -69 -11 26 49 -18 -83 143 119 64 11 45 0 46 78 -15 -200 0 21 139 -12 -44 -1 1 -8 -86 -21 17 7 144 79 6
-82Fo7O7nl8J01o9PL8m0q4K49k11J04m7m2l2J72
$$ 6 -61 6 1 -37 64 -5 2 40 0 -84 165 -46 58 11 -31 -63 109
-230A09
##PAGE=	F1=4275.98
##FIRST=	23146.756194512010552,	4241.1435120000014649,	-0.064163543283939361572
##DATA TABLE=	(F2++(Y..Y)), PROFILE
4241a5Rl2j10M6J14n8J01J0q8l0K0pJ2K8k6P3N1j89O9K2m6L2k4j9M2m4OM0l9m7J09j0j02M1
$$ -15 -6 -38 -148 -102 12 -46 55 65 -23 -53 -33 -40 -28 0 -26 47 98 -91 -22 0 -46 -14 -38 -57 -15 -59 -53 -13 -52 -99 10 0 -102 -61
3944f1Q0L7j09r3J42Q5M5J4j60m8J75k7q7q1J55L2j31r0M3O8J27n8j4n0j04J29nj16m9J39
$$ -61 19 56 -53 -146 -4 81 126 140 -20 -68 107 80 -7 -88 67 99 -32 -122 -79 -11 116 58 44 -6 -110 19 14 -102 -151 -12
3681a2M3j7K7k8P6p6o1q1J37p6m7O8q3J15m9K6oQLK8K4r8J14o8P6J3Op2j31O4J22k4l0K0m5
$$ -12 31 14 41 13 89 13 -48 -129 8 -68 -115 -47 -130 -15 -64 -38 -44 -36 -33 -5 19 -79 35 -33 43 56 62 -10 -141 -77 45 21 -9 11 -34
3375c4L2l3L5L0o3j45Q1J4O9M2o7K2N5L7O0nk94J71o7J16R4k44J32p6Km8O1M6r0j8J0J9J5
$$ -34 -2 -35 0 30 -33 -178 -97 -83 -14 28 -39 -17 38 75 135 130 -164 7 -60 56 150 -94 38 -38 -36 -84 -23 23 -67 -85 -75 -56 -41
3086d1n6J65r3P2m7K4q3o7Q7J13j10R7j02jl9P7m5R7j09O8Q8j41K06j64N4jj22O3N2Jlp0o9
$$ -41 -97 68 -25 47 0 24 -59 -126 -39 74 -36 61 -41 -42 -81 -4 -49 48 -61 7 95 -46 160 -4 50 49 -73 -10 42 43 40 -30 -99
2797i9J51j42J11q9J77p1Q1l1o0q1n2l9L3P8o1Q3J74k03j47J07J16J2ll9JN0j06M3J11j38
$$ -99 52 -90 21 -68 109 38 119 88 28 -53 -105 -144 -111 -33 -94 -11 163 -40 -187 -80 36 48 45 6 7 57 -49 -6 105 -33
2535c3k8M1j1J2k16L11j6j03Q3L5j01J16m3Q8k25q2J22J04m4j7k0J05j98J97j1L8j52p0P4
$$ -33 -61 -20 -31 -19 -235 76 60 -43 40 75 -26 90 47 135 -90 -172 -50 54 10 -7 -27 78 -120 77 66 104 -48 -118 -44
2281d4n0O1J5J9J1J8l0jQ4j61R1n5N7r5P6l7J2N6J2k6M3k4q2M5L2M1r9J11l1l0N2km5qJ9K3
$$ -44 -94 -33 -18 1 12 30 0 -1 83 -78 13 -42 15 -80 -4 -41 -29 27 39 13 56 32 -50 -5 27 68 -31 80 49 19 71 69 24 16 35 58
1966E8j1m3Q2j78N7qJ83j88k1J7L6M0L8j27JJ62j33nJ22j02P9L8j31j9J78j50K6LO4jo8O4
$$ 58 47 4 86 -92 -35 -43 140 -48 -69 -52 -16 24 62 -65 -64 98 -35 -40 82 -20 59 97 -34 -53 125 -25 1 4 68 67 -1 63
1686F3j3L0j90M7k7K1J57o1q4M3N4J2o1M6j11K8J0J10MK4j27K0mp5k5m5J18L5j26L8R4J07
$$ 63 50 80 -110 -63 -90 -69 88 27 -57 -14 40 52 -9 37 -74 -46 -36 74 78 102 -25 -5 -9 -84 -109 -154 -36 -1 -127 -89 5 112
1406A12j59j45J28P3J7j91J10M8j1l3Q5m0R6r5L9k4n6J51q0o0M9M4q8N6j01Q2m2M8m1O0j20
$$ 112 -47 -192 -64 9 26 -165 -55 -7 -18 -51 34 -6 90 -5 34 10 -46 105 25 -35 14 58 -30 26 -75 7 -35 13 -28 32 -88
1135h8J45M0j08j67J54p2J04o6P1l3j45K63j18o9O3l7O4R1o0n3k7%J13m5O3j14N8J49j76J02
$$ -88 57 97 -11 -178 -24 -96 8 -58 13 -20 -165 98 -20 -89 -26 -63 1 92 32 -21 -48 -48 65 20 83 -31 27 176 0 102
872A02j01L3j44O8j0q3R2Q2M2K5j6l9j13L1L0j9p5L7R8l5p0J37J1j11L5k0p2p0J61p0o7R7
$$ 102 1 34 -110 -42 -52 -135 -43 39 81 106 90 51 -62 -31 -1 -20 -95 -58 40 5 -65 72 83 -28 7 -13 -85 -155 6 -64 -131 -34
592c4M9j5N9K2j14M0p0O0l6P1j97J03J53q3q8Rk0J12q0QJ19j24M1n0k1J09O4j12j56K04j7
$$ -34 15 0 59 81 -33 7 -63 -3 -39 32 -165 -62 91 8 -80 -71 -91 21 -59 -51 68 -56 -15 -65 -86 23 87 -25 -181 23 6
321FJ6j14J27KK09j70k07J47L7j66L7J39j50j4J85j26L1M8j5n2m4J85n4l0k1N4j07N6K1q0
$$ 6 22 -92 35 37 246 76 -131 16 53 -113 -76 63 -87 -101 84 -42 -11 37 22 -30 -74 111 57 27 6 60 -47 9 30 -50
58e0j13J65N8K8q7lL4j03N8r7O5K0P6J05j22l1m4O3L2r4P4l6l6J03q8n4K47k55J02j8k6n3
$$ -50 -163 2 60 88 1 -2 32 -71 -13 -110 -45 -25 51 156 34 3 -41 22 54 -40 34 -2 -38 65 -23 -77 170 -85 17 -1 -27 -80
-222h0J83
$$ -80 103
-230A03
##PAGE=	F1=4181.63
##FIRST=	23146.756194512010552,	4241.1435120000014649,	-0.031244162470102310181
##DATA TABLE=	(F2++(Y..Y)), PROFILE
4241a0k2l5n8M7O4k0O8j2l4m9M8l7KK4j4L8J12j72P2J1p8M1j5oL4n9N2Qm0q6J43l4p7N5K8
$$ -10 -32 -67 -125 -78 -14 -34 34 22 -12 -61 -13 -50 -48 -24 -38 0 112 -60 12 23 -55 -14 -29 -35 -1 -60 -8 0 -40 -126 17 -17 -94 -39 -11
3935a1N2j01q2J69L5N6Pj24n8J46j8p1j11J50K7j04pp2Q0Q1J6%m8j20J16rp3nQ0P0r0O7o3
$$ -11 41 -60 -142 27 62 118 125 1 -57 89 71 0 -111 39 66 -38 -45 -117 -37 44 60 60 12 -108 8 -1 -74 -79 1 71 -19 48 -15
3646a5O1m3q6PR5q1q0J26p7P0j7l3J7P5rk8K0n4J18j12J14J6k8j2k20J21O6jn1N4p9O3kK8
$$ -15 46 3 -83 -76 19 -62 -142 -16 -93 -23 -40 -73 -56 19 10 -18 2 -52 66 -46 68 84 56 44 -176 -55 11 10 -41 13 -66 -3 -5 23
3349B3L9r1j25O6L8M2K7q7O9MN1O6o1k49K18q9L7J58k60J48r5M8k9L3O3j33k0M3K8j2L6J02
$$ 23 62 -29 -154 -88 -50 -8 19 -68 1 5 56 122 61 -188 30 -59 -22 136 -124 24 -71 -23 -52 -19 44 -89 -109 -66 -38 -50 -14 88
3069H8p8M6r3L4m6q3L3J54j00J36j87O8j04J01j7J20j79P2P8q9K15j77J16k0j97R7P3l0k6
$$ 88 10 56 -37 -3 -49 -132 -99 55 -45 91 -96 -28 -132 -31 -48 72 -107 -35 43 -46 169 -8 108 88 -109 -12 61 31 5
2815En3k5J26j75J52q8J12q9J30k2j2p9m7n4Q2J8j16Q9K34j75k03J27J08m5P6p3m3O2n3K3
$$ 5 -48 -73 53 -122 30 -58 54 -35 95 73 61 -18 -65 -119 -37 -19 -135 -46 188 13 -190 -63 45 0 76 3 -40 22 -31 -8
2552hN1q6l2M8K8mj41K30kj26J23Kr7P8JP2k22m3P1J67q4k5J5K2j52J91l4O3j51j03J05p8
$$ -8 43 -43 -75 -27 1 -3 -144 86 84 -42 81 83 -14 64 65 137 -85 -128 -57 110 26 1 16 38 -114 77 43 106 -45 -148 -43 -121
2272a21P8P3k4j3M0j2l3Q7j48L4j8O3p3Q7p5m3O1R3l9J1L5o5l9M3O3o6J36r1J6L1K3p6j4N5
$$ -121 -43 30 6 -7 33 21 -12 75 -73 -39 -57 6 -67 20 -55 -98 -37 56 17 28 63 -2 -41 2 65 -1 135 44 60 91 114 38 24 79
1975G9k4l4rM7q0k7L7J46k02K1N0J2J0O9j70k0J16l6MJ08j44J02O4p8n3J78j72Nj7J14j0r9
$$ 79 55 21 12 59 -21 -48 -11 135 -67 -46 4 16 26 95 -75 -95 21 -15 -11 97 -47 55 119 41 -12 166 -6 -1 -18 96 86 -13
1695a3O5K1l8q5k0p4N1J49j8p2M5L1k2n7P6j06J9L2N8lL1j25L3K0l0o2m6R4O9j33J7Q4N7r7
$$ -13 52 73 35 -50 -70 -144 -93 56 38 -34 11 42 20 -37 39 -67 -48 -16 42 39 70 -55 -22 -2 -32 -94 -140 -46 23 -110 -93 -9 48 -49
1397d9r0J46M4n0j74J36P8o8j9J26o2N0n7J7K8j33J92o8p4OR7j00L8j22J22m4M5p9M1p3J32
$$ -49 -139 7 51 1 -173 -37 41 -27 -46 80 18 68 11 28 56 -77 115 47 -27 -21 76 -24 14 -108 14 -30 15 -64 -23 -96 36
1126C6K2n3j62J33o4J03q3R4Rj42K30j24o6P5n7M2N7j0p3j4n6J42o1J21j44Q2J07k11J44n1
$$ 36 58 5 -157 -24 -88 15 -68 26 35 -107 123 -1 -67 8 -49 -7 50 40 -33 -47 -103 39 -22 99 -45 37 144 -67 77 26
863B6Nj51R7k7q4O5L9J07K3p8O6j10M9l9Jq2J4J10m3l5J36L1j42M8m9n4n8J15m2l8M1P4ML0
$$ 26 31 -120 -23 -50 -134 -69 -30 77 100 22 88 -22 27 -12 -11 -93 -79 31 -12 -47 89 120 -22 26 -23 -77 -135 -20 -62 -100 -59 15 19 49
566D9L0p6K0o0L0n4O4j68J05J21m8j07j0j6Q4l3k4J72j12OJ0m4Q1R9j45j52K24l6L0j53P8
$$ 49 79 3 23 -37 -7 -61 3 -165 -60 61 13 -94 -104 -120 -36 -69 -93 79 -33 -27 -17 -61 20 119 -26 -178 46 10 40 -113 -35
295c5Q1J74j96j58J81M5j88j0J47j35l0K23j00j3M5m5j4k9J07p3nK6N5j43O0J5l0o5J26Q6
$$ -35 46 220 24 -134 47 92 -96 -106 41 -94 -124 99 -1 -14 31 -14 -28 -57 50 -23 -28 -2 53 -90 -30 -15 -45 -110 16 102
32A02o7l4L7L9j89J13j08N0MJ20R8j74Oj8O5M7j39K9Pp6J43j08RJ88k47Q1qRp6J77
$$ 102 35 1 38 77 -112 1 -107 -57 -53 67 165 -9 -3 -21 44 91 -48 -19 -12 -88 55 -53 -44 144 -103 -22 -30 -21 -97 80
-230H0
##PAGE=	F1=4087.28
##FIRST=	23146.756194512010552,	4241.1435120000014649,	0.0095165297389030456543
##DATA TABLE=	(F2++(Y..Y)), PROFILE
4241an1m5J0O6J1jJ7m1M2p7Q4o5%k3K5J9J33j26N5Oq8L6mJ2K8o8R1m4j7j09J56o1n4O5j4P3
$$ -1 -52 -97 -87 -21 -10 -11 6 -35 7 -70 14 -51 -51 -74 -49 -30 103 -23 32 38 -50 -14 -18 -6 22 -46 45 1 -16 -125 31 -30 -84 -19 -33 40
3926D0p8j01J97j3M5Lo6m5P7l1k9q9R8L4p5M7j52N6N6P7Ol4j13R8k2mKK8J07j76J15j00K6
$$ 40 -38 -139 58 45 90 93 27 -18 59 28 -1 -90 8 42 -33 14 -138 -82 -26 51 57 23 -90 8 -14 -18 -16 12 119 -57 58 -42 -16
3637a6J1q9P6M5r0o9J26m3L4J5r5N5J12k7n4%l2J06j52J70Kk5M0k65J41lK2n5O0r1Q9J4L0
$$ -16 -5 -94 -18 27 -63 -132 -6 -49 -15 0 -95 -40 72 45 -9 -9 -41 65 -87 83 85 60 100 -165 -24 -27 -5 -60 0 -91 -2 12 42
3349D2K8q4r8M5L5K3L5j20J09p2Q3O7r4k17K57o7o4J69k09J52j34J19k0j1Q0j40k6R3J4n4
$$ 42 70 -14 -112 -67 -32 -9 26 -94 15 -57 26 93 -1 -218 39 -28 -92 77 -132 20 -114 5 -15 -26 54 -86 -112 -19 -5 -59
3086e9J29L0n1J6j24L5j2n3l5J35o5J40k15J24j89J49LJ23k24R2N4o3K07j41J29n7j89R2N1
$$ -59 70 100 49 65 -59 -24 -36 -89 -124 11 -54 86 -129 -5 -194 -45 -42 81 -143 -51 3 -60 147 6 135 78 -111 -19 32
2832C2l2j8l6J2J16j85J42n0L9r6J46k6M6o5m1n4J07o1j37R9K46j36k02J10J07j07J36q5p3
$$ 32 0 -18 -54 -42 74 -111 31 -19 20 -76 70 44 90 25 -16 -70 37 -24 -161 -62 184 48 -154 -44 63 -44 92 7 -66
2579f6L1K4K6l0rl9LJ08j2p4J18Kj22J58k1j05N5L2M2j88jL0J72j06k9O0n5j00J48j5O3j25
$$ -66 -35 -11 15 -15 -24 -63 -60 48 36 -38 80 82 -40 118 97 -8 47 79 121 -67 -68 -38 134 28 -1 59 4 -96 52 37 100 -25
2299b5j28J17q8O4J17l9m1M5J3k5O0r2n6kP8m6P6p7r8O2J44l9k7R4n4j02K6O8NJ41j41O5N
$$ -25 -153 -36 -124 -60 57 18 -23 22 35 10 70 -22 -78 -80 -2 -48 28 -49 -147 -85 59 20 -7 87 33 -69 -43 25 30 171 30 95 100
2010A00J5p7k0N3l3n0K6J5Pp8M2R9j82N4Q4j7j8Q8k22K0M2L7K7Q9j68Q9J06j0q4J30j71Rp0
$$ 100 115 38 18 71 38 -12 14 29 36 -42 0 99 -83 -29 55 38 20 108 -114 -94 -52 -15 12 101 -67 22 128 118 34 164 -7 2 -68
1721f8J61m7o3M3M7o7Kj01o5Q3R3K4m1L6j9j6m3O4o4jO6Oj2Lp0QN6L2r3n8N2R8j03l6Q9kl4
$$ -68 93 46 -17 26 73 6 8 -93 -158 -75 18 42 1 37 18 2 -41 23 -41 -42 24 30 18 21 -49 -41 15 47 -46 -104 -52 46 -57 -93 -4 -6 -40
1397d0j1J31K0j04j45J47P4r7jJ05m5J2j9L0M5j96J90l7p6k6J13r2J9j36J43l1N2j05qnR1
$$ -40 -51 80 100 -4 -149 -2 72 -25 -26 79 34 46 27 57 102 -94 96 59 -17 -43 70 -22 -3 -139 4 -27 25 -80 -88 -93 -2
1126bL9Rj58Q9p9J19p9Q3N9j08J62j07p0P6q1J5M4M6p8Lj26J54p7J55j33O5P1k20J66K6m9
$$ -2 37 46 -112 -23 -102 17 -62 21 80 -28 134 27 -43 33 -48 -33 11 57 -21 -18 -144 10 -67 88 -45 20 91 -129 37 63 14
855A4j26J08n3n9M9NJ42Qj37J27p9Q3j05K0p8j6J12m2J4J15M2j49M8o2k9l7K1MOk2R5pqM6
$$ 14 -112 -4 -57 -116 -67 -62 80 88 -49 78 -1 82 -23 -3 -81 -97 15 -27 -13 102 144 -5 43 -19 -48 -85 -64 -60 -54 -76 19 12 4 50
557E0k0%m6ln4N3j19J11N6j0j22l0J0M6Nl3J87q7j1L2k9M6R3j75j02K06o1N0j72K6J60P5j67
$$ 50 30 30 -16 -19 -73 -20 -139 -28 28 18 -104 -134 -124 -78 -73 -106 81 -6 -17 15 -14 32 125 -50 -152 54 -7 43 -129 -103 57 132 -35
268c5r7J95Q1k16o9J57j03m7K13m9m5K8n7L5k8K0n2JM1N1j39N6K2K9n3J04Q4j24j5P1N9k36
$$ -35 -132 63 144 -72 -141 16 -87 -134 79 30 -15 13 -44 -9 -37 -17 -69 -68 -27 24 -115 -59 -37 -8 -61 43 127 3 -12 59 118 -118
-12a18J43r3J5kJ00J06j82K9%N6M3j58k3O3j11J45r5Q7R5j95M3nM6j01J55
$$ -118 25 -68 -53 -55 45 151 -31 -2 -2 54 97 -61 -84 -21 -132 13 -82 5 100 -95 -52 -57 -11 -112 43
-230D3
##PAGE=	F1=3992.92
##FIRST=	23146.756194512010552,	4241.1435120000014649,	0.041228428483009338379
##DATA TABLE=	(F2++(Y..Y)), PROFILE
4241A0o4p3Q2Q9k4pj8q3J04j02J31q0Jr3P8K6J06p8K4Ro9K9oK8J7o8J23r7J8j16J33p8k5O3
$$ 10 -54 -127 -45 44 20 13 -5 -88 16 -86 45 -35 -34 -127 -49 -23 83 5 29 38 -31 -2 -8 20 37 -31 92 -5 13 -103 30 -48 -73 -10
3944a0l0J03n4j48K10l4K1llj4Lp9K1k0K8M2o0O7j71J2N5Q8J4j3q4R4n5P0l9OJ31k35J41j23
$$ -10 -40 63 9 -139 71 37 58 55 52 38 41 -38 -17 -37 -9 33 -27 40 -131 -119 -64 24 38 25 -59 35 -20 50 11 17 148 -87 54 -69
3646f9j4O7n9R6J4r7j7O5JJ9L3j43Q7J19m9m4l3j9Q5j76K13j8K6M6k50J14n1M0l2L9p8P3L7
$$ -69 -83 -16 -75 21 35 -62 -79 -14 -13 6 39 -104 -17 102 53 9 -24 -43 42 -134 79 61 87 133 -117 -3 -54 -14 -46 -7 -85 -12 25
3357B5J9On5o2J7K1J6N6j39J19j41J20O3r4k12K69l0j20J20j16J39j71J91k8n2R0j18k9J41
$$ 25 44 50 -5 -67 -50 -29 -13 43 -96 23 -118 2 65 -29 -241 28 -2 -122 -2 -118 21 -150 41 13 -39 51 -67 -96 45
3104D5j5j09K08l2k2j0j24L0J1pq5N8JJ18j90J48k54J79J0J14k32J22L6p5J77o4R1r8j01M6
$$ 45 30 -79 129 97 75 65 -59 -29 -18 -25 -110 -52 -51 67 -123 25 -229 -50 -40 74 -158 -36 0 -75 102 38 129 31 -70 -24
2841b4J3k8J8k7L1J14j53Q4nrp4J10l9Q8m6l2l7J01j32j15J04J92p9j46O5J10j53J56q3p1
$$ -24 -11 -39 -21 -48 -17 97 -56 28 23 14 -60 50 11 99 53 21 -16 85 -47 -162 -58 134 55 -91 -26 84 -69 87 4 -67
2579f7l1R7M3r7P6m1p0J77j3l4J8Kr7J75l0j22N8L3J6j35K5KJ24r1k6Q8q7p2R7J5O2r3j31
$$ -67 -98 -1 42 -55 21 -20 -90 87 74 40 58 60 -37 138 108 -14 44 77 93 -42 -17 -15 109 18 -8 80 -7 -79 18 33 95 2 -129
2290a29J15q3J2J40k7n4J6L9L2J8l8j41%Q6k4N3m3j28N5J59m4o2J33m3j15j9O0Q3J35j71R6
$$ -129 -14 -97 -85 55 28 -26 -10 29 61 79 41 -100 -100 -14 -38 15 -28 -156 -101 58 14 -48 85 42 -73 -92 -32 51 186 15 111
2019A11mk6n1l0J7pn9N6pO1q8K7L2j23P4J01k5m4Q3k56J06m0O2M5Q0j73M5J65M9j06O3j67
$$ 111 107 81 30 0 17 10 -49 7 0 61 -27 0 32 -91 -17 84 59 15 98 -158 -52 -92 -30 15 95 -78 -33 132 181 75 138 -29
1738b9L5j21J82j01J3K3N9o4M9j64j2J05J3M4k2L4o0J9k7J7Mk1Q5k4k3k9J0n2R2Q4j11o5J2
$$ -29 6 -115 67 -34 -21 2 61 -3 46 -118 -130 -25 -12 32 10 44 -16 3 -24 -7 -3 -24 61 37 14 -15 -5 -57 35 119 8 -57 -45
1450d5J18o4j03J12n3RO5J04j2j22j12J43L2p9J4L9j7kjP8K8k13J35Op3l1P8n0k1j28J45j3
$$ -45 73 9 -94 18 -35 -26 39 143 131 9 -103 40 72 -7 7 46 29 27 26 104 132 -81 54 60 -13 -44 34 -16 -37 -165 -20 -33
1170c3O8j08o5N6M6Q8K8j54N1j05J60p4M9Q9n5Q6p6p9N8q5j8N2R5o9M2j99J44p9J38q9L0M9
$$ -33 35 -73 -138 -82 -36 52 80 -74 -23 -128 32 -42 7 96 41 127 51 -28 30 -55 -73 -21 74 5 47 -152 -8 -87 51 -38 -8 41
890D1k04J63R7j01r6Q9o7j5N2j5J47k2j71J35m3J33j64L5o0l0R1k4M2Q7M7j38L6n0j1jq3M7
$$ 41 -163 0 97 -4 -100 -11 -78 -93 -41 -56 91 69 -102 33 -10 123 -41 -6 -66 -96 -5 -29 13 100 147 9 45 -5 -16 -17 -100 -53
610e3L3o3J09m3k6N5K3j1l7l7j8M2p5J16j0J6j16m1K9L0PqJ42o0LJ0J0L5N6k05k3J56q4P1
$$ -53 -20 -83 26 -17 -43 12 35 24 -13 -50 -68 -26 -101 15 5 21 -95 -136 -107 -77 -70 -78 64 4 7 17 27 62 118 -87 -110 46 -38 33
312C3j64pJ89k2j16l7J92J30k44r3J36p8m5J52J3n0Mn6P2k9m8J4j7QN3j07N3L0P4p1J08M3
$$ 33 -131 -138 51 29 -87 -124 68 198 -46 -139 -3 -81 -126 26 39 -11 -7 -63 9 -20 -68 -54 -71 -63 -10 -117 -64 -34 40 -31 77 120
32A20j27k2Q1Q2k43J41m0k5oL9R7j31M1J5K2L7j53o2J20j45J22p1J58Pj34PMP0j27J24
$$ 120 -7 -29 52 134 -109 32 -8 -33 -39 0 97 -34 7 22 44 81 -72 -134 -14 -159 -37 -108 50 57 -77 -70 -66 4 -123 1
-230A
##PAGE=	F1=3898.57
##FIRST=	23146.756194512010552,	4241.1435120000014649,	0.076022982597351074219
##DATA TABLE=	(F2++(Y..Y)), PROFILE
4241B1o3j09J43R6k8l0k5j23J30j19J80p0rj47J12M9O5n2j3J9m0K3j5M9mq0J60j28N2j14P8
$$ 21 -42 -151 -8 88 60 30 5 -118 12 -107 73 3 -6 -153 -41 8 73 21 8 27 -13 10 -5 44 40 -40 120 -8 44 -70 8
3970Hq1J3M8k1J26l4j89J93k6qj3N5K7n6j51O3O1l5M7o0P4j30l3N8M7K9Rm3J06j11J37j10
$$ 8 -73 -60 -12 -33 93 59 -130 63 37 29 16 71 98 42 -109 -46 15 -20 27 -33 41 -89 -122 -64 -17 12 21 -22 84 -27 110 0
3690@J9J21k40J28j18m4J03mP0J6r2L7j8K7K7J7j66J01J21o8k2o5%O8j76K18l0Q8J1j86N4
$$ 0 19 140 -100 28 -90 -134 -31 -35 35 51 -41 -4 -22 5 32 49 -117 -16 105 37 15 -50 -50 18 -158 60 30 118 129 -57 -3
3419cn5N0MPm6OO9%j5k9j0k4J6J7P5j37J00j73J45N4o5k26K45nj08M7k1J00j74K25m2q7R6
$$ -3 -58 -8 -4 3 -43 -37 32 32 17 -12 -22 -46 -30 -13 62 -75 25 -148 -3 51 -14 -240 5 0 -108 -61 -82 18 -156 69 27 -60 36
3130C6q2k0J61m0j57K48o5J1m2r1K3K7K1j01m2Q9P4j33J38k73J74lJ04k04J44L6j13J33K0
$$ 36 -46 -66 95 55 -102 146 81 92 50 -41 -18 9 30 -71 -113 -24 50 -83 55 -218 -44 -47 57 -147 -3 33 -80 53 73
2876G3K3j16Pj7jl4O5l8J8J21q9J8J3k7j4L5n3R5k5k0j8P7j59o8R5Q7j1o0QJ09j65J36p4m8
$$ 73 96 -20 -13 -30 -31 -65 0 -38 -20 101 12 30 43 16 2 37 -16 79 54 34 16 93 -66 -134 -39 48 37 -23 -15 94 -71 65 -9 -57
2579e7r0J38O3j20J46m4j28J91j1k0l7Jn7J60l1j27P4NRp6K4k0N4m0k3Q2o5p0O7K0P5o5j19
$$ -57 -147 -9 54 -66 80 36 -92 99 88 68 31 32 -25 135 104 -23 51 56 65 -11 13 -7 47 7 -16 66 1 -69 -2 18 93 28 -91
2290i1J09o9n3J33pl6l9N5J05qj9j88jP7pK6Nj23M2J49n6q8J39k4q2p4M9J35J25j81R5K0p5
$$ -91 18 -51 -104 29 22 -14 -53 2 107 99 80 -108 -109 -32 -39 -13 -8 -131 -89 60 4 -84 55 31 -51 -125 -76 59 184 3 98 118 43
2001D3k5m0k7L7p1P3j6Q2p0K2n2m6Q3J01op6N3k40J88j03M7L7Q7j62nK21Q9j17Lj65N9j34
$$ 43 18 -22 -49 -12 -83 -10 -26 56 -14 8 -44 -90 -7 94 88 12 65 -175 13 -90 -43 -6 81 -81 -86 135 224 107 110 -55 4 -130
1721a30J70j50Q3J9O0n2N7j81M8J04n6L6k8M0o2O2j6l6P1m0O8j6m0l3Q2j34J17J16j06p0l
$$ -130 40 -110 -27 -8 52 0 57 -124 -76 28 -28 8 -20 20 -42 20 4 -32 39 -1 67 51 11 -22 60 -74 43 159 53 -17 -20
1450b0J20l5j63J41q3K9R7J01n3j11p5J38l9k2K1l9NLpJ24Nj79M2N3p3j2RK1p7j03J41j0Q5
$$ -20 100 65 -98 43 -40 -11 86 187 134 23 -52 86 47 25 46 7 12 15 8 132 137 -42 0 53 -20 -32 -23 -2 -79 -182 -41 -51 34
1161C4q8j13R7K2J44k1j42N2j30K19r1J2R9j9K9m2q1K3o1n8O9J26n2J06k60J22p0Q1l9OL7
$$ 34 -54 -167 -70 -48 96 75 -67 -15 -145 74 -17 -5 94 75 104 62 -19 4 -57 -115 -46 80 28 134 -126 -4 -74 7 -32 -26 11
890A1j70J38J44j24r0M2n3L0O6j8J34o1j73J08j9J80k12M7m2j8M8J5L6O4M6j13J4k1j2M9j57
$$ 11 -159 -21 123 -1 -91 -49 -102 -72 -6 -24 110 49 -124 -16 -35 145 -67 -20 -62 -80 -32 -17 19 83 129 16 30 9 -3 46 -111
618a11P0K4o4J16q5j3N1L6j2l5o8M2M4n5J02m1K1q9l5K1M8k7L6M7l0L5l8M7N9J8k33N9Q6q4
$$ -111 -41 -17 -81 35 -50 -63 -12 24 12 -23 -91 -49 -5 -60 42 1 22 -67 -102 -81 -33 -60 -24 23 -7 28 -10 37 96 114 -119 -60 26 -58
321e8Q1j23k2J43p8o7LJ87J67k61n6O5o4j7O4O3k8j9n9Q6j5q3Q7m5m4O6p3N5K2R7r7J30k0
$$ -58 23 -100 -122 21 -57 -124 -121 66 233 -28 -84 -19 -83 -100 -36 27 -1 -20 -79 7 -8 -91 -4 -49 -93 -27 -100 -45 -23 74 -23 107 87
32H7r3l3O4R1k22J08M4m6j7j9M6m8O2K7l6N4j39p9J59j79Q8n3K07m8q8rJ0Q9j51R0
$$ 87 -6 -39 25 116 -106 2 46 0 -17 -36 10 -38 24 51 15 69 -70 -149 10 -169 -81 -134 73 25 -63 -72 -62 27 -124 -34
-230c4
##PAGE=	F1=3804.21
##FIRST=	23146.756194512010552,	4241.1435120000014649,	0.14491951465606689453
##DATA TABLE=	(F2++(Y..Y)), PROFILE
4241B4n3j20J68P6mn8jj57J33j30K10l0l8j59J08P0M0n4l9K8k4J6j8P8k8j19K06j18P1j11
$$ 24 -29 -149 19 95 91 33 32 -125 8 -122 88 58 20 -139 -31 39 79 25 -14 14 -10 6 -12 66 38 -81 125 7 78 -33
3979c3Rp7N4L1nJ27k5j77J38j6k5k1R3P1r5k11Q1J18p1M7o4R5o6o5M3j0M0K4nJ20j61J77j83
$$ -33 -24 -101 -47 -16 -21 106 81 -96 42 26 1 -20 73 144 49 -162 -81 37 -34 13 -51 44 -22 -87 -44 -54 -14 10 5 125 -36 141 -42
3690d2O6P9j99Q5q4o7J12N7K5M6p1N3p0K4L3k8j65R7J42p7j6p7K3O2j54J79k3J18l2j10nk8
$$ -42 24 103 -96 -11 -95 -162 -50 7 32 78 7 60 -10 14 47 19 -146 -49 93 16 0 -77 -54 8 -146 33 10 128 96 -14 -19 -47
3410d7M9L4rj1p8Q6mk8k3N5p5L0J2Q1j22O9j59J48M1k0k35J79J0n0NL7L7j35J98n3j13J04
$$ -47 2 36 27 16 -62 24 20 -8 -31 24 -51 -21 -9 72 -50 19 -140 8 49 29 -206 -27 -17 -67 -62 -25 12 -123 75 22 -91 13
3130A3m5jJ48n3j72K35o8M7q5l8K3M1J6q8j19J69J4o4J00k52J50k9R4j49J43M5j57Q2P9l4
$$ 13 -32 -33 115 62 -110 125 57 104 19 -19 4 45 61 -27 -146 23 37 -27 73 -179 -29 -58 36 -113 30 75 -82 0 79 45
2867D5r3O8o7K5m2J04p5k4J35k3j2kk7N5l7o5P1oqqN1j29j8Q0l0M0J4l5R2j32R1o5k1j17J33
$$ 45 -48 20 -47 -22 -64 40 -35 -59 76 53 41 39 12 67 30 -35 36 30 22 14 65 -64 -82 -2 -32 8 22 -13 79 -53 38 -27 -48 -165 -32
2561c2Q7j04J79n5j42J46qk2l4j1lJ14l5j02P4l0K0k9Qm0%K1k7N0qp6O4j0R4m1j03R5m5r4
$$ -32 55 -49 130 75 -67 79 71 49 15 4 1 115 80 -22 52 22 42 13 21 -19 -19 2 -25 25 17 -59 5 -5 89 48 -55 40 -5 -99
2264i9R5nK2r9N6J47ll6j82pN7J5qM8j00K8J31o3j01J10J2k4j25M4J44J10j66N6P1j01j6m8
$$ -99 -4 -9 13 -86 -30 117 114 78 -104 -111 -54 -39 -47 1 -99 -71 60 -3 -104 6 18 -6 -131 -87 57 167 1 57 128 27 11 -37
1983c7n1P5r6P8j0Q0n2N1j38J3R3Q9K4j12J3j63K16j31J7RR4j44k9K45J08j12l9j53N6q9J24
$$ -37 -88 -13 -109 -31 -41 39 -13 38 -100 -87 6 95 119 7 20 -143 73 -58 -41 -32 62 -82 -111 134 242 130 91 -62 -6 -95 29
1712B9j67J05K8N7m2M1j49Q6P4r1J0n6M7j5Q6j0o9J16o9J9L0o6PJ17k13J22J40q3q1RR9j0
$$ 29 -138 -33 -5 52 10 51 -98 -12 62 -29 -19 -75 -28 -43 43 33 -36 80 11 30 60 -6 1 118 -95 27 167 84 3 12 111 101
1432A01k05J56q7L7O7J43r8r6k1J33j16N4Rr3K3Mk4J24J0j17n3R1p9J5n2R4j30p0J37l4R5
$$ 101 -104 52 -35 2 69 212 114 18 -3 130 14 68 77 -16 7 11 -13 111 121 4 -49 42 -37 -22 -74 20 -110 -180 -43 -77 18
1161A8n7j37J14K4J79j11j20R0j38K71j36rJ02k5Oqo5k5j3j03Q8J21l5J74k87J05o7K0jMK2
$$ 18 -39 -176 -62 -38 141 30 -90 0 -138 133 -3 -12 90 65 71 63 -2 -27 -40 -143 -55 66 31 205 -82 23 -44 -24 -25 -21 1
890Aj23R7J68j06j18j2k1N8P7jJ20j05j59Q3pJ92k37N8l7LKP3LN2M1q2qLl2J03j87P5j3l8
$$ 1 -122 -25 143 37 -81 -93 -114 -56 21 20 140 35 -124 -41 -48 144 -93 -35 -72 -69 -67 6 9 61 102 20 12 15 -17 86 -101 -26 -39 -77
592g7J18j07J4M0K7ol7q8R5N7n5N1j7Nn1j7pP4o6O9o1mP4q8O0J13Qk47J08J5n3O9m9l1M0r2
$$ -77 41 -66 -52 -12 15 9 -28 -116 -21 36 -19 32 15 20 -31 -48 -55 19 -47 22 -39 -43 31 -57 3 116 124 -123 -15 0 -53 16 -33 -64 -24 -116
277a16l4K1J83J77k52K0m2m2J6qQ1Jk5q0P4K0q3J13n5o6Q5n5N7j1J02j10J53p5n4l0L4P6j82
$$ -116 -150 -129 54 231 -21 -1 -43 -85 -69 -77 4 5 -20 -100 -26 -6 -89 24 -31 -97 -12 -67 -10 -21 81 -29 124 49 -5 -35 -1 75 -107
-12a07M4J34l0m0m2l7J8J01K8r1J00j24p8J65k13N8m7K27n7o1jmJ09j58N6
$$ -107 -63 71 41 1 -41 -78 -60 41 69 -22 78 -46 -124 41 -172 -114 -161 66 9 -52 -53 -57 52 -106 -50
-230e0
##PAGE=	F1=3709.86
##FIRST=	23146.756194512010552,	4241.1435120000014649,	0.2973670661449432373
##DATA TABLE=	(F2++(Y..Y)), PROFILE
4241A9n0p9J51L6K4q3L6j76J39j38K05K1o8j30P2P4M1o9n1K6k6MMJ02m5j79K47n9O1j10n3
$$ 19 -31 -110 41 77 101 18 54 -122 17 -121 84 105 37 -93 -21 53 94 25 -26 0 -26 -22 -18 84 39 -140 107 48 109 -1 -54
3970e4o4Q1K6%J03l0r8N5k9j8k3J00J19j33k26P5J35o7M8o0J28k7p6Ol4L0K3K0J19j67J81
$$ -54 -118 -37 -11 -11 92 62 -36 19 -10 -28 -51 49 168 35 -191 -116 19 -48 0 -60 68 41 -35 -29 -63 -33 -10 10 129 -38 143
3699A43k37J29K6j42L6l7r2J06J09j7Q1l6K0o6rK6p2j55Q7J79o7l5n7K2P3j21J07MJ01n0n6
$$ 143 -94 35 61 -81 -45 -82 -174 -68 41 24 105 69 89 23 14 40 -32 -187 -100 79 12 -23 -80 -58 15 -106 1 5 106 56 0
3427@l5nM6M1lK8j36O8J8l8l1J17j26O0j5P7j04M4j15J36K4K5k23P6L6J4K1M5l4p1J12n2j23
$$ 0 -35 -40 6 47 44 72 -64 4 22 -16 -47 70 -56 4 -11 66 -38 6 -109 27 51 76 -147 -71 -35 -21 0 45 11 -60 52 0 -123
3139a23J17j7J3J19n7j39J68n6Q5j31J9L6M0lo7j49K20n2LM8k15J29m5P4q7J21M2j86K5R8
$$ -123 -6 -23 -10 109 52 -87 81 25 110 -21 -2 34 74 71 4 -145 75 23 26 74 -141 -12 -57 17 -70 51 93 -93 -68 30
2876C0m4l2N3q4O3k5J29j35p9J50J7J7k6l6R7o6p3L6LLj5M0o7K0P7j21N5M7m4M8o3M2m7k1
$$ 30 -14 -46 7 -77 -14 -39 90 -45 -124 26 43 60 34 -2 95 29 -44 -8 -5 -2 -17 23 -44 -24 53 -68 -13 34 -10 38 -25 17 -30 -51
2579e1r5Q9J14o7J61p8j18Q0lk1J1m3O3M2m1m7L8m1L1opm7k5N5k8K0L9o4Q0n9R2j5q6O1j3
$$ -51 -146 -57 57 -10 151 73 -45 35 32 11 22 -21 42 84 43 -4 34 -7 24 18 11 -36 -61 -6 -34 -14 25 -39 41 -18 74 59 -27 34 21
2272B1q6L4k8J08j47N2J36K6o1j44k2M5M0m7O8p9J9J13n4r1N3N5L7j57M4J11Q4j14qJ25j00
$$ 21 -65 -31 -59 49 -98 -46 90 116 55 -89 -111 -66 -26 -73 -5 -84 -65 48 -6 -97 -44 11 48 -109 -65 46 130 16 8 133 33
2001C3k0n3m4Q5j22P8RO6n2J02j87K0J12O6M4j39j3n8J82j27lrP2j26j6K22J09q7o5j17J5
$$ 33 13 -40 -84 1 -121 -43 -34 32 -20 82 -105 -85 27 93 137 -2 -15 -73 109 -18 -21 -30 42 -84 -100 122 231 144 79 -38 -23
1730b3kO0j46P7L5N5l4K1r4R6J6p6k8p5M3N6Q6j3p5J40j11l8R0r9P3J06k53J05J64n6r1K9
$$ -23 -25 35 -111 -34 1 56 22 43 -51 45 61 -15 -43 -118 -75 -19 67 54 -21 119 8 -30 60 -39 34 140 -113 -8 156 100 9 38
1450C8N5K7k27J48p4M4LK12j41q9M7J13j67J18j8j05M6j9l0O6N3n4j28J14q9M4p7J32j63k9
$$ 38 93 120 -107 41 -33 11 14 226 85 -4 43 156 -11 107 89 -16 30 11 -19 47 100 46 -82 32 -57 -13 -90 42 -121 -150
1187a50J26p4Q8k6j27J11M2J71j84j02J34j21K91j89%R9o6J1K3k7p5M7j43R9P7k2K09k55R3
$$ -150 -24 -98 -10 -36 -163 -52 -10 161 -23 -125 9 -112 179 -10 -10 89 23 34 57 30 -45 2 -141 -42 35 13 222 -33 60
933F0q1k0L3MPp4N4J73n1j66m7J0M9Q8L1J05j45j49Q5kJ58k22N6m3Rk3J36l5L6M0n2j3Np2
$$ 60 -21 -41 -8 -4 3 -71 -17 156 105 -61 -108 -98 -49 39 70 175 30 -119 -34 -36 122 -100 -44 -87 -78 -101 35 0 36 76 24 11 16 -56
636e6J52j70N9n7nJ08r4L9L5J1Ml5r1J04P7n9k5M4k9j2mk3P0p9P5j43J1J10j17M1J76K6k36
$$ -56 96 -74 -15 -72 -77 31 -63 -24 11 22 26 -9 -100 4 81 22 -3 41 12 0 -4 -27 43 -36 39 -104 -93 17 -100 -59 117 143 -93
347i3J04l2nL1L6m1o5q7j2K0J72J58k15R3j38lL0k6M9K4rj06L6O4o4P6l7l3J00n6O2o1Q5r5
$$ -93 11 -21 -26 5 41 0 -65 -152 -164 -144 28 186 -29 64 -74 -77 -47 -73 -24 0 -9 -115 -79 -15 -79 -3 -40 -73 27 -29 33 -28 57 -38
50c8J64r1m1j5LN2j34l5K00K1o8l5j11L4J50Nj19J69j15p2J36k34M1m4K14l1l5J1l8J30j37
$$ -38 126 35 -6 -21 -18 34 -100 -135 65 86 18 -17 -128 -94 56 61 -58 111 -4 -76 60 -174 -133 -177 37 6 -29 -18 -56 74 -63
-222f3K1
$$ -63 -42
-230d2
##PAGE=	F1=3615.51
##FIRST=	23146.756194512010552,	4241.1435120000014649,	0.35184571146965026855
##DATA TABLE=	(F2++(Y..Y)), PROFILE
4241A0n6jJ08%L1j04O9j78J55j30J56N6p4q5M3M9N0p4m3kl3oM8J01m6k38K62L5K2j02r5m9
$$ 10 -46 -47 61 61 92 -12 57 -121 34 -96 60 116 42 -43 0 49 99 25 -18 -20 -53 -59 -11 90 44 -194 68 103 125 23 -72 -121
3961a21Q6L7j0P2m7K1l4o9Pj7P4J69j80j87N9J17k3N3n0J49l6o2l4oj0LK9R4j08J55k56J74
$$ -121 -35 2 -8 64 17 38 4 -65 -58 -75 -1 168 -12 -199 -140 -23 -46 7 -43 106 70 8 -26 -32 -42 -39 -10 84 -24 131 -125 49
3681D9j2r6Ojj27J00J47n0R9Jl3k3n5Qp8j52P6K06k9o7j5k3R6q3K2L7P1m7l5k8j8N0L0J1P4
$$ 49 37 -59 -53 -54 -181 -81 66 16 115 116 83 60 5 13 -65 -217 -141 65 36 -31 -46 -69 27 -56 -34 3 74 27 -8 -36 -54 -4 26 37 111
3375A11j36J0N0m4l9J50j56R9p3O8q0L3o6J10J6N2j86m5Q1N9Q0K0q3k6Kl4j07J27%KR7n6p3
$$ 111 -25 -15 35 -9 -48 102 -54 45 -28 40 -40 -7 -73 37 53 105 -81 -126 -45 14 94 114 31 5 7 -27 -134 -7 -7 -5 92 36 -37
3086c7P3m7J16j60O0N7J7rn3j42K29r8O6j3j86J26l6M4m6R7J7j82k9P8nL3qo5P6K4J34j95
$$ -37 36 -11 105 -55 5 62 79 70 17 -125 104 6 72 59 -127 -1 -37 7 -39 58 75 -107 -136 -58 -63 -30 -38 -103 -27 -3 131 -64
2806f4j15J45K6Q8l4n8R0m1p7MlJ6k6M2j7M1J00j62K7L4j6j2K0jj0o4l2L0J30l0J02j00q0
$$ -64 -179 -34 -8 80 46 -12 78 37 -40 -36 -39 -23 -49 -7 -24 17 117 -45 -18 16 0 -12 8 7 -3 -67 -99 -69 61 31 133 33 -47
2517d7K7RLN8r5J34m2m4K3k4j9K3j2%l2l3L4LNN0l1R8r3M8J3n6KK2m5k6o5J92j70N7Q6N8p7
$$ -47 -20 -11 -8 50 -45 89 47 3 26 2 -17 6 -6 -6 -38 -71 -37 -34 -29 21 -10 88 -5 43 56 0 2 24 -21 -47 -112 80 -90 -33 53 111 34
2194C4r9m5N4O0q2N2o9K3R1k0o3j6Q5R4j69L6N8N8k6p5J51q5k3o1j9O0j19P6L7M0o1J41j76
$$ 34 -65 -110 -56 4 -78 -26 -95 -72 19 -1 -64 -80 5 99 -70 -34 24 82 56 -19 132 47 24 -37 -56 4 -115 -39 -2 38 -23 118 -58
1905e8j4J25L1M5j47mK2J17r9j2PJ9j11QJ67J00n3p5n9m8P6Or5K8L0N2k5Om4Q5n3j8o8o6L5
$$ -58 -72 53 84 129 -18 -22 0 117 18 6 13 32 -79 -71 96 196 143 68 9 -39 37 43 -52 -24 6 58 33 39 -5 80 27 9 -59 -125 -90
1598i0J09P1l2o4J59j51p9J32j23J21O8k37O7J92m2r0L2J1P4k34J25n6M9m2K64j77p8J12N4
$$ -90 19 90 58 -6 153 2 -77 55 -68 53 121 -116 -49 143 101 11 43 54 128 -106 19 -37 12 -30 234 57 -21 91 145
1345A45j61J46n3p8P3o3j3k0J13j2j71J22r6P5o5J10j69K1J04j07N5Kq0Q9N9J24j92j04J36
$$ 145 -16 130 77 -1 72 9 -4 -24 89 77 -94 28 -68 7 -58 52 -117 -96 8 -99 -44 -42 -122 -33 26 150 -42 -146 -10
1091a0p4K71k20L1Q8j14K6M9K2j13J01j66R8RqJ88j64P7j09l4O7j0Nl5J8J61K0k03m4J6KJ03
$$ -10 -84 187 -33 -2 86 -28 -2 47 69 -44 57 -109 -11 -2 -10 178 14 91 -18 -52 15 5 10 -25 -7 154 174 -29 -73 -57 -55 48
811D8P0Q6j75j50J10mJ01j60L2m4j2k1J83o2%N1k4Lj0j28J80j08J9q5K0P6n7O4L9MK0l4p7
$$ 48 118 204 29 -121 -11 -15 86 -74 -42 -86 -98 -119 64 2 2 53 29 32 22 -106 74 -34 -15 -100 -80 -4 -61 3 42 46 66 32 -45
522d5O1R1n4r9J13o8L0j8qK1n6N8j77OJ42j19LK32M5j94N3m7L4k6J02n6j14p6J1KJ44J17j53
$$ -45 16 107 53 -46 67 -1 29 11 3 24 -32 26 -151 -145 -3 -122 -119 113 158 -36 17 -30 4 -22 80 24 -90 -166 -155 -153 -9 108 -45
233d5J34j89M4J7J3k8L7K6j21j1R4m5jKL8J01o8Q1j02M0n3J57o4o4Lk2L9r1j01K27P5q8k1
$$ -45 89 -100 -56 -39 -26 -54 -17 9 -112 -123 -29 -74 -75 -73 -35 66 -2 79 -23 17 -36 121 57 -7 -4 -26 13 -78 -179 48 123 35 14
-55A4j35J0J81m4j07K33j09p7R3k37M7l1J65J1nRp4J45r3j4
$$ 14 -121 -111 70 26 -81 152 43 -34 59 -178 -131 -162 3 14 9 18 -56 89 -4 -18
-230a8
##PAGE=	F1=3521.15
##FIRST=	23146.756194512010552,	4241.1435120000014649,	0.17740669846534729004
##DATA TABLE=	(F2++(Y..Y)), PROFILE
4241A0o9P3O1j3Qj24R1j58J69r6P1N3l8n4N2kM9o0j2n5l7lQ9O8l3k62K37J26k9p4j19l7P5
$$ 10 -59 14 75 62 70 -54 37 -121 48 -48 23 76 38 -16 36 34 83 23 11 -44 -81 -84 5 73 40 -222 15 141 112 38 -81 -118 -43
3952d3O4k8N4o9J22r8j10K6j5K8K13k20j16N0P7M7N5l8J36q7k0o3N7o2k7K2N1%J14k32J76
$$ -43 21 -7 47 -22 100 2 -108 -82 -97 -69 144 -76 -192 -142 -65 -18 37 -1 135 48 28 -35 22 -40 -67 -45 6 6 120 -112 64
3681F4l0o0j4J8j64J04J69p9Q6K9o2J9r8%l1j73P3J98L0q8J8j00J23m6n0O4N7m3k8lo9O2J6
$$ 64 34 -26 -40 -22 -186 -82 87 8 94 123 61 80 -18 -18 -49 -222 -149 49 79 -9 9 -91 32 -14 -64 0 57 14 -14 -17 -86 -24 -8
3392hJ6J17q8n5O2m2l6J38j50J29j44O3l8K1k4O8K2N5j31j53J27Q7J29rq5k8q3no7J26J3m4
$$ -8 8 125 37 -18 44 2 -34 104 -46 83 -61 2 -36 -15 -39 29 51 106 -25 -178 -51 36 165 156 71 43 -40 -45 -112 14 27 -17
3112a7R1m9rj2n2J40j59P4P4k0mm4j21K07j02J11o8j74J34JKl5R2k2j37n9K9N1N9o5j2M9P5
$$ -17 74 25 16 4 -48 92 -67 7 81 61 57 13 -108 99 -3 108 40 -134 0 1 3 -32 60 38 -99 -158 -129 -78 -19 -84 -96 -47 28
2824B8J22k25j18J04J7J64k2p0M0J5p3k1l2L6j9L7%M5J35j55j8mL3p0R6l6M1j42M7k2J20J1
$$ 28 150 -75 -193 -89 -72 92 70 0 40 55 -18 -39 -71 -35 -54 -17 -17 28 163 8 -10 -14 19 -51 45 9 50 -92 -45 -67 53 64
2544F4J9r9n3pL4N2P4j41J83j14m3R5r0K6nm8L3Jl7l4P3jL0%J13j02k0K9Np1M5on6j00K44
$$ 64 83 -16 -69 -76 -42 10 84 -57 126 12 -31 64 -26 0 -5 -53 -20 -19 -56 -90 -17 -18 12 12 125 23 3 32 37 -34 11 5 -51 -151 93
2237I3j67P8K9Q3r5o0o4Q0P2j04Lo9M7N5L5l4p3R1J25j50J6KN0P3j26J37p2k0p5QPo7O3P2
$$ 93 -74 4 33 116 21 -39 -103 -23 49 -55 -52 -121 -74 -19 16 -18 -91 0 125 -25 -9 -7 43 116 -10 127 55 35 -40 -32 -25 -92 -29 43
1940D3Qo8J40j13m4J13j9M2j35L2M9N8n7j7M9l6j06J4J14Q2k9o3Lj07R8j4k9oPM9j6j2j3O0
$$ 43 51 -17 123 10 -34 79 60 102 -33 -1 48 106 49 32 81 45 -61 -47 67 149 120 57 60 -47 51 37 8 2 9 58 42 30 17 77
1642G7j06P2j09l1L1J25N0o4n8J89j67q4J21j26J25L1j69K4K01m1p5J0lJ03k29J03l4M2l4
$$ 77 -29 43 -66 -97 -66 59 109 45 -13 176 9 -75 46 -80 45 76 -93 -69 132 91 16 26 23 126 -103 0 -34 8 -26
1388b6K62k03m3J44l8q8J22p8l4R4j10J8q1J46J0j85J25r9J05l6M1j58P3Q0j15%K9rM9O9N3
$$ -26 236 33 -10 134 96 8 130 52 18 112 2 20 -61 85 95 -90 35 -64 41 5 46 -112 -39 41 -74 -74 -45 -54 -5 64 117
1117A17j31j25Q4j4K23k08O6O1j42L6O6N7j21J29j57Q0n4NJ30l9M4j42l6J02l3K2j2j1J35
$$ 117 -14 -139 -55 -69 154 -54 12 73 -69 -33 33 90 -31 98 -59 21 -33 -28 102 63 107 -35 -71 31 -2 20 8 -3 132
863A32P7k02j2Lp2J20J04O6j90j50J31k2N6n7j2l3m3oJ98q0n4O9QL7l0j93J81j3m0q9M2J0
$$ 132 209 7 -5 -2 -74 46 150 216 26 -124 7 -15 41 -16 -28 -61 -104 -110 88 8 -46 23 31 68 38 -155 26 13 -27 -116 -74 -64
583f4k0J07L9J6L8l1o5nR1n3j39J74j02P1n6L9m4k1L2j74j1J56r1l6K71L8j34j6l5M8q8J21
$$ -64 -84 23 62 78 116 85 20 15 106 53 -86 88 -14 57 1 40 -4 -25 7 -167 -178 -22 -113 -149 122 160 26 10 -25 23 -65 56
303E6n9r4n5L7k2R0O5q2J45j88P6pP3j14L8O8j11m9R4l9o6L9R6Q5p6J23j15k9mJ39pj14J6
$$ 56 -3 -97 -152 -115 -137 -47 18 -64 81 -107 -31 -38 35 -79 -41 27 -84 -133 -39 -78 -144 -105 -9 76 0 123 8 -21 -25 114 107 -7 9
15Im3M9o2j27K18R4q7k3j03j9J75j02o2K65j03r5O2k23P1jR2M0K6j2q5J44m5m9
$$ 9 -34 15 -47 -174 44 138 51 28 -75 -94 81 -21 -83 182 79 -16 46 -177 -106 -107 -15 25 51 39 -46 98 53 4
-230D
##PAGE=	F1=3426.8
##FIRST=	23146.756194512010552,	4241.1435120000014649,	-0.0045183179900050163269
##DATA TABLE=	(F2++(Y..Y)), PROFILE
4241B7q1J05K6kk7j38R0j10J63l9k3QK6m7J04o5L3l0L6j24l3J3J01J8j2k43J78J84o6l1j30
$$ 27 -54 51 77 75 48 -90 0 -110 53 14 -9 -1 25 -22 82 17 50 20 56 -68 -101 -88 13 31 19 -224 -46 138 72 41 -89
3970h9l2O2R4l5O0r1J51j08j23J4k0j3K31k23m5O0K0J05N5l4R6j48L7p2J15r6n4J2kJ11P3
$$ -89 -121 -59 35 0 60 -31 120 12 -111 -97 -117 -130 101 -122 -167 -107 -87 18 73 39 135 -13 24 -48 67 -29 -83 -71 -73 38 111
3699A11j66J39m6k6l8L0j80R8J75j04M9M6m3L0j26J1M8k13Q2J57Q2q6J7j60J44j6q8P3N9m8
$$ 111 -55 84 38 12 -26 4 -176 -78 97 -7 42 88 45 75 -51 -40 8 -205 -123 34 116 30 47 -113 31 15 -73 0 59 11
3436A1j1J5j36Q0J0QJ36k4r2L7k4k0Q4j11J32j91O2K4mJ5NL1M1o6k18J47J12J21k6l4p3j07
$$ 11 0 15 -121 -41 -31 -23 113 89 -3 34 10 -10 74 -37 95 -96 -34 -10 -14 1 6 37 78 12 -206 -59 53 174 148 114 41 -66
3156f6K1k4J15L6j15Q4k4K1n5o9J56j41O6P9m5j3k7j03J73p0J35j08j73J40N5m8m6J09n0q3
$$ -66 -45 -69 46 82 -33 51 27 48 -7 -76 80 -61 5 84 39 26 -1 -104 69 -1 134 26 -147 -7 48 0 -46 63 13 -70
2894g0n4l2R6M0q1N0QR0J04k14r7L8OK11j1m3k8O3o3l9p5N9J6J4j0L2J56j16n0m2Q0j05J46
$$ -70 -124 -156 -60 -20 -101 -51 -43 47 151 -63 -160 -122 -116 95 84 41 13 76 13 -26 -101 -42 -26 -12 -22 10 166 50 0 -42 38 -67 79
2605G9n7Q9k29J11n4Q9N7o7o6l1l8P1J09M5j55J91j51n2J59j37P6l9r3P4K6l9j10J53j1QL
$$ 79 22 111 -118 -7 -61 28 85 18 -48 -79 -117 -46 63 108 -47 144 -7 -59 100 -37 39 0 -93 -19 7 -32 -142 11 0 8 11
2334A1J28r8p1K9Q2j34M6Rm6j17K45j44J11j9J03j35j6o8J00P9j01o1p0Q6kR6k1r7P1J16r8
$$ 11 139 41 -30 -1 81 -53 -7 2 -44 -161 84 -60 51 32 135 0 -16 -84 16 95 -6 -67 -137 -51 -53 43 22 -75 -4 112 14
2062A4j2m3O9J46j52R3n9k3q8K7n5K5L3J08k6o0R6l5k2O2p9N8j19P4K6K7ql1R3n5j13j4R2
$$ 14 2 -41 28 174 22 115 56 33 -55 -28 -83 -58 -25 83 57 -3 93 58 36 98 19 77 -42 32 58 85 77 46 139 84 -29 -43 49
1773D9N7l6k6N2j40N3lM6pk6M6j3m1jK4j26J71j38KL7J06K8r5o1K18j44n0M7j03R0J6q0mJ73
$$ 49 106 70 44 96 -44 9 6 52 45 19 65 52 11 10 34 -92 79 -59 -57 -20 86 114 19 -42 176 32 -18 29 -74 16 32 -48 -52 121
1476A21m8n6k1K6R0k14R4rK6J4K02k09J4J29j29L2M8p7KR6j37M0q4J30Rj68J31r8J16Jm4j40
$$ 121 73 17 -4 22 112 -102 -8 -17 9 23 225 16 30 159 30 62 110 33 35 131 -6 34 -50 80 89 -79 52 -46 70 71 27 -113
1196a13J12N8q5o0M8O1%P0j4m8j44K3K7J66j57Q8K3j39L2O7O5r5J19j18N3q1OP0P2mj64l7
$$ -113 -1 57 -28 -88 -40 21 21 91 77 29 -115 -92 -65 101 -56 32 55 -84 -52 15 80 -15 104 -14 39 -42 -36 34 106 102 -62 -99
916i9J31n6N2Mm2J10R3j53J8j0j43J21J27N0j85j31J19n2L9N4n9j2n4J0J73j01j04Q2N3O5
$$ -99 32 -24 28 32 -10 100 193 40 58 48 -95 26 153 203 18 -113 6 -46 -7 47 -12 -24 -78 -68 105 4 -100 -18 35 100
653A00m1k47J48R5j00p8P5p8oJ62L3L8N3k3o6n6P5p1j33K18j17R7r5R1p6OOj60j9J36m7o4
$$ 100 59 -188 -40 55 -45 -123 -48 -126 -132 30 63 101 154 131 65 9 84 13 -120 98 -19 78 -17 74 -2 4 10 -150 -169 -33 -80 -144
373a44K88J2q1o8j9L8j29Q3m0l0j5N2m0K3J2k3J50j56P1j6J12j70L2R6q6n5P1m6r1O1J00N6
$$ -144 144 156 75 7 -12 26 -103 -20 -60 -90 -105 -53 -93 -70 -58 -81 69 -87 -16 -32 80 -90 -58 38 -48 -103 -32 -78 -169 -108 -8 48
93D8p4J88j04j05K4J24N6j66K6o0P4n1j11J87O8o2m4m5k3J29j42MK46r4j15N6j97Q9M2J9M4
$$ 48 -26 162 58 -47 -23 101 157 -9 17 -43 31 -20 -131 56 124 62 18 -27 -50 79 -63 -59 187 93 -22 34 -163 -74 -32 -13 31
-178C1M2l7o4J27j2p1
$$ 31 73 36 -28 99 87 16
-230A6
##PAGE=	F1=3332.44
##FIRST=	23146.756194512010552,	4241.1435120000014649,	-0.05402903631329536438
##DATA TABLE=	(F2++(Y..Y)), PROFILE
4241E3p9Q3RJ5m3j42N8l3J35J6r5n8R0n9J67j09ONQ0j82k6K5P6j1%j90J05J98o9Kj33k5N0
$$ 53 -26 57 66 81 38 -104 -46 -79 56 72 -23 -81 9 -50 117 8 14 19 99 -83 -109 -84 -8 -19 -19 -209 -104 94 25 27 -106 -131 -81
3952h1J22k1P6j04R8o5r6l6j4m5K18j78QQ1n3J25N4l7N2j84Q7p0J37r1o0Ln4J84L8p5R5p7
$$ -81 41 20 96 -8 90 25 -71 -107 -121 -166 52 -126 -118 -37 -90 35 89 52 104 -80 7 -63 74 -17 -77 -74 -128 56 94 19 114 37
3672C7No7N0j65O1J62j12KN5J2J8j33L4J09k53J08J04R8n7k4j68J59Jq7O9M3m9K5J1j79R1
$$ 37 42 -25 25 -140 -79 83 -29 -27 28 40 58 -75 -41 68 -185 -77 27 125 68 44 -124 35 36 -51 18 61 12 37 48 -131 -40
3401d0J1jJ12J9q5j1J0%Om9J03j94O4Q7m4O6o9K4J8%k20J33J32M8k9L9j19p1L0oR8P3j72O0
$$ -40 -29 -30 82 101 16 5 15 15 21 -28 75 -119 -55 32 -12 54 -15 9 27 27 -193 -60 72 120 91 130 11 -60 -30 -36 62 135 -37 23
3104B3J6Mm8q7J63j27M9P8m2m7kq4J39k7J39j28j75J40J07j04n1J25m8o7n2p7J42J2n9Q5q
$$ 23 39 43 -5 -92 71 -56 -7 71 29 -18 -20 -104 35 8 147 19 -156 -16 91 -13 -64 61 13 -54 -106 -183 -41 -29 -88 -3 -11
2832a1O6R7j77p3k3jK21k1K0q4P2m8n7j11Q0O7k7j4J2J32o9n0o7J12j09J68n3R6k82J40o8
$$ -11 55 152 -25 -98 -121 -122 99 78 98 14 86 38 -19 -130 -50 17 -10 -24 -12 120 51 1 -66 46 -63 105 52 148 -134 6 -62
2561f2O2R8j43okp9J12J36%j27J56j43q5K08j49J12n6j31R7K6l2j52J96k8Pl2J51j03o7J3
$$ -62 0 98 -45 -51 -53 -132 -20 116 116 -11 145 2 -83 125 -24 88 32 -99 -2 24 -8 -160 36 8 15 -17 134 31 -36 -23
2299b3J37j61J8J2oj14J94j07J42o1J25j93M0n4R5Q3p3j10o7J19o6J39k8q6M3O0j6l9p1J04
$$ -23 114 -47 -29 -17 -23 -137 57 -50 92 31 156 -37 3 -51 44 127 54 -56 -123 -4 -70 69 41 -45 -2 58 42 3 -68 36
2036C6J66j51L8l6l8q8L7j01J12pJ32m3m1L1J8N7j7j38J02j13J00j5K0L9n0J12l0j27n7J03
$$ 36 202 51 89 53 15 -73 -36 -137 -25 -32 100 57 16 47 65 122 105 -33 69 -44 56 41 61 100 50 162 132 5 -52 51
1773E1K1o8K3Q1j36k5PJ20K1n1M4j5q2pj6j10K47j37PM3P5Pj03o5K08q4Qo0o8M8K6loJ08o4
$$ 51 72 4 27 108 -28 -53 -46 74 95 44 88 73 -9 -16 -32 -142 105 -32 -25 18 93 100 -3 -68 140 56 64 4 -64 -16 10 7 1 109 45
1467D5l7m3P9M1j84Q7J5J7P1J08j80N9P4j71J45m4m8J2Q5j41L4l1P1j8j06J30r3Q6M8j05j23
$$ 45 8 -35 44 85 -99 -12 3 20 91 199 19 78 152 -19 126 82 34 46 131 -10 24 -7 64 46 -60 70 -23 63 111 6 -117
1196a17J25M0k9j01N8R6l6N7n2jj35J4K4J13j00R9j1j14J0N9M7m6P6o6L4o5j9L5J36n5j66
$$ -117 8 48 19 -82 -24 72 36 93 41 40 -95 -81 -57 56 -44 55 44 -70 -60 -1 46 0 76 10 44 -21 -40 -5 131 76 -90
925i0l0J46p0P1K0o9R5O2o7J9pj81R2J30M8j65r0P1p6L1J43r1Qk9K3J16j30j23P9J08O9l7
$$ -90 -120 26 -44 27 47 -22 73 135 68 87 80 -101 -9 121 169 4 -86 -15 -91 -60 83 -8 0 -29 -6 110 -20 -143 -64 44 113 76
645G6k66Q8J76j28p1J19j56j7K06J3O3O3pq1n9M1j11r5K37j04Q8j02J21n4K5k2j54kP7jq3
$$ 76 -190 -102 74 -54 -125 -6 -162 -179 27 40 103 166 159 78 19 60 -51 -146 91 -13 75 -27 94 40 65 43 -111 -113 -36 -37 -120
373a20K85j2n4p9k0J9j33RNK9L5M5m2l7l7J1J72j20K3%J13j76K4R5n8k5L8m6q9P4M5K4n7K45
$$ -120 165 153 99 20 0 19 -114 -105 -100 -71 -36 9 -33 -70 -107 -96 76 -44 -21 -21 92 -84 -60 35 -23 -48 -10 -56 -145 -71 -26 -2 -59 186
76A86r4j54J2J24J07j99M0p1J01n2q3J48K0j8o7pKO7j50O4J84p6j24P4j66Q4P1j9K3L4m5k8
$$ 186 92 -62 -50 74 181 -18 22 -49 52 0 -83 65 85 67 0 -7 -5 62 -88 -24 160 84 -40 34 -132 -48 23 4 27 61 16 -12
-204a2J04op2
$$ -12 92 86 14
-230A4
##PAGE=	F1=3238.09
##FIRST=	23146.756194512010552,	4241.1435120000014649,	0.063617751002311706543
##DATA TABLE=	(F2++(Y..Y)), PROFILE
4241G3o2L6kJ9j7j35%M9J07L4j10j14J21p3K00j06l2L0R8j99j8J7K8klj26L8J84l9Jj24qL5
$$ 73 11 47 45 64 47 -88 -88 -39 68 102 -8 -122 -1 -74 126 20 -12 18 116 -83 -101 -84 -56 -58 -61 -187 -149 35 -4 -3 -127 -135 -100
3952a00J42J2P7j03Kkm2j05K3p4J81j00M2R5j38J08N8m3K3j73J04o1J19o0l9or1K08J0OP6
$$ -100 42 54 131 28 30 28 -14 -119 -96 -170 11 -89 -47 48 -90 18 76 33 56 -117 -13 -74 45 -15 -54 -60 -151 57 67 73 149
3681A49j14J2p9P9j25j5J35r1m5O8O4J0j19M6J20k64J42N6P3j9p1j23J65jn7O3j8k5O6j1j74
$$ 149 35 47 -32 47 -78 -93 42 -49 -94 -26 38 48 -71 -25 95 -169 -27 29 102 83 12 -111 54 53 -4 59 41 16 82 71 -103
3410a03R1NLN2K3m9n1M7K1p4J4O0j59O5J23q7J30j24j6j0O3j67J02J31n0k4Q6j20rJ2k3Q8
$$ -103 -12 -7 -4 48 71 22 -29 18 39 -35 -21 39 -120 -55 68 -19 111 -13 -29 -39 24 -143 -41 90 40 16 102 -18 -27 -15 -38 50
3130E0J07j79J6N9l8j4j05J67j27L3P6j4q6K4o2J03kJ34j26j76J39J44j59l3J17k1j10q3q6
$$ 50 157 -22 -6 53 15 1 -104 63 -64 -31 45 31 -55 -31 -93 10 8 142 16 -160 -21 123 -36 -69 48 27 -83 -166 -252
2876b52K02J7l0O7J2L7J11j45n5m6rJ98m5R0j11L2l3o9j25Q7J19o8OoO8l7k0q4J28r0J68k0
$$ -252 -50 -33 -63 4 16 53 164 19 -36 -82 -91 107 62 152 41 73 40 -29 -154 -67 52 -16 -10 -16 52 15 -5 -89 39 -51 117 97
2596I7M3k67J33p6O2J11j95N7L9j18J41J07k4p6J10j02j52K37j27J26m0j55R1Jj4j34J65l4
$$ 97 140 -127 6 -70 -8 103 -92 -35 4 -114 27 134 110 34 144 42 -110 127 0 126 86 -69 22 23 9 -125 40 6
2351FK1q7J82j17noJ26j52k5K5M1r0J03o6J62j08J51k36J05m0O3P8k3j24o1J21j14J52m2o2
$$ 6 27 -60 122 5 0 -6 120 -32 -57 -32 9 -81 22 -44 118 10 161 -75 30 -10 53 131 108 -16 -77 44 -70 82 40 -22
2089b2K2j7P7o9p4J35J34j27j4Jn7o5M3j22J54l9J36l8j6k6K5J53r3j86J60j16R9m3J8Q4p0
$$ -22 0 -17 60 -9 -83 52 186 59 45 46 -11 -76 -33 -155 -1 -40 96 58 42 16 41 194 101 -85 75 -41 58 15 33 117 47
1817D7J06J3j33r4J28k1j02O6Q5r8q9k2J89N4n0M4j2j21k9n1o9K64r7j9M8M2qq1n5J36lO2
$$ 47 153 166 33 -61 67 46 -56 10 95 -3 -92 -114 75 129 79 123 111 -10 -39 -90 -159 105 8 -11 37 79 71 -10 -65 71 68 130
1537A30j47m9L3M3M8J5K7r1j4n0J06lj36O0L8K7J11K0j21N7J3j51K02j18J1rO6j22%L7No8
$$ 130 -17 -66 -33 10 58 73 100 9 -5 -55 51 48 -88 -28 10 37 148 168 47 104 117 -34 168 50 61 52 118 -4 -4 33 38 -30
1257c0JJ06q1J7J00j17j15J24J5K8j05N1Q9m5L2n2k0r3P7j6P4p5J11l1q3k5N4J8MK2j9L6k1
$$ -30 -29 77 -4 13 113 -4 -119 5 20 48 -57 -6 83 38 70 18 -2 -95 -18 -34 40 -35 76 45 -38 -63 -9 9 13 35 16 52 31
968C1p1K4J47j02j42j1J53q3O3L9p9R1mL4j4Qj64L8J08O0j42l9Op4J2J79r8K6J6M4M4j57j05
$$ 31 -40 -16 131 29 -113 -124 29 -54 9 48 -31 60 56 90 76 84 -80 -42 66 126 -16 -55 -49 -123 -111 68 -30 -4 12 56 100 -57 -162
680a62P3J43N1j9k46K8J97j08q3J58j86m0K09j7Q0P2J4r1j3qj56n4K20p1M7o8J22jM9n2j46
$$ -162 -89 54 105 86 -160 -132 65 -43 -126 32 -154 -194 15 -2 78 150 164 73 60 52 -104 -158 62 -9 38 -30 92 91 140 88 -58
408e8K4%L4r6K57j2n2m7m1lr4o6N6N6O8K6l2p3p5J8K16r8n4L0Q6j34K3O1l7K7Lj9r1R1m0n
$$ -58 -34 -34 0 -96 161 149 97 50 9 6 -88 -154 -98 -42 26 52 20 -53 -128 -110 106 8 -46 -16 70 -64 -41 20 -17 10 13 -6 -97 -6 -46 -51
93e1j8K52j03j54l0J38J37k05O2o9J11m9q0J06j2L1p7oL6J4j30R5J09m8j19J07j25M7O2j1
$$ -51 -69 183 80 -74 -104 34 171 -34 28 -41 70 21 -59 47 35 66 -11 -17 19 33 -97 -2 107 59 -60 47 -78 -31 31 20
-169B0pJ4k9j1Q5j3n0
$$ 20 13 27 -2 -13 72 59 9
-230I
##PAGE=	F1=3143.74
##FIRST=	23146.756194512010552,	4241.1435120000014649,	0.19589303433895111084
##DATA TABLE=	(F2++(Y..Y)), PROFILE
4241G4l2nj7OM0j12o7J01J03Lo2j41J10p7J81m8q5L9Q4j58oj9j5L3j8p4j3J67lk8j00K0J5
$$ 74 42 37 20 26 66 -46 -113 -12 91 94 32 -109 1 -76 105 57 -28 11 95 -63 -69 -88 -103 -70 -88 -162 -175 -8 -11 -39 -139 -119 -104
3952a04J45N1M1p5q2M0J0j63R9j12J40k9O6R4k23R0N7m2Oj16P6m2Q2l3jk3r8J99j3M0Q8j34
$$ -104 41 92 133 58 -24 16 26 -137 -38 -150 -10 -39 27 121 -102 -12 45 3 9 -107 -31 -73 9 -24 -25 -48 -146 53 40 80 168 34
3672C4j1m8J08r7r8J01m3q0Q5P7K7r1L4Q4k24J58J5K7J1p9p1J60j3k1N9j04K4R1l8j22Q2j9
$$ 34 23 -25 83 -14 -112 -11 -54 -134 -49 28 55 -36 -2 82 -142 16 31 58 69 -10 -81 79 66 45 104 0 24 115 77 -45 37 18
3392A8K7k1lj5o0P3M0j43O8K7j12N7J18j13J90j23r1m4J18q5P2R5j10j8P0n8L6j9o3Q7J17
$$ 18 45 24 21 6 -54 19 59 -84 -16 11 -101 -44 74 -39 151 28 -63 -107 11 -74 -2 93 -17 -35 35 -23 13 -6 -69 18 135
3121A35j26l6R1n5Kj30J77j30J7O9J8q7L4m6N7kJ28j04j69J37J58j95J0Q0J1j49p8o8J92L9
$$ 135 9 -27 64 9 11 -119 58 -72 -55 14 32 -55 -21 -67 -10 -12 116 12 -157 -20 138 -57 -47 33 44 -105 -183 -251 -59 -20
2859b0k3K3L9K7J36j40l9j8j8J47o0J32j06m7k1o2j18P8J57q6L5mj2k7Qq3J27p0J60L0n2j88
$$ -20 -43 -20 19 46 182 42 3 -15 -33 114 54 186 80 33 12 -50 -168 -90 67 -19 16 12 0 -27 -19 -102 25 -45 115 145 93 -95
2579i5J01q1Q6Q0k01R7P5j34J51K1rk3Q3o0k34K41p9J18mj58O4k9J0p0O9j8K8j20K03j23P7
$$ -95 6 -75 11 91 -110 -13 62 -72 79 100 91 68 151 91 -143 98 19 137 133 -25 39 10 20 -50 19 1 29 -91 112 -11 66
2307F6j3M2j20p0O5P2n3Ol8J74j58J65k27J49l4K1N6K9r4n7Q9j32J38m5n5J6p5J55j10m7J45
$$ 66 53 95 -25 -95 -30 42 -11 -5 -43 131 -27 138 -89 60 26 47 103 132 38 -19 70 -62 76 31 -24 -8 -83 72 -38 -85 60
2036F0P9r0o0M4n8l1M9j27J48m4J13j7J0n5kK06j26k22K02j15Q0m8LJ28q5R3L4j15j12J42
$$ 60 139 49 -11 33 -25 -56 -7 -134 14 -30 83 66 76 21 19 225 99 -123 79 -36 44 -4 -1 127 42 135 169 54 -58 84
1773H4o0j16R2N9l8j11r7K42P1j6M5Jj41n8p5j7K07l1n0N2K%n0k1J3P7Q5j71n7N2M4P6M1l2
$$ 84 24 -92 0 59 21 -90 -187 55 126 110 155 156 15 -43 -118 -135 72 41 -9 43 45 45 -5 -26 -13 64 149 -22 -79 -27 17 93 134 102
1476A02j27J5m8P5j2o7MN1N3J37l6n7Lk0r5J83j45Q5n0M8r2m0Q1m3j21J23O0o3n4J29p9j20
$$ 102 -25 -10 -58 17 5 -62 -58 -7 46 183 147 90 93 73 -22 161 16 101 51 99 7 -33 48 5 -116 7 67 4 -50 79 0 -120
1196a20J28j5N5p8M0N4k8%j9r2l0J65o6N6r3J32l6n5o4O1qL3j6J3N8K9j31J7J21j42r6J7J59
$$ -120 8 -7 48 -30 10 64 36 36 17 -75 -105 60 -6 50 -43 89 53 -2 -66 -5 -13 20 4 17 75 104 -27 -10 111 -31 -127 -110 49
907D9j12M0N5o4Q2p3J23n8J7r5j0N5Q3j31Mn0n0j8J69q4L4N9O9k4j60o6Q3J26K9J2k06kJ55
$$ 49 -63 -23 32 -32 50 -23 100 42 59 -36 -46 9 92 -39 -35 -85 -135 -153 16 -68 -34 25 94 70 -90 -156 -73 53 82 94 -112 -114 41
618D1n0j20J80j55o7J74n5Q4Q7L0q3O2o3j81l3J67m0J2k6J05L6Q3p5j15K5n3N8j03K01Ln2
$$ 41 -9 -129 51 -104 -171 3 -52 32 119 149 66 128 65 -116 -149 18 -22 -10 -36 69 105 188 113 -2 23 -30 28 -75 126 129 77
347G7Po8k3l5j06Q7N2O4J6k4p6j03J8K60r1j36N0N8p0M0Lk1P4l6L3j01J17j18l0M1J86j23
$$ 77 84 16 -7 -42 -148 -61 -9 55 71 47 -29 -132 -114 146 55 -81 -31 27 -43 -3 0 -21 53 17 50 -51 66 -52 -82 -41 145 22
67B2j09o3J53J27j82Q8n6J00l7j04N8mO1o1l4O8j7j05Q1N6j6j08J48p1lKK9k6%j2k0P6j1k0
$$ 22 -87 -150 3 130 -52 36 -20 80 43 -61 -3 -7 54 -7 -41 27 10 -95 -14 42 26 -82 66 -5 -8 -6 23 -3 -3 -15 -35 41 30 10
-230A0
##PAGE=	F1=3049.38
##FIRST=	23146.756194512010552,	4241.1435120000014649,	0.06922098994255065918
##DATA TABLE=	(F2++(Y..Y)), PROFILE
4241E6rj4l3j2R1p1j19J05J19n1J9j35P4p6J22L8j46L1N7o9Qo9l4N7k5m1n4J60J6n3o6M0j
$$ 56 47 33 0 -12 79 8 -111 -6 113 62 81 -54 20 -56 66 104 -42 -11 46 -23 -15 -84 -118 -61 -86 -127 -181 -21 -5 -58 -124 -84 -85
3952h5J25Q2l7k0j12M7L6j93J86j48J09JR0P8k80J01M5m0j2l7K0j4O2l9K9n0p0J78k7J7J06
$$ -85 40 122 85 65 -47 0 36 -157 29 -119 -10 -9 81 159 -121 -20 25 -15 -27 -64 -44 -58 4 -35 -6 -56 -126 52 25 42 148
3681A48j13m8J6J30j11j45P6Jq5R8M2O1n7RK8j39J39k4j5K4l5m7J39k3J0M9j67P4Q8n4n4P3
$$ 148 35 -13 3 133 22 -123 -47 -46 -131 -33 9 70 13 22 50 -89 50 26 11 35 0 -47 92 69 79 128 -39 35 123 69 15 88
3401H8n5N8p5l8lm1Q3N6j86J01K1p4K6Q3j09K22n6j72q3J57j2N3K4r6j2NL5M9m7j04Q9R0l4
$$ 88 33 91 16 -22 -25 -66 17 73 -113 -12 9 -65 -39 44 -65 157 101 -71 -154 3 -9 44 68 -28 -40 -35 0 49 2 -102 -13 77 43
3112D3p3J02lm4j53J92j18pN3L1l0K0n1jj0J24o0j54J25J55k02O4L8L4n4J38o9p3rm2K5K9
$$ 43 -30 72 69 25 -128 64 -54 -61 -8 23 -7 13 -38 -39 -49 75 15 -139 -14 141 -61 3 41 75 21 159 90 17 8 -34 -9 20
2832B0J3J51j60qL4k4P8m2J29q5j24j5l6j03N8J85p4M6J6p6l0Rn5J04o2J54O8j39q1O5q1J04
$$ 20 33 184 24 16 50 26 104 62 191 106 -18 -33 -69 -172 -114 71 -3 43 59 -17 -47 -38 -93 11 -51 103 171 32 -49 16 -65 39
2552C9J6j52J03Q3j09J32q7L5RR2m5k90K18k0R2L0j45L6m1K7Om4J6J1j09J98j04J32Jp7q1
$$ 39 55 -97 6 89 -20 112 25 60 69 161 116 -174 44 24 116 146 1 37 -4 23 29 -15 1 12 -97 101 -3 129 130 53 -28
2281b8j06J21P0pp1l2J82j90J54j62J47l5j4K3O4k9o2L6j19J20l1p8J4p7J93j61JJ34L4n2
$$ -28 -134 -13 57 50 -21 -53 129 -61 93 -69 78 43 29 52 116 87 25 61 -58 62 31 -47 -33 -110 83 -78 -77 57 91 39
2019C9j08Q2k4qN1j32J23j7P0MK8n4l5J91j04k40K06j04N9l7l3J75r2Q2K5o4j26J36p7j10
$$ 39 -69 13 -11 -19 32 -100 23 6 76 80 108 54 19 210 106 -134 72 -32 27 -10 -43 132 40 122 147 83 -43 93 16 -94
1756i4R7KL8j16j74K62P2L1M8K3j38p9q8L4R6L1n4N8m2K8m3L8j09J39O0j27q3Q2K2R1N6m7
$$ -94 3 5 43 -73 -247 15 87 118 166 189 51 -28 -116 -82 14 45 -9 49 7 35 -8 30 -79 60 120 -7 -90 -8 14 105 161 114
1476A14j60M9m9oJ4Qn5M6P2J62n2j9p1j2m2J07j22J48r5L8n3o5Q0p2j40K11Ll0r5J06kj40
$$ 114 -46 3 -46 -52 -38 -30 -85 -39 33 195 143 124 53 41 -1 106 -16 132 37 75 22 -43 37 -35 -175 36 39 9 -86 20 18 -122
1196a22J45l7M4m6M0K5pl4L1j67K7K12r8N7j28J46k5l4r8P5k4L1k4L4Q5O0j65PP2j75l6M1
$$ -122 23 -14 30 -16 24 49 42 8 39 -128 -101 111 13 70 -58 88 63 29 -69 6 -18 13 -11 23 108 168 3 10 82 -93 -129 -88
916h8J61j58L3O6m3N8j13J77q1Ook3j6J06j35K5r0j7l8J39n9L6P3P5o4j25l4J21M4K3N1j74
$$ -88 73 -85 -52 14 -29 29 -84 93 12 18 12 -11 -27 79 -56 -31 -121 -138 -176 -37 -96 -60 13 88 24 -101 -135 -14 30 53 104 -70
636g0J6P7J0j64J84q8j00J34q9P3J02L5o1J39j11j70m0J03k9J5k0R3L1J09p8n6j8n5Q1j04
$$ -70 -54 23 33 -131 53 -35 -135 -1 -90 -17 85 120 59 198 87 -83 -123 -20 -49 -34 -54 39 70 179 101 45 27 -28 53 -51
373e1J20Pk3N2q2l9J3j01Q3L6K5M0l3n0j28L4K79r9j91M1M7j0P6o0j3R9p8Q8r7J45j73n5J07
$$ -51 69 76 53 105 23 -16 -3 -104 -21 15 40 80 47 -3 -131 -97 182 83 -108 -67 -20 -30 46 -14 -27 72 -6 82 -15 130 -43 -98 9
85IP0j34l7n9J60O9j46J09m0P9k3j25NK7O2j6o8R1k5r1K7L9J2r9J88j7m6q3P3k6Nj6m5P6J3
$$ 9 79 -55 -92 -151 9 78 -68 41 1 80 57 -68 -63 -36 26 10 -58 33 8 -83 -56 -17 -5 -104 84 67 21 -62 11 -15 -10 -26 -71 5 18
-222A8O
-230B4
##PAGE=	F1=2955.03
##FIRST=	23146.756194512010552,	4241.1435120000014649,	-0.016687611117959022522
##DATA TABLE=	(F2++(Y..Y)), PROFILE
4241C4rJ1m6k1J06j7j40P1J28q3P9j00L2p8N6J14j92J2M1K7K1j12k5M4j4k0q4J61km1k7K5
$$ 34 25 36 -10 -31 75 58 -82 -11 117 34 113 13 45 -33 23 137 -55 -43 -2 25 46 -66 -91 -47 -61 -81 -165 -4 -6 -47 -74 -49
3961d9mQ9J00j34M9r1L5K7j94K51j65R1k0J11O1k87J46J5m8l8L4l1J0Q4p3K9q3j2J49l2l7
$$ -49 -53 36 136 2 51 -40 -5 22 -172 79 -86 5 -15 96 157 -130 16 31 -17 -55 -21 -52 -42 42 -31 -2 -85 -97 52 20 -17
3690a7R9n2p0Q0J34j53j36O8J1n3R6j7Q5k2qj9m1Q8n3m5K5L5o0J07k5L2L2j78J04N8n0oO0
$$ -17 82 30 -40 40 174 21 -115 -47 -36 -89 7 -10 75 53 45 26 -15 73 20 -25 0 35 -25 82 57 89 121 -57 47 105 55 49 109
3401A09p6P5r4o7qqQ3O3j93J09L6m4l4L7p6K20M2k25j12J74K3M7o4j8ro2J08L6n1j31P5M6
$$ 109 33 108 14 -53 -61 -69 14 77 -116 -7 29 -15 -49 -12 -88 132 174 -51 -163 11 34 81 17 -1 -10 -72 36 72 21 -110 -35 11
3121A1M9p9J03J15j48j64J88p6l3K6J8O0j4q3n0mJ18pj36J01J46j81J16J4N0K62O97j41p14
$$ 11 60 -19 84 199 51 -113 75 -1 -34 -8 10 70 56 -27 -77 -81 37 30 -106 -5 141 -40 76 90 140 402 1099 958 244
2867B44k01p6J29l6n0J46j85L5Q0k0Q%R3o9j57k0Or3L8K04m5J8M6j01k9k7MN6p2J55P9j77
$$ 244 43 -33 96 60 10 156 -29 6 86 66 74 74 167 98 -59 -79 -73 -166 -128 76 31 49 95 -6 -35 -62 -58 -2 -74 81 160 -17
2587a7ML8o4R0m8o2Q3N3n8Q8j61P4K1J15o5k78J74K2O0M3j17J6l2L7O5j29N1k5n9J56n3J31
$$ -17 -13 25 -39 51 3 -59 24 77 19 107 -54 20 41 156 91 -187 -13 9 69 112 -5 11 -21 16 81 -48 3 -22 -81 75 22 153
2307A53L5j79l8j29J67L2L8j07m6J89j83J12o9R4l7l6MO5M5p1j0r5J22j3j13Pk3J79k06N4
$$ 153 188 9 -29 -158 9 41 79 -28 -74 115 -68 44 -25 69 32 -4 0 65 110 39 29 -66 56 43 -70 -63 -86 93 -113 -59
2045e9J06J2j5j61J04M0j1N0j43J04L0K1J1K9l5m4J21l8k38J73q9M8j7p7K02q1O6QJ0j52J14
$$ -59 47 59 44 -117 -13 27 16 66 -77 27 57 78 89 118 83 39 160 122 -116 57 -32 16 -1 -78 124 43 109 117 127 -25 89
1773H9o1r8Q8p0J10j37k01K42P3N9N3M1j27p1r4P9j6N9k6O7p7O0p4J08j73J68ln3j02Q8qR9
$$ 89 28 -70 18 -52 58 -79 -280 -38 35 94 147 188 61 -10 -104 -25 -41 18 -8 59 -18 42 -32 76 -97 71 68 15 -87 1 -7 92
1493I2N3j8j71P2n3j01N5O7p9K1N6J93l5k2j22J9j2K4q0J80j25L7j7n9M7j04j04K26m0J5q3
$$ 92 145 127 -44 28 -25 -126 -71 -4 -83 -62 -6 187 152 130 8 27 15 39 -41 139 14 51 34 -25 22 -82 -186 40 0 15 -68
1222f8K8P9j62J52k7J3l4N8K1%o2Q1k11O7J80r9O1j40J34Lj9j22Q3k1qj3N7R7O5j51Pjj90
$$ -68 -40 39 -123 29 2 15 -19 39 60 60 -2 79 -132 -65 115 16 77 -63 71 74 55 -67 16 -5 -13 -26 31 128 193 42 49 48 -142
933a42K9M5J52k06O4P8m4K4j13J86p3j6N8jp0J17j45K2j26J6l0J21l4K8O0L8o0o4j6J66p6
$$ -142 -113 -68 84 -122 -58 20 -24 0 -113 73 0 -16 42 41 -29 88 -57 -35 -161 -145 -175 -54 -88 -60 0 38 -22 -86 -102 64 -12
662a2L5Q2j52O4J2L2j89J76k4j44J23j05M7J11L6n1J91j33j34n7N9k8N0p6J03JJ01o0J8r0
$$ -12 23 105 -47 17 29 61 -128 48 24 -120 3 -102 -55 56 92 41 232 99 -35 -92 -33 -61 -11 -87 16 17 118 58 76 -14
400a4j5J10r6K7j6M0O4p2l6J3n7N0K2k1R2o3qj47P3K59j23k00J0N1K8J21j01k0R4j12J20n7
$$ -14 -29 81 -15 12 -4 36 100 28 -8 5 -52 -2 20 -1 91 28 20 -127 -54 205 82 -118 -108 -57 -29 92 -9 -29 65 -47 73 16
120A6J55j98q0J58m2j31M0j6J63l6j08J17k8O0j7j05m4M6L4N1r8J01pq5m2M2K3q5K09J4o4
$$ 16 171 -27 -107 51 9 -122 -82 -98 65 29 -79 38 10 70 53 -52 -96 -50 -16 35 -63 38 31 -54 -96 -54 -31 -116 93 107 43
-152D3j51J08j8K7n4n9Q0N1J6
$$ 43 -108 0 -18 9 -45 -104 -24 27 43
-230D3
##PAGE=	F1=2860.68
##FIRST=	23146.756194512010552,	4241.1435120000014649,	0.14781598746776580811
##DATA TABLE=	(F2++(Y..Y)), PROFILE
4241A8l0N4m7j5P2L8j28K8J07o4Q3m8jr0J0J55k00nL7Q7L3j39JLJ2Jr6J53n2RJ7l5LN4J10
$$ 18 -12 42 -5 -20 52 90 -38 -10 97 33 116 68 67 -23 -13 142 -58 -63 -26 61 94 -45 -44 -41 -29 -28 -124 29 -23 -14 3 -32 -29 25 135
3935A35k15J03n1L4j0j72K75j57Q7p8J24M8k41K03k4p5o0P0n0J4J43j08lj12N8J06k9q6O4
$$ 135 -80 23 -28 6 -4 -176 99 -58 29 -49 75 123 -118 85 61 -14 -74 -4 -54 -40 103 -5 -8 -120 -62 44 15 -71 -7
3681gK3o5J05J19j79q6P5k2OP8p3R0Pnn4L2M6n7p9K7Q1q4P8k5N4Oj44J09J4k8%M3n9O6q9q0
$$ -7 16 -49 56 175 -4 -90 -15 -37 -31 47 -26 64 71 66 12 44 90 33 -46 -19 62 -22 56 31 85 91 -53 56 70 42 42 85 26 92 3 -77
3366g7qJ6P6O2j56R4N1k0j07j3k0J95J22k32j14J65J7M5j37P5j1p6J16J6k9j38L6J3Q6n1J06
$$ -77 -85 -69 7 69 -87 7 58 38 -69 -82 -102 93 215 -17 -131 34 51 96 -41 34 23 -53 63 79 50 -88 -52 -39 47 -4 102
3095A02K45k55j55J43j4m7kj2J32n7j25p3L0J02M5j23O4J42j46J49J9P2P23J482k86j584n07
$$ 102 347 92 -63 80 66 19 17 5 137 80 -45 -118 -88 14 59 -64 0 142 -4 145 164 236 959 2441 2155 571 64
2859F4j08L07j27j61J28j96P9R4j1k8L2N1q0j14m2M6q3K6K10j9m6O9q7nq7P7j2q9J54P3j64
$$ 64 -44 263 136 -25 103 -93 -14 80 69 41 73 124 44 -70 -112 -66 -149 -123 87 68 22 91 4 -1 -88 -11 -23 -112 42 115 -49
2587d9M1K7k3M7q8L0N6JnK2j63Q6K2J17r8j90J15L2L8L2q5Qk1M5R8j60O7o7PQ1K2Q0P3k19
$$ -49 -8 19 -4 43 -45 -15 41 42 37 59 -104 -18 4 121 23 -167 -52 -20 18 50 -35 -27 -48 -3 95 -65 2 -65 -58 23 45 125 198 -21
2290b1Pj34J84l5O4r9o3J85j29N0J5J1l5o0K6L4J03q0k8q0J50rj29kM8J23k26R6O5J2J5k11
$$ -21 -14 -148 36 1 65 -34 -97 88 -41 9 24 35 0 -60 -34 0 103 23 -5 -85 65 56 -73 -75 -27 96 -130 -34 31 43 58 -153
2010a53J06J11k4L8j41Q3P2j5PPj3j8L5M4k15J21q4N3Mj07J85m8L0K0P3j89R3k0r2P4j24J54
$$ -153 -47 64 40 78 -63 20 92 77 84 91 78 60 95 139 -76 45 -39 14 18 -89 96 48 78 98 171 -18 75 55 -37 37 -87 67
1730F7j86j59J82R9M1O4M0j22k8r7J10p8M9PP6q9P7j27J66j55J65p7Nj01N7k4R9L5K6j49P2
$$ 67 -119 -278 -96 3 44 108 148 26 -2 -99 11 -67 -18 -11 65 -24 53 -74 92 -63 102 25 30 -71 -14 -38 61 96 122 -27 45
1458D5m8j66R4Q1n1j4%K22nn3j24L6Ql0m5J72j32N0Ml5J3j51k0J71n6O1l5p3J35j71J25J8
$$ 45 -3 -169 -75 6 -45 -59 -59 163 158 105 -19 17 25 -5 -50 122 -10 40 44 9 22 -129 -149 22 -34 27 -8 -81 54 -117 8 26
1178B6om3P7M5j1r0J21k13Q8R1o8L9j04R1M7j3j34P9jp4kQ3R0M7r5K8q9j75Q5L0J29k30J21
$$ 26 20 -23 54 99 88 -2 119 -94 -6 85 17 56 -48 43 90 77 -57 22 21 -53 -55 28 118 165 70 98 9 -166 -81 -51 78 -152 -31
890c1R9p9nr0J56m8k9O4M3q0J06j40Nj71N2%J27k0PL8l5j6kj0J86j90N8Q1j10J05j6Lj68J54
$$ -31 68 -11 -16 -106 50 2 -27 37 80 0 106 -34 -29 -200 -148 -148 -21 -41 -34 4 -31 -47 -49 -59 127 -63 -5 76 -34 71 55 58 -110 44
592D4Rj89J47j00J3J00N3o7J99j23r0o2N1j7P7j70J33j2M1k8P5j46K8J40q3n2o1J17M2l9j3
$$ 44 53 -136 11 -89 -76 24 77 10 209 86 -4 -66 -15 -32 45 -125 8 -4 37 9 84 -62 -34 106 23 -29 -90 27 69 30 17
321A7l2oJ4J5n0J43r5L1j50J22K06j61j64k1N7M0J53j00m5O7j28J21RJ33j85r7J72j09j19
$$ 17 -15 -21 -7 8 -42 101 6 37 -113 9 215 54 -110 -131 -74 -34 119 19 -26 41 -87 34 43 176 -9 -106 66 -43 -162
67a62J02L3J77j52q1J07k3N6k3l9p6K9pJ25j24R1L6p8r0L4K5n8J90jn4j70J32j6N2j05n0Q0
$$ -162 -60 -27 150 -2 -83 24 1 57 34 -5 -81 -52 -59 66 -58 33 69 -9 -99 -65 -40 -98 92 91 37 -133 -1 -17 35 -70 -120 -40
-213d0Q4J3
$$ -40 44 57
-230E7
##PAGE=	F1=2766.32
##FIRST=	23146.756194512010552,	4241.1435120000014649,	0.17707018554210662842
##DATA TABLE=	(F2++(Y..Y)), PROFILE
4241Gn3R5l1rJ3P3r7ON4pL9J4j5j07j9J60j60j3K8Q5N0j51L0m2M0L1q2J26j14P0O5j22%L7
$$ 7 -46 49 18 9 22 95 -2 4 58 51 90 104 89 -18 -37 123 -37 -50 -22 63 113 -38 -8 -50 -10 21 -61 65 -49 21 86 -36 -36 1
3944AJ26k53J16k3N3n7j27K64j34R0j40J22L2j59K34n4j07o5O8l7oK13j26m4j31J17N6k6j02
$$ 1 127 -126 -10 -33 20 -37 -164 100 -34 56 -84 38 70 -89 145 91 -16 -81 -13 -50 -56 157 31 -13 -144 -27 29 3 -99
3690i9J4R2n1P4Q7j48k7Q3p3O0N2r8P8K7Qq0O0M7l3j20M0O1q9O8l3Q0j7j10J02k5Jk5K5qL4
$$ -99 -85 7 -44 30 117 -31 -58 25 -48 12 64 -34 44 71 79 -1 59 106 73 -47 -7 54 -35 33 0 80 63 -47 55 30 31 6 31 23 57
3384E7q4o4RK0N4N6q0O7N4qj59p0L6J74J47j99q4J34k1M9j73J39j9k6N6%J1j22k3MP1MJ14
$$ 57 -27 -91 -82 -62 -8 48 -32 35 89 81 -78 -148 -112 62 209 10 -74 60 39 88 -85 54 35 9 65 65 76 -46 -69 -65 6 10 124
3095A24L12k98j27N6M3l2k4m5J50r2j46o7P7P4P9j13K1J42j08J55L8R1J113K118m33k273p78
$$ 124 436 138 11 67 110 78 54 9 159 67 -79 -146 -69 5 84 -29 -8 134 26 181 219 310 1423 3541 3108 835 57
2859E7j21M43j76k65J08j77R5Q2mj7L2K3j15j9o9O9o5K1J93j3j14P6m7L9j41J23p7r6J40P1
$$ 57 -64 379 203 -62 46 -131 -36 46 42 25 57 80 -35 -54 -123 -54 -119 -98 95 82 -32 44 -3 36 -105 18 -59 -155 -15 56
2596E6j29L6K7L9Lj04R0L0l9J5m3q2O3K4P9j15o0M7OM1On2Ol1N4J17j46O0r8N9nJ00J4R3j95
$$ 56 -73 -37 -10 29 32 -72 18 48 9 24 -19 -101 -38 -14 65 -50 -110 -63 -57 -16 -10 -62 -56 -87 -33 84 -62 -2 -100 -41 -46 54 68 161 -34
2290c4N2j19J68j06O0o0o8J62n1%O2o9l0r9Q8qJ23p3k3q5J87k8j05kQ7N5k11J18J3K5L7k40
$$ -34 18 -101 67 -39 21 -39 -107 55 4 4 66 -3 -33 -132 -44 -52 71 -2 -25 -110 77 49 -56 -58 29 84 -127 -9 4 29 66 -174
2010a74R0J55k0J2j03M2Q2k7Ok9LK4l0J16j78P6r8P0K6j08J16jk2O4R3k14Q3K1q4N8j29J50
$$ -174 -84 71 51 63 -40 2 84 57 63 34 37 61 31 147 -31 45 -53 17 43 -65 51 50 28 92 185 -29 54 75 -9 49 -80 70
1730G0k34q3R9J53j4P4J6j24L6r5J20p1J2J7P9p4P5j63J85p7J37j30K0q8PoQ6OO0j12N8k8
$$ 70 -164 -247 -148 5 -9 65 81 -43 -7 -102 18 -53 -41 -24 55 -19 56 -107 78 1 138 8 28 -60 -53 -59 27 33 93 -19 39 11
1450A1j84J31M8Lm5p1K38J2p5r1K2L3m4l3J39j24P8Mq%k03P2Q7n1R0J4j37J39j52O0P3Nm1
$$ 11 -173 -42 6 9 -36 -107 131 143 68 -23 -1 32 -12 -45 94 -30 48 52 44 44 -159 -87 0 -51 39 53 -84 55 -97 -37 36 41 0
1161@O6P6j7j30J45j89R4Lj7j8m1L8R2rj38Q3J9j50oJ04P3K2k2N9j65j32J13J2J05k12J61
$$ 0 66 142 125 -5 140 -49 45 48 31 13 -28 10 102 93 -45 38 57 -93 -99 5 78 100 78 137 -28 -160 -47 -35 70 -142 19
890A9J22j23k3o5J06l0k1J2Q6m9P5j05j3k17R2L4J39k1j9K2j08M9L9j2J51k46P3M7k8J09j2
$$ 19 141 18 -5 -70 36 6 -15 -3 83 34 109 4 -9 -226 -134 -100 39 18 -1 21 -87 -38 1 -11 140 -106 -33 14 -14 95 83
618H3n4j08J19J1k13J76q4j7P0R7j03J57q9n3m4P5J5N9k54J73Mm4mR1j40L8J54o7j00r8J71
$$ 83 29 -79 40 51 -162 14 -70 -87 -17 80 -23 134 45 -8 -52 23 38 97 -157 16 20 -24 -28 63 -77 -39 115 48 -52 -150 21
347B1JMK6r7K2%J6n2J56j08N3j24J61J35k03r9k9M5L6J54n7p6K9j28J14N1Q9j33r2J44j32
$$ 21 22 26 52 -45 -23 -23 -7 -59 97 -11 42 -82 79 214 11 -88 -117 -72 -36 118 61 -15 14 -114 0 51 140 7 -85 59 -73
76g3j05J34N7K06k37o3Q6k4O4k3L4q4k5k4J76j50N9R8o5r5JK6j5J30n7k2j50J52l3O8j29l3
$$ -73 -178 -44 13 219 -18 -81 5 -19 45 22 56 -28 -53 -77 99 -51 8 106 41 -54 -53 -27 -42 88 31 9 -141 11 -22 46 -83 -116
-204a16P6Q7R
$$ -116 -40 47 56
-230E6
##PAGE=	F1=2671.97
##FIRST=	23146.756194512010552,	4241.1435120000014649,	-0.025692066177725791931
##DATA TABLE=	(F2++(Y..Y)), PROFILE
4241fn3J14Jj7m1P4o7K0j0M6rO9lj16m3J41r5j0kL1Q4j59M8o7O4O1n1Q8j64J21J01j96k9M2
$$ -6 -59 55 56 39 -2 72 5 25 15 61 52 121 118 2 -41 100 5 -5 -7 24 108 -51 -3 -70 -6 55 4 92 -72 49 150 -46 -75 -33
3944c3J51k37P6j5P1q8o2K38j12Q9j76J10Nq1K25o4j19m4L6ql3K55j28o6j37J47J5k1q8l0
$$ -33 118 -119 -43 -58 13 -75 -137 101 -11 78 -98 12 17 -64 161 97 -22 -66 -30 -38 -71 184 56 -10 -147 0 15 -6 -94 -124
3681a24J46n5J0M0n6RQ0j06Q0L4r2O0L6J9j04N1R6%j51N7j3o6P8n6J09k8j10R7m2J9n2J9M3
$$ -124 22 -33 -23 17 -39 -30 50 -56 24 58 -34 26 62 81 -23 28 124 124 -27 30 17 -49 29 -27 82 54 -56 41 -1 18 -34 -15 28
3392B8nr2j4L3%J5N2J3M0M4j7j61j29P2J65J18j44l7R3p0N7j69J56k7N6l2j5N4q0q8J8K3O7
$$ 28 23 -69 -83 -50 -50 -35 17 30 70 114 97 -64 -193 -121 44 162 18 -19 74 4 61 -108 48 21 77 45 30 84 4 -84 -66 -43 24
3104B4J20K75k49q9l8O4Pm3n6J18j07j28n2J12M1Q3r5j5J23o0J29M8Q6J219K243m95k392q37
$$ 24 144 419 170 81 43 107 114 71 15 133 26 -102 -154 -42 -1 82 -13 -28 95 35 164 212 298 1517 3760 3265 873 36
2859C6j08M62j44l14Q0j32P1O8j1K5LJ8j52O9q5P4m2K0J49k3j56O9kQ7j63J15j19q2J03Q9
$$ 36 -72 390 246 -68 12 -120 -49 19 8 33 36 54 -98 -29 -114 -40 -82 -62 87 64 -92 -23 -25 62 -101 14 -105 -187 -84 5
2596Ej00J4K5J15k8j05J11Km9jq6M7K3K0J7j02O1k5l0O5k6j6Qp2O2J37j17L9j07Q2p4J59l9
$$ 5 -95 -81 -56 59 31 -74 37 39 -10 -11 -97 -50 -27 -7 10 -92 -31 -56 -86 -21 -47 -63 -55 -127 -65 72 -45 -6 -113 -31 -105 54 15
2307A5Q4j28Q5r1J24j51L7j2n9J23J8j7O5j15k7j48J58m1J07m8jj08K06o7m9K1O9Kj62J15
$$ 15 99 -29 56 -35 89 -62 -25 -37 -96 27 45 28 93 -22 -49 -197 -39 -80 27 -21 -22 -130 76 9 -40 -19 50 52 -110 5
2045Em4M9M6k25N6J57J1k2l1k2N1k0K2n3J2M7o3J73j49N8j27R3M2q4K7L4o9J20N0k00Q9L7
$$ 5 -39 10 56 -169 -113 44 55 33 2 -20 31 11 33 -20 -8 39 -24 149 0 58 -69 24 66 -18 9 43 -26 94 144 -56 33 70
1765G0o3M0q0R7k40k1RK21p7P2j5j28R8q3J03k0l3JP6n2O9j54J64J2R5j47Kq3k8M2N9l1O9
$$ 70 7 47 -33 64 -176 -197 -188 33 -44 28 13 -115 -17 -100 3 -17 -50 -49 27 -25 44 -110 54 66 161 14 16 -67 -95 -53 6 -25 44
1476D4p4M5Lj65J63j3L9n2j18K35oo1n0j9O4l4m0J11j19J13rLJ5k30J22K7l7Q6M0j39R8j12
$$ 44 -30 15 18 -147 16 3 42 -10 -128 107 101 40 -10 -29 35 1 -39 72 -47 66 57 60 75 -155 -33 -6 -43 43 83 -56 42 -70
1196g0j3J06M0oRR5Qj88J52j55Q8m6M1r4J4lJ18Jj31J11J6k07k6J14N5ML9P2j96p0R5RR6j46
$$ -70 -83 23 63 57 66 161 169 -19 133 -22 66 20 61 -33 -19 -22 96 97 -34 77 93 -114 -140 -26 29 33 72 144 -52 -122 -27 -18 78 -68
898f8J35J27j32l7n1N6k7Jo7J22rK9l5k4k41J18N7J35l3m0J3j41J12N7l2P3k34Q1JP5P9j0
$$ -68 67 194 62 25 -26 30 3 4 -63 59 50 79 44 20 -221 -103 -46 89 56 16 29 -112 0 57 25 98 -136 -55 -54 21 100 90
618I0r2m5Q0Mj97J69p2k8K5J55j39Q8m5l1j4J13N3Mk88K08L0j18%O1o3RJ40n4j06j05J82l7
$$ 90 -2 -47 33 37 -160 9 -63 -91 -66 89 -50 38 -7 -38 -52 61 114 118 -170 38 68 -50 -50 11 -52 -43 97 43 -63 -168 14 -23
338b3M3O0j37OJ5K7m7J23q9N6p6J75P2k32l5mNL1J22Kq9nj29J20L0N4n0o5R1j47p9J24N8K34
$$ -23 20 80 -57 -51 -36 -9 -56 67 -22 34 -42 133 205 -27 -62 -66 -61 -30 92 94 5 0 -129 -9 21 75 25 -40 51 -96 -175 -51 7 241
41B41k67m6O4l0P3mP4p2r5KJ86j73K1J64n8o7m0L4K9N0j15J7j28J64n5O3j02k9O6O4J2
$$ 241 -26 -72 -8 -38 35 31 105 33 -62 -60 126 -47 -26 138 80 13 -27 7 36 86 -29 -12 -140 24 -31 32 -70 -99 -33 31 43
-230D3
##PAGE=	F1=2577.61
##FIRST=	23146.756194512010552,	4241.1435120000014649,	-0.1299152672290802002
##DATA TABLE=	(F2++(Y..Y)), PROFILE
4241b5k1J08K7l7p4N6n5N5n5O2k6J09L1j03p1J08m3km2l4J32j67M2p4Q6Q2j9M8j81J56J07
$$ -25 -46 62 89 52 -22 34 -21 34 -21 41 15 124 155 52 -19 89 46 44 2 -32 100 -67 -25 -99 -13 69 50 98 -83 73 180
3970A80k28p5N6J79j87Mj8O4q8J4K09r6P2j66R5l3l8J89o0r3j4mJ7l7K44j35m8j29J42jj7
$$ 180 -48 -123 -67 112 -75 -71 -89 -25 -113 -99 110 14 86 -80 15 -18 -56 133 73 -20 -34 -38 -21 -58 186 51 3 -126 16 15 -2
3699bn7p0J95p9n9j1N1K6N9j02N9L5p0M1L1K1j13L1J59Lj42O9r9l1J02q9J29k3j37R3l7J6
$$ -2 -59 -129 66 -13 -72 -83 -32 -6 53 -49 10 45 -25 16 47 68 -45 -14 145 148 6 75 -24 -55 47 -42 87 64 -73 20 -17 -1
3419an8K9N9k9j09O4M5m2k7N2R2K5K2m1j10j70O7J66N9q5OO0j12N8j34J39k6J12r3k7P7j4
$$ -1 -59 -30 29 0 -109 -45 0 -42 -69 -17 75 100 122 81 -29 -199 -132 34 93 8 14 74 -38 20 -114 25 -1 111 18 -9 68 54
3139E4j34L4k8J09J14J53j40l8j00M0N1o4l3N9r7o8n5J13J5N9n9l5O3PQ5L2M3J002J809m33
$$ 54 -80 -46 -74 35 149 302 162 124 24 64 115 51 18 77 -20 -88 -143 -30 -15 44 -15 -50 13 20 105 137 180 1182 2991 2558
2876B558j905o25n1M16m6l47J7p4J2P1l4N1k1L4j59Q7p2P1l2K2Q7k9j62N7L1J15j41N6j31
$$ 2558 653 28 -23 393 347 0 17 -57 -45 26 -8 43 22 56 -103 -16 -88 -17 -49 -27 60 31 -131 -74 -43 72 -69 -13 -144
2622a44m9N1J09p9oJ8J84m5j00J06l3k7m2q0J62j9Pl2o5J27r0m3R3o1K2J5j27O4J63r9J2r2
$$ -144 -193 -142 -33 -112 -118 -100 84 39 -61 45 12 -15 -57 -137 25 6 13 -19 -84 43 -47 -90 3 -58 -36 -21 -148 -84 79 -20 -8 -100
2342a00P7j06J85o8M9n1Q9n6O6j48RL4n0Q1N3%L6j17k6j84J91n1P5j5K7j33J88j10J0O3Nj7
$$ -100 -23 -129 56 -12 37 -14 75 19 85 -63 -54 -20 -70 11 64 64 100 -17 -43 -227 -36 -87 -12 -27 0 -133 55 -55 -45 18 23 6
2062Fq6Q3r4Q0M2j62J3J23M7n2M7q6%oM6m3K3K6p7K20j42P1j52J09M5o4k7L4q6J58l4j45J05
$$ 6 -80 3 -91 -11 31 -131 -118 5 52 0 47 -39 -39 -45 1 -42 -19 7 -70 150 8 79 -73 36 81 17 -10 24 -62 96 62 -83 22
1773B2J5k9K5mK2j94Rp2K68j08M5l4j20J34o4P0K9p7j1O4m7P8j07J26P2N0j38j8r6k4R8K1
$$ 22 37 8 33 29 51 -143 -134 -206 62 -46 -1 -35 -155 -21 -85 -15 14 -63 -74 -10 -57 21 -86 40 112 162 24 6 -90 -114 -16 5
1493Eo4N2m8M5K7j23J78o7K3k3j23K12n6pk9n3Q1j6n8J06j31J40j6pM9k12J10Nk2N1L7r5M9
$$ 5 -59 -7 -55 -10 17 -106 72 5 28 5 -118 94 38 31 2 -51 30 14 -44 62 -69 71 55 48 97 -115 -5 0 -22 29 66 -29 20
1205B0o8n8J03P2O2p9Q8O9k46J38j18O8n0Q9j51L6k2J11K0j09J65k2k22m7J08L5RN9N5j67
$$ 20 -48 -106 -3 69 131 52 140 209 -37 101 -17 51 1 90 -61 -25 -47 64 84 -25 140 118 -104 -151 -43 -8 1 60 115 -52
942e2j0K9L3J04n0L4J04r4m8m8J9k2J7j35J46J0j9M9j8k30J12O6J00m0m4oj24J59O5p1j6j71
$$ -52 -62 -33 0 104 54 88 192 98 50 2 21 -1 16 -119 27 37 18 67 49 -181 -69 -3 97 57 13 7 -117 42 107 36 20 -151
662a51Q5k3J52L9m0p6j7O4Mj50J17p3j4k3J90j52K1mk4PJ50P1m2k62K18K7j46j2lN8l9J04
$$ -151 -66 -89 63 102 62 -14 -31 33 37 -113 4 -69 -83 -106 84 -68 -47 -51 -75 -68 82 153 111 -151 67 94 -52 -64 -67 -9 -48 56
382E6m8p9q4J63o3P2P6j26n5M7M1m9O2m0N2l5J61M2k39J2L6n6L9O8M2o8k7j34J34m7N6L1k2
$$ 56 8 -71 -155 8 -55 17 93 -33 -88 -41 0 -49 13 -27 25 -10 151 193 -46 -34 2 -54 -15 53 95 27 0 -134 0 -47 9 40 18
93A8L6j85k8P9O1K33k54j8N1l3O5L0O6m8j56N9J49j74lK19o7l1o9M8N7j2j40M6j35J50n2M2
$$ 18 54 -131 -159 -80 -19 214 -40 -58 -7 -40 25 55 121 73 -83 -24 125 -49 -52 167 100 69 0 48 105 93 -47 -1 -136 14 -38 4
-187Dl7m3M8L3K1
$$ 4 -33 -76 -28 5 26
-230B6
##PAGE=	F1=2483.26
##FIRST=	23146.756194512010552,	4241.1435120000014649,	-0.0028603330720216035843
##DATA TABLE=	(F2++(Y..Y)), PROFILE
4241d6K8R0K3n4q4M3o6R1p2M7j2J24P6p7r1P2l9J6o4q1J79j64Qp8J11Q2nJ8j52J74P7k13j13
$$ -46 -18 72 95 41 -43 0 -66 25 -47 0 -12 112 188 111 20 92 53 69 5 -76 103 -61 -53 -131 -20 62 57 75 -77 97 174 -39 -152
3952a52P0J93j37n9k7L0n8Q1J73p0L3j15Q3p1l3J47n5l9Ml6L3mJ84j56Oj12J16%rl0j16K44
$$ -152 -82 111 -26 -85 -112 -82 -140 -59 114 44 77 -38 45 -26 -59 88 33 -6 -2 -38 -5 -9 175 19 25 -87 29 29 20 -10 -126 118
3672A18j06r7n6J15M3K0o2J6M7m7J4J3K3r1J6K00m8q3O6j48qJ32j14J22qj51Q4k2j4l8M5L4
$$ 118 12 -85 -141 -26 17 37 -25 -9 38 -9 5 18 41 -50 -34 166 118 35 101 -47 -55 77 -37 85 77 -74 10 -12 -26 -64 -19 15
3392A5l2j12J40L2r5m6N2J30L1j3n4l3j78K9J55%l1L0M5j30M3q4J06j6J11r2k9O2N7j43L7
$$ 15 -17 -129 11 43 -52 -98 -46 84 115 102 48 15 -163 -134 21 21 -10 20 65 -65 -22 -106 0 -16 95 3 -26 36 93 -50 -13
3121a3n2J02Q8Qk8L0j16rQ1q8K0pp2J8q4P9J6J5j4k8l6Q2M9j2k4O20J116k85j159k41O0M47
$$ -13 -65 37 125 133 105 135 19 10 91 3 23 16 -56 -38 -122 -43 -27 -12 -26 -54 -90 -8 41 29 5 625 1741 1456 297 56 116 563
2841E63N5m63r8k2n8R1o9L2j2O1j33K9k6O7m4K5K8k1j43O0L1J19r1k5j18j1QJ05n4j8QK27
$$ 563 618 155 57 35 -23 68 -1 31 19 80 -53 -24 -50 17 -27 -2 26 5 -138 -78 -47 72 -19 -44 -162 -173 -165 -60 -114 -132 -124 103
2561A03o3q9R9p5J5q5k1K04n3qm8j5J26j34j4J04j05O0K5j66O1J84r6k2m9M8j01J77p4ORO0
$$ 103 40 -49 50 -25 -10 -95 -116 88 35 27 -21 -36 90 -44 -58 46 -59 1 26 -140 -79 105 9 -13 -62 -14 -115 62 -12 -6 3 63
2281F3k3Mr7nO5n2N7M8K6kq8k9j74J61l9N5NN6j33J26j38M1J09o5nmK5j21J08L0p0k7P5N7
$$ 63 40 44 -53 -58 7 -45 12 60 86 84 -4 -33 -207 -46 -85 -30 -25 31 -102 24 -114 -73 36 -29 -34 -38 -13 -134 -26 4 -66 -93 -18 39
1983C9o5Q8j14m4OO5PL1k8q6K51j64J12j56J07L3o5j7qn9J61j14o8J11l2LK7N8m4j20K8j39
$$ 39 -26 62 -52 -96 -90 -25 -18 13 -15 -101 150 -14 98 -58 49 82 17 0 -8 -67 94 -20 -88 23 -9 -6 21 79 35 -85 -57 -196
1703a96K70r4ol0r7J41m8L0N9j25K0L6p0J06n0R9R3Nj21j7j16RJ32j0p6J3l1N7L0p8J61r4
$$ -196 74 -20 -26 -56 -153 -12 -60 -30 29 -96 -76 -40 -110 -4 -54 45 138 143 22 5 -111 -102 30 20 -56 -43 -74 -17 13 -65 96 2
1423Bk0L6j04J70j09N7k0o3O1Op2J21j62J42ll0Q6j45M0J7j4LJ5m6K5l5o2P3Q7J22j50N5J40
$$ 2 -18 18 -86 84 -25 32 12 -51 10 16 -56 65 -97 45 42 12 98 -47 -7 10 -4 -1 14 -32 -7 -42 -104 -31 56 178 28 83 223
1135B23k67J03p4K8k4J08j57L1l5Q0M4p6K17q0j89n3R0QM3K3K6j04L2n7P6J15M9j07O8m2n3
$$ 223 -44 59 -15 13 -11 97 -60 -29 -64 16 60 -16 201 121 -68 -121 -31 -23 20 43 69 -35 -3 -60 16 131 180 73 141 99 46
863D6m4kLJ2j66J55Pn8J12Mj91P9O2M3l2l3l9q6J96P0j21o8j02R0nJ59J5r5j5l5Q5J7r8M2
$$ 46 2 0 3 15 -151 4 11 -47 65 69 -122 -43 19 62 30 -3 -42 -128 68 138 17 -51 -153 -63 -68 91 106 11 -4 -39 46 63 -35 7
566Gp5J4o3J79j45k4M1l9QJ74O5m6j98J99k8j19k0q1J75q1O7m7m7n0J39p4Q7P8p3j33O9N1
$$ 7 -68 -54 -117 62 -83 -107 -66 -105 -97 77 142 96 -102 97 69 -50 -70 -151 24 -57 10 -37 -84 -134 5 -69 18 96 23 -110 -41 10
286A0o4QK1N6l1J29M8k17L3O9j17N5J3M4k4k7j27J28j41J00Q5K0nk42M3K4Q5J89k28K4N0l0
$$ 10 -54 -46 -25 31 0 129 177 -40 -7 62 -55 0 13 57 33 6 -121 7 -134 -34 51 71 66 -176 -133 -109 -24 165 -63 -39 11 -19
6a9L9M9L5k5j89J10Q3j41kK56r3j7o7N8O0l3j18M8j58R7nJ2K5o0K0K2K4
$$ -19 20 69 104 79 -110 0 83 -58 -60 196 103 86 19 77 137 104 -14 34 -124 -27 -32 -20 5 -55 -35 -13 11
-230A1
##PAGE=	F1=2388.91
##FIRST=	23146.756194512010552,	4241.1435120000014649,	0.029069429263472557068
##DATA TABLE=	(F2++(Y..Y)), PROFILE
4241e6O4P8k2n2q1N5r0J08p2L1OJ24J07o1p6L4q4M8m7r8J98j31m9r0J35O2j3lq5J69L4j71
$$ -56 8 86 64 12 -69 -14 -104 4 -68 -37 -31 93 200 139 63 97 13 61 14 -84 114 -17 -66 -156 -21 41 28 25 -60 109 143 -28
3961b8j19P8J82j16p2n2Jj4J04J36k3k1m0O7r6m3J16n8J3mn3L9N5J04j75O5q5Q4LPk8j68K84
$$ -28 -147 -69 113 -3 -75 -127 -126 -140 -36 100 77 56 16 83 -13 -56 60 2 15 11 -42 -3 52 156 -19 46 -39 45 48 55 27 -141 143
3672A43j09r3q8J14P2k2j2k4N3k2k8qL3m4J6K02j43LM7j40pJ57j08Q1Kj18P4k3n7j5N8nk5
$$ 143 34 -59 -147 -33 39 17 5 -19 34 12 -16 -24 9 -35 -19 183 40 43 90 -50 -57 100 -8 73 75 -43 31 8 -49 -64 -6 -11 -36
3384c6q5J88j2j40k5N0J14O2n6l9L8j63j1J25m9J1L2N0j15J4l5O7lO5m2qRJ06j17K4l8M0N4
$$ -36 -121 67 55 -85 -110 -60 54 116 60 21 59 -104 -115 10 -39 -28 4 54 -61 -47 -82 -15 -18 47 5 -3 6 112 -5 19 -19 21 75
3095G5j01M5J00j05l9Q8j03P5o9m8J02j20L1M8l6J7Kj37J42M3o9q0K84N56j33n83J30K13O25
$$ 75 -26 19 119 14 -25 63 -40 35 -34 -82 20 -100 -69 -21 -57 -40 -38 -175 -33 10 -59 -139 145 701 568 -15 115 328 953
2841I53R5p05k34J0j11J12j04k4L6P8r5n7L6O5p2K9oj0j18R1j0J10l8r0r6J4jO3j8l0PK33
$$ 953 1048 343 109 119 8 120 16 -8 28 106 11 -46 -10 55 -17 12 6 -4 -122 -31 -41 69 31 -59 -155 -141 -142 -79 -97 -127 -120 113
2561A13q5p5R5j14O3j08P2J51q0j0k9K9P7j43L9R2j50Q8L5j63N2J87r7o1J7op8J53n8l6M2
$$ 113 28 -47 48 -66 -3 -111 -39 112 32 22 -7 22 99 -44 -5 87 -63 25 60 -103 -51 136 39 -22 -5 -11 -89 64 6 -30 12
2290A2J1Mm1l0JQ0o8N3K4L2k9n0l6j11Q6j7P1j5Q3r3L9j41K7J38j03K4N6m8j13J26J7J0n1
$$ 12 23 27 -14 -44 -43 37 -31 22 46 78 49 -1 -37 -148 -62 -79 -8 -23 60 -33 6 -135 -108 30 -73 -49 7 -41 -154 -28 -11 -1 -52
2001e2L8K9o0P5r7n6K1N7Q0L3q4r3K45j98J65j33R0Lq4M0p1jJ39j50QQ9r0K5N4P9p5o0N8j83
$$ -52 -14 15 -45 30 -67 -123 -102 -45 35 68 -16 -109 136 -62 103 -30 60 63 -21 19 -52 -53 86 -64 -56 33 -57 -32 22 101 26 -34 24 -159
1703a59K27n2o2j2n7J24n0jP6j78J01pj12J33pR4R2l5j10Lj20L9J33k1n4l5k6P6Rm6J08q6
$$ -159 68 16 -46 -58 -115 9 -41 -42 34 -144 -43 -50 -162 -29 -36 58 150 115 5 8 -112 -73 60 39 -15 -50 -76 0 9 -37 71 -15
1423a5m6R9r3J17j33R6Mn9ML6p1J36j97J16K8n1J10n2n5M2k1l3ok6L1j1m2L9Q2J44j64kJ80
$$ -15 -61 38 -55 62 -71 25 29 -30 -26 10 -61 75 -122 -6 22 -29 81 29 -26 16 -5 -38 -44 -70 -39 -50 -92 -53 29 173 9 7 187
1135A87k19N6l0k1QR4j12K0n7N8N0m2K30j22j24m0O0j6R3o2J7n6N8j20J14J15J15k21M4j8
$$ 187 -32 24 -6 -27 -19 75 -37 -17 -74 -16 34 -8 222 100 -24 -64 -4 -20 73 11 28 -28 30 -90 24 139 254 33 77 59
872E9m8l1j0N7j7j64J40J3q4J25L8j47N1M2k1pj9p5o0K25P9j63o9n3R0M9R9Lj42M7o8J27L7
$$ 59 11 -20 -30 27 10 -154 -14 -1 -85 40 78 -69 -18 24 3 -4 -23 -98 -158 67 146 -17 -86 -139 -49 0 99 102 -40 7 -61 66 103
583A03o7j6o2L0p8J23j29m2Q9p1JJ68N6j8j23J50j10o1mj45K47j11N0m6l4k7J30p2R5O7jj98
$$ 103 36 20 -42 -12 -90 33 -96 -138 -49 -120 -119 49 105 87 -36 114 4 -57 -61 -206 41 -70 -20 -66 -100 -127 3 -69 26 93 92 -106
303a06O7M4p6k2P7P7o6Q3P8j74L0P8j46N9j8J5QKq8P8k04J51J16M3k8k89J07j1J23J14k08
$$ -106 -39 5 -71 -93 -16 61 -5 78 156 -18 12 90 -56 3 -15 0 8 10 -78 0 -204 -53 63 106 78 -211 -104 -115 8 122 -86
32h6P1N5j9NL2Pj0j81J24Pp2J2K72j23k9l8N8M2j8p4L0j62J4O9k4O2o4j2L0K1
$$ -86 -15 40 21 26 58 65 55 -126 -2 5 -67 -55 217 94 65 27 85 127 109 35 65 -97 -83 -14 -38 24 -40 -52 -22 -1
-230a
##PAGE=	F1=2294.55
##FIRST=	23146.756194512010552,	4241.1435120000014649,	-0.15195007622241973877
##DATA TABLE=	(F2++(Y..Y)), PROFILE
4241e3P5P9r5k8p4R2j10R9o9L7OJ19J11p9k2Lj42Q8kr5J73o2j12j00J45K8k4k1nJ28J2j23
$$ -53 22 101 6 -22 -96 -4 -114 -15 -84 -47 -41 78 189 110 88 91 -51 37 35 -60 113 51 -61 -161 -16 12 -12 -33 -38 90 102 -21
3961b1r3Q1J47j36j6j05J0K3P3J06L5p3L8L3j03l7R8o4L8l3n7M0J10L2j74J05o0O4oK7n4k02
$$ -21 -114 -33 114 -22 -38 -143 -133 -110 -37 69 104 31 69 102 -1 -38 60 -4 34 1 -56 -16 94 126 -48 57 -3 61 55 82 28 -174
3681a74K90q3n3r9O8J02m8K8m6M0J5r3j6N6mK2J82k28O5J8q5k6J66o2J5Mm2P1n4r0j0O2k2
$$ -174 116 33 -20 -119 -51 51 3 31 -15 25 40 -53 -69 -13 -17 5 187 -41 24 42 -43 -69 97 35 50 54 12 83 29 -61 -71 -9 -31
3392c1k0l5J90p2j63K6N4N5J07r2LP4j48j3P9q8L9J3O8p1j1JK5mJ5PM1n4J13q1J3Ln0K7j38
$$ -31 -51 -86 104 32 -131 -105 -51 4 111 19 22 96 -52 -65 14 -74 -35 -22 46 -25 -36 -35 -10 -14 1 8 49 -5 108 27 40 43 -7 20 -118
3086a18P1J34r8j8P6r7J04j25l7J67j38pR6p8J9L6j93J65O0j18j00J13K99l1l61L50L62Q48
$$ -118 -47 87 -11 -29 47 -50 54 -71 -108 59 -79 -86 10 -68 -49 -13 -206 -41 19 -99 -199 -86 213 182 -179 171 533 1381
2841A381O1r77l29J5j11J11j23q1R8P0p3j09Q9N6q9K8pj3j00J48q0J07kj31p1J7K9mK8n2K2
$$ 1381 1442 465 136 151 40 151 28 -53 45 115 42 -67 22 78 -11 17 10 -3 -103 45 -35 72 70 -61 -132 -115 -86 -90 -62 -114 -92
2570i2K04r5p0Q7j35R9j06J72K9r7MJO9Mj17Q5O2j77R3M4j12L3J64q5r0Q4p7o3J38j4p9M4
$$ -92 112 17 -53 34 -101 -2 -108 64 93 -4 0 1 70 74 -43 42 104 -73 20 64 -48 -15 149 64 -26 58 -19 -82 56 42 -37 7
2290Gk8K5o0J6J4P9p9O0LQl7k0m6j8LQJ16p5R6j4m0j19k8J43r9O2N6j01q3J32RM1n2K7k0m7
$$ 7 -21 4 -56 -40 -26 53 -26 34 37 45 8 -12 -58 -76 -73 -65 51 -24 72 58 18 -101 -129 14 -85 -23 33 -68 -151 -19 -10 31 -21 6 -14 -61
1975f1K9o0l5M2L4J35J6j00q9J87k15J97r1P8m1r5Q9j17O1J04j26O6L2j44N1R8N6p6l1R8j96
$$ -61 -32 -92 -127 -85 -51 84 100 0 -89 98 -117 80 -11 67 26 -69 20 -97 -36 68 -58 8 40 -104 -53 45 101 25 -6 92 -104
1703a04J50kr8jqR9p2k1J03k27J97m9j53J37K0Q4Q9n3j07K4j01M5J03qlo8m1J01l1m0M2n3
$$ -104 46 44 -54 -55 -63 36 -36 -57 46 -181 16 -33 -186 -49 -29 55 144 91 -16 8 -93 -48 55 47 44 -24 -65 36 5 -35 7 -46
1423d6j7J32j14P0j14R2O1o7p4Q3n4J35k13P0N8n8J13M6j46P0m6l7k8l0M1J4k1J5P0J17j17
$$ -46 -63 69 -45 25 -89 3 64 -3 -77 6 -48 87 -126 -56 2 -56 57 103 -43 27 -19 -56 -84 -114 -73 -59 -80 -65 5 122 5
1152Ep1J66j12J9Jo6L8N7m3Pq7Q0K2k1J84j22n4j2J8k0J36j62M1n1P4j32J21J03J30k56M3
$$ 5 -66 100 -12 7 8 -58 -20 37 -6 1 -86 -6 16 -5 179 57 3 -9 9 -11 125 -37 4 -47 27 -105 16 119 249 -7 36
881C6l3l5j3j0J18n3j49R9N1q7Q0P3j21O2Mp0J9j0r4n6K40Q3j79l2l1Q2J03J6j4j45P1q1J46
$$ 36 3 -32 -45 -55 63 10 -139 -40 11 -76 4 77 -44 18 22 -48 -29 -39 -133 -189 51 134 -45 -77 -108 -26 77 93 79 -66 5 -76 70
592G0N5n3l6l3J7n9N1j05n3J28j01J4J15P3No1P9j69qM2j79K56j24N2l5n4k7J37n5R8M7N7
$$ 70 125 72 36 3 20 -39 12 -93 -146 -18 -119 -105 10 83 88 27 106 -63 -71 -29 -208 48 -76 -24 -59 -113 -140 -3 -58 40 87 144
312A44k22M2K2p4k4J10J10j18L4J03j22J3O9j36L7j7j5OM2j1Jk21J60J48M1l1l01J33j3J46
$$ 144 -78 -36 -14 -88 -112 -2 108 -10 24 127 5 18 87 -49 -12 -29 -44 -38 4 -7 -6 -227 -67 81 122 91 -210 -77 -90 56
50E6L7j84J05N0Pk3j9plj36R3n5J4J5K66j42n0%N0J4J0m3Qj12o5J16o2P4m2m4M8J2
$$ 56 93 -91 14 64 71 48 29 22 19 -117 -24 -79 -65 -50 216 74 24 24 74 88 98 55 63 -49 -114 2 -60 14 -28 -72 -24 -12
-230a2
##PAGE=	F1=2200.2
##FIRST=	23146.756194512010552,	4241.1435120000014649,	-0.13757173717021942139
##DATA TABLE=	(F2++(Y..Y)), PROFILE
4241c7N6R3j60mn9J30j16P1o9P0j7J14R4j30N5k3j66J15M4q5J09K8j64r2J35j4j8l2N5N4L1
$$ -37 19 112 -48 -52 -111 19 -97 -26 -95 -25 -42 72 166 36 91 68 -98 17 61 -24 85 113 -51 -143 -8 -22 -40 -72 -17 37 68
3970F8p9n4P4R5j80R4j79N8M0KR9Q1j08J02k5r4qQ7p0M2o9m9L5J36j3j45J15n2O8l1M6r7j97
$$ 68 -11 -65 9 104 -76 18 -161 -103 -63 -61 38 119 11 113 88 -6 -14 73 3 45 -24 -73 -38 98 85 -60 55 3 71 40 86 -11 -208
3681b08K58m9Or3K1J08m0M6n5J1P2j72jP8NK5J51k50Q0j9j4m1J39J7m6nL9P4j04r4k1O1ok4
$$ -208 50 1 7 -86 -65 43 3 49 -6 5 77 -95 -96 -18 -13 12 163 -87 -7 -26 -40 -81 58 75 29 24 63 137 33 -61 -82 -21 -27 -51
3384e1J3J60j22j70Q1P2k3J48j00N0O8j54L7K9j11N1k4Q7j8j9J8ql0nJ2J04q9Q5o3J9M2j26
$$ -51 -38 122 0 -170 -89 -17 -40 108 8 58 126 -28 9 38 -73 -22 -46 41 23 4 22 14 -16 -21 -9 95 6 91 28 47 89 -37
3104c7K6j06N7J04j09N3N9o9R2j61m2J95j19j8J23j02MN0j81J51P5j39q5P8K47J0l61L96M43
$$ -37 -11 -117 -60 44 -65 -12 47 -22 70 -91 -133 62 -57 -75 48 -54 -50 0 -181 -30 45 -94 -179 -101 146 156 -205 191 634
2850F34R24j3j111l29Qn0P8j14j02J42L3p6r8J15L4p7J9J5l4r0K04j41J10J4j52m7JP5p1Q4
$$ 634 1558 1545 434 105 113 63 141 27 -75 67 100 24 -74 41 75 -2 17 32 -2 -92 112 -29 81 95 -57 -104 -103 -28 -99 -15
2587a5q6M4J58p8p7O3j34J15q5K51j02r9J9K3R7o5p2J04K9j66O3N6l1MJ16n5r0J25j45o4J36
$$ -15 -101 -57 101 23 -54 9 -125 -10 -95 156 54 -45 -26 -3 94 29 -43 61 90 -76 -13 43 12 16 132 77 -13 112 -33 -97 39
2316C9N2j27K1k8M5n6J6K1O9p1O1lk7l4qm7O0n2L1J61j52Q5Q3p8r0r6J26o9J04j8j01n2J26
$$ 39 91 -36 -15 -43 2 -54 -38 -17 52 -19 42 39 12 -22 -30 -77 -17 -69 -38 123 -29 56 139 61 -29 -125 1 -68 36 18 -83 -135 -9
2027iJ1J4l6M5o6l8j1k9%N9K1J43k1o9o0Q7j94J80m9R8q6q0Q5j21R6P1p1J08m8j85J01J37
$$ -9 2 16 -20 25 -41 -79 -90 -119 -119 -60 -39 104 83 14 -46 41 -153 27 -22 76 -10 -90 -5 -126 -30 41 -30 78 30 -155 -54 83
1747H3J3o9k3J14j70O4M0j01rL8P6r1l5J42k62K64p4j73J12M4M0Q9l6j06L3o7K5O2QO2o9q0
$$ 83 96 27 4 118 -52 12 52 -49 -58 -20 56 -35 -70 72 -190 74 0 -173 -61 -17 23 112 76 -30 3 -64 -39 23 31 93 24 -56
1467e6J30p3o0j0nO0J14j62N1p1N5J37j00j35J32k5J16k02K8O8m7R5J22k10R7q2om8m0K7M6
$$ -56 74 1 -59 -69 -74 -14 100 -62 -11 -82 -27 110 10 -125 7 -18 98 -104 -76 -8 -55 40 162 -48 49 -33 -39 -87 -127 -100 -54
1196e4mjN5O3m3j38J15OJ0Pq3N4J2J6qj10J54m0j8Q4p7LK0k7%J49k29P7p8Q5r7Q7Q9R8k10
$$ -54 -58 -59 -4 59 16 -122 -7 -1 9 16 -67 -13 -1 15 7 -103 51 11 -7 77 0 3 23 -4 -4 145 -84 -7 -85 0 -97 -10 79 177 -33
890c3N8n7k9J2j0J46p0j44N0J14o7oJ03j18J19m6r4L7j2q4n9K29P3j64Qk6P0J26m7m5r2N5
$$ -33 25 -32 -61 -49 -59 87 17 -127 -77 37 -30 -36 67 -51 68 22 -72 -35 -47 -131 -190 39 112 -52 -44 -70 0 126 79 34 -58 -3
610cn8J00O9m0k6jj8j6qo8o2J33j06N7K6J16Mj9nj75J7J05j84K10j15O3j5r7m5J43k4R7J5
$$ -3 -61 39 108 68 42 41 23 7 -1 -69 -131 2 -104 -47 -21 95 99 80 75 -100 -83 22 -162 48 -67 -4 -19 -116 -161 -18 -42 55 70
321G0R0k03J6pn7pJ05J43j50qR7o7rN8j05rJ3j3m1Q0O5n1k04R5K01J6j4k68J13QJ26k0j33
$$ 70 160 -43 -27 -34 -91 -98 7 150 0 -8 89 22 13 71 -34 -43 -30 -43 -84 -4 61 10 -194 -99 102 118 104 -164 -51 -43 83 63 -70
32g0J17K2M2l4p0j9Lp7M2r0R2kK30j41o0L1L9j4L3m4Jj6j06R8j07Q3jo4N6N
$$ -70 47 69 111 77 7 -12 -9 -86 -44 -134 -42 -44 186 45 -15 16 55 41 74 30 31 15 -91 7 -100 -17 -18 -82 -26 -21
-230b1
##PAGE=	F1=2105.84
##FIRST=	23146.756194512010552,	4241.1435120000014649,	0.16032934188842773438
##DATA TABLE=	(F2++(Y..Y)), PROFILE
4241a3J4J13j89J1m2J47j13M4p0J14n2R9P8j78J17m3j34J04O7p0L2R8j85o2J08n1J8l1P5l1
$$ -13 1 114 -75 -64 -106 41 -72 -28 -98 16 -36 63 141 -37 80 37 -97 7 74 4 36 134 -51 -113 -5 -56 -38 -69 6 -25
3979b5Q0m4k6N5L7k14K08k42J14L0n9J08R3j19J42q9p7K8P6o6L9j01l3K9J30l4r9J07p0R8
$$ -25 55 11 -15 40 77 -137 71 -171 -57 -27 -86 22 115 -4 138 49 -28 0 76 10 49 -52 -85 -56 74 40 -59 48 -22 76
3716G6o7N5j35j47K02k3N5p8nP7OM3o0j2J40k48K7R3k1J8J07j89N3o0N0l7O9J02o8k5Q2Q1
$$ 76 9 64 -71 -218 -16 -39 16 -62 -67 10 16 59 -1 -13 127 -121 -94 -1 -22 -4 103 -86 -33 -93 -43 -80 -11 91 23 -2 80 161
3436A61j48o0l0N2K0l0L7J28j44j73J19R8r0J61o8Q2L1j73J08j3j13N2n8R0K3j6J5j2p6Ll5
$$ 161 13 -47 -77 -25 -5 -35 2 130 -14 -187 -68 30 -60 101 33 115 146 -27 81 68 -45 7 -51 39 62 46 61 49 -27 -24 -59
3165e9J68p1L6q0N5M8j51K5m6M1L4j28J37M5l0M2j55n4J86p1j3J05j03%L1j19J22N9j17o1
$$ -59 109 38 74 -6 49 97 -54 -29 -75 -34 0 -128 9 54 24 66 -89 -143 43 -28 -41 64 -39 -39 -8 -127 -5 54 -63 -124
2902a24R3K14J3l59L31M16P50p3j006k40QN1K2p5q8J47j4q5m8J05J8m8J0L3n3p6K17j57J11
$$ -124 -31 183 196 -163 168 584 1334 1261 255 15 23 74 96 21 -67 80 66 -19 -67 38 56 8 18 51 -2 -78 139 -18 93
2649I3J9j63l0j9J00j17J53j22N5J15l8q0K0j18J11n8K85j82q4J4K5J11j11k9R9J0j24PP3
$$ 93 112 -51 -81 -100 0 -117 36 -86 -31 84 46 -34 -14 -132 -21 -79 206 24 -60 -46 -21 90 -21 -50 49 59 -65 -58 15
2395A5N6l3M8j6m9J15j75p3J38J14j69k0K0O4n0k0J8N5m0M3Lm4l5ll2Q3o7M8J71k02N3J58
$$ 15 71 38 86 70 21 136 -39 -112 26 140 -29 -49 -29 35 -15 -35 -17 38 -2 41 44 0 -35 -38 -70 13 -54 -6 165 -37 16 174
2115A74n7p4j44R6l8J41j31m6l4J06K4m7j4P7r5m0j1j9L4N1L3J08o8j1j3j3j34J05k4J56j13
$$ 174 117 43 -101 -5 -43 98 -33 -79 -113 -7 17 -30 -44 33 -62 -102 -113 -132 -98 -47 -14 94 26 15 2 -11 -145 -40 -64 92 -21
1843b1m8K8q2Q6N4l1J36j17k03J65J54k3p3j3Q2j14rP5q4k7O1N7q0m1J67k73K78p4j58O4P7
$$ -21 -69 -41 -123 -37 17 -14 122 5 -198 -33 121 98 25 12 94 -20 -29 46 -38 -65 -4 53 -27 -68 99 -174 104 30 -128 -64 13
1572A3l7Q0J0j05L9l8JL2oJ19l5j28J52r9r2l2N0J37N8k08N8k9J0J89j35j55J63KR0j72PN6
$$ 13 -24 56 66 -39 0 -38 -37 -5 -11 108 73 -55 97 -2 -94 -126 -76 61 119 -89 -31 -60 -50 139 4 -151 12 14 104 -68 -61 -5
1292ek9P1J57k34J07j04N1o7m5kP4J6k3L9QJ3j74N3Q5L1j0n8M6k8N0l3j07K48j10k8l5j7M1
$$ -5 -34 37 194 -40 67 -37 14 -53 -98 -100 -26 -10 -33 6 14 27 -147 -94 -9 22 12 -46 0 -28 22 -11 -118 130 20 -8 -43 -60 -19
1003a9N8p3L1J29k30R1j02R4m9K0Q8M6j28P1n3m0L9pJ16n6j57J4J62k8r7J31j24J87q8r3M3
$$ -19 39 -34 -3 126 -104 -13 -115 -21 -70 -50 38 84 -44 27 -26 -66 -27 -34 82 26 -131 -117 45 17 -80 51 -73 114 26 -67 -24
732b4j9n8m6J88N2j29K1k4O1J06p0p9j2L2qrP8j6j4J1m6L3m7j2o2R3q0J14o0J56qJq5j33J0
$$ -24 -43 -101 -147 41 93 -36 -15 -39 22 128 58 -21 -33 -1 -9 -18 60 44 30 41 -5 28 -19 -31 -93 0 -80 34 -26 130 122 123 38 -95 -85
426h5J60j79J40p5P1%j43o0J29J9Q2j7R8j54Qk9m0J3O7J65j50l1N6j3k7N5p4o1N1K8j08R7
$$ -85 75 -104 36 -39 32 32 -111 -171 -42 -23 59 42 140 -14 -6 -35 -75 -62 5 170 20 -11 45 32 5 60 -14 -75 -24 4 -104 -7
146gR7l6j74k6K60k0J8k01O9K2O5m7n4J06j7O5k5q8l7J2l1jq8J37k3J63j18n9M7K9k9L7o1
$$ -7 90 54 -120 -146 114 94 112 -89 -20 2 67 20 -34 72 55 120 95 7 -30 -18 -49 -50 -138 -1 -24 139 21 -38 9 38 9 46 -15
-143a5QP8q7J6j50R2N1p2N2M
$$ -15 -7 71 -16 0 -150 -58 -7 -79 -27 -23
-230b3
##PAGE=	F1=2011.49
##FIRST=	23146.756194512010552,	4241.1435120000014649,	0.4598032832145690918
##DATA TABLE=	(F2++(Y..Y)), PROFILE
4241A4l7J29j69Qk6J27j02K6n9J51q7O0P5j87J44n7o4N1O3m0l4J19j67k8O9o3P8k2O0j00J35
$$ 14 -23 106 -63 -55 -81 46 -56 -30 -89 62 -25 35 110 -77 67 10 -54 -3 60 20 -14 105 -62 -90 -21 -84 -6 -28 32 -68 67
3970F7k1j7K0j6k05K70k61J47kp2J15O8j14J61j32o2N8N5n3M1j22j0K2J09m3n4R7j11J51j05
$$ 67 46 29 49 33 -172 98 -163 -16 -18 -90 25 93 -21 140 8 -54 4 59 6 47 -75 -85 -63 46 3 -51 46 -65 86 -19
3707a9M7j42p5J45j2P8o6j8K1O8L5n8k0J98k99N2R9o2NL4p3K7j01Q6j0k5J64m0n4P4Q5j67
$$ -19 28 -114 -189 -44 -56 22 -44 -62 -41 27 62 4 -16 182 -117 -65 34 -28 -23 11 -62 -35 -136 -50 -60 -85 79 39 -15 59 144 -23
3427b3kj2K2J7j8L2J12j32j78J38J18j24J34j3R9j4j84J46m0r1N6p4P2L4k2KK2j17J7j00K13
$$ -23 -25 -37 -15 2 -16 16 128 -4 -182 -44 74 -50 84 71 170 156 -28 118 78 -13 43 -31 41 75 53 55 77 -40 -23 -123 90
3156I0rk0j23J20J1j27j5k1O9j1j28J86L7Nk3j02n9J44j7oM1r0K7j0m9J04Qn1m8R8J27mk69
$$ 90 81 61 -62 58 69 -58 -73 -94 -25 -36 -164 22 59 64 41 -61 -120 24 7 1 42 -48 -21 -31 -80 24 32 -19 -67 31 158 154 -115
2867a15K35K93M16q8p16j22K1J51m3j1o3J11m2q0jO6K8k1RJ6m2n1J70j15R1K3j58k2l7Q5j38
$$ -115 120 413 829 741 25 -97 -76 75 32 21 -42 69 27 -53 -54 12 40 19 28 44 2 -49 121 6 97 120 -38 -60 -97 -12 -150
2596a50K31j46M4Q1Mm8l4r7R3k8K60j88o7j8J6J09j32J1Q0K2q7m9Q5J23o2k4J6K3M9j44p7
$$ -150 81 -65 -21 60 64 16 -18 -115 -22 -50 210 22 -45 -63 -47 62 -70 -59 21 43 -44 -93 -8 115 53 29 45 68 117 -27 -104
2325a04J28J48j84p3R5Q5o6o5J3M1JPJ2l4l5jLN0n6N1J36j96J3J86Jp8j45N7k3J60k16L1k6
$$ -104 24 172 -12 -85 10 95 29 -36 -23 18 19 26 38 4 -31 -32 -29 21 -35 16 152 -44 -31 155 156 78 -67 -10 -33 127 -89 -58 -84
2036h4P0M0r7%J02j08m9K6j5O2LN7O4j01L2L2o7o0Jk3K26r8l3l4l1L3O4l8J46j36j96K03J57
$$ -84 -14 26 -71 -71 31 -77 -126 -100 -115 -53 -50 7 71 -30 2 34 -33 -93 -92 -115 111 13 -20 -54 -85 -52 12 -26 120 -16 -212 -9 148
1747A48m2q5KJ2m6n5J08p3l4N0L9l4l7J57k60K50n4j15J2J16j15N3N2j02N8k7nK0o0J53Rj52
$$ 148 106 21 23 35 -11 -66 42 -31 -65 -15 24 -10 -47 110 -150 100 46 -69 -57 59 -56 -3 49 -53 5 -22 -27 -7 -67 86 95 -57
1467e7J49r9j08k6R3J76j0k19P4ok4J84j49j15J60J7N8j31ML6k3N6J45k16Q9q9J08q2m4j3
$$ -57 92 -7 -115 -141 -48 128 118 -101 -27 -33 -57 127 -22 -137 23 40 98 -33 -29 7 -16 40 185 -31 58 -31 77 -5 -49 -62
1205f2Q2M4o1K5l4K6j60PJ07O6l7lJ3n7N6n4p3K99j47l8j37L2O1J00j00L4R2j65P1j07R6q
$$ -62 20 64 3 28 -6 20 -140 -133 -26 40 3 0 13 -44 12 -42 -115 184 37 -1 -138 -106 -45 55 -45 -11 81 -84 -13 -120 -24 -32
925c2n6R4J3p1Q2j9o4O0RL5j9j75kJ64J5j60J60j23K25j09o7L5k3l4j5J30L1r5Ok1O2N3o1
$$ -32 -88 6 19 -52 30 11 -53 7 16 51 32 -143 -145 19 34 -126 34 -89 136 27 -40 -5 -28 -62 -77 53 84 -11 -5 -26 36 89 28
636B8j00N8L5M3j40R4Lk2Jm8P2p0N0m1J5l5J55r9J59j1Rj41q3pJ81j75P8rP3nj70n6Q8O1M4
$$ 28 -72 -14 21 64 -76 18 21 -1 0 -48 24 -46 4 -37 -22 -57 98 -1 158 147 156 15 -68 -75 106 -69 9 0 73 68 -102 -158 -70 -9 35
330C5k8R2r2J6l9k8K2J5J65j22l3LL3l4N5n7r9P9R1j68R9N4M1j38j47K89n0N4j16K9J1rn5
$$ 35 7 99 7 23 -16 -44 -22 -7 158 36 3 6 39 5 60 3 -96 -17 74 -94 5 59 100 -38 -185 104 54 108 -8 21 32 23 -32
41c2K5Q3m2N7Jp0n2K3j4k8m4J34k7P8p2n0L6J9j8J6p1J4J26j7q2j74Q7R8p0M5L
$$ -32 -7 76 34 91 92 22 -30 -7 -21 -49 -93 41 14 92 20 -30 6 25 7 23 -48 -34 92 75 -7 -181 -94 4 -66 -21 -18
-230a8
##PAGE=	F1=1917.14
##FIRST=	23146.756194512010552,	4241.1435120000014649,	0.51645714044570922852
##DATA TABLE=	(F2++(Y..Y)), PROFILE
4241C9q4J31j11%k3P5q2J1k3J65j07mP8j44J37o1Kk3M2jo4R4j20rJ9l7J38k4M0j29J75k2j3
$$ 39 -45 86 -25 -25 -48 27 -55 -44 -67 98 -9 -13 65 -79 58 -3 -1 -24 18 17 -47 47 -73 -82 -63 -100 38 14 54 -75 100 78 65
3952F5l1n0j42K44k22J50m1l5R8J7r4J57j33n9Q2K9m0M5j30J5J3R3n0j8Q9j50K07j35K4j08
$$ 65 34 -16 -158 86 -136 14 -27 -62 36 53 -41 116 -17 -76 6 35 -5 40 -90 -75 -62 31 -19 -37 52 -98 109 -26 -2 -110
3690a10j7J03rP2o6l3l2J08L6l5j7K20l00N9R6q8op1M7L0j34Q9K0q9J87J2q8L7Q1j62N7M1
$$ -110 -127 -24 -33 39 -27 -60 -92 16 52 17 0 220 -80 -21 75 -13 -19 -90 -43 -13 -147 -58 -38 -127 60 72 -16 21 102 -60 -3 38
3410C8m2k5J7J6J11j02j75J48J08j19Q1L5J11m1j78J16m1n2O1o1L6J9m0j8P6j22J3j34K22
$$ 38 -4 -29 -12 4 115 13 -162 -14 94 -25 56 91 202 161 -17 99 58 6 67 6 42 61 21 3 79 -43 -30 -164 58
3156E8N9p4j57J90m7p7r3m8J37lr6J78L4K2p6k0n1Q3K4pl8p5P0m6kJ02n8M5n1Q7M0l2j60J57
$$ 58 117 43 -114 76 29 -48 -141 -189 -52 -55 -151 27 61 83 7 -13 -64 19 43 36 -2 -77 -7 -53 -55 47 -11 34 -17 70 110 78 -82 75
2859G5J27J19n6l92n1L6K13j01O0n5N8l4o0J5J9P3j6J7m0Pj8P6l4M7K2j20k6m8L3j32K89j35
$$ 75 202 321 265 -127 -178 -142 71 -30 30 -25 33 -1 -61 -46 -27 46 30 47 7 14 -4 72 38 85 107 -13 -39 -87 -54 -186 103 -32
2579c2J5L9L3L0q0q0O9OJ80j38o6o0OJ00j34N5N7O1q9p1P2J59o8q4L7R6m9o8o8J02J44j56
$$ -32 -17 22 55 85 5 -75 -6 0 180 42 -24 -84 -78 22 -112 -57 0 61 -28 -99 -27 132 64 -20 17 113 64 -4 -72 30 174 18
2299A8j36J69R8j01r3K2K3L7l7J7j3k8RM7j5l6L7Q1j37k7J70N2r2r7J2k7J53k18Q1j6K1M9
$$ 18 -118 51 149 48 -45 -23 0 37 0 17 4 -24 -15 32 17 -19 18 99 -38 -65 105 157 65 -32 -20 -47 106 -112 -31 -47 -26 23
2019B3j02%J02j09m9O6lQ7p0O7L9r9L9M6n5kq3m5K64l5n5n7%m0J01q0J31r6j66J80J57m2q6
$$ 23 -79 -79 23 -86 -135 -69 -72 15 -55 12 51 -48 -9 37 -18 -20 -103 -148 116 81 26 -31 -31 -71 30 -50 81 -15 -181 -1 156 114 28
1730B8Jn9J6o5J27q2k2J9J8K0k0J19k32K08k6o2k7J37j44OO0r6J05m3J2K6j32J57L2j40J18
$$ 28 29 -30 -14 -79 48 -34 -56 -37 -19 1 -19 100 -132 76 50 -12 -39 98 -46 -40 20 -76 29 -14 -2 24 -108 49 81 -59 59
1458E9p0j06LJ06J65n7j74O6nl8J25j39k9J36J3K2q7RJ8l7O2R1j62M6l9J37r6l6K4O2P3j09
$$ 59 -11 -117 -114 -8 157 100 -74 -8 -13 -51 74 -65 -94 42 55 77 -10 -1 17 -20 42 133 -29 17 -22 115 19 -17 7 69 142 33
1178C3J3o3Or4j8Q7R6o0N3k8p7M9n3k9K66j28m1j93O3O4J40j02j0O2p0K7r7R0J5j11R5K0o9
$$ 33 46 -17 -11 -105 -123 -36 60 0 53 25 -52 -3 -56 -85 181 53 12 -181 -118 -54 86 -16 -26 36 -34 -7 -104 -14 1 -110 -15 5 -64
890f4J02J2r1P2N2o1J4j78j2J21M8j85J90j06K10j02k6J2j6k4J4P5K8p2k9j4O8ol4j05R2O9
$$ -64 38 50 -41 31 83 22 36 -142 -154 -33 15 -170 20 -86 124 22 -4 8 -8 -32 -18 57 85 13 -16 -30 38 32 -2 -107 -15 54
610E4Q1k40J26j1n7j7j7R5q9R4Mo2%J55p7J14oJ9j50o0rJ52j69M5N9P4k9j68l2K6Q5qmP9l5
$$ 54 135 -105 21 10 -47 -64 -81 14 -75 19 23 -39 -39 116 39 153 147 166 16 -44 -53 99 -70 -25 34 108 79 -89 -121 -95 -10 -18 -22 57 22
303B2L0m6j7J7l0J46r0j6k8N7l1M8m2j24R2J35j90R9m6J34r9k10K60n7P7l3Qk3o4n7O8O0l0
$$ 22 52 6 -11 6 -24 122 32 16 -12 45 14 62 20 -104 -12 123 -67 32 -14 120 21 -189 71 14 91 58 66 43 -21 -78 -10 50 20
15B0J7L0l4n2K6j1m5K8Q8r%j5l3oQK8k7o6J3J04Q4j54j62N4J23n8M1J
$$ 20 37 67 33 -19 7 -4 -49 -21 67 58 58 43 10 4 12 40 13 -53 -40 64 148 -6 -168 -114 9 -49 -8 -7
-230g
##PAGE=	F1=1822.78
##FIRST=	23146.756194512010552,	4241.1435120000014649,	0.27760088443756103516
##DATA TABLE=	(F2++(Y..Y)), PROFILE
4241E4j08J08l6ol1Pm9rL7J48j07o8P1p2J09n1L0q4K0K9m8N9p3j3m2K6J71n3L4j09J90m0r
$$ 54 -54 54 18 12 -19 -12 -61 -70 -33 115 8 -60 11 -61 48 -3 27 -57 -37 -8 -56 3 -70 -83 -125 -99 72 19 53 -56 134 94 85
3952H5q0o8m3J47j43J39o2J2N1l2o6J35j05o4J10Rm0M3j19L9oQ7o2J8P3j62K46j46jn0LO9
$$ 85 5 -63 -106 41 -102 37 -25 -13 38 6 -60 75 -30 -94 16 25 -15 28 -91 -52 -58 29 -33 -15 58 -104 142 -4 -5 -55 -52 17
3672A7oN2p0n5o3R9N4Rj1J96k47N1Q2q7rj79J31O1j52O7K2p7J72M6j11KO9j42Q7J13j26r2
$$ 17 11 63 -7 -62 -125 -26 28 37 26 222 -25 26 108 21 12 -167 -36 25 -127 -60 -38 -115 57 103 -8 -6 63 -79 8 121 -5 -97
3392i7P2J1J04p3j53J57O2q6L3N0J23l8j63L7j4oN1k7prm6m2J16q3j4j12J87R4j18j54K40
$$ -97 -25 -14 90 17 -136 21 83 -3 30 80 203 165 2 39 25 19 70 43 36 27 -19 -61 55 -28 -42 -154 33 127 9 -145 95
3121I5q5k7j03l9J32j8m3J20L4J9r4N2l5J6M4j1r8o3J02n8J4R8j07J48o6P0K3n9j29J14j7
$$ 95 10 -17 -120 -159 -27 -45 -88 32 66 85 -9 43 8 24 68 57 -41 -104 -2 -60 -46 52 -55 93 27 97 120 61 -68 46 29
2850B9omj61n1M0K21j41J16o7J2Mm5Qk2J37k9K2j02O1J4j7M3oJ1n4k9n0l3j04K97q7j1k5M6
$$ 29 23 19 -142 -193 -153 68 -73 43 -24 -12 -8 -53 -45 -67 70 41 63 -39 22 36 19 62 56 67 13 -16 -66 -99 -203 94 7 -4 -29 17
2552A7J29r9p5M6N3O3p2q2r0jR5j26J11K1J14j36m1L1J60n1j17N5J39j40Pm9P4J15r2k01K13
$$ 17 146 47 -28 18 71 134 62 -20 -110 -111 -16 -142 -31 -10 104 -32 -73 -42 118 67 -50 5 144 4 11 -38 36 151 59 -142 71
2281G1R9j34r7N1rO1p2K0prK6R1p2k1PM3n6o1J25O6r6k7k9n2J31j38Q0Pl4M0n8j0P4r1l5O9
$$ 71 170 36 -61 -10 -19 42 -30 -10 -17 -26 0 91 19 -2 5 48 -8 -69 56 122 26 -1 -30 -82 49 -89 -9 -2 -36 4 -54 -64 10 -81 -116 -47
1966d7K6J13j38L8M6n5J2K1LK1j15p0K41M6r2l4oj02J50j20R3j5j30J02J60l4o2l1r7O6m4
$$ -47 -21 92 -46 -8 38 -17 -5 16 19 40 -75 -145 96 142 50 16 10 -92 58 -62 31 16 -114 -12 148 114 52 21 -76 -10 -54
1695e4J19j07n%j0N3JQ3j99J68Rl6l2J16j03m5K3p0J60q6L7N0j81J30K1j03P1j6j03L7Q7J24
$$ -54 65 -42 -47 -47 -57 -4 -3 80 -119 49 58 22 -10 106 3 -42 -19 -89 71 -15 22 72 -109 21 42 -61 10 -6 -109 -72 15 139
1415A39o4p9J7k7l2N2j17O0J14mj7l4KMo2Q1K8j01J2J6J21j10k5J02K6Q8j42jp8k9Pk9N4J05
$$ 139 75 -4 13 -14 -46 6 -111 -51 63 59 42 8 10 14 -48 33 61 -40 -28 -12 109 -1 -26 76 102 190 48 47 -31 -60 -53 -82 -28 77
1117G7p6Q9n7q8M3k2JJ61o8l1j98Q3N3J59q2r1N7J0j9q0O4L6j34Q3O6j13J39Nj10P2J17j22
$$ 77 1 90 33 -55 -12 -34 -33 128 60 29 -169 -86 -33 126 44 -47 10 20 1 -79 -15 21 -113 -30 36 -77 62 67 -43 29 146 24
837B4J5j52l7N7P7j82K10p7J50p1J8k3mk3K2L6N1o2p6MP6n0lj03R4J04J02k76J74o9j01k5
$$ 24 39 -113 -150 -93 -16 -198 12 -65 85 14 32 9 5 -18 4 40 91 29 -47 -43 33 -17 -20 -123 -29 75 177 -99 75 6 -95 -120
557a20K9J09j11J04O4j08RJ21l2M7j5M0j06o5J4P7j49M2R8Q2n5j39pl6Q0n9M5O8ML6n6oJ2
$$ -120 -91 18 -93 11 75 -33 -24 97 65 112 97 137 31 -34 -20 57 -92 -50 48 130 75 -64 -71 -107 -27 -86 -41 27 31 67 11 5 17
268A7n1J13p1Lj6M6k4M0k5j42J02J32j64J03j54K06p0j98J78l1P5L8on9r0n6O5L9J5l0N0j
$$ 17 -34 79 8 11 -5 41 17 57 32 -110 -8 124 -40 63 -91 115 45 -153 25 -6 69 107 101 42 -48 -104 -39 0 15 -15 35 34
-12C4m3J4ln0R2K5J7m8L3jo6qR9p8n7QL8J83j88j11kJ14l2L6L
$$ 34 -9 5 2 -48 44 69 86 38 71 70 4 -4 95 17 -40 -32 6 189 1 -110 -112 2 -30 6 9
-230I
##PAGE=	F1=1728.43
##FIRST=	23146.756194512010552,	4241.1435120000014649,	0.070749603211879730225
##DATA TABLE=	(F2++(Y..Y)), PROFILE
4241F0j02N7L5om7n2pl8J07J03p9j05M4j5P2k7K3j15NK9PN3n5k8j01R8J55r9M7n1J80m9pj11
$$ 60 -42 15 50 44 -3 -55 -62 -100 7 110 31 -74 -30 -45 27 0 23 -92 -87 -58 -51 2 -53 -81 -182 -84 71 -28 19 -32 148 99 92 -19
3944a9p9N3L2o2J26m2K1jo4m3J17q5o1J43Mn5L3r2O5m6Q4p1N6M1j43K57j33j1oj1L6nL8o8
$$ -19 -98 -45 -13 -75 51 9 30 29 -35 -78 39 -46 -107 36 40 -15 18 -74 -9 -55 29 -42 14 55 -88 169 36 25 19 8 44 39 77 9
3646Ip0o3M2Q3N3j0J42j67M7N1n8mk49J65R2j49L2j3J5J26L3r7k0M9j11P8J67j88j50J24K2
$$ 9 -61 -124 -82 1 54 44 186 19 66 117 59 55 -194 -29 63 -86 -54 -67 -52 74 107 10 -10 39 -72 6 173 -15 -165 -41 -19
3375a9Q2o3j11J60km5K4J7J32j1j44m3L3L2J8Lm6l0j5p0J18j8n2n2J19R2j47j11K54q0J9J22
$$ -19 63 0 -111 49 47 2 26 43 175 164 20 -23 10 42 60 63 17 -13 -28 -98 20 2 -50 -102 17 109 -38 -149 105 25 44 166
3095A66J58j15j99j0M5L8Nq5Q9j7m7M1pj20m7J08n7J5P7j17K19q0M5P2o0j91J05r5K3L6n1
$$ 166 324 209 10 0 45 83 88 3 92 75 28 69 62 -58 -105 3 -54 -39 38 -79 140 60 105 177 117 -74 31 -64 -41 -5 -56
2824e6r0K9J81j46J36q6rM5n0km2J82m2Qj22P3M2o8Q4m8lJ0k6l7q8o5K52k6j0j11N5J99q5
$$ -56 -146 -117 64 -82 54 -32 -41 4 -46 -48 -90 92 50 58 -64 9 51 -17 67 19 16 26 0 -37 -125 -190 62 36 26 -85 -30 169 84
2535H4q3L5R7m8j5j00r2j8R9j08J60k3J48j96L7k5J31k3j13P2J39j86L5k6N4Q5l3k42K23Q6
$$ 84 1 36 133 85 70 -30 -122 -140 -41 -149 11 -12 136 -60 -23 -48 83 60 -53 19 158 -28 7 -19 35 120 87 -155 68 154
2272A54j49q6R1n0P1p5J6l2J3N3J22r1j8k4L8J2r3P5M4p5K5n5r3J16k9M0L8p4LJ1j8L5n4r
$$ 154 5 -81 10 -40 31 -44 -28 -60 -47 6 128 37 19 -5 33 45 -48 27 71 -4 21 -34 -127 -11 -40 0 38 -36 -33 -22 -40 -5 -59 -68
1975f8K2O9J31j71k9O9J2k1k8O4K0j07p5J68R9j04Rm1j26J80j21M3P6j08J2J50k3j6r1q6J03
$$ -68 -46 23 154 -17 -46 23 35 14 -14 50 70 -37 -112 56 155 51 60 19 -107 73 -48 -5 71 -37 -25 125 102 86 -5 -91 12
1703A2j0P7j27jJ2l8N1J8P0j67J29N7n4jN2j8q0l3j8J85j43N3Q4j81Q0jp5L9M6j26O5N1P9
$$ 12 2 79 -48 -49 -37 -75 -24 -6 64 -103 26 83 29 28 80 62 -18 -51 -69 116 -27 26 110 -71 9 8 -67 -28 18 -108 -43 8 87
1415H7m0L7n1p6j0Oj00J12J06k6m2K8k0j3q1R8j3o2K2M0O7j24j3J77%Q0j34k6p5n7J03k9K2
$$ 87 47 84 33 -43 -53 -47 -147 -35 71 45 3 31 11 -2 -83 15 2 -60 -38 2 69 -55 -68 109 109 189 55 29 -46 -103 0 -29 -7
1126gQ8q4J03o2q5M5RQN1j6pj66J02L4J46n4j74Q2M9n0o6J3O7j26O0J21j59J74m1j13O7J74
$$ -7 81 -3 100 38 -47 -2 7 15 66 50 43 -123 -21 13 159 105 -69 13 62 12 -54 -41 26 -100 -40 81 -78 96 55 -58 9 183
846A83j21j8j05q9J0J06j62K08n0P5l1N8o6J1k6J5LQ8n5j28L5Q8p3L1j11Q3J17R9k45K20j53
$$ 183 62 44 -61 -150 -140 -34 -196 12 -38 37 6 64 -2 9 -17 -2 1 89 34 -94 -59 29 -44 -13 -124 -41 76 175 -70 150 -3
575cj26j3O8J10j32P7J23j09oP9j2mn1O9l2o5M2j5j10N2R3J00n8r6jq0M5q3Q7N8K5L1p2LK5
$$ -3 -129 -142 -74 36 -96 -19 104 -5 -11 68 56 52 1 70 38 -27 15 0 -110 -58 35 135 77 -19 -20 -100 -55 -138 -51 7 32 63 -9 -6 19
268A9m2O9o9QL2Lk0M9j2j57J11Q8j01J01k16K42o4j41Q5J5N0Q6k4p9r2n2L9J9O7n4M6K1l9
$$ 19 -23 46 -23 -15 17 20 0 49 37 -120 -9 79 -22 79 -137 105 41 -100 -15 0 50 136 112 33 -59 -111 -72 -53 14 -40 6 27 -12
-20a2j2K4l9J17k6L5n9M6M7j12l0J63j08o3J6k9K50j94m7n8P1J8J6J9
$$ -12 -24 0 -39 78 52 87 28 74 121 9 -21 142 34 -29 -13 -42 208 14 -33 -91 -20 -2 14 33
-230C3
##PAGE=	F1=1634.08
##FIRST=	23146.756194512010552,	4241.1435120000014649,	0.1896445155143737793
##DATA TABLE=	(F2++(Y..Y)), PROFILE
4241F1p0j0Q3on7q3K8n6J59M1l4j03QMK5J0%j18OmP5P9p2m1j33J44R5j35P0K0J42j6j7j13
$$ 61 -9 -19 64 58 1 -82 -54 -110 49 90 56 -47 -39 -35 -10 0 0 -118 -112 -116 -41 38 -34 -75 -208 -64 31 -104 -34 -14 128 112 95 -18
3944a8j03J12m1j1J04K8k9k7o9m4J24j02l2J66J1p0J7n6Q9j01O9o5R5oj11K45r7%om4J3j9
$$ -18 -121 -9 -50 -61 43 71 42 15 -54 -98 26 -76 -108 58 69 -1 16 -40 49 -52 17 -48 47 41 -70 175 78 78 72 28 41 22
3664B2M5m4p2m1k2J03O2pQ4j01O1Qj3jk54J54R5j17%o2J31O0k0l2l9J9o2L3J87j91j76J47
$$ 22 67 23 -49 -90 -112 -9 53 46 130 29 90 98 85 84 -170 -16 79 -38 -38 -100 31 91 71 39 0 19 -43 -10 177 -14 -190 -43
3384d3L6N8p3p1J51n5jN1n3J30J1j17p6P5O2l6J2p4l8N7r7R2L0q2ON5O7j54n6K29l4P3O48
$$ -43 -7 51 -22 -93 58 3 2 53 0 130 141 24 -52 23 85 49 61 -13 -51 6 -91 1 31 -51 -45 10 77 -77 -133 96 62 135 783
3095G83O20o74o08l5j6M0j3n9Q2Kr2J7Oj11j6J02p2J9L5q5K33r7J8J30j5k89J16j04J02L9
$$ 783 1403 729 121 86 70 110 97 38 120 122 30 47 53 -58 -74 28 -44 -25 10 -75 158 61 79 209 194 -95 21 -83 19 58
2832E8j8j14J5J13j08J17r3nN6p4Nm2J90n0j9p5J8N9o1Q7o4mK6j3nj24l7J93QK9j97O9K09
$$ 58 40 -74 -59 54 -54 63 -30 -35 21 -53 -48 -90 100 50 31 -44 -26 33 -28 59 -5 -9 17 4 -1 -125 -162 31 39 68 -129 -60 149
2544A49n2j00M2J16j12K5r2p4n6J07p8J75o0J37k29J36o9P5Op9Q1J08j80J2oM2P0j5k31K11
$$ 149 97 -3 39 155 43 68 -24 -98 -154 -47 -125 50 -10 127 -102 34 -35 40 46 -33 48 156 -24 -12 -18 24 94 79 -152 59
2281E9O3j47p0J21q8P9m8Mq0K3Q5J30o3k4m4N4M3j16L7J5l9M2o0j48J25N2nO4r1n6O7qKKJ0
$$ 59 122 -25 -95 26 -62 17 -31 -27 -107 -84 1 131 68 44 0 54 97 -19 18 33 -6 36 -24 -172 -47 5 0 64 -27 -83 -16 -24 -22 -20 -10
1975a0n1J19J33j65j07Q1P2l4q0R7J9r5m6Q8Q3o0L8q6j02J70q9JJ54j06m3J04rL0j52l3J27
$$ -10 -61 58 191 26 -81 0 72 38 -42 55 74 -21 -67 21 104 44 82 -4 -106 64 -25 -24 130 24 -19 85 76 106 -46 -79 48
1703D8J7J1j25j5M3n9M7J8O8j33Q3J12j03N5l0O1q6p0M5J54j90M7J18j34K1mp5M3R4j74P1
$$ 48 65 76 -49 -64 -21 -80 -33 -15 53 -80 3 115 12 67 37 98 12 -58 -13 141 -49 -2 116 -18 3 -1 -76 -33 61 -113 -42
1432d2K1M9rJ41j11j44K6qq8J16J00m6l6Q7m7l3p7R7j2o4Q4K1kj21j7K10nO2q4n6o3o6J61
$$ -42 -21 28 19 160 49 -95 -69 -77 -165 -49 51 5 -31 56 9 -24 -101 -4 -16 -80 4 25 23 -98 -115 95 90 152 68 12 -51 -117 44
1143D4k2qN3r1J16m6p0N1NQqoK2j19J17K4J02l9k14J25M0n7n0n6J07j07L9J52j76J79q5j02
$$ 44 22 14 67 -24 92 46 -24 27 32 40 32 26 48 -71 46 70 172 133 -81 44 84 27 -23 -79 28 -79 -40 112 -64 115 30 -72
863g2O5J84o5o2o5j47nJ41j33J76l6J6LR2j08K3k9Rk8J10m3j73O8J04p4O2j23O5J08O3j61
$$ -72 -7 177 112 50 -15 -162 -167 -26 -159 17 -19 -3 0 92 -16 7 -22 -13 -41 69 26 -147 -79 25 -49 13 -110 -45 63 126 -35
592c5K36k25j06J2Q3Q3j35K5J66p5k9N2l2k0r8R7K5l5N2q1o9N5N6J20l1n0j8r5po7R3M7L2
$$ -35 201 -24 -130 -118 -35 48 -87 -62 104 29 0 52 20 0 -98 -1 24 -11 41 -40 -109 -54 2 122 91 41 23 -72 -79 -146 -53 -6 26
303B6J9q8NO4j8K2p3nQ4n3k1Q4j3j63J13L0k1P3k11K50q0q2J9N5J7J15n3p8q4m4K0LR4l2J6
$$ 26 45 -43 -38 26 8 30 -43 -48 36 -17 -38 46 33 -130 -17 13 -8 65 -146 104 24 -58 -39 16 33 148 95 17 -67 -111 -91 -88 6 -26 -10
-3a0K7l8m8N1JQ2l5M2m5J2R9j17m9J80r5p9L9p3K72j82j2q6J0Q9k4N0
$$ -10 17 -21 -69 -18 -17 65 30 72 27 39 138 21 -28 152 57 -22 17 -56 216 34 22 -64 -54 35 11 61
-230F1
##PAGE=	F1=1539.72
##FIRST=	23146.756194512010552,	4241.1435120000014649,	0.52390497922897338867
##DATA TABLE=	(F2++(Y..Y)), PROFILE
4241F3l0o9R9rn0q4L4m0J69j3Qq3mk1l4N7j6j03K1n0J26R9r1n2j25J46J9j33Q8P8P8O5m1q3
$$ 63 33 -36 63 54 4 -80 -46 -86 83 70 78 -5 -9 -30 -64 -7 -23 -126 -105 -155 -29 70 -21 -73 -198 -52 -33 -166 -78 0 78 143 102 19
3944A9j52J24m9mO3J23j07nn6p8J64j56L2J59J5o4ok7J13j53L6m4J29n2r2K33o0K3n2p6J7
$$ 19 -133 -9 -58 -62 1 124 17 12 -44 -122 42 -114 -82 77 92 28 22 -5 108 -45 -9 -53 76 24 -68 165 105 128 76 0 17
3672A7m5O9qn8j2n4J00K2JM2p4R4l7M0j4k02J09P1o1k0q3J99nq3O5o4k1Ok5J74j37j64J28
$$ 17 -28 41 33 -25 -37 -91 9 31 32 74 0 94 57 97 83 -119 -10 61 0 -20 -103 96 91 8 73 9 -12 -6 -31 143 6 -158 -30
3384c0L3N6r2m8J20p1M9P8j32J15J0p3n0Q1R1j00J1r4l0J36j15O8K8r2L7K7M4j38k8J79K2
$$ -30 3 59 -33 -81 39 -32 17 95 -37 78 88 15 -35 46 137 37 48 -46 -76 60 -55 13 41 -51 -14 13 57 -81 -109 70 92
3112I2J32J312J211j365j117j15m8L1k7l8N1K7j12k0J6r4L4J08j21M2j8k7J85j19J1J56O1
$$ 92 224 1536 2747 1382 265 150 102 133 106 68 119 146 34 14 30 -64 -30 78 -43 -1 -19 -46 139 20 31 187 248
2876B48l65J31o6J48Mk0r2J0K8l3P8p7PJ9r2K5l1J81o7l6J3q8P1j1P1o2J5j5KL7j40l1J57
$$ 248 -117 14 -52 96 100 80 -12 -2 26 -7 71 -6 1 20 -72 -47 -78 103 36 0 13 -75 -4 -15 56 -6 9 -6 -4 33 -107 -138 19
2587A9qR4k49Q1J60j8j17O5J01j07M3m8m6j12J02l0J33o2P5k16K24q9ML4l3O8O6j34k4MK5
$$ 19 11 105 -144 -63 97 79 -38 27 128 21 64 16 -30 -142 -40 -70 63 1 76 -140 84 -5 -1 33 0 68 134 0 -24 -20 5
2316EP0m3j60J87M0j40n8J22r7R1rj5j28J1J21R7Nl6m3O3L3j18K2Pk3L6m2j99J52P6l5P8q5
$$ 5 75 32 -128 59 99 -41 -99 23 -74 17 8 -7 -135 -124 -3 94 99 63 20 83 116 -2 20 27 4 40 -2 -201 -49 27 -8 70 -15
2027a5j14Q7K4j6N2J7j16J65J23j37j64O7R8j6j15R3L7j08J4M2lK3M0j20m2J20n0k2K10j16
$$ -15 -129 -42 -18 -34 18 35 -81 84 207 70 -94 -27 71 55 -60 33 70 -38 -24 18 15 38 78 -42 -84 36 -14 -36 174 58
1765E8n2K4J5N2j86L8J31K6n5r7k9O1p4P5ML9q9L5J61j48J08r5R6o6o3P7Q0j95J6J37o1l1
$$ 58 6 30 45 97 -89 -51 80 106 51 -46 -75 -14 -88 -13 -9 30 -59 -24 137 -11 97 2 98 32 -31 46 126 -69 -53 84 23 -8
1485hJ6q9Q2J06k18N1RM0JK11j49k00O4rp7J04P2o1nJ27o3m2n3P0K1q4J61k5n6q3n6J99%M7
$$ -8 8 -81 1 107 -111 -60 -51 -11 -10 201 52 -148 -84 -93 -170 -66 6 -55 -60 67 4 -38 -91 -21 0 -84 77 52 -4 -87 -143 56 56 103
1187A03j8p2n1n4J64j3k9Or1J40k4m8N0n0K6nm4N0p1J12L5N1m5j95J69mm1l9j10J42r8K2J47
$$ 103 85 13 -38 -92 72 59 30 36 -55 85 61 13 63 13 39 34 -10 40 -31 81 116 167 122 -73 96 92 51 12 -98 44 -54 -32 115
898A15j60J45r0p9O2J35Rp9o5j74QJ65q9J18l6rJ2J28j39K3k6J9n8R6k4j95R3J14o4R2j32
$$ 115 -45 100 10 -69 -7 128 137 58 -7 -181 -173 -8 -97 21 -15 -24 -12 116 -23 0 -26 -7 -65 31 7 -188 -95 19 -45 47 -85
627h5L4Q9Om9K08k60l7M0P6J5j07k9J79l0n0M6o1rj31J15L0K5L1r3m0L6J4J30J2pm6q9m9j2
$$ -85 -51 38 44 -5 203 -57 -94 -54 22 37 -70 -99 80 50 0 46 -15 -24 -155 -40 -10 15 46 -47 -87 -51 -37 93 105 98 52 -37 -86 -98
330i8N1L2L6Rr2jJ09Nk6o2k7J01r4j9J24k5j54J01j1M8Rj44K26r1m9JO6j1J30q1p2p1l3J6
$$ -98 -47 -15 21 30 -62 -63 46 51 25 -37 -64 37 -57 -76 48 23 -131 -30 -41 7 16 -128 98 7 -42 -41 25 14 144 63 -9 -80 -113 -97
32i7JR0K8l5J5k0p8M9N7OmM8k5n0J31p7n3J33m4q8P2r5K42j38l1q2l8J58p4P9
$$ -97 -96 -6 22 -13 2 -18 -96 -47 10 16 12 60 35 -15 116 39 -14 119 75 -13 59 -36 206 68 37 -45 -83 75 1 80
-230H0
##PAGE=	F1=1445.37
##FIRST=	23146.756194512010552,	4241.1435120000014649,	0.63315737247467041016
##DATA TABLE=	(F2++(Y..Y)), PROFILE
4241F5Lj04R3j6k5o6J3KJ38l7K5p7L1o9j01J08j9p7M1p8J35P8q0o3r0J14l9q8R9R1J1J61p0
$$ 65 68 -36 57 41 16 -50 -37 -35 103 66 91 14 45 -24 -125 -17 -36 -113 -72 -150 -15 63 -17 -80 -170 -56 -95 -183 -84 7 18 179 109
3952A09l2k11J00ql3PK01j66N3l2j29K17k18J07J25Lj9m5j6J29j73qj8J49q4r2K33l4L9j16
$$ 109 77 -134 -34 -42 -75 -68 133 -33 20 -12 -141 76 -142 -35 90 93 74 29 13 142 -31 -39 -57 92 8 -84 149 115 154 38
3690C8j03N6o6R5K0l7Pm3Q9n5RK2q1J26o4Q6m5j32N4M1Ll1n5J82l8j32J50r0o2P7o4J49o9
$$ 38 -65 -9 -75 20 40 3 10 -33 56 1 10 32 -49 77 13 99 54 -78 -24 17 20 -11 -66 116 78 -54 96 6 -56 21 -43 106 37
3401C7j28P6J5Q2j07m4P3n4J07O5j76Q4j2j9J4L5J22j53K3j06j9J80j18O8k3p5M3M5L1j08
$$ 37 -91 -15 0 82 -25 -69 4 -50 57 122 -54 30 18 -1 13 48 170 17 40 -66 -85 95 -23 45 22 -53 -10 35 66 -42
3139d2m2J17O2J73J775J627j827j463k02m5Jl8k3J2O3r7o4J1q6Q8J32j84P6o5M0R4j36L9J44
$$ -42 -84 33 95 268 2043 3670 1843 380 178 133 134 96 73 85 148 51 -13 -2 -88 0 132 -52 24 -41 -1 93 -43 -4 140
2885A40J30l92J30j2J44l9m2l2Oo0M7N5m1J9n9q3L9j7J82j09j7R4k00P8N2N2n2M4q9J3P8j43
$$ 140 270 -122 8 -4 140 101 59 27 33 -27 20 75 34 53 -6 -89 -50 -67 115 6 -11 83 -117 -39 13 65 13 57 -32 -19 59 -84
2605h4l7J48n4J50k49P7Q5Kj15Q9O2n0L7J9j6j70P3L1M5k1j0j71K75r2o5O7OK8K5o6k6okP7
$$ -84 -121 27 -27 123 -126 -49 36 38 -77 12 74 24 61 80 64 -106 -33 -2 43 22 12 -159 116 24 -41 26 32 60 85 19 -7 -13 -15 62
2307F2q2o0J41L7j31n6Q8o2J05J9l6j60j3J48K3Q4l9l1N6kr3L6J2m9L7j2k20J70N7n0Q0o7
$$ 62 -20 -80 61 98 -33 -89 -1 -63 42 61 25 -135 -148 0 23 107 68 37 93 91 -2 34 46 -3 34 22 -198 -28 29 -21 59 -8
2027hj42P4O0k5P9K0j57J90J16j13j69K9Q3K8j34P3O2j33P7L9j15R5K9j28K0N7l2k6K41j23
$$ -8 -150 -76 -16 -41 38 58 -99 91 207 94 -75 -46 37 65 -69 4 66 -67 10 49 -66 29 58 -70 -50 7 -25 -51 190 67
1765F7l3o0N3L6j83J04J06K4r6n9k2M4r3J45j3l7l2mJ90j57J30j21Q7m0j9N1%j48j9J25K0
$$ 67 34 -26 27 63 -120 -16 90 114 18 -41 -63 -19 -112 33 20 -17 -49 -53 137 -20 110 -11 76 36 17 68 68 -80 -99 26 46
1493D6o9M2r5J31P1k19J4J8M1j1K36j75k08R2k0p0J14K3p2K9J31n6l5k1L4N5q7J97o0q3qj24
$$ 46 -23 19 -76 55 126 -93 -79 -61 -20 -31 205 30 -178 -86 -106 -176 -62 -39 -111 -82 49 -7 -42 -63 -29 26 -61 136 76 -7 -15 -139
1213a39J70rM3K7n3m8k2J08mk7l8q3J62nk8K9j21O2K0j02P2k8Q2O9J1o3j31J98n5j4m2j19
$$ -139 31 22 65 92 39 -9 -31 77 73 46 8 -75 87 82 54 83 -38 24 44 -58 14 -14 68 137 148 85 -46 152 97 83 41 -78
933g8J64j08kJ18j31R0m4n3N0M7O0m7j13j43L1J61l7M9m1OqJ65j60QnL3o9M2Kj90J09R9m6
$$ -78 86 -22 -24 94 -37 53 9 -44 6 53 113 66 -47 -190 -159 2 -35 14 -27 -21 -29 136 -24 -16 -21 12 -57 -15 -13 -203 -94 5 -41
645d1J17j28j5O0l6N5J49k54N5O1O4p8m7o8J55No7M5o2Oj30J19j6R2j1n3l1%j6J24M7K4o9
$$ -41 76 -52 -67 -7 -43 12 161 -93 -38 23 87 9 -38 -106 49 54 -13 32 -30 -24 -154 -35 -51 41 30 -23 -54 -54 -70 54 101 125 56
356E6p1n8O5k4J5M2Nq5MJ22J6p4j4m8P0j01j1J34k7j38Q5k6Q9q1m3J58p0l1J1N0k3J36r6p9
$$ 56 -15 -73 -8 -32 -17 25 30 -55 -51 71 87 13 -1 -49 21 -80 -91 43 16 -122 -37 -63 26 -55 -98 60 -10 -41 -30 20 -3 133 37 -42
58d2m8k5RK3O8J03r4j8L8r1LJ07p3M0O0pj10J31j5l6M3Lo6J00j07J65n0r4n5n6J94j05Q1
$$ -42 -90 -115 -106 -83 -15 88 -6 -24 14 -77 -74 33 -40 0 60 53 -57 74 59 23 66 69 3 103 -4 161 111 17 -38 -94 100 -5 76
-230G6
##PAGE=	F1=1351.01
##FIRST=	23146.756194512010552,	4241.1435120000014649,	0.23063720762729644775
##DATA TABLE=	(F2++(Y..Y)), PROFILE
4241E4K7j13Q5k8J4m6j6L2J04l5J2q8J04j18j63J50j2m9N4p0J05Qk7p6n6P5n7k6J04N7k9K11
$$ 54 81 -32 53 25 39 -7 -23 9 113 78 90 2 106 -12 -175 -25 -37 -86 -32 -102 3 11 -16 -92 -148 -73 -130 -156 -52 5 -24 187
3961A87q4J4k39N4M4o8m8K33j76J11rj54K37k46J56Q3k5N7j05j1J24j43m6mJ50j01r8K47l3
$$ 187 103 117 -122 -68 -24 -92 -140 93 -83 28 19 -135 102 -144 12 95 70 127 22 11 135 -8 -54 -58 92 -9 -107 140 107
3707A07M3j59j27J07n7J06J9j2Rj4R3j25LJ0q6J31o6J17q6q2J9K1M8l8QJ02j4j67J89j04r0
$$ 107 150 -9 -136 -29 -86 20 39 27 36 22 115 -10 -7 3 -83 48 -18 99 13 -69 -50 -29 19 -19 -11 91 77 -90 99 -5 -95
3436i5J28p1J31l9q5K0MJ14j10m6K3k8J64jj55L9l0J7Q5m2J47j89O2j08j6J74j05P9q6l2M1
$$ -95 33 -38 93 54 -31 -11 -7 107 -3 -49 -26 -54 110 109 -46 -7 -37 -20 65 23 170 -19 43 -65 -81 93 -12 67 -19 -51 -10
3165a0P9K4p4q1N8P9J67J766J617j784j439k40j3m1n2nk1R2l8j06j1q3J16J58k18J03r7R8
$$ -10 69 93 19 -62 -4 75 242 2008 3625 1841 402 162 149 108 56 51 30 122 84 -22 -33 -116 0 158 -60 43 -54 44
2920D4nj31Q9J07J57l63R8L7J19o0p4L5j5j36R7O6LL7j55m5M0j3K10j74L2J35k73Q5J03K7
$$ 44 39 -92 -3 104 261 -102 -4 33 152 92 18 53 38 -98 -1 65 68 105 -50 -95 -55 -68 142 -32 0 135 -138 -53 50 77
2657G7l6N2j43J7J05j29l7J38q5J58k04M8J6J6q6R2K9J5MQ8J3k11K6Q7m4L9p7j20K79r2j11
$$ 77 41 93 -50 -33 72 -57 -94 44 -41 117 -87 -39 -23 -7 -93 -1 28 43 47 135 148 -63 -37 50 6 45 -32 -152 127 35 -76
2386g6J00L0k5j7OJ4k7l1Q2r1K3N8N8j05o7L2RJ13K5m6j72l9J56o7J38k2k4M6l5n3P2Lj14
$$ -76 24 54 29 12 18 32 5 -26 56 -35 -12 46 104 -1 -68 -36 -27 86 111 65 -107 -146 10 -57 81 59 35 81 46 -7 65 68 -46
2097d6O1K9k02J60K2o1Q3o1j20N3P0l2P5K9j73J75J25j01j15j5L9P6j42N4P6j43J17N8j97
$$ -46 15 44 -158 2 24 -37 46 -15 -135 -82 -12 -44 31 60 -113 62 187 86 -29 -44 -5 71 -71 -17 59 -84 33 91 -106
1843a06J17J9r8M5J0l3k0K34j13j2j14J03j1j47J41N6L1j04k9lJ5j22K18j6j39K8k8J97j29
$$ -106 11 30 -68 -23 -13 -46 -66 168 55 43 -71 32 21 -126 15 71 102 -2 -31 -34 -19 -141 77 61 -78 -50 -78 119 -10
1590a0J18j19O1k7M2k5n3o6l2P3R4q6N0q2J59Mj68k1M2M6l0K13k01j61J08m4p1J48j8p6L9
$$ -10 108 -11 50 23 65 40 -13 -79 -111 -38 56 -30 20 -62 97 101 -67 -88 -46 0 -30 183 -18 -179 -71 -115 -186 -38 -56 -132 -93
1318i3R7l6j0J1PO0m7J62n1r6P7j85J49m7M3L2Jm5J8J2NKo3o6J51J0j8mj61R8K0j46R1QL5
$$ -93 4 -32 -42 -31 -24 36 -11 151 100 4 81 -104 45 -2 41 73 74 29 47 59 64 66 3 -63 88 98 80 76 -85 13 33 -113 -22 -14 21
1012B1J17j7p5o4K12q8Lo1p7J73j27m1R6j19N0K1l5L3m2O8J9j79o0M4J29Mj6m5N5m5J89j68
$$ 21 138 121 46 -18 194 106 109 48 -29 144 17 -24 72 -47 3 24 -11 22 -20 48 67 -112 -172 -128 1 5 -11 -56 -1 -46 143 -25
732b5k3M3K8n0l1L2j64J25N1k0J33j21o7K0l7J19Q0k14J24P6N7j51K3q2J05J5q3L5k5J2j02
$$ -25 -48 -5 23 -27 -58 -26 -190 -65 -14 -34 99 -22 -89 -69 -106 13 93 -121 3 79 136 -15 8 -74 31 46 -37 -2 -27 -15 -117
461a17J08p8J38m1jk9l8l3J08N6M2q5m5l1J33j02KN0J0p4L1Q5J9j22N9n2J7q8jR9Jj30Q2j8
$$ -117 -9 -87 51 10 9 -20 -58 -91 17 73 115 30 -15 -46 87 -15 -13 37 47 -27 4 89 108 -14 45 -7 10 -78 -79 20 21 -109 -27 -45
163d5Q6j70P2M5k0kJ7K9k5J40j00r8j0k7k0O6N3J60j53n4J28q2o9J32j31O4P3J3j38J03L6
$$ -45 41 -129 -57 -12 -32 -34 -17 12 -13 127 27 -71 -81 -108 -128 -62 -9 151 -2 -56 72 -10 -79 53 -78 -14 59 72 -66 37 73
-108G3Jm2Lj0J05j16O7O5j61k1n0J84j01M7
$$ 73 74 32 35 25 130 14 81 146 -15 -36 -86 98 -3 44
-230D4
##PAGE=	F1=1256.66
##FIRST=	23146.756194512010552,	4241.1435120000014649,	-0.31146442890167236328
##DATA TABLE=	(F2++(Y..Y)), PROFILE
4241B4M7j13R5m4N8l2l2J2J01k4j8r5J84j53k01J64mk6N3l3O3p6L1p8m2M9m1K0J00jj9J81
$$ 24 71 -42 53 9 67 35 3 15 116 92 74 -21 163 10 -191 -27 -31 -57 -4 -37 26 -50 -19 -97 -139 -90 -131 -111 -11 -12 -31 150
3961A50q0L7k03JP2q1q6K18j38J28J2j24J97k25J63M7n6J41j81LJ04q1n9rJ37j21r1K61n6
$$ 150 70 107 -96 -95 -23 -104 -190 28 -110 18 30 -94 103 -122 41 88 32 173 -8 -5 99 18 -41 -50 87 -34 -125 136 80
3707H0M1j59j36J31j5R9j6J5qJ0J14j44k5%o8R7m9J27j08p3K9RN4m2O1J8N6j89J77r9r1J41
$$ 80 121 -38 -174 -43 -58 41 25 40 32 42 156 12 -13 -13 -81 16 -33 94 -14 -87 -58 -49 5 -37 24 42 98 -91 86 -13 -104 37
3427C7n6J28o6m6j6K7J17j04m6j2j7J97q6p5j0k6K2J29j03J47k05J19r9k7J39q4O5j18L4L8
$$ 37 -19 109 43 -3 -19 8 125 21 -25 -37 -54 143 57 -18 -28 -54 -32 97 -6 141 -64 55 -44 -71 68 -16 49 -69 -35 3
3165CR0J2l8j12K0P5J13J300J185j275j063k02L7p7p4L1n2R4N8j37m2p1J10J51j82R2j10J41
$$ 3 93 105 67 -45 -25 50 163 1463 2648 1373 310 108 145 68 -6 25 -27 67 125 -12 -54 -125 -15 136 -46 46 -64 77
2920G7q3q6J20N5J37k88L8Q2Q7m3r6P2n8j75R5J01L4P9k38RK8k6K47k40Q1J45k91R4J31j4
$$ 77 -6 -92 28 83 220 -68 -30 52 139 96 0 72 14 -161 -66 35 69 148 -90 -81 -53 -79 168 -72 9 154 -137 -43 88 74
2657G4j1K1j40J0J22j02j4R7o4R5j33Kl1L1k8O0K2M3m2J43K6k12j6J14r4Q3r8p8K37r4j15
$$ 74 63 84 -56 -46 76 -26 -40 57 -7 88 -45 -43 -74 -43 -71 -11 11 54 12 155 181 -31 -47 67 -27 56 -42 -120 117 23 -92
2386i2J10N1p3o1O5P2m4m9P5m9N6o2R1m4q8k3Q8J03K2m1j68n5J33j33J48J1l5M9m0j4J02l6
$$ -92 18 69 -4 -65 0 72 28 -21 54 5 61 -1 90 46 -42 -65 23 126 148 107 -61 -116 17 -116 32 43 8 57 17 3 105 69
2106F9j78R2P2j42J18lp6R2q3n8N3L1k8M8N0j76J13J46q6l4m0k3J15j41M3P2j27J20P9k15
$$ 69 -109 -17 55 -87 31 28 -48 44 -39 -97 -44 -13 -41 7 57 -119 -6 140 54 20 -20 -43 72 -69 -26 46 -81 39 118 -97
1843i7Q6J4l6J3ll6j4J84q4%j17J46o3j01J40kN8q7j8NRj54K43Mk05O1l5J91r2R1j17N1l8
$$ -97 -11 3 -33 -20 -23 -59 -73 111 27 27 -90 56 -7 -108 32 30 88 1 -17 -12 -3 -157 86 90 -115 -54 -89 102 10 101 -16 35 -3
1555cR3r7p5J1qpJ44q5M6n7J42o7q4m3P5M1k3J41k25p8J21o9p8J67j3p1J9L8j6J8M2jK5K3
$$ -3 90 -7 -82 -71 -79 -86 58 -27 19 -38 104 37 -47 -90 -15 26 3 144 -81 -159 -38 -107 -185 -18 -31 -102 -83 -45 -61 -43 -1 -2 23 46
1257D6P3Rj07J32k01J35j02L9OO4k5M9r3K3M1o1m0Q3K6j5l1j40J01j8j56J10K8KJ55m3p3k6
$$ 46 119 128 21 153 -48 87 -15 24 30 94 69 118 25 48 89 28 -12 71 97 82 51 -89 12 -6 -162 -52 -24 -22 133 90 17 -9
977iK15q5qq7nJ71j32r1R6j36N1O5l9K7r7L6Q8k26L7L9Q7K5p5m4J12o6J79j59n4J06j7nr2
$$ -9 206 121 113 26 21 192 60 -31 65 -71 -20 45 6 33 -64 -28 60 -166 -129 -90 -3 22 -53 -97 15 -51 128 -31 -85 21 4 -1 -93
688i3O2j30J45k0J8J37j21r5k4lJ24J2j39J32Q0O5j65P3p9N2Jr7QL3Qo6Q6j16J53l5J8k0n9
$$ -93 -31 -161 -16 -36 -18 119 -2 -97 -121 -124 0 12 -127 5 85 150 -15 58 -21 31 32 -65 -57 -24 -16 -82 4 -112 41 6 24 4 -55
400e5m4R6L8M6r7j7J9J59j53kO3J5o7P9PL1j72J32m1j0q4OL4N6j36R5OM6k30J74q7M0M0LK6
$$ -55 -99 -3 35 81 -16 -33 -14 145 -8 -10 53 68 1 80 87 118 -54 78 37 27 -57 -51 -17 39 -97 -2 4 50 -180 -6 -93 -53 -13 -10 16
93A6k1J35j00j18M0l7o4J15M8J75k00o1J99n5j28J27j61N5O9N0j30O4O2L1p3n5N4Q4j09j6
$$ 16 -5 130 30 -88 -48 -85 -149 -34 14 189 -11 -72 127 72 -56 71 -90 -35 34 84 -46 18 80 111 38 -17 37 121 12 -4
-169dJ56j91J0l6J36n9j5
$$ -4 152 -39 -29 -65 71 12 -3
-230c
##PAGE=	F1=1162.31
##FIRST=	23146.756194512010552,	4241.1435120000014649,	-0.37948834896087646484
##DATA TABLE=	(F2++(Y..Y)), PROFILE
4241a8P1j20J19o2R5j8l4o1J37j5n0p4K32j59k06J34Pk4N2ML9j28M5n0n0M0rL0P8m3L2Q6n9
$$ -18 53 -67 52 -10 85 67 33 -28 109 94 44 -30 202 43 -163 -29 -22 -46 6 10 49 -79 -34 -84 -134 -94 -103 -73 5 -38 -6 80 21
3952B1K9j09n2O3n4j06J80p9R6K5m1J11j72J38J7p3K08k63M2P9j6n1j9J12j50p4K68r9N4j26
$$ 21 50 -59 -111 -48 -102 -208 -28 -107 -11 14 -27 84 -88 50 67 -6 202 -61 -19 60 44 -7 -26 86 -64 -138 130 31 85 -41
3690d1j11J04L1Q3o0L3l3K1J34j01p1j0k6L4k2J16r4q7P5jK0m5P3k8J24j87J40q2o2J26n1
$$ -41 -152 -48 -17 66 6 39 6 27 161 60 -11 -21 -47 -13 -35 81 -13 -100 -25 -26 -6 -51 22 -6 118 -69 71 -11 -73 53 2
3419BJ31j22j9k2R0P0r5m6j5l5J94j37J8m4oNJ29j12J11j96J62p5m9J07o4Or7J06K5O0onj05
$$ 2 133 11 -8 -30 60 130 35 -11 -26 -61 133 -4 14 -30 -36 -31 98 -14 97 -99 63 -12 -61 46 -18 -12 -109 -3 22 82 76 71 -34
3130c4J5N3L9O64N90o22n56j19R4q6j03Q1q4O2J64j56o2l9P2J08q1L1j11J71j29kJ05qJ06
$$ -34 -19 34 73 737 1327 705 149 30 124 38 -65 16 -68 -6 158 2 -60 -99 -27 81 0 31 -80 91 -38 -40 65 57 163
2876A63j97l7J25N0%q0N6r8j70O0J19M1J42k81N8J5n5K55k73J02J45k63J10J35p4K6l8r0q
$$ 163 -34 -71 54 104 104 24 80 -18 -188 -128 -9 32 174 -107 -49 -34 -89 166 -107 -5 140 -123 -13 122 48 74 36 -54 -62
2622f2J39o9K5L1Jj8o1m5n2M8L8QL3K2p5J74J5j69k7R3r7J04q3m7J65r1p9Q0Q9j10r9R9J08
$$ -62 77 8 33 64 65 47 -14 -59 -111 -63 -25 -17 16 38 -37 137 152 -17 -44 49 -48 56 -27 -74 91 0 -79 1 90 -20 -119 -20 88
2334H8m2n2N4K5N3j97J13M8j11o0J47P1K7k5j52n9Q5j37J15L6n4N8qJ3J01r3j99R7J06n3N8
$$ 88 46 -6 48 73 126 -71 42 90 -21 -81 66 137 164 139 -13 -72 13 -124 -9 27 -27 31 23 36 137 44 -155 -58 48 -5 53
2062E3nr5R9j24MQ6m7lJ9P7j78K5J63n2K6l8p9J30j30L7O3r9Q9R9j78M2KL9o2J4k6j8J01l9
$$ 53 48 -47 52 -72 -68 18 -29 -32 -13 64 -114 -89 74 22 48 10 -69 61 -69 -32 31 -68 21 120 -58 -16 -14 25 -37 -23 -49 -67 34 -5
1765eKq2J62r3o1J05m5R8n6k7k1M3j65J95M3j89M1k5J74p2P3j26O6o6J10j06p9M8M5r2J53
$$ -5 -3 -85 77 -16 -77 28 -17 81 25 -2 -23 20 -145 50 93 -96 -55 -80 94 22 95 -31 35 -31 79 -27 -106 -58 -13 -105 48
1493D8p4O2m2R2j25Ln7J11K3J8L0k24JJ42q5p6J31M5o7jl2KL3P4Ll5Q7l0J01j23J34j56J12
$$ 48 -26 36 -6 86 -39 -36 -93 18 41 59 89 -135 -134 8 -77 -153 -22 23 -44 -45 -77 -75 -42 32 35 0 87 57 158 35 169 13 125
1205A25j42K0k5J11RO1j69N0O5l2j4k9M7j5l3q4O7o7j35J37J5J1J56o4o2k6K08n0l8j04N5
$$ 125 -17 3 -22 89 98 159 -10 40 105 73 59 30 77 62 29 -55 12 -55 -190 -53 -38 -27 129 65 3 -23 185 135 97 -7 48
933D8J65j20j23J04j69Q4O6n7M5j09k5J39k26R8K1O0K6j21m7J55n0J23j26o4J51q6M2j22Q8
$$ 48 213 93 -30 74 -95 -11 55 -2 43 -66 -91 48 -178 -80 -59 1 27 -94 -141 14 -36 87 -39 -103 48 -38 4 -118 -30
680c0j01J60q6O0J31j28q2n0K8P5m9l4Q0O6Q6j17Q3p6K6l2r7l1Q6ll0N9j19J44Pj8On3n4R1
$$ -30 -131 29 -57 3 134 6 -76 -126 -98 -23 -72 -106 -26 40 126 9 92 16 42 10 -87 -118 -32 -35 -65 -6 -125 19 26 8 14 -39 -93 -2
382bJ0M0r8KO7J19j57KQ2Rn6J16o8O6k15J63j8J7j12Nk0J11j49J06N0j7k50K36j84Q7P4k7
$$ -2 8 48 -50 -48 19 138 -19 -17 65 74 18 134 66 132 -83 80 62 79 -33 -28 -48 63 -86 20 70 53 -197 39 -145 -58 16 -11
102a1M6j8J16j01j20Q8m7r7J54L9J41k25k3K05j5j47J02j73J9M8J00r6K9O6L2l6j38R0M8q1
$$ -11 35 17 133 32 -88 0 -47 -144 10 49 190 -35 -58 147 132 -15 87 -86 -67 -19 81 -15 14 80 112 76 -62 28 76 -5
-160en2J79j71L0k2P6kp9
$$ -5 -57 122 -49 -19 -41 35 33 -46
-230d6
##PAGE=	F1=1067.95
##FIRST=	23146.756194512010552,	4241.1435120000014649,	-0.10809603333473205566
##DATA TABLE=	(F2++(Y..Y)), PROFILE
4241e6R7j30J34q1J17Jl3j50J81Jp7k2K31j37j75O3J7m5P4J7M1j28KKo2L8J8QL6m2R5j9l5
$$ -56 41 -89 45 -36 81 82 49 -101 80 81 4 -18 213 76 -99 -36 -19 -64 10 27 68 -60 -58 -56 -118 -80 -62 -54 -18 -60 35 16 -19
3952a9jnq5K0Kj12J38j7L6K7N6K3j21J13j6p4K47l31J02O2J2l3j5Q3j77o7K66j42Q3q5m3M2
$$ -19 -20 -25 -110 -90 -88 -200 -62 -79 -43 -16 40 63 -58 55 39 -35 212 -119 -17 45 57 24 9 92 -85 -152 114 -28 55 -30 -73 -31
3672c1L8P6q5K7m6K6J19k6j05j2J2l0JR4l9j00J19j2l1m4L9k9J46j53J12o4j4J00q0J33j61
$$ -31 7 83 -2 25 -21 5 124 98 -7 -19 -7 -37 -36 58 19 -81 38 26 -5 -49 -10 -39 107 -46 66 2 -12 88 8 141 -20
3401b0ppJ57Lr5n0J4o9J53j20P0m5O%P7o3M5j63J72l3o8Q3m9r0k8J57j2J4j8J8n9L0K1j2J76
$$ -20 -27 -34 123 126 31 -19 -5 -74 79 -41 29 -16 -10 -10 67 4 49 -114 58 25 -43 40 -9 -99 -127 30 18 32 14 32 -27 3 24 12 188
3095A88J36j62j61m9J44o7j21J21j05OK40j64o1KL2N0L2n8j05J91j44Q9N6p3J01j28j02J67
$$ 188 324 162 1 -48 96 29 -92 29 -76 -70 170 6 -55 -53 -21 29 61 3 -102 89 -55 34 90 17 118 -10 -112 55
2850E5ML5k0kj07j34L6Q1L5J94k77R4Or1K15k55Q9J47k13J32J24j35O7r8k6l3J56m1O0l2P2
$$ 55 59 94 74 72 -35 -169 -133 -52 -17 177 -100 -6 0 -91 124 -131 -42 105 -108 24 148 13 80 -18 -44 -77 79 38 98 66 138
2579A38j29j0p6m6N7Q4m0M6k0q4J77k1q8KK3o5J07o0k2Q6o8l3J5J46j32j20R9J07j9n2K6Q6
$$ 138 9 -1 -77 -123 -66 18 -22 24 4 -80 97 76 -12 -10 13 -52 55 -5 -27 59 -9 -42 -27 119 -13 -133 -34 73 54 2 28 114
2299A14N6l02J08J36j23p4J69K8M1pj24n3L6q8P1K9o8N4M2K8P0j34j68O1J24M0mJ8j12R2j62
$$ 114 170 -132 -24 112 -11 -85 84 112 153 146 22 -31 5 -83 -12 17 -51 3 45 73 143 9 -159 -98 26 66 62 80 -32 60 -102
2027a02L0J38j30M4LR4j73m7J56kK5rj13J23j09L3O1q6N3J20j26L0k7R8j42M5pl1J9Lll1J35
$$ -102 -72 66 -64 -20 -17 77 -96 -143 13 11 36 27 -86 37 -72 -39 22 -64 -11 109 -17 13 -14 84 -58 -13 -20 -51 -32 -29 -32 -63 72
1738G2p9l9M8n9J32j9m7p5R7j41R5Q4r4l0NJ37o9P3j40R8r6P7k7q1M2R6j58J16n7J17m7L3
$$ 72 -7 -46 2 -57 75 56 9 -66 31 -110 -15 69 -25 -55 -50 87 18 91 -49 49 -47 30 3 -78 -36 60 -98 18 -39 78 31 64
1458F4j64P5o8J34rP8r4j79N8J64r3n8M9J19p6J0r0K0K7J07Qj02J11j00J83j30R0p6P1j43
$$ 64 -100 -25 -93 41 32 110 16 -163 -105 59 -34 -92 -43 76 0 10 -80 -60 -33 74 82 -20 91 -9 174 44 134 58 129 -14
1196a4mn4J41L2O3j89O6O4J3Rj50O9j2rm2K3q9j04J67l4O5J03o1n5l7J85pn5j14P5J59r8j18
$$ -14 -18 -72 69 101 164 -25 41 105 118 127 -23 46 34 25 -17 6 -83 -187 -20 -54 11 114 53 -2 -39 146 139 84 -30 45 204 106 -12
907a2R1j87J19L6p5Q0q8r1J64j80J01kO1J9j47n9J71oL5p4m2J52j37P2j32J02p5J51j21Q2
$$ -12 79 -108 11 47 -28 52 -36 -127 37 -143 -42 -44 17 36 -111 -170 1 -5 30 -44 -86 66 -71 1 -131 -29 -104 47 -74 8
645HJ30j28m2m3K5J2j08Q7KL1J04l2N7r2L7o7q1o5J26k3ML2r9J22O2r2M9k5o3Q5qK7p3mR3
$$ 8 138 10 -32 -75 -50 -38 -146 -59 -57 -26 78 46 103 11 48 -19 -100 -165 -39 -62 -58 -26 -125 -3 59 -33 16 -9 -72 13 5 32 -41 -45 48
338D8K6j16PJ07k1k9J15j05J19k30J36J0P9j61nl0J34j58R2J06p4k32K41k07J06P7m6P4j7
$$ 48 74 -42 -35 72 51 22 137 32 151 -79 57 67 146 -15 -20 -50 84 -74 18 124 50 -182 59 -148 -42 35 -11 63 46
85D6P4r2j04J20m6r7J74OP2k13L8J43K4j29P4j70k5K1J47n2NO1pM4j92P1K5l7l5J26j22L5
$$ 46 120 28 -76 44 -2 -99 75 81 153 -60 -22 121 145 16 90 -80 -105 -84 63 11 16 77 70 114 -78 -7 18 -19 -54 72 -50 -15
-195a5kK2M4j11
$$ -15 -17 5 49 -62
-230f2
##PAGE=	F1=973.598
##FIRST=	23146.756194512010552,	4241.1435120000014649,	0.061402324587106704712
##DATA TABLE=	(F2++(Y..Y)), PROFILE
4241g2J17j30J18r4J15J8l7k04J92L8r4K7J99r9j20k1J8p3J23lO2q7p1N9o6L2L0k7j9JJ41
$$ -72 45 -85 33 -61 54 72 35 -169 23 61 -33 -6 193 94 -26 -47 -29 -102 21 18 80 -7 -78 -19 -85 -53 -23 -50 -69 -68 73
3970G3q5j7l8N9q4m0O2j07J05L2rPJ25l3r2J14n6n9K47l58J58O0j4j9J5N0j81q5K62j68J16
$$ 73 -12 -29 -67 -8 -92 -132 -70 -177 -72 -40 -49 -42 83 50 -42 72 16 -43 204 -154 4 64 50 31 46 96 -85 -170 92 -76 40
3699D0o0M9j8JP9p9pm1L3O5L1j08KK7o4OP3L9r8J23j0p2m0k1oJ12r0R7m0K9P6j37J31j59k
$$ 40 -20 29 11 12 91 12 5 -36 -3 62 93 -15 -13 14 -50 -44 29 68 -30 93 83 11 -29 -50 -56 56 -34 63 23 52 128 -9 122 -37 -39
3392c9J0J84m0j09m4N2r3Q5m3N1nj1K9j2J5k8j13J49K9p6N2l9j80O1J61p0qrK6jL9j6k0l0
$$ -39 -29 155 115 6 -38 14 -79 6 -37 14 9 -2 27 15 30 2 -111 38 67 -9 43 4 -176 -115 46 -24 -32 -41 -15 -16 23 7 -13 -43
3095d3m9jJ7k7J75l9j17J33j01m2K46j55l2J8J3J8R7j36r8K02j44J55J0j27J31j05j32J93
$$ -43 -92 -93 -76 -103 72 33 -84 49 -52 -94 152 -3 -35 -17 -4 14 111 -25 -123 79 -65 90 100 -27 104 -1 -133 60
2850F0m1M1O0p2p7r1N2mK8K01k39J16Nj20J38k04Q1J30j62J57J03j69Q9j30J7n1J61k3O4n9
$$ 60 19 60 120 48 -29 -120 -68 -72 -44 157 -82 34 39 -81 57 -147 -66 64 -98 59 162 -7 82 -48 -31 -82 79 56 120 61
2587F1J15j83Mq5j8N4Q7o5N6m2q3J47o0ON8p1j9J02n7%K9l2qn7K03j38j12O6Q1J0n4mJ05R4
$$ 61 176 -7 -3 -88 -106 -52 35 -30 26 -16 -99 48 -12 -6 52 -19 -38 64 7 7 36 4 -4 -61 142 4 -108 -42 39 49 -5 -9 96 190
2290A90l47Q1J83j16p1J60j7N5Nq5m0Nk3N7j7o9K0P8M1L4j34j18JJ27J15n4N0j18N8j66PJ78
$$ 190 -157 -76 107 -9 -80 80 63 118 123 38 -2 3 -20 37 20 -49 -29 49 90 124 -10 -128 -127 0 115 61 111 -7 51 -115 -108 70
2010G0j70R1JR4j60p0J22M4l1J9r9J02r3L7O7r4K8J37r2P2p1J20j86P0Pn0k7K8j2J0P4k7l6
$$ 70 -100 -9 -8 86 -74 -144 -22 22 -9 10 -89 13 -80 -43 24 -70 -42 95 3 75 4 124 -62 8 15 -35 -62 -34 -46 -36 38 11 -25
1721b5om9J33K9o8j26J25p8j8J14K8j19N0P4n8P5j40J36j21KJ03q0J3J18j94O2m8J92o2j0
$$ -25 -31 -80 53 82 14 -112 13 -65 -83 31 59 -60 -10 64 6 81 -59 77 -44 -42 61 -19 -6 112 -82 -20 -68 124 62 52
1458E2j81J27q1J30l7J19j92j03R9J63r3l6k3J58j00N8j20M6JJ27Oj52R6j25K17j16M0j2L1
$$ 52 -129 -2 -83 47 10 129 -63 -166 -67 96 3 -33 -56 102 2 60 -60 -14 -13 114 120 -32 64 -61 156 40 80 68 99
1205I9j15j8p7J67J3P0j44L8N0N9K2k32Q8j1L2m6%p2q8J99j04J36Ok4n8j8J34K4l6j24N4J49
$$ 99 -16 -34 -111 56 69 139 -5 33 83 142 164 -68 20 9 41 -5 -5 -77 -165 34 -70 66 72 48 -10 -28 106 130 94 -30 24 173
925A73p9p7M1j69J32Jo8R7n1j41J74j07N4k3Q3J1j48p0J66K8n1k0OJ11j33P1j28R0n1J16j24
$$ 173 94 17 58 -111 21 22 -46 51 0 -141 33 -74 -20 -43 40 51 -97 -167 -1 27 -24 -44 -38 73 -60 11 -117 -27 -78 38 -86
653h6O9J45j11jj8ll2j44J79m9k3J05M6K3j33Q0r2n4q6J59n4L7J1q0R5J04j74J11No4O1nJ0
$$ -86 -17 128 17 16 -2 -5 -37 -181 -2 -51 -74 31 77 100 -33 47 -45 -99 -185 -26 -80 -43 -32 -112 -17 87 -87 24 29 -35 26 21 31
365C1j7m2R3p2n3KJ34p3J7O9r1J65k02P0L8J29k01j4kJ13j58M6J62j06j87J91j57J01N2m4
$$ 31 14 -28 65 -7 -60 -58 76 3 20 89 -2 163 -39 31 69 198 -3 -17 -19 94 -64 -18 144 38 -149 42 -115 -14 38 -6
102fJ01j9J1o4p8J20l1o1J65m4Jj59P4N7N2r6M7j42o0OJ61rpN6p0J23j92JM6JNL6p5K2L1j8
$$ -6 95 76 87 23 -55 65 34 -27 138 94 95 -64 10 67 119 23 70 -72 -132 -126 35 26 19 75 5 128 -64 -63 -17 -16 -11 25 -50 -28 3 -15
-213a5O4r1
$$ -15 49 -42
-230d2
##PAGE=	F1=879.244
##FIRST=	23146.756194512010552,	4241.1435120000014649,	0.1599683910608291626
##DATA TABLE=	(F2++(Y..Y)), PROFILE
4241f6J26j13P2r4R0K1l1k04J49R8j10N1J64o5o1p3oq2J77l9Q1l6j24Q9o1J4L4m9p1N6J57
$$ -66 60 -53 19 -75 15 36 5 -199 -50 48 -62 -11 153 88 27 -46 -52 -134 43 4 85 49 -75 14 -47 -33 1 -48 -119 -63 94
3970I4j00ro2N7m0r9J03q7Q2N3j6k5J37m9p4J30r0l3K09l29J86O9q2j8O2J8j55j16K57j64
$$ 94 -6 -15 -77 -20 -60 -159 -56 -143 -61 -8 -24 -49 88 39 -35 95 5 -28 181 -148 38 107 25 7 69 87 -68 -184 73 -91
3707i1J32n1J23m4n4Q1n0n7j7L0jM0p9K7J8n8j3O8J07r1Q8J3q1l6p9J9N0l1Q4rN0N5j89J27
$$ -91 41 -10 113 69 15 96 46 -11 -28 2 1 41 -38 -11 7 -51 -64 4 111 20 108 121 40 4 -75 -56 -6 -37 47 38 88 143 -46 81
3410H1j15pK5J50l6j25j2O4q8QN1k2O6n5Q3j14R0p8o5J06J00o8Ml4k22J40J09j24OL3K1L2
$$ 81 -34 -41 -16 134 98 -27 -39 25 -63 -55 -4 -26 40 -15 68 -46 44 -34 -99 7 107 39 43 9 -213 -73 36 -88 -82 -49 -28 4
3130DJ7l6ml8m2j5L4l9J71k0r3J21o8o4J74j19K3k1J9M0Q0j63q8J92j37J74mj61J76j20j15
$$ 4 21 -15 -19 -57 -99 -114 -80 -119 52 32 -61 60 -8 -72 102 -17 6 -15 4 44 124 -39 -127 65 -72 102 98 -63 113 -7 -122
2859a22J90p1J1J26j13l9n1R9q7K8J50j85J23Oj21N3j54J09Q0j26J78P7j61P9j26K5m5J39
$$ -122 68 -3 8 134 21 -18 -69 30 -57 -29 121 -64 59 65 -56 -3 -157 -48 32 -94 84 161 0 79 -47 -22 -67 72
2614G2j0K9m8J28j66j9p1J4M7M4o5O6k3q7Q6p7Q3J10j47L1Q0p7K0J4Kk6r5K20j19q3K0N3K5
$$ 72 62 91 43 171 5 -14 -85 -71 -24 20 -45 21 -2 -89 -3 -80 3 113 -34 -3 77 0 20 34 36 10 -85 135 16 -67 -47 6 31
2325C1o1k9R2J52l31O6J63r2m7J25n4N8Kl8k4nJ7R6p7o8l6Q0N1K1r2q8n2J27J45p9P4j15J2
$$ 31 -30 -59 33 185 -146 -80 83 -9 -56 69 15 73 75 37 13 8 25 121 44 -24 -60 20 71 92 0 -88 -140 -13 132 53 127 12 24
2036B4j31m0J79j43J05OP7j40m1O9P1j02K6l5Q2r2N3O2j07K5J30p6J35j07J07j81P7J3p2k5
$$ 24 -107 -147 32 -111 -6 0 77 -63 -104 -35 36 -66 -40 -75 7 -85 -32 30 -77 -52 78 2 137 30 137 -44 33 46 -26 -51
1773e1L2k0L1NL5n1l5k6R0R3r1j43J02Qj03J17J21j87Q9Mj3N1j16J64j35q5K21p0k0J08j98
$$ -51 -19 -39 -8 -3 32 -19 -54 -80 10 103 12 -131 -29 -21 -124 -7 114 -73 16 20 7 58 -58 106 -29 -114 107 37 17 125 -73
1502g3K4m6K41p6k7j69J52q6R4m1J16k33l1J29J30q0l7l1J38j19J07j15P7m3J27%j67O8j14
$$ -73 -49 -95 146 70 43 -126 26 -60 34 -7 109 -124 -155 -26 104 24 -13 -44 94 -25 82 -33 44 1 128 128 -39 29 -85
1248h5J82p7J9%J8q6lj03J99n4R2o2l9M3R0K7k53J02k3P4p8Jk3j10K31j63J83r6L2o3M2O4
$$ -85 97 20 39 39 57 -29 -32 -135 64 10 102 40 1 44 134 161 -92 10 -13 61 -17 -16 -39 -149 82 -81 102 6 38 -25 17 81
968H1L2J2j37J2J29p3j9l6j13J16rl9P4j2j58J70k3j0m5J11j0j19o4J53K5j12K2N1O6p3M4
$$ 81 113 125 -12 0 129 56 37 1 -112 4 -5 -44 30 18 -140 30 7 -3 -48 63 53 -66 -130 23 48 -64 -42 9 75 2 46
697D6j12N1m2P9j11K1J79q1J7%k5m4j33K02m7p8P7R7mj79J34r5l3r2J85q7N9Kp9P5J12k26
$$ 46 -66 -15 -57 22 -89 -68 111 30 47 47 22 -22 -155 47 0 -78 -1 96 92 -87 47 -48 -81 -173 12 -75 -16 -14 -93 -18 94 -132
417a32J77J9o0J5K5j3N5r8P4j30J4j8J56j29O2%m6J78j30NO5J30k05k1L3O3j50j9K04j13j28
$$ -132 45 64 4 19 44 31 86 -12 62 -68 -54 -72 84 -45 17 17 -29 149 19 24 89 219 14 -7 26 89 -61 -80 124 11 -117
146a17J13o8Q0K3k8J19k2n6j2o5R5j0j5J26p9m1q6O0jO5p6K9q8p9J2J22L1j1N6j29J66j49
$$ -117 -4 -72 8 31 3 122 100 44 32 -33 62 52 37 163 84 43 -43 17 16 81 5 34 -54 -133 -121 1 32 21 77 -52 114 -35
-134c5q2J03K1K9m0m2mO3m6O3k7
$$ -35 -117 -14 7 36 -4 -46 -50 13 -33 30 3
-230C
##PAGE=	F1=784.89
##FIRST=	23146.756194512010552,	4241.1435120000014649,	0.22202099859714508057
##DATA TABLE=	(F2++(Y..Y)), PROFILE
4241d6J16q0J2p1N1Nmj68P1J57j17M1J46m7j7p0n6o2K04o7Q3J0j30P3n4k1M6l9j05Q4J45q2
$$ -46 70 -10 2 -69 -18 -13 -17 -185 -114 43 -74 -33 113 66 49 -21 -77 -139 65 -2 81 91 -39 34 -20 -41 5 -34 -139 -55 90 8
3961Hj1n8NK6j30J17n9P1L7Qn2J01m9l9J34j11OJ40k50J78Q2j58k8J04j3j07j30K41j32J13
$$ 8 -3 -61 -56 -30 -160 -43 -102 -31 6 14 -38 63 14 -25 109 -2 4 144 -106 72 154 -4 -32 72 59 -48 -178 63 -69 44
3699D4m1J43l4p5O0k1r5J1J4m8J1l7M9Kl1m1Q0J39q7L8M5o0k5j20M0qrO3K7M1M0j97J18n4
$$ 44 3 146 112 37 97 76 -19 -8 6 -42 -31 -68 -19 -17 -48 -89 -9 130 43 81 126 66 41 -79 -39 -47 -56 7 34 75 115 -82 36 -18
3401a8k5M8P1nj23N2L0n7o1J17j07J50j01J24j98J48r9l3O5J54n4m5l1k00J84K2j48M4R4J6
$$ -18 -43 5 76 71 -52 0 30 -27 -88 29 -78 72 -29 95 -103 45 -54 -87 -22 132 78 33 2 -198 -14 8 -140 -96 -2 14
3139A4K1l3k9NmPk9Ln2J26j3o9J10k3o2O3n1Q9j18L8J05Mj35p0J51j27J58Pj69J98j38o5J61
$$ 14 35 2 -27 -22 -26 -19 -48 -45 -97 29 16 -53 57 34 -28 35 -16 73 -45 -7 98 102 -33 -103 48 -79 79 86 -83 115 -23 -88 73
2850G3q1l6J51j00l0j0J43j23L1O6j33J08Qq6j4j27J64J7j12J86N0j15L9r4Oj1Q6Ml6j0J28
$$ 73 -8 -44 107 7 -23 -33 110 -13 18 84 -49 59 67 -19 -33 -160 4 21 -91 95 145 30 69 -25 -19 -30 56 60 24 14 142
2579A42j06o8l1K1N3k3n3Q1K0j04J2n6J21J28j66P4L8j12L7M7J8p8q0J75p3n1j7M1K1o2n6
$$ 142 36 -32 -63 -42 11 -12 -65 16 36 -68 -56 -112 9 137 -29 45 83 -29 8 55 73 -5 -85 90 17 -34 -51 -10 11 -51 -107
2307a07P5J87k77R0Q4n7kP0q0N1j3Qqj7L1J71j21p6q3M8N2K9j7j02p8J33J23o8P2r9k1q2p5
$$ -107 -32 155 -122 -32 52 -5 -7 63 -17 34 21 29 21 4 35 206 85 9 -74 -26 26 55 38 -64 -142 -9 114 46 118 19 -2 -84 -159
2019a59J38o0P2ON1j19J2J6P6j39LN8P2j11Q6K7j02L4Q6n7J74j17Q2j48O2K1q8LK5j7K7m3
$$ -159 -21 -81 -9 -3 48 -71 -59 -43 33 -106 -103 -45 27 -84 2 29 -73 -39 47 -10 164 47 129 -19 43 64 -24 -21 4 -13 14 -29
1738b9P0o7k5j1J9J61j13j14L2R6j46R3J58k11J02m3O0rp5J70j38j36K74n5m4P6j74K5n1K32
$$ -29 41 -26 -51 -62 -43 118 5 -109 -77 19 -127 -34 124 -87 15 -28 32 23 -52 118 -20 -156 118 63 19 95 -79 -54 -105 127
1476A27p7l1j28J49p2M5k2P6k09%J42Q1n1p3L3P0j11J20p8J03r8J03nj34N2r4Q9j3L0l3L2
$$ 127 50 19 -109 40 -32 13 -9 67 -142 -142 0 81 30 -43 -10 60 -51 69 -9 94 -4 99 94 -40 12 -82 7 -6 24 -9 23
1205B3p8L9j19K16j31J17J8j33M3R6L6k23J13n6J15r9QK2j64K56j79J75j55P6o2J19%J7N7
$$ 23 -55 -16 -135 81 -50 67 85 -48 -5 91 127 -96 17 -39 76 -23 -15 7 -157 99 -80 95 -60 16 -46 73 73 90 147
951A47j42k7R7p6K7r8m9R0J1oJ8J5j33J47O1o4o5J30n3p3k8J39j6j41N4O0N1Qlo7pn3P1j02
$$ 147 5 -22 75 -1 26 -72 -121 -31 -20 -26 -8 7 -126 21 82 18 -47 83 30 -43 -71 68 52 -89 -35 25 76 84 81 14 7 -46 25 -77
653g7l1K03n8J5Lk0m1p2J47Lj17K5J26k8j98J75p2l2r1J98j02N8Kr1P2Q4k34K29Mn5l3O8l4
$$ -77 -108 95 37 52 55 35 -6 -78 69 72 -45 -20 106 78 -120 55 -17 -49 -140 58 -44 14 16 -75 -3 81 -153 76 80 25 -8 60 26
365B6J03j35M6j30O9m8J72j68Q2o0KJ47l3l8Q5R0j65l2M6J1j41p0K19j03p9M8J9N2J4k0J27
$$ 26 129 -6 40 -90 -21 -69 103 -65 17 -43 -41 106 73 35 120 210 45 13 59 70 -71 -141 78 -25 -104 -56 -37 15 29 9 136
93A36k5j04M6p3O6jK4N9p5m0k3Rj0O7p9K0k2p8K7M1O6j1O2j62J66r4j33J56K1K3p9j0l3O9
$$ 136 111 7 53 -20 46 45 69 128 53 13 -10 -1 -11 56 -23 -3 -25 -103 -76 -35 31 20 82 -80 86 -8 -141 15 36 59 -20 -30 -63 6
-204Fn5M9N4
$$ 6 -49 0 54
-230E4
##PAGE=	F1=690.536
##FIRST=	23146.756194512010552,	4241.1435120000014649,	0.31897974014282226563
##DATA TABLE=	(F2++(Y..Y)), PROFILE
4241b5Q7m2m3k6J7j7L3j22kJ82j12J7J43m5nj7j15k2J83o8O6N1j00J1m3o9P0Mj10O7J14n5
$$ -25 62 20 -23 -49 -32 -49 -16 -138 -140 42 -70 -53 90 45 40 23 -92 -114 69 1 67 118 18 29 -14 -83 -13 -9 -119 -52 62 7
3961Gk1k3o2Q2j21J07l6P8qL3n5M7n7L0J01j20N7N6j44J43R2k11l4J20m1n8j02J97r0P2j8
$$ 7 -14 -37 -99 -17 -138 -31 -67 11 3 36 -19 28 -29 1 102 -18 39 95 -49 94 186 -25 -59 61 20 -38 -140 57 -33 39 21
3690B1J02nl8J6j5j04K9mo9j4j1N8j2on3R5J29q6OO0k8lj29N3m5l9M5M8J9L4j50R7kn5Q9j0
$$ 21 123 118 80 96 81 -23 6 2 -67 -81 -92 -34 -46 -52 -105 -10 119 33 39 99 71 68 -61 -8 -53 -92 -47 1 20 54 -96 1 -1 -56 33 23
3375B3J0q6J25n0pj04J27j60K16j15J18k39J86r8k1L3J71m8o4l0j28J82n6j36P3J43L3l7p3
$$ 23 33 -53 72 22 15 -89 38 -122 94 -21 97 -142 44 -54 -75 -42 129 81 17 -13 -141 41 -15 -151 -78 65 98 61 -12
3121a2%j9JJ3J5j0l8N2j0o0J14J2n7l0L2J45k32N4J70p6q2l7Q3j14J36J7j47J74j32j2J24
$$ -12 -12 -31 -30 -17 -2 -12 -50 2 -8 -68 46 58 1 -29 3 148 -84 -30 140 64 -18 -55 28 -86 50 67 -80 94 -38 -50 74
2850G4p4q5J38m2n6L6J51j08L7j2r2O7J6k6n0j25K04j9j20J80K2n2pm8k6L5J7J8j07M1J21
$$ 74 0 -85 53 11 -45 -9 142 34 71 59 -33 34 50 24 -26 -151 53 34 -86 94 116 64 57 9 -17 18 35 53 -54 -13 108
2579A08n1j12K9j6Q6q4m1R0N1j13n1nJ13J09j23R6j3j36M3J04J7j42j8Q3j1l5k6M1Pn0q5O6
$$ 108 57 -55 -26 -42 44 -40 -81 9 60 -53 -104 -109 4 113 -10 86 73 -63 -20 84 101 -41 -59 24 13 -22 -48 -7 0 -50 -135 -69
2299f9J72k07J44k0j4N4Oj01M4k9M7mm3L7K41j31q6j02JM5K9O6j36q7J47N6j0L7p5k2n1p3
$$ -69 103 -104 40 20 6 60 66 -35 9 -20 27 23 -20 17 258 127 41 -61 -60 -15 14 80 -56 -143 4 60 50 87 12 -10 -61 -134
2019a34O9M7N%L0j03N4k9P4j21l3J29P3j36J25l1p7L6K2k5J63r1O5j16L3M0r3K3K8Jlm9M7
$$ -134 -65 -18 -13 -13 17 -86 -32 -61 13 -108 -141 -12 61 -75 50 19 -58 -22 0 -25 138 47 112 -4 29 69 -24 -1 27 28 25 -24 23
1730B3o7K4j4n1K03j24n7m4J57j47N9J46j96P7n0J40q9l8J46j23j29K54n0n6N0j38N2n0J66
$$ 23 -44 -20 -34 -85 118 -6 -63 -107 50 -97 -38 108 -88 -11 -61 79 -10 -48 98 -25 -154 100 50 -6 44 -94 -42 -92 74
1476G4n5m0p6J21l4RLK2j34j8J24M7k1j22J28j3o3P7k0J11j51O3rn7N5r2j0N5N8q2N5r1Q4
$$ 74 19 -21 -97 24 -10 -1 2 24 -110 -128 -4 43 22 -100 28 15 -48 29 9 120 -31 32 23 -34 21 -71 -81 -26 32 -50 5 -86 -2
1187bj04J90j73J24O5j83L2P4O4j77J25j03J52q9JM4k29K73j52J22j51R0n7J64k7j2P2j25
$$ -2 -106 84 -89 35 100 -83 -51 23 87 -90 35 -68 84 -5 -4 40 -189 84 -68 54 -97 -7 -64 100 73 61 133 8
942Hn5O5q2N2j25jO8N2J3m0K1p7J08J27r4p1J21j03k5K2J19n6j50Q0K6P2O0n7J6n7q5J04j08
$$ 8 -47 18 -64 -12 -137 -138 -70 -18 -5 -45 -24 -101 7 134 40 -31 90 -13 -38 -16 103 47 -103 -23 3 75 135 78 94 37 -48 56 -52
653e2m9J80n2RLll6J0M2P6j24m1J48o9j65J89l5m3r9J98q4L4Pj06Q1M1k01K46l5o0n3J04m2
$$ -52 -101 79 27 36 39 36 0 10 52 128 4 -37 111 42 -123 66 31 -12 -111 87 3 37 44 -62 19 60 -141 105 70 10 -43 61 19
365A9J06j24Rj00J10o9J84j73O3r8L5Q9N3n7R1M9r8n5L2k6j33q9K15r1n1J6P6L4K2l4J30l1
$$ 19 125 1 10 -90 20 -49 135 -38 25 -73 -38 51 104 47 138 187 89 34 66 40 -93 -182 33 -58 -109 -93 -17 17 39 5 135 104
85A04j25R0r2N4j1M6k0k9j2J1m6J1O5r1J7K7n2L1n1R6j0P5j67J37m8j25J56MRq1K2m8M1m5
$$ 104 -21 69 -23 31 20 66 46 17 5 16 -30 -19 46 -45 -28 -1 -53 -22 -73 23 13 88 -79 58 10 -115 41 45 54 -27 -5 -53 -12 -57
-213e7L2J15
$$ -57 -25 90
-230I0
##PAGE=	F1=596.183
##FIRST=	23146.756194512010552,	4241.1435120000014649,	0.23895417153835296631
##DATA TABLE=	(F2++(Y..Y)), PROFILE
4241dM0pr1L3J0l4N0p9l9J60r2jJ39m8k9N4j51QJ29l9L3R3o0p7k5j17R6O1q7K5P0l2l3L2j16
$$ -4 36 29 -62 -29 -19 -53 -3 -82 -121 39 -53 -54 85 37 8 62 -89 -81 48 9 42 135 75 -2 -27 -144 -48 13 -74 -49 21 -11 -44 -12 -128
3935a28J01p8P9k6J04o3L8k7Mq2J22L0j17J00j2m6J01R0k21k3J01n7k8l8J16m9K8J5L3K0L8
$$ -128 -27 -105 -26 -52 52 -11 27 0 4 -78 44 74 -43 57 45 -1 100 190 -31 -54 47 -10 -38 -76 40 -9 19 34 67 87 125
3664A25k9l9r2L7j0o9rj2M8k1Pl0R0Q4p3jM2lK6j00N3o3j00M5M1NM5p0N6K6r0J39n8qk4J76
$$ 125 96 57 -35 2 -8 -77 -86 -98 -50 -71 -64 -94 -4 80 7 6 48 45 71 -29 24 -39 -139 -94 -53 -48 -3 -73 -17 9 -81 58 0 -8 -32 144
3349A44j47M6j12Q2j59K42q6O8k37K09r4k0J1J51n7m1l3l2J35q6j07Q2J44P2j10p3L4o7mj5
$$ 144 -3 43 -69 13 -146 96 10 78 -159 50 -44 -64 -53 98 41 0 -33 -65 70 -16 -123 -41 103 175 65 -8 26 -41 -45 -60
3086f0P1j3lj4no7J27K1n7o9J00J68l10O8J93j24m1J1Or8J34J1j04J07j03K5J01o7j17J11
$$ -60 11 -2 -5 -19 -24 -91 36 57 0 -69 31 199 -111 -43 150 26 -15 -4 2 -96 38 49 -55 52 -51 -26 75 8 -109 2
2824BK7r1P7J17p0M3o2n2J4J8M0o2j28J86mj34J64mQl8%o2P6n2K4j59R9R8k6j32R3q4J35j07
$$ 2 29 -62 15 132 62 105 43 -9 5 23 63 1 -127 59 55 -79 85 81 89 51 51 -11 65 13 37 -122 -23 75 49 -83 10 -74 61 -46
2526d6l7P8M1q8q6N4Q0O9n7Q2l4j35K7J52J3j86N2j2M4m0nM8ql3j12N8J28j38J91j13L9R6
$$ -46 -83 -5 36 -52 -138 -84 -4 65 8 90 56 -79 -52 100 113 -73 -21 -33 11 -29 -34 14 6 -27 -139 -81 47 -91 100 -13 26 122
2246A22m7j19L8l5P4j2p8N4K69j21p6j02l1L5KJ33j53r5J56l1Q4k3m4Mn3m0KJ36o6lK5r0O4
$$ 122 75 -44 -6 -41 33 21 -57 -3 266 145 69 -33 -64 -29 -27 106 -47 -142 14 -17 67 44 0 4 -49 -89 -87 49 -17 -20 5 -85 -21
1957b1p0Q8o4o1J37Q0j55J55p7n1K0l7K2J11m1O1j03KP3q4J5M6L1n6j7k2n3R1l3q0J85j16
$$ -21 -91 -3 -67 -128 9 89 -66 89 12 -39 -19 -56 -34 77 36 97 -6 -4 69 -15 0 46 77 21 4 -18 -71 20 -13 -93 92 -24
1677b4Qr3J70j08L1J16j65K9l4J93j49j9R7r0p3J87o6m9M2j12P2l2P9oo4m3Q9J4jJ8k7l5o2
$$ -24 -16 -109 61 -47 -16 100 -65 -36 -70 123 -26 -45 52 -38 -111 76 10 -39 3 -109 -37 -69 10 4 -60 -103 -14 0 -1 17 -10 -45 -107
1388a07P4M5j0j49J99q3NPM3R5j80J7rL7O4j29n7J11P4j08O1j13J05n4J19j53R6P6j47lL0
$$ -107 -33 12 2 -147 52 -31 -26 -19 24 119 -61 -44 -53 -16 48 -81 -138 -27 47 -61 0 -113 -8 -62 57 -96 0 76 -71 -74 -44
1117d4J08j52J36j41J88p4rK8k63K70r9N5r7Q1n2J41on2O4q3p9M7q1N8j15J4N9R5J7p7Kj3
$$ -44 64 -88 48 -93 95 21 12 40 -223 47 -52 3 -94 -13 -65 76 70 18 82 -1 -80 -33 -114 -56 -171 -157 -98 -3 14 -63 -61 -74
837g4P2J58j05n0P4j29J1N5Q2n4j49J04l4J03O0j05J22q2j19J63j27k0J00n8J3J1Ml1P3p1
$$ -74 -2 156 51 1 75 -54 -43 12 94 40 -109 -5 -39 64 124 19 141 59 -60 103 -24 -44 56 -2 11 22 26 -5 68 -3
575cJ44r4j04J67j30q2J65jm1j24J90l5mJ3j13R3Mj43K20p5q0l7J16k6P1o7l6p4J33o4J91
$$ -3 141 47 -57 110 -20 -102 63 62 21 -103 87 52 48 61 -52 41 45 -98 122 47 -33 -70 46 20 91 24 -12 -86 47 -17 174
303A74j55K3j11M4L3J04p0P9L8k6q9Om5j24p6K00p7m0OR5M2K2n4J29m9j30J08r3O1l6N8q8
$$ 174 19 42 -69 -25 8 112 42 121 159 133 44 50 5 -119 -195 5 -72 -112 -106 -11 31 53 -1 128 79 -51 57 -36 25 -11 47 -41
23d1L6NK6q1L7N7q5J0L5rJ8j17J20qQ4j53R4po1Q3k5K1o5M4m1mk1PJ40
$$ -41 -5 0 26 -55 -18 39 -46 -36 -1 -10 8 -109 11 3 87 -66 28 21 -40 43 18 39 -26 18 -23 -27 -48 -41 99
-230I9
##PAGE=	F1=501.829
##FIRST=	23146.756194512010552,	4241.1435120000014649,	-0.13595880568027496338
##DATA TABLE=	(F2++(Y..Y)), PROFILE
4241A5j2K0j30Q4L5m3K9m0l1J11o8nJ25n0p2R4j36J3O8J4qJ31l1j63mj37J03J09m9oK0k2l2
$$ 15 3 23 -107 -23 12 -31 -2 -42 -73 38 -30 -35 90 40 -32 62 -74 -61 7 21 13 144 113 -50 -54 -191 -88 21 -28 -34 -14 -36 -68
3952f8Q3j44P4k1L8k1J38j05K8J9j6j18K01n0r7J11m6J9O9P1j91J1N6n9k3L5QpjL8k6L7J09
$$ -68 15 -129 -55 -76 -38 -59 79 -26 2 21 5 -113 88 38 -59 52 6 25 94 165 -26 -15 41 -18 -41 -6 2 -5 -6 32 6 43 152
3664A52n0q2p4L4jn6K8l5K4l0J3K5M5L2l7JjRM8m0L2n6j59O8NNP3RnL1j17J71o4m5M1J85k26
$$ 152 102 20 -54 -20 -21 -77 -49 -84 -60 -90 -77 -52 -7 25 -12 -11 -12 -3 45 5 37 -19 -178 -110 -105 -100 -27 -18 -23 8 -109 62 -2 -47 -6 179 -47
3340d7R9r6J2j15K22k1Jk06K12r3k1pJ17p1Nm8N4O5n7q6Q1Q5J14j59l5N6j07K0l7Q1l4L4m4
$$ -47 52 -44 -32 -147 75 54 55 -151 61 -32 -53 -60 57 -14 -9 -57 -3 62 5 -81 0 85 199 40 5 61 -46 -26 -63 18 -16 18 -26
3051b6Lp4J24J4n4o3J27J45l19R0J60j33k9O5n5q8J61mn6J5o9M5J00o8j36R8Q0r9Q9O9m9M3
$$ -26 -23 -97 27 41 -13 -76 51 196 -123 -33 127 -6 -35 30 -25 -113 48 44 -12 3 -66 -21 79 11 -125 -27 53 -46 43 112 63 106
2771A06p4j3k1jQ8o6j13J11M7j34J47k8N1n1M0q9R7j02K1j73J48N1k8j24J39j51J81q7m4M1
$$ 106 32 19 -2 -3 85 19 -94 17 64 -70 77 49 100 49 89 0 97 -5 16 -157 -9 42 14 -110 29 -122 59 -28 -72 -31
2509c1Jk8r4J00M6M1k2L8j0j04j2J62K0k00J00o9P2o0M1N5j6l0j22L1J02q0J89j63R0J06p0
$$ -31 -30 -58 -152 -52 -6 35 13 51 41 -63 -75 87 107 -93 7 -62 10 -50 -9 46 30 0 -122 -91 11 -69 120 -43 47 153 83
2237H3j29K4k0Q6k8r9P3K44j14k7j01l6L4m8J63j28j05J41j08J82q2qL1q0ml8J86j11MM1p6
$$ 83 -46 -22 -42 44 16 -83 -10 234 120 93 -8 -44 -10 -58 105 -23 -128 13 -95 87 5 -3 28 -52 -56 -94 92 -19 -15 26 -50
1966e0M3j12J21jo8Q3Q5j60J56p3m0j8o4O0N0J4N8j03k1J12n9j4O4N3j06L1j04l9J50n9n2
$$ -50 -7 -119 2 1 -67 16 101 -59 97 24 -16 -34 -98 -38 12 26 84 -19 -40 72 13 -1 63 116 10 41 -63 -102 48 -11 -63
1695f3J09q7N4r9J34m3J9Q7j32j2l2K04j59j7M3m5j2J14r1k4M5j10O8kJ3N4r4m2O8N4J0J0
$$ -63 46 -41 13 -86 48 5 24 111 -21 -33 -65 139 -20 -37 6 -39 -51 63 -28 -52 -7 -117 -49 -51 -38 16 -78 -120 -52 2 12 22
1415B2n6N9r8QO8l3j39K21j26N8n3J00P0j72k3qJ14O1j97k7J34O9r7M8j31R1RL3q6L8P3l9
$$ 22 -34 25 -73 -65 3 -30 -169 52 -74 -16 -69 31 101 -71 -94 -102 12 73 -124 -151 -17 52 -45 3 -128 -37 -28 5 -81 -43 30 -9
1135in4j9J45j53J36j54K17q4Lj9k48K47n2J4l0O8m2M7M5r4N9l4j00M1o4N5r0%O0J26K3r8
$$ -9 -63 -82 63 -90 46 -108 109 25 28 9 -239 8 -44 -30 -60 8 -34 13 58 -36 23 -11 -111 -70 -134 -79 -169 -169 -109 17 40 -58
855e8l6L2O4J51j09lrj01K3N6K4jj40J18q4J21K0j35K15q2j34K15j56M0j0o0K7J9%k0R1j59
$$ -58 -94 -62 2 153 44 41 32 -69 -46 10 34 33 -107 11 -73 48 68 -67 148 66 -68 147 -9 31 21 -39 -12 7 7 -13 78 -81
575h1J97m9j46J83j97K6J02J7mj57J80J5l4J5j08R0nq3J66r5j10oJ07QK8Pq4o5J25j9J79j34
$$ -81 116 67 -79 104 -93 -67 35 52 48 -109 71 86 52 67 -41 49 44 -39 127 32 -78 -84 23 31 59 66 -18 -83 42 23 202 68
295F8j0r7K9JJ14q0N0N5K8j21j3m8j15m6J82n7l0j0Q6P6qn5J34q2j32R4n8O9n9O5j22Q3kL6
$$ 68 58 -39 -10 -9 105 25 75 130 158 37 24 -24 -139 -185 -3 -60 -90 -100 -14 62 54 -1 133 51 -81 13 -45 24 -35 30 -92 -9 -11 25
-3B5j03N8M6m9j0KL4Lj42J36%P9j34M3L8K1k1o4O6m2L9j3l0nj9J27
$$ 25 -78 -20 26 -23 -33 -31 3 6 -136 0 0 79 -55 -12 26 47 26 -38 28 -14 25 12 -18 -23 -42 85
-230H5
##PAGE=	F1=407.475
##FIRST=	23146.756194512010552,	4241.1435120000014649,	-0.26196801662445068359
##DATA TABLE=	(F2++(Y..Y)), PROFILE
4241C4n4L4j54J06Q2n3k1mRO6n6NJ02n0j16Q5p0oK7O7m3J52j6k22J0j12P6J32j2jk2k8j4J06
$$ 34 -20 14 -140 -34 48 -5 -26 -30 -21 45 -11 -6 96 46 -70 15 -55 -61 -34 33 -10 142 126 -96 -86 -198 -122 10 -2 -3 -25 -53 -67 39
3944C9j46K5K5qj0J64j24K0O2j8j52K35j12n2Q1m7M8N1M3j37N6Mm7m5R2r9M0j5M7n9N0J42
$$ 39 -107 -82 -57 -65 -75 89 -35 -15 47 29 -123 112 0 -52 29 -18 30 81 124 -13 43 47 0 -45 47 -52 -12 -27 20 -39 11 153
3664A53m0j17o4K1Rk3O7o2mm3K4Q3l1%Rlm2J2N1L5j4j5j93R8m1J4J03N6o6K1j22J58n1o2Q2
$$ 153 113 -4 -68 -47 -38 -61 6 -56 -60 -103 -79 4 -27 -27 -18 -21 -63 -51 0 35 21 6 -187 -89 -130 -116 -13 43 -23 -2 -124 34 -17 -79 3
3357CJ65k65J44p2m9n4J70M9m7j67J95q6k4k8R4p2L2o7J00PKp6Q3j0J29j58RN6j04O5l2M4
$$ 3 168 -97 47 -25 -74 -128 42 91 44 -123 72 -14 -38 -66 28 -44 -12 -79 21 28 30 -46 37 27 156 -2 7 63 -41 24 -8 36
3077C6q2O6l4Mo5R3J2m4m2J14Q4k69J17J03j26l1J06r5q2J98j4k1o8n1O8J02p3j52J08J10
$$ 36 -46 20 -14 -10 -75 18 30 -14 -56 58 142 -127 -10 93 -33 -64 42 -53 -135 63 49 28 -40 -91 -23 79 6 -146 -38 72
2815G2o7N6M5n7K2n1K5k4m3J09q1p3K0R8j06J33n2O9n3O3r4R3j18J4j46J65ql0j11J55j83
$$ 72 5 61 106 49 71 20 45 21 -22 87 6 -67 -47 51 -55 78 26 95 42 105 11 104 -14 0 -146 19 11 -19 -130 25 -158
2544a58K00m1n8mm3M8q9J21K4M2m3nM1o0n4J27L9j89J16p3N9p5R3N8j4m5j10j4J23m9J30j58
$$ -158 42 1 -57 -61 -104 -56 -145 -24 0 42 -1 -6 35 -25 -79 48 87 -102 14 -59 0 -75 18 76 62 17 -93 -107 16 -33 97 -61
$$ [...]
-230A19
##END NTUPLES=	nD NMR SPECTRUM
##END=	
##END=	
