##TITLE=	Jul23-2022.51.fid
TM-VI-0XX, unprot. pyr, CD3OD 13C

##JCAMP-DX=	6.0	$$ MestReNova 14.3.1-31739
##DATA TYPE=	LINK
##BLOCK_ID=	1
##BLOCKS=	2    
##ORIGIN=	Mestrelab Research S.L.
##OWNER=	hrzepa
##$MNOVA/LINK_BLOCK_TYPE=	ITEM	$$ NMR Spectrum
##$MNOVA/ITEM/POLYGON=	(XY..XY)
5321,5835
8722,5835
8722,8208
5321,8208
5321,5835
##$MNOVA/ITEM/Z=	0
##$MNOVA/ITEM/ANGLE=	0
##TITLE=	Jul23-2022.51.fid
##JCAMP-DX=	6.0	$$ MestReNova 14.3.1-31739
##BLOCK_ID=	2
##DATA TYPE=	MNOVA NMR VIEW DATA
##DATA CLASS=	MNOVA VIEW DATA
##$MNOVA/ITEM/ZOOM/X=	-20.698776542268014111,	240.66949999422217843
##$MNOVA/ITEM/ZOOM/Y=	-166.36485671997070313,	1728.9760284423828125
##END=	
##TITLE=	Jul23-2022.51.fid
##JCAMP-DX=	6.0	$$ MestReNova 14.3.1-31739
##BLOCK_ID=	3
##DATA TYPE=	NMR SPECTRUM
##DATA CLASS=	XYDATA
##NUMDIM=	1
##ORIGIN=	Bruker BioSpin GmbH
##OWNER=	nmr
##.OBSERVE FREQUENCY=	100.69424847706599735
##.OBSERVE NUCLEUS=	^13C
##.SOLVENT NAME=	MeOD
##.PULSE SEQUENCE=	zgpg30
##LONGDATE=	2022/07/23 17:46:00.000
##.ACQUISITIONMODE=	SIMULTANEOUS (DQD)
##$ORIGINAL FORMAT=	Bruker XWIN-NMR
##$MNOVA/SCALES_VERSION=	9
##$PARAMETER FILE=	(acqus, ASCII, /private/var/folders/f6/rjf_tdyn2v98c5c0wvkgn4s80000gn/T/WUt+g7wmSNqPthLC$7r9rA/51/acqus, 0)
$$ ##TITLE= Parameter file, TOPSPIN		Version 3.2
$$ ##JCAMPDX= 5.0
$$ ##DATATYPE= Parameter Values
$$ ##NPOINTS= 11	$$ modification sequence number
$$ ##ORIGIN= Bruker BioSpin GmbH
$$ ##OWNER= nmr
$$ $$ 2022-07-23 17:46:25.734 +0100  nmr@CZC10666PP
$$ $$ /opt/topspin/data/agmb/nmr/Jul23-2022/51/acqus
$$ $$ process /opt/topspin3.2/prog/mod/shimcntl
$$ ##$ACQT0= -2.01680680282977
$$ ##$AMP= (0..31)
$$ 100 100 100 100 100 100 100 100 100 100 100 100 100 100 100 100 100 100
$$ 100 100 100 100 100 100 100 100 100 100 100 100 100 100
$$ ##$AMPCOIL= (0..19)
$$ 0 0 0 0 0 0 0 0 0 0 0 0 0 0 0 0 0 0 0 0
$$ ##$ANAVPT= -1
$$ ##$AQSEQ= 0
$$ ##$AQ_mod= 3
$$ ##$AUNM= <au_zgonly>
$$ ##$AUTOPOS= <14 >
$$ ##$BF1= 100.683175
$$ ##$BF2= 400.41
$$ ##$BF3= 100.683175
$$ ##$BF4= 100.683175
$$ ##$BF5= 100.683175
$$ ##$BF6= 100.683175
$$ ##$BF7= 100.683175
$$ ##$BF8= 100.683175
$$ ##$BYTORDA= 0
$$ ##$CAGPARS= (0..11)
$$ 0 0 0 0 0 0 0 0 0 0 0 0
$$ ##$CFDGTYP= 0
$$ ##$CFRGTYP= 9
$$ ##$CHEMSTR= <none>
$$ ##$CNST= (0..63)
$$ 1 1 145 1 1 1 1 1 1 1 1 1 1 1 1 1 1 1 1 1 1 1 1 1 1 1 1 1 1 1 1 1 1 1 1
$$ 1 1 1 1 1 1 1 1 1 1 1 1 1 1 1 1 1 1 1 1 1 1 1 1 1 1 1 1 1
$$ ##$CPDPRG= (0..8)
$$ <waltz16> <> <waltz16> <> <mlev> <mlev> <mlev> <mlev> <mlev>
$$ ##$D= (0..63)
$$ 0 1 0.00345 0 0 0 0 0 0 0.06 0 0.03 2e-05 3e-06 0 0 0.0002 0 0 0 0 0 0
$$ 0 0 0 0 0 0 0 0 0 0 0 0 0 0 0 0 0 0 0 0 0 0 0 0 0 0 0 0 0 0 0 0 0 0 0 0
$$ 0 0 0 0 0
$$ ##$DATE= 1658594784
$$ ##$DE= 6.5
$$ ##$DECBNUC= <off>
$$ ##$DECIM= 760
$$ ##$DECNUC= <off>
$$ ##$DECSTAT= 4
$$ ##$DIGMOD= 1
$$ ##$DIGTYP= 12
$$ ##$DQDMODE= 0
$$ ##$DR= 21
$$ ##$DS= 4
$$ ##$DSPFIRM= 0
$$ ##$DSPFVS= 20
$$ ##$DTYPA= 0
$$ ##$EXP= <c13q>
$$ ##$F1LIST= <111111111111111>
$$ ##$F2LIST= <222222222222222>
$$ ##$F3LIST= <333333333333333>
$$ [...]
$$ 90 74 58 42 26 10 0 0
$$ ##$Sgu3PowerLevels= (0..7)
$$ 0 0 0 0 0 0 0 0
$$ ##$Sgu4PowerLevels= (0..7)
$$ 0 0 0 0 0 0 0 0
$$ ##$Sgu5PowerLevels= (0..7)
$$ 0 0 0 0 0 0 0 0
$$ ##$Sgu6PowerLevels= (0..7)
$$ 0 0 0 0 0 0 0 0
$$ ##$Sgu7PowerLevels= (0..7)
$$ 0 0 0 0 0 0 0 0
$$ ##$Sgu8PowerLevels= (0..7)
$$ 0 0 0 0 0 0 0 0
$$ ##$SguType= 3
$$ ##$ShimPowMaxUA= (0..63)
$$ 130000 130000 130000 130000 130000 130000 130000 130000 130000 130000 130000
$$ 130000 130000 130000 130000 130000 130000 130000 130000 130000 0 0 0 0
$$ 0 0 0 0 0 0 0 0 0 0 0 0 0 0 0 0 0 0 0 0 0 0 0 0 0 0 0 0 0 0 0 0 0 0 0 0
$$ 0 0 0 0
$$ ##$ShimPowMaxUC= (0..63)
$$ 130000 130000 130000 130000 130000 130000 130000 130000 130000 130000 130000
$$ 130000 130000 130000 130000 130000 130000 130000 130000 130000 0 0 0 0
$$ 0 0 0 0 0 0 0 0 0 0 0 0 0 0 0 0 0 0 0 0 0 0 0 0 0 0 0 0 0 0 0 0 0 0 0 0
$$ 0 0 0 0
$$ ##$ShimPowMaxUG= (0..63)
$$ 524287 524287 524287 524287 524287 524287 524287 524287 524287 524287 524287
$$ 524287 524287 524287 524287 524287 524287 524287 524287 524287 0 0 0 0
$$ 0 0 0 0 0 0 0 0 0 0 0 0 0 0 0 0 0 0 0 0 0 0 0 0 0 0 0 0 0 0 0 0 0 0 0 0
$$ 0 0 0 0
$$ ##$ShimPowRcbType= 3
$$ ##$ShimPowRes= (0..63)
$$ 1e-20 1e-20 1e-20 1e-20 1e-20 1e-20 1e-20 1e-20 1e-20 1e-20 1e-20 1e-20
$$ 1e-20 1e-20 1e-20 1e-20 1e-20 1e-20 1e-20 1e-20 0 0 0 0 0 0 0 0 0 0 0 0
$$ 0 0 0 0 0 0 0 0 0 0 0 0 0 0 0 0 0 0 0 0 0 0 0 0 0 0 0 0 0 0 0 0
$$ ##$ShimPowRng0= (0..63)
$$ 1 1 1 1 1 1 1 1 1 1 1 1 1 1 1 1 1 1 1 1 0 0 0 0 0 0 0 0 0 0 0 0 0 0 0 0
$$ 0 0 0 0 0 0 0 0 0 0 0 0 0 0 0 0 0 0 0 0 0 0 0 0 0 0 0 0
$$ ##$ShimPowRng1= (0..63)
$$ 1 1 1 1 1 1 1 1 1 1 1 1 1 1 1 1 1 1 1 1 0 0 0 0 0 0 0 0 0 0 0 0 0 0 0 0
$$ 0 0 0 0 0 0 0 0 0 0 0 0 0 0 0 0 0 0 0 0 0 0 0 0 0 0 0 0
$$ ##$ShimPowRng2= (0..63)
$$ 1 1 1 1 1 1 1 1 1 1 1 1 1 1 1 1 1 1 1 1 0 0 0 0 0 0 0 0 0 0 0 0 0 0 0 0
$$ 0 0 0 0 0 0 0 0 0 0 0 0 0 0 0 0 0 0 0 0 0 0 0 0 0 0 0 0
$$ ##$ShimPowRng3= (0..63)
$$ 1 1 1 1 1 1 1 1 1 1 1 1 1 1 1 1 1 1 1 1 0 0 0 0 0 0 0 0 0 0 0 0 0 0 0 0
$$ 0 0 0 0 0 0 0 0 0 0 0 0 0 0 0 0 0 0 0 0 0 0 0 0 0 0 0 0
$$ ##$ShimSysFunc= (0..63)
$$ 1 2 3 4 5 7 9 11 15 16 8 10 12 14 6 17 13 18 19 20 0 0 0 0 0 0 0 0 0 0
$$ 0 0 0 0 0 0 0 0 0 0 0 0 0 0 0 0 0 0 0 0 0 0 0 0 0 0 0 0 0 0 0 0 0 0
$$ ##$ShimSysMatrix= 0
$$ ##$ShimSysType= 1
$$ ##$TFXNUM= 0
$$ ##$TRIPLO2= 0
$$ ##$VTU= 2
$$ ##$VTUETH= <149.236.99.20>
$$ ##$VTUTY= <no>
$$ ##$WBREFAM= (0..15)
$$ 135 116 100 100 100 100 100 100 100 100 100 100 100 100 100 100
$$ ##$WBREFLM= (0..15)
$$ 0 0 0 0 0 0 0 0 0 0 0 0 0 0 0 0
$$ ##$WBREFPH= (0..15)
$$ 71.66 -68.25 0 0 0 0 0 0 0 0 0 0 0 0 0 0
$$ ##$WBSGU= (0..15)
$$ 0 0 0 0 0 0 0 0 0 0 0 0 0 0 0 0
$$ ##$XFAC= 2
$$ ##END=
$$ 
##$DECIM=	760
##$DSPFVS=	20
##XUNITS=	HZ
##YUNITS=	ARBITRARY UNITS
##FIRSTX=	24231.369385662510467
##LASTX=	-2084.0185409410978536
##DELTAX=	-0.40154708059210514337
##XFACTOR=	1
##YFACTOR=	0.044959541029242426624
##FIRSTY=	-3.0996291637420654297
##MINY=	-9.185214996337890625
##MAXY=	1571.79638671875
##NPOINTS=	65536
##XYDATA=	(X++(Y..Y))
$$ [...]
10409A61QORJ3J5RL%%%mj0j3j2j1j2j3j3ql%KLPJ1J5J9K0J8J1Nlrj6j9j6j3rqplOJ4J4Lj3
10390A57k6l1k8j6MK2K7J3rk5k5j6ploj0j3j4j1kQJ5J4QMNOONORJ5K1K6K3Rqk2k2j2KJ1J2
10373A22R%j1k5k8j9KK2L1K9J7Kj5k3j7rloqpnpj0rnmpr%J2J8J6QMOJ0J2J2Pmj9k4k1qNJ8
10354E9K4K3J1mj4j6j5j3romkkmj5k7l1j6OK4L1K9K3J2MMJ1J6J4Mj2k5k7j9qllk%KLRK0K4
10337G6J7Loj3j9k8l1k8k1j4rjJ0J7K4L0L6L4J9KoKJ6J7Lj5k1rJ1K8L1J6nk0j8jJ2J2Jj2k4
10320A16l4l4k3lJ3J8J6J1O%mnnjOJ1J2PKkoj2k0k4j8mQJ2Krj5r%PJ1J4J4RMjoj4k1k1j1k
10302eOJ3J8J3JpnMQQMLJmj3k3k5k0pKMj%LMkqrpqj1oKPOLJNQJ3J9J8J1KmlLJ0Qlj4j5lRJ4
10280B8J2J2J2Qjo%J3K0J5Noj0oMJ3J5J5J8K5K3J3%qqmlnj0j3j3rlJMPPLlrj2j7j8j9j6rM
$$ plain form
10409 161 169 175 184 197 212 221 224 224 224 224 220 210 197 185 174 162 149 136 128 125 125 127 130 137 148 163 182 202 220 231 236 233 224 208 189 173 160 151 143 136 133 139 153 167 170 157
10390 157 131 100 72 56 60 82 109 122 113 88 63 47 40 37 31 21 8 -6 -17 -19 -11 4 18 26 30 35 41 47 52 58 67 82 103 129 152 161 153 131 109 97 99 110 122
10373 122 131 131 120 95 67 48 50 72 103 132 149 151 136 113 96 87 84 78 70 63 58 51 41 32 27 23 16 7 7 19 37 53 61 65 71 81 93 105 112 108 89 65 44 36 41 59
10354 59 83 106 117 113 99 83 68 55 46 40 36 34 32 28 13 -14 -45 -61 -55 -31 0 29 52 64 68 72 83 99 113 117 105 80 53 34 26 23 20 18 18 20 23 32 52 76
10337 76 93 96 90 77 58 30 -1 -29 -50 -64 -73 -74 -64 -47 -23 7 43 77 96 98 92 94 110 127 130 115 94 85 96 124 155 171 166 146 128 127 139 151 152 140 116
10320 116 82 48 25 22 35 53 69 80 86 86 82 77 72 71 77 88 100 107 109 107 101 89 69 45 27 23 31 43 45 36 21 12 12 19 30 44 58 67 71 70 64 50 29 8 -3 -5
10302 -5 1 14 32 45 46 39 34 38 46 54 58 61 62 58 45 22 -3 -23 -30 -28 -24 -25 -25 -22 -18 -20 -28 -37 -44 -52 -63 -69 -67 -60 -54 -51 -50 -45 -37 -24 -5 13 24 26 22 19 22 32 40 37 23 8 5 14 28
10280 28 40 52 64 72 71 65 65 78 98 113 118 112 102 96 100 113 128 143 161 186 209 222 222 214 206 202 199 194 184 171 158 149 146 147 151 158 165 168 165 156 144 127 109 90 74 65 69
10261F9J8L2L7L2J9Nnj0j8k7l3l1k1j3j0qmKKkomOJ7K1J7J3J5J7J0kpkM%j0j2nNQQPOLJj%
10242A43J%pj6k4k7k5k2j8j0l%oj2j2pJOPQNL%LJ0J4J4QMMN%rr%J0Rnj9j6JK0K8K2Rqj8j6
10223D6lJ8L1L4K9K0Oj0j6pQJ8J5J2J3J6J4Mpk1l4m2m1k4mJ2J5J0jqrjQJ5J8J5J4J0O%mlk
10205A70pj0r%J1J6J4RLkqj9k6k3pJ7L4L5K1Jj5k7k8k1j0mkkLJ2J6J2KkJQJ1RQMrk4l6l9l7
10187E0k9j8oLQJ7K6L2L0K3J7J3Oknnpj1j6j7j5j0JJ3J9J1nk0k6k7k3j4mJLNJ3J9J8Qkpj1
10170E6j9k4k0j0KQJ4K0K2J7J0PJ1J3J3Rkj5k2j7kJ3J8J5J1RPNkj3k3l0l1l1l0k7j5JJ4J9
10154a9J6PMRK0K6J4rk7k5j0NJ2J8K4K9K5J0rk0k1j2mJMPJ3J5J0Jnorj7k3j9j0nkLRLj4k3
10136dj6OJ6J0LOJ6K0J3Jj2j8j7oJ2K7L3L3K8K2J5RKpj7j9j2ooj1j3oLRJ2J3Rnk2l0k8j4K
$$ plain form
10261 69 87 119 156 188 207 212 207 197 179 152 119 88 67 54 44 36 32 34 36 34 28 24 30 47 68 85 98 113 130 140 138 131 129 133 133 123 111 106 111 119 127 134 140 143 144 143 143
10242 143 144 144 137 121 97 70 45 23 5 -5 -8 -8 -14 -26 -38 -45 -44 -38 -31 -23 -18 -15 -15 -12 -2 12 26 34 38 42 47 47 38 29 29 39 48 43 24 8 9 29 57 79 88 80 62 46
10223 46 43 61 92 126 155 175 181 171 155 148 156 174 189 201 214 230 244 248 241 220 186 144 103 79 75 87 102 112 111 103 94 93 101 116 134 149 163 173 179 179 175 172 170
10205 170 163 153 144 144 155 171 185 194 197 195 187 168 142 119 112 129 163 198 219 220 205 178 150 129 119 115 113 111 114 126 142 154 156 154 155 163 174 183 191 195 186 162 126 87 50
10187 50 21 3 -3 0 8 25 51 83 113 136 153 166 172 170 165 160 153 142 126 109 94 84 85 98 117 128 123 103 77 50 27 13 9 10 13 18 31 50 68 76 74 67 56
10170 56 37 13 -7 -17 -15 -7 7 27 49 66 76 83 94 107 120 129 127 112 90 73 71 84 102 117 128 137 144 149 147 134 111 81 50 19 -11 -38 -53 -52 -38 -19
10154 -19 -3 4 8 17 37 63 77 68 41 16 6 11 23 41 65 94 119 129 120 100 79 67 63 64 68 75 88 103 113 114 109 103 94 77 54 35 25 20 18 21 30 33 19 -4
10136 -4 -20 -14 2 12 15 21 37 57 70 71 59 41 24 18 30 57 90 123 151 173 188 197 199 192 175 156 144 138 132 121 108 102 105 114 126 139 148 143 121 91 63 49 51
10119E1J6K2J4jj3j2kNRPOKKNOKnpnjkqj3j4qjL%l%PJ2J1QMkrj5j7j5rkJ0J8J9J1Jnpj1j4
10099E0j7j5rllnj1j4j8j8j0RL1M5M7L3Rj2k1j8j3j2j3pJOjj0j4pQK1K2J3LKMLknlKLLKJL
10080F0QJ3J4J2O%nqqonmLJ1J2QOJ2J9J6Kj3j8k4k9l2k6j9j1rJJ8L7M7M8M2L2J8%j0j3j6k2
10062A67k5k1pPJ4J2PJkoj1j8k7l0k4j3lMJ1J8K1J9J4QQJ0QKqj5j2pnqj2j0nnrj3pOJ5J5R
10044G3QJ5K1K1J7J3J0J0PML%mj0j1j2j1rokjpj2j3j1qnLJ4K1K1K3K7L0K2Pkrj7k9l2k5j4
10027A20j2j5j4j4j5k2k2j9j4qOK3K9K5J9J4R%qqkMRJ4J9J7RJkkKOJ1RJoj0j1pLJ3J1jj2j6
10009A34j9k1j9oJ1K4K8K7K4J7J1O%j0k3k8k3j1npj2j6j6j1j1j3j0jJ2J7J1MLLklRL0M7M4
9993A95K2jj8k6l0l2k6j5lkj3k9l8l8l0k1qJ3L3L7K5ROJ0J2J4K2L3K8Qj1j6j1rrj0qj3j6r
$$ plain form
10119 51 67 89 103 102 89 77 75 80 89 96 102 104 106 111 117 119 114 107 102 101 99 91 78 64 56 55 58 58 55 55 62 74 85 93 97 95 86 71 54 39 30 28 38 56 75 86 87 82 75 64 50
10099 50 33 18 9 6 3 -2 -13 -27 -45 -63 -73 -64 -33 12 59 92 101 89 68 50 37 25 12 5 6 12 11 1 -13 -20 -12 9 31 44 47 49 53 56 54 49 46 48 51 54 56 57 60
10080 60 68 81 95 107 113 113 108 100 92 86 81 77 80 91 103 111 117 129 148 164 166 153 135 111 82 50 24 5 -6 -15 -14 4 41 88 136 178 210 228 228 218 205 189 167
10062 167 142 121 114 121 135 147 154 155 153 147 136 118 91 61 37 24 21 25 36 54 75 94 108 116 124 134 142 144 136 121 109 102 97 89 77 67 62 57 48 35 28 34 49 64 73
10044 73 81 96 117 138 155 168 178 188 195 199 202 202 198 188 177 165 154 145 139 137 136 129 117 104 93 85 80 83 97 118 139 162 189 219 241 248 246 237 220 191 159 134 120
10027 120 108 93 79 65 50 28 6 -13 -27 -35 -29 -6 23 48 67 81 90 90 82 74 72 76 85 99 118 135 144 145 143 141 143 149 160 169 170 164 154 143 136 139 152 163 162 150 134
10009 134 115 94 75 69 80 104 132 159 183 200 211 217 217 207 184 156 133 122 117 110 98 82 66 55 44 31 21 20 32 49 60 64 67 70 68 65 74 104 151 195
9993 195 217 216 198 172 142 110 84 69 66 64 51 22 -16 -54 -84 -105 -113 -100 -67 -30 -5 4 10 20 32 46 68 101 129 137 126 110 99 90 81 71 63 50 34 25
9977B5NJ9K3K1J8J1LomLJ0J2RM%lnpqpj0j4j6j0mnj0j2mPJ6J8J8J6J1POOKjKQJ2J1P%nrqn
9957A57nmjKNOONKJLOLj1k8l5k9j3OK1K8K2Rnj1j2j4j6k1k3k0j1mkmnnmmkKNKLMOKnqmMJ2
9936A6J6J5J0Mlrj3j8j9j4jJ3J7J5J0RJ1RLnpkNPKlmJNNJkjPJ6J8Roj4lJ9L1K0mk5l4l5l2
9917D0k2pQJ3P%mpj5k4k7j7kQMkjJ0K3K7K3J2kj2j8j3LK6L9M2L7L2K8K2Qj1l0m2m2l0j4kO
9899G4J4K0J8Kj6k5k1j5j4k0k0j3kRJ6K4K8K1J0LOJ5J9J6RJlqj6k5k9k0%J9K4J3lj6j7j1l
9883F4JPJ1J3J2Nmj1j8k3k4j8oMNKLJ8L5L9L0J5LmnmLMLklklj0j4j4j0oJJ0J5QjlLLrk0j4
9863H9PK3K4J4Jj3l3n2n4l6j6lJJ0K1K8L0K6K1J4Mlmkloj1j0o%MQRMknJJ5K7K4J0nrlOJ2J3
9844A70RJkJRJ2RKqk0l4l7k6rKMMK%kJQR%j3j8j5j0nLJ3K4K7K3J0mj2j4j2j4j0JJ9K8J6oj9
$$ plain form
9977 25 30 49 72 93 111 122 125 119 115 118 128 140 149 153 153 150 145 138 130 123 113 99 83 73 69 64 54 42 38 45 61 79 97 113 124 131 137 143 145 144 146 154 166 177 184 184 179 170 162 157
9957 157 152 148 147 149 154 160 166 171 173 174 177 183 186 175 147 112 83 70 76 97 125 147 156 151 140 128 114 98 77 54 34 23 19 17 13 8 3 -1 -5 -7 -5 0 2 5 9 15 17 12 4 0 4 16
9936 16 32 47 57 61 58 49 36 18 -1 -15 -16 -3 14 29 39 48 59 68 71 66 59 57 62 69 71 68 64 65 70 75 76 74 73 80 96 114 123 117 103 100 119 150 170 166 141 107 72 40
9917 40 18 11 19 32 39 39 35 28 13 -11 -38 -55 -57 -49 -45 -47 -48 -38 -15 12 35 47 45 33 15 2 5 31 70 112 149 181 209 231 239 228 198 156 114 84 70 68 74
9899 74 88 108 126 128 112 87 66 51 37 17 -3 -16 -18 -9 7 31 59 80 90 93 99 114 133 149 158 159 156 148 132 107 78 58 58 77 101 114 111 95 78 67 64
9883 64 65 72 83 96 108 113 109 98 80 57 33 15 9 13 18 20 23 41 76 115 145 160 163 159 154 150 153 157 160 158 155 153 150 140 126 112 102 96 97 107 122 130 129 126 129 132 123 103 89
9863 89 96 119 143 157 158 145 112 60 6 -30 -46 -49 -48 -38 -17 11 41 67 88 102 106 103 99 97 94 88 77 67 61 61 65 73 82 86 84 79 80 95 122 146 156 151 142 139 145 157 170
9844 170 179 180 178 179 188 200 209 211 203 183 149 112 86 77 79 83 87 89 89 87 88 96 105 105 92 74 59 49 44 47 60 84 111 134 144 140 128 114 102 88 78 79 98 126 142 136 117
9825A17j7o%JNJ0J8J7Rko%PQ%j0j5j8j7rKJ1J1Mjkkmpj5k4k5j5l%pj0%J8K9L2K5J6J0J2K1
9807A68K4J5jj3j8k3k6k4j9j4j2j3j3j3j1lJ0J8K4L1L9M5L9K0MnojNJ2J6R%qj3j8k6k5j8p
9791A49mqj1pk%kLJ2J6J1%m%LJnj2j5j3kJ3K0J5L%NJ3J0O%oj3j8j5oOJ4K3K6K2J5Pmj9l4m1
9772A52l7l3l1k7j7jJ3K5L5L8L2J7Omj2k0k2j8j0n%joj1j3rKJ4K6L0K5J7K1L3L9K8J1JKMP
9756C01J6L1M2M1L1K6L7N6P9J04J37J82K36L01L65L99L55K04k2k36l61l84l49k95k43j91j45
9745G17j13r2p5n9m6l8k9k2j3rlOJ0Oqk2k7k5k0j3mNJ0Nlj2j7k1k5k5k1j2kOJ0J0PPPPRJ2
9728G8J7J7J4J7K2K4J3pk5l3l3k6j2MJ3J2OLlj0j6rLOlj4j7j3nMJ7K9L2L0K3J7Okpmj%lpp
9710A50ojMNNLLjnmKJ2J5J7J7J3Mqj5qNJ1Qjj2k6l4k4jJ7J6%j3j9k7l8m0l0k0j8j9j4lPJ5
$$ plain form
9825 117 100 94 94 95 100 110 128 145 154 152 146 146 153 161 161 151 136 118 101 92 94 105 116 120 119 117 115 111 104 89 65 40 25 22 22 15 5 5 23 52 84 109 125 135 147 168
9807 168 192 207 206 193 175 152 126 102 83 69 57 44 31 18 7 4 14 32 56 87 126 171 210 230 234 229 223 222 227 239 255 264 264 256 243 225 199 174 156 149
9791 149 145 137 126 119 117 117 115 118 130 146 157 157 153 153 156 157 152 140 125 112 110 123 143 158 161 161 166 179 189 195 195 189 176 158 143 137 143 157 180 206 228 243 250 246 227 193 152
9772 152 115 82 51 24 7 6 19 44 79 117 149 166 172 168 156 136 114 96 86 81 81 80 74 63 50 41 43 57 83 113 138 155 176 209 248 276 287 288 290 294 301
9756 301 317 348 390 431 462 488 525 581 660 764 901 1083 1319 1620 1985 2384 2739 2943 2921 2685 2324 1940 1591 1296 1053 862 717
9745 717 604 512 437 378 332 294 265 243 230 221 218 224 234 240 232 210 183 158 138 125 121 126 136 141 138 126 109 88 63 38 17 5 3 9 19 29 36 43 50 57 66 78
9728 78 95 112 126 143 165 189 202 195 170 137 104 78 66 70 83 95 101 104 101 91 75 66 69 75 72 58 41 28 23 27 44 73 105 135 158 175 181 179 172 168 167 167 164 157 150
9710 150 144 143 147 152 157 160 163 162 157 153 155 167 182 199 216 229 233 225 210 202 207 218 226 225 213 187 153 129 128 145 161 161 148 129 102 64 24 -6 -26 -44 -63 -77 -80 -73 -58
9692e8K4L5M3M2L7L4K8J5lj6k4k8l0k6j8mJ1K0J6MljORJ0J1J2Qjj0j3j2lQJ2PkpnkNJ0J0k
9674A49j5k0j0lpj9k2j3noj3k0j9j5rnJRJ9K5K7K6K3K0J8J4Plrj1nNJ1J1Mknnj0k1l4m2l6
9657a5k1OK8L7L1J3pk1k6k6k3j3%J3K6L7L5K2MnlLJrj7k2k0j5oPK0K8K9K5K2J7Plj4k1k5k5
9640G4j5lPJ3J4J5J4J5J9K1J2rl2m6m6l7k2j2omlKJ0J4Qkj5k4k6j7%J8L0L0J6jj3j7j5j3j2
9623e8j5j6j0KJ7K7K8K5J9J5QJkrj9k3j6JJ4K0K0K0J9J8J7J3OjmkJLNJ1J7J5Mj2k7l4k7j4
9607E7%Mmj4j7oJ4K9L0K1Qoj5j9j3%J3K4K8K4J1mj3j3nPK4L6L4K0Pkj6l5m8m8m3l9l2j6OK1
9590A0K2J5PLLL%npkJ2K1J8Npj1j2j4k0k0j1JPLkkNJ5K1J7Mj0j3lJ1J0jj1rJJ1J9K0J3Kpj1
9571A01j3j8j9j4oJPJ3J6J0kqo%LMOLnj0q%Kkj0j2qjPJ6J8Qqk3k5j5kQJ4J7K0J6Kj4k5k0r
$$ plain form
9692 -58 -34 1 44 86 123 157 185 200 197 181 157 129 99 73 55 51 62 82 98 102 99 98 104 113 123 134 146 154 153 143 130 118 115 123 135 142 140 133 128 126 131 141 151 149
9674 149 134 114 104 101 94 75 53 40 35 29 16 -4 -23 -38 -47 -52 -51 -42 -23 2 29 55 78 98 116 130 137 134 125 114 109 114 125 136 140 138 133 128 118 97 63 21 -15
9657 -15 -36 -30 -2 35 66 79 72 51 25 -1 -24 -37 -37 -24 2 39 74 96 100 95 92 95 96 87 70 48 28 13 7 14 34 62 91 116 138 155 162 159 145 124 99 74
9640 74 59 56 63 76 90 105 119 134 153 174 186 177 145 99 53 16 -6 -18 -24 -28 -31 -29 -19 -5 3 1 -14 -38 -64 -81 -81 -63 -33 -3 13 12 -1 -18 -33 -46 -58
9623 -58 -73 -89 -99 -97 -80 -53 -25 0 19 34 42 43 41 32 13 -10 -26 -25 -11 9 29 49 68 86 103 116 122 121 117 115 116 119 124 135 152 167 171 159 132 98 71 57
9607 57 57 61 57 43 26 20 34 63 93 114 122 116 101 82 69 69 82 106 134 158 169 165 152 139 134 141 165 201 235 255 262 260 244 209 161 113 70 31 -1 -17 -11 10
9590 10 32 47 54 57 60 63 63 58 51 49 61 82 100 105 98 87 75 61 41 21 10 11 18 21 19 17 22 37 58 75 79 69 56 53 64 74 73 62 53 54 65 84 104 117 119 112 101
9571 101 88 70 51 37 31 32 39 52 68 78 76 68 62 62 65 69 75 78 73 63 55 55 57 55 45 33 25 24 31 47 65 73 65 42 17 2 0 8 22 39 59 75 77 63 38 18 9
9552IJONOL%%LJ1J3J0Mnj2j7j7j0LJ5K7K9K4J5QN%lkKPPN%mmMJ2J6J1Mkj0j6j9j2%Kmj3j6
9532A01j2rj1j3j4j1j0j6k2k2nJ6K8K9K1J2LljPJ3J0MLRJ2%j9l4l9l1j9jRQLJLON%KQJ7K5
9514F3K6J8lk4l4l3k2j2nmj0j5j7j2lPJ8K1K0J2RRJ1RPPOMNRJ5J7J5J0OLORMoj7k1j7j5j1
9496F5nkpj5j6mJ5K7K5J2MRJ7J5jj9k4j8pl%%JJLOKpj0jJ4K2J4%qqlMJ2J7J6Rjj1j9k5k4j7
9477E5rj5k9l3j8J1K9K9J6JmjPJ4J5J1J3J7J6Nj2k2j9oJ0J7J4Jj3j8j4ojJlnrj1j0JJ8K7J8
9459H8mj8j3jOMPJ4J6Qoj6j8rLJ2J3Qkj3k1k2j7pmonJJ5L3M6M7L4J0j4k3k1j5j2rmKONNRJ0
9440A22Nqj2qklqj0mkpj4j1lLJqj4j7k0j7oQJ9K4K1J5P%ooonkMJ3K2K7K7K3J3LJRJ4Oj4k9
9421A45l2l0l0l1k0JJ6J8RKjJ%jJJ%%JPJ6K6K8J7kj5j8j4j3j5j2kORRQPjrrLJ5J3Mnolmpo
$$ plain form
9552 9 10 16 21 27 30 30 30 33 44 57 67 71 66 54 37 20 10 13 28 55 84 108 123 131 136 136 133 131 133 140 147 152 152 148 144 148 160 176 187 191 189 179 163 144 132 132 134 130 117 101
9532 101 89 80 69 56 42 31 21 5 -17 -39 -44 -28 0 29 50 62 65 62 61 68 81 91 95 98 107 119 119 100 66 27 -4 -23 -24 -15 -7 -4 -3 0 6 11 11 13 21 38 63
9514 63 89 107 104 80 46 13 -9 -21 -26 -30 -40 -55 -72 -84 -87 -80 -62 -41 -21 -9 0 9 20 29 36 43 49 53 58 67 82 99 114 124 130 133 139 148 152 146 129 108 91 76 65
9496 65 60 58 51 36 20 16 31 58 83 95 99 108 125 140 139 120 96 78 71 68 68 68 69 70 73 79 81 74 64 63 77 99 113 113 105 97 94 98 110 127 143 152 151 140 121 96 72 55
9477 55 46 31 2 -31 -49 -38 -9 20 36 37 33 32 39 53 68 79 92 109 125 130 118 96 77 71 81 98 112 113 100 82 68 62 61 62 59 54 45 34 24 25 43 70 88
9459 88 84 66 53 52 58 62 69 83 99 107 101 85 67 58 61 73 86 94 92 79 58 36 19 12 8 2 -3 -2 13 46 92 139 173 183 169 146 125 110 98 89 85 87 93 98 103 112 122
9440 122 127 119 107 99 97 94 86 76 72 70 63 49 38 35 38 39 31 17 0 -20 -37 -43 -35 -16 8 29 44 51 51 45 39 33 28 26 30 43 65 92 119 142 155 158 159 168 182 188 174 145
9421 145 113 83 53 22 2 3 19 37 46 48 47 48 48 47 48 49 49 49 50 57 73 99 127 144 142 127 109 95 82 67 55 53 59 68 77 85 92 91 82 73 76 91 104 108 103 97 94 90 83 77
9401G7kNJ2K0K4K0Nj2k0k1j8j3qkKOJ1J2Moqjjj4k6k7j7o%NQRJ2J7J8Rrj7j4rrj0lOJ2J0M
9382C5ln%J1K1J9Poj5j7j4plqj4rNRKj1j4jJ6K2K1J1Knqj1j0lNRQL%lpj0nkkqj1j3j3rNK3
9362a3L0K2NjMRMqk3l1k7j0PJ1LkLJ0PMLN%qo%NPQJ5J9J6Olpj2j5j4pMJ2J7J7J4J3J3RKqr
9342A00nnpr%J1J4R%j%jkKQJj7l4l7k5j0kOJ3J9J9J7J0%njJ2K2K1J3Lnj2j6j5j4k2l4l7k4
9324d0kJ3J2PNJ2K1K3J4%lOJ3Pqk1k4j9j3qmjLPJ4K3K5J7NmmLJ1Rmj6k1j7j0kQK0K7K6K0J0
9305A40lj1j4j0popppqj1oMJ3J2KonLRNpj8k1j5qLJ2J3Mj0k1k4k4k2pJ8M2M9M0K6J6J1QOR
9287A60J1RMkmmpj8k9k8j3LQPNQJ0RJ2J9J7Nj3j9j4lJ%nqqqqj0rrplMJ7K8K9J4ok2k3j6qn
9267G1jNRPKKMKnj3j2kJ2K5K7J4pk0k0j2j0rmOJ3J3MkJORMqj6j8j6j4j2pmkjOJ2J1PKJOJ3
$$ plain form
9401 77 75 80 92 112 136 156 161 149 129 108 90 77 69 67 69 75 86 98 102 96 88 87 86 72 46 19 2 -4 -4 1 9 18 30 47 65 74 65 48 34 25 16 6 3 9 21 31 35
9382 35 32 27 27 38 59 78 85 79 64 47 33 26 23 15 1 -8 -3 6 8 -3 -17 -18 -2 20 41 52 54 49 41 30 20 17 22 31 39 42 42 39 32 22 17 15 13 5 -6 -19 -32 -41 -36 -13
9362 -13 17 39 44 43 47 56 60 52 29 -2 -29 -39 -32 -21 -18 -20 -17 -7 0 4 7 12 12 4 -2 -2 3 10 18 33 52 68 74 71 64 52 37 23 16 20 32 49 66 80 93 106 115 117 109 100
9342 100 95 90 83 74 74 85 99 108 108 107 107 106 104 106 114 115 98 64 27 2 -8 -10 -4 9 28 47 64 74 74 69 68 80 102 123 136 139 134 122 106 91 77 55 21 -16 -40
9324 -40 -42 -29 -17 -10 -5 7 28 51 65 65 62 68 81 88 80 59 35 16 3 -5 -9 -10 -7 0 14 37 62 79 84 80 76 79 90 99 95 79 58 41 31 29 37 57 84 110 130 140
9305 140 137 126 112 102 95 89 82 75 68 60 49 43 47 60 72 74 68 63 66 75 80 73 55 34 19 11 14 26 39 43 33 12 -12 -36 -58 -65 -47 -5 44 84 110 126 137 145 151 160
9287 160 171 180 184 182 178 174 167 149 120 92 79 82 90 97 102 110 120 129 141 160 177 182 169 150 136 133 134 134 129 121 113 105 97 87 78 69 62 59 63 80 108 137 151 145 123 100 84 76 71
9267 71 70 75 84 91 93 95 99 101 96 83 71 69 81 106 133 147 140 120 100 88 78 69 65 71 84 97 101 99 100 106 115 119 111 95 77 61 47 35 28 24 22 21 27 39 50 57 59 60 66 79
9247G9J6J0rl1l5k4oKLQJ5K1J9J2N%%PJ8K6K7K1J4J1P%lLJ6K4J7Mqj3j0ppj4k1k5k3k1k0j9
9230H9j1jMMKKJmpnjMRK1L1L2K2RJJLMK%mpo%J1J4Mj5k5k6k1k2k2j0QJ9J6OKKLRJ5J9J5PJ
9209B05jjmnj0j3j4j1ron%KKJOJ2J1KlJJ0J7J5Plj5k4k6k2k0k0k1j6j1j2j7j5lJ6K9L0J8P
9191H4jkKNM%KORPMMNkqj0jONK%jmpmMJ2J5J6J2lk0k8k1nJ0J9J8J0nk2l2l2k5rJ1K9L8L4K9
9171A60K7K5J5lk1l5m3m6m1k8pOJ0OLQJ8K6K5J6Mllmj0k1k9k5rJ5L4M3L9L3L1L0K0%j9k9k9
9155A89k6k3j6j0plKJ0J4J1Jj0k2k9k8j9j0kNJ2J8K2K3J7Jj2j1jJ1J2J0RJ5J9K2K2J5Jj6k8
9139A88k9j7JJ7K4K1J1Jrj6k1j8j0JRJ1Mj0k4k6j6qoj1j5j3mJ1K7L5L0J4nk1k6k4j6pkqk1
9122B2l1l0j2J2L0L4K8J1mrlPMpj8k2j5qjMQJ2J8K1J6Q%prkJ0K4K9K8K2J6Pjrj5j7j7j3pr
$$ plain form
9247 79 95 105 96 65 30 6 0 2 5 13 28 49 68 80 85 85 85 92 110 136 163 184 198 209 216 216 213 216 232 256 273 277 269 256 246 239 232 218 197 172 149 128 108 89
9230 89 78 77 81 85 87 89 90 86 79 74 73 77 86 107 138 170 192 201 202 203 206 210 212 212 208 201 195 195 206 220 224 209 184 158 137 115 93 83 91 110 126 132 134 136 139 148 163 182 197 204 205
9209 205 204 203 199 194 184 171 157 146 137 131 126 126 128 130 131 137 149 160 162 159 160 170 187 202 209 206 191 167 141 119 99 79 58 42 31 19 2 -13 -16 0 29 59 77 84
9191 84 83 81 83 88 92 92 94 100 109 116 120 124 129 127 119 109 108 114 119 121 121 120 116 109 105 109 121 136 152 164 161 141 113 92 87 97 116 134 144 139 117 85 53 28 19 30 59 97 131 160
9171 160 187 212 227 224 203 168 125 79 38 10 3 9 19 25 28 36 54 80 105 121 125 122 119 115 105 84 55 30 21 36 70 113 152 185 216 246 266 266 247 218 189
9155 189 163 140 124 114 107 104 106 116 130 141 142 132 110 81 53 34 24 22 27 39 57 79 102 119 120 108 97 96 107 119 129 138 153 172 194 216 231 232 216 188
9139 188 159 142 143 160 184 205 216 217 208 192 171 153 143 144 153 164 168 158 134 108 92 84 78 67 52 39 35 46 73 108 138 152 147 126 100 76 60 53 51 43 22
9122 22 -9 -39 -51 -39 -9 25 53 64 60 51 48 55 59 52 34 12 -3 -11 -12 -8 0 12 30 51 67 75 75 68 59 57 67 91 120 148 170 186 193 192 183 168 151 134 121 114 105
9104A05j6j9j6j0nKJ3K3K5K1J2Ll%J1J6J5RNjmnLOjj3j7j2j3k2l0k9k2j6j1o%LOJ2K1K2J3
9087G5JomJLjj2k5k7j4RL1M1L4K3J8J4J1NJJKQJ7K2J8jk4m1m1l0j5j3j8j8oJ3K2J9J1QPMK
9069A25NPOlj4k4k4j4jP%j1j7j5j0lOJ2J3J0PPOMMLJoj0oJMkj2j8j3mLONNPOLmj4j6oJ1J6
9049D3RK%JlpnKQPOMjl%J0J7J8J5J3Omj0p%LQJ5K3K2J4M%nj3k4l1k9j8%J3J7J2MKKnj8l2l3
9029E2k6j8k1k5k0j1lJPJ3J3%j1j4pMJ8L0M0L9K8J6J1J0RPKjjlqj3j6rLJ3J3J0NJmj1j3q%
9011A02KkqrnlLJ6L0L2K0Ml%%nj4j8j8j1%QLrj9k3k8l3l4k8j5nLJ3J7J6J2J6K7L3L5L0K1N
8993A58j1j7j8j9l0l7k8qJ0J2%qkJ5L2L5K5Oj6k9k2jJ9K6J5kj4j6rmknlPK0K6K0Oqj9k4j8
8977F2nQJ8J9J7J2%j4k3k3j2KJ1J2Q%pj3j3rjOJ0RNjnomMJ3J7Oj5l7m6l6j8kRJ5K6L8M5M1
$$ plain form
9104 105 89 70 54 44 39 41 54 77 102 123 135 138 135 135 146 162 177 186 191 190 186 181 184 190 189 176 159 147 134 112 82 53 31 15 4 -2 -2 1 7 19 40 62 75
9087 75 76 70 66 67 70 69 57 32 5 -9 0 31 72 106 129 147 161 172 177 178 179 181 189 206 228 246 245 221 180 139 109 94 81 63 45 39 52 74 93 104 112 119 123 125
9069 125 130 137 143 140 126 102 78 64 63 70 70 59 42 27 17 14 20 32 45 55 62 69 75 79 83 86 87 81 71 65 66 70 68 56 38 25 21 24 30 35 40 47 53 56 52 38 22 16 27 43
9049 43 52 54 54 55 52 45 40 42 50 57 63 67 66 63 63 73 90 108 123 136 142 138 128 121 121 124 132 147 170 192 206 210 210 205 192 168 137 108 90 90 103 120 132 136 138 140 135 117 85 52
9029 52 26 8 -13 -38 -58 -69 -72 -71 -64 -51 -38 -38 -49 -63 -70 -66 -48 -18 22 61 89 105 116 126 135 142 144 143 142 139 131 118 102 93 96 109 122 132 137 138 134 123 110 102 102
9011 102 104 102 94 85 80 77 80 96 126 158 178 182 179 179 179 174 160 142 124 113 113 121 124 115 96 73 45 12 -22 -50 -65 -70 -67 -54 -37 -21 -9 7 34 67 102 132 153 158
8993 158 147 130 112 93 63 26 -2 -10 0 12 12 4 2 17 49 84 109 115 99 70 48 47 66 92 107 105 91 75 66 62 60 55 52 59 79 105 125 131 123 104 80 62
8977 62 57 65 83 102 119 131 131 117 94 71 59 61 72 84 92 92 85 72 59 50 49 55 65 74 79 78 73 67 63 67 80 97 103 88 51 5 -31 -49 -51 -42 -27 -1 37 82 123
8959A23K4Ppj7j9j2kLkj4k3k5k2j3%J4J9J5J1J4K0K0J6RMkqpOK2K9K0LpjJ1J8J5R%rj7k3k6
8941A76l0l0k0nJ2K1K7K4J3mj4j3rrj0oj%nnKPJ2J7K5L1K6J2jj1j7k0k0j8j6j4j2oMJ3J5P
8924A48jkPJ4Qqk1j9qORNmj3k0k1j8j1pj0j0jRJ1%j2k0k3k4k4j7pOJ9K7K8J9Oj0k1k4j1RK9
8906gL7L5K2Mj1j5j1n%PJ3J6J6J5J2%j7k6k4j7j9k3k0j0%NOQPQQLqj8j9pOJ3J3ROOJ2J8K3
8888G1K2J6Mj2k8l3l1k6k6k2j4nMJ7K8K5Oj7k3j5m%MMJlkQK1K6K1J2MLRJ2J0LmokNJ5K4K3
8870A25J3Jj1j9k0j1jNJlmLJ2J8J9J6RPOLmj1j8k4l0k7j1J2K5K1QmojPJ1Ooj5j2jQJ0RQJ2
8852A36J6J6Nj4l2m0l7k4j3pojNJ9K7K4J4KJOJ3J4J1Njj0j7j9j2kJ0K1K6K0Nj4k8l1k3qJ2
8835F9L0L7L5L0K6K1Qj4l0l4k7j6rnqrq%ONlj1j8k0j7j1jQJ7K0K1J9J7Rmk2k9k3j0jKLLLQ
$$ plain form
8959 123 147 154 147 130 111 99 97 100 98 84 61 36 14 1 1 15 34 49 60 74 94 114 130 139 143 141 133 126 132 154 183 203 206 199 198 209 227 242 251 251 242 225 202 176
8941 176 146 116 96 91 103 124 151 175 188 184 170 157 148 139 129 123 122 122 117 112 114 121 133 150 175 206 232 244 243 232 215 195 175 157 141 127 115 109 113 126 141 148
8924 148 147 145 152 166 174 166 145 126 118 124 133 138 134 121 101 80 62 51 44 34 24 23 32 43 43 31 11 -12 -36 -60 -77 -84 -78 -59 -32 -4 15 21 11 -10 -34 -45 -36 -7
8906 -7 30 65 87 91 80 65 54 49 49 56 69 85 101 116 128 128 111 85 61 44 25 2 -18 -28 -28 -23 -17 -9 -2 6 14 17 9 -9 -28 -35 -29 -16 -3 6 12 18 30 48 71
8888 71 93 109 113 101 73 40 9 -17 -43 -65 -79 -84 -80 -63 -35 -10 -4 -21 -44 -59 -63 -63 -59 -55 -54 -57 -59 -51 -30 -4 17 29 33 36 45 57 67 70 66 60 58 63 78 102 125
8870 125 138 139 128 109 89 78 77 82 83 80 76 79 91 109 128 144 153 160 166 169 165 154 136 112 82 55 44 56 81 102 110 106 100 99 106 117 123 117 102 90 89 97 107 116 124 136
8852 136 152 168 173 159 127 87 50 26 13 6 0 -1 4 23 50 74 88 90 91 97 110 124 135 140 139 129 112 93 81 79 89 110 136 156 161 147 119 88 65 57 69
8835 69 99 136 171 201 227 248 256 242 212 178 151 135 126 121 113 104 96 96 102 107 104 93 75 55 38 27 26 34 51 71 92 111 128 137 133 111 82 59 49 48 50 53 56 59 67
8817F7J8K9L3K9K1J3Lrj7k2k2k0j5pnj2j3kJ8K6J3qk1j9j1onoKJ6K7K4J2mk2l8m6m0k4nOJ3
8800b9J7J3PKMJ2J8J9J5J1PKlqj0j1j1j1j0mLJ0J5J9J3%j6k1j0MJ0ROLkpj1j2j0n%NOJqj7
8782A5j5qMJ1RKoqmLJ4J6J0kj2j6j0KJ3J2Ojmpj3j3qQJ8J9J0nj4j4oOJ7K2K3K0J4LnnJRRj
8763A19j3j7j3lJkrj4j1mmrj1jJ8K6J9Pjqj7k1j6qk%MPJj4j7pJ3K5L1K7K3J8J1MjjPJ7K0J3
8744A87MkjjmponmnrqKJ2J6J2PJnj2j5j3j1j6k4k5j6jJ2J2Jj2j5lJ8L6M1L2J4JkKMmj3j5p
8725A53llpj3j7j9j3jJ1J4Lj6k7k3pPQJ%PJ0Kqj2p%NRJ8K5K9K6K6K8L1L0K7K2J4Jj3k3k7k5
8708B43k1j3j0j6k8l0j9lMPJ2J7J3Jj2j8j4mNJ0Mlk%lj7k9k8j8nOJ7K6K9K1J2OQJ1J0%qj1
8690A50j1j6k5k5j4kKLRJ8J9J4J1J3J5J1OLjj1k6l6l2j4PK0J7Lqj2plklkjJ%koollnnJPQj
$$ plain form
8817 67 85 114 147 176 197 210 213 204 187 165 143 123 108 101 96 84 71 69 87 113 126 118 97 78 67 61 56 50 52 68 95 119 131 127 105 67 21 -19 -43 -48 -42 -29
8800 -29 -12 1 8 10 14 26 44 63 78 89 96 98 95 87 77 66 55 44 34 30 33 43 58 77 90 90 74 53 43 47 57 66 72 75 73 66 55 43 33 28 28 33 39 40 32 15
8782 15 0 -8 -4 7 16 18 12 4 0 3 17 33 43 41 29 13 3 5 18 30 36 35 31 24 11 -2 -10 -2 16 35 45 40 26 12 6 12 29 51 74 94 108 111 106 101 102 111 120 119
8763 119 106 89 76 73 74 72 63 49 38 34 30 21 10 9 27 53 72 79 78 70 53 32 16 8 6 6 10 17 18 4 -13 -20 -7 18 49 76 99 117 128 132 131 130 137 154 174 187
8744 187 191 189 188 187 183 176 170 165 161 156 147 139 141 153 169 181 188 189 184 172 157 144 133 117 93 68 52 51 63 75 76 64 49 46 64 100 141 173 187 188 186 188 192 188 175 160 153
8725 153 150 147 140 127 110 91 78 77 88 102 105 89 62 39 32 39 47 48 48 55 65 67 59 47 40 40 45 54 72 97 126 152 178 206 237 267 294 316 330 331 318 295 268 243
8708 243 222 209 199 183 155 125 106 103 107 114 126 143 156 157 145 127 113 109 114 124 128 125 123 123 120 103 74 46 28 23 29 46 72 101 122 134 140 148 159 169 169 161 150
8690 150 139 123 98 73 59 57 59 62 71 89 108 122 133 146 161 172 178 181 180 169 143 107 75 61 68 88 105 108 100 88 81 78 76 73 71 70 71 71 69 63 57 54 51 46 41 42 49 57 56
8671E6j0j4j0KJ6K1J4Jrj2qJJ1J7J6RNNQRQQNJmmKJ2J9J5%j7k8k6j3JJ2J5R%pj0j3j8k0j6
8652E9pklmnoqmLROlj1j3j1j2k0k6j8%J9K0Lj3j0QK5K9K8K5K3J4JpmNJ7K0J2nk0k6k2j7j4
8634C5j1plk%NRJ4J8K3K0Lk4m6m7k9jJ9K7K5K1J6RJllpj6k1j2KJ0QMLkppjJ0J5J4J3J1POP
8615A06QJpoNJ7K1J8J2Nmj2j1oj%kl%NQRPNQJ4K0J6Oqj6j8j2jQRmk3l2k5qOJ1RJj0k2k9k5
8596E0j5ppqlRK3L1K7J7J1RKj0k3k5j7roj3k1k8l0k1mQJ0NLJ0J9J6PnpJJ3K2K3J6Okk%MNN
8577H9K%mrj3j5j5j2roqj4k2k2j4lRJ3J2RMNORJ1J4J5J9K5K9K4J0oj5j5oMJ2J4R%pj0qppq
8558H9ojQJ1Nnj3j4j6j5j1MK2L2K6J2KjJnj3j6rJRJ3J6J3KnmMOKJRJ6J4Kj2k5l7l8k4nJ1J6
8539G2J6J5J1ROLpj9k5j5MK3L4L0J0k0m2m4l1j8j2pNJ6J9RkrqnjKK%jjOJ4J8J5Omj1j4j5j0
$$ plain form
8671 56 46 32 22 24 40 61 75 76 67 55 47 48 59 76 92 101 106 111 119 128 136 144 149 150 146 142 144 156 175 190 190 173 145 119 106 107 119 134 143 143 136 126 113 95 75 59
8652 59 52 50 47 43 38 32 24 20 23 32 38 35 24 11 0 -12 -32 -58 -76 -76 -57 -37 -34 -47 -57 -49 -24 5 33 58 81 95 96 89 85 90 107 127 139 134 114 88 66 49 35
8634 35 24 17 14 12 12 17 26 40 58 81 101 104 80 34 -13 -42 -43 -24 3 28 49 65 74 75 72 69 62 46 25 13 15 25 33 37 40 38 31 24 23 33 48 62 75 86 93 99 106
8615 106 114 115 108 102 107 124 145 163 175 180 176 164 153 147 146 146 144 141 141 146 154 163 170 175 183 197 217 233 239 231 215 197 185 184 192 201 197 174 142 117 109 115 126 135 136 126 104 75 50
8596 50 35 28 21 13 10 19 42 73 100 117 128 137 139 129 106 81 64 55 49 36 15 -13 -43 -64 -68 -60 -50 -45 -42 -32 -13 3 10 5 -2 -1 12 34 57 73 79 77 75 75 79 84 89
8577 89 91 91 87 78 65 50 35 23 14 8 0 -14 -36 -58 -72 -75 -66 -53 -41 -32 -28 -23 -17 -8 3 17 32 51 76 105 129 139 133 118 103 97 101 113 127 136 136 129 119 111 104 97 89
8558 89 83 82 90 101 106 101 88 74 58 43 32 36 58 90 116 128 130 129 130 125 112 96 87 88 97 110 126 139 141 136 132 136 142 144 145 154 170 184 186 174 149 112 74 50 45 56 72
8539 72 88 103 114 123 129 132 125 106 81 66 70 93 127 157 167 147 105 61 30 12 0 -7 -2 14 33 42 40 31 23 18 17 19 21 21 20 19 25 39 57 72 78 74 63 49 34 24
8520B4lNMnj6j8j3jLLNPQRJ1J9K9L0K1Poj2j2j1rj3j6j2JJ6K3K4K0J0mj7j5lJ0J8K1K4K4J7
8503B07Nnj4j9j6qMJ2J2Noj8k9l7l7k8j6lPJ3J3Pmj5j8j2kQJ8K7L1K4Qpj3j1pnmkMJ0J1Nn
8485I0j7l0l9m3l7k1mJ1K4L5L4K1NmkNJ0J3J4J1OLKPJ0J2QJj%ML%%QJ5J2lj2rmqk5m0l6j7
8466A2%QPL%jKRJ5J6J1jj5k7k6j3JRJ0J0J0QMJkj2k4k7k0j0nlMJ4J8J3MJLORRNKLKlj0j1q
8446A1mkKJ2K1K1RklNJ2RNOJ3J9K4K5K2J1kj0j1n%OJ3K3K6J5rl4m4l4j9rqplklmljnmQK4L1
8426A45K3Nj2k0k1j5jJ0J6J5J1N%k%lj1k2k6k3j3kQJ4J0ok2k7k0j1njJKjkk%JKJ3K3J9jk0
8408C4j7m%j3k2j9jJ3J7J4J2PJmlJ0K9M0L4J6jnjLJlnlmnJJ0J7J2jj2j2rj1j7k2j6nOJ3K3
8390I8L2L5K7J5Mlj0k1l1l6l5k6j6pnj0k1l3k9j2QK1K2K1K1K1J0mj9k2j9r%J0J5J8J7RJmk
$$ plain form
8520 24 21 26 30 25 9 -9 -22 -23 -20 -17 -12 -5 3 12 23 42 71 101 122 129 123 111 99 88 79 66 50 38 39 55 78 102 122 132 128 111 96 93 103 121 142 166 190 207
8503 207 212 207 193 174 158 150 154 166 178 183 177 159 130 93 56 28 12 9 16 29 42 49 45 30 12 0 -2 6 24 51 82 106 114 107 94 83 76 71 67 65 69 79 90 95 90
8485 90 73 43 4 -39 -76 -97 -101 -90 -66 -31 3 24 29 25 23 28 38 51 65 76 82 85 87 94 104 116 124 125 124 124 128 131 131 131 139 154 166 163 151 142 138 130 105 65 29 12
8466 12 12 20 27 30 30 29 31 40 55 71 82 81 66 39 13 0 1 10 20 30 40 48 52 53 51 39 15 -12 -32 -42 -47 -50 -46 -32 -14 -1 3 4 7 13 22 31 36 38 41 43 40 30 19 11
8446 11 7 5 7 19 40 61 70 68 65 70 82 91 96 102 115 134 158 183 205 216 214 204 193 188 188 194 207 230 256 271 262 228 184 150 131 122 114 107 104 102 99 95 92 91 86 82 90 114 145
8426 145 168 173 161 141 120 105 104 114 130 145 156 161 161 159 159 156 145 123 97 74 61 59 67 81 91 85 63 36 16 5 0 -1 0 2 1 -1 -3 -3 -2 0 13 36 55 54 34
8408 34 17 13 13 0 -22 -41 -42 -29 -12 2 14 21 22 18 15 25 54 94 128 144 143 138 137 140 141 138 133 130 126 121 122 132 149 161 160 148 136 127 116 99 77 61 56 62 75 98
8390 98 130 165 192 207 211 208 198 177 146 110 75 49 33 26 21 11 -10 -43 -72 -84 -76 -55 -33 -12 9 30 40 36 17 -5 -24 -33 -33 -23 -8 10 27 36 37 33 31
8373C1QJ7K4K3J7Opj8k2j7qJJ0J5J5Qmj1pPK0K4J7NmlKMJjLJ0RKrj7k7l2l3k8j9nJ0K1K7K6
8355I1K4K0J0%lKLlkJ0K2J8%k0l3l8l5j9lQRPRRQRJ0J0NjkJLkj1j5j3kRJ8K4L2L5L0J6J0J3
8336B73J6J0%qnnpj5k1k1j9j4j4j4j1m%lpoJLLRK0K8K4J3Lnj0j2j3j7k2k7l1l5m0l5j8OK3
8319gK7K6K0J5J1J2J6J8J2Krj6j8j4p%OJ0RRPNjj0j1rj0j9k5j4QK3K5K4K5J7Jj4j2jPPPJ0
8301A62O%mlkj1k5l3l0k2j2mPJ2J0Jj0j3qOJ5J4J0J1J4J9J9J8J5Mj3k4k5j2kJ%MQJ0PKlnm
8283A10%PJ7K4K2J3Kk%Joj4j3nJlj3k4k7k2j5rj0j4j7j4qLJ1J7J6J5J5J3Mj4k5k1pJLJLPJ2
8265C5J5J1OLOJ1Qnj8j8mJ5K4K0Pmj0j6k2k5j7mNPORJ5K0K0J8J7J7J6J1kj6k4j8j1qj1oMJ2
8247I9Qjn%RJ0NLQJ6J8Qrk4k7k4j7j7j7j5pNJ2J4J6J8K0J7J2J0J0QM%lnqj2j8k8l5l4k8k7
$$ plain form
8373 31 39 56 80 103 120 126 119 101 79 62 54 55 65 80 95 103 99 88 81 88 108 132 149 154 150 147 149 153 154 153 156 166 175 177 168 151 124 92 59 31 12 7 17 38 65 91
8355 91 115 135 145 145 142 144 147 144 142 152 174 192 192 172 139 101 66 47 44 52 61 68 77 86 94 103 113 123 128 127 125 126 129 127 116 101 88 86 95 113 137 169 204 234 250 260 273
8336 273 289 299 299 291 286 281 274 259 238 217 198 184 170 156 145 141 141 138 131 125 126 129 132 141 161 189 213 226 229 224 214 202 189 172 150 123 92 57 17 -18 -36 -30 -7
8319 -7 20 46 66 81 92 104 120 138 150 152 143 127 109 95 88 88 94 104 113 122 129 134 133 123 112 103 93 74 49 35 43 66 91 115 140 157 158 144 132 131 138 145 152 162
8301 162 168 168 164 161 159 148 123 90 60 38 26 22 29 41 51 52 42 29 21 27 42 56 66 77 91 110 129 147 162 166 153 129 104 92 90 91 91 95 103 113 120 122 119 114 110
8283 110 110 117 134 158 180 193 195 193 193 194 188 174 161 156 157 154 141 117 90 68 53 44 34 20 3 -11 -19 -16 -5 12 28 43 58 71 75 61 36 15 8 9 12 13 16 23 35
8265 35 50 61 67 70 76 87 95 90 72 54 50 65 89 109 116 112 102 86 64 39 22 18 23 30 36 45 60 80 100 118 135 152 168 179 177 161 137 119 108 100 89 83 87 99
8247 99 107 106 101 101 110 120 125 128 136 152 170 178 169 145 118 94 77 60 43 28 21 26 38 52 68 86 106 123 135 145 155 163 167 167 164 159 151 139 121 93 58 24 -4 -31
8230c1l1l1j9JJ4J4RJ7L2L8K9QopljLJ0J7J9J6J4J4J0kj8k8k9k9k9k9k6j3LJ7K3K1J4QJpj3
8213@j2qkNJ1J5J9J9J2KnJJ4K3J7QMNOLKOJ1Oqj8j8j0JLJnnkmj5k8l4k5j0NJ0%j1k1j9oNR
8193d3Nlj0j4j3rjQJ7K3K4K1K1K0J6QLNRJ0Kqj2lJ6L4M1K9Mj9l2l7l7l7k6nJ5K4J7LpqkQJ6
8175G3K2K2K1K2J8J1lj2j5j9k4k8k5j3lLLJjKNMmqnKjj4k7k8k0j0jOJ7K5K8K9K5J9J4Lj2k3
8157G9k0jJ8K1J0mj0rqoOK1L1K9J7%j5j9j5j3j7k1j3KJ1Lo%K1L6K8J0lkOJ2J7J7Pj0k3k1q
8140A58%krj0j0j5k2k9k7k3j7j2lOJ5K7L8M1L2J1rk2k4j9j2pjLOMkrj1o%NQJ3J9K1J9J9K0
8123A64J8Pnj3j2j1j0j2j5j9j9rOK0K0J0mj6k4k5j6kRJ4Rmj5j6pJK%OJ8K4J9J2J0J6J9J3L
8106A66nonj6l3m0l0j1JJkoj4k7k8j3J0K1J9J5J4K1K4K0J1%prqmQK4L3J9ok4k6j8j4j3j0l
$$ plain form
8230 -31 -62 -93 -112 -111 -97 -83 -74 -57 -25 13 42 50 44 37 34 33 36 46 63 82 98 112 126 136 134 116 88 59 30 1 -28 -54 -67 -64 -47 -24 -3 11 19 20 13 0
8213 0 -12 -20 -22 -17 -6 9 28 47 59 61 56 57 71 94 111 119 123 128 134 137 139 145 156 162 154 136 118 108 109 112 113 108 103 101 97 82 54 20 -5 -15 -10 0 0 -11 -32 -51 -57 -52 -43
8193 -43 -38 -41 -51 -65 -78 -87 -88 -80 -63 -40 -16 5 26 46 62 70 73 78 87 97 99 91 79 76 92 126 167 196 200 181 149 112 75 38 12 7 22 46 63 66 59 51 49 57 73
8175 73 95 117 138 160 178 189 186 174 159 140 116 88 63 50 47 50 53 54 53 55 60 64 60 52 47 49 48 34 7 -21 -41 -51 -52 -46 -29 -4 24 53 78 97 111 114 102 79
8157 79 59 58 76 97 107 103 93 84 76 70 76 97 128 157 174 174 159 140 125 112 95 74 61 63 74 77 71 71 92 128 156 166 163 161 167 179 196 213 220 210 187 166 158
8140 158 158 156 147 137 127 112 90 61 34 11 -6 -18 -21 -15 0 27 65 106 138 149 140 118 94 75 63 56 55 58 64 68 66 57 46 40 40 45 53 66 85 106 125 144 164
8123 164 182 189 184 171 159 148 138 126 111 92 73 64 70 90 110 120 116 100 76 51 35 33 42 56 65 61 46 30 23 24 26 26 32 50 74 93 105 115 131 150 163 166
8106 166 161 155 150 134 101 61 31 20 21 22 20 14 0 -27 -55 -68 -58 -37 -18 -3 11 32 56 76 87 87 80 71 63 59 67 91 124 143 137 113 87 69 55 42 32 29
8089B9KOJ0J4J5Ooj3j3j4j7j7oJ0K6K9J9J0Ljnpj0j2qKJ4J9J8J4J0PNQJ5J7J2K%JLLjpj5k5
8071A52k6j8mRJ6J3PKLOkj3j7j2lknoMK0L4L9L2J5%nrj8k5k4j8j6j8j2JJ4J7J7J9J9J2jj1
8053A86k0l6n1n6m7l6k7j6jJ1J0OOJ4K0K2K1K3K5K4K0Rnj4j3kJ0J6J7J4RJkJLkj3k0k0j4q
8037F5nnoqj1j4j2mMJ0RJpj6k2k4j5KK1K6J9J1J2J8K4K2J5NjmJPQKkNJ5K1J1qk5l4l5l3k9
8019A4k1j0LOkj3j5oRK5L4L9L8L3K5J7Poj5j7j2oKQJ6K1J7RJmj0k2l7m8n0m1k5qNJ1J3J5J3
8002A3J2Noj2j0JPKqj1nPJ4J8K1K3J8Pjllj0j9k6j8lJ4K1K0J6K3M0N2M5K3PQJ8K0J4Kj4k7
7984B95l5l1k3j7j7j5j0nklnnlKQJ1J4J4J6J6J3QQRROONKpj3j6j3qljmj2k2k4j4JJ5J9J7Q
7966A94jj3k4l1k6pJ6K6J8Jj6k2k1j0PK4L1K7J6RPQMlj1j5j7k0k3k0j2pj3j9j2RK7K9J7O%
$$ plain form
8089 29 31 37 47 61 76 82 76 63 50 36 19 2 -4 6 32 61 80 90 93 92 87 80 70 58 50 52 66 85 103 117 127 134 139 147 162 179 191 193 193 194 197 200 199 192 177 152
8071 152 126 108 104 113 129 142 149 151 154 160 158 145 128 116 113 111 106 100 104 124 158 197 229 244 244 239 230 212 187 163 145 129 111 99 100 114 131 148 167 186 198 197 186
8053 186 166 130 79 23 -24 -60 -87 -103 -104 -93 -83 -77 -71 -57 -37 -15 6 29 54 78 98 107 102 88 75 73 83 99 116 130 139 140 138 139 142 140 127 107 87 73 65
8037 65 60 55 49 41 30 16 4 0 4 14 23 24 17 1 -21 -45 -60 -58 -37 -11 8 19 31 49 73 95 110 115 114 110 111 118 126 128 126 131 146 167 178 170 145 111 76 43 14
8019 14 -7 -17 -14 -8 -10 -23 -38 -44 -35 -10 24 63 101 134 159 176 183 177 162 145 133 127 129 137 153 174 191 200 201 197 187 165 128 80 30 -11 -36 -44 -39 -28 -15 0 13
8002 13 25 30 24 12 2 3 10 12 4 -7 -12 -5 9 27 48 71 89 96 95 92 89 79 60 34 16 13 27 48 68 84 107 147 199 244 267 274 282 300 320 334 336 322 295
7984 295 260 229 206 189 172 157 147 142 140 137 132 127 124 126 134 145 159 173 189 205 218 226 234 243 252 258 264 269 271 264 251 235 222 214 211 210 206 194 172 148 134 135 150 169 186 194
7966 194 193 180 156 125 99 92 108 134 152 153 137 115 94 84 91 115 146 173 189 198 205 213 217 214 203 188 171 151 128 108 96 89 76 57 45 54 81 110 127 133 133
7949A33%jlmnkJPJ3J7J5J0NKKK%jmqj9k9l8l8l1j8kJ0J2ROQROKLPJ1RLpj9k8k7j4%PJ1K1L7
7929H0M3L3J1moMJ5J9J0nj7k3j8pOJ9K4J8%j8k8k6j5pkKOJ1Rnj7k2j3lJKOJ5K2K5J9J1%j1
7912A64k1k9k9k2rJPJ1J4RJo%RRKnj0j4k0j8mJ1J8J0jmLJ0Rlj7k5k4k4k5k3j3JJ2J9K0J6J0
7894B0Ljjoj3j2kJ1J3RLOJ6J8J3MmqqkOQNkmmmoqomklMJ1J5RJlmj1k6l7l5j9JRRPJ0J3J5K2
7873B6L1L9L8K8J9J7J7J3QLKKJJJJjKPPok2k4j1KLoj2j5j7j7j4rqlLJ1J2Noj8k7k5j0RJ4O
7854G7jOJ6J4jj4k0j4nK%pj2j0m%JNJ0J1Lj0j7j4jJ4J8J1kj1pNJ6K0J5Lqj0nJML%mj0qJJ3
7835G4J7J4RO%j2k7l8l9l0j6MK0K4J8MnomlmjJMOLoj4j6j0lkj2j9j6nPJ5J3RORJ2J3Nkook
7815a1NJ2K3L4M1M0L2J9QjmkK%oj4j9j9k1k4k4j0NJ0ok4l3k8j7nPJ3Oj1l1l7k8rQK0K6K5K2
$$ plain form
7949 133 133 132 129 125 120 118 119 126 139 156 171 181 186 188 190 192 192 191 187 179 160 131 93 55 24 6 4 14 26 35 41 49 58 64 66 69 76 87 96 99 92 73 45 18 4 4 11 22 43 80
7929 80 123 156 167 163 157 161 176 195 205 200 183 160 142 135 141 160 184 202 202 184 156 130 115 108 106 108 114 125 134 129 112 90 77 74 75 77 83 98 120 145 164 175 175 164
7912 164 143 114 85 63 54 55 62 73 87 96 97 91 91 100 109 111 106 96 82 62 44 40 51 69 79 78 74 77 87 96 93 76 51 27 3 -22 -45 -58 -57 -45 -26 -6 10 20
7894 20 23 22 21 15 2 -10 -12 -1 12 21 24 30 46 64 77 81 77 69 61 59 65 73 78 76 72 68 64 58 50 44 40 38 35 39 50 65 74 75 72 68 57 31 -6 -41 -60 -59 -50 -41 -34 -24 -11 4 26
7873 26 57 96 134 162 181 198 215 228 236 239 241 243 244 245 246 247 246 248 255 262 256 234 210 199 201 204 198 186 171 154 137 123 114 106 103 106 117 129 134 128 110 83 58 48 57 71 77
7854 77 76 82 98 112 111 97 77 63 58 60 60 53 41 31 27 27 28 33 43 54 57 47 30 16 15 29 47 58 56 45 38 43 59 79 94 97 89 79 74 75 79 82 82 78 68 60 61 74
7835 74 91 105 114 120 120 108 81 43 4 -26 -42 -38 -18 6 24 28 23 17 13 10 6 5 6 10 16 19 13 -1 -17 -27 -30 -32 -44 -63 -79 -84 -77 -62 -49 -40 -34 -25 -13 0 5 3 -3 -9 -11
7815 -11 -6 6 29 63 104 144 176 195 203 202 198 196 198 198 192 178 159 140 119 95 71 61 66 76 70 46 13 -15 -32 -37 -30 -17 -11 -22 -53 -90 -118 -127 -119 -99 -73 -48 -26
7798b6J3MMQJ7K2K3K0J3MmlOJ0Mj3k5k9k2qJ1K4K9K3J3RQPM%jJNPMJloj1j4j0l%nqlQJ1Kj4
7778A07k5k7j8jJ7L0L2K4Rnj0oPJ3Ppk2k7k3j3%J6L2L9L4J9Mj1k1k8k4j4nmpnlnj0j4j1%J5
7760E9K6K7J7PPJ6K0J5MjKJ0J6J8J0mj8k3k1j7pNJ4J5J1Nlj5k7l0k6k5k5k7k2j2%J2K4L1K8
7744I6K2J5J2Qjrj3j0lMJ0J2J0Njkmrj5j5rJLkj1j9k6k6j5PK4K7J5%j1j4rjMORJ2J1OLRK0
7725A26K7K4J4LKJ1J9J6jj9k1rNQOKmj1j6j5j4j6k1k3j7pjNOQNlj0j4j0jNMklRK2K8J9Opj5
7706A20j5j1j0j6k7k8j1J2K1J5Kpj3j6j7j7j6j6j8j2%J8L3M0M0L5L4L5L3K5J5%j4k8k8j5%
7691A43QPLkmmoqj0j0pjLQRLpj5j1%PN%qj5j5mRK0K6K8K5J6NKNQPPNok6m5n1m5l5k4j0QK3
7671B1L1K4Oqj2pjRK3L5L4J5oj7j7rjPOkj4k0j5mOR%j5k5k7k2j3kRJ5J9K0K5K5J6Krj2j2q
$$ plain form
7798 -26 -13 -9 -5 3 20 42 65 85 98 102 98 95 101 111 115 102 77 48 26 18 29 53 82 105 118 127 135 142 146 146 145 146 151 158 162 163 160 154 143 129 119 116 116 111 103 100 108 119 121 107
7778 107 82 55 37 36 53 83 115 139 148 143 133 127 134 147 154 147 125 98 75 62 62 78 110 149 183 202 206 195 174 146 122 108 103 99 92 87 84 79 69 55 44 44 59
7760 59 85 112 129 136 143 159 179 194 198 197 199 209 225 243 253 249 231 208 187 170 163 168 182 197 208 213 210 195 168 138 112 87 62 35 13 1 1 13 37 68 96
7744 96 118 133 145 153 152 143 130 120 117 121 131 143 153 158 157 155 151 142 127 112 103 104 107 105 94 75 49 23 8 15 39 66 81 81 70 56 47 46 50 56 65 77 88 94 97 106 126
7725 126 153 177 191 194 196 207 226 242 241 222 201 192 197 205 211 213 209 198 182 167 153 137 116 93 76 69 68 73 79 87 92 89 79 65 55 54 59 63 61 58 67 89 117 136 142 135 120
7706 120 105 94 84 68 41 13 2 14 35 50 52 45 32 16 -1 -18 -34 -50 -68 -80 -80 -62 -29 11 51 86 120 155 188 213 228 228 214 186 158 143 143
7691 143 151 158 161 159 155 151 145 137 127 117 110 109 112 120 129 132 125 110 99 99 106 111 111 103 88 73 69 78 98 124 152 177 193 198 200 205 213 220 227 232 226 200 155 104 59 24 0 -10 -2 21
7671 21 52 76 82 74 62 55 54 63 86 121 155 170 164 147 130 121 120 127 133 131 117 97 82 78 84 93 93 78 53 26 4 -9 -11 -2 13 32 52 77 102 118 120 111 99 87 79
7653G9KJ8K8K2Qj%QJ1%k1l8m4l8k8j9j3pk%OJ7K9L7L1J2pj9j2LJ7J9J0Jmoqj1j0pmklmkJJ
7634E0jqj4j4qkKNJ1K5M1M5L6J4oj8j8j2rj6k7l1k8k0j7j0LJ5J8J7J7K0K4K6K9L4L4L0K2J3
7618B72PJoj3k1k6k9k6j8nQJ7K0J5Noj9k8l0k2j1OJ7J6Jj7k5j9j2j5k0j8pPJ5J7J1NMJ3K6
7602I0L3K7J4%qqjQJ1Ojqj5k4k9k4j6j1rj0j1j1pjOPL%MJ2J9J9J6PlrnKPJ0J1QNMPLlj0j3
7582A02j6j9j5kJ0J1Joj0pmKPLoj6j6nJ2L1M2M0K5Lk1l7m0k6mJ0J1OLJlpjRJ7J4Qlj5k8l0
7564C1j8JJ7K4K8L6M0L5J8kj6j9j5rmklqj2j4j6j6j5j0poj0j1nMJ0Q%nmNJ1J1O%JPJ5K3K5
7546A29K3K0J6J5J3J2RJoomqk1l0l1k6k1j3mNNKKQJ1J3J7J9J7J2J1J1Qkrj0pnkKJpj5j5pk
7527A31j1k7m0l9k7rPJ2RPRJ4J8J5RLKLNOLkj0j1o%OQJ0J0J1J1Qkj8k7k1nJ0J8K1K5K6K0R
$$ plain form
7653 79 81 99 127 149 157 156 156 164 175 175 154 116 72 34 6 -13 -26 -33 -35 -35 -29 -12 17 54 85 97 90 71 59 62 79 98 108 109 105 99 91 80 70 63 59 57 54 50 48 49 50
7634 50 49 41 27 13 5 3 5 10 21 46 87 132 168 182 176 158 140 128 119 103 76 45 17 -3 -20 -30 -27 -12 6 23 40 60 84 110 139 173 207 237 259 272
7618 272 279 280 274 261 240 214 185 159 141 136 144 161 181 196 201 195 176 148 118 96 85 91 108 124 125 108 83 64 52 37 17 -1 -8 -1 14 31 42 47 51 64 90
7602 90 123 150 164 164 156 148 147 155 166 172 171 163 148 124 95 71 55 44 35 25 14 3 -4 -5 1 8 11 11 15 27 46 65 81 88 85 76 71 73 80 90 101 109 114 118 125 128 125 115 102
7582 102 86 67 52 50 60 71 72 66 56 49 45 47 54 57 51 35 19 14 26 57 99 139 164 167 146 109 69 43 39 49 60 66 69 70 67 60 59 68 85 99 107 104 89 61 31
7564 31 13 14 31 55 83 119 159 194 212 210 194 175 160 151 147 145 142 134 122 108 92 76 61 51 44 38 28 17 12 16 26 34 34 29 25 30 41 52 58 58 59 66 81 104 129
7546 129 152 172 188 203 216 228 237 238 232 226 222 214 193 163 132 106 85 72 68 73 78 80 82 90 101 114 131 150 167 179 190 201 209 207 198 188 181 176 174 176 177 170 155 140 133 131
7527 131 120 93 53 14 -13 -22 -15 -3 6 13 22 36 54 69 78 81 83 86 91 97 100 98 88 77 71 71 77 85 95 105 116 127 135 133 115 88 67 62 72 90 111 136 162 182 191
7509A91kj2k1k4k4k4k3j5kPMqk2k8k4j2kRK4M3N7N2K7jj6j8j4j0qj1j4j0jJ2K1K2K3J4kk6
7493A32m2l7j3J7L9M2K4%k1k8k0mJ3J6Orj4j3j4j8j9j4q%OROJMJ6K5K2Qoj6j9j4kPO%nnnn
7475D8jLOQRJ1Mj1k6k5lK3L8L4J8%j0rjNkj4k6k4j4kOJ0J1Mpj4rJOKqj6j6j1j0j5j7j4kNJ
7456e4n%J5K3K2K0K5L3K9J3oj3j1mNJ2J7J3OOJ6K8L0J8%j6k9l4l0j5MJ3RkrpLJ2J7J5J3J8
7439B00K2J6Jj6k3k0j2mkoj1j5j6j2kJ5L2L9L4K0RJnqrrj0j1j4j9k4k4j6nJkm%OJ0Nok1k8
7422E7k8j8rnqq%J1K1K6K3J4KoqjJ1K4K9K5J2Kmk%nj8l0l1k3j2ponMJ2J0Jj2j7j3kJ2K5L1
7404G4L0J5nj5j3pqj7k5k5j2KJ3J7J3Pjrj3pOJ8K2J7OJ%OJ2J3RKkjLPJ3J9J9J0jj0j7k1k4
7386A21k4k0j5j4j3q%J3K1K2J0nj8k7l1k8k0j3j5k1j5NK4K7J4%mmj%LJ0J8K1K0J5J0J0J1J0
$$ plain form
7509 191 189 177 156 132 108 84 61 46 44 51 55 47 25 -3 -27 -39 -41 -32 -8 35 92 144 171 170 154 136 122 112 104 93 79 69 68 80 101 123 146 160 158 132
7493 132 90 53 40 57 96 138 162 162 141 113 93 89 102 118 124 115 101 88 74 56 37 23 15 15 21 30 36 37 41 57 82 104 112 106 90 71 57 55 62 68 68 63 58 53 48
7475 48 47 50 56 64 73 84 88 77 51 26 23 46 84 118 136 136 126 117 116 121 119 105 79 55 41 39 45 55 66 70 63 49 40 41 47 49 41 25 9 -2 -12 -27 -44 -58 -60 -55 -54
7456 -54 -59 -59 -44 -21 1 21 46 79 108 121 115 102 91 87 92 104 121 134 140 146 162 190 220 238 238 222 193 159 129 114 118 131 140 138 129 122 125 137 154 169 182 200
7439 200 222 238 239 223 200 180 168 164 162 156 145 130 114 102 100 115 147 186 220 240 249 250 245 237 228 219 209 198 184 165 141 117 101 96 97 95 91 91 97 107 112 106 85 57
7422 57 29 11 2 -3 -11 -19 -19 -8 13 39 62 76 78 72 64 63 74 98 127 152 164 166 162 160 160 155 137 107 76 53 41 34 28 23 27 39 49 50 38 21 8 6 18 43 74
7404 74 104 119 114 99 86 79 71 54 29 4 -8 -6 7 24 37 44 43 34 21 14 20 38 60 77 83 84 84 90 102 115 124 126 124 123 126 133 146 165 184 194 193 183 166 145 121
7386 121 97 77 62 48 35 27 27 40 61 83 93 88 70 43 12 -16 -36 -49 -64 -85 -100 -95 -71 -44 -30 -30 -34 -38 -39 -39 -36 -26 -8 13 33 48 58 68 79 89
7370H9NKkopooj3k0j9mRJ1N%LPROkj4j9j4%Nmj5j3kRRKqj2lJ8L6M0K8J2JnnJPRNJJL%nlJ2
7348A38K8L3K3Lj7l0k8j3OJ1Kj2j4kJ2K0J8J3Qjj1j9k1k5l4m2m2k9j7rplLJ3K0K7L1L0K5K2
7332A10K0J9J7J4J1Okj1k0k6k8k6k1j5rmJMJ1K0L0L0J5oj9k5k6k3j5lLJnroLJ5J9J4ONQJ0
7315I3QQJ7K3J5nk0k2j8j6j6j1%J3J9J8J7J2Njnnmpj4k1k3k4k3j8j2nJORQOLMPQOjmjMQMk
7295D4olKJrk1k4j6nLPJ2K0K5J9Mj4k3k0rJKj0k7l8l4j8PK9M1M0K5J0lpn%%%npJJ0Rjj3j6
7276b2qOJ8K7L2K8J6NLKlj3j9j6oOJ4J1jj4j6oKJqj0oLPRJ6K1K1J8J5J8J9J3%j1j5j3j1rk
7258A22QK1K7K7J5%j2j5rj0k0k7j7QK6L0K0Qoj7k2j8qlljOJ4J9J7J3J0J2J8J7Nj4k5k2j3p
7242A74pqj2j6j4o%kqj1lNNmj3j7j2kJ6L0L6K5Rmnpj1j4j2qj1j4j3lLkrq%RJ1Pkrj1nKJnl
$$ plain form
7370 89 94 96 94 88 81 75 69 56 36 17 13 22 33 38 38 41 48 57 63 61 47 28 14 14 19 15 0 -13 -15 -6 3 5 -3 -15 -18 0 36 76 104 116 117 112 107 108 115 124 129 130 131 134 134 129 126 138
7348 138 166 199 222 225 208 178 150 137 143 154 156 144 130 128 140 160 178 191 199 198 187 168 147 122 88 46 4 -25 -42 -51 -58 -61 -58 -45 -25 2 33 63 88 110
7332 110 130 149 166 180 191 197 195 184 164 138 110 84 63 48 39 35 36 40 51 71 101 131 146 140 121 96 70 47 32 29 32 33 28 19 13 16 31 50 64 70 75 83 93
7315 93 101 109 126 149 164 159 139 117 99 83 67 56 56 69 88 106 123 135 140 139 134 129 125 118 104 83 60 36 13 -5 -17 -22 -21 -15 -6 2 8 11 15 22 30 36 35 31 30 34 42 46 44
7295 44 38 35 37 38 29 8 -16 -32 -37 -34 -27 -15 5 30 49 53 39 16 -4 -13 -12 -10 -20 -47 -85 -119 -137 -130 -101 -60 -20 5 15 12 5 0 0 0 0 -5 -12 -11 -1 8 7 -6 -22
7276 -22 -30 -24 -6 21 53 81 97 102 105 107 104 91 72 56 50 56 70 81 80 66 50 44 46 47 39 29 23 26 33 42 58 79 100 118 133 151 170 183 183 172 157 144 133 124 122
7258 122 130 151 178 205 220 220 208 193 184 174 154 127 110 118 144 174 194 202 196 179 157 139 131 128 125 124 130 144 163 180 193 203 215 233 250 255 241 216 194 181 174
7242 174 167 159 147 131 117 111 111 109 101 90 87 92 97 93 80 63 51 49 65 95 131 156 165 161 156 149 138 124 112 104 93 79 66 63 66 64 55 47 47 56 67 74 72 63 52 47 49 50 45 42
7221D2J1K4K1Mj4k3k3k4k0j3MJ9L0K9K0Nnpjlj2k0rJ5L2L3K0J1OJj0k3l1l0k0lJ4K1J7PK%
7205I7JMN%oj4j4j4j1qkNKoj3r%PQJoj0lRJ5PJPK3L1K4Qlj0j6k2k4k2j4JJ4J3KkJ3L2L9K5
7185A65Mqj2j4j5j0lkj7l9m9m0j5NJ5J7J5J4J4J4J7J8J3KmppnLJ6K7L0K7J7Lm%J5K5J8Jj3
7168B31k0k1j8j4j0nkKJoj1pJMJmmKPJ5K0J8Plqrj4k0j9j1LJ1RKnrqqj1j3j4j0kLL%pj4k0
7149A3j8qPJ6J7Opj6k0k4k7k3j3%QPJKMNMLJ0J6J9J7J3J6K0K2J7%k0l0k8k1k0j4lJ2J6J4J3
7131FK1L1L2K8K1J0jro%JJLLkj2j7j3mLLJNJ0J1Jj4k2j7p%KQJ3Rql1m4l1jK8M0L2K4K4L0K5
7113A87J3Joj2j2nLJrj3pLOMkj1j5j3mLNORJ1RMjkmnkmrj8k4k3j4lMNJ%JJnromqj3j2jJ4K3
7091C8K4K4K2J9J0jrpmnj1j0kJ1J3Ojoqj1rKJ5K2J8Lj1j8j4nKLnj7k8k8j7lPROPRRQQJ1J4
$$ plain form
7221 42 53 77 98 102 88 65 42 18 -2 -15 -11 8 38 67 87 92 87 80 79 76 64 44 35 50 82 115 135 146 152 153 143 120 89 59 39 36 50 71 88 95 97 97
7205 97 98 102 107 107 101 87 73 59 48 40 38 43 45 39 26 17 17 24 32 33 27 17 14 23 38 45 46 53 76 107 131 139 136 126 110 88 64 42 28 29 43 56 58 56 69 101 140 165
7185 165 169 161 149 135 120 110 107 105 88 49 0 -40 -55 -50 -35 -18 -3 11 25 39 56 74 87 89 85 78 71 66 69 85 112 142 169 186 189 185 185 200 225 243 244 231
7168 231 211 190 172 158 148 143 141 143 144 138 127 120 121 125 126 122 118 120 127 142 162 180 187 184 176 167 153 133 114 103 106 117 126 128 123 114 106 98 87 74 60 50 48 51 54 54 47 33 13
7149 13 -5 -13 -6 10 27 33 26 10 -10 -34 -61 -84 -97 -97 -89 -82 -81 -79 -75 -70 -66 -63 -53 -37 -18 -1 12 28 48 70 87 87 67 37 9 -12 -32 -46 -49 -37 -21 -7 6
7131 6 27 58 90 118 139 149 148 139 133 133 134 135 138 141 139 127 110 97 93 96 99 100 105 115 126 127 113 91 74 67 67 69 77 90 99 91 60 16 -15 -16 12 52 84 108 132 162 187
7113 187 200 201 195 183 171 166 169 170 161 148 141 144 150 154 152 141 126 113 109 112 117 123 132 143 152 156 155 153 149 144 142 138 129 111 87 64 50 47 51 56 57 57 58 59 54 45 39 35 27 14 2 1 15 38
7091 38 62 86 108 127 137 136 127 120 116 111 100 90 88 99 112 118 117 111 103 92 83 85 100 122 140 143 132 114 100 95 97 100 95 78 50 22 5 2 9 18 24 31 40 49 57 65 76 90
7072I0J0%j1j3rj2k1l0k5j2lkmLQNmqkQJ4J5J7K4K9K6J6Qkj5l0k8pK4M0L3J0qj9k0j3jJ0J4
7054A05J7J8J7J1jrj2j0rj0j3j9k3k7k7k2pJ2K3K4J9J7J8J4Mnrj2j4j5j2j1rkJ6L6N1N4M5
7038B23K9J0nj5j9k4k3j9j1qrqlMJ2J7K1K2J8Pjkjlj0j6j3nJkj3k6l3l3k5j1lmj3k1k3j7m
7021e9J1K2K0J2PMJjkLNMLJ1K2K5J0j1k6k7k0oQK2L0L0K0J4J1J2J1Loj1j1pklrj7j9j2JJ2
7003H5J4Npj9k1j9j1%J3K4K4J7Ooj5j7j0llj3k0j8j0lOJ5K6L0L2K7J8Krj3j2rqn%Jjqj3j2
6986F0kJ3K1J3jnPK0K2J5Njm%OQjj1j8k0k5k9l1k8k3j5jJ0J4QPRJ4J6J5J3J1QNjrj4j3j0j2
6968D6k1k9l0j5NJ9K4J9J4Okpnjpj8k9k2rkkLJ5K4J6JqnJNPRJ1OkmPK5L5K7Oj0j1kMNOJ2K0
6948A37K5J6jk2l8l9l2j7nMPOLj%LPJ0Olj1j4j1qkRK0K0J1nj8k2j6nJmj4j8rMRJ4K3L6M0L4
$$ plain form
7072 90 100 100 89 76 67 55 34 4 -21 -33 -36 -38 -42 -39 -31 -26 -30 -38 -40 -32 -18 -3 14 38 67 93 109 117 115 100 70 42 35 59 99 132 142 134 115 95 82 81 91 105
7054 105 122 140 157 168 167 158 146 136 127 117 104 85 62 35 8 -14 -21 -9 14 38 57 74 92 106 110 105 96 84 70 55 43 32 23 21 37 73 124 178 223
7038 223 252 262 257 242 223 199 176 157 146 138 129 121 118 122 134 151 172 194 212 219 218 216 215 212 202 186 173 168 169 167 154 128 95 62 37 26 23 19 6 -15 -38 -55 -59
7021 -59 -48 -26 -6 6 13 17 18 17 15 18 23 27 30 41 63 88 98 87 61 34 14 8 16 38 68 98 118 132 143 155 166 169 163 152 141 134 132 129 120 103 84 72 73 85
7003 85 99 104 97 78 57 38 27 27 40 64 88 105 111 105 90 73 63 60 57 44 24 6 -4 -7 -1 14 40 70 102 129 147 149 140 127 115 106 98 93 93 94 93 85 72 60
6986 60 58 71 92 105 104 99 106 126 148 163 168 167 163 163 169 177 176 165 147 127 102 73 42 14 -9 -24 -25 -15 -1 7 14 23 37 53 68 81 92 100 105 104 95 81 68 58 46
6968 46 25 -4 -34 -49 -44 -25 -1 18 32 38 36 29 24 23 16 -2 -31 -53 -62 -64 -66 -63 -48 -24 -8 -7 -15 -20 -19 -14 -7 2 13 19 17 13 20 45 80 107 113 103 92 90 94 99 105 117 137
6948 137 162 178 177 155 117 78 46 29 24 28 35 41 44 43 43 46 53 63 69 66 55 41 30 22 20 29 49 69 80 75 57 35 19 14 15 11 -3 -21 -30 -26 -17 -3 20 56 96 130
6930A30K2J0kj0j2okkrj6k3k7k2rRK2K3J7J1QQRQRPLkqj4k3l1k9j2J5L3L5K4J2NKkj1k4l8
6912H8m2l1j0J2K9L6L6K8J6J0PMjmlj%%KLOQRJk2n0o3n2k6rloj2j3j0%J3K3K6K3J6NkKJ3K1
6893G7K2J9J6J1OMQJ1Q%pj2j4j6j2poj1j5rMJ4J8J5J3J1J0J2J3J1N%%Jmj2j7j8k3l0l1k1p
6876C7OJ2J1MlnkLJk%PJ1Mj0k0j6mQJ1RQJ0J6J7J2kj6k2k1j1jLKoj2j3j1nlKJ0K2L0K7K0J3
6857A31Noj5j4mNJ2J4J5J2NjopmNJ7K5K6J8J0lj6k2j8qJ%mokOJ4J6Pmj1pj%pj7j8j2l%npj
6838A15NOoj7k1j4mNRJ3J9K1J7OmpJOPL%moojKLKKKJJJJJPJ1Opj8j4kROmj4k2k0j5rj0j3j7
6816C3j6j3j1rKJ3J7J0jnnrj5k0j4KK0K9L1K3J4J1J4J5R%mpj2j9k1j5j2j6k2k6j9oQK1K8K6
6799B9J4kj5k4k2rJ0K6L4K9J6LljPJ4J5Q%nk%lj1j2oKK%knj3k3k2r%J%LJ4K1J7QKJPJ1J1P
$$ plain form
6930 130 152 162 160 150 138 132 130 128 119 103 80 53 31 22 31 53 76 93 104 112 120 129 137 146 153 156 154 146 132 109 78 49 37 52 85 120 144 156 161 163 161 150 126 88
6912 88 46 15 5 17 46 82 118 146 162 172 179 183 182 178 175 174 174 174 176 179 185 193 202 203 181 131 68 16 -10 -19 -22 -28 -40 -53 -63 -63 -50 -27 -1 22 38 43 41 43 56 77
6893 77 99 118 134 145 151 155 163 174 182 182 175 163 149 133 121 114 108 97 82 73 77 91 109 124 137 148 158 170 183 194 199 199 199 200 196 184 167 149 126 96 65 44 37
6876 37 43 55 66 70 67 62 60 63 64 62 62 69 80 84 74 54 38 34 42 53 62 70 80 96 113 125 123 107 85 64 53 52 55 57 51 39 26 15 10 7 9 19 41 71 98 118 131
6857 131 136 130 115 101 97 102 114 128 143 155 160 159 153 146 142 147 164 189 215 233 243 240 224 202 184 176 177 177 173 167 165 171 185 201 208 204 193 186 185 185 178 161 143 131 128 128 123 116 115
6838 115 120 126 120 103 82 68 64 69 78 91 110 131 148 154 150 143 144 150 157 160 160 156 150 144 143 145 148 150 152 154 155 156 157 158 159 166 177 183 176 158 144 142 151 157 153 139 117 97 82 73 63 50 33
6816 33 17 4 -7 -16 -14 -1 16 26 25 20 15 6 -9 -29 -43 -41 -21 8 39 62 76 87 101 116 125 125 121 114 102 83 62 47 35 19 -3 -29 -48 -54 -46 -25 3 29
6799 29 43 41 26 2 -20 -29 -19 7 41 70 86 89 86 85 92 106 121 129 129 124 122 122 119 108 96 90 92 94 94 92 87 74 51 29 20 20 21 21 24 38 59 76 84 86 87 94 105 116 123
6780A23Klnqj5k5l2k5rNJ4K1K7K3NqnOQJkKNJljKmqpmpj0oJ0K1K1J2Lqj4j3pmlmnpj0j1j6
6759B3k4l1k1jJ6K0J7J0KokJ3K6K5J6J2P%qoLNlj2j0kPJ1J2J3J2J1QKkoqqoLJ6K4K2J4Pkj4
6740A85k5k7j7%J3J3PKPJ5J5PjjLLkoj0j2j7j9j8k0k5k8j6PK7L4K8J5Knn%PRNkqj1pOK1K9
6722A78K2Mj2j9j4lK%j3k7l2k3oJ3J7J0%ljjqj2j2qkPJ7K4K9L4L7L6K3Qlqj4j9j9j1orj4j7
6704A45j4j0qj1j6j8j1llj7l3l3k1nMPJ4K3K7K4J2Krj7k2j8j0MJ5J7K0K1K2K2K2K7L8M5M6
6689B78L8K4Mj5l0m0n1o1o6n8l4oJ9K8J8jj2j0KJ6K9M1M6L8J7ok0k7l4m2m6m2l5j9%J7L0L7
6673B7L9L2K0Olpj2j3r%J0J6J1jj0j0jPRPJ1K1K9K0lk9m5m4l0j6rojJ4L0L7K6Prj2kQRKqj5
6655A03k3l1l6k9j0J5L7M8M7L3J4joKJ3J2nk3k9k0oKK%loqj2j7j9j7rMJ5K2J6MnlONoj9j9
$$ plain form
6780 123 125 122 117 109 94 69 37 12 3 8 22 43 70 93 98 90 85 91 99 100 98 100 105 106 103 102 104 100 92 85 81 74 64 58 68 89 110 122 125 117 103 90 83 79 76 72 67 60 50 39 23
6759 23 -1 -32 -53 -54 -38 -18 -1 9 11 5 3 16 42 67 83 95 102 102 94 88 91 96 93 81 71 69 76 87 99 112 124 135 143 145 143 137 129 121 115 118 134 158 180 194 201 199 185
6740 185 160 133 116 116 129 142 149 151 158 173 188 195 194 193 196 199 197 191 181 169 152 133 115 95 70 42 26 33 60 94 122 137 139 134 129 129 136 145 150 148 140 129 122 128 149 178
6722 178 200 204 192 173 159 156 158 158 145 118 86 63 57 70 87 97 97 94 93 92 84 72 60 52 50 57 74 98 127 161 198 234 257 265 262 254 240 221 202 191 185 176 162 145
6704 145 131 121 113 102 86 68 57 54 51 34 1 -32 -53 -58 -54 -47 -33 -10 17 41 53 55 46 29 7 -11 -21 -17 -2 15 35 56 78 100 122 149 187 232 278
6689 278 316 340 344 329 299 259 208 147 81 23 -11 -17 2 30 48 47 35 25 27 43 72 113 159 197 214 208 188 161 127 85 39 -3 -38 -57 -57 -40 -10 27
6673 27 66 98 118 124 121 114 102 89 80 80 90 106 117 116 106 96 95 102 111 118 129 150 179 199 196 167 122 78 48 32 23 17 16 30 60 97 123 130 121 109 107 115 124 126 118 103
6655 103 80 49 13 -16 -26 -11 26 74 121 154 168 167 161 163 176 188 183 160 131 111 105 107 109 109 106 100 92 80 63 44 27 18 22 37 59 75 79 74 71 77 82 76 57 38
6637C8pQJ2QNQJ4J2Jj2j8j8k0j8pJ5L4M0L4K3Roj5j7j7j9k2k2k1j9j2%J3J8J5J1J3J4J1O%
6621I2oj2j7j9j3nLNQJ3J7J3jj5j9j4j0j1qNJ9K1J1nj5j6q%KKjmj2j9j8nJ2J6Opj2oQK1K4
6603B0K1J2%j0j7j8j4j3j1n%%JJ0K6M0L5K3J3J0J1RRNjrqOJ9K0Ppj1qoj0j4j6j5j3rjJ1J9
6585A11J7J1NLQJ3J7J0jqrnmqj7k6l6l7l3k7k8k9k1lJ6K8K7J8NprnkKOJ5K0J7Jj9l1l2j7L
6567f1J7K0K0K2K8K8K2J2Kpj0j0onj1j6j5qKQJ1J2J1RQOKqk4l5l2k0oJJj%%KLjprmPJ6K6L4
6548C4L7L2K1J1kj6k4j9pkqj7j7j3j2j5j3mOJ5J9K0J4Mqj7k5l1k9j6jJ3K3K5K0J1LLQJ5J8
6532E6J5J2QJrj2kJ8L0K3kk2k6j0J0K2J8Pmj3k4m2n5n2l3j1kjNJ9L0L0J7MjJJ0J7K1J8Qnp
6514F7OK0K1Pormkqj6j9j5pKONkppjJ0J8J7QKLLnk0k7j9nQJ3J3Mqk0k6k3j6kK0L5M0K9J0j0
$$ plain form
6637 38 31 39 51 59 64 72 86 98 99 87 69 51 31 13 6 21 55 95 129 152 161 155 140 123 106 87 65 43 22 3 -9 -9 4 22 37 48 61 75 86 92 92
6621 92 86 74 57 38 25 20 23 28 36 49 66 79 78 63 44 30 20 9 1 6 25 46 57 52 37 21 13 13 15 17 16 12 0 -19 -37 -42 -30 -14 -8 -15 -27 -33 -25 -4 20
6603 20 41 53 53 43 26 8 -6 -19 -30 -35 -35 -35 -34 -24 2 42 77 100 113 123 134 143 152 157 156 147 139 145 164 184 191 184 173 165 159 149 135 119 104 91 82 81 92 111
6585 111 128 139 144 147 155 168 185 195 194 186 177 172 168 160 143 117 81 44 11 -16 -44 -73 -94 -97 -81 -53 -26 -8 -3 -10 -19 -24 -26 -24 -18 -3 17 34 35 16 -15 -47 -64 -61
6567 -61 -44 -24 -4 18 46 74 96 108 110 103 93 83 77 72 61 45 30 22 24 32 43 55 66 75 83 89 91 83 59 24 -8 -28 -34 -33 -32 -33 -33 -33 -31 -28 -29 -36 -45 -49 -42 -26 0 34
6548 34 71 103 124 135 133 117 93 74 67 65 57 40 23 10 -2 -17 -30 -34 -28 -13 6 26 40 44 36 19 -6 -37 -66 -82 -83 -70 -47 -22 -2 9 12 15 23 38 56
6532 56 71 83 91 92 83 71 69 87 117 140 138 116 90 80 90 112 130 137 133 120 96 54 -1 -53 -86 -97 -99 -100 -95 -76 -46 -16 1 5 4 5 15 32 53 71 79 74 67
6514 67 73 93 114 121 115 106 102 100 92 76 57 42 35 37 43 48 46 39 32 31 41 59 76 84 86 89 92 87 67 40 21 16 24 37 50 54 46 26 0 -23 -39 -41 -21 14 54 83 93 83
6495H3k0j7qjmo%J1J7J7J4J1Lqj2qJMlj4k3k3j4lMQRJ4J8J4Lj4k6k4qRJ8J6O%jjnj1rjQJ2
6476C6QOJ0J5J7J3QKqj4j0%OLpj3j6j8j3kRJ4J4J1QMJkqj3j3rrj1j0LK1L2L0K5J6Kj5k6k4
6458G3j1KQRJrj9j7mJ2K4K8K5J4Kpj0j1j3j4j4j2j2j0kJ1K2K6K5K5K6K2J1lj7k9l7l7l0k1
6442B7j7j7j5oLJ1J7K6K8J6lj8k5k2j7j6j2%J6K4J5KmKJ0J2J3J6J9K3K3K1Qj4l8m7m4l3k3
6426c9j4nMJ3J6J3Nj%LNNMOPMJkk%MRJ6K4K7K4J0qk1k5k0j3lOJ5K2K5J9Jj9l0l1k7k7k4j9
6407d2pJ0K2K0R%%J0J3QJjJLLJ0J9K4K3J4RMJoj0j2j1j2j2j1j0rj1j5k1k1k1j3%J4K4K5J9
6390D1J1NMQJ4J5J3J5K5L1K2KqkRMqj5j1mkkMJ3K0J7Oqk6l6l6k7j7qJJ3K2K4J8J2OOQJ6K0
6372B15J4ok7m0l5k1pJPJ2J6J2Jqj0nlrj4j1lJkpj1j3j4j4j0qn%J3L0L8L1J4jqj1j7k4k8k5
$$ plain form
6495 83 63 46 38 37 33 27 27 38 55 72 86 97 100 92 80 72 73 77 74 60 37 14 0 -3 1 9 18 32 50 64 67 53 27 3 -5 4 22 38 44 44 43 42 37 26 17 16 24 36
6476 36 44 50 60 75 92 105 113 115 107 93 83 83 89 92 85 72 56 38 25 23 32 46 60 71 79 83 84 82 74 61 48 39 30 19 9 12 33 65 95 120 136 138 123 97 73
6458 73 62 64 72 81 82 73 54 37 33 45 69 97 122 136 138 131 121 110 97 83 69 57 45 35 33 44 66 92 117 142 168 190 201 198 181 152 115 78 48 27
6442 27 10 -7 -22 -28 -25 -14 3 29 57 73 70 52 27 5 -12 -28 -40 -40 -24 0 15 17 13 15 25 37 50 66 85 108 131 152 160 146 108 61 17 -16 -39
6426 -39 -53 -58 -54 -41 -25 -12 -7 -8 -8 -5 0 5 9 15 22 26 27 25 23 23 27 36 52 76 103 127 137 129 108 83 63 50 47 53 68 90 115 134 135 116 86 55 28 1 -23 -42
6407 -42 -49 -39 -17 3 12 12 12 22 35 43 44 43 44 47 50 60 79 103 126 140 149 153 154 148 138 126 115 103 91 80 70 61 50 35 14 -7 -28 -41 -41 -27 -3 22 41
6390 41 52 57 61 69 83 98 111 126 151 182 204 206 198 196 205 209 201 186 175 171 169 167 171 184 204 221 227 219 193 157 121 94 77 69 70 83 105 129 147 159 165 171 179 195 215
6372 215 229 223 196 156 121 100 93 94 101 113 129 141 142 134 124 119 116 107 93 82 79 80 78 71 60 47 33 19 9 1 -4 -4 9 39 77 108 122 121 113 102 85 61 33 8
6354Hj3kOJ0J5K1K9L7L9K7Nj5k6k4k3k4k4j3MJ9K2J8Rjj4k7k8j9nLOPPOLJ%jklmnpojPJ4J3
6335D9J1J0Olk0l0k3pML%JNNJjLJ1J4Npj3pQK1K7L3L7L7K7Qoj1j0j0j0j1j1j4j5j3mQJ7K4
6317A49K6K1J1jqj3j5j8j9j6j0lNO%oj3j6k0k3j9qjoj5k1j7rnjLPNJjRJ9K1J2%j0j5j7j4j0
6299e5j2k1l6m1l1qJ7L2L2K0RKOJ5K2J7Noj0qooJJ6L0L1J8mk1k7k5j4KJ6K3K6K5J9J4OL%n
6282G1j2j7j9j5rqj1j7j5pNJ5K0K6L4L1J5pk2k5j3MK0K5K5K4K2J6LqmJ2K8L6K9J0j4l8m8l9
6266A23j9nLOJ4K2K3J2lj6k0j9j4j2j3j3oKJ1K0K8K7J8Lpj0j0pnnqj2j2pmorj0rrqlJkj3j6
6247ApLPJ0J6K5L0K8K4K0Rmj9k3k2j7j3nOJ4J8J5Nnj4j3qjLMNJkl%MPRJ1J0Njlnpj4j5nMP
6227I5Lj%JmpmMNnj7k4k3k1j9j7oPJ5J3PNMKkjOJ3J7J8J9J8J2MlplQJ5J2jrkJ5K3J7Okmpr
$$ plain form
6354 8 -5 -7 -1 9 24 45 74 111 150 177 182 167 141 117 94 70 46 33 37 56 78 96 105 104 90 63 35 16 11 14 20 27 34 40 43 44 44 43 41 38 34 29 22 16 15 22 36 49
6335 49 60 70 76 73 53 23 0 -7 -3 0 0 1 6 11 12 11 14 25 39 44 37 24 17 25 46 73 106 143 180 207 215 209 198 188 178 168 157 146 132 117 104 100 108 125 149
6317 149 175 196 207 206 198 185 170 152 133 117 107 104 109 115 115 109 96 80 60 37 18 10 9 3 -12 -33 -50 -59 -64 -65 -62 -55 -50 -49 -50 -41 -22 -1 11 11 1 -14 -31 -45 -55
6299 -55 -67 -88 -124 -165 -196 -204 -187 -155 -123 -103 -94 -92 -86 -71 -49 -32 -27 -33 -43 -51 -57 -63 -62 -46 -16 15 33 29 8 -19 -44 -58 -56 -40 -17 9 34 53 67 73 76 76 71
6282 71 59 42 23 8 -1 -9 -20 -37 -52 -59 -54 -39 -19 7 41 72 87 80 58 33 20 24 44 69 94 118 140 156 159 151 147 159 187 223 252 262 248 210 162 123
6266 123 104 99 102 108 122 144 167 179 176 160 140 121 107 95 82 69 63 65 76 96 124 151 169 172 165 155 145 138 133 128 120 108 96 89 85 79 70 60 51 42 34 31 32 30 17 1
6247 1 -6 -3 4 14 30 55 85 113 137 157 166 162 143 120 98 81 68 63 69 83 101 116 121 116 102 89 81 80 83 87 92 93 91 88 88 92 99 108 119 129 134 133 130 125 118 104 89 84 88 95
6227 95 98 97 97 98 94 87 83 87 92 87 70 46 23 2 -17 -34 -40 -33 -18 -5 2 7 11 13 11 10 16 29 46 64 83 101 113 117 114 107 104 112 127 139 138 129 127 142 165 182 188 186 182 175 166
6207A66j3j2j2qjJ0J4J3Lpj8k5k7k0j2oooMJ6K3J8Pjpj5k1k2j7rrj3j6j3ooj4k5k6rJ9L9L9
6189c1K6J2J2J8K1J6OklJJlrj2rolnrrlJ1K2K0J0NRJ3RkrmOJ1J3J5J7J7J1ORJ8K0J3NOJ4J8
6170B92Pj5l4m0m0l8l3k0kQOlpmLQJ0J2Pjqj1qoonnj0j5j4mNJ4J7J7J1kj5k4k2rJ1K4K5J4
6152I0kj2j0n%KjkjJMOKoj1oOJ5J4Moj2j4j1kRJ1Olqo%J1K0K1J6J1J5K5L1K8K0Rkj1j2rpj1
6132B07j6j4rmmoj4k9m6n3m3k2JJ7K5K1J4%j0j3q%QJ7K2K7K8K5J4JopmLJ3K3K5J4mj3j2nr
6115A54j8k4j8pNJ1J2RKorrj3k1k6j7%J5J8J2PJ1J9K4J7PkmjlonJJ2K3L2L0J8%j3k1k6k8k3
6098A39j0PJ3PmqkNOkj3k5l3l2j8JJ5J7J3J3J5J3Okoj0rpnj1j9j9nJ3J9J5Moj1j1kJ0K0K3
6080A04K2K1J2jj6k5k3j4lMPPM%%PJ3J2LnkKLkmoj4k4l0k7j6kJ4K6K9K5K5K1Roj5pOJ1Mj2
$$ plain form
6207 166 153 141 129 121 120 130 144 157 160 153 135 110 83 63 51 45 39 33 37 53 76 94 101 100 93 78 57 35 18 9 0 -13 -29 -42 -48 -54 -68 -93 -119 -128 -109 -70 -31
6189 -31 -5 7 19 37 58 74 80 78 75 76 77 74 65 53 44 38 35 30 21 12 9 20 42 62 72 77 86 99 108 106 97 93 99 110 123 138 155 172 183 189 198 216 236 249 254 260 274 292
6170 292 299 284 250 210 170 132 99 79 77 85 91 88 81 77 80 88 98 110 117 116 108 97 89 83 77 72 67 57 42 28 24 29 43 60 77 88 86 71 47 25 16 27 51 76 90
6152 90 88 76 66 61 61 63 62 60 59 60 64 70 72 66 55 49 55 70 84 88 82 70 56 45 43 52 63 69 66 58 52 52 63 83 104 120 131 146 171 202 230 250 259 257 246 234 225 218 207
6132 207 191 177 168 164 160 154 140 111 65 12 -31 -53 -52 -35 -10 11 25 25 15 2 -6 -6 2 19 41 68 96 121 135 136 130 123 119 122 135 158 183 197 193 180 168 163 154
6115 154 136 112 94 87 92 103 115 124 126 120 111 102 89 68 42 25 25 40 58 70 77 88 107 131 148 155 153 149 148 145 139 134 135 147 170 202 232 250 250 237 216 190 162 139
6098 139 129 136 149 156 152 144 142 147 153 151 138 113 80 48 30 31 46 63 76 89 104 117 123 121 115 105 96 89 84 73 54 35 30 43 62 77 81 75 64 53 51 61 81 104
6080 104 126 147 159 158 142 117 94 80 77 81 88 95 99 99 99 106 119 131 134 129 127 129 132 130 126 120 106 82 52 25 9 7 21 47 76 101 126 147 156 150 135 128 134 145 149 137
6061A37k4j7KK1K3J6QMnj1lJ3K0Pj0j9j8j6j3nMNpk2k7k0mRJ4J7K2K6K3J9K1K6K3J1kj1j9
6045B18k3j7lOONRRlj3j0oj4l3m0l1j4%J4K5K3J1jlJQJ7K2K1J0koLJ9K8K0NkKLqk1k1rj%k
6026B02j%PJ8J8J0KJKjJOLrj1MJ7RkLJ9K8K8L0L3L3N4J00J45J52J33J30J48J71K11K87L82
6011B363M84O33Q82J230J661K208K781K964K230N39j403k673k910k469j884j408j037p51n65
6004B875m48l48k58k03j79j54j27j20j21j10q6o7n6l8j7j0j4j8j9k6k9k2j4j5j7j2pj5k5j9
5991B81jRPNRJ1J2J5K0Rj4l2m1m4m2l8l1k8k1mJ3J7RKKmj6k4j9j1%J2K2K1J0KLNLmpqj1j1
5974H8jOPkrj2j4j2q%OJ0RKrk3l4l6k5%K4L8L9L1K1J5J2J1OJMJ1J1Jj1j4j1rrlLKlmKLNJ2
5955A31K5K4OplJ5K3J2pk1k3j7pkLQQjj6k6k6k2k2k1rQK1K5L3M0L7J8pj9j5n%qj9k6k5j8p
$$ plain form
6061 137 113 96 98 119 142 158 166 170 165 154 151 164 184 191 181 162 144 128 115 110 114 119 112 90 63 43 39 48 62 79 101 127 150 169 190 216 239 250 248 237 218
6045 218 195 178 175 181 187 192 201 210 207 194 184 178 164 131 91 60 46 46 60 85 108 119 118 115 116 124 141 163 184 194 192 186 189 208 236 256 261 259 261 264 256 235 214 205 204 204 202
6026 202 201 201 208 226 244 254 256 257 259 258 259 265 268 259 248 252 269 278 276 279 298 326 354 384 417 450 504 604 749 901 1034 1164 1312 1483 1694 1981 2363
6011 2363 2847 3480 4362 5592 7253 9461 12242 15206 17436 17975 16572 13899 10989 8520 6636 5228 4191 3440 2875
6004 2875 2427 2079 1821 1618 1439 1285 1158 1038 917 807 721 654 598 560 543 533 519 501 482 456 427 405 391 376 359 347 340 325 300 281
5991 281 280 289 296 301 310 321 333 348 368 377 363 331 290 246 204 166 135 107 86 82 95 112 121 123 125 121 105 81 62 51 51 63 85 106 116 118 121 126 129 125 118 110 99 88
5974 88 87 93 100 98 89 77 63 51 43 43 49 59 68 70 61 38 4 -32 -57 -57 -33 5 44 75 96 111 123 134 140 141 145 156 167 168 157 143 132 123 114 111 114 116 113 109 111 114 119 131
5955 131 156 180 186 179 176 191 214 226 219 198 175 158 151 149 152 160 168 167 151 125 99 77 55 34 25 33 54 79 112 152 189 207 200 181 166 161 161 153 134 108 83 65 58
5937E8OJ7K2K0J4J2J2Qjj4k4k9k9k2j4rj0j0pJJ1J5Rlj5k2k3j6KK1L2L4L0K2J4J0J2J6J1n
5921A56j6j4lQJ1J3J5J3J2J3J3J0Mmj0j3j5j4j6j8j5oJjqj0mjpj9k7k6j4KJ5J6Onj1j2j2j2
5904ej2oKRJ3J8K4K8K2Nj5k3j9oOJ6K1K0J6QJj1j8k2k3k3j8mJ8L1L2K6K1J3MlkJmj7k5k5j8
5887E6j0qrrqlNJ4K3K6K8K7K6K3J6P%nrj0plkmprj1j3j2j1j0j2j3j1p%ORQJ1K1L8M9M6L2J0
5869B78j6m0n4n4m3k9j5JJ9L3L6K9J1pj6j8j4j0mjLNMjqj5j1%J3K3K6K5J6Noj2j7k1k4k3j9
5852D9j5j0nKNNMLmj4j8j3qmJJ0J9K4K3J8J5Q%j0j5j4pLJ7K6K5J5MjlkJNNOPJ1J3Ppk1k7k3
5833A10j2kNOPMKjlkoj6j6mJ6K9K4Prk0k4j9qMJ4K5L1K8J6N%jnj0j1rj1j6j8j7j2qmlmmJJ2
5814G1K2K0RmplLNRJ6K1J4jj6k4k6k1mJ9L4L2J8Ojpj2j5k0k9l2k4j0pj4j5pjnj7k1j7nPJ8
$$ plain form
5937 58 64 81 103 123 137 149 161 169 168 154 130 101 72 50 36 27 17 7 0 1 12 27 36 33 18 -4 -27 -43 -41 -20 12 46 76 98 112 122 134 150 161 156
5921 156 140 126 123 131 142 155 170 183 195 208 221 231 235 231 221 208 193 179 163 145 130 124 125 124 116 106 102 101 94 75 48 22 8 10 25 41 47 42 31 19 7 -5
5904 -5 -17 -23 -21 -12 1 19 43 71 93 98 83 60 41 35 41 57 78 98 114 122 123 112 94 72 49 26 8 4 22 53 85 111 132 145 149 146 144 145 141 124 99 74 56
5887 56 46 38 29 20 12 9 14 28 51 77 105 132 158 181 197 204 204 199 190 180 173 170 168 164 157 148 137 124 112 101 91 79 66 55 48 48 54 63 71 82 103 141 190 236 268 278
5869 278 262 222 168 114 71 42 27 28 47 80 116 145 156 149 133 115 101 91 87 86 89 94 98 97 89 74 63 63 76 99 125 150 166 171 165 153 136 115 91 68 49
5852 49 34 24 19 21 26 31 35 38 34 20 2 -11 -19 -23 -22 -12 7 31 54 72 87 95 95 85 70 56 49 52 69 95 120 135 139 138 135 133 134 139 144 150 157 168 181 188 181 160 133 110
5833 110 98 96 101 107 114 118 120 119 116 114 108 92 76 72 88 117 141 148 139 119 95 76 68 72 86 111 142 170 186 191 191 190 185 175 164 155 144 128 110 93 81 73 69 66 62 58 59 71
5814 71 93 113 122 118 111 108 111 116 125 141 162 176 175 159 135 109 88 84 103 137 169 187 193 192 185 173 158 138 109 77 53 43 36 22 7 0 -1 -6 -23 -44 -61 -66 -59 -41
5796d1K4K2K0J8K0K0J6J0LmolPJ8K4K1Qmj0j0ponoj2k5l3k6nK0L7M0K9J5NKkj0j9k2k0j7j4
5779G2qLQLqj8j7oORJj5k8k9j9lQJ5J8J8J7J1Mlj0j2j2nLJ5K1K1K1K5L1L3L0K4J7J1Mkpj2
5761B35j9k8l4l5l0j8lRJ0JjQJ7J8J0QJ3J4Qoj3j3olnj2j7j3LK0L1L6L2J8Lqj4j9k3j7KJ9
5744A78J9Kj4j9j4j0j1j0kNNLMJ1J6J3J0J5K0J6lk1k7k6k3k3k0j3j0j0j3j6j8j4jJ3K5K3J0
5728G0nj3j1oqj9k3j2PJ7J4J5J9K2J8J1J2J5J7J4J2Mj0k3l0k8k1j3p%J2K8M3L9J8ok0k6k9
5713I7l0k5j1JRJ1QNNQQJllNJ0J0QKllKLkj0nPJ2MnjOMpj5j0jMKJJPJ2J7J2Kqj2j2j2j1qm
5692H3llljJKJJOJ3J1Jj4k4k5j7qJOOKklJQJ5J6Pqj9k1j5j4j5j2%J3J8J7J1QRJ4K0J9J1MO
5672A24J5J6J0kj1j8k0j7rmqj8k3j6oLJ1J8J9J4NjnnjMJ1J7K3L1L2J9pl0l8l3k2j6j4j3j0
$$ plain form
5796 -41 -17 5 25 43 63 83 99 109 112 108 102 99 106 124 148 169 177 173 163 153 146 140 135 129 117 92 59 33 28 48 85 125 154 169 174 176 174 164 145 123 103 86 72
5779 72 64 67 75 78 70 52 35 29 35 44 45 30 2 -27 -46 -49 -41 -26 -8 10 27 38 42 39 29 17 5 0 3 18 39 60 81 106 137 170 200 224 241 252 256 254 247 235
5761 235 216 188 154 119 89 71 68 77 87 88 87 95 112 130 140 148 161 175 183 177 164 151 145 142 137 125 108 95 98 118 149 185 217 235 238 230 216 197 174 157 159 178
5744 178 197 199 185 166 152 142 131 121 119 124 129 132 136 147 163 176 186 201 221 237 234 213 186 160 137 114 94 81 71 61 48 32 14 0 -1 12 37 60 70
5728 70 65 52 41 35 27 8 -15 -27 -20 -3 11 26 45 67 85 96 108 123 140 154 166 170 160 137 107 79 58 45 38 38 50 78 121 160 178 172 152 126 97
5713 97 67 42 31 32 41 52 60 65 70 78 86 87 84 81 86 96 106 114 116 113 110 112 115 113 103 98 105 117 121 116 115 121 125 118 103 93 92 96 98 99 100 107 119 136 148 150 142 130 118 106 95 87 83
5692 83 80 77 74 73 74 76 77 78 84 97 108 109 95 71 46 29 21 22 28 34 36 34 31 32 40 55 71 78 70 51 30 15 1 -14 -26 -26 -13 5 22 33 41 50 64 84 103 114 118 124
5672 124 139 155 165 163 152 134 114 97 88 84 76 58 35 19 13 16 27 45 64 78 83 82 77 72 71 75 86 103 126 157 189 208 201 171 133 100 78 62 48 35 25
5656B5mMQQMJlqj2j2nLL%jLJ0J1NjkMRJ1QPJ0J6K0J2ok2k5j2MJ4J8K3K4J8Mpm%rk8m1l7k5
5636B3j3p%MJnj0j1rlOJ3J4J0J1J9L2L6L0K3J8J4PJlnqj1j1pqj7k8l1k6j8q%QJ2J1J2J6J9
5618A01K1J9J2jj5j8rMQKqj6j7j5pkmpjJ3K9L7L3J7ok1k1j1qj4k6l0l0l0k5qJ1K1J8J3J6K1
5602D6K4K3K0J5OklJOPORJ2Rlk0k7k0jJ5J6Kj1j3nLRJ7K5K0Kj6j6jQNkjLM%rj6k4k5j6oln
5582F8pnmjKPJ2J6J6J6J5J5J4Oqj4mJ2J8QoqkRJ8J9Pj1k6k7j7lRJ5J1Lmnloj1j5j6j1kJ1K1
5563A32K2J7J3Onj9l1l0k1qLJ0J5J3J0QRJ1RMJlpj2j5j1rj3k0k1j6j3j6k0k0j5qnjPJ3J4J3
5546iJ5K5M0M8M4L2K3J7Qqk5l1k5j3njMJ3K3K7J9Jk0k9k7j8j2rqpoopj1j9k2j5KJ8K5J8J0
5529G9PJ0J5J5J2Kpj0oKQQPJ2J3Nj3k9l9l9l5k8k1j0kjmm%NRJ4J9J8Pj1k4k8k3j0NK4L3K8
$$ plain form
5656 25 21 25 33 41 45 46 43 35 23 11 6 9 12 12 11 14 24 35 40 39 37 41 50 61 69 76 86 102 122 134 128 106 81 69 73 87 105 128 152 170 174 167 163 163 154 126 85 48 23
5636 23 10 3 3 7 8 3 -7 -18 -27 -30 -24 -11 3 13 24 43 75 111 141 164 182 196 203 204 201 196 188 177 166 159 151 134 106 75 49 31 23 23 31 43 54 66 82 101
5618 101 122 141 153 152 137 119 110 114 122 124 116 100 83 68 61 59 55 48 47 60 89 126 159 176 170 149 128 117 109 95 69 39 9 -21 -46 -54 -43 -22 -4 9 25 46
5602 46 70 93 113 128 134 132 129 130 136 143 149 158 170 179 176 156 129 109 108 123 139 141 130 117 112 115 124 141 166 186 188 172 156 155 163 168 166 165 168 172 172 163 147 123 98 82 76 73 68
5582 68 61 56 52 51 53 60 72 88 104 120 135 150 164 170 162 148 144 156 174 182 176 168 166 175 193 212 219 208 182 155 138 135 144 159 170 173 169 164 161 155 144 129 113 102 100 111 132
5563 132 154 171 184 190 185 166 135 105 84 76 79 89 104 117 127 135 144 155 164 168 169 166 159 147 132 121 112 99 79 58 42 29 13 -7 -27 -42 -50 -55 -56 -49 -36 -22 -9
5546 -9 6 31 71 119 163 195 218 235 243 235 210 179 154 141 136 135 139 152 175 202 221 222 202 173 146 128 116 107 99 92 86 80 73 62 43 21 6 8 26 51 69 79
5529 79 86 96 111 126 138 140 133 123 117 119 127 135 142 154 167 172 159 130 91 52 17 -11 -32 -42 -44 -45 -49 -53 -53 -48 -39 -25 -6 12 19 8 -16 -44 -67 -77 -72 -48 -15 13
5511A3J6LJPJ2J0OLNPJ2J8K4K3J7QNPJ0RLqj8j8nJ3K5K8K9K6J6ok6l5l2k6k1j9j6j4j2nLP
5494A05MjjPJ3J2MlqrrqnlJNJ1J2J1PMNPPNLJkmlnj2k3k9l2l0k4j3%RJ7J7J0jrpNJ7J9J5J1
5473A03J2J7K0J9J5J3J6J5Nj0j8j8j2qkL%qj6j3m%kqj2j4j1KK3L8L7J8rk4k7j6mRK1K9L2K7
5456B38J4mk6m4m9m0l1k8k7j5MJ8K3K1K0J5Oj%OOLKJ1K0J7Kj8k8k9j5LJ9K1J0%JQRNkpj2j8
5439A08k6l1l1k1JK2L2K3Rjqj7k2j6JJ6K3K3J6PlnjLJpj6k2k0rQK3L1L5L5K5Pj0j6j1mMRJ2
5421A77J2Plj7k7k8j9oLQJ1RKoqrj0pMJ4J4NJKkj3k4k3j0JOLkj0j7j5mJ0J7J2ONQRLoj6k0
5402D7j8qMJ6K1K0J4RNJlqj2j0kPQjj5k1j6lRJ5J7J9K4K8K3Qnj4j7j9j8j0JQJ3J6J5Nj6l4
5384A03l4k2j0nmMJ6K5K2Rqk3k9k4j8j7k9m1m1k4KK5L9M7M4L7J8KmjQRMnj5k4k5j2LJ4J2Q
$$ plain form
5511 13 29 32 33 40 52 62 68 71 76 83 95 113 137 160 177 185 190 197 207 216 219 211 193 175 170 183 208 236 265 291 307 301 275 240 208 182 161 142 126 112 100 95 98 105
5494 105 109 108 107 114 127 139 143 140 132 123 114 106 101 98 99 104 115 127 138 145 149 154 161 168 173 176 177 175 171 168 163 151 128 99 67 37 13 0 0 9 26 43 53 52 43 36 41 58 77 92 103
5473 103 115 132 152 171 186 199 215 230 235 225 207 189 177 169 167 170 170 162 146 133 129 129 127 119 107 93 82 84 107 145 182 200 191 167 140 124 120 129 150 179 211 238
5456 238 252 248 222 178 129 89 58 30 3 -12 -8 10 33 54 74 89 95 94 94 100 106 109 111 122 142 159 161 143 115 86 71 74 93 114 124 124 125 133 142 147 145 138 126 108
5439 108 82 51 20 -1 0 22 54 77 86 85 77 60 38 22 23 39 62 85 101 108 105 100 99 102 103 96 80 58 38 29 37 60 91 126 161 186 193 183 167 156 152 156 165 177
5421 177 189 196 193 176 149 121 102 96 99 107 118 127 129 123 115 106 96 89 93 107 121 126 127 129 127 114 90 67 57 58 64 67 65 55 38 23 19 29 46 58 64 69 77 86 89 83 67 47
5402 47 29 21 25 41 62 82 96 105 110 111 108 100 88 78 76 83 91 90 75 54 38 35 44 59 76 95 119 147 170 178 173 159 142 123 105 95 96 104 117 133 148 153 137 103
5384 103 69 47 37 32 28 32 48 73 95 104 96 73 44 20 2 -15 -44 -85 -126 -150 -148 -123 -84 -37 7 44 62 64 60 59 67 76 80 75 60 36 11 -1 2 16 28 36
5367C6MMmj5k4k1j0QJ8J6OkpqpmPJ4J3%j1j0KJ8K5K0Ooj0mLKj%PJ5J4PKOJ5K4K6K2J0lj1j1
5348A81j0j4k0k6k8k4j1PJ2%j4j4jJ2J3J1J2J6J6J7J9J8OppKP%j1j3rpj2j8k3k9l3k9j9nQ
5331b7J7J9J3OJPK0L0K8J1rj9j7j1rroKJ1J5J2PNQJ3J5J0JkKPLoj3j4j3j5j9j4KK2L4K8J7
5314A63J0J1J0NjJMPNOONmj2j9j9k0j7j4j0mKQJ2J3J6K1K0J1kj5k1k4k5k1j5j0olJKjk%%n
5295F9j2j8j4kJ0J7J5QPJ2J3Jj4j8oLJnmKNJkKLmj2j1MK3L2K3kk1k3j1jqj7j5LK2L1L0K7K2
5277A66Rqk1j7jJ2J0kqn%KLOOJoj0n%%qk0l0l4k9j4LJ9L2L6L0J9QMjrj5j4mORPNPRJ1J1QL
5257A81%lqj4j8j3mjmqnj%j%RJ7J9J3QRK0K7K0%j8k4k0j8k4k6j9mJ4K1J5kk0l0k5j6lPJ5K1
5239H7K7K6J9Npj0j2j6k5l2l0k8k4j8j0nj1j4pJ2K4K0Opj2rkMJmpnjJKPJ2J0LkKJ1J5J4QM
$$ plain form
5367 36 40 44 40 25 1 -20 -30 -22 -4 12 18 16 9 1 -6 -10 -3 11 24 24 13 3 5 23 48 68 74 68 58 54 57 59 58 58 65 80 94 101 103 109 124 148 174 196 206 203 192 181
5348 181 171 157 137 111 83 59 48 55 67 67 53 39 38 50 63 74 86 102 118 135 154 172 178 171 164 166 173 173 162 149 140 133 121 103 80 51 18 -11 -30 -35 -27
5331 -27 -10 9 22 28 29 36 56 86 114 125 116 97 80 69 60 51 45 47 58 73 85 92 97 105 118 133 143 144 142 144 151 154 148 135 121 108 93 74 60 62 84 118 146 163
5314 163 173 184 194 199 198 199 203 210 215 221 227 232 228 216 197 178 158 141 127 117 113 115 123 135 148 164 185 205 216 214 199 178 154 129 108 93 83 77 74 75 77 76 74 74 74 69
5295 69 57 39 25 23 33 50 65 73 80 92 105 106 92 74 68 71 72 67 63 65 70 71 69 71 74 70 58 47 51 74 106 129 127 106 83 72 71 63 46 31 34 56 87 117 144 166
5277 166 175 167 146 129 128 140 150 148 140 135 135 137 140 146 152 153 147 137 132 132 132 124 104 74 40 11 -3 0 19 51 87 117 136 144 148 147 138 123 109 105 111 120 127 132 139 148 159 170 178 181
5257 181 181 178 170 156 138 125 121 120 116 108 103 102 102 101 101 110 127 146 159 167 176 196 223 243 243 225 201 181 163 139 113 94 90 104 125 140 138 118 88 63 47 44 51 66 87
5239 87 114 140 159 164 157 147 135 119 94 62 32 4 -20 -38 -48 -53 -64 -78 -85 -73 -49 -29 -23 -30 -42 -51 -53 -49 -48 -52 -59 -64 -65 -64 -62 -55 -43 -33 -30 -32 -30 -19 -4 10 18 22
5220B2krj2j1kOQQOMJnnLJ3K5L3L7L5L1K4J4JnkQRLnopj1k2l5l9l3j4NJ3PJJK%mnkJJJMPP
5199A05OMOMnj3j1JJ3Rj3l2l3j6MJ7K0J7J2NKjKOJ3J1Lopprj5j8j5kJ1J6Prk3k6k1j6qLJ3
5180DK0J8J3J0RJ3J7J0ok1j9qJjrj3j5j6j1olkMJ5K3J9P%j%KQJ7K5K7K2Qj1k0j1K%j7l2l0
5162D2j7pjMPOMQJ6K2K1J1%mmloj4k4k7j9pNJ1J0QOPRJ2J4J0Kpj4j9j9j4n%LRK1L0K5Oj0j6
5143I2j0%J1J6J2PJkmonnopjJ0K1K2J5Nknrj6k5l0k9k5k2j1OK9L9K9J1kj0j1oRK1K1J3Njq
5125A37j5j6qLRQJjMJ4J8Qj1k8l4l3k3mK0L6L9K8Rnrpnqj2j2j1j4j9j9rOK1L3M1L8K5J1%o
5107B00j1j2opj6k6k1lJ3J4MkkLNNKkmjNRQ%pj6k0j7mPJ0Lmk%jjKMJoronj1j9k0j6pKRPKm
5085B7oppl%LQJ5J9J4MKNPLknj2k4l2k3j0PK6N0O3N6K9Mrj8k4k6j9j2okNPPMJmj2j3n%%JP
$$ plain form
5220 22 20 11 -1 -12 -14 -8 0 8 14 18 19 14 9 12 25 50 83 120 155 186 210 224 225 220 218 226 235 238 233 227 220 209 187 152 113 80 66 71 84 91 92 93 95 95 91 86 84 85 86 87 91 98 105
5199 105 111 115 121 125 120 107 96 97 110 119 106 74 41 25 29 46 66 83 95 100 102 101 103 109 122 133 136 130 123 116 107 92 74 59 57 68 84 91 82 59 33 12 -4 -12 -9 4
5180 4 24 42 55 65 74 87 104 114 108 87 68 60 61 60 51 38 23 7 -4 -10 -13 -15 -11 4 27 46 53 53 52 52 54 62 79 104 131 153 161 150 130 119 121 121 104 72 42
5162 42 25 18 17 21 28 34 38 46 62 84 105 116 116 112 108 105 99 85 61 34 15 8 13 24 34 42 48 55 64 76 90 100 102 95 81 62 43 29 24 24 27 36 57 87 112 118 108 92
5143 92 82 82 93 109 121 128 129 127 123 117 112 107 101 94 93 103 124 146 161 166 164 159 150 134 109 79 50 25 3 -8 -2 27 66 95 106 104 94 83 77 86 107 128 141 146 145 137
5125 137 122 106 98 101 110 118 119 118 122 136 154 162 151 123 89 56 33 29 49 85 124 152 161 156 147 140 135 127 115 103 92 78 59 40 31 37 58 91 132 170 195 206 206 200
5107 200 189 177 171 164 148 122 101 98 111 125 129 127 125 128 133 138 140 138 134 133 138 147 155 155 148 132 112 95 91 98 108 111 107 105 105 104 103 105 109 110 104 95 89 84 73 54 34 18 11 13 22 29 31 27
5085 27 21 14 7 4 4 7 15 30 49 63 67 69 74 81 84 82 77 65 41 9 -14 -24 -17 9 59 122 178 207 211 202 184 160 134 115 103 97 95 100 107 114 118 119 115 103 90 85 85 85 86 93
5065I3J2Lj6l0k4pOQmj7k3j9j1n%KMLLNJ2J7K1K2K1K1J9J9J9J8J3Mornkqj7k2j7oKQJ2J8J9
5047A56J5QK%klj%Jlpj4j5j0lJ%oj1j3j1oJOQMlj1j6j6rmqj7j7mJ5K5J9OjKQJ0PJj0j8j7o
5027C3QJ4J1Mjmqj1j1mPJ7K2K2K2K6K9K6J7Onj2j8j7j4j2j2j2j4j9l0l3k3oKM%KJ0J7J9J3
5010F5Mqj4oJ2L0M1L5K1Nqj5k3l1l7l5k3j0jMQJ6K2K2J2Knqj3k3l1l0k4j2lLQJ4K1K3K0J0
4993C8%mloj1j4j6j3j4j5j3KK0L7M7N1M3K7RJKLjrqljj0k2k1qJ0J6PmjRJ7J0nj8j7r%NMKJ
4974A15ORQKnj2j5j3lJ2J9J3KpqmLQJ3J4Pj1l1m2l4j4J1K3K7K7K7J8Jj7k6k0j1pn%PJ1QJn
4956A02mLJ3K1K4K1J3OKKlj3k4k8k6k4k3j7roj1k2k9k6j5JJ3J9K0K0K7L4L8M0M0L5K2Mj0j7
4939B13j8j4j1ojLOMKkpj4j9j4KJ9K6J9Nqj6j7j2jJ4K5K9J8Kj5k1j9j4pjJjnpoqj3j3lNLr
$$ plain form
5065 93 105 108 92 62 38 31 37 45 41 24 1 -18 -29 -34 -34 -32 -28 -25 -22 -17 -5 12 33 55 76 97 116 135 154 172 185 189 183 174 169 167 159 142 120 103 97 99 107 119 137 156
5047 156 171 179 181 181 179 176 175 175 176 173 166 152 137 127 124 125 125 119 108 95 84 78 79 85 93 97 94 83 67 51 42 38 30 13 -4 -8 7 32 51 57 56 58 66 76 83 84 74 56 39 33
5027 33 41 55 66 70 69 65 57 46 35 31 38 55 77 99 121 147 176 202 219 225 220 208 190 173 159 147 135 123 109 90 60 27 4 -2 0 4 4 6 16 33 52 65
5010 65 69 61 47 41 53 83 124 159 180 185 177 162 139 108 71 36 13 3 2 6 14 30 52 74 86 88 83 75 62 39 8 -22 -46 -58 -61 -58 -50 -36 -15 8 28 38
4993 38 38 34 31 25 14 0 -16 -29 -43 -58 -71 -69 -49 -12 35 86 129 156 165 166 168 171 170 161 153 150 149 139 117 96 88 98 114 121 117 116 125 142 152 147 129 112 103 103 108 112 114 115
4974 115 121 130 138 140 135 123 108 95 92 104 123 136 138 131 123 119 122 130 143 157 164 153 122 80 46 32 43 66 93 120 147 165 166 149 123 103 92 85 80 80 87 98 106 107 102
4956 102 98 101 114 135 159 180 193 199 201 203 200 187 163 135 109 85 62 45 36 30 19 -3 -32 -58 -73 -72 -59 -40 -20 0 27 61 99 139 179 214 236 240 230 213
4939 213 195 181 170 164 163 166 172 176 178 176 169 155 136 122 124 143 169 188 193 185 169 152 140 139 153 178 207 225 227 212 191 172 158 151 150 151 150 145 138 132 124 111 98 95 100 103 94
4921I4j9k0j6qOJ9K2J1mj2j0nJQJ2J1QONmj7k3j8oLQJ6K2K0Mj8k9k7k4k1k2j4mRJ9K5K7K3
4903E8J8J6J7K0K0J7Ork0k1j6j3j1j1j0qnLJ3J7J2KnlLOMmppj1j8k3j8qKJ5L0M3M3K8J1JK
4886A79QRKj6l1l1j4RK0J7RKoj2j4oNJ2J1OMONok1k6k1nRJ9J8J1MJKPRMj%J2K7L4L2K3K0K4
4867C50L3L7K4OMK5M7N6O3Q1R9J08J37K05K96M09N83Q08Q98O27K9n62q22p43n58m23l25k27
4856A265j57j36j27j00p4o6n3k0MKkKol2m6l1rl%J1K2K9M4O5O6N0M5N4N2M8P7J21J42J53K08
4841A598K96L67M54O37R04J205J630K255K706K269P04j226k405k462j932j446j125q35n77
4834C017m37l65k69j77j45j38r2m7n4p4m9j7k4l5j6mk9m2nL9M6N6Q9J02P5O7J00J05P4R5J93
4821B039K68K86L63N33O93Q31J120J611K178K906M062N248N103K620j292m356n167m313l198
$$ plain form
4921 94 75 55 39 31 37 56 78 89 85 73 63 58 59 67 79 90 98 104 109 105 88 65 47 41 44 52 68 90 110 114 96 67 40 16 -5 -27 -41 -45 -36 -17 8 35 58
4903 58 76 92 109 129 149 166 172 163 143 122 106 93 82 71 61 53 48 51 64 81 93 95 90 87 90 96 100 96 89 82 71 53 30 12 4 6 21 51 94 137 165 176 177 179
4886 179 187 196 198 182 151 120 106 115 135 152 161 163 157 145 131 125 130 142 153 159 163 169 174 168 147 121 100 95 104 123 141 152 156 157 159 166 175 179 178 178 190 217 251 283 306 326 350
4867 350 383 420 444 450 454 479 526 582 645 726 825 933 1070 1275 1571 1980 2563 3371 4269 4896 4925 4363 3541 2798 2240 1817 1492 1265
4856 1265 1108 972 845 745 671 605 552 532 536 538 536 538 532 500 454 423 414 411 411 422 444 473 517 582 648 698 743 797 849 897 974 1095 1237 1390 1598
4841 1598 1894 2261 2715 3352 4256 5461 7091 9346 12052 14321 15025 13799 11394 8932 7000 5554 4429 3594 3017
4834 3017 2580 2215 1946 1769 1624 1486 1394 1347 1293 1219 1170 1153 1129 1094 1078 1074 1045 1003 998 1037 1083 1139 1228 1330 1405 1472 1572 1677 1751 1846 2039
4821 2039 2307 2593 2956 3489 4182 5013 6133 7744 9922 12828 16890 22138 27241 29861 28569 24213 19046 14733 11535
4814A1535k440j852j304r41p69o03m07l06k97k47j57j35j71j56r9r3j15p6lJ0k0lM2L9K0N6
4803A508J03Q8O5J14J69J41J13J90K98L34L82N58P66R10J154J668K336L107M291N815O378
4795C0488M392Q0m165o061n550m204l163k426j749j239r94q28o03m34l91l46k29j51j67j70
4787B090j12q6j24j25n9k3n2n5lJ8nQO4P2L4M7J12J29J08J50K43K76K81L92N91P42R09J278
4776F900J823K420L269M553N524M686J520k434m906n105m061l033k332j731j215r22p73o03
4768C580m35l63l33k56j75j63j69j23p5q2r6n9k0l9o6m4j5k3k9PL6K2J2M4O5M2L5P9J19J23
4756A599J57K52L34L89N27P91J102J480K077K718K697J460n50k166k638k246j689j297r88
4749D009p03n13m23l42k42j79j58j30q7p2q5q1o3n9o4m9k1j2k2k3j1pnMRqk2rJ5J7MNJ7K0
$$ plain form
4814 11535 9095 7243 5939 4998 4229 3626 3219 2913 2616 2369 2212 2077 1906 1750 1651 1558 1443 1367 1364 1374 1354 1351 1393 1432 1452 1508
4803 1508 1611 1699 1764 1878 2047 2188 2301 2491 2789 3123 3505 4063 4829 5739 6893 8561 10897 14004 18295 24110 30488
4795 30488 34880 34960 30795 24734 19184 14980 11817 9391 7642 6403 5409 4581 3978 3544 3153 2807 2578 2427 2260 2090
4787 2090 1978 1892 1768 1643 1584 1561 1509 1454 1451 1469 1464 1472 1536 1608 1642 1689 1801 1930 2038 2188 2431 2707 2988 3380 3971 4713 5622 6900
4776 6900 8723 11143 14412 18965 24489 29175 30695 28261 23355 18250 14189 11156 8824 7093 5878 4956 4183 3580
4768 3580 3145 2782 2449 2193 2018 1855 1686 1563 1488 1406 1310 1251 1231 1192 1126 1082 1067 1044 1015 1022 1058 1080 1092 1136 1201 1243 1278 1357 1476 1599
4756 1599 1756 2008 2342 2731 3258 4049 5151 6631 8708 11426 14123 15583 15033 12867 10229 7983 6294 4997 4009
4749 4009 3306 2793 2370 2028 1786 1607 1449 1319 1232 1160 1075 994 931 872 808 759 738 726 704 681 670 663 658 662 671 663 641 632 647 664 668 673 690 710
4735G10K8O3J08J36J70K39L30M39O12Q44R42O76O4n56q58q15o31m74l57k56j88j62j48j21
4725G95r1p1n7m1l2l7l7k6j1j2k2k6k2j5j1nLRRLmqj1j6j9j5j1j1j7j8oJ3K4J8Jj6k3k0pR
4709A66K2K4J5lk2l1k7j6pJJ0J8J8J4J5J9J7Lj6k9k9k5k0j5oLOMKOROoj5j2lMLkrj6j8j7j4
4692B7j1j1pjPJ8J9J4QOOQRJ4K3K6K4J4Lpj5j8j8k0k0j8j4j2j3j2rmJJ2K9M0L5K1ROMnj9l0
4674A19l0k4j7rJJ4K4K8K4K3K0J2lj7k1j6j1j0j3k3l0k8j1J2K6K5J9J6K1K3J9Ooj0mNJ1J5
4659A80J2Nrk8m3n0m6l1j3OJ7K0J7Ork1k2j8rjRK4L3L0J5lj9k8k5j7rokPJ8K3J9J2J1J8K5
4642I8K8K3J5PKjjNJ1J0LqrlOJ1J5J1Lqj2rqj1j6k0k1k0k1k1j9j7j2j0rqNK2L0K3J0Jjmom
4624F0MPPQJ4J7J2krj0mLRJ8K3K2J4J0J1J4Rnj9l1l8m3m3l5j9KJ9K4J5jqlJkj2j2kJ1J5J6
$$ plain form
4735 710 738 801 909 1045 1215 1454 1784 2223 2835 3679 4621 5297 5361 4805 3947 3132 2501 2027 1670 1414 1226 1064 916 795
4725 795 704 633 576 535 503 466 429 403 392 380 358 332 310 295 284 279 282 291 300 303 299 291 280 264 245 230 219 208 191 173 167 180 204 222 223 207 184 164 157 166
4709 166 188 212 227 224 202 171 144 128 121 122 132 150 168 182 197 216 233 236 220 191 162 137 117 102 96 99 105 109 111 117 126 132 126 111 99 96 100 103 101 92 76 58 41 27
4692 27 16 5 -2 -3 4 22 41 55 63 69 75 83 92 106 129 155 179 193 196 189 174 156 138 118 98 80 66 54 41 29 20 16 17 29 58 98 133 154 163 169 173 168 149 119
4674 119 89 65 48 39 40 54 78 106 130 153 173 185 182 165 144 128 117 107 94 71 41 13 2 14 40 65 84 100 121 144 163 169 163 153 149 154 165 180
4659 180 192 197 188 160 117 67 21 -10 -23 -17 0 20 37 43 34 13 -9 -27 -36 -37 -28 -4 29 59 74 71 52 24 -1 -18 -27 -33 -35 -28 -10 13 32 44 55 73 98
4642 98 126 149 164 171 173 172 171 176 187 197 200 192 183 180 186 197 212 223 226 218 206 197 189 178 162 142 121 101 80 59 40 23 11 1 -8 -16 -11 11 41 64 74 75 74 70 64 60
4624 60 64 71 78 86 100 117 129 127 118 108 104 107 116 134 157 179 193 203 214 228 237 232 213 182 144 101 58 23 4 6 25 49 64 63 55 52 53 51 39 27 25 36 51 67
4606F7J8K0J6OlolOQJj2k2k6k7k7k1pOQKljpk0l1l1k2j4rmPJ8K5K0J0NQJ5K0J2OOJ7L1L9L8
4588A39K6Rj1k0j6plrj3j1oJQJ4K1K1J7J4J5J1Lrj2j0mjJjnj2j8j9j6j1prj2j4j0jKmj1j4
4570FnRJ8J6Lj1j5rJRJ3J3J1RJ2J5J5J3ROPPJ0J2J6J6J4RMj%NRP%qj3j8k0j7j1qqqmNRMqj6
4550A32j1KJ1J1%j2j9j9j1kMPJ2J8K1J7Plj0j6j9k0j6rmkjjjlooJQRKkjLJoj0nKJ4K5L1K8
4531A51J4Jomlj1k4l2l1k3j9k1k4k1j8j5j0OL1N2O2O2N0L1J2MPQLrj3j0pj2k1k7k5j1PJ8J9
4514A41Qoj9k6k7k3k0j8j0JJ2J2QONJqj2j0lkmkJ0K9M2M1K6J1J0J8K4K0Lj5k6k6j9j0rj3k1
4497I9k2j7pLLkrj1j1pjMLjm%NNlokMNMKJnj2j3nJ2K6L0K5J5Nmj2j7j8j3j0mLJ2J3RM%pk1
4477D8l0k6j6pmJQJ8K6L5M0L3J5kj3j5j6j9k3k3j5NK9M0L3Qj3j9j2NJ7J8Pj1k1j8pKKoj0j0
$$ plain form
4606 67 85 105 121 127 124 118 115 121 129 130 118 96 70 43 16 -5 -12 -6 2 4 1 0 -7 -27 -58 -89 -111 -125 -134 -138 -131 -113 -88 -68 -58 -53 -45 -30 -10 2 8 14 31 62 101 139
4588 139 165 174 163 143 127 120 117 108 95 84 78 79 87 101 122 143 160 174 189 200 203 194 182 172 168 167 168 167 162 150 132 113 97 86 79 70 58 44 34 33 35 31 20 6
4570 6 1 10 28 44 47 36 21 12 13 22 35 48 59 68 80 95 110 123 132 138 145 152 162 174 190 206 220 229 233 232 232 237 246 253 253 245 232 214 194 177 166 158 150 142 138 143 152 156 148 132
4550 132 121 123 134 145 145 133 114 95 84 82 86 93 105 123 144 161 168 165 155 139 120 100 84 75 71 69 68 67 66 63 57 51 52 60 69 71 69 68 71 72 66 56 51 53 67 92 123 151
4531 151 165 166 160 156 153 142 118 86 55 32 13 -8 -32 -53 -71 -86 -96 -90 -59 -7 55 117 167 198 210 214 221 229 232 223 210 200 193 181 160 133 108 97 104 122 141
4514 141 149 143 124 98 71 48 28 10 0 1 13 25 33 39 44 45 37 25 15 12 10 6 4 14 43 85 126 152 163 173 191 215 235 238 223 197 171 152 142 133 120 99
4497 99 77 60 53 56 59 57 48 37 26 19 18 22 25 24 20 20 25 30 27 21 19 23 28 32 34 35 30 18 5 0 12 38 68 93 108 113 109 97 80 62 49 39 35 38 50 63 72 76 76 69 48
4477 48 18 -8 -24 -31 -35 -34 -26 -8 18 53 93 126 141 139 126 111 95 76 53 30 15 20 49 89 122 130 117 98 86 91 108 126 133 122 101 83 76 78 80 74 64 54
4460E4mkorj1qlOJ3J9J8J2J2J4J5OmnKNnk3l5l7l1k5j7pJJ0K2L2M0L7K7J8R%j2k2k6k0j0L
4442E3J4K2K4J8Nj0j8k4k5k0oRJ4QlookNJ3J6QmqMJ4J5QMPNnj9k5j9pJLMJ0J8K9L1K3Nj5k3
4423A45k0j0jMMlj3k1k1qOJ7J9J5PPJ3K2K1Nj3k4k3j3MJ8K1J3PQRJj1j4j1j1j5j3mRJ1O%%
4406A43LJ1J5J4O%ljmpojjnrkQJ3PLKPPL%NJ0J0Lpj7k5k3j7j0m%K%qj6j6j1rj5k0j4mjoj4
4385dj2MK2L2L2K4J4Krj2rlkJQJ9J9Lj8k5j5KJ6J9J4Jrj3p%JjkLPQOLKKLJmj2k2k9k8k0rL
4365FJ5K4K5K0J2Llj1j9k6l4l4k9j6MK4L9M7M6L8K6J7J4R%j4k2k3j8j6j6j4mOJ3J5J0Njoj0
4349A02rlJ1K4K8J8PJjmpl%lj8k7j7NK2K4J5Ojnpp%MJj3k7l3k4j3qrj0rpjNJ1J6J5RlrlJ5
4329E8L1K9J2qj9k6k7k1j0nprj0rj2j5j2pjMJ3K4K7K3J4KnlNJ0QMPJ8K7L0K7K0J2NJmj3k6
$$ plain form
4460 54 50 48 42 33 22 14 11 17 30 49 67 79 91 105 120 126 122 117 119 124 119 96 61 24 -7 -32 -49 -56 -55 -45 -23 9 49 86 113 131 140 140 128 106 80 60 50 53
4442 53 67 89 113 131 136 126 108 84 59 39 33 42 56 64 61 55 49 47 52 65 81 89 85 77 81 95 110 118 122 129 134 129 110 85 66 59 60 63 67 77 95 124 155 178 183 168 145
4423 145 125 115 114 118 122 119 106 85 64 56 62 79 98 113 120 127 140 162 183 188 175 151 128 115 119 137 158 171 178 186 195 196 185 171 160 149 134 121 117 126 137 143 143 143
4406 143 146 157 172 186 192 192 189 188 184 177 171 170 169 164 155 153 161 174 181 184 186 193 200 203 203 208 218 228 231 224 207 182 159 142 132 128 128 130 130 122 106 90 79 70 55 35 21 17 16 10 -4
4385 -4 -16 -12 10 42 74 98 112 114 105 93 84 81 79 80 88 107 126 129 111 86 71 73 89 108 122 123 114 101 94 94 95 94 92 95 102 110 116 119 121 123 126 127 123 111 89 60 32 12 3 6
4365 6 21 45 70 90 102 105 102 91 72 46 12 -22 -51 -67 -63 -39 0 47 93 131 157 174 188 197 197 183 161 138 120 104 88 74 70 76 89 104 114 119 118 112 102
4349 102 93 90 101 125 153 171 178 179 178 174 167 164 164 161 143 116 99 104 126 150 165 171 170 165 158 151 151 155 156 143 116 83 59 46 38 29 19 10 3 2 7 18 34 49 58 55 46 43 58
4329 58 89 118 130 122 103 77 50 29 19 14 7 -2 -12 -21 -33 -48 -60 -67 -68 -64 -51 -27 0 23 37 39 34 31 36 46 54 58 65 83 110 140 167 187 199 204 205 201 188 162
4311A62l0k2r%NOPNjrj8k1j0QK4K8K4J8J1Jj0k4l5m1m2l1j7mMONPJ4K3K3J5ROJ0RMmj0j5j3
4293F8pJONKMRJ3J3J2J4J6J1Jj2j4pjKJMPM%KM%j2k1k0qQJ5J1nj7j9j0jKj%NQNkomNJ3K0K3
4272A47K4K3K2J6RL%jJjj0k3l0k8j9j4j1kJ1K6K8J6lj9k4k1j2%J0J1NklLJ0RNLJmj6l0l2j7
4255F1PK6K5Oj6k4j9rmpj9k9l6k8j2NJ1NkKJ6K9K6J1oj4j7j4kJ7L3L5J7jrpjLLKKNNMNPNo
4236I1j9k4j4kQJ5K0J6Jk0l2k8j2JJ1J5J5J4J5J4J2OLKjnqpkNJ3J8K0J6RLnj3j8j8j3pllm
4217H5pj1rkJ1K1K3K3K5K9L1K2Lrqkjrj3rJJ2K0K6K9K4J3Lmj1j9k5k9k6j9nRJ6J3Mml%Jkq
4199B09rqqj0j7k6l3l5l3k4rPK2K0OlLJ6K1J2lj7k6k5j1LJ0QKlqpNJ9K3J2Knrj5j4JJ6J7K
4181G8j2j7j1lPJ0PLNJ0QjokKKJNJ1J6J8K0K2J6Mj2k5l2l1k2rkjprnNJ4J6J0MKM%qj6j6j1
$$ plain form
4311 162 132 110 101 101 106 112 119 124 123 114 96 75 65 73 97 125 149 167 178 179 169 145 110 69 27 -4 -21 -25 -21 -15 -10 -3 11 34 57 72 81 87 97 106 110 106 96 81 68
4293 68 61 62 68 73 75 79 88 101 114 126 140 156 167 168 156 142 135 134 136 137 141 148 152 152 154 158 158 146 125 105 97 105 120 131 126 109 90 80 79 81 80 80 85 93 98 96 90 86 91 104 124 147
4272 147 171 194 216 232 241 244 244 243 244 243 233 210 180 152 133 119 108 106 117 143 171 187 184 165 141 120 108 108 118 129 134 132 129 132 142 151 156 159 160 156 140 110 78 61
4255 61 68 94 119 125 109 85 66 57 53 46 27 -2 -38 -66 -78 -73 -62 -57 -59 -57 -41 -12 14 25 19 5 -12 -26 -28 -11 22 57 74 73 64 57 56 59 62 64 66 71 76 80 85 92 97 91
4236 91 72 48 34 32 40 55 75 91 92 72 40 12 0 1 12 27 42 56 71 85 97 103 106 108 107 102 94 87 85 90 103 121 141 157 166 169 164 151 133 115 102 95 92 89 85
4217 85 78 67 58 56 67 88 111 134 159 188 219 241 244 235 227 225 224 215 202 193 194 206 226 252 281 305 318 321 317 306 287 262 233 207 188 183 192 208 221 225 221 218 218 219 217 209
4199 209 200 192 184 174 157 131 98 63 30 6 -3 4 26 46 52 49 52 68 89 101 98 81 55 30 19 22 32 40 42 39 31 24 29 48 71 83 85 80 71 56 42 43 59 76 78
4181 78 66 49 38 35 42 52 59 62 67 77 85 84 78 76 78 80 81 86 97 113 131 151 173 189 193 181 156 124 93 71 62 60 59 52 43 38 43 57 73 83 87 89 93 93 85 69 53 42
4162D2kMQQKmj2j4oPJ9K2J6Q%onJOJj0k1k4k5k5k9k6j7JK1L4L5L2L0K8K1Qkorj9k8k8j7qj
4143A0%MJ0J5J9J9J5P%k%NPM%MJ1J3Noj1jJ0J7J8J5RM%mj1j4j0%QPlj1j4j4j5j6j2mNJ3J8
4124A24J9J0qk9m6m6l2j5%NRJ3K0J9RmoLJ5J8J3QL%kKRJ4J6J6J6J1Jqj5k4l3l3k0okooJ1L2
4106G5M3L9K2NopkMJ2J6J3Kpj0j0j3j9k1j6j1rj1j5j5j7j5j1m%MQJ6J8Pj1k3k5j4nMJ3K4K9
4089E7K5J9J7J6RjqqonKJ6K6J9jj6j6kRJ4RNKNP%pj0jQJ3J0Jqj2j0lJ%MJ7K5J9Ojknj0j2n
4069B12KLkqj6k5k9k4j7j2j1pkJ%klm%RJ0JqnJ0K6L0K6J1rk6l1k0nnj3k1k2k4k9l1k6j4nO
4051a09J7K6K7J6Jj0qNK0K7K7K0J2jj6k7k7j4%J2K1K5K2J1jj3k3l3l6k5jK2L4L7K7J0j0k2
4036D3k4k1j6rlmqj2lJ5L1L1K3OopLJ9L0L2K9J9Nj1k0j8j3j3j6j8j9j9j6rlmj0j5j3jJ0J8
$$ plain form
4162 42 40 44 52 60 62 58 46 32 26 33 52 74 90 98 98 92 87 88 94 95 85 64 40 15 -10 -39 -65 -82 -81 -60 -26 9 41 71 99 120 128 126 120 111 92 64 36 19 11 10
4143 10 10 14 24 39 58 77 92 99 99 97 97 102 109 113 113 117 128 141 146 140 129 128 138 155 173 188 197 201 201 197 186 172 162 162 170 177 174 163 149 135 120 104 92 88 93 106 124
4124 124 143 153 145 116 70 24 -8 -23 -23 -18 -9 4 24 43 52 48 42 45 60 78 91 99 102 102 100 102 111 125 141 157 173 184 185 177 162 138 105 72 52 46 44 38 32 43 75
4106 75 118 157 179 184 178 171 169 173 185 201 214 216 209 199 189 176 157 136 120 109 100 89 74 59 42 27 16 12 12 16 24 40 58 65 54 31 6 -8 -13 -9 4 28 57
4089 57 82 101 118 134 143 142 134 126 120 115 117 133 159 178 177 161 145 143 152 166 175 180 182 187 194 194 187 177 176 184 197 207 208 200 188 178 175 176 176 180 197 222 241 247 246 244 239 229 217 212
4069 212 214 217 215 207 191 166 137 113 96 84 73 66 64 65 65 63 60 56 56 65 75 76 68 63 73 99 129 155 166 157 131 100 80 75 70 57 36 14 -10 -39 -70 -96 -110 -115 -109
4051 -109 -92 -66 -39 -23 -22 -32 -40 -35 -15 12 39 59 71 70 54 27 0 -14 -14 -2 19 44 66 77 76 63 40 7 -29 -54 -55 -33 1 38 65 75 65 43
4036 43 19 -2 -18 -27 -30 -34 -42 -54 -57 -42 -11 20 43 49 43 36 39 58 88 120 149 168 173 162 142 124 111 98 82 64 45 26 10 1 -2 -6 -16 -31 -44 -45 -35 -17
4019a7J3JpoMJ4J7J4QPRQMnj2j2j0nlmqj0oOJ9K4J9QJMQQLk%LOQJ3K0K0J3PONmk2l2l4k4j3
3998F4mknj2j6j4j3j4j0jJ1J8K2K0J1jj1j8j9j5qMJ5K3J8Mj3k0j1NJ6J8J8K1K7K7K4J8J7J8
3982B12J9J2Jj3k3k8l3l6l1k1j3j2j2nMJ1J4J5J1LnlPJ1J2J5K2K1Qj1j9j8j2j0j1j4j2rnp
3966C5j0j4j7k2k4j7nOJ2J6K2K6K9L1L5L4K5Prj7j2kLjj1k3l6m8m9l7pK2L7L5L0K2J1%jNQ
3950H9Nnj2j0rrj2j2j1rqnNJ6J8J0OJ1K1K3J5Jqj0mMPKmlKPO%mj1j9k5k7k3j7j1mKKkmNK2
3930AL7L4J4rj9j4qqj2j4j3j6j8k1k4k5j8KK9M4M2K9K4K6K7J6lj8k2j8j2kMMmj2j4roKJ3K2
3913C1J8QNRQ%nJJ1J3Plrj5j6j1mLONLJNJ2J8J7J5J2Kj3k7k4pOJ0QRJ1Olj4j7j2nnj2j2jN
3893E0nk3k5nK2L6L4K4J7J5J1Mrj8j8nJ0J7J4PKoj4j5qnj1k3l2l4l2k6j1J1K6K9K3J5J2PL
$$ plain form
4019 -17 -4 -3 -10 -16 -12 2 19 33 41 48 57 65 69 64 52 40 30 25 22 18 10 0 -6 0 19 43 62 70 71 75 83 91 94 92 92 95 101 109 122 142 162 175 182 188 193 189 167 135 101 77 64
3998 64 60 58 53 41 25 11 -2 -16 -26 -27 -16 2 24 44 55 54 43 25 6 -9 -17 -13 2 25 43 47 34 14 3 8 24 42 60 81 108 135 159 177 194 212
3982 212 231 243 244 231 208 180 147 111 80 59 46 34 22 17 21 32 46 61 72 75 70 67 74 85 97 112 134 155 163 152 133 115 103 93 82 68 56 47 42 35
3966 35 25 11 -6 -28 -52 -69 -74 -68 -56 -40 -18 8 37 68 103 137 162 169 160 143 131 129 132 131 120 97 61 13 -36 -73 -80 -58 -21 14 44 66 77 77 76 81 89
3950 89 94 89 77 67 58 49 37 25 14 5 -3 -8 -3 13 31 41 47 58 79 102 117 118 110 100 96 100 107 109 105 102 104 111 117 117 113 102 83 58 31 8 -9 -20 -24 -22 -20 -22 -26 -21 1
3930 1 38 72 86 77 58 44 36 28 16 2 -11 -27 -45 -66 -90 -115 -133 -131 -102 -58 -16 13 37 63 90 106 103 85 63 45 33 31 35 39 35 23 9 0 -6 -4 9 31
3913 31 49 57 62 71 79 79 74 75 86 99 106 103 94 79 63 52 48 51 57 62 65 66 71 83 101 118 133 145 147 134 107 83 76 82 92 100 109 120 126 123 109 92 80 75 70 58 46 45 50
3893 50 45 22 -3 -8 14 50 84 108 125 140 151 155 146 128 110 105 115 132 146 153 155 149 135 120 112 107 96 73 41 7 -25 -51 -62 -51 -25 4 27 42 54 61 64
3877F4%NJ2J8J7Qmj0mQJ4R%%LKoj2j1nJRJ4J4J0OKmj6l3m3m0k7pMMKjnj6k2j9pKkmLJ7K5K1
3857dQ%pj0j1rqpjPJ5J5P%m%ORJ4J4J1%j0j4rLJ3J9J9Roj8j9j1JJ6K7K7J2oj6j9j8j7j3jJ3
3838B7K2K2Rnj1mPJ1P%pqjJ2J9J3JnmmkJPKj1j8j3lKjnpm%kqj2mJ4K1J1pj6j4qokK%qk0k4
3817c4j3J0L0L6K9J7NjnJJ3K2J7Kj2k3l2l5k8oJ7L1K9J7RJ0J7K5K6K1Ork4k8k0oRJ6J0lj2
3801A34j2lPJ1Nmj2j2rl%JNRRNkrj2j0nKPJ2J5J7J7J6J3Pkj7k9l6l5k7j7j2j2j3pLRJ4J6J7
3782E1J1MPK0K8J5j1k8k8j6nQJ9K5K3J5J1J2J0Kj1k9l8l6k6j7j2nKRPoj8k5k1j3%J1J8J9J5
3766cQRJ5J9J3KjPJ6J8J4J0Mmj4k4k6j6JJ7K5K0Rkj3k2k9k4j0LOKlJQJ6J7J5J1PMLMMJlmJ
3746A12RJ9K0J0j3l4m1l6k1pLPLlmMRJ2J0J0J0RJ2J7K0J8J9K4K7K0Lrj1rj2k2l3l8l7l2k4
$$ plain form
3877 64 64 69 81 99 116 124 120 110 106 114 128 137 137 137 140 142 136 124 113 108 109 118 132 146 156 162 164 160 144 111 68 28 1 -6 -2 2 4 3 -2 -18 -40 -59 -66 -64 -66 -70 -67 -50 -25 -4
3857 -4 4 4 -3 -13 -24 -33 -41 -48 -49 -42 -27 -12 -5 -5 -9 -9 -3 6 20 34 45 45 35 21 12 15 28 47 66 75 69 51 32 21 22 38 65 92 104 98 82 63 45 28 15 14 27
3838 27 49 71 80 75 64 60 67 78 85 85 78 70 69 81 100 113 114 109 105 101 99 100 107 109 98 80 67 64 66 65 60 53 49 49 47 39 27 23 37 58 69 62 46 32 24 18 16 18 18 10 -10 -34
3817 -34 -47 -37 -7 29 58 75 80 79 74 75 88 110 127 129 117 94 62 27 -1 -7 10 41 70 87 96 106 123 148 174 195 201 192 168 140 120 114 123 139 149 146 134
3801 134 122 119 126 137 142 138 126 114 105 102 102 103 108 117 126 131 129 120 108 98 93 95 102 114 129 146 163 179 192 199 197 180 151 115 80 53 36 24 12 -1 -8 -5 4 18 34 51
3782 51 62 66 73 93 121 136 125 97 69 53 48 56 75 100 123 138 149 161 171 173 162 133 95 59 33 16 4 -1 1 10 17 11 -7 -32 -53 -66 -66 -55 -37 -18 -3
3766 -3 5 14 29 48 61 63 62 69 85 103 117 127 131 127 113 89 63 47 48 65 90 110 119 117 104 82 53 29 19 22 28 30 27 28 36 52 69 84 95 102 106 109 113 117 118 115 111 112
3746 112 121 140 160 170 157 123 82 46 25 18 21 28 31 28 24 28 37 49 59 69 79 88 100 117 137 155 174 198 225 245 248 239 228 219 207 185 152 114 77 45 21
3730B1j1PK8M2M5L8L0K4J4jj5j9j3%J4J8J4Nnj1j4j3oJMJ%%jmkJJj0j9k1j3mKMPOMLOQPJq
3710A66j6j8j5j3j6k3k5j9pJOOKjnnkKJqj2j1nJPJ2J9K4K4K0J5ROJ2J9J8Mj8l9m7m3l3k4k1
3693e2j8j1MJ7K7L2K9K0Plopj5k1j7pLQPJ1K1L0L5L3K5J4Mkpqpklj3k8l3k4j0kmpqj0j1qM
3674a3J6J6QKNJ2J4J0NJkJJ0J8J4Omj0j8k7k6j5kMK%MJ5K5L0K5J5OJkkJJ0J5J3Kj5k7l3l2
3656G8k4j1PK0K1J1JooonjJLPJ3J4R%jjok1l0k4j2mnnmjjk%OJ7K8L2K6J8J4J6Qj2l1l8k9q
3637E6J2K2J5Jj0j0lJ%jjljKON%pj9l5m2l3j2MPPJ2J7J4J1J1J4J5J0PJ1J9K8L4L2J9Lqj1m
3619A95JPRLrk1k1j1MJ5J9J5%j5k1j8q%MPRPJmm%OQQJklkmnmLPNkrj8k4k6k0lJ5K6K3J6RP
3598A76Lnj0ronrrn%KQJ4J4OprLJ4Qj2l1l4k1lJ1K1K3J9RjlKJ0J3J1Moj9k4j7jRJ1OKoj3j4
$$ plain form
3730 21 10 17 45 87 132 170 200 224 238 237 222 203 190 190 204 222 236 241 236 225 211 198 192 193 197 198 198 198 197 193 191 192 193 183 164 143 130 126 128 132 139 145 149 152 158 166 173 174 166
3710 166 150 132 117 104 88 65 40 21 14 15 21 27 29 28 23 18 16 18 19 11 -1 -12 -17 -16 -9 3 22 46 70 90 105 114 120 132 151 169 173 155 116 69 26 -7 -31 -52
3693 -52 -70 -81 -77 -60 -33 -1 28 48 55 52 46 39 24 3 -14 -21 -18 -10 -3 8 29 59 94 127 152 166 170 168 161 153 146 144 141 128 100 67 43 33 31 27 20 12 2 -9 -17 -13
3674 -13 3 19 27 29 34 46 60 70 75 76 74 75 85 103 117 123 119 109 91 64 38 23 21 25 27 27 31 46 71 101 126 141 147 148 146 144 145 155 170 183 185 170 143 110 78
3656 78 54 43 50 70 91 102 103 97 91 85 80 79 80 83 90 103 117 126 126 125 124 118 97 67 43 31 27 22 17 13 12 11 9 9 15 32 60 92 118 136 150 166 174 162 131 93 64 56
3637 56 68 90 105 106 96 86 83 84 84 83 82 79 78 80 86 91 91 84 65 30 -12 -45 -57 -53 -46 -39 -27 -10 4 15 26 40 55 65 72 83 102 130 164 196 215 218 210 199 195
3619 195 196 203 212 215 206 185 164 153 157 172 191 206 206 191 170 152 144 144 148 155 164 171 172 168 164 164 170 178 186 187 185 182 180 176 171 167 170 177 182 180 171 153 129 103 83 80 95 121 144 160 169 176
3598 176 179 174 164 155 149 144 135 126 121 121 123 131 145 159 165 158 149 152 166 174 162 131 97 76 73 84 105 128 147 156 155 152 154 164 177 188 192 186 167 143 126 125 134 145 151 153 147 134 120
3578A20rllnlPJ2Pmj0pmoj0j2oLJ1J5J5J5J4J6J5J2jj5k1j9j0mk%loplNJ3J4J1Jj0j5rjKk
3559I8%OJ2Nqk0k2j8j2oJRJ2J0LnnKPKnpNK5M0M3L2J4OQJ6J4Kj4k3k2j3nlj2k4k8k2j1npj1
3540F4j8k2k2j5oKJ1J8K6K8K4J4Mnj2j6j4pLRJ0Mkj1j7j9j6j1m%%OJ3K0K1J2kplQJ4J1Kpo
3522H2%NJj0k1k0j1l%mj0j6k1j4jJ1J5J6K0K6K3Oj4k1j2OK1K9K7J8J3J5K0J9QLOJ5J5RJoj6
3505B30k7k3%K5L1J8Krj8k5k9k3rLJ2J2Mrj4j4j0qpprj2j7j8j9j7rOK1K8K4J6J1Olqj1j0q
3487G6mRK1K3Rj0k1k1j3lJ0K0J9Qpj4j5j3j6j6j2okkkjjlrj0pjNQPQQPJ2K5L6L6K0lj9l1l7
3469F8m0l5l2k8j9qLRRJ0OKm%J0K0K2J4Jj2k0j7qnpp%OQMjpj3j5j0jPJ2J4J2J4K0K9L8L1J8
3450I8OKNNkj2j6j5j0pnKJ0J1NjjLKnj5k4l2l3k9j5LK1K9J8mj6nJ8L4L4K7K1J5Pjpj7k7l0
$$ plain form
3578 120 111 108 105 100 97 104 116 123 119 109 102 98 92 82 70 64 67 78 93 108 123 137 153 168 180 179 164 143 124 114 110 108 108 105 99 92 89 94 107 121 132 133 123 108 99 98 100 98
3559 98 98 104 116 121 113 93 71 53 41 35 36 45 57 67 70 65 60 62 69 71 66 59 64 89 129 172 204 218 224 232 248 262 264 250 227 205 192 187 184 172 148 120 98 87 82 75 64
3540 64 46 24 2 -13 -19 -17 -6 12 38 66 90 104 108 103 91 75 61 54 57 66 76 80 78 67 50 31 15 4 0 0 0 6 19 39 60 72 70 63 60 68 82 93 95 88 82
3522 82 82 87 88 78 57 37 26 23 23 19 9 -7 -28 -42 -43 -32 -17 -1 19 45 68 74 60 39 27 33 54 83 110 128 141 156 176 195 203 206 212 227 242 251 252 246 230
3505 230 203 180 180 205 236 254 256 247 229 204 175 152 143 146 158 170 174 165 151 137 127 119 112 105 96 84 67 49 30 13 4 10 31 59 83 99 110 116 113 105 94 84 76
3487 76 72 81 102 125 134 124 103 82 69 66 76 96 115 123 116 102 87 74 58 42 30 24 22 20 18 17 16 13 4 -6 -13 -14 -9 -1 6 14 22 29 41 66 102 138 158 155 136 105 68
3469 68 28 -7 -39 -67 -86 -94 -91 -82 -73 -63 -57 -55 -59 -59 -49 -29 -7 7 8 -4 -24 -41 -49 -54 -61 -68 -68 -62 -54 -50 -51 -58 -71 -86 -96 -97 -90 -78 -64 -52 -38 -18 11 49 80 98
3450 98 104 106 111 116 114 102 86 71 61 54 49 51 61 72 77 76 75 78 80 75 60 36 4 -29 -58 -73 -70 -49 -20 -2 -6 -22 -27 -9 25 59 86 107 122 129 128 121 104 77 47
3432D7k1pLPJ3J6J3MnnMJ3J9J8J4Onj3k2k9l7l6k5kJ8K9L3L2L0J8Jj5j6oMLqk0j9oORMoj0
3414E1j1p%MKlkQJ6J9K1K7L6L6K4Pj0k0k1j4j3j7k5k3j2jK%JKLKnj1j7j6oJ0K2K7K2Orj8j5
3396G2qqj5k0j3JJ4J8K1K7K7J4mqLJ1Jj2j7j4j2j6j3%J4K3K4J8Kj8l6l7k4oJ2J9J4JoJJ7L0
3379I7L3L2L0K5J8Nj3k8l6l4l2k9k4j0KOjlkKjqj3j5j1nMJ1QPOQJ1J3J9K6K5J4lj5k1k1k0
3362E7j1JJ4J8J5J1RQNlqqmkj%OJ1J1J0J1J1PjmKJ0Qlj8l2l9l5k2nOJ0J4J4J0Jnnmoj1j4j0
3342B9%J0J3NmmKRQPRJ1ONJ4K6K3Mj5k0j3lKKjkkJL%qj6j5qOJ6K2K1J4KnpmknnJRJ1N%kMQ
3321A67J1RMjomJQJ3J0Jpqqj1j5j6j0oj3k5l3l2k1qMJ1J6J4Rlj5k0j5lPJ5J9K2K6L1K9J5k
3303A60j4j4j2j6k1k2j6mPJ8K3K5K0Rqk3l0k2qKRJ5J8J6PK%jqj6k2k4k3j8qNJ7K3K4J7J1N
$$ plain form
3432 47 26 19 22 29 42 58 71 75 70 65 69 82 101 119 133 139 134 121 99 70 33 -3 -28 -30 -12 17 50 82 112 130 131 116 100 94 98 101 93 73 54 48 54 63 67 61 51
3414 51 40 33 33 37 39 36 34 42 58 77 98 125 161 197 221 228 218 198 177 163 150 133 108 85 73 72 74 74 75 77 80 82 77 66 49 33 27 37 59 86 108 114 105 87 72
3396 72 64 56 41 21 8 9 23 41 62 89 116 130 126 118 121 132 133 121 104 90 78 62 49 49 63 86 110 128 130 112 76 39 15 9 21 40 54 55 49 50 67 97
3379 97 130 162 192 217 235 240 227 199 163 129 97 68 44 34 36 42 41 38 36 38 37 29 16 1 -10 -15 -11 0 8 15 21 29 40 53 72 98 123 137 134 119 98 77 57
3362 57 46 47 61 79 94 105 114 122 127 124 116 108 104 102 101 101 107 118 129 139 150 161 168 167 163 165 175 183 180 162 130 91 56 34 29 35 45 59 73 83 84 79 74 70 64 53 39 29
3342 29 29 39 52 57 53 49 51 60 68 75 84 95 101 106 120 146 169 173 158 138 125 122 124 126 125 123 121 122 125 125 117 101 86 78 84 100 122 143 157 159 154 147 143 141 136 131 132 141 152 157 157 155 159 167
3321 167 178 187 191 190 184 180 181 189 202 212 213 206 198 190 179 164 148 138 132 119 94 61 29 8 0 4 15 31 45 54 51 36 16 1 -2 5 20 39 61 87 118 147 162 160
3303 160 146 132 120 104 83 61 45 41 48 66 89 114 134 143 135 112 82 60 52 54 63 78 96 112 119 121 121 120 112 96 74 50 27 9 1 6 23 46 70 87 98 103
3286A03OPOKkoqpqj3j9j6%J5J7OpqMJ7K2J5lj6j3KJ4J6QMKK%kJJ1K2K9K5J4KlnkJLJpj4j9
3266A99j7j3pmlmnj0j3j2lPRKmJJ1J6J0kj2j7j5j1pnqomk%JPJ3J4RMLLjj3k2k0j4rplMRQQ
3246F5J1J5J7J8J7J6J6J9K5K4Qrj9j6pjMRJ2Rjj1j6j4qnprpmoj1j5j4j1qkJ0K2L0L1K9K7K9
3228B62L0K3Prj6j1qj0j5k2l1m2m6l1qJ5K8L4K9J4lj1j1j2j4j2onj2j8j2LK0L2L4K5J1MPQ
3212B21jj6k4k8k8k8k3j4jQJ2Qnj8k6k3j4mMJ4K4L0L2L1K5J6Kj8l6m7l7j1J9L8M3L6J7kj1
3196A65lQJ3J2J4J2Jj8l1k8k2j8j5oQJ5J1Lpj8k7k3j3JRJ4J8J7J0KjjmomJNLJNJ1J1Mqj2l
3178A06J4K9L0J4j2l1l0j3MLrj8j8j1nLRJ6J6J7J4Pmj8k6l0l1k8k1j2j0j1qLJ5J8J7J1PKk
3161GlJNJ0J0OJMJ0J2OKNJ0J0RJ4J8J7RJKMKnj5k4k7k1pQJ7K2K0J4Lrj7j7q%kj1j9j4NK2K5
$$ plain form
3286 103 109 116 122 124 122 116 108 101 93 80 61 45 45 60 77 83 76 68 72 89 111 126 123 107 94 96 110 126 134 138 140 142 142 140 141 152 174 203 228 242 244 241 236 234 235 238 239 232 218 199
3266 199 182 169 162 158 155 151 146 136 123 111 108 115 124 126 122 123 134 150 160 158 146 129 114 103 96 91 83 77 73 71 71 72 79 92 106 115 119 122 125 124 111 89 69 55 46 39 36 40 49 57 65
3246 65 76 91 108 126 143 159 175 194 219 243 251 242 223 207 200 199 203 212 224 233 232 221 205 191 183 178 171 162 155 151 145 134 119 105 94 86 84 94 116 146 177 206 233 262
3228 262 292 315 322 313 297 286 278 268 253 231 200 158 112 81 73 88 116 150 179 193 190 179 168 156 142 130 124 119 107 89 77 80 100 132 166 191 202 206 213 221
3212 221 220 204 180 152 124 96 73 59 58 66 78 86 81 63 37 14 0 -4 0 14 38 68 100 131 156 172 174 156 120 73 36 25 44 82 125 161 178 176 165
3196 165 162 170 183 195 209 221 222 204 173 145 123 105 90 84 92 107 118 121 114 96 69 46 33 34 43 57 75 92 102 104 103 102 98 92 88 89 94 97 98 103 114 125 129 121 109 106
3178 106 120 149 179 193 181 150 120 107 111 114 105 87 69 58 53 56 65 81 97 114 128 135 131 113 87 57 26 -2 -23 -35 -45 -56 -64 -61 -46 -28 -11 0 7 9 7
3161 7 4 5 10 20 30 36 37 41 51 63 69 71 76 86 96 105 119 137 154 163 164 166 170 172 167 152 128 101 80 73 81 98 120 140 154 157 148 131 114 106 106 104 93 74 60 65 87 112
3142A12J4%j4j9j8j0%M%ll%lj0j7j4lQJ2Pmj5k4k1j2lkqj0jJ2K1J9J4J4J8K1J8J6J9K8L8L9
3125B20K7Oj6k6k0oQJ1Ooj7k2j9j3j0j3j1lJ0J9K1J6Rmj3j3nNJ4K0K4J9Opj3j0mJKkrj3j1
3108A58ro%J3K6K9K2J1kk1m2n1m1k6j2omkmqj1j4j6oJ1K8L1J9Kqqopj0qLJ0Lk0l8l8j6LJ1
3090f0ROPJ1J2J3J2J5K1K8K9K2J1jnojMMmj4j9k1k3k1qJ1J9J3kj0j2rmOJ6K5K8K9K9K8K4J6
3073B28J0KkmkjjjKMMkj2k1j7kJ2J3mk1k4j7j0pnrj6k3k2qJ3K5K4J3%mjKJjKQJ2J3J5J7J4
3054A97Olj0j2j3j2j3j6j9j9j0OK1K6K2J2Lrk2l4l5k6j1lkmjKJkqj4j9j8pMJ2J3J4RP%lkK
3036A0PJ1J2J1QLkmJRJ3QMNROlqmJJlqj0qrj3j6j1LJ8J8OooKQJ0J2J2J2J4J8K0J1mj6k0j4
3016A18pmpj0j1lJ2K7L3L1J5ok6l0k3rmpj3j5j1pnpj0qk%rk0k5j5LJ9K7L1L0K1J0KKOPQNn
$$ plain form
3142 112 126 126 112 93 75 65 65 69 69 66 63 63 60 50 33 19 16 24 36 43 39 24 0 -21 -33 -36 -38 -46 -56 -57 -45 -24 -5 9 23 41 62 80 96 115 143 181 220
3125 220 247 253 237 211 191 185 193 204 210 204 187 165 146 133 123 110 99 96 106 125 146 162 171 167 154 141 136 141 155 175 199 218 224 217 204 194 190 191 193 191 182 169 158
3108 158 149 143 143 156 182 211 233 244 242 221 179 128 87 61 49 43 39 37 33 25 14 0 -16 -22 -11 17 48 67 69 61 53 47 40 30 22 25 35 38 18 -20 -58 -74 -71 -60
3090 -60 -51 -45 -38 -27 -15 -2 10 25 46 74 103 125 136 135 130 124 123 127 131 127 113 94 73 50 29 21 32 51 64 62 52 40 31 27 33 49 74 102 131 160 188 212 228
3073 228 238 240 238 234 232 231 230 229 231 235 239 237 225 204 187 185 197 210 206 185 161 144 134 127 122 113 97 74 52 44 57 82 106 119 119 115 114 116 117 116 118 126 138 151 166 183 197
3054 197 203 200 190 178 165 153 140 124 105 86 76 82 103 129 151 163 166 157 135 101 66 40 29 26 24 20 19 21 22 20 12 -2 -21 -39 -46 -42 -30 -17 -3 6 13 13 10 8 10
3036 10 17 28 40 51 59 62 60 56 57 66 79 87 91 96 105 111 108 100 96 97 98 95 87 77 69 60 47 31 20 23 41 59 65 59 53 55 63 73 85 97 109 123 141 161 172 168 152 132 118
3016 118 111 107 100 90 79 76 88 115 148 179 194 188 162 132 109 100 96 89 76 61 50 43 38 31 21 13 11 11 2 -18 -43 -58 -55 -36 -9 22 52 73 83 85 87 93 100 108 113 108
2998A08j7k9l6l7l6k4j0KKpj0lOJ2J1N%ljLJ2J9K7L4M1M0K8J2jnkkqj7k1j7j1noj0j5j3jJ2
2980B7J8J3MMJ4K5K8J7kj9l1l3k7k2j6p%LMRJ9K6K5J7J1J0P%j0j2lJ0J5J0%ooKJ2J4OpqjN
2962A45kj4j5j3j4k2k5k0j3j1qJJ4K1J7J2PJpj1nOJ8K2K1J5Olj0j3ql%Jkmpj0j1qkOJ2J7J7
2944I8J7J5J3Qjprrj1j6j5pJKjmNJ7K4K4J9J3J0Lknqj0j3j2rommmoj2j5j0NJ8K2J7Ppk0k2
2925H9j4JJ3J3Pnj3j8j5j2j0j0qjQJ7K3K6K6K1J1%kMJ4J8J1Mkmqj3j8k2k4k4k1k0j8j5j0q
2908irj0oMJ3J5J1QOQJ2J5J2Mrk2k9k5j4LJ6K3K6K4J7Pjpj1j3j2pjRK3L6L9K7Qoo%NOKnj0
2889A67j0qlmoj2j6j6j5j4j8k2k2rOK2L3L1K5J7J4J2Oqj8k1j8j7j8j6nNQMKORQKmoolMJ5K0
2871A01J5P%nj1j5j9j5j0mKJ3K7L5L2J5nj6j3%RRKpj3j5j5j7j6j2j0j1j7j7pLRLnmPK2L9M9
$$ plain form
2998 108 91 62 26 -11 -47 -71 -81 -79 -77 -84 -94 -97 -91 -79 -68 -63 -63 -66 -67 -64 -52 -33 -6 28 69 109 137 149 148 143 141 139 131 114 93 76 65 60 54 44 29 16 15 27
2980 27 45 58 62 66 80 105 133 150 148 129 98 65 38 16 0 -7 -7 -4 0 9 28 54 79 96 107 117 124 124 114 102 99 109 124 134 134 128 122 124 136 150 156 149 141 140 145
2962 145 143 129 114 101 87 65 40 20 7 -4 -12 -11 3 24 41 53 60 61 54 43 38 44 62 84 105 120 126 123 113 100 92 89 89 90 88 84 77 67 56 48 46 52 64 81 98
2944 98 115 130 143 151 150 143 134 125 114 98 83 76 77 79 78 74 79 96 120 144 163 176 186 189 187 182 174 164 151 139 130 124 120 116 112 106 94 79 69 74 92 114 131 138 131 111 89
2925 89 75 76 89 102 109 104 91 73 58 46 36 26 18 17 25 42 65 91 117 138 149 149 147 151 165 183 194 198 196 192 184 171 153 131 107 83 62 42 24 9 -1 -9
2908 -9 -18 -28 -34 -30 -17 -2 9 17 23 31 43 58 70 74 65 43 14 -11 -25 -22 -6 17 43 67 84 91 90 83 72 59 47 40 39 48 71 107 146 173 181 175 169 169 174 180 182 177 167
2889 167 157 149 146 142 136 124 108 92 77 63 45 23 1 -8 -2 20 53 84 109 126 140 152 158 150 132 111 93 76 58 42 37 42 50 54 56 62 71 79 81 77 71 65 62 66 81 101
2871 101 116 123 123 118 107 92 73 58 48 44 46 59 86 121 153 168 163 147 134 134 143 152 154 147 134 119 104 87 71 59 49 38 21 4 -3 0 9 12 7 3 10 32 71 120
2853A20N1M0J8nk2k7k5j9j3oLJ0R%qj0qj2k0k6k0pOJ1J5J8J9J7J3J0Npj9k6k6k2j8j2kQJ1
2837B4POQJ2J0MJJLJ0K1L0K9J7NKJ1J8J9J4Nqj8k3k3k1k4k5k1j3rj1r%J8L1L3K2Qmolnrj1
2818A26plmnLJ3J8J2MNJ3J4Qnj6k2j9rjJJQJ7J9J1KKNKqj8k4k3j9j1kOJ4J9K0J6J6J7K3K2
2800B41J2rl1m2l6j9kNLjmkLRJ0OJmqj1j4j4pLJ5K1K1J3Moj4j9j9j6j6j8j4lJ0J8J6J5J7J6
2783A30Prj9k3k0j4rjPJ7K2K3J7Lj1k2k7k5j8qjLKNJ3K2K7K3J7Q%oo%OOJ%J2K2K5J7QJmqj1
2764B02j0j0j1j4j7j9k5k9k1KK1K6J5%rj1qLJ7K9K7J5JpmRK2K1Mj9l0k7j8j0oJQJ3J4Pmj3
2747A35j4oPJ3J5J1PKoj8l0l5k9j8j2rnNJ3J7J5RJorol%PJ6J7QkJJ1K0K1J8J8J5Q%pokL%j0
2728A80j8j6qnppmrj6k2k3k5l3l6k0OJ8J0lj0mMJ6L0M3N3N0L6J5%npj2k1k2j6onrj1nOJ7K4
$$ plain form
2853 120 171 211 229 224 202 175 150 131 118 112 115 125 134 134 126 116 108 96 76 50 30 23 29 40 55 73 92 109 122 132 137 130 111 85 59 37 19 7 5 13 24
2837 24 31 37 45 57 67 71 72 73 76 86 107 137 166 183 188 190 201 219 238 252 257 249 231 208 185 164 140 115 94 81 72 61 52 52 70 101 134 156 164 160 154 151 146 137 126
2818 126 119 116 112 107 110 123 141 153 157 162 175 189 197 192 176 154 135 126 125 126 127 135 152 171 182 184 186 191 193 185 167 143 120 101 90 88 94 108 127 147 163 179 196 219 241
2800 241 253 244 213 171 135 116 114 119 122 121 117 115 118 127 137 143 144 140 132 121 107 93 86 89 104 125 146 159 163 157 143 124 105 89 73 55 41 38 48 66 82 97 114 130
2783 130 137 128 109 86 66 52 43 42 49 66 88 111 128 131 120 98 71 46 28 20 19 22 24 29 42 64 91 114 131 139 139 133 127 127 133 139 140 140 152 174 199 216 224 225 221 213 202
2764 202 192 182 171 157 140 121 96 67 46 48 69 95 110 110 101 90 82 85 102 131 158 173 174 167 163 172 194 215 219 200 170 143 125 115 109 110 118 131 145 152 148 135
2747 135 121 115 122 135 150 161 168 170 164 146 116 81 52 34 22 13 8 13 26 43 58 67 68 62 53 47 44 44 51 67 84 92 90 91 102 122 143 161 179 194 202 202 195 189 187 190 190 180
2728 180 162 146 138 133 126 119 115 106 90 68 45 20 -13 -49 -69 -63 -45 -35 -38 -48 -52 -48 -32 -2 41 94 144 180 195 195 190 183 171 150 128 112 106 101 92 81 76 82 99 123
2710A23K5K2J5J0Mnj3j4j1rj0j4j2qpj0j6k0k7k7j9KJ9K2J5RQPMMJ0J5J4J2J4J5J0lj5k1k0
2694I8j9j8j6j2jJ0J5Qpj7j2MJ4Qnj5j5oMJ4J5J4J0J0J2J1PMJ0J8K4K0Rkj0j3j8k2k4j9mJ1
2677I5K4L2L6L2K1Lj2k1k2j3kPRN%mrj4j9j5qjKLJJPJ9K5J7KrrmJNQJ1J7K4L1L1K0Npj8k9
2658B78l9m4m2l2k2j4j0lMRRMMJ2K2K2J4JomOJ7K1J3jj3j7j5rjNKornMJ2J1Lrj8k0j7j8k5
2640G4l4l1j8kJ1K0K5K4J7Lrj9j7mJ4K9L0K3J5J2J0J0J0J2J0%j2j7j0jjj3k6l3k9k0oRK7M0
2624A23M3L1Qj0j9j9k0k1j6kJ4J9Rj0k6k6j4MJ8K4K5K1J8J3Onj5j8j4j2k0k9k5mJ9K9K3J0
2608A32Jnqj0j5j7j3mKMK%mj3j5mJ3J8Nj2j5pKMLJKNPOJk%KLNOLnj3j4oQJ8K4K0J1LMMKlp
2587A29j0j9l4m4m0k5lJ8L1L1K2J5J2J0QOMLjkLQPMQJ3J3NjmkkJjpj2j0kLjnkQJ5J4QKNJ0
$$ plain form
2710 123 148 170 185 195 199 194 181 167 156 147 137 123 111 103 96 86 70 50 23 -4 -23 -21 -2 20 35 44 52 59 63 67 77 92 106 118 132 147 157 154 139 118 98
2694 98 79 61 45 33 32 42 57 65 58 41 29 33 47 55 50 35 20 14 18 32 47 61 71 81 93 104 111 115 125 143 167 187 196 194 184 171 153 131 107 88 84 95
2677 95 119 151 187 219 240 243 231 210 188 175 173 180 189 194 194 190 181 167 148 133 125 124 126 129 130 131 138 157 182 199 201 192 183 179 180 185 193 204 221 245 276 307 327 332 325 307 278
2658 278 239 195 153 121 99 85 75 72 76 85 94 98 102 114 136 158 172 173 167 163 169 186 207 220 219 206 189 174 165 164 169 171 165 156 151 155 167 178 181 172 154 134 117 99 74
2640 74 40 9 -9 -11 0 20 45 69 86 89 80 61 44 40 54 83 113 136 151 163 173 183 193 205 215 215 203 186 176 175 174 161 135 102 73 53 47 56 83 123
2624 123 166 197 205 195 176 157 137 116 100 98 112 131 140 130 104 78 64 68 86 110 135 156 174 187 193 188 173 155 141 129 109 80 55 51 70 99 122 132
2608 132 133 128 120 110 95 78 65 61 63 67 69 69 65 52 37 33 46 64 69 57 42 35 37 41 44 45 47 52 59 65 66 64 64 66 69 74 80 83 78 65 51 45 53 71 95 115 126 129 133 137 139 136 129
2587 129 119 100 66 22 -18 -43 -46 -28 3 34 56 71 83 93 101 107 111 114 113 111 114 122 129 133 141 154 167 172 171 167 165 163 164 163 156 144 134 132 135 134 129 127 135 150 164 172 174 179 189
2568A89Qnj7k3j8j1lPJ6J6jj9k0qLNNRJ2Omj2j6j8j6j1k%nojQJ3OmqlRJ9K3J4mk1l1l0j8l
2549C0J3K2K3K4K4K5J9Npj2qkkqj5rOK1K4J4KkNJ5J8J2kj8k9l0k4j4qon%QJ5J6J1QPjj8l6
2531A11l8k4mJ0J9K4K0RloJJ1J4J3Kj3l0l9m1l6k7j3KJ3J4J0JlJJ5L2L7K8Rmnk%nj3k4l2l1
2513Cj8JJ5K1K1K2K0J0nj6j6rmjOJ6K5K4J9J5J6J1Jj2j7j1nmqqKJ7K3J8PJkloj1j1mNQ%j0
2495A46j4rjL%kllk%KLknkLPKrj9k0j3l%MJ3K4K8J8jj8k4k3j6ql%MQJ1J1QNKjmlJPJ0PKmo
2473A11oqj2j7j7j1KJ9L2M0M0L4K7K0J4J2J0Onk0k7k4j5j3j7k3k3j7oOJ2Nj0k2k6j9rMJ3J4
2457G4Nqj3nQJ5J3MkpolLLnj9l1l4l2k0mJ2K1K0J2KlmkOJ3J6J3RPOLmj2j6j7j4rkLKk%J0K6
2437C2L2K7J8J0ROJoj0j0pjKLnj2j2jJ1J6QJJRJ6J2LnpmjloqnjMQQOM%lrj3j4j3rmOJ4J9J8
$$ plain form
2568 189 197 192 175 152 134 123 120 127 143 159 158 139 119 111 114 119 124 133 145 151 147 135 119 101 85 74 72 72 67 61 60 68 81 87 83 75 72 81 100 123 137 133 112 81 51 33 30
2549 30 43 65 88 112 136 161 180 185 178 166 158 156 154 146 131 122 128 149 173 187 189 187 192 207 225 237 235 217 188 158 134 120 112 106 101 101 109 124 140 151 159 166 165 147 111
2531 111 73 49 45 55 74 98 118 127 124 118 119 130 144 157 159 146 116 77 36 0 -27 -40 -38 -25 -11 -1 0 -3 -2 13 45 82 110 119 115 110 108 108 103 90 66 34 3
2513 3 -15 -14 1 22 43 65 85 95 90 74 58 49 45 44 50 66 91 115 134 149 165 176 177 165 148 137 132 128 120 112 114 131 154 172 179 180 178 175 169 158 147 143 148 156 156 146
2495 146 132 123 122 125 125 123 120 117 115 115 117 120 118 113 111 114 121 123 114 95 75 62 59 59 63 76 100 128 146 145 127 103 80 64 56 53 53 57 65 76 87 95 100 102 101 97 94 95 102 112 119 121 117 111
2473 111 105 97 85 68 51 40 42 61 93 133 173 207 234 254 268 280 290 296 291 271 244 220 205 192 175 152 129 112 106 112 124 129 119 97 71 52 43 47 60 74
2457 74 79 71 58 53 61 76 89 93 91 84 78 75 78 81 76 57 26 -8 -40 -60 -64 -52 -31 -11 1 3 0 -4 -6 0 13 29 42 51 58 64 67 63 51 35 18 4 -5 -7 -4 -2 -4 -4 6 32
2437 32 64 91 109 119 128 134 135 129 119 109 102 101 103 106 101 89 77 76 87 103 111 112 113 122 138 150 153 148 141 137 136 133 127 119 114 113 117 125 133 139 143 143 140 131 118 104 91 82 78 84 98 117 135
2416A35J5J3RLlmLRJ5J3Omj0rjMLmrrqqrplMKpj6j9j1KJ3K1J9Ppj5j1qrj5j4qjLLkj0j6j5
2395C0oQJ8K1J8J4J1Plj5k1j7q%QJ1Mj3k9l0j9rkPJ8K8K7K8L0L2K7J5Mmprrj2j7k4l0l3l1
2378A8k1mJ2K5L2L6L1J7MkJKLNQQ%pj3j3j2oJ%oj2j0j0j4k3k6k1j1kORJ2J2J0Omj4j5%J9K7
2360E8J9Krrqj2j7j2LJ5J8J2NMPJ2J1Okrj1p%QRMnj3j3mNP%pplkk%OJ0Npk2l3l3k2JK2K8K4
2339C2K0K4K7J6nk3k9k3j1LJ2J3Jrj0jORO%mojJ1K1K5K0Qnj6j5nNPJopokKOQOJ1J9K3J9QJ
2319A86%jnn%NNok0k9k5j1MJ0QJlnpj0j4j6j4pLP%rq%NPOOQJ0J2J2PJmppokPJ2J0Kpj1j0q
2298G7lkJMJ1K1K8K6J3nk2k7k3j5nPK0K7K3J0lqkML%kloj4j5pJkj0j3nJK%klmJJ0J7J0j1k9
2278G6l3j5RK6K6J5NJnj7k8k7j5nkm%NRQNPJ8K8K7Rqj5j3j1j5j5lJ4K6K8K3J2Jn%PJ2Qjqj1
$$ plain form
2416 135 150 163 172 175 172 168 171 180 195 208 214 210 200 191 190 194 197 193 184 175 167 159 150 143 140 144 146 139 123 104 93 95 108 129 148 155 148 133 122 114 105 90 76 68 67 70 73 71 61 45 30
2395 30 24 32 50 71 89 103 114 121 118 103 82 65 57 57 65 76 80 67 38 8 -11 -20 -22 -15 3 31 58 86 116 148 175 190 194 190 183 174 165 153 136 112 82 49 18
2378 18 -3 -7 5 30 62 98 129 146 150 148 149 151 154 159 167 175 175 168 155 142 130 124 125 125 119 107 97 87 73 50 24 3 -8 -10 -4 5 17 29 39 45 41 27 12 12 31 58
2360 58 77 79 70 61 53 41 24 12 15 30 48 60 65 69 76 88 99 105 103 94 83 76 76 84 93 97 92 79 66 62 67 74 74 67 60 57 55 53 53 59 69 74 67 45 12 -21 -43 -42 -20 8 32
2339 32 52 76 103 119 114 91 62 39 28 31 43 56 57 48 38 37 43 52 58 58 54 48 47 58 79 104 124 132 127 111 96 91 96 103 104 98 91 85 83 85 91 99 105 116 135 158 177 185 186
2319 186 186 185 180 175 175 180 185 179 159 130 105 94 98 108 116 117 114 109 102 92 78 62 48 41 44 51 51 42 34 34 39 46 52 58 66 76 88 100 107 108 104 97 90 84 82 89 101 111 113 106 95 85 77
2298 77 74 72 73 77 88 109 137 163 176 171 149 122 99 84 79 86 106 133 156 166 163 155 153 157 160 160 158 155 149 135 120 113 114 112 102 89 84 85 87 87 85 82 78 79 89 106 116 105 76
2278 76 43 28 37 63 89 104 109 110 105 88 60 33 18 13 11 7 7 12 21 29 34 41 59 87 114 123 115 100 87 76 61 46 43 57 83 111 134 146 147 142 142 149 161 169 168 160 149
2260A49j0j2j7k4k7k4j5qmJJ0K0K9L2L1K8K1J1kj2j7j3lJ0J9J5Mqj7k0k0j6j2qnj%lnkjjl
2242G0KJ1J9J8J5J1Q%plJ3K9L5K7J0j1k5k6j4MK3L5L4K2Opj2j2rmMPjj1j7k0k3l0k9j5OK2
2225A55K5J4nk3k9k3qJ0J6J5RLKJoj8k4k1j4rlPK2K4J1nqKPkj7k4k4k4k5k2j1%NNOMjpqm%
2207b2PJ3J0%j7k3j4JOLKPJ4J3N%LJ0J4QKknrj0lJ4K5L0L1L1K4Jk8m3m0l0k5k2j6pjlnkOJ1
2188c6J3J1RQJ0QPJ1J9K1J8J2QOM%nnJJ7L3L9K9J4MJmj3k1k2k0k2k6k9k3qRJ9J9J5J7J9K1
2170A88K4K4J6ol0m3l7k5j9j7j5rmKOJ1J2J5J7J4Kj7l0l6l6l3k8j7JJ7K9L4L2K3J1KkKJ1J5
2154A04J2N%MJ2J7J5RJmmMRQJjNJ2J3Omj1j7k5l4l5k3lJ6K0J4L%KNOOLJrj9k6k1rOJ4J7J6
2135A21Rjj5k4k3j0OJ6J4MlJQQkj6k7l1k9k3j6pjOJ3J6J3J4K0L1L5K6Qrj7j2KJ6K1J2jj4k1
$$ plain form
2260 149 139 127 110 86 59 35 20 12 8 9 19 39 68 100 131 159 180 191 189 177 160 147 144 154 173 188 192 184 167 147 127 111 99 91 86 85 85 82 77 75 74 73 70
2242 70 72 83 102 120 135 146 154 154 147 144 157 186 221 248 258 247 222 196 182 186 209 244 278 300 306 299 287 275 266 262 266 273 272 261 244 224 201 171 142 127 133 155
2225 155 180 194 189 166 137 114 106 116 132 147 156 159 161 162 156 138 114 93 79 70 67 74 96 120 131 126 118 120 127 125 108 84 60 36 11 -11 -22 -22 -17 -12 -6 -2 -3 -10 -18 -22 -22
2207 -22 -15 -2 8 8 -9 -32 -46 -45 -39 -36 -34 -27 -13 0 5 5 8 18 32 40 42 40 35 26 16 13 27 52 82 113 144 168 169 141 98 58 28 3 -19 -35 -42 -43 -46 -51 -53 -47 -36
2188 -36 -23 -12 -3 5 15 23 30 41 60 81 99 111 119 125 129 129 124 119 120 137 170 209 238 252 256 257 253 240 219 197 177 155 129 100 77 69 78 97 116 131 148 167 188
2170 188 212 236 252 246 216 173 136 111 92 75 60 51 47 49 55 66 78 93 110 124 126 109 79 43 7 -26 -54 -71 -70 -53 -24 10 42 65 76 78 76 78 89 104
2154 104 116 121 121 125 137 154 169 178 179 175 171 175 184 192 193 192 197 209 222 228 224 213 196 171 137 102 79 76 92 112 126 129 129 131 136 142 148 151 152 143 124 98 77 68 74 88 105 121
2135 121 130 129 114 90 67 57 63 79 93 97 94 95 103 111 109 93 66 35 6 -17 -33 -40 -41 -35 -22 -6 7 21 41 72 107 133 141 132 115 103 105 121 142 154 153 139 118
2118A18k2j6kJ6K6K4J2nk1l0k7j5poj0j0ojMQJ2J3J2J0J1J1QKmmMJ6J9J2KNJ5K4J8Kj4k5k6
2101A53j8j1j0j7k1j3LJ7J6Qlj2j7j3jRQlj0mRJ1%j0j1kRJ1O%kKPJ0J0J0J5J6Ooj3j1poom
2082A05kpj5k1j7pMJ3J6J3MnrjJ5K6K3Qoj2j0okQJ7K3K1J6J2Nlj3j9j8j4j4j8k3k2j4lKLM
2064E7OQOjj0j4j0MJ5J6J0ORJ5K1K5K6J7jj7k5k2j5qplQK3K5J3lpNJ9K3J7RLJmj0j7k1k3k0
2046A49j7j1kJ2K0K1J7J7J6J0kj3k0k0j4mOJ0PKjOJ4J3Kj0j2onj4k0j6mPJ3J2J0Mlqj7k5k2
2029A02j2lnrlJ5L4M3M0L1K0J0Kj0k1k9l1k6k3j7mJ6K7K5J2NKLK%jmqj0j1j1j4k3k9k5j0Q
2012E8J7J5J3J6K3K2J2lj5k1j4JJ4J6J0LKJknlknj1j3j1j0j6k2j8lJ0R%ojJ2K4L2L1K2%k3
1995A59l6l4j8JJ9L0L1K0LrqjOM%KJ1J4R%m%LKJKOJ1J3J2Krj9k1k1k3k7l0l0k4j4mOPQJ3K0
$$ plain form
2118 118 96 80 78 94 120 144 156 151 130 100 73 58 51 45 35 25 19 18 22 30 42 55 67 77 88 99 107 109 105 101 105 121 140 152 154 159 174 198 216 218 204 179 153
2101 153 135 124 114 97 76 63 66 83 99 107 104 92 75 62 61 70 78 75 65 61 70 81 81 71 60 58 67 78 84 84 82 84 91 101 111 121 136 152 158 152 139 128 121 115 109 105
2082 105 103 96 81 60 43 36 40 53 69 82 86 81 72 71 86 112 135 143 137 125 115 109 107 115 132 155 176 192 204 209 206 193 174 156 142 128 110 87 65 51 48 50 53 57
2064 57 63 71 77 76 66 52 42 46 61 77 87 93 102 117 138 163 189 206 205 188 163 141 126 118 111 108 116 139 164 177 174 167 172 191 214 231 240 243 244 240 230 213 192 169 149
2046 149 132 121 119 131 151 172 189 206 222 232 230 217 197 177 163 159 165 175 182 184 183 189 203 216 218 208 196 190 185 171 151 135 131 138 151 163 173 177 174 166 149 124 102
2029 102 90 87 82 73 70 85 119 162 202 233 253 263 265 255 234 205 174 148 125 108 104 120 147 172 184 189 191 194 196 196 195 191 183 173 162 151 137 114 85 60 50 58
2012 58 75 90 103 119 142 164 176 173 158 137 123 124 138 154 164 167 169 170 168 163 160 158 153 142 129 118 108 92 70 52 49 59 68 68 62 61 73 97 129 160 182 182 159
1995 159 123 89 71 72 91 121 152 172 175 166 158 157 163 167 167 169 180 194 203 203 199 199 202 204 205 207 213 224 237 249 251 242 223 202 181 158 131 101 71 47 33 29 35 42 50 63 83
1976H3K0J2KNJ4J8J5RJ3J5Nj7l5l5k2rkjkoqrrj4k6l0j9NK6L3L0K7K5J8Kj0j0JQMnpJRJ5J5
1958A54J2J1QONNMkqj6k2k3k1j2mlj0j2pNJ6J7J2Llqj1j1pLJ4J9J4J1J2J2Qlj2j6j8k1j9j1
1940G1lMJ4K9M0L6J7lj6k0k1k2k0j1JPNMJ0J8J9J0LNNok0k6k3k0k5k8k0oPJ3J6J4Npj6j2l
1923B5NMkooLJ4K8L7M1L6K5J2ok4l6l2j3J1K7K6J2ok0k2j8j4k0l8m9m4j5K2M3M2L3K9L4L4
1907A72K5J0kj1j6j5pNJ2RNJoj7k4k0mJ0J4J3J0ROjrj3j2pKJ0J2Ook0k6k6k1j3olklml%KJ
1888C7lponkk%LRJ5K0J9J0KPK1K7J3pk2k2j9j5qKJ3K0J6Onj4j3qjJ1K2K9K2Oqj1ppj1j5j5
1870I7j5j0mNO%j1j7j2%J1J9J8RkqqnmlkjLPJ3J7J2NjkJQJ8K1J4mk0k9l0k9k6j2J0K8L1K3
1851A21J5J1Pkj8k7k4j7j2j1j1qpj2j3qKJ0J0J3J9K5K3J3MMJ0J4J1Jqj0pJRJ6J7J1lj2j6j6
$$ plain form
1976 83 103 115 117 122 136 154 169 178 191 206 211 194 159 124 102 93 91 90 88 82 74 65 56 42 16 -14 -33 -28 -2 31 61 88 113 131 133 123 113 114 122 126 121 114 115 124 139 154
1958 154 166 177 185 191 196 201 205 203 195 179 157 134 113 101 97 94 84 72 65 70 86 103 115 118 115 107 96 85 78 81 95 114 128 139 151 163 171 168 156 140 122 101 82 71
1940 71 68 72 86 115 155 191 208 205 189 169 148 126 106 95 96 103 108 112 122 140 159 169 172 177 182 176 156 130 107 87 62 34 14 8 15 28 44 58 63 56 40 28 25
1923 25 30 34 32 26 20 23 37 65 102 143 179 204 216 210 186 150 118 105 116 143 169 181 175 155 133 115 101 81 43 -6 -50 -65 -43 0 42 75 104 138 172
1907 172 197 207 205 194 178 163 156 161 173 182 187 188 182 165 141 121 117 127 141 154 164 173 179 178 169 156 144 137 139 149 161 167 161 141 115 89 68 55 49 46 44 41 37 34 34 36 37
1888 37 34 27 21 16 14 12 12 15 24 39 59 78 88 90 97 118 145 158 151 129 107 88 73 65 67 80 100 116 122 117 103 90 82 81 92 114 143 165 171 163 152 145 138 127 112 97
1870 97 82 72 68 73 79 79 68 51 39 39 50 69 87 96 94 86 78 73 69 66 64 63 66 73 86 103 115 120 119 117 118 126 144 165 179 175 155 126 96 67 41 29 39 67 98 121
1851 121 136 147 154 152 134 107 83 66 54 43 32 24 17 5 -8 -16 -14 -4 6 19 38 63 86 99 103 107 117 131 142 143 135 125 118 119 128 144 161 172 169 157 141 125
1834A25j6j1kNKj2k7l5l1k4j6j3j2j2j0j0pJJ3K6L4L2K5J5J1J2J6K0J9J8K1K0J3Loqj1j6j8
1819A34j9j7j8k2l2l8l6k3JK0K9K7K6L1L6L3K2Pmj3k0k3k3j7oLJ0J5J4J2J2J9K5K2Qj0k0j6
1803A49q%NLoj9k7k6k0j2kJ5L1L1J1j1j9j5ol%NJ0J5J5Qmj5j7j2lKJkl%PJ1QNMQJ2J5K1K0
1785A82J2JnkjJPJ8K1J3jqn%mj5k5k7k0rnj0j5j2jPJ2J5J7J3Jj1j6j5j4j8k1j6rjKNRJ4J3
1767G7ROQMpk1k3j0OJ3RKjMJ4K5L0K6J9Pkpj3k1k9k9k0ojlnmKOJ1J3J7K2K4K2J4QPQ%j8l2
1748A61l2j8kJ5K6L0K3Mj2k1k4k3k1j5qlKRJ3J1Jqj0j5j8k0j2oj1k0k6j3MJ5J6J4J4J0PNP
1731D9MjnJJ2K3K7L1L5L5K7Pj8l5m0l7k9j8kJ3J6PnplLNKoj3j3pKMLRJ9K7K9K5J9J6J5J8J9
1713B63J8J3Mpk0k5k2k1k8l4k5qMKjPJ7J8J3RQOMMLoj7k0j3njJOJ0J3J5K0J9Oj1k1j9nJ0K3
$$ plain form
1834 125 109 98 96 101 103 91 64 29 -2 -26 -42 -55 -67 -79 -89 -99 -106 -105 -92 -66 -32 0 25 40 51 63 79 99 118 136 157 177 190 193 187 179 168 152 134
1819 134 115 98 80 58 26 -12 -48 -71 -70 -50 -21 6 32 63 99 132 154 161 157 144 124 101 78 61 55 58 68 83 97 109 121 140 165 187 195 185 165 149
1803 149 141 141 146 149 143 124 97 71 51 39 37 52 83 114 125 114 95 80 74 71 71 76 86 101 116 124 120 105 88 76 73 75 76 74 71 71 78 89 97 102 106 114 126 141 162 182
1785 182 194 195 190 188 187 188 195 213 234 247 246 238 233 233 229 214 189 162 142 133 128 118 103 91 90 97 109 124 141 154 155 144 128 113 99 81 60 44 35 34 36 41 50 64 77
1767 77 86 92 100 104 97 76 53 43 49 62 71 73 72 76 90 115 145 171 190 197 195 188 175 154 125 96 76 70 69 66 61 57 59 65 76 89 106 128 152 174 188 196 203 211 211 193 161
1748 161 129 111 109 124 150 180 203 207 195 174 150 127 106 91 83 80 82 91 104 115 116 108 98 83 65 45 33 27 16 -4 -30 -43 -39 -24 -8 6 20 30 37 42 49
1731 49 53 52 47 48 60 83 110 141 176 211 238 245 227 192 152 115 86 68 66 79 95 102 97 90 87 90 95 97 91 78 65 58 60 64 67 76 95 122 151 176 195 211 226 244 263
1713 263 281 294 298 291 271 246 224 203 175 141 116 108 112 114 113 120 137 155 168 177 185 191 195 199 202 196 179 159 146 141 140 141 147 157 170 185 205 224 230 219 198 179 174 184 207
1695B07K6J8Nmj0j8k8l5l2k5j9j5j6j9j8j4kJ3K1K1J0%mNJ9K9L1K7K4J9J2Kj0k2l3l9l6k7
1680F3j2OK1L2L2K4J0lq%J2J1pk5k8j7m%kj0k0k7k9k4j9j4p%LNQJ4J5Omp%NLlqkPJ1J1RJ2
1661D0J2NjMJ9K8K9K1J3Mj1k3k8k2j4oLJ0J2J0Nkonkjoj2j9k2k7k2j2MJ2J2J4J7J8J5J2J3
1644I1J8J9J2Jj1j2pj%mnmkLRJ1RMLLjj3j7j0MJ2P%k%MMjmmLRRKjKRJ3Qkj1j5j7j9j9j3lO
1623G7Lnj2j0pj0j8k3k2j2kPJ2J3RNLOJ3K1K9L2L0K3J6RLqj7j8j0JLnj3j8j7j3oPJ7K4K6K4
1605A67J7Mrj8k0k5l2l6l2k2j5nNJ8K1J6ROJ0J2Nqj7j4JK0K7J9Ojklj%%jKOJ1RPOJj0k5l1
1587G8k5j7j3qmlqqrppkJ2K0J7LoqjQJ9K8L0K5J3lj9k8k8j9mPRO%%MPQMKjkmnmjLNjppJJ0
1565F0J6J8K2K2J5MlkJ1K2K6J5jj2j8k2k6k2rKNLKjj1j8j7j1plNJ4J2Mlmqj5k1j7oNJ4K3K5
$$ plain form
1695 207 233 251 256 252 242 224 196 161 129 104 85 70 54 35 17 3 1 14 35 56 66 66 62 67 86 115 146 173 197 216 228 230 220 198 165 126 90 63
1680 63 51 57 78 110 142 166 176 173 165 165 177 188 181 156 128 111 107 107 105 95 75 48 19 -5 -24 -38 -45 -45 -42 -37 -29 -15 0 6 2 -5 -5 0 3 0 -8 -10 -3 8 19 28 40
1661 40 52 57 56 60 79 107 136 157 170 174 163 140 112 90 76 70 73 83 95 105 110 108 102 97 95 94 88 76 57 35 8 -14 -26 -22 -10 2 16 33 51 66 78 91
1644 91 109 128 140 141 130 118 111 110 110 106 101 97 95 98 107 118 127 131 134 137 136 123 106 96 100 112 119 119 117 117 121 125 124 120 116 119 128 137 139 138 140 149 162 170 168 157 142 125 106 87 74 71 77
1623 77 80 75 63 53 46 36 18 -5 -27 -39 -41 -34 -22 -9 0 5 8 14 27 48 77 109 139 162 178 187 190 182 165 147 137 138 141 136 123 105 88 75 69 76 93 117 143 167
1605 167 184 188 179 161 141 116 84 48 16 -6 -21 -26 -21 -3 18 34 43 49 59 71 76 68 51 37 38 58 85 104 110 109 107 104 103 103 103 102 104 110 121 130 137 143 144 134 109 78
1587 78 53 36 23 15 11 8 0 -8 -17 -24 -31 -33 -21 -1 16 19 13 5 4 12 31 59 89 114 127 124 105 77 49 30 26 33 42 48 48 48 52 59 67 71 73 72 70 66 61 57 56 59 64 63 56 49 50 60
1565 60 76 94 116 138 153 157 154 152 163 185 211 226 225 213 195 173 147 125 116 118 123 126 128 127 116 98 81 70 63 60 65 79 91 95 92 88 80 65 44 27 21 26 40 63 88
1547H8K5K5L0L3K8J6kj7l3m0l9k9j9j4j3j5j4j2j0o%J0J7J9J3O%lnqj1j6j8qPK1K6K4J8J1
1531H5MKQJ3J1Kj2k6l0k0JJ7K0J6J5J5J3QLpj8k4j1J0K6K8K1J1Kqj3j3j4j4j0klj3k3j8mO
1514E4MKMRQJlKQLj2k4k0mOKj0j8j8j5j0pjMJ1K1L0L6L2J9QNKkj1j6j5j2oLJ4J3Lj0rOK2K4
1495A33J0j3k6l2l3l7l5k3NL2M1L3J7QJmj1j9k6k9k9j8oKJpj8k0j1PK2L1L5L8M5M5L5J7Kl
1479A60jLJnj0j5j5j0jQJ2J0Okoqrj1j5j6qPJ3J2MJPJ5J7Qj0k4k7k1j6j0j0j1j2pLJ2J6J3
1461D8J4K1K6K2J1mj6j7j0JONMQJ1RJj1k5l4l4k6j5j1rnJPJ6K8L5L3K7K1J6Mj2k4l0k7k2j7
1444B6qMJ2J5J4J3J3OloKJ3J3PNOOlqoMPO%moonloj0rlLLqk3l2k8j3jRJ4K1K5K8K7J9Pnj3
1424A19k1k6k3qJ5L3L8K8J0qj8j8j4j1j3j3pNJ4J5Qmj1rLJ8K5K3Qj0k0j9j4j3j4mJ1K2K4K3
$$ plain form
1547 88 113 138 168 201 229 245 243 226 193 153 114 85 66 52 39 24 10 -2 -12 -18 -18 -8 9 28 41 47 47 44 39 31 20 4 -14 -22 -15 6 32 56 74 85
1531 85 89 91 99 112 123 125 113 87 57 37 38 55 75 91 106 121 134 142 145 138 120 96 85 95 121 149 170 181 183 175 162 149 135 121 111 109 106 93 70 52 48 54
1514 54 58 60 64 73 81 82 79 81 89 92 80 56 36 32 38 40 30 12 -6 -21 -31 -38 -39 -35 -24 -3 27 63 95 114 122 127 129 127 116 100 85 73 67 70 84 97 100 90 81 87 109 133
1495 133 143 130 104 72 39 2 -33 -56 -51 -19 22 55 72 80 81 77 66 47 21 -8 -37 -55 -61 -59 -58 -65 -83 -103 -114 -107 -85 -54 -19 19 64 109 144 161 163 160
1479 160 159 162 163 158 148 133 118 108 107 115 127 137 143 141 135 127 118 107 92 76 68 75 88 100 104 105 112 127 144 152 142 118 91 70 54 44 34 23 11 4 7 19 35 48
1461 48 62 83 109 131 142 138 122 105 95 96 102 107 111 119 130 139 140 129 104 70 36 10 -5 -16 -25 -30 -29 -22 -6 22 57 90 117 138 154 158 146 122 92 65 43 26
1444 26 18 22 34 49 63 76 89 95 92 86 88 101 114 121 126 132 138 135 127 121 125 132 138 138 134 128 122 117 114 108 98 89 86 89 92 84 61 29 1 -12 -13 -4 10 31 56 84 111 130 137 132 119
1424 119 98 72 49 41 56 89 127 155 165 157 139 121 107 96 83 70 63 68 82 97 105 101 90 81 84 102 127 150 158 148 128 109 95 82 68 64 75 97 121 144
1408A44K2K1J4J0RP%rj3j7k0k3j8j1lJL%rj9k5k6k3j5kNJ3J5J6J5J0J1J3J2Kj1k0j5oJmj3
1391D2j3%J7K4K1J4Q%qj2j1j4k3k3pJ7L5M0L6K3ROOnk8l9k5nKrj8k0j8j0KJ1J4J0QJrrPK4
1373G1K5J1JLMNMKrj9j5%RJ2J4K2K8L3L7L4K0Nnj0k2l5m0l7l4k0PL2K8Oqpoj0j0pj1k1k0q
1356E9MJ6M0N8M9K1RK2M1N3O0O6O6O5P8Q8P5N9P1J05J27J54K25L26M20N38P62J099J516K073
1344H345K801L349L019J462p51k491l080k746k132j616j214q90o67n33m25l20k54k26j95j53
1336A283j29j20r5n0k3k0k5k7m6p6p9n3k4j2nOPj1k6k1rklmrrjQMj4k2j5j1j8k7k6j8j2pl
1319B56lmJQPoj6j9k0k5k4k0j8j8qJ3L1L2K1R%mKJ6K3J1orm%%jKkj0j9k3k5k3k1j9j4nNRJ3
1301I3K6M0M0K3Lonlnj3k3k9k1nMjj0r%NNMKjMJ9L7M3L5K6J9J4Pkj2j9k0j1KJ1Rok7m3l9j6
$$ plain form
1408 144 166 187 201 211 220 227 227 218 205 188 168 145 127 116 113 114 117 117 108 89 64 38 15 0 -2 3 16 31 47 62 72 83 96 108 110 99 79 64 58 59 55 42
1391 42 29 29 46 70 91 105 113 113 105 93 82 68 45 22 15 32 67 107 143 166 175 181 187 182 154 115 90 85 87 78 60 40 22 12 14 25 39 49 57 58 49 40 47 71
1373 71 96 107 108 111 115 120 124 126 117 98 83 83 92 104 118 140 168 201 238 272 292 297 292 282 260 225 185 148 114 94 101 133 161 167 159 152 146 136 126 119 108 87 67 59
1356 59 63 79 119 177 226 247 256 278 319 372 432 498 564 629 707 795 870 929 1000 1105 1232 1386 1611 1937 2357 2895 3657 4756 6272 8345
1344 8345 11146 14495 17514 18976 18225 15734 12654 9908 7776 6160 4946 4056 3389 2856 2431 2111 1857 1631 1436 1283
1336 1283 1154 1034 939 889 866 846 821 794 748 672 593 540 516 504 499 505 512 501 475 454 445 443 440 436 427 418 417 425 429 415 393 378 367 349 322 296 278 266 259 256
1319 256 253 249 250 258 265 259 243 224 204 179 155 135 117 99 91 104 135 167 188 197 197 193 195 211 234 245 239 230 226 226 226 225 227 225 215 196 173 148 125 104 85 71 66 71 80 93
1301 93 119 159 199 222 225 219 214 211 206 193 170 141 120 115 119 118 108 99 99 104 109 113 115 114 118 137 174 217 252 278 297 311 318 316 304 285 265 254 256 267 276 270 243 200 161 145
1283A45MOnj3j2plJLMQJ5J8J0%mlqk1k9k5j5mLQP%lKJ3J7J0j%J4L2M3L7J9Kj1j2pjoj9l3l8
1263A41k9j5LJ5J8J7J5J8J8J1MLMJonPJ8K4K0J1lj8k8l4l4l0k2j0mlmpj0j2pPK4K8J8Jj2j7
1246A16j7j7j4j0nnnkNO%qpKJ3J7J2PPJ6L3M4L9K3Mj3k4k8j5MJ3RMKKjmJLlk2l9m7m2k9j9
1228Fj6j7j2PK9M5N2N1N3N5M7K8jk2l0k9k8k8k0nRJ5J5J0KoplJnj7k6l0k9k3j0J1K9L6K6Q
1211A71j2k0k0j2kNQRPPNlj4k4k2j4lNMnj1rjOMKNPOKjlnpnLRPJorjJ0J6Pmj5j9j8rNJ4J5
1190F6J1J3J8J3JonjKPJ8K5J7Jj0j4j7k5k8k1mJ4K5K7K2J0jprj2j4j1%J1J9K2K1J9J9K1K1
1173B58J4mk1k5j7lRK0K1J4NKMjj0j6j3j3k5l5l3k2j7k0j9qjknkJ%ljJlrrKJ9K7K3OqqMJ2
1154H9J1RJ4K0J2qk4k9k8l3l8l8k5lJ6K7K5J8J4J6K1K1J3KnmjLPJ5K5K6K1J8J3Mj9l6l4j5
$$ plain form
1283 145 149 155 150 137 125 118 115 116 119 123 131 146 164 174 174 170 167 159 138 109 84 69 65 68 76 83 83 80 82 95 112 122 121 121 135 167 210 247 266 268 257 245 238 237 231 212 179 141
1263 141 112 97 100 115 133 150 165 183 201 212 216 219 223 224 218 213 220 238 262 282 293 290 272 244 210 176 146 124 114 110 107 103 96 86 74 67 74 98 126 144 145 133 116
1246 116 99 82 68 58 53 48 43 41 46 52 52 44 37 39 52 69 81 88 95 111 144 188 227 250 254 241 217 189 174 178 191 200 204 206 208 207 203 204 207 204 182 143 96 54 25 6
1228 6 -10 -27 -39 -32 -3 42 94 145 198 253 300 328 327 305 275 246 218 190 170 165 174 189 204 214 216 210 203 200 201 196 179 153 123 94 71 61 72 101 137 163 171
1211 171 159 139 119 107 105 110 118 127 134 141 146 143 129 105 83 69 66 71 75 70 59 50 49 55 59 61 66 73 79 81 80 77 72 65 60 63 72 79 80 74 65 64 74 90 97 93 78 59 41 32 37 51 66
1190 66 77 90 108 121 122 116 111 110 112 119 137 162 179 180 170 156 139 114 86 65 61 75 100 127 149 159 158 151 142 130 116 105 105 116 135 157 178 197 216 237 258
1173 258 272 268 247 222 205 202 211 231 252 266 271 273 277 276 266 250 237 224 199 164 131 109 92 72 53 45 44 42 37 35 36 36 33 32 33 30 21 12 14 33 60 83 89 81 73 77 89
1154 89 100 109 123 143 155 147 123 94 66 33 -5 -43 -68 -71 -55 -28 -3 15 29 45 66 87 100 102 97 93 92 95 102 117 142 168 189 207 220 224 205 169 135 120
1138A20KLqj8j9j0JMkj3j6j0LJ0QLmmLJ8K8K7J3kj2rjJmj0j0oljOJ3J5J1QJ2J7J4PKLKJnj6
1119A72k6k5rJ3K4J8Lj1k1k7k7k4j8j6j2lJ0K3K7K2J0KNRRJjKLnj6j9j7j7j9j4lRJ7J9J5P
1102I0mrmOJ6K5L4L7L0J4%j0j3j3qmnqojMKpj3j7j8k0k4k4k0j0LJ3J5Rkj5k1k2j8j2qqmRK4
1083a7K6J6KMJ7K4J3lqlkqj1kJ4K7L0K2J1MMJ0J3PjnJRPmk3l2l0k1j4nOJ2J4J0RJ5K1K3J8
1065B00J6J7J9J3lk2l2k9k3j3jJ5K7K7K0J4J4J3Mj0k2l1m0m9n1m3k3jJ9L2L8L5K7J4Mjlj2
1050A59k8l8l0j4j%jNJ4K0K0J1kqromJJ2K8L4K7J1pj6j3%J0Rkj4j6j9k2k2j2NJ8K1J8J0Ml
1033A50qj4k4l1k7j5jONjm%J0J8K0J5R%j2k5k5j1PJ7J9K2K5K2J2LLNMJ%NJ1J6J0lk1l0k4r
1015A30%%kKLkj4k2j9qKQJ0J0J1J2J2Qkj2j2KJ9K4J4mj9k5k8k7k3j5rjJ3L1M0L6K0RLK%%K
$$ plain form
1138 120 122 125 117 99 80 70 71 75 73 60 44 34 37 47 55 58 54 50 53 71 99 126 139 137 125 116 115 116 112 102 92 86 83 82 88 101 116 127 135 147 164 178 185 187 190 192 193 188 172
1119 172 146 121 112 125 149 167 170 159 138 111 84 60 42 26 14 11 21 44 71 93 103 105 110 119 128 129 128 130 133 128 112 93 76 59 40 26 23 32 49 68 83 90
1102 90 86 77 73 79 95 120 154 191 221 235 235 225 212 199 191 187 182 174 168 167 171 173 166 153 136 118 98 74 50 30 20 23 36 51 60 58 43 22 0 -18 -30 -38 -46 -50 -41 -17
1083 -17 9 25 27 31 48 72 85 82 74 71 69 61 50 48 62 89 119 141 152 156 160 170 183 190 189 184 185 194 201 197 174 142 112 91 77 72 78 90 104 114 123 138 159 182 200
1065 200 216 233 252 265 262 240 208 179 156 143 142 157 184 211 231 245 259 272 276 266 244 213 173 124 73 30 7 6 25 57 95 130 157 171 175 174 171 159
1050 159 131 93 63 49 48 48 47 52 66 86 106 117 115 107 98 92 88 89 101 129 163 190 201 194 178 165 165 175 184 182 168 152 133 111 89 77 82 100 121 139 149 153 150
1033 150 142 128 104 73 46 31 30 36 41 40 36 36 46 64 84 99 108 108 96 71 46 35 42 59 78 100 125 147 159 162 165 170 174 175 175 180 191 207 217 214 193 163 139 130
1015 130 130 130 128 130 133 131 117 95 76 68 70 78 88 98 109 121 133 141 139 127 115 117 136 160 174 170 151 126 98 71 48 33 24 23 36 67 107 143 163 172 175 177 177 177 179
997A79jrj8j9j0JQJ0J0J2J0OPJ3J7J3%j5k1j5nNJ1J1J0POJqj9k8l1k8k0pJ1K2J9Ppj7k4k5
980F9k0j2mjjLJ4K5L1K7K3K3K3J7Kj3j9k0j8j7j1kOJ3J8K3K6J9RJnj2k1k6j9qKjj0j8j8rJ
963I0QJ5K0J9J2Kqj4j3oLJ1J2J0NJkmljLQJ4J6J1Njqk1l4m2l8k8k1j4oNJ0J1RPQQRPOPJ1J6
943A15K0J4Lpj0mMM%kMPKj1j3mQJ2Nlrj3oPJ6J3jj5k6l3l0j2J3K5J6jqnkkjPJ4J8K1K6L2K8
924B16Qj7l6l6k6j7j3qKJ3K2K5K3J3pk4k6j6onplKPOMkonjLORJ7K7K9K2J0Ljnj1j6j5oJL%
904A56LJ3K3K9K8K1Lk1m1m9m8m3l3j3RK3K1J3J0J7K5K9K9K3J7J3J3J4P%onk%klmorqoj0j6
887B14k2k0qQJ9K0J0ok1l0l2k8j7jJ3K0J8J5J2J1J1Plj4k2j9j1pj2j8j7pMOMLK%%OJ4J7J1
870A30NLOMkj2k0k0j8j1okkjLPRPPJ2K0K3K0J0%prpkMROJoj2j6j6j3rpqojOJ2J3Rlj5j8j2
$$ plain form
997 179 178 169 151 132 122 123 131 141 151 163 173 179 186 199 216 229 229 214 193 178 173 178 189 200 210 217 223 224 216 197 169 138 110 90 83 94 116 135 142 135 118 94 69
980 69 49 37 33 32 31 34 48 73 104 131 154 177 200 217 219 206 187 167 149 132 121 119 125 138 156 179 205 224 233 234 229 217 196 170 151 143 145 144 134 116 98 89 90
963 90 98 113 133 152 164 166 158 144 131 125 128 139 151 161 166 167 165 161 158 157 160 168 182 198 209 214 213 205 184 150 108 70 42 21 7 1 6 16 27 36 43 51 59 68 75 81 88 99 115
943 115 135 149 152 145 135 131 135 139 139 137 141 148 150 139 126 122 130 142 147 144 135 122 116 123 139 152 151 136 110 77 47 35 48 73 89 88 80 75 73 71 70 77 91 109 130 156 188 216
924 216 224 207 171 135 109 92 79 71 73 86 108 133 156 169 162 138 112 96 90 85 78 75 77 84 90 94 92 86 81 80 83 89 98 115 142 171 193 203 206 205 200 189 173 158 152 153 156 156
904 156 159 172 195 224 252 273 276 255 214 165 117 74 41 28 37 60 81 94 104 121 146 175 204 227 244 257 270 284 291 291 285 280 278 278 276 273 269 263 254 246 240 230 214
887 214 192 172 164 172 191 211 221 215 194 164 132 104 87 86 99 119 137 152 164 175 186 193 190 176 154 135 124 117 105 87 70 63 67 73 77 80 82 82 82 88 102 119 130
870 130 135 138 144 148 146 134 114 94 76 65 59 57 55 54 57 64 73 80 87 99 119 142 162 172 172 165 156 149 147 151 160 166 167 161 149 133 117 104 95 88 80 74 73 79 91 104 113 110 95 77 65
849F5kJklMJ4K2K4K2J4OK%kqj7k2k0j0LJ6K0J5QPJ1J5J8J9J7Qjrj2j0mjnj7k8k9j7JJ6K0J1
831A60kj2j8k1k3j9pLMkljjnplOJ2J5J6J0lj1rMJ5J3Jj4k0j7mQJ5J3J0Lnj1mQJ5Pmqooj2j4
811F6oOJ9K9L3K9J4jpKJ6K2J7Mrj9k4k2j8j4j3qJJ5K1J9PmqlKjqj4j1mlj0j9k2j9j3opj4j8
793cj3KJ4K1J9J4OlpkPJ6J9J6Qoj8k2k3k1j5jJ8L5M1L4K0O%NRKj0j7j0PJ6J3MoqLJ9L3L8L3
774B93K3Nj4k6l1l5l9l9k6oQJ1J1J0N%ljlpmJ2K5K0Mj0j2j2j7k7l3l7l5k3oJ2J9J9J8K0J7
758H6Q%%QJ3J1QPQLkjMPJj1j9k1k3j9pQJ6Rnj6k2k4j9q%kj0j1kRRkj7k1j2JQPMJ1K2K9K8K3
738G4K3K7K9K5J4Lloprj3j4j5j4j6j4lJ3K3K3J9J6J5J2%j3j7j4j1j1j4j5j0JRQok2k9k0nP
721D0RKnqJJ8L3M0L8L1K1Poj5j6j1jJ1J4Onj4k0k3k4j7lJ0J9K0J3kj4j3jJ2J7J3QLkrk0l1
$$ plain form
849 65 63 64 62 59 63 77 99 123 145 159 165 167 167 165 157 140 118 98 88 91 107 127 142 150 157 168 183 201 220 237 245 244 235 223 213 209 208 203 186 158 129 112 113 129 149 160
831 160 158 146 128 107 84 65 58 61 65 63 60 59 58 53 46 43 49 61 76 92 102 99 88 79 83 98 111 112 98 78 61 57 65 80 93 103 106 101 90 86 94 109 116 112 104 98 92 80 66
811 66 60 66 85 114 147 176 190 189 182 184 200 222 239 243 234 215 191 169 151 137 124 116 117 132 153 172 179 175 167 164 166 165 157 143 132 128 125 115 96 74 55 42 36 29 15 -3
793 -3 -16 -14 0 21 40 54 60 57 50 48 55 71 90 106 114 108 90 68 45 24 9 8 26 61 102 136 156 162 162 167 176 178 168 151 141 148 164 177 181 175 167 170 189 222 260 293
774 293 316 321 307 281 250 215 176 137 111 105 113 124 135 145 150 150 147 146 143 136 132 144 169 189 193 183 171 159 142 115 82 45 10 -13 -19 -7 12 31 49 69 86
758 86 94 94 94 102 115 126 134 141 149 152 150 149 153 160 161 150 131 110 87 68 61 69 85 94 89 73 51 27 8 0 0 -2 -12 -23 -25 -16 -7 -9 -26 -47 -59 -58 -50 -43 -39 -28 -6 23 51 74
738 74 97 124 153 178 192 195 192 186 179 170 157 143 128 114 98 84 81 94 117 140 159 175 190 202 202 189 172 158 147 136 122 107 97 98 107 115 109 87 58 38 33 40
721 40 49 51 46 38 39 57 90 130 168 199 220 227 221 206 190 179 178 189 203 209 204 190 170 147 123 106 103 113 132 152 165 163 149 136 135 147 164 177 185 188 186 177 157 126
703A26l2k0nkrj3mLjj3j8j5j1qnllpmKJ1J8K1K4K2J6J1J0J1J4J8J8J3jj9l2l2k3rMJ4J9J8
686A04J3J0QJ1J4J1Kj1j8j4lNNjpj3j6j2%J2J7J3J1J0QKpj0pKJ3K3K7K1Nj1k2k2j4mLMjqj5
668A38k1k0j4ppnLJ4J8J0lj1j8k2j9jK2L9L6K4J0Jnj1rnKQJ2J5Qrl1l7k2LJ9K2J2kj6k2j6
651H3JJ8K4J4pk2k1kJ6J6Mnpqj1pRK8L9L3J7JpqkK%oo%PRKj1k1k2j6j2j5j7j2jRJ9K3K5K0
632A73J1Jpj0j0mJjpqm%mj1j2mMNmj4j7j7j8k4k7j9oRJ8K5L2L1K1PJjlqj1mRK3K3J2mj6k2
613A09k2k3k2k0j2KJ4K1J6J0ONJnj2j3j3j1oJLjpqnKJ0J9K3J7OlnjJJPJ7K2J3ok5l2k2mJ4
594F2K2K0Qoj3j0k%oj6j6pOJ4J0Jj2j9j8j0KJ4K4L2L2K2Mj5k2j7mQJ9K0J4Klmjkqj2j3rmJ
576H8QJ5K0J9PmlOJ1LorokOJ6K3J7Nmj2k5l7l7k5j2mLJ4K2K4J9J2PJnj1j5j2mKLjJLJj1j7
$$ plain form
703 126 94 74 69 67 58 45 41 44 43 30 12 -3 -14 -22 -27 -30 -33 -40 -44 -42 -31 -13 8 32 54 70 81 91 102 116 134 152 165 164 145 113 81 58 49 53 67 86 104
686 104 117 127 135 146 160 171 173 162 144 130 127 132 137 136 129 116 100 88 88 100 117 130 141 151 159 161 154 144 137 139 152 175 202 223 228 217 195 173 159 155 158 162 161 153 138
668 138 117 97 83 76 69 64 67 81 99 109 106 95 77 55 36 35 57 96 132 156 166 167 162 151 142 137 139 147 159 174 182 173 142 105 83 86 105 127 139 137 121 99 83
651 83 84 102 126 140 133 111 90 88 104 120 124 119 112 104 93 86 95 123 162 195 212 213 206 198 196 198 198 192 186 186 193 202 204 193 172 150 134 122 107 90 78 77 86 105 128 153 173
632 173 184 185 178 168 158 154 155 154 147 139 135 135 131 120 108 104 108 113 109 95 78 61 43 19 -8 -27 -33 -24 -6 19 51 82 103 110 111 110 107 99 88 84 93 116 139 151 147 131 109
613 109 87 64 42 22 10 12 26 47 63 73 79 84 85 80 68 55 42 31 25 26 29 28 21 13 8 10 20 39 62 79 85 82 77 76 77 78 85 102 124 137 131 106 74 52 48 62
594 62 84 104 112 106 93 83 81 81 75 59 43 36 42 56 66 67 55 36 18 8 10 24 48 80 112 134 138 123 101 84 80 88 107 127 141 143 140 136 135 133 125 113 100 91 87 88
576 88 96 111 131 150 157 153 150 156 167 170 164 155 149 147 153 169 192 209 214 210 198 173 136 99 74 62 58 61 75 97 121 140 152 159 160 155 144 129 117 113 115 118 117 118 121 122 111 94
557I4j2JKqj8j9j2mOJ7K0J2%roLRQNMOPLKQJ3J0KmjMM%qrnOJ6J8J4RJ1J2R%rj5k0k5l3l7l8
536D3l1j7lQJ7K1K2K1J9J9J5Qjmqj0j0nPJ4J5J1RPLoj4j6j3j0j4k1k5k0j3qrj2j2j0mPJ8K6
518A4K6J9QJ%QJ4J2MkMJ4J3%j5j7j0moj0j0mKPJ5K2K6K3J6J3J5J1Mkkjmj3k1k5k1j4lJ0K2
500A39L0K9J7jj8k6k2j5rjJ1K2K7K1J1LjJLjj0k1k9k9k2j4njMOMmj3j2kJ0J4QLkjjjj%ORN
481A21oj2j0lJ%lknj2j6j1JRRMLNPKnpmLJ0J6J9K0J4PJjkrj4j1nkkJJ3K6K8J9QJpj5k2k2j8
460A22j1%J7L3L7L1K1J2jj6k5k4j9j5j5j2oJMjj3k4k5j3LJ4J9J9J3NMJ0J4J0NRK2L1K8J2l
444B73j4j3lPQJoj0j1j7k6k6j5JP%j4k0j0RK3K5J5Mnrj2j8k3k6k0oJ1K3K4J3koMJ8K2J8J4
426B08J1lk2l2k2pLMKlj1j6j0j%lKJ5K5K3J6J4J7J4Onj1j5j8k0k4k5k5k3k0j8j2m%oj3j4l
$$ plain form
557 94 82 83 85 77 59 40 28 24 30 47 67 79 79 70 64 67 76 84 89 93 99 106 109 111 119 132 142 144 140 139 143 147 147 139 130 125 131 147 165 179 188 199 211 220 220 211 196 176 151 118 81 43
536 43 12 -5 -8 0 17 38 60 81 100 119 134 142 141 137 129 119 109 104 111 125 140 151 160 167 170 164 150 134 121 111 97 76 51 31 18 10 1 -11 -23 -33 -37 -30 -12 14
518 14 40 59 67 68 68 76 90 102 106 104 108 122 135 135 120 103 93 89 83 73 63 59 61 68 83 105 131 154 170 183 198 209 213 211 209 208 204 191 170 145 124 110 107 117 139
500 139 169 198 215 214 196 170 148 133 124 123 134 156 183 204 215 218 217 218 221 220 210 189 160 131 109 95 90 89 93 99 103 99 86 74 72 82 96 104 107 105 104 103 102 101 101 107 116 121
481 121 115 103 93 90 91 91 88 86 81 69 53 42 43 52 61 65 68 73 80 82 77 70 66 69 79 95 114 134 148 155 156 155 153 144 130 119 114 112 110 111 124 150 178 197 205 206 199 184 162 140 122
460 122 111 111 128 161 198 229 250 262 261 245 220 196 177 162 147 135 129 130 134 133 120 96 71 58 61 75 94 113 126 131 135 145 159 169 174 183 205 236 264 276 273
444 273 259 246 243 250 258 259 253 243 232 215 189 163 148 149 156 156 142 122 112 121 144 169 184 188 183 174 162 144 121 95 75 69 80 103 127 140 138 132 136 154 176 194 208
426 208 219 216 194 162 140 133 136 140 142 139 128 112 102 101 101 98 100 115 140 163 179 193 210 224 230 225 214 199 181 161 137 112 87 64 44 26 14 10 10 4 -9 -23 -26
409b6J6K8L5L3L4L1K4J0lrj1j3j4rjORNmj3k1k0j3nMRQjj2j7j4oKJ2K2K5J9ROJ2K4L3L1J4
392B49j1l1l5k9k3k1j7pNJ1J4J7J6J3Olj3j9j2RL1M2L3J8Lj0k3l3l2k2j6j7k4k5j4kPJ5K1
376G1K4K1J5J2J4J8J6J0NKjoojPQOMMNPMlj5k8l2k4j2orj4j6qLJ1J4PJjMJ2J7J1KqqKJ2J3
356A64P%lmqj7k6k4j4KJ2J1M%%PJ3J3Pmj4j6rjLLLMNLlrj5j5rlmj3j7j0JJ1J7K1K2J2mj3q
337H2MOoj5j2JJ3K0J9J2MmmljMJ2J5Rjrj0plKJ1J5J3Omj1j3nQJ3Mrj4r%RJ4J5QnpKJ9K6K3
316B37J3Llopnorj5k4l3l5k6j1NJ5J7J8J8J9K2K2J9Rlj2j8k2k5k3j2kkj2k2k9l0k7j7NK5L4
300D5L1K2J2KorplMJ2K1K0Pj1k7l1k3j3rrkJ0J9J6J1J3K0K6K3J6QKlmnrj3j2pJMRJ4K1K4J9
281B29Qlj3j5j4j6k1k2j9j6j1jRPmj2r%MJMJ0J3PJ%NJ2J7J8Rkrq%J1K0K0J4QOOKoqjMjj2j9
$$ plain form
409 -26 -10 18 53 86 120 151 175 185 182 173 162 149 135 126 125 131 140 145 141 128 107 87 74 69 73 82 90 89 77 60 46 40 42 54 76 101 120 129 135 147 171 204 235 249
392 249 238 207 172 143 120 99 82 75 80 91 105 122 138 151 157 154 141 122 110 119 150 192 225 243 246 236 213 180 148 126 110 93 69 44 30 28 35 50 71
376 71 95 116 131 143 157 175 191 201 206 208 207 201 195 194 201 209 215 219 223 228 235 239 236 221 193 161 137 125 119 110 96 80 72 75 86 100 107 108 107 111 123 140 151 153 145 137 139 151 164
356 164 171 171 168 164 156 139 113 89 75 77 89 100 104 104 104 111 124 137 144 140 126 110 101 100 103 106 109 113 118 121 118 109 94 79 70 67 63 50 33 23 24 35 52 73 95 107 103 90 82
337 82 86 92 86 71 59 60 73 93 112 124 128 124 120 117 116 120 132 147 156 155 146 136 129 126 128 139 154 167 173 169 158 145 140 148 161 165 156 142 133 133 142 156 171 179 174 167 169 188 214 237
316 237 250 253 250 244 237 232 226 217 202 178 145 110 84 73 78 93 110 128 146 165 187 209 228 237 234 222 204 182 157 134 122 120 118 106 84 55 25 -2 -19 -14 11 45
300 45 76 98 110 112 106 97 90 87 91 103 124 144 151 140 113 82 59 46 37 28 26 36 55 71 82 95 115 141 164 180 188 190 187 183 178 169 156 144 137 138 142 151 165 186 210 229
281 229 237 234 221 206 192 176 155 133 114 98 87 86 95 102 98 86 77 77 81 82 86 96 109 116 117 117 122 134 151 169 178 176 167 159 159 170 190 210 224 232 238 244 246 240 232 231 235 234 222 203
261B03k1k0k1k3k1j3JJ4K1J5Jj3k2k2j3QK6L2K1ROJ1J7J6J0LjllJMNMNQJ2Pnk0l2l1k0pjk
243A46nlNJ7K5K6K1J0mk1l6m2l8l0j8oJ0L0M3M3K5%j8k2j7qJQJ0PJKMKj1k2k1nJ0J6J7J4Q
226A74%nqrj1j0lKMJLRJ4J5J6J7J2Kppnorrompj1j5j3nMJ0QKoqmMMjj0j7k0k1j7qMRLnqop
204B9j0j3j2oOK1L0L0K3J6J5J2Pkrj6j9k0k0k4k8k5j6mMQJ2J5J8J4Mrj4pOJ9K6K5J7Pmrro
186H2KJ0J2MnlRJ7J1nj8k2j9rOK0K5K2J9K2K6K4J9J3Ojnmnj4k3k8k6k1k1j9j2njOJ6K1J3J
169A40njjpj6j3mOJ3J5J2JoqmLRJ8K6K6K3K1K2J7Lrj8j7j3nKM%rj5j3poj4k4j9LL2M1L0J3
150B46PPM%kLOKoj8k2j8oNQKqj7k3k2j9j5j0jOPKKJ0J8J7RNORNKlj2k7m0l9k5pPJ3J1OMKK
130I3jlnlKJ0J7J8J5J2J2Plj2j4pJQJ1J4J3Okj0j5j6j4rmMRJ2J1Mpj8k0qOJ1Lpj2j1j0j1j3
$$ plain form
261 203 182 162 141 118 97 84 85 99 120 135 136 123 101 79 66 74 100 132 153 162 168 179 196 212 222 225 224 221 218 219 223 228 232 237 245 257 264 259 239 207 176 156 149 148 146
243 146 141 138 143 160 185 211 232 242 238 217 181 139 101 71 53 47 57 87 130 173 198 198 180 158 141 133 134 142 152 159 160 162 166 168 157 135 114 109 119 135 152 166 174
226 174 174 169 161 152 141 131 128 130 134 135 138 147 161 176 192 209 221 223 216 209 204 198 189 180 174 170 163 152 137 124 119 123 133 141 143 137 129 125 129 133 132 122 105 85 64 47 39 43 52 55 50 42 36 29
204 29 19 6 -6 -12 -6 15 45 75 98 114 129 141 148 146 137 121 102 82 62 38 10 -15 -31 -35 -31 -23 -11 4 22 36 40 31 17 10 16 35 61 86 103 110 106 97 88 82
186 82 84 94 106 110 105 102 111 128 139 134 116 94 75 66 72 92 117 139 158 180 206 230 249 262 268 267 262 258 253 239 216 188 162 141 120 101 89 84 83 89 105 126 139 140
169 140 135 134 133 126 110 97 93 99 112 127 139 140 134 126 122 125 134 152 178 204 227 248 270 287 290 281 263 246 233 228 230 234 234 225 210 197 190 184 170 146 127 130 162 203 233 246
150 246 253 260 264 264 262 265 271 273 267 249 227 209 203 208 216 218 210 193 170 148 129 114 104 103 109 116 118 120 130 148 165 174 179 185 194 199 201 198 186 159 119 80 55 48 55 68 79 85 89 91 93
130 93 92 89 84 81 83 93 110 128 143 155 167 174 171 159 145 138 139 147 158 172 185 191 189 179 164 148 134 125 121 125 134 146 157 161 154 136 116 108 114 125 128 121 109 98 88 77 64
111F4j4j1o%KMMMJljLJ0J6K5L3K7Rj2k5k3j2jOPjj2j9k0j7rKJ1J7K1K0J7J3Mpj6j9j8j6j6
93D2j8j4%J2J0mj6j1MJ7J6Qko%J0J9K1J6Pmj0mPJ3NmnKMnk1l1l4k9j7LK4L5L0K0J0QO%nmP
73A12J7J6OmoLQPjrrnjnj3j8j5pNJ4J7J4Ojorj2qKQNkplJKNJ0J5R%qrmK%pj7j8j3olJPJ4J6
51I6J3Pkj4k1j8lJ4K1J9Nj0j9j6oLMLMRJ3J2M%LQJ2Nnj0j1pjJ0K3L1K9K5K5K3J6Npj5j7j5
33B45rkLMkj1j8j7j1qrqjLjoqlLRJ4J5J1Kknqqo%%oj1rnqj3j8j6j4j1qjNQO%kNJ8L0L5K8J3
11A92L%MQPMJ%KNQNoj7j5qnomLQM%NJ4J5Lj2k2k7k4j2OJ3Mj2j7j2ol%Jlj2j5pRK4K9K4J3%
-10A69j3j8j5nNJ3J9J8J2M%Jlj5k3j6%J2J2J2J5J7Qnj2j5j9k4k6k0j0nmj0j5j5nJ1K3L1M0
-26A29M9N2M3K4Mj3k4k8k4j7qjjpj6j6nPJ3J4J7J9J9J5Rkj5k8k8j3KPJqj0njmj5k4k2j2nn
$$ plain form
111 64 50 39 33 33 35 39 43 47 48 45 44 47 57 73 98 131 158 167 155 130 107 95 94 100 107 106 94 75 55 38 29 31 42 59 80 100 117 130 134 127 111 92 74 58 42
93 42 24 10 10 22 32 28 12 1 5 22 38 46 44 38 38 48 67 88 104 111 107 97 93 100 113 118 114 109 111 115 110 89 58 24 -5 -22 -19 5 40 70 90 100 108 114 114 109 105 112
73 112 129 145 151 147 141 144 152 159 158 149 140 135 134 129 116 98 83 76 81 95 112 126 132 131 125 116 104 96 98 106 111 109 102 99 100 102 107 117 132 141 141 133 124 120 122 122 115 98 80 67 61 58 59 66 80 96
51 96 109 116 114 100 79 61 58 72 93 112 117 107 88 72 66 69 73 76 80 89 102 114 118 118 121 129 141 146 141 131 120 113 112 122 145 176 205 230 255 278 294 299 292 277 260 245
33 245 236 234 237 241 239 228 210 193 182 174 165 157 156 159 158 152 144 141 144 153 167 182 193 195 193 188 180 172 166 166 166 160 149 140 135 127 114 96 80 66 55 47 46 51 59 65 65 63 68 86 116 151 179 192
11 192 195 195 199 207 214 218 219 219 221 226 234 239 233 216 201 193 188 182 178 181 189 193 193 198 212 227 230 218 196 169 145 133 139 152 156 144 127 115 109 106 106 107 104 92 77 70 79 103 132 156 169 169
-10 169 156 138 123 118 123 136 155 173 185 189 189 190 187 172 149 133 133 145 157 169 184 201 209 204 192 177 158 134 108 88 78 73 69 59 44 29 24 35 58 89 129
-26 129 178 230 273 297 301 288 264 236 212 195 187 186 185 178 162 146 141 148 161 175 192 211 230 245 254 252 237 209 181 168 170 177 178 170 160 155 154 150 135 111 89 77 72 67
-44F7qrplMJ3K1K0Pqj4j6j6j7j7j4nMJ9K8K7J7RKmj1j5j1l%lprojJJkqj1j2plOJ4K4L1L3K7
-64A28J5Mlkjjkoj0j7j6j1opmJ0K9L5K0nk7l3k6j1LRRLj%OJ4J9J4PNQPKmkKNKKKLKLL%pj3
-85A56k0k2j6%J8K9K9K4J3Lmqj2j4j3kNKqj3pKNLKNJ1J7J9Rpj7rRK8L4K9J6kj8l2l9l7l1k0
-103A17pLRJ0Mjm%LJpj8k6l2l3k9k0oKMLNRPMKNJ2J3J0OLKJjjk%MJ0K0K9L4K6Rqj9j9j5rn
-124A05mnnjORLmrj3j4j0%J2K1K2J6Lj0j8j9j5j1nLQP%jjkornLJ1J3J0MJJLLMMLKlj1j9k0
-144E7j5j1j4j8j1J0L0L8L2K2J4OKNJ6K2J9Qnj2j4j5j4qJJ1K0J9J2Jqj4j3ojmj1j3j0mlmk
-161A15KJlqrommlMJ5K2J7Npj2r%J2K4L0K5J5Lnj5k1k2j6qj%mj2j4rjMLJKKMK%kljnj0j2j
-182H1J4K3J7Moj2j7j9j2kjmnQK3K8K0OnrqlMRJ6K7L8L8K3%j6j9j9k0k4k4j4%J2J5RLKLLk
$$ plain form
-44 67 59 50 43 40 44 57 78 98 105 97 83 67 51 34 17 3 -2 2 21 49 76 93 102 104 100 89 74 63 60 60 57 50 41 35 34 35 36 34 26 15 3 -4 -7 -1 13 37 68 101 128
-64 128 143 147 144 142 141 140 138 132 122 105 89 78 72 65 61 71 100 135 155 150 123 90 64 53 56 65 74 77 76 76 82 96 115 129 136 141 149 156 158 154 152 154 159 161 163 165 168 170 173 176 176 169 156
-85 156 136 114 98 98 116 145 174 198 211 214 210 202 190 176 163 161 166 168 160 147 140 142 147 150 152 157 168 185 204 213 206 189 180 189 217 251 280 296 294 276 244 205 168 137 117
-103 117 110 113 122 132 136 135 131 131 134 135 128 110 84 52 19 -10 -30 -36 -34 -30 -27 -22 -13 -6 -2 0 5 17 30 40 46 49 51 52 51 50 48 48 52 62 82 111 145 171 180 172 153 134 119 110 105
-124 105 101 96 91 90 96 105 108 104 95 82 68 58 58 70 91 113 129 132 122 104 85 70 59 54 57 65 72 72 71 70 68 62 53 48 51 62 75 85 89 90 91 94 97 101 105 108 110 107 96 77 57
-144 57 42 31 17 -1 -12 -2 28 66 98 120 134 140 142 147 163 185 204 212 207 195 181 166 152 144 145 156 176 195 207 208 200 186 173 167 166 162 151 138 128 124 121 117 115
-161 115 117 118 115 107 98 92 88 84 81 85 100 122 139 144 137 125 116 116 128 152 182 207 222 225 220 205 184 162 146 138 137 137 133 121 107 98 97 101 104 105 107 109 113 115 115 113 110 109 104 94 82 81
-182 81 95 118 135 139 133 121 104 85 73 71 70 66 61 69 92 120 140 146 141 132 124 121 125 134 150 177 215 253 276 276 260 241 222 202 178 154 140 140 152 167 176 179 181 184 187 185
-201A85nrj2j3qkkj0j6rRK0J4pk4k9k4j3pljLQQPPJ3J6Rok1k8k8k5j6OK9M0L5K6K0J9J3Lm
-219A68qj3k3k8l0k6k2j7nJ1L0L9M1L3K7K4K1J3lk1k8k1j0jKLRJ3J3OknoqqjPJ1NlpqnMK1
-237A92L5L4J5rk4l0l5m1m1l0qJ2J7Mj0rPK3K3Rmj2j0pmklmppok%jkloppkMJ1J6K3K9L1L1
-256A83K2J0JJNPmk0k4j5JJ0Rkj3j7pJ2K2J9Lj5k8l2k5j0MJ0J0Nlj2j9j8j1LJ5K3K1RkqmJ
-273A17jqj2oJ1K3K4J3Loj0j0kJ2J7Pj0k0j3KJ4J7J4J2J4J2OKNJ7J8Jk2l6l4k7k3k2j8qLQ
-290H4LmmNJ4J4RNMKjkmppjKJnprj6k2j8oOJ1J3J5J3QOPPKjJOQJ0J2J0LmjMPQJ2Rlj6k3k0
-312A40j6j7j7j4j3q%J1J6J3J1J0QjqpKJ1J7J7Qoj9j8mRJ3P%k%J%mrnMJ4J4RLMRJ3J4J5J6
-331B41J5J4J4J5Rlk2l3l8l8l7l2k6k4k6k8k0lJ5K5K7K4J8J4RJj2k4l2k7j4OK2L3M0L9L1J5
$$ plain form
-201 185 180 171 159 146 138 136 134 124 108 99 108 128 142 135 111 82 58 45 38 35 34 37 45 53 60 67 80 96 105 99 78 50 22 -3 -19 -13 16 56 91 117 137 156 169 172 168
-219 168 160 147 124 96 66 40 18 1 -4 7 37 76 117 150 177 201 222 235 232 211 183 162 152 151 153 156 165 178 191 197 195 190 184 176 168 167 174 185 190 187 180 172 167 171 192
-237 192 227 261 276 267 243 213 178 137 96 66 58 70 87 91 81 72 79 102 125 134 130 118 108 101 97 95 92 88 81 74 68 66 66 65 63 60 54 47 40 38 42 53 69 92 121 152 183
-256 183 205 215 216 217 222 229 225 205 181 166 167 177 186 184 171 154 147 159 181 200 203 188 160 128 103 93 97 107 117 122 119 107 88 70 59 62 77 100 121 130 128 120 116 117
-273 117 116 108 96 90 101 124 148 161 164 158 148 138 136 148 165 172 162 142 129 131 145 162 176 188 202 214 220 222 227 244 262 263 241 205 171 144 121 99 81 73 76 84
-290 84 87 83 79 84 98 112 121 126 130 132 131 129 125 118 111 110 112 113 108 101 92 76 54 36 30 36 47 60 75 88 96 102 109 116 118 117 118 124 132 142 154 164 167 163 162 166 173 181 193 202 199 183 160 140
-312 140 124 107 90 76 63 55 55 66 82 95 106 116 124 123 115 108 110 121 138 155 163 157 138 120 116 125 138 145 145 143 143 144 144 140 131 126 130 144 158 167 170 174 183 196 210 225 241
-331 241 256 270 284 299 308 305 283 250 212 174 137 105 79 55 29 1 -19 -22 -7 18 45 69 87 101 110 111 99 75 43 16 2 8 30 63 103 142 173 188
-346A88mk2l2l1k3rKQJ0QLjnpj2j8k3j6%J9K9K6J6RQJ0J0N%lnj1j1mRJ6J5Olj1j6j7j3pj%
-365I2knmKQQKlpj4k9l9l6j9PK8K9J6jqnKPJ2J8K1J7J4J3Npj8j5kRJ1RNLJKMKjnrj8l1l5l0
-385Dj7oRK5L7L5K9K8L3L0J0k0m3n2m4l1j8rkOJ9K9L0K1J0%lmkMJ6K4K2J1%nnprqnjoj5j9
-403A01rJ2K9K7J8J4J6J9J1lj2rkKkj4k6l0k6j7j5j6j3oLNjj2j9j7nOPqk3l2k4rKRRJ2J3J4
-420b1J4J6K5L2L2K4J5PLLPJ2J4PjkMJ0O%oj2k0k8l3l1l2l2k7j9rqrrkNRJ2J3RMJLJ0J4Rm
-439A5j8k6k2j0MJ8K7K9K7K2K2K8K4RoqJPjj4j6qLMoj6j5pMJ0RQJ4K2K7K1Pqj6j9j6j0l%k
-457A15nj0romqj7k4k2j0KN%qj4j5j0lPRPNJ1K2L0K5J6J0J1ROjlorj1nPJ7K1K2K2K2J9J0%
-476B30nj0j6k5l4l6l0k3j8j5qKJ1Omp%J2J9K1K1K0J5OjonlJlj5k4k3pJ3K7L6L9L1J0rj7r
$$ plain form
-346 188 184 162 130 99 76 67 69 77 87 95 98 97 92 85 73 55 32 16 16 35 64 90 106 115 123 133 143 148 148 145 140 129 118 114 123 139 154 160 157 146 130 113 100 93 92 92
-365 92 90 85 81 83 91 99 101 98 91 77 48 9 -27 -46 -39 -11 18 34 33 25 20 22 29 41 59 80 97 111 124 129 122 104 89 87 96 107 116 121 124 125 127 131 133 132 127 118 100 69 34 4
-385 4 -13 -19 -10 15 52 87 116 144 177 207 217 197 154 102 58 27 9 0 -2 4 23 52 82 103 113 113 110 106 104 108 124 148 170 181 181 176 171 164 155 147 142 141 135 120 101
-403 101 92 104 133 160 178 192 208 227 238 235 223 214 212 214 212 198 172 142 116 99 84 68 55 49 52 57 56 44 25 8 3 9 16 8 -15 -47 -71 -80 -78 -69 -60 -48 -35 -21
-420 -21 -7 9 34 66 98 122 137 144 147 150 157 169 183 190 189 187 191 201 207 207 201 189 169 141 108 77 45 13 -14 -33 -42 -50 -59 -68 -70 -65 -56 -44 -31 -22 -18 -17 -14 -4 10 19 15
-439 15 -3 -29 -51 -61 -57 -39 -12 17 44 66 88 116 140 149 143 135 136 143 142 128 112 104 107 111 105 89 74 67 71 81 90 98 112 134 161 182 189 181 165 146 130 120 117 117 115
-457 115 110 100 91 85 81 73 56 32 10 0 2 7 7 -1 -15 -30 -40 -43 -36 -27 -20 -15 -4 18 48 73 89 99 110 119 125 124 121 115 106 95 90 97 114 135 157 179 201 220 230 230
-476 230 225 215 199 174 140 104 74 51 33 18 10 12 23 29 25 18 18 30 49 70 91 111 126 132 131 125 120 117 118 115 100 76 53 46 59 86 122 161 192 202 193 176 167
-493A67%NONQJ1J8J9J0rk4l0k7k1j5pkmrj5j5j3rooj2j6j1JJ4K3K2J8J3RJ0J3J5J1QPNlj4
-511A50k1j9j3j0qqrj1oMR%j1j3LK3L3K9J8Ooj6k0j5qlkkKPJ0RNJKPJ3J4Q%qj3j4j3rnmop
-530G3olNJ3J9J6MJJ0K5L3K8J6Nlrj4j6j6rLJ1J1%j4k6m0m7m5l0j0NJ0NmmLJ7K2J7J0QJ0O
-548I0%jKQJ2J3J2J3J3PjplJ1K4K3J3Jmj0j8k3j6lPQOJ4K7L7L2K4J9J8J4Ojoqj5k0k1j5j0
-566B72qj1j4j6j6j5j6j8j3omqj2oOQjj2j5j1mOJ4J7J2MJjmonloj2j5rJJ0J6K0J6Qkqj1k0
-584A03k5k0JK0K8K4J7J7J6Qmj3j3rl%KKKkqqlKLMNOjj8k9k5nRJ3RJ0J6K0J5Pkpj5k3l1l4
-603F1k9j2OJ7J2nj9j9qMPNNPJ1J2J2J3J5J4Pjj4l0m1m1k7j0kmolMJ2J9K2J7PloKJ5K4L0L0
-621A10K5J6Mrj8k1j8pLRJ0P%pj2oPJ8K2K0J5RjpoJ%pj3p%%prjJoj2j0KPLl%M%rj6j5j4j0
$$ plain form
-493 167 167 172 178 183 191 202 220 239 249 240 216 186 159 138 123 116 114 110 101 86 71 58 49 43 37 25 9 -2 -1 13 36 58 76 89 98 108 121 136 147 155 162 167 164 150
-511 150 129 110 97 87 79 71 62 51 45 49 58 58 47 34 37 60 93 122 140 146 140 124 104 89 81 78 76 74 76 83 93 102 107 108 110 117 130 144 152 152 144 131 117 104 95 90 86 80 73
-530 73 67 64 69 82 101 117 121 122 132 157 190 218 234 239 236 227 213 197 181 172 175 186 197 197 183 157 117 70 25 -5 -15 -10 0 5 1 -3 0 17 39 56 66 74 84 90
-548 90 90 89 91 99 111 124 136 149 162 169 168 161 158 169 193 216 229 230 226 216 198 175 159 156 163 171 177 191 218 255 287 311 330 348 362 368 367 361 353 338 318 297 282 272
-566 272 264 253 239 223 207 192 176 158 145 139 135 127 115 109 115 123 122 110 95 84 80 86 100 117 129 133 134 133 129 123 118 115 109 97 82 73 74 84 100 120 136 144 142 134 123 103
-584 103 78 58 59 79 107 131 148 165 181 189 185 172 159 150 147 147 149 151 153 151 143 135 132 134 137 141 146 152 151 133 104 79 74 83 96 105 115 131 151 166 173 171 164 149 126 95 61
-603 61 32 20 26 43 55 50 31 12 4 8 15 20 25 32 43 55 67 80 95 109 116 115 101 71 30 -11 -38 -48 -50 -54 -60 -63 -59 -47 -28 -6 11 18 15 9 11 26 50 80 110
-621 110 135 151 155 146 128 107 89 82 85 94 104 111 111 104 92 86 93 111 133 153 168 177 176 169 163 164 164 157 144 137 137 137 130 121 120 121 115 103 93 95 102 105 102 102 106 106 97 81 66 52 42
-642D2nPJ7J8J3OMOO%pj1oMJ1PkplOJ3J5J4J1QPOL%mlMJ2J7J4ROQPjj2k1k6k9k8k1j2orqk
-662G8PRKpj2pJ0K9M0L7K6J3Lnqj2j4j9k2j9j1mJJ2K7L4K6Oj0j4j1j1j5j9k0j7j3pmj%KNN
-680I0MK%%kmmkLRJ6J6J0Jprj2j6j9j8j0%J0J7J7J3PKoj3j4lJ0J7J0%mJOO%mkKKjpj3j9j8
-700F4j4mKQJ4K2K7K3J5PKnj2j2mNRLnj0mMQjj6k2j8pKRJ4J3Qjnpqpmpj6k4j9mJ6K8K9K2J4
-720A32ONK%jMQQjj0rKJ0Qlj6k2j8rkjnj1j7j6pQK2K4J7QLJ%%MJ7L5M8M2K3Jj2j8j8j8j4j1
-739A99qnklqj6j9j7j6j7j3lMPJ0K0L5M1K9Nj5k4k1j4rj2k2l1l2k2jJ9K5J5Mlnj5k6l1k4j6
-756c7j1j0lQJ9K7K9L3L2K4J3NORRjj3k0j7j0rj3j4r%ONJjLRJ5J5J1PNJj0k2k8k6j6mJ3K7
-774E8L4L0J9J1PNKpj7k0j2mnj6k5k7k5k1j5mMPOjpj2pNJ1RJ0J4J5%k0j8JK0K7K3J8J3RJ3
$$ plain form
-642 42 37 44 61 79 92 98 102 108 114 114 107 96 90 94 105 112 110 103 100 106 119 134 148 159 167 174 180 183 183 179 176 180 192 209 223 232 238 246 253 252 240 219 193 164 136 115 103 97 88 80 78
-662 78 85 94 96 89 77 70 80 109 149 186 212 225 228 223 215 203 189 170 148 129 118 114 115 127 154 188 214 220 210 196 185 174 159 140 120 103 90 83 79 78 78 80 85 90
-680 90 94 96 96 96 94 90 86 84 87 96 112 128 138 139 132 123 111 95 76 58 48 48 58 75 92 105 112 114 108 95 81 78 88 105 115 115 111 112 118 124 124 120 118 120 122 121 114 101 82 64
-700 64 50 46 48 56 70 92 119 142 157 164 166 161 149 137 133 138 147 150 145 135 131 135 143 142 126 104 86 79 81 90 104 117 125 124 119 112 104 97 93 86 70 46 27 23 39 67 96 118 132
-720 132 138 143 145 145 144 148 156 164 163 153 144 146 156 164 161 145 123 105 96 94 93 88 77 60 44 37 45 67 91 108 116 119 120 120 120 124 141 176 224 266 289 290 278 260 242 224 210 199
-739 199 191 186 184 181 173 157 138 121 105 88 75 72 76 83 93 113 148 189 218 223 208 184 163 149 140 128 106 75 43 21 20 39 64 79 83 80 75 60 34 3 -21 -37
-756 -37 -48 -58 -61 -53 -34 -7 22 55 87 111 124 129 135 144 153 152 139 119 102 92 83 70 56 47 47 53 58 59 58 61 70 85 100 111 118 123 124 114 92 64 38 22 18 31 58
-774 58 92 122 141 152 159 164 166 159 142 122 110 106 101 85 60 33 8 -13 -28 -32 -28 -21 -15 -16 -23 -35 -42 -37 -26 -17 -7 7 22 22 2 -16 -15 5 32 55 73 86 95 108
-791A08K8M2M4L4J5j1l8n0l7j4kln%OORJ5K3K4J5Jj7l0k7rJ3K3K5K1K1K1J5Kj3k2k8l3l6l0
-808A06rJ9M3N0M4K9Rpj6j8j9k3k7k3j4rj0q%J3K1J8Nnj1j0j1pMJ6J6Mpq%NLjj0k0k7k1r%
-825G5OJ0J8K2J8J2PLpk1l2l4k7j5kQJ2RJnkMJ1QL%LRJ1J1OJkjKKlo%J0J7J7J3P%m%OPOMO
-846B04O%rj8k0j5j0oqj2j3j2j1j0j0qkJ0K2K3J0rk3k6k0rMJ9L0L5L4K5J1KJPQPMkj3k8l2
-863A36k1mQJ3J2Lj1k4k2j0NJ5K0K5K3J3ok4l3k6j0LKoj0oJRJ6J9J5O%JOOJpj2j1qljJJJm
$$ plain form
-791 108 136 178 222 256 271 260 222 172 135 121 119 116 111 111 117 123 132 147 170 194 209 210 193 163 136 127 140 163 188 209 230 251 266 268 255 233 205 172 136 106
-808 106 97 116 159 209 253 282 291 284 268 250 231 208 181 158 144 135 125 117 117 130 151 169 174 169 158 148 137 130 134 150 166 170 163 155 155 160 163 162 152 132 105 84 75 75
-825 75 81 91 109 131 149 161 168 171 164 143 111 77 50 35 33 41 53 62 63 58 56 60 71 79 82 82 85 94 105 116 122 123 121 120 122 124 121 115 115 125 142 159 172 179 179 175 175 181 188 194 198 204
-846 204 210 210 201 183 163 148 138 132 124 112 99 87 76 66 56 48 46 56 78 101 111 102 79 53 33 24 28 47 77 112 146 171 182 184 185 192 200 207 211 209 196 168 136
-863 136 115 111 119 132 144 147 136 112 90 80 85 100 120 145 168 181 175 151 118 92 82 85 87 81 71 65 66 75 91 110 125 131 131 132 138 144 145 138 126 115 107 104 103 104 105 106 102
$$ [...]
-2084A03
##END=	
##END=	
