##TITLE=	May10-2022.50.fid
TM-VI-01X, dmso 13C new

##JCAMP-DX=	6.0	$$ MestReNova 14.3.1-31739
##DATA TYPE=	LINK
##BLOCK_ID=	1
##BLOCKS=	2    
##ORIGIN=	Mestrelab Research S.L.
##OWNER=	hrzepa
##$MNOVA/LINK_BLOCK_TYPE=	ITEM	$$ NMR Spectrum
##$MNOVA/ITEM/POLYGON=	(XY..XY)
5321,5835
8722,5835
8722,8208
5321,8208
5321,5835
##$MNOVA/ITEM/Z=	0
##$MNOVA/ITEM/ANGLE=	0
##TITLE=	May10-2022.50.fid
##JCAMP-DX=	6.0	$$ MestReNova 14.3.1-31739
##BLOCK_ID=	2
##DATA TYPE=	MNOVA NMR VIEW DATA
##DATA CLASS=	MNOVA VIEW DATA
##$MNOVA/ITEM/ZOOM/X=	-31.150195598113686657,	251.15679998888273872
##$MNOVA/ITEM/ZOOM/Y=	-717.07962417602539063,	7666.336669921875
##END=	
##TITLE=	May10-2022.50.fid
##JCAMP-DX=	6.0	$$ MestReNova 14.3.1-31739
##BLOCK_ID=	3
##DATA TYPE=	NMR SPECTRUM
##DATA CLASS=	XYDATA
##NUMDIM=	1
##ORIGIN=	Bruker BioSpin GmbH
##OWNER=	nmr
##.OBSERVE FREQUENCY=	100.64143946071199309
##.OBSERVE NUCLEUS=	^13C
##.SOLVENT NAME=	DMSO
##.PULSE SEQUENCE=	zgpg30
##LONGDATE=	2022/05/10 21:19:00.000
##.ACQUISITIONMODE=	SIMULTANEOUS (DQD)
##$ORIGINAL FORMAT=	Bruker XWIN-NMR
##$MNOVA/SCALES_VERSION=	9
##$PARAMETER FILE=	(acqus, ASCII, /private/var/folders/f6/rjf_tdyn2v98c5c0wvkgn4s80000gn/T/7NuZUs5RQDa1Su7azTj9gg/50/acqus, 0)
$$ ##TITLE= Parameter file, TOPSPIN		Version 3.2
$$ ##JCAMPDX= 5.0
$$ ##DATATYPE= Parameter Values
$$ ##NPOINTS= 11	$$ modification sequence number
$$ ##ORIGIN= Bruker BioSpin GmbH
$$ ##OWNER= nmr
$$ $$ 2022-05-10 21:19:56.180 +0100  nmr@CZC2439F63
$$ $$ /opt/topspin/data/agmb/nmr/May10-2022/50/acqus
$$ $$ process /opt/topspin3.2/prog/mod/shimcntl
$$ ##$ACQT0= -1.90126054427203
$$ ##$AMP= (0..31)
$$ 100 100 100 100 100 100 100 100 100 100 100 100 100 100 100 100 100 100
$$ 100 100 100 100 100 100 100 100 100 100 100 100 100 100
$$ ##$AMPCOIL= (0..19)
$$ 0 0 0 0 0 0 0 0 0 0 0 0 0 0 0 0 0 0 0 0
$$ ##$ANAVPT= -1
$$ ##$AQSEQ= 0
$$ ##$AQ_mod= 3
$$ ##$AUNM= <au_zg>
$$ ##$AUTOPOS= <52 >
$$ ##$BF1= 100.63037
$$ ##$BF2= 400.2
$$ ##$BF3= 100.63037
$$ ##$BF4= 100.63037
$$ ##$BF5= 100.63037
$$ ##$BF6= 100.63037
$$ ##$BF7= 100.63037
$$ ##$BF8= 100.63037
$$ ##$BYTORDA= 0
$$ ##$CAGPARS= (0..11)
$$ 0 0 0 0 0 0 0 0 0 0 0 0
$$ ##$CFDGTYP= 0
$$ ##$CFRGTYP= 9
$$ ##$CHEMSTR= <none>
$$ ##$CNST= (0..63)
$$ 1 1 145 1 1 1 1 1 1 1 1 1 1 1 1 1 1 1 1 1 1 1 1 1 1 1 1 1 1 1 1 1 1 1 1
$$ 1 1 1 1 1 1 1 1 1 1 1 1 1 1 1 1 1 1 1 1 1 1 1 1 1 1 1 1 1
$$ ##$CPDPRG= (0..8)
$$ <waltz16> <> <waltz16> <> <mlev> <mlev> <mlev> <mlev> <mlev>
$$ ##$D= (0..63)
$$ 0 1 0.00345 0 0 0 0 0 0 0.06 0 0.03 2e-05 3e-06 0 0 0.0002 0 0 0 0 0 0
$$ 0 0 0 0 0 0 0 0 0 0 0 0 0 0 0 0 0 0 0 0 0 0 0 0 0 0 0 0 0 0 0 0 0 0 0 0
$$ 0 0 0 0 0
$$ ##$DATE= 1652213995
$$ ##$DE= 6.5
$$ ##$DECBNUC= <off>
$$ ##$DECIM= 704
$$ ##$DECNUC= <off>
$$ ##$DECSTAT= 4
$$ ##$DIGMOD= 1
$$ ##$DIGTYP= 12
$$ ##$DQDMODE= 0
$$ ##$DR= 21
$$ ##$DS= 4
$$ ##$DSPFIRM= 0
$$ ##$DSPFVS= 20
$$ ##$DTYPA= 0
$$ ##$EXP= <c13>
$$ ##$F1LIST= <111111111111111>
$$ ##$F2LIST= <222222222222222>
$$ ##$F3LIST= <333333333333333>
$$ ##$FCUCHAN= (0..9)
$$ [...]
$$ ##$Sgu3PowerLevels= (0..7)
$$ 0 0 0 0 0 0 0 0
$$ ##$Sgu4PowerLevels= (0..7)
$$ 0 0 0 0 0 0 0 0
$$ ##$Sgu5PowerLevels= (0..7)
$$ 0 0 0 0 0 0 0 0
$$ ##$Sgu6PowerLevels= (0..7)
$$ 0 0 0 0 0 0 0 0
$$ ##$Sgu7PowerLevels= (0..7)
$$ 0 0 0 0 0 0 0 0
$$ ##$Sgu8PowerLevels= (0..7)
$$ 0 0 0 0 0 0 0 0
$$ ##$SguType= 3
$$ ##$ShimPowMaxUA= (0..63)
$$ 130000 130000 130000 130000 130000 130000 130000 130000 130000 130000 130000
$$ 130000 130000 130000 130000 130000 130000 130000 130000 130000 0 0 0 0
$$ 0 0 0 0 0 0 0 0 0 0 0 0 0 0 0 0 0 0 0 0 0 0 0 0 0 0 0 0 0 0 0 0 0 0 0 0
$$ 0 0 0 0
$$ ##$ShimPowMaxUC= (0..63)
$$ 130000 130000 130000 130000 130000 130000 130000 130000 130000 130000 130000
$$ 130000 130000 130000 130000 130000 130000 130000 130000 130000 0 0 0 0
$$ 0 0 0 0 0 0 0 0 0 0 0 0 0 0 0 0 0 0 0 0 0 0 0 0 0 0 0 0 0 0 0 0 0 0 0 0
$$ 0 0 0 0
$$ ##$ShimPowMaxUG= (0..63)
$$ 524287 524287 524287 524287 524287 524287 524287 524287 524287 524287 524287
$$ 524287 524287 524287 524287 524287 524287 524287 524287 524287 0 0 0 0
$$ 0 0 0 0 0 0 0 0 0 0 0 0 0 0 0 0 0 0 0 0 0 0 0 0 0 0 0 0 0 0 0 0 0 0 0 0
$$ 0 0 0 0
$$ ##$ShimPowRcbType= 3
$$ ##$ShimPowRes= (0..63)
$$ 1e-20 1e-20 1e-20 1e-20 1e-20 1e-20 1e-20 1e-20 1e-20 1e-20 1e-20 1e-20
$$ 1e-20 1e-20 1e-20 1e-20 1e-20 1e-20 1e-20 1e-20 0 0 0 0 0 0 0 0 0 0 0 0
$$ 0 0 0 0 0 0 0 0 0 0 0 0 0 0 0 0 0 0 0 0 0 0 0 0 0 0 0 0 0 0 0 0
$$ ##$ShimPowRng0= (0..63)
$$ 1 1 1 1 1 1 1 1 1 1 1 1 1 1 1 1 1 1 1 1 0 0 0 0 0 0 0 0 0 0 0 0 0 0 0 0
$$ 0 0 0 0 0 0 0 0 0 0 0 0 0 0 0 0 0 0 0 0 0 0 0 0 0 0 0 0
$$ ##$ShimPowRng1= (0..63)
$$ 1 1 1 1 1 1 1 1 1 1 1 1 1 1 1 1 1 1 1 1 0 0 0 0 0 0 0 0 0 0 0 0 0 0 0 0
$$ 0 0 0 0 0 0 0 0 0 0 0 0 0 0 0 0 0 0 0 0 0 0 0 0 0 0 0 0
$$ ##$ShimPowRng2= (0..63)
$$ 1 1 1 1 1 1 1 1 1 1 1 1 1 1 1 1 1 1 1 1 0 0 0 0 0 0 0 0 0 0 0 0 0 0 0 0
$$ 0 0 0 0 0 0 0 0 0 0 0 0 0 0 0 0 0 0 0 0 0 0 0 0 0 0 0 0
$$ ##$ShimPowRng3= (0..63)
$$ 1 1 1 1 1 1 1 1 1 1 1 1 1 1 1 1 1 1 1 1 0 0 0 0 0 0 0 0 0 0 0 0 0 0 0 0
$$ 0 0 0 0 0 0 0 0 0 0 0 0 0 0 0 0 0 0 0 0 0 0 0 0 0 0 0 0
$$ ##$ShimSysFunc= (0..63)
$$ 1 2 3 4 5 7 9 11 15 16 8 10 12 14 6 17 13 18 19 20 0 0 0 0 0 0 0 0 0 0
$$ 0 0 0 0 0 0 0 0 0 0 0 0 0 0 0 0 0 0 0 0 0 0 0 0 0 0 0 0 0 0 0 0 0 0
$$ ##$ShimSysMatrix= 0
$$ ##$ShimSysType= 1
$$ ##$TFXNUM= 0
$$ ##$TRIPLO2= 0
$$ ##$VTU= 2
$$ ##$VTUETH= <149.236.99.20>
$$ ##$VTUTY= <no>
$$ ##$WBREFAM= (0..15)
$$ 135.5 97.7 100 100 100 100 100 100 100 100 100 100 100 100 100 100
$$ ##$WBREFLM= (0..15)
$$ 0 0 0 0 0 0 0 0 0 0 0 0 0 0 0 0
$$ ##$WBREFPH= (0..15)
$$ 72.26 -67.22 0 0 0 0 0 0 0 0 0 0 0 0 0 0
$$ ##$WBSGU= (0..15)
$$ 0 0 0 0 0 0 0 0 0 0 0 0 0 0 0 0
$$ ##$XFAC= 2
$$ ##END=
$$ 
##$DECIM=	704
##$DSPFVS=	20
##XUNITS=	HZ
##YUNITS=	ARBITRARY UNITS
##FIRSTX=	25274.001712016048259
##LASTX=	-3134.6557087493106337
##DELTAX=	-0.43348832563920586258
##XFACTOR=	1
##YFACTOR=	0.084700786226667851286
##FIRSTY=	7.0471410751342773438
##MINY=	-20.139926910400390625
##MAXY=	6969.39697265625
##NPOINTS=	65536
##XYDATA=	(X++(Y..Y))
$$ [...]
9508B31l2j0J1Rj6l6l3j6oMJ8L4K9Mj8j8lNMNQNkmmj2l0m1k7%J8J4oj9j5MK1K4Rj1k0j5mL
9489F2OJ0J5J7J2L%QJ7J2j0l5m7l5oK3L8L3J8QJ1J8J8J4J0J1J2Qlj5j9j6rmoj3j5j3qjOJ1
9471A46J4K1K8K7J6NLQQkj6k3j8j0orj0rrj7k4k3j3qq%J8K4Nk5l6k3JJ9L2L6K4Lj1kJ0J3K
9452A61pj6k9m2l6nL2M7L1Kj4oJ8L4L2J6mj9k7k2j2JJ0J8K4K0Oj1k1k1j3KJ7K1J3PQNj2l5
9435A73m1k7j4j7k5k7k2j2MK6M2L6J9J3K1K7J9Olj3k6m0m2l0j1KLjmKJ1K4L5L8K7J0lkQJ1
9417A97kk7n1m9j7K1L6J9jNK4K3nl0k9j3qj5j2MJ5J2KlkjOJ8L1L2K4J3Jj6l9n1m4k2kMnj6
9399B7j8qQJ8K2K2K0J1mk0k3j3LJ3K0K7L3L2J8Kj0j3j4j1nOJ8K7K0ml2m4l8k4j5rlJnj8k0
9381cj1KJ2K3L1K2NlNK0K3J8J3QL%PJ4J4lk5m0l2rNjj7j8mKpoJ7M1L5Nj3pKmj8k8k5j5lRJ5
$$ y = [231, 199, 189, 200, 209, 193, 157, 124, 108, 102, 106, 124, 158, 187, 191, 173, 155, 152, 157, 161, 166, 174, 179, 177, 173, 169, 157, 127, 86, 59, 59, 77, 91, 85, 66, 51, 55, 76, 100, 109, 98, 78, 63, 59, 62, 68, 78, 93, 110, 122, 125, 125, 133, 150, 162, 152, 117, 70, 35, 29, 52, 90, 123, 141, 149, 160, 178, 196, 210, 220, 231, 243, 251, 248, 233, 214, 198, 189, 185, 179, 166, 151, 138, 130, 129, 135, 146, 160, 181, 209, 236, 252, 257, 260, 268, 276, 274, 258, 235, 217, 207, 201, 192, 182, 173, 164, 147, 123, 100, 87, 79, 71, 71, 89, 113, 118, 93, 57, 34, 35, 54, 86, 122, 146, 149, 138, 136, 146, 159, 161, 154, 138, 109, 67, 31, 26, 58, 105, 136, 138, 124, 118, 136, 170, 202, 218, 214, 195, 168, 146, 134, 135, 145, 163, 187, 207, 213, 202, 181, 160, 147, 149, 166, 187, 200, 207, 215, 220, 208, 173, 132, 105, 91, 74, 49, 22, 0, -12, -8, 18, 60, 96, 115, 128, 149, 176, 195, 201, 198, 185, 159, 119, 77, 47, 36, 38, 41, 40, 36, 38, 49, 73, 108, 146, 173, 183, 180, 178, 186, 197, 195, 168, 117, 68, 51, 72, 108, 127, 126, 131, 155, 178, 173, 143, 114, 101, 93, 78, 66, 70, 85, 97, 99, 96, 94, 93, 99, 117, 148, 180, 204, 217, 218, 202, 163, 112, 68, 46, 44, 48, 43, 27, 9, 1, 9, 27, 49, 71, 91, 102, 98, 78, 55, 42, 45, 58, 78, 105, 138, 170, 188, 190, 180, 167, 153, 142, 137, 143, 161, 188, 208, 204, 172, 128, 90, 66, 51, 42, 39, 40, 35, 17, -3, -14, -12, 0, 23, 54, 76, 81, 78, 83, 103, 126, 144, 157, 165, 168, 168, 175, 189, 203, 200, 175, 135, 103, 94, 99, 98, 81, 63, 59, 61, 54, 48, 65, 106, 141, 146, 133, 126, 128, 124, 106, 78, 53, 38, 35, 44, 59]
9361E9K4L9N0M0Pk5l5k1LJ8J2nj8j9qjJMOKkkLQJ3J9J9Pqj2j1j7k6j7NJ8J3RK1L1L0K7K4J3
9342B98j3k9k0j3l3n9n1j3QLNK7M0J7j7k3KK7L0K7L0L3K3jk0k3qLnk6m0l8k8j9oK1M8O0N2
9325B69L6K7K2J1j0l8n3n2m3l1j8KK1K0kk5k9j7omqmRK5K9J9Mpqmlrk2l5l9k6%J8J2mrOK9
9306E3M3M1K6Q%MJ7K5J8jj3qJlk2l4l2k1j1lNRPOJ3K5K8K2J7J8J9J2lk3l5l1j1QOoj3p%mj1
9287A39qNK2L1K9J5lj3j1rqkJ6L4L7K0ql1l8k8j2rj6j8oJ2K3K2J5%j9k9k4j7j2oLJj6l0k0
9269C1NK0J3Knj3k4j9NK4J2k2l9k3RL0L2K4J9K2K6K2J5J1J1J3J4J4Nj0l2m6m4k7pNLkkPJ7
9251I6K2K2J7PnqKQ%j3j2%QQMjj1j7oJ6K7K6J9J6J0nj9j7nPJ2J3J0Lj0k6l9l6j4J3K2J4NN
9232A68Kpj6j2kRK2M0M5K8%j6j8k0k8l1k3j0kJMJ0J2jk6m4l9k2j2j3j3jJ3J6J3J2OmjK4N2
$$ y = [59, 83, 122, 172, 212, 219, 194, 159, 138, 141, 159, 171, 166, 148, 129, 121, 120, 121, 125, 131, 133, 131, 129, 132, 140, 153, 172, 191, 198, 190, 178, 167, 150, 124, 107, 112, 130, 143, 152, 173, 204, 234, 261, 285, 298, 285, 256, 236, 223, 190, 131, 80, 67, 75, 78, 83, 110, 150, 167, 150, 127, 129, 156, 186, 213, 243, 276, 299, 298, 278, 255, 247, 250, 245, 219, 179, 141, 113, 94, 88, 109, 157, 217, 269, 305, 332, 354, 365, 355, 317, 264, 212, 169, 138, 120, 122, 143, 163, 161, 136, 107, 90, 84, 80, 72, 68, 77, 102, 131, 150, 154, 147, 139, 135, 132, 123, 101, 66, 27, 1, 1, 19, 31, 27, 18, 24, 53, 96, 137, 163, 171, 171, 175, 192, 217, 235, 234, 221, 213, 214, 211, 189, 155, 123, 102, 91, 88, 93, 102, 109, 115, 128, 153, 181, 203, 220, 238, 257, 269, 266, 243, 208, 177, 166, 174, 180, 174, 161, 154, 154, 150, 139, 131, 136, 158, 189, 218, 233, 230, 217, 206, 197, 189, 187, 203, 237, 274, 294, 286, 255, 217, 189, 177, 168, 152, 134, 128, 140, 163, 185, 200, 200, 181, 152, 128, 111, 99, 93, 96, 97, 81, 51, 31, 36, 56, 69, 71, 66, 53, 29, 10, 15, 39, 51, 29, -10, -33, -24, 6, 38, 62, 81, 103, 129, 151, 166, 177, 188, 201, 215, 229, 234, 224, 192, 146, 102, 75, 68, 73, 76, 74, 72, 79, 96, 118, 140, 157, 164, 159, 151, 153, 161, 161, 148, 136, 136, 144, 152, 156, 155, 144, 127, 121, 137, 164, 190, 209, 225, 235, 230, 211, 194, 189, 196, 208, 221, 231, 234, 224, 198, 159, 123, 109, 122, 144, 158, 163, 168, 170, 163, 147, 135, 133, 142, 164, 204, 249, 277, 277, 261, 243, 223, 195, 164, 141, 131, 129, 130, 134, 144, 156, 155, 129, 85, 46, 24, 12, -1, -14, -15, -2, 14, 27, 39, 45, 41, 40, 64, 116]
9215A16N5L7K5K0Lk5m0l1j8k0k8k4qNRRJ3J3Lj5l5l9k4JJ6J3OJ3K6K7Rj5k2rJ0J6Kj7j9oP
9197E9PKQK5L8L7K2Kj1j3j0j1j7j6%J7K1J0lmjJJ%nj3j4rnj0j8k0qJMkkPJ8J9NqoJ1K5K0j
9176A53j6j7lJ7L2L5K4QlJPMqj8j6rj3k5l1j9%Mj5l6l4j1RJ0jokNQJ0PKqj1nMOjnLJ3J3Jr
9156E4KK2K9Pk0k3PM0M4J9npNJk2l8k7lQlk0j7jJ5J7Rkj0oLKrj6jK4L8L7L2K5Ok2l5j6J6K6
9136A85J1j2k2j4MK2K9K0ORK7L9K8jl2m7m2k1jLqj0OK9K6qm3n4m0k6j7qJ1L8O0N9L2pl6l9
9119A56k9k3k7j9JJ3NpJK2K6J6J0J8K1J1LMJk0m0l4qK1M0N1M7K5j0l3m0l7l1j9nJLQJ4J0%
9101A46OL1M7L4ml9m9l2pQJj3j9j8j8j4PL6M8L4J2jqj3nJ1J1j6m8m7j9QJ5Qkj4k1j2QK0J5
9083H7OLQJ3J4RJnmnj5j7JK9L3J2mNJ5Lk0k2jJ1Ompj0j5j7j0j1k8m5l3LM2O0N5M0K6J5Oqk0
$$ y = [116, 171, 208, 233, 253, 256, 231, 191, 160, 142, 122, 94, 70, 62, 67, 76, 85, 98, 111, 114, 99, 64, 25, 1, 2, 18, 31, 37, 50, 76, 103, 112, 97, 75, 66, 76, 92, 94, 77, 58, 52, 59, 66, 68, 76, 101, 139, 176, 198, 200, 189, 176, 166, 155, 138, 122, 122, 139, 160, 170, 167, 163, 162, 163, 164, 164, 159, 146, 132, 123, 118, 108, 90, 70, 62, 63, 67, 65, 63, 70, 88, 107, 112, 104, 98, 109, 134, 154, 153, 137, 120, 117, 134, 166, 201, 225, 233, 230, 231, 238, 242, 234, 216, 200, 191, 178, 153, 122, 103, 103, 107, 92, 56, 22, 11, 20, 30, 29, 23, 21, 26, 34, 44, 51, 53, 45, 34, 29, 33, 39, 38, 33, 36, 49, 62, 63, 54, 56, 78, 107, 114, 94, 71, 78, 118, 162, 181, 176, 169, 174, 175, 153, 115, 88, 85, 93, 90, 70, 53, 52, 67, 84, 93, 91, 81, 75, 78, 80, 71, 55, 54, 78, 116, 153, 185, 210, 216, 194, 159, 143, 159, 185, 196, 184, 162, 148, 152, 174, 203, 223, 229, 238, 265, 304, 332, 331, 299, 252, 210, 189, 188, 191, 183, 173, 179, 208, 234, 226, 183, 129, 89, 63, 46, 38, 49, 87, 147, 206, 238, 231, 195, 156, 127, 104, 77, 58, 59, 72, 77, 70, 71, 93, 119, 135, 145, 163, 184, 195, 198, 202, 203, 183, 143, 109, 101, 122, 162, 213, 260, 285, 275, 242, 202, 165, 134, 115, 110, 111, 114, 122, 136, 146, 146, 152, 183, 230, 264, 260, 221, 172, 140, 133, 141, 142, 129, 110, 92, 74, 60, 67, 103, 151, 185, 197, 196, 188, 175, 170, 181, 192, 176, 128, 81, 62, 70, 85, 93, 91, 77, 56, 44, 52, 72, 87, 93, 96, 104, 117, 131, 140, 141, 136, 132, 127, 112, 95, 96, 125, 158, 170, 166, 171, 186, 189, 169, 147, 146, 157, 163, 159, 152, 142, 127, 110, 100, 89, 61, 16, -17, -14, 28, 88, 143, 183, 209, 224, 230, 222, 202]
9064B02k4j1KJrj1ljj2j5%K6L9L9L1J7j0l7l6rJ3Pj1j6mLkj1j1rrj3j9k0j2%Kj1k4j9JJ7J5
9045D6LlOK1K9K3RMJ4K3J3j0k5j9jJ9K9K5J1mj2pjjoj3rOJ9Rj7l4k6lRJ1J7K5J7nk1j7mkj1
9026A37j4mJ2J9J4jj0oLKj1j8pJ4K5K0Pmpmlrj9j7%K3L2K1NmJJ3K3K0Kj7k4j7njnqolJNJ1
9005A86J6J3Ojkrl0n3n3k6QK3K1J4J3J5J8J6Qlj1j3j2pMJ7K3J0nnJ0K6K9J9R%j1k4k7j1J8
8987B19L7L1Qj9m0n4n3m0k4k2j8J0M6N1J7j3JL4M0J0j8k0j0pj0o%%nrj0p%Kmj2qJ1K4J8Kp
8969A45nNJ7K3J4oj7j7j9k8k8mK7K9om9p1o4m3j6KRJ2K8N6P0O2L7K0J8J0rk2j4MRjj2qmqj6
8951A30j2kLlpj5l1m9l7PM8M9J4j5j6l%pqNJ6J5RK%krj7j6qRL1N0N9M7J7j5l0k4qNNrk3k4
8931A31pJ2J7Nj1j3jJ0Lj8l0j9LQpj7nJ3Ok0l9l3k3j8rK0M7M7J4j6j6J4L9M6L8K6K2J7J2M
$$ y = [202, 178, 167, 169, 170, 161, 150, 147, 146, 134, 119, 119, 145, 184, 223, 254, 271, 261, 224, 188, 179, 192, 199, 188, 172, 168, 171, 169, 158, 147, 138, 129, 116, 97, 77, 65, 65, 67, 56, 32, 13, 14, 31, 46, 49, 46, 52, 73, 102, 125, 134, 138, 152, 175, 188, 178, 153, 134, 133, 152, 181, 206, 217, 213, 201, 194, 193, 192, 186, 173, 164, 170, 189, 198, 181, 147, 121, 118, 127, 138, 155, 180, 197, 192, 171, 154, 150, 148, 137, 123, 119, 131, 150, 164, 163, 153, 147, 150, 152, 141, 123, 116, 130, 155, 175, 182, 178, 171, 167, 164, 155, 136, 119, 119, 142, 174, 195, 200, 196, 197, 210, 233, 253, 255, 238, 214, 197, 192, 191, 186, 178, 172, 169, 170, 175, 186, 202, 215, 221, 220, 218, 209, 179, 126, 73, 47, 55, 78, 99, 113, 126, 141, 159, 175, 183, 180, 169, 156, 144, 137, 141, 158, 181, 191, 186, 181, 191, 217, 246, 265, 274, 274, 263, 239, 212, 201, 219, 256, 287, 295, 276, 236, 182, 129, 89, 65, 43, 25, 35, 81, 132, 149, 136, 137, 171, 211, 221, 203, 183, 173, 166, 156, 150, 150, 150, 145, 136, 126, 119, 119, 121, 117, 105, 97, 108, 132, 150, 152, 145, 140, 145, 162, 185, 199, 193, 176, 159, 140, 112, 84, 80, 107, 136, 130, 81, 10, -54, -97, -113, -111, -102, -90, -62, -6, 64, 126, 163, 183, 201, 211, 202, 180, 166, 170, 179, 178, 166, 158, 154, 146, 130, 118, 116, 119, 116, 109, 94, 63, 14, -23, -16, 32, 81, 95, 80, 64, 61, 61, 54, 46, 51, 67, 82, 91, 93, 93, 91, 82, 65, 49, 41, 50, 81, 131, 190, 237, 254, 239, 209, 185, 177, 182, 187, 178, 155, 131, 124, 136, 153, 158, 147, 134, 133, 143, 146, 128, 98, 79, 82, 90, 83, 66, 61, 74, 80, 60, 21, -12, -35, -53, -62, -42, 5, 52, 66, 50, 34, 48, 87, 133, 171, 197, 219, 236, 248, 252]
8914B52jlkmj0j3qKRJ4J1%j6k8j9NK2J2j3l1l2l0l0k6j1J6L9M6L7K1Mlnj3k0j8KK6L4K1Mr
8896B32j9k7k9k1j5j8k4j5OK2K6K3K3K0J3J1K1L0J6j8m5m9m0k8rJ8L6L4K3K0J4ql3l1qLqj4
8879A32jJ1%j7j5MRmj8qJ6L7M0K2jrJ2L4K8nk8k2j4k5m2m2k1jRJ9L2L1Qk1k8rJ1Oj8k9j5R
8861G7J8J2NJ0J4J1OPJ1J2J4J9J7%k4l3k4j1mKJ3K0K1K1K6K5J0j7l4l1j3PJ9J8Mj7k5rJ9L3
8844B29K4J0Jkj1j7j9j3j2j0jLmj9k4j8j4j3KL3N6M8J3j5j9pKO%oqmKkj1j3nNJooKN%qj6j9
8824A20j6jJ9K7J6kj1j1rlJ1K6K7J1%JKj4l9n2m8l0j3OK0K4K6K8L4L0J5JkJJJ%j0k2k3lK4
8805A62L0J2j0k2l1l7l3j2J2K4J8J1J5K6K8J7lj2qKNjj2k4l1k8j4NJ7K1K9M2M6L0OnKQKlN
8788B89J8K1Oj4k8l5l3k2pkpj6j5j4j7k0rJ0J8J1lj0j1rkRJ5PlnkknlMJj2j7JK8L8K0j0k8
$$ y = [252, 251, 248, 246, 242, 232, 219, 211, 213, 222, 236, 247, 247, 231, 203, 184, 189, 211, 223, 210, 179, 147, 117, 87, 61, 50, 66, 105, 151, 188, 209, 213, 210, 205, 192, 172, 154, 156, 182, 216, 237, 241, 232, 213, 186, 157, 136, 121, 103, 79, 64, 70, 92, 118, 141, 164, 184, 197, 208, 229, 259, 275, 257, 212, 163, 123, 95, 86, 104, 140, 174, 197, 217, 231, 223, 190, 159, 151, 154, 146, 132, 131, 142, 142, 125, 110, 114, 123, 119, 101, 93, 109, 146, 186, 208, 207, 198, 210, 244, 272, 267, 239, 217, 203, 178, 136, 94, 73, 72, 81, 100, 132, 163, 171, 150, 122, 113, 124, 130, 112, 83, 68, 77, 95, 107, 112, 122, 136, 147, 153, 160, 171, 183, 197, 216, 233, 233, 209, 176, 152, 141, 137, 139, 152, 172, 193, 214, 240, 265, 275, 258, 224, 193, 180, 187, 206, 224, 228, 211, 186, 177, 196, 229, 253, 263, 264, 262, 251, 234, 215, 202, 190, 180, 179, 182, 178, 159, 135, 117, 103, 90, 92, 125, 181, 229, 242, 227, 208, 201, 203, 209, 209, 203, 195, 191, 193, 191, 180, 167, 162, 167, 168, 162, 156, 158, 163, 163, 155, 139, 120, 104, 103, 122, 149, 165, 163, 152, 141, 132, 129, 140, 166, 193, 204, 204, 205, 207, 193, 154, 102, 54, 24, 11, 17, 37, 61, 87, 115, 149, 179, 194, 195, 193, 194, 195, 196, 196, 186, 164, 141, 138, 162, 192, 204, 194, 172, 141, 104, 71, 59, 71, 95, 113, 124, 139, 165, 193, 210, 207, 195, 187, 189, 194, 193, 181, 157, 126, 98, 84, 89, 106, 127, 156, 198, 244, 274, 280, 275, 277, 285, 287, 284, 289, 307, 328, 334, 320, 292, 257, 224, 202, 195, 193, 186, 170, 155, 141, 124, 104, 95, 105, 123, 134, 131, 121, 110, 101, 99, 108, 123, 130, 127, 122, 120, 118, 113, 110, 114, 115, 103, 86, 87, 115, 153, 173, 163, 135]
8769A35k2nJ2J5J1QJ4K3J9Lj7k5k0j0MJ9K9K7J5PJ2K1K2Pj3l1l9l7k3oNQPKpj7j5jJ3Rj4l8
8750A07m2k7kQjj7k2j6j6k0j3PK5K5J6J8K3J8MKK2M4M8L1J0JKKok1l1k7j1RK8M1M1K9J2rk9
8733B63l8k7JK5K9J6PMqk5k6rJj8m7m8j8ROj3k1j2lkpqj0j2oJ6L5L4J2nkJ1J2MJLONRJ9J9
8713A82Mj4j7rjJjl%JK%OJ6K5J5nk5l9n0n4l4MK8K2MOK5L2J5rk1k0j4qLJ6J9J2kj5j5qkjL
8693G4J8K9J8j1l4k8%K5L2K7J9J0rl4m9m1j3J1J8J8K4K9K7J8Pnj8k0kJ9J8%rJOrk7k0PK8L0
8675A84K2J9K1K4J8jk7m6m7l8l0k8k5k4k3k1pRJ7J9L3N6O2M1J4PJ3J0lrLJ7J7MqpMQlk9n0
8658A96m9l0j4j5k4k3nJ3J8J0QK0K7K0Ommmrj0qproKPJpMK7L8J8j2k6j7oqj6k3k0rPK1K4J4
8638A16mj7k8l0k3%K3L8L9L8L4K8J6RMlk2m4m5k3JJ0OJ0K9M3K9jj9j3%OPK1M1M6K9Jj6j8j6
$$ y = [135, 113, 108, 120, 135, 146, 154, 168, 191, 210, 213, 196, 171, 151, 141, 145, 164, 193, 220, 235, 242, 254, 275, 297, 304, 291, 260, 221, 184, 161, 155, 160, 168, 175, 177, 170, 153, 138, 137, 150, 159, 145, 107, 65, 38, 36, 44, 43, 26, 4, -12, -28, -48, -61, -54, -29, -4, 12, 30, 53, 71, 75, 77, 99, 143, 191, 222, 232, 233, 235, 237, 231, 210, 179, 152, 141, 150, 178, 219, 260, 289, 301, 292, 263, 225, 198, 199, 224, 253, 269, 276, 280, 272, 247, 221, 212, 213, 195, 148, 100, 82, 91, 97, 84, 63, 51, 48, 46, 39, 31, 21, 9, 3, 19, 54, 88, 100, 95, 93, 104, 116, 120, 121, 124, 130, 135, 144, 163, 182, 186, 172, 155, 146, 145, 146, 145, 142, 142, 143, 145, 145, 151, 167, 192, 207, 202, 177, 138, 88, 34, 0, 4, 32, 54, 58, 64, 89, 121, 136, 127, 106, 86, 72, 64, 67, 83, 102, 114, 112, 97, 82, 74, 72, 71, 74, 92, 121, 139, 128, 94, 66, 66, 91, 123, 150, 169, 179, 170, 136, 87, 46, 33, 44, 62, 80, 104, 133, 160, 178, 185, 180, 162, 142, 140, 159, 177, 177, 168, 169, 175, 166, 139, 119, 126, 154, 184, 206, 225, 246, 270, 288, 287, 260, 214, 167, 129, 99, 71, 46, 22, -1, -22, -29, -20, -3, 16, 49, 105, 167, 208, 222, 229, 242, 252, 249, 240, 243, 260, 277, 281, 273, 266, 270, 278, 275, 246, 196, 147, 117, 103, 88, 64, 41, 36, 49, 67, 77, 85, 105, 132, 152, 158, 154, 150, 146, 137, 127, 119, 112, 103, 97, 99, 106, 107, 100, 104, 131, 169, 187, 175, 149, 132, 126, 118, 102, 79, 59, 50, 57, 78, 102, 116, 112, 95, 67, 37, 14, 14, 37, 75, 114, 152, 186, 214, 230, 239, 243, 240, 218, 174, 129, 106, 107, 117, 123, 133, 162, 205, 234, 233, 214, 201, 201, 207, 214, 235, 276, 322, 351, 352, 336, 318, 302]
8620C02j5j9k8l5l4j9nnk0l1k1MK1J6JnjLKoj2j3j7k1k2j2QK5K6J2%%Klj7k6k0LL1M2K8mk1
8602I4j0PKk0k5LM1N4M0J5krj0jPR%j1j6j1KRLj4j7oNqk9m1l6k8j7J1M5N9L7Pj0j5j9k0j4
8583F1mnj1rLJ5J8J6J3J1J5K5L9M1K9J1%KJ0J2Qjnj1j8k4j9pmj6l0l1k1rNK2L2K6J4J1J9J6
8565B49ol1l7k8j8j5j0J1L4L7J3j5k2jK0J5j8m9n5l3kK0K8K3J5OLRJ9K3J4mj3KK9M6M0K4J0
8548C33%j4m0o2o1m0j1OJ3J5K0K4J8J0Knj5k3j7nM%j2k3k7k7k1nJ3K8L0K2J0jpj2j2j1j3j6
8531F8qJ2K8K7J3K%oj8k3pJ4K3J9J7K0J8PJkj1k6k6kK9M4M2L2J9lk4l4k5j4j3j6j4nkrj9j7
8512A11nkj7l6l8k1jRQQJ0J9L0K6PrjK2L3K1NKjj1k7k7qJ5L1L4K6J9J9K0J0j7l8m0k6j6j0
8495A34%J0Rjj0j4k1k3j5%QPJ2L1M3L2Jk2j8jJ2Qmj6j9j6rRK8L7K4lk1k2j5oKPKj5l0l5k7
$$ y = [302, 287, 268, 240, 205, 171, 152, 147, 142, 122, 91, 70, 74, 95, 111, 112, 107, 106, 109, 111, 105, 93, 80, 63, 42, 20, 8, 16, 41, 67, 79, 79, 79, 81, 78, 61, 35, 15, 18, 49, 91, 119, 115, 94, 84, 91, 93, 73, 48, 51, 92, 146, 186, 201, 199, 190, 180, 179, 186, 195, 195, 184, 168, 157, 159, 168, 171, 157, 140, 134, 139, 131, 102, 61, 25, -3, -20, -9, 36, 95, 132, 139, 129, 114, 95, 75, 61, 57, 52, 41, 32, 35, 50, 68, 84, 97, 108, 123, 148, 187, 228, 257, 268, 268, 270, 280, 292, 300, 299, 294, 283, 265, 241, 222, 215, 211, 195, 165, 134, 113, 104, 109, 131, 163, 189, 203, 214, 233, 249, 243, 212, 175, 147, 129, 114, 104, 115, 149, 186, 199, 184, 162, 161, 181, 196, 178, 129, 74, 41, 39, 59, 87, 110, 125, 131, 134, 143, 162, 185, 199, 195, 182, 184, 213, 259, 299, 323, 333, 333, 319, 279, 217, 156, 116, 105, 111, 124, 139, 159, 183, 201, 211, 213, 208, 193, 170, 153, 148, 152, 152, 140, 117, 90, 63, 42, 37, 50, 78, 108, 130, 140, 139, 132, 120, 108, 97, 84, 68, 60, 72, 100, 127, 140, 142, 142, 136, 118, 95, 88, 102, 125, 144, 161, 181, 199, 206, 207, 205, 194, 168, 142, 140, 169, 213, 255, 287, 306, 303, 279, 245, 220, 206, 193, 177, 163, 158, 156, 147, 128, 111, 106, 104, 87, 51, 13, -8, -9, 0, 8, 16, 26, 45, 75, 101, 108, 99, 98, 120, 153, 174, 179, 181, 180, 169, 142, 115, 107, 122, 153, 187, 213, 232, 251, 271, 281, 264, 226, 186, 160, 144, 134, 134, 144, 153, 152, 142, 128, 107, 84, 69, 69, 77, 84, 96, 127, 170, 202, 203, 181, 163, 162, 174, 182, 178, 162, 143, 127, 118, 127, 155, 192, 216, 213, 192, 170, 155, 149, 151, 158, 160, 145, 115, 80, 53]
8476E3j5jJ1J9J5P%kKJ1J5Pqj4nJ0J4Ojmnj3k1j4RK8K6PrpMJ0J0QPJoj3j5j6pJ1L1L4K5J7
8456B22J8J7Lj6k2j4JOOJmj1j3r%jj1k2j9mPLoj0j4k6k8mL2M7K9Lj1j0lJ4L7M4K3ok0j5j1
8437B03j1nNLj3k1%L1M4K9kl3n1n3m2k6j4ppj1j0PL6N4M8K8J8J9K1J3jolnj6l6m9m2j8RJ8
8420A04J1LLJ3J6J0jppomnnkLjk0l7k9LK9K3LML5O1N7K7lj5j5qLJ3J4Mj3l1n0n5l9j6mj1j0
8400D5J1L9M5K3mj8j3NK3L0K4Mj3j8rNJ0Kj4k8l0j4J4L8M1J5k5n7o8n2j5K6O2O4L8Mj6k2k0
8383A32j5o%loKJ4J0pk0j4JJ2J3Olj4j9k2l0l7l1oK4L7M0L9L7K0qk6k0jJ2J2QNK%lj1k2k7
8364G5j9JK5M0M1L0J7J2J0jj9k9k5j7j7j7kJ7K5J5KjjjjLNOJ2K8L7K7Kk1l4l8l5l0l1l5k7
8347B9PM7N5K7j1j9jJ7K1J5RMqj8j9kK2L7L4K0J1RNpj3nRLk2l9l2j0QJ6K3K7J6oj7qPMj3k6
$$ y = [53, 38, 37, 48, 67, 82, 89, 89, 87, 89, 100, 115, 122, 114, 100, 95, 105, 119, 125, 124, 120, 115, 102, 81, 67, 76, 104, 130, 137, 128, 121, 125, 135, 145, 153, 160, 161, 155, 142, 127, 111, 104, 115, 146, 180, 205, 222, 240, 257, 260, 244, 222, 208, 209, 215, 221, 222, 218, 207, 194, 185, 185, 184, 173, 151, 132, 128, 135, 138, 132, 122, 108, 82, 54, 50, 82, 129, 158, 161, 150, 140, 137, 151, 188, 232, 255, 249, 229, 214, 203, 192, 187, 192, 195, 182, 161, 161, 192, 236, 265, 263, 230, 179, 126, 84, 58, 44, 37, 30, 19, 9, 16, 52, 106, 154, 182, 200, 219, 240, 253, 252, 246, 243, 238, 222, 186, 137, 95, 77, 86, 104, 115, 118, 121, 134, 150, 160, 159, 152, 145, 139, 135, 130, 125, 123, 126, 125, 105, 68, 39, 42, 71, 94, 97, 101, 136, 197, 254, 281, 278, 263, 248, 240, 243, 256, 270, 274, 261, 230, 180, 125, 86, 70, 66, 55, 45, 56, 95, 140, 163, 159, 141, 128, 133, 156, 186, 210, 214, 201, 183, 174, 179, 189, 191, 177, 149, 119, 105, 119, 157, 198, 213, 188, 131, 63, 11, -4, 22, 84, 148, 186, 190, 174, 152, 132, 117, 111, 111, 108, 102, 104, 118, 128, 121, 101, 87, 88, 100, 113, 119, 116, 102, 83, 61, 31, -6, -37, -43, -19, 18, 58, 97, 134, 154, 146, 120, 100, 99, 111, 123, 131, 136, 138, 138, 135, 124, 102, 75, 56, 57, 82, 122, 163, 193, 210, 222, 232, 231, 212, 183, 158, 141, 124, 107, 105, 122, 147, 162, 164, 163, 162, 161, 160, 163, 168, 174, 186, 214, 251, 278, 280, 259, 225, 187, 152, 122, 91, 56, 29, 36, 83, 138, 165, 154, 135, 134, 151, 172, 187, 196, 200, 192, 174, 155, 153, 175, 212, 246, 266, 277, 286, 291, 284, 271, 266, 275, 278, 256, 217, 185, 175, 183, 199, 222, 249, 265, 259, 242, 234, 241, 245, 232, 206]
8328B06k3j3noj4j8j1J0L0K9Pj8k7k1j3JK2M2M6L0J2MMNRJ8K7K5J4Lqk7m9n3l3kJ3J1OLkj1
8309B23k0k2k8l6l2j3RJ5PjllmLJ8L0L1K4J2lj4j9j4lJ2K3K2Mj1nJ6K7J0j4j7mkj5j9JK4J5
8291B24k0m0k0J3K4RkLJ0POJ6J7j4m9n2j9Nkk1k2j6j6j2MK6L4L0K4J7Jj2oJ1K0J8J4Qj2l6
8274A70m3k5oRK4L8K5j8n2m2jK7K4RknJJ4K6K2Orj6k3l2k5NM3O0M4Rj7k2j5j8m2o4o3m0j0
8257c4J6L1L4K3J3J9L3L3J4mojMRJ9K4J5Mlnj1k1k9k8j8jJ5K1Rqj4pjlJJ4K8K3kk4l3k6j5
8238A08mMQQORPkj2j0MNj3l1k6mQ%nJ1K9L0J7J3K1K2Mj1pJ1K3J9PKmj5l1k8mK7L6J2k6m8m3
8218A27k1JJ8K7J9nk9l4j6LJ1J3J4J0mj8k3j8j3rLK1L6L5K4Rmrrrj4j4nPRNJ1K6L4K4R%ok0
8199B16l3l1k1j5j4kJ7K1Lj8k3j4jQJ2J0RJ4K6K5Nj9k7j8j0j0j0mNJ1QMjpj2j2nJ4L5M1L1
$$ y = [206, 183, 170, 165, 159, 145, 127, 116, 126, 156, 185, 192, 174, 147, 126, 113, 114, 136, 178, 224, 254, 266, 270, 274, 279, 288, 306, 333, 358, 372, 375, 367, 340, 291, 238, 205, 203, 216, 227, 233, 236, 234, 223, 203, 181, 153, 117, 85, 72, 81, 96, 103, 102, 99, 96, 92, 95, 113, 143, 174, 198, 210, 207, 193, 174, 160, 157, 169, 192, 214, 218, 207, 202, 218, 245, 255, 241, 224, 220, 218, 203, 184, 185, 209, 224, 204, 164, 144, 157, 181, 190, 188, 191, 201, 208, 214, 230, 247, 233, 184, 132, 113, 118, 116, 95, 73, 57, 41, 29, 33, 59, 93, 123, 147, 164, 165, 153, 147, 158, 178, 196, 210, 218, 206, 170, 127, 102, 96, 105, 129, 167, 192, 174, 122, 80, 79, 106, 130, 139, 137, 132, 133, 147, 173, 195, 201, 192, 176, 153, 121, 96, 101, 144, 204, 248, 257, 240, 218, 203, 185, 143, 79, 16, -24, -34, -18, 13, 47, 70, 83, 102, 135, 168, 182, 178, 172, 171, 175, 184, 203, 227, 242, 246, 243, 238, 227, 206, 177, 149, 131, 130, 145, 166, 175, 167, 153, 146, 145, 142, 143, 157, 185, 208, 206, 182, 149, 123, 108, 104, 108, 116, 124, 130, 139, 146, 144, 132, 122, 126, 131, 118, 87, 61, 57, 65, 65, 60, 71, 100, 130, 147, 160, 181, 203, 207, 196, 189, 200, 223, 242, 249, 251, 247, 232, 201, 173, 169, 196, 232, 244, 218, 170, 127, 106, 107, 125, 152, 171, 166, 137, 103, 87, 90, 101, 114, 128, 138, 134, 116, 93, 75, 62, 53, 56, 77, 113, 148, 172, 181, 177, 168, 159, 150, 136, 122, 117, 124, 133, 138, 149, 175, 209, 233, 242, 242, 236, 216, 183, 152, 131, 116, 102, 100, 117, 138, 141, 123, 100, 86, 85, 93, 105, 115, 124, 138, 164, 189, 194, 175, 148, 130, 120, 110, 100, 96, 101, 112, 120, 124, 123, 116, 104, 92, 87, 101, 136, 177, 208]
8182B08J5QQ%j6l2l9m0l8l1j6LJ7K1J8J2Olj5k3j8KK8M2L8J9%j0qlmj6k4j7QL8N1M3K0ok6
8164B20l4l2k0mOJj4k9m2m9m0j9PJ7J2PJ2J1jj2%K6M8N4M7L0Kk0j1K1L1Ll8n0l1rnqqJJ4J7
8146A11J3Kmlllm%%orJJ5J8J0Jlpj5k2k3j9rPK1J9RKKrl2m8l7j7%PJ7J9Mj6k1qkj1j5KJ8J6
8125c2NRK4L4L0K6K4J6nk7l6k8j4%PLoj1%J3J4%j3j4oMJ1J7K3K3J8J5J6J0j0m0n6m9l2qK0
8107b5M3M7K1rj2J1L0K6J2%qj9k1rNOpk4l6l7k2J1L5L2Pj1r%KLJ0J4J1LKMMLKOJ1J1Jj3j8
8087I3j4rj6k1j2MQjjJ7L5L7K7J5Kj3k2j3JLprjMMQK0K5J0rj7j2mMJ1J3Mn%J7K9K7J6QMKk
8067B60opj0k0l6m6l4nJ3RkMK6L6K4PMJ4J5%j0mJ5K0Qj6l2l0j3QK2J3j1l4m2l1j6qj0j3nJ0
8049F7K3K5K3J9J9K0J8J0kj3j9j8j0MK0K4Qj6k8j8NJ7J5Nlj0j5j6j2mRK7L5K5Jj5j5j5k3k7
$$ y = [208, 223, 231, 239, 239, 223, 191, 152, 112, 74, 43, 27, 30, 47, 68, 86, 98, 104, 101, 86, 63, 45, 47, 75, 117, 155, 174, 174, 164, 156, 153, 149, 133, 109, 92, 100, 138, 189, 232, 252, 246, 220, 186, 154, 134, 130, 136, 137, 123, 94, 52, 3, -37, -56, -49, -32, -20, -13, -1, 10, 9, -3, -3, 23, 71, 125, 172, 202, 204, 184, 173, 194, 225, 228, 190, 140, 109, 100, 95, 87, 79, 80, 94, 111, 124, 126, 122, 119, 116, 113, 109, 109, 109, 103, 94, 95, 110, 128, 138, 139, 136, 129, 114, 92, 69, 50, 41, 48, 69, 88, 97, 99, 101, 92, 60, 12, -25, -42, -42, -35, -18, 1, 5, -11, -32, -40, -42, -53, -68, -66, -48, -32, -27, -18, 6, 40, 70, 96, 120, 136, 131, 104, 68, 40, 26, 26, 33, 36, 30, 19, 19, 32, 46, 46, 33, 19, 13, 17, 28, 45, 68, 91, 109, 124, 140, 150, 140, 100, 44, -5, -37, -45, -25, 18, 65, 86, 77, 65, 76, 106, 132, 144, 144, 136, 117, 96, 87, 92, 98, 91, 67, 31, -6, -28, -17, 18, 50, 57, 46, 37, 37, 39, 42, 52, 66, 77, 80, 82, 86, 90, 93, 95, 101, 112, 123, 124, 111, 93, 79, 70, 54, 33, 21, 25, 33, 32, 31, 48, 83, 120, 147, 162, 164, 151, 129, 116, 117, 120, 113, 104, 103, 107, 111, 119, 139, 164, 174, 165, 148, 136, 132, 136, 147, 160, 164, 159, 159, 176, 205, 232, 248, 256, 260, 262, 260, 254, 247, 237, 217, 181, 135, 101, 96, 109, 118, 116, 120, 146, 182, 206, 213, 217, 231, 246, 246, 236, 232, 247, 267, 275, 259, 227, 197, 184, 192, 214, 227, 216, 182, 140, 109, 93, 85, 75, 62, 57, 67, 90, 115, 138, 157, 176, 196, 214, 224, 222, 209, 190, 172, 162, 166, 186, 210, 218, 202, 174, 156, 161, 178, 193, 198, 195, 185, 170, 154, 142, 138, 147, 174, 209, 234, 235, 220, 205, 190, 167, 140]
8032A40j4RK5K9K3J2loMJ3Nj3k2j2kpk1k4pJ3K5K1Rqk0k6k2j3JJ0QknPK3K6J8J4K0K1Nk0l7
8013A97l3j4QJ8Qk2m9n2k5J5M0L0pm0l8mL3M0J9oj8j9j6qKPMjjlj2j1J0M1N8N1L2J8RJnoj
7994B50Ljpoknj6j9OM5O1L0k2n1m0j6j%jmj0nJ3L2K8Lk2k2JK0J4pj5NL2M3L3J4j0m1o3n3j7
7976A77J2Qj3k6k3j9j5j0mnj0j0mLJ1K4L4L1J7LnolQJ7J3kj7k0j3JJ4J5mk6l5k5j0%NKkjJ2
7957I9K8K5J0kJOJrj6j4kJ1K2K5J9Oj3l5m5l1pJ3K1K7L1K1OjJ1J7Nj4j9rK%qj4oJ0K4K0PL
7938B26QMj4k1%K4J9j1k9k1LJ7J8Nj6l6l8j8J2L2L0J5krrj2j8j8kJ1Ppj0jOJ0J8L3L0Pj7k2
7919B04j5j0j4j4qorj3qjKnpNK5L6J9j2l0k5j4qj0qJOQPJ0J3J7J5J3Opk7l7k4PK8K0LNK4L1
7900A93J4j1k5k4j5kJ2J8J5J8L1L6K0ok1j9j6j8k1k3k3j9j4j1j1j1nj%LJ4J8Oj5k1rPJ3J3
$$ y = [140, 126, 135, 160, 189, 212, 224, 221, 215, 219, 232, 237, 224, 202, 190, 188, 181, 160, 136, 129, 142, 167, 188, 197, 189, 169, 143, 121, 108, 109, 119, 127, 125, 120, 127, 150, 176, 194, 208, 228, 249, 254, 234, 197, 164, 150, 158, 176, 184, 162, 113, 61, 36, 51, 91, 121, 114, 74, 36, 32, 65, 105, 124, 118, 100, 81, 65, 57, 59, 66, 70, 69, 68, 65, 53, 42, 52, 93, 151, 202, 234, 252, 261, 262, 257, 251, 250, 253, 252, 245, 239, 237, 232, 216, 197, 203, 248, 309, 339, 317, 266, 226, 210, 209, 209, 208, 204, 194, 189, 202, 234, 262, 265, 243, 221, 222, 242, 256, 249, 234, 239, 271, 314, 347, 361, 351, 310, 247, 194, 177, 189, 197, 184, 158, 135, 116, 101, 91, 87, 82, 72, 62, 58, 61, 72, 96, 130, 161, 178, 181, 176, 170, 167, 175, 192, 205, 203, 186, 166, 153, 154, 168, 183, 179, 153, 118, 93, 83, 83, 88, 90, 88, 87, 99, 127, 152, 162, 160, 161, 167, 168, 159, 143, 129, 127, 138, 160, 185, 204, 210, 197, 162, 117, 86, 79, 92, 113, 140, 171, 192, 198, 197, 208, 225, 230, 216, 197, 188, 190, 190, 182, 168, 162, 172, 196, 216, 223, 226, 234, 238, 224, 203, 203, 227, 246, 235, 206, 185, 188, 205, 223, 228, 212, 176, 138, 120, 132, 164, 194, 209, 207, 198, 189, 177, 159, 141, 139, 150, 157, 150, 140, 139, 145, 155, 173, 206, 236, 243, 226, 204, 189, 179, 165, 151, 143, 137, 128, 115, 107, 106, 108, 103, 96, 101, 126, 162, 181, 169, 139, 114, 100, 92, 82, 74, 75, 81, 89, 96, 106, 119, 136, 151, 164, 170, 163, 136, 99, 75, 82, 110, 130, 133, 138, 162, 193, 207, 196, 171, 147, 132, 130, 142, 160, 175, 193, 224, 260, 280, 274, 253, 234, 218, 200, 179, 156, 133, 114, 100, 89, 78, 67, 62, 61, 61, 64, 78, 96, 102, 87, 66, 57, 64, 77, 90]
7883I0Rkj3j0MJ2Nrj6j7j7rRK7K9K0J5K3K5J7Mnj2j8k0j3%Njj1j9k2k3k0j1LJ8K4J5MJRJ4
7864A14J0LJJnj1j2nkrj1JK1L1K8K3K1J7Lj8l2l1j6LJ6J6Plqn%QJ3J1QMjj2k3j9lRMrj5rj
7844A13RK8M9N4L8J7Lmj3l0m6n0m1k7j7j1NL3N8O0L9Qk1m3n5m6k3lJ2K6L4J9j0k6j2ONj1q
7827A19J5K8J8MLJ0Kj7k6j7OK8L1J5pj7mJ7K5J4pk6l3k3ojrk0j6pqj6j6%K1M0N0M7K8Mj2k4
7809B13m0n1l6lK3K7J4LnqKJ7J6ok9k5nNLJLKJPJ5Prj4jJ2K0K8M0L6J2ppmj9m0l7j4NPLL%
7788A65mkJ2J8J1JJPPLKKkqq%Kpj6j4jJ0J5J9J9Pj7l3k7j2rk3l8l5k3oPK4M3N3M3J2k1l0p
7769A40K7M9M8L4J4%rj4j9l2l8k5rqk5l2j3K1M4M2K3Jj1qnj7m0m9l3j1LNQPLLJ8L8M0K4%j8
7751A76l1l7l7l7l7k9jL2M4K8%k2k6j1J8M7N6M4K4RK%jj4l8n0l4nJ0J3J8K7K2KnJ1K0Jl0l5
$$ y = [90, 99, 97, 84, 74, 78, 90, 95, 86, 70, 53, 36, 27, 36, 63, 92, 112, 127, 150, 175, 192, 196, 191, 179, 161, 141, 128, 128, 133, 132, 121, 102, 80, 57, 37, 26, 29, 47, 71, 86, 90, 91, 100, 114, 124, 127, 128, 129, 124, 113, 101, 96, 94, 85, 74, 75, 96, 127, 155, 178, 199, 216, 219, 201, 169, 138, 122, 125, 141, 157, 164, 161, 153, 148, 148, 156, 169, 180, 188, 192, 191, 179, 156, 137, 134, 143, 147, 138, 123, 114, 113, 122, 150, 199, 253, 291, 308, 311, 307, 294, 264, 218, 168, 127, 100, 83, 72, 77, 110, 168, 228, 267, 275, 254, 211, 156, 110, 87, 84, 96, 122, 156, 175, 165, 139, 127, 133, 138, 127, 119, 134, 162, 180, 184, 187, 197, 199, 182, 156, 139, 145, 173, 204, 219, 212, 195, 191, 208, 233, 247, 240, 214, 181, 158, 152, 151, 142, 122, 106, 99, 91, 75, 59, 59, 80, 120, 170, 217, 245, 249, 237, 213, 173, 122, 86, 83, 106, 133, 147, 150, 145, 137, 139, 156, 172, 166, 137, 112, 107, 112, 115, 116, 119, 121, 122, 129, 144, 151, 142, 128, 127, 139, 159, 187, 227, 263, 275, 268, 261, 257, 238, 198, 161, 147, 152, 159, 162, 165, 165, 161, 159, 171, 189, 200, 201, 202, 209, 216, 219, 221, 223, 221, 213, 205, 205, 207, 200, 184, 170, 169, 179, 194, 213, 232, 239, 222, 189, 162, 150, 141, 118, 80, 45, 22, 16, 23, 47, 90, 143, 186, 198, 177, 147, 140, 167, 216, 264, 298, 312, 312, 303, 289, 270, 238, 200, 175, 166, 158, 133, 101, 88, 109, 153, 195, 218, 219, 208, 200, 195, 178, 138, 89, 56, 45, 48, 53, 61, 68, 71, 74, 92, 130, 170, 194, 194, 176, 145, 108, 71, 34, -3, -32, -33, -1, 43, 71, 71, 49, 23, 12, 30, 77, 133, 177, 201, 210, 212, 212, 211, 197, 159, 109, 75, 70, 80, 93, 111, 138, 160, 162, 157, 168, 188, 189, 159, 124]
7733A24j1K0L3K3kk4k2LK6K7J3RJ5J3j2m7o7n9l2nLkpplkmJRJ8K3K4J6NkKJ3K2K6K4J2JKR
7714B08Nj5k8j6J4L2K6Mj7k6k1j0j0k4l6k6%K6L8L0J5MPJ6Pj8l1k1pj4k8k0OK3K7L2L8K3o
7697B07k4k1j5k3l1j5J2K2J5%j0j8j8j0%KmlKNORJ2J4J1Nkj2j7j1RK8M0L4J5pk1k1j3rqj1
7679A24j0okJNJ5K6K7J0j4k8k2j2j0j2oQJ7Qj1k9k4lK3L2K9K0Qj3l9m7k7JJ4J6K4L3K7Nqm
7661A46Jrk3j6PK4J9RONpk1k2j1pj2j5KL1M9M2J9rl0l7k7j0NJ0J4J3Nrj7j4kJ2K4L1K7J2m
7643B11j6j7rMJ1Jj8k7j3NR%nJ1L8N3M1Ml8o3o1m6l2k5pK0L9K9lk4k0%PjnRK3J5qk7l0k2o
7625GK3N8P7O5L6J1K%rk6m5n4n0l2j3mmnKJ7L1L6K9J8J2ROKjkj0j3mJ5K2Rj2k5k8k8k6j7j0
7606F9lJ0K5K3Jj9j1PRljJ8K9J3j3k4j8j0j1j1p%jmmRK3K0%j6qJ4K1J1PK7N0N3K9kk7l5l3
$$ y = [124, 113, 133, 166, 189, 187, 163, 141, 144, 170, 197, 210, 219, 234, 247, 235, 188, 121, 62, 30, 25, 28, 26, 19, 12, 9, 7, 3, 4, 13, 31, 54, 78, 94, 99, 97, 99, 112, 134, 160, 184, 196, 197, 199, 208, 213, 198, 170, 154, 168, 200, 226, 230, 213, 187, 166, 156, 146, 122, 86, 60, 60, 86, 124, 154, 169, 173, 180, 196, 203, 185, 154, 133, 126, 112, 84, 64, 70, 93, 120, 152, 190, 213, 207, 183, 162, 147, 124, 93, 78, 90, 112, 127, 127, 117, 99, 81, 71, 71, 73, 69, 66, 68, 73, 79, 88, 100, 114, 125, 130, 128, 116, 99, 88, 97, 125, 165, 199, 214, 207, 186, 165, 152, 143, 135, 124, 114, 108, 106, 107, 112, 127, 153, 180, 190, 176, 148, 126, 114, 104, 92, 86, 94, 111, 119, 108, 79, 55, 52, 75, 107, 136, 156, 164, 151, 112, 65, 38, 39, 53, 69, 93, 126, 153, 158, 150, 146, 147, 138, 115, 99, 106, 130, 149, 158, 164, 169, 162, 141, 119, 108, 101, 89, 74, 76, 107, 156, 198, 217, 208, 178, 141, 114, 104, 109, 119, 133, 146, 151, 142, 125, 111, 109, 121, 145, 176, 203, 215, 211, 195, 178, 169, 173, 184, 185, 167, 140, 127, 132, 141, 141, 136, 147, 185, 238, 279, 283, 245, 182, 121, 75, 43, 18, 11, 31, 70, 99, 96, 72, 52, 52, 59, 58, 53, 62, 85, 100, 92, 65, 35, 13, 7, 30, 88, 165, 230, 266, 277, 279, 279, 270, 244, 199, 145, 95, 63, 50, 46, 42, 37, 39, 56, 87, 123, 152, 170, 182, 191, 197, 199, 198, 196, 186, 173, 169, 184, 206, 215, 203, 178, 150, 122, 96, 79, 69, 66, 76, 101, 124, 125, 106, 95, 102, 111, 108, 107, 125, 154, 167, 154, 130, 112, 102, 91, 80, 73, 73, 72, 68, 64, 73, 96, 116, 116, 100, 92, 106, 127, 138, 145, 172, 222, 275, 304, 302, 275, 240, 207]
7587B07k6k2j8j0LP%nOJ9K1Mj7k6k4k2k4l0l0j8KK3L6K9Nj4pK3M7M6K9K2K0Mk6m6l9j6JRJ0
7569A53Mj1j4JK3K3NqJK1K6J5Lmoj1j9k2j3JJ4J4kk5l9m1l5k8k2j0NPmj4jL2N5L9%k6k3KL1
7551I7M7M3K6Mj4k0j4jO%rpJ6M1N0L8J6pk0k1j4qqj3j6j4mJ1J5Nj4j8jJ4Mk5m5l5oJ1R%QK9
7532A56L5J2k0k5JK7K7J4J0J2R%j%ok1k3kJ8J3j3l5l0JL3M0J9pj6rlj5l1l5j6J0K7K1N%J1
7514A93K1Qj6l1k6j5qmmj0j9j5NK8L5K0pk6k3JK6L3K5K0K2K0Kj4j3lmj6j8oKlj3j5r%J3K6
7496A82L6L0J0j1j9j0KJ0RPOPPPKqj7j8j0ljklpj7k5j9NK6L0J4nj5j6rJJ0J0LkJOQQJ0J6J9
7475B65K1J9Rqk4k1lJ2Qj3l2l5k1KJ7J0j2k5j1J5L1K9J5Jj9l7l9k0knj7k0rnj6k4j2J5L4L6
7458A09K3Qj5m3n6l9ML8M6K6NpnKPMooOK1K3J4RK0L4L0Lm0o4n2k0K%lJ0K6J8mnJ6L2K3QJp
$$ y = [207, 181, 159, 141, 131, 134, 141, 141, 136, 142, 161, 182, 186, 169, 143, 119, 97, 73, 43, 13, -5, -3, 20, 56, 85, 90, 76, 69, 92, 139, 185, 214, 236, 256, 260, 234, 188, 149, 133, 134, 143, 153, 157, 146, 132, 133, 156, 179, 184, 176, 177, 198, 224, 239, 242, 238, 232, 221, 202, 180, 167, 168, 182, 196, 194, 169, 130, 89, 54, 26, 4, -6, -1, 6, 2, -12, -13, 19, 74, 113, 113, 87, 64, 66, 97, 144, 187, 213, 217, 203, 183, 169, 168, 174, 174, 165, 158, 174, 215, 265, 303, 319, 312, 292, 271, 257, 249, 241, 228, 212, 198, 194, 205, 220, 225, 211, 193, 192, 206, 210, 185, 140, 105, 99, 110, 119, 119, 127, 156, 191, 203, 183, 158, 159, 186, 213, 227, 237, 249, 258, 258, 257, 257, 251, 230, 207, 205, 223, 236, 223, 188, 158, 159, 192, 232, 251, 244, 228, 219, 216, 201, 170, 135, 119, 129, 156, 177, 182, 182, 193, 214, 222, 206, 175, 149, 134, 126, 122, 118, 108, 89, 74, 79, 107, 142, 162, 155, 129, 106, 107, 133, 166, 191, 211, 233, 253, 255, 241, 228, 225, 221, 205, 187, 181, 183, 180, 167, 152, 143, 143, 156, 182, 218, 248, 258, 247, 228, 218, 220, 230, 239, 246, 252, 259, 266, 273, 275, 267, 250, 232, 222, 219, 218, 216, 213, 206, 189, 164, 145, 150, 176, 206, 220, 215, 200, 184, 175, 176, 186, 196, 199, 197, 198, 204, 212, 220, 230, 246, 265, 286, 305, 314, 306, 282, 261, 258, 270, 278, 265, 233, 198, 177, 179, 196, 206, 194, 169, 158, 173, 204, 233, 248, 249, 230, 193, 154, 134, 132, 127, 110, 90, 81, 76, 60, 36, 24, 39, 73, 109, 132, 140, 125, 82, 26, -13, -9, 29, 75, 101, 106, 99, 94, 96, 103, 107, 101, 95, 101, 122, 145, 159, 168, 188, 222, 252, 255, 215, 151, 99, 79, 81, 81, 78, 88, 114, 132, 128, 123, 139, 171, 194, 202, 203, 196]
7439A96k9n0m1mK6L1J4J%RJ5Rmj8k4k7l1k6mJ8K0PNK7M8L6ol4j5L3N9M0Lj8j4qj3k4l2k7j5
7421A33jPMKORnk4k7pJ0RljQJ2PLRK1K9K6Pj4k2j7j8k4k4rLkj1JK7M4L9J9kj9k5j6npj7j7
7401A18lJ2K2K6K5Nk2l8l3k2j0KJ7K3J6J3K0K6J7%j0j2j3j5j3nJ%oj0nRK5K6Rj1j8j2JJ4K4
7383A93J9j0m2m3j3J4J2j2k8k5j3njjkl%KkmRL3M5L5J8J3J9K1J7J8K3J6%j3j3k2m4o0n1k5
7366G5qonkLOJ0J2Nqrlmj2j0J0K8L0K0J0jj0mJ9M0M0J9nk1k8l2l0k0oNOKMJ3J6Opj1oprJJ9
7345A35K3Pj1j5j1n%PNpj5j2pj6k8k5rMJ2K0K7K6J5QJ1J9K3J5%j1rJJj3k4k2j6j5j8j2oqj3
7326C1rKPJ2K4L9M3M0L7M2M3L2Rj3k3j6klk1l6k9pKj4l6m4l7j7QK9L6L1K7K8J8jj6j2oj4l6
7309A48n3m4j3K4M7M1J1k1l3j7RK4J3oj3PL4M1J8j2k7j9%J5J5QPJ1J2Jrj0pj1k2k4rNMmoj
$$ y = [196, 167, 117, 76, 72, 98, 129, 143, 144, 144, 153, 168, 177, 173, 155, 131, 104, 73, 47, 43, 61, 81, 88, 93, 120, 168, 204, 198, 164, 149, 182, 241, 281, 284, 266, 252, 244, 231, 207, 175, 148, 133, 132, 139, 143, 145, 151, 160, 155, 131, 104, 97, 107, 116, 113, 112, 120, 132, 139, 142, 151, 172, 201, 227, 234, 220, 198, 181, 163, 139, 115, 106, 109, 107, 96, 97, 124, 168, 207, 226, 224, 205, 180, 164, 159, 152, 135, 118, 115, 127, 149, 175, 200, 205, 183, 145, 112, 90, 80, 82, 99, 122, 138, 151, 171, 197, 214, 214, 204, 192, 179, 164, 151, 146, 147, 147, 141, 131, 126, 135, 160, 186, 195, 184, 166, 154, 155, 169, 193, 212, 202, 160, 117, 104, 118, 130, 118, 90, 65, 52, 47, 46, 45, 43, 40, 40, 42, 40, 36, 45, 78, 123, 158, 176, 189, 208, 229, 246, 264, 287, 303, 303, 290, 277, 255, 211, 151, 100, 75, 67, 61, 56, 54, 57, 63, 73, 85, 90, 82, 73, 70, 66, 54, 44, 54, 82, 112, 132, 142, 141, 131, 127, 146, 186, 226, 245, 240, 219, 191, 159, 129, 109, 103, 108, 114, 116, 120, 133, 149, 155, 148, 137, 131, 124, 115, 116, 135, 158, 165, 154, 139, 128, 123, 123, 130, 135, 128, 113, 101, 94, 78, 50, 25, 16, 20, 32, 52, 79, 105, 120, 128, 139, 158, 181, 196, 196, 185, 176, 177, 178, 165, 141, 119, 103, 88, 70, 58, 52, 44, 31, 22, 24, 31, 43, 67, 106, 149, 189, 226, 268, 311, 343, 352, 339, 316, 300, 298, 295, 274, 238, 209, 202, 204, 190, 154, 110, 73, 56, 64, 93, 129, 160, 187, 215, 233, 232, 216, 204, 198, 184, 148, 95, 51, 38, 62, 109, 150, 161, 140, 107, 90, 99, 123, 136, 130, 117, 124, 158, 199, 217, 205, 178, 159, 159, 174, 189, 197, 204, 215, 227, 228, 219, 209, 202, 191, 169, 145, 136, 141, 145, 141, 135, 134]
7290A34NQJ2J6J3NkjONqk2k3rQJ7J9J4%j3j2OK2K3J5J4J3Jj3nJ8K9J6j0l3n2o2n5l4k1k3k1
7272@lJ9K7J8RRRJ0QNLOMrk5j7J8M5L8Mk1k2j0NJ3J3MOK4M2L3%l0l9l9l9l5k3pQJ9L0L3K6
7253A69J8J9K2K2J9J8K1J8Mj5k4j8qj1k9l8k6qKPK0L1J6k2m9m1j0J6K4J6QJ%kj1j8j3MJ5P
7236A54rj1LJ9K5J6kk1l2k2MK6K8J4LLLj4m1n6m7k4jJ8L2L2J4oqjKlJJ7K3Pj2j4LJ9K0J0m
7217A68j3j4nRJ6J7J2OOJ0J2RMQJ3J2%j5k1j9j2ook6n5p2n6k4PK3K8K8J4nj4mJ3K2J7J2J4
7199A13J6RjqqkOJ8K9L2K6J5%j9l7m1k5mJpj0lJJQK7L9K8%k2k2pJ1K3K5J9J0ORJ1Jj9l8m4
7180A67l2j7j3j1kJ6K3J3qk1j8qKJ1J6J2kj7j9NL2L3lm2m3j1J7J5lj3j0lQK5M2M0K3Onj0j0
7162A85JK4L9L3J4Jjnk2l3k1KOj8m2l8j8rj5j4NJ9J4L%%pj5qJ0J5Mj1j6j6j3r%PRMnj0oRK3
$$ y = [134, 139, 147, 159, 175, 188, 193, 191, 190, 196, 201, 193, 171, 148, 139, 147, 164, 183, 197, 197, 184, 172, 178, 200, 223, 238, 252, 265, 266, 253, 248, 266, 295, 311, 301, 268, 216, 154, 99, 65, 44, 21, 0, -3, 16, 43, 61, 70, 79, 88, 98, 106, 111, 114, 120, 124, 115, 90, 73, 91, 136, 174, 178, 157, 135, 125, 130, 143, 156, 160, 166, 190, 232, 265, 265, 235, 196, 157, 118, 83, 60, 53, 61, 80, 110, 143, 169, 187, 206, 228, 250, 269, 287, 308, 326, 330, 315, 291, 273, 265, 254, 225, 187, 161, 153, 155, 162, 182, 213, 229, 207, 158, 117, 107, 123, 147, 163, 171, 172, 172, 170, 159, 141, 128, 132, 147, 154, 145, 134, 137, 156, 181, 197, 195, 174, 142, 120, 124, 150, 178, 192, 195, 198, 201, 187, 146, 90, 43, 19, 18, 36, 68, 100, 114, 108, 100, 99, 101, 98, 99, 116, 139, 146, 134, 120, 123, 142, 162, 172, 168, 155, 141, 136, 145, 161, 178, 190, 196, 202, 212, 224, 233, 237, 245, 258, 270, 270, 255, 234, 215, 203, 197, 191, 165, 110, 38, -18, -42, -35, -12, 16, 44, 58, 53, 39, 35, 48, 70, 87, 99, 113, 129, 138, 137, 129, 121, 119, 125, 143, 172, 204, 230, 245, 245, 226, 189, 148, 123, 119, 120, 113, 103, 100, 101, 102, 110, 137, 176, 204, 204, 182, 160, 153, 164, 187, 212, 231, 241, 247, 256, 267, 268, 249, 211, 167, 135, 118, 105, 94, 92, 108, 131, 144, 136, 115, 97, 89, 91, 102, 118, 130, 128, 111, 92, 97, 129, 162, 159, 117, 74, 63, 80, 95, 92, 79, 69, 66, 74, 99, 141, 181, 204, 210, 205, 195, 185, 186, 210, 249, 282, 296, 297, 296, 291, 269, 236, 215, 217, 223, 205, 163, 125, 107, 98, 83, 69, 74, 93, 107, 110, 110, 110, 103, 88, 80, 90, 105, 109, 98, 82, 66, 53, 44, 44, 51, 60, 64, 59, 49, 43, 52, 75]
7142G5K5J6J0J0RNllNJ6K4K0Jk6m3m1k0PK2K0LqjJ8K7J6kj2rqk1l7k7QM2L8Lk6j9J1L9M9L8
7124B51J1k1m0l1kK6L8L0Jl9o1m5qJ8J6NOK0K6J6pk3j9QL1K5lk7k8k4k6k6j2J7M0M3K3pl0
7107A72k6JK8K7RlMOql0l4j6%lj7k3j5MK0K9K5J4Kj%oj3rMJ1Opj1j2j8j7mJ6K8L2L1K6Nk1
7088B06l9l3j3J0K8L6K9J2j1k9m0l4j1J1J7J0QJ1Mj4k2j6j1j6j4PK7K4Kj2j1kJ6L6M1K0j5
7072B12l2k7j7oJ4L3K4j3m3l9j8lOK4M2M5K5Omm%OPjj6k7l0k5j8j2j3j7j6mPQJ%J0J6J4QQ
7053A31Mpk0k5k1j4o%ORJ0J2J4J2Moj9l2m2l8j9KJ5J5J4J2J4J4J3RMkmmopLK5M5M2K1JKJ4
7034A95J5mk7k7oJ4J5jrmKKnrqnJJ2K5L2K9K3J8J0nk1j4J4L8L6J2rj7k1k7k9k5k4k7k8j7o
7016A18pqjROqj9j4%J4K5K9K3Qqk0k2qJ5L2K4Mommj0nJ1J7Lj5j6p%OJ7K7J7mk2k5k2j4mLJ
$$ y = [75, 100, 116, 126, 136, 145, 150, 147, 144, 149, 165, 189, 209, 210, 184, 141, 100, 80, 87, 109, 129, 132, 124, 123, 141, 168, 184, 182, 170, 161, 153, 132, 95, 68, 76, 118, 156, 159, 133, 114, 125, 164, 213, 251, 262, 241, 201, 170, 168, 194, 232, 262, 263, 224, 163, 118, 110, 128, 144, 149, 155, 175, 201, 217, 210, 187, 168, 176, 207, 232, 229, 202, 174, 150, 124, 98, 86, 103, 143, 186, 209, 202, 172, 146, 147, 175, 202, 211, 208, 212, 218, 210, 180, 146, 130, 130, 127, 110, 87, 72, 76, 96, 125, 150, 164, 166, 165, 165, 159, 146, 137, 141, 152, 158, 151, 140, 128, 110, 93, 89, 105, 133, 165, 196, 222, 227, 206, 167, 134, 121, 131, 159, 195, 224, 236, 225, 196, 156, 122, 111, 122, 139, 149, 157, 168, 172, 158, 136, 120, 109, 93, 79, 86, 113, 137, 139, 127, 116, 114, 130, 166, 207, 227, 212, 180, 153, 136, 130, 144, 177, 201, 188, 145, 106, 88, 85, 91, 115, 157, 202, 227, 233, 229, 225, 225, 231, 238, 237, 221, 194, 164, 139, 121, 109, 96, 79, 63, 59, 66, 74, 75, 75, 85, 101, 115, 123, 131, 135, 128, 108, 83, 62, 48, 42, 42, 48, 57, 67, 79, 93, 105, 109, 103, 84, 52, 10, -28, -47, -45, -30, -15, -1, 11, 25, 39, 52, 61, 65, 63, 59, 55, 49, 42, 45, 70, 115, 157, 178, 179, 181, 195, 210, 206, 179, 152, 146, 160, 175, 174, 165, 161, 163, 165, 160, 151, 143, 138, 139, 151, 176, 208, 237, 260, 278, 288, 283, 262, 248, 262, 300, 336, 348, 339, 322, 301, 274, 245, 220, 196, 169, 141, 124, 118, 111, 103, 102, 111, 117, 109, 90, 76, 76, 90, 115, 144, 167, 175, 167, 147, 125, 117, 132, 164, 188, 192, 186, 182, 178, 168, 163, 174, 191, 194, 179, 163, 156, 156, 162, 179, 206, 223, 219, 197, 172, 150, 136, 132, 135, 136]
6996A36KJ5K9K4MnLPmj9j3PK2K1J2Okj2k4l3l3k4j4o%RJ5J0kj2j0mKJ1J5Qj1k1j4%ONJ4L1
6977A51M0L5K3J0jj1j9k2j9j5j0kQJ8K5K1Kk4m0m3l4j8NK6L1J9QQJ7J9J0MOPjqnONj4l4l5
6959A49j5J1K5K1J2OKnj4j4%J1J2PRJ4J3J1J6K2J2j1k5k2j7k1j6LJ6Nj4j7j1j8l1k1OJ5%j1
6941A15KPrk5pK6L6J9PJ0Qpk2j9nRK4M1M9M1K2Lj4k7l1k9k6k4j3J1L3L2Qj7k4k1k2l0l5k6
6924G0oJ5L5N0M8K8R%Jpk3l6l0j0J5L5L2jm2n7l1QK5J8LjOJ6J7Nj2j6nPO%jlrpRK7K6J1Kl
6904B24j1k5k1lQmj8j6KJ5K0J9J9K2K6K6J6kj4oRJ3nl2m6l6pJ7J8%j5j4ljpj3pLJ2J6J6J3
6886B08PNMOKrk0k0p%j0k1j6KJ4J5J5J4Nj0j3KJ5Nj3j3LJ1nk7l2j0K5M5L8Ok8m0k8nJ6K4K0
6867A80J2QJ4K2J9%j6j4JJ2J3J0J6K2Qk4m8m4k4j2j6j9kK0K9J8Mllj1k3k8rK0L5K6Lj3j4q
$$ y = [136, 138, 153, 182, 206, 210, 205, 208, 215, 211, 192, 179, 186, 208, 229, 241, 247, 245, 233, 209, 176, 143, 119, 105, 99, 99, 108, 123, 133, 131, 119, 109, 105, 107, 118, 133, 141, 130, 109, 95, 95, 101, 106, 120, 151, 191, 226, 249, 259, 258, 247, 228, 206, 187, 172, 162, 160, 168, 186, 211, 232, 234, 210, 170, 127, 93, 75, 80, 106, 137, 156, 164, 172, 189, 208, 218, 222, 228, 235, 234, 226, 221, 227, 232, 218, 184, 149, 134, 145, 170, 191, 203, 209, 211, 206, 192, 178, 178, 189, 201, 208, 217, 231, 244, 255, 271, 293, 305, 294, 269, 247, 230, 209, 193, 196, 212, 217, 203, 186, 175, 157, 126, 105, 111, 126, 126, 115, 117, 124, 115, 90, 83, 109, 145, 164, 171, 181, 189, 182, 160, 141, 136, 145, 169, 210, 259, 300, 322, 325, 311, 284, 253, 224, 198, 174, 161, 172, 205, 237, 245, 228, 204, 183, 161, 131, 96, 70, 64, 79, 114, 164, 212, 240, 249, 249, 250, 243, 220, 184, 154, 144, 159, 194, 226, 225, 183, 126, 95, 103, 128, 146, 149, 148, 154, 170, 187, 192, 180, 164, 159, 166, 172, 172, 171, 168, 159, 152, 161, 188, 214, 225, 227, 224, 213, 188, 167, 164, 172, 168, 150, 134, 136, 151, 171, 190, 209, 231, 257, 283, 299, 297, 283, 277, 286, 299, 294, 262, 216, 180, 173, 190, 208, 208, 193, 179, 176, 175, 168, 155, 148, 151, 163, 179, 195, 208, 215, 220, 224, 230, 232, 223, 203, 183, 176, 176, 166, 145, 129, 131, 145, 160, 175, 189, 194, 184, 171, 173, 188, 193, 180, 167, 170, 181, 176, 149, 117, 107, 132, 177, 215, 221, 193, 153, 125, 120, 136, 160, 180, 192, 200, 214, 236, 255, 255, 239, 225, 226, 238, 251, 261, 277, 299, 307, 283, 235, 191, 167, 155, 139, 120, 118, 138, 167, 185, 189, 186, 183, 172, 149, 121, 112, 132, 167, 193, 196, 183, 169, 161]
6850A61NK1K7J5mj0PK9L4K0lj9j9lJ3J2lj2pMPJ2K3K4Kl0m3l6k4k4l0k7j6nQK2L4L5K0%j6
6832B04k0j1LJ7K7K8J7kj6j7j0jMQJ0J1Loj4j9k3k8l3k8j8j3j6j3NK7L0J0q%K5L8K6jj8j5
6815A63kQJ1J2K0L0K8J3NOQmk5l8m3m2l4j4J0K2J3pk2k0lJ4J8Q%MJ0MjQK7K7kl4l9j8J0K1
6797A52J5lj9k7l0l0k1JK3L0J8J0J6K0J1k%J8L1L2K3J3Nmj2k0k8l4l6l1k1%L1N0M3J5j0j9
6780B10k2k3pK7M8K9j0k6lK3K1Lpopj6k0j6j4j6j1JPOJ0K0K3Qj3k3k1j3qjJlokPJ3J7K8L9
6761B47L3Ok0k9j4NJ2%j8j9KK5K6Nj1j6j5k5l7l5j6J0K8K7J2nqLK0L0L0K4K1K0J3nk5l4l2
6745B35k7k2j1MLk2m6m5k6j4j2j0jLMJ5L7M0J8mjK0L1K3Ooj0jQ%k2m2l9k0m%jjKPJ1J0OKj
6725I7nkJ4K7J7j0j9JJ8Nk6m1l0lK7N1N0K1kNK0J3j2k4k1k7l8k4K0N2M4K1J4J6Mj4j5npk5
$$ y = [161, 166, 187, 214, 229, 225, 215, 222, 251, 285, 305, 302, 283, 264, 261, 274, 286, 283, 271, 264, 268, 275, 287, 310, 334, 336, 306, 263, 227, 203, 179, 149, 122, 106, 101, 109, 131, 165, 200, 220, 220, 204, 184, 173, 176, 193, 220, 248, 265, 263, 247, 230, 220, 219, 223, 231, 241, 252, 255, 249, 235, 216, 193, 165, 132, 104, 86, 73, 57, 44, 49, 76, 106, 116, 108, 108, 133, 171, 197, 196, 178, 163, 161, 169, 180, 192, 212, 242, 270, 283, 288, 294, 302, 298, 273, 235, 192, 150, 116, 102, 112, 134, 147, 140, 118, 98, 95, 109, 127, 135, 135, 139, 149, 153, 152, 160, 187, 214, 212, 178, 139, 121, 131, 152, 167, 164, 145, 118, 88, 58, 37, 38, 61, 91, 109, 119, 135, 155, 166, 164, 164, 182, 213, 245, 268, 281, 286, 282, 270, 250, 222, 188, 152, 121, 100, 100, 131, 181, 224, 239, 229, 210, 188, 165, 158, 185, 233, 262, 252, 226, 223, 246, 267, 270, 263, 257, 250, 234, 214, 198, 184, 168, 157, 158, 165, 171, 181, 201, 224, 232, 219, 196, 175, 162, 154, 153, 154, 151, 145, 143, 150, 163, 180, 208, 247, 280, 286, 266, 237, 223, 228, 240, 240, 222, 203, 205, 230, 256, 261, 250, 234, 219, 194, 157, 122, 106, 116, 144, 171, 183, 178, 170, 173, 193, 223, 253, 277, 298, 318, 331, 326, 301, 267, 235, 208, 186, 175, 179, 182, 160, 114, 69, 43, 29, 17, 7, 6, 9, 13, 28, 65, 105, 123, 119, 118, 138, 169, 192, 198, 192, 182, 181, 189, 189, 167, 125, 86, 66, 62, 62, 61, 60, 62, 69, 80, 90, 96, 98, 97, 92, 90, 104, 131, 148, 138, 119, 120, 138, 143, 117, 76, 46, 43, 70, 121, 171, 192, 190, 195, 215, 228, 216, 192, 171, 144, 106, 82, 102, 154, 198, 219, 233, 249, 253, 239, 224, 219, 212, 187]
6708A87m4m5l1pK1L8M0L3K8K4Nk2k9j1J0J0nj4j2j0j2j1ooj2k1j6kJ7K9L4L1K1J2J0J6J9L
6691B72k3m5m8m0k9j8NL3M8M0J6%%Mkj2j8j5j3j8k3k1pJ4K9K6Nj4j4JPJmJJ3J9K0J9J4OKM
6673B35Kj5l5m0k8j2KJ4K1J8MnqroOJ5Nk1l5k4JJ6J6J1Olo%J2K2K9L2K1lk5k7j2%mj1pJ2L2
6654A96L8K6Kj7j4J1K9J9j0l0k1PK6K1ml1l7j3K4M4L1Lj3j3rj4j8j8k0k8l2k0kJ2J5Qpk1j5
6637A05J0L1K4%j3jJ5J7PknpmKLlj1j6j0J0L5M1J8j1j6kkj4j5QK2Ok5l7k2lPOmj9k3mK1L2
6618A51K7K1J2j0k9k1J0K3Kk5k8rJoj4kK2L6K8Mj1nPLj3k2j7rj2j3kJ5J5%j5j1RK4J5rk7k1
6600I4JK0K7K8L1K6J2kqomkJ0K4K9J7jj6k4k7l0k7j8lKlrKK2L1K0%j1j2j3j4qj%jRL0L8K6
6581B59Lj6k6l6m2l7k4j1nlKJ0K2K9K7J5Mjqk2k8j5MJ4J0J0J5J2nj2MK6K7Pj1j4j1j4j7j8
$$ y = [187, 143, 98, 67, 60, 81, 119, 159, 192, 220, 244, 249, 227, 198, 187, 197, 207, 202, 188, 176, 166, 154, 143, 137, 131, 119, 98, 82, 80, 97, 126, 160, 191, 212, 224, 234, 250, 269, 272, 249, 204, 156, 116, 87, 69, 74, 107, 155, 195, 211, 211, 211, 215, 213, 201, 183, 168, 155, 137, 114, 93, 86, 100, 129, 155, 160, 146, 132, 133, 140, 141, 137, 138, 151, 170, 190, 209, 223, 229, 231, 235, 237, 222, 187, 147, 119, 107, 109, 123, 144, 162, 166, 161, 153, 144, 138, 144, 159, 164, 143, 108, 84, 85, 101, 117, 128, 134, 131, 125, 125, 137, 159, 188, 220, 241, 238, 213, 186, 174, 174, 170, 159, 152, 164, 196, 234, 260, 262, 245, 231, 242, 271, 290, 280, 250, 229, 236, 262, 283, 279, 248, 211, 198, 222, 266, 297, 300, 287, 274, 265, 251, 233, 215, 195, 167, 135, 115, 113, 125, 140, 148, 141, 120, 105, 115, 146, 170, 170, 157, 156, 171, 188, 195, 193, 188, 181, 177, 179, 182, 179, 168, 152, 142, 152, 187, 228, 246, 235, 219, 217, 215, 201, 186, 194, 216, 222, 197, 160, 138, 135, 142, 148, 144, 125, 102, 98, 119, 151, 178, 199, 211, 201, 172, 151, 161, 184, 186, 161, 133, 124, 125, 119, 105, 103, 125, 161, 189, 193, 182, 177, 184, 187, 174, 152, 135, 126, 114, 101, 99, 114, 129, 129, 114, 103, 112, 136, 151, 142, 115, 94, 95, 115, 142, 170, 201, 227, 239, 237, 229, 223, 219, 217, 227, 251, 280, 297, 296, 280, 256, 229, 199, 172, 154, 151, 153, 150, 141, 143, 165, 196, 216, 216, 205, 193, 180, 166, 158, 157, 157, 156, 165, 195, 233, 259, 262, 246, 220, 184, 142, 105, 81, 70, 65, 62, 64, 74, 96, 125, 152, 167, 171, 170, 162, 140, 112, 97, 101, 115, 125, 135, 150, 162, 157, 145, 149, 175, 202, 209, 198, 184, 173, 159, 142, 124]
6563A24j8k4l0k6rJ2L0L6L5L0K0RLOJ6K0J1nj6j3lJ0J5Orj3jJ1Nqj9k0j9j1RK4J4j7l5k0P
6546A37K4K5K3K3K0J4Q%j0j8k2k2k2j6kJ1J2Pjj2k2j7PK7K9J8J6K1J9%j2qj%lmnj3j9pJ6L2
6527B53K2pl6m8m5l8l2k4pJ2J8RlrnMJ2J8K5K7J8Kj0j0pqj3j6j8l4n5n2pN2P9O5L0KmPJ9K4
6509B10J8J6K0J1k0n0m4oL1M3L1Rk1m6m8j9J3J7ok5k1%J3J1OJ8L9M3J5k6m6k8QL7L9K1mk0
6493B39k1j5rJK2M0M1K9K4K2Qj9l7l2j9j5j9k2k4k6k4j5mMJ5K8K4Jk4l6k9j9r%RK0L8M9L3
6476B29Kj1QK3Ml1m5k8rmMK1L3K4MoQK9L6K2ok5k5j1JMjkNJ1Jk6n2m7j5K0L6L3J9mk6l3j5
6457A55RK6K8J7ok4k0%J1JrlLqk7l1k1j1nJPJ3K5M5N3L9J8J2J7J2KLOqk8l1j2Lkj5k0j5mJ2
6438B18K6K4Qj1j9k0j0NJ8J6Kqj1j7k1j7j1j1j3ML1L9J5j4k6k1j4lJ1J9J0jmLJ3J9K0Pqj3
$$ y = [124, 106, 82, 52, 26, 17, 29, 59, 95, 130, 160, 180, 189, 192, 198, 214, 234, 245, 240, 224, 211, 208, 218, 233, 239, 230, 217, 216, 227, 232, 224, 205, 185, 166, 155, 164, 188, 202, 185, 150, 130, 137, 161, 186, 209, 232, 252, 266, 274, 274, 264, 246, 224, 202, 180, 164, 162, 173, 185, 192, 191, 179, 157, 140, 147, 174, 203, 221, 237, 258, 277, 277, 265, 257, 256, 256, 253, 249, 244, 231, 212, 205, 221, 253, 275, 268, 232, 184, 139, 101, 69, 45, 38, 50, 68, 77, 74, 65, 60, 64, 76, 94, 119, 146, 164, 166, 156, 146, 139, 131, 118, 102, 84, 50, -5, -57, -64, -12, 67, 132, 162, 164, 160, 167, 186, 210, 228, 244, 264, 275, 255, 205, 161, 155, 186, 229, 260, 269, 248, 202, 154, 135, 148, 165, 159, 134, 113, 113, 126, 137, 143, 161, 200, 243, 258, 232, 186, 158, 166, 203, 242, 263, 259, 239, 218, 203, 194, 195, 217, 257, 298, 327, 351, 373, 381, 362, 325, 293, 274, 259, 240, 218, 194, 168, 144, 129, 125, 129, 144, 172, 196, 197, 173, 137, 108, 89, 80, 80, 89, 109, 147, 196, 229, 231, 220, 228, 251, 255, 224, 179, 151, 142, 138, 142, 163, 196, 220, 224, 218, 226, 255, 291, 313, 307, 282, 257, 246, 247, 251, 250, 248, 253, 264, 265, 239, 187, 140, 125, 145, 181, 214, 233, 229, 203, 170, 155, 164, 190, 218, 235, 229, 205, 185, 185, 196, 197, 188, 185, 188, 180, 153, 122, 101, 90, 85, 86, 93, 106, 131, 176, 229, 268, 286, 298, 315, 327, 329, 332, 338, 330, 302, 271, 259, 262, 260, 245, 225, 210, 206, 218, 244, 268, 276, 265, 246, 226, 216, 221, 239, 255, 257, 249, 238, 221, 200, 183, 172, 161, 148, 152, 183, 222, 237, 223, 197, 176, 162, 159, 170, 189, 199, 198, 194, 197, 210, 229, 249, 256, 248, 235]
6421B35oOK0L7M0J6k4m2k6JJ3Mj7l8m4k3QJ4qk4j4kj2k2lL0L8J5k0m4m9l7j3Jrk0qK3L8L0
6403F4J8J5J4Mj0j1jJ0J4Pj0k3k1oRJ3Mj4l1k3NL3L4K2J6K2J6%rQL0L8K8J0mj4k2k5k2j3o
6386A69kjKLok3k6kK9L3J0rj0j0k8m5l7j1PNLJ1J9RrpJ8L8L2J3Jjpj4j6j5j8k1j8mQJ9K7K8
6367A44J1j4k5k8l4m0k1J0L1K4J3J6J6KrKJ4QkOJ7Rj1j1OJ6RLNJ2J4J6J1ok6l1j9mRJ7J7J0
6348A87J5L4M0J2k6l2j2mk2k8j3Klj0qlmMJ8J6rk7j3J2J4LLJ4J8Qjnpj0rmjNJ5J2pk1nL1M6
6329B25K7kj0LJ4J1ok8m3m3k6kJ0J2J1J3Qok5l2k7j8pLJ0OnqKJ0OlOL0N0M8K5%j1%K0K5Qp
6310B74KK3K8J9RJk2m9n2k7mJjOJ3J1Llj1j6j3JOpk6l2k1jJ6K1J7K2M7O7N1Km3n8n6m9l0j
6292A18J5J3NNKqj4qpj1lJ8J8qk2KK8J0l4n1k7KRMPJ1Qoj8j7KL5N5N5L9K5Oj4k8k5k3l1l1
$$ y = [235, 229, 235, 255, 292, 332, 348, 324, 282, 256, 257, 270, 274, 257, 219, 175, 152, 160, 174, 166, 142, 128, 126, 114, 92, 89, 119, 157, 172, 152, 108, 59, 22, 9, 10, 1, -19, -27, -4, 34, 64, 82, 97, 111, 115, 105, 94, 93, 103, 117, 124, 114, 91, 70, 64, 73, 86, 90, 76, 45, 22, 27, 60, 94, 116, 132, 154, 170, 170, 161, 169, 199, 237, 265, 275, 271, 257, 235, 210, 188, 175, 169, 167, 166, 168, 171, 165, 142, 116, 114, 143, 176, 186, 177, 167, 157, 129, 84, 47, 36, 43, 48, 51, 62, 81, 90, 81, 74, 92, 130, 162, 175, 176, 175, 168, 154, 138, 123, 105, 84, 66, 62, 70, 89, 116, 144, 155, 141, 116, 88, 54, 14, -7, 3, 34, 58, 71, 87, 103, 105, 96, 98, 112, 120, 118, 124, 141, 150, 139, 128, 134, 150, 159, 162, 167, 179, 193, 209, 220, 214, 188, 157, 138, 134, 143, 160, 177, 187, 202, 236, 276, 288, 262, 230, 218, 214, 192, 164, 151, 153, 150, 140, 132, 129, 125, 129, 147, 163, 154, 127, 114, 126, 140, 143, 146, 160, 178, 186, 185, 180, 173, 163, 154, 150, 149, 154, 169, 181, 174, 153, 148, 179, 225, 252, 250, 240, 243, 257, 268, 262, 234, 191, 148, 122, 120, 130, 142, 153, 166, 174, 168, 143, 111, 84, 66, 59, 62, 72, 78, 73, 65, 67, 77, 83, 80, 86, 116, 166, 214, 239, 239, 228, 228, 248, 273, 281, 274, 276, 299, 327, 346, 355, 356, 334, 285, 233, 206, 202, 203, 202, 208, 221, 232, 235, 232, 221, 205, 192, 193, 199, 192, 166, 134, 113, 112, 128, 149, 166, 188, 235, 302, 353, 355, 312, 254, 198, 149, 119, 118, 133, 146, 151, 156, 158, 150, 136, 128, 121, 110, 107, 125, 143, 135, 113, 115, 143, 153, 119, 68, 41, 43, 52, 56, 63, 74, 82, 76, 58, 41, 43, 78, 133, 188, 227, 252, 258, 244, 216, 191, 168, 137, 106]
6273A06oK4K3nl2m3l9k6kJ2J0ljJ2J8J0KKRK2L0K4Lj0MJ9J3j%J1Mj4oK1K9Kl1m0l5k6j3NJ2
6254I4MJPJ0jj1j0qj0jK1M3M7L5J1j9m0l3jK2K0J1J8K9K7J6RJj7l5l6j8MJ8J6lk5k7j1OMp
6236A61j1j3k1k5qK4M3M0K2J2J3K0J5lk4l4k4oQNj1k7k1OL0L0J7J3J6Qj5k4j0J2K6K8K3Pj9
6219B83l4l2k2j3oKKrk2k9l0k4oJ3J5LKJ3J5kj4kJ4J1nj1JQJj3j5LL0M7M3K4Omj1j7j2JNK
6200B11MJ4J5Ooj1k0k4j3RJ1qk0qPROJ6K4J8Mkj1k7l2j1J4J3mj5j2plQJ8K0J7J6Rj1k8k8j8
6181A50j7k6l0k8k2rJ5L2K9J8J8K4K3J8J6J3jrjQLnKJ2%k7m0l0j9j0NL1M7M3L0J1j9m6m8k2
6164A39J0K5K5J5nk1k4j3%RJ0LpqJ1L0K9J4Koj7k5j8lQJ3J2kl1m3j5K2K5%rJ7M1L8J8Kj0j9
6146B42j8pKPJ3J8J3%JQRmj2rpj1j0pomPJ8J7ROkk6m8l5%J2lj2LJ4%k3k5j2kKkj4k6k4j2j
$$ y = [106, 100, 124, 147, 142, 110, 67, 28, 2, 0, 12, 22, 19, 18, 30, 48, 58, 60, 62, 71, 93, 123, 147, 150, 140, 144, 163, 176, 175, 175, 186, 190, 176, 170, 191, 220, 222, 191, 151, 116, 90, 77, 82, 94, 98, 99, 106, 116, 115, 104, 94, 86, 76, 75, 96, 139, 186, 221, 232, 213, 173, 140, 139, 161, 181, 192, 210, 239, 266, 282, 291, 292, 275, 240, 204, 186, 190, 208, 224, 221, 196, 169, 158, 164, 168, 161, 150, 137, 116, 91, 83, 107, 150, 190, 212, 224, 237, 257, 272, 269, 245, 211, 187, 181, 189, 194, 183, 156, 135, 141, 171, 201, 218, 231, 247, 255, 240, 216, 206, 218, 244, 272, 295, 302, 283, 249, 217, 195, 182, 176, 178, 180, 171, 149, 120, 90, 66, 60, 73, 88, 91, 93, 106, 121, 119, 105, 103, 117, 128, 123, 112, 113, 121, 122, 109, 94, 97, 127, 174, 217, 241, 247, 243, 232, 215, 203, 204, 209, 211, 215, 229, 244, 250, 244, 233, 213, 189, 176, 185, 196, 188, 168, 160, 167, 176, 182, 198, 222, 240, 244, 242, 231, 204, 172, 161, 175, 188, 184, 169, 157, 150, 147, 155, 173, 193, 210, 226, 235, 224, 196, 168, 150, 133, 107, 77, 49, 27, 18, 33, 65, 94, 112, 130, 154, 177, 195, 211, 224, 223, 214, 213, 221, 224, 219, 221, 233, 233, 206, 166, 136, 117, 107, 112, 143, 190, 233, 263, 274, 255, 209, 161, 139, 149, 174, 199, 214, 209, 188, 164, 151, 151, 160, 170, 173, 166, 158, 169, 199, 228, 242, 244, 238, 221, 196, 178, 175, 183, 196, 208, 206, 175, 132, 117, 139, 164, 164, 155, 172, 213, 251, 269, 271, 261, 242, 224, 217, 219, 226, 239, 257, 270, 270, 271, 279, 288, 284, 272, 263, 256, 245, 235, 228, 222, 218, 225, 243, 260, 269, 275, 273, 247, 199, 164, 164, 176, 173, 161, 164, 178, 178, 155, 130, 118, 116, 118, 116, 102, 76, 52, 40, 39]
6126C9NJ6K9K4Qlmj2k1j2J1J8ROJ9K4J1KQJ2MMJ2J1rk6k6j6mJ6L0J2k6m0j5Qkk1k0j5j5kL1
6107H0N3L5MmMOKQJ7RJK%k1l8k6MJ9J3Mnj3j3jPmj8j9j7k0j8jJ5J7RLlkJ6L8K5j7l5kL4K0
6087A68j8k2%PopOJ0krJJ3J9K0J0pj5%J7J3oj4j4j3j0JOjlJ3L2L0K6L3M0L4K3K0Nk8m6k5L
6068C04NnjOpk0oJ2PrnMj2l1k5j7l3n3l2QJ3rpJ8J9oj3PJ5%oQJ5Mjkj8l5k5RK7K2K0K5J1j2
6048A69qK1L0J3JMok8k4J5M4L7J4ql1m9l7pQmoPJ4OJ0K3K8K4L2L8J5j8k4j1k2m7l4RK2mj8
6031A98KJ9J6J4K3J9NJ7L7J7l1m3k1k6o7o6mM5M1K0K2J5qqK2K9kj8KMl1m1%L0J2KL0M2Ok1
6013C02JK8J1j0%J3KRN2O7K9qQK4ll4k7j6k8k6QK6NkK9L7mk4J0K7ok4J1K6j3k4L2N8Ml7RN0
5995E92K2J1Q3J41R3J8QKo6j04l9J9j9n2J7Q1L2k0L4Q5K7k2N6J27O1NJ04K07J51Q7J90K85
$$ y = [39, 44, 60, 89, 113, 121, 118, 114, 102, 81, 69, 80, 98, 107, 113, 132, 156, 167, 169, 177, 189, 193, 197, 209, 220, 211, 185, 159, 143, 139, 155, 185, 197, 171, 131, 116, 124, 122, 101, 81, 66, 51, 49, 80, 133, 168, 172, 168, 172, 178, 180, 188, 205, 214, 215, 217, 217, 196, 158, 132, 136, 155, 168, 172, 167, 154, 141, 140, 147, 143, 125, 106, 89, 69, 51, 50, 65, 82, 91, 94, 91, 89, 105, 143, 168, 151, 116, 114, 148, 168, 150, 128, 128, 135, 129, 122, 128, 138, 136, 127, 128, 141, 160, 180, 190, 183, 168, 168, 185, 198, 192, 178, 164, 151, 141, 142, 148, 147, 144, 157, 189, 219, 245, 278, 318, 352, 375, 395, 400, 372, 326, 301, 304, 309, 304, 303, 309, 302, 282, 276, 288, 295, 286, 281, 285, 273, 242, 217, 200, 167, 114, 82, 90, 103, 94, 87, 105, 124, 118, 105, 112, 127, 127, 121, 129, 144, 148, 147, 145, 127, 92, 67, 76, 103, 125, 145, 170, 181, 169, 161, 182, 212, 225, 226, 230, 224, 196, 172, 187, 231, 268, 282, 274, 243, 194, 157, 150, 158, 154, 148, 155, 169, 175, 185, 208, 236, 260, 292, 330, 345, 327, 303, 292, 270, 223, 189, 198, 220, 216, 198, 200, 219, 235, 249, 272, 291, 296, 313, 350, 367, 336, 293, 272, 246, 179, 113, 109, 154, 195, 215, 237, 252, 244, 236, 258, 287, 285, 267, 269, 273, 242, 201, 201, 231, 243, 245, 275, 317, 323, 302, 303, 331, 342, 332, 332, 345, 347, 356, 408, 475, 504, 496, 504, 528, 525, 491, 464, 448, 420, 394, 402, 428, 433, 431, 460, 497, 493, 469, 479, 506, 500, 476, 487, 513, 500, 476, 508, 566, 570, 533, 542, 592, 614, 625, 708, 849, 942, 960, 968, 970, 904, 800, 761, 780, 761, 709, 726, 807, 839, 819, 853, 938, 965, 943, 999, 1126, 1187, 1192, 1296, 1503, 1654, 1741, 1931, 2216]
5981B216J93J30L19N26M97M95Q29J225J377J711K729M090N497P835J1520J3832J0444Q98r324
5973E7039j3984j2298q383n696m266k951j806j350j245r05m95m31n27l94j62j53k59k02p1
5965A461r6j83j16Ok1j18r0ol5j04n1N6M3l9l6J9mo1l6K9K2qM1J00M2p4j01n3m6o8l0L7K9
5950E09k5k2K0Jn5n0OJ5k4k4Oll8k4J8Ol9l2J6K1j6j9J6J8j1pK3J3k6j6K7K1l2m8nK3Kj8j2
5933B15k4n2m3OK7%j8nJ0L%%k6n5l8J2L1QKK2K2loJ9K5jj2QJ3rj1K0L8K3PJ2Nj9j6K1L9Ol1
5915B25l4k1j5pJ2J8J2K2M8N1J7j0nLj0j8olj8k2JJ5lk8l4l1l1k0KLj7j6J1K0j0l5j8J0K0
5898G8K3M2M9K3qoRkk3k1njj1j4q%RK1K1jj7j2lpqQK3K3J6K4L0K2J1J1Oj6l0j5Jj7n5o9m6
5879E5j4J1K5L1K5J9K0K3J5MKlj9l2k7j0mj1j9j9j0J3L9M3K3QJ3J7Jj8j5lK%OLj6k7qK6L4
$$ y = [2216, 2409, 2539, 2858, 3384, 3881, 4376, 5205, 6430, 7807, 9518, 12247, 16337, 21834, 29669, 41189, 55021, 65465, 66363, 57039, 43055, 30757, 22374, 16678, 12412, 9461, 7655, 6305, 5060, 4155, 3660, 3229, 2702, 2308, 2146, 1993, 1734, 1532, 1461, 1365, 1182, 1066, 1072, 1051, 933, 843, 837, 802, 698, 647, 703, 746, 707, 671, 690, 686, 625, 589, 618, 640, 632, 673, 773, 815, 741, 640, 587, 541, 473, 443, 480, 509, 484, 462, 482, 483, 428, 378, 384, 399, 375, 351, 357, 354, 316, 292, 310, 316, 277, 245, 261, 282, 266, 247, 263, 281, 270, 263, 286, 299, 273, 257, 284, 305, 273, 225, 220, 243, 245, 227, 215, 191, 139, 96, 102, 129, 129, 111, 106, 116, 119, 119, 119, 93, 38, 0, 12, 43, 51, 53, 75, 97, 94, 88, 107, 132, 131, 119, 127, 140, 131, 120, 140, 178, 201, 208, 220, 225, 206, 190, 211, 250, 256, 225, 191, 170, 155, 148, 160, 178, 190, 212, 260, 311, 328, 318, 313, 316, 306, 288, 282, 279, 261, 239, 240, 255, 252, 224, 190, 159, 128, 108, 110, 113, 96, 80, 91, 111, 101, 66, 48, 58, 78, 101, 143, 192, 215, 207, 201, 210, 208, 185, 164, 159, 158, 147, 133, 125, 125, 134, 155, 176, 175, 158, 146, 143, 136, 128, 136, 159, 182, 198, 222, 252, 274, 285, 296, 302, 286, 256, 241, 242, 225, 170, 101, 55, 41, 52, 77, 108, 133, 152, 172, 195, 210, 214, 216, 213, 194, 162, 135, 125, 121, 110, 91, 72, 62, 75, 114, 157, 180, 188, 201, 218, 219, 201, 186, 183, 185, 185, 191, 194, 178, 151, 143, 169, 203]
5862B03J2j1k4l5m8m5k5mRJ3J5J2J2J9K4J9J3RMpj0%Kj6k8j0J6J6lrjkj4rJ2J9nl0l6l1k6
5844@j6J0L8M8L4J3K%Jlppjjqj0oknnOJ5RKQK2L1L2K5Ok7m6k8J3L9L8K2Oj3k1j4%L%%LMPK0
5823B37K7J3j2j9rJPJ6J5jk4l2k9l2l4j8J5L8M0L3K2Lj5j8j3j7k6j3K0M1L0J2%nj5k0k0k4
5806A74k9k3jJ2RMJ4L0L5K7J2kj2k0l0l9l0ML8M2K3QMok2k4nJ4J5P%j5l0k8nJ0NmLJ7K5L3
5788B40L8L0Nj4j2LMoqLJ3J3nk9m2k9qmk1k9k0rqmJ8L2K4J0J3K3J3j3l0k2j1pmNJ4K1K4K4
5770B35J5jk3l7l1j1Kqk5j7J4L3K4J4J8K1RKJ3K1J0okJ3J7J4J9J9ml4l8j9j4l1l8j7RJ4%j1
5752A69j2oKJ0J2J4K6L1J5j4k4j2MKkKQMKJ1K4K1Lj6k7k5j6ork8l9k3J4L1J4j4j9%J6J2KJ
5734A58J0J3mk5l6k6mJ4J3jj0kPJj2j6nJ0K5M0M6K8jj3lKj4l2k7j0kJJ1K3J7JqkORJ2J4J0
$$ y = [203, 215, 204, 180, 145, 97, 52, 27, 23, 32, 45, 60, 72, 84, 103, 127, 146, 159, 168, 172, 165, 155, 155, 157, 141, 113, 103, 119, 135, 132, 123, 122, 120, 106, 97, 109, 128, 123, 93, 57, 26, 0, -16, -6, 32, 80, 114, 127, 129, 129, 130, 127, 120, 113, 112, 111, 103, 93, 87, 85, 80, 75, 81, 96, 105, 107, 115, 137, 168, 200, 225, 231, 204, 158, 130, 143, 182, 220, 242, 248, 235, 214, 200, 200, 203, 203, 203, 206, 210, 217, 237, 264, 277, 265, 246, 237, 238, 245, 261, 276, 275, 251, 219, 190, 158, 124, 106, 121, 159, 199, 232, 254, 257, 242, 224, 211, 194, 168, 155, 175, 216, 246, 258, 258, 253, 238, 218, 198, 174, 145, 122, 121, 133, 142, 146, 160, 190, 225, 252, 264, 262, 250, 230, 200, 161, 131, 135, 173, 215, 238, 246, 250, 244, 222, 198, 193, 207, 222, 229, 229, 214, 184, 156, 151, 161, 166, 162, 165, 182, 207, 240, 278, 308, 313, 299, 287, 290, 294, 288, 280, 283, 296, 309, 304, 275, 233, 204, 196, 192, 171, 142, 122, 113, 105, 101, 119, 151, 175, 185, 198, 221, 234, 221, 191, 169, 158, 151, 147, 152, 166, 187, 211, 235, 250, 249, 226, 189, 158, 147, 149, 141, 116, 99, 113, 146, 170, 184, 202, 223, 232, 234, 247, 268, 278, 272, 270, 283, 300, 314, 333, 352, 348, 314, 276, 257, 243, 212, 174, 157, 166, 180, 180, 169, 157, 151, 153, 163, 175, 189, 215, 246, 261, 247, 223, 211, 215, 217, 215, 217, 225, 229, 231, 242, 266, 287, 290, 274, 247, 222, 206, 200, 191, 163, 124, 101, 115, 146, 160, 146, 127, 127, 143, 155, 157, 158, 168, 181, 177, 152, 116, 90, 86, 100, 113, 112, 102, 100, 107, 108, 96, 80, 75, 85, 110, 150, 196, 224, 223, 210, 207, 209, 195, 163, 136, 126, 124, 125, 136, 159, 176, 177, 169, 167, 173, 182, 194, 208, 218]
5715B18POKrj7nJ2J1lnJ3L1K6Oj8m0m9l4jK4K8K2K3K5J5nj9j3KLk0n2o5m8k8j5KL2N8M9K1
5698A90%krj8j4KLj7k8nK9L7K0jj0pJP%j0rQK2J4mrMJ8J5Mlnj6m0n9m6lL8L8J1oLJ8J2JJQ
5677A83Omj2j3j3j4j5j9j9j1knj8j9ML0L8L5M4N3L9Nk1k0j1omlmj3k3k5j9mJ0J4RNRJ0lk5
5659A49k8j0J3K2K4K9K9J7mk0k2j6rj0j4j3kJ1J1nk0j5OJ7Qj1j5KJ7Qj9l4k2jJ0QOQJ3K2L2
5641A72L2J6pk3k3j8rQL4N0M9L0Pj0k1k9l8n1n4l9kL1L8J9lqmqj5j1NJ7J4J3J9J9PjJ0K2J5
5624B53mJK7L8J4j5k5j9j4j5j2pqj3j3j4j6k0j8j2jJ8L5L5K0OKnj8k4j4mj0k1j2J0K1J5ON
5606A72PJ1J7J9J0oj1pJPQKooJ1K1Ok2l0j9j0j1jK2L7K9J6J0Ooj4j5j4j6mJ8K9J4j3k8k8j7
5588A89mJ0RnrPK5K3OjQJ5Rmj4j6j2j0j7l2m5m7l4j1K1M2M1J9mj6k0j5kQLrkK1L1J2mjJ4J6
$$ y = [218, 225, 231, 233, 224, 207, 202, 214, 225, 222, 217, 230, 261, 287, 293, 275, 235, 186, 152, 151, 175, 203, 225, 248, 273, 288, 283, 264, 251, 253, 256, 236, 184, 119, 71, 43, 28, 30, 62, 120, 169, 190, 190, 188, 179, 161, 147, 149, 152, 135, 107, 102, 131, 168, 188, 187, 177, 170, 171, 178, 178, 168, 159, 167, 189, 203, 199, 190, 194, 212, 227, 231, 228, 223, 207, 167, 108, 62, 59, 97, 135, 146, 140, 143, 161, 173, 174, 175, 183, 189, 185, 173, 160, 147, 133, 118, 99, 80, 69, 67, 62, 44, 25, 29, 59, 97, 132, 176, 229, 268, 273, 252, 232, 221, 215, 211, 208, 204, 191, 168, 143, 124, 120, 130, 144, 153, 158, 167, 177, 174, 149, 121, 111, 124, 146, 170, 199, 228, 245, 241, 221, 199, 183, 174, 164, 150, 137, 135, 146, 157, 152, 132, 117, 123, 140, 148, 137, 122, 124, 141, 149, 130, 96, 74, 73, 83, 91, 97, 105, 118, 140, 172, 204, 220, 213, 190, 167, 149, 140, 148, 182, 232, 281, 311, 318, 308, 287, 258, 220, 169, 115, 76, 74, 105, 143, 162, 159, 151, 147, 139, 124, 113, 118, 135, 149, 162, 181, 200, 207, 206, 216, 238, 253, 249, 250, 277, 315, 329, 314, 289, 270, 256, 241, 229, 222, 214, 201, 188, 174, 158, 138, 120, 108, 107, 125, 160, 195, 215, 221, 223, 218, 200, 176, 162, 158, 148, 127, 115, 125, 146, 161, 167, 172, 179, 190, 207, 226, 236, 230, 219, 212, 213, 220, 228, 230, 224, 218, 229, 250, 256, 234, 204, 185, 175, 164, 163, 185, 222, 251, 267, 277, 283, 277, 263, 248, 234, 218, 214, 232, 261, 275, 262, 234, 206, 189, 185, 195, 204, 199, 190, 197, 222, 245, 251, 250, 258, 273, 282, 278, 264, 248, 236, 226, 209, 177, 132, 85, 51, 40, 61, 103, 144, 163, 159, 143, 123, 108, 106, 114, 117, 108, 106, 127, 158, 170, 166, 165, 179, 195]
5569A95J2Nj0l2l8j2J3PrML5L6Jk8k8j6j8j7%J7J8QLmj2qJ4L2K1j2l0k0MJ6Prk3k2rmj2k6
5551D9k4oJ7L0L0K4J8J6J1LNK0M2N0L3Oj5k4l4l8l2j7j4k4l2k8j4jJ1K4L1K2J0J0K3K6Rj5
5534B02k4j3kJJNQJ0J4K4K7K2J2QO%j4k5k9j9KJ7Qj5k2%K4J9j%K6L7Rl0m0j4J1J2pk9m0k7
5516A54jK1J8Jj1jJ3J6NoKJ6K2J0mnOJ0kk2l5l8k9qJ6K6J4mlJ6L4L2J4%pqlMOJmLJ7J9Jj8
5496B88k5k3k5k4j7ooj2j1jQRJ6K2J4j2l6l4j5PK6M4M4J6k4l9k4njolKlj3j7qOJ5J8J4RJ1
5478A79J6J3%j1j0pqj4j3j1j2j0NL0M1K7OJJ0J3Mn%QKk0l6k9j3j1k9m2l1mK2L2K5PrqOJ9J2
5459A45j0k6k4rQK1J9Mj3j5%J8K8L0L2L1K0%j9k3rJ3K9K8J5MJ0J8J2j8n0n5l3kJ2Rmk0l1l1
5442A14j4J1K6K6J9J6J6J6J2%k1m3m8l2oJ1J0kj9k3pJ9L7L0QkMJ4J5J2J0QJj3k7m1m9m7k5
$$ y = [195, 207, 212, 202, 170, 132, 120, 133, 140, 131, 135, 170, 206, 207, 179, 151, 135, 117, 100, 100, 117, 135, 143, 146, 142, 130, 122, 136, 168, 189, 177, 147, 127, 131, 147, 154, 145, 122, 100, 91, 87, 75, 49, 25, 19, 36, 66, 96, 120, 138, 154, 165, 168, 173, 193, 235, 285, 318, 324, 309, 285, 251, 213, 181, 164, 150, 126, 94, 66, 52, 51, 62, 86, 117, 139, 149, 159, 182, 208, 217, 202, 178, 165, 163, 164, 165, 170, 178, 188, 202, 226, 253, 275, 287, 295, 301, 301, 287, 262, 233, 214, 216, 233, 241, 226, 204, 204, 228, 247, 246, 246, 272, 309, 318, 288, 248, 234, 245, 257, 250, 221, 181, 154, 153, 174, 192, 193, 182, 181, 194, 210, 215, 209, 211, 227, 249, 259, 255, 250, 256, 266, 264, 242, 207, 169, 140, 132, 148, 174, 188, 184, 181, 197, 231, 263, 277, 277, 270, 262, 259, 263, 269, 270, 266, 269, 286, 305, 306, 288, 263, 240, 215, 191, 174, 168, 162, 150, 139, 138, 146, 155, 171, 193, 207, 195, 159, 125, 110, 117, 143, 187, 231, 247, 223, 184, 160, 155, 154, 148, 145, 147, 144, 131, 114, 106, 112, 127, 145, 159, 168, 179, 195, 208, 208, 197, 187, 180, 172, 158, 145, 134, 122, 112, 117, 147, 188, 215, 221, 222, 232, 245, 249, 244, 244, 252, 254, 234, 198, 169, 156, 145, 116, 74, 43, 39, 61, 93, 118, 125, 116, 108, 114, 133, 145, 135, 109, 85, 76, 84, 105, 124, 128, 115, 100, 100, 118, 146, 176, 208, 239, 259, 259, 240, 217, 208, 221, 250, 278, 293, 297, 307, 325, 337, 319, 269, 214, 181, 179, 191, 200, 196, 176, 145, 114, 100, 111, 137, 163, 182, 198, 214, 230, 242, 242, 221, 178, 130, 98, 92, 103, 113, 111, 92, 69, 62, 81, 118, 148, 156, 154, 158, 172, 187, 199, 209, 217, 218, 205, 178, 137, 88, 41, 16]
5425A6LJ5Pj0j6oJ0K0K7K6J6lj5j1J0K6K5QqpJ1K9L1J8QRJ2Mj2j7j1lmrnMLpj7j0J2L2L0Q
5406B49j4k1qMRN%k%J3L2M3L2Mk2l2k0njj2k5k4rKONMmk1l3l3k5k0k0j5nMJ5L0L9L4J9RRM
5386B00pj8k0j9j9j0J2L0K6PKJ5K6J7mj7j8k2l2m1l8k9k7k8k3mK3M7N9N0L0J4J4K2K9K9K5
5370C01J6jk4l4k6j9k4l2k7q%j3l6m1k0J7M3M2K0oj6j3nPK0K7K2Oj3k9l7k7OM4O8O1M2K6K1
5353C38J5Jj5j8oPKj6k9k3nNMjlj0j8k5k5j6KK4L5K8J0kmpj0qkkj6l2l3k2j3j3j5j2NK6L4
5335A35J8pj5LK2J8mj9j3OJ6J1mj3lJ4K7K4Rj3l2l5j4J9L2J7pk1j9pJ4L2L1Qk0k9k0o%Joj6
5317A34k2k0j4lJ0K3K6J8J0OLj1k8l7l3k3mJ9L5K9RlMJ9L1L5K6Mk1l4l8m5n3m5j8J0K4L1L3
5300H7L3K0MokQJ2Q%lMJ2J3PNRJ1RQQJpqMJ6J7Nj0k5k9j3J8L7K6kk2j9p%KKjk%Lpk3k8j1J1
$$ y = [16, 19, 34, 41, 31, 15, 9, 19, 39, 66, 92, 108, 105, 90, 79, 89, 115, 140, 148, 140, 133, 144, 173, 204, 222, 230, 239, 251, 255, 243, 226, 215, 212, 208, 199, 194, 198, 201, 194, 177, 167, 179, 211, 241, 249, 235, 214, 206, 210, 219, 224, 224, 222, 222, 235, 267, 310, 342, 346, 324, 292, 272, 267, 266, 254, 229, 205, 196, 198, 204, 209, 213, 209, 188, 155, 122, 97, 77, 57, 42, 37, 41, 56, 86, 125, 159, 178, 187, 196, 200, 193, 175, 155, 136, 117, 107, 119, 149, 175, 182, 184, 199, 225, 242, 238, 221, 203, 181, 149, 108, 70, 41, 14, -14, -37, -41, -18, 29, 88, 138, 168, 182, 196, 218, 247, 276, 301, 317, 316, 292, 258, 232, 213, 189, 157, 130, 122, 122, 109, 73, 32, 12, 29, 72, 114, 134, 128, 112, 99, 94, 101, 121, 148, 170, 176, 163, 134, 97, 70, 76, 120, 188, 249, 291, 317, 338, 353, 354, 339, 321, 315, 322, 324, 308, 279, 256, 251, 256, 260, 259, 256, 246, 228, 203, 178, 162, 164, 188, 223, 251, 261, 259, 255, 248, 238, 230, 228, 226, 210, 178, 145, 123, 110, 97, 82, 70, 75, 101, 135, 153, 146, 131, 134, 156, 174, 170, 151, 138, 144, 160, 171, 167, 154, 151, 165, 192, 216, 225, 212, 180, 145, 131, 150, 182, 199, 192, 171, 152, 145, 159, 191, 222, 230, 210, 181, 161, 155, 155, 156, 150, 134, 112, 92, 78, 75, 85, 108, 134, 152, 162, 168, 171, 160, 132, 95, 62, 39, 35, 54, 89, 118, 127, 124, 128, 147, 178, 213, 239, 243, 222, 188, 150, 105, 52, 7, -11, -1, 23, 54, 87, 120, 140, 144, 138, 136, 144, 156, 164, 164, 161, 165, 177, 190, 197, 202, 211, 222, 231, 239, 247, 248, 241, 233, 237, 253, 270, 275, 265, 240, 211, 198, 216, 253, 279, 277, 255, 236, 229, 229, 231, 233, 232, 230, 230, 233, 226, 203, 175, 164, 175]
5278A75J8Roj4j4lJ3K2J3nj3lJ0J4Q%j0j8j0K2N2M4lm9n5k9rqj6j4o%LJ5K9K8J0j1j4%J5J4
5260B04JpLJ9K2Nk6m9n3l7k3k2k6j7LJ1OKJ3L1L1J4jjJ0J7K0K5L3L5J6j6m0l1%K1J2mqlj3
5242A77l1l4k0j2j9j8KK1K5K1K0J5jj3oONmlKj0l5l8lL7M7K5jj5k0k6k6j2J4L6L9K3Jj4j4
5225A41oPJ8J8NpmJ0J9J8J7K7K9Ql0m8k8RK2jl1l2nJ1Jj4j0MPOJ9M2M2Rk8m1l5k6j3QK1Mk7
5206A36m1j9K2N8P0M9Lm3n8m1j5JQJ4J7J8J7J5Lj6k5j7mlmNJ6J1rk5k4j1KJ0J8K3K1J4Jj4
5189A83k0oK5M6M2K4J3K0K5J0k2n0n6l7j3KPJ0J1Mrj2%Nrk6k3NK7K5Rkqj5j4LK3K9J4JkKM
5170B45LLLmj8l0k4%J9J7KlJ3K2Qk0k8j6knj3j1loj5j4MK2K7J8MmpJJ5L1L7K9J1rk1j9j2j1
5151B39j6j3mLlj5j6mOONkk0m4n1k8RK5J6RJ5J6lk3k0NK4K2J1QJ3K4L2K5Mj5j1J4L8M3L3J9
$$ y = [175, 193, 202, 196, 182, 168, 165, 178, 200, 213, 208, 195, 192, 202, 216, 224, 224, 214, 196, 186, 208, 260, 304, 301, 252, 197, 168, 159, 151, 135, 121, 115, 115, 118, 133, 162, 190, 200, 189, 175, 175, 190, 204, 205, 198, 201, 220, 242, 247, 221, 172, 119, 82, 59, 37, 11, -6, -3, 8, 14, 16, 29, 60, 91, 105, 104, 103, 113, 130, 150, 175, 208, 243, 259, 243, 203, 172, 172, 193, 205, 201, 193, 190, 177, 146, 112, 92, 80, 61, 43, 45, 66, 91, 112, 132, 147, 146, 133, 127, 133, 138, 134, 131, 133, 123, 88, 50, 47, 84, 131, 156, 155, 140, 120, 94, 68, 56, 70, 106, 145, 168, 169, 155, 141, 135, 142, 160, 178, 183, 176, 172, 182, 201, 219, 236, 263, 292, 300, 270, 222, 194, 203, 225, 224, 193, 161, 156, 167, 168, 154, 144, 148, 155, 161, 180, 222, 264, 273, 245, 204, 169, 143, 130, 138, 159, 163, 136, 95, 76, 98, 156, 226, 275, 278, 235, 177, 136, 121, 122, 130, 144, 161, 179, 196, 211, 214, 198, 173, 156, 152, 149, 145, 150, 166, 177, 168, 143, 119, 108, 110, 120, 138, 161, 182, 196, 197, 183, 163, 157, 182, 228, 270, 294, 307, 327, 352, 362, 340, 290, 234, 197, 184, 186, 193, 203, 214, 218, 209, 197, 197, 202, 193, 167, 144, 149, 176, 201, 210, 208, 200, 185, 171, 174, 197, 226, 240, 241, 239, 241, 245, 248, 251, 254, 250, 232, 202, 178, 178, 197, 214, 216, 213, 226, 248, 256, 236, 208, 192, 190, 185, 172, 161, 158, 152, 137, 123, 127, 149, 176, 194, 198, 194, 187, 188, 203, 234, 271, 300, 311, 302, 281, 262, 250, 239, 223, 210, 206, 209, 206, 191, 175, 171, 177, 183, 188, 186, 166, 122, 71, 43, 52, 77, 93, 102, 117, 133, 130, 107, 87, 92, 116, 138, 149, 157, 170, 194, 226, 251, 255, 240, 229, 243, 281, 324, 357, 376]
5133C76Pjmpj6l3l7j8J3M0O7R4J00N9j4p2q4o7n4m4k6rnj2pJ0J4rl8n1m6l3j1K1M5M7L2K1
5116B48J9K0J9J7J1nk1k0jJ4J2jrj4j8j9j2pj3k2k0mJ1J3Lj0j7j3KJ8K8K3Oj1j2QK4J7lj3
5099B48mPK%J6M3N1K8%j1njj6l7m2k4KJ0K%POj2l3l0rMLnqnMJ7K1Ok2m0l9k4j2nl%RK6L6K3
5079A84%p%Jj5k3j0POj0k0j5kJ1K0J6Kj2j4j1j3j4oOJ4J3QMJMJ7K7J6nk0j8rJPJ4J5Mj7l9
5060A18n2m2j0L2N9O4N8M1J8j1l0l3l0l1k9j8jJ1J7J9J6Lj3j9qQJ3Lk0l3k6lJ4J3KKJ8L6L1
5043A87Qj1qJ1K0Pj9l3j9J1L5L9K7J0lj1j4j3j4k3l4k8JL4M6M0L3K7J5pj9j6ojlqk1l0k7r
5025A74MLJPQoj3MK8K9QnMJ9K1J9J7Pj7l4k8oQOkprj0rmJNOjj5l0l4k9k0mJ6K9K6Qj1j4lJ3
5005A60K8L2K3Lk1l3l1k0qmkJMLj%QK3L5L7K5R%MJ6K1J3ok7l7l6l2l0l1k5LL6N4M0Ok4l3k6
$$ y = [376, 383, 382, 378, 371, 355, 322, 285, 267, 280, 320, 387, 481, 581, 640, 626, 554, 470, 403, 349, 305, 279, 270, 265, 253, 246, 256, 270, 261, 223, 172, 126, 93, 82, 103, 148, 195, 227, 248, 267, 287, 306, 323, 334, 329, 308, 288, 287, 301, 313, 312, 303, 289, 271, 252, 240, 233, 220, 198, 178, 174, 185, 198, 201, 191, 174, 161, 163, 181, 209, 232, 238, 227, 215, 223, 247, 264, 261, 248, 244, 251, 253, 253, 269, 312, 363, 391, 391, 380, 375, 374, 358, 321, 279, 255, 257, 267, 269, 269, 276, 282, 270, 237, 207, 198, 202, 205, 200, 192, 187, 191, 208, 229, 235, 213, 173, 134, 110, 98, 93, 90, 90, 99, 125, 161, 184, 184, 177, 177, 178, 163, 140, 130, 137, 143, 133, 113, 98, 96, 107, 127, 143, 145, 133, 119, 108, 95, 81, 75, 81, 95, 108, 116, 120, 121, 125, 142, 169, 185, 180, 160, 142, 133, 134, 141, 155, 170, 174, 157, 118, 66, 24, 14, 46, 105, 169, 227, 268, 286, 275, 245, 212, 182, 151, 122, 104, 103, 114, 131, 150, 166, 169, 156, 137, 129, 137, 150, 153, 133, 100, 74, 71, 85, 98, 100, 102, 120, 156, 187, 195, 184, 176, 187, 207, 214, 195, 162, 143, 154, 189, 228, 255, 265, 262, 251, 237, 224, 210, 187, 153, 125, 126, 160, 206, 246, 279, 306, 321, 314, 295, 279, 273, 272, 269, 261, 240, 210, 183, 174, 178, 181, 182, 189, 197, 191, 178, 182, 210, 239, 247, 242, 246, 265, 286, 305, 322, 329, 312, 278, 250, 244, 252, 258, 256, 249, 240, 230, 221, 217, 218, 223, 229, 228, 213, 183, 149, 120, 100, 96, 112, 141, 167, 175, 164, 150, 147, 160, 188, 220, 243, 246, 225, 192, 161, 141, 133, 129, 127, 128, 132, 135, 134, 134, 142, 165, 200, 237, 262, 271, 271, 275, 291, 312, 325, 319, 292, 255, 219, 187, 157, 126, 101, 104, 140, 194, 234, 240, 216, 183, 157]
4986A57j7k0k4j0K0M1K9ok8k0%J7K9L8L5J4j4l5m5m8l7rK6L7K3kj6j6j3r%J3K1J8Lj5j9lJ8
4969A33L0K4J1PJ3K0J7Kqp%Mlk0l4l4j8NK1K0J1NKloOL3N7N5L2NojMmj8k0qlj9l9l5j2%j2
4949B07k6k1qj2k4k8j4JQJ2J5J9J9J5jk0k2KL0L6K8K1J7Kj9k5j8j7k7l1j7MJ8K9L5K4lk0%
4933A89K9K9%k6l0k4k3k1pJ0J9K1K1K1J4JqroJMKrk0k4k5k9k9j6J2L2L3K0J2J7K6K3J1kpK
4915B34J2J1j0l2l4j4NJ0J4K7L6K2ok5k8k8k5qJ8K2Jj8j0J2K1J5J3J2Kj6k7k0rpj1pJOPOO
4897A78N%pj7k8k8j2J2K7K5J3NMjj3k4k1j2jNJ5K6K6J4oj9k7k3pJ1K4K9L4L9L0Oj7k2k1k9
4880A93m1l7j1J1J5MkKPKnmJ2K7K8J1mj2j3j8k1j8oRK1K5J5nk2k1oQJ2Opk6l6k5PL4M0L1K8
4861B08L7M4L3Jl6m8k8OK0Kk3k4qJmj3j4j2j4oJ6L5L5K1J1J2J0MjKJj2k1j4KNj2l3m3l4j0
$$ y = [157, 140, 120, 96, 86, 106, 147, 176, 170, 142, 122, 122, 139, 168, 206, 241, 255, 241, 206, 161, 113, 76, 67, 93, 130, 153, 151, 135, 119, 106, 97, 97, 110, 131, 149, 152, 137, 118, 115, 133, 163, 187, 198, 205, 218, 238, 255, 257, 249, 242, 242, 246, 243, 223, 189, 155, 137, 142, 163, 183, 194, 199, 201, 198, 192, 198, 231, 288, 343, 375, 380, 374, 373, 377, 373, 355, 335, 327, 324, 305, 266, 231, 219, 219, 207, 181, 160, 152, 140, 116, 88, 74, 75, 83, 95, 110, 129, 148, 163, 162, 142, 120, 122, 152, 188, 216, 237, 254, 256, 237, 212, 194, 177, 150, 119, 102, 106, 124, 153, 188, 212, 209, 189, 189, 218, 247, 247, 221, 191, 167, 144, 123, 116, 126, 145, 166, 187, 208, 222, 223, 215, 206, 200, 201, 205, 207, 198, 178, 154, 129, 100, 71, 55, 67, 99, 132, 152, 164, 181, 207, 230, 241, 239, 232, 234, 246, 257, 247, 215, 181, 167, 172, 182, 196, 223, 259, 281, 275, 250, 222, 194, 169, 161, 179, 201, 202, 184, 174, 186, 207, 222, 235, 247, 249, 233, 206, 186, 177, 170, 159, 152, 153, 159, 166, 172, 178, 183, 183, 176, 159, 131, 103, 91, 103, 130, 155, 168, 173, 177, 176, 163, 139, 118, 106, 105, 110, 125, 151, 177, 191, 185, 166, 139, 116, 109, 120, 144, 173, 207, 246, 276, 282, 265, 243, 222, 193, 152, 115, 104, 115, 130, 134, 132, 134, 141, 143, 138, 134, 146, 173, 201, 212, 208, 196, 183, 165, 144, 126, 120, 129, 150, 175, 190, 185, 163, 142, 136, 144, 156, 162, 155, 129, 93, 68, 75, 109, 149, 180, 208, 245, 289, 322, 323, 287, 239, 211, 217, 237, 239, 216, 192, 184, 185, 181, 168, 154, 142, 128, 122, 138, 173, 208, 229, 240, 252, 262, 266, 265, 267, 268, 256, 235, 221, 223, 228, 216, 183, 140, 106, 96]
4843I6K1M7N4L9K1J1POJpj8l3m0l7k7j9j4j0oJJ1K1K7K6K2Rpk1k3j8j3oLP%oLJ6J4nj1RK6
4825A77J6kkJ2Nk0l9l1j5nljkooLPOPJ3J6Oj1k0j7mJ1K0J2mj0NK9L7K1jj1oJlj8l1k7qJ0J7
4805A28K2L2M2L6J3j2l1l7l3j5J3L6M3K5mk5k0ML1M0K8Jk3k3jK4K7Qj6k9l1k4oRKl0m8k8J4
4788A42L6L1J6J1Qjj1rpj0j8j5JK0K5J8Pok4l5k2J3M2L4ml6l2oJ7K1Pj6l0k5pRJ6J6J5Npj2
4770A77olj7l2l7l1k5j7LK7L9L9M0M2L1Rpj2j5j9j3JJ0OLPKj6l3l3k3j1KJ8K2PpJK0L1L1L2
4751B43L2J7pk2k7k8k4LL8N3L4J2J1J7Kk6l9k8qOJ1Pj1l1l1qJ5J5nk9m0k7%K3K2PjPK3K9K3
4734B58Jl0n5n3l0pqj5qJ0J8J1OJ0J4J3J3K1K4J3oj5qRK2J9Jj7j0RJ5Jj0mN%jJ6L4K6K%K2
4715C16L3J0j8k8k3l0n0n9m0nL0M6M3K5J4J7K5K3J1Jqk2l6m1l2j0PJ1JqlJ6L1K6Kk9m9m9k7
$$ y = [96, 117, 164, 218, 257, 278, 289, 296, 302, 303, 296, 278, 245, 205, 168, 141, 122, 108, 98, 92, 93, 104, 125, 152, 178, 200, 209, 202, 181, 158, 140, 127, 121, 124, 131, 131, 125, 128, 144, 158, 153, 142, 151, 177, 193, 191, 189, 201, 206, 186, 147, 116, 101, 96, 93, 92, 90, 84, 78, 81, 88, 94, 101, 114, 130, 136, 125, 105, 88, 84, 95, 115, 127, 123, 113, 118, 147, 184, 205, 204, 193, 187, 188, 185, 167, 136, 109, 101, 111, 128, 150, 182, 224, 260, 273, 261, 230, 193, 160, 145, 158, 194, 237, 262, 258, 233, 213, 217, 248, 288, 316, 317, 294, 271, 270, 294, 321, 329, 313, 284, 253, 229, 223, 232, 234, 204, 156, 128, 142, 178, 209, 225, 236, 244, 243, 232, 223, 216, 206, 188, 173, 174, 194, 219, 237, 244, 238, 214, 179, 157, 170, 212, 246, 242, 206, 174, 168, 185, 206, 213, 197, 167, 142, 135, 144, 160, 176, 191, 196, 189, 177, 171, 168, 151, 119, 82, 51, 26, 9, 12, 39, 78, 117, 157, 199, 230, 239, 232, 220, 205, 186, 173, 174, 184, 190, 193, 200, 202, 186, 153, 120, 97, 86, 88, 106, 128, 135, 128, 129, 149, 180, 211, 243, 275, 292, 285, 263, 236, 208, 184, 187, 225, 278, 312, 324, 335, 352, 354, 328, 289, 261, 253, 259, 270, 277, 266, 235, 204, 196, 211, 226, 221, 192, 152, 125, 125, 148, 170, 177, 176, 183, 206, 235, 258, 259, 229, 174, 121, 91, 84, 76, 61, 53, 63, 81, 92, 98, 108, 122, 135, 148, 169, 193, 206, 200, 185, 177, 186, 208, 227, 228, 211, 201, 210, 225, 226, 216, 212, 217, 217, 216, 232, 266, 292, 294, 294, 316, 349, 359, 341, 313, 290, 260, 210, 151, 111, 106, 136, 182, 225, 250, 264, 281, 306, 329, 340, 341, 333, 311, 275, 234, 202, 192, 199, 210, 211, 203, 200, 216, 247, 273, 275, 246, 197, 148, 121]
4698A21RL5L7J7mj5j2nlpj1j2j5k4l1k8j2KJ1J2J2Lrj7j6oQK3L5K4ok4oL2N0K4j5l7k5%K6
4680A41M2N1N1L3Lk9l6k0lrl0l3rK0K4J0oj4j9k3j8jK0L5L5K0kj7j7roj0j8k4k6k1j1JRJ4
4663I8J9K0J5J1J5K2K0kk7l6k5lJ2QJQL0M1K3nqK3M9L6Mj6j7j8k7k7j2nj6k6k2j2j5j7qJ1
4646A22J7QLPPkj4j4n%mrqKJ9L1L0J5nk5l8l8j8RL1M0L8L1K0QJLJ0J5J2kk3l3k9j8j0mNR%
4626A94j0KL5O0N1K3%j0j3j1oJLlj2k2k4j6kJpj5j1prj3j6k2l1k7jK5K8J9J9L0L0J8J1J3M
4608B79k0l8l0nJ7K1J5MjPK0K3%k9m4l0%K7L6K6Rrk2k6j5KJ1lk5k5kK5K8Pj5k1pJ4K6K0P%
4590B57jmrp%kj3k3k1j1JRQnk1k3lJ5J5rm1o1n6l1KJ9K2K9M1M9M6L9L4K3Kj4k4l1l8l5j5L
4572A16J3K1K9K3lk8l0j5orqLJ0J4K2K8K7J8RJqj4j2pj3k3j8lPJ0K0L9M3K4KommpmNJ0Qkj5
$$ y = [121, 130, 165, 202, 219, 215, 200, 188, 183, 180, 173, 162, 150, 135, 111, 80, 52, 40, 42, 53, 65, 77, 80, 71, 54, 38, 32, 40, 63, 98, 122, 116, 92, 86, 118, 168, 192, 177, 140, 115, 115, 141, 183, 234, 285, 318, 321, 292, 256, 236, 233, 224, 194, 161, 152, 172, 196, 206, 200, 186, 167, 144, 126, 125, 145, 180, 215, 235, 233, 216, 199, 190, 184, 174, 156, 132, 106, 85, 74, 75, 84, 98, 117, 137, 152, 163, 178, 200, 220, 218, 191, 155, 130, 127, 139, 147, 148, 156, 186, 227, 250, 245, 237, 260, 309, 345, 349, 333, 316, 298, 271, 244, 232, 227, 211, 185, 163, 151, 136, 119, 111, 122, 139, 147, 150, 157, 164, 162, 148, 134, 129, 129, 125, 116, 108, 110, 129, 160, 190, 205, 200, 175, 137, 99, 81, 90, 121, 161, 199, 230, 250, 258, 259, 262, 272, 287, 299, 297, 274, 241, 212, 194, 184, 180, 185, 194, 194, 184, 186, 221, 281, 332, 355, 355, 345, 332, 321, 315, 316, 319, 316, 304, 282, 258, 242, 240, 241, 234, 219, 208, 201, 192, 179, 163, 141, 110, 83, 82, 107, 135, 154, 173, 203, 233, 251, 262, 275, 279, 259, 221, 191, 186, 203, 224, 239, 243, 242, 249, 269, 292, 292, 263, 219, 189, 189, 216, 252, 278, 287, 278, 256, 230, 215, 217, 228, 225, 200, 175, 173, 198, 226, 233, 218, 197, 190, 204, 230, 250, 257, 257, 256, 252, 243, 236, 236, 234, 221, 198, 177, 166, 167, 176, 184, 179, 158, 135, 132, 147, 162, 153, 112, 51, -5, -36, -34, -15, 7, 36, 77, 126, 172, 211, 245, 268, 270, 256, 232, 201, 163, 128, 113, 116, 129, 150, 179, 202, 199, 171, 141, 126, 120, 111, 103, 106, 116, 130, 152, 180, 207, 225, 234, 235, 227, 213, 201, 194, 181, 158, 140, 137, 144, 154, 174, 213, 256, 280, 282, 276, 272, 268, 261, 257, 262, 272, 280, 278, 263]
4552B63k2k1j1%QJ2J1ok3k2mNnj5oJ6K2Pj2k0j1KPKj1j5oJ1J8J4kk3l8l3rJ6K8K8K2J1jnR
4534A91K8L4K6J5J0kj6k3k0j2mPJ8J9J4QNok0k4lK4L8L3J6mk6m5n1l3nJ4J7Pkk%oj3rQK3J5
4515B44j5m1m2k1MJ7J9RlpPK7K9Oj4j3kmj7j6MK1K1J5J4J0qk9l7k7j1MJ9K8K1PjMK1L5M2L1
4497C51Nk0l3l0k2j7j8k7l1j8J2L6L4J8PJrj9j5jNpk0k2j8j5jK7N1N0L0Rpk1k7k2j4j5k6l5
4480A26k8j1J2L5M2K9Lj2j2kLKkqqKJ4J2JrkQRPJ3K8L3J8nj8j8j6j7j5JK7M8N0L0jk8m1l6
4461B64j7jNnj9l0k7j4nj5l2l9k4qnj4j4LK5L5L6L6L0Qk1l4k1J0L5M5L9K6J0%lLNJplJ0K1
4443B89J5pl0m1m1l3k2j0KJ2J2Mrj9j4MK3K9K2J2Jj5l3l5j4J5K4Rj1j1KJ2J2Moj5j2QL7M2
4425B12J6j5k3qOJmMJ6J6Nnj1k1l3k9j2QJ2PQJ5K0J7Oj0k4k5oJ5J7%j4rLQMMPNpj7k2k7l6
$$ y = [263, 241, 220, 209, 209, 217, 229, 240, 234, 211, 189, 185, 190, 185, 170, 164, 180, 202, 209, 197, 177, 166, 168, 175, 177, 166, 151, 145, 156, 174, 188, 186, 163, 125, 92, 83, 99, 127, 155, 177, 188, 187, 182, 191, 219, 253, 279, 294, 304, 302, 286, 263, 243, 231, 227, 234, 252, 271, 285, 293, 298, 292, 272, 248, 245, 269, 307, 340, 356, 352, 326, 281, 230, 197, 192, 206, 223, 230, 228, 226, 226, 220, 207, 198, 206, 229, 244, 229, 188, 146, 125, 129, 146, 165, 174, 171, 164, 171, 198, 227, 233, 219, 206, 204, 200, 183, 167, 171, 192, 213, 228, 242, 252, 244, 215, 178, 151, 140, 144, 163, 191, 212, 219, 218, 222, 243, 278, 320, 351, 356, 336, 303, 273, 251, 234, 216, 189, 158, 140, 152, 188, 222, 240, 247, 248, 239, 220, 205, 204, 209, 202, 182, 160, 142, 127, 126, 153, 204, 254, 284, 293, 286, 265, 238, 216, 202, 187, 161, 126, 98, 87, 99, 134, 176, 205, 208, 196, 184, 182, 185, 187, 185, 177, 169, 171, 185, 197, 198, 189, 187, 195, 204, 211, 224, 252, 285, 303, 298, 280, 262, 246, 229, 214, 215, 242, 290, 340, 370, 369, 341, 300, 264, 247, 246, 251, 246, 227, 197, 170, 156, 151, 136, 104, 65, 41, 33, 28, 14, 0, 3, 28, 63, 99, 135, 165, 173, 152, 118, 97, 107, 142, 187, 226, 252, 262, 262, 259, 262, 267, 268, 261, 258, 268, 289, 304, 297, 267, 226, 185, 152, 130, 120, 122, 134, 146, 150, 141, 122, 108, 112, 135, 164, 186, 198, 199, 184, 151, 116, 102, 117, 141, 150, 139, 128, 130, 142, 154, 158, 152, 137, 125, 133, 170, 212, 228, 213, 190, 182, 188, 189, 185, 189, 205, 221, 226, 221, 210, 189, 156, 127, 115, 123, 135, 142, 150, 165, 185, 202, 208, 198, 174, 149, 143, 158, 175, 175, 161, 152, 155, 163, 167, 171, 178, 183, 176, 159, 137, 110, 74]
4406G4l8k3QK9K4Lj4rJ0L1M3L9K1mj9j5NK2L0K9K2PqqNJ0pk3j4J1K1Oj3j6nJlpoorrlKqk1
4386A65j5J1L1K2krOK0Pj8k7k1j7j6kK1L0J3olJ6K3Jk8l7j7QJ9J1JJKpk2k3qOJ0OKLJ2K8L8
4367B35K4j0l7l5j9rKK3M2L5Nj4kK0L0K5J9J1nk2k6j7j4l0m1l0kJ2Jj5jL0M3J5k8m5l3j9j8
4350A00j6kJ4J2KJ1L4M4L1J3J4J9Pj8k9j5NJ2J1J2K1K1Nk1l8l8j5J2K6J5j0k2j1OJ0jj2j2
4333A97rj1j7j4OK9L3J6KJ1L1L9L1J5mk7m4l5j0Olj8j9j2j2j2LL0M5M4L6K5Oj9k8j9j2j8k7
4317B35k3j3pnkJkkQK0K0J1MMKkLJ4J9J0jkjrk2l3l7l0pK6M6M1K4K2L5M0K1nj8j4rnJNrl3
4297C21m4k4J2K8J4j0j7kJ3J4J0QMj6l9m4k0PJ1mj5j6k3l8l9qL3M8L4Pj1k2k5j5jJ0QJmqr
4279A29lMNmpLJ5J2rk8k8j1RJ5OokK0L3J8j5l3k0OJ6Kj5j3QL1M3M5L7K1kk2k2oJ2J5Rkqj2
$$ y = [74, 36, 13, 21, 50, 74, 77, 63, 54, 64, 95, 138, 177, 198, 194, 175, 160, 165, 187, 217, 246, 268, 275, 267, 259, 264, 274, 267, 244, 230, 241, 262, 268, 255, 239, 234, 235, 232, 225, 219, 213, 204, 195, 192, 194, 186, 165, 150, 161, 192, 214, 212, 203, 209, 229, 236, 218, 191, 170, 153, 137, 135, 156, 186, 199, 193, 190, 206, 229, 230, 202, 165, 148, 156, 175, 186, 187, 188, 190, 183, 161, 138, 130, 136, 146, 152, 154, 157, 169, 197, 235, 259, 249, 212, 177, 158, 149, 151, 174, 216, 251, 256, 242, 240, 260, 290, 315, 334, 345, 340, 318, 292, 275, 261, 231, 190, 160, 158, 170, 171, 156, 155, 185, 228, 243, 215, 170, 137, 118, 100, 84, 82, 96, 108, 110, 121, 155, 199, 230, 243, 257, 276, 283, 265, 236, 221, 226, 238, 249, 261, 282, 303, 308, 287, 249, 211, 196, 208, 234, 249, 239, 217, 206, 212, 222, 221, 209, 197, 188, 177, 160, 146, 152, 181, 214, 230, 232, 243, 274, 313, 344, 359, 355, 328, 284, 249, 239, 245, 242, 224, 205, 193, 181, 169, 172, 202, 247, 291, 327, 352, 358, 339, 311, 292, 280, 262, 235, 212, 199, 192, 187, 185, 186, 184, 182, 190, 210, 230, 241, 245, 249, 251, 249, 252, 266, 285, 295, 294, 292, 291, 282, 260, 227, 190, 160, 153, 179, 225, 266, 290, 312, 347, 387, 408, 403, 385, 371, 362, 357, 358, 363, 354, 321, 277, 253, 265, 293, 307, 297, 280, 278, 291, 305, 315, 323, 327, 311, 272, 228, 208, 215, 226, 222, 207, 191, 168, 130, 91, 83, 116, 164, 198, 205, 194, 172, 147, 132, 131, 141, 149, 150, 146, 138, 129, 126, 130, 135, 131, 124, 127, 142, 154, 145, 117, 89, 78, 87, 102, 108, 102, 100, 120, 153, 171, 156, 123, 103, 109, 125, 127, 112, 99, 107, 138, 181, 226, 263, 284, 282, 260, 238, 232, 244, 259, 268, 266, 258, 246]
4260B46j5j8k1k1j3nKKJLQJ4J8J3LjNJ3J0mpjLrk4l1l1k9j9kJ3J2QJ8L6M1L0K1K4L0K8K1J7
4241C89J4Jj6l0l7l4j8jQLkMJ4J9J2mk4l9l7j9l%proqk0l0l1k2j1JRJ1ROKKOJ0J2J4J8K0J3
4222A89rk7k0NJ9J3LQJ9K3J6RLpj2mJ2J9QjLJ4J7R%oj3j5j3pKJ2K2J8%j6j5kKj0k3k9k6j3
4203A77NK4K2Jj5rPJ0LJQJ0RJ2J9J7Jj4j6j4k2k7k0oJllMJ3K0K0J7O%QK7L2J7lqmqk5l7l7
4183B20l1k3kK6M1L1Qllrj6j6ooj5j3QK9L0K3J7J1lk2l3k9j8lJ1Rpk1j4LRMMMj5m6n5l1MK1
4164G3K6L4M3L2Oj4j4%K3M0M4L0J4J2J4Nj5k7k6k7k9k3NL5M5L3J8Noj7j6LK0J8kj5rLJj1j6
4146C15qOJ6J7J2jj3j3pj1k6l6k9j5j3j6j3JJ1J7K1K1J5ONPLKJ1K4K0%j4qNMj1k6k5j1MMn
4128B46nJ1K2Ok6l4j4PJ2J3K3L0J9Joqk0l9m4l0j2m%LOJ5L3N1N7M4J9pk4k5j5j0k3l7k8JK5
$$ y = [246, 231, 213, 192, 171, 158, 153, 155, 157, 158, 161, 169, 183, 201, 214, 217, 216, 221, 234, 244, 240, 233, 232, 235, 226, 202, 171, 140, 111, 92, 90, 103, 115, 123, 141, 177, 218, 248, 269, 293, 323, 351, 372, 389, 403, 404, 388, 358, 321, 287, 269, 268, 276, 279, 277, 281, 295, 314, 326, 322, 298, 259, 222, 203, 200, 200, 193, 184, 178, 170, 150, 120, 89, 67, 56, 57, 66, 77, 86, 92, 94, 96, 102, 112, 124, 138, 156, 176, 189, 180, 153, 133, 138, 157, 170, 173, 181, 200, 223, 239, 248, 251, 244, 232, 228, 240, 259, 267, 266, 269, 283, 300, 309, 309, 303, 290, 275, 262, 255, 257, 269, 291, 309, 309, 293, 278, 276, 278, 268, 245, 216, 190, 177, 182, 206, 228, 229, 214, 205, 212, 222, 225, 226, 234, 244, 253, 265, 284, 301, 302, 288, 272, 258, 236, 209, 189, 183, 184, 181, 178, 182, 195, 215, 235, 252, 258, 258, 266, 293, 325, 342, 339, 331, 327, 319, 294, 257, 220, 189, 166, 164, 190, 231, 262, 270, 267, 264, 255, 239, 223, 217, 211, 196, 183, 191, 220, 250, 273, 290, 301, 298, 276, 243, 214, 196, 193, 204, 213, 206, 185, 171, 174, 183, 187, 191, 195, 180, 134, 79, 48, 52, 73, 99, 133, 176, 208, 214, 200, 186, 186, 209, 249, 293, 323, 337, 349, 363, 368, 353, 326, 300, 273, 244, 221, 226, 261, 306, 339, 357, 362, 356, 339, 323, 326, 346, 364, 362, 347, 338, 341, 342, 331, 315, 307, 313, 329, 346, 358, 357, 344, 331, 324, 313, 287, 251, 222, 207, 194, 178, 165, 166, 177, 194, 215, 236, 251, 257, 262, 269, 272, 274, 285, 309, 329, 329, 315, 307, 312, 316, 305, 279, 254, 243, 247, 251, 246, 241, 252, 274, 280, 254, 220, 206, 213, 225, 238, 261, 291, 310, 311, 305, 297, 277, 238, 194, 164, 152, 148, 148, 151, 157, 172, 205, 256, 313, 357, 376, 369, 345, 320, 305, 295, 272, 235, 207, 208, 233]
4110B33K6J5Mqk0k3j1KNLMM%jJ3L1L7K9J5OQK1L7L8J6j9n0o4o2m4j7QJ6J0K%QJ8K7K1Np%K3
4091C59L9L7K9K2J2joJ0L5M3L2J8J8L0L8L3K1J2J3K1L8O6J06J45J69J82K01K37K92L70M84
4077C105O40Q29J034J231J373J389J213Q33L12k46p29j046j172j146j046r27p99o61n26m11
4069C250l25k55j96j44j05p3m7k4NL1M3L1J7K3N7R9J30J53J82K18K60L12L87M85O05P52R48
4057F819J230J618K121K731L393L982M287M080L235J820R3j581k877l612l789l565l134k649
4049A4202k186j774j419j119q71o73n20m09l25k56j93j36p9k8J1L6O2J01J50K00K51L12L85
4039E722M69N72P08Q81J085J327J652K122K788L676M792O089P391Q355Q507P448N090J782
4031G0456j769m792o770p590p473o776n821m838l949l193k556k016j568j226r76p93o44n15
$$ y = [233, 259, 274, 278, 270, 250, 227, 216, 218, 223, 226, 230, 234, 234, 233, 246, 277, 314, 343, 358, 364, 372, 393, 430, 468, 484, 465, 415, 351, 289, 245, 228, 236, 252, 262, 264, 264, 272, 290, 317, 338, 343, 336, 336, 359, 398, 435, 464, 486, 498, 497, 491, 501, 536, 579, 611, 629, 647, 677, 715, 748, 769, 781, 794, 815, 853, 919, 1025, 1170, 1339, 1521, 1722, 1959, 2251, 2621, 3105, 3745, 4574, 5608, 6839, 8212, 9601, 10814, 11647, 11959, 11713, 10984, 9938, 8766, 7620, 6574, 5647, 4848, 4187, 3661, 3250, 2925, 2670, 2474, 2330, 2225, 2152, 2105, 2081, 2086, 2117, 2160, 2191, 2208, 2231, 2288, 2387, 2517, 2670, 2852, 3070, 3330, 3642, 4029, 4514, 5119, 5871, 6819, 8049, 9667, 11788, 14519, 17912, 21894, 26181, 30261, 33496, 35316, 35409, 33828, 30951, 27339, 23550, 19985, 16851, 14202, 12016, 10242, 8823, 7704, 6833, 6160, 5640, 5231, 4906, 4650, 4457, 4321, 4242, 4214, 4225, 4261, 4323, 4424, 4574, 4774, 5025, 5337, 5722, 6191, 6763, 7471, 8352, 9437, 10764, 12416, 14538, 17326, 21002, 25794, 31883, 39274, 47629, 56136, 63584, 68674, 70456, 68687, 63895, 57125, 49535, 42062, 35286, 29465, 24627, 20678, 17485, 14929, 12913, 11345, 10119, 9143, 8350, 7706, 7191]
4024G191l97k85j87j14o7k8K5R5J73K47L10L71M35N23O47Q23J054J348J718K200K859L759
4014B2700M936O374P940R326J0031R510P451M014j40m111p120q778r136q551p472o265n139
4007B5570m164l338k647k086j646j302j031q13o41n07m01l16k50j88j16l9K8P6J20J73K32
3998F714K94L68M80O41Q32J041J295J644K131K793L666M777O078P372Q294Q387P279M898J578
3989G0562j997n045p018p786p595o842n871m892m000l223k559k002j561j237j002q12o53n29
3981E938m40l62k82k08j64j41j15p6k8J3N0Q9J31J84K51L40M47N74P32R41J229J616K110K703
3971A5532L339L891M154L901L009J551j94j856l111l797l928l656l181k666k196j791j440
3964G561j142r00p19n82m69l70k86k26j93j69j40j01o6n5o1n9l7oJ9L1M4N8P2R8J53K30L06
$$ y = [7191, 6794, 6509, 6322, 6208, 6141, 6113, 6138, 6233, 6406, 6653, 6963, 7334, 7769, 8292, 8939, 9762, 10816, 12164, 13882, 16082, 18941, 22700, 27636, 34010, 41950, 51276, 61307, 70817, 78268, 82282, 82142, 78031, 70911, 62133, 52997, 44446, 36974, 30709, 25570, 21406, 18068, 15421, 13335, 11689, 10387, 9356, 8543, 7902, 7395, 6994, 6678, 6428, 6240, 6124, 6085, 6113, 6189, 6309, 6482, 6714, 7008, 7376, 7856, 8497, 9329, 10370, 11665, 13309, 15440, 18233, 21899, 26676, 32754, 40126, 48420, 56807, 64086, 68984, 70562, 68565, 63520, 56502, 48716, 41121, 34279, 28408, 23516, 19516, 16293, 13734, 11732, 10171, 8934, 7932, 7120, 6467, 5938, 5498, 5136, 4854, 4646, 4482, 4341, 4226, 4150, 4122, 4135, 4185, 4274, 4405, 4589, 4840, 5180, 5627, 6201, 6933, 7874, 9103, 10719, 12829, 15532, 18871, 22762, 26916, 30817, 33826, 35377, 35183, 33327, 30216, 26419, 22491, 18835, 15654, 12988, 10792, 9001, 7561, 6419, 5519, 4800, 4218, 3749, 3379, 3093, 2867, 2674, 2505, 2365, 2264, 2198, 2143, 2082, 2023, 1986, 1980, 1999, 2030, 2074, 2132, 2204, 2302, 2455, 2685, 2991]
3952B991L69M51N83P72R78J156J256J235J055P08K29l06p96j139j288j258j121r47p82o43
3943C503n36m47l61k73j95j45j23j22j22j14r8q2p3o6n2l5l4m2m3k6oNJ3K6L1J5j0j5J0L4
3930F17L1Nk1k8k7k5l3m3m8m1j9OK4L1K3Rlj0j3j8k1j6nKLK%j0k1k3j4j2k7l4j5J8L3K2PN
3913C11QPJ0J9K4J2moOJ2Lopkoj7l1m0l5j7JJ4K4L4L2Qk0k2OL2L2J6MKK%%lj6l2l9l3k5k6
3894B32l0k4pPJ5J8K2J8jl0m8l8j2PJ1J1J5J8J2%nlloroPJ8K3J5JroMJ6J8Rqk1j6OK9L7L2
3875C19K3J5Okrj6k8l3k4j0nj3j9j5j3j7k1rNJ0MKQJ1jj7k1j0OJ7J9J8J6J2%k1l4k8kK3K7
3857A73J0oq%Kj2k8k8oJ9K9J8QJ3K4K1PKRNj3k5pK0K0kj4lOnj5rNPOJ5K6J6mj0NJ3jj7k0j4
3837B32j0plnj7k5j2J9M6N8N3L4Pj8k3j2%lj7k3j4lpk6l7k2MJ5PjRL1M7M6L1Qj0j7j7k6m0
$$ y = [2991, 3360, 3811, 4394, 5166, 6144, 7300, 8556, 9791, 10846, 11554, 11783, 11477, 10681, 9542, 8254, 6996, 5875, 4928, 4146, 3503, 2967, 2520, 2159, 1886, 1691, 1546, 1423, 1301, 1179, 1065, 967, 885, 812, 746, 694, 659, 625, 583, 540, 514, 508, 513, 526, 552, 583, 598, 588, 573, 583, 617, 648, 653, 632, 604, 577, 552, 519, 476, 428, 387, 368, 374, 398, 429, 452, 461, 458, 448, 435, 417, 396, 380, 375, 377, 380, 382, 382, 372, 351, 328, 314, 302, 275, 241, 226, 244, 277, 299, 306, 311, 319, 326, 336, 355, 379, 391, 387, 381, 387, 399, 402, 396, 389, 387, 381, 364, 333, 293, 258, 241, 242, 256, 280, 314, 346, 354, 334, 312, 318, 350, 382, 398, 402, 404, 406, 406, 406, 403, 387, 355, 316, 283, 258, 232, 202, 178, 171, 178, 193, 211, 233, 251, 250, 220, 172, 134, 122, 129, 140, 151, 166, 184, 196, 196, 191, 188, 185, 179, 170, 164, 171, 189, 212, 227, 228, 219, 213, 217, 233, 251, 260, 252, 231, 215, 221, 250, 287, 319, 342, 357, 363, 361, 352, 336, 308, 275, 251, 241, 236, 223, 204, 189, 176, 159, 138, 129, 134, 144, 148, 150, 158, 169, 168, 151, 130, 120, 126, 143, 162, 180, 196, 208, 208, 187, 153, 125, 123, 146, 173, 183, 177, 169, 169, 171, 159, 131, 103, 97, 116, 145, 163, 171, 184, 208, 229, 236, 238, 247, 252, 239, 214, 207, 227, 247, 245, 231, 228, 234, 229, 214, 205, 210, 217, 223, 238, 264, 280, 276, 266, 271, 284, 283, 266, 246, 232, 222, 215, 212, 207, 190, 165, 153, 172, 218, 276, 329, 363, 370, 352, 329, 317, 317, 314, 297, 274, 260, 257, 250, 224, 187, 165, 169, 184, 191, 190, 199, 230, 277, 323, 354, 362, 352, 335, 318, 292, 252]
3819B52l5pK2K3Jj6j8j5k5m4o0n8l7jL9O8P7P0N0K8Qoj5j7j0MJ0Lnolj0k1k6j9rNK1K6Oj9
3802B31k2JK1J2pj3lMkrrLJ6J7Mj9l2l1k3j7qQK7L7L4K5J7J4J6J6Poj2j1j3l2m8m8k9rQK6
3783A41L8L8L0K3J9Lk8n3m8j8OQlnQK1K0Jk4l7k3J0L5K7%j9qJ2K1K3K9K9Pk8l7rK2K1mj6q
3766B24Klj0q%NJ0J6J4LrnJ4L3L0Qj8k7j3NOmmOMj6l4k5%K0K4K3K0Rpj9j6mJ1K6L5K6Pj0j6
3746C33k0l0l4k5j1oj2j8j8j5j8j9j1J4M2N5L6jk8l0k2k1k5j1K2M5M2J5qj7j2JJ4J8Qoj4j0
3730B03JRJ6K3K8K4Ok0l6l0pJ3J0j5l8m7l7j9JJ6K3K9M0N0M0Pk1k6rjj2k5k2kJ5J5kk6m5m6
3712H3k9%K6M0M5M3M2L6K1mk4l1k7k3k0j4mLKKJ4L5M6L1%k8l3k3rm%KjpoKOkj6k1j8j7j5k
3693A01J5J8MpnKjpjJ7L2L4K6Qj7l4k9pJ6L0L7L2J0j4k3oJ1J0nj7j3kPPkj7k7k5j4o%MRNl
$$ y = [252, 217, 210, 232, 255, 256, 240, 222, 207, 182, 138, 78, 20, -17, -18, 21, 89, 166, 236, 286, 314, 322, 316, 301, 284, 274, 278, 288, 291, 286, 280, 277, 267, 246, 220, 201, 192, 197, 218, 244, 250, 231, 209, 210, 231, 243, 236, 223, 220, 224, 222, 213, 204, 207, 223, 240, 244, 225, 193, 162, 139, 122, 114, 122, 149, 186, 220, 245, 262, 276, 292, 308, 315, 309, 297, 286, 273, 241, 193, 145, 116, 107, 115, 141, 179, 217, 247, 270, 289, 292, 264, 211, 163, 145, 151, 159, 156, 151, 159, 180, 200, 201, 177, 140, 117, 127, 162, 189, 189, 170, 162, 174, 195, 218, 247, 276, 283, 255, 218, 209, 231, 252, 248, 232, 224, 226, 223, 213, 205, 205, 210, 220, 236, 250, 253, 244, 239, 253, 286, 316, 324, 306, 279, 266, 271, 277, 273, 269, 275, 279, 263, 229, 204, 204, 224, 248, 271, 291, 300, 293, 274, 258, 254, 265, 291, 326, 352, 359, 349, 333, 313, 283, 249, 224, 213, 207, 195, 177, 159, 144, 126, 107, 96, 110, 152, 207, 243, 242, 214, 184, 162, 141, 116, 105, 127, 172, 214, 229, 221, 204, 192, 193, 207, 225, 233, 227, 213, 203, 204, 213, 229, 252, 280, 304, 310, 290, 254, 224, 217, 230, 240, 225, 187, 140, 103, 84, 85, 101, 124, 153, 193, 243, 283, 290, 269, 243, 234, 233, 221, 196, 174, 172, 187, 202, 200, 174, 129, 83, 54, 54, 80, 120, 165, 208, 250, 286, 307, 303, 279, 248, 221, 198, 178, 164, 160, 163, 165, 167, 181, 216, 262, 293, 293, 265, 232, 209, 200, 196, 196, 198, 197, 190, 184, 186, 192, 190, 174, 153, 135, 118, 103, 101, 116, 134, 138, 131, 126, 128, 127, 120, 119, 136, 168, 202, 228, 236, 219, 185, 156, 149, 165, 195, 232, 264, 274, 260, 237, 231, 242, 252, 247, 230, 217, 215, 222, 229, 227, 210, 183, 158, 144, 138, 138, 142, 151, 156, 153]
3674A53oKJ3J7QkpnjOJ2J6J0LKN%j4k2rJ5K8K0Kj4k3k4j5jOJ0K3M7O3N2K2j1l5n1n4l9k1j4
3655A67k0j9pOJ0J1J6K2K1J7Pj1l3m1k2J2M0M5L1Oj3k3j9pOJ5Rj0l1l4k0kLLJ4L7N2M4J9m
3638B97j5j7j8j3nOLj1k4k0JJ9J7Lorj5j7mK2L5J4j8l2j7jjj4j7j0moqkKkj0r%PQM%jPK5L8
3617A82L0Qonlj0j3qlj6l3l0qRPJPJ6J7J0J1J6J3Jj3j7j4j4j3j2qnqrnRK4L1L0L0L5L7K6J
3598B98k6l8l1oK4M7N0M1K9K2Qj2k6k2%J2Ooj1j1k3m0l7j1J2Jl0m4k7pjQL0M5L2Jj2oMJ1L2
3581B86N6N5J6k5k3OK1Mk3l3k9k2j1LQKnKPlk7l6j6J4K2Oj8k9k5k0j2MK1K9K2J2J2J4Lk0l9
3563B09l8k0lQJ4K1K5J6lj8j9j0rj8k0jK4K4nl0k2J0K4Lk7l8l0k3j8nK2M1L7J9PQJ4J4J0J0
3545B03J2RPJ6L5M4L4Nj9l1l2k8j7nkolJ1J6%j8j5OK2J7RNNJkkpk4l3k4o%j0j7rQK2K3J5N
$$ y = [153, 147, 149, 162, 179, 187, 185, 178, 173, 172, 178, 190, 206, 216, 219, 221, 226, 226, 212, 190, 181, 196, 224, 244, 246, 232, 209, 185, 170, 169, 175, 185, 208, 255, 318, 370, 392, 381, 346, 295, 241, 202, 181, 167, 147, 128, 121, 127, 137, 148, 164, 186, 207, 224, 231, 220, 187, 146, 124, 136, 176, 221, 252, 258, 245, 222, 203, 196, 202, 217, 226, 216, 185, 151, 131, 129, 132, 135, 149, 186, 238, 282, 301, 297, 282, 265, 247, 234, 229, 235, 238, 227, 203, 183, 184, 203, 220, 223, 217, 208, 193, 176, 172, 194, 229, 243, 225, 193, 176, 175, 174, 160, 143, 133, 129, 123, 115, 113, 115, 113, 103, 94, 94, 101, 109, 113, 113, 112, 119, 144, 182, 212, 220, 214, 209, 206, 196, 183, 175, 172, 156, 123, 93, 85, 94, 101, 102, 109, 125, 142, 152, 163, 179, 192, 193, 180, 163, 149, 135, 122, 110, 102, 97, 89, 80, 75, 84, 108, 139, 169, 199, 234, 271, 297, 298, 272, 234, 203, 197, 221, 268, 318, 359, 388, 410, 418, 406, 380, 358, 358, 370, 376, 370, 359, 348, 325, 285, 248, 237, 249, 250, 220, 176, 149, 142, 141, 149, 179, 224, 256, 257, 245, 239, 243, 254, 286, 342, 397, 413, 388, 365, 371, 392, 396, 373, 340, 311, 289, 278, 281, 289, 291, 286, 288, 295, 292, 265, 229, 213, 227, 249, 255, 237, 208, 183, 163, 151, 155, 176, 205, 227, 239, 251, 265, 268, 248, 209, 171, 151, 148, 156, 170, 191, 216, 232, 229, 211, 192, 182, 173, 155, 135, 134, 158, 182, 177, 147, 125, 135, 159, 162, 135, 97, 67, 44, 26, 21, 43, 84, 121, 140, 147, 155, 169, 183, 193, 203, 215, 224, 231, 247, 282, 326, 360, 365, 346, 315, 283, 255, 238, 233, 231, 225, 222, 233, 249, 249, 231, 216, 222, 244, 261, 270, 275, 280, 281, 279, 277, 270, 246, 213, 189, 183, 183, 173, 156, 147, 155, 177, 200, 215, 220]
3526B20LJ1K0J8Qlj0j7k0j8j1njLMKMRLj8l6k9JK2K2J5J3Jk2l4j6J4K6J5lj4j9j6jJ8K7K1
3508B07J2Lor%J4J1nj7j6rroNJ7J8J6J9K1J5QJ5K6K1Lj3j1oj0k0j9j0lqj5j1kM%o%J5K7K0
3489B86jj9k3j6j0rpJPLqj4nJ1K3K1Oqj4ploj4j7pMJ1J1J6K4K5J6Jprj0j3j2LJ8K2J3OJ6K5
3469C30Rl1n8l9J1M4L7J1JJ0J7Nj4k2j8j0jJ1K2J6j0l4l9k1NK2K6J8Nqj2j2j3j6j1lPJ9L2
3452B86K9mm4n0j7J0Lk4k2J4M9N2K3j5l8l5j4QJ2OJ0K8M5M2K4Nrk2l2m1m6m4l5k3j1MK0J9
3436A63kk7k4RL8L7J1j7l0k6j0J1K6K6J9J3J7K6K9K8K1Qpj8j4NK3K4J0%OJ3Nj2j8rjKNOLn
3418C64lLlk4m5n0l9k1%J9K6K7K8K6Nk6l3rJ5Nk3l8l3k0mJ8L7L7K2R%j1j7rNJ1J3K0K6J8%
3400C26qnnpkMkk0k0jJ4J0jLOjj6k3j9j2JJ7K4J1qj0RK8K9J6%m%Llj8l0l0k4j1MJ0KrJK7L8
$$ y = [220, 223, 234, 254, 272, 280, 277, 267, 250, 230, 212, 201, 196, 195, 198, 202, 204, 208, 217, 220, 202, 166, 137, 138, 160, 182, 197, 210, 211, 189, 155, 139, 153, 179, 194, 191, 177, 158, 142, 141, 159, 186, 207, 219, 222, 216, 207, 207, 221, 232, 227, 210, 194, 185, 176, 170, 175, 192, 210, 226, 245, 266, 281, 289, 304, 330, 351, 354, 341, 330, 324, 314, 294, 275, 265, 262, 254, 239, 228, 226, 230, 230, 224, 224, 239, 266, 286, 285, 266, 243, 227, 217, 208, 201, 202, 209, 212, 204, 190, 185, 196, 219, 240, 246, 238, 224, 217, 214, 208, 194, 177, 170, 174, 185, 196, 212, 236, 261, 277, 278, 271, 262, 252, 239, 227, 230, 248, 270, 283, 289, 305, 330, 339, 308, 250, 211, 222, 266, 303, 314, 315, 325, 342, 347, 333, 311, 293, 283, 282, 293, 315, 331, 321, 287, 248, 227, 232, 254, 280, 298, 303, 295, 283, 271, 258, 242, 231, 228, 235, 254, 286, 315, 311, 267, 217, 200, 210, 213, 189, 167, 181, 230, 282, 305, 290, 252, 217, 203, 211, 223, 229, 239, 267, 312, 354, 378, 383, 374, 352, 320, 279, 233, 189, 154, 131, 120, 124, 144, 163, 161, 134, 110, 119, 157, 194, 205, 188, 158, 132, 122, 133, 159, 185, 204, 217, 234, 260, 289, 317, 338, 346, 339, 321, 307, 312, 335, 359, 369, 369, 375, 388, 393, 381, 363, 354, 353, 355, 360, 366, 369, 364, 361, 364, 361, 337, 292, 242, 203, 182, 182, 201, 227, 254, 282, 308, 313, 287, 254, 245, 260, 265, 242, 204, 171, 151, 147, 165, 202, 239, 261, 270, 270, 259, 242, 233, 238, 249, 262, 282, 308, 326, 326, 318, 313, 308, 301, 299, 303, 301, 281, 261, 260, 274, 284, 283, 286, 292, 291, 275, 252, 233, 221, 222, 239, 263, 274, 266, 256, 265, 293, 322, 338, 338, 334, 334, 337, 334, 316, 286, 256, 232, 221, 225, 235, 237, 228, 229, 256, 294]
3379B94J8j2k2j4pookoj3j3poj2mK1M5M0Ol0m2k6%J5K0K0J9J7J6J8J4kk2l0k2j0jNJ0RRJ9
3361C00L4L1Pj6j9j2j5k1j9k2l3m2k5%Mk1l3rL4N5M1J4rj6j2j0j9k9k4KK5K6RlOK3L5K7J1
3344B75ok1l5m4k5J3M4M1J5%RK1K2J4Nmj2j7j3j1j2j0%J2J1kj4k2k4l0l9m2k7OL5L9K3RRR
3327B02Jj2k0k0j6nRJ7J3PRJ4J4J0QPmk1l1k7j6mKNJ3K4K5Qk1l9l0jK4M3N1M9L2J1LLLoj3
3308C21j3j4k2l3l5k5j6rkRJ4Oj1k4k5j9j1J0L7N2L8QjJ9L9L0Jj8j7j2k0l7m4k6NK2J9J0R
3291B15Rlj5pJ8K4Mj6rOkk2l0j6qj3j5pKPRJ4Qj0l1l6j8J6M5N6M4K6J6Rpk2j9%Oj5m2m8k4
3273I9K1O4Q3O3J3l3m7l8l0k4j4jlk0l5k9mK3L0K1RJ4L0L9K9J1JKONLKlrj4k5l9m7m4k9j9
3255F1qJ0L3M4K9jj7rJ4L2L1K2J0jrj0KJ8K2Qj1k0k3k7k9k7k5k6k4j1MOjlQK5L6M2L8K2Ln
$$ y = [294, 312, 300, 278, 264, 257, 251, 245, 243, 237, 224, 211, 204, 198, 186, 182, 203, 248, 288, 294, 264, 222, 196, 196, 211, 231, 251, 270, 287, 303, 321, 335, 333, 311, 281, 259, 249, 248, 253, 263, 272, 281, 300, 334, 365, 372, 356, 337, 325, 310, 289, 270, 248, 215, 173, 148, 148, 152, 131, 98, 89, 123, 178, 219, 233, 224, 208, 196, 186, 167, 138, 114, 116, 141, 167, 176, 173, 179, 202, 237, 264, 275, 269, 248, 213, 169, 144, 157, 201, 242, 257, 257, 266, 287, 309, 323, 328, 324, 312, 295, 282, 271, 259, 249, 249, 261, 272, 270, 256, 234, 210, 180, 141, 99, 72, 78, 113, 152, 175, 184, 193, 202, 203, 191, 171, 151, 135, 130, 139, 156, 169, 176, 185, 199, 213, 223, 231, 238, 234, 213, 182, 155, 139, 135, 137, 142, 155, 179, 204, 212, 191, 152, 122, 121, 145, 188, 239, 288, 320, 331, 334, 337, 340, 334, 321, 308, 294, 272, 239, 204, 179, 163, 154, 152, 161, 175, 181, 170, 146, 121, 102, 91, 101, 138, 190, 228, 236, 235, 254, 293, 323, 324, 306, 289, 277, 257, 220, 176, 150, 155, 177, 196, 206, 215, 224, 221, 206, 199, 217, 241, 245, 229, 220, 226, 224, 202, 172, 156, 148, 135, 120, 113, 115, 122, 131, 145, 153, 143, 112, 76, 58, 74, 119, 175, 219, 245, 261, 270, 263, 241, 222, 222, 228, 213, 171, 123, 99, 120, 184, 267, 330, 343, 310, 263, 225, 195, 171, 157, 156, 153, 133, 98, 69, 65, 88, 118, 139, 148, 162, 192, 231, 260, 271, 272, 274, 280, 285, 288, 290, 287, 278, 264, 239, 200, 153, 109, 80, 61, 53, 63, 96, 140, 169, 168, 151, 142, 156, 188, 219, 241, 251, 250, 241, 231, 233, 251, 273, 281, 270, 250, 227, 200, 171, 144, 119, 93, 69, 58, 62, 68, 67, 64, 72, 97, 133, 175, 213, 235, 238, 233]
3237B33jNKmj1j8l0l3k0NK5K9J9OjOJ8K4K1J8J9J6OkKKj1k8l3k4j5j3j3j5j7j7j0KJ0J9L7
3219B08N4M4%m0m0pJ8J0j0j7j1qj8k6k3j2jL%j4k6k1RM2M9K4j2k7j8KRPNJ7K7K4Kj6j4JPm
3201A97k2k4j0MJ1J2J0Mqj4rnj1k1j8LK1J6krLJ1PNJ6K5J0j9k9qJ6J9J2J3J8J1OJ7L3K5j3
3183C03m4m1k3j9k8k5%K5K9J1j1k5l0k4pJ9M2M5K3j0k8k4j6j5j8oJ4K5J4%jOJ1Nrk9m6m3j5
3166C5K1L3K2J1J6K5L0L0L2K9J6nj5j4j0j0j0qqmJ1M0N4L2j3m5l8jK8L4J9Jqrm%NOKorlPP
3147C26ok0k2j0NJ6J6jk5l5k4kPJj0j2mMQLqj5j1JPPRJ7J6Jk1k9k6k0j3%J3J8J3QJ3K3L0L0
3128B78K0Lj2k2k5k7k2j1mqj4rPJ8J7J5J3NnjJ9L7L8K7J7R%j1k3l4l1j1J7L0J7jkPRKqj5k3
3109B86k0KK2J0k5m9l6j0JJJ2L8N1L8J2mk%j3l1m4l7k2mJ2J9J3nk5l0k4pJ3L1M4L9K1lk0k4
$$ y = [233, 232, 237, 239, 235, 224, 206, 176, 143, 123, 128, 153, 182, 201, 207, 206, 212, 230, 254, 275, 293, 312, 328, 334, 332, 334, 336, 325, 297, 264, 240, 225, 212, 199, 184, 167, 150, 140, 142, 152, 171, 208, 262, 306, 306, 266, 226, 219, 237, 247, 237, 220, 209, 201, 183, 157, 134, 122, 121, 124, 124, 110, 84, 63, 72, 114, 163, 187, 175, 148, 130, 132, 141, 148, 153, 170, 197, 221, 223, 207, 193, 194, 201, 197, 175, 151, 141, 145, 156, 168, 178, 182, 174, 160, 151, 146, 135, 114, 96, 99, 120, 136, 134, 125, 128, 139, 146, 151, 167, 192, 202, 183, 154, 146, 162, 181, 193, 206, 224, 235, 241, 258, 291, 316, 303, 259, 218, 195, 176, 148, 123, 123, 148, 177, 188, 177, 152, 122, 98, 91, 110, 152, 197, 220, 210, 182, 158, 142, 127, 109, 103, 117, 142, 156, 156, 155, 161, 172, 177, 168, 139, 93, 50, 35, 56, 89, 111, 122, 138, 163, 193, 223, 255, 284, 300, 295, 280, 266, 256, 246, 236, 228, 220, 216, 227, 267, 321, 353, 340, 295, 257, 256, 284, 318, 337, 338, 330, 321, 317, 317, 322, 328, 330, 324, 315, 312, 319, 326, 320, 300, 278, 268, 273, 289, 305, 304, 279, 244, 220, 218, 225, 226, 216, 204, 200, 204, 212, 215, 207, 192, 181, 182, 189, 196, 205, 222, 238, 239, 218, 189, 163, 143, 130, 130, 143, 161, 174, 182, 195, 218, 248, 278, 298, 301, 289, 267, 242, 215, 193, 182, 178, 170, 156, 147, 154, 172, 189, 204, 217, 222, 217, 216, 235, 272, 310, 337, 354, 363, 363, 352, 329, 295, 264, 253, 270, 300, 317, 316, 314, 321, 330, 332, 324, 309, 286, 266, 268, 290, 300, 275, 226, 190, 180, 181, 182, 194, 232, 283, 321, 333, 329, 327, 327, 314, 283, 239, 202, 180, 176, 188, 207, 220, 215, 190, 160, 136, 129, 142, 173, 217, 256, 277, 274, 254, 230]
3092B30j8mKok2l2l1j6LK5L7L4K2J2Krk1j9oOMjLJ4K1J6R%mooqj8l1l1j9kQJ1J3J5Pnj4j7
3072A48j7j6rJ3L5L9K0nj3oRJ4Qoj5qJ3K7K1Jrj0j5l0l8k4kRQMjqj3j1%J2J9K2J6MmJJ4J9
3053B16J8K0K9K5Nj1rMQjmjKllJ4L5L4Ll8n6m3j3MLnpKJ8L1L5K4Mj1j0lqk5l5j7J2K7Rk1m3
3034B15m3l2j5njJQK2L1K6J2ORRlj8k1j2kLjkjMMMOPmk5l8k4J0L2K5Opj6k6l4k9rJ3K4L0L1
3014A70K9K2J2%j4j9rRJ6Pj8l8l5kM4O8N1J4j5k3k2k6l0l1l1l8l7j9QJ6jj0J7O7R2O9K3nj7
2997B94l1m6m1j1Oj3l7l4lK1K9L4M1L2Qj0lQQ%%J1J6J3QLlj0j0mlj2k4l3l2k4j8j2JK3L8L3
2979B13J2NJ6K6J1j7k8k1j0okRJ3Jj2qJ4K9K2pl5m7m0k7j4kJ7L3K7kk8k2J3M7N4L7J3%kRJ9
2961C10J9Kj9k8j8okoj9l6n8o3m0KL6M2L1K3J9J3MLRJ6J0ok1k6j5LJ8J9J1MK%mJJ5K3J4mr
$$ y = [230, 212, 208, 210, 204, 182, 150, 119, 103, 106, 131, 168, 202, 224, 236, 238, 229, 208, 189, 183, 189, 193, 192, 195, 209, 230, 246, 255, 255, 251, 245, 239, 231, 213, 182, 151, 132, 130, 138, 149, 162, 177, 184, 179, 165, 148, 131, 115, 106, 119, 154, 193, 213, 208, 195, 189, 198, 212, 220, 214, 199, 191, 204, 231, 252, 253, 244, 234, 219, 189, 151, 127, 125, 134, 142, 146, 145, 137, 124, 113, 113, 125, 144, 166, 182, 186, 182, 183, 197, 216, 234, 254, 283, 308, 313, 302, 293, 297, 305, 304, 300, 299, 301, 298, 295, 309, 344, 378, 381, 343, 287, 244, 231, 235, 238, 233, 226, 228, 246, 277, 312, 336, 340, 329, 319, 316, 308, 283, 248, 231, 243, 270, 279, 258, 215, 172, 140, 125, 120, 119, 120, 128, 150, 181, 207, 219, 225, 234, 243, 240, 222, 201, 189, 187, 190, 189, 187, 186, 190, 194, 198, 204, 211, 207, 182, 144, 120, 130, 162, 187, 193, 186, 170, 144, 110, 81, 72, 85, 109, 139, 170, 199, 221, 233, 233, 219, 200, 191, 200, 216, 223, 205, 167, 132, 130, 174, 242, 293, 307, 292, 269, 247, 221, 191, 160, 129, 91, 54, 35, 43, 59, 58, 48, 65, 132, 224, 293, 316, 311, 294, 263, 217, 176, 165, 171, 158, 121, 87, 84, 105, 134, 168, 209, 241, 249, 239, 236, 244, 252, 252, 252, 263, 279, 292, 300, 303, 300, 290, 280, 276, 273, 261, 237, 204, 172, 148, 130, 118, 119, 142, 180, 213, 225, 230, 246, 272, 283, 266, 238, 217, 207, 201, 199, 208, 221, 222, 210, 202, 216, 245, 267, 260, 225, 178, 138, 111, 97, 95, 112, 145, 172, 170, 142, 120, 133, 180, 234, 271, 284, 284, 282, 291, 310, 329, 331, 312, 284, 266, 260, 258, 252, 233, 197, 139, 76, 36, 38, 74, 116, 147, 170, 189, 202, 206, 209, 218, 234, 244, 238, 217, 191, 176, 179, 197, 216, 227, 231, 233, 233, 229, 230, 245, 268, 282, 278, 269]
2942B69MJ3PKNQnk4l1k3j5j1mNKj3k3j3OJ5Ppj9k2j1LMj0j7%K2K1JoRJ8Nj3j4lJKJ0J9J3l
2922A84q%PNNJ5K2J8J2J6K0Pj3k0mJ3J2jj2j5j9k1j2RK2J1opJ1J9Nj6k0j1kjlmnqj3j5j2m
2903A61NJ3J4J5J4J2QMJLRJ4Rpj5nJ8K5Ok2l7m2m5m6l6j6OK4L6L8K7J1jnnOK4L4J9jmJ5K5
2885C09J6nk2l7n1m6j7J7L1K7K1J7Oj2k6k2pJ0K0K0J6J1Lj0k4k6k0j4qjJ0R%JJ8L7L4K1J5
2868C21K3K1Oj5k7l3m0m6m1k6j0%jj1j8j5JK3M1M5L4J3pj8j7qQJ4Nj1j1OK7L3K9K3J1qk0r
2851B92J3K0Pprrj1j2rj2j5oJ2K7K7K0J0ql6n2m2k3k2k8j6J5L9L6K0J0O%mlJjprrqpn%LRJ7
2831B14K2J3kj0qj0k1k5j4LRNjpj1qQK1J4qk1j3NJ9K3K1J5MKMMqj8j8j3j6k3k1oJ1K5L1K4
2812B15Oj4k2k5l0l1j9MK3L6M5N1M1J8lj2j2j0kPPnrPK0J1j4k8k6k2k6k8j9j2rnOJ5J6J4J9
$$ y = [269, 273, 286, 293, 295, 300, 308, 303, 279, 248, 225, 210, 199, 195, 200, 202, 189, 166, 153, 159, 174, 181, 174, 155, 133, 122, 125, 129, 119, 102, 102, 124, 145, 146, 140, 149, 167, 172, 159, 145, 142, 143, 145, 155, 174, 187, 184, 176, 176, 183, 188, 193, 208, 230, 248, 260, 276, 296, 303, 290, 270, 266, 279, 291, 290, 278, 263, 244, 223, 211, 220, 242, 253, 247, 240, 251, 270, 275, 259, 239, 228, 226, 225, 222, 218, 213, 205, 192, 177, 165, 161, 166, 179, 193, 208, 222, 234, 242, 246, 247, 250, 259, 273, 282, 275, 260, 255, 273, 298, 304, 282, 245, 203, 158, 112, 76, 60, 66, 90, 126, 164, 191, 202, 201, 196, 191, 197, 221, 255, 274, 273, 269, 284, 309, 325, 320, 298, 261, 210, 164, 147, 164, 195, 222, 243, 260, 266, 254, 228, 206, 199, 209, 229, 249, 265, 276, 279, 269, 245, 219, 199, 185, 177, 176, 186, 195, 195, 196, 214, 251, 285, 306, 321, 344, 365, 371, 356, 329, 296, 256, 210, 169, 143, 133, 133, 132, 121, 103, 88, 89, 112, 153, 198, 232, 245, 238, 220, 203, 195, 203, 217, 222, 211, 200, 206, 233, 266, 295, 318, 329, 321, 301, 292, 305, 325, 332, 325, 316, 307, 296, 284, 275, 263, 248, 242, 254, 281, 308, 328, 338, 330, 294, 242, 200, 177, 155, 127, 111, 126, 165, 201, 221, 231, 237, 237, 233, 230, 231, 230, 223, 214, 205, 197, 190, 185, 185, 188, 197, 214, 236, 249, 247, 237, 229, 219, 198, 173, 159, 162, 171, 176, 175, 168, 157, 149, 157, 178, 192, 184, 163, 150, 155, 174, 197, 218, 233, 237, 239, 243, 247, 239, 221, 203, 190, 174, 151, 130, 124, 135, 160, 191, 215, 221, 207, 185, 160, 130, 99, 80, 84, 107, 143, 188, 239, 280, 298, 295, 283, 271, 261, 259, 266, 273, 268, 259, 266, 286, 297, 283, 255, 229, 207, 181, 153, 134, 122, 113, 108, 114, 129, 145, 159, 178]
2794A78K1J1nj2j0plNJ2R%n%JkjRK5L2L1J9jk3k9j1J4J7mk1j9mLmj3j3l%j1l3m3k7NK8L1K3
2775A70K0J8J4QPJ3J9K1J0j3l4l5j2J1J3lk1k9k7j4MJ8J9J1jj6l1l1j2J3K2J3NRJ0KlQK2K4
2757B22J9J4J0PLKnk1l4l2j5LJ7K6L1K2OkMJ1Qnj9k5k0oJ0K1J9Nrj4lJ3K5K1Nj5k8l1k4pQ
2739B17J8K1J8QklPJ8J9Rqk0k7k1nJ1J5J2OJj4k8k5kK0K3J4J1J2Nj2k3j7lPRNmj7k8k7j3Q
2720A95L0M2L6J1j6k8k2j0lpj4j7j3lRJ8K0J3lj7k2j4lN%j3k3k2pJ5L9N1N0L8K9K0J0ok0k4
2703C24k4k5l1l5l0j4OJ7J5Mqj0nKJ4J7QooJ4K7J9krjMpj9j3NJ9J8Oj1k0rK0M4M0J6qk3l4
2684B89l6k5lQLpmkj2k8l0j3LNJjnj5k1qK1M4M8L5J3j0l0l3k0KK1L2K7Pj5k8k7j5LK5L8K5
2666B62pl1k5ojj2j6mPMjNK2L0J4j8m1l3mK1K5J6J2J8K0Rj0j8j1NJ5J5RLjj0j9k3k0j5pJ2
$$ y = [178, 199, 210, 205, 193, 183, 176, 173, 178, 190, 199, 199, 194, 194, 195, 193, 192, 201, 226, 258, 289, 308, 307, 284, 255, 244, 258, 275, 271, 250, 231, 227, 230, 226, 213, 200, 197, 197, 186, 153, 110, 83, 88, 116, 147, 170, 190, 208, 222, 230, 237, 250, 269, 290, 300, 287, 253, 218, 206, 217, 230, 227, 206, 177, 150, 136, 140, 158, 177, 188, 187, 171, 140, 109, 97, 110, 132, 145, 150, 159, 169, 171, 168, 176, 198, 222, 241, 255, 265, 272, 275, 277, 272, 251, 217, 185, 170, 173, 190, 216, 247, 269, 275, 273, 277, 288, 296, 291, 272, 247, 227, 221, 231, 252, 271, 276, 267, 253, 250, 263, 288, 309, 314, 299, 271, 240, 216, 209, 217, 235, 256, 274, 282, 280, 277, 284, 302, 321, 330, 322, 302, 275, 254, 249, 260, 275, 287, 293, 294, 280, 252, 227, 225, 245, 268, 282, 293, 305, 310, 298, 275, 258, 255, 262, 271, 276, 272, 255, 227, 200, 187, 195, 225, 267, 303, 314, 298, 270, 248, 238, 235, 228, 214, 197, 184, 181, 190, 208, 228, 241, 238, 221, 199, 185, 182, 187, 187, 174, 151, 129, 122, 137, 176, 227, 277, 315, 344, 364, 374, 368, 348, 324, 300, 275, 244, 209, 179, 165, 171, 188, 203, 207, 199, 189, 184, 186, 200, 217, 225, 219, 213, 227, 254, 273, 271, 262, 261, 265, 258, 239, 226, 231, 250, 268, 274, 263, 243, 234, 254, 298, 338, 354, 346, 323, 289, 253, 228, 225, 233, 236, 229, 225, 223, 211, 183, 153, 140, 143, 148, 149, 148, 143, 128, 107, 99, 120, 164, 212, 247, 260, 250, 220, 187, 167, 169, 190, 222, 249, 256, 241, 213, 186, 171, 174, 199, 237, 262, 255, 224, 199, 193, 192, 180, 164, 160, 167, 171, 170, 175, 197, 227, 241, 223, 182, 149, 145, 166, 191, 207, 219, 237, 257, 266, 256, 238, 227, 232, 247, 262, 271, 274, 273, 263, 244, 221, 201, 186, 179, 191]
2648A91L2L5Rj9k1mP%lPJ5Pj1k4l0l1k8k1j3nOJ7K4K9M1N9N9L5kl2n0n3l4JL1L0Kk7m1l3r
2630A46J9L3K4Orj8k7k5rMlk2k4pPQKKKPK2L2K4PMJ8K1PkJ1K2Mk5k9mJ9J5pl1m3l7k0j0j5
2611I9j8lK0K4J9K1L0K2Jj0lONOJ4J8Pqk0k9l2j6J7L9L6K4K0J4lj5rLjoJ1K9J3l0n0k0K3L3
2593B81J5rk6l3k4KK2J9QQJ2Mj0rJ0K5K2Nj3k6l2l1k9k9j7J3M2L5kl5l7k3qRL2M2K7mj9rJ0
2575B18K2K4J6KpjJ4J8Mj1j1LJ1J2Nmj9l4l6k1LJ7K0J8J5J2PPPKj3k4j9oJQL0N7O0L5Ooj1
2556D31k9n2n5l2rok1k8j1K0M2L5J0j0pJok6m2m4l6k5rLOOJ7L5M4L4J4kj0j1j2j3j5pRK3K3
2538B35J1jrj4j5nM%j0mJ9L5K7J4R%j4j8lJ1lk7k4MK2J3LQJ4J0JOJ7J7%k1l7m4m4l2k1j0M
2520A28K4L6L1J5RJ7K2J2lj4j3j0rj0j2j1nJNPJ6K8L2K1OKMKnmOJ2NnlN%j8l4l1j2PRpk1j5
$$ y = [191, 223, 258, 267, 248, 227, 223, 230, 230, 227, 234, 249, 256, 245, 221, 191, 160, 132, 111, 98, 93, 99, 116, 140, 169, 210, 269, 328, 363, 361, 329, 279, 226, 192, 193, 224, 254, 256, 229, 188, 155, 146, 165, 198, 222, 228, 219, 201, 174, 149, 140, 144, 141, 119, 95, 88, 95, 103, 105, 107, 109, 116, 138, 170, 194, 201, 205, 223, 244, 251, 249, 260, 282, 286, 261, 232, 228, 247, 262, 255, 224, 181, 144, 124, 114, 99, 81, 78, 98, 122, 141, 162, 192, 214, 215, 205, 202, 208, 213, 219, 233, 251, 258, 250, 230, 201, 169, 153, 170, 209, 245, 269, 289, 303, 300, 285, 276, 279, 278, 272, 283, 312, 325, 295, 245, 225, 248, 281, 296, 287, 261, 228, 204, 206, 228, 247, 255, 263, 275, 279, 269, 260, 270, 295, 317, 322, 309, 283, 251, 220, 191, 162, 145, 158, 200, 235, 233, 198, 161, 138, 130, 139, 171, 213, 240, 236, 217, 208, 218, 240, 264, 280, 282, 275, 274, 288, 306, 310, 299, 288, 291, 302, 314, 319, 315, 296, 262, 226, 205, 208, 225, 245, 263, 278, 290, 297, 304, 311, 313, 300, 276, 257, 251, 252, 260, 290, 347, 407, 442, 448, 442, 431, 402, 350, 295, 263, 254, 248, 227, 199, 188, 208, 250, 285, 295, 285, 278, 279, 273, 247, 205, 161, 125, 100, 91, 94, 100, 106, 123, 158, 202, 236, 250, 248, 238, 227, 215, 202, 187, 180, 189, 212, 235, 246, 245, 236, 222, 207, 202, 206, 206, 196, 192, 211, 246, 273, 287, 296, 296, 282, 264, 261, 272, 269, 242, 218, 222, 244, 257, 260, 268, 282, 292, 293, 299, 316, 333, 333, 312, 275, 231, 187, 155, 134, 124, 128, 152, 188, 219, 234, 243, 260, 282, 294, 291, 277, 264, 254, 245, 235, 223, 212, 207, 208, 213, 220, 236, 264, 296, 317, 323, 325, 329, 331, 326, 322, 328, 340, 345, 340, 337, 342, 342, 324, 290, 259, 247, 254, 263, 256, 235, 220]
2500B20LJ3LrnPQKPK3K5Jk5k3KK0J2j1k3j4QK5K8K4K1J7ll5n6m5j2J5J9J1jooLJ2Qj1k6k3
2481B03nJ5K8L4K6J1qj8j3JJ2J2JmKJ2J1nj7j4oJKMjj2k2k4j9j3lJ1K5K0mk7l2k1oJ1K6K8
2463B22J4nrNJ4Rnj2j2j1j2q%POMMMKJPJ6J5Kj0lK1L8L0Lk4m1n2n0j9K2L8J6j3j3J1K7K6K2
2444B87K5K3J0oj4j9k1j1J2J9jl4m3k3LJ6J7J4J2J0ROLkj0j6j2KJ3Mj9k7j6j1k2l3j7J6L7
2427A81L2J8Kj6l0k5kK2K9K1Pj2k8l6l2k2qNJ3J7J9K5K2Qmoj2k8m3k5J7M8M5K5J5J2Oj%Lk
2409B60j2j7j7j7j6rjMNLnj4j7pNPLMJ1Qj0k3k1rlnkRJ7J6J2J4K2K7K5J5lk6m4l9j4NPknm
2389A37qoOK1K3J4Olk1l4j9J7L6J9nlK1L7L3K4J7J0JomPJ5Nk6n6n8l1mjj9l5l8k3LK2K0J1
2371A05J2K3K0%j0LJ7J1kllj3j5OK6J5j3j5J5L4J8qj3lOOLqj7j3lkrlJ4J5qk5j3PJ1NJ3K9
$$ y = [220, 223, 236, 239, 230, 225, 232, 240, 242, 249, 272, 297, 298, 273, 250, 252, 272, 284, 273, 250, 236, 244, 269, 297, 321, 342, 359, 356, 321, 265, 220, 208, 223, 242, 253, 252, 246, 240, 243, 255, 263, 252, 226, 203, 198, 213, 241, 275, 301, 312, 304, 286, 273, 274, 286, 298, 299, 295, 297, 309, 320, 315, 298, 284, 278, 279, 281, 285, 284, 272, 250, 226, 207, 194, 191, 202, 227, 247, 243, 216, 184, 163, 157, 168, 194, 222, 236, 231, 222, 227, 241, 250, 245, 233, 221, 210, 198, 190, 190, 197, 203, 207, 211, 215, 217, 218, 225, 241, 256, 258, 248, 245, 266, 304, 334, 337, 313, 272, 220, 170, 151, 173, 211, 227, 214, 201, 212, 239, 265, 287, 312, 335, 345, 339, 325, 306, 285, 274, 286, 305, 304, 270, 227, 204, 207, 223, 240, 254, 266, 276, 285, 291, 294, 292, 282, 266, 254, 256, 269, 273, 254, 227, 211, 200, 178, 145, 128, 144, 181, 213, 231, 233, 217, 187, 162, 160, 182, 211, 232, 239, 227, 199, 163, 131, 109, 101, 106, 119, 136, 155, 180, 202, 210, 206, 200, 188, 160, 117, 92, 109, 157, 202, 227, 242, 254, 260, 259, 259, 262, 260, 248, 231, 214, 197, 181, 172, 171, 175, 180, 183, 178, 164, 147, 140, 145, 152, 155, 159, 170, 178, 168, 145, 124, 115, 112, 107, 105, 114, 131, 147, 159, 173, 195, 222, 247, 262, 259, 233, 189, 150, 136, 141, 148, 146, 141, 137, 129, 123, 129, 150, 173, 187, 193, 190, 169, 135, 116, 133, 169, 188, 183, 180, 201, 238, 271, 295, 312, 322, 323, 317, 313, 320, 335, 340, 314, 258, 200, 169, 165, 164, 145, 110, 72, 49, 52, 74, 94, 105, 117, 140, 160, 160, 150, 153, 170, 181, 179, 176, 173, 160, 145, 151, 177, 192, 179, 164, 179, 213, 231, 223, 210, 207, 213, 219, 222, 214, 197, 184, 181, 179, 170, 167, 181, 196, 188, 163, 150, 157, 168, 173, 186, 215]
2352B15L0J4lnjNJ5K7L1K4J4Qjj3k7l7m0l4j7jPJ0J5K2J9Nj1j0J0L2K6j1n5o1k6J6K9K1J7
2335B59J9J2l%K0L0Pk7l7k7k3l9m7l0%J4Lj2j3LK3L4L6L0K5K5K7K0%j7j7LK4K9Rj9l8m0k5
2318B38nQJ1Pqk7l8l2j8qjLQJ3J8K4K5J3LMJ0Jj8k4rPJ0RQjj9k3kJ5jk9k3J5M3L3J0OJ8K0
2299B94J1MLnk0k4j2L%j9l8l8j6J4L6M0L1K0J5J9K0J3Jj7k8k8k2k3l3l9k8mQ%j4j0JMKLRM
2281A37j5k8j9%J5J7J0MJJ1K8L3J6nmJ3J6ol1k6LK5K8J7J4J8J1nj5pJ0J2qk9l6k7j3jJkrq
2263A46KJ4K4L7M7M2K2Mjoj5k4k8l1l8l2j0Rkk5k4jJ8Rqj2onj2j8j1J1L7M6L0PmMJ7K5K6J5
2245B79nk4k7j5orj6k3k8k8j0J8L3K7J7J3Pj2l0k5oJ3J6J4J2RRJ3K0K8L2K7J4JkJkj1j6j1
2227B97qj4k2j7pJOJ3J5Jk0l0k1pLJ2K0J7ll1l8j1L1N0L1ql5l7k5j1NJ4J0lmPJ9K4L2L9K7
$$ y = [215, 245, 259, 256, 251, 250, 255, 270, 297, 328, 352, 366, 374, 373, 360, 333, 296, 256, 222, 205, 204, 211, 221, 236, 258, 277, 282, 271, 261, 271, 303, 329, 318, 263, 202, 176, 192, 221, 242, 259, 278, 290, 287, 287, 307, 337, 344, 317, 280, 253, 230, 191, 144, 114, 114, 128, 131, 119, 106, 109, 132, 166, 202, 232, 257, 282, 309, 329, 329, 312, 295, 298, 322, 351, 360, 341, 303, 263, 238, 233, 241, 252, 259, 251, 224, 186, 154, 136, 128, 127, 130, 138, 151, 169, 193, 218, 231, 234, 238, 248, 249, 231, 207, 198, 205, 215, 224, 232, 231, 212, 189, 187, 202, 201, 172, 149, 164, 207, 240, 250, 256, 274, 294, 305, 309, 312, 307, 287, 263, 251, 254, 254, 235, 197, 159, 143, 157, 193, 233, 264, 284, 299, 318, 338, 351, 352, 335, 307, 279, 257, 234, 201, 162, 134, 130, 138, 138, 124, 114, 115, 119, 121, 124, 133, 137, 122, 94, 75, 75, 90, 107, 117, 121, 122, 133, 161, 194, 210, 205, 201, 214, 230, 224, 193, 167, 170, 195, 223, 240, 254, 272, 283, 278, 263, 256, 266, 278, 270, 241, 205, 178, 165, 164, 165, 163, 154, 146, 148, 162, 186, 223, 270, 312, 334, 338, 337, 331, 316, 292, 264, 233, 195, 163, 153, 162, 160, 135, 111, 110, 128, 137, 129, 117, 111, 106, 94, 76, 65, 76, 113, 159, 189, 196, 192, 196, 213, 238, 264, 279, 274, 250, 223, 208, 202, 193, 177, 154, 126, 98, 88, 106, 139, 166, 183, 196, 203, 191, 161, 136, 130, 143, 159, 173, 185, 194, 203, 216, 236, 264, 296, 323, 337, 338, 336, 337, 335, 324, 308, 297, 289, 275, 253, 236, 229, 230, 236, 249, 264, 265, 245, 215, 194, 187, 190, 202, 222, 239, 236, 205, 167, 156, 187, 237, 268, 260, 225, 188, 163, 152, 157, 171, 181, 178, 174, 181, 200, 224, 256, 295, 322]
2209C22rm1l9j0J9K7J6ql6m9l5mJ5J7K3M0M7L0Jj1nKJopqnJMpl0m8m5k6j3j0kJ5K6J8QJ2K4
2191B14J9mk1k3j8k0j6KK1K7K1J1Kqj3oJ0K3K8K3Lk8m9m4k4lJ2K6L5L0J4%j4l2m8m4j9RK7
2174A23L8M4M1K6Lj2j9j8j2JJ4J8Qj4k7j5J3K6J2onJ5K7J7lk0k8k1kK0K6J6%j5k5k0NL5L7
2157C03Mk6k8nO%oMK0K7J5jrKK2L4K7Jk5l8l6k2nOJ3J6J0ql2l9j7K3N2M9K4Kqj2k0k0jK7L7
2138C66J4j7k5rLpk4l3k7j8j5j6j4KK2K3Kj6j3%nk0k4j0KJ%MMnmJ7L5L2J7RQ%rj2nmppj%r
2118B05j5kK5M7M2J6ooLok6l5j9kjmKNlj0JJ6J3qk0j4KJ0J3Qkj1j1kL%j%NJ4K4K6J1pj0qj5
2098B47k3j7JPqj8mK8N1N1L2Mj5j4nrk5l3k9k2k0j1J7L8L8K6K0J6mk5k6kK1K5J4Jj2k2k6k5
2080B42k2j9j4j0j2j9k2j6mLPJ4K4L5L7K9J7J3J9K5J4j3l4l9l3k4j7kJ9L9M5L0ll0l4j8mj1
$$ y = [322, 313, 272, 233, 223, 242, 269, 285, 277, 241, 192, 157, 153, 168, 185, 208, 248, 295, 325, 326, 315, 310, 312, 313, 307, 300, 292, 287, 288, 292, 285, 255, 207, 162, 136, 123, 113, 111, 126, 152, 170, 178, 190, 214, 233, 229, 208, 185, 167, 147, 131, 133, 154, 181, 202, 213, 215, 207, 194, 188, 198, 221, 249, 272, 275, 247, 198, 154, 130, 127, 139, 165, 200, 230, 244, 244, 230, 198, 150, 106, 87, 96, 123, 161, 205, 246, 272, 275, 263, 244, 226, 214, 215, 229, 247, 255, 241, 214, 199, 212, 238, 250, 244, 239, 254, 281, 298, 295, 275, 247, 226, 224, 244, 270, 286, 286, 271, 246, 226, 231, 266, 303, 307, 281, 253, 248, 254, 254, 248, 252, 272, 299, 314, 313, 304, 306, 328, 362, 389, 390, 365, 327, 291, 269, 264, 270, 283, 299, 309, 301, 269, 230, 213, 236, 288, 337, 361, 363, 355, 343, 323, 303, 302, 329, 366, 380, 363, 338, 329, 332, 325, 301, 268, 241, 223, 208, 192, 178, 180, 202, 225, 227, 211, 198, 198, 193, 173, 149, 139, 141, 142, 142, 146, 150, 145, 141, 158, 193, 225, 242, 251, 259, 259, 250, 238, 233, 229, 222, 215, 214, 214, 205, 190, 188, 213, 260, 302, 318, 312, 306, 309, 303, 277, 242, 223, 221, 220, 216, 218, 223, 220, 210, 211, 227, 240, 232, 212, 198, 200, 210, 223, 231, 229, 218, 207, 205, 208, 208, 207, 207, 212, 226, 250, 276, 287, 280, 270, 262, 247, 224, 207, 208, 215, 207, 189, 185, 213, 264, 315, 347, 351, 336, 322, 317, 308, 283, 250, 221, 199, 179, 168, 185, 223, 261, 287, 307, 323, 319, 294, 268, 266, 287, 312, 326, 327, 315, 293, 267, 242, 220, 201, 187, 177, 165, 146, 124, 108, 104, 107, 114, 128, 152, 187, 224, 253, 270, 283, 302, 327, 341, 328, 294, 255, 222, 198, 181, 179, 198, 237, 282, 312, 309, 279, 245, 227, 223, 212]
2064B12k4k2lJ1J2J1J8K1J3LJMnk4l8l6k4nJ1K3K3J2jnpj0j3j6k3k6j3J6L6K2j5k9mL5M6K6
2046B13Nj%nj6j8j2rj2j7j6j3jK1M4M9K5oj4jJ3J4Nrk3l3k4LL2M3L8K4QkJQOj0k2k2k2k8k4
2028A92PM2M9K3pj8j6j0ork3l6l2j1LjpkJ6K7K8K5K4K9L2L0J5koNJ1mk5k9j3%LKOJ2J0Ljm
2009C32rj5pJ1K4J9ONJ1J0nk8m3n2n2l7j2QRK%NNKNJ1Mj4k4j9j4j6j5JK4L2K4J0KLOOLpj5
1989A96j7mJ7L3K4mk2j3J5L0K2QJklMJ5J5KpJJ8J7rm3o0n0k4plpKJ4J9J5J6J9J5lj3j2omN
1970B10J6J3oj3NK5J7nj4nlj4k0j1MJ5K6L5L4J9lk5l9l5rK0L2K2R%j1k7l9l6k2oRK1K0J1R
1952B29K1L3K6kk8l4j8LJ1%j0pLKj4k2pK0L5K3mk8l5k2lOlj3qPJ9J7Mj4k0j4ljj2j6JL2N3
1934B07M4J3j3j1J4K9J8rk1j2NQ%JK0M6M9K1k1m7m7l7l2l3k8k0j6j9j7qLORJ3J8J1%nLROm
$$ y = [212, 188, 166, 163, 174, 186, 197, 215, 236, 249, 252, 253, 257, 252, 228, 190, 154, 130, 125, 136, 159, 182, 194, 193, 188, 181, 171, 158, 142, 119, 93, 80, 96, 132, 154, 139, 110, 106, 141, 187, 213, 218, 217, 217, 212, 196, 178, 166, 157, 145, 128, 112, 99, 98, 119, 163, 212, 237, 231, 217, 216, 229, 243, 248, 239, 216, 183, 159, 162, 194, 237, 275, 299, 307, 305, 306, 314, 320, 310, 288, 266, 244, 216, 192, 199, 241, 290, 313, 306, 288, 272, 262, 256, 247, 224, 188, 156, 145, 148, 147, 140, 138, 154, 181, 209, 234, 258, 287, 319, 349, 364, 362, 356, 361, 372, 368, 343, 314, 301, 301, 304, 306, 312, 324, 334, 337, 336, 332, 323, 308, 301, 312, 336, 355, 361, 366, 377, 387, 382, 354, 311, 259, 207, 170, 158, 166, 175, 177, 177, 182, 187, 189, 194, 205, 209, 195, 171, 152, 138, 122, 107, 108, 132, 164, 188, 198, 200, 203, 209, 215, 218, 211, 196, 179, 175, 192, 225, 249, 245, 223, 210, 225, 255, 277, 285, 286, 284, 281, 285, 300, 315, 317, 310, 311, 329, 346, 337, 294, 234, 184, 160, 153, 150, 143, 145, 159, 178, 193, 209, 228, 243, 240, 227, 215, 209, 205, 210, 226, 239, 233, 220, 225, 250, 267, 262, 248, 243, 240, 226, 206, 195, 199, 214, 240, 275, 309, 328, 325, 300, 261, 226, 217, 237, 269, 291, 300, 300, 289, 262, 223, 187, 165, 159, 168, 189, 209, 220, 229, 250, 283, 309, 307, 279, 245, 227, 230, 241, 241, 231, 224, 227, 229, 215, 193, 186, 206, 241, 264, 260, 232, 197, 175, 172, 178, 175, 162, 154, 161, 180, 197, 201, 187, 167, 153, 150, 149, 137, 121, 122, 154, 207, 251, 264, 251, 240, 254, 283, 301, 292, 271, 259, 264, 272, 272, 273, 293, 339, 388, 409, 388, 341, 294, 257, 225, 192, 164, 144, 128, 109, 92, 84, 87, 93, 102, 115, 133, 144, 144, 139, 142, 151, 157, 153]
1915A53nNJ4RJKMlj1nJ8L4L2K4K5K3Rj0j5r%J2K0J8Nqj2j5k4k7qK5M3L3Lk7m3l7rJ8J9kk0
1897B59j7%J7K6K4J4OMjj7l2k9j7poqpmLJ4J9J0LJ0K2Pk9n2m2j8m%%knqj1qjJ0J0pk0j4jn
1877H6j0NL4M6L1J3Plk1k6j1%%LJ3J1j1k8j7LLrj0MJ2J5J6J6Om%OMjOK2K2J3PJ2J5Pjrj6j8
1857B43oJ5K8K2Mj0nJ4K4J2j3k7k4k5l1k7mJ4J2PJ4K1J2kkPJ1ROj0m1n7l5KJ5RJ3K4J7j6l7
1839A83l1j5lQJ9Qk1m1k9JK3K4J7J3J4J8J4RRK2L0J8mj1nrk1k4j0Jnk1k9k7j5KJ5J4QJ0J9
1821A78J6PQJ6J3%jJ5K3J3jqj1j6j4%J4J9K0J9PpmJ5K4Mj8k0rpj2j6k0l2l4j4K0L8K7QMJ6
1803B80K7J9lk0j5KJ1QKlj1k3k3j7j3j8j7kJ2J5Q%mOL4N0L1j2l1j4Kj2l6l4oJ6J9J2MJRK0
1785B74K2J4J0J8K3Qj3k3j9j6j6j7k0k7k3lJ9K4J7J3J5J0jj2j2%J7K8K6J6J2J1kk7m3l2j7
$$ y = [153, 148, 153, 167, 176, 177, 179, 183, 180, 169, 164, 182, 216, 248, 272, 297, 320, 329, 319, 304, 295, 295, 307, 327, 345, 350, 342, 330, 315, 291, 264, 256, 281, 324, 357, 360, 333, 290, 253, 244, 262, 281, 279, 259, 242, 242, 259, 285, 309, 323, 329, 333, 332, 315, 283, 254, 237, 230, 224, 216, 209, 205, 208, 222, 241, 251, 254, 264, 286, 293, 264, 212, 170, 152, 148, 148, 148, 146, 141, 133, 122, 114, 113, 123, 133, 126, 106, 92, 91, 86, 76, 81, 115, 161, 192, 205, 212, 209, 188, 162, 151, 151, 151, 154, 167, 178, 167, 139, 122, 125, 128, 119, 109, 113, 125, 140, 156, 172, 178, 174, 174, 180, 184, 183, 189, 211, 233, 246, 253, 265, 280, 287, 286, 277, 261, 243, 237, 252, 280, 302, 306, 296, 291, 305, 329, 341, 328, 301, 277, 252, 221, 194, 190, 204, 216, 223, 237, 258, 270, 268, 266, 273, 284, 293, 299, 289, 248, 191, 156, 158, 173, 182, 195, 219, 236, 220, 183, 152, 137, 134, 142, 161, 169, 148, 107, 78, 79, 102, 126, 143, 156, 170, 188, 202, 211, 220, 242, 272, 290, 286, 275, 270, 261, 240, 216, 206, 207, 202, 181, 152, 125, 110, 112, 127, 141, 149, 159, 178, 194, 201, 209, 225, 238, 238, 237, 252, 275, 288, 287, 279, 268, 252, 238, 238, 252, 271, 291, 310, 317, 310, 306, 321, 345, 349, 331, 311, 302, 295, 283, 267, 247, 215, 181, 167, 187, 225, 252, 260, 264, 280, 307, 326, 323, 303, 288, 290, 301, 309, 311, 308, 297, 274, 251, 234, 221, 203, 186, 184, 196, 211, 219, 219, 215, 221, 255, 305, 336, 324, 293, 279, 281, 269, 233, 199, 193, 209, 228, 240, 244, 245, 254, 274, 296, 310, 320, 338, 361, 369, 356, 333, 314, 298, 282, 265, 245, 218, 195, 192, 211, 235, 252, 265, 280, 290, 289, 277, 265, 265, 282, 310, 336, 352, 364, 375, 373, 346, 303, 271, 254]
1769B54j7k7k9j7KJ8K2J2ooJ4L1K5Mj3j9j7j0oj0j5JL8N8M1Pj2j5j9k2j8j3j8k2j0PJ3PMK
1752B19jQL0M6L0mk7l1k7j4LQj0k9j8PJ6Ll%JojJ5K0Qj0j5j2%J4J8Lj5j9j6j9j5PL6L7J8J0
1733B65J8J6lk1k3j5mJ0J4jj7oK2L8K6Kj5k7l0j5MMrpNKj3kL9O2L9ml0l4l2k6j0LNMLql0m0
1714A59k3RK9K9K1J8K8M2L7%l9m0qJ2nk7k7j0NJ0J0Kj1j4nlpjJ6K0Jj2mPmk4k6j2kJOO%%R
1694A73J3Jj4j7j0rmJ2L0L1J3qj8j7lJ6K3Rrj1JJ3J6J6J4J2%k6m6l5KK3Jl1k3J0J7rj7J2L5
1677A86K1mqK%lNPrk2j3KNQK5L3J5j1j4j2j8j6J2M2L9J2lj%kNOj3l8l6j1PPNPNJNOpj6NL4
1656B50M3K5Q%j2l1m0l6k6j3MJ1lj5kJ9K0OMRmk4k1KRpj9oJ4J9J2MKNJ1Rj1l2k8qRJ1J8L2
1637B18L2J4mj1j1j0j0j0j5j9j1LJ7K3K5K2K0K8L6K8Mpjlk5l2j1Nj0k6j3Mmj7LL1K6klJ5O
$$ y = [254, 237, 210, 181, 164, 166, 184, 206, 218, 212, 206, 220, 251, 276, 280, 267, 248, 231, 221, 215, 205, 190, 191, 229, 287, 328, 335, 323, 308, 289, 267, 249, 236, 218, 196, 186, 193, 206, 213, 217, 219, 218, 226, 256, 302, 332, 328, 301, 270, 243, 229, 232, 240, 230, 201, 183, 190, 206, 209, 206, 206, 207, 201, 200, 215, 235, 243, 233, 218, 206, 206, 220, 238, 241, 226, 207, 191, 172, 157, 164, 200, 237, 255, 265, 283, 299, 296, 275, 252, 237, 233, 243, 257, 256, 239, 233, 255, 293, 319, 321, 306, 279, 249, 234, 238, 242, 233, 226, 231, 233, 220, 218, 257, 319, 358, 354, 324, 290, 258, 232, 222, 225, 230, 234, 237, 229, 199, 159, 136, 145, 174, 203, 224, 242, 270, 312, 349, 349, 310, 270, 262, 274, 269, 242, 215, 205, 210, 220, 230, 232, 221, 207, 202, 199, 192, 191, 207, 227, 228, 216, 212, 219, 215, 191, 165, 153, 151, 152, 158, 164, 164, 164, 173, 186, 187, 173, 156, 146, 137, 133, 145, 175, 206, 219, 211, 193, 176, 173, 189, 212, 221, 212, 201, 202, 215, 231, 247, 261, 273, 273, 247, 201, 166, 168, 191, 192, 161, 138, 148, 165, 156, 139, 151, 186, 207, 203, 195, 197, 197, 194, 199, 206, 197, 175, 162, 164, 169, 177, 202, 235, 250, 239, 225, 213, 195, 179, 191, 233, 272, 284, 281, 280, 280, 278, 283, 289, 276, 238, 202, 191, 198, 205, 210, 217, 222, 223, 228, 234, 227, 211, 216, 250, 293, 318, 326, 326, 314, 283, 243, 207, 181, 168, 172, 183, 180, 165, 163, 182, 202, 208, 212, 221, 217, 193, 172, 174, 183, 176, 157, 151, 165, 184, 196, 200, 202, 207, 218, 227, 216, 184, 156, 148, 157, 168, 186, 218, 250, 264, 260, 249, 238, 228, 218, 208, 193, 174, 163, 166, 183, 206, 231, 253, 273, 301, 337, 365, 369, 362, 361, 358, 333, 301, 290, 295, 285, 259, 246, 250, 246, 229, 232, 263, 289, 287, 284, 299, 305]
1619C05k8m4k9j8k0rK2L7K8K1K8K2Mnjql2n0n1n2m9k0J9L2K1J7K8K0mrRJ5NRL0K8Jj3LQj0
1601B60k0q%j1j2QJ1j1k4kK3K1RROlmRPj7k5nJ0OOK1J5j9l8j9O%j3qmj8k8j5JJOJ6J1j1pK8
1581A68L9Lk7pK9L1J7K0L5L6K7J4j7n5n9k2Nmj3jll5m6pL2K4NJ5K2j0m8l9kJ4K1M1M9K0j1
1564B61mJ6Oj3rLmoJ6L1Ok0j0Nj4l0%L2J5k0j4J2Nk0rJ6J1rjJ5Kj6nPk0l9kM8M2LLK2Nk4m
1545B89L8L9NkJ2ml0j9Jk4o0m5qj5l9j2M3M9J9K3M6K6j3jL3J5k9j9K7K2j8j1K5Mn1m2J6K3
1528C13j4pM0L3j2jN3M2k9n3j6j4m6k5L4K9k8j6N3N2k2m0PMn1l5M8N7j3k2M6N1k1k6N0N5k2
1512D54k7O7J03N7Q1J70J38k7r9k5mq8q3M7P9l5o3N8Q7l2m4J16J64L0J0J80K15L2LK31L11
1499B106J14R2M00N44L52L97Q96J204J139J588K924M277N673R018J4411J6938J0950k111j3555
$$ y = [305, 277, 233, 204, 186, 166, 157, 179, 216, 244, 265, 293, 315, 319, 314, 313, 305, 273, 223, 172, 120, 71, 51, 70, 102, 123, 140, 168, 188, 184, 175, 184, 199, 204, 213, 243, 271, 272, 259, 262, 270, 260, 240, 232, 232, 221, 209, 217, 228, 217, 193, 191, 214, 235, 244, 253, 259, 256, 252, 261, 268, 251, 226, 221, 231, 237, 243, 264, 279, 260, 222, 203, 209, 209, 196, 188, 184, 166, 138, 123, 124, 125, 131, 147, 158, 147, 140, 168, 207, 210, 183, 176, 205, 236, 253, 273, 308, 344, 371, 385, 368, 313, 254, 232, 237, 233, 220, 219, 216, 181, 135, 128, 160, 184, 189, 204, 226, 216, 168, 129, 127, 141, 162, 203, 252, 272, 261, 257, 273, 279, 266, 257, 260, 256, 250, 266, 297, 303, 283, 273, 278, 264, 234, 234, 266, 281, 261, 247, 259, 264, 244, 235, 251, 262, 253, 252, 267, 269, 253, 248, 255, 235, 196, 194, 242, 284, 287, 290, 312, 317, 293, 289, 327, 366, 371, 369, 381, 377, 347, 328, 329, 305, 245, 200, 192, 177, 138, 126, 169, 218, 237, 260, 306, 332, 319, 318, 351, 366, 337, 318, 345, 367, 349, 338, 363, 367, 316, 274, 290, 313, 299, 292, 332, 365, 353, 352, 405, 447, 418, 365, 349, 335, 289, 264, 298, 327, 299, 283, 336, 388, 366, 326, 333, 337, 286, 251, 299, 356, 343, 321, 367, 418, 397, 371, 421, 476, 454, 427, 494, 597, 654, 735, 905, 1043, 1016, 917, 892, 888, 800, 717, 764, 843, 808, 745, 803, 890, 858, 814, 930, 1094, 1124, 1134, 1314, 1529, 1561, 1564, 1795, 2106, 2220, 2312, 2712, 3256, 3608, 4005, 4901, 6105, 7244, 8832, 11756, 16033, 21706, 30724, 45135, 62073, 73023, 70912, 57357]
1491E7357j6498j2500p731n308m001k501j417j247j205p29l52m61n64l04q8k11l07j17K3j27
1482A712k45r2N2m8j60o8K8n4j34m7K8n2j07MJ00K7n4J0P3lo9J2J01L9o7o8l9q5j16m1K7k6
1468F38q9m4K2rn4pN1Qn9l7J3j2o0k8K9J9j4PL6Kl0J4O1K3m0k9J1j0n3l5QJk7mL3J0k8qM0
1451C49L9J2K1L9Pl8k7J4J7LK3N0K6j7j5Rnl7k6M%j9pQk7o7m5OJ2j4qJ2pm0k6J9K7NRK7J6
1433C29mJ4M4K4j7j8J3Rj7j3J2jl2j7K6K5j8k8OJ8oj4LMj4jL5L8Jj7%Nj4k0llk3k4mlk3j7
1415B55J8L0Oj3kRQJ1J7nl8l9r%j7j9mj7n5n7j0K3Rj0KJ7J4J8M0N0L3J5J3om6o2l2NR%OJ5
1397A82J3RJ6K1J7J9K6J9mj0OK1K4K7K7Ll9n7l9j8oJ7M6L4j5m2j7PjpJ2K8J3mJ0K5J2qj0j5
1380C42l8n2k8jqk8k1NJ4OQK1K3J8J7J7J1RJ9J8kk0j3%oj6j4oj5k8k6j7k1k4j0RJ8K5L5L0
$$ y = [57357, 40859, 28359, 20628, 15320, 11319, 8818, 7401, 6154, 4949, 4220, 3868, 3407, 2843, 2539, 2451, 2240, 1933, 1816, 1839, 1712, 1467, 1375, 1427, 1379, 1219, 1151, 1179, 1125, 991, 944, 972, 920, 813, 817, 917, 944, 890, 900, 973, 970, 901, 913, 1014, 1053, 986, 918, 879, 794, 678, 637, 664, 638, 549, 505, 527, 518, 464, 457, 508, 516, 457, 420, 433, 421, 361, 333, 362, 381, 367, 374, 410, 412, 382, 396, 457, 480, 440, 411, 422, 412, 359, 324, 332, 333, 306, 302, 335, 345, 317, 309, 349, 388, 400, 421, 460, 467, 429, 402, 416, 433, 436, 459, 509, 535, 518, 503, 512, 507, 470, 444, 448, 448, 429, 422, 430, 403, 336, 291, 297, 309, 295, 287, 299, 292, 252, 226, 245, 272, 277, 286, 313, 329, 325, 339, 383, 407, 390, 372, 385, 394, 377, 364, 376, 375, 343, 326, 352, 377, 359, 331, 337, 355, 349, 335, 338, 342, 328, 327, 362, 400, 401, 384, 384, 389, 375, 355, 352, 349, 326, 302, 298, 295, 272, 255, 273, 303, 309, 296, 294, 303, 311, 322, 339, 334, 296, 257, 248, 248, 231, 212, 208, 191, 136, 79, 69, 92, 101, 91, 93, 110, 124, 142, 182, 232, 265, 280, 293, 287, 241, 179, 147, 152, 161, 161, 167, 182, 195, 204, 220, 241, 258, 277, 303, 322, 318, 308, 314, 335, 359, 386, 413, 416, 377, 320, 281, 263, 257, 274, 320, 354, 339, 297, 280, 287, 286, 279, 291, 319, 332, 328, 338, 363, 375, 367, 357, 342, 304, 252, 224, 223, 215, 187, 166, 171, 185, 191, 199, 220, 243, 261, 278, 295, 306, 315, 334, 352, 350, 330, 317, 317, 311, 295, 281, 275, 260, 232, 206, 189, 168, 144, 134, 143, 161, 186, 221, 251]
1362B51Jk9k4JJ7K2L0L2J7LJ5L0J4k5m2k5nmk1l8n2n2l3nK2M7O4O2L8J2mj4j7lK4L1Nk2j8
1345C05OJ4Mqj3j4mQ%k9l9j3J9J6lpkj1k2nK3K5lk4k2j1JJ6K5J1qj0KMrj3pJQJ6J4j3m9n6
1326A23l9k7k6k1jJ4K1K7K8K2J2J8K6J7JlRJ1krrrj3oRJ3LljjjJ0K2J4mkK2L4K4RPJ1PKjj1
1306C27k1k3j7j1j0jRRRK5M1L6J3%Kok7l0pJ8K7K7K7J8Kj0j0j0rkOnl2m9m2l0k2oJ8L0K7K5
1288C16L1K3kk3k1j0kQJ9J7Mmpk1m8o7o9o1m4nM3N6K4mLK7L3L0L1K7J1jJ%j6k4mJ7J5%%J6
1270C19J7kk1l1l7l4j9kKnqqj0nRJ4JnJ5M5N4L9K4J7Mj1k2k4l0l9m1k9mK5M2L7J8J0J0nm0
1252B70n7l0QK0J4J2J4Jj7j9pnj0JK0K3QMJ2Qj1j4NK1J4nj5j2lQJ6J3Jo%QRjj5k8k5kJ9J8
1233B65MkKpk3j8QK6J5kqoj2j8j3nkloj3k1j9lJ1RMJ1K8L3K4J1Jpj4j6j3lJ1K1J6kj6j6j2
$$ y = [251, 252, 223, 199, 200, 217, 239, 269, 301, 318, 321, 336, 366, 380, 355, 313, 288, 283, 279, 258, 220, 168, 116, 83, 78, 100, 147, 211, 273, 311, 323, 319, 305, 288, 285, 309, 340, 345, 323, 305, 311, 325, 329, 321, 308, 294, 290, 298, 298, 269, 230, 217, 236, 252, 249, 242, 240, 229, 207, 202, 225, 250, 247, 223, 201, 190, 191, 207, 232, 243, 235, 225, 227, 231, 222, 209, 202, 203, 211, 227, 241, 228, 179, 123, 84, 57, 31, 10, 9, 23, 44, 71, 99, 121, 133, 151, 177, 194, 195, 192, 201, 212, 210, 201, 192, 183, 170, 164, 173, 186, 189, 186, 185, 184, 183, 193, 215, 229, 225, 223, 245, 279, 303, 312, 319, 330, 337, 339, 338, 327, 306, 283, 266, 255, 245, 244, 253, 262, 271, 296, 337, 373, 386, 386, 388, 382, 355, 325, 318, 336, 363, 390, 417, 435, 437, 427, 417, 407, 398, 396, 402, 397, 365, 316, 274, 244, 222, 216, 234, 264, 291, 316, 347, 370, 368, 345, 324, 314, 312, 320, 339, 356, 360, 356, 349, 328, 280, 213, 144, 83, 39, 34, 77, 133, 157, 153, 156, 183, 216, 246, 277, 304, 315, 314, 315, 315, 299, 275, 271, 288, 303, 303, 303, 319, 336, 334, 313, 282, 245, 211, 192, 190, 192, 187, 179, 171, 161, 156, 165, 179, 180, 175, 190, 235, 289, 328, 352, 369, 373, 362, 340, 316, 286, 247, 206, 177, 173, 198, 240, 277, 295, 305, 315, 310, 270, 213, 183, 191, 211, 225, 237, 251, 252, 235, 216, 209, 204, 194, 195, 215, 238, 246, 250, 262, 270, 259, 245, 250, 271, 285, 280, 265, 253, 250, 258, 274, 287, 288, 282, 282, 290, 299, 298, 283, 255, 230, 228, 247, 265, 269, 267, 269, 262, 239, 221, 229, 255, 270, 268, 260, 254, 242, 224, 211, 206, 204, 201, 195, 182, 161, 142, 139, 150, 159, 163, 174, 202, 235, 259, 270, 271, 264, 250, 234, 221, 218, 229, 250, 266, 264, 248, 232, 220]
1214B20rmMNkj3j5jK6M5M4K1oj5rj0k5m4m8l3j1MQQJ5L3M6M2K9J5%j8k9k4j6k1k9j9NJ7J3
1196A99J7K5J6j9m8m3j3J1J5Nj2k5k6kL3N9N6L0j0m1m6k4MK0J6KrJK7M9M6K4Kqj4k0j2Kll1
1179B53n1l4LK6K5J2pl0m8m3k3KK1L8M7M4L2J7%j9l0k5j0mmKJ4K6L3L2K0kj6oJ6J9nl1l3o
1162B55K6M2K9kl1m0l6l0k1lJ4J4lk0j5LJ3Lj3j2J4L9M1J9KJ%j2j8qJ3K3K4K4K3Rj1j9j3p
1144C17j6l0l7m0m1k9LL8N4M5K9J4Jj6k6k3j3j3k3k8j7%Omj3qQK1K7K0Kj4j2MPj9n2n5k4J2
1127E5K7K7K9K9K5J3M%j%RK6L6K9Rrj0mmrj3j4j7k0j9j4j4k0j9j5j2oRK5K7Rnkkj4k2mK9M8
1108A96M7L4J8j2m2m9k7nKkJRJ4J7J9J8J2NJmnKJ2Mk9o5o4k1L3O4O5N3L7J6j1k6j7LJ1kk4
1090B88l5l2k7k5k6k0oPJ3NLJ5K8J9qk1mJ8J5nk3k4j6LL1N3M7J9JMJ4J8K1K4J5lj2jRKk4m2
$$ y = [220, 211, 207, 211, 216, 214, 201, 186, 185, 211, 256, 300, 321, 315, 300, 291, 281, 256, 212, 164, 131, 120, 124, 132, 140, 155, 188, 234, 276, 305, 320, 320, 302, 273, 249, 233, 212, 183, 164, 169, 186, 199, 216, 241, 257, 238, 190, 147, 134, 145, 160, 165, 153, 128, 102, 100, 133, 192, 248, 278, 268, 227, 181, 157, 161, 181, 197, 199, 190, 191, 218, 267, 313, 337, 339, 331, 317, 297, 285, 287, 284, 253, 202, 168, 171, 197, 222, 234, 227, 197, 149, 106, 83, 85, 106, 144, 191, 235, 267, 284, 284, 265, 235, 210, 200, 196, 192, 194, 208, 234, 267, 299, 319, 317, 301, 295, 311, 330, 325, 294, 261, 255, 281, 323, 352, 350, 319, 279, 243, 213, 192, 189, 203, 217, 214, 194, 179, 182, 195, 198, 185, 173, 187, 226, 267, 286, 288, 289, 289, 277, 259, 251, 264, 287, 311, 335, 358, 367, 356, 337, 324, 317, 301, 271, 234, 194, 153, 124, 127, 165, 219, 264, 293, 307, 308, 292, 266, 243, 230, 217, 194, 166, 149, 149, 155, 151, 138, 130, 138, 159, 186, 206, 208, 194, 182, 186, 193, 174, 122, 67, 43, 55, 82, 109, 138, 167, 192, 205, 209, 209, 208, 208, 217, 243, 279, 308, 317, 308, 298, 294, 290, 281, 268, 254, 237, 217, 198, 184, 170, 150, 131, 116, 104, 98, 107, 132, 159, 168, 163, 161, 159, 145, 123, 119, 148, 196, 243, 277, 295, 283, 241, 192, 165, 160, 162, 160, 161, 170, 184, 201, 220, 238, 250, 255, 256, 252, 247, 249, 261, 265, 236, 171, 107, 86, 119, 183, 248, 301, 338, 354, 343, 317, 300, 303, 314, 312, 288, 253, 221, 194, 169, 143, 123, 117, 124, 137, 142, 145, 160, 188, 207, 199, 178, 174, 192, 207, 202, 179, 155, 139, 142, 173, 226, 273, 292, 293, 297, 311, 329, 350, 374, 389, 386, 374, 373, 382, 384, 360, 318]
1072C18m7m4l4j3QJ5QKJ0K4K6Pj6k9k4j3j4k4k8j5LPnj2ML4M8L0LnJ3L1L3K0PkoLJ8K5J4L
1054C83ORol0l4j8mKOJ1RLJ3L3L4Rj8j8mKmrrj0rkKmj9l2l4l4l3k9j4J0L7N1M5K7J8J9J2j0
1035C57j9KL3M2K0jrj2j6j3lONNOKj1k7k7j6ppj0pKQRLoj5j3%J2J0kpLJ6J6Jj4k0k4k3j9p
1015B23%JJMNJjPK1L1L1K3Pj2k4l1l9m1k6JJ7Qrj5j1onOJ7J9J1QJ2QnrOK2J7K%J2J7%k8m5
995B31l8j5J0K7L7L3J8kj9k3k1j1LJ2J2jj8k5j8%K1K6J0j3j8lJ1Oj0k1k2j9mK0L7L5J7Jpj1
977B48pLJ1QKMJ0Kj7l3l9l3j7J0L0K6OmNJ6J9J9K3K3J4%mlKRJ9J2j3m0m5k8rlpqlOQMjOK6
957B57L9K9Kk0j9lJ2J4PjllKOPQRJ5K1K0J2Jqj7k8l1k6k1k3k4j1J0J9J0lkRJ8J0qk0j7ojn
938B37nlqj7j4J0L0K5OjMJj8l4l8k9rK1L8K6ok3j7ojJ0K7L1J5OJ8L5L0J4MLnk1l0l2l1k8j9
$$ y = [318, 271, 227, 193, 180, 188, 203, 211, 213, 223, 247, 273, 280, 264, 235, 211, 198, 184, 160, 132, 117, 120, 127, 122, 110, 114, 148, 196, 226, 229, 224, 237, 268, 301, 321, 328, 326, 320, 323, 341, 366, 380, 383, 389, 398, 392, 362, 328, 310, 306, 308, 314, 325, 334, 337, 350, 383, 417, 426, 408, 390, 386, 388, 384, 375, 366, 356, 347, 345, 347, 343, 324, 292, 258, 224, 191, 162, 148, 158, 195, 246, 291, 318, 336, 355, 367, 357, 338, 340, 373, 415, 435, 434, 425, 413, 397, 384, 381, 387, 392, 397, 403, 405, 394, 367, 340, 324, 317, 310, 300, 293, 295, 303, 312, 315, 309, 294, 281, 281, 293, 303, 301, 294, 297, 313, 329, 330, 316, 296, 272, 249, 230, 223, 223, 224, 225, 229, 234, 235, 234, 241, 262, 293, 324, 347, 354, 342, 318, 287, 248, 207, 181, 182, 199, 207, 198, 183, 172, 166, 161, 167, 184, 203, 214, 222, 234, 242, 237, 228, 234, 256, 273, 275, 275, 287, 304, 304, 276, 231, 193, 178, 188, 215, 252, 285, 303, 301, 282, 259, 238, 227, 230, 242, 254, 253, 235, 210, 192, 192, 213, 239, 249, 236, 218, 215, 226, 232, 222, 201, 179, 160, 156, 176, 213, 248, 265, 266, 259, 248, 241, 244, 255, 263, 265, 269, 279, 281, 264, 231, 192, 159, 142, 152, 182, 208, 214, 210, 215, 231, 250, 269, 292, 315, 329, 329, 325, 322, 324, 333, 352, 364, 351, 311, 266, 238, 229, 226, 219, 211, 208, 214, 222, 226, 225, 231, 257, 296, 325, 327, 307, 288, 285, 297, 311, 318, 317, 314, 311, 313, 319, 326, 334, 343, 358, 379, 399, 411, 412, 404, 387, 359, 328, 302, 281, 258, 234, 223, 233, 252, 262, 259, 257, 266, 284, 294, 286, 266, 249, 243, 242, 237, 232, 229, 221, 204, 190, 200, 230, 255, 261, 260, 264, 265, 247, 213, 175, 146, 137, 158, 196, 222, 216, 193, 176, 170, 169, 179, 206, 237, 252, 258, 276, 311, 341, 355, 359, 362, 357, 336, 306, 274, 243, 215, 196]
919A96qMK5N5P1N5J7j5l0l8l5j5J0Qk2m2k6PK0Mk1l1k3mRJ0%rpKJ0J1J3J8J7Q%OK0K6J4lp
900C00nj0j9j8jJ5J7J0PPjj3j0OK1J8Kj3k4k9k4qJ0J4lk6l4k6j0LJ9L2L0Rj2j3%QQJ4L5M5
882C31K5pj8oPJj7k6j4PK4K2Oj2j7j2j0j7l0l0qK5M7M2J2k1l7l3j8qmKJ6K8K5Nj1lJ8K6J7
864C27Q%j1k3k6j6j3k4l2l1k6k1nJ9K7J4KLKj1qK7O6O9L8Poj6k5j8lM%OK8L9K9J4J6J6Kk2
846D26l4l0k1j7k2l4m0l9l0k1j2l%%KJ0J7J4J2K2L2J8j5l9l7k4j2kRR%p%J2J6J6J7K1J9J8
829B51K0K1J1JjOJ0Lqj6j2nmj6k5k0olj3k0j2RK7L5L4K5J0JkNK1L4L1Pk1k9k1k3l8m9l5qJ9
810A94L7M2L2J7J3J2Nnrrj9l0k0K%k5l4j6JmpRK5J6KQK2J5lqqk3l7j8K7N4M3J8jj5k5k0jL
791B60j2k6k0oMJ0K0K9L4L6L2J5j1k7l2l4l5k4MK5K9K2J5Ol%K0M1L7Pk7n2n6m0k0j1j4j1K
$$ y = [196, 188, 192, 217, 272, 343, 398, 415, 400, 370, 332, 297, 282, 292, 300, 278, 236, 210, 217, 237, 241, 220, 189, 166, 162, 171, 181, 181, 172, 165, 167, 177, 188, 201, 219, 236, 244, 244, 250, 270, 296, 310, 307, 300, 295, 285, 266, 248, 247, 262, 279, 289, 296, 303, 302, 289, 279, 285, 306, 324, 326, 313, 289, 260, 236, 228, 238, 252, 249, 223, 189, 163, 153, 156, 175, 207, 237, 246, 234, 221, 221, 229, 237, 251, 286, 331, 356, 349, 331, 325, 332, 333, 316, 290, 276, 283, 307, 329, 335, 323, 306, 294, 284, 267, 237, 207, 199, 224, 271, 313, 325, 304, 267, 234, 216, 208, 204, 206, 222, 250, 275, 280, 269, 266, 284, 310, 327, 335, 335, 324, 301, 275, 259, 246, 222, 190, 159, 133, 112, 107, 126, 153, 167, 169, 172, 174, 163, 155, 182, 248, 317, 355, 362, 356, 340, 315, 297, 294, 298, 298, 304, 332, 371, 400, 414, 430, 446, 448, 426, 392, 362, 341, 324, 302, 268, 228, 189, 159, 138, 126, 123, 123, 123, 125, 135, 152, 166, 178, 200, 232, 250, 235, 196, 159, 135, 123, 121, 130, 139, 139, 132, 132, 144, 160, 176, 193, 214, 233, 251, 271, 292, 303, 304, 303, 309, 319, 322, 314, 298, 286, 281, 277, 261, 236, 216, 210, 207, 194, 174, 162, 171, 198, 233, 267, 292, 302, 303, 301, 306, 327, 361, 392, 399, 378, 349, 328, 305, 267, 218, 183, 175, 194, 231, 273, 305, 322, 335, 347, 352, 347, 338, 329, 310, 280, 260, 262, 262, 237, 203, 187, 188, 184, 177, 186, 211, 227, 229, 237, 259, 274, 271, 263, 255, 232, 195, 177, 204, 258, 301, 319, 318, 303, 278, 258, 257, 260, 248, 222, 202, 196, 200, 210, 230, 259, 293, 329, 361, 376, 365, 338, 306, 272, 237, 213, 217, 242, 271, 293, 308, 314, 311, 311, 331, 372, 409, 416, 389, 337, 281, 241, 221, 210, 196, 185, 187]
774A87J8K0J1LKNJ4K2K0jl0m3k7PL1K7Nj8l0l8l9j7K2N3N3K9Rmk2m7n9m9k6lJ4J7ROK5N1N0
756B57K0rj4oqj3pNJ2J3J6J7QkkK%j0k1k7l3k8j3NJ6J8J9J7J3J3K2L0K7J5J2J5Oj5l7m4l7
739B52k0kQJj9k3kK6L8K8J2Kj0k1k8k7k3k1j6%K1K6Qj6k8k2nJ9L8M7M0K3%k1k5pK0K6Nj7j6
721B71nj3l3l9k3nJ0K2L0J2j9l0nJ8K0J1J4J3pk1KM8O2L3MjNol3n6o0m8k2PK3K7K9K8K2RQ
703C02K1K4Jk8l2qJ5J4%lRJ9J3mj5j5pJ%pk4l6l6k1KK3L0K1Lj4j6nLJkKOKrj4j7j4jK5M5M1
683B95J3rrjok6l9k5J0L6L2Kk4l1k2j2kNPJlkLOOJ2J3J1QJ6K1J6MJL%oppj8l6l5j0J4K0J2
663B37OJ0J8K3K1Nj5k2j4omKJ6K3J3Ljpk0l3l2k6k4j6OK9L1J8Pkj6k2oK6M0K5LnolJ2L7M2
644C73Om2n0j2K4J9k0n0m7k2QK4K2PljNJ0J7L0L8K2oj6lJ1Lj6k3j4okkmj0oRJ7Jk4k6%J8R
$$ y = [187, 205, 225, 236, 239, 241, 246, 260, 282, 302, 301, 271, 228, 201, 208, 239, 266, 271, 253, 223, 185, 146, 129, 151, 204, 257, 286, 295, 291, 269, 222, 163, 114, 88, 85, 99, 116, 125, 131, 156, 207, 257, 277, 268, 254, 248, 240, 227, 220, 225, 237, 250, 266, 283, 291, 289, 287, 289, 289, 279, 258, 231, 198, 170, 157, 162, 178, 196, 215, 232, 245, 258, 280, 310, 337, 352, 364, 379, 385, 370, 333, 289, 252, 232, 230, 238, 239, 220, 197, 195, 221, 259, 287, 299, 301, 291, 270, 242, 215, 192, 171, 155, 155, 176, 202, 210, 194, 166, 144, 139, 158, 196, 243, 283, 306, 306, 285, 260, 253, 273, 299, 304, 287, 271, 266, 253, 220, 181, 158, 153, 163, 185, 215, 227, 208, 178, 173, 191, 211, 222, 236, 249, 242, 221, 223, 271, 333, 366, 370, 369, 374, 368, 335, 279, 219, 171, 149, 156, 179, 206, 235, 263, 285, 294, 302, 323, 347, 348, 320, 288, 280, 295, 309, 309, 306, 315, 334, 347, 343, 328, 313, 306, 307, 307, 300, 276, 240, 204, 183, 185, 208, 238, 259, 262, 248, 232, 227, 230, 231, 229, 231, 237, 239, 230, 216, 199, 185, 184, 209, 254, 295, 308, 299, 290, 289, 283, 257, 218, 193, 203, 239, 271, 273, 249, 218, 196, 184, 182, 187, 194, 195, 192, 190, 193, 199, 205, 217, 230, 241, 249, 265, 286, 302, 306, 307, 310, 310, 304, 297, 290, 272, 236, 201, 191, 205, 225, 237, 243, 253, 271, 294, 315, 320, 305, 283, 269, 263, 259, 261, 277, 300, 313, 316, 315, 308, 288, 255, 223, 197, 173, 157, 163, 192, 223, 241, 248, 246, 230, 208, 202, 228, 268, 293, 296, 291, 285, 282, 294, 331, 373, 379, 337, 287, 275, 299, 318, 298, 248, 201, 179, 187, 211, 233, 240, 237, 236, 241, 251, 268, 298, 336, 358, 352, 336, 333, 344, 347, 331, 308, 294, 288, 286, 284, 280, 270, 264, 273, 290, 291, 267, 241, 241, 259, 268]
625B68j2j7j1m%J4K8L3L4M0L7J5j7k9j1J3J8Nj7l5m6m1k5qMJ5K7L0J6nj4pLMKMRMrj9j7m%
607B75oj6j9j1kLPJ3K5K9J8Jj0j3j3j4j4qmqj1j0rj2j3jJ8L2L6L5K6QpnJ4K4J5mj7k1k2j6
589B93pOJ5J4jk9m9l8nJ7J1pj3mPJ4J6J6J8K4K8J9nk6l8l8k8kK6L2J2qrkrk7l4k3jK5M7N1
570B88L2J2J4K3J9jqjmk8n5n9m2k3j7j8j7oQJ7J6J5K2K9K4J6J4J8J8J1RJ4J8J5Lj2k7l3k2
553B82lPOJok0l6l9k3%J3J0qk9l7k4mlj6k0oJ4K1K3K3J1j6l9k9MK7K6K1K9M2M4L3K5K0J0j0
536C24k7k4oJrk7l4k9j7JK1L5L1J5KLJ1J9J8Oj5l0k2mRRRJ5J4Kj1qQJ8J5jk0k7k2rKRJ9K5
517B99K1J4J4J4kl4m5k1J1J6kj7qOJ1RJ0J3Nj9m8o1m0LL3L4K1Rjj1j5nQJ1Mkmrj4rLNnj9j9
497A64nJ8L8M1K6mk7l3j8QL3L7J3j9l3j9NJ5QkLK6M9M4J3k0k9j6KJ3K1K3Pk0l7k7jJ9K2J3
$$ y = [268, 256, 239, 228, 224, 224, 238, 266, 299, 333, 373, 410, 425, 408, 379, 368, 381, 399, 404, 387, 352, 306, 265, 240, 232, 236, 251, 278, 308, 324, 319, 305, 298, 301, 305, 307, 311, 320, 324, 315, 296, 279, 275, 275, 269, 253, 234, 223, 221, 224, 231, 244, 269, 298, 316, 317, 307, 294, 281, 267, 253, 245, 241, 233, 222, 212, 203, 191, 178, 177, 195, 227, 263, 298, 324, 332, 325, 320, 334, 358, 373, 369, 352, 331, 309, 293, 286, 292, 307, 321, 320, 291, 242, 204, 199, 216, 227, 220, 207, 203, 210, 224, 240, 256, 274, 298, 326, 345, 340, 314, 276, 238, 210, 208, 234, 266, 278, 270, 261, 259, 250, 223, 189, 166, 165, 190, 237, 288, 320, 332, 346, 369, 388, 387, 379, 378, 374, 346, 291, 232, 190, 167, 150, 132, 115, 109, 117, 134, 150, 165, 187, 216, 240, 256, 270, 288, 306, 317, 326, 340, 358, 373, 376, 364, 337, 304, 282, 279, 286, 292, 293, 287, 267, 231, 192, 169, 169, 182, 192, 184, 155, 118, 94, 90, 87, 71, 51, 45, 59, 80, 103, 126, 137, 121, 82, 53, 57, 84, 110, 131, 160, 202, 246, 279, 304, 324, 334, 324, 297, 273, 267, 268, 259, 232, 198, 169, 152, 153, 174, 209, 240, 255, 257, 260, 271, 290, 308, 314, 299, 269, 247, 243, 252, 261, 270, 285, 299, 301, 290, 282, 290, 308, 323, 322, 302, 275, 253, 244, 246, 255, 274, 299, 320, 334, 348, 362, 360, 326, 281, 260, 271, 287, 285, 268, 260, 266, 277, 286, 296, 309, 314, 295, 247, 186, 146, 149, 182, 216, 237, 246, 245, 234, 219, 214, 222, 233, 237, 235, 231, 222, 208, 199, 202, 207, 202, 183, 164, 159, 177, 215, 256, 282, 278, 251, 218, 200, 208, 241, 278, 291, 272, 239, 220, 225, 240, 248, 246, 249, 275, 324, 368, 381, 361, 332, 316, 318, 331, 352, 375, 382, 362, 325, 298, 297, 316, 338, 351]
480C51Jqj3k1l7m6l3%K6L3L2L1L0J9NJJkmOJ9K0Lj2j2nrk2k7k5k3k8k8j7JJ3J7J6Lj0j0PK2
461B65K0NjMNlj5k3k5k3j2%JmlQJ1%roJKLJ2J6QMJ7L0K1ok3j8pk%PJ1J0Lmj0lJ8L3K2j1l2
440B97k6j0lmnJJ0J8K7L3L5K8J0k0m4m4j9NJ1NKKlj5k4k1j0k%jJ3L4M4K5ok7k3pLJj6l6l3
422B05mL0L8J4k1m5m6k3J2L5K8O%J5K7J9LopkLJj0j3lPok9k5QK6Qj8k1j4j6k6j9KJ4J3J6K4
403B00K8K2Rpj8j2NJ6QJQJ7Jk5l0j7nqj3j3j0mJ1L0L2J2j1j8rknj2j4j1%J2J8J7J0PJ0K0K7
384B77J5loJ5L4K7QLQJk0l7l8k8j5MJ5RppJ4L0K6J3Jj2k9m2l7j9%J5K2K4K1K0J5OomOOoj0
365C09RL2L5K0Qmk2m3m5k7pJ%J%nj4j9j6pk%NJ4K1J6Njlj1k3k4qOO%kJjqj1mQJ9K4K1J2Jq
344B59j5j4%J3J2ok0j6j1k2l5l1j4JJ3L0M5L9J2j4j7roqkPJ2J1J2J6K0K3K6K7J9%j9k8k4j5
$$ y = [351, 352, 344, 331, 310, 273, 227, 194, 194, 220, 253, 285, 316, 346, 365, 370, 371, 372, 370, 366, 372, 391, 411, 414, 402, 390, 385, 376, 354, 327, 302, 279, 251, 223, 206, 207, 220, 237, 253, 256, 246, 236, 243, 265, 285, 290, 289, 293, 298, 295, 280, 257, 232, 209, 197, 197, 198, 194, 191, 199, 210, 210, 201, 195, 196, 198, 201, 213, 229, 237, 241, 258, 288, 309, 303, 280, 262, 255, 253, 253, 260, 271, 281, 284, 280, 270, 267, 285, 318, 340, 329, 297, 271, 261, 258, 254, 249, 250, 260, 278, 305, 338, 373, 401, 411, 391, 347, 303, 284, 289, 300, 305, 307, 309, 306, 291, 267, 246, 236, 234, 234, 233, 246, 280, 324, 349, 343, 316, 293, 286, 289, 290, 274, 238, 205, 201, 231, 269, 283, 262, 217, 171, 148, 160, 195, 223, 229, 229, 244, 271, 290, 293, 287, 280, 278, 281, 282, 272, 259, 256, 263, 257, 228, 203, 211, 237, 245, 227, 206, 192, 176, 150, 131, 133, 147, 160, 176, 200, 228, 250, 259, 252, 234, 222, 227, 243, 251, 252, 260, 277, 278, 253, 223, 206, 201, 193, 180, 167, 157, 153, 164, 194, 226, 238, 227, 209, 200, 198, 193, 181, 167, 156, 156, 168, 186, 203, 213, 220, 230, 250, 277, 292, 289, 283, 298, 332, 359, 367, 370, 378, 379, 359, 322, 284, 256, 241, 245, 260, 269, 262, 255, 269, 299, 325, 338, 339, 327, 298, 256, 219, 200, 200, 215, 237, 261, 282, 302, 317, 323, 317, 313, 319, 325, 319, 309, 318, 350, 385, 405, 413, 409, 387, 344, 299, 272, 265, 266, 266, 267, 267, 262, 248, 229, 213, 206, 204, 204, 209, 223, 244, 260, 265, 264, 261, 250, 227, 203, 195, 201, 207, 207, 205, 206, 205, 197, 186, 182, 190, 209, 233, 254, 266, 267, 259, 244, 230, 230, 243, 255, 249, 229, 213, 202, 180, 145, 114, 100, 101, 114, 144, 189, 228, 240, 226, 209, 200, 194, 186, 184, 191, 203, 214, 226, 242, 262, 285, 311, 338, 357, 357, 338, 310, 286, 271]
327B71j1j3j8j7rJ3L3L8J8j3l6l8k7j0OJ4J2%j1qMQLmNK3K6Mk4l3k4j5j3mJ3K3J5KRK3J8r
309B44l0k5nPJ3J5J4Nl%OPjj5k9l7k8oJ1RjpnnoJJ1J7J6J7K1K2J6NllOK3L2K3Lj4k0k4k6k3
289B28j0JQJ6K3K5J0j4l1k7pJ5K7L2K7J4qk8l2k2j0pqpppmOJ2PmrlPK3M0N0M1J6j3k8k6j4
270C02lkj1k1k4j8mK1L9L4Mk3k5j3qj5j8j5j3j7j6KK3L2K5J0%kLKlJK1M4M4J8j4k6j4MJ4J3
252C51Nmqj2j3oPJ5Lj6k2j0KMjoj7l1l5k3jJ3J5J0%oqn%KjoqlOJ3Lj3k0oJ2J6QQJ9K3Qj4k1
231B27nJ1Mj8k7j5llqMK0K1J1J1K3K9J8M%LPMlj1j1njrk4l5l2j5QK6K3PlPJ5MnJ6N2N9L0J
211D12ork3k5lJ7Qj3k0j6j8j6PM2N3L3J2Kok1m0m7m2k3kJ2J5J1J0Ork2k3j8j4pJ4K9J6j6l3
193B27j7J2L2L6K2rl3l3j7j1j9j5PK6K9K7L3L2J4mrlnj1rjMRR%k3l9k9jJ7J1nj3nJ8M3M7K9
$$ y = [271, 260, 247, 229, 212, 203, 216, 249, 287, 305, 292, 256, 218, 191, 181, 187, 201, 213, 213, 202, 194, 198, 206, 209, 205, 210, 233, 259, 263, 239, 206, 182, 167, 154, 150, 163, 186, 201, 203, 212, 235, 253, 244, 214, 189, 184, 191, 204, 219, 233, 238, 235, 235, 241, 248, 247, 232, 203, 166, 138, 132, 143, 152, 151, 144, 139, 134, 128, 129, 140, 157, 173, 190, 211, 233, 249, 254, 251, 248, 254, 277, 309, 332, 335, 321, 301, 277, 251, 228, 218, 219, 227, 243, 266, 291, 301, 287, 256, 229, 222, 237, 264, 296, 323, 337, 329, 301, 269, 247, 237, 230, 222, 215, 208, 201, 197, 203, 215, 222, 218, 209, 206, 213, 236, 276, 326, 367, 383, 370, 342, 316, 302, 299, 297, 286, 265, 241, 223, 219, 240, 279, 313, 317, 294, 269, 256, 248, 233, 215, 200, 187, 170, 154, 156, 179, 211, 236, 246, 246, 244, 247, 249, 246, 247, 268, 312, 356, 374, 360, 334, 320, 324, 338, 351, 356, 352, 344, 332, 319, 313, 320, 335, 338, 322, 300, 290, 292, 296, 295, 289, 272, 241, 206, 183, 182, 195, 210, 220, 220, 214, 206, 201, 201, 203, 202, 196, 188, 185, 191, 204, 207, 194, 174, 168, 180, 196, 204, 212, 231, 254, 262, 248, 227, 222, 233, 237, 219, 192, 177, 174, 171, 163, 167, 187, 208, 219, 230, 253, 282, 300, 304, 304, 307, 314, 318, 315, 304, 293, 288, 287, 278, 254, 219, 187, 172, 180, 206, 229, 236, 233, 240, 255, 259, 254, 270, 322, 381, 411, 412, 406, 397, 374, 349, 346, 363, 371, 358, 338, 322, 304, 288, 295, 337, 390, 423, 435, 437, 431, 410, 370, 323, 281, 258, 256, 268, 283, 294, 304, 310, 301, 279, 256, 238, 224, 217, 231, 260, 276, 260, 227, 210, 222, 254, 290, 312, 303, 270, 237, 220, 209, 190, 175, 182, 208, 237, 264, 297, 329, 343, 339, 330, 327, 322, 311, 302, 301, 305, 314, 323, 323, 300, 261, 232, 231, 248, 259, 254, 241, 236, 254, 297, 344, 373]
174C73jk2k7k3j7rnj1j9k1oJ2J5lk8l4k1ork5l3k8j5lJ0K3K4J8J9L2M2L4K1K1K9K0ok8k7j0
157B56OP%nmlmj1k0k4k3j7mJ4L1L5K4Nrj1mJLJ0K2K5Pk0l2k1plqq%QJ3J7J6J1Jllj%Jnj6k9
136B18l0k0nMNL%Jkj0j8j3OK4K2Kj2rJ0K7L1K1Nmj1j6j3KK3K4Jk2k2rqj3rRJ8J1jqrj3j4r
116A67lpj9l1l3j9QK9K9J4J5L3M5K7LMK8M4L5J5RQjj9l1l4k6j5JJ1Qnj3pMJ8L1L8L0kl4m1
97C14k6qorkLok4l2k1oKPJ4J9J5RRJ2J0KjKJj5l8n5n2l3j0NPJ0J9L2L9K9J3LKOJ1J4J5Pk%
77B85QMk2m4l4OL6L4Roj0j4k0j7%Rjk1k6j2OJ1QRJ5J3jj1nRJ3Jqj0j0j0mJ2K4K1Pkmj0k3l3
57A82k8rJ0J8J3Koo%J4K7L1K2NLJ9L8M1K2lj7j8rlqj4j3mlj4k7k6j3%QJ0PNRK2L3L0J8Lj5
38C56l6m7l9k6j9j2J5M9O0L6Qpj3j7j3NJ9J2qj4pkrj5rOJ5J0kq%J1J1ok5l2k6j8j2j2j1mJ5
$$ y = [373, 372, 350, 323, 300, 283, 274, 269, 258, 239, 218, 212, 224, 239, 236, 208, 174, 153, 147, 138, 113, 80, 52, 37, 34, 44, 67, 91, 109, 128, 160, 202, 236, 257, 278, 307, 327, 321, 293, 266, 256, 262, 269, 269, 264, 260, 257, 253, 242, 222, 198, 175, 158, 154, 168, 199, 234, 258, 263, 254, 243, 239, 240, 243, 253, 275, 300, 307, 287, 255, 234, 227, 224, 216, 208, 208, 216, 229, 246, 262, 273, 274, 271, 268, 267, 267, 268, 263, 247, 218, 188, 168, 163, 167, 172, 175, 175, 176, 174, 164, 146, 133, 139, 163, 185, 187, 175, 166, 176, 203, 234, 255, 260, 256, 245, 229, 216, 218, 241, 265, 266, 244, 222, 213, 205, 192, 183, 192, 210, 221, 220, 212, 203, 190, 176, 167, 164, 157, 138, 107, 74, 55, 63, 92, 121, 135, 150, 183, 228, 255, 258, 262, 290, 334, 369, 384, 393, 401, 400, 381, 350, 316, 290, 275, 276, 287, 295, 290, 277, 270, 274, 292, 323, 361, 391, 389, 355, 314, 288, 280, 274, 265, 263, 266, 260, 236, 204, 183, 177, 179, 186, 200, 219, 234, 243, 252, 264, 274, 276, 275, 277, 278, 263, 225, 170, 118, 85, 75, 80, 87, 97, 116, 148, 187, 216, 229, 232, 234, 240, 251, 265, 280, 287, 285, 285, 293, 297, 275, 231, 197, 203, 239, 273, 282, 276, 266, 252, 232, 215, 215, 224, 223, 202, 176, 164, 170, 181, 189, 198, 213, 226, 225, 214, 209, 218, 231, 232, 224, 214, 204, 194, 190, 202, 226, 247, 254, 252, 248, 238, 215, 182, 154, 145, 155, 173, 186, 188, 182, 176, 176, 190, 217, 248, 270, 275, 278, 297, 335, 376, 398, 395, 378, 360, 351, 348, 340, 326, 313, 309, 306, 292, 265, 239, 226, 226, 234, 244, 251, 256, 265, 287, 320, 350, 368, 371, 356, 320, 273, 234, 208, 189, 177, 192, 241, 301, 337, 345, 338, 325, 308, 295, 300, 319, 331, 323, 309, 302, 300, 291, 276, 267, 273, 288, 298, 296, 288, 288, 299, 310, 304, 279, 247, 221, 203, 191, 179, 168, 164, 179]
19A79L4M1L0J4Mjj0k1j7jJ0J0LLMJpnQK3K3Pj3l0l4k8rRJ8J3NPJ3J2kj9k3qJ7L4L5K1Qjj3
-1C44k9m1l6k3j1NL0N3M9J5k5m8n0m2k6%K5L9M1L4J9LomPJ9K7K2Mj5j1MOj6k8j3RRn%K2L2
-19C89J6qk1l2m7n3l2LJ8Mk0k6pJ7L0L0K7K3J7Mj4k9k9j5LJ3J0QRPoj7j3%Jj8l4l4k3j4pN
-37A35J6J7J2J2J2Mml%pk3l2k5j3%J2J7J3NPJ8K4J7PjopLK3L1J8pk1j4QK6K8J1j3l0l3k2l
-56B12J4J2krOL4M5M0K8J3ok3k5j5kRJ9K4Pk2l4k5j6j8j2J0K5J8%j0k0l7m6l5j6j0pK0N9P0
-73B75M3Mj2qnrj6j6nJ3L0L5K5J2%j0k1k6j8jJ7K6J8jk0k7k3j6j6j9j7j1%MJlJJ4K1J6RJ3
-91B77K0J6Jq%J0J0mj4j0JPMlj0j8k9l2j7OK3K9L6M0K8jk4k6j4m%mk0m7n6l1LJ7J0J4K9L5
-109B44K3J4K0K5J8ROJj5k7k4j5j1j0JQJk0k4j2JK%LP%j4k4k1j1jRJ2J2RMNNJmpl%oj5j3N
$$ y = [179, 213, 254, 284, 298, 302, 301, 291, 270, 253, 252, 262, 272, 275, 278, 282, 283, 276, 271, 279, 302, 325, 332, 319, 289, 255, 227, 218, 227, 245, 258, 263, 270, 283, 295, 293, 274, 251, 243, 260, 294, 329, 350, 358, 357, 344, 315, 274, 238, 215, 204, 209, 239, 292, 341, 356, 331, 283, 233, 191, 165, 165, 190, 229, 270, 304, 323, 326, 320, 316, 323, 342, 369, 391, 395, 380, 369, 373, 379, 363, 335, 322, 331, 340, 335, 335, 357, 389, 405, 397, 376, 344, 297, 244, 212, 215, 233, 237, 217, 191, 184, 201, 231, 261, 288, 311, 328, 332, 318, 289, 260, 245, 248, 261, 271, 279, 288, 295, 289, 272, 259, 259, 260, 242, 208, 174, 151, 137, 130, 135, 151, 168, 180, 192, 204, 208, 204, 201, 201, 194, 171, 139, 114, 101, 101, 113, 130, 143, 148, 155, 173, 197, 214, 221, 220, 214, 207, 210, 233, 264, 282, 275, 254, 240, 248, 274, 302, 313, 300, 270, 237, 215, 212, 226, 238, 236, 227, 233, 267, 312, 352, 380, 393, 387, 364, 339, 324, 322, 331, 350, 374, 381, 359, 325, 300, 284, 266, 254, 264, 289, 307, 307, 297, 277, 240, 194, 159, 143, 133, 126, 146, 205, 275, 318, 322, 310, 302, 297, 288, 272, 256, 251, 264, 294, 329, 354, 366, 366, 356, 335, 309, 291, 290, 307, 333, 351, 350, 330, 303, 280, 264, 248, 229, 212, 201, 201, 205, 206, 203, 204, 218, 239, 255, 264, 277, 297, 313, 314, 306, 306, 316, 326, 322, 308, 298, 299, 306, 310, 307, 297, 279, 250, 218, 201, 207, 230, 259, 295, 335, 363, 362, 338, 312, 298, 294, 294, 290, 270, 223, 167, 136, 139, 156, 166, 180, 209, 244, 267, 281, 301, 326, 344, 353, 359, 360, 345, 318, 294, 279, 268, 258, 259, 267, 268, 248, 224, 212, 213, 215, 215, 218, 225, 225, 211, 187, 166, 155, 154, 163, 175, 187, 196, 200, 205, 210, 211, 207, 200, 197, 197, 191, 176, 163, 168]
-130A68L3N7O5N2K4oj9j3kLJjOJ6K3K3J5Mmqj7l5n2n3l0PL6M0K6J4J0Lj6l8m1k7j4rlQJ3P
-148B66lLJ5J6Opj1j3j5j7j2nJPJ2J0jj5k0j3NK5L8L5J7kqlJjp%J5K4J5lj0qmj1k7m4m5k6
-167A80KK5K9K1J0qk5k2NL0K5j0l2k5kRPJjOK4M5M8K4j0k7k4j4MK2L2K6J3Npk9m8m6l0k1j9
-185A93j1KJj4j4J0L2L0J4Lkj5j8OM5N9L5%k1k9l2k3NL5M0K3J1J3J7J2kj4l0n5o8m6kL1L3
-202B54J9J6K8L6K9J3K%KMPPpl5o0n3j8J6K6J5Onk3l8l1j1%mML3N8N5L3K0J2lk3l6l3k5j1
-219B79QK1J3mj0l%kkkqk0k5j9j4kK7N6N5J6k4l2j6nllkj0k0k3j4JJ5K4J9Nponj6l0l0j5K
-239A69RJ3J5J4J5K0K1J3ok3k7j9OL3M3L0Rnj0j6k0j1%kj1rOJ5R%%K%j2k8m3m7k9RM3N2M1
-257B69K7K2K2K4J8LrnRJ6Qjkok0l0j9%Qnk5l9m6m2k6nPJ0J7K9K6Mk0k4qRJ3J0Mnj3j0PL3
$$ y = [168, 201, 258, 323, 375, 399, 393, 374, 361, 359, 362, 363, 362, 368, 384, 407, 430, 445, 449, 445, 437, 420, 385, 333, 280, 250, 257, 293, 333, 359, 373, 383, 386, 370, 332, 291, 264, 250, 241, 238, 246, 259, 266, 263, 266, 281, 297, 303, 296, 285, 272, 257, 240, 228, 223, 224, 231, 243, 253, 252, 237, 217, 204, 209, 234, 272, 307, 324, 322, 314, 311, 312, 311, 304, 304, 319, 343, 358, 355, 345, 337, 333, 322, 295, 251, 206, 180, 182, 207, 236, 257, 267, 259, 234, 212, 217, 247, 272, 262, 230, 205, 203, 212, 219, 220, 219, 225, 249, 294, 342, 366, 356, 329, 305, 291, 295, 317, 349, 375, 388, 393, 386, 357, 309, 263, 233, 212, 193, 182, 184, 185, 171, 157, 167, 199, 229, 243, 246, 244, 229, 211, 217, 262, 321, 356, 356, 335, 306, 274, 251, 256, 291, 331, 354, 365, 378, 395, 407, 405, 391, 361, 306, 238, 192, 190, 221, 254, 273, 289, 317, 353, 382, 395, 397, 397, 399, 403, 410, 417, 410, 375, 315, 262, 244, 260, 286, 301, 307, 302, 279, 241, 210, 199, 199, 195, 199, 232, 290, 345, 378, 398, 410, 407, 384, 348, 315, 290, 279, 287, 308, 321, 317, 307, 304, 304, 302, 300, 298, 290, 270, 245, 226, 212, 210, 237, 293, 348, 364, 340, 308, 292, 287, 284, 281, 279, 269, 249, 226, 212, 213, 228, 252, 271, 276, 269, 263, 258, 242, 212, 182, 167, 169, 178, 191, 206, 220, 235, 255, 276, 289, 283, 260, 233, 214, 220, 253, 296, 326, 335, 330, 320, 304, 284, 273, 273, 271, 260, 251, 257, 272, 281, 281, 281, 283, 283, 271, 243, 200, 153, 124, 133, 176, 228, 269, 296, 318, 340, 364, 382, 385, 376, 371, 380, 396, 404, 403, 401, 395, 375, 345, 326, 326, 334, 329, 304, 265, 219, 177, 151, 146, 153, 163, 180, 209, 235, 239, 219, 195, 187, 196, 209, 219, 223, 218, 205, 195, 202, 235]
-276B35N2N1L0NrpPJ7J3mk4l5l3k5j8j6j4plj0j9j5KJ6J9J7J8K1J0j1k5j8LJ8J9Mj1j5pKj
-294B32j1pJ2K4J4pk1k8l8m0j8K6N4M4J3pJJ7K4J7Onj4k8l9l7k4rJNJ1J4RQJ6K5K2Lj3j0%
-311B42PQJ1J5J7J6J4Pmj6j9k1k3k1j4j1j8j7ML3M7L8K3J3Moj3j5j7j3MK3K3NrmKnoRK2J4
-330C49oj3pqj9k1rJpj3kJ4J8Rlj0j9k3j1J2K7K5J0%kJjnnnpj0qOK1K7K0J4J2Rkrj3j1j1q
-349C07jRJ8K1J8Kj6k3j4%jj3k2j8j0j0j3nJ3K3J8LnJJ4K6K4J1j1k4j4J3K7Rk8m3k5JO%MJ9
-368B91K5J7RJ1Pj0l2l5k0jJ2J5K0L1M1L7J8j1l5m3l4rJ7K6J3rj6j4j6k6k2KL0L4J8%qj6k1
-385B96j5OK6K6Mj9k5j5ljkJMlj5pJ9L6K0j2k4qLj1m1n4l4kK6L9M3L8K0lj5pQLj7l3k9k3j9
-403A81j3NJ9J8%j6k7k6j0J9L7L2J5J7K8K4jj8j3JNkpj6k6l0k1j2rlJ0J9J4OJ7L6L4J0pmL
$$ y = [235, 287, 338, 368, 373, 364, 357, 364, 381, 394, 390, 366, 331, 298, 273, 255, 239, 225, 218, 215, 205, 186, 171, 173, 189, 208, 225, 243, 264, 274, 263, 238, 220, 223, 241, 260, 264, 253, 238, 231, 233, 232, 221, 214, 226, 250, 264, 257, 236, 208, 170, 130, 112, 138, 192, 236, 249, 242, 243, 260, 284, 301, 307, 302, 288, 260, 221, 184, 160, 151, 152, 157, 168, 182, 191, 199, 215, 240, 262, 265, 252, 242, 242, 249, 257, 268, 283, 300, 316, 330, 337, 333, 317, 298, 277, 254, 233, 219, 208, 190, 173, 177, 210, 257, 295, 318, 331, 335, 329, 316, 301, 284, 271, 275, 298, 321, 326, 317, 313, 315, 310, 304, 313, 335, 349, 343, 330, 323, 315, 296, 275, 266, 267, 260, 247, 245, 259, 277, 286, 283, 273, 254, 231, 220, 232, 259, 284, 294, 294, 292, 293, 292, 287, 282, 277, 270, 260, 252, 258, 279, 306, 326, 340, 352, 361, 359, 350, 337, 326, 315, 307, 306, 315, 333, 354, 372, 374, 358, 335, 321, 321, 320, 307, 285, 267, 257, 247, 234, 229, 242, 265, 283, 286, 281, 282, 296, 322, 346, 357, 346, 322, 308, 321, 348, 357, 329, 286, 261, 262, 268, 268, 272, 291, 316, 333, 342, 353, 360, 350, 318, 283, 263, 262, 274, 289, 309, 340, 381, 418, 436, 425, 390, 347, 313, 304, 321, 347, 360, 351, 335, 321, 305, 279, 257, 259, 289, 323, 341, 341, 333, 317, 296, 281, 287, 313, 339, 343, 324, 299, 284, 281, 280, 278, 279, 283, 280, 265, 258, 277, 313, 333, 321, 297, 289, 292, 281, 240, 186, 152, 150, 176, 215, 258, 296, 316, 313, 298, 291, 299, 302, 285, 252, 223, 200, 181, 168, 173, 192, 210, 210, 194, 167, 141, 131, 150, 187, 219, 234, 251, 279, 303, 302, 284, 271, 272, 277, 275, 268, 252, 226, 196, 175, 163, 154, 151, 161, 180, 194, 200, 217, 253, 287, 297, 290, 286, 289]
-421B89lj1jK1L3K1kj7k0j6j3j2rj0j6k1j5JJ4J3J2K5M2M6K7lk2k1j3rk0l3l6k6j3mJ0K9L5
-438B52J6j9l3k0OK2L0L4K4ol4k9OL6K7nl2l4k6j8j0mNJ1K3L7M4L9K4J2Nmj0pKQONLpk7m3
-456C09m5k8KK9L6J2k4l4j5Nlk7l1j4OJ1MlrnJ3L7L9J6j5l2k7j3QK2K8K6K3K0Qrj6j0lJMN
-474C01ql4n4m8k1%NOJ0K1K5J2j4l2j9K0M8M0J1mJPLkJM%j5l3l5j7J6L8L0Nj4j5j0nMK4M1
-493B93M2K8Qnj1mOJ1Onj8k8k6j4KJ0ROMJllLQNpj8l2m0l3rJ4K1J4J5K7M1L7K1Omj1j8j7j
-512C31K2L3K2%j6j6j4k0k7k7k1j9j8j3%J7K6J9jj5rPJ5KrnMLkMJ2J0%LJ5J2j4l4k8j2nqo
-531B18j%lk%lokJjjQJ9J6kj9l0l1k1kJ5J8J6J6J9J8J7J9J3qj8mJ9J7kj4rj1j9j6lmj9k0O
-550A84K2Nj4jK0J3j3j8KJ8J9K5L7L0ll1l2j7mLJ0J3J1J5K1J3ok0j0QRj1l3l6k1l%nmQJ4M
$$ y = [289, 286, 275, 274, 295, 328, 349, 347, 330, 310, 294, 281, 269, 260, 250, 234, 213, 198, 199, 213, 226, 238, 263, 305, 351, 378, 375, 353, 332, 319, 310, 290, 257, 221, 195, 182, 178, 188, 217, 252, 268, 249, 216, 196, 202, 224, 254, 288, 312, 306, 272, 243, 249, 285, 312, 307, 275, 241, 215, 197, 187, 183, 188, 199, 222, 259, 303, 342, 366, 378, 383, 379, 369, 362, 364, 372, 378, 383, 386, 379, 352, 309, 264, 236, 238, 267, 303, 315, 291, 257, 242, 247, 244, 217, 186, 172, 178, 189, 193, 190, 181, 176, 189, 226, 265, 281, 266, 234, 207, 194, 202, 224, 252, 278, 301, 321, 329, 320, 304, 294, 291, 292, 296, 301, 293, 259, 205, 157, 136, 136, 141, 147, 157, 178, 203, 215, 201, 169, 150, 170, 218, 258, 269, 265, 266, 273, 276, 274, 275, 279, 279, 264, 231, 196, 179, 195, 233, 263, 268, 254, 239, 229, 224, 228, 252, 293, 335, 363, 371, 366, 355, 351, 357, 368, 374, 369, 351, 323, 297, 283, 285, 295, 304, 310, 314, 315, 312, 309, 312, 320, 325, 318, 300, 268, 228, 195, 186, 200, 221, 235, 250, 277, 318, 355, 376, 382, 378, 367, 349, 332, 331, 353, 386, 408, 408, 392, 376, 362, 342, 315, 288, 267, 248, 230, 217, 217, 234, 260, 279, 278, 263, 254, 261, 276, 278, 269, 264, 268, 271, 269, 273, 285, 295, 295, 298, 313, 325, 311, 277, 249, 237, 232, 224, 218, 217, 217, 214, 212, 212, 209, 203, 201, 202, 201, 200, 208, 227, 243, 241, 222, 192, 161, 140, 138, 153, 171, 187, 203, 222, 240, 257, 276, 289, 281, 263, 259, 278, 295, 293, 279, 270, 259, 240, 224, 221, 217, 198, 178, 184, 206, 211, 197, 196, 216, 229, 216, 198, 200, 218, 237, 262, 299, 329, 326, 295, 263, 246, 242, 245, 255, 268, 279, 294, 315, 328, 322, 302, 292, 300, 309, 298, 265, 229, 208, 205, 205, 200, 196, 204, 218, 222]
-568B22jJ4L2K2rk3nJ1OJJ3K2J1kNJ6J3PJ1J3j3m9n3k3MMj1j6pLPMjOK2K8Pk8m1k5jQJ4K8
-587B46L9L6K1Ooj7j9j1%PROol0m7m7k7lJ5J5jk0k5k1k5l7l3jL8N4M9M3L3J2k1m1l3rJ0J8
-605A77J8J8J8J5Qnj2JK6L8K5KmPJ8J3Koqj2k2k9k3pPKj8m2n6n1l5rK0M0M2K5RPJ2OkQL3M6
-624C02K4j0k3qMLjOJ7K1J7J0nk3l6l1j4lqj9k6j7JR%j3j4prk0j8J0M0M8L5K4K7L5L3K1Np
-642C80oKM%onqj8k5j3J1K6J3j5l7m1k8qMONLlj1j0kQJ3J8K1Rj6k7pJ9K3QJMjj0j1%jj9k9
-662B21j9okOL2N2M1J2pkLok3l0k5rJ3K8K4Kj9j9kJ7K1Nj8k9j7QK5K3RlpnnnkNJ0J2Pjj2k3
-682B80l4l6k6oJ7L1K9RqpJ2K9K6J0klMQNnk1l3l5k8k8l3k9rRJ1lj3rOJ6K3L1M0M1L5J9Lj9
-701C07l7m0k2RK5J6kj2oOJ3J0NOJ4K3K1Prj7k1j9j4mPRNKMJ0Pmj4j5qqj0oJ5L4L0ll5m1k3
$$ y = [222, 221, 235, 267, 289, 280, 257, 252, 263, 269, 270, 283, 305, 316, 314, 319, 335, 348, 355, 366, 379, 366, 317, 264, 241, 245, 249, 238, 222, 215, 218, 225, 229, 228, 234, 256, 284, 291, 263, 222, 197, 196, 204, 218, 246, 285, 321, 342, 348, 342, 325, 306, 295, 295, 302, 311, 317, 311, 281, 234, 187, 160, 157, 172, 187, 186, 166, 141, 120, 95, 58, 25, 24, 62, 116, 165, 208, 241, 253, 232, 191, 158, 149, 159, 177, 195, 213, 231, 246, 254, 249, 237, 238, 264, 302, 327, 329, 325, 332, 350, 363, 365, 359, 351, 339, 317, 288, 265, 258, 265, 267, 249, 207, 151, 100, 65, 56, 76, 116, 158, 183, 192, 199, 211, 217, 215, 223, 256, 302, 326, 316, 293, 285, 289, 292, 291, 297, 314, 335, 352, 362, 357, 334, 298, 267, 253, 250, 242, 223, 197, 180, 181, 190, 190, 177, 163, 156, 147, 127, 109, 119, 159, 207, 242, 266, 293, 328, 361, 382, 387, 380, 374, 376, 380, 380, 374, 369, 361, 343, 318, 305, 316, 342, 355, 340, 303, 262, 234, 226, 230, 236, 241, 244, 241, 230, 220, 218, 226, 239, 257, 278, 287, 271, 244, 237, 256, 279, 287, 288, 292, 291, 281, 270, 270, 269, 250, 221, 202, 196, 194, 200, 232, 284, 325, 337, 330, 328, 331, 325, 302, 272, 247, 238, 251, 279, 303, 305, 286, 267, 265, 282, 303, 308, 290, 261, 244, 252, 277, 300, 309, 306, 299, 294, 289, 284, 282, 287, 297, 309, 316, 315, 303, 280, 246, 210, 184, 178, 195, 226, 255, 264, 256, 249, 261, 290, 316, 326, 324, 321, 325, 333, 338, 333, 312, 279, 244, 216, 188, 155, 126, 117, 126, 137, 134, 121, 112, 118, 134, 157, 188, 228, 269, 304, 323, 326, 307, 270, 230, 208, 217, 242, 258, 256, 244, 238, 244, 257, 267, 272, 278, 292, 315, 336, 343, 334, 317, 296, 277, 263, 259, 266, 275, 280, 282, 286, 296, 303, 299, 285, 270, 262, 254, 244, 238, 253, 287, 317, 314, 279, 238, 215]
-720B15JJ3J1mk1l0j9LJ3lk6k8j0OKroJ3K7J9QJ2K9L1Rj7k2mJ6K2J0nj6j7j0ljmpjNNnj2r
-740A81mjk%Jj3k9k9lK4L5L4L6L6J5k0l7k2RL9O4P7O7K9j4m2n3n1l2oKj3l1k9j2LJ4L0L7K1
-757C11lj3pj0k0k1rqk5k4J2M7M0Kk1nK0K8K0J1Mrj8j7pjqk1k5j2MJ0MlJJ0Qnj4j3j0j5k1
-776A67j6JJ4J5J0OPN%nJJ0J5Qnj4j0JNkj0mJ1J9RkPK4K6Qrj3j9k9k7KM0N2L7K1K1K6J8nl0
-795C86m5m3k3LJ8J4kj3j2lPJ9L2M3M1K4kj8j8j6k2k9k8j7j5k2k0KL0L8K1%j7k3k3j2jjj1
-812B42k1k2j1J0L5M6L9K0J5K0J5mj7j1ok3m4m4j9JRJ9L5L9K0oj9j6j1nMJ3J5J0Jj1k8l9m2
-829B09l8l3j9MK2K3J2LNJ2J6J4QjnJJ5K7L0K4J6J0J3J5Mk6n5n6k9jJ0OjokNOqk3j9MK5K7
-848B44J8Kj7l2l4k2oRK9M7M5K5QJoj9k6j5mKJ0L3M9L9K1K0L0K0j1l7m1l5l2l6l9m3l9k5n
$$ y = [215, 216, 229, 240, 236, 215, 185, 166, 169, 182, 179, 153, 125, 115, 121, 123, 114, 108, 121, 148, 167, 175, 187, 216, 247, 256, 239, 217, 213, 229, 251, 261, 256, 240, 223, 213, 210, 209, 205, 198, 197, 202, 207, 202, 190, 181, 177, 176, 174, 174, 175, 162, 133, 104, 101, 125, 160, 194, 230, 266, 281, 261, 224, 202, 211, 250, 314, 391, 458, 487, 473, 431, 378, 327, 295, 289, 291, 278, 247, 218, 206, 209, 223, 253, 290, 311, 308, 295, 288, 278, 258, 237, 228, 220, 195, 171, 183, 230, 270, 272, 251, 246, 266, 294, 314, 325, 329, 320, 302, 285, 278, 277, 269, 248, 223, 211, 215, 225, 229, 226, 227, 237, 245, 240, 226, 213, 203, 188, 167, 151, 152, 166, 181, 191, 197, 204, 209, 209, 204, 205, 215, 230, 238, 233, 219, 209, 210, 215, 213, 203, 199, 210, 229, 238, 236, 243, 267, 293, 301, 292, 279, 260, 231, 204, 206, 246, 298, 335, 356, 377, 403, 421, 416, 386, 341, 298, 275, 278, 296, 310, 308, 295, 283, 280, 287, 306, 338, 381, 422, 446, 444, 426, 408, 392, 370, 341, 313, 296, 281, 259, 239, 241, 271, 309, 330, 330, 313, 290, 267, 255, 254, 253, 242, 221, 199, 188, 198, 233, 279, 318, 338, 353, 373, 388, 384, 367, 356, 350, 327, 283, 239, 220, 221, 230, 249, 284, 323, 343, 337, 318, 302, 291, 286, 290, 303, 318, 328, 329, 318, 290, 251, 209, 171, 138, 119, 123, 145, 168, 180, 183, 188, 200, 216, 230, 238, 237, 232, 233, 248, 275, 305, 329, 345, 355, 368, 383, 387, 361, 306, 250, 221, 220, 230, 236, 235, 229, 227, 232, 238, 230, 207, 188, 192, 217, 244, 262, 264, 247, 215, 181, 159, 153, 162, 191, 238, 283, 308, 316, 317, 311, 292, 266, 251, 247, 249, 259, 292, 341, 380, 401, 421, 451, 471, 460, 423, 382, 347, 315, 279, 240, 197, 158, 133, 128]
-864A28RJ7K9L6J8j8m1l1lJ3J0MMJ1J0ol0l8nM8P6N4Ml2m4m5l9j9J2L2L0J4LMJ3J5R%lJ%q
-883B42j8j9j6j0kORNNQOj1k5j7J2L4L6K2Nj2k6k4qQJ3QMLlj5k3j5QL3L7J2k1k8oJ3Jk5k9
-901A77kK3K6J7J3J5Oj0j7j2kLLQJ4J8Qj4l8m6k9%K1K3J7J9K5K6J7Mrk0l1l6k5kJ8K5J9J8
-919B70L1M5L7Qk4m0l9l4k9k4j9j5nJ2K6K3Mk0l1k9j6JJ6K2K2J7J2QJ1J5J4RNJj1k4k4mJ7
-936B38J9QQK2K9J4pk0k2k7l4l4j9OK0J1j6l7l1rJ1K2L0L1J3rj9j5j6k6k1RM2N1M1L1K1Lj8
-952C00k3j9j9l1m1m1k9j3OJ9K5K5K7K5J0jQK8L5K8K0K1J8Kj1j5j9l2l4j3J3K3J9J6J6jk8
-969C14l7j3K3L5K1Jrj5k2k3j4jJj4l5l8j7J2K1%l0l7j6J4K8K0RMQJ6K5L1K4Oj0j0%OMMOL
-987B95pj5j7j1rrj2j2j1nKRJ2J7K5L1K5Poqorj4kJ9K3jk9k9JL0L4J5nj6j4rpj6k6k3LL1L4
$$ y = [128, 137, 154, 183, 219, 237, 219, 178, 147, 144, 157, 167, 171, 175, 186, 196, 190, 160, 122, 117, 165, 241, 295, 299, 267, 223, 178, 139, 120, 132, 164, 194, 208, 211, 215, 228, 243, 252, 252, 249, 250, 250, 242, 224, 205, 189, 179, 177, 183, 192, 197, 202, 210, 216, 205, 180, 163, 175, 209, 245, 267, 272, 260, 234, 210, 202, 210, 223, 231, 235, 238, 235, 220, 197, 182, 190, 223, 260, 272, 251, 223, 217, 230, 231, 206, 177, 175, 198, 224, 241, 254, 269, 275, 265, 248, 236, 234, 237, 240, 248, 262, 280, 288, 274, 236, 190, 161, 161, 182, 205, 222, 241, 266, 292, 309, 313, 304, 284, 253, 217, 192, 190, 208, 233, 252, 270, 301, 346, 383, 391, 367, 327, 288, 254, 225, 201, 182, 167, 162, 174, 200, 223, 227, 207, 176, 147, 131, 132, 148, 170, 192, 209, 221, 229, 240, 255, 269, 278, 283, 284, 273, 249, 225, 221, 238, 257, 265, 273, 295, 324, 338, 331, 311, 289, 262, 228, 194, 175, 181, 201, 212, 196, 159, 128, 119, 130, 152, 182, 213, 226, 217, 198, 183, 167, 141, 120, 129, 171, 222, 263, 294, 315, 318, 300, 277, 258, 239, 208, 167, 126, 97, 84, 90, 109, 134, 159, 186, 211, 221, 220, 228, 256, 291, 319, 339, 360, 378, 380, 369, 354, 335, 303, 269, 256, 269, 292, 311, 327, 343, 342, 314, 277, 264, 287, 322, 343, 344, 335, 320, 298, 275, 261, 260, 261, 247, 212, 174, 157, 169, 190, 190, 160, 123, 107, 121, 149, 169, 178, 182, 190, 206, 231, 262, 286, 292, 282, 272, 272, 278, 282, 286, 292, 295, 288, 273, 256, 245, 236, 227, 215, 203, 192, 187, 189, 198, 210, 227, 252, 283, 308, 315, 309, 301, 295, 286, 272, 270, 289, 312, 311, 282, 253, 254, 284, 318, 333, 328, 312, 298, 289, 282, 266, 240, 217, 220, 251, 285]
-1006B85J2j8l6l8k4JK5L5K9K1J3Oqk3k7j7lLlj8l1l2k7j6%K4N1O2M7J5rqOJ6J1%j0k2l9m6
-1023B07k8NK0Kj9k1j0rpJ4M7N8L9J4RJ2Okk%pj5qROk2n2n1k6nJmkQJ1LjJ1K5K2%j5pJ1J6
-1043B43J2J1J1%k3l9l1j1LQJ3J7J4QJ0J7J8NpMK8L4Pk3k6j3rj7j3NOj5k8nK4J9j4k8rRjk4
-1061A90k7qJ3K3K8K9K5J2j0k9l9l0rRJ4J0Ojj2j9j4mlj0j7j3ppo%NNJ%QJ1J0PNJrj6j6nP
-1080A08J5J6J1NQJ9L1L6K9J7J0J3J9J4ql0l1j2%rk1j8oklJMmk1l0k2j2%J7L1K6J2J4L3L3
-1098B93ml9l3OL5L6K8J7jk2k3%K4L0J7Kqj1j3j8k7k5j0QQkqnmproj2k4k9k0qlknj6k8j9J2
-1117G5M3M8L2J3LJ1L0N0N1K7lk5m0n1m6k1QJ8J6K0L5M0K0j7m4m6k2QK6K4J5J0Jj2k4k1qJ
-1133B45jkKJ3K4K3J3jpoj1k1k1nOlj7j5mlj2j1OK0J2pj9k0j6qkKKLJ1J7J3Kl%N%rrJ0L9N3
$$ y = [285, 297, 279, 243, 205, 181, 182, 207, 242, 271, 292, 305, 311, 303, 280, 253, 236, 233, 236, 233, 215, 184, 152, 125, 109, 109, 133, 184, 246, 293, 308, 299, 291, 297, 313, 324, 324, 314, 292, 253, 207, 179, 184, 204, 206, 187, 166, 156, 147, 140, 154, 201, 259, 298, 312, 321, 333, 339, 337, 335, 335, 328, 313, 305, 314, 320, 298, 246, 195, 169, 164, 165, 161, 159, 167, 178, 181, 180, 191, 216, 238, 238, 223, 216, 227, 243, 255, 266, 277, 277, 254, 215, 184, 173, 176, 184, 197, 214, 228, 236, 246, 263, 281, 286, 279, 283, 311, 345, 352, 329, 303, 290, 281, 264, 251, 256, 262, 247, 219, 214, 238, 257, 243, 215, 206, 215, 214, 190, 163, 155, 168, 191, 219, 248, 273, 285, 275, 246, 207, 177, 168, 177, 191, 201, 207, 206, 194, 175, 161, 157, 154, 144, 127, 114, 107, 100, 94, 94, 99, 104, 105, 105, 113, 124, 134, 141, 146, 147, 138, 122, 106, 101, 108, 123, 139, 150, 155, 163, 182, 213, 249, 278, 295, 305, 318, 337, 351, 343, 313, 282, 270, 270, 261, 240, 222, 216, 214, 211, 212, 216, 212, 191, 161, 139, 127, 127, 144, 175, 201, 213, 227, 260, 293, 289, 250, 217, 223, 258, 294, 322, 339, 338, 316, 293, 293, 317, 347, 364, 366, 358, 347, 334, 316, 289, 264, 254, 262, 270, 268, 260, 255, 251, 244, 235, 229, 217, 193, 164, 144, 136, 133, 131, 126, 110, 82, 63, 75, 118, 166, 198, 211, 214, 225, 255, 305, 356, 383, 380, 355, 315, 264, 218, 197, 205, 223, 239, 259, 294, 334, 354, 337, 293, 247, 225, 233, 259, 283, 298, 308, 309, 297, 273, 252, 244, 245, 244, 242, 244, 257, 281, 304, 317, 316, 309, 303, 292, 271, 250, 245, 251, 248, 231, 216, 212, 209, 197, 186, 192, 212, 224, 217, 198, 178, 162, 154, 152, 154, 156, 159, 170, 187, 200, 202, 199, 199, 204, 204, 195, 186, 196, 235, 288]
-1154B88M3K1lk0k8j9%Qjj2lJ1Kk4m1l2j5j0j6k0j9j5j0ppmJ0L0L9K8Qknj2k2k4j2QJ7J4O
-1171A50RJ9J6krJ3M1M3J9%%mk3l9l0mJ1J4J1J0PQJ3J3Kj1j1l%llLOKjOJ5J9J8J7J3Mj5m0
-1190C04n3l8mK1J8Ml%%pj2j0pkMKj6l1k3J2M4N0L7J8%j9l2l6l5l3k7j6kJ6L9N8N2K5RJ6L1
-1208C54K0j0l0k3pNJ5K7L2J8j3m2m5k4JR%j1nQQpj9j9j7k0k5k1j3nkPJ7J7Nrj9k1j9j2mJ
-1226A02OJ7L2L6K1%j0jJ4K3J7Jj0nJ3L0L3K4Pj3k7k1OL2L4K0Ook2l7l4j2kk1m9m7j3K4L7
-1243B05K9K1J7J3OLMKpj9k0j6j5j9k2j9k0j8%L5O0M1kl1k6j0%KRR%oMJ0nk4k3LK4K9K3K1
-1262B68K0Oj3k6l0k5pJ4K6J7%oMK1K3J0j1k4k1rMNmj8k2j1OJ6J7K2L1L5J9j1l3l8l2k9k6
-1278A68j6J0L8M9L3Q%Mlk9m9m7k7j3mJ6L6M2K9J2Loj3qJ0L1M0L9L1J5qk6k7j1PJ3MooMJ5
$$ y = [288, 331, 352, 349, 329, 301, 282, 282, 290, 289, 277, 274, 285, 287, 263, 222, 190, 175, 165, 149, 129, 110, 95, 85, 78, 71, 67, 77, 107, 146, 174, 182, 180, 175, 163, 141, 117, 105, 113, 130, 144, 150, 159, 178, 194, 192, 183, 196, 237, 280, 299, 299, 299, 295, 272, 233, 203, 199, 210, 224, 235, 245, 252, 260, 273, 286, 288, 277, 266, 263, 263, 260, 257, 260, 266, 268, 267, 273, 288, 307, 325, 342, 355, 359, 344, 304, 251, 213, 209, 230, 248, 252, 249, 249, 249, 242, 230, 220, 213, 211, 215, 217, 201, 170, 147, 159, 203, 253, 290, 308, 308, 289, 257, 221, 186, 153, 126, 110, 108, 124, 163, 221, 273, 298, 307, 323, 354, 374, 364, 334, 311, 304, 309, 324, 351, 383, 401, 388, 346, 301, 277, 278, 287, 287, 276, 271, 279, 287, 280, 261, 242, 225, 205, 180, 159, 146, 141, 139, 146, 163, 180, 185, 176, 157, 136, 117, 105, 101, 102, 108, 125, 157, 193, 214, 214, 204, 203, 217, 240, 257, 258, 248, 243, 256, 286, 319, 343, 350, 337, 310, 289, 295, 327, 361, 381, 387, 381, 359, 322, 288, 276, 274, 253, 204, 157, 144, 168, 205, 234, 255, 272, 285, 291, 294, 298, 300, 293, 274, 254, 238, 223, 204, 182, 163, 143, 125, 125, 160, 220, 261, 259, 228, 202, 192, 192, 194, 203, 212, 212, 206, 210, 220, 215, 191, 168, 171, 195, 224, 247, 268, 288, 294, 281, 255, 225, 200, 193, 207, 233, 250, 250, 244, 248, 269, 292, 302, 291, 267, 246, 237, 241, 246, 242, 224, 202, 191, 197, 213, 230, 252, 283, 318, 337, 326, 293, 255, 223, 194, 168, 152, 162, 200, 249, 282, 290, 290, 294, 291, 262, 213, 166, 139, 126, 122, 138, 174, 216, 245, 257, 260, 254, 241, 233, 243, 274, 314, 353, 384, 399, 391, 365, 338, 327, 334, 347, 351, 345, 339, 343, 358]
-1296C58J2kk1m3n9n8m1j9nPK6M1L7J7M%j0k5k8j4%RK1L4K7jj9lK5K5Mj0jJ2J0qk4l2k7j3
-1314B06JN%mooJRQpj5qKJkJ4L9M5K8J7K0K6K5K3K0Ok3m2l7j8nkoj2k2k7j8kJ2K0K4K2J4O
-1333C32NLpj9k8l0j8MK8L3J5prOK0K3J5Onj4j5j1kPJ2J0QJ1J7K0J3Jj0k1k9l1k3j5j7k6k6
-1350B26rJ4K3J3OJ6L2L2Oj6rJ8K3Jk4k5j4j3k3k8k5k1k0j2OK7L7L3J7mj1lPLj0j6j0KRJ1
-1368B69J0Okqj4k2k6k0j0j0j2KL0M8L7J4JMJ2J1%j4k9k7oJ5J2oj2J1M1M3K1%omqj3j2o%P
-1386C27J7J6R%%jj0k0j2PJ3lk3j9KK2K7K2J7Qlj7k6k5j8rpj0j3j0lPJ5J5Onj0oloj0qj%k
-1405B50nj2j6j2LJ4J2KKRQoj4qJPJ3K2K1Jk0k2mPkj4j0MNj8l8l9j8LJ4J9K4L2L6L1K0Rjm
-1425C06moj1j0KJ7K0Pj0j4p%knKK0L0K1Lqj2j8k8k0J0L5L0J0NJ8K1%k4l5k8j8roj0j5pRJ5
$$ y = [358, 370, 368, 347, 304, 245, 187, 146, 127, 122, 129, 155, 196, 233, 250, 254, 254, 244, 219, 191, 177, 177, 186, 207, 241, 268, 267, 248, 245, 270, 295, 299, 289, 288, 300, 310, 302, 278, 246, 219, 206, 207, 212, 212, 208, 202, 196, 197, 206, 214, 207, 192, 184, 186, 187, 185, 199, 238, 283, 311, 328, 348, 374, 399, 422, 442, 448, 425, 383, 346, 328, 323, 321, 315, 303, 281, 254, 236, 234, 246, 266, 290, 312, 326, 332, 337, 340, 333, 314, 286, 256, 238, 242, 270, 303, 318, 311, 302, 308, 328, 351, 366, 372, 367, 353, 338, 327, 325, 332, 344, 354, 362, 373, 390, 410, 423, 424, 414, 393, 364, 333, 310, 295, 278, 252, 226, 217, 231, 254, 267, 273, 289, 321, 353, 359, 343, 334, 352, 375, 376, 352, 327, 313, 300, 277, 249, 224, 203, 183, 171, 177, 204, 241, 274, 291, 287, 276, 273, 280, 283, 273, 257, 247, 249, 258, 269, 279, 285, 283, 275, 261, 239, 213, 193, 183, 173, 161, 163, 193, 241, 278, 292, 293, 297, 309, 320, 320, 306, 277, 250, 244, 259, 271, 265, 253, 264, 305, 348, 369, 369, 363, 359, 351, 338, 326, 320, 320, 327, 344, 360, 369, 369, 369, 368, 358, 338, 326, 333, 346, 343, 320, 301, 303, 325, 352, 374, 391, 399, 396, 379, 353, 328, 310, 301, 294, 284, 271, 261, 258, 265, 280, 295, 301, 296, 286, 280, 277, 271, 261, 253, 252, 252, 250, 245, 233, 217, 205, 208, 222, 234, 236, 238, 247, 255, 249, 235, 227, 228, 235, 248, 270, 291, 292, 272, 250, 246, 253, 251, 237, 227, 231, 236, 218, 180, 141, 123, 126, 140, 159, 183, 215, 251, 282, 302, 311, 310, 306, 302, 296, 285, 275, 277, 294, 314, 321, 311, 297, 290, 290, 288, 283, 285, 305, 335, 356, 359, 351, 339, 321, 293, 273, 283, 318, 348, 358, 363, 381, 402, 402, 378, 343, 315, 297, 288, 282, 272, 257, 250, 259, 274]
-1443B74Jj3j2mk%J3K9K5%j8j9j3j0rjKJjLQKkNK0L2L5L2K5J2Ljkj0k2k7k6k4k7k6k1j8j6
-1462A98oJ3K4J3npJ2K8J7oj9rQK0J9J0Jnpprj3j9j7pJ1K3K1RMJ7L2L0Rj4k6k8k5k1j3njk
-1480B48qj3rJLj1k3j5RK0Qqj3j0oJJ5K0QoLK4L3J8NQK0K5K2J6jl4n7m7j3Pjk0k8k4k8l7k6
-1499G6RM2M6K9J8K6L0J8jlJ1J8J3MLQJ4J9K1J3mj5j1OJ8Rj4l5l8k6j2rj4j7j5j4j7j8k0k6
-1516A42l2k8j1QK2L0L0J7nj3KK4K6J2jKJ4J9J5Mrj5j5j3pRL2M5L0lk2j7kjj0j5j0JJ2J7J2
-1534B96jr%K1L8L4J5mrkQJ4J9J8J0pk3k3j4qj2j5j2pmljJnj7k8l2k4pJ0K2L1M4N5M2Jl7l9
-1553C36j0J6J7lk2k5j8oMJ0J5J7J3PMJj0k5k8rJ4J9QkLJ4K1K1J5ml0m8m9m0l4k8j7LK2L5
-1570B07L9L6K4PllMNkj1nJ3J9Lj9l1k9k9k6pK4L6J9pj2%J2J3J1MloLJ1Pjomrj7j6nPJ6K6
$$ y = [274, 275, 262, 250, 246, 244, 244, 257, 286, 311, 311, 293, 274, 261, 251, 242, 241, 243, 244, 243, 246, 254, 256, 254, 259, 279, 311, 346, 378, 403, 415, 418, 417, 415, 405, 383, 356, 330, 306, 279, 253, 232, 214, 198, 192, 205, 229, 242, 237, 230, 242, 270, 287, 281, 262, 253, 261, 281, 300, 310, 311, 306, 299, 292, 283, 270, 251, 234, 227, 238, 261, 282, 291, 295, 312, 344, 374, 383, 369, 343, 315, 290, 269, 256, 251, 250, 248, 240, 227, 218, 219, 222, 211, 188, 173, 182, 202, 210, 202, 189, 179, 173, 174, 189, 209, 217, 211, 214, 238, 271, 289, 294, 302, 322, 347, 369, 385, 384, 350, 293, 246, 233, 240, 239, 219, 191, 167, 139, 102, 76, 85, 127, 173, 202, 220, 246, 276, 294, 293, 290, 301, 319, 332, 336, 339, 347, 361, 380, 401, 414, 410, 395, 384, 390, 408, 417, 403, 368, 330, 304, 292, 283, 269, 252, 237, 223, 206, 188, 168, 142, 110, 82, 71, 79, 101, 131, 161, 178, 173, 160, 162, 186, 212, 224, 223, 225, 239, 258, 273, 277, 268, 253, 238, 225, 218, 227, 259, 304, 334, 331, 309, 292, 290, 289, 279, 264, 254, 255, 267, 284, 296, 295, 286, 286, 307, 345, 379, 394, 390, 381, 379, 387, 401, 420, 438, 448, 441, 418, 395, 381, 373, 361, 346, 334, 327, 323, 320, 319, 320, 315, 298, 270, 238, 214, 207, 217, 239, 270, 314, 369, 411, 412, 375, 336, 326, 342, 359, 356, 334, 309, 291, 285, 289, 299, 314, 331, 344, 351, 355, 356, 346, 321, 293, 284, 298, 317, 325, 323, 326, 340, 361, 382, 397, 393, 363, 315, 266, 226, 192, 164, 147, 150, 172, 207, 246, 282, 306, 313, 310, 307, 311, 316, 314, 303, 298, 311, 330, 333, 314, 283, 254, 225, 199, 192, 216, 252, 271, 264, 252, 252, 264, 277, 288, 292, 289, 283, 286, 297, 304, 303, 297, 293, 284, 267, 251, 246, 253, 269, 295]
-1590B95L0J4k2m7l8qJ7K3L0L7L2Ll4m9l4kK1L0K6J9Rkj7l0m2n2m8k7MK7K9J8Mnj2j6j7mK1
$$ y = [295, 325, 339, 317, 270, 232, 224, 241, 264, 294, 331, 363, 366, 332, 283, 249, 247, 268, 298, 324, 343, 352, 350, 333, 303, 261, 209, 161, 134, 138, 165, 194, 212, 216, 211, 199, 183, 166, 162, 183]
$$ [...]
-3135B78
##END=	
##END=	
