##TITLE=	Jul23-2022.50.fid
TM-VI-0XX, unprot. pyr, CD3OD

##JCAMP-DX=	6.0	$$ MestReNova 14.3.1-31739
##DATA TYPE=	LINK
##BLOCK_ID=	1
##BLOCKS=	2    
##ORIGIN=	Mestrelab Research S.L.
##OWNER=	hrzepa
##$MNOVA/LINK_BLOCK_TYPE=	ITEM	$$ NMR Spectrum
##$MNOVA/ITEM/POLYGON=	(XY..XY)
5321,5835
8722,5835
8722,8208
5321,8208
5321,5835
##$MNOVA/ITEM/Z=	0
##$MNOVA/ITEM/ANGLE=	0
##TITLE=	Jul23-2022.50.fid
##JCAMP-DX=	6.0	$$ MestReNova 14.3.1-31739
##BLOCK_ID=	2
##DATA TYPE=	MNOVA NMR VIEW DATA
##DATA CLASS=	MNOVA VIEW DATA
##$MNOVA/ITEM/ZOOM/X=	-4.005464102252559222,	16.005770000004368114
##$MNOVA/ITEM/ZOOM/Y=	-2166.4303535223007202,	23810.5634765625
##END=	
##TITLE=	Jul23-2022.50.fid
##JCAMP-DX=	6.0	$$ MestReNova 14.3.1-31739
##BLOCK_ID=	3
##DATA TYPE=	NMR SPECTRUM
##DATA CLASS=	XYDATA
##NUMDIM=	1
##ORIGIN=	Bruker BioSpin GmbH
##OWNER=	nmr
##.OBSERVE FREQUENCY=	400.4124024600000098
##.OBSERVE NUCLEUS=	^1H
##.SOLVENT NAME=	MeOD
##.PULSE SEQUENCE=	zg30
##LONGDATE=	2022/07/23 17:32:00.000
##.ACQUISITIONMODE=	SIMULTANEOUS (DQD)
##$ORIGINAL FORMAT=	Bruker XWIN-NMR
##$MNOVA/SCALES_VERSION=	9
##$PARAMETER FILE=	(acqus, ASCII, /private/var/folders/f6/rjf_tdyn2v98c5c0wvkgn4s80000gn/T/$PENruoORcinNZ4utRCAng/50/acqus, 0)
$$ ##TITLE= Parameter file, TOPSPIN		Version 3.2
$$ ##JCAMPDX= 5.0
$$ ##DATATYPE= Parameter Values
$$ ##NPOINTS= 11	$$ modification sequence number
$$ ##ORIGIN= Bruker BioSpin GmbH
$$ ##OWNER= nmr
$$ $$ 2022-07-23 17:32:43.871 +0100  nmr@CZC10666PP
$$ $$ /opt/topspin/data/agmb/nmr/Jul23-2022/50/acqus
$$ $$ process /opt/topspin3.2/prog/mod/shimcntl
$$ ##$ACQT0= -2.36344537815126
$$ ##$AMP= (0..31)
$$ 100 100 100 100 100 100 100 100 100 100 100 100 100 100 100 100 100 100
$$ 100 100 100 100 100 100 100 100 100 100 100 100 100 100
$$ ##$AMPCOIL= (0..19)
$$ 0 0 0 0 0 0 0 0 0 0 0 0 0 0 0 0 0 0 0 0
$$ ##$ANAVPT= -1
$$ ##$AQSEQ= 0
$$ ##$AQ_mod= 3
$$ ##$AUNM= <au_zg>
$$ ##$AUTOPOS= <14 >
$$ ##$BF1= 400.41
$$ ##$BF2= 400.41
$$ ##$BF3= 400.41
$$ ##$BF4= 400.41
$$ ##$BF5= 400.41
$$ ##$BF6= 400.41
$$ ##$BF7= 400.41
$$ ##$BF8= 400.41
$$ ##$BYTORDA= 0
$$ ##$CAGPARS= (0..11)
$$ 0 0 0 0 0 0 0 0 0 0 0 0
$$ ##$CFDGTYP= 0
$$ ##$CFRGTYP= 9
$$ ##$CHEMSTR= <none>
$$ ##$CNST= (0..63)
$$ 1 1 145 1 1 1 1 1 1 1 1 1 1 1 1 1 1 1 1 1 1 1 1 1 1 1 1 1 1 1 1 1 1 1 1
$$ 1 1 1 1 1 1 1 1 1 1 1 1 1 1 1 1 1 1 1 1 1 1 1 1 1 1 1 1 1
$$ ##$CPDPRG= (0..8)
$$ <> <> <> <> <mlev> <mlev> <mlev> <mlev> <mlev>
$$ ##$D= (0..63)
$$ 0 1 0 0 0 0 0 0 0 0.06 0 0 0 0 0 0 0.0002 0 0 0 0 0 0 0 0 0 0 0 0 0 0 0
$$ 0 0 0 0 0 0 0 0 0 0 0 0 0 0 0 0 0 0 0 0 0 0 0 0 0 0 0 0 0 0 0 0
$$ ##$DATE= 1658593963
$$ ##$DE= 6.5
$$ ##$DECBNUC= <off>
$$ ##$DECIM= 2496
$$ ##$DECNUC= <off>
$$ ##$DECSTAT= 4
$$ ##$DIGMOD= 1
$$ ##$DIGTYP= 12
$$ ##$DQDMODE= 0
$$ ##$DR= 22
$$ ##$DS= 2
$$ ##$DSPFIRM= 0
$$ ##$DSPFVS= 20
$$ ##$DTYPA= 0
$$ ##$EXP= <proton>
$$ ##$F1LIST= <111111111111111>
$$ ##$F2LIST= <222222222222222>
$$ ##$F3LIST= <333333333333333>
$$ ##$FCUCHAN= (0..9)
$$ 0 2 0 0 0 0 0 0 0 0
$$ ##$FL1= 90
$$ ##$FL2= 90
$$ [...]
$$ 90 74 58 42 26 10 0 0
$$ ##$Sgu3PowerLevels= (0..7)
$$ 0 0 0 0 0 0 0 0
$$ ##$Sgu4PowerLevels= (0..7)
$$ 0 0 0 0 0 0 0 0
$$ ##$Sgu5PowerLevels= (0..7)
$$ 0 0 0 0 0 0 0 0
$$ ##$Sgu6PowerLevels= (0..7)
$$ 0 0 0 0 0 0 0 0
$$ ##$Sgu7PowerLevels= (0..7)
$$ 0 0 0 0 0 0 0 0
$$ ##$Sgu8PowerLevels= (0..7)
$$ 0 0 0 0 0 0 0 0
$$ ##$SguType= 3
$$ ##$ShimPowMaxUA= (0..63)
$$ 130000 130000 130000 130000 130000 130000 130000 130000 130000 130000 130000
$$ 130000 130000 130000 130000 130000 130000 130000 130000 130000 0 0 0 0
$$ 0 0 0 0 0 0 0 0 0 0 0 0 0 0 0 0 0 0 0 0 0 0 0 0 0 0 0 0 0 0 0 0 0 0 0 0
$$ 0 0 0 0
$$ ##$ShimPowMaxUC= (0..63)
$$ 130000 130000 130000 130000 130000 130000 130000 130000 130000 130000 130000
$$ 130000 130000 130000 130000 130000 130000 130000 130000 130000 0 0 0 0
$$ 0 0 0 0 0 0 0 0 0 0 0 0 0 0 0 0 0 0 0 0 0 0 0 0 0 0 0 0 0 0 0 0 0 0 0 0
$$ 0 0 0 0
$$ ##$ShimPowMaxUG= (0..63)
$$ 524287 524287 524287 524287 524287 524287 524287 524287 524287 524287 524287
$$ 524287 524287 524287 524287 524287 524287 524287 524287 524287 0 0 0 0
$$ 0 0 0 0 0 0 0 0 0 0 0 0 0 0 0 0 0 0 0 0 0 0 0 0 0 0 0 0 0 0 0 0 0 0 0 0
$$ 0 0 0 0
$$ ##$ShimPowRcbType= 3
$$ ##$ShimPowRes= (0..63)
$$ 1e-20 1e-20 1e-20 1e-20 1e-20 1e-20 1e-20 1e-20 1e-20 1e-20 1e-20 1e-20
$$ 1e-20 1e-20 1e-20 1e-20 1e-20 1e-20 1e-20 1e-20 0 0 0 0 0 0 0 0 0 0 0 0
$$ 0 0 0 0 0 0 0 0 0 0 0 0 0 0 0 0 0 0 0 0 0 0 0 0 0 0 0 0 0 0 0 0
$$ ##$ShimPowRng0= (0..63)
$$ 1 1 1 1 1 1 1 1 1 1 1 1 1 1 1 1 1 1 1 1 0 0 0 0 0 0 0 0 0 0 0 0 0 0 0 0
$$ 0 0 0 0 0 0 0 0 0 0 0 0 0 0 0 0 0 0 0 0 0 0 0 0 0 0 0 0
$$ ##$ShimPowRng1= (0..63)
$$ 1 1 1 1 1 1 1 1 1 1 1 1 1 1 1 1 1 1 1 1 0 0 0 0 0 0 0 0 0 0 0 0 0 0 0 0
$$ 0 0 0 0 0 0 0 0 0 0 0 0 0 0 0 0 0 0 0 0 0 0 0 0 0 0 0 0
$$ ##$ShimPowRng2= (0..63)
$$ 1 1 1 1 1 1 1 1 1 1 1 1 1 1 1 1 1 1 1 1 0 0 0 0 0 0 0 0 0 0 0 0 0 0 0 0
$$ 0 0 0 0 0 0 0 0 0 0 0 0 0 0 0 0 0 0 0 0 0 0 0 0 0 0 0 0
$$ ##$ShimPowRng3= (0..63)
$$ 1 1 1 1 1 1 1 1 1 1 1 1 1 1 1 1 1 1 1 1 0 0 0 0 0 0 0 0 0 0 0 0 0 0 0 0
$$ 0 0 0 0 0 0 0 0 0 0 0 0 0 0 0 0 0 0 0 0 0 0 0 0 0 0 0 0
$$ ##$ShimSysFunc= (0..63)
$$ 1 2 3 4 5 7 9 11 15 16 8 10 12 14 6 17 13 18 19 20 0 0 0 0 0 0 0 0 0 0
$$ 0 0 0 0 0 0 0 0 0 0 0 0 0 0 0 0 0 0 0 0 0 0 0 0 0 0 0 0 0 0 0 0 0 0
$$ ##$ShimSysMatrix= 0
$$ ##$ShimSysType= 1
$$ ##$TFXNUM= 0
$$ ##$TRIPLO2= 0
$$ ##$VTU= 2
$$ ##$VTUETH= <149.236.99.20>
$$ ##$VTUTY= <no>
$$ ##$WBREFAM= (0..15)
$$ 135 116 100 100 100 100 100 100 100 100 100 100 100 100 100 100
$$ ##$WBREFLM= (0..15)
$$ 0 0 0 0 0 0 0 0 0 0 0 0 0 0 0 0
$$ ##$WBREFPH= (0..15)
$$ 71.66 -68.25 0 0 0 0 0 0 0 0 0 0 0 0 0 0
$$ ##$WBSGU= (0..15)
$$ 0 0 0 0 0 0 0 0 0 0 0 0 0 0 0 0
$$ ##$XFAC= 2
$$ ##END=
$$ 
##$DECIM=	2496
##$DSPFVS=	20
##XUNITS=	HZ
##YUNITS=	ARBITRARY UNITS
##FIRSTX=	6408.8703656999996383
##LASTX=	-1603.8278811825093726
##DELTAX=	-0.12226593800080123864
##XFACTOR=	1
##YFACTOR=	0.0079733311918108989297
##FIRSTY=	9.00440216064453125
##MINY=	-1.8336738348007202148
##MAXY=	21645.966796875
##NPOINTS=	65536
##XYDATA=	(X++(Y..Y))
$$ [...]
$$ plain form
1949 8188 8182 8186 8192 8187 8159 8106 8043 7993 7961 7934 7907 7887 7882 7880 7863 7831 7799 7772 7740 7696 7650 7618 7606 7614 7628 7634 7617 7581 7545 7522 7510 7497 7479 7458 7440 7426 7418 7414 7411 7403
1944 7403 7386 7358 7320 7275 7229 7187 7150 7120 7101 7099 7110 7126 7139 7141 7126 7096 7064 7042 7025 7002 6968 6933 6910 6895 6877 6857 6843 6838 6827 6791 6735 6679 6646 6641 6651 6662
1940 6662 6670 6673 6669 6658 6637 6608 6576 6543 6502 6448 6396 6377 6400 6438 6459 6460 6460 6464 6454 6425 6393 6367 6333 6279 6228 6212 6225 6234 6226 6220 6226 6229 6212 6183 6163 6156 6147 6127 6099 6066 6019
1935 6019 5953 5885 5837 5823 5830 5838 5836 5825 5808 5789 5773 5764 5760 5752 5741 5735 5742 5752 5749 5737 5732 5740 5743 5724 5687 5647 5609 5574 5545 5524 5512 5504 5505 5517 5531 5532 5516 5492 5467 5449 5443 5447 5447
1930 5447 5428 5399 5384 5392 5405 5402 5381 5357 5339 5328 5322 5322 5325 5324 5314 5295 5270 5244 5219 5194 5172 5156 5145 5137 5128 5124 5136 5156 5165 5151 5123 5100 5087 5081 5079 5081 5082 5072 5045 5008 4976
1925 4976 4958 4958 4966 4959 4929 4896 4888 4911 4938 4942 4919 4883 4843 4795 4741 4696 4678 4688 4711 4726 4725 4714 4698 4681 4672 4678 4695 4697 4668 4625 4602 4609 4630 4643 4651 4662 4675 4683 4680 4662 4625
1920 4625 4578 4544 4536 4542 4543 4542 4553 4569 4566 4534 4495 4475 4473 4468 4446 4416 4395 4390 4397 4409 4423 4440 4454 4454 4435 4404 4374 4349 4323 4293 4270 4261 4261 4257 4245 4226 4203 4179 4161 4157 4168
1915 4168 4185 4197 4199 4195 4190 4189 4195 4207 4215 4213 4198 4173 4149 4135 4136 4148 4163 4169 4161 4138 4109 4082 4064 4049 4028 3999 3964 3931 3907 3893 3886 3878 3863 3842 3819 3802 3796 3804 3818 3830 3841
$$ packed form
1949H188oMOnk8n3o3n0l2k7k7k0nkj7l2l2k7l2m4m6l2j2QJ4Oj7l6l6k3j2j3j8k1j8j4qmlq
1944G403j7k8l8m5m6m2l7l0j9kJ1J6J3Kj5l0l2k2j7k3l4l5k3j5j8k0j4nj1l6n6n6l3nJ0J1
1940F662QLmj1k1k9l2l3m1n4n2j9K3L8K1J%Mj0k9l2k6l4n4n1j6J3RqoOLj7k9k0prk0k8l3m7
1935F019o6o8m8j4PQkj1j7j9j6rmqj1oPJ0lj2nQLj9l7m0l8l5k9k1j2qJJ2J4Jj6k4k5j8oM%
1930E447j9k9j5QJ3lk1k4j8j1o%Ljj0j9k5k6k5k5k2j6j1qrmJ2K0Rj4k8k3j3okKJj0k7l7l2
1925D976j8%Qpl0l3qK3K7Mk3l6m0m8n4m5j8J0K3J5jj1j6j7rOJ7Kk9m3k3PK1J3QJ1J3Qlj8l7
1920D625m7l4qOJjJ1J6ll2l9k0knk2l0k1nPJ2J4J7J4%j9l1l0k5k6l0k3r%mj2j9k3k4j8mJ1
1915D168J7J2KmnjOJ2Qkj5k5k4j4JJ2J5Oqk3k9k7j8j5k1k9l5l3k4j4pqj5k1k3j7oQJ4J2J1
$$ plain form
1910 3841 3858 3877 3885 3874 3860 3858 3869 3879 3889 3903 3920 3923 3909 3890 3880 3873 3858 3827 3788 3754 3735 3728 3719 3700 3677 3663 3654 3637 3612 3603 3617 3636 3643 3651 3681 3716 3718 3678 3635 3621
1905 3621 3629 3634 3625 3615 3609 3597 3575 3552 3542 3556 3591 3631 3650 3634 3595 3563 3554 3561 3568 3571 3570 3569 3566 3562 3557 3551 3545 3539 3532 3521 3504 3487 3477 3477 3482 3489 3498 3508 3514 3505 3478 3449 3438 3448 3462 3462
1899 3462 3447 3428 3414 3401 3385 3367 3354 3347 3341 3338 3339 3347 3358 3365 3362 3346 3322 3304 3299 3295 3280 3256 3240 3241 3252 3254 3244 3237 3247 3273 3300 3311 3307 3297 3292 3294 3294 3290 3278 3254 3212 3161 3123
1894 3123 3110 3115 3116 3108 3103 3116 3139 3159 3175 3189 3201 3211 3222 3234 3236 3219 3189 3167 3159 3153 3133 3102 3078 3073 3085 3095 3086 3049 2995 2943 2911 2899 2901 2913 2929 2942 2945 2947 2961 2986
1889 2986 3003 2998 2977 2957 2951 2960 2977 2992 2999 2997 2988 2974 2955 2937 2930 2938 2952 2963 2963 2952 2928 2900 2878 2871 2878 2893 2914 2935 2951 2958 2954 2941 2919 2893 2875 2871 2869 2851 2821 2793 2778 2769
1884 2769 2765 2773 2791 2798 2781 2754 2745 2759 2778 2787 2796 2813 2836 2850 2848 2829 2805 2791 2798 2818 2834 2834 2825 2814 2805 2798 2793 2786 2774 2760 2753 2751 2739 2712 2690 2695 2725 2751 2751 2728 2695 2662 2638
1879 2638 2633 2646 2665 2679 2684 2684 2686 2696 2711 2717 2700 2660 2621 2600 2596 2602 2614 2628 2637 2637 2633 2631 2627 2620 2624 2644 2663 2659 2634 2612 2606 2609 2612 2619 2632 2637 2624 2601 2584 2577 2569 2554 2538 2524 2510
1873 2510 2497 2497 2517 2554 2592 2622 2649 2682 2717 2735 2723 2686 2641 2596 2553 2516 2494 2488 2494 2508 2526 2534 2519 2489 2469 2470 2481 2490 2509 2545 2575 2570 2539 2515 2522 2550 2574 2574 2544
$$ packed form
1910C841J7J9Qj1j4kJ1J0J0J4J7Lj4j9j0pj5l1l9l4j9prj9k3j4rj7k5rJ4J9PQL0L5Km0m3j4
1905C621QNrj0oj2k2k3j0J4L5M0J9j6l9l2rPPLjjlmnooopj1j7j7j0%NPRJ0Ork7k9j1J0J4%
1899C462j5j9j4j3j6j8j3polJQJ1Plj6k4j8nmj5k4j6JJ1Kj0pJ0K6K7J1mj0nK%mj2k4m2n1l8
1894C123j3NJqnJ3K3K0J6J4J2J0J1J2Kj7l0k2qok0l1k4nJ2J0rl7n4n2l2j2KJ2J6J3LKJ4K5
1889B986J7nk1k0oRJ7J5Pkrj4j9j8pQJ4J1%j1k4k8k2pPJ5K1K1J6Pmj3k2k6j8mkj8l0k8j5r
1884B769mQJ8Pj7k7rJ4J9RRJ7K3J4kj9k4j4PK0J6%rj1rpnpj2j4pkj2k7k2NL0K6%k3l3l3k4
1879B638nJ3J9J4N%KJ0J5Oj7m0l9k1mOJ2J4R%mkmpMK0J9mk5k2oLLPJ3Nj3k3j7pqj5j6j4j4
1873B510j3%K0L7L8L0K7L3L5J8j2l7m5m5m3l7k2oOJ4J8Qj5l0k0JJ1RJ9L6L0nl1k4PK8K4%l0
$$ plain form
1868 2544 2492 2440 2416 2422 2439 2455 2474 2500 2520 2523 2515 2506 2494 2471 2436 2405 2390 2388 2393 2401 2413 2429 2450 2471 2481 2474 2453 2431 2417 2418 2428 2438 2435 2417 2398 2394 2401 2411 2417 2424 2438
1863 2438 2457 2472 2472 2452 2417 2382 2356 2339 2324 2317 2329 2354 2368 2354 2316 2276 2248 2231 2218 2207 2201 2206 2222 2243 2268 2304 2356 2409 2439 2440 2426 2413 2399 2375 2340 2304 2271
1859 2271 2241 2227 2240 2276 2312 2327 2322 2308 2290 2270 2254 2254 2270 2290 2305 2314 2318 2308 2279 2244 2225 2236 2264 2289 2305 2316 2318 2305 2280 2259 2251 2250 2246 2239 2237 2243 2248 2248 2241 2232 2230 2238 2251
1854 2251 2255 2249 2245 2254 2265 2261 2245 2230 2218 2204 2192 2202 2226 2233 2202 2157 2138 2151 2176 2198 2223 2254 2275 2272 2253 2234 2224 2226 2241 2268 2289 2284 2247 2196 2154 2138 2144 2156 2154 2134
1849 2134 2114 2110 2122 2134 2136 2128 2116 2107 2108 2121 2141 2163 2179 2189 2192 2190 2184 2180 2181 2188 2193 2193 2185 2171 2160 2156 2159 2165 2173 2179 2176 2157 2128 2102 2088 2083 2084 2091 2104 2112 2101 2075 2052 2046 2058 2077 2093
1843 2093 2100 2096 2083 2071 2068 2076 2087 2091 2083 2064 2043 2034 2042 2050 2042 2018 2000 1998 2003 2000 1995 2001 2018 2033 2038 2035 2025 2001 1968 1947 1952 1976 1998 2009 2017 2022 2018 2004 1995 2004 2026 2050 2067 2074 2073 2066 2063 2068
1837 2068 2074 2073 2066 2059 2052 2046 2048 2062 2078 2081 2063 2041 2031 2030 2029 2022 2015 2013 2015 2015 2012 2011 2013 2020 2033 2049 2063 2068 2067 2061 2051 2032 2008 1990 1981 1974 1957 1928 1908 1913 1940 1966 1972 1963 1957 1965 1979 1983 1976 1973
1831 1973 1981 1991 1997 2006 2031 2060 2064 2033 1986 1950 1935 1939 1958 1984 2000 1995 1983 1986 2010 2036 2042 2029 2009 1992 1987 2003 2035 2059 2054 2024 1998 1999 2022 2043 2049 2046 2051 2066 2076 2066 2039
$$ packed form
1868B544n2n2k4OJ7J6J9K6K0Lqrj2k3l5l1j5kNQJ2J6K1K1J0pk1k2j4JJ0J0lj8j9mPJ0OPJ4
1863B438J9J5%k0l5l5k6j7j5pJ2K5J4j4l8m0k8j7j3j1oNJ6K1K5L6N2N3L0Jj4j3j4k4l5l6l3
1859B271l0j4J3L6L6J5nj4j8k0j6%J6K0J5RMj0k9l5j9J1K8K5J6J1Kj3k5k1qjmpkON%prkQJ3
1854B251MomRJ1mj6j5j2j4j2J0K4Pl1m5j9J3K5K2K5L1K1lj9j9j0KJ5K7K1nl7n1m2j6OJ2kk0
1849B134k0mJ2J2Kqj2rJJ3K0K2J6J0LkomJPN%qj4j1mLOQOlj9k9k6j4nJPJ3Qj1k6k3oJ2J9J6
1843B093Pmj3j2lQJ1Mqj9k1rQQqk4j8kNlnOJ7J5Nlj0k4l3k1NK4K2J1QNmj4rRK2K4J7PjplN
1837B068OjpppoKJ4J6Lj8k2j0jjppkK%ljKPJ3J6J4Njoj0j9k4j8rpj7k9k0NK7K6OroQJ4Mpl
1831A973QJ0ORK5K9Ml1m7l6j5MJ9K6J6nj2LK4K6Oj3k0j7nJ6L2K4nl0k6JK3K1OlNJ5J0j0k7
$$ plain form
1826 2039 2010 1991 1984 1983 1986 1989 1989 1982 1973 1967 1962 1956 1950 1944 1940 1941 1952 1972 1993 2000 1990 1968 1937 1903 1881 1893 1939 1996 2038 2061 2082 2112 2134 2129 2094 2053 2035 2043 2060 2065 2051 2030 2013
1821 2013 2003 1996 1992 1993 2000 2012 2025 2034 2038 2039 2040 2041 2034 2017 1996 1981 1980 1992 2010 2027 2033 2019 1988 1956 1946 1964 1993 2013 2017 2013 2010 2008 2004 1995 1980 1965 1958 1970 1999 2032 2061 2074 2063 2029
1815 2029 1984 1950 1938 1946 1971 2006 2032 2024 1985 1944 1928 1935 1940 1944 1963 2004 2047 2070 2066 2050 2033 2023 2026 2042 2061 2075 2082 2086 2088 2087 2079 2068 2062 2063 2067 2066 2064 2072 2096 2122 2134 2123 2099
1810 2099 2072 2049 2036 2036 2044 2052 2061 2076 2096 2111 2122 2135 2153 2170 2178 2180 2182 2187 2197 2213 2230 2238 2228 2212 2207 2219 2242 2264 2278 2279 2279 2294 2331 2382 2442 2522 2626 2741 2840
1805 2840 2919 2995 3091 3219 3381 3568 3762 3939 4087 4204 4282 4317 4317 4295 4252 4177 4070 3944 3815 3681 3534 3380 3234 3108 3009 2934 2870
1802 2870 2803 2733 2672 2628 2597 2578 2580 2605 2640 2666 2677 2678 2670 2655 2640 2629 2623 2628 2654 2704 2766 2823 2885 2972 3087 3217 3350 3489 3641 3816 4039 4337 4715
1798 4715 5153 5631 6144 6688 7240 7765 8237 8628 8916 9090 9158 9120 8956 8655 8251 7804 7358 6914 6467 6032 5622 5234 4857 4504
1795 4504 4206 3978 3799 3634 3470 3318 3197 3114 3065 3041 3030 3017 2993 2959 2929 2919 2931 2955 2977 2993 3009 3033 3067 3107 3157 3226 3324 3452 3604 3777
$$ packed form
1826B039k9j9pjLL%pronooomJJ1K0K1Pj0k2l1l4k2J2M6N7M2K3K1L0K2nl5m1j8QJ7Nj4k1j7
1821B013j0pmJPJ2J3RMJJJpj7k1j5jJ2J8J7Oj4l1l2j0J8K9K0Mmlkmrj5j5pJ2K9L3K9J3j1l4
1815B029m5l4j2QK5L5K6ql9m1j6PNMJ9M1M3K3mj6j7j0LJ6J9J4PMKjqj1oJMjkQK4K6J2j1k4
1810B099k7k3j3%QQRJ5K0J5J1J3J8J7QKKNJ0J6J7Qj0j6nJ2K3K2J4J%J5L7N1O0Q0J04J15R9
1805B840P9P6R6J28J62J87J94J77J48J17P8L5%k2m3p5j07j26j29j34j47j54j46j26r9p5o4
1802B870o7p0o1m4l1j9KK5L5K6J1Jqj5j5j1oNK6N0O2N7O2Q7J15J30J33J39J52J75K23K98L78
1798D715M38M78N13N44N52N25M72L91K88J74O8l8j64l01m04m47m46m44m47m35m10l88l77l53
1795D504k98k28j79j65j64j52j21q3m9k4j1j3k4l4l0j0J2K4K2J6J6K4L4M0N0O9R8J28J52J73
$$ plain form
1791 3777 3976 4213 4497 4837 5240 5707 6229 6786 7351 7894 8385 8804 9136 9362 9454 9392 9184 8863 8474 8045 7592 7127 6663 6212
1788 6212 5780 5377 5012 4692 4417 4181 3973 3788 3630 3498 3390 3305 3243 3200 3157 3101 3035 2978 2938 2904 2866 2827 2795 2766 2726 2679 2646 2646 2676
1785 2676 2723 2770 2811 2850 2892 2945 3010 3088 3189 3326 3498 3689 3876 4052 4220 4380 4523 4639 4725 4773 4773 4716 4608 4469 4321 4176 4033
1782 4033 3890 3754 3625 3500 3369 3237 3115 3013 2924 2838 2757 2690 2652 2644 2656 2674 2688 2693 2688 2666 2622 2562 2504 2458 2422 2391 2365 2349 2336 2316 2291 2269
1778 2269 2257 2253 2263 2295 2348 2407 2449 2466 2467 2461 2453 2442 2430 2421 2423 2438 2466 2507 2555 2601 2632 2643 2640 2628 2598 2544 2480 2428 2402 2398 2413 2452 2502 2540 2551 2548 2550 2555 2547 2532
1773 2532 2526 2535 2550 2572 2611 2665 2711 2733 2746 2768 2793 2801 2787 2764 2741 2713 2675 2635 2609 2602 2611 2629 2643 2642 2623 2601 2594 2608 2636 2666 2687 2691 2680 2666 2654 2639 2621 2615 2639
1768 2639 2679 2700 2684 2655 2648 2677 2730 2789 2845 2887 2901 2891 2878 2876 2887 2904 2929 2965 3003 3029 3037 3033 3020 2998 2976 2967 2978 3002 3031 3060 3091 3120 3134 3121 3086 3045 3022
1763 3022 3021 3030 3039 3051 3073 3105 3137 3170 3204 3234 3244 3235 3228 3240 3264 3284 3303 3330 3361 3385 3401 3415 3431 3443 3451 3462 3473 3471 3449 3426 3425 3451 3492 3537 3578 3608 3619 3611 3595
$$ packed form
1791C777J99K37K84L40M03M67N22N57N65N43M91M19L32K26R2o2k08l21l89m29m53m65m64m51
1788F212m32m03l65l20k75k36k08j85j58j32j08q5o2m3m3n6o6n7m0l4l8l9l2k9m0m7l3%L0
1785B676M7M7M1L9M2N3O5P8J01J37J72J91J87J76J68J60J43J16Q6M8%n7j08j39j48j45j43
1782D033j43j36j29j25j31j32j22j02q9q6q1o7l8qJ2J8J4Nnk2m4o0n8m6l6l1k6j6j3k0k5k2
1778B269j2mJ0L2N3N9M2J7Joqj1j2rKJ5K8M1M8M6L1J1lj2l0n4o4n2k6mJ5L9N0L8J1lKNqj5
1773B532oRJ5K2L9N4M6K2J3K2K5Qj4k3k3k8l8m0k6pRJ8J4jj9k2pJ4K8L0K1Mj1j4j2j5j8oK4
1768B639M0K1j6k9pK9N3N9N6M2J4j0j3kJ1J7K5L6L8K6Qmj3k2k2rJ1K4K9K9L1K9J4j3l5m1k3
1763C022jRRJ2K2L2L2L3L4L0J0rpJ2K4K0J9K7L1K4J6J4J6J2QJ1J1kk2k3jK6M1M5M1L0J1qj6
$$ plain form
1759 3595 3579 3562 3552 3564 3602 3646 3672 3679 3684 3696 3704 3699 3692 3701 3728 3763 3806 3860 3920 3971 4009 4044 4080 4111 4128 4134 4137 4136 4127 4117 4123 4155 4209 4275 4336 4378 4399 4411 4434 4472
1754 4472 4522 4569 4603 4622 4628 4629 4630 4632 4640 4655 4675 4691 4700 4713 4739 4781 4837 4903 4963 5003 5025 5053 5100 5152 5189 5217 5252 5294 5332 5371 5424 5494 5568 5644 5735 5835 5919
1749 5919 5980 6030 6079 6114 6128 6144 6182 6223 6234 6215 6200 6218 6267 6334 6406 6470 6521 6570 6635 6713 6782 6821 6837 6846 6864 6902 6960 7027 7081 7118 7154 7212 7288 7356 7398
1745 7398 7424 7460 7522 7605 7691 7772 7856 7952 8057 8165 8273 8378 8477 8570 8672 8799 8946 9087 9207 9317 9437 9570 9707 9840 9970 10095
1742 10095 10212 10317 10409 10491 10572 10664 10765 10866 10962 11072 11210 11369 11533 11700 11882 12084 12294 12494 12679 12859 13045 13239 13431 13612
1739 13612 13788 13980 14208 14472 14757 15054 15362 15685 16022 16369 16731 17109 17507 17931 18381 18852 19333 19831 20366 20957 21600 22283 22995
1736 22995 23734 24494 25271 26066 26895 27787 28764 29832 30991 32248 33631 35174 36908 38862 41065 43547 46343 49499 53094
1734 53094 57222 61987 67512 73968 81574 90591 101312 114035 129026 146526 166843 190385 217434 247778 280556
$$ packed form
1759C595j6j7j0J2L8M4K6PNJ2QnpRK7L5M3N4O0N1L8L5L6L1J7OLjrj0OL2N4O6O1M2K1J2K3L8
1754D472N0M7L4J9OJJKQJ5K0J6RJ3K6M2N6O6O0M0K2K8M7N2L7K8L5M2L8L9N3P0P4P6R1J00Q4
1749E919O1N0M9L5J4J6L8M1J1j9j5J8M9O7P2O4N1M9O5P8O9L9J6RJ8L8N8O7N4L7L6N8P6O8M2
1745G398K6L6O2Q3Q6Q1Q4R6J05J08J08J05R9R3J02J27J47J41J20J10J20J33J37J33J30J25
1742A0095J17J05R2Q2Q1R2J01J01R6J10J38J59J64J67J82K02K10K00J85J80J86J94J92J81
1739A3612J76J92K28K64K85K97L08L23L37L47L62L78L98M24M50M71M81M98N35N91O43O83P12
1736B2995P39P60P77P95Q29Q92R77J068J159J257J383J543J734J954K203K482K796L156L595
1734E3094M128M765N525O456P606R017J0721J2723J4991J7500K0317K3542K7049L0344L2778
$$ plain form
1732 280556 314483 348126 379945 408192 431013 446753 454187 452652 442284 424288 400804 374225 346438 318578
1730 318578 291271 264942 239959 216710 195644 177168 161446 148338 137534 128713 121574 115842 111301 107797 105200
1728 105200 103389 102289 101869 102092 102916 104348 106443 109244 112769 117082 122307 128567 135979 144729 155092 167371 181907
1726 181907 199197 219915 244836 274790 310683 353408 403735 462535 531057 610486 700705 799458 902848
1725 902848 1006431 1105515 1194776 1268385 1320955 1348330 1347900 1319248 1265299 1192440 1108538 1020167 931316 844015
1723 844015 759482 678735 602876 533283 471366 417898 372646 334700 303022 276643 254649 236263 220927 208199
1721 208199 197646 188900 181730 175952 171358 167813 165317 163888 163481 164103 165889 168983 173453 179412 187132 196939 209121
1719 209121 224070 242415 264935 292433 325767 365845 413470 469431 534862 611084 698460 795259 897842
$$ packed form
1732B80556L3927L3643L1819K8247K2821J5740P434j535j0368j7996k3484k6579k7787k7860
1730C18578k7307k6329k4983k3249k1066j8476j5722j3108j0804q821p139n732m541l504k597
1728A05200j811j100m20K23Q24J432K095K801L525M313N225O260P412Q750J0363J2279J4536
1726A81907J7290K0718K4921K9954L5893M2725N0327N8800O8522P9429R0219R8753J03390
1725I02848J03583R9084Q9261P3609N2570K7375m30k8652n3949p2859q3902q8371q8851q7301
1723H44015q4533q0747p5859o9593o1917n3468m5252l7946l1678k6379k1994j8386j5336j2728
1721B08199j0553q746p170n778m594l545k496j429m07O22J786L094M470N959P720R807J2182
1719B09121J4949J8345K2520K7498L3334M0078M7625N5961O5431P6222Q7376R6799J02583
$$ plain form
1718 897842 1001796 1102489 1194708 1272587 1330465 1363806 1369531 1346519 1296777 1225988 1141997 1052002 960742
1716 960742 870684 783163 699187 619823 546414 480429 422866 373765 332345 297525 268258 243591 222705 204970
1714 204970 189892 177022 165962 156411 148130 140891 134511 128915 124072 119920 116405 113552 111428 110061 109452 109638 110685
1712 110685 112660 115668 119909 125638 133097 142514 154151 168273 185139 205075 228475 255521 285809 318312 351670
1710 351670 384398 414825 441051 461160 473535 477030 471130 456253 433957 406606 376600 345715 314985 284967
1709 284967 256047 228602 203069 179905 159448 141776 126702 113896 103020 93774 85899 79160 73346 68274 63808
1707 63808 59850 56329 53178 50329 47724 45318 43078 40991 39071 37337 35788 34389 33097 31884 30746 29687 28698
1705 28698 27764 26878 26051 25286 24565 23861 23171 22522 21925 21360 20804 20266 19768 19307 18857 18410 17996 17632 17295 16947 16583 16222 15877
$$ packed form
1718H97842J03954J00693R2219P7879N7878L3341N725k3012m9742p0789q3991q9995r1260
1716I60742r0058q7521q3976p9364p3409o5985n7563m9101m1420l4820k9267k4667k0886j7735
1714B04970j5078j2870j1060r551q281p239o380n596m843m152l515k853k124j367o09J86J047
1712A10685J975L008M241N729P459R417J1637J4122J6866J9936K3400K7046L0288L2503L3358
1710C51670L2728L0427K6226K0109J2375L495n900j4877k2296k7351l0006l0885l0730l0018
1709B84967k8920k7445k5533k3164k0457j7672j5074j2806j0876r246p875o739n814n072m466
1707F3808l958l521l151k849k605k406k240k087j920j734j549j399j292j213j138j059r89
1705B8698r34q86q27p65p21p04o90o49n97n65n56n38m98m61m50m47m14l64l37l48l64l61l45
$$ plain form
1702 15877 15546 15226 14918 14619 14325 14043 13787 13557 13333 13108 12886 12672 12460 12250 12044 11846 11649 11458 11287 11138 10988 10822 10656
1699 10656 10516 10406 10309 10224 10162 10124 10087 10034 9967 9895 9815 9720 9616 9506 9383 9239 9079 8915 8753 8588 8418 8244 8072 7915 7793 7710
1696 7710 7654 7604 7549 7490 7425 7359 7305 7277 7263 7242 7211 7191 7189 7183 7145 7084 7029 6998 6982 6964 6936 6902 6866 6832 6803 6773 6737 6686 6622 6547 6470 6396 6330 6268 6207
1692 6207 6141 6074 6008 5949 5903 5869 5832 5780 5717 5657 5605 5542 5452 5344 5244 5166 5104 5043 4976 4901 4823 4748 4687 4642 4619 4623 4654 4696 4726 4740 4750 4775 4814 4863
1688 4863 4915 4960 4986 4995 5009 5053 5128 5209 5276 5325 5362 5385 5389 5372 5337 5286 5218 5136 5047 4953 4856 4752 4647 4549 4462 4374 4269 4144 4016 3908 3829 3774
1684 3774 3736 3709 3682 3638 3566 3472 3378 3304 3263 3248 3247 3239 3214 3177 3139 3111 3094 3089 3093 3105 3124 3156 3203 3256 3292 3301 3300 3309 3338 3372 3403 3431 3457 3476 3483 3490 3511 3541 3557
1679 3557 3544 3504 3451 3396 3345 3296 3238 3158 3059 2963 2890 2833 2770 2688 2596 2507 2436 2390 2369 2360 2346 2324 2295 2258 2210 2162 2125 2094 2051 1993 1942 1917 1907 1890 1863
1675 1863 1843 1841 1842 1828 1799 1772 1761 1767 1780 1788 1782 1766 1753 1753 1764 1771 1762 1741 1725 1724 1729 1724 1698 1660 1626 1600 1580 1563 1547 1534 1528 1534 1546 1544 1513 1463 1415 1378 1347 1322 1307
$$ packed form
1702A5877l31l20l08k99k94k82k56k30k24k25k22k14k12k10k06j98j97j91j71j49j50j66j66
1699A0656j40j10r7q5o2l8l7n3o7p2q0r5j04j10j23j44j60j64j62j65j70j74j72j57j22q3
1696G710n6n0n5n9o5o6n4k8j4k1l1k0kol8o1n5l1j6j8k8l4l6l4k9l0l6n1o4p5p7p4o6o2o1
1692F207o6o7o6n9m6l4l7n2o3o0n2o3r0j08j00p8o2o1o7p5p8p5o1m5k3ML1M2L0J4J0K5L9M9
1688D863N2M5K6RJ4M4P5Q1O7M9L7K3Mj7l5n1o8q2q9r4r7j04j05r8q7q8j05j25j28j08p9n5
1684C774l8k7k7m4p2r4r4p4m1j5jqk5l7l8k8j7nMJ2J9L2M7N3L6RjRK9L4L1K8K6J9PPK1L0J6
1679C557j3m0n3n5n1m9n8q0r9r6p3n7o3q2r2q9p1m6k1rj4k2k9l7m8m8l7l1m3n8n1k5j0j7k7
1675A863k0kJj4k9k7j1OJ3Qoj6j3%J1Prk1j6jNnk6l8l4k6k0j7j6j3oOJ2kl1n0m8l7l1k5j5
$$ plain form
1670 1307 1301 1292 1272 1252 1241 1238 1229 1212 1189 1160 1128 1105 1102 1115 1129 1133 1127 1115 1101 1088 1080 1080 1092 1116 1143 1155 1144 1124 1118 1136 1161 1175 1170 1152 1127 1101 1074 1046 1021 1010
1665 1010 1021 1045 1061 1057 1037 1012 993 995 1025 1064 1078 1057 1025 1011 1010 1001 989 1002 1045 1090 1104 1091 1078 1076 1079 1075 1067 1061 1060 1064 1073 1081 1084 1083 1084 1095 1113 1135 1158 1180 1198 1209
1660 1209 1217 1227 1248 1287 1343 1408 1471 1523 1565 1602 1640 1682 1732 1795 1878 1987 2116 2251 2384 2521 2671 2834 2995 3140 3268 3372 3440 3458 3426
1656 3426 3353 3249 3117 2960 2787 2615 2461 2327 2202 2076 1958 1863 1793 1736 1688 1658 1652 1657 1655 1639 1613 1585 1564 1562 1586 1625 1663 1702 1762 1860 1988
1652 1988 2121 2242 2347 2436 2512 2586 2678 2803 2960 3140 3338 3559 3809 4085 4389 4730 5128 5589 6093 6599 7075 7502 7873 8164
1649 8164 8340 8365 8231 7956 7576 7133 6662 6195 5751 5331 4921 4511 4106 3735 3423 3170 2959 2771 2608 2476 2366 2260 2157
1646 2157 2076 2033 2019 2015 2014 2020 2029 2031 2026 2032 2058 2103 2163 2247 2352 2464 2567 2676 2814 2990 3193 3413 3647 3893 4147 4423 4743 5121 5547 6000
1643 6000 6466 6933 7381 7774 8081 8283 8357 8283 8047 7668 7197 6694 6201 5735 5295 4880 4486 4110 3753 3424 3130 2865 2628 2427
$$ packed form
1670A307ork0k0j1lrj7k3k9l2k3lJ3J4Moj2j4j3q%J2K4K7J2j1k0oJ8K5J4nj8k5k6k7k8k5j1
1665A010J1K4J6mk0k5j9KL0L9J4k1l2j4jrj2J3M3M5J4j3j3kLmqojMRQLjJJ1J8K2K3K2J8J1
1660A209QJ0K1L9N6O5O3N2M2L7L8M2N0O3Q3J09J29J35J33J37J50J63J61J45J28J04O8J8l2
1656C426p3j04j32j57j73j72j54j34j25j26j18r5p0n7m8l0oNkj6k6k8k1kK4L9L8L9O0R8J28
1652A988J33J21J05Q9P6P4R2J25J57J80J98K21K50K76L04L41L98M61N04N06M76M27L71K91
1649H164J76K5j34k75l80m43m71m67m44m20m10m10m05l71l12k53k11j88j63j32j10j06j03
1646B157q1m3j4mjORKnOK6M5O0Q4J05J12J03J09J38J76K03K20K34K46K54K76L20L78M26M53
1643F000M66M67M48L93L07K02P4p4k36l79m71n03m93m66m40m15l94l76l57l29k94k65k37k01
$$ plain form
1640 2427 2264 2129 2003 1887 1791 1719 1659 1605 1558 1517 1474 1435 1417 1423 1437 1446 1463 1502 1547 1568 1566 1567 1592 1628 1658 1692 1757 1861 1982 2096 2197 2299
1636 2299 2419 2562 2712 2854 2982 3095 3194 3268 3307 3308 3264 3171 3027 2844 2639 2432 2233 2053 1896 1764 1647 1533 1423 1328 1253 1189
1633 1189 1121 1050 1000 988 1005 1023 1021 1001 972 944 918 893 866 832 792 755 730 720 716 707 688 666 655 665 691 719 733 734 732 738 754 769 770 757 739 729 734 753
1628 753 777 789 774 733 689 668 667 664 650 637 637 637 622 602 604 634 663 663 646 646 674 709 729 735 736 730 709 682 675 696 726 737 719 688 667 665 677 686 681 663 643 632
1623 632 622 607 592 591 601 610 608 598 588 577 559 537 523 524 533 535 524 513 516 528 532 519 504 500 504 509 521 546 574 585 577 568 571 576 575 580 602 631 650 656 663 679 694 692 670
1618 670 642 621 605 589 574 572 592 624 646 649 641 626 598 559 527 518 521 514 493 474 469 474 482 493 508 516 510 497 490 495 498 481 446 417 418 451 496 527 534 524 513 518 547
1612 547 583 600 586 550 515 492 488 507 552 607 646 655 648 648 665 686 698 701 706 717 719 697 654 612 588 578 569 553 534 520 513 508 498 482 472 476 489 496 493 493 498 498 488
1607 488 487 509 540 554 548 543 552 562 559 548 543 548 558 565 564 552 534 520 514 513 517 536 564 584 587 584 586 586 570 539 509 493 491 500 507 498 474 458 473 509 540 554 566 589 610
$$ packed form
1640B427j63j35j26j16r6p2o0n4m7m1m3l9j8OJ4RJ7L9M5K1kJK5L6L0L4O5J04J21J14J01J02
1636B299J20J43J50J42J28J13R9P4L9Jm4r3j44j83k05k07j99j80j57j32j17j14j10r5p5o4
1633A189o8p1n0j2J7J8kk0k9k8k6k5k7l4m0l7k5j0mrj9k2j1J0K6K8J4JkOJ6J5Jj3j8j0NJ9
1628G53K4J2j5m1m4k1jlj4j3%%j5k0KL0K9%j7%K8L5K0OJok1k7pK1L0J1j8l1k1kJ2Rnj8k0j1
1623F32j0j5j5jJ0Rkj0j0j1j8k2j4JRKj1j1LJ2Mj3j5mMNJ2K5K8J1qrLNjNK2K9J9OPJ6J5kk2
1618F70k8k1j6j6j5kK0L2K2Lqj5k8l9l2rLpk1j9nNQJ1J5Qoj3pNLj7l5k9JL3M5L1Pj0j1NK9
1612E47L6J7j4l6l5k3mJ9M5N5L9Rp%J7K1J2LNJ1Kk2m3m2k4j0rj6j9j4pnj0j6j0MJ3Pl%N%j0
1607D88jK2L1J4onRJ0lj1nNJ0Pjj2j8j4ojMJ9K8K0LlK%j6l1l0j6kRPrk4j6J5L6L1J4J2K3K1
$$ plain form
1601 610 610 589 562 542 534 538 553 571 581 579 573 568 566 568 568 559 542 526 523 532 542 552 568 594 612 606 585 570 568 563 539 504 476 461 453 451 461 476 481 469 454 452 460 463 455 440
1596 440 432 437 447 448 431 406 389 388 396 408 426 446 455 444 424 409 405 411 424 439 440 418 390 383 409 452 490 508 505 485 459 439 426 416 412 417 436 464 496 527 547
1591 547 551 545 541 545 546 540 537 546 563 577 587 593 593 576 539 493 458 448 459 474 482 487 495 503 502 485 457 426 399 386 399 441 498 549 583 602 612 620 623 615 593 572 566 573 572
1585 572 552 523 497 473 448 433 439 462 482 494 511 543 572 579 565 550 543 534 509 480 467 475 483 472 455 460 496 538 558 556 548 542 526 496 464 441 429 424 429 448 476
1580 476 498 497 469 430 410 426 460 479 470 451 447 454 453 439 425 422 419 402 375 359 367 389 406 419 436 462 484 490 484 486 503 522 525 510 490 476 471 476 495 522 541 534
1575 534 503 470 450 447 458 482 512 533 538 532 530 535 542 546 549 551 552 556 565 570 560 540 531 542 560 563 548 530 524 530 540 548 551 552 552 547 532 510 492 489 499 513 529 546 563 575
1570 575 580 576 563 542 520 507 510 528 560 597 628 639 625 594 557 528 512 503 493 479 465 448 425 403 398 413 433 440 443 455 470 477 472 467 463 456 452 461 476 486 499 538
1564 538 598 643 655 651 649 644 625 610 623 655 676 671 654 636 616 604 613 632 636 618 609 630 659 662 630 591 569 567 576 589 594 577 534 480 441 432 450 473 483 475 466 469
$$ packed form
1601F10%k1k7k0qMJ5J8J0konkK%rj7j6lRJ0J0J6K6J8ok1j5knk4l5k8j5qkJ0J5Nj2j5kQLqj5
1596D40qNJ0Jj7k5j7jQJ2J8K0Rj1k0j5mOJ3J5Jk2k8pK6M3L8J8lk0k6k0j3j0mNJ9K8L2L1K0
1591E47MomMJolRJ7J4J0O%j7l7m6l5j0J1J5QNQQjj7k8l1k7j3J3M2N7N1L4J9J0QLqk2k1oPj
1585E72k0k9k6k4k5j5OK3K0J2J7L2K9Pj4j5prk5k9j3QQj1j7NL6M2K0kqoj6l0l2k3j2nNJ9K8
1580D76K2jk8l9k0J6L4J9rj9mPjj4j4llj7k7j6QK2J7J3J7K6K2OoKJ7J9Lj5k0j4nNJ9K7J9p
1575E34l1l3k0lJ1K4L0K1NokNPMLKJMRNj0k0rJ1J8Lj5j8oOJ0QLJ%nj5k2j8lJ0J4J6J7J7J2
1570E75Nmj3k1k2j3LJ8L2L7L1J1j4l1l7k9j6rj0j4j4j7k3k2nJ5K0PLJ2J5PnnmpmRJ5J0J3L9
1564E38O0M5J2mknj9j5J3L2K1nj7j8k0j2RJ9Mj8rK1K9Ll2l9k2kRJ3Nj7m3n4l9rJ8K3J0qrL
$$ plain form
1559 469 478 478 467 453 446 449 460 480 496 492 462 427 412 420 437 455 480 514 537 534 513 501 514 543 567 572 559 538 520 504 487 469 463 480 509 528 523 506 491 486
1554 486 488 487 477 459 448 465 509 557 584 588 577 555 522 486 458 447 446 452 463 475 486 497 509 521 528 535 544 554 554 540 519 498 483 478 484 500 519 544 573 594
1550 594 592 566 535 517 507 493 470 448 439 450 480 522 563 594 608 599 564 512 463 432 426 434 444 448 442 432 430 440 453 453 433 405 391 408 452 496 517 519 527 551
1545 551 576 586 592 612 642 658 648 626 608 597 591 592 602 615 619 614 600 579 561 563 590 629 659 668 663 647 628 611 605 608 604 584 552 517 485 452 418 398 404 438 480
1540 480 502 496 477 471 486 502 499 477 456 456 470 481 484 486 498 516 525 518 499 473 451 447 470 506 522 502 469 463 491 526 547 557 567 568 550 522 506 504 504 498 490 486 484
1534 484 486 496 511 520 522 530 547 553 535 511 503 510 508 496 491 508 530 541 542 549 560 560 543 528 529 541 552 553 545 531 515 506 510 526 538 541 543 553 566 571 568 567 565 551 523 499
1529 499 490 488 483 483 497 508 492 454 430 443 476 499 502 488 461 432 424 450 491 514 510 500 494 481 456 430 420 426 448 486 534 567 563 535 512 509 515 513 503 495 490 487 487
1523 487 494 511 530 545 556 568 583 599 619 640 648 633 600 567 549 536 517 496 493 508 525 525 510 491 480 484 505 527 532 522 511 507 500 480 459 457 469 478 476 475 482
$$ packed form
1559D69R%j1j4pLJ1K0J6ml0l5j5QJ7J8K5L4K3lk1j2J3K9K4Nj3k1j8j6j7j8oJ7K9J9nj7j5n
1554D86Kjj0j8j1J7M4M8K7Mj1k2l3l6k8j1jOJ1J2J1J1J2J2PPRJ0%j4k1k1j5nOJ6J9K5K9K1
1550E94kk6l1j8j0j4k3k2rJ1L0M2M1L1J4rl5n2m9l1oQJ0Moj0kJ0J3%k0k8j4J7M4M4K1KQK4
1545E51K5J0OK0L0J6j0k2j8j1oJJ0J3Mnj4k1j8KK7L9L0Rnj6j9j7oLmk0l2l5l2l3l4k0OL4M2
1540D80K2oj9oJ5J6lk2k1%J4J1LKJ2J8Rpj9k6k2mK3L6J6k0l3oK8L5K1J0J0Jj8k8j6k%oqmk
1534D84KJ0J5RKQJ7Oj8k4qPkj2nJ7K2J1JPJ1%j7j5JJ2J1Jqj4j6rMJ6J2LKJ0J3Nljkj4k8k4
1529D99rkn%J4J1j6l8k4J3L3K3Lj4k7k9qK6M1K3mj0oj3k5k6j0OK2L8M8L3mk8k3lOkj0qnl%
1523D87PJ7J9J5J1J2J5J6K0K1Qj5l3l3j8j3j9k1lJ5J7%j5j9j1MK1K2Nj0j1mpk0k1kJ2RkjP
$$ plain form
1518 482 492 502 515 526 525 508 493 493 507 524 539 557 582 612 633 636 617 593 586 595 599 586 570 563 555 525 486 480 524 589 636 654 660 659 639 602 564 542 536 541 560
1513 560 587 603 589 556 534 541 566 586 598 607 616 615 602 591 598 621 640 638 621 602 592 587 584 584 588 591 587 576 569 568 568 565 566 574 583 586 583 581 584 591 600 610 618 616 601 581 569 569 571
1507 571 566 550 531 514 498 484 482 498 525 547 556 561 569 579 586 591 599 607 606 589 564 542 527 518 510 495 473 454 449 459 476 499 533 579 616 623 605 582 568 558 544 528
1502 528 513 498 479 455 434 419 410 401 394 395 408 434 461 479 483 474 456 437 433 450 477 493 488 476 474 488 510 540 575 616 651 670 664 638 615 612 626 636 634 632 639 647
1497 647 641 626 620 628 636 634 626 618 610 603 601 605 609 607 598 576 536 485 436 401 377 363 367 393 429 461 485 506 517 512 497 494 509 533 554 570 588 610 626 630 619 596 567 540
1492 540 520 508 507 516 529 540 542 532 514 503 507 526 545 560 573 585 587 572 552 543 549 560 571 586 599 600 582 557 538 534 547 578 618 649 658 647 619 580 548 548
1487 548 585 630 648 637 621 612 605 594 585 585 588 587 579 563 540 520 515 528 551 574 594 614 632 647 653 643 614 571 533 514 515 521 521 514 512 527 548 553 530 489 455 441
1482 441 442 450 464 482 499 507 506 503 509 531 564 594 608 616 638 674 698 685 640 588 553 539 543 552 552 536 510 493 494 509 530 555 585 614 629 629 626 634 648 656 648 636 630
$$ packed form
1518D82J0J0J3J1jj7j5%J4J7J5J8K5L0K1Lj9k4pRMj3j6pql0l9oM4O5M7J8Ojk0l7l8k2oNJ9
1513E60K7J6j4l3k2PK5K0J2RRjj3j1PK3J9kj7j9j0nl%MLmj1pj%lJQRLlkLPRJ0Qkj5k0j2%K
1507E71nj6j9j7j6j4kJ6K7K2RNQJ0PNQQjj7k5k2j5rqj5k2j9nJ0J7K3L4M6L7Pj8k3j4j0j4j6
1502E28j5j5j9k4k1j5rrpJJ3K6K7J8Mrj8j9mJ7K7J6nj2kJ4K2L0L5M1L5J9ok6k3lJ4J0kkPQ
1497F47oj5oQQkqqqpkMMkrk2m0n1m9l5k4j4MK6L6L2K4K1J1nj5lJ5K4K1J6J8K2J6Mj1k3k9k7
1492E40k0j2jRJ3J1Kj0j8j1MJ9J9J5J3J2Kj5k0rOJ1J1J5J3Jj8k5j9mJ3L1M0L1Rj1k8l9l2%
1487E48L7M5J8j1j6rpj1r%Ljqj6k3k0nJ3K3K3K0K0J8J5Oj0k9m3l8j9JO%pkJ5K1Nk3m1l4j4
1482D41JQJ4J8J7QjlOK2L3L0J4QK2L6K4j3m5n2l5j4MR%j6k6j7JJ5K1K5L0K9J5%lQJ4Qqj2o
$$ plain form
1477 630 628 621 612 609 617 628 634 633 624 602 573 558 566 587 602 603 596 585 570 558 560 574 586 590 589 594 605 618 628 636 652 682 716 732 715 681 655 646 647 648 653 667 686 703 721
1471 721 743 762 766 749 712 665 620 592 590 615 654 686 696 683 667 666 681 705 724 733 724 705 695 709 738 756 752 734 714 691 667 652 647 639 616 591 583 596 620
1466 620 650 683 710 718 712 711 727 743 742 722 698 689 699 722 744 757 762 757 741 719 708 718 733 732 710 687 675 668 661 658 666 676 681 691 716 748 765 762 754 757 776 797 805
1461 805 790 759 736 741 770 794 790 764 738 722 711 693 671 658 661 668 668 666 674 697 717 717 706 703 717 736 747 748 741 730 719 716 721 723 712 689 664 644 629 612 598 597
1456 597 614 634 639 621 597 582 579 578 579 590 613 635 649 663 682 696 692 672 651 636 625 622 637 670 704 729 754 789 821 829 816 801 796 795 783 763 746 738 737 751
1451 751 785 834 873 891 896 902 911 912 897 876 859 845 828 809 800 798 789 763 734 722 730 737 724 697 677 678 699 725 748 764 775 780 776 756 724 694 679 684 702 717 719 709
1446 709 701 706 723 748 782 829 888 949 1001 1040 1061 1059 1040 1019 1010 1008 1003 992 977 954 922 884 850 814 772 733 714 707 688 654 638 660 699 718 717 724 758 800 825
1441 825 824 808 790 773 754 734 724 736 767 796 809 818 833 845 834 800 764 734 705 679 676 701 728 733 720 716 729 754 783 805 803 769 720 689 685 693 688 666 641
$$ packed form
1477F30kprlQJ1Ojrk2k9j5QK1J5Jpj1j5j2KJ4J2MjNJ1J3J0QJ6L0L4J6j7l4k6rJJNJ4J9J7J8
1471G21K2J9Mj7l7m7m5k8kK5L9L2J0j3j6jJ5K4J9Rrj9j0J4K9J8mj8k0k3k4j5nqk3k5qJ3K4
1466F20L0L3K7QojJ6J6jk0k4rJ0K3K2J3Nnj6k2j1J0J5jk2k3j2pplQJ0NJ0K5L2J7lqLJ9K1Q
1461H05j5l1k3NK9K4mk6k6j6j1j8k2j3LP%kQK3K0%j1lJ4J9J1Jpj1j1lNKj1k3k5k0j5j7j4j
1456E97J7K0Nj8k4j5ljJJ1K3K2J4J4J9J4mk0k1j5j1lJ5L3L4K5K5L5L2Qj3j5njj2k0j7qjJ4
1451G51L4M9L9J8NORJj5k1j7j4j7j9rkrk6k9j2QPj3k7k0JK1K6K3J6J1Nmk0l2l0j5NJ8J5Kj0
1446G09qNJ7K5L4M7N9O1N2L9K1kj9k1rknj1j5k3l2l8l4l6m2l9j9pj9l4j6K2L9J9jPL4M2K5
1441H25jj6j8j7j9k0j0J2L1K9J3RJ5J2j1l4l6l0k9k6lK5K7Nj3mJ3K5K9K2kl4m9l1mQnk2k5
$$ plain form
1436 641 629 637 661 688 708 720 725 720 701 678 669 673 673 659 646 645 650 646 637 641 664 691 702 699 698 706 710 698 671 647 634 629 623 616 611 605 603 618 657 696 704 675 637 618 616 613 606
1431 606 607 621 636 643 646 659 687 719 738 739 728 715 701 683 660 642 640 652 669 681 680 665 644 630 625 620 611 604 607 616 620 615 610 612 620 630 635 631 616 592 563 527 487 454
1425 454 431 414 397 387 401 437 484 530 572 601 607 597 593 607 626 633 633 637 645 650 657 666 666 643 610 597 613 639 655 660 662 662 657 649 641 626 602 575 560 560 571 592 621
1420 621 651 674 697 727 758 770 759 737 719 701 681 671 681 704 718 715 704 703 721 753 788 812 817 807 792 777 761 739 710 680 657 653 670 700 725 735 730
1415 730 718 700 676 655 647 658 678 684 663 623 590 583 599 618 630 644 666 682 676 651 627 618 616 609 603 602 600 587 574 580 606 635 654 664 675 685 685 668 634 596 574
1410 574 582 612 639 650 649 642 630 619 625 656 697 722 726 723 726 736 754 780 811 835 850 867 897 934 969 1001 1028 1044 1040 1016 988 969 959 956 963 991 1044 1109 1162 1189
1406 1189 1197 1204 1217 1229 1239 1257 1286 1315 1332 1339 1347 1354 1353 1344 1335 1330 1326 1325 1334 1356 1385 1413 1428 1417 1377 1325 1291 1286 1296 1298 1276 1225 1153 1078 1020 982 950 915 886 877 882 891 909
1400 909 944 981 990 965 936 930 937 936 921 899 872 834 788 756 751 771 799 819 828 832 836 835 822 798 774 765 774 790 805 816 830 846 860 866 867 872 885 903 916 926 941 966
$$ packed form
1436F41j2QK4K7K0J2Nnj9k3rM%j4j3jNmrMK3K7J1ljQMj2k7k4j3nopnokJ5L9L9Qk9l8j9klp
1431F06JJ4J5PLJ3K8L2J9Jj1j3j4j8k3j8kJ2J7J2jj5k1j4nnrpLRMnnKQJ0Nmj5k4k9l6m0l3
1425D54k3j7j7j0J4L6M7M6M2K9Oj0mJ4J9P%MQNPR%k3l3j3J6K6J6NK%nqqj5k4k7j5%J1K1K9
1420F21L0K3K3L0L1J2j1k2j8j8k0j0J0K3J4lj1jJ8L2L5K4Nj0j5j5j6k2k9l0k3mJ7L0K5J0n
1415G30j2j8k4k1qJ1K0Ok1m0l3pJ6J9J2J4K2J6ok5k4rkpojkj3j3OK6K9J9J0J1J0%j7l4l8k2
1410E74QL0K7J1jpj2j1OL1M1K5MlLJ0J8K6L1K4J5J7L0L7L5L2K7J6mk4k8j9j0lPK8N3O5N3K7
1406A189QPJ3J2J0J8K9K9J7PQPjrrnmjRK2K9K8J5j1m0n2l4nJ0Kk2n1p2p5n8l8l2l5k9rNRJ8
1400I09L5L7Rk5k9oPjj5k2k7l8m6l2nK0K8K0RMMjj3k4k4rRJ6J5J1J4J6J4OJNJ3J8J3J0J5K5
$$ plain form
1395 966 990 999 991 974 954 924 883 839 810 807 820 837 846 850 855 856 840 802 751 713 703 715 735 755 778 806 833 851 864 882 902 911 900 880 867 862 850 827 808
1390 808 806 813 808 783 749 717 695 686 689 698 699 691 686 693 704 709 710 718 733 749 759 766 773 776 771 761 756 762 781 806 826 839 849 863 881 897 908 912 911 904 891 868 833 789 745 710
1385 710 678 644 616 607 624 658 698 740 779 804 807 797 789 791 801 818 844 881 918 944 958 961 950 924 891 866 845 815 772 739 742 778 820 844 848 846 844 841 835 824
1380 824 815 817 834 860 882 896 903 903 891 869 847 833 825 815 805 798 800 812 834 861 880 884 881 876 861 828 790 764 753 742 728 721 724 717 690 663 660 678 694 699 703 711 717 722
1374 722 741 785 840 888 919 929 917 881 841 821 830 848 847 821 783 753 738 741 763 796 822 827 816 806 805 803 796 793 803 821 831 825 809 797 799 818 849 880 897 898
1370 898 884 857 817 773 743 736 746 761 770 767 751 737 738 752 758 744 727 728 743 750 737 712 694 693 703 712 717 726 749 781 814 847 882 911 914 887 854 840 848 860 867 872
1364 872 882 895 909 924 933 932 928 933 946 960 973 991 1007 1004 981 960 956 959 957 960 983 1009 1007 973 935 921 929 945 962 979 991 994 993 992 991 984 971 958 954 961 970 977 985 998 1018
1359 1018 1035 1046 1055 1066 1076 1077 1065 1046 1029 1021 1025 1039 1058 1074 1085 1095 1107 1126 1154 1186 1208 1206 1190 1184 1198 1218 1228 1230 1238 1257 1280 1308 1346 1388 1419 1422 1400 1373 1357
$$ packed form
1395I66K4Rqj7k0l0m1m4k9lJ3J7RMNJj6l8n1l8j0J2K0K0K3K8K7J8J3J8K0Rj1k0j3nj2k3j9
1390H08kPnk5l4l2k2rLRJqnPJ1NJQJ5J6J0PPLnj0nOJ9K5K0J3J0J4J8J6J1Mjpj3k3l5m4m4l5
1385G10l2l4k8rJ7L4M0M2L9K5Lj0qKJ0J7K6L7L7K6J4Lj1k6l3k5k1l0m3l3LL6M2K4Mkkloj1
1380H24rKJ7K6K2J4P%j2k2k2j4qj0j0pKJ2K2K7J9Mlnj5l3l8k6j1j1j4pLpk7k7lJ8J6NMQON
1374G22J9M4N5M8L1J0j2l6m0k0RJ8jk6l8l0j5LK2L3K6Nj1j0jkplJ0J8J0oj6j2KJ9L1L1J7J
1370H98j4k7m0m4l0pJ0J5Rlj6j4JJ4Oj4j7JJ5Pj3k5j8jJ0RNRK3L2L3L3L5K9Lk7l3j4QJ2PN
1364H72J0J3J4J5RjmNJ3J4J3J8J6lk3k1mLkLK3K6kl4l8j4QJ6J7J7J2Ljjjpj3j3mPRPQJ3K0
1359A018J7J1RJ1J0Jj2j9j7qMJ4J9J6J1J0J2J9K8L2K2kj6oJ4K0J0KQJ9K3K8L8M2L1Lk2k7j6
$$ plain form
1354 1357 1352 1354 1366 1389 1420 1443 1449 1445 1444 1454 1466 1471 1468 1466 1473 1486 1499 1512 1534 1572 1615 1646 1655 1657 1674 1707 1738 1747 1733 1711 1696 1701 1729 1772 1813 1836 1845 1852 1861 1864 1856 1850 1865 1902
1349 1902 1947 1985 2013 2036 2061 2092 2133 2185 2241 2290 2329 2362 2393 2424 2454 2488 2531 2578 2616 2645 2671 2703 2742 2789 2843 2906 2975 3050 3133 3224 3315 3401 3480 3549
1345 3549 3604 3653 3719 3823 3960 4105 4239 4359 4473 4587 4708 4836 4967 5096 5232 5384 5553 5732 5923 6136 6375 6634 6909 7207
1342 7207 7537 7896 8278 8687 9135 9638 10214 10886 11678 12614 13722 15036 16590 18403 20503 22941 25792 29100 32840 36934
1339 36934 41289 45820 50430 54995 59391 63513 67272 70601 73550 76377 79477 83156 87481 92338 97587 103083 108617
1337 108617 113932 118817 123095 126547 129007 130659 132136 134165 137113 140899 145287 150054 154896 159371 163047 165605 166712
1335 166712 165969 163236 159007 154271 149902 146241 143224 140717 138604 136695 134749 132582 130023 126795 122608 117472 111831
1333 111831 106277 101183 96615 92509 88793 85370 82104 78885 75640 72250 68520 64317 59710 54943 50263 45806 41610
$$ packed form
1354A357nKJ2K3L1K3OmjJ0J2NlkPJ3J3J3K2L8M3L1RKJ7L3L1Rj4k2j5NK8M3M1K3RPRLqoJ5L7
1349A902M5L8K8K3K5L1M1N2N6M9L9L3L1L1L0L4M3M7L8K9K6L2L9M7N4O3O9P5Q3R1R1Q6P9O9
1345C549N5M9O6J04J37J45J34J20J14J14J21J28J31J29J36J52J69J79J91K13K39K59K75K98
1342G207L30L59L82M09M48N03N76O72P92R36J108J314J554J813K100K438K851L308L740M094
1339C6934M355M531M610M565M396M122L759L329K949K827L100L679M325M857N249N496N534
1337A08617N315M885M278L452K460J652J477K029K948L786M388M767M842M475L676K558J107
1335A66712p43k733m229m736m369l661l017k507k113j909j946k167k559l228m187n136n641
1333A11831n554n094m568m106l716l423l266l219l245l390l730m203m607m767m680m457m196
$$ plain form
1331 41610 37679 34016 30638 27582 24891 22576 20600 18901 17430 16163 15081 14157 13356 12642 11990 11398 10873 10415 10009
1329 10009 9632 9269 8910 8546 8185 7849 7557 7303 7064 6822 6585 6374 6201 6055 5910 5745 5570 5407 5268 5145 5027 4917 4817
1326 4817 4712 4590 4463 4352 4261 4171 4071 3970 3878 3789 3699 3610 3530 3462 3404 3359 3319 3268 3193 3106 3030 2975 2926 2864 2789 2715 2656 2612 2576 2543 2507
1322 2507 2462 2409 2352 2297 2247 2202 2166 2142 2129 2115 2098 2086 2088 2097 2098 2080 2045 1997 1939 1875 1819 1780 1758 1747 1740 1734 1729 1727 1724 1705 1667 1623 1597 1594 1596 1587 1570 1558 1553 1547 1539
1317 1539 1526 1505 1479 1455 1440 1425 1397 1363 1343 1349 1367 1378 1373 1352 1320 1287 1265 1259 1265 1276 1295 1318 1331 1317 1282 1250 1240 1249 1257 1255 1246 1239 1233 1220 1192 1153 1124 1121 1140 1159
1312 1159 1162 1154 1152 1165 1178 1176 1155 1131 1123 1133 1148 1155 1153 1150 1150 1145 1126 1097 1073 1064 1068 1072 1068 1059 1051 1046 1038 1023 1011 1014 1027 1034 1028 1017 1011 1005 990 974 968 970 969 968 986 1024 1056 1054 1027 1006
1306 1006 1008 1025 1037 1038 1027 1007 984 962 936 899 858 831 831 845 854 852 847 847 851 854 852 841 826 815 822 847 877 896 890 853 796 741 717 726 747 757 758 765 785 804 809 805 804
1301 804 803 795 778 760 741 716 685 665 672 699 720 715 688 650 618 606 621 656 687 702 707 715 724 726 718 708 699 682 657 640 647 675 703 722 740 763 788 805 811 809 800 779
$$ packed form
1331D1610l931l663l378l056k691k315j976j699j471j267j082r24q01p14o52n92n25m58m06
1329A0009l77l63l59l64l61l36k92k54k39k42k37k11j73j46j45j65j75j63j39j23j18j10j00
1326D817j05j22j27j11r1r0j00j01r2q9r0q9q0o8n8m5m0n1p5q7p6n5m9o2p5p4n9m4l6l3l6
1322B507m5n3n7n5n0m5l6k4j3j4j7j2KRJj8l5m8n8o4n6l9k2j1ponklj9l8m4k6lKrj7j2noq
1317A539j3k1k6k4j5j5k8l4k0OJ8J1nk1l2l3k2oOJ1J9K3J3j4l5l2j0RQkrpoj3k8l9k9lJ9J9
1312A159LqkJ3J3kk1k4qJ0J5Pkl%nj9k9k4rMMmrqnqj5j2LJ3Poj1ooj5j6oKjjJ8L8L2kk7k1
1306A006KJ7J2Jj1k0k3k2k6l7m1k7%J4Rkn%MLkj1j5j1PK5L0J9ol7n7n5k4RK1J0JPK0J9Nmj
1301H04jqj7j8j9k5l1k0PK7K1nk7l8l2j2J5L5L1J5NQRKqj0rj7k5j7PK8K8J9J8K3K5J7Okrk1
$$ plain form
1296 779 748 718 705 716 740 761 760 731 683 637 614 618 637 656 670 684 702 723 740 743 725 689 649 626 627 644 661 672 677 683 697 717 731 729 712 699 704 725 746
1291 746 761 774 777 754 706 662 650 662 665 648 634 643 663 666 644 615 591 579 579 587 597 608 628 664 697 701 674 638 614 597 582 572 571 564 541 511 495 499 508 510 507
1286 507 504 501 498 496 497 500 505 514 527 542 559 579 599 610 612 611 609 603 591 579 580 604 646 690 717 721 713 706 697 678 652 630 615 595 568 547 547 565 587 600 609 619 632 642
1281 642 645 637 624 616 618 626 632 629 620 608 593 573 547 521 505 510 533 557 569 567 566 578 605 635 653 650 624 585 552 534 525 511 491 482 497 529 555 570 581 592 597 592 590
1275 590 598 603 592 572 559 550 535 520 525 548 560 547 534 545 571 586 581 577 588 606 622 637 656 673 671 644 602 567 549 547 553 563 578 592 597 596 599 610 621 630 642
1270 642 653 641 598 546 516 517 527 532 530 529 528 531 547 579 620 659 694 731 773 818 853 868 866 861 867 885 904 915 923 934 951 972 993 1002 996 983 977 979 985 995 1016 1049
1265 1049 1083 1115 1149 1189 1223 1240 1240 1231 1215 1195 1174 1161 1158 1160 1162 1161 1156 1144 1128 1107 1088 1077 1073 1066 1045 1012 985 967 955 945 944 951 947 923 889 871 873 881 873 841 790 739
1260 739 708 704 714 722 723 716 696 659 615 583 571 575 586 592 581 553 526 515 513 501 478 457 447 444 449 478 535 594 623 615 590 566 548 533 523 520 521 522 521 519 516 516 522 535
$$ packed form
1296G79l1l0j3J1K4K1jk9m8m6k3MJ9J9J4J4J8K1J7Lj8l6m0k3JJ7J7J1NOJ4K0J4kj7j3NK1K1
1291G46J5J3Lk3m8m4j2J2Lj7j4RK0Lk2k9k4j2%QJ0J1K0L6L3Mk7l6k4j7j5j0jpk3l0j6MRKl
1286E07lllkJLNRJ3J5J7K0K0J1Kjkoj2j2JK4M2M4K7Mqprj9k6k2j5k0k7k1%J8K2J3RJ0J3J0
1281F42Lqj3qKQOlrj2j5k0k6k6j6NK3K4J2kjJ2K7L0J8lk6l9l3j8rj4k0rJ5L2K6J5J1J1Nnk
1275E90QNj1k0j3rj5j5NK3J2j3j3J1K6J5nmJ1J8J6J5J9J7kk7m2l5j8kOJ0J5J4NjLJ1J1RJ2
1270F42J1j2m3n2l0JJ0NkjjLJ6L2M1L9L5L7M2M5L5J5knOJ8J9J1QJ1J7K1K1Roj3oKOJ0K1L3
1265A049L4L2L4M0L4J7%rj6k0k1j3lKKjnj2j6k1j9j1mpk1l3k7j8j2j0jPmk4l4j8KQql2n1n1
1260G39l1mJ0QJpk0l7m4l2j2MJ1Oj1k8k7j1kj2k3k1j0lNK9N7N9K9qk5k4j8j5j0lJJjkl%OJ3
$$ plain form
1255 535 550 565 575 576 570 559 553 558 567 568 554 533 524 530 536 528 511 509 528 555 571 570 566 576 605 643 671 681 685 694 705 705 691 667 637 598 552 517 504 510 523 535 550
1249 550 574 611 656 689 696 678 657 647 646 649 661 683 702 707 704 706 706 688 651 613 590 581 581 595 622 651 671 678 671 645 604 570 567 597 638 665 673 667 652 629 601 578
1244 578 562 551 539 528 525 533 544 549 548 550 563 585 609 630 644 647 635 606 571 552 560 585 599 585 550 514 492 486 495 518 547 564 556 531 509 501 505 516 531 545 550
1239 550 540 524 518 530 553 576 599 621 633 623 590 547 508 486 487 509 537 550 538 511 491 485 485 482 477 482 501 527 552 569 576 575 567 560 557 561 567 569 571 572 563 540 512 500
1234 500 515 538 547 541 538 548 565 574 572 562 544 518 491 471 466 473 486 506 532 557 569 565 561 566 574 561 519 471 449 459 488 517 541 559 571 579 585 581 559 523 493 491
1229 491 517 549 564 553 524 499 498 521 550 566 569 572 583 594 595 584 568 557 555 566 587 609 621 617 606 594 579 554 522 492 472 458 449 449 466 495 525 552 580
1224 580 609 631 640 640 637 629 614 596 583 575 574 579 588 594 597 602 614 627 632 635 640 637 617 589 569 560 545 521 513 544 604 655 672 663 646 628 602 567 529 502 497 514 549 590
1219 590 627 649 647 625 601 590 591 589 575 556 547 554 572 594 608 606 586 560 543 539 541 538 523 499 476 469 486 514 531 528 516 509 510 516 523 528 524 510 499 506 532 561 579 585
$$ packed form
1255E35J5J5J0Joj1oNRJj4k1rOOqj7kJ9K7J6jmJ0K9L8K8J0MRJ1%j4k4l0l9m6l5j3OJ3J2J5
1249E50K4L7M5L3Pj8k1j0jLJ2K2J9NlK%j8l7l8k3r%J4K7K9K0Ppk6m1l4lL0M1K7Qoj5k3k8k3
1244E78j6j1j2j1lQJ1NjKJ3K2K4K1J4Lj2k9l5j9QK5J4j4l5l6k2oRK3K9J7qk5k2qMJ1J5J4N
1239E50j0j6oJ2K3K3K3K2J2j0l3m3l9k2JK2K8J3j2k7k0o%lnNJ9K6K5J7PjqplMOKKJrk3k8j2
1234E00J5K3RolJ0J7Rkj0j8k6k7k0nPJ3K0K6K5J2mmNQj3m2m8k2J0K9K9K4J8J2QOmk2l6l0k
1229D91K6L2J5j1k9k5jK3K9J6LLJ1J1Jj1j6j1kJ1K1K2J2mj1j2j5k5l2l0k0j4r%J7K9L0K7K8
1224E80K9K2R%lqj5j8j3qjNROLNJ2J3NLNlk0k8k0rj5k4qL1O0N1J7rj7j8k6l5l8k7nJ7L5M1
1219E90L7K2kk2k4j1Jkj4j9rPJ8K2J4kk0k6j7mKlj5k4k3pJ7K8J7lj2pJOPNmj4j1PK6K9J8O
$$ plain form
1213 585 583 579 579 587 594 587 561 524 487 457 441 450 486 529 556 559 548 538 540 556 575 579 561 533 520 532 565 599 619 617 605 596 594 582 551 515 502 522 550 563 560 559
1208 559 572 594 612 619 614 602 591 586 591 606 623 629 617 593 568 549 540 542 550 558 563 572 588 601 593 566 541 532 534 526 506 486 482 496 516 530 533 530 526 522 517 516 531 559 587 597
1203 597 589 572 552 527 496 465 442 434 441 456 472 490 515 545 571 586 590 585 573 559 553 556 555 539 513 488 467 451 446 457 482 513 547 586 624 647 652 645 631 605
1198 605 570 536 520 523 542 568 590 599 593 580 565 543 510 475 449 434 426 425 436 455 473 482 480 476 477 485 498 507 516 532 557 580 588 583 576 572 560 535 504 485 488 506 527
1192 527 542 551 557 559 554 544 536 540 554 563 549 513 483 487 526 569 593 597 594 584 561 530 506 496 491 491 500 518 532 535 538 549 558 553 539 530 527 528 536 555 576 582 571 559 562 580
1187 580 607 639 662 657 620 573 546 551 575 599 612 615 615 616 621 628 633 629 609 578 556 559 579 595 596 589 584 581 579 582 587 587 577 564 563 578 604 639 678 708 718 710 699 693 689 681
1181 681 673 666 659 649 635 618 604 594 593 599 612 632 655 670 667 647 622 605 597 591 580 568 567 578 584 564 522 487 479 488 492 491 504 534 562 572 573 574 569 550 528 521 535 551
1176 551 555 552 557 578 603 615 601 570 543 540 560 586 599 594 573 539 504 479 473 483 500 520 543 569 594 614 623 620 608 599 594 584 561 533 518 518 521 512 497 487 483 470
$$ packed form
1213E85km%QPpk6l7l7l0j6RL6M3K7Lj1j0KJ6J9Mj8k8j3J2L3L4K0kj2rkj2l1l6j3K0K8J3lj
1208E59J3K2J8Pnj2j1nNJ5J7Oj2k4k5j9rKQQNRJ6J3qk7k5rKqk0k0mJ4K0J4LlmmnjJ5K8K8J0
1203E97qj7k0k5l1l1k3qPJ5J6J8K5L0K6J5Mnj2j4oLjj6k6k5k1j6nJ1K5L1L4L9L8K3Npj4k6
1198F05l5l4j6LJ9K6K2Roj3j5k2l3l5k6j5qjJ1J9J8RkmJQJ3RRJ6K5K3Qnpmj2k5l1j9LJ8K1
1192E27J5ROKnj0qMJ4Rj4l6l0ML9M3K4Mlj0k3l1k4j0n%RJ8J4LLJ1Rnj4rlJQJ9K1Oj1j2LJ8
1187E80K7L2K3nl7m7k7NK4K4J3L%JNPNmk0l1k2LK0J6JpnlkLN%j0j3jJ5K6L5L9L0J0qj1omq
1181F81qppj0j4j7j4j0jOJ3K0K3J5lk0k5j7qoj1j2jJ1Ok0m2l5qRMjJ3L0K8J0JJnj9k2pJ4J6
1176E51MlNK1K5J2j4l1k7lK0K6J3nk1l4l5k5oJ0J7K0K3K6K5K0Rlj2rnj0k3k8j5%Lrj5j0mj3
$$ plain form
1171 470 441 405 381 386 419 459 480 480 477 493 521 538 538 534 534 534 528 528 543 566 584 596 611 627 630 616 592 571 557 549 547 554 572 598 620 629 631 637 647 651 642 632 634 641 643
1165 643 645 656 671 673 657 631 602 569 539 529 545 569 588 606 623 622 590 546 524 534 557 576 589 594 585 564 545 538 538 532 517 499 494 507 532 551 556 554 550 538 515
1160 515 498 508 542 571 577 571 566 561 543 514 486 470 472 488 508 518 519 518 525 539 556 572 585 587 579 569 560 548 532 526 540 558 560 543 526 524 535 548 550 534 509 498
1155 498 517 558 591 593 568 538 525 538 566 587 593 595 603 610 598 567 536 514 496 483 486 508 525 512 476 449 452 480 516 540 543 529 516 523 552 588 614 622 615 602
1150 602 593 592 592 591 593 601 608 598 570 540 526 531 546 561 570 568 563 564 574 579 570 554 544 543 544 549 563 588 615 638 659 673 665 624 570 534 527 539 553 567 584 598 598 578 548
1145 548 522 514 525 550 580 610 638 658 659 638 607 579 564 567 587 619 648 658 648 633 624 620 614 603 593 587 582 575 566 557 544 531 523 531 556 585 600 598 589 589 603 624 637
1139 637 631 609 582 566 567 583 606 619 611 588 571 583 615 641 641 622 603 591 582 574 571 575 584 597 616 629 625 602 572 551 541 542 551 561 565 565 570 579 582 569 544 522 516 533
1134 533 569 606 632 658 699 745 765 751 731 730 738 729 706 683 663 629 577 525 491 477 483 509 545 574 585 577 556 528 510 519 544 560 555 543 540 542 537 522 503 486
$$ packed form
1171D70k9l6k4NL3M0K1%lJ6K8J7%m%%o%J5K3J8J2J5J6Lj4k4k1j4qkPJ8K6K2RKOJ0Mrj0KPK
1165F43KJ1J5Kj6k6k9l3l0j0J6K4J9J8J7jl2m4k2J0K3J9J3Nrk1j9p%oj5j8nJ3K5J9Nkmj2k3
1160E15j7J0L4K9Oonnj8k9k8j6KJ6K0J0JjPJ4J7J6J3Kqj0rj2j6oJ4J8Kj7j7kJ1J3Kj6k5j1
1155D98J9M1L3Kk5l0j3J3K8K1OKQPj2l1l1k2j8j3LK2J7j3l6k7LK8L6K4Lj4j3PK9L6K6Qpj3
1150F02rj%jKQPj0k8l0j4NJ5J5RknJJ0Nrj6j0jJNJ4K5K7K3K1J4qm1n4l6pJ2J4J4J7J4%k0l0
1145E48k6qJ1K5L0L0K8K0Jk1l1k8j5LK0L2K9J0j0j5rmoj1j0onprrj3j3qQK5K9J5kr%J4K1J3
1139F37ok2k7j6JJ6K3J3qk3j7J2L2K6%j9j9j2rqlMRJ3J9J3mk3l0k1j0JRJ0M%NRLj3k5k2oJ7
1134E33L6L7K6K6M1M6K0j4k0jQrk3k3k0l4n2n2l4j4OK6L6K9J1qk1k8j8RK5J6nj2lKnj5j9j7
$$ plain form
1129 486 473 467 467 466 462 459 464 472 479 489 511 545 591 641 681 691 671 645 638 640 626 594 565 556 557 554 546 543 550 571 596 610 596 562 539 546 571 589 591 587 592 604 614 621 628 635
1123 635 637 627 610 603 611 622 619 602 582 571 564 551 535 531 550 586 620 633 624 609 603 604 601 590 583 592 615 632 634 626 615 605 594 583 584 606 649 697 730 738 724 694 657
1118 657 624 607 608 613 611 606 611 632 665 698 720 719 692 657 636 637 642 632 611 601 615 642 660 661 655 656 668 688 714 741 764 775 779 783 785 770 735 694 671 669 675 679 682 692
1113 692 710 724 723 701 668 640 627 626 628 628 626 619 606 593 585 581 576 566 561 575 607 634 634 601 553 521 521 544 571 588 601 613 620 616 604 591 582 575 569 564 558 552 551 566 597
1107 597 628 638 626 609 604 611 619 616 601 579 554 531 514 509 520 546 580 608 618 607 582 560 551 555 563 571 584 616 666 705 702 654 595 563 568 595 624 643 643 630 624
1102 624 643 677 701 703 695 690 681 660 629 605 593 593 602 621 639 646 641 636 636 637 631 618 604 597 601 613 625 641 670 712 751 766 752 720 685 650 617 592 576 563 550 545
1097 545 550 553 546 536 536 552 575 600 620 628 616 587 553 522 498 483 481 493 515 547 592 651 709 754 779 787 777 750 715 689 679 679 675 661 639 618 609 615 630 639 632
1092 632 617 611 619 630 629 615 601 598 604 612 619 624 624 612 591 573 569 573 578 582 589 604 628 656 684 704 712 699 667 624 591 578 581 583 571 547 520 500 489 489 498 509 518 535 570
$$ packed form
1129D86j3o%jmlNQPJ0K2L4M6N0M0J0k0k6pKj4l2k9rJlqlPK1K5J4j4l4k3PK5J8KmNJ2J0PPP
1123F35Kj0j7pQJ1lj7k0j1pj3j6mJ9L6L4J3rj5oJlj1pRK3J7Kqj1j0j1j1JK2M3M8L3Qj4l0l7
1118F57l3j7JNknNK1L3L3K2jk7l5k1JNj0k1j0J4K7J8JoJJ2K0K6K7K3J1MMKj5l5m1k3kOMLJ0
1113F92J8J4jk2l3k8j3jK%kpj3j3qmnj0nJ4L2K7%l3m8l2%K3K7J7J3J2Pmj2j3rponoojJ5L1
1107E97L1J0j2j7nPQlj5k2k5k3j7nJ1K6L4K8J0j1k5k2rMQQJ3L2N0L9lm8n9l2NK7K9J9%j3o
1102F24J9L4K4Kqnrk1l1k4j2%RJ9J8Pnn%Joj3j4pMJ2J2J6K9M2L9J5j4l2l5l5l3k5j6j3j3n
1097E45NLpj0%J6K3K5K0Qj2k9l4l1k4j5kJ2K2L2M5N9N8M5K5Qj0k7l5k6j0%mj4k2k1rOJ5Rp
1092F32j5oQJ1jj4j4lOQPN%j2k1j8mMNMPJ5K4K8K8K0Qj3l2m3l3j3LKj2k4k7k0j1%RJ1RJ7L5
$$ plain form
1087 570 610 628 617 598 596 604 593 558 523 509 511 512 507 508 518 532 541 549 555 557 557 568 601 647 688 709 710 696 673 646 620 600 589 586 591 601 613 618 613 605 609 625 644 654
1081 654 659 667 670 656 629 609 607 619 632 641 640 621 594 585 609 646 665 657 642 632 620 597 572 562 570 589 608 617 606 578 552 542 549 566 588 607 614 606 599 608 627 633 622
1076 622 609 607 609 605 598 598 601 598 588 577 571 568 563 554 543 534 533 540 549 547 533 515 508 515 526 530 525 519 518 519 516 509 507 513 523 527 520 504 487 478 483 495 505 510 515 524 531 534 535 538 542 548 561 585 613
1069 613 630 638 651 671 681 662 620 578 554 545 539 530 516 500 488 488 499 512 523 534 551 570 580 577 562 545 534 532 536 540 544 554 571 588 587 568 542 527 525 533 542 543
1064 543 530 511 499 508 538 575 603 614 611 602 599 603 600 579 546 518 509 519 540 564 586 604 622 644 664 670 659 642 634 636 637 629 612 590 569 560 567 588 616 640 656 663
1059 663 662 653 637 619 612 625 651 670 662 627 581 543 524 529 551 581 612 641 663 668 659 651 658 677 692 693 683 667 655 654 664 668 653 627 614 624 645 659 662 658 642 617
1054 617 591 575 563 543 525 530 561 588 583 551 527 532 553 562 551 533 522 520 524 533 544 550 549 553 572 599 617 620 619 626 646 673 704 727 732 720 708 705 709 708 697 674 645
1049 645 621 610 613 617 617 622 636 648 646 636 630 627 616 598 587 587 592 600 614 628 631 624 626 644 664 671 666 660 657 655 654 657 654 635 606 587 597 631 665 674 654 624 609 606 602 592 592
$$ packed form
1087E70M0J8j1j9kQj1l5l5j4KJnJJ0J4RQOK%J1L3M6M1K1Jj4k3k7k6k0j1lNJ0J2NnqMJ6J9J0
1081F54NQLj4k7k0kJ2J3Rjj9k7rK4L7J9qj5j0j2k3k5j0QJ9J9Rj1k8k6j0PJ7K2J9PqpRJ9Oj1
1076F22j3kKmp%Llj0j1olnrj1rjPRkj4j8pPJ1MnojJlpkOJ0Mpj6j7rNJ2J0NNRPLJLMOJ3K4K8
1069F13J7QJ3K0J0j9m2m2k4rorj4j6j2%J1J3J1J1J7J9J0lj5j7j1kMMMJ0J7J7jj9k6j5kQRJ
1064E43j3j9j2RL0L7K8J1lrlMlk1l3k8rJ0K1K4K2J8J8K2K0Oj1j7qKJqj7k2k1rPK1K8K4J6P
1059F63jrj6j8pJ3K6J9ql5m6l8j9NK2L0L1K9K2NrqPJ9J5Jj0j6j2jJ0Mj5k6j3J0K1J4Lmj6k5
1054F17k6j6j2k0j8NL1K7nl2k4NK1Rj1j8j1kMRJ1OjMJ9K7J8LjPK0K7L1K3Nj2j2lMjj1k3k9
1049F45k4j1LM%NJ4J2kj0olj1j8j1%NQJ4J4LpKJ8K0PnolkjLlj9k9j9J0L4L4Rk0l0j5lmj0%
$$ plain form
1043 592 608 625 626 618 618 630 647 668 694 717 722 709 687 664 636 610 599 607 620 625 619 604 591 594 622 664 701 727 749 759 737 687 637 610 597 586 584 607 641
1038 641 666 678 684 680 653 617 600 604 599 574 554 562 589 611 628 652 679 694 697 705 723 736 740 742 749 745 719 680 653 649 657 661 652 631 602 574 560 567 590 616 632 631 618
1033 618 606 608 629 650 652 635 620 620 625 615 593 581 591 607 610 596 567 525 481 456 465 494 513 516 521 539 553 551 548 564 594 616 619 622 636 652 653 639 623 615 606 586
1028 586 559 531 514 510 522 542 556 556 548 547 560 575 580 579 587 611 641 668 686 697 700 693 672 638 602 588 607 645 675 683 675 661 639 613 592 584 580 570 555 545 539 529
1023 529 521 527 549 569 578 581 592 604 598 566 515 468 444 445 459 478 503 536 570 593 602 603 603 606 612 620 627 628 628 638 656 671 672 662 653 653 660 667 664 643 618 609 625 649 665 672
1017 672 676 671 654 634 627 631 628 616 608 615 629 636 632 620 606 591 583 584 588 585 577 574 581 596 609 618 618 608 584 554 537 542 558 563 551 540 550 582 611 616 594 564 547 552 574 596
1011 596 610 624 640 648 635 609 592 591 588 568 539 518 515 527 544 559 570 581 601 630 658 679 697 709 701 677 658 657 658 642 617 611 624 635 629 616 609 608 608 613 629
1006 629 650 667 681 690 682 648 605 580 587 609 620 609 583 564 566 590 617 623 601 563 529 514 518 528 527 515 503 501 505 504 496 492 494 499 508 526 557 594 623 644 660 674
$$ packed form
1043E92J6J7Jq%J2J7K1K6K3Nj3k2k3k8k6j1QJ3Noj5j3LK8M2L7K6K2J0k2n0n0k7j3j1kK3L4
1038F41K5J2Omk7l6j7Mnk5k0QK7K2J7K4K7J5LQJ8J3MKPmk6l9k7mQMrk1k9k8j4PK3K6J6jj3
1033F18j2KK1K1Kj7j5%Nj0k2j2J0J6Lj4k9m2m4k5RK9J9LNJ8J4klJ6L0K2LLJ4J6Jj4j6qrk0
1028E86k7k8j7mJ2K0J4%qjJ3J5NjQK4L0K7J8J1Lpk1l4l6j4J9L8L0Qqj4k2k6k1qmj0j5j0oj0
1023E29qOK2K0RLJ1J2ol2n1m7k4JJ4J9K5L3L4K3RJ%LOQPJ%J0J8J5Jj0r%PPlk1k5rJ6K4J6P
1017F72Mnj7k0pMlj2qPJ4Pmj2j4j5qJMlqlPJ5J3R%j0k4l0j7NJ6Nj2j1J0L2K9Nk2l0j7NK2K2
1011E96J4J4J6Qj3k6j7jlk0k9k1lJ2J7J5J1J1K0K9K8K1J8J2qk4j9jJj6k5oJ3J1oj3pj%NJ6
1006F29K1J7J4Rql4m3k5PK2J1j1k6j9KK4K7Ok2l8l4j5MJ0jj2j2kMjqmKNRJ8L1L7K9K1J6J4
$$ plain form
1001 674 686 698 713 723 716 692 671 671 687 699 693 677 664 658 652 641 626 614 613 626 650 664 655 630 612 614 621 617 602 588 581 579 583 592 605 614 619 627 637 640 631 619 617 632 656
996 656 678 687 679 657 629 602 573 541 512 491 485 493 513 534 545 538 520 501 484 469 468 491 530 563 579 590 614 648 672 679 675 669 658 646 646 660 673 670 657 649 643 625
991 625 598 586 606 644 676 693 699 696 683 672 676 693 703 691 665 642 631 631 640 654 668 683 706 736 756 752 732 719 717 709 687 666 669 692 708 708 705 708 708 693 669 652
985 652 647 642 634 633 643 655 659 658 657 646 614 567 530 516 516 513 504 499 508 529 555 577 584 579 576 590 616 634 635 630 636 659 686 698 691 678 678 692 708 711 704 704 721 743 755 753 745 733
980 733 714 691 680 695 725 747 749 740 737 740 738 720 689 652 615 585 577 599 643 679 686 669 655 658 671 681 690 705 729 746 744 722 693 667 650 645 649 657 667 682 702 717
974 717 718 704 687 673 668 678 703 731 747 745 731 715 697 680 665 644 611 572 556 577 619 648 655 653 655 654 643 632 635 649 655 647 634 631 636 642 641 634 624 614 604 596 589 584
969 584 579 571 559 550 549 552 552 552 563 590 628 667 702 731 753 763 762 753 737 718 699 680 662 650 650 657 652 629 603 594 601 607 607 614 630 644 648 644 637 628 619 623 651 686 702 692 672
963 672 662 665 671 669 658 647 644 652 663 670 672 668 661 654 655 667 677 679 679 692 711 720 707 683 664 657 656 651 636 618 615 634 660 669 659 650 651 648 633 619 622 634 634 619 605 601 599 594 590
$$ packed form
1001F74J2J2J5J0pk4k1%J6J2oj6j3ooj1j5j2jJ3K4J4rk5j8KPmj5j4pkMRJ3RNQJ0Lrj2kJ5K4
996F56K2Rqk2k8k7k9l2k9k1oQK0K1J1pj8j9j7j5jK3L9L3J6J1K4L4K4Pmoj1j2%J4J3lj3qoj8
991F25k7j2K0L8L2J7Olj3j1MJ7J0j2k6k3j1%RJ4J4J5K3L0K0mk0j3kqk2k1LK3J6%lL%j5k4j7
985F52nnqjJ0J2Mjjj1l2m7l7j4%lrnRK1K6K2PnlJ4K6J8JnOK3K7J2pj3%J4J6Lp%J7K2J2kqj2
980G33j9k3j1J5L0K2KrlLkj8l1l7l7l0qK2M4L6Pj7j4LJ3J0RJ5K4J7kk2k9k6j7nMQJ0J5K0J5
974G17Jj4j7j4nJ0K5K8J6kj4j6j8j7j5k1l3l9j6K1M2K9PkKjj1j1LJ4Oqj3lNOjpj0j0j0qpn
969E84nqj2rjL%%J1K7L8L9L5K9K2J0jrj6j9j9j9j8j2%Pnk3k6rPO%PJ6J4MmprrMK8L5J6j0k0
963F72j0LOkj1j1lQJ1PKmppJJ2J0K%J3J9Rj3k4j9pjnj5j8lJ9K6Rj0rJlj5j4LJ2%j5j4mknm
$$ plain form
957 590 592 599 610 626 647 667 678 684 689 694 692 675 646 617 597 582 566 555 558 573 576 555 528 525 552 584 598 600 609 627 635 619 584 547 526 527 543 562 576 586 597 610
952 610 619 626 635 650 665 666 644 606 570 550 549 560 572 578 578 577 581 593 612 635 660 682 694 695 689 682 670 651 631 622 624 625 620 619 636 660 671 659 638 630 640 657 670 680
947 680 691 694 678 644 610 589 581 580 583 595 612 628 641 650 652 639 611 583 570 575 590 603 604 598 595 601 608 605 599 611 652 711 766 798 795 753 693 648 637 637 619 581 546
942 546 532 533 540 552 573 599 624 640 642 634 624 615 607 601 601 607 613 613 618 639 666 674 655 627 609 605 608 615 622 625 619 609 601 601 614 632 637 618 585 562 561 574 592 612 626 619 596
936 596 583 600 632 649 645 638 644 662 685 705 717 711 685 644 601 574 571 581 584 574 567 580 605 623 629 631 634 637 639 649 667 680 679 668 659 659 671 683 684 670 652 638 622
931 622 602 590 598 609 601 580 581 615 651 661 651 641 639 636 639 657 690 720 735 740 737 730 724 726 731 731 723 713 702 688 674 668 672 676 672 659 643 629 621 614 600 579 564 564 573 577 577
925 577 582 597 616 632 640 635 617 599 596 608 624 637 654 670 666 635 599 582 584 587 578 563 552 557 581 618 646 645 626 616 629 655 682 707 729 736 728 722 731 749 757 754 749 744
919 744 732 715 706 706 703 686 657 633 630 655 695 727 729 710 689 678 669 656 646 647 651 644 630 621 617 606 585 566 559 561 564 569 576 585 594 599 602 600 600 605 610 603 581 552 526 507 496 498
$$ packed form
957E90KPJ1J6K1K0J1ONNkj7k9k9k0j5j6j1LJ5Lk1k7lK7L2J4KRJ8Qj6l5l7k1JJ6J9J4J0J1J3
952F10RPRJ5J5Jk2l8l6k0jJ1J2O%jMJ2J9K3K5K2J2Jopj2j9k0rKJnjJ7K4J1j2k1qJ0J7J3J0
947F80J1Lj6l4l4k1qjLJ2J7J6J3RKj3k8k8j3NJ5J3JolOPloJ2M1N9N5L2lm2o0m5j1%j8l8l5
942E46j4JPJ2K1K6K5J6Kqj0rqo%OO%NK1K7Qj9k8j8mLPPLoj0q%J3J8Nj9l3k3jJ3J8K0J4pk3
936E96j3J7L2J7mpOJ8K3K0J2ok6m1m3k7lJ0Lj0pJ3K5J8OKLLKJ0J8J3jj1r%J2J2Jj4j8j4j6
931F22k0j2QJ1qk1JL4L6J0j0j0klLJ8L3L0J5NlpoKN%qj0j1j4j4oMMmj3j6j4qpj4k1j5%RM%
925E77NJ5J9J6Qnj8j8lJ2J6J3J7J6ml1l6j7KLrj5j1NK4L7K8jj9j0J3K6K7K5K2PqoRJ8Qlnn
919G44j2j7r%lj7k9k4lK5M0L2Kj9k1j1rj3j0JMpj4rmj1k1j9pKLNPRRNLk%NNpk2k9k6j9j1K
$$ plain form
914 498 511 525 532 540 558 589 626 666 710 747 761 746 713 679 657 650 656 667 674 672 662 647 631 614 600 596 612 643 671 672 645 607 580 564 556 560 581 608 625 627 625
908 625 625 621 615 621 649 683 697 679 645 619 607 604 605 612 625 634 627 604 580 571 579 593 603 605 605 614 637 668 684 675 652 636 629 621 606 595 592 589 582 580 594 621 652 679 701 708
903 708 694 670 649 643 646 652 662 677 698 721 742 756 756 745 728 709 695 689 683 668 648 637 640 643 628 601 582 583 596 611 623 627 616 597 583 586 602 621 640 657 668
898 668 669 663 652 638 624 615 613 619 632 651 670 683 695 711 726 729 722 718 726 740 755 771 781 776 754 722 691 656 620 592 580 574 560 539 521 513 514 529 562 599 619 616
893 616 607 612 626 641 659 690 729 751 742 711 681 667 669 681 703 726 735 717 682 652 636 629 623 619 625 642 665 688 708 720 717 703 689 686 692 695 682 662 656 676 706 719
888 719 707 693 695 701 694 674 657 649 643 637 638 645 643 624 601 589 589 594 597 591 576 559 554 566 580 585 590 607 636 659 667 663 658 652 641 631 632 642 649 646 641 648 660 662 646 624 607 595
882 595 580 572 581 605 626 633 633 629 617 595 574 563 559 557 558 561 555 535 517 520 541 562 572 573 572 572 581 599 618 627 629 637 652 665 671 673 672 659 634 615 614 628 640 648 657 667 669 661
876 661 653 650 645 627 602 585 588 609 633 651 661 670 681 693 700 699 694 692 698 704 700 681 654 637 636 647 660 670 675 670 653 635 632 652 683 704 705 692 676 659 641 629 630 644
$$ packed form
914D98J3J4PQJ8L1L7M0M4L7J4j5l3l4k2pOJ1Pkj0j5j6j7j4mJ6L1K8Jk7l8k7j6qMK1K7J7Kk
908F25%moOK8L4J4j8l4k6j2lJPJ3Rpk3k4rQJ4J0K%RK3L1J6rk3j6pqj5j1llpkJ4K7L1K7K2P
903G08j4k4k1oLOJ0J5K1K3K1J4%j1j7j9j4ooj5k0j1LLj5k7j9JJ3J5J2Mj1j9j4LJ6J9J9J7J1
898F68Joj1j4j4rkOJ3J9J9J3J2J6J5LpmQJ4J5J6J0nk2l2l1l5l6k8j2oj4k1j8qJJ5L3L7K0l
893F16rNJ4J5J8L1L9K2rl1l0j4KJ2K2K3Rj8l5l0j6pomOJ7K3K3K0J2lj4j4lOLj3k0oK0L0J3
888G19j2j4KOpk0j7qooJPkj9k3j2%NLoj5j7nJ2J4NNJ7K9K3Qmnoj1j0JJ0PlnPJ2Kj6k2j7j2
882E95j5qRK4K1P%mj2k2k1j1mkJLok0j8LK1K1J0Jj%RJ8J9RKQJ5J3OKjj3k5j9jJ4J2QRJ0Kq
876F61qlnj8k5j7LK1K4J8J0RJ1J2PjnkOOmj9k7j7jJ1J3J0Nnj7j8lK0L1K1Jj3j6j7j8j2JJ4
$$ plain form
870 644 658 661 652 635 618 612 623 638 640 624 603 588 579 568 562 571 585 588 576 564 561 562 564 574 595 614 626 644 681 726 755 761 756 748 729 694 650 611 587 585 600 622 637
865 637 645 650 656 656 651 658 688 730 749 726 674 623 593 582 583 593 609 627 638 636 624 602 577 559 555 562 566 561 564 588 626 661 682 694 702 706 706 706 704 693 678 668 667 665 655
860 655 636 614 594 582 587 605 618 611 593 576 564 552 546 558 585 608 617 622 632 641 641 635 632 635 633 624 623 643 679 710 718 701 678 669 680 699 708 703 691 682 677 674 671 665 656 646 638
854 638 635 641 653 666 671 665 648 621 587 560 561 595 647 690 718 737 751 757 752 746 742 735 726 723 724 715 684 646 622 617 615 607 601 603 604 593 576 567 574 585 589 587 589 604 625 643 657 673
848 673 692 706 709 707 705 701 688 663 631 601 579 573 587 619 657 682 684 665 640 628 640 667 694 709 709 698 677 656 640 634 639 660 692 723 735 731 727 731 734 731 731 739 743 730
843 730 708 696 693 688 680 682 700 723 741 757 773 779 764 736 713 704 704 706 711 722 731 728 713 700 704 721 734 731 713 699 700 708 714 714 716 719 712 685 639 598 586 608 637 648 635
837 635 618 616 629 646 660 663 655 639 623 611 602 591 579 576 587 604 614 610 596 580 569 566 574 597 631 664 678 673 659 646 634 624 624 638 655 668 682 709 741 760
832 760 751 723 695 677 666 655 640 621 604 601 616 639 657 664 659 648 637 637 654 682 706 707 681 643 615 608 618 632 640 640 633 623 619 620 617 599 574 562 575 604 632 651
$$ packed form
870F44J4Lrj7j7oJ1J5Kj6k1j5rj1oRJ4Lj2j2lJKJ0K1J9J2J8L7M5K9Onqj9l5m4l9k4kJ5K2J5
865F37QNO%nPL0M2J9k3n2n1l0j1JJ0J6J8J1kj2k2k5j8mPMnLK4L8L5K1J2QM%%kj1j5j0jkj0
860F55j9k2k0j2NJ8J3pj8j7j2j2oJ2K7K3RNJ0R%olLkrjK0L6L1Qj7k3rJ1J9Rnj2rnllorj0q
854F38lOJ2J3Noj7k7l4k7JL4N2M3K8J9J4OnomprlJrl1l8k4nkqoKJj1j7rPJ1MkKJ5K1J8J4J6
848F73J9J4Lkkmj3k5l2l0k2oJ4L2L8K5Kj9k5j2J2K7K7J5%j1k1k1j6oNK1L2L1J2mmMLl%QMj3
843G30k2j2lnqKJ8K3J8J6J6Oj5k8k3r%KNJ1Rlj5j3MJ7J3lj8j4JQO%KLpk7m6m1j2K2K9J1j3
837F35j7kJ3J7J4Lqj6j6j2rj1j2lJ1J7J0mj4j6j1lQK3L4L3J4nj4j3j2j0%J4J7J3J4K7L2J9
832G60rk8k8j8j1j1j5j9j7lJ5K3J8Pnj1j1%J7K8K4Jk6l8k8pJ0J4Q%pj0mJlj8k5j2J3K9K8J9
$$ plain form
827 651 665 678 692 707 717 714 698 685 688 702 702 677 637 602 582 573 567 562 560 566 582 605 624 631 633 644 665 674 654 606 558 537 545 572 609 649 683 706 718 724 719 697
822 697 666 645 644 651 651 637 611 576 543 532 553 591 620 631 634 636 638 643 664 693 704 692 680 690 711 721 716 713 719 720 714 714 730 757 776 782 776 760 742 735 742 753 753 739
817 739 716 695 690 712 752 786 794 784 777 778 774 757 738 727 720 718 727 750 770 768 743 719 714 724 737 745 747 741 725 710 715 741 768 776 764 752 759 783 805 810 799 779 757 734
811 734 711 697 699 717 732 731 718 714 732 763 788 801 808 810 807 799 797 802 814 831 860 900 938 958 966 985 1037 1123 1232 1349 1466 1578 1681 1772 1844 1890 1911 1908
807 1908 1879 1822 1739 1648 1564 1491 1419 1336 1243 1148 1060 984 922 876 845 825 815 812 811 806 790 767 742 720 704 705 723 745 750 731 699 673 662 666 684 714 749 778
802 778 793 789 763 722 684 664 662 668 674 680 686 689 686 678 671 666 665 670 683 699 714 725 732 730 716 690 659 635 633 655 689 714 723 718 712 705 694 678 665 668 690 716 727 721 715 721 736
796 736 747 760 786 821 842 834 805 779 767 770 780 789 784 768 757 767 788 798 790 783 797 833 880 924 953 957 940 918 905 898 892 890 898 913 919 909 885 857 827 800 776
791 776 760 753 753 755 747 733 728 744 778 811 826 826 818 809 801 797 797 794 780 761 749 755 776 802 816 804 773 742 731 741 756 761 760 766 790 830 872 907 930 940 939 932 928 935 943 934
$$ packed form
827F51J4J3J4J5J0lj6j3LJ4%k5m0l5k0ronkOJ6K3J9PKJ1K1Rk0m8m8k1QK7L7M0L4K3J2Onk2
822F97l1k1jP%j4k6l5l3j1K1L8K9J1LKKNK1K9J1j2j2J0K1J0nlOJo%J6K7J9Ooj6j8pPJ1%j4
817G39k3k1nK2M0L4Qj0pJmj7j9j1pkRK3K0kk5k4nJ0J3QKoj6j5NK6K7Qj2j2PK4K2Nj1k0k2k3
811G34k3j4KJ8J5jj3mJ8L1K5J3PKlqkNJ2J7K9M0L8K0QJ9N2Q6J09J17J17J12J03R1P2M6K1l
807A908k9n7q3r1q4p3p2q3r3r5q8p6o2m6l1k0j0ljnj6k3k5k2j6JJ8K2Nj9l2k6j1MJ8L0L5K9
802G78J5mk6m1l8k0kOOOOLlqpnjNJ3J6J5J1Pkj4k6l1k4kK2L4K5Rnopj1j6j3LK2K6J1ooOJ5
796G36J1J3K6L5K1qk9k6j2LJ0Rnj6j1J0K1J0qpJ4L6M7M4K9Mj7k2j3pokQJ5Oj0k4k8l0k7k4
791G76j6p%Kqj4nJ6L4L3J5%qrqm%lj4j9j2OK1K6J4j2l1l1j1J0J5NjOK4M0M2L5K3J0jpmPQr
$$ plain form
786 934 897 843 797 775 777 788 798 806 819 842 868 888 895 897 902 912 912 890 851 809 780 766 759 748 728 706 689 679 670 660 652 662 692 729 748 738 713 696 697 702 695
781 695 677 663 658 660 668 687 712 727 726 716 709 701 685 664 652 661 688 728 773 810 827 822 806 791 782 775 763 747 727 707 697 697 701 702 703 712 732 753 759 746 727 720 731 746
775 746 755 757 757 751 735 712 696 699 717 736 743 737 725 723 733 739 719 676 638 626 642 674 709 731 730 709 690 686 689 689 696 724 761 774 753 719 694 678 662 650 648 649 641 619
770 619 589 564 554 567 606 654 687 688 668 655 668 700 730 739 732 718 699 671 645 637 651 673 693 710 725 731 720 706 703 713 725 734 743 750 751 749 760 788 823 847 852
765 852 839 815 788 770 769 779 789 789 777 756 731 707 692 685 684 684 688 705 736 769 791 797 793 787 783 781 784 780 754 706 659 642 657 688 721 752 776 786 781 768 758 762 783
760 783 816 843 854 852 844 827 795 762 745 741 731 713 708 726 742 722 666 605 568 560 572 596 621 638 643 637 624 615 624 650 673 679 674 678 694 707 708 704 707 715 721 723 721 722 732
754 732 756 782 792 782 768 761 755 741 725 718 716 706 684 660 650 659 677 689 682 659 632 615 612 626 660 710 757 780 780 772 771 776 777 773 769 770 775 779 779 778 779 784 786 780 766 751 741
748 741 736 740 754 772 787 794 796 802 813 825 826 808 772 737 720 729 750 763 751 716 672 640 632 646 666 681 696 714 731 735 724 707 703 723 765 816 856 870 858 824
$$ packed form
786I34l7n4m6k2KJ1J0QJ3K3K6K0PKNJ0%k2l9m2k9j4pj1k0k2j7j0rj0qJ0L0L7J9j0k5j7JNp
781F95j8j4nKQJ9K5J5jj0pqj6k1j2RK7M0M5L7J7nj6j5rpj2j6k0k0j0%MJJRK0K1Oj3j9pJ1J5
775G46RK%oj6k3j6LJ8J9Poj2kJ0Ok0m3l8j2J6L2L5K2jk1j9mL%PK8L7J3k1l4k5j6j6j2kJqk2
770F19l0k5j0J3L9M8L3Jk0j3J3L2L0Rpj4j9k8k6qJ4K2K0J7J5Oj1j4lJ0J2RRPJkJ1K8L5K4N
765H52j3k4k7j8jJ0J0%j2k1k5k4j5pj%MJ7L1L3K2OmomkLmk6m8m7j7J5L1L3L1K4J0nj3j0MK1
760G83L3K7J1kqj7l2l3j7mj0j8nJ8J6k0n6o1l7qJ2K4K5J7Noj3rRK6K3OnMJ6J3JmLQOKkJJ0
754G32K4K6J0j0j4poj4j6pkj0k2k4j0RJ8J2pk3k7j7lJ4L4N0M7K3%qjNJmmJNM%jJNKoj4j5j0
748G41nMJ4J8J5PKOJ1J2Jj8l6l5j7RK1J3j2l5m4l2qJ4K0J5J5J8J7Mj1j7mK0M2N1M0J4j2l4
$$ plain form
743 824 775 720 668 630 607 594 592 600 612 620 618 616 623 639 656 664 664 662 659 651 634 613 602 614 641 668 685 701 719 735 744 753 770 787 791 784 780 782 779 759 732 709 693 681
738 681 674 675 684 698 718 740 747 730 701 683 681 678 662 644 638 644 651 651 640 620 602 606 641 690 731 755 768 774 770 752 731 714 701 684 666 652 643 633 613 587 561 543
733 543 539 556 591 635 669 679 672 666 677 702 725 734 724 701 680 674 680 683 671 651 643 657 687 722 750 764 761 752 755 772 791 794 778 760 744 724 692 663 656 672 687 683
728 683 670 670 684 697 696 687 679 675 670 663 657 652 649 657 682 717 748 763 761 740 701 659 637 647 681 720 756 786 800 794 776 767 772 776 761 737 726 732 734 708 664 635 641 671 696
722 696 705 714 732 748 746 730 719 722 728 722 700 669 642 633 651 692 736 761 760 742 723 706 696 698 716 746 770 772 754 730 720 732 757 777 785 788 794 800 795 782 769 761 750
717 750 735 726 731 741 747 752 765 781 785 776 765 759 751 739 731 736 752 769 784 792 790 781 777 780 773 748 723 724 750 773 773 756 734 711 691 681 687 706 726 747 767 775 764 746 742 761
711 761 789 809 813 803 785 769 763 768 772 765 747 735 741 762 784 799 809 823 838 848 850 855 871 897 920 937 952 964 968 962 953 950 950 944 927 901 869 834 797 772 773 798 825
706 825 832 824 825 844 865 870 856 835 811 779 742 718 727 766 811 838 841 838 844 853 847 825 807 812 830 838 828 811 792 767 742 729 730 732 728 731 755 797 835 854 849 826 796 780
$$ packed form
743H24m9n5n2l8k3j3kQJ2QkkPJ6J7Q%klqj7k1j1J2K7K7J7J6J8J6RRJ7J7MpmKlk0k7k3j6j2
738F81pJRJ4K0K2Pj7k9j8klj6j8oOP%j1k0j8ML5M9M1K4J3Omj8k1j7j3j7j8j4rj0k0k6k6j8
733E43mJ7L5M4L4J0poJ1K5K3Rj0k3k1oOLj2k0qJ4L0L5K8J4lrLJ7J9Lj6j8j6k0l2k9pJ6J5m
728F83j3%J4J3jrqmnponlQK5L5L1J5kk1l9m2k2J0L4L9L6L0J4oj8rNMj5k4j1OKk6m4k9OL0K5
722F96RRJ8J6kj6j1LOok2l1k7rJ8M1M4K5jj8j9j7j0KJ8L0K4Kj8k4j0J2K5K0QLOOnj3j3qj1
717G50j5rNJ0ONJ3J6Mrj1oqj2qNJ6J7J5QkrmLpk5k5JK6K3%j7k2k3k0j0OJ9K0K1K0Qj1j8mJ9
711G61K8K0Mj0j8j6oNMpj8j2OK1K2J5J0J4J5J0KNJ6K6K3J7J5J2Morl%oj7k6l2l5l7k5JK5K7
706H25PqJJ9K1Nj4k1k4l2l7k4RL9M5K7LlORok2j8NJ8Qj0j7j9k5k5j3JKmLK4M2L8J9nk3l0j6
$$ plain form
701 780 785 797 799 788 776 776 788 801 804 796 790 799 817 821 803 785 795 830 869 905 942 973 975 949 922 912 907 892 873 860 847 819 780 758 768 797 825 843 851 850 839
696 839 821 799 785 789 812 838 851 851 851 859 867 866 857 852 857 869 876 868 847 824 812 815 825 834 836 824 800 776 765 763 755 740 735 754 782 796 795 796 804 808 799 784 777 781 784 781 772 765 768 782
690 782 804 827 846 865 881 886 877 856 837 829 834 846 860 869 871 869 867 870 876 880 872 847 810 780 773 790 806 804 787 769 758 752 753 768 797 828 855 884 920 952 965 963 959 950 926
684 926 892 869 870 883 891 896 909 930 944 946 939 928 913 900 899 915 934 935 911 872 836 813 797 781 770 780 810 839 846 835 825 831 849 870 893 916 928 919 890 851
679 851 811 779 760 754 753 751 747 750 765 789 807 810 804 810 835 862 872 869 868 874 875 871 881 910 937 937 916 903 914 939 962 978 988 993 993 989 983 969 946 915 882 857 854 873 900
674 900 912 908 902 900 892 872 849 841 847 857 861 856 838 815 803 816 845 872 892 912 937 960 975 988 1003 1017 1024 1022 1013 989 949 901 863 844 841 850 866 883 890 881 859 832 811
668 811 797 791 792 800 813 821 816 796 772 755 746 744 750 772 809 848 869 865 842 811 782 766 773 806 852 882 878 852 835 838 846 842 834 839 856 865 859 850 855 874 903 939 976 997 995 983
663 983 977 971 949 913 883 874 877 877 878 889 910 927 931 920 905 893 889 887 884 875 866 863 874 901 939 975 996 1000 996 988 977 964 959 965 974 978 979 981 983 977 960 942 931 925 919 916 922 938 954
$$ packed form
701G80NJ2Kj1j2%J2J3LqoRJ8Mj8j8J0L5L9L6L7L1Kk6k7j0nj5j9j3j3k8l9k2J0K9K8J8Qjj1
696H39j8k2j4MK3K6J3%%QQjrnNJ2Pqk1k3j2LJ0RKj2k4k4j1kqj5nJ9K8J4jJQMrj5pMLlrpLJ4
690G82K2K3J9J9J6Nrk1j9qNJ2J4RKkkLOMqk5l7l0pJ7J6kj7j8j1oJJ5K9L1K7K9L6L2J3kmrk4
684I26l4k3JJ3QNJ3K1J4Kpj1j5j3jJ6J9Jk4l9l6k3j6j6j1J0L0K9Pj1j0OJ8K1K3K3J2rk9l9
679H51m0l2j9ojkmLJ5K4J8LoOK5K7J0ljOJmJ0K9K7%k1j3J1K5K3J6J0N%moj4k3l1l3k5lJ9K7
674I00J2mokqk0k3qOJ0Mnj8k3j2J3K9K7K0K0K5K3J5J3J5J4Pkrk4m0m8l8j9lRJ6J7Prk2k7k1
668H11j4oJQJ3Qnk0k4j7rkOK2L7L9K1mk3l1k9j6PL3M6L0mk6j7LQmqNJ7RorNJ9K9L6L7K1kj2
663I83ook2l6l0rL%JJ1K1J7Mj1j5j2mklrrlJ1K7L8L6K1Mmqj1j3nORMJKKoj7j8j1oolOJ6J6
$$ plain form
657 954 965 975 998 1030 1054 1049 1015 972 941 930 930 936 945 953 959 964 972 978 974 954 930 916 919 927 926 915 907 914 933 957 975 986 995 1003 1006 1000 984 961 934 908 889 887 902 926 944
651 944 945 930 908 885 863 848 842 843 848 854 868 892 922 951 976 998 1016 1030 1038 1035 1020 996 978 980 998 1019 1032 1039 1038 1028 1011 996 989 988 989 993 1005 1022 1031 1019 990 961 947
646 947 953 973 991 997 990 981 985 1005 1030 1039 1029 1017 1019 1027 1017 981 943 930 944 965 976 974 969 967 977 1004 1043 1074 1081 1066 1047 1040 1048 1063 1070 1062 1044 1027 1017 1012 1009 1005 1009 1021 1037
641 1037 1050 1059 1069 1079 1080 1069 1058 1060 1079 1100 1109 1103 1092 1079 1064 1046 1032 1023 1017 1013 1018 1039 1070 1097 1111 1120 1134 1157 1182 1207 1227 1236 1237 1235 1234 1225 1204 1175 1156 1155 1166 1173 1169 1151
635 1151 1121 1086 1059 1055 1078 1119 1159 1179 1175 1158 1146 1142 1138 1127 1116 1115 1122 1125 1121 1114 1106 1090 1065 1038 1017 1008 1005 1010 1024 1043 1061 1069 1068 1061 1055 1049 1045 1044 1049 1063 1087 1115 1143 1167 1182
630 1182 1186 1181 1170 1157 1141 1125 1116 1116 1120 1126 1138 1156 1169 1164 1148 1141 1150 1162 1161 1150 1147 1157 1170 1175 1177 1185 1195 1197 1188 1179 1180 1191 1204 1215 1221 1222 1219 1218 1226 1242 1254 1255 1249 1242 1235 1224 1211 1206 1216
624 1216 1234 1246 1246 1245 1256 1269 1265 1240 1218 1219 1234 1239 1229 1221 1232 1259 1286 1309 1329 1346 1356 1358 1352 1340 1330 1331 1344 1358 1364 1366 1373 1387 1403 1415 1417 1407 1397 1395 1402 1400 1380 1347 1313
618 1313 1279 1251 1238 1246 1263 1279 1297 1327 1361 1383 1387 1382 1370 1351 1331 1323 1330 1343 1354 1369 1387 1403 1414 1427 1441 1447 1433 1404 1376 1361 1367 1392 1417 1423 1413 1408 1421 1443 1464
$$ packed form
657I54J1J0K3L2K4nl4m3l1j1%ORQONQOmk0k4j4LQjj1qPJ9K4J8J1RQLoj6k3k7k6j9kJ5K4J8
651I44Jj5k2k3k2j5oJNOJ4K4L0K9K5K2J8J4Qlj5k4j8KJ8K1J3Pjj0j7j5pjJMJ2J7Rj2k9k9j4
646I47OK0J8OprMK0K5Rj0j2KQj0l6l8j3J4K1J1knkJ0K7L9L1Pj5j9pQJ5Pqj8j7j0nlmMJ2J6
641A037J3RJ0J0Jj1j1KJ9K1Roj1j3j5j8j4romNK1L1K7J4RJ4K3K5K5K0RJkjrk1k9j9jJ1Pmj8
635A151l0l5k7mK3M1M0K0mj7j2mmj1j1jPLmpqj6k5k7k1rlNJ4J9J8QjpoomjNJ4K4K8K8K4J5
630A182Mnj1j3j6j6r%MOJ2J8J3nj6pRJ2jj1lJ0J3NKQJ0KrrJJ1J3J1OJljQJ6J2Joppj1j3nJ0
624A216J8J2%jJ1J3mk5k2JJ5Nj0qJ1K7K7K3K0J7J0Koj2j0JJ3J4OKPJ4J6J2Kj0j0kPkk0l3l4
618A313l4k8j3QJ7J6J8L0L4K2Mnj2j9k0qPJ3J1J5J8J6J1J3J4Oj4k9k8j5OK5K5Oj0nJ3K2K1
$$ plain form
614 1464 1491 1529 1565 1582 1586 1592 1601 1601 1592 1589 1600 1627 1666 1719 1782 1841 1892 1939 1995 2059 2126 2187 2239 2298 2391 2534 2715 2909 3113 3355 3664 4040 4465 4929
610 4929 5433 5975 6539 7102 7644 8135 8539 8812 8924 8866 8659 8333 7922 7454 6958 6463 5982 5522 5086 4684 4331 4035 3788 3576
607 3576 3385 3212 3062 2944 2854 2783 2729 2703 2718 2764 2813 2839 2844 2850 2869 2896 2917 2931 2951 2994 3071 3188 3334 3497 3676 3891 4161 4492 4879 5338
603 5338 5898 6583 7398 8341 9404 10557 11747 12909 13993 14953 15732 16265 16500 16415 16021 15364 14517 13562 12561 11557 10576
600 10576 9629 8719 7859 7082 6414 5850 5360 4933 4580 4303 4079 3881 3707 3568 3462 3376 3300 3236 3184 3138 3094 3047 3003 2969 2954 2961 2982
597 2982 3008 3040 3084 3146 3230 3339 3467 3603 3756 3953 4221 4561 4960 5408 5901 6425 6959 7494 8026 8528 8952 9251 9400 9392 9221 8899
594 8899 8472 8007 7549 7097 6623 6124 5629 5178 4783 4442 4146 3893 3684 3512 3372 3257 3160 3078 3007 2938 2864 2787 2730 2706 2702 2694 2672 2641
590 2641 2604 2559 2517 2495 2498 2506 2498 2478 2458 2446 2445 2462 2492 2518 2528 2532 2542 2553 2549 2539 2545 2569 2588 2589 2581 2578 2573 2556 2539 2541 2559 2570 2568 2568 2583 2602 2602 2584 2572 2585 2611 2629
$$ packed form
614A464K7L8L6J7MOR%rlJ1K7L9N3O3N9N1M7N6O4O7O1N2N9R3J43J81J94K04K42L09L76M25M64
610D929N04N42N64N63N42M91M04K73J12n8k07l26m11m68m96m95m81m60m36m02l53k96k47k12
607C576j91j73j50j18r0p1n4k6J5M6M9K6NOJ9K7K1J4K0M3P7J17J46J63J79K15K70L31L87M59
603E338N60O85Q15R43J063J153J190J162J084R60P79N33K35q5l94o57q47r55j001j004r81
600A0576r47r10q60p77o68n64m90m27l53k77k24j98j74j39j06q6p6o4n2m6m4m7m4l4j5PK1
597B982K6L2M4O2Q4J09J28J36J53J97K68L40L99M48M93N24N34N35N32N02M24K99J49qj71l22
594H899m27m65m58m52m74m99m95m51l95l41k96k53k09j72j40j15r7q2p1o9p4p7n7k4mqk2l1
590B641l7m5m2k2LQqk0k0j2jJ7L0K6J0MJ0J1mj0OK4J9Jqlnj7j7KJ8J1k%J5J9%j8j2J3K6J8
$$ plain form
585 2629 2636 2647 2664 2674 2668 2657 2654 2657 2649 2630 2611 2596 2585 2581 2595 2628 2666 2688 2689 2678 2671 2683 2715 2753 2781 2795 2806 2819 2825 2818 2811 2818 2840 2867 2893 2922 2958 2996 3030 3054 3067
580 3067 3075 3083 3096 3114 3125 3121 3105 3091 3091 3104 3115 3116 3114 3122 3140 3158 3166 3166 3166 3174 3197 3232 3270 3302 3335 3386 3459 3537 3595 3625 3635 3649 3679 3718 3749 3763 3777 3808 3850 3878
575 3878 3880 3867 3854 3843 3827 3816 3827 3864 3909 3948 3978 4006 4032 4043 4036 4025 4032 4064 4106 4141 4163 4179 4193 4204 4218 4238 4261 4278 4289 4299 4317 4346 4391 4454 4520 4572
571 4572 4612 4659 4722 4780 4816 4837 4857 4881 4911 4965 5054 5159 5250 5318 5381 5454 5539 5627 5717 5805 5887 5955 6000 6016 6010 6006 6033 6086 6133 6151 6148 6150 6169 6201 6241 6287
567 6287 6340 6395 6455 6526 6607 6684 6745 6791 6834 6879 6920 6953 6993 7057 7147 7243 7326 7394 7456 7524 7601 7687 7768 7827 7862 7891 7938 8006 8088 8179 8283 8401 8525
563 8525 8647 8763 8878 9001 9134 9270 9401 9529 9666 9819 9974 10111 10227 10336 10451 10570 10680 10777 10872 10983 11113 11251 11388 11537
560 11537 11714 11916 12118 12302 12479 12669 12872 13069 13252 13434 13631 13854 14101 14360 14612 14845 15061 15271 15470 15651 15817 15980 16150
557 16150 16323 16500 16684 16874 17058 17241 17448 17707 18014 18342 18667 18985 19308 19647 20004 20382 20779 21188 21601 22016 22439 22879 23334
$$ packed form
585B629PJ1J7J0oj1lLqj9j9j5j1mJ4L3L8K2Jj1pJ2L2L8K8J4J1J3OppPK2K7K6K9L6L8L4K4J3
580C067QQJ3J8J1mj6j4%J3J1JkQJ8J8Q%%QK3L5L8L2L3N1P3P8N8L0J0J4L0L9L1J4J4L1M2K8
575C878Kj3j3j1j6j1J1L7M5L9L0K8K6J1pj1PL2M2L5K2J6J4J1J4K0K3J7J1J0J8K9M5O3O6N2
571D572M0M7O3N8L6K1K0K4L0N4Q9J05R1O8O3P3Q5Q8R0Q8Q2O8M5J6omK7N3M7J8lKJ9L2M0M6
567F287N3N5O0P1Q1P7O1M6M3M5M1L3M0O4R0R6Q3O8O2O8P7Q6Q1N9L5K9M7O8Q2R1J04J18J24
563H525J22J16J15J23J33J36J31J28J37J53J55J37J16J09J15J19J10R7R5J11J30J38J37J49
560A1537J77K02K02J84J77J90K03J97J83J82J97K23K47K59K52K33K16K10J99J81J66J63J70
557A6150J73J77J84J90J84J83K07K59L07L28L25L18L23L39L57L78L97M09M13M15M23M40M55
$$ plain form
554 23334 23796 24261 24740 25244 25777 26339 26940 27589 28288 29028 29798 30593 31413 32262 33155 34118 35178 36345 37615 38975 40420
551 40420 41952 43568 45262 47030 48872 50780 52744 54774 56894 59124 61470 63964 66678 69684 73023 76733 80882
549 80882 85544 90775 96632 103220 110665 119084 128621 139501 152021 166514 183405 203298 226978 255350 289387
548 289387 330062 378275 434992 501507 579243 668700 768355 874674 983160 1089069 1187183 1271593 1336380
546 1336380 1376650 1389069 1372301 1328002 1261469 1180416 1092243 1002028 912539 825318 741481 662120 588639 522714
544 522714 465607 417515 377696 345074 318556 297041 279552 265412 254141 245253 238322 233133 229582 227483 226679
542 226679 227224 229263 232828 237936 244799 253711 264825 278293 294534 314147 337687 365828 399699 440841 490972
541 490972 551988 625929 714623 819715 943576 1089535 1259722 1452026 1659603 1873373 2084069 2281691
$$ packed form
554B3334M62M65M79N04N33N62O01O49O99P40P70P95Q20Q49Q93R63J060J167J270J360J445
551D0420J532J616J694J768J842J908J964K030K120K230K346K494K714L006L339L710M149
549H0882M662N231N857O588P445Q419R537J0880J2520J4493J6891J9893K3680K8372L4037
548B89387M0675M8213N6717O6515P7736Q9457R9655J06319J08486J05909R8114Q4410O4787
546A336380M0270J2419j6768m4299o6533q1053q8173r0215q9489q7221q3837p9361p3481o5925
544E22714n7107m8092l9819l2622k6518k1515j7489j4140j1271q888o931n189l551k099q04
542B26679N45K039L565N108O863Q912J1114J3468J6241J9613K3540K8141L3871M1142N0131
541D90972O1016P3941Q8694J05092J23861J45959J70187J92304K07577K13770K10696J97622
$$ plain form
539 2281691 2454593 2590733 2679928 2714795 2691270 2610803 2482631 2322156 2145253 1963247 1782215 1605198
538 1605198 1434183 1271088 1118516 979888 858236 754630 667972 596094 536703 487586 446708 412463
536 412463 383682 359352 338554 320637 305185 291789 280052 269791 261012 253673 247676 243074 240068 238770 239195
534 239195 241472 245869 252614 261921 274231 290254 310776 336609 368688 407957 455206 511350 577753 655616 744575
533 744575 842011 943857 1045665 1142675 1229381 1299862 1348794 1372112 1367332 1334379 1276652 1200770 1114415 1023834
531 1023834 932844 843429 756741 673779 595765 524227 460615 405670 359162 320182 287613 260367 237453 218019
529 218019 201400 187071 174588 163575 153740 144854 136728 129217 122229 115706 109612 103932 98671 93814 89326 85181
527 85181 81381 77923 74776 71897 69265 66875 64703 62711 60863 59144 57542 56054 54684 53432 52275 51177 50120
$$ packed form
539B281691J72902J36140Q9195L4867k3525q0467j28172j60475j76903j82006j81032j77017
538A605198j71015j63095j52572j38628j21652j03606q6658p1878n9391m9117m0878l4245
536D12463k8781k4330k0798j7917j5452j3396j1737j0261q779p339n997m602l006j298M25
534B39195K277M397O745R307J2310J6023K0522K5833L2079L9269M7249N6144O6403P7863Q8959
533G44575R7436J01846J01808R7010Q6706P0481M8932K3318m780l2953n7727p5882q6355r0581
531A023834r0990q9415q6688q2962p8014p1538o3612n4945m6508l8980l2569k7246k2914j9434
529B18019j6619j4329j2483j1013r835q886q126p511o988o523o094n680n261m857m488m145
527H5181l800l458l147k879k632k390k172j992j848j719j602j488j370j252j157j098j057
$$ plain form
525 50120 49100 48104 47113 46121 45138 44171 43204 42230 41271 40352 39474 38617 37765 36926 36110 35317 34539 33765 32992 32224 31478 30767 30097
522 30097 29459 28838 28226 27626 27049 26509 26003 25518 25041 24570 24115 23679 23255 22830 22394 21951 21511 21087 20686 20305 19947 19619 19323
519 19323 19045 18769 18495 18233 17986 17754 17543 17359 17197 17040 16877 16715 16559 16404 16232 16033 15815 15602 15419 15262 15098 14899 14673
517 14673 14452 14249 14055 13856 13648 13429 13200 12973 12760 12555 12340 12119 11920 11751 11592 11428 11269 11125 10978 10806 10623 10461 10317
514 10317 10163 9991 9828 9698 9587 9471 9349 9243 9157 9073 8974 8862 8747 8638 8533 8434 8338 8234 8114 7980 7851 7737 7636 7537 7441
511 7441 7352 7266 7180 7100 7037 6990 6936 6857 6763 6682 6624 6575 6514 6436 6359 6305 6272 6238 6181 6105 6030 5964 5901 5836 5780 5736 5695 5649 5599 5553 5507 5461 5421 5394 5374
506 5374 5348 5316 5274 5221 5161 5106 5067 5028 4973 4907 4850 4808 4777 4757 4755 4758 4738 4682 4604 4521 4442 4371 4318 4280 4242 4192 4139 4094 4057 4020 3984 3949 3905 3837 3752 3673
502 3673 3620 3590 3573 3564 3564 3569 3563 3537 3494 3447 3404 3369 3343 3333 3339 3354 3369 3379 3382 3378 3365 3346 3322 3296 3269 3241 3206 3159 3102 3048 3011 2993 2981 2971 2960 2944 2915 2869
$$ packed form
525E0120j020r96r91r92r83r67r67r74r59r19q78q57q52q39q16p93p78p74p73p68p46p11o70
522C0097o38o21o12o00n77n40n06m85m77m71m55m36m24m25m36m43m40m24m01l81l58l28k96
519A9323k78k76k74k62k47k32k11j84j62j57j63j62j56j55j72j99k18k13j83j57j64j99k26
517A4673k21k03j94j99k08k19k29k27k13k05k15k21j99j69j59j64j59j44j47j72j83j62j44
514A0317j54j72j63j30j11j16j22j06q6q4r9j12j15j09j05r9r6j04j20j34j29j14j01r9r6
511G441q9q6q6q0o3m7n4p9r4q1n8m9o1p8p7n4l3l4n7p6p5o6o3o5n6m4m1m6n0m6m6m6m0k7k0
506E374k6l2m2n3o0n5l9l9n5o6n7m2l1k0kLk0n6p8q3p9p1n3l8l8n0n3m5l7l7l6l5m4o8q5p9
502C673n3l0j7r%Nok6m3m7m3l5k6j0OJ5J5J0Lmj3j9k4k6k7k8l5m7n7n4l7j8j2j0j1j6k9m6
$$ plain form
497 2869 2819 2779 2757 2744 2725 2693 2652 2611 2578 2558 2554 2563 2578 2588 2586 2573 2548 2517 2495 2497 2513 2515 2486 2448 2428 2427 2421 2397 2360 2321 2281 2248 2232 2228 2219 2203 2200 2219 2247 2265
493 2265 2278 2298 2320 2327 2315 2289 2250 2197 2144 2108 2087 2062 2029 2006 2006 2016 2014 1999 1985 1975 1962 1941 1914 1890 1875 1874 1891 1919 1942 1947 1945 1954 1988 2040 2094 2139 2174 2198
488 2198 2217 2241 2277 2327 2386 2460 2554 2653 2724 2742 2712 2662 2612 2563 2514 2473 2442 2410 2365 2313 2270 2248 2245 2243 2226 2194 2162 2144 2147 2165 2191 2235 2310 2431 2598
484 2598 2800 3024 3266 3535 3848 4219 4662 5183 5765 6371 6964 7516 8013 8436 8757 8950 8999 8898 8664 8337 7964 7583 7209 6842
481 6842 6482 6136 5819 5548 5333 5160 5010 4874 4756 4656 4557 4436 4290 4133 3980 3838 3704 3579 3467 3373 3297 3229 3166 3117 3101 3125
478 3125 3167 3205 3239 3286 3357 3454 3580 3765 4035 4398 4842 5364 5975 6690 7519 8467 9523 10651 11799 12919 13976 14917 15656 16102
475 16102 16203 15967 15442 14697 13813 12871 11924 10995 10087 9215 8396 7650 6992 6433 5973 5596 5279 4999 4741 4504 4295 4115 3950
472 3950 3779 3604 3446 3323 3229 3147 3067 2994 2933 2885 2846 2812 2781 2762 2764 2789 2824 2864 2927 3038 3200 3398 3620 3873 4180 4561 5021 5541 6086
$$ packed form
497B869n0m0k2j3j9l2m1m1l3k0mRJ5J0kj3k5l1k2KJ6Kk9l8k0jok4l7l9m0l3j6mrj6lJ9K8J8
493B265J3K0K2Pj2k6l9n3n3l6k1k5l3k3%J0kj5j4j0j3k1k7k4j5jJ7K8K3NkRL4N2N4M5L5K4
488B198J9K4L6N0N9P4R4R9P1J8l0n0n0m9m9m1l1l2m5n2m3k2lkj7l2l2j8LJ8K6M4P5J21J67
484B598K02K24K42K69L13L71M43N21N82O06N93N52M97M23L21J93M9j01k34l27l73l81l74l67
481F842l60l46l17k71k15j73j50j36j18j00r9j21j46j57j53j42j34j25j12r4p6o8o3m9j6K4
478C125M2L8L4M7P1R7J26J85K70L63M44N22O11P15Q29R48J056J128J148J120J057R41P39M46
475A6102J01k36n25p45q84r42r47r29r08q72q19p46o58n59m60l77l17k80k58k37k09j80j65
472C950j71j75j58j23r4q2q0p3o1m8l9l4l1j9KK5L5M0O3J11J62J98K22K53L07L81M60N20N45
$$ plain form
468 6086 6622 7124 7582 7983 8310 8539 8635 8568 8333 7966 7519 7028 6514 6003 5523 5080 4659 4258 3893 3574 3294 3037 2807 2619
465 2619 2473 2356 2251 2154 2066 1993 1931 1875 1824 1784 1759 1744 1726 1704 1687 1682 1683 1680 1666 1636 1596 1564 1554 1552 1533 1495 1471 1487 1526 1550 1545 1524 1504 1486 1468 1448
461 1448 1419 1377 1331 1288 1246 1197 1148 1121 1117 1117 1106 1091 1081 1078 1076 1080 1094 1114 1130 1136 1130 1111 1082 1055 1048 1061 1076 1068 1033 988 959 955 965 976 978 967 943 913 893 887 892
456 892 895 894 891 888 891 902 917 921 905 882 873 881 893 899 899 892 869 837 816 817 827 826 816 811 814 814 809 804 799 788 767 747 732 720 701 677 656 645 644 656 680 712 746 774 789
450 789 792 788 786 791 800 807 809 813 817 817 807 792 782 776 766 744 714 685 665 660 681 721 758 764 732 682 639 618 621 639 652 641 607 566 534 515 508 512 518 515 503 497 503 511 513 520 544
445 544 577 596 594 581 572 571 578 592 604 603 585 560 539 521 504 492 495 519 558 599 626 634 629 616 603 597 605 623 635 630 612 595 584 568 546 527 521 525 526 523 522 526 533 540 550
439 550 569 591 605 606 597 581 557 526 496 480 477 481 481 475 465 449 425 396 372 360 362 372 384 394 406 423 446 467 486 502 515 524 528 538 561 586 593 577 552 540
434 540 540 538 521 492 463 447 446 456 467 476 487 501 504 486 451 420 410 423 452 493 538 572 585 582 582 593 606 603 582 555 530 509 495 493 496 486 455 416 394 397 410
$$ packed form
468F086N36N02M58M01L27K29R6o7k35l67m47m91n14n11m80m43m21m01l65l19k80k57k30j88
465B619j46j17j05r7q8p3o2n6n1m0k5j5j8k2j7nJlj4l0m0l2j0kj9l8k4J6L9K4nk1k0j8j8k0
461A448k9m2m6m3m2m9m9k7m%j1j5j0lkMJ4K0J6Ooj9k9k7pJ3J5ql5m5k9mJ0J1Kj1k4l0k0oN
456H92LjllLJ1J5Mj6k3rQJ2O%pk3l2k1JJ0jj0nL%nnnj1k1k0j5j2j9k4k1j1jJ2K4L2L4K8J5
450G89LmkNRPKMM%j0j5j0oj0k2l0k9k0nK1M0L7Ol2n0m3k1LJ8J3j1l4m1l2j9pMOlj2oOQKPK4
445E44L3J9kj3rjPJ4J2jj8k5k1j8j7j2LK4L9M1K7Qnj3j3oQJ8J2nj8j7j1j6k2j9oMJljMPPJ0
439E50J9K2J4Jrj6k4l1l0j6lM%oj0j6k4k9k4j2KJ0J2J0J2J7K3K1J9J6J3RMJ0K3K5Pj6k5j2
434E40%kj7k9k9j6jJ0J1RJ1J4Lj8l5l1j0J3K9M1M5L4J3l%J1J3lk1k7k5k1j4kLj0l1l9k2LJ3
$$ plain form
429 410 414 408 403 410 428 456 489 519 529 511 481 468 479 497 500 490 488 503 519 528 540 567 601 614 599 569 548 548 570 600 615 610 597 592 584 551 490 434 414 430 459
424 459 483 502 518 531 533 526 513 499 487 477 463 442 412 378 351 342 355 381 406 420 427 433 437 433 420 401 386 388 408 435 449 448 445 450 455 444 420 408 424 457 481
419 481 482 465 453 458 478 500 512 513 504 488 468 452 446 452 466 483 500 515 526 534 535 521 492 466 459 477 506 524 522 503 476 457 449 447 438 426 428 454 490 516 526 528 531
414 531 531 526 514 498 479 463 452 444 435 424 421 428 431 421 401 387 390 401 408 409 407 407 409 410 410 411 420 441 467 481 468 438 417 426 454 479 487 477 451 416 386 379 394 417 434
408 434 447 461 470 465 452 441 437 433 422 409 398 387 370 353 347 357 377 395 404 404 399 397 409 436 466 482 482 481 490 503 505 492 477 466 449 423 398 393 408 421 418 403 386
403 386 368 346 326 318 319 326 338 358 378 384 381 385 406 423 419 398 384 388 401 412 419 420 410 390 366 345 329 319 321 336 357 378 392 398 401 408 424 444 457 459 455 446 427 406
398 406 406 436 478 507 519 526 530 519 491 462 443 433 423 417 418 425 423 405 378 359 357 368 381 390 400 408 407 397 395 413 437 441 420 391 369 357 351 352 360 371 380 383 377 364 357
392 357 372 403 432 449 461 474 483 483 481 482 479 464 447 437 429 407 376 358 360 366 361 352 353 367 383 395 401 405 413 434 466 494 508 511 511 506 492 476 467 462 450 424 402 400 421
$$ packed form
429D10MonPJ8K8L3L0J0j8l0j3J1J8Lj0kJ5J6RJ2K7L4J3j5l0k1%K2L0J5nj3nql3o1n6k0J6K9
424D59K4J9J6J3Kpj3j4j2j0j4k1l0l4k7rJ3K6K5J4POMmj3j9j5KK0K7J4jlNNj1k4j2J6L3K4
419D81Jj7j2NK0K2J2Jrj6k0j6oOJ4J7J7J5J1QJj4k9k6pJ8K9J8kj9k7j9qkrj2KK6L6K6J0KL
414E31%nj2j6j9j6j1qrj1lPLj0k0j4LJ1PJk%KJ%JRK1K6J4j3l0k1RK8K5Qj0k6l5l0pJ5K3J7
408D34J3J4Rnj3j1mmj1j3j1j1j7j7oJ0K0J8R%nkJ2K7L0J6%jRJ3Kj3j5j1j7k6k5nJ5J3lj5j7
403C86j8k2k0qJPJ2K0K0OlMK1J7mk1j4MJ3J1PJj0k0k4k1j6j0KJ5K1K1J4OLPJ6K0J3Kmrj9k1
398D06%L0M2K9J2PMj1k8k9j9j0j0oJPkj8k7j9kJ1J3RJ0Qjj0kJ8K4Mk1k9k2j2oJQJ1RLoj3p
392C57J5L1K9J7J2J3R%kJlj5j7j0qk2l1j8KOnrJJ4J6J2OMQK1L2K8J4L%nj4j6rnj2k6k2kK1
$$ plain form
387 421 448 467 477 481 484 487 494 504 509 500 479 455 432 413 401 400 399 386 367 363 387 418 429 418 405 404 408 408 400 389 378 370 368 373 386 413 461 520 568 583 561 514 460
382 460 417 398 403 423 437 433 411 383 365 359 356 351 348 354 365 367 360 353 354 362 376 395 412 412 394 376 373 382 394 408 431 460 478 480 472 463 455 444 433 422 410 404 409 418 421 419 426 448
376 448 468 470 456 444 440 440 442 451 463 467 462 459 466 472 469 465 471 484 481 452 414 388 379 377 384 410 450 476 464 421 384 379 403 430 438 423 403 396 407 420 427 430 442 462 474 468 450
370 450 439 446 463 470 451 414 383 381 401 415 408 391 385 392 395 384 368 360 359 355 351 362 396 439 463 455 428 406 396 390 381 379 390 404 405 404 427 475 515 514 482 459 470 502
365 502 530 545 552 553 545 529 515 506 494 475 450 433 429 435 443 447 447 444 444 452 471 494 504 493 472 457 451 445 432 421 427 448 474 499 524 547 558 553 541 533 534 538 536 525 508
359 508 492 481 474 466 455 443 433 424 418 413 409 405 412 437 477 516 538 540 527 502 473 451 443 449 469 501 536 555 552 541 541 543 531 503 478 469 469 473 484 506 529 537 527 509
354 509 491 479 477 484 498 516 537 549 538 504 468 451 452 452 441 426 412 395 378 374 385 394 385 363 353 369 402 435 457 462 454 447 454 470 478 470 458 458 469 476 469 450 428
348 428 408 391 374 355 336 329 338 353 357 348 346 366 397 419 424 419 408 396 389 402 432 462 478 483 482 475 457 439 434 442 445 434 422 428 454 487 511 521 520 517 519 532 554 576
$$ packed form
387D21K7J9J0MLLPJ0Nrk1k4k3j9j2jjj3j9mK4L1J1j1j3jM%qj1j1qkNJ3K7M8N9M8J5k2m7n4
382D60m3j9NK0J4mk2k8j8olnlOJ1KppJQJ4J9J7%j8j8lRJ2J4K3K9J8Kqrqj1j1j1j2oNRLkPK2
376D48K0Kj4j2m%KRJ2MnlPOlmOJ3lk9l8k6rkPK6M0K6j2m3l7nK4K7Qj5k0pJ1J3PLJ2K0J2oj8
370D50j1PJ7Pj9l7l1kK0J4pj7oPLj1j6qjmmJ1L4M3K4qk7k2j0orkJ1J4JjK3M8M0jl2k3J1L2
365E02K8J5PJqj6j4rj2j9k5j7mOQM%l%QJ9K3J0j1k1j5ooj3j1OK1K6K5K5K3J1nj2qJMkj1j7
359E08j6j1pqj1j2j0ronmmPK5M0L9K2Kj3k5k9k2qOK0L2L5J9lj1%Kj2k8k5r%MJ1K2K3Qj0j8
354E09j8j2kPJ4J8K1J2j1l4l6j7J%j1j5j4j7j7mJ1Rrk2j0J6L3L3K2NqpPJ6Qqj2%J1Ppj9k2
348D28k0j7j7j9j9pRJ5MrkK0L1K2Nnj1j2pJ3L0L0J6Njpj8j8nQLj1j2OK6L3K4J0jlKJ3K2K2
$$ plain form
343 576 584 570 537 497 464 445 440 443 448 456 468 479 480 467 453 452 455 446 423 406 412 433 447 445 437 437 450 475 508 539 554 545 522 504 500 498 479 440 405 395 412 431 433 420
338 420 411 413 415 409 397 394 408 432 451 452 433 406 386 382 385 385 372 349 318 287 261 245 243 262 308 368 418 442 450 458 468 466 453 442 442 447 447 446 455 467 465 446 431 438 455
332 455 462 448 420 388 358 334 327 340 366 394 417 439 462 480 485 480 474 467 447 409 370 352 357 363 359 356 368 392 410 419 425 426 417 401 390 388 391 395 403 410 402 378 358 363 384 402
327 402 409 415 431 450 460 456 450 447 441 422 393 381 402 436 446 421 390 388 405 410 389 359 339 334 343 366 394 408 405 400 405 416 419 409 393 380 380 392 401 391 362 335 323
321 323 323 324 327 341 373 420 470 508 519 499 463 431 409 386 361 348 357 379 398 410 424 442 449 433 401 369 347 329 314 308 314 324 325 319 320 334 353 373 394 413
316 413 418 410 403 413 434 445 440 428 413 392 366 351 357 378 395 394 379 361 347 336 325 315 312 317 324 324 316 307 298 285 272 269 282 310 344 373 384 376 360 355 367 388 404
311 404 405 394 381 374 377 380 372 358 350 356 370 384 401 423 447 467 489 524 563 583 567 521 468 422 383 347 320 311 323 348 376 398 413 419 418 413 409 408 407 404 401 404 418 436
306 436 444 433 411 400 410 426 424 402 373 349 332 323 325 329 323 307 300 311 327 335 338 348 358 350 320 289 272 262 254 251 257 267 272 279 300 330 349 344 322 305 310 335 366 389
$$ packed form
343E76Qj4l3m0l3j9nLNQJ2J1Jj3j4jLrk3j7OK1J4kq%J3K5L3L1J5rk3j8mkj9l9l5j0J7J9Kj3
338D20rKKoj2lJ4K4J9Jj9k7k0mL%j3k3l1l1k6j6kJ9M6O0N0K4QQJ0kj3j1%N%jRJ2kj9j5PJ7
332D55Pj4k8l2l0k4pJ3K6K8K3K2K3J8Nnopk0l8l9j8NOmlJ2K4J8ROJrj6j1kLMQPqk4k0NK1J8
327D02POJ6J9J0moloj9k9j2K1L4J0k5l1kJ7Nk1l0k0nRK3K8J4lnNJ1Lj0j6j3%J2Rj0k9k7j2
321C23%JLJ4L2M7N0L8J1k0l6l2k2k3k5j3RK2J9J2J4J8Pj6l2l2k2j8j5oOJ0JoJJ4J9K0K1J9
316D13NqpJ0K1J1nj2j5k1k6j5OK1J7jj5j8j4j1j1j0lNP%qrrj3j3lJ3K8L4K9J1qj6nJ2K1J6
311D04Jj1j3pLLqj4qOJ4J4J7K2K4K0K2L5L9K0j6m6n3m6l9l6k7rJ2K5K8K2J5OjnmjjllLJ4J8
306D36Qj1k2j1J0J6kk2k9k4j7rKMoj6pJ1J6QLJ0J0ql0l1j7j0qlOJ0NPK1L0J9nk2j7NK5L1K3
$$ plain form
300 389 401 408 414 416 409 397 392 405 432 463 484 491 486 475 463 447 431 423 431 454 475 480 467 452 447 457 476 496 512 517 511 501 495 491 481 473 482 514 546 549 516 472 443 436 440
295 440 444 445 441 430 409 383 360 343 330 320 323 347 383 407 410 408 420 440 445 429 405 391 385 374 356 338 331 342 368 399 420 427 429 432 434 432 427 421 411 394 375 367 375 398
289 398 423 441 443 432 419 413 414 412 398 373 342 311 290 286 301 328 358 385 404 417 431 446 450 438 417 407 414 433 450 457 446 421 392 368 351 338 337 351 368 373
285 373 364 357 360 362 362 371 397 431 453 458 452 440 421 394 364 342 334 341 356 370 379 391 404 412 409 404 406 411 410 399 386 374 364 365 380 394 390 365 342 338 346 349 342 337 345 368 402 437
279 437 469 496 515 521 508 480 454 439 428 409 380 355 345 344 338 319 296 288 305 338 368 382 379 363 344 335 348 382 414 422 403 371 343 327 328 344 368 388 393 387
274 387 378 374 373 368 354 342 347 374 405 413 397 380 384 407 430 438 430 412 397 397 411 422 412 382 349 321 299 283 280 291 304 308 311 324 346 367 384 404 422 425 408 382
269 382 357 332 307 293 295 303 309 323 355 396 424 434 445 462 469 454 426 403 395 395 402 414 427 432 428 419 413 413 418 422 415 396 380 379 389 396 395 396 395 380 346 316 310 321 325 313
263 313 300 305 323 339 343 341 336 331 338 368 414 446 444 421 406 413 432 453 478 502 512 495 467 446 435 417 390 372 381 410 438 448 441 422 396 366 339 328 337 362 389
$$ packed form
300C89J2POKpj2nJ3K7L1K1Pnj1j2j6j6qQK3K1Nj3j5nJ0J9K0J6Noj0omj0qRL2L2Ll3m4k9pM
295D40MJmj1k1k6k3j7j3j0LK4L6K4LkJ2K0Nj6k4j4oj1j8j8pJ1K6L1K1PKLKknoj0j7j9qQK3
289C98K5J8Kj1j3oJkj4k5l1l1k1mJ5K7L0K7J9J3J4J5Mj2k1j0PJ9J7Pj1k5k9k4j7j3jJ4J7N
285C73rpLK%RK6L4K2Noj2j9k7l0k2qPJ5J4RJ2J3QlnKNjj1j3j2j0JJ5J4mk5k3mQLpnQK3L4L5
279D37L2K7J9Oj3k8k6j5j1j9k9k5j0joj9k3qJ7L3L0J4lj6j9rJ3L4L2Qj9l2k8j6JJ6K4K0No
274C87rmjnj4j2NK7L1Qj6j7MK3K3Qqj8j5%J4J1j0l0l3k8k2j6lJ1J3MLJ3K2K1J7K0J8Lj7k6
269C82k5k5k5j4KQOJ4L2M1K8J0J1J7Pj5k8k3q%PJ2J3Nmro%NMpj9j6jJ0PjJjj5l4l0oJ1Mj2
263C13j3NJ8J6MknnPL0M6L2kk3j5PJ9K1K5K4J0j7k8k1j1j8k7j8RK9K8J0pj9k6l0k7j1RK5K7
$$ plain form
258 389 410 426 441 453 459 460 463 469 469 458 442 430 423 412 396 385 388 404 424 442 462 483 499 506 507 504 488 444 382 333 318 334 357 374 386 387 372 349 340 356 386
253 386 410 418 415 409 408 413 424 438 452 463 464 447 420 398 391 393 395 397 403 414 436 472 518 559 582 580 555 514 465 424 399 382 363 345 340 350 361 364 363 372 396 427 456
248 456 474 483 481 468 449 435 428 423 414 410 423 444 456 458 468 498 525 534 535 550 569 563 522 469 426 401 391 396 405 395 359 316 291 288 298 317 336 346 348 355 377 402 424
243 424 452 494 532 534 494 442 405 387 376 366 360 364 380 404 427 438 435 431 438 450 458 455 445 436 428 422 415 410 414 426 439 440 426 405 389 384 387 393 399 405 413 422 426 420 406 397 397 402 401
237 401 386 364 347 343 347 348 341 329 319 319 332 356 378 387 389 402 437 482 513 525 527 528 523 505 478 455 445 444 443 440 439 440 435 418 389 366 367 393 431 467 496 513 511 485
231 485 448 421 417 429 443 445 437 427 417 407 400 404 423 448 462 461 450 430 398 365 346 350 362 365 359 360 374 397 419 440 464 494 526 546 539 503 454 411 374 334 295
226 295 272 280 315 355 383 392 390 392 398 404 404 402 403 405 398 376 346 317 297 292 305 327 341 336 317 299 294 301 310 314 315 319 327 333 338 352 383 417 436 440 445 456 455 434 410 406 417 421 409
220 409 392 387 399 423 456 488 508 515 516 514 507 493 485 489 499 503 500 493 479 451 414 385 380 394 410 414 405 395 396 409 418 411 388 363 343 327 313 305 302 304 316 342 376 399 401
$$ packed form
258C89K1J6J5J2OJLO%j1j6j2pj1j6j1LJ6K0J8K0K1J6PJlj6m4o2m9j5J6K3J7J2Jj5k3rJ6L0
253C86K4QlojNJ1J4J4J1Jj7k7k2pKKKOJ1K2L6M6M1K3kk5m1m9m1k5j7j9j8nJ0J1LjRK4L1K9
248D56J8Rkj3j9j4pnrmJ3K1J2KJ0L0K7RJJ5J9om1n3m3k5j0NRj0l6m3k5lJ0J9J9J0KPK2K5K2
243D24K8M2L8Km0n2l7j8j1j0oMJ6K4K3J1lmPJ2Qlj0rqopnMJ2J3Jj4k1j6nLOOOQRMoj4r%Nj
237D01j5k2j7mMJpj2j0%J3K4K2RKJ3L5M5L1J2KJnj8k7k3j0jjljJnj7k9k3JK6L8L6K9J7kk6
231D85l7k7mJ2J4Kqj0j0j0pMJ9K5J4jj1k0l2l3j9MJ2LoJJ4K3K2K1K4L0L2K0pl6m9m3l7m0l9
226B95k3QL5M0K8RkKOO%kJKpk2l0k9k0nJ3K2J4nj9j8nPRMJMQONJ4L1L4J9MNJ1jk1k4mJ1Mj2
220D09j7nJ2K4L3L2K0PJkpj4qMJ0Mlpj4k8l7k9nJ4J6Mrj0JJ3Rpk3k5k0j6j4qlKJ2K6L4K3K
$$ plain form
215 401 394 396 404 400 380 362 359 364 364 357 359 380 414 440 443 427 412 412 419 416 402 393 395 398 390 373 360 352 346 343 342 332 306 276 267 288 325 357 379 394 405 415 424 434 445 451 446 430
209 430 414 412 422 425 405 374 354 348 338 321 314 334 365 383 385 386 392 397 398 402 404 393 370 352 352 361 367 376 398 427 444 440 430 428 433 435 429 418 413 417 432 445 444 428 415 418 436
203 436 457 474 483 478 448 401 365 356 366 375 383 400 421 421 385 332 297 293 307 322 331 337 342 351 364 378 381 378 386 417 459 487 490 480 476 473 459 435 420 431 460 482 479 461
198 461 447 448 459 471 483 494 507 518 524 521 506 482 455 428 402 371 329 277 228 199 200 227 270 324 387 448 494 520 530 526 504 468 434 411 393 371 350 345
193 345 355 364 364 360 363 371 374 369 363 358 354 354 362 381 404 425 437 441 439 436 429 415 394 373 361 360 367 374 377 380 392 417 452 483 498 488 458 428 413 411 410 405 404 408 411 409 404 399 391 374 358
187 358 354 364 379 394 413 432 444 444 435 415 382 347 330 339 362 385 403 416 421 421 430 459 497 517 510 485 456 437 432 441 451 455 458 469 485 495 499 503 506 499 485 476 473 464 442
181 442 419 406 402 399 402 408 409 401 394 402 418 423 415 407 404 394 369 336 303 275 254 245 255 286 326 359 373 366 353 348 355 369 390 417 450 484 520 555 580 587 579 564 539 499
176 499 449 408 385 370 361 366 389 420 440 444 431 404 372 343 319 294 267 257 276 313 343 357 366 377 384 382 383 394 407 407 392 374 360 349 338 334 348 382 425 463
$$ packed form
215D01pKQmk0j8lN%pKK1L4K6Lj6j5%Plj4rKLqj7j3qoljj0k6l0rK1L7L2K2J5J1J0RJ0J1Onj6
209D30j6kJ0Lk0l1k0oj0j7pK0L1J8KJONJMKj1k3j8%RORK2K9J7mj0kNKoj1nMJ5J3jj6j3LJ8
203D36K1J7Rnl0m7l6rJ0RQJ7K1%l6n3l5mJ4J5RONRJ3J4LlQL1M2K8Lj0mlj4k4j5J1K9K2lj8
198D61j4JJ1J2J2J1J3J1Olj5k4k7k7k6l1m2n2m9k9JK7M3N4O3O1M6K6J0mk2l6l4k3j8k2k1n
193C45J0R%mLQLnonm%QJ9K3K1J2Mklpj4k1k1j2jPPLLJ2K5L5L1J5j0l0l0j5kjnjMLknnqj7j6
187C58mJ0J5J5J9J9J2%rk0l3l5j7RK3K3J8J3N%RK9L8K0pk5k9j9nRJ0MLJ1J6J0MMLpj4rlrk2
181D42k3j3mlLOJqpQJ6Nqqlj0k5l3l3k8k1rJ0L1M0L3J4pj3nPJ4K1K7L3L4L6L5K5Pqj5k5m0
176D99n0m1k3j5rNK3L1K0Mj3k7l2k9k4k5k7j0J9L7L0J4RJ1PkJJ1J3%j5j8j4j1j1mJ4L4M3L8
$$ plain form
171 463 484 480 452 411 377 368 385 413 438 456 465 464 455 447 443 437 422 406 399 396 380 343 305 291 309 344 374 388 392 395 399 392 366 326 296 294 314 333 333 319 308 308 311 311 309
165 309 318 343 380 421 460 490 502 495 475 456 442 432 419 400 382 375 376 376 372 373 388 407 417 418 426 449 474 491 502 512 513 498 478 474 488 506 517 517 501 463 414
160 414 380 377 397 420 433 433 423 407 392 384 388 404 423 425 400 370 366 386 396 376 350 348 369 386 390 391 402 417 435 457 480 491 486 470 447 421 400 396 407 416 415 413
155 413 413 407 391 381 391 409 415 413 419 433 435 417 392 381 384 388 391 396 409 429 452 461 443 409 385 386 398 397 387 387 405 425 434 433 425 409 382 358 353 367 384 390 391 398 416 438
150 438 448 444 432 425 426 429 432 438 446 450 448 449 456 461 458 454 454 447 417 370 327 304 294 287 278 270 265 268 280 299 324 356 387 399 375 328 288 277 294 324 357 384 394 388 383 390 401
144 401 404 402 408 422 434 436 422 394 362 349 363 383 380 356 335 332 331 317 299 293 307 333 360 379 388 400 427 463 490 497 489 474 447 413 397 420 473 518 531 519 506
139 506 502 496 474 439 414 418 443 465 464 446 429 420 412 397 379 364 352 335 309 286 281 293 314 339 369 400 414 402 386 388 408 424 428 432 441 444 434 424 425 433 437 439 444 451
134 451 451 441 424 403 384 378 380 370 339 307 304 327 347 349 348 359 383 417 455 488 498 476 435 394 365 351 351 358 366 373 386 401 410 414 427 446 452 434 405 384 375 372 377
$$ packed form
171D63K1mk8m1l4rJ7K8K5J8Rjrqmoj5j6plj6l7l8j4J8L5L0J4MLMpk6m0l0kK0J9%j4j1%L%k
165C09RK5L7M1L9L0J2pk0j9j4j0j3j9j8pJ%mJJ5J9J0JQK3K5J7J1J0Jj5k0mJ4J8J1%j6l8m9
160D14l4lK0K3J3%j0j6j5qMJ6J9Kk5l0mK0J0k0k6kK1J7MJJ1J5J8K2K3J1nj6k3k6k1mJ1Rjk
155D13%oj6j0J0J8OkOJ4Kj8k5j1LMLNJ3K0K3Rj8l4k4JJ2jj0%J8K0Rjqj6k7k4nJ4J7OJPJ8K2
150D38J0mj2pJLLOQMkJPNlm%pl0m7m3k3j0prqnLJ2J9K5L2L1J2k4m7m0j1J7L0L3K7J0onPJ1
144D01LkOJ4J2Kj4k8l2j3J4K0lk4k1ljj4j8oJ4K6K7J9RJ2K7L6K7Pqj5k7l4j6K3N3M5J3j2j3
139E06mok2l5k5MK5K2jj8j7rqj5j8j5j2j7k6k3nJ2K1K5L0L1J4j2j6KK0J6MMRLj0j0JQMKNP
134D51%j0j7k1j9oKj0l1l2lK3K0KjJ1K4L4L8L3J0k2m1m1k9j4%PQPJ3J5RMJ3J9Oj8k9k1rlN
$$ plain form
128 377 391 406 408 393 364 326 289 274 296 340 367 361 341 340 367 406 437 456 467 474 477 473 462 451 442 437 439 451 460 451 424 402 403 413 400 364 332 321 320 310 304 321
123 321 357 378 366 339 322 323 325 314 293 272 255 240 227 221 229 257 300 346 381 395 390 373 354 337 326 319 310 300 292 299 322 349 365 365 355 346 343 347 356 365 366 359 355 362 382
118 382 408 429 439 437 428 421 419 418 413 406 408 421 436 440 435 431 432 429 416 394 376 365 361 360 364 377 399 425 447 458 449 421 391 373 372 371 361 349 349 361 369 365 358 362 377 388 392 395
112 395 397 397 399 413 439 458 457 445 440 436 411 366 332 328 343 345 325 295 277 282 305 333 357 381 409 435 439 417 389 375 373 369 359 358 372 394 419 448 475 487 474 451
107 451 434 424 418 419 434 461 483 487 471 440 402 371 361 383 427 472 497 492 470 451 446 449 454 458 455 436 404 384 393 424 451 464 472 471 446 400 361 352 365 384 410 451
102 451 487 489 458 426 417 419 410 391 373 363 356 355 361 370 373 370 373 384 396 398 387 364 329 291 265 268 301 347 380 391 391 397 410 416 407 398 401 416 432 449 466 476 471 463 466 478
96 478 483 476 472 482 501 521 539 547 528 482 437 416 414 408 394 383 377 369 360 355 350 333 310 297 301 309 309 305 304 306 310 323 343 356 351 338 332 332 326 318 321 335 345 345 343 348 358 364 364 356 338
90 338 313 291 276 263 249 242 251 277 304 317 315 310 317 339 366 384 385 374 359 346 335 325 323 334 356 379 394 404 409 410 404 398 398 397 387 363 337 322 317 317 320 332 356 386
$$ packed form
128C77J4J5Kj5k9l8l7j5K2M4K7ok0jK7L9L1J9J1PLmj1j1rnKJ2Rrk7k2JJ0j3l6l2j1jj0oJ7
123C21L6K1j2k7j7JKj1k1k1j7j5j3oQK8M3M6L5J4nj7j9j7j1prj0qPK3K7J6%j0rlMRRJpmPK0
118C82K6K1J0krpkjnpKJ3J5MnmJlj3k2j8j1mjMJ3K2K6K2J1rk8l0j8jjj0j2%J2QmpMJ5J1ML
112C95K%KJ4K6J9jj2nmk5m5l4mJ5Kk0l0j8NK3K8K4K4K8K6Mk2k8j4kmj0jJ4K2K5K9K7J2j3k3
107D51j7j0oJJ5K7K2Mj6l1l8l1j0K2M4M5K5nk2j9nLNMlj9l2k0RL1K7J3Qjk5m6l9rJ3J9K6M1
102D51L6Kl1l2rKrj9j8j0pjORLlLJ1J2Kj1k3l5l8k6LL3M6L3J1%OJ3OrrLJ5J6J7J7J0nqLJ2
96D78NpmJ0J9K0J8Qj9m6m5k1koj4j1oqrnnj7k3j3MQ%mjKMJ3K0J3nj3o%oqLJ4J0%kNJ0O%qj8
90C38k5k2j5j3j4pRK6K7J3knPK2K7J8Jj1j5j3j1j0kJ1K2K3J5J0NJoo%jj0k4k6j5n%LJ2K4L0
$$ plain form
84 386 411 423 425 422 419 414 406 400 400 401 393 377 361 350 334 312 299 311 345 384 414 433 438 430 418 413 412 406 393 379 368 358 347 348 364 387 401 402 392 376 354 330 313 308
79 308 317 335 353 363 363 358 355 355 354 349 333 307 284 279 295 316 323 313 301 299 310 324 335 344 359 385 411 421 412 403 409 420 418 398 372 356 357 374 398 413 408 387 365 350
74 350 342 340 351 377 404 420 424 426 433 446 461 471 465 444 418 397 383 369 357 354 364 387 418 448 468 469 457 440 422 407 397 392 392 395 405 424 443 449 443 436 437 441 436 420
68 420 403 397 406 420 421 406 390 390 401 404 391 384 401 433 449 442 427 421 417 403 385 376 379 390 407 435 470 498 512 515 516 517 510 489 451 403 357 323 302 284 264 244 236 246
63 246 274 307 329 337 346 368 395 411 414 421 444 468 472 454 432 425 430 436 435 419 388 348 311 287 279 291 320 355 374 364 333 302 290 296 312 332 354 373 385 395 409
58 409 428 443 443 432 422 422 425 420 407 398 402 411 412 405 404 419 439 443 430 413 403 396 393 404 429 450 447 429 414 410 402 382 364 358 362 366 369 377 386 391 392 390 378 359 344 348 367 390 413
52 413 436 447 429 385 344 327 333 346 361 379 392 395 397 407 424 432 427 418 417 422 423 420 416 418 423 429 436 446 456 457 445 424 401 373 334 293 275 295 340 382 405 412 413 406 391
46 391 376 372 377 381 379 371 358 340 320 306 309 328 353 366 362 354 361 389 427 457 470 467 452 431 408 385 368 366 384 419 456 483 497 503 503 497 484 463 432 391 355 336 338
$$ packed form
84C86K5J2Kllnqo%Jqj6j6j1j6k2j3J2L4L9L0J9Nqj2njoj3j4j1j0j1JJ6K3J4Jj0j6k2k4j7n
79C08RJ8J8J0%nl%jnj6k6k3nJ6K1Pj0j2kJ1J4J1RJ5K6K6J0rrOJ1kk0k6j6JJ7K4J5nk1k2j5
74C50qkJ1K6K7J6MKPJ3J5J0ok1k6k1j4j4j2lJ0K3L1L0K0Jj2j7j8j5j0n%LJ0J9J9OopJMnj6
68D20j7oRJ4Jj5j6%J1Lj3pJ7L2J6pj5omj4j8rLJ1J7K8L5K8J4LJJpk1l8m8m6l4k1j8k0k0qJ0
63B46K8L3K2QRK2K7J6LPK3K4Mj8k2pNOjj6l1m0l7k4qJ2K9L5J9j0l1l1j2OJ6K0K2J9J2J0J4
58D09J9J5%j1j0%Lnj3rMRJpjJ5K0Mj3j7j0plJ1K5K1lj8j5mqk0j8oMMLQRNJkj2j9j5MJ9K3K3
52D13K3J1j8m4m1j7OJ3J5J8J3LKJ0J7QnrjNJlmKNOPJ0J0Jj2k1k3k8l9m1j8K0M5M2K3PJpj5
46C91j5mNMkqj3j8k0j4LJ9K5J3mqPK8L8L0J3lj5k1k3k3j7kJ8L5L7K7J4O%oj3k1l1m1l6j9K
$$ plain form
41 338 347 351 357 370 388 405 424 447 465 464 450 437 434 435 436 442 452 450 430 406 392 384 371 355 346 343 334 321 313 311 307 303 314 332 334 308 281 281 309 343 372 397 410 404 380 349
35 349 316 282 262 274 309 340 346 341 348 367 383 390 395 406 422 436 444 447 453 466 477 471 442 400 362 337 328 339 369 405 428 428 413 404 412 430 443 444 438 427 409 383 362
30 362 356 359 359 358 365 376 378 369 364 370 375 365 347 340 352 380 417 449 459 443 416 392 370 342 317 311 326 348 368 382 393 396 389 372 350 329 320 329 346 357 359 369 393 426
25 426 458 478 469 425 363 322 321 343 360 366 373 390 409 421 424 423 429 452 482 500 489 460 430 408 392 387 402 434 463 470 454 435 427 432 435 425 397 364 341 341 362 385
20 385 389 365 328 296 270 240 209 198 222 262 289 297 303 313 315 300 277 257 239 225 223 243 276 306 323 331 333 328 322 332 363 402 429 437 432 422 410 398 394 400 413 428
14 428 442 451 447 433 423 424 426 410 372 331 307 306 323 348 374 386 378 355 327 301 281 279 303 337 354 344 325 320 331 343 342 328 315 318 341 375 403 415 414 414 428 457
9 457 486 491 460 407 362 341 344 356 369 376 374 368 369 383 396 389 357 317 293 298 319 337 339 335 345 375 409 431 442 453 467 478 479 474 468 466 471 477 473 461 450 444 436 424 418 430
4 430 452 467 470 467 466 463 460 461 467 474 471 449 411 364 328 314 318 328 336 336 323 301 286 289 296 291 278 280 303 326 336 342 359 381 388 376 357 345 342 340 332 315 294 278 266 258 254 261
$$ packed form
41C38RMOJ3J8J7J9K3J8jj4j3lJJOJ0kk0k4j4qj3j6rlrj3qkmmJ1J8Kk6k7%K8L4K9K5J3ok4l1
35C49l3l4k0J2L5L1OnPJ9J6PNJ1J6J4QLOJ3J1ok9m2l8k5rJ1L0L6K3%j5rQJ8J3Joj1j8k6k1
30C62oL%jPJ1KrnONj0j8pJ2K8L7L2J0j6k7k4k2k8k5oJ5K2K0J4J1Lpj7k2k1rRJ7J1KJ0K4L3
25D26L2K0rm4o2m1jK2J7OPJ7J9J2LjOK3L0J8j1k9l0k2j6nJ5L2K9Pj6j9qNLj0k8l3k3%K1K3
20C85Mk4l7l2k6l0l1j1K4M0K7QOJ0Kj5k3k0j8j4kK0L3L0J7QKnoJ0L1L9K7Qnj0j2j2mOJ3J5
14D28J4Rmj4j0JKj6l8m1k4jJ7K5K6J2qk3k8k6k0kK4L4J7j0j9nJ1J2jj4j3LK3L4K8J2j%J4K9
9D57K9Nl1n3m5k1LJ2J3PkoJJ4J3pl2m0k4NK1J8KmJ0L0L4K2J1J1J4J1JnokNOmj2j1oqj2oJ2
4D30K2J5LljllJOPlk2l8m7l6j4MJ0Q%j3k2j5LPnj3KK3K3J0OJ7K2Pj2j9j2lkqj7k1j6j2qmP
$$ plain form
-2 261 279 302 328 357 376 369 340 317 316 324 323 317 321 326 308 269 232 209 191 172 165 186 223 253 265 267 268 270 270 273 283 302 321 333 335 330 327 325 325 332 350 373 394 416 440
-8 440 453 442 410 381 371 376 384 385 372 340 303 288 299 317 324 326 334 344 348 351 366 389 405 405 392 369 345 330 331 344 354 355 339 304 258 229 236 263 279 272 259 254 251
-13 251 241 234 237 241 232 219 219 236 260 284 306 323 330 324 319 322 328 322 305 291 293 307 319 320 314 311 314 318 320 322 332 351 369 379 380 381 384 379 357 324 298 295 309 330 354 383 409
-19 409 425 433 437 438 428 410 399 401 411 420 426 427 417 396 379 374 372 359 345 346 358 355 331 309 314 335 352 359 364 367 354 324 294 280 278 276 278 293 310 312 296 284 298 338 377
-24 377 394 390 387 398 415 418 404 394 401 413 406 383 370 381 397 389 355 319 297 290 292 300 312 320 321 321 325 329 322 296 260 236 241 267 292 301 306 324 357 387 402 401 385 358 327
-30 327 299 278 263 259 272 296 320 339 356 371 377 374 377 386 382 352 312 298 317 345 361 367 380 397 409 410 408 407 405 399 397 406 427 445 446 431 407 382 359 344 346 364 386
-35 386 389 371 339 307 278 257 249 257 278 300 314 319 324 336 358 382 400 406 399 377 346 322 315 316 309 285 257 246 257 273 276 259 234 219 225 251 286 312 320 306 280 252
-40 252 230 216 211 215 225 244 278 320 353 355 330 303 290 284 270 250 238 240 250 262 274 288 301 311 317 315 308 309 329 358 374 367 346 323 301 280 266 266 285 318 357
$$ packed form
-2B61J8K3K6K9J9pk9k3jQjoMNj8l9l7k3j8j9pK1L7L0J2KJK%LJ0J9J9J2Knlk%PJ8K3K1K2K4
-8D40J3j1l2k9j0NQJj3l2l7j5J1J8PKQJ0MLJ5K3J6%j3k3k4j5JJ3J0Jj6l5m6k9PK7J6pj3nl
-13B51j0pLMrj3%J7K4K4K2J7PonLOoj7j4KJ4J2JolLMKKJ0J9J8J0JJLnk2l3k6lJ4K1K4K9K6
-19D09J6QMJj0j8j1KJ0ROJj0k1j7nkj3j4JJ2lk4k2NK1J7PNLj3l0l0j4kkKJ5J7Kj6j2J4M0L9
-24C77J7mlJ1J7Lj4j0PJ2pk3j3J1J6ql4l6k2pKQJ2QJ%MMpk6l6k4NK6K5RNJ8L3L0J5jj6k7l1
-30C27k8k1j5mJ3K4K4J9J7J5OlLRml0m0j4J9K8J6OJ3J7J2JkjkokRK1J8Jj5k4k5k3j5KJ8K2
-35C86Lj8l2l2k9k1qQK1K2J4NNJ2K2K4J8Opk2l1k4pJpk4k8j1J1J6Lj7k5j5OK6L5K6Qj4k6k8
-40B52k2j4nMJ0J9L4M2L3Kk5k7j3oj4k0j2KJ0J2J2J4J3J0OkpJK0K9J6pk1k3k2k1j4%J9L3L9
$$ plain form
-45 357 390 409 418 428 438 438 427 421 425 430 425 415 412 415 415 413 420 432 437 426 406 390 386 390 400 415 432 445 446 434 414 397 392 397 407 415 413 396 371 352 345 346 352 363 378 389
-51 389 396 411 438 464 468 454 441 439 432 402 348 293 261 260 278 297 310 324 340 344 328 304 292 293 295 292 291 300 314 323 325 321 315 309 298 274 238 213 222 256 285 291 284 278 271 260
-56 260 254 264 288 314 334 344 339 318 296 287 290 292 292 300 324 359 395 420 425 407 378 363 374 397 408 399 381 372 375 382 381 374 361 341 320 310 319 336 343 338 337 342 335 311 291
-62 291 291 305 315 322 344 381 410 416 403 386 375 372 376 380 379 370 363 365 383 416 451 469 460 437 417 408 405 412 430 450 458 458 463 476 481 472 453 433 407 380 366 364 358 336 314 312
-67 312 329 343 346 343 349 369 401 432 441 424 396 375 359 344 340 352 364 354 326 306 305 308 302 291 288 295 309 331 359 383 395 400 408 415 412 402 393 392 393 390 380 364 344 328
-73 328 327 341 362 378 385 384 378 364 341 321 315 323 330 320 301 296 314 348 386 422 449 454 438 416 403 399 392 373 343 309 279 266 277 302 320 316 300 288 288 292 288 282 290 322
-78 322 361 381 369 340 314 296 281 265 257 268 307 364 415 435 419 394 392 415 441 449 437 412 381 350 324 308 301 299 305 322 343 360 369 371 366 353 338 330 336 350 363
-83 363 372 384 406 433 454 463 467 476 487 489 476 446 407 368 346 347 361 365 349 329 320 323 323 318 316 320 325 326 332 351 382 412 428 427 413 393 364 323 278 250 251 273 292 297 296
$$ packed form
-45C57L3J9RJ0J0%j1oMNnj0lL%kPJ2Nj1k0j6mMJ0J5J7J3Jj2k0j7nNJ0Qkj7k5j9pJOJ1J5J1
-51C89PJ5K7K6Mj4j3kpl0n4n5l2jJ8J9J3J4J6Mj6k4j2JKljRJ4RKmooj1k4l6k5RL4K9Opopj1
-56B60oJ0K4K6K0J0nk1k2rLK%QK4L5L6K5Nj8k9j5J1K3J1rj8rLPjpj3k0k1j0RJ7PnjNpk4k0
-62B91%J4J0PK2L7K9Oj3j7j1lMMjrpKJ8L3L5J8rk3k0rlPJ8K0Q%NJ3Nrj9k0k6k7j4kok2k2k
-67C12J7J4LlOK0L2L1Rj7k8k1j6j5mJ2J2j0k8k0jLoj1lPJ4K2K8K4J2NQPlj0rjJlj0j6k0j6
-73C28jJ4K1J6Pjoj4k3k0oQPj0j9nJ8L4L8L6K7Nj6k2j3mpj9l0l4l0j3J1K5J8mj6j2%MmoQL2
-78C22L9K0j2k9k6j8j5j6qJ1L9N7N1K0j6k5kK3K6Qj2k5l1l1k6j6pkOJ7K1J7RKnj3j5qOJ4J3
-83C63RJ2K2K7K1RMRJ1Kj3l0l9l9k2JJ4Mj6k0rL%nkMNJOJ9L1L0J6jj4k0k9m1m5k8JK2J9Nj
$$ plain form
-89 296 299 299 291 283 285 293 296 292 290 298 310 328 353 377 386 377 365 367 377 384 385 389 393 392 385 382 387 398 410 421 422 404 369 332 309 301 301 306 319 340 364 377 371 349 322 301 282 259
-95 259 238 234 249 270 282 288 292 289 272 254 252 266 282 299 329 369 395 393 373 351 329 299 264 237 229 245 281 327 364 378 373 360 342 318 298 293 301 306 299 285 273
-100 273 261 246 232 226 229 238 248 253 253 258 279 311 337 347 353 366 379 381 370 362 363 366 365 358 354 354 356 354 343 325 311 304 295 270 235 211 212 231 248 252 247 245 249 258 270 289 319
-105 319 353 371 361 332 304 291 293 303 316 325 329 331 336 346 351 344 331 322 323 333 345 355 358 354 345 337 329 315 290 260 236 216 197 180 175 184 196 200 197 192 183 166 157 176 221
-111 221 268 298 315 321 302 254 202 182 195 209 209 206 215 232 243 243 227 190 144 114 112 121 119 107 105 121 150 181 209 229 237 232 214 183 150 136 149 176 199 217
-116 217 246 286 314 315 303 297 300 298 279 253 230 218 218 228 243 257 265 268 276 290 299 293 275 261 254 242 222 217 247 296 323 314 298 302 321 333 328 317 304 287 265 247
-121 247 238 240 255 278 295 303 314 333 354 363 372 396 426 434 406 353 299 252 218 203 205 212 208 194 178 165 155 152 163 187 214 233 240 234 224 215 210 204 196 192 194 197 195 189 186 189
-126 189 201 231 280 327 345 333 312 301 296 291 293 314 344 366 373 374 374 373 371 373 376 373 362 353 353 356 353 350 356 367 370 356 333 314 305 300 292 278 262 253 253 251 238 224 228 256 286
$$ packed form
-89B96L%qqKQLmkQJ2J8K5K4Rrj2KJ0PJMMjplNJ1J2J1Jj8l5l7k3q%NJ3K1K4J3ok2k7k1j9k3
-95B59k1mJ5K1J2OMlj7j8kJ4J6J7L0M0K6kk0k2k2l0l5k7qJ6L6M6L7J4nj3j8k4k0nQNpj4j2
-100B73j2j5j4oLRJ0N%NK1L2K6J0OJ3J3Kj1qJLjpm%Kkj1j8j4prk5l5k4JJ9J7MnkMRJ2J9L0
-105C19L4J8j0k9k8j3KJ0J3RMKNJ0Npj3rJJ0J2J0Lmrqqj4k5l0k4k0j9j7nRJ2Mlnrj7rJ9M5
-111B21M7L0J7Oj9m8n2k0J3J4%lRJ7J1%j6l7m6l0kRkj2kJ6K9L1K8K0Qnj8l1l3j4J3K7K3J8
-116B17K9M0K8Jj2oLkj9k6k3j2%J0J5J4QLQJ4Roj8j4pj2k0nL0M9K7rj6MJ9J2nj1j3j7k2j8
-121B47rKJ5K3J7QJ1J9K1RRK4L0Qk8n3n4m7l4j5KPmj4j6j3j0lJ1K4K7J9Poj0rnoqmKLkolL
-126A89J2L0M9M7J8j2k1j1nnKK1L0K2PJ%jkKLlj1r%LllOJ1Lj4k3j9rnqj4j6r%kj3j4MK8L0
$$ plain form
-132 286 298 292 286 288 297 309 322 325 307 275 256 265 286 298 299 300 305 306 295 277 255 233 222 230 244 241 216 192 189 205 220 229 239 248 244 227 217 225 237 227 193 165 172 213
-138 213 251 261 251 246 257 266 255 231 214 215 233 260 283 290 276 256 250 262 282 294 296 284 259 235 235 264 303 329 340 345 342 331 321 324 337 347 348 345 339 329 323 332
-143 332 352 362 353 337 332 337 338 329 315 301 279 246 212 201 224 262 285 275 244 217 206 210 225 251 282 307 321 330 338 337 322 296 272 253 240 238 247 262 276 282 277
-148 277 262 250 265 314 376 422 447 466 487 496 481 444 401 363 331 303 278 260 257 275 308 338 354 359 362 368 373 366 337 293 256 248 266 286 292 287 283 281 278 275 276 280 288
-153 288 300 314 322 326 334 345 344 323 300 305 334 358 356 345 348 367 383 384 373 356 339 327 319 310 293 272 259 256 259 272 297 325 337 327 307 295 293 291 287 288 299 315 329
-158 329 335 337 344 361 387 410 416 402 374 342 309 273 234 208 211 240 272 279 263 245 240 244 246 250 264 280 278 257 237 239 258 270 260 237 226 240 269 293 298 287 272
-163 272 263 263 267 270 270 266 263 264 267 266 261 256 252 253 272 317 370 393 374 344 342 370 398 402 391 379 366 345 318 295 275 254 235 227 238 260 281 288 273 242 212 203 220 247
-169 247 266 270 266 259 251 242 238 247 266 283 290 285 270 256 256 273 293 295 281 278 305 344 359 338 301 267 242 225 222 237 258 276 290 304 318 326 328 328 326 322 319 318 319 326 342 358
$$ packed form
-132B86J2ooKRJ2J3Lj8l2j9RK1J2JJNJj1j8k2k2j1QJ4lk5k4lJ6J5RJ0Rmj7j0QJ2j0l4k8PM1
-138B13L8J0j0nJ1Rj1k4j7JJ8K7K3Pj4k0oJ2K0J2Kj2k5k4%K9L9K6J1Nlj1j0LJ3J0Jloj0oR
-143C32K0J0rj6nNJrj4j4k2l3l4j1K3L8K3j0l1k7j1MJ5K6L1K5J4RQjj5k6k4j9j3kRJ5J4On
-148B77j5j2J5M9O2M6K5J9K1Rj5l7m3l8l2k8k5j8lJ8L3L0J6NLONpk9m4l7qJ8K0OnmkllJMQ
-153B88J2J4QMQJ1jk1k3NK9K4kj1LJ9J6Jj1j7j7j2qrj7k1j3lLJ3K5K8J2j0k0j2kkmJJ1J6J4
-158C29OKPJ7K6K3Oj4k8l2l3l6l9k6LK9L2Pj6j8nMKMJ4J6kk1k0KJ9J2j0k3j1J4K9K4Nj1j5
-163B72r%ML%mlJLjnnmJJ9M5N3K3j9l0kK8K8Mj1j2j3k1k7k3k0k1j9qJ1K2K1Pj5l1l0rJ7K7
-169B47J9MmpqrmRJ9J7Pnj5j4%J7K0Kj4lK7L9J5k1l7l4k5j7lJ5K1J8J4J4J4QK%kmljJPJ6J6
$$ plain form
-174 358 357 337 314 303 302 304 310 321 324 307 285 286 310 327 311 273 237 220 219 227 234 237 240 254 282 310 323 323 321 317 300 266 226 199 192 205 228 252 271 276 266 247 231
-180 231 225 225 225 225 231 238 237 227 221 226 232 232 232 244 266 287 293 282 255 218 182 160 160 174 191 197 191 181 181 192 204 211 216 224 232 235 238 246 257 264 262 252 236 224 228 249 275 288
-185 288 286 279 272 262 248 236 229 228 232 245 267 289 302 301 285 255 224 207 209 222 236 249 263 278 290 302 317 329 330 315 295 283 282 279 262 237 222 230 243 236 208
-190 208 181 178 193 209 218 222 221 211 199 197 212 234 254 271 284 292 296 300 303 303 305 320 345 363 359 344 342 358 379 389 388 383 371 351 325 295 261 234 228 247 273 285 279
-196 279 268 257 242 225 221 240 273 300 307 293 261 222 188 172 181 205 226 223 195 163 152 165 179 181 181 196 223 241 237 223 217 228 251 275 294 307 315 315 303 276
-201 276 241 210 195 197 209 220 226 231 241 259 275 279 269 253 242 243 255 266 264 254 249 255 260 259 270 304 343 357 342 321 305 281 243 208 189 179 169 171 194 223
-205 223 235 228 220 219 218 208 201 203 216 229 235 226 206 194 203 224 234 224 214 218 225 218 196 174 161 158 164 178 195 207 217 231 245 247 233 212 201 209 232 257 273 273 264 259
-211 259 264 275 281 277 264 246 224 206 204 229 268 290 273 229 191 180 191 212 240 274 300 300 270 232 211 215 233 245 239 217 195 186 196 216 239 261 279 287 284 278
$$ packed form
-174C58jk0k3j1jKOJ1Lj7k2JK4J7j6l8l6j7jQPLLJ4K8K8J3%kmj7l4m0k7pJ3K3K4J9Nj0j9j6
-180B31o%%%OPjj0oNO%%J2K2K1Oj1k7l7l6k2%J4J7Ooj0%J1J2PNQQLLQJ1Pkj0j6j2MK1K6J3
-185B88kppj0j4j2pjMJ3K2K2J3jj6l0l1j7KJ3J4J3J4J5J2J2J5J2Jj5k0j2jlj7k5j5QJ3pk8
-190B08k7lJ5J6RMjj0j2kJ5K2K0J7J3QMML%KJ5K5J8mj5kJ6K1J0jnj2k0k6l0l4k7oJ9K6J2o
-196B79j1j1j5j7mJ9L3K7Pj4l2l9l4j6RK4K1lk8l2j1J3J4K%J5K7J8mj4oJ1K3K4J9J3Q%j2k7
-201B76l5l1j5KJ2J1ONJ0J8J6Mj0j6j1JJ2J1kj0nONjJ1L4L9J4j5k1j6k4l8l5j9j0j0KK3K9
-205B23J2pqjjj0pKJ3J3Ork0j2RK1J0j0j0MPpk2k2j3lOJ4J7J2J0J4J4Kj4k1j1QK3K5J6%rn
-211B59NJ1Omj3j8k2j8kK5L9K2j7m4l8j1J1K1K8L4K6%l0l8k1MJ8J2ok2k2rJ0K0K3K2J8Qlo
$$ plain form
-216 278 284 304 327 339 342 349 361 368 350 305 258 239 257 288 300 289 272 268 272 269 259 257 269 283 286 279 275 275 266 235 192 170 186 228 260 265 257 254 255 246 230 226 243 271
-221 271 294 310 319 313 282 233 185 150 130 122 131 153 179 200 221 246 274 292 295 286 272 257 239 217 195 177 168 170 183 203 216 210 192 180 182 186 189 203 240 282 299
-226 299 290 274 264 250 225 203 200 210 221 227 233 231 218 204 208 236 269 289 292 283 271 266 273 290 304 307 303 295 286 276 267 265 270 281 292 298 294 282 273 273 282 288 288 289 303 328 350
-232 350 353 337 317 302 284 260 241 240 252 258 250 233 219 211 206 201 194 183 169 157 148 143 142 149 159 164 163 163 171 186 204 223 236 239 235 234 246 262 268 254 228 204 198 217 247
-237 247 266 259 235 216 211 213 207 191 173 166 176 197 220 239 251 255 251 249 259 280 295 290 275 273 291 311 313 294 266 241 229 232 245 258 264 263 254 233 205 185 186 202 219
-243 219 232 242 254 263 268 272 279 290 299 304 301 292 284 280 282 283 280 272 262 248 235 228 229 232 234 232 221 202 182 172 169 164 158 163 184 203 208 208 223 255 281 289 293 308 329 333 311 274 238
-249 238 210 190 178 178 189 204 215 223 236 259 289 316 331 334 334 335 334 322 292 253 224 217 221 217 199 181 176 177 169 148 124 109 108 121 155 203 242 252 229 195 169
-254 169 157 154 156 167 186 206 221 237 259 279 279 258 237 240 268 301 321 328 331 336 340 342 343 347 353 359 359 349 332 314 301 295 289 271 236 198 177 174 169 151 130 126 144 170
$$ packed form
-216B78OK0K3J2LPJ2Pj8m5m7j9J8L1J2j1j7mMlj0kJ2J4Lpm%rl1m3k2J6M2L2NqlJrj6mJ7K8
-221B71K3J6Rol1m9m8l5k0qRK2K6K1K1K5K8J8Lrj4j5j8k2k2j8rKJ3K0J3oj8j2KMLJ4L7M2J7
-226B99rj6j0j4k5k2lJ0J1OOkj3j4MK8L3K0Lrj2nPJ7J4Lmqrj0rkNJ1J1Omj2r%RO%JJ4K5K2
-232C50Lj6k0j5j8k4j9jJ2Oqj7j4qnnpj1j4j2rnjPJ0Nj%QJ5J8J9J3LmjJ2J6Oj4k6k4oJ9L0
-237B47J9pk4j9nKoj6j8pJ0K1K3J9J2MmkJ0K1J5nj5kJ8K0Kj9k8k5j2LJ3J3Ojrk1k8k0JJ6J7
-243B19J3J0J2RNMPJ1RNlrqmKJlqj0j4j3pJLKkj1j9k0j0lnoNK1J9N%J5L2K6QMJ5K1Mk2l7l6
-249B38k8k0j2%J1J5J1QJ3K3L0K7J5L%Jjj2l0l9k9pMmj8j8nJqk1k4j5jJ3L4M8L9J0k3l4k6
-254A69j2lKJ1J9K0J5J6K2K0%k1k1LK8L3K0PLNMKJMOO%j0j7j8j3ooj8l5l8k1lnj8k1mJ8K6
$$ plain form
-259 170 191 205 210 209 210 222 235 228 199 171 164 169 170 170 182 206 228 241 257 284 309 318 307 285 261 246 243 244 240 234 239 262 286 298 301 304 311 314 313 316 325 326 307 270 230 203
-265 203 196 207 227 243 244 232 215 207 216 241 268 283 285 279 266 241 207 178 165 167 180 204 231 245 235 209 189 186 191 190 183 177 173 171 174 181 185 175 161 160 176 190 189 178
-270 178 171 176 185 189 188 187 194 212 235 252 250 234 222 223 232 236 235 238 245 244 229 217 228 260 293 308 307 300 290 274 250 218 188 174 190 226 255 251 220 186 165 155 152 164
-275 164 188 206 201 180 162 157 163 179 208 245 275 288 289 285 277 261 239 219 211 220 235 237 225 214 224 247 259 248 227 215 218 234 257 279 288 281 265 247 232 224 230 247
-281 247 263 266 253 229 204 193 207 243 273 283 277 265 243 209 182 187 218 245 252 251 258 268 271 272 280 293 300 295 282 269 262 267 273 272 265 269 286 294 282 267 269 282 283 266 248
-286 248 239 237 238 247 253 241 209 180 176 191 206 217 232 252 273 294 321 352 371 366 344 319 302 300 307 314 306 278 239 205 183 165 146 128 117 111 103 94 90 95 103 101 88 78
-291 78 83 96 109 121 139 160 171 170 171 190 232 282 317 324 311 298 297 306 311 303 285 265 250 243 237 224 200 178 174 192 220 248 273 288 282 253 218 194 182 172 165 179
-297 179 214 247 254 240 235 254 286 306 303 282 253 228 210 197 189 191 212 252 295 322 339 363 399 427 429 411 390 373 350 322 294 266 236 204 185 185 200 222
$$ packed form
-259A70K1J4NjJJ2J3pk9k8pNJ%J2K4K2J3J6K7K5Rj1k2k4j5lJmoNK3K4J2LLPLjLRJj9l7m0k7
-265B03pJ1K0J6Jj2j7qRK5K7J5Koj3k5l4k9j3KJ3K4K7J4j0k6k0lNjpomkLPMj0j4jJ6J4jj1
-270A78pNRMjjPJ8K3J7kj6j2JRMjLPjj5j2J1L2L3J5jpj0j6k4l2l0j4J6L6K9ml1l4k1j0lJ2
-275A64K4J8nk1j8nOJ6K9L7L0J3Jmqj6k2k0qRJ5Kj2j1J0K3J2j1k1j2LJ6K3K2Rpj6j8j5qOJ7
-281B47J6Lj3k4k5j1J4L6L0J0oj2k2l4k7NL1K7PjPJ0LJQJ3Pnj3j3pNOjpMJ7Qj2j5KJ3Jj7j8
-286B48rkJROj2l2k9mJ5J5J1J5K0K1K1K7L1J9nk2k5j7kPPqk8l9l4k2j8j9j8j1oqrmNQkj3j0
-291G8NJ3J3J2J8K1J1jJJ9M2N0L5Pj3j3jRNqj8k0j5poj3k4k2mJ8K8K8K5J5ok9l5k4j2j0pJ4
-297A79L5L3Pj4nJ9L2K0lk1k9k5j8j3qKK1M0M3K7J7K4L6K8Kj8k1j7k3k8k8k8l0l2j9%J5K2
$$ plain form
-301 222 244 255 244 222 217 237 259 257 240 231 233 226 200 171 157 162 182 209 228 223 193 157 131 114 103 102 111 122 129 135 145 159 174 190 204 212 211 205 195 182 179 205
-306 205 255 299 306 280 246 215 185 157 142 140 140 131 119 111 102 90 82 86 103 124 141 143 129 110 102 106 106 96 85 90 109 135 165 199 225 227 203 174 157 156 166 183
-311 183 205 220 219 211 211 227 244 245 232 222 225 234 235 223 206 196 199 213 230 240 241 237 231 224 217 210 199 179 152 127 110 103 104 112 124 136 145 154 163 174 192 215 230 223 200
-317 200 189 208 242 264 270 271 276 282 293 309 322 318 295 262 227 188 154 144 165 198 219 225 228 235 247 259 265 267 275 297 324 334 320 294 272 252 226 204 198 207 214 214
-322 214 214 217 215 201 178 153 134 130 150 187 220 224 197 164 156 177 201 204 193 187 192 191 178 170 181 205 226 242 257 266 260 243 233 239 252 262 265 266 270 278 285 280 261 239 229
-328 229 229 226 210 185 156 126 100 86 87 96 105 108 108 112 122 129 123 105 96 104 123 148 183 221 235 210 173 167 190 203 189 170 166 159 133 106 108 142 186 221 238 226 188
-333 188 147 138 166 205 232 242 240 229 213 197 185 179 179 183 184 178 178 193 221 243 250 244 233 219 205 199 200 197 184 170 176 209 254 285 284 252 208 169 144 135 145 172 206
-338 206 231 242 245 250 260 269 269 252 222 191 169 155 139 120 104 96 96 102 120 153 196 227 233 217 201 202 215 222 217 215 230 257 279 290 287 271 243 218 211 217 219 212 204 201
$$ packed form
-301B22K2J1j1k2nK0K2kj7rKpk6k9j4NK0K7J9nl0l6k6j7j1jRJ1POJ0J4J5J6J4Qjoj0j3lK6
-306B05N0M4Pk6l4l1l0k8j5k%rj2qrj2qMJ7K1J7Kj4j9qM%j0j1NJ9K6L0L4K6Kk4k9j7jJ0J7
-311A83K2J5jq%J6J7Jj3j0LRJj2j7j0LJ4J7J0Jmopppj1k0k7k5j7pJQJ2J2RRRJ1J8K3J5pk3
-317B00j1J9L4K2OJNOJ1J6J3mk3l3l5l9l4j0K1L3K1OLPJ2J2OKQK2K7J0j4k6k2k0k6k2oRP%
-322B14%Lkj4k3k5j9mK0L7L3Mk7l3qK1K4Lj1oNjj3qJ1K4K1J6J5Roj7j0OJ3J0LJMQPnj9k2j0
-328B29%lj6k5k9l0k6j4JRRL%MJ0Poj8rQJ9K5L5L8J4k5l7oK3J3j4j9mpk6k7KL4M4L5J7j2l8
-333A88m1rK8L9K7J0kj1j6j6j2o%MJo%J5K8K2Poj1j4j4oJlj3j4OL3M5L1jl2m4l9k5rJ0K7L4
-338B06K5J1LNJ0R%j7l0l1k2j4j6j9j6q%OJ8L3M3L1Oj6j6JJ3PnkJ5K7K2J1lj6k8k5pOKpql
$$ plain form
-344 201 203 211 232 267 303 327 333 322 297 274 263 259 240 199 155 132 133 144 156 166 169 162 154 159 178 196 199 183 158 134 124 133 161 201 241 265 267 256 247 243 230 204
-349 204 180 169 165 154 139 133 138 145 148 156 165 160 135 108 102 113 119 112 107 118 138 149 147 143 150 170 197 218 218 195 159 127 104 88 79 77 80 88 112 156 203 222 201 163 134
-354 134 117 110 118 140 160 162 162 187 228 251 248 245 262 284 287 276 271 276 277 269 253 233 210 192 188 200 225 254 275 272 248 223 213 212 211 218 243 274 291 293 294 294 279 252
-360 252 231 228 234 239 243 244 234 217 208 212 213 194 165 146 145 151 152 145 133 127 131 146 165 185 207 228 240 241 237 234 232 228 222 216 209 198 185 169 152 144 157 188 216 225 220 215 218 227 237
-366 237 245 249 246 236 216 187 162 160 180 199 201 188 175 168 163 162 170 184 196 202 198 181 163 163 188 220 233 228 225 225 217 198 177 159 138 118 116 133 152 159 166 192 235 275
-371 275 295 288 258 224 210 227 259 277 271 247 214 178 151 145 157 165 157 138 124 127 149 181 210 221 217 216 228 246 256 259 269 292 315 327 326 318 307 293 277 261
-376 261 245 226 205 185 165 151 155 183 218 237 229 206 187 177 168 149 120 90 76 84 101 111 116 133 172 216 245 256 257 245 217 186 170 167 156 128 96 77
-380 77 74 76 81 85 86 89 104 135 165 182 192 209 229 239 235 230 230 227 217 211 220 236 248 257 270 285 283 251 199 155 136 131 122 103 91 103 140 179 196 184 161 151 165
$$ packed form
-344B01KQK1L5L6K4Oj1k5k3j1mj9m1m4k3JJ1J2J0LpqNJ9J8Lj6k5k4j0RK8M0M0K4Kj1rmj3k6
-349B04k4j1mj1j5oNPLQRnk5k7oJ1OpnJ1K0J1kmPK0K7K1%k3l6l2k3j6rkLQK4M4M7J9k1l8k9
-354A34j7pQK2K0K%K5M1K3llJ7K2Lj1nNJqj6k0k3j8mJ2K5K9K1lk4k5j0jjPK5L1J7KJ%j5k7
-360B52k1lONMJj0j7rMJj9k9j9jOJpj2oMJ5J9K0K2K1J2Jmlkmoopj1j3j6j7qJ3L1K8RnnLRJ0
-366B37QMlj0k0k9k5kK0J9Kj3j3pnjQJ4J2Omj7j8%K5L2J3nl%qj9k1j8k1k0kJ7J9PPK6M3M0
-371B75K0pl0l4j4J7L2J8ok4l3l6k7oJ2Qqj9j4LK2L2K9J1mjJ2J8J0LJ0K3K3J2jqj1j4j6j6
-376B61j6j9k1k0k0j4MK8L5J9qk3j9j0rj9k9l0j4QJ7J0NJ7L9M4K9J1Jj2k8l1j6lj1k8l2j9
-380G7lKNMJLJ5L1L0J7J0J7K0J0mn%lj0oRJ6J2RJ3J5kl2n2m4j9nrj9j2J2L7L9J7j2k3j0J4
$$ plain form
-386 165 194 225 249 268 284 290 283 265 239 210 189 186 200 214 212 193 168 139 104 73 63 72 83 82 79 87 106 125 141 161 186 203 207 204 202 195 174 144 125 137 183
-391 183 238 273 271 242 213 201 201 194 169 137 122 132 158 175 168 141 109 90 93 117 152 191 223 236 224 195 167 156 165 177 180 178 189 222 265 290 283 248 205
-395 205 168 143 127 119 117 122 134 155 184 215 240 255 257 251 247 253 265 271 258 227 188 153 133 134 149 166 174 177 190 218 252 269 258 227 198 188 193 203 212 219 222 213 188
-401 188 164 157 172 189 184 154 118 107 134 183 223 238 235 229 219 198 167 140 131 135 144 149 154 163 178 201 228 250 262 270 278 287 291 292 295 293 276 246 220 213 215 209 196 188 188 186
-406 186 176 166 165 169 170 173 179 177 154 117 90 88 101 112 119 128 145 176 211 234 230 213 209 224 241 240 226 212 199 183 170 174 192 204 197 179 167 170 184 195 198 197 201 208
-412 208 206 190 181 192 213 218 203 184 175 178 189 206 216 206 181 165 171 189 210 236 259 256 226 196 195 217 232 224 198 159 115 79 59 45 24 2 7 45 96 135
-417 135 152 155 156 168 198 235 262 273 278 282 279 268 259 262 267 259 233 202 184 183 195 207 208 194 172 156 156 170 183 186 184 194 216 231 228 216 209 205 190 166 147 138 130 116
-422 116 101 90 79 72 84 118 158 184 199 219 246 268 274 266 249 234 222 206 179 150 141 164 201 225 224 203 173 143 127 138 176 220 250 254 239 220 210 204
$$ packed form
-386A65K9L1K4J9J6Opj8k6k9k1lJ4J4kj9k5k9l5l1j0RJ1jlQJ9J9J6K0K5J7Mlkpk1l0j9J2M6
-391A83N5L5kk9k9j2%pk5l2j5J0K6J7pk7l2j9LK4L5L9L2J3j2k9k8j1RJ2LkJ1L3M3K5pl5m3
-395B05l7k5j6qkNJ2K1K9L1K5J5KomOJ2Oj3l1l9l5k0JJ5J7QLJ3K8L4J7j1l1k9j0NJ0RPLrk5
-401A88k4pJ5J7nl0l6j1K7M9M0J5loj0k1l1k7rMRNNRJ5K3K7K2J2QQRMJLkj7l0k6pKoj3q%k
-406A86j0j0jMJLOkk3l7k7kJ3J1PRJ7L1L5K3mj7mJ5J7jj4j4j3j6j3MJ8J2pj8j2LJ4J1LjMP
-412B08kj6rJ1K1Nj5j9rLJ1J7J0j0k5j6OJ8K1K6K3ll0l0jK2J5qk6l9m4l6k0j4k1k2NL8N1L9
-417A35J7LJJ2L0L7K7J1NMlj1rLNqk6l1j8jJ2J2Jj4k2j6%J4J3LkJ0K2J5lj2pmj5k4j9rqj4
-422A16j5j1j1pJ2L4M0K6J5K0K7K2Oqj7j5j2j6k7k9rK3L7K4jk1l0l0j6J1L8M4L0Mj5j9j0o
$$ plain form
-427 204 191 165 139 129 131 129 121 115 117 123 126 122 111 100 105 129 156 161 144 127 126 132 131 122 116 115 118 120 120 118 122 142 174 194 184 154 126 117 123 134 141 143 141 140 145 155 164 175 193
-433 193 212 214 192 155 121 100 94 99 105 100 82 62 60 86 125 158 171 168 161 155 145 131 121 123 136 155 181 217 257 286 294 288 283 280 268 242 218 211 219 227 234 253 283 299
-438 299 278 228 182 160 159 159 151 141 134 138 150 164 170 171 176 184 186 174 154 143 151 170 183 184 172 155 135 116 103 97 95 97 107 128 155 181 199 216 234 246 241 222 210
-443 210 228 276 326 346 320 264 216 203 221 244 253 252 252 253 249 234 217 206 202 203 210 217 221 220 221 231 249 264 261 243 224 224 243 264 273 268 256 239 215 190 174 170 171 163
-449 163 143 116 92 78 74 76 75 72 78 100 131 161 182 197 212 222 221 208 187 162 138 123 125 145 173 194 200 193 182 175 178 188 196 195 186 174 165 160 160 167 179 191 199 203 202
-454 202 195 182 166 147 126 109 105 117 131 135 131 127 128 133 141 153 169 188 204 207 192 170 158 156 145 114 85 86 112 131 122 101 92 99 116 141 171 194 196 180 166 171 186
-459 186 190 167 133 114 121 137 138 128 123 124 117 98 88 99 122 145 173 215 259 278 258 207 149 112 109 133 157 165 166 172 185 200 223 255 278 269 235 209 207 217 226
-464 226 236 247 249 236 221 219 226 231 234 239 245 240 221 192 164 143 132 124 112 101 104 124 143 150 150 160 177 190 197 205 211 202 176 148 133 125 114 98 86 89 102 112 110 99
$$ packed form
-427B04j3k6k6j0KkqoKOLmj1j1NK4K7Nj7j7jOjrojLK%kMK0L2K0j0l0k8rOJ1PKkjNJ0RJ1J8
-433A93J9Kk2l7l4k1oNOnj8k0kK6L9L3J3lpoj0j4j0KJ3J9K6L6M0K9Qonlj2k6k4pQQPJ9L0J6
-438B99k1n0m6k2j%qj0pMJ2J4OJNQKj2k0j1QJ9J3Jj2j7k0j9j3okKJ0K1K7K6J8J7J8J2nj9j2
-443B10J8M8N0K0k6n6m8j3J8K3Rj%Jmj5j7j1mJPPMjJJ0J8J5lj8j9%J9K1Rnj2j7k4k5j6mJq
-449A63k0k7k4j4mKjlOK2L1L0K1J5J5J0jj3k1k5k4j5KK0K8K1Opj1pLJ0Qjrj2rn%PJ2J2QMj
-454B02pj3j6j9k1j7mJ2J4MmmJNQJ2J6J9J6Lj5k2j2kj1l1k9JK6J9rk1rPJ7K5L0K3Kj6j4NJ5
-459A86Mk3l4j9PJ6Jj0nJpj9j0J1K3K3K8M2M4J9k0n1n8l7lK4K4QJOJ3J5K3L2K3rl4k6kJ0R
-464B26J0J1Kj3j5kPNLNOnj9k9k8k1j1qj2j1LK0J9P%J0J7J3PQOrk6k8j5qj1j6j2LJ3J0kj1
$$ plain form
-470 99 93 101 121 146 173 203 238 265 273 259 237 223 219 213 197 175 164 169 178 179 173 169 170 168 161 151 146 150 159 169 175 179 192 210 215 193 150 112 97 108 134 165 194 215 223
-475 223 214 192 171 172 197 216 198 151 115 113 130 134 123 114 116 122 121 118 120 132 152 177 196 193 163 122 90 73 68 65 59 53 51 58 67 70 70 80 107 141 162 161 144 125 111
-481 111 105 111 125 143 157 162 158 152 153 166 182 179 145 92 45 22 21 26 26 17 5 3 18 43 68 83 93 107 123 134 138 140 145 150 152 145 129 104 73 47 37 45 56 57 50
-486 50 54 78 114 143 155 154 145 130 120 129 150 160 144 113 92 86 87 90 100 113 118 116 116 125 138 156 179 194 183 147 112 103 113 120 116 112 117 131 146 157 152 132 116 124
-492 124 152 170 159 132 116 120 132 146 164 183 186 163 126 98 93 106 122 131 134 134 135 138 144 149 153 160 175 193 201 193 179 172 170 161 140 111 87 78 90 126 173 203 197 159
-497 159 120 104 116 140 156 157 140 114 89 79 83 88 82 73 80 111 150 179 193 199 194 172 135 103 87 85 89 96 111 137 169 199 218 224 221 219 218 209 186 157 131 113 100
-502 100 94 101 126 157 179 183 173 161 154 150 142 128 115 106 100 100 112 134 147 138 115 102 112 138 164 189 221 256 280 284 273 259 243 224 199 173 154 146 151 169 193
-507 193 212 219 214 202 192 192 196 187 155 108 77 84 120 158 184 207 234 252 244 210 170 140 123 109 90 67 52 59 86 116 134 140 144 149 145 127 107 99 107 121 128 124 116
$$ packed form
-470I9oQK0K5K7L0L5K7Qj4k2j4moj6k2j1NRJomJkpj0nMRJ0OMJ3J8Nk2m3l8j5J1K6L1K9K1Q
-475B23rk2k1JK5J9j8m7l6kJ7Mj1rKOjlKJ2K0K5J9ll0m1l2j7nlookPRL%J0K7L4K1jj7j9j4
-481A11oOJ4J8J4NmoJJ3J6ll4n3m7k3jN%rj2kJ5K5K5J5J0J4J6J1MKNNKpj6k5l1k6j0QJ1Jp
-486E0MK4L6K9J2jrj5j0RK1J0j6l1k1oJLJ0J3Nk%RJ3J8K3J5j1l6l5rJ0PmmNJ4J5J1nk0j6Q
-492A24K8J8j1k7j6MJ2J4J8J9Lk3l7k8nJ3J6RL%JLONMPJ5J8Qqj4pkrk1k9k4rJ2L6M7L0ol8
-497A59l9j6J2K4J6Jj7k6k5j0MNorPL1L9K9J4Onk2l7l2j6kMPJ5K6L2L0J9Olkjrk3k9k6j8j3
-502A00oPK5L1K2Mj0j2pmqj4j3ro%J2K2J3rk3j3J0K6K6K5L2L5K4Mj1j4j6j9k5k6j9qNJ8K4
-507A93J9Pnj2j0%Mrl2m7l1PL6L8K6K3K7J8ql4m0l0j7j4j9k3j5PK7L0J8OMNmj8k0qQJ4Pmq
$$ plain form
-513 116 109 105 104 106 110 114 110 93 70 55 53 62 75 82 78 71 78 108 149 181 197 202 207 207 198 180 157 134 122 129 156 189 215 228 231 228 223 221 223 220 208 195 195 209 225 228 223 220 220
-519 220 218 214 220 242 270 286 286 282 282 272 242 199 164 146 133 119 113 122 138 149 150 149 150 154 160 171 173 152 114 92 111 158 194 198 179 159 143 132 127 132 141 145 140 133 129 131
-524 131 138 151 162 163 154 150 158 169 167 150 133 125 117 97 72 62 75 93 91 70 56 64 80 73 39 4 -4 4 11 7 4 6 6 0 -2 13 44 71 82 81 82 93 103 99 81 68
-530 68 72 82 76 54 34 35 47 53 45 36 39 59 90 122 146 160 169 175 177 186 210 240 250 228 191 161 142 124 107 102 114 135 161 192 219 232 229 218 202 179 155 148
-535 148 158 168 168 166 174 182 177 165 160 167 178 186 190 183 158 125 110 118 129 131 132 148 165 161 133 109 108 125 144 165 195 229 243 227 195 173 168 168 162 153 152 160 161 146 125 116
-541 116 119 120 110 97 97 114 134 148 153 149 136 122 118 128 138 130 104 85 90 116 148 168 168 153 141 145 154 148 125 112 127 161 191 217 249 280 283 243 181 130 105
-546 105 95 90 85 77 65 54 55 71 95 114 127 138 151 163 169 166 160 156 159 160 159 162 179 205 220 212 190 173 164 146 110 68 41 37 42 42 35 26 17 13 25 56 93 114 116 112
-551 112 119 139 163 180 187 182 175 174 179 180 173 166 167 179 192 200 202 199 195 194 198 198 189 174 163 153 137 117 109 117 125 118 100 85 73 54 33 28 41 56 64 71 87 102 108 118 147 190
$$ packed form
-513A16pmjKMMmj7k3j5kRJ3PmpPL0M1L2J6NN%rj8k3k3j2PK7L3K6J3LlnkKlj2j3%J4J6Lnl%
-519B20kmOK2K8J6%m%j0l0m3l5j8j3j4oRJ6J1JjJMOJ1Kk1l8k2J9M7L6Mj9k0j6j1nNRMnpmK
-524A31PJ3J1JrmQJ1kj7j7qqk0k5j0J3J8kk1j4QJ6pl4l5qQPmlK%okJ5L1K7J1jJJ1J0mj8j3
-530F8MJ0ok2k0JJ2OqrLK0L1L2K4J4ROKRK4L0J0k2l7l0j9j8j7nJ2K1K6L1K7J3lj1j6k3k4p
-535A48J0J0%kQQnj2nPJ1QMpk5l3j5QJ1KJJ6J7mk8k4jJ7J9K1L0L4J4j6l2k2n%orjQJj5k1r
-541A16LJj0j3%J7K0J4Nmj3j4mJ0J0qk6j9NK6L2K0%j5j2MRok3j3J5L4L0K6L2L1Lm0o2n1k5
-546A05j0nnqj2j1JJ6K4J9J3J1J3J2OlomLJjLJ7K6J5qk2j7rj8l6m2k7mN%prrmJ2L1L7K1Km
-551A12PK0K4J7PnpjNJppJJ2J3QKlmjM%rj5j1j0j6k0qQQpj8j5j2j9k1nJ3J5QPJ6J5OJ0K9M3
$$ plain form
-557 190 220 220 201 183 176 182 194 206 208 201 198 203 209 207 203 206 211 211 205 197 188 167 132 93 66 55 57 63 68 69 68 72 81 90 95 92 84 73 69 73 83 92 98 101 107 119 132 138 131 121 129 162 204
-564 204 226 217 187 152 121 101 97 108 124 135 140 141 142 146 156 167 166 147 120 104 103 105 100 89 84 95 120 149 176 197 211 214 209 202 195 179 147 109 86 84 87 79 63 52
-569 52 55 65 73 73 69 69 80 96 106 109 113 116 112 102 105 131 164 177 163 141 127 122 120 120 120 115 101 84 68 54 47 53 70 88 100 104 102 98 93 97 111 132 151 162 157 133 96
-575 96 58 33 22 18 19 27 45 69 90 102 103 105 112 115 101 68 34 14 10 16 30 52 81 112 136 142 127 102 87 90 103 117 128 133 126 101 69 46 40 41 42 46 57 71
-580 71 81 85 88 93 98 108 133 179 238 277 277 247 219 207 203 192 179 165 143 111 84 81 96 106 109 120 144 165 167 148 112 61 9 -14 8 61 113 146 166 180
-585 180 190 196 198 195 182 169 167 176 178 166 149 143 145 145 141 143 154 166 166 151 125 90 53 30 36 57 69 66 62 69 73 55 22 2 10 31 51 67 86 103 111 112 117 136 161
-590 161 178 179 163 139 112 78 39 9 4 31 76 125 167 192 194 180 169 168 163 142 106 72 50 42 52 80 112 132 138 136 123 95 56 24 12 15 17 11 2 -5 -9 -8
-596 -8 1 21 54 94 132 160 182 202 217 220 208 192 179 167 155 150 160 178 190 193 197 210 231 246 244 227 202 178 155 130 101 80 78 92 106 110 106 106 114 128 138
$$ packed form
-557A90L0%j9j8pOJ2J2KplNOkmLN%oqrk1l5l9k7j1KONJjMRRNlqj1mMJ0ROLOJ2J3Opj0QL3M2
-564B04K2rl0l5l1k0mJ1J6J1NJJMJ0J1jj9k7j6jKnj1nJ1K5K9K7K1J4Lnppj6l2l8k3kLqj6j1
-569E2LJ0Q%m%J1J6J0LMLmj0LK6L3J3j4k2j4nk%%nj4j7j6j4pOJ7J8J2MkmnMJ4K1J9J1nk4l7
-575I6l8k5j1mJQJ8K4K1J2JKPLj4l3l4k0mOJ4K2K9L1K4Oj5k5j5LJ3J4J1Npk5l2k3oJJMJ1J4
-580G1J0MLNNJ0K5M6N9L9%l0k8j2mj1j3j4k2l2k7lJ5J0LJ1K4K1Kj9l6n1n2k3K2N3N2L3K0J4
-585A80J0OKlj3j3kRKj2j7oK%mKJ1J2%j5k6l5l7k3OK1J2lmPMj8l3k0QK1K0J6J9J7QJNJ9K5
-590A61J7Jj6k4k7l4l9l0nK7M5M9M2K5Kj4j1jnk1l6l4k2qJ0K8L2K0Okj3k8l9l2j2LKorpmJ
-596hRK0L3M0L8K8K2K0J5Lj2j6j3j2j2nJ0J8J2LMJ3K1J5kj7k5k4k3k5k9k1kJ4J4Mm%QJ4J0
$$ plain form
-601 138 143 141 134 123 106 88 80 93 123 154 168 159 130 90 45 2 -24 -28 -11 14 32 32 16 -3 -13 -12 -7 -5 0 16 43 76 112 147 170 166 135 99 85 94 112
-606 112 125 127 122 113 105 101 102 107 119 143 171 192 200 204 211 218 221 218 222 240 272 303 320 320 308 287 257 228 217 234 263 272 250 210 174 147 128 118 112 101 85 75 80 95
-611 95 105 106 107 112 113 107 98 97 106 120 134 143 146 146 149 155 163 169 177 184 189 184 166 141 123 129 164 211 241 239 217 196 187 191 204 219 228 223 201 166 128 100 95 111 138 162 176 182 183
-617 183 187 198 215 227 230 227 221 211 198 191 201 227 255 272 271 258 241 222 198 164 127 103 104 128 162 191 206 201 179 158 160 191 224 225 191 155 150 177 207 219
-622 219 215 214 228 248 263 265 258 243 222 193 156 120 97 95 110 131 145 145 129 111 104 108 114 119 135 163 191 206 218 233 238 218 185 173 190 213 224 229 242 254 256
-627 256 254 256 254 234 199 168 150 140 132 121 108 99 108 139 175 194 189 164 129 90 62 57 69 81 87 94 108 123 132 136 135 127 113 98 88 83 87 100 114 120 120 125 140 156
-632 156 171 189 205 208 194 175 154 123 89 67 66 69 65 68 90 120 131 116 87 63 53 65 97 131 148 152 158 167 167 153 129 95 53 15 3 22 50 68 77 85
-637 85 92 96 97 91 72 47 36 45 55 51 39 36 44 51 51 51 58 68 76 79 79 78 79 86 102 124 142 146 134 123 133 165 199 216 214 204 194 187 185 189 192 190 186 181 165 127 83 55 56
$$ packed form
-601A38Nkpj1j7j8qJ3L0L1J4rk9m0m5m3k6mJ7K5J8%j6j9j0JNKNJ6K7L3L6L5K3ml1l6j4RJ8
-606A12J3KnrqmJNJ2K4K8K1QMPPLlMJ8L2L1J7%j2k1l0k9j1J7K9Rk2m0l6k7j9j0oj1j6j0NJ5
-611I5J0JJNJorjRJ4J4RL%LOQOQPNnj8k5j8OL5M7L0kk2k1rMJ3J5Rnk2l5l8k8nJ6K7K4J4OJ
-617A83MJ1J7J2Lloj0j3pJ0K6K8J7jj3j7j9k4l4l7k4JK4L4K9J5nk2k1KL1L3Jl4l6nK7L0J2
-622B19mjJ4K0J5Kpj5k1k9l7l6k3kJ5K1J4%j6j8pMONJ6K8K8J5J2J5Nk0l3j2J7K3J1NJ3J2K
-627B56kKkk0l5l1j8j0qj1j3rRL1L6J9nk5l5l9k8nJ2J2OPJ4J5RMjqj4j5j0nMJ3J4O%NJ5J6
-632A56J5J8J6Lj4j9k1l1l4k2jLmLK2L0J1j5k9k4j0J2L2L4J7MOR%j4k4l4m2l8j2J9K8J8RQ
-637H5PMJoj9k5j1RJ0mj2lQP%%PJ0QL%jJPJ6K2J8Mj2j1J0L2L4J7kj0j0pkMLkmnj6l8m4k8J
$$ plain form
-643 56 76 107 146 184 205 198 176 156 150 153 160 166 174 189 213 237 245 229 199 175 167 171 177 177 169 156 145 140 142 149 159 171 179 183 186 181 156 112 67 49 62 93 122 143 155
-649 155 160 156 149 146 154 170 186 197 204 211 214 202 172 132 98 76 64 63 81 115 158 198 232 254 262 255 243 228 202 166 137 132 145 150 137 117 107 107 107 105 106 112 124 143
-654 143 168 189 193 179 159 142 124 101 80 74 86 107 122 123 115 105 100 102 115 147 196 242 264 256 241 244 265 277 258 214 176 162 164 163 148 128 114 108 107 111 122
-659 122 135 142 144 148 162 182 197 202 201 196 186 171 157 151 153 158 157 150 135 120 108 102 95 81 63 44 30 18 6 -4 -7 0 15 25 19 0 -14 -4 30 72 101 107 94
-664 94 71 49 37 39 46 51 56 67 78 84 93 116 150 174 174 162 155 156 158 159 166 176 177 166 150 139 130 118 105 101 116 148 181 198 192 175 163 156 150 151 168 199 221 220 208
-670 208 201 200 195 183 171 161 155 160 179 203 217 219 218 219 219 221 235 258 274 271 250 218 183 159 157 170 181 179 176 185 197 196 180 165 168 186 207 217 209 189 171 167 172 181 192
-675 192 204 209 196 166 127 97 91 114 147 157 131 90 63 59 67 74 80 82 81 87 105 125 134 134 139 149 150 130 105 94 101 117 130 130 119 106 105 115 124 130 144 165 174 169 171
-681 171 197 229 236 219 206 210 210 188 153 124 106 85 59 40 38 51 68 78 75 64 57 62 71 70 59 58 85 137 190 221 221 198 174 163 165 168 161 145 133 129 132 131 123 109
$$ packed form
-643E6K0L1L9L8K1pk2k0oLPOQJ5K4K4Qj6l0k4qMO%qj3j1nKPJ0J2QMLnk5m4m5j8J3L1K9K1J2
-649A55NmplQJ6J6J1PPLj2l0m0l4k2j2jJ8L4M3M0L4K2Qpj2j5k6l6k9nJ3Nj3k0j0%%kJOJ2J9
-654A43K5K1Mj4k0j7j8k3k1oJ2K1J5Jqj0nKJ3L2M9M6K2qj5LK1J2j9m4l8j4Kjj5k0j4ojMJ1
-659A22J3PKMJ4K0J5Njnj0j5j4oKNjpj5j5j2opj4j8j9j4j2j2j0lPJ5J0oj9j4J0L4M2K9Oj3
-664I4k3k2j2KPNNJ1J1ORK3L4K4%j2pJKJPJ0Jj1j6j1rj2j3mJ5L2L3J7oj7j2poJJ7L1K2jj2
-670B08pjnj2j2j0oNJ9K4J4KjJ%KJ4K3J6lk1l2l5k4kJ3J1klRJ2jj6j5LJ8K1J0qk0j8mNRJ1
-675A92J2Nj3l0l9l0oK3L3J0k6m1k7mQPOKjOJ8K0R%NJ0Jk0k5j1PJ6J3%j1j3jJ0ROJ4K1RnK
-681A71K6L2Pj7j3M%k2l5k9j8k1k6j9kJ3J7J0lj1pNRjj1jK7N2N3L1%k3k4j1KLpj6j2mLjqj4
$$ plain form
-686 109 98 94 101 117 135 145 138 111 77 53 53 72 91 102 112 132 160 182 194 198 186 150 101 61 45 40 24 -4 -32 -40 -11 53 131 184 188 157 124 111 119
-691 119 139 159 164 150 130 120 117 105 87 86 115 155 178 173 146 108 69 40 23 11 4 12 37 61 66 52 31 12 0 -3 8 24 29 21 11 3 1 12 40 73 89
-696 89 84 77 82 89 86 79 81 93 102 98 79 41 -9 -55 -69 -47 -15 2 4 8 27 54 75 82 70 49 33 31 38 36 20 0 -9 -8 2 23 53 82 94 86 69 52 34 13
-701 13 -4 -13 -12 -5 12 44 80 107 118 113 98 79 69 72 81 86 89 103 127 135 114 76 46 34 34 42 58 82 109 136 163 185 191 175 145 117 102 98 93 78 61 61 88
-707 88 129 158 156 126 85 56 59 96 147 183 186 162 127 87 52 34 42 66 88 97 100 105 113 119 121 120 118 112 105 93 79 63 52 54 68 93 120 139 141 129 114 104 92
-712 92 67 36 16 16 29 40 49 63 79 85 75 60 61 84 115 132 126 107 91 90 102 121 138 143 140 139 148 156 147 119 92 78 66 43 15 2 13 36 61 84 102
-717 102 111 119 136 161 175 163 133 103 79 58 40 34 40 49 59 74 93 103 92 60 22 -7 -28 -45 -55 -51 -33 -10 3 7 10 18 30 40 46 43 29 6 -16 -28
-722 -28 -24 -8 14 32 42 46 50 52 48 46 61 100 149 186 200 193 169 134 98 73 59 52 52 61 76 94 121 161 193 193 164 133 121 126 135 139 137 126 111 105 115 137 161
$$ packed form
-686A09j1mPJ6J8J0pk7l4k4%J9J9J1J0K0K8K2J2Mj2l6m9m0j6nj6k8k8qK9O4P8N3Ml1l3j3Q
-691A19K0K0Nj4k0j0lj2j8jK9M0K3nk7l8l9k9j7j2pQK5K4Nj4k1j9j2lJ1J6Nqj0qkJ1K8L3J6
-696H9npNPlpKJ2Rmj9l8n0m6j4K2L2J7KMJ9K7K1Pj2k1j6kPkj6k0rJJ0K1L0K9J2qj7j7j8k1
-701A3j7rJPJ7L2L6K7J1nj5j9j0LRNLJ4K4Qk1l8l0j2%QJ6K4K7K7K7K2Oj6l0k8j5mnj5j7%K7
-707H8M1K9kl0m1k9LL7N1L6Lk4l5m0l5j8QK4K2RLNQOKjkopj2j4j6j1KJ4K5K7J9Kj2j5j0j2
-712I2k5l1k0%J3J1RJ4J6Oj0j5JK3L1J7oj9j6jJ2J9J7NljRQrk8k7j4j2k3k8j3J1K3K5K3J8
-717A02RQJ7K5J4j2l0l0k4k1j8oORJ0J5J9J0j1l2l8k9k1j7j0MJ8K3J3MLQJ2J0Olj4k3k2j2
-722b8MJ6K2J8J0MMKmkJ5L9M9L7J4pk4l5l6k5j4p%RJ5J8K7M0L2%k9l1j2NRMkj1j5oJ0K2K4
$$ plain form
-727 161 182 196 201 201 207 216 211 182 141 108 90 74 53 33 19 10 10 27 66 113 147 155 143 130 130 143 160 173 185 195 194 174 141 106 71 34 0 -24 -31 -24 -6
-732 -6 23 64 103 129 143 150 149 142 131 124 118 105 81 51 22 0 -14 -19 -16 -5 13 42 78 112 132 134 123 114 113 119 128 142 160 179 190 189 176 157 139 125 117 112 109 112
-737 112 125 141 152 157 160 162 159 152 139 117 78 27 -16 -43 -53 -54 -42 -12 31 75 101 109 111 124 153 183 196 187 172 162 159 155 149 143 140 139 145 161 182 198 203 202 201 201 199
-743 199 188 171 157 155 158 151 131 108 91 82 77 76 74 62 40 21 21 38 60 84 107 120 116 104 100 110 120 119 111 102 94 87 82 80 80 85 98 114 121 116 111 115 129 148 164 169 160
-749 160 147 142 140 127 100 80 82 92 90 73 58 49 39 21 0 -15 -14 3 32 58 71 77 85 98 110 114 109 94 73 59 60 71 75 68 57 56 65 82 103 124 138 143 148
-754 148 157 166 170 173 180 188 186 172 151 128 103 84 86 111 143 158 145 114 86 76 92 126 164 186 188 176 156 125 85 50 38 52 72 78 73 70 81 102 124 138 137
-759 137 122 102 84 75 74 78 91 108 116 106 85 70 72 86 93 88 82 88 107 129 143 144 135 120 104 89 77 65 56 55 65 80 91 95 94 89 75 49 23 15 33 70 107
-764 107 128 130 123 125 143 172 200 218 223 214 192 166 152 158 169 159 121 79 61 72 93 105 108 107 105 101 96 85 64 41 30 42 68 91 102 104 97 84 65 43 22
$$ packed form
-727A61K1J4N%ORnk9m1l3j8j6k1k0j4r%J7L9M7L4Qj2j3%J3J7J3J2J0jk0l3l5l5l7l4k4pPJ8
-732fK9M1L9K6J4Pjpj1poj3k4l0k9k2j4nLJ1J8K9L6L4K0Kj1rjORJ4J8J9J1jj3j9j8j4qnlL
-737A12J3J6J1NLKlpj3k2l9n1m3k7j0jJ2L0M3M4K6QKJ3K9L0J3rj5j0lmooljOJ6K1J6Njj%k
-743A99j1j7j4kLpk0k3j7rnjkj2k2j9%J7K2K4K3J3mj2mJ0J0jqrqpnk%NJ3J6PnnMJ4J9J6Nr
-749A60j3nkj3k7k0KJ0kj7j5rj0j8k1j5JJ7K9K6J3OQJ3J2Mnj5k1j4JJ1Mpj1jRJ7K1K1J4NN
-754A48RRMLPQkj4k1k3k5j9KK5L2J5j3l1k8j0J6L4L8K2Kj2k0l1m0l5j2J4K0OnlJ1K1K2J4j
-759A37j5k0j8rjMJ3J7Qj0k1j5KJ4PnoOJ9K2J4Jrj5j6j5j2j2rjJ0J5J1Mjnj4k6k6qJ8L7L7
-764A07K1KpKJ8K9K8J8Nrk2k6j4OJ1j0l8m2j8J1K1J2Ljkmnj1k1k3j1J2K6K3J1Kpj3j9k2k1
$$ plain form
-769 22 12 21 45 72 89 98 103 100 87 83 106 145 170 166 148 140 141 134 113 84 55 31 23 39 73 104 115 112 109 116 130 143 151 157 161 157 134 92 57 55 89 126 138 129 129
-775 129 156 195 218 215 197 174 152 131 113 92 63 36 26 38 51 56 69 106 155 177 163 134 112 94 69 44 31 27 25 32 52 73 71 50 35 40 49 46 35
-780 35 33 48 79 118 144 135 91 41 13 11 23 39 55 62 51 33 30 56 103 157 198 209 185 144 111 92 80 72 77 93 106 105 97 93 92 89 88 90 90 81 78 98 130 139
-785 139 106 50 4 -16 -20 -17 -11 -5 -2 0 9 26 46 62 76 94 113 123 115 96 84 91 106 105 84 59 52 62 74 84 100 129 157 167 155 131 109 95 92 97 97 78
-790 78 47 23 21 37 61 88 116 138 146 146 147 151 150 139 125 114 109 107 108 111 106 92 75 63 57 50 43 40 34 19 2 0 9 20 23 34 66 109 141 151 145 130 109 93 94 105
-796 105 106 85 55 35 26 24 26 34 37 24 1 -13 -10 0 9 18 37 61 77 75 61 45 31 20 9 -5 -24 -40 -46 -40 -25 -10 -1 2 9 28 55 79 95 105 116 121 113
-801 113 98 88 90 97 104 110 114 110 99 93 105 126 135 119 88 62 58 74 101 120 117 89 50 16 -4 -7 6 30 50 60 67 78 90 92 88 88 95 94 79 63 61 73 83 90
-806 90 98 104 94 67 39 30 35 43 53 70 89 102 103 104 116 139 156 151 125 92 73 72 80 85 82 72 57 36 12 -7 -19 -20 -12 6 33 64 90 106 107 97 89 96 119 146
$$ packed form
-769B2j0RK4K7J7RNlj3mK3L9K5mj8qJpk1k9k9k4qJ6L4L1J1llPJ4J3QOMmk3m2l5kL4L7J2r%
-775A29K7L9K3lj8k3k2k1j8k1k9k7j0J2J3NJ3L7M9K2j4k9k2j8k5k5j3mkPK0K1kk1j5NRlj1
-780C5kJ5L1L9K6rm4n0k8kJ2J6J6Pj1j8lK6M7N4M1J1k4m1l3j9j2qNJ6J3jqmjljK%rlK0L2R
-785A39l3n6m6k0mLOOLKRJ7K0J6J4J8J9J0qj9j2PJ5jk1k5pJ0J2J0J6K9K8J0j2k4k2j4lN%j9
-790G8l1k4kJ6K4K7K8K2Q%JMjj1j4j1nkJLnj4j7j2opploj5j7kRJ1LJ1L2M3L2J0oj5k1j6JJ1
-796A05Jk1l0k0rkKQLj3k3j4LJ0RRJ9K4J6kj4j6j4j1j1j4j9j6oOJ5J5RLPJ9K7K4J6J0J1Nq
-801A13j5j0KPPOMmj1oJ2K1Rj6l1k6mJ6K7J9lk8l9l4k0lJ3K4K0J0PJ1J2Km%Pjj5j6kJ2J0P
-806I0QOj0k7k8rNQJ0J7J9J3JJJ2K3J7nk6l3j9jQNlj0j5k1k4j9j2jQJ8K7L1K6J6Jj0qPK3K7
$$ plain form
-812 146 160 156 144 137 146 173 208 235 242 233 216 201 189 177 159 138 119 110 110 113 114 114 111 100 80 61 59 75 94 101 97 89 80 70 60 53 45 34 31 46 74 96 98 83 63
-817 63 38 10 -10 -8 13 38 45 34 22 23 41 63 78 86 95 108 114 105 90 87 99 111 109 96 87 92 110 131 145 147 141 141 153 163 158 135 113 105 112 121 126 127 125 119 107 96
-823 96 93 95 91 78 74 89 110 116 106 102 119 142 144 118 78 43 28 40 74 107 113 93 67 52 46 40 33 24 12 6 19 56 99 126 137 144 151 151 140 126 121 129 147 161
-828 161 158 136 109 99 112 128 127 106 78 53 29 4 -6 6 35 56 55 41 28 20 17 25 50 82 102 110 118 129 132 123 119 134 157 164 150 127 111 100 95 99 113 129
-833 129 142 154 165 166 154 145 155 179 195 183 149 110 80 69 80 109 137 147 139 132 134 137 127 105 88 84 88 90 83 72 65 73 93 105 92 65 53 70 94 103 97 94
-838 94 99 104 102 97 88 72 53 45 57 80 100 104 92 67 37 13 0 -4 -11 -26 -43 -50 -39 -14 16 46 77 106 125 128 126 132 139 132 116 111 126 145 153 155 159 158 140 107 75
-844 75 52 38 31 33 41 49 55 59 54 39 29 41 69 92 99 101 107 109 96 82 83 95 94 69 37 20 24 32 33 26 20 24 38 54 66 71 73 72 67 60 54 55 65 81 99 110 106 84 50
-850 50 30 44 86 125 131 99 46 -4 -31 -26 1 28 41 41 40 44 51 59 65 66 65 72 90 110 127 147 174 195 190 160 125 94 61 24 -3 -17 -27 -40 -42 -20 14 33
$$ packed form
-812A46J4mj2pRK7L5K7Prj7j5j2j2j8k1j9r%LJ%lj1k0j9kJ6J9Pmqrj0j0pqj1lJ5K8K2Kj5k0
-817F3k5k8k0KK1K5Pj1j2JJ8K2J5QRJ3Orj5lJ2J2kj3rNJ8K1J4Ko%J2J0nk3k2qPRNJkoj2j1
-823I6lKmj3mJ5K1Oj0mJ7K3Kk6m0l5j5J2L4L3Ok0k6j5ooprj2oJ3L7M3K7J1PP%j1j4nQJ8J4
-828A61lk2k7j0J3J6jk1k8k5k4k5j0J2K9K1jj4j3qlQK5L2K0QQJ1LrmJ5K3Pj4k3j6j1nMJ4J6
-833A29J3J2J1Jj2rJ0K4J6j2l4l9l0j1J1K9K8J0qpKLj0k2j7mMKpj1pQK0J2j3k7j2J7K4Rol
-838I4NNknrj6j9qJ2K3K0Mj2k5l0k4j3mpj5j7pJ1K5L0L0L1K9J9LkOPpj6nJ5J9QKMjj8l3l2
-844G5k3j4pKQQOMnj5j0J2K8K3PKOKj3j4JJ2jk5l2j7MQJpoMJ4J6J2NKjnpoJJ0J6J8J1mk2l4
-850E0k0J4M2L9Ol2n3n0k7NK7K7J3%jMPQOJjPJ8K0J7K0K7K1nl0l5l1l3l7k7j4j0j3kK2L4J9
$$ plain form
-855 33 29 20 20 26 33 46 69 88 83 50 11 -9 -3 20 45 64 76 84 86 85 87 98 115 131 145 159 165 150 111 68 47 53 67 68 62 67 96 132 150 142 120 100 89 94
-860 94 115 139 139 107 68 51 60 71 68 54 35 17 6 12 32 49 50 37 21 8 5 15 33 42 39 35 39 37 12 -31 -65 -73 -65 -59 -60 -59 -48 -26 0 21 22 3 -20 -33
-866 -33 -29 -11 15 40 52 46 33 28 34 40 36 29 29 38 54 72 88 95 84 63 47 51 72 94 104 99 89 85 89 100 115 132 144 146 139 134 137 142 139 130 124 121 111 93 80 78 77 62
-872 62 32 0 -28 -60 -91 -112 -113 -96 -69 -37 -3 28 50 57 50 35 21 16 21 31 43 55 61 58 48 39 29 11 -13 -38 -53 -52 -36 -9 15 26 26 25 28 31 31 37 53
-877 53 71 85 99 112 108 78 44 36 62 96 116 118 109 90 60 31 10 2 9 34 72 104 114 106 101 109 122 126 119 112 114 117 104 72 37 17 11 7 4 10 27 47 67 88
-882 88 106 112 109 110 123 137 142 140 144 152 152 139 120 107 101 103 113 129 141 140 124 107 103 114 125 117 93 71 64 69 71 58 33 6 -8 -2 20 42 47 38 28 26 33 44 47 35
-888 35 3 -37 -73 -94 -99 -85 -54 -14 19 42 54 63 68 69 67 62 56 47 41 38 36 30 16 -7 -37 -64 -77 -67 -33 16 65 100 114 111 95 79 74 86 113 145 168 173 159
-893 159 129 92 55 19 -12 -40 -64 -88 -108 -109 -86 -58 -47 -52 -50 -28 -5 -3 -17 -23 -13 2 12 16 23 36 55 73 83 84 84 88 89 83 73 66 57 36 4 -25 -42 -46
$$ packed form
-855C3mr%OPJ3K3J9nl3l9k0OK3K5J9J2QKjKJ1J7J6J4J4Oj5l9m3k1OJ4JoNK9L6J8qk2k0j1N
-860I4K1K4%l2l9j7RJ1lj4j9j8j1OK0J7Jj3j6j3lJ0J8RlmMkk5m3l4qQOjJJ1K2K6K1Jj9k3j3
-866c3MJ8K6K5J2oj3nOOmp%RJ6J8J6Pj1k1j6MK1K2J0nj0mMJ1J5J7J2KpnLNlrolj0j8j3kjj5
-872F2l0l2k8l2l1k1jJ7K7L2L4L1K2Ppj5j4nNJ0J2J2Olj0rj0j8k4k5j5JJ6K7K4J1%jLL%OJ6
-877E3J8J4J4J3ml0l4qK6L4K0Krj9l0k9k1qPK5L8L2J0qnQJ3MppKLj3l2l5k0omlOJ7K0K0K1
-882H8J8OlJJ3J4NkMQ%j3j9j3oKJ0J6J2jj6j7mJ1J1qk4k2pNKj3k5k7j4OK2K2Nrj0kPJ1Lj2
-888C5l2m0l6k1nJ4L1M0L3K3J2RNJknorolkoj4k3l0k7j3J0L4M9M9L5J4lj6j6nJ2K7L2K3Nj4
-893A59l0l7l7l6l1k8k4k4k0jK3K8J1nKK2K3Kj4oJ0J5J0MPJ3J9J8J0J%MJoj0prk1l2k9j7m
$$ plain form
-898 -46 -40 -24 5 42 78 105 115 112 103 99 94 85 80 87 97 90 64 46 59 91 110 97 61 20 -13 -36 -42 -31 -9 11 20 17 13 18 28 36 41 55 76 93 91 74 52 29
-904 29 6 -14 -27 -26 -14 2 16 21 20 16 7 -11 -35 -44 -33 -18 -14 -18 -19 -17 -18 -17 -2 23 48 63 68 63 43 15 -2 0 8 4 -18 -42 -47 -26 6 29 40 50 71 91
-909 91 102 107 116 122 110 84 68 74 87 95 96 93 83 66 52 41 24 -2 -22 -16 6 19 7 -14 -28 -27 -13 12 52 98 140 168 184 194 202 196 173 147 139 152 166
-914 166 160 137 116 106 98 83 58 36 26 24 20 6 -7 -13 -11 -8 -7 -6 -8 -21 -49 -77 -88 -78 -53 -28 -13 -10 -6 12 36 44 32 15 6 -2 -21 -42 -50 -49 -46 -40 -22 6
-920 6 33 61 98 142 176 186 179 165 150 136 122 111 104 106 118 133 141 147 154 157 149 136 128 123 109 83 55 32 14 8 19 37 36 9 -23 -43 -56 -77 -103 -120 -125 -119 -105
-925 -105 -83 -61 -46 -33 -21 -19 -35 -50 -31 31 113 174 195 181 149 120 108 107 105 97 95 112 142 163 159 138 120 120 135 150 158 161 168 177 174 152 118 94 98 121 135
-930 135 119 81 49 39 45 58 77 99 116 128 145 173 194 189 161 131 105 79 57 58 88 128 147 135 101 62 30 10 3 8 20 29 28 16 9 16 32 36 26 16
-935 16 18 31 48 68 86 89 70 42 26 28 42 53 54 41 20 6 15 40 62 67 61 54 49 42 30 12 -8 -28 -43 -45 -35 -20 -12 -14 -22 -20 3 47 90 107 89 49 19
$$ packed form
-898d6OJ6K9L7L6K7J0lrmnrnPJ0pk6j8J3L2J9j3l6m1l3k3oJ1K2K0RlmNJ0QNJ4K1J7kj7k2k3
-904B9k3k0j3JJ2J6J4Njmrj8k4rJ1J5MmjKjJJ5K5K5J5Nnk0k8j7KQmk2k4nK1L2K3J1J0K1K0
-909I1J1NROj2k6j6OJ3QJlj0j7j4j1j7k6k0OK2J3j2k1j4JJ4K5M0M6M2K8J6J0Qok3k6qJ3J4
-914A66ok3k1j0qj5k5k2j0kmj4j3oKLJJkj3k8k8j1J0K5K5J5LMJ8K4Qj2j7rqj9k1qJLOJ8K8
-920FK7K8L7M4L4J0pj4j5j4j4j1pKJ2J5QOPLqj3qnj4k6k8k3j8oJ1J8jk7l2k0j3k1k6j7nOJ4
-925a05K2K2J5J3J2Kj6j5J9O2Q2O1K1j4l2k9j2jkqkJ7L0K1mk1j8%J5J5QLPRlk2l4k4MK3J4
-930A35j6l8l2j0OJ3J9K2J7J2J7K8K1nk8l0k6k6k2JL0M0J9j2l4l9l2k0pNJ2Rjj2pPJ6Mj0j0
-935A6KJ3J7K0J8Lj9k8j6KJ4J1Jj3k1j4RK5K2Nopnpj2j8k0k0j5kJ0J5QkqKK3M4M3J7j8m0l0
$$ plain form
-940 19 16 33 51 59 59 52 36 18 15 37 68 84 76 59 49 45 42 37 35 32 29 30 39 53 64 73 89 110 118 98 60 27 18 30 49 64 71 68 52 26 -4 -35 -60 -75 -77
-945 -77 -72 -65 -56 -43 -22 3 29 51 67 79 93 106 109 93 63 43 47 71 101 122 129 118 92 61 38 25 21 25 34 35 20 -2 -17 -13 0 12 14 3 -20 -50 -65
-950 -65 -55 -29 -8 -2 -6 -7 -2 5 12 12 5 -1 -2 3 6 2 -3 -5 -4 -5 -2 11 34 47 39 19 4 3 9 17 31 52 72 82 83 87 99 117 134 144 148 149 150 148 145 145 150 156 158 156 154 150 137
-957 137 117 99 89 83 77 75 87 106 116 113 106 108 118 121 109 84 60 45 38 38 54 89 124 132 105 66 46 44 39 23 12 18 31 31 15 -6 -22 -28 -22 -9 -4 -15 -31
-962 -31 -41 -44 -54 -67 -58 -14 51 110 140 142 125 101 83 79 86 97 104 108 110 108 102 94 88 86 79 61 33 9 3 15 27 25 9 -8 -20 -22 -12 0 9 9 11 27 54 75 83 84
-968 84 85 85 80 74 78 90 102 108 111 110 103 87 66 48 40 39 40 32 14 -3 -6 10 37 58 59 41 15 -4 -13 -15 -17 -19 -16 -9 -10 -22 -37 -46 -43 -32 -14 9 33 50 57 56 50 37 20
-974 20 6 2 11 25 34 32 31 44 67 84 87 86 96 104 87 44 4 -4 10 23 22 20 27 39 42 31 11 -6 -12 -4 15 44 79 118 146 152 141 129 126 126 124 131 158 190 198 168
-979 168 120 81 59 43 32 32 39 40 31 23 34 56 68 57 35 24 31 46 57 61 56 41 21 12 21 36 32 1 -43 -83 -114 -131 -126 -96 -61 -45 -46 -42 -19 5 16 14
$$ packed form
-940A9lJ7J8Q%pj6j8lK2L1J6qj7j0mlnkllJRJ4J1RJ6K1Qk0l8l3rJ2J9J5Plj6k6l0l1k5j5k
-945g7NPRJ3K1K5K6K2J6J2J4J3Lj6l0k0MK4L0K1Pj1k6l1k3j3mMRJj5k2j5MJ3J2Kj1k3l0j5
-950f5J0K6K1OmjNPP%pojNLmnkJjLJ3K3J3qk0j5jOQJ4K1K0J0JMJ2J8J7J0MJJkl%NOKkkmj3
-957A37k0j8j0ookJ2J9J0lpKJ0Lj2k5k4j5p%J6L5L5Qk7l9k0knj6j1OJ3%j6k1j6oOJ3Nj1j6
-962c1j0lj0j3RM4O5N9L0Kj7k4j8mPJ1PMKkoqokpj8k8k4oJ2J2kj6j7j2kJ0J2R%KJ6K7K1QJ
-968H4J%noMJ2J2OLjpj6k1j8qjJqj8j7lJ6K7K1Jj8k6j9rkkkLPjj2j5rLJ1J8K3K4J7Pjoj3j7
-974B0j4mRJ4RkjJ3K3J7LjJ0Qj7m3m0qJ4J3jkPJ2Lj1k0j7oQJ9K9L5L9K8Oj1j2l%kPK7L2Ql0
-979A68m8l9k2j6j1%PJrqJ1K2J2j1k2j1PJ5J1Mnj5k0rRJ5ml1m4m0l1j7NL0L5J6jMK3K4J1k
$$ plain form
-985 14 18 35 62 92 119 127 105 64 28 10 2 -11 -35 -60 -74 -69 -46 -14 10 18 11 -1 -18 -33 -41 -37 -24 -14 -17 -30 -39 -32 -11 8 21 31 41 42 28 12 9 17
-990 17 19 6 -14 -33 -49 -59 -53 -31 -9 -2 -2 3 17 27 33 41 52 60 66 73 78 73 63 58 59 55 44 35 31 24 11 0 -9 -21 -42 -62 -73 -80 -96 -116 -129 -131 -130 -126 -113 -88 -58
-995 -58 -24 16 67 120 159 178 182 183 184 174 140 88 40 11 2 8 30 74 126 160 161 140 113 86 57 26 0 -17 -25 -28 -29 -24 -12 1 1 -16 -38 -40 -15 23 57
-1000 57 78 83 71 46 23 17 34 69 111 146 162 160 157 168 187 194 182 161 141 121 103 92 91 90 82 74 74 80 80 69 49 22 -7 -32 -45 -56 -75 -93 -91 -70 -54
-1005 -54 -59 -68 -60 -37 -22 -22 -20 -2 23 44 58 74 96 119 142 161 168 151 113 72 54 63 85 99 98 94 90 82 69 64 74 90 91 74 52 39 32 31 42 68 99 123
-1011 123 144 166 182 176 145 110 85 70 53 33 17 10 4 -6 -20 -23 -11 12 37 58 73 78 66 44 33 50 88 125 143 149 154 158 152 136 118 111 113 112 95 62
-1015 62 26 1 -5 1 12 16 13 12 21 36 46 44 38 33 28 23 23 38 69 104 129 141 143 141 139 140 147 161 180 196 191 159 112 70 42 23 10 6 10 17 19 13 -1 -21 -27 -3 50
-1021 50 102 125 118 100 81 63 47 41 48 57 57 45 29 14 10 19 33 45 52 60 69 72 66 60 65 77 81 67 44 30 38 62 80 75 48 17 0 -3 0 11 29 52 70 76 71
$$ packed form
-985A4MJ7K7L0K7Qk2m1l6j8qj3k4k5j4NK3L2K4Qpj2j7j5qMJ3J0lj3rPK1J9J3J0J0Jj4j6lQ
-990A7Kj3k0j9j6j0OK2K2P%NJ4J0OQJ1QOPNnj0nJmj1rmpj3j1rj2k1k0j1pj6k0j3kJMJ3K5L0
-995e8L4M0N1N3L9J9MJJj0l4n2m8k9rOK2M4N2L4Jk1k7k7k9l1k6j7qljNJ2J3%j7k2kK5L8L4
-1000E7K1Nj2k5k3oJ7L5M2L5J6klJ1J9Pj2k1k0k0j8j1jjqq%O%j1k0k7k9k5j3j1j9j8KK1J6
-1005e4nrQK3J5%KJ8K5K1J4J6K2K3K3J9Pj7l8m1j8RK2J4jmmqj3nJ0J6Jj7k2j3pjJ1K6L1K4
-1011A23K1K2J6ol1l5k5j5j7k0j6poj0j4lJ2K3K5K1J5Nj2k2j1J7L8L7J8ONMoj6j8pKjj7l3
-1015F2l6k5oOJ1MljRJ5J0konnn%J5L1L5K5J2KkkJPJ4J9J6nl2m7m2k8j9j3mMPKoj4k0oK4N3
-1021E0N2K3pj8j9j8j6oPR%j2j6j5mRJ4J2PQRLooNJ2Mj4k3j4QK4J8nk7l1j7lLJ1J8K3J8On
$$ plain form
-1027 71 58 45 41 50 64 61 33 -10 -49 -64 -47 -7 36 61 60 40 12 -16 -41 -59 -64 -60 -48 -24 8 39 52 45 28 10 4 16 40 57 56 48 46 41 15 -27 -63
$$ packed form
-1027G1j3j3mRJ4lk8m3l9j5J7M0M3K5jk0k8k8k5j8nMJ2K4L2L1J3pj7j8oJ2K4J7jqknk6m2l6
$$ [...]
-1604F70
##END=	
##END=	
