##TITLE=	Mar21-2022.70.fid
TM-VI-01X, dmso-d6

##JCAMP-DX=	6.0	$$ MestReNova 14.3.1-31739
##DATA TYPE=	LINK
##BLOCK_ID=	1
##BLOCKS=	2    
##ORIGIN=	Mestrelab Research S.L.
##OWNER=	hrzepa
##$MNOVA/LINK_BLOCK_TYPE=	ITEM	$$ NMR Spectrum
##$MNOVA/ITEM/POLYGON=	(XY..XY)
5321,5835
8722,5835
8722,8208
5321,8208
5321,5835
##$MNOVA/ITEM/Z=	0
##$MNOVA/ITEM/ANGLE=	0
##TITLE=	Mar21-2022.70.fid
##JCAMP-DX=	6.0	$$ MestReNova 14.3.1-31739
##BLOCK_ID=	2
##DATA TYPE=	MNOVA NMR VIEW DATA
##DATA CLASS=	MNOVA VIEW DATA
##$MNOVA/ITEM/ZOOM/X=	-4.0107147498308073352,	16.011019999997905927
##$MNOVA/ITEM/ZOOM/Y=	-1547.658233605325222,	17025.5228271484375
##END=	
##TITLE=	Mar21-2022.70.fid
##JCAMP-DX=	6.0	$$ MestReNova 14.3.1-31739
##BLOCK_ID=	3
##DATA TYPE=	NMR SPECTRUM
##DATA CLASS=	XYDATA
##NUMDIM=	1
##ORIGIN=	Bruker BioSpin GmbH
##OWNER=	nmr
##.OBSERVE FREQUENCY=	400.20240119999999706
##.OBSERVE NUCLEUS=	^1H
##.SOLVENT NAME=	DMSO
##.PULSE SEQUENCE=	zg30
##LONGDATE=	2022/03/21 18:23:00.000
##.ACQUISITIONMODE=	SIMULTANEOUS (DQD)
##$ORIGINAL FORMAT=	Bruker XWIN-NMR
##$MNOVA/SCALES_VERSION=	9
##$PARAMETER FILE=	(acqus, ASCII, /private/var/folders/f6/rjf_tdyn2v98c5c0wvkgn4s80000gn/T/nugJsw3FS2+H+2rD$TnX5A/70/acqus, 0)
$$ ##TITLE= Parameter file, TOPSPIN		Version 3.2
$$ ##JCAMPDX= 5.0
$$ ##DATATYPE= Parameter Values
$$ ##NPOINTS= 11	$$ modification sequence number
$$ ##ORIGIN= Bruker BioSpin GmbH
$$ ##OWNER= nmr
$$ $$ 2022-03-21 18:23:44.044 +0000  nmr@CZC2439F63
$$ $$ /opt/topspin/data/agmb/nmr/Mar21-2022/70/acqus
$$ $$ process /opt/topspin3.2/prog/mod/shimcntl
$$ ##$ACQT0= -2.36344537815126
$$ ##$AMP= (0..31)
$$ 100 100 100 100 100 100 100 100 100 100 100 100 100 100 100 100 100 100
$$ 100 100 100 100 100 100 100 100 100 100 100 100 100 100
$$ ##$AMPCOIL= (0..19)
$$ 0 0 0 0 0 0 0 0 0 0 0 0 0 0 0 0 0 0 0 0
$$ ##$ANAVPT= -1
$$ ##$AQSEQ= 0
$$ ##$AQ_mod= 3
$$ ##$AUNM= <au_zg>
$$ ##$AUTOPOS= <34 >
$$ ##$BF1= 400.2
$$ ##$BF2= 400.2
$$ ##$BF3= 400.2
$$ ##$BF4= 400.2
$$ ##$BF5= 400.2
$$ ##$BF6= 400.2
$$ ##$BF7= 400.2
$$ ##$BF8= 400.2
$$ ##$BYTORDA= 0
$$ ##$CAGPARS= (0..11)
$$ 0 0 0 0 0 0 0 0 0 0 0 0
$$ ##$CFDGTYP= 0
$$ ##$CFRGTYP= 9
$$ ##$CHEMSTR= <none>
$$ ##$CNST= (0..63)
$$ 1 1 145 1 1 1 1 1 1 1 1 1 1 1 1 1 1 1 1 1 1 1 1 1 1 1 1 1 1 1 1 1 1 1 1
$$ 1 1 1 1 1 1 1 1 1 1 1 1 1 1 1 1 1 1 1 1 1 1 1 1 1 1 1 1 1
$$ ##$CPDPRG= (0..8)
$$ <> <> <> <> <mlev> <mlev> <mlev> <mlev> <mlev>
$$ ##$D= (0..63)
$$ 0 1 0 0 0 0 0 0 0 0.06 0 0 0 0 0 0 0.0002 0 0 0 0 0 0 0 0 0 0 0 0 0 0 0
$$ 0 0 0 0 0 0 0 0 0 0 0 0 0 0 0 0 0 0 0 0 0 0 0 0 0 0 0 0 0 0 0 0
$$ ##$DATE= 1647887023
$$ ##$DE= 6.5
$$ ##$DECBNUC= <off>
$$ ##$DECIM= 2496
$$ ##$DECNUC= <off>
$$ ##$DECSTAT= 4
$$ ##$DIGMOD= 1
$$ ##$DIGTYP= 12
$$ ##$DQDMODE= 0
$$ ##$DR= 22
$$ ##$DS= 2
$$ ##$DSPFIRM= 0
$$ ##$DSPFVS= 20
$$ ##$DTYPA= 0
$$ ##$EXP= <proton>
$$ ##$F1LIST= <111111111111111>
$$ ##$F2LIST= <222222222222222>
$$ ##$F3LIST= <333333333333333>
$$ ##$FCUCHAN= (0..9)
$$ 0 2 0 0 0 0 0 0 0 0
$$ ##$FL1= 90
$$ ##$FL2= 90
$$ ##$FL3= 90
$$ ##$FL4= 90
$$ [...]
$$ ##$Sgu3PowerLevels= (0..7)
$$ 0 0 0 0 0 0 0 0
$$ ##$Sgu4PowerLevels= (0..7)
$$ 0 0 0 0 0 0 0 0
$$ ##$Sgu5PowerLevels= (0..7)
$$ 0 0 0 0 0 0 0 0
$$ ##$Sgu6PowerLevels= (0..7)
$$ 0 0 0 0 0 0 0 0
$$ ##$Sgu7PowerLevels= (0..7)
$$ 0 0 0 0 0 0 0 0
$$ ##$Sgu8PowerLevels= (0..7)
$$ 0 0 0 0 0 0 0 0
$$ ##$SguType= 3
$$ ##$ShimPowMaxUA= (0..63)
$$ 130000 130000 130000 130000 130000 130000 130000 130000 130000 130000 130000
$$ 130000 130000 130000 130000 130000 130000 130000 130000 130000 0 0 0 0
$$ 0 0 0 0 0 0 0 0 0 0 0 0 0 0 0 0 0 0 0 0 0 0 0 0 0 0 0 0 0 0 0 0 0 0 0 0
$$ 0 0 0 0
$$ ##$ShimPowMaxUC= (0..63)
$$ 130000 130000 130000 130000 130000 130000 130000 130000 130000 130000 130000
$$ 130000 130000 130000 130000 130000 130000 130000 130000 130000 0 0 0 0
$$ 0 0 0 0 0 0 0 0 0 0 0 0 0 0 0 0 0 0 0 0 0 0 0 0 0 0 0 0 0 0 0 0 0 0 0 0
$$ 0 0 0 0
$$ ##$ShimPowMaxUG= (0..63)
$$ 524287 524287 524287 524287 524287 524287 524287 524287 524287 524287 524287
$$ 524287 524287 524287 524287 524287 524287 524287 524287 524287 0 0 0 0
$$ 0 0 0 0 0 0 0 0 0 0 0 0 0 0 0 0 0 0 0 0 0 0 0 0 0 0 0 0 0 0 0 0 0 0 0 0
$$ 0 0 0 0
$$ ##$ShimPowRcbType= 3
$$ ##$ShimPowRes= (0..63)
$$ 1e-20 1e-20 1e-20 1e-20 1e-20 1e-20 1e-20 1e-20 1e-20 1e-20 1e-20 1e-20
$$ 1e-20 1e-20 1e-20 1e-20 1e-20 1e-20 1e-20 1e-20 0 0 0 0 0 0 0 0 0 0 0 0
$$ 0 0 0 0 0 0 0 0 0 0 0 0 0 0 0 0 0 0 0 0 0 0 0 0 0 0 0 0 0 0 0 0
$$ ##$ShimPowRng0= (0..63)
$$ 1 1 1 1 1 1 1 1 1 1 1 1 1 1 1 1 1 1 1 1 0 0 0 0 0 0 0 0 0 0 0 0 0 0 0 0
$$ 0 0 0 0 0 0 0 0 0 0 0 0 0 0 0 0 0 0 0 0 0 0 0 0 0 0 0 0
$$ ##$ShimPowRng1= (0..63)
$$ 1 1 1 1 1 1 1 1 1 1 1 1 1 1 1 1 1 1 1 1 0 0 0 0 0 0 0 0 0 0 0 0 0 0 0 0
$$ 0 0 0 0 0 0 0 0 0 0 0 0 0 0 0 0 0 0 0 0 0 0 0 0 0 0 0 0
$$ ##$ShimPowRng2= (0..63)
$$ 1 1 1 1 1 1 1 1 1 1 1 1 1 1 1 1 1 1 1 1 0 0 0 0 0 0 0 0 0 0 0 0 0 0 0 0
$$ 0 0 0 0 0 0 0 0 0 0 0 0 0 0 0 0 0 0 0 0 0 0 0 0 0 0 0 0
$$ ##$ShimPowRng3= (0..63)
$$ 1 1 1 1 1 1 1 1 1 1 1 1 1 1 1 1 1 1 1 1 0 0 0 0 0 0 0 0 0 0 0 0 0 0 0 0
$$ 0 0 0 0 0 0 0 0 0 0 0 0 0 0 0 0 0 0 0 0 0 0 0 0 0 0 0 0
$$ ##$ShimSysFunc= (0..63)
$$ 1 2 3 4 5 7 9 11 15 16 8 10 12 14 6 17 13 18 19 20 0 0 0 0 0 0 0 0 0 0
$$ 0 0 0 0 0 0 0 0 0 0 0 0 0 0 0 0 0 0 0 0 0 0 0 0 0 0 0 0 0 0 0 0 0 0
$$ ##$ShimSysMatrix= 0
$$ ##$ShimSysType= 1
$$ ##$TFXNUM= 0
$$ ##$TRIPLO2= 0
$$ ##$VTU= 2
$$ ##$VTUETH= <149.236.99.20>
$$ ##$VTUTY= <no>
$$ ##$WBREFAM= (0..15)
$$ 135.5 97.7 100 100 100 100 100 100 100 100 100 100 100 100 100 100
$$ ##$WBREFLM= (0..15)
$$ 0 0 0 0 0 0 0 0 0 0 0 0 0 0 0 0
$$ ##$WBREFPH= (0..15)
$$ 72.26 -67.22 0 0 0 0 0 0 0 0 0 0 0 0 0 0
$$ ##$WBSGU= (0..15)
$$ 0 0 0 0 0 0 0 0 0 0 0 0 0 0 0 0
$$ ##$XFAC= 2
$$ ##END=
$$ 
##$DECIM=	2496
##$DSPFVS=	20
##XUNITS=	HZ
##YUNITS=	ARBITRARY UNITS
##FIRSTX=	6407.6102040000005218
##LASTX=	-1605.0880428824991668
##DELTAX=	-0.12226593800080109986
##XFACTOR=	1
##YFACTOR=	0.016768928420305920929
##FIRSTY=	10.208307266235351563
##MINY=	0.11654666811227798462
##MAXY=	15477.748046875
##NPOINTS=	65536
##XYDATA=	(X++(Y..Y))
$$ [...]
1855H50M0P6N4J1j6k7k4kK3J1l0m7j5L0K4k5o1m7qJ4J2QJ2J3mj9nK9M4J9j7k5j1nj1j5j6j7
1850H23mL3O1L8j3l3rNk0l1J0N6L6k7n1j5K5K9K4L1K8%k2j4PJ1QJ0Nj1j5NJ5j4l9j4L4L2k1
1845I73m2JL8Qm7n2j1Qpj3J1L0K1RK0L5K2qk1rLnk1k8j1K1M0K0l4p6o2jM8N1L1K1J4j6n0m4
1840H67ML2Nl3k3K2M1J7kNJ1pk1j6j2k0nM4P0K4m9p4l6OK4K6J9rk8OO6P6Po3o7k1J8L5L7J4
1835I90k7m5j7J6Mk6j9K9N9L8j5n7o4l1J6L1Jk8j1L1M6K7NlpnJ7L3J3k0j5K0K3j8l8rJ7nk6
1831I30MM7L7j3l2mJ8Mj0kPnj9j3oj7l1k0QJ9Lj5mL7O6M2k0o1l7J9M6L1Rkk5n5m5K2P8N9j2
1826A038n0j8K8L6J4%%Ljlj0j7j8j0j3k9k9NL7K8pj0K3M0Pl8m1qJ8J6kk3l1j5K1M9M4K3Nj7
1821A045m7n1%O0N0k5o8k1M5L9k3n1j1L0K3qj5KJ4J9K9K5j2n8n9j1K8J4l1m8j4L3O1N8L0q
$$ plain form
1855 850 890 966 1020 1031 1015 988 964 962 985 996 966 919 904 934 958 933 872 825 817 831 843 851 863 876 872 853 848 877 921 940 923 898 887 882 871 856 840 823
1850 823 819 852 913 951 938 905 896 901 881 850 860 916 952 925 874 859 884 913 937 968 996 996 974 960 967 978 986 996 1001 990 975 980 995 981 942 928 962 994 973
1845 973 931 932 970 978 931 879 868 876 869 856 867 897 918 927 947 982 1004 996 975 966 969 964 943 915 904 925 965 985 951 875 813 812 860 911 942 963 977 961 911 867
1840 867 871 903 908 875 852 874 915 932 930 935 946 939 918 902 890 870 865 909 979 1003 954 880 844 850 874 900 919 910 882 888 954 1030 1037 974 907 886 904 939 976 990
1835 990 963 918 901 917 921 895 876 905 964 1002 987 930 866 835 851 882 883 855 844 875 921 948 953 950 943 938 955 988 1001 981 966 986 1009 991 953 944 961 956 930
1831 930 934 981 1018 1005 973 969 987 991 981 979 986 981 962 949 943 926 895 875 883 902 905 890 886 923 989 1031 1011 950 913 932 978 1009 1018 1016 991 936 891 913 991 1050 1038
1826 1038 988 970 998 1034 1048 1048 1048 1051 1050 1047 1037 1020 1002 992 979 950 921 926 963 991 984 974 997 1037 1044 1006 965 957 975 991 989 966 935 920 941 990 1034 1057 1062 1045
1821 1045 998 947 947 1007 1057 1032 964 943 988 1027 1004 953 942 972 995 987 972 974 988 1007 1036 1061 1049 991 932 921 949 963 932 884 870 903 964 1022 1052 1044
1816A044l6k8OK8J2k1l6k7nJ9M3M7J8j4j2J5J8j5m5l3kMj7k6jL9N8M9K7J4J5J1ok5k3KJ8M
1812A119j9j8J0L9M3K1k2o3q1n5jL9M1K4J4J2ll3m7k8NK0J5J0J5J4OKQMj7l4k6j5k1j7J2L5
1807A008J7j5pK7K2k4m1%L3Nl6l4prj5K1P0O2lm7l3LK2K2Pk1l6qL3K5k3l4K1P4O7J7k1m1m3
1802A058j2M2O5K2l7n6m2l5l4j2J7K7K7L5L0j2m8k0M0M1k4o4k9K3K4kkJ8J7knOmk6k9j1jj
1798I84J1L6L6Lk3j0J5Ml5m7rM2N3J9j9k6qRJ4J4J2NLJ7M0M1%m9o1k4J8K4jk5k1LK4K4J0%
1793A103jrk9l3JM3M2Kk2MK8Jm9n1KL9K0j2mK2J4k4l6mL6L9J7QJ7K1Mk3m0l6k4mJ8L6K9pm2
1788A096m4k0nnkJ3J7RRK2J9j2l3j0J6Jk4nM2M1ok1J6L4j6o5m3J6K8lnL2M1km3l2RL2L1K6
1783A154K1J5J1RNnj7l2m5m2rK8L3J2QL2M4J0m0n6l1NK8K6Oj2lK0J0l8o2j9M4M5j0l6RO8O6
$$ plain form
1816 1044 1008 980 986 1014 1026 1005 969 942 937 956 999 1046 1064 1050 1038 1053 1071 1056 1011 978 976 980 963 937 936 975 1033 1082 1109 1123 1138 1149 1143 1118 1095 1097 1115 1119
1812 1119 1100 1082 1092 1131 1174 1195 1173 1110 1029 974 973 1012 1053 1077 1091 1103 1100 1067 1020 992 997 1017 1032 1042 1057 1071 1077 1079 1087 1091 1074 1040 1014 999 978 961 973 1008
1807 1008 1025 1010 1003 1030 1052 1028 987 987 1020 1025 989 955 948 939 924 945 1015 1077 1074 1027 994 997 1019 1041 1048 1027 991 983 1016 1041 1018 984 1005 1079 1146 1163 1142 1101 1058
1802 1058 1046 1088 1153 1175 1138 1082 1040 1005 971 959 976 1003 1030 1065 1095 1083 1035 1015 1055 1096 1072 1008 979 1002 1026 1024 1022 1040 1057 1055 1050 1056 1052 1026 997 986 985 984
1798 984 995 1031 1067 1070 1047 1037 1052 1056 1021 974 965 1007 1060 1079 1060 1034 1026 1035 1049 1063 1075 1080 1083 1100 1140 1181 1181 1132 1071 1047 1065 1089 1088 1063 1042 1045 1069 1093 1103 1103
1793 1103 1102 1093 1064 1031 1032 1075 1117 1119 1097 1101 1129 1130 1081 1030 1032 1071 1091 1079 1075 1097 1111 1087 1051 1047 1083 1122 1139 1147 1164 1185 1189 1166 1126 1090 1066 1062 1080 1116 1145 1138 1096
1788 1096 1052 1032 1027 1022 1020 1033 1050 1059 1068 1090 1109 1097 1064 1054 1070 1071 1047 1042 1084 1125 1119 1098 1114 1148 1132 1067 1024 1040 1068 1065 1060 1092 1133 1131 1088 1056 1065 1097 1128 1154
1783 1154 1175 1190 1201 1210 1215 1210 1193 1161 1116 1074 1065 1093 1126 1138 1146 1178 1222 1232 1192 1136 1105 1110 1138 1164 1170 1158 1155 1175 1185 1147 1085 1066 1110 1155 1145 1109 1118 1186 1252
1778A252Rl7l6rPjk2m0l8j1K2L9L2J3Jjjnqj3k5m4n1k0L2O2L9ok4mJ8J7MLRLj3k4k6j3J3M5
1773A148O0L6j9o4o6k9J7M4M1J7j0k6k1%K3L3K1ok6l0k9l3l3j4K4M2K6nj3KK0K7L5L6J2l2
1768A208n7l5J1L4K1kk0k9k2RM2L8j1n2l7J3L8J3j9j3K3M5K9rl2k5NL5M2J9j9m2m0k5j7j3
1764A106%J7L0L4L7L8K3ol3m1l3k4j2jJ0K1K8K7J0j1j0NRj2l1j5K3M7L8K0Nlmnrj4pK0L6J6
1759A329k1l6k0QK8L6J9j8l7j0L4M0Rj0rk5n8o2k1J1Kj1J5M4K8j1j9QK5J3oj8l1k9LL8M3K0
1755A301L%rk6k1KPj8m2l9j5MJ5J1LJ0M0O4M9J1ML1M4J8j4j9j1j4k2j9j4j6j8qpj8k4lK9L4
1750A303J2rj1%QKj2j4RL7M0K3QPok5k1J6M3L2J1K0M5M9L0K4L8N2M9M4M4L8L1M1O2N9J5m3
1745B051o4l9JJ5qn0p8q3p2m7j1J4%m1o1l5KJ2OMMqrJ5K8mm4j8N5Q3K9l4l7ML0L4L5L7K5J5
$$ plain form
1778 1252 1261 1224 1188 1179 1186 1185 1163 1123 1085 1074 1096 1135 1167 1180 1181 1180 1179 1174 1166 1153 1128 1084 1033 1013 1045 1107 1146 1140 1116 1112 1130 1147 1151 1154 1163 1166 1153 1129 1103 1090 1103 1148
1773 1148 1208 1244 1225 1161 1095 1066 1083 1127 1168 1185 1175 1149 1128 1128 1151 1184 1205 1199 1173 1143 1114 1081 1048 1034 1058 1100 1126 1121 1108 1110 1130 1157 1192 1228 1240 1208
1768 1208 1151 1116 1127 1161 1182 1180 1160 1131 1109 1118 1160 1198 1187 1135 1098 1111 1149 1162 1143 1130 1153 1198 1227 1218 1186 1161 1166 1201 1243 1262 1243 1201 1161 1136 1119 1106
1764 1106 1106 1123 1153 1187 1224 1262 1285 1279 1246 1205 1172 1148 1136 1135 1145 1166 1194 1221 1231 1220 1210 1215 1224 1212 1181 1166 1189 1236 1274 1294 1299 1296 1292 1287 1278 1264 1257 1277 1313 1329
1759 1329 1308 1272 1252 1260 1288 1324 1343 1325 1288 1278 1312 1352 1361 1351 1342 1317 1259 1197 1176 1187 1189 1178 1193 1237 1265 1254 1235 1243 1268 1281 1275 1257 1226 1197 1200 1238 1281 1301
1755 1301 1304 1304 1295 1269 1248 1250 1257 1239 1197 1158 1143 1147 1162 1173 1176 1186 1226 1290 1339 1350 1354 1385 1429 1447 1433 1414 1403 1389 1367 1348 1334 1318 1300 1292 1285 1267 1243 1240 1269 1303
1750 1303 1315 1306 1295 1295 1303 1305 1293 1279 1288 1325 1365 1388 1396 1403 1397 1372 1351 1367 1410 1442 1453 1473 1518 1567 1597 1621 1659 1711 1760 1804 1848 1886 1917 1958 2020 2079 2094 2051
1745 2051 1987 1948 1949 1964 1956 1906 1828 1745 1673 1626 1615 1629 1629 1588 1527 1492 1494 1506 1512 1516 1520 1512 1503 1518 1546 1542 1498 1480 1535 1618 1647 1613 1576 1580 1610 1644 1679 1716 1741 1756
1740A756K9O3R1J04J01Q6Q3J16J66J81J47J28J65K03J69Q6K4k3j02j92k01j31q6j28j77j54
1737B504j03j07j46j32o2k2m2o6l9NJ5j0l4m6n1m3j9J0L1M0L6J9ljK9N1M0Pj1lJ5L1M1M7N3
1733B034O6Q1Q3Q6J17J79K19K02J49J22J30J35J00L0m1q4r1r0j20j81k22k04j55j25j17r6
1729B207o4o0r3j15r3m4NL7L4j5p2p1rL7J9k2k6jNj0j2LRJ%POkLK0L9N1O0N8L9K1J8K7K7K6
1725B050M1O0O5N9N7M8Rm6p0o1n6p9j04j00o4j4K5K4j9o0m4KJ1l2n9k3K7K6j4l1mK2J5j4l0
1720A617k3pjnmJ6M5N2L5J5Oql7n8l8J0L6J9j1j4J1K7J2j2j1J5K9J2oJ1M4M7J4j8k3k0k3k5
1716A729j3%PJ3K0Ok0k9kK7K0rk2mK2L2K1KrLK0J8pk1qOj0k6nL3L2j6n5l7J5M5L3lk5j6J0
1711A777K0Kk5l0mL9P6Q3M3k2o0l9J5M7K7k4n9n4k2J1K8M5O7O4Qo7q7l3K6K2j3j9J3L8M2M1
$$ plain form
1740 1756 1785 1848 1939 2043 2144 2230 2313 2429 2595 2776 2923 3051 3216 3419 3588 3674 3698 3675 3573 3381 3180 3049 2963 2835 2658 2504
1737 2504 2401 2294 2148 2016 1954 1932 1890 1824 1785 1790 1805 1795 1761 1715 1664 1621 1602 1612 1643 1683 1719 1738 1735 1734 1763 1814 1854 1861 1850 1847 1862 1893 1934 1981 2034
1733 2034 2100 2181 2264 2350 2467 2646 2865 3067 3216 3338 3468 3603 3703 3733 3692 3608 3517 3427 3307 3126 2904 2700 2545 2420 2303 2207
1729 2207 2143 2083 1990 1875 1782 1738 1743 1780 1814 1799 1727 1656 1647 1684 1703 1681 1655 1654 1659 1649 1637 1640 1649 1650 1650 1657 1663 1661 1664 1684 1723 1774 1834 1892 1931 1952 1970 1997 2024 2050
1725 2050 2091 2151 2216 2275 2332 2380 2389 2343 2273 2212 2156 2077 1973 1873 1809 1795 1820 1844 1825 1765 1721 1723 1734 1702 1643 1620 1647 1673 1659 1628 1624 1646 1661 1647 1617
1720 1617 1594 1587 1586 1581 1577 1593 1638 1690 1725 1740 1746 1738 1701 1643 1605 1615 1651 1670 1659 1645 1656 1683 1695 1683 1672 1687 1716 1728 1722 1733 1777 1824 1838 1820 1797 1777 1754 1729
1716 1729 1716 1716 1723 1736 1756 1762 1742 1713 1711 1738 1758 1749 1727 1723 1745 1777 1798 1800 1791 1794 1814 1832 1825 1804 1796 1802 1792 1766 1761 1794 1826 1810 1755 1718 1733 1778 1811 1808 1783 1767 1777
1711 1777 1797 1799 1774 1744 1740 1779 1855 1938 1981 1959 1899 1860 1875 1922 1949 1925 1866 1812 1790 1801 1829 1874 1941 2005 2013 1946 1859 1826 1852 1874 1861 1842 1855 1893 1935 1976
1706A976M5L1ml2k9j1JRJ8L3M1L2lm6o0l3JO%NJ1pk3nL8N4L9L0L2J5j7k5JJ4pk2%K5J8kRL8
1701B196L9Rj4lK0K4Jj5NM4M9j0q2q8k7L4M8L4K1Jk3j7K3N0L3J5L1M7J8l1l3QL2J8LROk3m2
1696B410k4J0K1J5J7L6M9M2J7npOJ6PmKK3L1J3kJ0L4L3jl7k8K5P1O5J4k3j8KQMJ8M7N4K1k4
1691B948l4mL2L4J0jK2M8M3J7MJ3J0nj0J%j3lL3M9J4k6j6L2O3O1M8K7mk2j2J3K1J7K6M0L1
1687C507J4K2N0O0M2K3J9K2K4K9M1N1N6N5M0J4lOK5L5M1N7N9L8K4L7M1Nk4J4Q5J01N9L1M0
1683D740L0nnN4R9P7L2J6K4L3O1J10J22P4L0M7Q9R3P6Q5J04R1O5Q0J25J42J13Q3Q2J07J39
1679G013J61J48J01Q7J51K37K52J97J61J90K31K41K45K82L34L54L55L82M44N00N17N23N65
1676A3671O58P64Q51R45J089J284J483J693J975K357K811L324L955M746N633O533P459Q463
$$ plain form
1706 1976 2021 2052 2048 2016 1987 1976 1977 1986 2004 2037 2078 2110 2107 2061 2001 1968 1969 1975 1975 1980 1991 1984 1961 1956 1994 2048 2087 2117 2149 2164 2147 2122 2123 2137 2130 2108 2108 2133 2151 2149 2158 2196
1701 2196 2235 2244 2230 2227 2247 2271 2272 2257 2262 2306 2355 2345 2263 2175 2148 2182 2230 2264 2285 2286 2263 2246 2269 2319 2352 2367 2398 2445 2463 2432 2399 2407 2439 2457 2460 2469 2475 2452 2410
1696 2410 2386 2396 2417 2432 2449 2485 2534 2576 2593 2588 2581 2587 2603 2610 2606 2608 2631 2662 2675 2673 2683 2717 2750 2749 2712 2684 2709 2780 2845 2859 2836 2818 2820 2828 2832 2850 2897 2951 2972 2948
1691 2948 2914 2910 2942 2976 2986 2985 3007 3055 3098 3115 3119 3132 3142 3137 3127 3128 3128 3115 3112 3145 3194 3208 3182 3166 3198 3261 3322 3370 3397 3393 3371 3359 3372 3393 3410 3436 3476 3507
1687 3507 3521 3543 3593 3653 3695 3718 3737 3759 3783 3812 3853 3904 3960 4015 4055 4069 4066 4072 4097 4132 4173 4230 4289 4327 4351 4388 4429 4434 4410 4424 4509 4610 4669 4700 4740
1683 4740 4770 4765 4760 4814 4913 4990 5022 5038 5062 5095 5156 5266 5388 5462 5492 5539 5628 5721 5797 5882 5986 6077 6142 6222 6347 6489 6602 6685 6767 6874 7013
1679 7013 7174 7322 7423 7510 7661 7898 8150 8347 8508 8698 8929 9170 9415 9697 10031 10385 10740 11122 11566 12066 12583 13106 13671
1676 13671 14329 15093 15944 16889 17978 19262 20745 22438 24413 26770 29581 32905 36860 41606 47239 53772 61231 69694
1674F9694R524J0540J1409J1959J1810J0500P850M215K99l207n888p646q624r079r228r170
1672I4958q913q450p786o968o094n276m553l879l224k619k108j688j330j028p62m92k01O1
1670B9648K51M02N77P90J013J252J530J838K147K467K852L338L937M670N576O685Q033R711
1667H6717J1807J4284J6994J9833K2833K6063K9488L2961L6189L8443L8358L4329K5594J3130
1666D47023n57j2677k1483k6734k9274l0255l0502l0259k9357k7629k5232k2551j9896j7362
1664A23255j4940j2667j0620q850p364o143n124m233l435k760k211j733j276q62n14k05J30
1662D0448M94Q50J184J531J951K465L061L716M445N324O442P855R588J1667J4104J6826J9723
1660A51674K2759K5991K9445L3001L6299L8558L8425L4355K5608J3104p36j3138k2228k7601
$$ plain form
1674 69694 79218 89758 101167 113126 124936 135436 143286 147501 147800 144593 138705 131059 122435 113356 104128 94958
1672 94958 86045 77595 69809 62841 56747 51471 46918 43039 39815 37196 35088 33400 32070 31042 30280 29788 29587 29648
1670 29648 29899 30301 30878 31668 32681 33933 35463 37301 39448 41915 44767 48105 52042 56712 62288 68973 77006 86717
1667 86717 98524 112808 129802 149635 172468 198531 228019 260980 297169 335612 373970 408299 433893 447023
1666 447023 446466 433789 412306 385572 356298 326043 295541 265282 235925 208296 183064 160513 140617 123255
1664 123255 108315 95648 85028 76178 68814 62671 57547 53314 49879 47119 44908 43175 41899 41037 40523 40318 40448
1662 40448 40942 41792 42976 44507 46458 48923 51984 55700 60145 65469 71911 79766 89354 101021 115125 131951 151674
1660 151674 174433 200424 229869 262870 299169 337727 376152 410507 436115 449219 448483 435345 413117 385516
1658C85516l0077l0950l1176l0967l0066k8304k5888k3187k0449j7794j5321j3095j1111r354
1656F7777p857o639n621m714l918l287k800k369j962j604j309j037p79n65l94k09K3K60M62
1654B3458O55R01J206J542J919K393L003L727M520N368O285P272Q308R368J0419J1350J1886
1652A13580J1618J0185P488L813k51m000o886q704r618r985j0101j0054r786r248q501p661
1650E1889o811n984n193m465l827l270k782k368k028j743j481j249j079r69q68p39n99m88
1648E946m23l98l98l95l58k91k31k17k32k34k14j87j59j26r5q2q6q8q4q7r3q0n7n3p5q5n6
1644A062k7l8p2p2l3rk8m5j8K5K5j6n6o8p2p4n3k0nj9k5JK2Mk9m4m7n8n4j2K7Rl6k4L7O1P
1640B26n1m5lJ4OLmk1j5L4O2K1l6k0M3N0k0o9m0MNqJ5M3K9pj7mnj4JK9J8k5m7k5LOjMOrj6
$$ plain form
1658 385516 355439 324489 293313 262346 232280 203976 178088 154901 134452 116658 101337 88242 77131 67777
1656 67777 59920 53281 47660 42946 39028 35741 32941 30572 28610 27006 25697 24660 23881 23316 22922 22713 22736 22996 23458
1654 23458 24113 25014 26220 27762 29681 32074 35077 38804 43324 48692 54977 62249 70557 79925 90344 101694 113580
1652 113580 125198 135383 142871 146684 146433 142433 135547 126843 117225 107240 97139 87085 77299 68051 59550 51889
1650 51889 45078 39094 33901 29436 25609 22339 19557 17189 15161 13418 11937 10688 9609 8640 7772 7033 6434 5946
1648 5946 5523 5125 4727 4332 3974 3683 3452 3235 3003 2769 2555 2368 2209 2083 1988 1906 1820 1732 1648 1561 1468 1388 1331 1278 1203 1118 1062
1644 1062 1035 997 925 853 820 811 783 738 720 745 770 754 698 630 558 484 431 411 406 387 362 363 385 389 360 316 269 211 157 145 172 181 145 121 158 219 226
1640 226 175 130 127 141 147 150 146 125 110 144 206 227 191 171 214 264 244 175 135 139 144 136 151 194 223 216 199 195 190 176 177 206 224 199 152 127 130 136 135 139 145 136 120
1635A20OL2K4nj4kpl6n5l0J3L1K7K8M0L5Nk1k0j4k2l3k1QJ5kj5lRKoJ1M3N6L8J1j3l2m0k9
1630A34pKkjJ7K3Jk3k2MK3K2J1Jj0j7j5ojMJ4L0K9J0lLOj4l6l5j9j7k9k1J7N2N7L9J4j9m9
1625A67n2j8K1K4Jj1MK4K6J0oj0plonRK4K4QlJQJ2K0K8J5k3n4m8k0kkMJ6K3J7Lj0j5PN0P3
1620C24M7j1m6m1j3J4K7J5j9l8k2%joK5O4N0qm0k3rj9oN0Q2L3m4p0l6lOJ0J7J2%ljkJ3M3M2
1615D13rn7l4L2N4J6j7rOmj8j3jMJ6K9J8k6n1l2NJ4j1l6l9qM5Q5P1J6k4j7MNj3k6l0k4rL%
1610C28qJ0M4M6Ok5j8lj6k7pK5K8J8K6M2K3k2n0m2j4J3K9K4mj5OK1nm1k1K8K9k4n0j8J3lk3
1605C23J2P6R8O2Ql5n6m8j4J2Jj8qK4L3J0lJ2K3Nk1k1jQKqqrj2%K9M9L1j9n2l2J6M3L3J3J3
1600E71K7L2L4M4O2O6M9K7L0O1R1Q0L1oLK2oo9r5o5l2m5o3m0Kjn0q3n7lL0K1j7n0m9j0K8L3
$$ plain form
1635 120 126 158 182 177 163 161 154 118 63 33 46 77 104 132 172 207 212 191 171 157 135 102 81 89 104 102 87 84 93 95 89 100 143 199 237 248 235 203 163 134
1630 134 127 129 127 126 143 166 167 144 122 126 149 171 182 183 173 156 141 135 134 138 152 182 211 221 218 221 227 213 177 142 123 106 77 56 73 125 182 221 235 216 167
1625 167 115 97 118 142 143 132 136 160 186 196 190 180 173 170 164 159 168 192 216 224 221 222 230 242 262 290 305 282 228 180 160 158 156 160 176 199 216 219 209 194 201 251 324
1620 324 371 360 314 273 260 274 301 316 297 259 237 237 236 230 255 319 369 361 321 298 289 270 264 314 396 429 385 315 279 276 282 292 309 321 321 318 317 315 328 371 413
1615 413 404 347 313 345 399 415 398 389 395 391 373 360 359 363 379 408 426 400 349 317 322 336 325 289 250 242 287 372 443 459 435 418 422 427 414 388 358 334 325 328 328
1610 328 320 330 374 420 426 401 383 380 364 337 330 355 383 401 427 469 492 470 420 378 364 377 406 430 426 411 417 438 433 392 371 399 428 404 354 336 349 346 323
1605 323 335 411 509 571 579 544 488 440 426 438 439 421 413 437 470 480 477 489 512 517 496 475 474 482 484 476 468 459 447 447 476 525 556 537 485 453 469 512 545 558 571
1600 571 598 630 664 708 770 836 885 912 942 1003 1094 1174 1205 1199 1202 1224 1218 1149 1054 989 957 912 849 809 811 810 760 677 620 617 647 668 651 601 552 542 570 603
1595F03K6L9N8L9j1l9j9J2J8J2J3J5lk1pL5P1P6N8L6L6P1J20J45J38J31J51J74J71J54J50
1591B452J50J17M2l3q1j13j35j37j20j10j34j64j65j35j12j04q4m3j4k8n9n8l2k5m1k8L0O9
1588I05K7n5r0n7j9j8j8J3M5L6jj2J2M1N3N6O2P8J01J13J05R1R8J30J42J21J06J32J70J63
1584B530J10O2L3no2j06j16j17j37j65j68j37r6p6q6j12j19r2n2k7k7l6m9n7m3qPj9m9k9K0
1580G72L3Kj7jJ5J0J4M0M4km3k5J8J7j6j7K2M7L9L2M2M4K9K1L1M2M9O9Q4M9l1r1q1l9k6m5
1576A131n5m5l3l3k9j9j4j4j0mqj9k4j4oj9l9m1j5J4J8jj2jJ0nl2l0RM3K7k3n5m2j3j3m2n5
1571D87k7K3N5N1L2J7PkKK0L9L7J9JmkPJ1MrpJ4K6Ml0m2l4l0l1j5J7L0J6KNJ1Lj2k0k1k1j6
1566F17kQOoj8j6J1N9Q3M5l0o5l2J4J5j3j6RK5K6L3L8J6k4l1LK5on5n7j0K1Kk6j3K3K7j0l5
$$ plain form
1595 603 629 668 726 765 754 715 696 708 726 738 751 766 763 742 735 770 841 917 975 1011 1047 1118 1238 1383 1521 1652 1803 1977 2148 2302 2452
1591 2452 2602 2719 2761 2728 2647 2534 2399 2262 2142 2032 1898 1734 1569 1434 1322 1218 1134 1091 1077 1049 990 932 900 875 834 806 836 905
1588 905 932 877 787 730 711 693 675 688 733 769 768 756 768 809 862 918 980 1058 1159 1272 1377 1468 1566 1696 1838 1959 2065 2197 2367 2530
1584 2530 2640 2702 2735 2730 2668 2562 2446 2329 2192 2027 1859 1722 1626 1550 1464 1352 1233 1141 1089 1062 1035 999 950 893 850 842 849 830 781 752 772
1580 772 805 807 790 789 804 814 828 868 912 910 867 842 860 877 861 844 866 913 952 984 1026 1070 1099 1120 1151 1193 1242 1311 1395 1444 1413 1322 1241 1202 1176 1131
1576 1131 1076 1031 998 965 936 917 903 889 879 875 867 848 824 810 804 785 746 705 690 704 722 721 709 708 718 713 681 651 660 703 730 707 652 610 597 584 542 487
1571 487 460 483 538 589 621 638 645 643 645 665 704 741 760 761 757 755 762 773 777 768 761 775 801 805 775 733 699 669 638 623 640 670 686 688 693 704 707 695 675 654 633 617
1566 617 615 623 629 623 605 589 600 659 742 787 757 692 660 674 689 676 660 669 694 720 753 791 807 783 752 755 780 774 719 662 652 673 675 649 636 659 686 676 641
1561F41j5J0nl7k5K3M9K8lo%loJ0K5K4J1lk0k9lM6O3K8pML2K4j1k8l5n7p1l3K5K9j5k8J9N7
1557G08L9Jj3j0j3qJ7K5kk6j2Rkj6J5O2N4qn5m3KL3M0L3J7rl3m7m6k3J9M8L6jj5JJ1j8n1m1
1552F78J0M0K3j0rK0L3J3rj2rj7k0lJ0ok6mN0O0%o1n9j0K1J6J4K9L9K2oj5KK3K9J5j2m0n6
1547G63n3k1K1L7Pk7rN4Q9O2J2j6k8m4m6k2NKj3nJ3J5RJ6K0kk7j6J6L0K5K8L7K5jolk2m6k1
1542H58L9N3%n0m1lJ8K6K4ro1n9QO0L4j4mL4K1k8l2J8M3mo1o6k1K7N4M3nm7l5K2M9K2mJ2L4
1537I55Ql7m0ML8L1J1J3K6K5J7J5K0J2j9n2o5m9j7J0J7Nj1j6oOmk5l0kL3L8Qk0j2K0L6J6j4
1533I45k4rQRkj1j8k7k9j7Kmk7k8J0M7M1Kj6kJ4J1OJ2J2oj8JK9K2j8m1k3J1K3K1K6L5K1j5
1528I73l4j7J4K9K6K9K7%l9n2j6K9M1J9j1l0m1l9j7RJ4Jqnnj2j1OJ9J4J3L3N1K6l5o6k2N2
$$ plain form
1561 641 626 636 631 594 569 592 641 669 666 660 660 657 651 661 686 710 721 718 698 669 666 712 775 803 796 800 832 856 845 817 782 725 654 621 646 675 660 632 651 708
1557 708 747 748 735 725 712 704 721 746 744 718 706 715 713 697 712 774 828 820 765 722 724 757 797 830 847 838 805 758 712 689 708 756 792 791 776 777 788 770 719 678
1552 678 688 728 751 741 732 752 785 798 789 777 768 751 731 728 738 732 706 702 752 812 812 751 692 682 703 719 733 762 801 823 817 802 804 827 856 871 859 819 763
1547 763 710 689 710 747 754 727 718 772 861 923 935 919 891 847 801 779 784 786 773 768 781 796 805 821 841 839 812 796 812 842 867 895 932 957 956 950 947 925 879 858
1542 858 897 950 950 900 859 856 874 900 924 915 854 795 803 863 897 883 879 913 934 906 874 892 935 931 870 804 783 810 864 907 902 855 820 842 891 913 909 921 955
1537 955 963 926 886 890 928 959 970 983 1009 1034 1051 1066 1086 1098 1079 1027 962 913 896 906 923 928 917 901 895 901 897 872 842 840 873 911 919 899 887 907 943 959 945
1533 945 921 912 920 929 927 916 898 871 842 825 827 823 796 768 778 825 866 868 852 850 864 875 881 893 905 899 881 882 911 933 915 874 851 862 885 906 932 967 988 973
1528 973 939 922 936 965 991 1020 1047 1047 1008 956 940 969 1010 1029 1018 988 947 908 891 900 914 915 907 902 897 885 874 880 899 913 926 959 1010 1036 1001 935 913 965
1523I65O6Lo2n5%L0J6JJ5K8K0RJ3J0j4l3j8Pmm1n0j1K2Ok8k5K0N6M6J0lJ1J8j1m2k6L0O2M0
1518A081KnMok4k1jLrj0lrk2j3PRjJ3M3L5j1l5j0J8J1mJ0K1nl3j4L0M3J2j1pmj5k8k3pJ2K7
1513A050K8J0olKj4m5m8j2L2M3J7j7k6JL9M8J5k0k6nJ5K2J3pk2rK7L7Ll2k3Lj2n5n2J2P6Q2
1508A141L6j6m7m3nL7L9Lk3j7LRNNLlp%KopQK6L3K8J6mk1j6KJ8J7Oj3l1l0mJ9Mk6k4QK2J1
1503A158OJ4Kl6n4k8NJ5J9K4Ol7m3J7P6O6J2j3OJ5Jj3j4k1l3k8%K0K2J0lqPK9K6ol7m0l5l2
1498A075%N2O1Jn1k4K2Ql9j9N1P3L0%J3J0k2j5L3M1k0n6j1L8J3k7mL8J3m6m7RL8J8J0L7N0
1493A353K3oj0j2l1m6m2k7nK2L3J0k2k1OJ3nj2%RRK0L6K9Kj0lj1l3k9QL7L0J0jj1k1nL3M5
1488A365J0l2l1kPlmJ8M3M2Ln1o7j3N8O6Pl4j8pm2p3l1M0N5J8NK8L0kj8MK4J7Mkk7p4q1k7
$$ plain form
1523 965 1031 1034 972 917 917 947 963 964 979 1007 1027 1036 1049 1059 1045 1012 994 1001 997 956 906 895 917 923 895 870 890 946 992 1002 999 1010 1028 1017 975 949 979 1041 1081
1518 1081 1083 1078 1082 1076 1052 1031 1030 1033 1024 1014 1011 1002 980 967 974 983 982 995 1038 1073 1062 1027 1017 1035 1046 1042 1052 1073 1068 1035 1021 1051 1094 1106 1095 1088 1084 1069 1041 1018 1011 1023 1050
1513 1050 1078 1088 1082 1079 1081 1067 1022 974 962 994 1037 1054 1037 1011 1012 1051 1099 1114 1094 1068 1063 1078 1100 1113 1106 1084 1075 1102 1139 1142 1110 1087 1090 1078 1023 971 983 1059 1141
1508 1141 1177 1161 1114 1071 1066 1103 1142 1145 1122 1105 1108 1117 1122 1127 1130 1127 1120 1120 1122 1116 1109 1117 1143 1176 1204 1220 1216 1195 1179 1181 1199 1216 1222 1209 1178 1148 1144 1163 1167 1141 1117 1125 1147 1158
1503 1158 1164 1178 1180 1144 1090 1062 1067 1082 1101 1125 1131 1094 1051 1068 1144 1210 1222 1209 1215 1230 1231 1218 1204 1183 1150 1122 1122 1142 1164 1174 1171 1163 1170 1199 1225 1219 1182 1142 1107 1075
1498 1075 1075 1127 1188 1189 1138 1114 1136 1144 1105 1086 1137 1210 1240 1240 1253 1263 1241 1226 1259 1300 1280 1224 1213 1251 1264 1237 1233 1271 1284 1238 1191 1200 1238 1256 1266 1303 1353
1493 1353 1376 1370 1360 1348 1317 1271 1229 1202 1197 1219 1252 1262 1240 1219 1225 1238 1233 1221 1221 1230 1239 1259 1295 1324 1326 1316 1313 1302 1269 1240 1248 1285 1315 1325 1324 1313 1292 1287 1320 1365
1488 1365 1375 1343 1312 1310 1317 1314 1310 1328 1371 1413 1416 1365 1298 1285 1343 1409 1416 1382 1364 1357 1315 1242 1211 1251 1306 1324 1329 1357 1387 1385 1367 1371 1395 1412 1416 1414 1387 1313 1232 1205
1484A205M3O2M0K0Qj2l0j9J3L3K9J0omK3N7N5Ol6k7QRk5l5kK0qn2n3pL1K9PlNJ0QORJ3PjL
1478A449J7J6mk4j0K1L4J8QK5M2K7%ML1L7Ll0k2KLj4j4J3K8J0j3j4LJ6K3L9N2M8K6J0OMnl
1473A862K2N3O3M4K3L2P1J11J19R4P3R2J57K32K82L09L47M16N02N84O59P46Q47R25R42Q83
1470A0490P52N36K27j33m46o34p06p32p62p81p65p16o56n94n21m43l76l26k74k13j54j17j08
1467B548j11j10j01q7o7m0rNol5n9o4n5l9k2nNJj8m0m6k5J1L4L0Qj4k3k5k2kL2N8M7Qk2k2
1463A718kOkj5j3jN%j0j3jJ9L7M2L2J1j2l1m3m0j7J3K3Kk6k1J3L3Rl3m2rL1M4L6K9K4Rj4k6
1458A765k7k9l9k9ML9M5K5RNJn%J6K7J4j2k5k2j0OJ8K2J8Rmk6m6m3j5J7L0L1K8J3j2j9J2M5
1453A836M1J0jJ8K6ll4l6j8j1j3j0%RJ2Pok0k0pMPJ8L6L1kk1PN0N4K8J5K9L0Kk1j4NPnj3j6
$$ plain form
1484 1205 1248 1310 1350 1370 1378 1366 1336 1317 1330 1363 1392 1402 1396 1392 1415 1472 1527 1533 1497 1470 1478 1487 1462 1427 1425 1445 1437 1385 1332 1325 1356 1385 1392 1389 1394 1404 1412 1418 1427 1440 1447 1446 1449
1478 1449 1466 1482 1478 1454 1444 1465 1499 1517 1525 1550 1592 1619 1619 1623 1654 1691 1694 1664 1642 1644 1647 1633 1619 1632 1660 1670 1657 1643 1646 1662 1685 1724 1776 1824 1850 1860 1866 1870 1865 1862
1473 1862 1884 1937 2000 2044 2067 2099 2170 2281 2400 2494 2567 2659 2816 3048 3330 3639 3986 4402 4904 5488 6147 6893 7740 8665 9607 10490
1470 10490 11242 11778 12005 11872 11426 10792 10086 9354 8592 7811 7046 6330 5674 5080 4559 4116 3740 3414 3140 2927 2773 2656 2548
1467 2548 2437 2327 2226 2139 2072 2032 2023 2028 2022 1987 1928 1864 1809 1770 1748 1743 1748 1749 1731 1691 1645 1620 1631 1665 1695 1703 1689 1666 1641 1619 1617 1649 1707 1754 1762 1740 1718
1463 1718 1716 1722 1720 1705 1692 1691 1696 1696 1686 1673 1672 1691 1728 1770 1802 1813 1801 1770 1727 1687 1670 1683 1706 1708 1682 1661 1674 1707 1716 1683 1641 1632 1663 1707 1743 1772 1796 1805 1791 1765
1458 1765 1738 1709 1670 1641 1645 1684 1729 1754 1763 1768 1769 1764 1764 1780 1807 1821 1809 1784 1762 1752 1758 1776 1798 1816 1825 1821 1795 1749 1706 1691 1708 1738 1769 1797 1810 1798 1779 1791 1836
1453 1836 1877 1887 1886 1904 1930 1927 1893 1857 1839 1828 1815 1805 1805 1814 1826 1833 1827 1807 1787 1780 1784 1791 1809 1845 1876 1874 1853 1860 1910 1964 1992 2007 2036 2066 2068 2047 2033 2038 2045 2040 2027 2011
1448B011j1NK6K4kk2j2Mlj9j1K3L9J4l2n4l8jL0L9L0Rpj0NK1K0Jj6j4%OLnj7l0k2K7Q7R0K6
1443B214m1n4k8j6k5k4oOLJ3M4N6K5j8k0J5L7K1ok5l4m3l5lL4M1K4RKqk8l5k0onNM2P7P0J9
1438B277l0m5k9%L0N0M2J3j0j0kjjOJ8K6L6M2K8j0m9o0m4k7j7kK6N5O2K9k3n0j8L8N5J8k4
1434B399k5plnJ8N3N6K6JOK3L5M7N4M4J5nlNjj3j4mMOol2n4m5mL3L6J5MMLmlJ8L4J9j5l3j4
1428B668J3Rl3o4m9pK6M0M5M0K1OK2M7L9Lj7qmk4l1jK5J1k0k3LK1K3L1M2L4Nj8j8lJ3K9L2
1424B928J8MQK0J2j4l0j7OJ6Pj5l4l0RN2O2L8J1Jnj0LK4K6Jj4MK5J0k3k4J5M7M3J8Jpk2l4
1419C130j9K8O8O5K3j5j3J7L4K9K0J9J5ok1pK7M0J8j7l3k4jK3M7N6K8j5k9QN2L9j9n1j6M2
1414C542N8K6j3l3m0l7j0L1N7N6M2K3jj9j2J5L1J9PJ0J1pj8OM4N1K0j2j1J0K7L7N1O3M8on9
$$ plain form
1448 2011 2000 2005 2031 2055 2053 2031 2019 2023 2020 2001 1990 2013 2052 2066 2034 1980 1942 1941 1971 2010 2040 2049 2042 2032 2037 2058 2078 2079 2063 2049 2049 2055 2058 2053 2036 2006 1984 2011 2098 2188 2214
1443 2214 2173 2119 2091 2075 2050 2026 2020 2026 2029 2042 2086 2142 2167 2149 2129 2144 2181 2202 2196 2171 2137 2094 2059 2056 2090 2131 2155 2164 2166 2158 2130 2095 2075 2069 2064 2069 2111 2188 2258 2277
1438 2277 2247 2202 2173 2173 2203 2253 2295 2308 2298 2288 2286 2285 2284 2290 2308 2334 2370 2412 2440 2430 2381 2321 2277 2250 2233 2231 2257 2312 2374 2403 2380 2330 2312 2350 2405 2423 2399
1434 2399 2374 2367 2364 2359 2377 2430 2486 2512 2513 2519 2542 2577 2624 2678 2722 2737 2732 2729 2734 2733 2720 2706 2702 2706 2712 2706 2674 2620 2575 2571 2604 2640 2655 2659 2663 2666 2662 2659 2677 2711 2730 2715 2682 2668
1428 2668 2681 2690 2657 2593 2544 2537 2563 2603 2648 2688 2709 2715 2737 2784 2823 2826 2809 2801 2797 2773 2742 2741 2766 2777 2757 2734 2737 2758 2781 2812 2854 2888 2893 2875 2857 2854 2867 2896 2928
1424 2928 2946 2950 2958 2978 2990 2976 2946 2929 2935 2951 2958 2943 2909 2879 2888 2940 3002 3040 3051 3052 3047 3037 3040 3064 3090 3091 3077 3081 3106 3116 3093 3069 3084 3131 3174 3192 3193 3186 3164 3130
1419 3130 3111 3139 3207 3272 3295 3280 3267 3284 3318 3347 3367 3386 3401 3395 3374 3367 3394 3434 3452 3435 3402 3378 3377 3400 3447 3503 3531 3516 3487 3495 3547 3586 3567 3516 3500 3542
1414 3542 3600 3626 3613 3580 3540 3503 3493 3524 3581 3637 3679 3702 3701 3682 3670 3685 3716 3735 3742 3752 3763 3756 3738 3744 3788 3839 3859 3847 3836 3846 3873 3910 3961 4024 4072 4066 4007
1410D007o1k0J2pl3rN0P6M2lj1QK1K5L5M0K4jj5rLJ3J2KjK5O7P5L2oML7L7Oj1%OMJ5M3N4L9
1405D627K7L0K7OpnlpOL4M6K3orjJJ0M0O3M5J0pkmj5pK4N0N4M0K0krRL1L1J4J0K8L7K8K0J8
1399E325J2llK3M1K7J3L2N8M1j4l9pL6M6L9N5P8O6K4KK0L7L1K7N4Q2P6L7R%rk3j4J7M3M2K7
1395F308J4NKK2N7O9M4K2M0O7N4%l2j4J8K5J3QJ4K4L4M7M8L1J8K9M6M5L5L8M9M1J9K4N6P0
1390G390L8JML2L5J1QL7O2N7M7N7P9Q6P5N2J5l1m1JO6R5Q6O7M9L0K3M8Q3Q0M2K0L5N6N9N6
1386H910O3N8L8M4Q7J18Q9L8K6M8M9K1J4M1O8O9O3P2P8P2P3R5J11R2N6L8M6N3M2K4K3M7Q3
1382A0849J06J02Q0O1M9L3K3M3R6J43J43J06P1O2O9P7P4O4N6O1P6R2J09J27J30J05P2O8J08
1378A3255J51J52J26J10J16J16J01Q4P9P4O3O6J00J43J55J25Q8Q1J01J27J42J53J60J54J32
$$ plain form
1410 4007 3946 3926 3938 3931 3898 3889 3939 4015 4057 4054 4043 4051 4072 4097 4132 4172 4196 4195 4180 4171 4174 4187 4199 4201 4200 4225 4292 4367 4399 4393 4397 4434 4471 4477 4466 4466 4472 4476 4491 4534 4588 4627
1405 4627 4654 4684 4711 4717 4710 4705 4702 4695 4701 4735 4781 4804 4798 4789 4788 4789 4799 4839 4902 4947 4957 4950 4948 4944 4929 4922 4946 4996 5050 5090 5110 5108 5099 5108 5139 5170 5184 5194 5222 5259 5287 5307 5325
1399 5325 5337 5334 5331 5354 5395 5422 5435 5467 5525 5566 5552 5513 5506 5542 5588 5627 5682 5760 5826 5850 5852 5872 5909 5940 5967 6021 6103 6179 6216 6225 6225 6216 6193 6179 6196 6239 6281 6308
1395 6308 6322 6327 6329 6351 6408 6477 6521 6543 6583 6650 6704 6704 6672 6658 6676 6701 6714 6722 6736 6760 6794 6841 6889 6920 6938 6967 7013 7058 7093 7131 7180 7221 7240 7264 7320 7390
1390 7390 7428 7429 7433 7465 7500 7511 7519 7556 7618 7675 7722 7779 7858 7944 8019 8071 8086 8055 8014 8015 8081 8176 8262 8329 8378 8408 8431 8479 8562 8642 8684 8704 8739 8795 8854 8910
1386 8910 8973 9031 9069 9113 9200 9318 9407 9445 9471 9519 9568 9589 9603 9644 9712 9781 9844 9916 9994 10066 10139 10234 10345 10437 10493 10531 10577 10630 10672 10696 10719 10766 10849
1382 10849 10955 11057 11137 11198 11247 11280 11303 11346 11442 11585 11728 11834 11905 11967 12036 12113 12187 12251 12307 12368 12444 12536 12645 12772 12902 13007 13079 13147 13255
1378 13255 13406 13558 13684 13794 13910 14026 14127 14211 14290 14364 14427 14493 14593 14736 14891 15016 15104 15185 15286 15413 15555 15708 15868 16022 16154
1375A6154J09R8J02J18J40J58J60J43J27J33J48J47J29J19J24J34J49J85K32K52K18J62J34
1372A9575J40J56J62J69J86K03K04J96J92K02K19K27K19K07K02K10K21K36K56K68K43J98J89
1370B4280K35K83K74K34K40L00L36L02K49K38K57K61K49K65L08L37L29L19L35L60L65L56L48
1367C1060L48L50L52L63L75L83L97M20M37M23L94L85M16M56M68M52M39M48M66M79M84M92N11
1364D0798N28N34N24N24N53O10O54O50O10N85O02O44O78O98P05O98O90O99P33P65P72P68P82
1361E5804Q11Q33Q52Q85R28R46R32R13R26R72J026J064J066J046J039J075J138J186J214J248
1359G5904J295J318J311J312J356J415J452J476J516J562J586J597J634J705J778J832J868
1357A01917J899J928J971K028K084K130K181K264K352K406K435K489K581K672K738K807K893
$$ plain form
1375 16154 16263 16361 16463 16581 16721 16879 17039 17182 17309 17442 17590 17737 17866 17985 18109 18243 18392 18577 18809 19061 19279 19441 19575
1372 19575 19715 19871 20033 20202 20388 20591 20795 20991 21183 21385 21604 21831 22050 22257 22459 22669 22890 23126 23382 23650 23893 24091 24280
1370 24280 24515 24798 25072 25306 25546 25846 26182 26484 26733 26971 27228 27489 27738 28003 28311 28648 28977 29296 29631 29991 30356 30712 31060
1367 31060 31408 31758 32110 32473 32848 33231 33628 34048 34485 34908 35302 35687 36103 36559 37027 37479 37918 38366 38832 39311 39795 40287 40798
1364 40798 41326 41860 42384 42908 43461 44071 44725 45375 45985 46570 47172 47816 48494 49192 49897 50595 51285 51984 52717 53482 54254 55022 55804
1361 55804 56615 57448 58300 59185 60113 61059 61991 62904 63830 64802 65828 66892 67958 69004 70043 71118 72256 73442 74656 75904
1359 75904 77199 78517 79828 81140 82496 83911 85363 86839 88355 89917 91503 93100 94734 96439 98217 100049 101917
1357 101917 103816 105744 107715 109743 111827 113957 116138 118402 120754 123160 125595 128084 130665 133337 136075 138882 141775
1355A41775K984L066L163L271L350L390L453L577L721L821L896M004M140M258M349M467M616
1353B05301M740M818M905N051N216N341N432N522N607N649N673N737N840N903N868N784N735
1350B98122N722N664N511N296N074M845M569M238L875L491L069K602K101J576J013M19j75
1348C57012p47j317j901k477l026l554m063m526m919n280n649n994o248o423o602o801o949
1346B80536o994o987o992o994o945o854o752o640o490o323o176o049n909n749n588n424n243
1344A72427n059m890m726m553m396m272m148l983l809l687l604l479l307l162l072k981k850
1342A06449k738k689k649k547k396k271k198k149k107k068k015j936j853j784j718j647j590
1340G0094j555j505j426j375j395j414j346j225j163j168j154j092j051j062j057r89r22r10
$$ plain form
1355 141775 144759 147825 150988 154259 157609 160999 164452 168029 171750 175571 179467 183471 187611 191869 196218 200685 205301
1353 205301 210041 214859 219764 224815 230031 235372 240804 246326 251933 257582 263255 268992 274832 280735 286603 292387 298122
1350 298122 303844 309508 315019 320315 325389 330234 334803 339041 342916 346407 349476 352078 354179 355755 356768 357187 357012
1348 357012 356265 354948 353047 350570 347544 343990 339927 335401 330482 325202 319553 313559 307311 300888 294286 287485 280536
1346 280536 273542 266555 259563 252569 245624 238770 232018 225378 218888 212565 206389 200340 194431 188682 183094 177670 172427
1344 172427 167368 162478 157752 153199 148803 144531 140383 136400 132591 128904 125300 121821 118514 115352 112280 109299 106449
1342 106449 103711 101022 98373 95826 93430 91159 88961 86812 84705 82637 80622 78686 76833 75049 73331 71684 70094
1340 70094 68539 67034 65608 64233 62838 61424 60078 58853 57690 56522 55368 54276 53225 52163 51106 50117 49195 48285
1338D8285r07q61q16q31q76q66q02p50p24o94o71o86p10o76o01n77o26o55n99n25n24n75n81
1335C2152n29m83m76m76m61m53m68m72m38l93l72l74l69l55l60l77l73l41l15l24l53l63l47
1332B2880l16k85k58k47k65k98l11k86k50k38k62k86k83k55k38k47k50k16j72j81k44k86k45
1329A6961j74j59j99k19j90j64j85k12k01j73j66j76j66j45j35j38j28j15j21j44j46j29j24
1327A3252j51j78j72j44j24j27j47j58j47j18r8j01j05r0p9j04j49j60j33j12j20j34j24j00
1324A0177q4p1o0p0j03j27j24j09r2o1k0j8p7j36j25o1k7n7r9j04q0o5o5o7p3q3q3o6n2o4
1320G854q8r0n8k0pk2m2n2n0n4p3r3r5p9o3o1p0p3o3m0j7j0k5m5n7o0p0r0j01q2m6j8poj4
1316F013m3p8q9o3k9k1l1k8j2j8m6o2m2k1l6o8p4n0l7m1l9k1rj7j8orm0o2m7k4l5o8p4m3p
$$ plain form
1338 48285 47378 46517 45701 44870 43994 43128 42326 41576 40852 40158 39487 38801 38091 37415 36814 36237 35611 34956 34357 33832 33308 32733 32152
1335 32152 31623 31140 30664 30188 29727 29274 28806 28334 27896 27503 27131 26757 26388 26033 25673 25296 24923 24582 24267 23943 23590 23227 22880
1332 22880 22564 22279 22021 21774 21509 21211 20900 20614 20364 20126 19864 19578 19295 19040 18802 18555 18305 18089 17917 17736 17492 17206 16961
1329 16961 16787 16628 16429 16210 16020 15856 15671 15459 15258 15085 14919 14743 14577 14432 14297 14159 14031 13916 13795 13651 13505 13376 13252
1327 13252 13101 12923 12751 12607 12483 12356 12209 12051 11904 11786 11688 11587 11482 11392 11313 11209 11060 10900 10767 10655 10535 10401 10277 10177
1324 10177 10093 10022 9962 9892 9789 9662 9538 9429 9337 9276 9256 9238 9161 9025 8900 8839 8812 8755 8656 8552 8472 8407 8342 8275 8202 8119 8036 7970 7918 7854
1320 7854 7766 7676 7618 7598 7591 7569 7527 7475 7425 7371 7298 7205 7110 7031 6968 6907 6837 6764 6701 6661 6644 6634 6609 6564 6507 6447 6377 6287 6186 6104 6058 6040 6033 6027 6013
1316 6013 5970 5892 5803 5740 5711 5690 5659 5631 5619 5601 5555 5493 5451 5430 5394 5326 5252 5202 5165 5124 5085 5064 5055 5038 5020 5014 5005 4965 4903 4856 4832 4797 4729 4655 4612 4605
1311D605Pkk7n8o4l5jKj3qJ1Ml5o3o1n2n2l6lQj8m1k2J0J3Jlj7o6j13r2j3M0J9k8l6qJ0kk3
1306C738k9l1m5n9m9j3J2pm5n9m1j9j3qjj7n2n5j1K0j1o2n5mK1MNL7L0m6j08p2J3M6Km3l2
1302B941J3L5J1m1p6o0rK3Pk2j9NLk9n2l6MK8K1j0l8l2%K0Nk2k7j3j3k7l1k3j6pJ0K1kl9m9
1297B454k6ommmj6m1m2j4J9K9K4Ml1n6l0J8K3k8o1l8j1k9n2k4K1J4k7k0L5N6Pm9m3kJ4pk4
1292B029j2J0J4KmNJ1j0m8n9k7J0J3qk1k6l9m8k9J2L3K2O%oj4j6j3qLK6L1lm8n1k2rj8j1J8
1288A695L4K2J0Mj6l8k2J7J8l1n2j1K7Kl6k4J8K4jrjj2k2JL8K4k8m7j3K5K5Qpk3l6j8J8K7
1283A590jj9ML1K0j6l9l2j4kj1l9o0m0QM1L9J8mk8m9m8k0J5L8N0M3Mm2n5k8mj3l2k6JJ9K0
1278A319J1ok1k5k0k5m3m6j6K9N6N6L2mk3j0J5J4oj6j6k6m1k5J6K7ok1J7N9M7Lj6rnrpj4m2
$$ plain form
1311 4605 4612 4610 4583 4525 4461 4426 4425 4427 4414 4406 4417 4421 4386 4323 4262 4210 4158 4122 4119 4127 4109 4068 4046 4056 4069 4070 4067 4050 3984 3871 3779 3766 3806 3825 3797 3761 3753 3763 3761 3738
1306 3738 3709 3678 3633 3574 3525 3512 3524 3517 3472 3413 3372 3353 3340 3332 3331 3314 3262 3207 3196 3216 3205 3143 3088 3084 3105 3109 3114 3151 3181 3135 3027 2955 2968 3014 3016 2973 2941
1302 2941 2954 2989 3000 2959 2883 2823 2814 2837 2844 2822 2803 2808 2811 2782 2730 2694 2698 2726 2747 2737 2699 2667 2667 2687 2692 2670 2643 2630 2617 2590 2559 2536 2520 2513 2523 2544 2542 2503 2454
1297 2454 2428 2422 2418 2414 2410 2394 2353 2311 2297 2316 2345 2369 2373 2342 2286 2256 2274 2297 2269 2208 2170 2159 2130 2078 2054 2075 2089 2062 2042 2077 2133 2140 2091 2048 2046 2060 2053 2029
1292 2029 2017 2027 2041 2043 2039 2044 2055 2045 1997 1938 1911 1921 1934 1926 1905 1879 1840 1792 1763 1775 1808 1830 1836 1836 1830 1816 1800 1787 1779 1782 1808 1839 1836 1788 1737 1715 1706 1688 1677 1695
1288 1695 1729 1751 1761 1765 1749 1711 1689 1706 1724 1693 1641 1630 1657 1659 1623 1599 1617 1641 1640 1631 1630 1618 1596 1597 1635 1659 1631 1584 1571 1596 1621 1629 1622 1599 1563 1545 1563 1590
1283 1590 1589 1570 1574 1605 1625 1609 1570 1538 1524 1522 1511 1472 1412 1372 1380 1421 1460 1478 1474 1446 1397 1349 1329 1344 1382 1432 1475 1479 1437 1382 1354 1350 1337 1305 1279 1280 1299 1319
1278 1319 1330 1324 1303 1278 1258 1233 1190 1144 1128 1157 1213 1269 1301 1297 1274 1264 1279 1293 1287 1271 1255 1229 1188 1163 1179 1206 1200 1179 1196 1255 1302 1305 1289 1280 1275 1266 1259 1245 1203
1274A203n5k5K1K9J0MJ2nl7m1rJ4OlMJ7K5K7J7j0k8j0K0J0l7n8k5K0L2J8Lpk0l1l0j8NL6N4
1269A138L4mk2j0%qj8j4rj4j7j8k5l8l8k5j5j2QM8P7P6N0J4k9m9j9K9L0k0o1n6l7l1j5K7N5
1264I82M0Nj4k6m7l9J5N2J4n4n8LM5K9JLJ2ml0l7k3OL0L1Nj6lK9L1kk6k3j9l0l2j3MjqPK5
1259H64J7oj2RM1N6M8K1rl2m1l4lL7M5jn4n7j0K1Lk2rJ8J3k3m3k4QK0J1oj5j2nklJJk1m8m0
1254G02J4O3N5Pj8lJ0ol1k8kJ1Jj1LL3M6K9jj7rMMnj8k5k1mPj4n1n7qN1O7L9J1Jj6m2n1j6
1249G04K9L9J5JJ2K0mm0m9k1J4K8K4K0J1ok6l5l0k4k4j3J3L5L1Lk1j9LJ7J3%lRK3K0Mj0j0
1244G53LJ1Mj3k6j8rj6l4l5j0J8K7K9K8Rk5l8rK2J2j9j3L4N5J9k8l2qOOJ5L2L3J8ml0m8m0
1239F79j1%l5o5l6L3O7L3j8l1j3qk4k7NM5N4K2j6k8j5kJ1L1M5K2l0n4k6J4J0k5m5k5RL2K7
$$ plain form
1274 1203 1148 1123 1144 1173 1183 1187 1199 1194 1157 1116 1107 1121 1127 1124 1128 1145 1170 1197 1214 1204 1176 1166 1186 1196 1159 1101 1076 1096 1128 1146 1149 1142 1122 1091 1061 1043 1048 1084 1138
1269 1138 1172 1168 1146 1136 1136 1128 1110 1096 1087 1073 1056 1038 1013 975 937 912 897 885 893 941 1018 1094 1144 1158 1129 1080 1061 1090 1120 1100 1039 983 946 915 900 927 982
1264 982 1022 1027 1013 987 940 901 916 968 982 928 870 873 918 947 948 951 963 959 929 892 869 875 905 936 941 925 922 951 982 980 954 931 912 882 850 837 841 840 832 839 864
1259 864 881 875 863 872 913 969 1017 1038 1029 997 956 922 919 956 1001 1000 946 889 879 900 903 881 872 890 903 880 837 813 821 841 852 846 831 819 814 812 809 810 811 790 742 702
1254 702 716 779 834 841 823 820 830 824 793 765 763 774 775 764 767 800 846 875 874 857 848 852 856 851 833 808 787 783 790 776 725 668 660 711 778 817 828 829 813 771 720 704
1249 704 733 772 787 788 800 820 816 776 727 706 720 748 772 792 803 797 771 736 706 682 658 645 658 693 724 727 706 687 690 707 720 720 717 726 749 769 773 763 753
1244 753 756 767 771 758 732 714 705 689 655 620 610 628 655 684 712 721 696 658 649 671 683 664 651 685 740 759 731 699 691 697 703 718 750 783 801 797 767 719 679
1239 679 668 668 633 568 532 565 632 665 647 616 603 595 571 544 549 594 648 670 654 626 611 609 620 651 696 718 688 634 608 622 632 607 562 537 546 578 605
1235F05Nj9j6J5L1J1j8j9rj4j9J2N7N8J0j8ML1K1j6l6k5NL2K9j8o9n5K1P4M8j3m0l3l0l6k9
1230E37j0J0L1N5N1J6nJ4K4j8o8n6%J8nlL4L7j6n7l3J0J4jMJ1j5m1k4J7K3mj7pmj6j3J1K6
1226E30K0J8K0Qj4j4J2K5J0KJ8K6Nj5lJ1nl8m8l3k4k6k1kJ2K0K9L9L5K0Jj6l1k3NK6J4nMK5
1221F17J4k6m2k5j0j7j3J5L3K8K4M1L4j7o9n8nK2Nj6j6mJ0L0M2J7l2n1k2K1L6K7J4Lj5l8n3
1216E04m4j5K2M5M3K4Pmj5j6j2j4k8l1jL4L4ml1k4lP%j2k1j0K4N1L4oj8lkk2j5L5O3L5npR
1211F08Jj4kJ3j1m2k3L5N4J1l2l5j7j2j2mjoJJ6J3j1j9%Qrk2jJ4j4n6n2jL7K8mk2k1j1JPJ
1206C94j2j1QK6K7K4K8L3L4K3Oj7l5l0pJ1ll8n0k0K2L1J1ML0M7J6m1o1k9J0J9LpoplJ6M2M5
1201E33J9j9l9l4j7mMJ5K7L1J9OLN%pj3k1l9m4j4K6L4J3J5M7N6On2n2%M3L8Jm6p7o6rL9L0
$$ plain form
1235 605 610 591 575 590 621 632 614 595 586 572 553 565 622 680 690 672 676 707 728 712 676 651 656 688 717 699 630 575 596 670 718 705 665 632 602 566 537
1230 537 527 537 568 623 674 690 685 699 723 705 637 581 581 599 594 591 625 662 646 589 556 566 580 579 583 594 579 538 514 531 554 550 533 526 522 506 493 504 530
1226 530 550 568 588 596 582 568 580 605 615 617 635 661 666 651 648 659 654 616 568 535 511 485 464 462 474 494 523 562 597 617 618 602 571 548 553 579 593 588 592 617
1221 617 631 605 563 538 528 511 498 513 546 574 598 639 673 656 587 529 524 546 551 535 519 515 525 555 597 614 582 531 509 530 566 593 607 610 595 557 504
1216 504 460 445 467 512 555 579 586 582 567 551 539 525 497 466 465 499 533 529 498 474 471 478 478 466 445 435 459 510 544 538 520 517 515 493 478 513 576 611 606 599 608
1211 608 609 595 593 606 595 553 530 565 619 630 598 563 546 534 522 518 517 511 512 528 541 530 511 511 519 510 488 487 501 487 431 379 378 415 443 439 417 396 385 386 393 394
1206 394 382 371 379 405 432 456 484 517 551 574 580 563 528 498 491 502 499 461 411 391 413 444 455 459 489 536 552 511 450 421 431 450 453 446 440 433 430 446 488 533
1201 533 552 533 494 460 443 439 443 458 485 516 535 541 544 549 549 542 529 508 469 425 411 437 471 484 499 546 602 608 556 504 504 547 585 586 540 463 397 388 427 457
1196D57mmK6K9mk7k6l1m6k4L9P3L3k2k7KQOK9M7Qo0o9j3L3K5J1J9J5k4m8j8J7mm5k8L8O8L2
1192D91j0j7j1j5j2J5L3J7mQL4L1kk8l1k6j7PL9N0L3J1jk0m6n1k5%jkK1M2K0k9m2mL1J7k4
1187D82l9j5QJ3J6K1J6jpQJ8Mj4qK2M0L4J0j5l6m1k1jnj8oK3J7k7m2KM2Qo0o8rK9Ok5j4Lo
1182C44j5J2N0N4M2M6L9j8q0o9J0N6K7k0k2llj8j6mqj0RK8J1k1k1J0K2mk2JK7J1l4n3k2K6
1177C62M7L5J2j0k2l0k5oJ4J9RmlPJ3J2J2J2Jj7k3oJ5K1J8K0L0L2K2J3Ppl4n7n0j5J5J0k3
1172D26m4k6J3L0J3lMK0J6jKL1M6K0k9n0k6J3K5Kl0l7j6J3K5K0RM%jJql2m1mN5P2K6l0m0j2
1167D56M%jJ1J6J3Nql1l4RN9N2j4o2m8j2mj3lJ5J8J8K7K7kl0k2krl2j8L0N9M6J4k0o0q2m2
1162C30M8R9O4pl8k3j0j5j3J0K6J6j3l8m4k7ML3N0M7K2j5l7k7nol2l7%M2M6K8K3K5Mm1o4l4
$$ plain form
1196 457 453 449 475 504 500 473 447 416 370 346 385 458 491 469 442 444 452 458 487 534 542 482 413 400 433 458 469 488 503 479 431 413 430 426 381 353 391 459 491
1192 491 481 464 453 438 426 441 474 491 487 495 529 560 558 530 499 473 456 463 502 552 585 596 595 575 529 478 453 453 452 450 471 513 533 504 462 458 489 506 482
1187 482 443 428 436 449 465 486 502 501 494 502 520 524 510 502 524 564 598 608 593 557 516 495 494 489 471 465 488 505 478 436 438 480 488 428 360 351 380 386 361 347 350 344
1182 344 329 341 391 445 487 533 572 554 474 405 415 471 498 478 456 453 450 432 416 412 404 394 403 431 442 421 400 410 432 428 406 407 434 445 411 358 336 362
1177 362 409 444 456 446 424 394 369 363 377 396 405 401 398 405 418 430 442 454 455 438 415 409 424 445 463 483 513 545 567 580 587 580 546 489 439 424 439 449 426
1172 426 382 356 369 399 412 409 413 433 449 448 450 481 527 547 518 468 442 455 480 482 452 415 399 412 437 457 466 470 470 469 470 462 430 389 385 440 512 538 508 468 456
1167 456 460 460 459 470 486 499 504 496 465 431 440 499 551 537 475 427 415 411 398 395 410 428 446 473 500 498 468 446 444 435 403 385 415 474 520 534 514 454 372 330
1162 330 378 477 541 534 496 473 463 448 435 445 471 487 474 436 392 365 369 402 452 499 521 506 469 442 437 431 399 362 362 404 450 478 501 526 530 489 425 391
1158C91J2K6Lj0J1K6nm7k8M6Q1K4n4n4PM1K0nj3k9m5rO0P4J5l4k2j0m9o7LQ7P7pm6j6J2QJ4
1153D88L3J3m4o2k3J2PLK1K0j8m2k2KmjL3M8Ml8j8L1L4jj3RJ7jj4k1l8m8k1K7L6Lj6J2M4L3
1148D85mk2pJ3J3lj2%J7J6lj3PL8N4N3L5j0p0r7o2JK8J5oj8k4j2K9N3J9m4n8j6J4j1m7m4j1
1143B96J5L4N5O1L5nl0l5k9rL0N6M5Ll4m0j1K3K5j9o5o5k2J2J3K0M9N4Kn9o1j3K1K1J7K3J7
1139D30ok3k1j4q%J1J4J6K8L4J1k5k7J4M6L2MJK2L1J0l0n9o0l2kKj2qJ7K9Qj2LL2K5j8m2j6
1134D05K5L5Lk7k4NJ4ql5l2mK0K4K0Rj2l1k7rj1l4l4QN3N5K9J0ll0m8k7J0J8KJ6O0P1K4k5
1129D95k8qqj3JNk6n3k5L0M4Qj4J2L9K8%oqk8m4j8K9M1Mm0m9k9j0LJ2K3K4J4OJ2K5K9Nl0m3
1124D09k1J4L0J9ok2j9jQkk2j8OK0Mj8j6RK3J6Lnoqrj5k5k9j8KJ6K5L2K5mk7j2L1N2L4Pko
$$ plain form
1158 391 403 429 432 422 433 459 454 407 379 425 506 530 476 422 429 470 490 485 472 443 398 389 449 523 538 504 482 472 423 356 359 446 523 516 470 454 466 474 488
1153 488 521 534 490 428 405 417 424 427 448 468 450 408 386 388 384 383 416 464 468 430 412 443 477 476 463 472 489 488 474 453 415 367 346 373 409 412 396 408 452 485
1148 485 481 459 452 465 478 475 463 463 480 496 493 480 487 525 579 632 667 657 587 490 428 429 457 472 466 448 424 412 441 494 513 469 411 395 409 398 351 307 296
1143 296 311 345 400 461 496 491 461 426 397 388 418 474 519 522 488 448 437 460 485 466 401 336 314 326 339 359 408 462 464 405 344 331 352 373 390 413 430
1139 430 424 401 380 366 358 358 369 383 399 427 461 472 447 420 434 480 512 516 517 539 570 580 550 491 431 399 397 399 387 379 396 425 433 421 424 456 481 463 421 405
1134 405 430 465 468 441 417 422 436 428 393 361 357 377 401 421 430 418 387 360 351 340 306 272 280 333 388 417 427 424 394 346 319 329 347 349 365 425 496 520 495
1129 495 467 459 451 438 439 444 418 365 340 370 414 422 408 420 459 487 487 481 473 445 401 383 412 453 457 417 368 339 329 332 344 367 391 405 411 423 448 477 482 452 409
1124 409 388 402 432 451 445 423 404 403 411 409 387 369 375 395 399 381 365 374 397 413 416 411 405 397 388 373 348 319 301 303 319 344 376 401 397 370 358 389 441 475 482 480 474
1119D74k9n0l2J6N1M5J6kKK2K8Ol6n2k6J0J4j3l1j5QJ1OJ1K2J9j0m3o1n2k3J3L1K8J6J9L4
1114D27L3Mk4j0L6N4J0m9m8J2M3Jn3l3L5O1J7k7j6Rpm6n0j1J8J0j1j6nQK1L0K8J7J0O%rj1
1109D64j0j4j6JK3J1l2m9kN9N6j6p8o5KM3K7j6k3J5M3K3k0l1jK7K4L0N9O9J5o2q2l6J1J9J3
1105D81J1jk9l2ML5K7KjNkj3rj1m3o6k9L6N5Pl6k1K9M9K5j6k7JM5N6J6l9o1n3m4k7J1M4L8
1100D17PLK4J0m1n4mM0J4l4k8J0J3k2l8k2rqJ2N2O1J8l6m4JO0Q6O0Km5n7n1m1j4L1O0M1QL
1095D85Rj0l5j7K9M4J8J1L3L0j8m9l0pl0n8l7J3K9J2PK7K9j0n8o4j2N6P4K0n6q0l8J4M3O3
1091D37P1L6k8n0j7on1p5j2O9O8J0jM1M5ql9j8%k6m5j4K5K6Kj6l6n7m8%M1L8K4K8K6%k0lJ9
1086D36Mk4k5m%j5k2k1l1l4nL6M1RrJ4M0L2lk4j0K8N3L3j8m8k1L3N5K5l3q1q7m3K3N3K8JJ6
$$ plain form
1119 474 445 395 363 379 430 475 491 489 491 513 541 547 511 459 433 443 457 444 413 398 406 417 423 434 456 475 465 422 361 309 286 299 330 358 374 393 427
1114 427 460 464 440 430 466 520 530 481 433 445 488 489 436 403 438 499 516 489 473 482 475 429 379 368 386 396 385 369 364 372 393 423 451 468 478 484 484 475 464
1109 464 454 440 424 425 448 459 427 378 376 435 491 475 397 332 334 377 404 388 365 380 423 446 426 395 394 421 445 475 534 603 618 556 474 438 449 468 481
1105 481 492 491 462 430 434 469 496 498 497 502 500 487 478 467 424 358 329 365 420 427 391 370 399 448 473 457 430 431 476 532 548 509 448 395 351 324 335 379 417
1100 417 424 427 451 461 420 366 362 402 416 382 354 364 377 355 317 295 286 278 290 342 403 421 385 341 342 402 488 548 550 505 448 397 356 342 373 433 474 482 485
1095 485 494 484 449 432 461 505 523 534 567 597 579 530 500 493 463 405 368 381 410 422 429 456 485 475 417 353 341 397 471 491 435 355 317 331 374 437
1091 437 508 544 516 466 449 443 392 317 305 374 442 452 451 492 537 529 490 472 472 446 401 387 412 438 440 424 388 331 283 283 324 362 386 414 440 440 420 417 436
1086 436 440 416 391 387 387 372 350 329 298 264 259 295 336 345 336 350 390 422 419 395 385 413 466 499 481 433 412 445 500 525 492 411 324 281 304 357 385 386 402
1081D02L8J9j6lM3M6qm7k5Mnj5K2P4O6kn7m9mK4J5pj4%J8K3J6J0%k4m6m8l4k5k0OM6N7K6m
1077E02%J9J5jnjppJ6M5L6Jj1J6L8K5kj3LK8N0N4M0J7Npl6o2m8KL7K6kj4qnJK4M3K8rl2l0
1071G71k0j2nLjqjJ8K4Mk0k6j8qpj6l9n9n3j3K4K4mj4J2L9K8j4m2k7RK6Qk1l1k0lMPJ2J3q
1066E36l7m4k1MKj1jK9M3K4LMJ2pm1m8j0L0K2k6n2k7K0L1Kk1j2Loj9JL5M0RoJ9M3K0l0m3j2
1061D58J2Lj5lK8L8Ql5m6j2K8J8l5o7l1L7P0N6L7K7jm6o8m4j5j5k4oJ5Ml0l6j4PK0M4O2L4
1057D63l3p1m3KJ2NK8O4N7Ok7%M9O3L2oj9rKrm0o5n4j3K0K1PPJ2pl2l1jK2J6%mkKJ7L9L1j3
1051D98m6k2L0M4J1j6nK1L0J8Jk1l7l3k2j9k2nK8L7J8OJ6J0k2l3lK4Qj6JL3K6jMK8J5l1m4
1046E09qJ3mqJ9L0ml5k1Joj1K0M6K2j9j5J4J1j8j1L0L4j2m2j7J1j3n3m5MK5qm0j9L8O0K2k9
$$ plain form
1081 402 440 459 443 440 483 529 521 474 449 453 448 433 455 529 595 593 536 487 483 507 522 515 501 501 519 542 558 568 568 544 498 450 416 391 371 377 423 480 506 502
1077 502 502 521 536 535 530 529 522 515 531 576 612 613 602 618 656 681 679 666 669 697 747 801 841 858 863 856 820 758 710 712 749 775 773 759 751 746 747 771 814 842 833 801 771
1071 771 751 739 734 737 736 728 727 745 769 773 753 727 709 701 694 678 639 580 527 514 538 562 558 544 556 595 623 609 567 540 549 575 583 562 531 511 508 512 519 531 544 536
1066 536 499 455 434 438 440 429 428 457 500 524 527 531 543 536 495 447 437 467 489 463 411 384 404 435 437 416 404 407 401 382 383 418 458 467 461 480 523 543 513 470 458
1061 458 470 473 458 455 483 521 529 494 448 436 464 482 447 380 349 386 456 512 549 576 575 529 461 417 402 387 363 357 372 376 346 310 296 303 323 367 429 463
1057 463 430 359 316 318 330 335 363 427 484 490 463 463 512 575 607 601 582 573 575 566 526 461 407 394 414 435 442 449 461 454 422 391 390 412 428 428 424 422 424 441 480 511 498
1051 498 452 430 460 504 515 499 494 515 545 563 564 543 506 473 451 432 410 405 433 470 488 494 510 520 498 465 462 486 494 478 479 512 538 537 541 569 584 553 509
1046 509 501 514 510 502 521 551 547 512 491 492 486 475 495 541 563 544 529 543 554 536 525 555 589 577 535 518 529 516 463 418 422 447 439 399 380 418 478 500 471
1042D71k4L3O2K0m3n6qL9N0L4J0j0j0J5L1Pk6j8K6L6j3n4l7KMk1k6rknOK7L1J2mlKOJ2J4j
1037E80k8m0k3QL5L8K0K%Nj2m5l9J1M1Mm5k6L9N5Lm3k7J4K7K5K5Nm3p0l4K6M0J1rjRQQJ6K1
1032E91K2J5lk9l4kL1K4oj1QJ7NMJ7J3rpK5L7Qk8k9j9k3k4%J6j0m4l3NJ5lQO0R9P6K1k1l8
1027G44m2m0l6l6k3J5N3L7k6o6l7J7K3j3l7k9j4mK0N2N9L4J0J7L0J3k6m3k0J7K6Kk3j9QK5
1022F68K3J6J3QPJ6K9K1j2l4j6Okk7k4J0L5L7M2N6M2j2n3l1K6M7Mm5l8K7Q7Q6L2j0KM1M7J7
1018A141LJ9K7NoK5O2N0Lk3j0J6L1L8L7K7J4Qpl4m7j7K7M8M6N6O5M8K1L4O8N2j9n3KQ4J04
1013A945P9O3O1L9K0N6J29J57J10N3M3N6M9L2M1P0Q8R1J06J42J71J80J89K30K98L64M12M59
1010E733N35O51P85R05J001J096J208J328J421J456J430J365J274J152J006Q76Q20Q58R77
$$ plain form
1042 471 447 480 542 562 519 463 455 494 544 578 588 578 568 583 614 621 595 577 603 639 626 572 535 537 541 520 494 485 483 478 484 511 542 554 550 547 549 555 567 581 580
1037 580 552 512 489 497 532 570 590 592 592 597 585 540 501 512 553 557 512 486 525 580 583 540 513 527 554 579 604 609 566 496 462 488 528 539 530 529 538 546 554 570 591
1032 591 613 628 625 596 562 560 591 615 609 598 606 623 628 632 649 662 653 646 671 708 716 688 659 640 617 593 593 609 599 555 522 527 542 539 547 607 706 782 803 782 744
1027 744 702 662 626 590 567 582 635 672 646 580 543 560 583 570 533 504 490 486 506 558 617 651 661 678 708 721 695 652 632 649 675 677 654 635 643 668
1022 668 691 707 720 728 735 751 780 801 789 755 739 745 743 716 692 702 737 774 816 872 914 902 849 818 844 891 895 850 812 839 926 1012 1044 1034 1036 1077 1124 1141
1018 1141 1144 1163 1190 1195 1189 1214 1276 1326 1329 1306 1296 1312 1343 1381 1418 1445 1459 1467 1460 1426 1379 1362 1389 1437 1483 1539 1604 1652 1673 1707 1775 1827 1808 1755 1757 1841 1945
1013 1945 2024 2087 2148 2187 2207 2263 2392 2549 2659 2712 2755 2811 2860 2892 2933 3003 3091 3182 3288 3430 3601 3781 3970 4200 4498 4862 5274 5733
1010 5733 6268 6919 7704 8609 9610 10706 11914 13242 14663 16119 17549 18914 20188 21340 22346 23222 24042 24900 25877
1007B5877J148J351J561J756J924K056K090J944J603J181Q12N34L19J84J99L84O54R26J206
1005D7709J501J734J763J518J039M10k77r14j388j646j724j690j568j354j068p63n00l27k86
1003D2169m16p11j113j512j814j970k002j955j857j705j505j289j096r52q72q72r44j056j169
1000A7359j272j348j364j305j225j193j189j124r56p64o46n96n47m75m06l46k73k02j71j73
998A784j58j15q5r2r1n9l3m6n4k4Jm1j16j28o1J2K9Oj5k3k6j7ork3k8j8k2m2m6k1OJ4K1M7
994E21O2L5j9m9l5mJ8J6%j4j0J1K5K1J1Lj9n6p0l4J4K3kj2MOj7l4k1%PJ3K8L5J5j4l2l9m5
989C42l7mK8K5j%L9O9M3j2m1k4OK0J8J4Oj4l1k6pjj6k9k6k1l0l4rM2Q2Q1M7Qj4k2k4k6k0J0
984D11M6N0Pn9r2p3j5L9N3J9l4m9j2L5M0J7PJ2pn1p4m2J1L8L7K9J9ONK5L8J8j6k0KOj9l6j5
$$ plain form
1007 25877 27025 28376 29937 31693 33617 35673 37763 39707 41310 42491 43303 43837 44156 44340 44539 44923 45577 46503 47709
1005 47709 49210 50944 52707 54225 55264 55674 55397 54483 53095 51449 49725 48035 46467 45113 44045 43282 42782 42455 42169
1003 42169 41753 41042 39929 38417 36603 34633 32631 30676 28819 27114 25609 24320 23224 22272 21400 20528 19584 18528 17359
1000 17359 16087 14739 13375 12070 10845 9652 8463 7339 6383 5619 4973 4377 3830 3355 2949 2603 2330 2128 1957 1784
998 1784 1626 1511 1426 1334 1243 1184 1151 1105 1051 1027 1028 987 871 743 682 694 723 729 714 691 665 648 642 633 610 582 564 542 500 454 433 439 453 474 521
994 521 583 618 599 550 515 511 529 545 545 531 521 532 557 578 589 592 573 517 447 413 427 450 448 436 440 446 429 395 374 374 381 394 422 457 472 458 426 387 342
989 342 305 301 329 354 353 353 392 461 504 492 451 427 433 453 471 485 491 477 446 420 413 412 396 367 341 320 290 256 247 289 371 452 499 507 493 471 447 421 401 411
984 411 457 507 514 455 363 290 275 314 367 386 352 303 291 326 366 383 390 402 395 344 270 228 239 277 314 343 362 368 373 398 436 454 438 418 420 426 407 371 356
979C56K0K6%j8qRLl0m7j8K6K9j5m6j9L3M2J0rLPj4k8j2jj5rM4R0O1lj7K2L3j1m2k0Nrk5PM4
974D54K6k7m2j2%k0k5pml4l9MM4K7j7k2J1K3jk5j4J7L8L1J0lOK6K3nj8KK0j1o4p2k1L1L1n
969C36k7j7KJ4K6M9O8N0j4p4o9jN8M4j6n5m5k1rlJMOJ2J6Nj1qOPkJ5N5O8K6l1m6j9PNj2k1
964C79j0J1J7ol2j9L1O1M4Oj6k5l4k2J9M4J4m1n0jN3O5L5ql5k7QJ8k4p5o8j1L1K2LJ2K7J4
959D10o%J8J3k0m5l4nQnj7qK2M4M1K0Jk2m3m9j9K3L5Rj8k1lJ8K8J5k0m3j5M2N8J6k6k5lmj4
954C56JK9L0Kj2%J3Kj2j4qrj2nJ4L6L8J4j3j5MMk6m4j1M4N9J9k5k8nJ2Qqk3k9k0qnj1j3j1
949C18j1nJ3K5J3rmK8M4K3pj1pj5k4pJ6Rk0k7kJ4%j2RM4M6J1k0k2j4j8j9NM3N4K2k0l5k0n
944D03pk4k7oL1M6K3j5l1j0J3J1jJ1L4L2ml4l1j0jlKJ0Ooj2j1j8l4l6j3J8L0K0J4K5M4M8L7
$$ plain form
979 356 376 402 402 384 376 385 388 358 311 293 319 348 333 287 268 301 343 353 344 347 354 340 312 300 299 284 275 319 409 470 467 450 472 505 494 452 432 437 428 403 410 454
974 454 480 453 411 399 399 379 354 347 343 309 270 274 318 345 328 306 317 340 339 314 300 317 355 386 396 393 399 425 448 443 425 427 447 436 372 300 279 310 341 336
969 336 309 292 294 308 334 383 451 501 487 413 344 343 401 445 429 374 329 308 299 296 297 301 307 319 335 340 329 321 327 334 332 347 402 470 496 465 419 400 407 412 400 379
964 379 369 380 397 391 359 340 371 432 476 482 466 441 407 385 404 448 462 421 371 370 423 488 523 515 480 453 461 479 455 380 312 301 332 354 357 369 396 410
959 410 404 404 422 435 415 370 336 331 339 334 317 309 331 375 416 436 437 415 372 323 304 327 362 371 353 332 329 347 375 390 370 327 312 354 412 428 402 377 374 370 356
954 356 357 386 416 418 406 406 419 421 409 395 387 378 366 361 375 411 449 463 450 435 439 443 417 373 362 406 465 484 459 431 426 438 446 438 415 386 366 358 353 342 329 318
949 318 307 302 315 340 353 344 340 368 412 435 428 417 410 395 371 364 380 389 369 342 340 354 354 342 351 395 441 452 432 410 396 378 359 364 407 461 483 463 428 408 403
944 403 396 372 345 339 370 416 439 424 393 383 396 407 406 417 451 483 479 445 414 404 403 400 402 412 418 412 400 389 371 337 301 288 306 336 356 370 395 439 487 524
939E24K2Oj7m0l0K1O7N3j0m7j9L6N7L5Pqk1l9m0j6J0J2pj6LM0O2N1K0kopj8k7j9lKpkK0L5
934F82K5Qoj8k8j0M2P6L9m5r4o6j5kj5pK7L1j1o4p9o0l1jL4N8O1M5K3ll6o0m5JM1M2Rk9m5
930D74k2J4K6jk7j3J9K1oj5NJ1j7m3k6J3K8J6%j2k6k4JJ6mk7kN5Q5O6L2Ll2n9l9J3K8j6n1
925D64k0K9K8lpK1K7QJJ2Qj5j2J4Qm5q2m7K4N7L8Kk6l9k7J7N2L9j5n4m5pK2J6j6m4k8K5N9
920D39K7m0p3n0j5KJ4L7N1M1J9Mj0j8kL5M6J0l3l6k0k8m4k0L5O2M0K0K9L2lm3m6k0kmj1j7
915D08j3J2M3L2k8o5k3M8N7Ml1rQj0k5JL2K2l%J3Jk7k7qpk5k0PJ8OMJ3Lk7k7K1O0L9qk3nN
910D46mj3j3qJ0L0K1j9l8jM7L6j4j9K5L6j0n0l7j7l5l6K2Q2N5k4n0KM9L7Pjql3m5k5nj4k0
905C66MK9K3OJ6K8Kl9l9jK4K2K5K8ln2n8oL3J1k3j6J3J2j1mL1M0J1j7j7j4l4m9l1OK8K8L0
$$ plain form
939 524 546 552 535 495 465 486 553 606 596 549 530 566 623 658 665 657 636 597 557 541 551 563 556 540 543 583 645 696 716 714 708 701 683 656 637 634 636 629 627 647 682
934 682 707 715 709 691 663 653 695 771 810 765 671 605 590 588 573 566 593 624 613 549 470 410 379 378 412 470 531 576 599 596 560 500 455 456 497 539 548 519 474
930 474 452 466 492 491 464 451 470 491 485 470 475 486 469 426 400 413 441 457 457 445 419 395 396 412 408 381 379 434 519 585 617 620 588 529 490 503 531 515 464
925 464 444 473 501 498 491 512 539 547 548 560 568 553 541 555 563 518 436 389 413 470 508 510 484 445 418 435 487 526 511 457 412 405 427 443 427 383 355 380 439
920 439 466 426 353 303 288 290 304 341 392 433 452 456 446 428 426 461 507 517 484 448 428 400 356 336 371 433 473 493 522 554 551 508 462 442 440 436 425 408
915 408 395 407 450 482 454 389 366 414 471 475 444 435 443 433 408 409 441 463 460 460 473 474 447 420 412 405 380 360 367 385 391 395 408 411 384 357 378 438 477 469 446 441 446
910 446 442 429 416 408 418 448 469 450 412 411 458 494 480 461 486 522 512 462 425 408 373 337 359 441 496 472 422 424 473 510 517 516 508 475 430 405 400 386 366
905 366 370 399 422 428 444 472 474 435 396 395 419 441 466 494 491 439 381 375 408 419 396 380 393 405 394 390 421 461 472 455 438 424 390 341 310 316 344 372 402
901D02L4K3j1m0l8nL1L9K0j2l1l0j1RJ3Jj3j0NJ2Jj5j4MK5L2K4Lj5j6%J7K7M2M6J6m4p4l6
896D11K4L1qk0J4L0j2n0k1L7M1rl7rK5K4Jj2k2l4l0oJ4J4J4K5K5nk6j0J5Mk7k5%jk7k1L0N4
891D21J6k2kM0K7k5m0%K4ml7k6NJ7J8L0L5Nl5l6lJ3lj8j0lj2j6KK5K7K0K5K7ln1o1j1N0O2
886D71K5rnJ3Ol1n7l8QM0L6Rj1j3mLL%MJ7J3k1n7n2oK1Jk8lN6O8J1m1k1L7N4J9rJ2L8J6l8
881E37o9m7mJ7Rpj2mRJ3LmKJ6J9Mqj0lmj2j8j8nJ6L1J3l0n2k4K2L0jj8J0M7M7J6lPJ6OplR
875E36Prk2k3j3nqk0l3l3j6NJ5Kk1k8mL2M2J5j8j5J8L2Qk3j2L4O1K8m0p8n4JL3K2lj8k4k7
871C44j0L0N0J8l1l5NK9Nj8oK1J9LQK4J4j1j7qj4k8j6K4M5L2J7J9J7mj3PK3J3nn%j6k9j7j
866D83j6m0l2qqk1JM4L6k6n6kO7O5Km1l5j1jJ1K8L0Lk2j6J0K3Rj6l3l2j9rnkJ6M3N9M9J9j4
$$ plain form
901 402 436 459 448 408 370 365 396 435 455 443 412 382 371 380 393 394 381 371 376 388 389 374 360 364 389 421 445 448 433 417 417 434 461 503 549 565 521 447 411
896 411 435 466 458 438 452 482 470 420 399 436 477 468 431 422 447 471 472 460 438 404 374 368 382 396 410 435 460 455 429 419 434 438 411 386 386 385 358 337 367 421
891 421 437 415 413 453 480 455 415 415 439 435 398 372 377 394 412 442 477 482 447 411 408 421 418 400 390 387 375 359 361 386 413 433 458 485 482 431 370 359 409 471
886 471 496 487 482 495 501 470 413 375 383 423 459 468 457 444 440 443 446 446 450 467 480 459 402 350 344 365 366 338 335 391 459 470 429 408 445 499 518 509 521 559 575 537
881 537 468 421 417 434 443 436 424 420 429 442 445 441 443 459 478 482 474 464 461 457 445 427 409 404 420 451 464 434 382 358 380 410 409 391 401 448 495 511 508 515 531 537 530 527 536
875 536 543 534 512 489 476 471 463 443 410 377 361 366 381 383 362 334 330 362 404 419 401 386 404 436 444 421 409 443 504 532 492 414 360 361 394 416 413 395 371 344
871 344 334 364 414 432 401 366 371 400 405 387 381 402 421 424 432 456 470 459 442 434 420 392 376 400 445 477 494 513 530 526 513 520 543 556 551 546 546 530 501 484 483
866 483 467 427 395 387 379 358 359 403 439 413 357 355 422 487 489 448 413 402 401 412 440 470 473 451 435 445 468 477 461 428 396 377 368 363 361 377 420 479 528 547 533
861E33l7m6m3l3j9olo%K3N3N7K5k0m3l2kK3L1K1%k1l2k8pJ9L3K6J4J1Mk3n2m3%K2%j8%K3K
856D06m1l6J2M3K4%PK0Mk5l3k4j7j0J0L0K4JoNJ4Mj1j4qkQK0L4L8K2j2l6l1pOKJ0L7M1no1
850D43o4j2L3L0NKJ9K8Ql2o8p1k4L4N5K9NK3M9L7ok0J3L8Qm6o2k7RJ0ooJK%J9M5L8j0m8l3
845D48J7M3K1j4k1JJ4Nj1j4orl0m2j9J9K9%l3l6j7KK4N9P3L8k6n3k8Jnj6KL1K3k1n9m8MN5
840D01O3L1kMK6J2l8n9k1K6J7k6l2MJ8rl0rK6M2M8N2L6pl0LN7P3N2M0M5L7jl1l5k4j8j5j4
836G12k1k0J4N7M6k6q7p8k9rj9oK8L7Kk9k7j5k1k4r%j0j2J2L2J3k3k4oj0k7j2L0M4J1j2RK5
831E16qn4m3PL4K6K7M4L1k4p0n6pK0K4L2M2K4j8m1l0j1j2j9MM0M7J0k8k4LRj3k2mJ6J1LK1
826E07M2J8m6q9o6qK7J3j9l2j2J7K3kk6j1L2M6Pl9l3K0O1N1Rk1k2NM0N4K9j8l8j9Mlk5l2k3
$$ plain form
861 533 496 450 407 374 355 349 346 340 340 363 416 473 498 478 435 403 401 424 455 476 476 455 423 395 388 407 440 466 480 491 495 472 420 377 377 399 399 381 381 404 406
856 406 365 329 341 384 408 408 415 435 439 414 381 357 340 330 340 370 394 395 389 394 408 412 401 387 379 377 385 405 439 477 499 487 451 420 413 419 421 431 468 509 504 443
850 443 379 367 400 430 435 437 456 484 492 460 392 321 297 331 386 415 420 443 492 529 523 503 516 554 562 516 454 427 436 446 440 434 435 437 437 456 501 539 529 481 448
845 448 465 508 529 515 494 495 509 514 503 489 483 474 444 402 383 402 431 431 398 362 345 347 371 430 503 541 515 462 434 435 430 414 416 447 470 449 390 342 346 401
840 401 464 495 493 497 523 535 497 438 417 443 460 434 402 406 424 415 385 376 402 444 492 544 580 573 543 546 603 676 728 768 813 850 849 818 783 759 741 726 712
836 712 691 671 685 742 788 762 675 597 568 559 540 534 562 599 601 572 545 530 509 485 476 476 466 454 466 498 511 488 464 458 448 421 409 439 483 494 482 491 516
831 516 508 454 411 418 452 478 505 549 580 556 486 430 423 443 467 499 541 565 547 506 476 465 453 434 438 478 525 535 507 483 486 495 482 460 456 472 483 486 507
826 507 549 567 521 432 366 358 385 398 379 347 335 352 375 373 347 336 368 414 421 382 349 369 430 481 490 469 447 452 492 546 575 557 519 500 504 501 476 444 421
821D21j7j6LL5M4J9j2j9poj6pK8N3K9l4p9o2mL2J2k4j7L4O6L7k2m5j1L7M8J7k0k9j7j0k2k9
817C90nL1M2J3j8j9nnj2oJ5K7K7L4L9J5l1m7j0K7J5k4l4oJ3LmJ1J8j0m3l7jJ9Lj8rK0L6K3
812D77%nJ0K1J0j6m2n0m3k1J1M7P1O8L4j5n4n7k6PJ2pk0pJ3K5K1Oj9m4m8j5L5O0N1K6Ork1
807D92k4j5nqj8j9kK2L3L2J3k3p1q8m8L1Q8Q9N5J4k9o9p7l2K8M4J4qRK8J1k5l4j1J7L7N4N5
802E60K4k7n0k4K4L9J1k8l0NL4J9k4m5k5jrk9j8J9L3Mk4oL5N1K2j1oK8M5J9l1n4k8QKl6m9
798D27jN4M9ml4rJ6j4n9m8J3M0mm8j8N1P5L2j7k2j0rj2KK2K1Nrj2kJ5K6J1k1k3RL3Rk4k0Q
793D98J4LRK4Kn0o4j1N0N8K3oj2mJ0J8jm5p2n0pJ2J2J9K7J5j2j4J1L0K0qk6k9k3j1OK0K0N
788D61j3pL2O8N6oo5p1m4k7l5m1k2J1L8N1M7K8J0OJ1Rj%J6K6J5qj5PL3K7k0n8m1K0O1N0J8
$$ plain form
821 421 404 388 391 426 470 489 477 458 451 445 429 422 450 503 532 498 419 357 353 385 397 373 356 390 456 493 471 426 415 452 500 517 497 468 451 441 419 390
817 390 385 416 458 471 453 434 429 424 412 406 421 448 475 509 548 563 532 485 475 502 517 493 459 453 466 469 465 476 494 484 441 404 403 422 425 407 398 418 454 477
812 477 477 472 482 503 513 497 455 405 362 341 352 399 470 538 572 557 503 446 420 427 439 432 412 405 418 443 464 470 451 407 359 344 379 439 490 516 522 513 492
807 492 468 453 448 440 422 403 401 423 456 488 501 478 407 319 271 302 390 479 534 548 519 450 373 341 369 413 427 419 428 456 467 442 408 397 414 451 505 560
802 560 584 557 507 483 507 546 557 529 499 504 538 557 533 488 463 462 453 424 406 425 458 462 438 432 467 518 540 529 523 551 596 615 584 530 502 510 512 476 427
798 427 426 480 529 525 491 482 498 484 425 377 390 430 426 378 360 411 486 518 501 479 469 460 448 450 472 493 498 489 477 475 490 516 527 506 483 492 525 534 510 490 498
793 498 512 515 524 548 550 500 436 425 475 533 556 550 538 534 544 562 561 516 444 394 387 399 411 430 457 472 460 446 457 487 507 499 473 444 421 410 416 436 456 461
788 461 448 441 473 541 597 591 526 455 411 384 349 308 286 297 335 386 433 461 471 477 488 497 496 496 512 538 553 545 530 537 570 597 577 519 478 498 559 609 627
783F27jj2k7l2j8qj7j0L1N7K2l5l5J0J4m1p3l2K6L4J3J0K6K8Rj0l0m2k9NK3Jj4OL0J0l9o2
778D15n1l1qK9N6M2Rljk9o5n0K2P3O0K6J6Rk4n6m3mR%QL3L1pl8k4RK0J3J8L2K5ok1%K5J8l
773E34MJ7ro2p1rM6L1q%L6K8j6j8K9M6jm6l2jrk4MM6L9kj3J6K2j0l3k0mo%K5K9j1n1l1J6J9
768E00l1o0j5O1Q0K3m0m5kL1K7PMJ5K4J9nm5p1n3%L4J8j4j5jj0l0j8K6N1L2Opk0m7n1mO5R3
763E32O8K8jj5j7pRJ3Lrk2l8n2n1k7OL7M6K9%j2%J1RPJ6J6j1k8mK7Mn6p0j1M1K3l4n9l8oJ4
758C71K8K9J2LJ7K9Ml0k1J0ln8p3j1N1M0qj9QJ9OMK2K2MRL9L7j3n0j9L7L9j8n8l0K8N4L2k
753E41j5rlLJ4L1L4J5pj1nj3l0l3j9j5l3m0j3K5M2L7K5%l4m6j7J7K3J2K2M3L3j0m4n0m8m7
749C75l2jJ3QJ6M7N9L8RL%j3k0omk9m7l1oKJ2M8O9M0LJ5N3L6k8n8l0lj2j2L3P1N3Oj8j9k7
$$ plain form
783 627 626 614 587 555 537 529 512 502 533 590 612 577 542 552 566 525 452 420 446 480 493 503 529 557 566 556 526 484 455 460 483 484 470 476 506 516 477 415
778 415 364 333 325 354 410 452 461 458 457 428 363 313 335 408 468 494 510 519 495 439 396 392 401 401 409 442 473 466 428 404 413 433 446 464 496 521 515 494 494 519 537 534
773 534 538 555 546 484 413 404 450 481 473 473 509 537 521 503 532 578 577 531 499 498 489 465 469 515 554 552 539 555 577 567 534 514 510 504 504 529 558 547 496 465 481 500
768 500 469 409 394 455 535 558 518 473 471 502 529 536 540 555 579 598 593 548 477 424 424 458 476 462 447 446 436 406 388 414 465 497 503 496 476 429 378 374 439 532
763 532 600 628 627 612 595 588 597 610 613 604 582 544 492 441 414 420 457 503 532 532 520 520 531 540 547 563 579 568 540 536 563 567 511 441 430 471 494 460 401 363 357 371
758 371 399 428 440 443 460 489 493 463 442 452 449 391 318 307 358 398 390 371 379 398 404 408 430 452 456 465 504 541 528 478 459 496 535 517 459 429 457 511 543 541
753 541 526 517 514 517 531 562 596 611 604 593 588 575 545 512 493 478 445 405 392 417 459 496 521 521 487 441 424 441 464 476 498 541 574 564 520 470 422 375
749 375 343 342 355 363 379 426 485 523 532 535 535 522 502 496 492 463 416 385 379 381 393 441 510 550 553 568 621 657 629 571 541 538 526 514 547 618 671 677 659 640 613
744F13l5j7PQj4k1j7j8k5j2PNj2rK0L9K9J2jj9l8l0J3N5N4K3pk0k0j3NJ7Rj4k5k0j7k7l5k9
739D21j1PJ1J1PMknLJ8L1K6J3RJ7K3J5lj5j4rlLMLKJ0J7Nk1l9l2j2%%j0k5m5m4j3L2M9L5J9
733D92J9J6%j3jJ4Rrj9j8k0k1JK6K2rk6rK0L0J8Kj5k1lK5L1Qj3j7j7j7MM4N5J7j2J4N2L2l0
728F61n7l2k0m1n3j8L0N1M7K4j4n3m8jL4K3nj7k1k7k0QJ7pj9J9O3M7ql5k3j6k3oK9L3ol7k9
723D50j4rJ0M2M3ll7k0J0ml1j4L2L8kk4%K5J7jOK1J5j0j5PK7J4j9l6k2kqk7k4J3M2L4Mj5j8
718D95k4k5oJ6J3omJ4J9lj4JK1K0QJj1k9k4QL8L8J9J1Lk4n6o0l4pJ5M2O5O0K4j5l8m2k2J2
714D99K9J0j4nJ1nl4j7L6M8lm6k9Kpk9pL5L8Lj6lNJJ3L3J5m2o9k9K7M2K5J0Jj7k6pK0J8%K
708E18K5L3J0rPL6K8k3p1o7k1J0Jj8MM7N7K4kJ4L4Pl8m4qJ4ql7l2rlpKJ8J6rk6j3J3K9L3L3
$$ plain form
744 613 578 561 568 576 562 541 524 506 481 469 476 481 469 460 480 519 548 560 559 540 502 472 485 540 594 617 610 590 570 557 562 579 588 574 549 529 512 485 450 421
739 421 410 417 428 439 446 450 448 443 446 464 495 521 534 543 560 583 598 595 580 566 557 554 557 561 564 566 576 593 598 577 538 506 494 494 494 484 459 414 370 357 389 438 473 492
733 492 511 527 527 514 513 527 536 527 508 490 470 449 450 476 498 489 463 454 474 504 522 524 509 488 485 510 541 549 536 519 502 485 489 533 588 605 593 607 659 691 661
728 661 604 572 552 511 458 440 470 521 568 592 578 525 477 476 510 533 528 511 490 463 443 451 468 461 442 461 524 571 563 528 505 489 466 460 489 522 516 479 450
723 450 436 427 437 479 522 519 482 462 472 468 437 423 455 493 491 467 467 492 509 508 514 535 550 540 525 532 559 573 554 518 496 494 486 459 435 448 490 524 528 513 495
718 495 471 446 440 456 469 463 459 473 492 489 475 476 497 517 525 526 515 486 462 470 508 546 565 576 579 555 499 439 405 398 413 455 520 580 604 589 551 509 487 499
714 499 528 538 524 519 530 525 491 474 510 558 555 509 480 482 475 446 439 474 512 515 499 496 501 502 515 548 563 521 452 423 450 492 517 527 528 511 485 478 498 516 516 518
708 518 543 576 586 577 584 620 648 625 554 487 466 476 477 459 463 510 567 591 589 603 637 644 606 562 554 568 560 523 491 482 479 472 474 492 508 499 473 460 473 502 535 568
703E68K8Ok4l0lK4J7j9l8j3L2N0L0nk7l1k4oJ3J9Pj1j6j8k7m0l4nK5L0J2ok4m5n8l1K8O9O2
699D85L0J5J7Lk3k5PL5K7kj2MK0J4j0k3oK1K3j0k9KM1L0j8k5K2M8On4o7m0j9j1RK5J7%kll3
694D89o3m1J2L5J9J3K4J7j1j1K4M1Ql3l5j5n%J2K2K1J8J8ll0k0L1N9K3l5n0l1j8j5MK7K9J9
689E49J0jk7l5lL2K4olL5N3K4j9l4k4oMkk3l0rJ5J1molk1m1k6Jkj8jL6L1j4k4J4L8J8PL7M6
684F03j0o5l6L6N1Mk3jK1Oj2NL1L0mm0n3l9nJ7QpRN0O5K7l2n7l8pJj0k2j9kJ1Opj0qolQK2
678D95K8K2J3Mj4l0k7mJ5J7J2J3J4LomOll5o0m2J3M4K0k4k6J2L8J4j9j9QJ6MmKPOJ5L3L5J1
673F03j0r%j1k5j7J3L1J3j3k0j1pj2jL2N4M2Rj0pLJ1J6J0j7m0l3r%mJJ2j0m8m0K7P3M5j4l2
668E95j8j4j3J3L5Pm3m5kJ6noK7L6ml6j4K0K2J6M2O8M3j1l8l1k7l4k3JKj8k7j2lj2pK3M4L3
$$ plain form
703 568 596 602 578 548 545 569 586 567 529 516 548 598 628 623 596 565 541 535 548 567 574 563 547 529 502 462 428 423 448 478 490 484 460 415 357 326 354 423 485
699 485 515 530 547 550 527 502 509 544 571 569 557 561 581 595 585 562 556 577 600 590 561 563 604 634 616 591 613 661 667 613 546 506 487 476 485 510 527 527 525 522 489
694 489 426 385 397 432 451 464 488 505 494 483 507 548 556 523 488 473 468 468 480 502 523 541 559 556 526 506 537 596 619 584 534 503 485 470 474 501 530 549
689 549 559 558 531 496 493 525 549 543 540 575 628 652 633 599 575 569 573 571 548 518 509 524 535 531 525 522 501 460 434 435 433 415 414 450 481 467 443 457 495 513 520 557 603
684 603 593 528 492 528 579 583 560 559 580 586 574 579 610 640 636 596 543 504 499 516 524 517 526 576 641 668 636 579 541 534 535 525 503 484 482 493 499 492 482 474 468 465 473 495
678 495 523 545 558 562 548 518 491 487 502 519 531 544 558 561 555 551 557 554 519 459 417 430 474 494 470 444 456 494 508 489 470 478 494 498 494 496 503 509 524 557 592 603
673 603 593 584 584 573 548 531 544 575 588 575 555 544 537 525 524 556 610 652 661 651 644 647 658 674 684 667 627 594 585 585 581 582 594 584 536 496 523 596 641 627 595
668 595 577 563 550 563 598 605 562 517 515 531 526 520 547 583 579 543 529 549 571 587 629 697 740 729 691 660 633 599 576 577 579 561 534 522 519 507 500 523 567 600
663F00J5J9L2J5k7n3m5k4j2KK6M3K5rk2lQrk5lK9K0k1l1PL7J3k7l0nJj6j9OK2J3KRPk9p0n6
658D15K3R5Q4%n9l0M2O5K8mJ2L1J4qOK3j6q6j01l6M1O2L6Jl0n0l7J7O2N4Qj2RK8Ml7m9k4K
653E83KnMK6L0J0k1m6n7m1NN3N5J1k4j0K5L3J5KJnj2JJ9J0j8k6JK6K3Qkj1k3k4j4j7l7l7l
648E10L4K5j6l6j0L8O8N6J4k9m1l0k9m4l4K5P9P0J0k3pJ1jk1j3jj7m3l3J2L9J8k1l2j1J2J6
644E45J0Mlj0j1njlJK2M0K6j2l1qL8N5L0j5m6m2j1K3K9ll6l0J8N5L7j5l6LN1M9mn3o1m0j1
639E49K6N3L4k0m8j2L8K8k6m5%M2L3NJJ3Nj5k1j2pj4k2k2j5PL0K5j0l2j8kj7l6k1J3K0PK4
634E38O6P4K6k4k6oj2l9m3j2K3K5ml2l0pQNjRK0K0J8K5K3j3o2o7j6L6M4J4j5k3kL5N4K3m2
629F10p1l7J4K7MrLK8N1O2M3nm8n4l3j3ML0M6K0k8l8NM8M2mm5m6qM3P3N4Qk4k5k3l3m1k9j1
$$ plain form
663 600 615 634 666 681 654 601 556 532 520 522 548 591 616 607 585 582 590 581 556 553 582 602 581 550 557 594 607 580 550 545 546 530 511 517 539 552 554 563 570 541 471 415
658 415 438 533 617 617 558 528 570 635 663 659 671 702 716 708 714 737 721 635 534 498 539 601 637 638 608 558 521 538 600 654 662 650 659 687 691 654 605 581 583
653 583 585 580 584 610 640 650 629 583 526 485 490 543 598 609 585 575 600 633 648 650 651 646 634 635 654 664 646 620 621 647 670 678 676 665 642 618 604 587 550 513 510
648 510 544 569 553 517 507 545 613 669 683 654 613 583 554 510 476 501 580 650 660 637 630 641 640 619 606 605 588 545 512 524 563 581 560 528 517 529 545
644 545 555 559 556 546 535 530 529 526 527 549 589 615 603 572 564 602 657 687 672 626 584 573 596 625 622 586 556 574 629 666 651 615 618 669 718 714 661 600 560 549
639 549 575 628 662 642 594 582 620 648 622 577 577 619 652 657 658 671 676 661 640 628 621 607 585 563 548 555 585 610 600 568 550 548 531 495 474 487 507 514 538
634 538 604 678 704 680 654 648 636 597 554 542 565 590 586 554 524 517 525 530 529 538 558 578 596 621 644 631 569 502 486 522 566 580 565 542 540 575 629 652 610
629 610 539 502 516 543 547 538 541 569 620 682 725 720 672 618 585 572 576 606 652 672 644 606 611 659 701 697 652 606 598 641 714 768 776 752 727 704 671 630 601 590
624E90mplKmj2mJ4K0ROJ4K2K0J6J0j6m9n1rL7L2mpL2O1L3j6k2RK5%l1l0rmk2m1m0j9KJ4J3
619E77J2J6J8Pk0l3j5J6K0j6n0l8QM1L4PlJ2K7K7K2K3K3J1qj6j2kjm%J3K5J4j8l9k2J4J9j2
614F77k5PM6L5j7n2m3j8JJ9L3K0j5m5m6k1J2L8L5nm6l4J6L5om1j2M0M4NqK3M7K1k3m2k4jJ
610F31j0j1OK7J5k1l9j0L7N2K8M%MMjrk4l3k5qkJJ0K0J5%rj0j2j1NJ8Kl4m7j8K0L7K5nl4l8
604E50%M4M6Nk3j2J5K6K6K2Qj2k1j4j5k0MN6P4K3m4o0l0j1j7k0LL4M1K2j6m6m3oK7K4KnJ0
599F47K5K1Mk4m4l4RL9K6nj9j1pKK9M0Pl6k6L2N7J7l1l9k2qJ0K5Ln2p2oP9Q8J4n6o1l1j1k
595E77OJ0RJ2L3N4N0J4k7m1k7%J3kk6l6k2OK3K6K3K2J1j4m0l6LM1L6Lk2j6JJ8L2L4J4j8k4
590G20PL8L8J2j3l1m3l2OL4K5mj9j8k1j8NK9J7k4m9l7j1J1L4M9L1j5l3jL4J6k9m0j4MopJ6
$$ plain form
624 590 586 579 576 578 574 562 558 572 592 601 607 621 643 663 679 689 673 624 573 564 601 633 629 622 654 715 748 732 710 719 744 744 713 683 674 670 648 607 567 548 550 564 577
619 577 589 605 623 630 610 577 562 578 598 582 532 494 502 543 577 584 581 593 620 647 669 692 715 726 718 702 690 688 687 683 683 696 721 735 717 678 656 670 689 677
614 677 652 659 705 740 723 671 628 610 611 630 663 683 668 623 577 556 568 606 641 636 590 556 572 607 601 560 548 588 632 637 629 652 699 720 697 655 631 630 631
610 631 621 610 616 643 658 637 598 588 625 677 705 709 709 713 717 716 707 683 650 625 617 615 616 626 646 661 661 652 642 630 619 624 642 644 610 563 545 565 602 627 622 588 550
604 550 550 594 640 645 622 610 625 651 677 699 707 695 674 660 645 625 629 685 759 782 738 678 648 637 620 600 603 637 678 700 684 638 595 589 616 640 642 637 647
599 647 672 693 697 673 629 595 604 643 669 664 645 634 627 629 658 698 705 669 643 675 732 749 718 679 657 649 659 684 687 635 563 557 636 724 738 682 621 590 579 577
595 577 583 593 602 614 647 701 751 765 738 697 670 670 683 681 655 619 597 603 626 652 675 697 708 694 654 618 621 662 698 701 679 663 664 682 714 748 762 744 720
590 720 727 765 803 815 802 771 728 696 702 736 761 757 738 720 699 681 686 715 732 708 659 622 611 622 656 705 736 721 688 687 721 737 708 668 654 658 652 645 661
585F61L5J1l2m4j6J9K8L0M9P1N7ko5p8m3lNj1k4j9QL9M6J2l6m3jL2J6j8j3K5L8Pj9mK7L2M
580G81l2o1o4l3J2L9L8L5M7M3Ll7l7pOqj3RK8J3k8n7m4KM5M9K1mkOkoJ8M3K5j9l5rKk2m1j4
575F90K4J9j3k3jJ5J1J0L3N8M8Qj9lL2K6l4q8p7k1J4MrLJ3RJ9N2O2J3n2o1j7K3K7J9J7K1J8
570H70lm1p1m3M6J13Q3qn6k8J6K5Qj1k8k3RL6J4k9j7M4O8J6l4j6L2M0J5MOLPL6N9M3J1NJ7
566A218J9L2P4J17J23J19J48J80J61J26J49K23K49J84R2M0Rl9q9j18j40j76j99j79j28q7q4
562B024j09j31j14n3Jqn9q7o9n5o4n7j2K4Rj3QN1M4pm1k4J3L2L5L3K8K0K2M1O8R7J18J31J51
558B047J93K44K72K71K91L63M56N04M80M01K76J12n9j88k60l03l33l39l20k92k70k55k53k61
555B777k51k03j44j29j58j68j15m7k9n9p3m1KJ1j0k1mJ9K0j2m9o1l5LK6K7K4M0O7P7N5K4K5
$$ plain form
585 661 696 707 675 631 615 634 662 692 741 812 869 867 802 724 681 678 683 672 648 629 637 676 722 734 698 655 654 686 702 684 671 696 734 741 722 718 745 777 781
580 781 749 688 624 591 603 642 680 715 762 805 808 771 734 727 733 725 712 721 749 762 734 677 633 635 680 729 750 746 744 750 748 742 760 803 828 809 774 765 767 745 704 690
575 690 714 733 720 697 696 711 722 732 765 823 871 879 860 857 889 915 881 793 716 695 709 713 704 707 720 729 748 800 862 875 823 762 745 768 795 814 831 852 870
570 870 867 826 755 712 758 871 954 946 890 862 878 903 911 900 872 849 858 894 908 879 862 906 974 990 956 940 972 1012 1027 1031 1037 1040 1047 1083 1142 1185 1196 1201 1218
566 1218 1237 1269 1343 1460 1583 1702 1850 2030 2191 2317 2466 2689 2938 3122 3214 3254 3263 3224 3135 3017 2877 2701 2502 2323 2195 2108 2024
562 2024 1915 1784 1670 1617 1618 1610 1551 1464 1395 1340 1276 1219 1207 1231 1240 1227 1235 1286 1330 1323 1282 1258 1271 1303 1338 1371 1399 1419 1441 1482 1550 1647 1765 1896 2047
558 2047 2240 2484 2756 3027 3318 3681 4137 4641 5121 5522 5798 5910 5851 5663 5403 5100 4767 4428 4108 3816 3546 3291 3038 2777
555 2777 2526 2323 2179 2050 1892 1724 1609 1562 1533 1474 1401 1360 1362 1373 1363 1342 1338 1357 1377 1365 1316 1255 1220 1223 1249 1276 1300 1340 1407 1484 1539 1563 1588
551A588O7J08J09Q7R3J44J98K20K13K07K01J61P7k3j03j51j89k16k05j43p5o5j21j78j77j25
548A702p7o0n3m6m8n9n6l0JOqj2QL2K5j9o5p1l3PJ6RK0M1M1Rk2l4m2n5n0j3K9L7Pk5l6k1J0
543A065M5N8L5nk7k4j9k2j6J4M3L4j1m9m1PN2N3J2k6k0K9P5P7L4j9l9k5%Ojooqj3rQJ9Ok1
538A265l4k3KK6M5N3M2J7rj9j3NK9M4K8j7n8o1l0mlj1KL6N2L3mk0qJ1J3JpkNLKJ2K9M0M0L8
533A550L2J6pj4ppl0m9k5K5N3L6Kj4j9k2k0oKqj7nJ7K2J6J7K2J7%oJLoj1mOJ5K1J8OlJ4M1
528A672M0J4KK0K1j8n3l3K1N1M5L2K4Lk1qK9L0k6p3m2M0R1Q1N8N9O0K4l2n3l0MK4L1L6K1j7
523B127m4l3RL7L6L0M1M3J7k6m6l3nJ9K8K6J8K6N9Q8P5J8l6m9k8jJ7K5K8K2J7J9K1K0J8K9
519B612M2L2kl1k2J4M0L9L1L2K9Kl3m0rL5N7N2L4K0K3M8P1N9J5j7qJ6J9J0J8M3M7K8K0N0Q6
$$ plain form
551 1588 1655 1763 1872 1959 2052 2196 2394 2614 2827 3034 3235 3396 3473 3450 3347 3196 3007 2791 2586 2443 2368 2303 2182 2004 1827 1702
548 1702 1625 1565 1512 1466 1418 1359 1303 1273 1274 1280 1272 1260 1268 1300 1325 1306 1241 1170 1137 1144 1160 1169 1189 1230 1271 1280 1258 1224 1182 1127 1077 1064 1093 1130 1137 1112 1076 1055 1065
543 1065 1110 1168 1203 1198 1171 1147 1128 1106 1090 1104 1147 1181 1170 1121 1080 1087 1139 1192 1204 1178 1158 1187 1262 1339 1373 1354 1315 1290 1290 1296 1295 1289 1283 1275 1262 1253 1261 1280 1286 1265
538 1265 1231 1208 1210 1236 1281 1334 1376 1393 1384 1365 1352 1357 1386 1430 1458 1441 1383 1322 1292 1288 1285 1274 1276 1312 1364 1397 1393 1373 1365 1376 1389 1390 1383 1381 1386 1389 1391 1403 1432 1472 1512 1550
533 1550 1582 1598 1591 1577 1570 1563 1533 1484 1459 1484 1537 1573 1575 1561 1542 1520 1500 1494 1496 1488 1471 1466 1483 1505 1521 1538 1560 1577 1577 1571 1572 1575 1569 1558 1554 1560 1575 1596 1614 1620 1617 1631 1672
528 1672 1712 1726 1728 1748 1769 1751 1698 1665 1686 1737 1782 1814 1838 1841 1820 1812 1841 1871 1845 1772 1730 1770 1861 1942 2000 2059 2119 2143 2111 2058 2028 2032 2056 2087 2123 2144 2127
523 2127 2083 2050 2059 2096 2132 2162 2203 2246 2263 2237 2191 2158 2153 2172 2200 2226 2244 2270 2329 2417 2492 2510 2474 2425 2397 2396 2413 2438 2466 2488 2505 2524 2545 2565 2583 2612
519 2612 2654 2686 2684 2653 2631 2645 2685 2724 2755 2787 2816 2818 2785 2745 2736 2771 2828 2880 2914 2934 2957 3005 3076 3135 3150 3133 3125 3141 3160 3170 3188 3231 3278 3306 3326 3376 3462
514C462Q7N9M0M5N5N3N0N6O3O2N5N6N6M4L0L9O6O8K4k1mO4J14J11Q8Q3P8N0K9M4Q3R7Q1P7
510E444R0R6Q0P1R7J35J57J52J31J14J15J43J66J58J25J06J21J39J42J54J94K33K44K43K66
507I116L05L18L01K86L02L41L86M35M71M77M72N00N62O12O16O34P27Q65R62J003J069J217
504B1977J405J575J752J990K279K579K914L362L954M642N440O472P882R709J1886J4326J6992
502A21136J9937K3284K7132L1427L5900L9958M2448M1646L5972K5211J1171l070j4764k2623
501D14765k6884k8660k9183k9215k8811k7663k5687k3253k0847j8684j6715j4841j2999j1148
499A00175r326p686o352n282m349l504k753k071j416q21l38O4M81R55J465K000K570L178L831
497G0821M581N500O620P983R674J1820J4576J8122K2535K7634L3137L9083M5909N3985O3222
$$ plain form
514 3462 3549 3608 3648 3693 3748 3801 3851 3907 3970 4032 4087 4143 4199 4243 4273 4312 4378 4446 4470 4449 4445 4509 4623 4734 4822 4905 4983 5033 5062 5106 5189 5286 5367 5444
510 5444 5534 5630 5710 5781 5878 6013 6170 6322 6453 6567 6682 6825 6991 7149 7274 7380 7501 7640 7782 7936 8130 8363 8607 8850 9116
507 9116 9421 9739 10040 10326 10628 10969 11355 11790 12261 12738 13210 13710 14272 14884 15500 16134 16861 17726 18688 19691 20760 21977
504 21977 23382 24957 26709 28699 30978 33557 36471 39833 43787 48429 53869 60341 68223 77932 89818 104144 121136
502 121136 141073 164357 191489 222916 258816 298774 341222 382868 418840 444051 455222 452152 437388 414765
501 414765 387881 359221 330038 300823 272012 244349 218662 195409 174562 155878 139163 124322 111323 100175
499 100175 90849 83163 76811 71529 67180 63676 60923 58852 57436 56615 56277 56341 56822 57777 59242 61242 63812 66990 70821
497 70821 75402 80902 87522 95505 105179 116999 131575 149697 172232 199866 233003 272086 317995 371980 435202
495D35202P3162Q2814Q9698Q9426P7637N3512K1550j0504l5885n1740n9176o1422o1655o1467
493E81152o0616n8108n3656m8137m2796l8286l4455l0798k6978k3041j9335j6186j3634j1507
491A03619r688q195o975n867m805l891l206k649k077j506j014n87j43L38Q31J352J956K646
489F0139L423M342N489O920Q667J0777J3233J5932J8826K2030K5685K9758L3970L7756M0023
487C36970L9118L3530K3060R421m467j5921k3592k7657k9257k9657k9582k9069k7852k5878
486A99167k3459k1037j8873j6956j5129j3286j1448r749q294p093o088n232m501l870l321
484C0831k863k506k221j959j709j501j355j241j121r88q56p48o80o54o35n83n05m43m18l88
481G457l27k55k21k28k42k36k19k03j95k03k22k29k02j56j23j17j22j31j45j55j40r5n5n7
$$ plain form
495 435202 508364 591178 680876 770302 847939 901451 923001 912497 876612 824872 765696 704274 642619 581152
493 581152 520536 462428 408772 360635 317839 279553 245098 214300 187322 164281 144946 128760 115126 103619
491 103619 93931 85736 78761 72894 68089 64198 60992 58343 56266 54760 53746 53159 53016 53354 54185 55537 57493 60139
489 60139 63562 67904 73393 80313 88980 99757 112990 128922 147748 169778 195463 225221 259191 296947 336970
487 336970 376088 409618 432678 442099 437632 421711 398119 370462 341205 311548 281966 252897 225045 199167
486 199167 175708 154671 135798 118842 103713 90427 78979 69230 60936 53843 47755 42523 38022 34152 30831
484 30831 27968 25462 23241 21282 19573 18072 16717 15476 14355 13367 12511 11763 11083 10429 9794 9211 8706 8263 7845 7457
481 7457 7130 6875 6654 6426 6184 5948 5729 5526 5331 5128 4906 4677 4475 4319 4196 4079 3957 3826 3681 3526 3386 3291 3236 3179
478C179r0j13j11r1p2n7n5o3p9q5q0p2o8n9n7p0r0q4m3j2l3p7p3j5J5l1r1p8pK4j8o4m7MK6
474A263J2knk1m1l6j0mk5l4j0J0j3n8p6m8j9j6k4qL1M8J9k5l2j0nl1m2j7jl4o9m5K4N0J6j2
470G00LJ7j2n2n3k8rKJ8K2%k5k3j3j5rJ9L9J6k3k1RK0Pknk6m5k9Kpn3o5k2J8J9K0M7O1K3k5
465E00k5MJ0qNM7O0J9k9l2JK5J6LJ9N0N8K0k8l7j6lj4j2K2N8O4L8Mj8k1NL1K0k3m8l1m%kQ
459G36Ol1o8o3k4%QK1L2Pl8n2k4Kj0l7n2n0m2k9j4j1j3lJ3J4PJ3L3K7pl1l0k4l0k4J4N0M3
455C19RpMPj4l4k6nPlj3pJ3K0kl0k8LK0ll2l1qMMJ2K8K7jk9k4NK9K2nk3rK5L9J8j7l6l9m0
449A49l9j8J7M0L2J1qk7n3o1k4L4O4M7Qj2j0LJ5K7L6M0L6K0pk1pJ2ll6l2K4O4L1k7l1PKo0
445B43r4m4K9N3M1L8L3mm6l4J1K6mk7j6JmqJ%k1l3j9RK3K6K3J0mjK1K8J2jJ3K8K0QQNrj6J1
$$ plain form
478 3179 3089 2976 2865 2774 2702 2645 2590 2527 2448 2363 2283 2211 2143 2084 2027 1957 1867 1783 1740 1728 1695 1618 1545 1530 1545 1514 1423 1345 1338 1362 1344 1280 1233 1237 1263
474 1263 1275 1273 1268 1247 1206 1170 1160 1156 1131 1097 1087 1097 1084 1026 950 902 883 867 843 835 866 914 933 908 876 866 861 830 788 771 770 736 667 622 646 696 712 700
470 700 703 720 708 656 603 575 566 568 586 608 608 583 560 547 532 523 542 581 597 574 553 562 582 589 587 582 556 511 482 484 477 424 359 337 355 374 394 441 502 525 500
465 500 475 479 489 481 486 533 593 612 583 551 552 577 593 596 615 665 723 743 715 678 662 659 645 633 655 713 777 815 819 801 780 785 816 836 813 765 734 730 730 728 736
459 736 742 711 643 580 556 556 564 585 617 624 586 534 510 512 502 465 413 363 321 292 278 267 254 251 264 278 285 298 331 358 351 320 290 266 236 212 226 276 319
455 319 328 321 325 332 318 284 258 253 260 257 244 237 250 270 268 238 210 213 233 230 198 167 159 163 167 179 207 234 233 204 180 185 214 236 231 208 199 224 263 281 264 228 189 149
449 149 110 92 109 149 181 192 184 157 104 43 19 53 117 164 172 160 150 153 168 195 231 271 307 327 320 299 292 304 301 265 233 257 321 352 325 294 301 303 243
445 243 149 105 134 187 228 266 299 295 249 215 226 252 248 221 205 206 202 194 195 195 174 141 122 131 154 180 203 213 209 208 229 257 269 268 281 309 329 337 345 350 341 325 336
439C36M4M5K9L9Q0J08R7Q6J15J65J87J64J43J66K22K45J95R9J5l2o7j05j40j62j75j70j40
436A589r4p6j02j37j46j24q8n1k3j5k8m5m9m4l4k2k0l1l0J0N5L9k7n4LO6N7QLM1O1N9P2R7
432I20Q9O4Q9J73K37K44K46K98L70M08M27M55M61L78K04J0j37k23k65k85l04l30l52l52l24
429B501k79k34j97j71j57j47j35j16r0o7o1o9o5l9j5k4n3n3k3kj0j7LK5J3k4m5l4j2OK5N2
425D86P2P2N6M8P4J22J46J30J13J42K04K35K11J66J27P9J3m7p8j04j39j62j52j34j43j58j34
422A245q6p2j12j47j19m5Kk1q2j11q0k3Lqj5NK9L4L0K4Kl4m8k3%k0n5m6jK2jk5j9kjj2k3l3
417A32l6k0QK2J4J4L1M2K8J5K3K9Kk9j3L4M2j4o7n8j6ql8m7oL6L6RLJ7J8ok5j9MK2K4J1lk
412B09J6J9ok4jL5K1l7o4l1Lj0l1rL0L5Oj0kNOJ6K2Pj2oJ6J5rj8nmj3JM0N4K2j8k1lNmj1j9
$$ plain form
439 336 380 425 454 493 573 681 778 864 979 1144 1331 1495 1638 1804 2026 2271 2466 2565 2580 2548 2481 2376 2236 2074 1899 1729 1589
436 1589 1495 1419 1317 1180 1034 910 822 771 748 733 705 660 611 567 533 511 491 460 430 440 495 534 507 453 456 522 579 587 590 631 692 751 823 920
432 920 1009 1073 1162 1335 1572 1816 2062 2360 2730 3138 3565 4020 4481 4859 5063 5073 4936 4713 4448 4163 3859 3529 3177 2825 2501
429 2501 2222 1988 1791 1620 1463 1316 1181 1065 975 908 847 778 713 674 659 635 582 529 506 504 494 477 480 505 518 494 449 415 403 409 434 486
425 486 558 630 686 734 808 930 1076 1206 1319 1461 1665 1900 2111 2277 2404 2483 2496 2449 2371 2267 2128 1966 1814 1680 1537 1379 1245
422 1245 1159 1087 975 828 709 664 666 645 563 452 372 349 352 344 329 334 363 397 427 451 453 419 371 348 348 328 273 227 226 248 247 222 203 201 200 188 165 132
417 132 96 76 84 106 120 134 165 207 235 250 273 302 304 275 262 296 338 324 257 199 183 175 137 90 84 120 156 165 168 185 203 197 172 153 157 179 203 214 211 209
412 209 225 244 238 214 213 248 269 232 168 137 140 130 99 90 120 155 161 151 149 154 160 176 198 205 193 187 203 218 209 191 186 182 169 170 210 264 286 268 247 244 249 245 234 215
407B15k8k0J1L8L0ml1l2j2J6L5L0Kk2k4lJ2Oj1j6MK1Kl3k6L0N8Lp3p7j5K8K5K2L4K2j8j8L5
402B16N7Qm1k3J5on5m5K7P6O2J2m2q5q3k2M9N7Qk2j5j9l6j5N4R3N2j0j4J7Mn1p2j8N6P0J7
397B76l8m4j4RRJ0K3K4Jj4PK5ro3n5K2P7M5k5m3rK1J7lj5j7oJ3J4j4l7j9J8J9j3k6LL4K4r
392B18k4j9j8j2J3M1L2j0l6j6J5J6qj8j2m%J5L1K1k1n5m7kM5O1L3j4l1KM6L7j5m1k1KmpK2
388B15L7%m8m2KJ3k6n1l2J5N7P8N7j6q2o9LL9Ll6j1M8P6N8J3l9o5l0M1O9J8l7k8J6K7J0K0
383C03M4K2n4j06p1J5P1N5jm0l7oJ6J9K3J9j5o5o6nN4M9J8J6K7nn2m1K1L5k6p9n4PL6K3J6
379A66K9M3M1K3j0m2m4j7QJ4J9L1K8Kj1RK0ol6j9K0K7JqJ8L5J1k5l7k4nJ4L0L6K9J1nk0k8
374C28k7k1k7l9l5%M0N9M8K5Rlj3k0j6qmj4k5k4rPJ5Rpk7k9pK0K6J4J1J8J3j5l7k0J7L6L0
$$ plain form
407 215 187 167 178 216 246 242 211 179 167 183 218 248 250 228 204 201 213 219 208 192 196 217 219 186 160 190 248 251 178 101 86 114 139 161 195 217 199 181 216
402 216 273 281 240 217 232 226 171 126 153 229 291 303 261 176 93 71 120 177 185 163 148 129 93 78 132 225 277 267 253 270 274 223 151 133 189 259 276
397 276 238 194 180 189 198 208 231 255 256 242 249 274 265 202 147 169 246 291 266 223 214 235 252 249 234 217 211 224 238 224 187 168 186 205 192 166 169 203 227 218
392 218 194 175 157 145 158 199 231 221 185 169 184 200 192 174 162 158 158 173 204 225 204 149 102 100 145 206 239 225 194 196 242 279 264 223 202 204 200 193 215
388 215 252 252 204 162 164 177 151 100 68 83 140 218 275 259 177 108 111 150 153 117 106 154 230 288 301 262 197 167 208 277 295 258 230 246 273 283 303
383 303 347 369 315 209 138 153 224 279 278 238 201 195 211 230 253 272 257 192 126 121 175 224 242 258 285 280 228 187 208 243 217 138 84 91 127 150 166
379 166 195 238 279 302 292 250 206 189 197 211 230 261 289 291 280 289 309 303 267 248 268 295 296 288 306 341 352 327 290 266 261 275 305 341 370 381 376 356 328
374 328 301 280 253 214 179 179 219 278 326 351 360 357 344 324 308 300 296 282 257 233 224 231 246 255 248 221 192 185 205 231 245 256 274 287 272 235 215 232 268 298
369B98J2mk4l1j6NLj1jK8K9mj3L0O6K8m4n7MM5J0m8m5OL2Kl8l9j5LJ2J4Mj7k7oK8L7K0NJ0
364B91L0L8K7Nj1j1%Kj1k1j7j2k0k8j6N%k3k1J9M5K5qpJ8J1l7p1n4rK3L0K1Jk3l3j1L6O7N5
359C05J0k6k0K2N9M9ln6p8o3k4K6N2L4j3l5j3J3OrQM1L3j7n7m3oJ4J8K0K2J2jkkqqJ1K8J8
354C17krj0k8m1j6L5M8J1k8l2j7rLJ8J0k4l3J0N6N1J5OJ9Km1n3j5J8J0qQM3N3L0kj6j3n%m
349C57roj0k5l6j7J4J1k2l4NM9L9j4m1j3M0O1L9lk9k7j2lqj0rppPL2L5Rk0j8PK4J9Jk5l8k4
344B82J8M4K5j6l7k5qkOK7M4M1J0l0n1l7jK5K2Qjj0k3j3K7N7L6j0k8oJ9J5%j6l7n5m7nL9N0
339C37L2Mj7j7KK5K2kj9j2mj1l2m2l8k6qJ4L0L4K4Qrk0k3k2j8jL0N4M8K3Loj6k4j0K0L7K4
334C94jk0k7k4pQQpk2k8l4k7JK9K2mJM0M8ko3p3m0kK3L8L9K2J4K4K5ol5k3J1K2%k1k2j7j7
$$ plain form
369 298 310 306 282 251 235 240 243 232 231 259 288 284 271 301 367 395 351 294 298 343 353 305 260 266 298 300 262 223 208 211 223 237 241 224 197 191 219 256 276 281 291
364 291 321 359 386 391 380 369 369 371 360 339 322 310 290 262 246 251 251 228 207 226 271 296 288 281 299 310 273 202 148 139 162 192 213 214 191 158 147 183 250 305
359 305 315 289 269 291 350 399 396 340 262 199 175 201 253 287 274 239 226 239 245 236 244 285 318 301 244 201 195 209 227 247 269 281 280 278 276 268 260 271 299 317
354 317 315 306 296 268 227 211 246 294 305 277 245 228 219 222 240 250 226 193 203 259 310 325 331 350 352 311 258 243 261 271 263 271 314 367 397 395 379 366 361 361 357
349 357 348 342 332 307 271 254 268 279 257 223 228 277 316 302 261 248 288 349 388 385 356 329 317 314 306 296 287 280 273 280 312 347 356 336 318 325 349 368 369 344 306 282
344 282 300 344 369 353 316 291 283 281 287 314 358 399 409 379 328 291 290 315 337 345 344 334 311 298 325 382 418 408 380 374 393 408 408 392 355 300 253 248 287 337
339 337 369 373 356 339 341 366 388 386 367 355 351 340 308 266 228 202 194 208 238 272 296 304 295 275 252 230 212 211 241 295 343 366 369 363 347 323 313 333 370 394
334 394 393 373 346 322 315 323 331 324 302 274 240 213 214 243 265 261 262 302 350 348 285 212 172 170 193 231 270 292 306 330 355 349 314 291 302 324 324 303 281 264 247
329B47j3%J3J8J1oj6KL7M0jm0l3NK5K3K0J1j8m0k3J7L1J4nj4k9m7m7k6j1KK5L9J7k4k0K8N9
325B71L1pj2MKj3rJ1K0J5Nlj0rkMNJ1K4K3Mj1lJ4J4rm2o4n2j1J6lm0l3K0N6M7L0L6L6lm3l7
319B83JJ4klK7M8K0m2r1q1oP6R0L3k4k1J1Rj9j3L4O5M2%k6l8m8n5m6k0RK4Pk9m5k0J8K7Qn
314B12%%p%K3K1j4m3l2PK8K5J4RJ0J0Lnj1j3j9k6j0L3O0M3NlK3L5J6mj2l4p1p8k9K4K6j6m5
309A55l5JM0O0M5Ml1l3j4LJ0Pj0l5l6jL3L2J5K3N1N6K8kj5k2l3l6l3l2k5kK7L8L3L4M6M2J3
305D01j7k7k5l0l3j7J1K2QrmJ6K3nm3m4pK3J3j2j3KOMJ4K1ll3j3M3N9J2k6LN4N2Lk5k1j9l8
300C26m4k6rj5k0mK3L4K8Qj3j4J6M6L7kj9OL1J4k7m9m1k7j2QK6J8nj9j5mKJ3K3J9jj7j2PJ6
295C06Kk4m3k8J5M4K8nmL1M2Km0l1NOk4l5qJ4Kk0j6OJ8J1L%LRK2L2L0J5ol2n1m9k9j0kJPP
$$ plain form
329 247 234 234 247 265 276 270 254 256 293 333 332 292 259 264 289 312 332 343 325 285 262 279 310 324 319 305 276 229 182 156 145 147 172 211 228 204 184 212 271
325 271 302 295 283 287 289 276 267 278 298 313 318 315 305 296 294 298 303 314 338 361 365 354 351 365 379 370 328 264 212 201 217 214 174 141 161 217 264 294 330 366 363 320 283
319 283 284 298 296 293 320 368 388 346 255 174 168 244 334 367 343 322 333 342 323 310 344 409 451 451 425 387 339 284 238 218 227 251 258 229 184 164 182 209 217 212
314 212 212 212 205 205 228 249 235 192 160 167 195 220 234 243 253 263 266 261 250 237 218 192 182 215 275 318 323 320 343 378 394 390 378 344 273 195 166 190 216 200 155
309 155 120 121 161 221 266 270 239 206 192 195 205 212 202 167 131 130 163 195 210 233 284 340 368 366 351 329 296 260 227 195 170 168 195 233 266 300 346 388 401
305 401 384 357 332 302 269 252 263 285 293 284 280 296 319 314 271 227 220 243 256 244 231 233 239 243 257 278 275 242 229 272 331 343 317 320 374 426 429 404 383 364 326
300 326 282 256 247 232 212 208 231 265 293 301 288 274 290 336 373 371 352 358 389 403 376 327 286 259 247 255 281 299 294 275 260 256 258 271 294 313 312 295 283 290 306
295 306 308 284 241 213 228 272 300 295 291 322 364 366 326 295 300 306 282 247 239 253 255 235 219 225 243 254 257 257 260 269 291 323 353 368 362 330 279 230 201 191 189 190 197 204
289B04knJ3L5L9K6J0pk4l3k7k1k4j5J8M3K0k8m0qJ5Jj0J2L9L0PJ6M2L5j2m5l9j7plRJ6RNJ1
284B88J1j1j8J7O5O1kn7n5j6PRJ4K7K1nk4k7l1m4m6k3QK0K2L5M7L1nl0l7l9l6rL8N6L2jro
279B78j0lL0N2J9l7m5kJ8oj8J2K9j2o1n1%K2J2J9M4M5K0J0J5kl3k8J4K0k6m9KN1K3m1m7OL1
275C01RpNPj8k8j3jnJK1J6pKM3M6j4n8k3L2K0k7k4K3K4l7p2l6K0L7K8K5K6J7J0J1Poj0mj5
269C26l6k7K2N1J8l3l9qNqj9nJ9L9M9L8jm0n0m0m4n5l8J2M8L8J1kjmj6k2j3OL1M8M4K3nk2
265C00l0l3k8j2MJ4J8J7J6J4J5J5J5J6J6Nj0j2OJ7mm3n4k0K3L2jl3l2KL9N0L3Pj2k3l3m2m1
260B11k5ML4N1L9Pk4k8j5%J3K9L5J2k6m0qM0N3K7KOK2J3k8n9m2QL5J8j7k9k0j1r%J1J1%j1
255B89j7k1j7NK6K2mj5JJ9J9PJ%MJ5L0L1J3Kjj3l7l5J0N1K7l9o9l3K2M7M0K7%l7n3k2K1J6
$$ plain form
289 204 202 197 210 245 284 310 320 313 289 256 229 208 184 169 187 230 250 222 182 174 189 190 180 192 231 261 268 284 326 361 349 304 265 248 241 238 247 263 272 277 288
284 288 299 288 270 287 352 413 411 354 299 283 290 299 313 340 361 356 332 305 274 230 184 161 169 189 211 246 293 324 319 289 252 213 177 168 206 262 294 293 284 278
279 278 268 265 295 347 366 329 284 282 300 294 276 288 317 305 244 193 193 215 227 246 290 335 355 365 380 378 345 317 331 351 325 276 278 329 352 311 264 270 301
275 301 310 303 308 315 297 269 256 255 250 251 272 288 281 283 326 372 358 300 277 309 329 302 278 301 325 288 216 180 200 237 265 290 316 333 343 354 361 355 345 341 326
269 326 290 263 285 336 354 321 282 274 279 271 252 247 266 305 354 392 391 351 301 261 217 162 124 136 184 222 233 231 230 226 210 188 175 181 212 260 304 327 322 300
265 300 270 237 209 197 201 215 233 250 266 280 295 310 325 341 357 362 352 340 346 363 359 316 262 242 265 297 296 263 231 233 272 322 355 362 350 327 294 252 211
260 211 186 190 224 275 314 321 297 269 254 254 267 296 331 343 317 277 269 309 362 389 391 397 419 432 404 345 303 311 346 364 347 318 298 287 278 278 289 300 300 289
255 289 272 251 234 239 265 287 283 268 269 288 307 314 315 315 319 334 364 395 408 410 409 396 359 324 334 385 412 373 304 271 293 340 380 407 407 370 317 295 316 332
250C32l1n1j0L3K2rKM4L7k6o1j3N0M1k7o9m8pK1L8L7Jm6m5ML4Qk8k1J2K5K2K6K9J3j1j7pp
245B97j1lJ1J9K2L0L4K5J8K1Mm6q8p6k2J7K6K0Mk5m1k1QKk4j4L0N0K0j7k1j6k1j5J4K9Rj7
241B32j8j1j8k9j6NJ0RK3M4M1K1NjmkOJ2MnlQJ3K1K8J5k4n6m5oJ9J6NMRJ2J2J0Mjqj5j4NJ7
235C34j2n5m6K3O8L0l6m4OK8ml9l4nJ9L5M0J9j5k2LL1L0Pj9l4k5PL0J1k8l5j1ql7m6JN4N3
230B74J3rLK0K3J8Qoj3kJ3J4NJjj5l1k8mJ8K6K5J1j9m4l3LL0K1mj7rkLJ1K2J9%j8rK5M3K6
225D11j4m2m0j9NJ7J2oj6nJ7K6K2J8J5%j8k3j5j2rKNk4n4m0J0L0Jj8PK4j1n6l7K8O0M1K5L6
220C53M0Ql4n1m6l4j7J1L6M2L1K1K2K6J8ql3l0lQj1k9pK8K8nk2oJ4J1rk6l6l0LM9O0K4l0n8
215C08m8j2L0M2Jo0p9l9J1K3J2J3K7K7Nj6k4k6k3j2MJ9K5K6J8Nj1k6l2k6nJ5J8Lj2j2jK1M9
$$ plain form
250 332 301 250 240 273 295 286 288 332 369 343 282 269 319 360 333 264 216 209 230 268 305 306 260 215 219 253 261 233 212 224 249 271 297 326 339 328 311 304 297
245 297 286 283 294 313 335 365 399 424 442 463 467 421 333 257 235 252 278 298 302 277 236 215 223 225 201 187 217 267 287 270 249 233 212 197 211 240 249 232
241 232 214 203 185 156 140 145 155 164 187 231 272 293 298 297 293 291 297 309 313 308 305 313 326 347 375 390 366 310 265 259 278 294 299 303 312 324 336 346 350 349 341 326 312 317 334
235 334 322 267 221 244 312 342 306 262 268 296 292 253 219 214 233 268 308 327 312 290 293 324 354 361 342 308 283 290 320 331 303 268 257 249 212 166 167 221 274
230 274 287 278 281 301 324 342 350 344 331 329 342 356 361 362 361 346 315 287 283 301 327 352 363 344 300 267 270 300 321 317 300 291 289 292 303 325 344 344 326 317 342 385 411
225 411 397 355 315 296 301 318 330 324 308 303 320 346 368 386 401 401 383 360 345 333 324 326 331 307 253 213 223 253 254 236 243 267 256 200 163 191 251 292 317 353
220 353 393 401 367 316 270 236 219 230 266 308 339 360 382 408 426 418 385 355 352 360 349 320 313 341 369 364 342 336 350 361 352 326 290 260 263 312 372 396 366 308
215 308 260 248 278 320 321 261 182 143 154 177 189 202 229 256 261 245 221 195 172 160 164 183 208 234 252 257 246 220 188 162 157 172 190 193 181 169 168 189 238
211B38O0L8pm0m4k5KK9M7M2J2j6k0%K5L1Km4o6m7j9j2oL1O9M3k8o1j5L4K1k0k1J5K7%k3j3
206B39J0K1J7J0J0J7J6nk9k6OK4J7J8M0M1mm6k7J7J3l6n4jN9O1Ln6o4j6M6O0K1j8j4Nnl1k8
201C11j2k1m3k3K9M5J1j5OK4Lj9mK3K3PJ1K2J1j6l3l4k6nK0K8J0ojMj0k0%K7J5k4m2k1QJ3
196B76jj4j4%J8K9K9K5J4pk5j1K2L1pm3l6nOoj7j8j3NL4L7ml8j4M0N5J7k3k9j9pJ0J8PJK4
191C47M4On8p2j8K7K3RK4L3Oj9KL4J2m6o9l8JJ5K0K1J2mMK8L2Jk4j2J0Jl1l9kM4N2J8k3l7
186C34k6rjJKPJ6K5J6qk6j7Jkk9m6l0JK2K1Qj4l0k2NL1L9L7L6K1j0l9l3mK2K8J7om0o0m2M
181B00L1K0mLL1L5rn0l5K8O6M4%qJ2J3j4l2k2rj8k3jL4M9L5Qj0pRJ7ml7l9jL1K4jj6k0j8K
176C14K9K3k9p0m5J1K6KLL5L5j0l9k1mk7m1MO9O9Mm5k9J4K7Mk4k9pK4L8L2K5K5J6k6p8q9n2
$$ plain form
211 238 298 336 329 289 245 220 222 251 298 340 352 336 316 316 341 372 374 330 264 217 198 186 180 211 280 323 295 234 219 253 274 254 233 248 275 275 252 239
206 239 249 270 287 297 307 324 340 335 306 280 286 310 327 345 385 426 422 376 349 366 379 343 289 288 347 408 411 355 291 275 321 381 402 384 370 375 370 339 311
201 311 299 278 235 212 241 286 297 282 288 312 315 296 292 315 338 345 356 378 389 373 340 306 280 275 295 323 333 327 326 330 320 300 300 327 342 318 276 255 263 276
196 276 275 261 247 247 265 294 323 348 362 355 330 319 341 372 365 322 286 281 287 281 264 246 233 238 272 309 305 267 253 293 348 365 342 313 294 287 297 315 322 323 347
191 347 391 397 339 267 249 276 299 308 332 365 371 352 354 388 400 354 285 247 248 263 283 304 316 312 316 344 376 377 353 341 351 352 321 282 280 324 376 394 371 334
186 334 308 299 298 299 301 308 324 349 365 357 331 314 315 313 284 238 208 209 231 252 260 246 216 194 199 230 269 306 342 363 353 314 281 277 299 327 344 338 298 238 196 200
181 200 231 251 247 250 281 316 307 257 222 250 316 360 360 352 364 377 363 331 309 300 282 259 258 292 341 376 384 374 367 376 393 389 352 313 312 343 367 366 350 330 312 314
176 314 343 366 337 267 222 233 259 261 264 299 334 324 285 264 260 233 192 196 265 334 338 293 264 278 305 309 285 256 249 273 311 343 368 393 409 383 305 216 164
171A64oJ6K0K8L5L4K8L1L4J8j3l3k9j7j4j4jK1K3lk9k8oQOkj2k6l3j4K3M6L1Jj1lRRKJRK4
166C27K7J7MMJ4Rk1m5l8j5nj2j3mLmj0qJJ2K2K3Pj3j1J2L1K4jj8j8KL8O5N3Pk6j9OJk7l5j1
161C55J7K0J4J5%m5p9n8%L3J9KK2N6O2L4lm0o2m7J6O7N2j2n2l8k1m2n7k1M4N9J2l6l7j3kq
156B26lK3M6M5J6j7l4k7qJ1L0M2L2nm0l7nJ9K0J4Qrl7n2m0k3j7JM5Q1O7J4l2m6l6j4J9L3P
152C17k5nN8Q6L6l6n7l3j1j0j2ppnJ1K8K2J0K3M7L4k8q2p6k5J9L9M2L8K3ol0l8j9QJ1k0m6
147B74k5K8N2K0k2k6KJ8Rmj2k4l0j9MK6M3N4M6J2k2k1LJ3ok2j8qj4k6j6J6M9N2J9k7n4n2l6
142B56j8NL0L7J6j0k2k8l0qM3P0L2k7l3RK0j4l4lK6J2j4nJ8J0j2rJ3J0j4k2kK1K9K3J1j0k6
137C50k7j0RL1M2K5j7l9k4nrj2J8M8K7j6j5K8M5J2k6l6l1k4mJ3om8m5J3N1K1j8%M1L5nk5j6
$$ plain form
171 164 158 174 194 222 257 291 319 350 384 402 389 356 327 310 296 282 281 302 325 322 293 265 259 267 273 271 259 233 200 186 209 255 286 287 276 273 282 291 293 294 303 327
166 327 354 371 375 379 393 402 381 336 298 283 278 266 253 249 252 248 238 230 231 243 265 288 295 282 271 283 314 338 337 319 301 303 341 406 459 466 440 421 427 428 401 366 355
161 355 372 392 406 421 421 376 297 239 239 272 291 293 315 371 433 467 464 424 362 315 331 398 450 438 386 348 327 285 228 207 251 310 322 286 249 236 234 226
156 226 223 246 292 337 353 336 302 275 267 278 308 350 382 377 337 300 295 314 334 348 356 347 310 258 218 195 178 179 224 305 372 386 354 308 272 258 277 310 317
152 317 292 287 345 431 467 431 374 341 330 320 308 301 294 289 300 328 350 360 383 430 464 436 354 278 253 272 311 353 391 414 408 378 340 321 329 340 320 274
147 274 249 277 329 349 327 301 303 321 330 326 314 290 260 241 245 271 314 368 414 426 404 383 386 399 393 371 353 345 331 305 289 305 354 406 425 398 344 292 256
142 256 238 243 273 310 326 316 294 266 236 228 271 341 373 346 313 322 342 328 294 291 317 329 315 310 328 338 326 317 330 340 326 304 302 323 352 375 386 376 350
137 350 323 313 322 353 395 420 403 364 340 335 326 314 332 380 407 391 376 404 449 461 435 399 368 344 340 353 347 299 254 267 318 339 321 321 362 397 392 367 351
133C51j4j5RL6J5m3p0l7J0K4K3L5L9J4j3oK2K9Lk4l1k6k3j9kK2L1J6jQK7K2j3l5oL9L3j8m7
128C65j3L4L4j3n0m4j3J3L0L7L0Rj4k9l0j7PK2J1ppJ6L2J8j0j9j1j0k6m0l0NM6O4M2ll4k7
123C68jJ0OOJ7J3j0k5j3MLoLK0K3J7K3K6jn4p9m5QL3L0L1M1K9rl7k4POl4o6n6k3nmJ2M0M5
118C29J5j6k4k0k2rJ9K0l1p2l5M6P4L2KK7N0J6l5l3J1L3J3rj7k5l6l0LL8N0K9j7n9n7rL9L3
113C23j8n6m4KM0M5Rm0n8k7K7N7N0J8j7m3l3LK4Nj7jL4L5NmJ5K2ol3l2j6lK0M3L7Nj0J1L0
108D02J2j2mJ9J6pj2Kll4n3l5PL6L4J0k0l5k8KL5N5N0K3j4m3n0l5mK3K5%k3j9mLQK0K3lk2
103C45PN4M4j9m5NN4K7m1o5l8lK4N1N2Jn9n2RL9Qk2lK8J9j4k4jL0L5Pm0o3l2K6M8J9j4j3J
99C85rk8l1j9k7m5m2%M4N3K2k0l9k7J0M5N3L0j0l4k6MK6K4J2RRlk1k0%J5Nj0mK0K9J3qroj9
$$ plain form
133 351 337 322 331 367 382 339 269 232 242 266 289 324 363 377 364 358 380 409 412 388 357 331 308 289 287 309 340 356 355 363 390 412 399 364 358 397 430 412 365
128 365 352 386 420 407 357 313 300 313 343 380 410 419 405 376 346 329 336 358 369 362 355 371 403 421 411 392 381 371 345 305 275 280 326 390 432 429 395 368
123 368 367 377 383 389 406 419 409 384 371 375 378 372 375 395 418 435 458 484 483 429 350 305 313 346 376 407 448 477 468 431 407 414 420 386 320 264 241 236 232 244 284 329
118 329 344 328 304 284 262 253 272 292 261 189 154 200 274 306 308 335 385 401 366 333 344 377 390 381 364 339 303 273 276 314 364 393 376 317 260 251 290 323
113 323 305 249 205 207 247 292 301 261 203 176 203 260 310 328 311 268 235 238 262 267 250 249 283 318 323 319 334 356 350 317 285 269 266 286 329 366 371 361 372 402
108 402 414 402 398 417 433 426 414 416 413 379 326 291 298 334 368 378 358 323 295 297 332 387 437 460 446 403 353 318 314 337 362 362 339 320 316 319 327 347 370 367 345
103 345 352 406 450 431 386 391 445 472 431 366 328 325 349 400 452 453 394 342 351 390 398 376 373 401 420 406 382 381 411 446 453 413 350 318 344 392 411 397 384 385
99 385 376 348 317 298 271 226 184 184 228 281 303 283 244 217 227 272 325 355 345 311 285 289 315 339 351 360 369 366 345 325 325 340 345 335 331 351 380 393 385 376 370 351
93C51m3l9PN4N2J9MJ7J2k3m7l1j2k7m1rM3M8Pk0KL3K5ol5m7l5JL2K6kJL9M9Km8l9PL2K9K3
88D11J1j8m4l5lPj6l0j4J1K3K4K5J7%j4k0k1rJ6L7L2OjJ8L0Km7o4k9K1L2Jk2kL9M2Ll6m0k4
83C19qJ7M2L5qk9PM3J4n0n0K1O9L5j9j7K5L1ol0j0J1kk5j7J3K3rm9n2j8J5K6K5K4Ok6l9rL1
79C59L2kk5j8j3k5k7QM5L8mk1J1M5L4j3m2k6LJ3J1J2Ok6n0k1M1N9Kn5m4RL1J5NJ9J7joKj5
74C83n4n3PP1P8L2k3o5q4n5RM9K7j3j5RJ3rj9oJ6L7O0O9L3k5n3k9QJ6mk3j5J8M9M2pn1n3k7
69C43pmKJ5J4J%J8L5L0J4kk2l7l2pJ1Kk0l0j9OJ9Jl6n1k1K2K3j0k1J2M4L9Rj1j3mJ5K9J1l4
63C34n9l3RK0J3K0L3K4ok1j5m%%nj8j6J3M1K7j5l0rMj2k2J1N6O4L2Jj3k0k7k6j0OQrk9l0L
58B90N4P7M9om1m0k0LK4L6K8J0pj6k3k8j8%Kj7l4l2j9j2qJ0L4M1K8J2Omk6m9m4oL2M1K1lk
$$ plain form
93 351 308 269 276 330 382 401 405 422 434 411 364 333 321 294 253 244 287 335 342 322 324 357 382 376 341 294 259 260 292 318 316 317 356 405 407 359 320 327 359 388 411
88 411 422 404 360 325 322 329 313 283 269 280 303 327 352 369 369 355 335 314 305 321 358 390 396 395 413 443 445 398 334 305 326 358 359 337 335 374 416 419 383 343 319
83 319 311 328 370 405 397 368 375 418 432 382 332 353 422 457 438 421 446 477 471 441 431 442 440 415 398 411 434 425 376 324 306 321 347 372 396 402 376 337 328 359
79 359 391 389 364 346 333 308 281 289 334 372 368 347 358 403 437 424 382 356 359 372 383 395 401 375 325 304 345 404 406 351 307 316 347 362 367 386 403 402 396 398 383
74 383 329 276 283 354 432 464 441 376 292 237 246 295 322 309 294 303 316 307 288 282 298 335 395 464 497 472 419 390 398 414 410 387 372 390 439 481 474 423 370 343
69 343 336 332 334 349 363 364 364 382 417 447 461 459 437 400 368 361 372 374 354 324 305 311 330 331 295 244 223 245 268 258 237 249 293 332 341 330 317 313 328 357 368 334
63 334 275 242 251 271 284 304 337 361 355 334 319 315 315 315 310 292 276 289 330 357 342 312 303 307 295 273 284 340 404 436 437 424 404 377 351 341 347 355 346 317 287 290
58 290 344 421 470 464 423 383 363 366 390 426 454 464 457 441 418 390 372 372 374 357 323 291 272 260 252 262 296 337 365 377 383 379 353 304 260 254 286 327 348 345 343
53C43J8M5N3L5nl5l2%K6J9ok2j3JLj2k4j6OJ8Lk3k9j4j%MK0L0J4rj4j0j6k3j4mk1m4k1M3Q2
48C55N3QMK5K1qk1j1oj5pJ9K0j2k8jL1J3l6m9j0L3L4Mj2MK0J0j9l3k3omj8l7n2m9qN0O8J6
43C23m3l6K5N5K6oRL1J0l3m5j6RR%j3k8k1K4P5P6K6k1k5j1JJ2L3M1K2j4m0m3l0jK7L6K2ol4
38D26n8o2l4OK0JnK1M7L0j2l9l9l2k1LL6N2M5K9Qk0m7m4j4J8K6K0J4J3J5K1K2Qj4j7lPJLJ5
33D46J0l6q0o9j3K9K5NRK2K0Pkj1l4m5j3M5P0L5j5l5l2k6j9QL7L8J0j2pJ3L0M0M1K4ql3l5
29D39j2J6K9J8ok4k2j6j6j2QL1K6ol2k6jK5M8N5K8k2m9k6K2L6Pl1l5oK3J8k4o2n5pK9K6Mp
24C91qj4qJ1K3Mk0lL6M5Lm2m8k3JJ3J7Nj9k9qL2M6K1j9l0oK4K3KlJ8K1j8n8l9K3N5K6j2j2
19D21nl2p4p1k1K5L0J8J9L2L8K5Poj7k9k9oL6O4M9mn0n4k0K2M0K0k9o2m0J9N1K8j4k1lLkR
$$ plain form
53 343 361 406 459 494 489 454 422 422 448 467 461 439 426 427 430 418 394 378 384 402 405 382 353 339 338 338 342 362 392 406 397 383 373 357 334 320 316 295 251 230 273 355
48 355 408 416 420 445 466 458 437 426 420 405 398 417 437 425 397 396 427 440 404 355 345 378 412 416 404 408 428 438 419 386 363 357 353 335 298 246 197 189 239 307 323
43 323 280 244 269 324 350 344 353 384 394 361 316 300 309 318 318 305 277 256 280 355 431 457 436 411 400 401 413 446 487 509 495 455 412 382 381 408 444 466 460 426
38 426 368 306 272 278 298 299 294 315 362 392 380 341 302 270 249 252 288 340 385 414 422 402 355 311 297 315 341 361 375 388 403 424 446 454 440 423 420 427 428 431 446
33 446 456 420 340 271 258 287 312 317 326 348 368 375 373 362 328 283 270 315 385 420 405 370 338 312 293 301 338 376 386 374 367 380 410 450 491 515 507 474 439
29 439 427 443 472 490 484 460 438 422 406 394 402 433 459 453 421 395 394 419 467 522 550 528 479 453 475 511 518 487 452 446 469 487 463 401 346 339 368 394 398 391
24 391 383 369 361 372 395 399 379 376 412 457 460 418 370 347 348 361 378 383 364 335 327 359 405 426 407 377 371 395 418 420 417 435 456 438 380 341 364 419 445 433 421
19 421 416 384 310 239 218 243 273 291 310 342 380 405 412 406 389 360 331 325 361 425 474 470 420 366 346 368 408 428 399 337 297 316 367 395 381 360 357 360 358 367
14C67K8J9j1j6J5L4Ol1l3rmj9j9RL6L9J7j8n0n6j6M5O2J5m7n6j8J3Nj2%K8L3J0j2oJ0Pk0l6
9C09j6K6M7K5j4l3j7OJ0oj8qJ9M1M5L1J3j0m1n4k9J9M0J1k8l1j2j2k6qL9N1mo0m5K6P4O0K0
4D40j3l2l6j9J7M6M8K9Kk3k7qPkk3k3j2j6k7rK9M1Rj6mJ4Oj4j1%j0k1jK5J9j2j4J7L9K5Jj5
-1D26l0m5k8K5O9O2K1qrklqj3j6j7j6j6j7qJ2L1K6Mj2nJ4J1j7m8m0kK0ll0j4M4P8N3ll8m0
-6D08k8j3kKmj5k1k4k6k1rMJ1J9L2L7K0j6m7n4l8lK6L3J3pnJ7L5L1J2opJ1L6L9J3k2m2m7m2
-11C00k4J4M7M6J4lOkn1r5p1RN9L9jJL6M8K2oj6k1k2nK7L9J2k1k0NJ0qk0nJ4J0j6m1m1j4L0
-16B85N6M7J8lj0j6j6NL9M9K2lMK1J8kj2ork4l3k9k2j3LJ7J3rk0pMnj3JK3Rl1n3l0J2L3L6
-21C49L1J6j3k8oL2M1K2J4J8Km2o9n3k5j6j0J3L5K6RMlk7k6J5M5Rm3k4M3N6%m0k6j4l5l4J2
$$ plain form
14 367 395 414 403 387 402 436 442 411 378 369 365 346 327 336 372 411 428 410 360 304 288 333 395 410 363 307 289 302 307 295 295 323 356 366 354 348 358 365 345 309
9 309 293 319 366 391 377 344 327 333 343 337 319 311 330 371 416 447 460 450 409 355 326 345 385 396 368 337 325 313 287 279 318 369 365 305 260 286 360 420 440
4 440 427 395 359 340 357 403 451 480 482 459 432 424 431 429 406 383 371 355 328 319 348 389 398 382 378 392 398 384 373 373 363 342 341 366 385 373 359 376 415 440 441 426
-1 426 396 351 323 348 417 479 500 492 483 481 478 470 457 441 424 408 392 375 367 379 410 436 440 428 423 437 448 431 383 343 341 361 358 328 314 358 436 489 486 448 408
-6 408 380 367 365 367 363 348 327 303 277 256 247 251 262 281 313 350 370 354 307 253 215 212 238 271 284 277 272 289 324 355 367 361 354 365 401 440 453 431 389 342 300
-11 300 276 290 337 383 397 394 400 398 347 252 181 190 249 288 287 288 324 372 394 388 372 351 329 324 351 390 402 381 361 366 376 368 348 343 357 367 351 310 269 255 285
-16 285 341 388 406 403 393 377 361 366 405 454 476 473 477 498 516 514 502 496 487 463 430 401 379 366 369 386 399 390 370 363 367 362 349 350 373 382 351 298 268 280 313 349
-21 349 380 396 383 355 349 381 422 444 458 476 478 436 367 314 289 273 263 276 311 337 346 350 347 320 294 309 354 363 320 296 339 395 395 355 329 315 280 246 258
-26B58L6%k1K0N2Qm0pN3K9m9n7J1M0pl7OM8L2lJJ6PnLmm5o5k7J5%l7j6N2P9L2k1k0J8L2mn6
-31C27p9n2KL4K9J6J1%k5l2JM0L6kj8jJ6Nj8k2NM5P4O6K1k8m9l6j0J1J6R%RK9K9Kk0k2k2l5
-36C62k7J1L3Jm2l4QJ7j6l3oK4K8K1K4K6J1jrk8m2l0mj7n7n7LN0L1kRL6K2pOL9K0l3m1MK2
-41C22j4l6KM2J9k9l0MNl0m1JM4M5J6kNJ6K1K3J6jk3l6l6l3l2l3k1J3M6M6Nk7j3K2K8jj3J5
-46C05L1ro1n2J7O4M5KoJ8K4Kj1LJ5kk6k5rlqQM2N0J7k0j8PPj6k0%Ok0m5m1l1m1m5j4L6O0
-51B36M6J9j0l4l4JM0M1K3K5L6J1m1m9QO2M7%j7OK1J3lj6k8k4qjj6k4kJ9Ll2l1kJ7J6K0K6
-56C64Nk2mN1O3Kn9m9J0L7J4j6j8nJjrj1j1j7l5m0lN5O7J3m0l0J6K6j3l7j2J9J8kOM5P1M3
-61D92k4q0p7k2L5N3L5J3kj5k8k4LK8K8Mj7k3j9j5j6j4qMJ7K1J2pj6JL3M7J8k8m0j6Qlk7k4
$$ plain form
-26 258 294 294 273 293 345 353 313 306 359 388 339 282 293 333 326 289 295 343 375 372 373 389 396 391 394 390 345 280 253 268 268 231 215 267 346 378 357 337 355 387 383 327
-31 327 248 196 198 232 261 277 288 288 263 231 232 272 308 306 288 287 303 308 290 268 273 318 392 458 479 451 402 366 356 367 383 392 392 401 430 459 461 441 419 397 362
-36 362 335 346 379 380 338 304 312 329 313 280 274 298 326 347 371 397 408 407 398 370 328 298 294 277 220 163 166 216 247 245 254 290 312 305 311 350 370 337 296 300 322
-41 322 308 272 274 316 335 306 276 280 285 255 214 215 259 304 320 318 323 339 360 383 399 398 375 339 303 270 238 205 184 197 243 289 294 267 254 276 304 303 290 305
-46 305 336 327 266 214 231 295 340 342 336 354 378 380 369 372 387 385 359 334 325 322 314 322 364 414 431 411 393 400 407 391 371 371 377 357 312 271 240 199 154 140 176 236
-51 236 282 301 291 257 223 224 264 305 328 353 389 400 359 310 318 380 427 427 410 416 437 450 447 431 403 379 371 370 354 330 328 347 350 318 287 285 302 318 338 364
-56 364 369 347 343 394 457 459 400 351 361 398 412 396 378 373 374 373 364 353 342 325 290 250 247 302 369 382 342 312 328 354 341 304 292 311 329 327 333 378 449 492
-61 492 468 388 311 289 324 377 412 425 423 408 380 356 359 387 415 419 402 379 360 345 329 315 307 311 328 349 361 354 338 339 372 419 437 409 369 353 361 358 331 307
-66C07QL1K6KrJJ9L1K6Lk6m4m0j3J7K7Qj6k3j6j4k0j9lJ5J8Mk1m5l9RO3O4J3k0QM6L1k4m4
-71C41qK7K5QJ0J2j2m4l8PM8M4Pk2j5J4L2K3%j6j3LK0K7J0k0l8k9mJ3J2Kj7l7n0m7l8k3rM
-76B09RJ1L1O3O9K7k9m5j5J7J8mk8m1l8j0K5M1K7Kj2k2l1l3j5J5L8L5Rj8j9J1L6K6qk9k0K
-80C04J8K8K7J5nk4l2k7j0J2J8kj5NL5L0lj4LNk7n3m3j8oQL8O0M9J6j0k4k5j3RJ5mk1j8j2
-85B89k3k8%M1N3L5J2mj4j4jjk5m9m2j8qoJ6M4L3j3l9j8Opl6m0mM0O2M6J2qMK7K1j1l4k2O
-90B82K4L3L5K4Lj1omj7l1k1KJ5J2J2K2L4L4J5j7n1n9k5L1O3M2nl5l3l1m2m2mM6N9L2PKrl6
-95C50m2jL6K0l0m4j3Mj6l2j3J3PqQN0P7O6L0j3n0o8n0nK9K2j3l8k6PL8N5O0M7Ln5q5o2oL7
-100B89L9J0l1m6k1K2L1kk2JK1rn1l4K4M7K1J0L5M3%l5k0Rkk3j0J5Jl0j8L8O6K8l6o2l6RL6
$$ plain form
-66 307 315 346 372 374 365 366 385 416 442 445 419 375 335 322 339 366 374 358 335 319 305 285 266 263 278 296 300 279 234 195 204 267 331 344 324 332 378 409 385 341
-71 341 333 360 385 393 403 415 403 359 321 328 376 420 427 405 390 404 436 459 459 443 430 433 453 480 490 470 432 403 399 412 424 426 409 372 322 275 237 214 205 209
-76 209 218 229 260 323 392 419 390 345 330 347 365 361 333 292 254 244 269 310 337 339 327 305 274 241 226 241 279 314 323 305 286 297 333 359 351 322 302 304
-80 304 322 350 377 392 387 363 331 304 294 306 324 322 307 312 347 377 374 360 363 368 341 288 245 227 221 229 267 327 376 392 382 358 333 320 329 344 340 319 301 289
-85 289 266 238 238 279 332 367 379 375 361 347 346 345 320 271 229 211 203 197 213 257 290 277 238 220 226 219 183 143 139 179 241 287 299 291 295 322 343 332 298 276 282
-90 282 306 339 374 398 401 390 384 380 363 332 311 313 328 340 352 374 408 442 457 440 389 330 305 336 399 441 436 401 368 337 295 253 249 295 354 386 393 395 386 350
-95 350 308 307 343 363 333 289 276 280 264 232 219 232 239 231 239 289 366 432 462 449 399 331 281 276 305 327 314 276 250 257 295 350 410 457 460 405 320 258 252 289
-100 289 328 338 307 261 240 262 293 291 269 270 291 282 231 197 221 268 289 299 334 377 377 342 322 331 329 306 296 311 312 282 264 302 368 396 360 298 262 271 307
-105C07K8j2m5m4j4J4J9J1J1K1L1K0j4m5l4J1M0K0k6n1m1j0K5M4L0mj2J9M6K6rj2J3K1jk5
-109C58l4l1j9QK2Kk6k0J7L2Rj5j6NK9M1J7l9p3m2J7K3k0l0J9N9L9MMJ2j3m0j7L2L9Kk3j1
-114C21Qjk4l5l2j2J2K6J1j5j6J4M9N9M2J4j2k5k0j0j1k1k4j1J1K1J7Mj0k0k1j4%J3J3jqO
-118B98K6K9J3jj1k4l9l1LL5L7J3j3k6k3nJ9L4K9J5Lj0j7j0kj2l2k8JJ6kk1j4NJ2J5K8K9O
-123C45j8j5LMjOJ5Kk1k4qJlqj4k4j2K5M1Nl6j6M4N1kl8j2J3j4n3n2k3kRK9L4J1j2ML0K5q
-128B81k1pKopPK0K1K0K5K3Rmj0rrj1j8j9JL5L9nm9m3nJ2JOK8K0k5m4NO4O1Ll6l0j8k1k2n
-134B59J2OqpRJ4Noj3j2LK5L7K4Jn%ql7n9m3lL5N3N1L1lk9k9j8j5j9pJ5K5J7J0J7K5K0Oqk4
-139C47l0j7OOk0l7k2lnj3LK9K6LnJ6L5L6K9K4J1j0j8qKlqJJ3J4%j8l4m0k5jPjJK4M1J6k8
$$ plain form
-105 307 335 323 278 234 220 234 253 264 275 296 327 347 333 288 254 265 305 325 299 248 207 197 222 266 296 292 280 299 345 371 362 350 363 384 383 358
-109 358 324 293 274 282 304 306 280 260 277 309 318 303 287 292 321 362 379 340 267 225 242 265 245 215 234 293 332 336 340 352 339 299 282 314 353 355 332 321
-114 321 329 328 304 269 237 225 237 263 274 259 243 257 306 365 407 421 409 384 364 354 343 322 298 287 298 319 336 340 330 310 289 275 275 288 301 300 292 298
-118 298 324 353 366 365 354 330 291 260 263 298 335 348 335 309 286 281 300 334 363 378 381 371 354 344 342 330 298 270 271 287 285 264 250 255 267 282 310 339 345
-123 345 327 312 315 319 318 324 339 341 320 296 288 289 286 278 264 240 228 253 294 299 263 247 291 342 340 302 290 303 289 236 184 161 159 168 197 231 242 230 234 264 289 281
-128 281 260 253 255 249 242 249 269 290 310 335 358 367 363 353 344 335 324 306 287 288 323 362 357 308 265 260 272 273 279 307 327 302 258 263 327 388 391 355 325 307 286 264 259
-134 259 271 277 269 262 271 285 290 284 271 259 262 287 324 348 349 344 344 336 299 240 197 194 229 282 333 364 361 332 303 285 270 251 244 259 284 301 311 328 353 373 379 371 347
-139 347 317 300 306 312 292 255 233 230 225 212 215 244 270 273 268 284 319 355 384 408 419 409 391 383 385 382 374 375 388 402 402 384 350 310 285 284 291 290 291 315 356 372 344
-144C44m6k4lj2k9k1LNk2m1k4J2L9N3O0M5km8n1k2j9m5m5JL2Pj3L3R6P9om8qL4K2LK5M2Nm4
-149C67l6PJ4j0j0K2K6j6m6l6j1lJ0K9J6l8p7m2K9O5M2J0OK0K7J9kk8m4m0j9jQJ4J8J5QOP
-154C26J0K2M3N4L7jk5k3j6l2o2o8l1K8N9M1jk3j4Mjj7k0pJ0J5Prk7k1J8N7M6j1n8m9JL7L3
-159C32Kk5k6MM2M2j3p1p1j2M5M3Mj9j3KONJ5L5M6L6Ml2m1j1L0L7%l5m2l2l4l2JM1L0l2o7
-163A94k3M3N0Lk6rQpk1%K8K6QJ0K5K6J3NMj0l2l4j3PJ4J7K0J5kj2j3j8k4k0j1j5k5rL0N1
-168B73K1j9j7K2M5K8LLK0J9j7n5o3m3k9l0j6L7Q7P1ln6l9PL1L5M3L6ll7k3J2Ll8n5k8orL
-173B13L9N0J0k4oK5Kn8p9l6K1M2L5K5J3jj6k5l5l4j1L2O2N4J8j7l0k6k5l1l1nL4N8M9K8J6
-178C36J3jk0k5pJ9L1K1kj3mPj0m7n9k7J1J1qpJ4J5qj7KJ6PLK8M9K9rj9kMolJ2Ll9o0k1L9
$$ plain form
-144 344 298 274 271 259 230 209 212 217 195 154 130 142 181 234 294 339 337 289 238 216 197 152 107 108 140 147 134 167 263 342 336 288 280 314 336 339 364 406 411 367
-149 367 331 338 352 342 332 354 380 364 318 282 271 268 278 307 323 285 208 166 195 260 302 312 318 338 365 384 382 354 310 270 251 250 258 272 290 305 313 319 326
-154 326 336 358 401 455 492 491 466 443 427 395 333 265 234 262 321 362 361 338 324 328 327 310 290 283 293 308 315 306 279 258 276 333 379 368 310 261 262 299 332
-159 332 334 309 283 287 329 371 358 287 216 204 249 292 296 277 264 266 272 277 292 327 373 409 413 381 340 329 359 396 396 361 319 287 253 221 222 263 293 261 194
-163 194 171 214 264 267 241 232 240 233 212 212 240 266 274 284 309 335 348 353 357 347 315 281 268 275 289 306 326 341 339 327 314 296 272 252 241 226 201 192 222 273
-168 273 294 275 258 280 325 353 356 359 379 398 381 326 263 220 191 161 145 182 269 340 337 281 242 249 280 315 358 394 391 354 331 343 346 308 253 225 219 210 213
-173 213 252 302 312 288 282 307 309 251 172 136 157 199 234 259 272 271 255 230 195 161 150 182 244 298 316 299 269 243 218 187 156 151 185 243 292 320 336
-178 336 349 348 328 303 296 315 346 367 365 352 348 355 345 298 239 212 223 234 226 219 233 248 240 223 225 241 248 251 279 328 357 348 329 327 331 325 322 334 337 298 238 217 256
-183B56M9on5l8J3L1Jk5pK9L4Lj5mPj1l7k9J0M0M1L0K2Rj7l6k8nPLjQK2K5J2mj1rj5m0n9l9
-188A61J6N1K9j3j5J8K9kk5lK8K0j2k9k5k2j6J8N1L9j2m0k4lnnJ5K1pk8pK2J3j8rK8L9Oj9
-193B65rNpk2j1J1K3K2K7L6M0L7K5%k9m5m2l5k7j2Mlk5k7NL8M1K9K2J3qk3j3OMj4j9j3rlJ8
-198B75L5K3pj4LNk2m4k9kQ%m%lj0pPJ2LoJPnk9l6j1J9L0K6K4J1k3m6j9L4M9K1J0L8L5l4r1
-203B34m8N1Q0J2n5n4j9jJ0K8K8lk5j0J1KrOK2Kk6k0PJ7J4L1M7J9l4m9j6QjnK5N2L8ol5l7
-208B91k5oNmk7l6j8LJ0J6K9K7j0n0n3j9J3K4L3N3O3M5km5o1m5j3J6L2K7Lk1j5J8M2K1k3m3
-212B55k8qoKK1K4rl9k5J9L7J8qj4j4j5j2kNORJ4J0OJ6K8J7j3k9j8lnnJ4L5K9jj9rJ0Pk5n1
-218B24l0K6N5K0k8j9L0L6k1o1k0N0O2J9j1j2k4n1m7JL8K3j0j9j1j0qJ7M9N7L8J2k2n4n4k
$$ plain form
-183 256 305 299 244 206 219 250 251 226 219 248 282 285 270 266 273 262 225 196 206 246 287 317 339 348 331 295 267 262 269 272 271 279 301 326 338 334 323 314 299 259 200 161
-188 161 177 228 257 244 229 247 276 274 249 246 274 294 282 253 228 206 190 208 259 298 286 246 222 219 214 209 224 245 238 210 203 225 238 220 211 239 278 284 265
-193 265 256 261 254 232 221 232 255 277 304 340 380 417 442 442 413 368 326 291 264 252 256 253 228 201 206 244 285 314 336 349 341 318 305 311 315 301 282 269 260 257 275
-198 275 310 333 326 312 315 320 298 254 225 223 231 231 227 227 224 214 207 214 226 229 223 224 231 226 197 161 150 169 199 225 249 260 237 191 172 206 255 276 286 324 359 325 234
-203 234 186 237 317 329 274 220 201 200 210 238 266 263 238 228 239 241 232 238 260 262 236 216 223 240 254 285 332 351 317 268 252 260 259 254 279 331 369 363 328 291
-208 291 266 260 265 261 234 198 180 183 193 209 238 265 255 205 152 133 146 170 203 256 319 364 362 317 256 211 198 214 246 273 276 255 240 258 300 321 298 255
-212 255 227 219 213 215 236 260 251 212 187 206 243 261 253 239 225 210 198 196 201 207 216 230 240 246 262 290 307 294 265 247 244 239 234 248 283 312 311 292 283 293 300 275 224
-218 224 194 220 275 295 267 248 278 314 293 232 212 262 324 343 332 320 296 245 198 199 237 260 250 231 220 210 202 219 268 325 363 375 353 299 245 243
-222B43N7O6K1j4j2%moJ4L3J5k6l7pK0Ll9n3k6NLk2k6NM1L9nm7n0j6J9L1K7K6L0K5J1KJ5K5
-227C86Mm2o5l8J0L1J8ok6m3m9k4K5N6N4L8L2K2rm2m3j1K3L4K0pl7n6m7j7J4L1L3K6J3RQn
-232C20l2l7PO1N6on6l9MJ7LMK0J6j2l3k9k2k7k0%J2NNK9M1K1o%K1J3j9l0kK0J4JRJ5rm9o2
-237B24m6k2oRK3K2J0KLNJ0L1N7O8M8J1k9o0o7m4j1jk1k8J1O2P2K3l5n1j7L2N5L5j1m2m0j9
-241B63jJ3K8L2Pl2m1j1J9J3rj2OJ2KmLkl2n4l1K2M7J4m0n5j8K7L8K4J1J1RmqKJ3Mj7j7J4
-246B46M3L5lk6kM3N7K3j8k1NJ9%k8l6k5j4j2j2j5k1k1kK4L1Ok6l7j8J1K8K9J7Jn%J0J4J2
-251C12PLmj5k4j9JK1K9K1J2RPmj6j6orl3m7k9PK3J6OL%rj2jJ7L8N7M9mn7m6K7P3L7k3k9%
-256C72j2o2o2MM3Km9j4P1R5L6j9kM1L4k9p8p0k9mj3j9JK6J4k4l8j0K0Qk9m2k6mJ6L1L0Qj1
$$ plain form
-222 243 300 366 387 373 361 361 357 351 365 398 413 387 350 343 363 366 327 274 248 253 256 234 208 213 254 293 288 241 191 175 194 225 252 278 308 333 344 346 361 386
-227 386 390 348 283 245 255 286 304 298 272 229 180 156 181 237 291 329 361 383 374 332 289 278 301 335 355 348 311 255 208 191 205 236 269 295 308 317 325 320
-232 320 288 251 258 319 375 369 313 274 278 295 298 302 322 338 326 293 264 242 215 195 195 207 212 217 246 287 308 302 302 323 336 317 287 285 305 319 320 329 344 335 286 224
-237 224 178 156 150 159 182 204 214 216 219 224 234 265 322 390 438 449 420 360 293 249 238 237 216 188 199 261 333 356 321 270 253 285 340 375 364 322 282 263
-241 263 262 275 303 335 342 310 269 258 277 290 281 269 275 287 289 285 288 286 254 200 169 191 238 252 212 157 139 166 204 228 239 250 259 255 247 249 262 266 249 232 246
-246 246 289 324 321 295 293 336 393 416 398 377 382 401 401 373 337 312 298 286 274 259 238 217 215 239 270 276 250 213 195 206 234 263 280 281 276 276 286 300 312
-251 312 319 322 318 303 279 260 261 282 311 332 344 353 360 356 340 324 318 309 276 229 200 207 230 246 252 255 255 246 234 233 250 288 345 394 390 333 287 314 387 424 401 372 372
-256 372 360 298 236 240 283 285 236 222 293 388 424 405 403 444 478 449 371 301 272 268 255 236 237 263 277 253 215 205 225 233 204 162 136 132 148 179 209 217 206
-261B06jK1J7pj1J0K3J1%LRJ0J8K0ll2k8J1K8om2l5nKoRL8L8km5n5k5K8O6M7j7o1m5j1j4m0
-266A24l2J3M3L3K1K7K2lj7J5O2O9J8l8m8j3J2j2n2m7OK7k5p8n4J5L6J0K2Q2J07M8k1l0j4
-271C28l2n2k2K9L6Mj4oj0k5j5J0J3mQM2M4kl3qL3M1K0mk7m5l0K2N8L4k0m8l0plj6l3l6rL9
-275B30O3K8k7m0jL8L8J4pj8k1j5KJ5Pj2k5k2j7j2qJJ0J3QRJ5J4nl1l1%K7J5k3m5k6J8M7L7
-280B63Lj7kK6K5rl0rK3L0K0K9N4N4J1m6p5p0l9ML2K3j5l9k7NK3J1k3n8o0j8L1L6PnJ8L0L
-285B19k2KM5M0j0m7l9j7j4k1j1K5O8R3P1J3l4l4rmj5pJ5J0k2l4LL8K4j6k5ML1L2J8Mqj2n
-290C49Joj8k6k0j1KJ3J4OLJ3J4mk1qK4L9J8j9l5j5J6J9k1n6l3K9N1Ql1oL2Pn5p2k0L0L2J2
-295B55Ojj6k1%J9J5J3K5L2K4J6K5K4jl3m3l9l9l2j5nj1rJ7L3J0k4k8nQRJ7K7K6J5Rrm1n2
$$ plain form
-261 206 205 226 243 236 225 235 258 269 269 272 281 291 309 329 326 294 266 277 305 299 257 222 217 219 213 222 260 298 296 251 196 171 199 265 312 295 234 189 178 164 124
-266 124 92 105 148 181 202 229 251 248 231 246 308 377 395 357 309 296 308 296 244 197 203 230 205 127 73 88 124 134 156 238 345 393 372 342 328
-271 328 296 244 222 251 287 291 277 271 261 236 221 231 244 240 248 290 334 332 299 291 324 365 385 381 354 309 279 301 359 393 373 325 295 288 285 269 236 200 191 230
-275 230 293 321 294 254 253 291 329 343 336 318 297 282 284 299 306 294 269 247 230 218 210 211 221 234 242 251 266 280 275 244 213 213 240 255 232 187 161 179 226 263
-280 263 266 249 247 273 298 289 259 250 273 303 323 352 406 460 471 425 350 280 241 245 277 300 285 246 219 224 247 258 235 177 117 99 130 166 173 168 186 216 219
-285 219 197 199 244 284 274 227 188 171 157 136 125 150 218 311 382 395 361 327 318 314 299 292 307 317 295 261 264 302 326 310 285 289 320 352 370 374 366 354 349
-290 349 350 344 326 300 280 269 271 284 298 304 307 320 334 330 309 301 325 364 382 363 328 313 329 348 327 271 238 267 318 326 295 289 321 328 273 201 181 211 243 255
-295 255 261 260 244 223 223 242 257 270 295 327 351 367 392 416 415 382 339 300 261 229 214 209 198 189 206 239 249 225 197 192 200 209 226 253 279 294 303 294 253 201
-300B01j7K8K5rj0K4L5Nk2j6jLRK1J2j2j2J9L2J3LK5K5k5o4l9Rmn4o0j3J7LmL2O2M0nk4j7
-305B35j7j5J8O3O5Rn2n5j2K6K5OJJ0Rpk0j3%%j3j6%K4L7K8QooJkj6k5j5%Lqj5j0lrk5l0j0
-310A68L1N1K6k2l5MM4L0j9m4j2L6M9K2pj4okoplqk5l7k1J5M4M7L4J8nk7l6k4rmKJ3Qk1m9
-315A99l9kK0J0j0j1KJ6J9Mk0k5JL6L7J0rKJ6J1j5m3n5l5J0M3L7PjJ0Rj3j8%Pj1j6J8N0L5
-320B86pk8k0oPJ7J2qj4J6M4J8l8m8kM3M6K9K1J2j7m0l3rLKpk3m4m4j6J2J1jPK9K9ll1l1j5
-325A59lJ1K9L8J6j9k9rJ4J2pj8pJ6L5L9J9k2n3l7J8N5K8k9n4k7Lrm3n0j2K7K8MnJ0K6J4p
-330A61mK4M0K1j1k4j6j7k8k6oK0L4M3M9L7%l3l6j3MKnqj1j2%J8K0lj6KL4L6J0rkPmqK1N5
-335C46L8k3o1m7k0k1k4J0N5N3Km3m6k9j8KL7O2M7Jl8m2j3K5M2K3j3k9k2j6j7lK8M1J7j4j4
$$ plain form
-300 201 184 212 237 228 218 242 277 282 260 244 243 246 255 276 288 276 264 283 315 328 331 356 381 356 292 253 262 258 204 144 131 148 151 147 179 241 281 276 252 235
-305 235 218 203 221 284 349 358 306 251 239 265 290 296 297 307 316 309 289 276 276 276 263 247 247 271 308 336 344 338 332 333 331 315 290 275 275 278 270 255 245 242 233 208 178 168
-310 168 199 250 276 254 219 223 267 297 278 234 222 258 307 329 322 308 302 300 294 287 284 276 251 214 193 208 252 299 333 351 346 319 283 259 250 246 248 261 269 248 199
-315 199 160 158 178 188 178 167 169 185 204 208 188 163 164 200 237 247 238 240 256 267 252 209 154 119 129 172 209 216 215 225 234 221 203 203 210 199 183 201 251 286
-320 286 279 251 231 225 232 249 261 253 239 255 299 317 279 231 229 272 318 347 368 380 363 323 290 281 284 286 279 256 212 168 152 164 175 174 181 210 239 236 205 174 159
-325 159 156 167 196 234 250 231 202 193 207 219 212 194 187 203 238 277 296 274 221 184 202 257 285 256 202 175 178 169 126 76 64 91 119 123 118 128 154 168 161
-330 161 157 181 221 242 231 207 191 174 146 120 114 134 168 211 260 297 297 264 228 215 219 221 216 208 197 185 185 203 223 220 204 206 240 276 286 277 275 282 278 270 291 346
-335 346 384 361 300 253 233 212 188 198 253 306 308 265 219 190 172 174 211 273 320 321 283 241 228 253 295 318 305 276 254 238 221 218 246 287 304 290 276
-339B76QJ5%j1okrqOK7L4J8j3m3n1k9nmj3KL7N3K4j5k1qj2l7l5RM7K9k4m3OO2O0Ol1j7J1O
-344B99k8m9k7K1N4M5mm7m2jK7Rk0j5K5N4M9K0j1k9k4%J6PokNj6m8n0j9Kpj5ML0L2J4ok2k4
-349B01j0RKk3k5PK7%l3j9K8M7K3KJ3K8J9pk2k1lK4M4L4jl3l8l0j7jJ4J7OOK2L1J7%knl4o6
-355B31n7%N3O8M9K2ol3m9m5k9j0J7N1O1K3l6n6j8L0L9J9KKNMJj0m0o2n2j5RJ0J2L4M7K7r
-359B89k1qOjj5k3k0j6k1l3k3J4M8L1k4m7qM2M3J1rppj0LK4K6J1lj2k5k5RM0K9KJ6N2L7l0
-364C45n7j1K6nm4j6L7L0k6m1NM1K9MKLj4m2n1l7nL3M7K4mKK3J7qjL8N0J2l1l9k9k8k0J3L5
-369C07J6j6j7J3L2L6L4K3rm4n3l9k6k4j6NK0J7NopKJ3J2lj1MK3K4Prj3r%Olj0NL3K4k8n5
-374B63j2M6L7k9o1k3K2K0mj1NK1L4L6K1rk0j0nj5j9j1j8m7m9jN5N7K5J4L2L5Nk4k4j1rk4
$$ plain form
-339 276 284 299 299 288 282 280 271 263 269 296 330 348 335 292 241 212 207 203 190 192 229 282 306 291 270 262 250 213 178 187 234 263 239 196 202 264 324 330 299 282 293 299
-344 299 271 222 195 216 270 315 311 264 222 221 248 257 237 222 247 301 350 370 359 330 306 306 322 329 323 321 326 310 262 212 193 195 188 173 177 207 239 253 247 225 201
-349 201 191 200 202 179 154 161 188 188 155 136 164 211 234 236 249 277 296 289 267 246 243 267 311 345 344 311 273 243 226 225 239 256 262 268 290 321 338 338 336 331 297 231
-355 231 174 174 227 295 344 366 360 327 278 233 204 194 211 262 323 346 310 254 236 266 305 324 326 328 333 337 338 328 288 226 174 159 168 178 190 224 271 298 289
-359 289 268 260 266 265 250 227 207 191 170 137 114 128 176 207 183 136 128 170 213 224 215 208 201 191 194 218 244 255 252 240 215 190 199 239 268 270 286 338 375 345
-364 345 288 277 303 298 254 238 275 305 279 238 243 284 313 317 319 322 308 266 215 178 173 206 253 277 273 275 298 315 307 306 344 394 406 375 336 307 279 259 272 307
-369 307 323 307 290 303 335 371 405 428 419 375 322 283 257 233 217 222 242 259 264 258 251 253 266 278 275 264 268 291 315 322 313 300 291 291 297 294 284 289 322 346 318 263
-374 263 251 297 334 305 244 221 243 263 259 248 253 274 308 344 365 356 336 326 321 306 287 276 258 211 162 161 216 273 298 312 344 379 384 360 336 325 316 292
-379B92m1m0rL9N0np9q1oO7O4J4j7j8j9k9pM6P6L7l8p5m9pP%J2L4L4J4NJ5Pk4l2QM7L3j4k4
-384B87KJ1j4l0j0Mj2k9j5J1J2nr%%jQJ4lk3j1K0K6lk1KL9M7K9Pj1k4k1kJ5Mk0k0QK8J7qj3
-389B86OJ5Kj9k2jJ8K1Roj9k7k4nJ9L0K1%j3j1nmj5k5k1lJ1R%jNMnj2j0kKNRJ7J7Oj2k4k2
-395B04rok5m9m4ON9P0L1j1j7PK8K9K1J5NkjKj3l5l4jK9K4%j2j0j2oK6N3K7l7o3j8L2K4k5
-399B62m2j3J9L0K3J0rk7k1llk4m0k6J6N9P7N0qm7l3NRk3m4k8qpqNK1K2K0J3qk9j0M2O5K0
-404C07k8j2M2M6nm1j6J9J9loQJ0mj1%J7J7nl7m1jN6P9N3Ol4n8o4n0k7pLQJk6l4JN3N5Ll2
-409B61j3J8J2j3j4KQJ0K6L3Ok5j8J1J1k0k4J3M3L3POJ4Lk5l9k5OK5J7j0k2lK2Lm8o8k6K9
-414B26K8k1n1k7J7L3K1J2J2Kk4l8j4L0M2J2j6j3MMqj3pnLK0K6on2o2l2KK3M1M8J5k7j4N3
$$ plain form
-379 292 251 211 202 241 291 286 207 126 120 187 251 265 248 230 211 182 175 221 297 334 296 221 172 165 172 172 184 218 252 266 271 286 293 269 237 245 292 325 311 287
-384 287 289 300 286 256 246 250 238 209 194 205 217 212 203 203 203 202 210 224 221 198 187 207 233 230 209 211 250 297 326 333 322 298 277 275 290 294 274 254 262 290 307 299 286
-389 286 292 307 309 290 268 267 285 306 315 309 290 263 239 234 253 283 304 304 291 280 275 271 256 231 210 207 218 227 227 226 231 235 230 218 208 206 208 213 222 239 256 262 250 226 204
-395 204 195 189 164 115 71 77 136 206 237 226 209 216 244 273 294 309 314 312 311 313 300 265 231 230 259 283 283 271 261 249 243 269 322 349 312 249 231 263 287 262
-399 262 220 207 226 256 279 289 280 253 232 229 226 202 162 136 152 211 288 338 330 283 250 255 264 241 197 169 161 154 146 151 172 194 214 227 219 190 180 222 287 307
-404 307 279 267 309 355 350 309 293 312 331 328 322 330 340 336 325 325 342 359 354 317 276 275 331 410 463 469 435 377 313 263 236 229 232 240 241 215 181 182 235 290 293 261
-409 261 248 266 278 265 251 253 261 271 297 330 336 311 293 304 315 295 271 284 327 360 367 373 387 390 365 326 301 307 332 349 339 317 314 336 339 291 223 197 226
-414 226 254 233 182 155 172 205 226 238 250 252 228 190 176 206 248 260 244 231 235 239 231 218 211 206 209 229 255 249 197 135 103 105 128 169 217 232 205 191 244
-419B44Q8L5m8p3l2PRpj4JM4Q2N8k9r3o4J8N4K6nmJrj2LR%mkj9m6l0L0O0J5m7n3j6nk6k5J9
-424A40N3L8jj9rKLOJ8L2L3K1Jj8l5m2k9jK0J9J2J5J5lj7MM3M3Kj8J4M5L0j2k4j5k7n4n4k0
-429B11PJ2J5K8J9rk4qQnk1mK8M1K5Lj1k1k5j1J4K5J6lk0k6j1J9L4Om5n6rM3L9ql4j6QJ0Q
-434B52K1J9j8n5m4PL6J5k3l6k5rQK1K3J4J4J7Mj8k1KRk3n1k8K5N1L8J8Onj3rkopOK5K4J5
-439B77K1K7Qk1k3m%j4qJ0Mk5k9KJ7JnK1L6Nl0k7pmKL0M9K2k4l1qOjMRol0k2J0K5J5J5J9m
-444C12m1l1L1O5J6n6p0k4J2%k3rM0P7O2J0l3l7k0j9l3l6k2j1lJ7M4M3Qj9qJ0PpLL1N1M6K4
-449D07j7o2p2k2M6O9L4kqqk4m0k3PRj1k2j1pj7j5J4L8J9j7k0J6L5J8mJQpk2j0J0Kj9j2J4
-454B75J1k3l5j2Qj0l3k5JJ8K5L5L4J5mm%npJ4K7%n1p1l4J9L7J6j2j7%J3J0NK5N0M1kl2k2
$$ plain form
-419 244 332 367 319 246 214 221 230 223 209 210 254 336 394 365 272 208 226 280 306 301 297 298 289 277 280 289 289 285 283 264 218 188 218 278 293 246 193 177 172 146 121 140
-424 140 193 231 230 211 202 204 207 213 231 263 296 317 318 300 265 223 194 193 213 232 244 259 274 271 254 258 301 344 346 328 342 387 417 405 381 366 339 285 231 211
-429 211 218 230 245 273 292 283 259 251 259 254 233 229 257 298 323 326 315 294 269 258 272 297 313 310 290 264 253 272 306 312 267 211 202 245 284 276 242 226 234 244 252
-434 252 273 292 274 219 175 182 218 233 210 174 149 140 148 169 192 206 220 237 241 223 202 204 213 190 139 111 136 187 225 243 249 244 231 222 220 214 207 213 238 262 277
-439 277 298 325 333 312 289 285 285 271 263 273 277 252 223 225 242 243 238 259 295 300 270 243 236 232 234 264 313 335 311 280 272 278 277 281 290 284 254 232 242 267 282 297 316 312
-444 312 271 240 271 336 352 296 226 202 214 214 191 182 222 299 361 371 338 301 281 262 229 193 171 160 157 174 218 261 269 250 242 252 259 252 255 286 337 383 407
-449 407 390 328 256 234 280 349 383 381 373 365 341 301 278 285 294 283 261 250 243 226 211 225 263 282 265 245 261 296 314 310 311 319 312 290 280 290 292 273 261 275
-454 275 286 263 228 216 224 214 181 156 157 175 200 235 269 284 280 276 276 271 264 278 305 305 254 183 149 168 205 221 209 192 192 205 215 220 245 295 336 334 302 280
-459B80lj8m1l5nJ1QJ7L8M0J5j1j5j8l4m5k8J6N4N9L5PJOom0n3k1K1K0k2m9k9QK8J7j0l5k7
-464A36J0L6J2k7j6M6P7L0m2o3l0NK1K2Qj6l3k1J1L3L5K0mk7k8mJ8J2kJ3M4M8J4k3k7mJ9R
-468C12k7n2l5J3L3jm1k7K4M7K9J1J9L0K0Lmj0k1j8kMj2k1kJ9Ok3k6mNrj4MJ8RnmKmqLQj0
-474B39k4OO0P2K2m0n7l4j1kJ0J6Nj0NL7L9Lk7j6Kqk5j6QJ1jKQk0o1n6J2O9O2K2OJ2kk9l0
-479B59lQj0k9k5j0NJ6J8PkK0N1M3ol2qRl2q3o1K5P1K9l9m9lM0M6L0J3Mjqk2l4l1j7mPL5O4
-484B91N8J0l2l0nkrNK7Om7o4j7L7L8Jk3j7oLJ7K0Jk5k0J1K7Ok4l3j7MK4L3J5k7n8m5NN2O3
-489B53M5J8NNOj0m2p2p0k4L5O2L8jj1OJ7NnRK9K6Pnmrk1j9jQpk7k4LK8L2K0KmLJ3Pj5l5m0
-494B36m0m3l9j5J9L6J4k4l6j2J5J4plL3N4K5k2k6J3M0K2NK7M9J0p0r8l5M6N4km8m1j8qLL6
$$ plain form
-459 280 277 259 218 183 178 189 197 214 252 292 307 296 281 263 229 184 156 172 226 285 320 327 328 334 328 288 235 214 235 255 233 184 155 163 191 208 198 163 136
-464 136 146 182 194 167 151 197 274 304 262 199 169 174 195 217 225 209 176 155 166 199 234 254 250 223 195 191 209 221 219 232 276 324 338 315 288 284 303 312
-468 312 285 233 198 211 244 243 202 175 199 246 275 286 305 335 355 358 354 344 323 305 303 307 295 274 272 291 297 274 248 244 249 240 226 230 248 257 252 248 250 246 238 241 249 239
-474 239 215 221 281 353 375 335 278 244 233 231 241 257 262 252 257 294 333 336 309 293 295 287 262 246 254 265 264 266 274 254 193 137 149 218 280 302 308 320 318 289 259
-479 259 256 264 254 225 200 190 195 211 229 236 234 254 305 348 342 310 302 311 279 196 135 160 231 260 221 172 169 209 255 285 298 302 301 293 271 237 206 189 185 192 227 291
-484 291 349 359 327 297 292 290 281 286 313 319 272 208 191 228 266 267 244 227 221 224 241 261 262 237 217 228 255 261 237 204 187 191 215 248 263 236 178 133 138 190 253
-489 253 298 316 321 326 332 322 280 208 138 114 149 211 249 248 237 243 260 265 260 269 298 324 331 326 322 313 292 273 272 280 273 246 222 225 253 285 305 307 303 306 319 326 311 276 236
-494 236 196 153 114 99 118 154 168 144 108 96 111 125 118 115 148 202 227 205 179 192 232 254 259 286 335 345 275 177 142 188 242 240 192 151 133 125 128 164
-499A64O3N2J4j1j3j0oOK2K4Nqqj3l0l4j6J3K4K8L2K7pn1p4n5j1L5O1N0J8lOJ7%k3j7Okm2
-504B33o3l4J6M2M0K9J5jj7j9j8j5jK7M4K8j0k8pK5K8jl0l0rJj1j4RL2K2prJ8K9%l9l9j5J
-509B22KJ3M0N2K4k7n6l7mJj9j5K8M8Rl9k1L6N2Rj5J0L1Kl3l2k0l0l3jK9J0k2j5J7K6J5J9
-513B76K8Ok5j6Ron6o7k1J9J4LK0M0L9L3K4Jl1k9JNk8l6J1N6M3ml3m1m8l9KL7K7j2l1k8k2
-518A21j0J4K8QrJ2N3O0L5J4RP%rk9n2m1J0L7mn4l5L3N5J8j2j1j8l9k7J7K5j2j7M1Q4M7j3
-523C36j8Nqm2l7nlk1oM5O4K9j0j3nj5l2l5k8j3J4M0K8j9n0k0M0P1N6K6Nrj3p%j1l7n3m2j2
-528A95J7K9K7J1qk2k3j6rqj3j8j2PL1L9K3kj0KJ4J3ONJ1J1N%mj3k4j8jJ2J8K8K9Km0l7J5
-533B72N5K8k1k4Lj0o1p1rM8L2k2l6%L4L0J2Mlj5k4k2j2J1L7M2J1l2l9j1J2Nj0j2n%PK0K2
$$ plain form
-499 164 227 279 293 282 269 259 253 259 281 305 310 302 294 281 251 217 201 214 238 266 298 325 318 267 193 138 127 162 223 273 291 288 294 311 311 288 271 277 275 233
-504 233 170 136 152 194 234 263 278 277 260 241 223 208 207 234 278 306 296 268 261 286 314 313 283 253 244 245 234 220 229 261 283 276 267 285 314 314 275 236 221 222
-509 222 224 237 277 329 353 326 270 233 229 230 211 196 224 272 281 242 221 257 309 318 303 313 344 346 313 281 261 231 198 197 226 236 214 199 216 242 257 276
-513 276 304 310 285 269 278 272 216 149 128 147 161 164 184 224 263 296 320 321 290 261 262 267 239 203 214 270 313 309 276 235 187 148 150 187 214 202 171 143 121
-518 121 111 125 153 161 152 164 217 277 312 326 335 342 342 333 304 252 211 221 258 254 200 165 198 253 271 259 248 230 191 164 181 206 194 177 218 302 349 336
-523 336 318 323 315 273 236 231 228 207 201 246 310 339 329 316 311 296 264 229 201 188 202 242 270 251 201 181 221 292 348 374 379 370 357 350 350 339 302 249 207 195
-528 195 212 241 268 279 271 249 226 210 201 193 180 162 150 157 188 227 250 248 238 240 254 267 273 278 289 300 305 305 301 288 264 246 245 257 275 303 332 334 294 257 272
-533 272 327 355 334 310 313 303 242 171 162 210 242 220 184 184 218 248 260 264 261 246 222 200 188 199 236 278 289 257 218 207 219 224 214 202 197 197 204 224 246
-538B46PlPK2J8Ojlj5k4rJ8J9rl8l4pJ5K2Pk9o1n6nN9Q3O0K0nj8k7k8j3J4K9K1kj7j7j5j8
-543B19j3RK9J8j5l9l0pMjkNJ1J2J8K6J7j3l7k8KJ1j7m1k0K8M1km8m0MK9J4n%J4RJOJ5kk9
-548A53k6J6N2N0K4J4J8J0k4n0l6OK7Mk8k4J6M8M5J7j2l6n2l6J1M6K8j8m2k3J0L1L6K1j8n5
-552B03m9nJ7qm3l8NL9M4K1j4m0k9K0O1N2Rj4nJ1J2QPKrrOJ4jj5rPPj8m0k9J9P0P8L3k9o1
-557B80m7j8knrnOJ8J9jl3n3l5MK9K4J5K9N8O1K5k0l0rO%jK0L6J9k1n6o4m8k2%MonJ7L7K4
-562B41nj5lKj3j6J2M5M6J1j8j3RJ0j3k2J5O4N3j6o7m4PJ3j4j4J4J9m%L1K8j8l7QM6J3l5j6
-567C04L1J6m8o2qK5kk6NL9J8k4k2J5K9Pj5j1QL0N0M9J7j6j4NLk3l0qJ5J9J5J2lk9l9k4j8
-572B90n1q5o1J6P2N3jk0J1L8K7%kJ2Ll1n4l2J1K9J3j1j6jJ5J8%k9m6l5mK0K2QjMK5N1N0J4
$$ plain form
-538 246 253 250 257 279 297 303 302 299 284 260 251 269 288 279 241 207 200 215 237 244 215 154 98 93 152 235 295 315 310 292 265 237 224 238 267 288 286 269 252 237 219
-543 219 206 215 244 262 247 208 178 171 175 174 172 177 188 200 218 244 261 248 211 183 185 196 179 138 118 146 187 185 137 97 101 130 144 139 139 153 162 163 169 184 182 153
-548 153 127 143 195 245 269 283 301 311 287 237 201 207 234 238 210 186 202 250 295 312 300 264 212 176 187 233 261 243 201 178 188 219 255 276 258 203
-552 203 154 149 166 158 115 77 82 121 165 186 172 132 103 123 184 236 245 231 226 237 249 257 264 266 257 248 254 268 267 252 243 250 257 239 199 170 189 259 337 370 341 280
-557 280 233 215 213 208 199 194 200 218 237 236 203 150 115 119 148 172 187 216 274 335 360 340 310 301 307 307 306 326 362 381 360 304 240 192 170 170 174 168 163 180 217 241
-562 241 236 221 218 220 207 191 203 248 294 305 287 274 283 293 280 258 273 337 390 374 307 263 270 283 269 255 269 288 284 284 315 343 325 288 296 342 355 320 304
-567 304 335 351 303 241 233 258 256 230 235 274 292 268 246 261 290 297 282 271 279 309 359 408 425 409 395 400 403 380 350 342 357 376 391 403 400 371 332 308 290
-572 290 239 154 93 109 181 234 233 213 224 262 289 289 287 299 302 271 217 185 196 225 238 227 211 210 225 243 243 214 168 133 129 149 171 179 178 182 207 258 308 322
-577C22l2m9l0j0njJ8L3K2%nORpk1k3j7nJ4K4%m2m7lL6J8k8k8K0M9K0k8m1j9RL1M4L3pm5l8
-582A77J1M9M2Kk9k3PL2K6KnJ4K6Ok4j9J6L9J8k3m6m7l2j3OJ7J0jmMRRQRPjj3j8qJ7M1M4K4
-587C66j7o3r1o6OP0P0J9j4mJ7Rj6k6k3j8pJ0J4pk7j7QJ1JNK4K6RmOJ6J3QPMj2k4k7k8k7j3
-592A88K0M3L7J3moKRJ4Qjj0j9l1l6j4K6M4K4j2k6j8mMJ5K0Pk7n9o0k1L1M4Lm1k3N1J00P3
-597C64%m5l5kK3K6Rj5k1pQJ1J0J0ol5l7MM6L8mk6j5j4l2m0k6j3pPL2L1jk6j2J9K7Qq%K3M1
-602C10M0J9%mjqj3KJ7Kk8l3j0jk1l1j4rl0l4J2N8M7Nj0lj6m3m3j2J7K6L4K9ll7l3OK7J4j
-607B27PJ8Qj5l5m2k0K7N3K5j6j4K3L3Jj3J3K5kk4qJ3lk6j9nj8l2jN4O8K1l9o5m5LM4L7mk7
-612B27KL8K0l1n2l0j6l2n2m5j7J6M9P1O9N1K8Lk1k7kK0Rj6j4PMj2LL8K9k4m4RO7N1j2m5k6
$$ plain form
-577 322 290 241 211 201 196 195 213 246 268 268 263 269 278 271 250 227 210 205 219 243 243 201 154 151 187 205 177 149 169 218 238 210 169 150 159 190 234 267 260 215 177
-582 177 188 237 279 281 252 229 236 268 294 296 291 305 331 337 313 294 310 349 367 344 298 251 219 206 212 229 239 238 234 238 247 256 264 273 280 279 266 248 240 257 298 342 366
-587 366 349 286 195 129 135 205 275 294 280 276 293 302 286 260 237 219 212 222 236 229 202 185 193 204 205 210 234 260 269 265 271 287 300 308 315 319 307 283 256 228 201 188
-592 188 208 251 288 301 297 291 293 302 316 324 323 313 294 263 227 213 239 283 307 295 269 251 247 251 266 286 293 266 207 147 126 157 201 204 163 140 191 291 364
-597 364 364 319 284 282 305 331 340 325 304 297 305 316 326 336 330 295 258 262 308 346 342 316 301 287 255 215 189 176 169 176 208 239 238 212 200 219 246 254 246 246 269 310
-602 310 350 369 369 365 364 356 343 345 362 364 336 303 293 292 271 240 226 217 187 153 165 223 270 275 265 262 246 203 160 148 165 191 225 254 251 214 181 187 214 228 227
-607 227 234 252 260 245 210 168 148 175 228 253 237 223 246 279 280 267 280 305 303 279 271 284 281 255 236 231 213 181 180 234 302 323 284 219 174 177 221 258 254 227
-612 227 229 267 287 256 204 174 158 126 74 29 12 28 77 148 217 268 296 299 278 251 249 269 278 262 248 255 259 247 250 288 317 293 249 258 325 376 364 319 293
-617B93mmqlJjMLj5l2k1J8M0K2j4l1j3J3K2Mk2l0j0K5N1N3K6j0k0kJ1k1o4n8JL9J9j2PM9N1
-622C57J3k1k9l5l5qL7M2ln1n2k2%QJ3J6MrkJ9K7J3mr%QJ7K6K2ml8m8k4RJ6nj5OL7M2J2k7
-627C03m6l6j1NMj%lk2l0mL9M5J8J0L6L4k5p6m8K0L5lj9J3L2Kl4l9l6l6j2M7Q1M7j3l2j2j
-632B32MK6N0L2j0k0MQk6m3j4J7Oj6oK5K8Mj2j0j2k6k8j5ppML0L8J2qMK2%m2m0J9O7M8ql0
-637C00oJ6Nj1KK7L2J3mj3k6m4m7l2j4nJ0M3O5M2j2l7rL2L2%l0l6l5k7qJ0om2m6lL4J6k5l2
-642A29LK2Nj7j1RK3L3L8K4j0l1k2m%jJ3K7K2RJ2K7K6jk6k9j8nMRJoLK0J6j8n0m0ML2Pm7p3
-647A09l2L7P3M8kk5j6JPRJ4J7J2J%J9N4P4M6k5q4q0k6K3L9L5K3rn4p1m1KJ4MMJ2J0mjJ4J2
-652B43j1k1lJ3nl4l1KK5J7jopk0l0j8RK4K1J7K0J6nk5j1L9Q0O7J1m1m6k1KNOJ9K8J0l5p0
$$ plain form
-617 293 289 285 277 274 275 274 278 281 266 234 213 231 271 293 279 248 235 248 270 274 252 222 212 237 288 341 367 357 337 335 346 325 261 203 204 243 262 250 257 306 357
-622 357 370 349 320 285 250 242 279 321 318 267 215 193 193 201 214 230 234 225 223 242 269 282 278 269 269 277 294 320 342 338 300 252 228 237 253 248 233 239 276 318 330 303
-627 303 257 221 210 215 219 218 218 215 193 163 159 198 243 261 271 307 341 316 240 192 212 247 244 225 238 270 272 238 199 163 127 115 162 243 290 277 245 233 232
-632 232 236 262 312 344 334 314 318 326 300 257 243 260 266 250 244 269 297 301 289 279 267 241 213 198 191 184 188 218 256 268 260 264 286 286 244 204 223 290 338 330 300
-637 300 294 310 315 304 306 333 365 378 374 361 335 291 244 212 198 193 203 246 311 353 341 304 295 327 359 359 329 293 258 231 223 233 227 185 139 136 170 186 161 129
-642 129 132 154 159 142 131 140 163 196 234 258 248 217 195 191 191 190 203 230 252 261 273 300 326 325 299 270 252 247 251 260 261 255 258 278 294 276 226 186 190 222 229 182 109
-647 109 77 114 187 235 233 208 192 193 200 209 223 240 252 253 253 272 326 400 446 421 337 257 231 254 293 328 351 342 288 217 176 178 192 196 200 212 222 218 217 231 243
-652 243 232 211 208 221 216 182 151 153 178 195 194 188 181 161 131 113 122 146 167 184 204 220 215 190 179 218 298 365 376 335 289 268 270 275 281 300 328 338 303 233
-657B33n8kM4L4k0n5l2J7M2L5K7K5J1j6k3jJ9Rj2j2lj1k7j5K0L9K4NQJ5Mk0l4k2J2N1N9K7
-661C97j8l6k4j9l0k7JJ7kj8LL6L0j5m8m3j5J0K0J4pj9j7j1j7j3J6M1K7j0j5J5L1Pl0l7k1
-666A73%J6L0L4J5j0k4j6NK2J4j4l5k9JK5K7J2rk0j2J7L4J8qoJ8K1KqQJ9J0oj8l8n9n2j2K1
-671A66K2J8K8K4j2m2k5J4K2LjJ0%l1n0l4oJ2K6M1M3K3jj6k1j6JJ8J8LoPK2J7oj6NK9K2j2
-676B99k9mK5J0l1l5J5N5L6j5l5k1ooKK1K7J5kj1j6j4MK6L0J0j7l4l2j7kJlknk9n4l2L5P5
-681B34N0J0J6L7J1m5o3l2j2k0j6J1J2j3qM5P9M5j2l1k2k3k3LK9J6j8j9J0K9J1j0j4pjKNN
-685B71MPJ6K2K2J1oj2jNj3l2j0K7J5m7p3k0M0K9k3k6K1M1J0j5jJ7Mk0k2j7k3k7pJ4Nk8m6
-690A12k2K3M9K7k3n5m4jL3L6J9MjRJ4OqlJ5J9rl0j7J3J7MjNmk5j5L1O5M7pm4l7LL1K2qj3
$$ plain form
-657 233 175 173 217 251 231 176 144 161 203 238 265 290 301 285 262 261 280 289 277 265 262 251 224 209 229 268 292 297 305 320 324 304 270 248 260 311 370 397
-661 397 379 343 319 300 270 243 244 261 259 241 244 280 310 295 247 204 189 199 219 233 226 207 190 179 162 149 165 206 233 223 208 223 254 261 231 194 173
-666 173 173 189 219 253 268 258 234 218 223 245 259 245 210 181 182 207 234 246 237 217 205 222 256 274 266 260 278 299 301 293 301 320 330 324 306 268 209 157 145 166
-671 166 188 206 234 258 246 204 179 193 215 218 217 227 227 196 146 112 106 118 144 185 228 251 250 234 213 197 198 216 234 237 231 238 260 277 271 255 260 289 311 299
-676 299 270 266 291 301 270 235 250 305 341 326 291 270 264 258 260 281 308 323 321 310 294 280 284 310 340 350 333 299 267 250 248 249 246 244 239 210 156 124 159 234
-681 234 284 294 310 347 358 313 250 218 206 186 170 181 193 180 172 217 296 341 329 298 276 253 230 233 262 278 260 241 251 280 291 281 267 260 259 261 266 271
-685 271 275 282 298 320 342 353 347 335 334 339 326 294 284 311 326 279 206 186 226 255 232 206 227 268 278 263 262 279 283 263 241 224 201 174 167 181 186 158 112
-690 112 90 113 162 189 166 111 67 66 99 135 154 158 157 166 180 186 178 175 190 209 200 170 153 166 183 187 186 191 187 162 147 178 243 290 283 239 202 205 236 258 250 237
-695B37J5L6K6RJ4K2jl8m3j3J1K3L6L8no3p1k4Qqk7qJ7J4OJ7K9J6klpk9k3K3N0ko9n4K2M8
-700B27j3o5l5K7L9Kk3j7j2k2l1j4K0N5O5L6qk4jJ4j1l6pM9M5l1q5n1K2M2J3LK3J9j4j1M6
-705B36P3J9m5k8K9L7KJ2O2M9m7j08n5L1L1l1n0rJ4lpK5M1Pk7j3L6N9L6lk3rJ1Ll5n7k9Pk
-709B39m6n1J2P8P8J7m7o3l3J1K4ll8l7mJ5NKK2L5J3j8j5J1J8KrjJ4J7J6J5Pj7l4k3J3L2M
-714B61l9m9j5J7K0K0M3N6J6m7o5l3omQL7K9l0o5j6O3Q0L1j5k3k0j9j1OLj4j4J4L6K8Kj7k5
-719B43k2qPJ5K0K1Nl6o5m5OL3K5J4J7J0j3k8j3J1K3K9K7%l9m8qK8J9j5k2jNkPL5M0J2j8j7
-724B52kKkKMpk1j7JJ6J7J5K0J8jk8l8j7J6K5Jk9l2rJ6K5K0J3%j4j8%L3N1L3qm7n4l1jJ4R
-729B27%JPJ1RKqk3l0j8OJ5mk3j1K3L5Ok6k4kmk6k8LK9K2NJ2K5J6lRM9O2K4l0m3j9Klj7j3
$$ plain form
-695 237 252 288 314 323 337 359 358 320 277 264 275 298 334 372 367 304 233 209 217 209 182 174 191 205 211 228 257 273 271 268 261 232 209 232 282 280 211 157 179 227
-700 227 214 149 114 141 180 182 159 142 130 108 77 63 83 138 203 239 231 207 206 220 209 173 166 215 260 229 144 93 115 157 170 173 196 215 201 190 236
-705 236 309 328 283 255 284 321 323 335 397 446 399 291 236 267 298 267 217 208 222 219 212 237 278 285 258 245 281 340 376 373 350 341 352 355 320 263 234 241 239
-709 239 193 142 154 232 310 327 280 217 184 195 219 216 178 141 137 152 157 159 181 216 229 211 196 207 225 227 218 217 231 248 264 279 286 269 235 212 225 257 261
-714 261 222 173 158 175 195 215 258 314 330 283 218 185 179 175 183 220 249 219 154 138 201 281 312 297 274 254 235 224 230 233 219 205 219 255 283 285 268 243
-719 243 221 213 220 235 255 276 281 245 180 135 141 174 199 213 230 240 227 199 186 197 220 249 276 276 237 189 181 209 228 213 191 190 195 193 200 235 275 287 269 252
-724 252 250 252 250 252 256 249 228 211 212 228 245 260 280 298 297 269 231 214 230 255 256 227 195 186 202 227 247 260 260 246 228 228 261 312 345 337 290 236 205 204 218 227
-729 227 227 228 235 246 255 257 249 226 196 178 184 199 195 172 161 184 219 225 199 175 173 169 143 115 118 147 169 174 186 211 227 224 233 282 344 368 338 295 276 278 275 258 245
-734B45J7M5M3Nl3l2LK1nm4m0J1N6M9Nl2l4k3k1k8k9k6k8l6k8OL8M7L4K0J0rl5m3k3RL4L5
-739A84J4j3j5J3L9J9k7l9LM5L5nk0LK9L0J1j3l6l5mK7K5KkJ6K4Nj3j1%kj8l5m3k5J3M1K7
-743B49j6l9k8j5rJ4M5M0ql2kL2J7k1k3JJj6pK2J8j4k2J1K8nm1l6lK1K8J9ol2k4K3N6M4J5
-748B85OJ2Mk2l7l6k3jK7M1K5ok5k4j6j3j2rRM3O5L6k3m8j9Nj8m6k2K8L9J3QL3L6Lk3j6pj8
-753B54k7mK7L2Qk0l5l1pJ8J7oj9mJ1PKJ6K7J5plJ7K3Kk0k3j2rk3l5k7NK6J0k2k1K6N9L8m
-758B81qJ7J2l1n5k2L2N2L5J5Nj0l1m2k8kJ9K5K2K9L9L2Kl4m6l1j2NK1L1J4k2m3l2j0j0j8
-763B01qJ8L7L1J6%j5j7KK5J4k5n2m0j1mj7k2j6j4k1j6jNLPK6M1L7K5J6QLPJ4Pj4k3rONJQ
-768B38Nj9l8k2J8M3M1L6L0J8NKJj9m5m5k4j4k0j9%PlJK8L8Nl4l1PL7L7J7j2k8qL9N8K0l2
$$ plain form
-734 245 262 307 350 355 322 290 293 314 309 265 225 236 292 341 346 314 280 257 236 208 179 153 125 89 61 67 105 152 186 206 216 207 172 129 106 115 149 184
-739 184 198 185 170 183 222 241 214 175 178 223 258 253 233 236 265 295 306 293 257 222 218 245 270 272 270 286 310 315 302 291 291 289 271 236 193 168 181 222 249
-743 249 233 194 166 151 142 156 201 241 233 201 199 231 248 227 204 205 206 190 183 205 223 209 187 198 226 221 180 144 141 162 190 209 203 171 147 170 226 270 285
-748 285 291 303 307 285 248 212 189 188 215 256 281 275 250 226 210 197 185 176 185 228 293 329 306 258 239 244 226 180 158 186 225 238 246 279 315 318 295 279 272 254
-753 254 227 223 250 282 290 270 235 204 197 215 232 226 207 203 214 221 223 239 266 281 274 271 288 311 313 293 270 258 249 226 191 164 169 195 205 183 162 188 247 285 281
-758 281 273 290 302 271 216 194 226 278 313 328 333 323 292 250 222 220 239 264 286 315 354 386 388 354 308 277 265 270 291 322 336 314 271 239 229 219 201
-763 201 193 211 248 279 295 295 280 263 265 290 304 279 227 187 176 172 155 133 117 103 82 66 65 70 73 80 106 147 184 209 225 233 236 243 257 264 250 227 218 224 229 230 238
-768 238 243 224 186 164 182 225 266 302 332 350 355 357 358 339 294 249 225 211 191 172 172 179 176 177 205 243 248 214 183 190 227 264 281 269 241 233 272 330 350 318
-773C18m1pK2K0%j6k0qRJ0j9m4l1JQj3l0k1jK2M1M1J9n%J8J4j1k2j5j5k6k1nkj7j8NK0QkQ
-778A74K2K3K7K9Ql3m8k1Jj4l1qL2M0K2J2Jk9n0k2L0M0QnJ7L0J1j0j4k2l6k4J6L2Kk2%L0J5
-783B33k3j9J5J7k5m4qL2K9jqJ1K0OpjJ2J2Kpplmj7k8k0J7N4O0K1k9n0k5J5L5K7J4K4M4L7
-788D11j1n9n7j4J6ll4k8NJ5j0l0j0K1J6l6p9o7qM8O2L0k0m7l2J1M8M9K1rj6rkNK2M6N2K5
-792C22j0j5OJ9jl1l3%K6J1l4o7n8k8j0j0rJ5M9P1O2K3k2l0K3Q0O9j3p7n9JK1jrJ0Rj6k2j
-797B61Oj9k4J2L7Ql1k5%j0l3j5L4M5Rk2j8j1j4oJ8L2K4J2Mk1n1l7J5L9km2j6M7O8M2J5Nj0
-802C26l9n0l6j8j1jJ6K5Oj6j2J8M6L8jl8l7mK1J7M%nj9k8rJ9J5nmK2K8j3o2o3j4L3M1J3k0
-807A83k8rJ8L3K5%k5k9qJ5J6MJ2M2N5K0l1n4m2j9QL9N7L7lk3j7o%J3J6j6o5p3k9J6K9L5N9
$$ plain form
-773 318 277 270 292 312 312 296 276 268 277 287 268 224 193 194 202 189 159 138 137 159 200 241 260 255 255 273 287 276 254 239 224 198 177 172 170 153 135 140 160 168 166 174
-778 174 196 219 246 275 283 250 202 181 182 168 137 129 161 201 223 235 236 207 157 135 165 205 213 208 225 255 266 256 242 220 184 160 176 208 210 188 188 218 233
-783 233 210 191 206 223 198 154 146 178 207 206 198 209 229 235 228 227 239 251 253 246 239 236 232 215 187 167 184 238 298 319 290 240 215 230 265 292 306 330 374 411
-788 411 400 341 284 270 286 283 249 221 226 241 231 201 191 212 228 192 113 46 38 86 148 178 158 111 79 90 138 187 208 199 183 174 172 177 199 245 297 322
-792 322 312 297 303 322 321 290 257 257 283 294 260 193 135 107 97 87 78 93 142 213 275 298 276 246 269 349 418 405 328 269 270 291 290 281 291 300 284 262 261
-797 261 267 248 224 236 273 281 250 225 225 215 182 167 201 246 255 233 215 204 190 184 202 234 258 270 274 253 202 165 180 219 217 175 159 206 274 316 331 336 326
-802 326 287 237 201 183 172 171 187 212 218 202 190 208 254 292 291 253 216 212 233 250 254 254 249 230 202 193 212 227 222 218 240 268 255 193 130 116 149 190 203 183
-807 183 155 146 164 197 222 222 197 168 160 175 191 195 207 249 304 324 293 239 197 178 186 225 282 319 316 293 276 270 270 283 299 283 218 145 116 132 161 196 255
-811B55P4M9Lk6m2n4m9j7J2QqOL2K2k0l9j0J8J6PJ6K6J1k2m3m8m2j5K3M1K4LJ0L0K2j1k7j5
-816B20jj6m2m3j1K3L3K2J7L0L2on9o7k3J9J8PL0O0L7k9o9m4JJ5J2K5L5K1kjJ7J9Kj4j8k7
-821B23l8l0qJplK3M6L8Rj5j9j0QK3K2Kj8k3j7j6j1J5N2N7J2m2n3j6K6L0Kj7nK9N3N2K0k7
-826C68o6o8m0j3rj2pjoj3nNPJ3L9M8Rn0n6pK4Mk3j0J3QLL7P6N5j5n6m2j5j2j4j0kPL1N0K3
-831B68m0o9m2rpqK0M5L4J6K8L9Ln0m8%K6J5J9M6L7l1q2n9j0j0l5j7L6M7Oj5J9N0K8lJ2M4
-835C03L1j8l9j7ok9l5QN0L3j8m1k6j6k5k7j7j1j1J1M7N8K6pkK5L2J6%mj4l3l9k4mlnJ3M8
-840B30N8K2l6n6k7RJ1l%J4Nk2k4J3M9M4J3j5l1l2pL0L4j1n6m7ML2J8j7l9m1j5K8N4M0J0%
-845B39Lj6m3k6K6N3J7l9n4l0%J4J6PonRJ4jj5rOJ0J1J8K6K7K5K0Kk3k6PM0L0j4m5m1k5j0
$$ plain form
-811 255 329 378 381 355 313 259 210 193 205 213 205 211 243 265 245 206 196 214 230 237 253 279 290 268 225 177 135 120 143 184 208 211 221 251 273 262 235 220
-816 220 219 203 161 118 107 130 163 185 202 232 264 258 199 132 109 128 146 153 183 243 280 251 182 138 139 154 166 191 226 247 245 244 261 280 282 268 250 223
-821 223 185 155 147 148 141 138 161 207 245 254 239 220 210 218 241 263 265 247 224 207 191 180 195 247 304 316 274 221 205 231 261 263 246 241 270 323 375 395 368
-826 368 302 234 194 181 172 160 153 152 146 133 128 133 140 153 192 240 249 199 143 136 160 164 141 131 144 152 155 192 268 323 308 252 210 195 183 169 159 157 164 195 245 268
-831 268 228 159 117 108 101 93 113 158 192 208 236 275 278 228 180 180 206 221 240 286 323 292 210 151 141 131 96 79 115 162 168 153 172 222 250 247 259 303
-835 303 334 316 277 260 254 225 190 198 248 281 263 222 196 180 155 128 111 100 89 100 147 205 231 224 222 247 279 295 295 291 277 244 205 181 177 174 169 182 230
-840 230 288 310 274 218 191 200 211 208 208 222 227 205 181 194 243 287 300 285 254 222 215 245 279 268 212 165 169 201 219 202 163 122 107 135 189 229 239 239
-845 239 242 226 183 157 183 236 253 214 160 130 130 144 160 167 161 156 165 179 178 163 154 160 170 181 199 225 252 277 297 299 276 250 257 297 327 313 268 227 202 192
-850A92LJ9K6J3j8o0r0p1mN9O8L4J0J5K4J7Lj1l9p3p4k5K7L5R%J7K6J1KK2M5L5nk7rK6L0l
-854B59m0n0l3j1jLLok2k3NM0M9K3noN%j0NM0M4Nk6pK9J6l4n3j3L2L2Oo%kpqj5l8m9k4K1M3
-860A71K7KqjK6O1O6K2m1o9n6m0l2j2L3P1O7K4k3m5k8J1L0J5jJ3L1Pm1n2j4J7RkJ0K2RpJR
-865B82mj2KJ8Nj1mKk7n4k5M6P7M6mk4j9mJ3J4j2l7k7%kl0l5lK7L3M0O2N6Ln4o4l3MK8L1R
-870C13j7j3RNk8l3NK8pm1j9J7qo7o1K2R4R1M1ll1m6l5j2qk4k3RK9Ok7l6k7j5%K4L9K9J8K2
-875B20K0mk8k1%KkQJ6om1l3K0N6L3j3k0J1L2K0lrllj5k7k3jK2L9M1L1J1qj2lQJ4J1Jj4k1
-880C06rJqj7nJ6%m4n7j6K3J5oJ0L8K4j6j3L4N1J0l2k3Jj1l9m3k4j0LL3N8L4k8p3o2oM2M8
-884B05Ql6l6LK8Qj7JL6L3jqK3M2K4QK0K1k0n9l5K8N1Mn3n8k2kj1j8kJ7J7QJ2J5ll0k2K5O1
$$ plain form
-850 192 195 214 240 253 235 175 85 14 10 69 137 171 181 196 220 237 240 229 190 117 43 18 45 80 89 89 106 132 143 145 167 212 247 242 215 206 232 262 259
-854 259 219 169 136 125 124 127 130 124 102 79 84 124 173 196 191 185 190 190 180 185 225 269 274 248 241 270 286 252 199 186 218 250 256 250 250 248 241 233 218 180 131 107 128 171
-860 171 198 200 192 191 217 278 344 366 325 256 200 160 128 116 149 220 287 311 288 243 215 226 256 271 270 283 314 321 280 228 214 231 240 238 248 270 279 272 273 282
-865 282 278 266 268 286 291 280 276 278 251 197 172 218 295 341 337 313 294 290 303 317 305 268 241 241 239 209 174 171 198 231 271 333 389 392 338 274 241 245 273 304 313
-870 313 296 283 292 297 269 236 241 269 262 221 202 219 211 144 83 105 199 290 331 328 297 251 216 204 196 172 149 158 187 193 166 130 103 88 88 112 151 180 198 220
-875 220 240 236 208 187 187 189 187 195 211 205 164 131 151 207 240 227 207 218 250 270 267 258 255 252 237 210 187 186 208 247 288 319 330 322 310 307 315 329 340 341 327 306
-880 306 297 298 290 273 268 284 284 240 183 167 190 205 199 209 247 271 255 242 276 327 337 305 282 283 272 233 190 166 156 159 192 250 284 256 183 121 115 157 205
-884 205 213 177 141 144 172 180 163 164 200 233 232 224 247 289 313 321 341 362 342 283 248 276 327 331 278 220 198 196 185 167 165 182 199 207 219 234 231 201 179 204 265
-889B65M1nk9k8k4j3K5O0L5l7o3lP7P3qp8p3j9K8L6J2k4m8m1j3J3J4j1m0m7j4M2O7M1qk8j3
-894A62J3K4K3J0j6l5k8jJ7Oj5k1kL0M8L3ml0j8QJ2qj6n%j3k1kL0N1M6K0j4l3k2NJ7Noomj2
-899B28k0k6l4m0j4L7O1L1j5k4jJ3ONRKj9k1jNj8l8j9K1M1K4jnOQlpJ3L7J8l6o4k4M3O0K2
-904B60j1j0ok4k9ML1J3k0pM0M7qn9m2J1K6j1m6l7ML2L6K6Rpj0PK5J7j2k7j5JlqMJ5nl7m0
-909A34qK1K1Mqj2rQK9K9QoMJ4Kj2qKmj3kK7M4L6J8ql6n2l4NL0J9j7m7m3lM5N1J2k7j6K5M2
-914B65K1qk1k7k1OL8L6jl0k8j4qMK8L5Rj4lK1K0mj5oqk6l5j9%OQJ9K9K6kk9l3kL7M0jm4m7
-920B02k1MJ3K0K7J1k4m4k0L2N9M1Lj5lJ1Jj8k1rj0k6k5OL0J6j4rJ9K7Jj7nJ4J1kkPOnj4k0
-925B37k4k6j9qLJ3J9J7J2J3J3%k0k0PK9J9nj5j0j1j2%K4L9L7K3pm9p8o0j2J7Mj6nJ6J7KL
$$ plain form
-889 265 306 301 272 244 220 207 232 292 327 290 227 224 301 374 366 288 215 196 224 260 272 248 200 159 146 159 173 162 122 75 61 103 170 211 203 175 162
-894 162 175 199 222 232 216 181 153 152 169 175 160 139 137 167 215 248 244 214 196 204 216 208 192 187 187 174 153 151 181 232 278 298 284 251 229 234 251 256 250 244 240 228
-899 228 208 182 148 108 94 131 192 223 208 184 183 196 202 207 216 218 199 178 177 182 164 126 107 128 169 193 192 187 193 201 198 191 204 241 259 223 159 135 178 238 260
-904 260 249 239 233 209 180 184 215 228 208 201 241 288 280 221 179 190 216 205 159 122 126 158 194 220 229 222 212 219 244 261 249 222 207 208 205 197 201 216 211 174 134
-909 134 126 147 168 172 164 152 143 151 180 209 217 211 215 229 231 219 211 213 209 196 194 221 265 301 319 311 275 223 189 194 224 243 226 179 136 133 178 229 241 214 198 223 265
-914 265 286 278 257 230 209 215 253 289 288 258 230 216 208 212 240 275 284 270 267 288 308 304 289 283 275 249 214 195 195 201 209 228 257 283 281 252 219 217 254 294 293 249 202
-920 202 181 185 198 218 245 256 232 188 168 200 259 300 303 288 285 296 297 279 258 249 239 213 188 194 224 240 226 217 236 263 264 247 242 256 267 265 263 270 276 271 257 237
-925 237 213 187 168 160 163 176 195 212 224 237 250 250 230 210 217 246 265 260 245 235 224 212 212 236 275 312 335 328 279 201 141 129 146 150 134 129 145 162 164 167
-930A67K0J5j3k5QM9M5km2m1j2J5L3L8K3lj5mLj4m2m6k0PRnj2kJ8L4L3J5lj0j3j2mJ0J3KJ
-935B18K0L1Jl3k7QJ7oj4RK0KkK6L6%l1mM4L9qk9j1Jj4k6k3k8m1k3K2L8Rk0j3Lrk1KM4N5L3
-940B95J1%j1l5n2n1l3oK0L3L0K0J4J2J1Lj0k3k1NL0J3l9o3k0M4N8K0j6j6%Mmj4j5pRK3K4
-945B43J4OLJmj2k2k6j9kJ2Qjpj1pJ3L8L3rl4kM4L5k9o6l6J1K1QJ1J7jk5j7J7L1J1j0qLok6
-950B00l0j2OOpj4j1pkJ1K5L4K6J0MJ5K9L4K2Jj8l0l0k3j6j3qLJ5Qk0m4k0M4Q2M1m3p2k1M5
-955B20N3J9mqk0m0l9k4k1k4mL1L4%j9PL1J1l1l9j1J4J7J1OMJ1K3K2M%K6N1K5l4o8n2j7kM
-960A67K0M2M1Rl0l9qL8N3K8qk9k8j1K8O1M8k0p5o0JL4J7j9m0l8j4K0L2jl4j2M4N6J0k5oJ6
-964B68pl6j6L1L2j7n3m1lK6M2M4L1Kk3k8j5OJ7J0oj5j1rrJ0M7O6L6k2n2m3k2k0k1rJ7L0J1
$$ plain form
-930 167 187 202 189 164 172 221 266 264 222 181 169 184 217 255 278 275 260 256 259 245 203 157 137 144 153 148 136 134 152 186 219 234 231 221 208 196 192 202 215 217 218
-935 218 238 269 270 237 210 218 235 229 215 224 244 246 244 270 306 306 275 271 315 354 346 317 306 307 293 267 244 216 175 152 174 212 221 201 188 191 182 161 163 207 262 295
-940 295 306 306 295 260 208 157 124 118 138 171 201 221 235 247 258 261 251 228 207 212 242 255 216 153 133 177 235 255 239 223 223 227 223 209 194 187 196 219 243
-945 243 257 263 266 267 263 251 229 203 184 182 194 202 201 194 183 176 189 227 260 251 217 215 259 294 265 199 163 174 195 203 214 231 230 205 188 205 236 247 237 229 232 226 200
-950 200 170 158 164 170 163 149 138 131 129 140 165 199 225 235 239 254 283 317 339 340 322 292 262 239 223 210 202 205 220 228 208 164 144 188 270 311 268 196 175 220
-955 220 273 292 288 280 260 220 181 157 136 112 108 139 173 173 154 161 192 203 172 133 122 136 153 164 170 174 185 208 230 234 234 260 311 336 302 234 182 165 163 167
-960 167 187 229 270 279 249 210 202 240 293 321 313 284 256 245 273 334 382 362 287 227 228 262 279 260 220 182 168 188 220 219 185 173 217 273 283 258 252 268
-964 268 261 225 209 240 272 255 202 161 158 184 226 270 301 303 280 252 237 243 260 270 264 249 238 229 220 230 277 343 379 357 305 262 240 220 199 190 207 237 248
-969B48k3l2JL8K8j6l6j5Lj3j9J6N4M1lk5k1k5k7qQj5m9k9L1N2J6j2mkk6k7J6M1J5j6pNk1
-974A42m0qL3J4l2k2L8O1K2j6j1J1J4J1J3RMJ2K0km1m3kL1K3Klpl0n1m9l1j8mJ3L0M4O0O1
-979B58L6kj1lj6m7m9qK6K2NLrm3n3j9J5J4QL4N0J7k2qK9J5l7n1j1K4K5K1J7j6n5m0K5N5J8
-983B17j9%L3J2l9n6k6J3L2L8L5K2J0J0Ok1n6p6p1m6mL8M8L0J6L0M4K9ql2l3k1lJ5J7J0J1
-988B05J8Nk6l1lMl3n2jO3N3j4l9JL8K4orkqj8j4j0pOK7K8Oj2j0qj4oK3M1K3nj7rNK5L2Mm6
-993B31o5l2NOkK1N6N3J4j9k5k3k6k4j3KK4N3O0K1l1l8%K8J1j3oJ8J9nl1m3l5oL6O3N9L8J9
-998D00kl6o4n7j9J2Pj8k2%K2J8mj7j0QK4K7Rk9o0n3j1K9L2Pj3mK7N5N0Mn3o9l3J5L4K7K2
-1003B55J9Mk2k8lL6N8M9%p0j13r1k7K9M7M5L7K6J6J6Qk0m2k2K3M1J9mlok0pK9K5m6j08q0
$$ plain form
-969 248 225 193 194 232 260 244 208 193 196 183 164 180 234 275 272 247 226 201 174 166 174 159 110 81 112 164 180 168 164 162 136 109 125 166 181 165 158 163 142
-974 142 102 94 127 141 109 87 125 186 208 192 181 192 206 217 230 239 243 255 275 273 232 189 187 218 241 243 240 233 203 152 103 72 54 50 63 93 137 197 258
-979 258 294 292 281 278 262 215 166 158 184 206 211 214 205 162 109 90 105 119 127 161 211 228 206 198 227 242 205 154 143 167 192 213 230 214 159 119 144 199 217
-983 217 198 198 231 243 204 148 122 135 167 205 240 262 272 282 288 267 211 135 64 18 14 52 100 130 146 176 220 249 241 209 176 155 152 167 184 194 205
-988 205 223 228 202 171 168 172 139 87 86 149 202 188 149 150 188 212 206 197 195 187 169 155 145 138 144 171 199 205 193 183 175 161 155 178 219 242 237 220 211 216 241 273 277 231
-993 231 166 134 139 145 143 164 220 273 287 268 243 220 194 170 157 159 183 236 296 317 286 248 248 276 287 274 268 286 305 300 269 226 191 185 221 284 343 381 400
-998 400 398 362 298 241 222 234 241 223 201 201 223 241 237 220 210 218 242 269 278 249 189 136 125 154 186 193 180 176 203 258 308 312 259 190 157 172 206 233 255
-1003 255 274 278 256 228 225 261 319 368 368 298 185 94 67 96 143 188 225 251 267 283 291 271 229 207 230 271 290 286 283 277 257 250 279 304 258 150 70
-1007G0%L8K5J8K1j3o4m4O1J35Q7j9n4KO6O4J2m1o6n6k0J4J9jj9j7J0M5N8K4k8m5j0K9K4o
-1012C19k1k3l7m6j3M4O0K0k7m1l6l5j6K4N1L3qk7k3j7nL1P2O1qp5p7k3K6K9Jj0J9M9L3j8
-1016B86m3j7J0j2m7m1OL1K2K5N3N6Ln6n9k2KMJ7M0K9j3l8j8QMk1k5pJ4J9J5Jk0l8l9j7J3
$$ plain form
-1007 70 70 108 133 151 172 159 95 51 112 247 334 315 261 263 329 393 405 364 298 242 222 236 255 254 235 218 228 273 331 355 327 282 272 301 325 319
-1012 319 298 275 238 192 179 223 283 303 276 235 199 164 148 172 223 256 248 221 198 181 176 207 279 340 332 257 180 157 183 212 213 203 222 271 304 286
-1016 286 243 226 236 224 177 136 142 173 195 220 273 329 332 276 217 195 197 201 218 258 287 274 236 218 226 230 209 184 177 191 210 225 226 206 168 129 112 125
$$ [...]
-1605E25
##END=	
##END=	
