##TITLE=	Dec04-2021.23.fid
TM-VI-191, CD3OD 13C

##JCAMP-DX=	6.0	$$ MestReNova 14.3.0-30573
##DATA TYPE=	LINK
##BLOCK_ID=	1
##BLOCKS=	2    
##ORIGIN=	Mestrelab Research S.L.
##OWNER=	hrzepa
##$MNOVA/LINK_BLOCK_TYPE=	ITEM	$$ NMR Spectrum
##$MNOVA/ITEM/POLYGON=	(XY..XY)
5321,5835
8722,5835
8722,8208
5321,8208
5321,5835
##$MNOVA/ITEM/Z=	0
##$MNOVA/ITEM/ANGLE=	0
##TITLE=	Dec04-2021.23.fid
##JCAMP-DX=	6.0	$$ MestReNova 14.3.0-30573
##BLOCK_ID=	2
##DATA TYPE=	MNOVA NMR VIEW DATA
##DATA CLASS=	MNOVA VIEW DATA
##$MNOVA/ITEM/ZOOM/X=	-31.107771267257835035,	251.11459999734066173
##$MNOVA/ITEM/ZOOM/Y=	-382.97400665283203125,	3884.98114013671875
##END=	
##TITLE=	Dec04-2021.23.fid
##JCAMP-DX=	6.0	$$ MestReNova 14.3.0-30573
##BLOCK_ID=	3
##DATA TYPE=	NMR SPECTRUM
##DATA CLASS=	XYDATA
##NUMDIM=	1
##ORIGIN=	Bruker BioSpin GmbH
##OWNER=	nmr
##.OBSERVE FREQUENCY=	100.67161678785400625
##.OBSERVE NUCLEUS=	^13C
##.SOLVENT NAME=	MeOD
##.PULSE SEQUENCE=	zgpg30
##LONGDATE=	2021/12/04 17:11:00.000
##.ACQUISITIONMODE=	SIMULTANEOUS (DQD)
##$ORIGINAL FORMAT=	Bruker XWIN-NMR
##$MNOVA/SCALES_VERSION=	9
##$PARAMETER FILE=	(acqus, ASCII, /private/var/folders/f6/rjf_tdyn2v98c5c0wvkgn4s80000gn/T/fzSHe96GTy+OOdZ34tDPiw/23/acqus, 0)
$$ ##TITLE= Parameter file, TOPSPIN		Version 3.2
$$ ##JCAMPDX= 5.0
$$ ##DATATYPE= Parameter Values
$$ ##NPOINTS= 11	$$ modification sequence number
$$ ##ORIGIN= Bruker BioSpin GmbH
$$ ##OWNER= nmr
$$ $$ 2021-12-04 17:11:08.446 +0000  nmr@CZC2524DW0
$$ $$ /opt/topspin/data/agmb/nmr/Dec04-2021/23/acqus
$$ $$ process /opt/topspin3.2/prog/mod/shimcntl
$$ ##$ACQT0= -2.05882356948211
$$ ##$AMP= (0..31)
$$ 100 100 100 100 100 100 100 100 100 100 100 100 100 100 100 100 100 100
$$ 100 100 100 100 100 100 100 100 100 100 100 100 100 100
$$ ##$AMPCOIL= (0..19)
$$ 0 0 0 0 0 0 0 0 0 0 0 0 0 0 0 0 0 0 0 0
$$ ##$ANAVPT= -1
$$ ##$AQSEQ= 0
$$ ##$AQ_mod= 3
$$ ##$AUNM= <au_zg>
$$ ##$AUTOPOS= <26 >
$$ ##$BF1= 100.660544
$$ ##$BF2= 400.32
$$ ##$BF3= 100.660544
$$ ##$BF4= 100.660544
$$ ##$BF5= 100.660544
$$ ##$BF6= 100.660544
$$ ##$BF7= 100.660544
$$ ##$BF8= 100.660544
$$ ##$BYTORDA= 0
$$ ##$CAGPARS= (0..11)
$$ 0 0 0 0 0 0 0 0 0 0 0 0
$$ ##$CFDGTYP= 0
$$ ##$CFRGTYP= 9
$$ ##$CHEMSTR= <none>
$$ ##$CNST= (0..63)
$$ 1 1 145 1 1 1 1 1 1 1 1 1 1 1 1 1 1 1 1 1 1 1 1 1 1 1 1 1 1 1 1 1 1 1 1
$$ 1 1 1 1 1 1 1 1 1 1 1 1 1 1 1 1 1 1 1 1 1 1 1 1 1 1 1 1 1
$$ ##$CPDPRG= (0..8)
$$ <waltz16> <> <waltz16> <> <mlev> <mlev> <mlev> <mlev> <mlev>
$$ ##$D= (0..63)
$$ 0 1 0.00345 0 0 0 0 0 0 0.06 0 0.03 2e-05 3e-06 0 0 0.0002 0 0 0 0 0 0
$$ 0 0 0 0 0 0 0 0 0 0 0 0 0 0 0 0 0 0 0 0 0 0 0 0 0 0 0 0 0 0 0 0 0 0 0 0
$$ 0 0 0 0 0
$$ ##$DATE= 1638637867
$$ ##$DE= 6.5
$$ ##$DECBNUC= <off>
$$ ##$DECIM= 704
$$ ##$DECNUC= <off>
$$ ##$DECSTAT= 4
$$ ##$DIGMOD= 1
$$ ##$DIGTYP= 12
$$ ##$DQDMODE= 0
$$ ##$DR= 21
$$ ##$DS= 4
$$ ##$DSPFIRM= 0
$$ ##$DSPFVS= 20
$$ ##$DTYPA= 0
$$ ##$EXP= <c13>
$$ ##$F1LIST= <111111111111111>
$$ ##$F2LIST= <222222222222222>
$$ ##$F3LIST= <333333333333333>
$$ ##$FCUCHAN= (0..9)
$$ [...]
$$ ##$Sgu3PowerLevels= (0..7)
$$ 0 0 0 0 0 0 0 0
$$ ##$Sgu4PowerLevels= (0..7)
$$ 0 0 0 0 0 0 0 0
$$ ##$Sgu5PowerLevels= (0..7)
$$ 0 0 0 0 0 0 0 0
$$ ##$Sgu6PowerLevels= (0..7)
$$ 0 0 0 0 0 0 0 0
$$ ##$Sgu7PowerLevels= (0..7)
$$ 0 0 0 0 0 0 0 0
$$ ##$Sgu8PowerLevels= (0..7)
$$ 0 0 0 0 0 0 0 0
$$ ##$SguType= 3
$$ ##$ShimPowMaxUA= (0..63)
$$ 130000 130000 130000 130000 130000 130000 130000 130000 130000 130000 130000
$$ 130000 130000 130000 130000 130000 130000 130000 130000 130000 0 0 0 0
$$ 0 0 0 0 0 0 0 0 0 0 0 0 0 0 0 0 0 0 0 0 0 0 0 0 0 0 0 0 0 0 0 0 0 0 0 0
$$ 0 0 0 0
$$ ##$ShimPowMaxUC= (0..63)
$$ 130000 130000 130000 130000 130000 130000 130000 130000 130000 130000 130000
$$ 130000 130000 130000 130000 130000 130000 130000 130000 130000 0 0 0 0
$$ 0 0 0 0 0 0 0 0 0 0 0 0 0 0 0 0 0 0 0 0 0 0 0 0 0 0 0 0 0 0 0 0 0 0 0 0
$$ 0 0 0 0
$$ ##$ShimPowMaxUG= (0..63)
$$ 524287 524287 524287 524287 524287 524287 524287 524287 524287 524287 524287
$$ 524287 524287 524287 524287 524287 524287 524287 524287 524287 0 0 0 0
$$ 0 0 0 0 0 0 0 0 0 0 0 0 0 0 0 0 0 0 0 0 0 0 0 0 0 0 0 0 0 0 0 0 0 0 0 0
$$ 0 0 0 0
$$ ##$ShimPowRcbType= 3
$$ ##$ShimPowRes= (0..63)
$$ 1e-20 1e-20 1e-20 1e-20 1e-20 1e-20 1e-20 1e-20 1e-20 1e-20 1e-20 1e-20
$$ 1e-20 1e-20 1e-20 1e-20 1e-20 1e-20 1e-20 1e-20 0 0 0 0 0 0 0 0 0 0 0 0
$$ 0 0 0 0 0 0 0 0 0 0 0 0 0 0 0 0 0 0 0 0 0 0 0 0 0 0 0 0 0 0 0 0
$$ ##$ShimPowRng0= (0..63)
$$ 1 1 1 1 1 1 1 1 1 1 1 1 1 1 1 1 1 1 1 1 0 0 0 0 0 0 0 0 0 0 0 0 0 0 0 0
$$ 0 0 0 0 0 0 0 0 0 0 0 0 0 0 0 0 0 0 0 0 0 0 0 0 0 0 0 0
$$ ##$ShimPowRng1= (0..63)
$$ 1 1 1 1 1 1 1 1 1 1 1 1 1 1 1 1 1 1 1 1 0 0 0 0 0 0 0 0 0 0 0 0 0 0 0 0
$$ 0 0 0 0 0 0 0 0 0 0 0 0 0 0 0 0 0 0 0 0 0 0 0 0 0 0 0 0
$$ ##$ShimPowRng2= (0..63)
$$ 1 1 1 1 1 1 1 1 1 1 1 1 1 1 1 1 1 1 1 1 0 0 0 0 0 0 0 0 0 0 0 0 0 0 0 0
$$ 0 0 0 0 0 0 0 0 0 0 0 0 0 0 0 0 0 0 0 0 0 0 0 0 0 0 0 0
$$ ##$ShimPowRng3= (0..63)
$$ 1 1 1 1 1 1 1 1 1 1 1 1 1 1 1 1 1 1 1 1 0 0 0 0 0 0 0 0 0 0 0 0 0 0 0 0
$$ 0 0 0 0 0 0 0 0 0 0 0 0 0 0 0 0 0 0 0 0 0 0 0 0 0 0 0 0
$$ ##$ShimSysFunc= (0..63)
$$ 1 2 3 4 5 7 9 11 15 16 8 10 12 14 6 17 13 18 19 20 0 0 0 0 0 0 0 0 0 0
$$ 0 0 0 0 0 0 0 0 0 0 0 0 0 0 0 0 0 0 0 0 0 0 0 0 0 0 0 0 0 0 0 0 0 0
$$ ##$ShimSysMatrix= 0
$$ ##$ShimSysType= 1
$$ ##$TFXNUM= 0
$$ ##$TRIPLO2= 0
$$ ##$VTU= 2
$$ ##$VTUETH= <149.236.99.20>
$$ ##$VTUTY= <no>
$$ ##$WBREFAM= (0..15)
$$ 132.2 106.2 100 100 100 100 100 100 100 100 100 100 100 100 100 100
$$ ##$WBREFLM= (0..15)
$$ 0 0 0 0 0 0 0 0 0 0 0 0 0 0 0 0
$$ ##$WBREFPH= (0..15)
$$ 77.55 -65.76 0 0 0 0 0 0 0 0 0 0 0 0 0 0
$$ ##$WBSGU= (0..15)
$$ 0 0 0 0 0 0 0 0 0 0 0 0 0 0 0 0
$$ ##$XFAC= 2
$$ ##END=
$$ 
##$DECIM=	704
##$DSPFVS=	20
##XUNITS=	HZ
##YUNITS=	ARBITRARY UNITS
##FIRSTX=	25277.332242342450627
##LASTX=	-3131.3251784229105397
##DELTAX=	-0.43348832563920591809
##XFACTOR=	1
##YFACTOR=	0.068709686350398452293
##FIRSTY=	0.15490755438804626465
##MINY=	-29.79389190673828125
##MAXY=	3531.801025390625
##NPOINTS=	65536
##XYDATA=	(X++(Y..Y))
$$ [...]
9631a18%K0K0Qoj8k4k3qJ3K4J4qk7l7l2j3J2K7K7K0K3K8K4OoLJ8K1Nj9k8k1qrl0n0m3mM0O1
9614a18N0K6Nj0j5j2JJ0Pj0k6l4l6l3k4qJ2K7L3L1K5J2mk0l2l4l0k3j3n%NNkj8l3l5k6j0P
9596c55K3L2K8J7J5K6L4K6Pj%Jrj9k7l1k6j3jkj4k0qJ1J8J6J6J7K3K8L1K6J2kkM%j3j9j1L
9579a59Lrj9j2J0L0K8Mj6j3NOj4k6lL4M7K5loJ3K6K1lk8m4m4k8kJ7K1J2J0K0L1K6Qj0k0l0
9561i2m0l4j1J2J9J5J9K5J8Jj4k0k0j9mJ7K7J8PLMnj4j6j0lJMJ0J6K3K3J2lkK0M4M4J9pj9
9543F8k5l0l5l2j5PK2J7pl2l7k3plpj4k3k9k9k1qRK9L9L3J7RJ3J9J6Jj0j5j0JJ1J5J1PKoj4
9525h6j6rmmOK3L3K3kj7j3KJ9J7ol7m8l1j1rj3JK3K2kj6nJ2J2OOOmj5j1LNkkRJ6Rjkjoj0l
9504a33NOJMJ7K8K5J0lj2j6j2NK4K5Oj3rJ1J8Nqo%oj6j6mjj0k0j7qnmJNkj7k9l0k2j1%J3K6
$$ plain form
9631 -118 -118 -98 -78 -70 -76 -94 -118 -141 -149 -136 -112 -98 -106 -133 -170 -202 -215 -203 -176 -149 -129 -106 -78 -54 -48 -54 -51 -33 -12 -7 -26 -54 -75 -83 -92 -122 -172 -215 -219 -179 -118
9614 -118 -68 -42 -37 -47 -62 -74 -73 -63 -56 -66 -92 -126 -162 -195 -219 -227 -215 -188 -155 -124 -99 -87 -91 -111 -143 -177 -207 -230 -243 -248 -248 -243 -238 -240 -258 -291 -326 -352 -362 -355
9596 -355 -332 -300 -272 -255 -240 -214 -180 -154 -147 -148 -148 -147 -156 -175 -202 -233 -259 -272 -273 -275 -289 -309 -317 -306 -288 -272 -256 -239 -216 -188 -157 -131 -119 -121 -123 -119 -119 -132 -151 -162 -159
9579 -159 -156 -165 -184 -196 -186 -156 -128 -124 -140 -153 -148 -142 -156 -182 -185 -151 -104 -79 -82 -88 -75 -49 -28 -31 -59 -103 -147 -175 -177 -160 -139 -127 -117 -97 -66 -40 -32 -42 -62 -92
9561 -92 -132 -166 -177 -165 -146 -131 -112 -87 -69 -68 -82 -102 -122 -141 -145 -128 -101 -83 -76 -73 -69 -74 -88 -104 -114 -117 -116 -112 -102 -86 -63 -40 -28 -31 -33 -13 31 75 94 87 68
9543 68 43 13 -22 -54 -69 -62 -40 -23 -30 -62 -99 -122 -129 -132 -139 -153 -176 -205 -234 -255 -263 -254 -225 -186 -153 -136 -127 -114 -95 -79 -78 -88 -103 -113 -112 -101 -86 -75 -68 -66 -72 -86
9525 -86 -102 -111 -115 -119 -113 -90 -57 -34 -36 -53 -66 -64 -45 -28 -34 -71 -119 -150 -161 -170 -183 -182 -159 -137 -139 -155 -160 -148 -136 -130 -124 -118 -122 -137 -148 -145 -140 -142 -144 -135 -119 -110 -111 -113 -114 -120 -130 -133
9504 -133 -128 -122 -121 -117 -100 -72 -47 -37 -40 -52 -68 -80 -75 -51 -26 -20 -33 -42 -31 -13 -8 -16 -22 -22 -28 -44 -60 -64 -65 -75 -95 -112 -120 -125 -129 -128 -123 -125 -142 -171 -201 -223 -234 -234 -221 -195
9484a95M0M5L1Jk1k3r%%j%kj1j8j3mok2l8l3JM0M8K3oqQJ2pk0nK4M3M1L1J5ql1l6j6QJ8J1
9466i3J%MRMj6m0m5k3NJ1j3m2n0l2KL5N4N6M7L4K6J5Kj2k1j9j4rj3k1k3j3OK0K0J5J6K2K8
9449f7L3L4K5Nk4m2m5l5k1mROj2k4j6kKKJ9M7N6L5PkLjk1l6l2j8j0nLQJp%J8K2Nj4j5nKlq
9429a27oljjNJ1J4J0%k2m3n0l2lK4L4K9J2j0j9j0J0K1J7Lqj1nRK8L8L5J9%j6k8l3k5kK7M5
9411f4L5Ok3l1k2%K2L6K9Oj5j2OJ5Ppj5j0JJ0J3MqrLRkk2k9k3r%lj9l3l2rJ9L3L2K2Pj4l1
9392a27k5NL5M4L0QljNNJkjpk2l3k5kOpk7l0j6OK0K4J5MjLPOOJ4K0J5PJ1J7Pk1m2l6j3LNJ2
9371a00K5K7on1p1m1OL5K9J3NJ4K5L2K5Nk2l9l6k2pQK1K2RopJNjj0k1l5m3l1%K8L8L9M2L6
9354e9J2j5j8jJ3J0%moppmqk2k9j7%Npk0k6k7j9PM4O5M8Pk7l9k9j0OJ1KmjMlj5rJ3L1K3Nm
$$ plain form
9484 -195 -155 -110 -79 -78 -99 -122 -131 -131 -131 -132 -132 -134 -145 -163 -176 -180 -186 -208 -246 -279 -278 -238 -190 -167 -173 -181 -173 -161 -168 -188 -193 -169 -126 -85 -54 -39 -47 -78 -114 -130 -122 -104 -93
9466 -93 -92 -92 -88 -79 -75 -91 -131 -176 -199 -194 -183 -196 -238 -288 -320 -318 -283 -229 -173 -126 -92 -66 -51 -49 -61 -82 -101 -115 -124 -137 -158 -181 -194 -188 -168 -148 -133 -117 -95 -67
9449 -67 -34 0 25 30 6 -36 -81 -116 -137 -141 -132 -126 -138 -162 -178 -180 -178 -176 -157 -110 -54 -19 -12 -14 -11 -12 -33 -69 -101 -119 -129 -134 -131 -123 -122 -129 -129 -111 -89 -84 -98 -113 -118 -116 -119 -127
9429 -127 -133 -136 -137 -138 -133 -122 -108 -98 -98 -120 -163 -213 -245 -248 -224 -190 -161 -149 -159 -178 -188 -178 -157 -140 -137 -145 -156 -161 -152 -124 -86 -51 -32 -32 -48 -76 -109 -134 -136 -109 -64
9411 -64 -29 -23 -46 -77 -99 -99 -77 -41 -12 -6 -21 -33 -27 -12 -5 -12 -27 -37 -36 -26 -13 -9 -17 -26 -23 -14 -16 -38 -67 -90 -99 -99 -102 -121 -154 -186 -195 -176 -143 -111 -89 -82 -96 -127
9392 -127 -152 -147 -112 -68 -38 -30 -33 -34 -29 -24 -23 -25 -26 -33 -55 -88 -113 -115 -109 -116 -143 -173 -189 -183 -163 -139 -124 -120 -121 -118 -111 -105 -99 -85 -65 -50 -43 -32 -15 -8 -29 -71 -107 -120 -117 -112 -100
9371 -100 -75 -48 -54 -105 -176 -217 -211 -176 -147 -134 -129 -115 -90 -58 -33 -28 -50 -89 -125 -147 -154 -146 -125 -103 -94 -100 -107 -106 -101 -102 -112 -133 -168 -211 -242 -242 -214 -176 -137 -95 -59
9354 -59 -47 -62 -80 -81 -68 -58 -58 -62 -68 -75 -82 -86 -94 -116 -145 -162 -162 -157 -164 -184 -210 -237 -256 -249 -205 -140 -92 -85 -112 -151 -180 -190 -184 -173 -171 -175 -176 -172 -175 -190 -199 -186 -155 -132 -127 -131
9334a31%NMkqj9k8k3%K5K9J2j7l4l5j9mOJ2J6J6J3RPRJ0Olj4k0j3MK0J8%j8j9lJ4K1K1K0J9
9315i4J5J0J1J5J2kj6j5KJ4J2%nJNkj4j9j1lnj5k3j6KJ8K0Nj7l3l2j4J4K6J9JmPJ5Nj2k0j1
9296a54oj2k1j7kLrk1qK1L7K3qk9k1KJ9J0k1l9k2J4L5L1J8J6J6Oqj1JJ7L4M5M0J6pj4j2k0
9279e8l8m8m1k7j3ooj3j2J0L9N4M1J4pj3oJ3K7K4Prj7j8j3MK2K0mk6k7j6j3j7j3lPJ0J7L3
9262a22M8M9L1%k9m3m3l0j4OK0J1oqRK0Pj1j0%mj2%K6L7J7jPK0J0j9l8k8lJ1Nj0k0j8j3mN
9243a47J9K0jl4m6k5J1M3N4M7K0j4l4k6nMok0k6j9pNK3L6L5K1Knqj3j9j7j0j4k7l0j4OJ3J7
9226a91K5L5K7J0pj7k4j8LJ7jl3l5kK1J3JJ6L9M0K4J6K5K5J3mj3k0k7k7j9j8k8l6k8pJ5K5
9210a65J7jj4j6j2rJJ7K7K4K4L5M5L1Nj1rkmpkMM%pj8l3l2rJ7K2Nj3j4kJ1J1RJ2K1J3j3l0
$$ plain form
9334 -131 -131 -126 -122 -124 -132 -151 -179 -202 -202 -177 -148 -136 -153 -187 -222 -241 -245 -239 -227 -211 -195 -182 -173 -166 -157 -147 -141 -144 -158 -178 -191 -187 -167 -149 -149 -167 -186 -189 -175 -154 -133 -113 -94
9315 -94 -79 -69 -58 -43 -31 -33 -49 -64 -62 -48 -36 -36 -41 -40 -35 -37 -51 -70 -81 -84 -89 -104 -127 -143 -141 -123 -103 -98 -115 -148 -180 -194 -180 -154 -135 -134 -138 -131 -116 -111 -123 -143 -154
9296 -154 -160 -172 -193 -210 -212 -209 -218 -239 -247 -226 -189 -166 -174 -203 -224 -222 -203 -193 -214 -253 -275 -261 -226 -195 -177 -161 -145 -139 -147 -158 -157 -140 -106 -61 -21 -5 -12 -26 -38 -58
9279 -58 -96 -144 -185 -212 -225 -231 -237 -250 -262 -252 -213 -159 -118 -104 -111 -124 -130 -117 -90 -66 -59 -68 -85 -103 -116 -112 -90 -70 -74 -100 -127 -143 -156 -173 -186 -189 -182 -172 -155 -122
9262 -122 -74 -25 6 6 -23 -66 -109 -139 -153 -147 -127 -116 -122 -130 -121 -101 -94 -105 -115 -115 -119 -131 -131 -105 -68 -51 -52 -45 -25 -15 -34 -72 -100 -103 -92 -87 -97 -117 -135 -148 -152 -147
9243 -147 -128 -108 -109 -143 -189 -214 -203 -160 -106 -59 -39 -53 -87 -113 -118 -114 -120 -140 -166 -185 -192 -187 -164 -128 -93 -72 -70 -75 -83 -96 -115 -132 -142 -156 -183 -213 -227 -221 -208 -191
9226 -191 -166 -131 -104 -94 -101 -118 -142 -160 -157 -140 -141 -174 -209 -211 -190 -177 -176 -160 -121 -81 -57 -41 -16 9 22 18 5 -15 -42 -69 -88 -106 -134 -170 -198 -205 -190 -165
9210 -165 -148 -149 -163 -179 -191 -200 -199 -182 -155 -131 -107 -72 -27 4 9 -2 -11 -13 -17 -24 -26 -22 -18 -18 -25 -43 -76 -108 -117 -100 -78 -73 -86 -100 -102 -91 -80 -71 -59 -38 -25 -38 -68
9191f8pL9O1L7lj3LJ7Qj5m2o3o8m5nK6L3K6K0J4NjMJ4J1nk0k4j6j0nmJQK2L1K3pl8n2n4n4
9173b16m8k5QK7K3J2J3J6J3RJ8K8K3OlJONOJ1jl5o0m7jL5K9Jj4LL4M4L1J2RJ3Pj1k8m0m4l5
9155a65j4J0K0J7J3Oj0k2rK2L0Ok4k5j2rj8j4OK6L6L6K2%j8k1j5k0l2k8JL2M7M6L7K3RNJ0
9138DJ2%j2qj%npj2l1m8m0KM8O0L7jk3k8k2j6oJ3L1L9K9J2jmlnj4k3l8m6m0rL1M7K1k5n1m0
9119a73j2QJ4J3Nj3k5k2j1npj0j0j1j3r%OJj3l0l9k5OL3L2J5J1K3L2J5rj7oRJ9L0L4K0oj7
9101a57%L3M2K5JlPOrj7oJ4J6kj7k1k2k8l2k6j6j2mJ9L9L8J9NQJ1mk2k5j8j6k0j3J1K4J3o
9084a65oQQj1k5j9kQJ5K6L4K6RKKqk6l1j9rj8k6j7%RMmrj4j0MK3L3L4L5K9Rk2m3m6l4j5PK5
9064b29K3MqMK3L1K1R%j1j8mL2O3N4Qm0o5o2m9l5k5j5nOJ6J4N%PJ7J2knOJ5PolJ7L4L8K9J4
$$ plain form
9191 -68 -75 -36 25 62 59 46 49 66 74 59 17 -46 -114 -159 -164 -138 -105 -79 -59 -45 -40 -41 -37 -23 -12 -17 -37 -61 -77 -87 -92 -96 -95 -87 -65 -34 -11 -18 -56 -108 -162 -216
9173 -216 -264 -289 -281 -254 -231 -219 -206 -190 -177 -168 -150 -122 -99 -93 -96 -95 -89 -84 -78 -67 -68 -103 -163 -210 -211 -176 -147 -146 -160 -157 -123 -79 -48 -36 -27 -14 -7 -18 -46 -86 -130 -165
9155 -165 -179 -169 -149 -132 -119 -113 -123 -145 -154 -132 -102 -96 -120 -145 -157 -166 -184 -198 -192 -166 -130 -94 -72 -72 -90 -111 -126 -146 -178 -206 -205 -173 -126 -80 -43 -20 -11 -6 4
9138 4 16 16 4 -4 -5 -5 -10 -17 -29 -60 -108 -148 -146 -98 -38 -1 -2 -25 -53 -75 -91 -97 -84 -53 -14 15 27 26 22 19 14 0 -23 -61 -107 -147 -156 -125 -78 -57 -82 -133 -173
9119 -173 -185 -177 -163 -150 -145 -158 -183 -205 -216 -221 -228 -238 -248 -259 -272 -281 -281 -275 -274 -287 -317 -356 -381 -375 -342 -310 -295 -284 -261 -229 -214 -223 -240 -246 -237 -218 -188 -154 -134 -140 -157
9101 -157 -157 -124 -82 -57 -56 -59 -52 -46 -55 -72 -78 -64 -48 -50 -67 -88 -110 -138 -170 -196 -212 -224 -228 -209 -170 -132 -113 -108 -100 -89 -93 -115 -140 -158 -174 -194 -207 -196 -172 -159 -165
9084 -165 -171 -163 -155 -166 -191 -210 -212 -204 -189 -163 -129 -103 -94 -92 -90 -98 -124 -155 -174 -183 -201 -227 -244 -244 -235 -231 -235 -244 -258 -268 -264 -241 -208 -174 -139 -110 -101 -123 -166 -212 -246 -261 -254 -229
9064 -229 -206 -202 -210 -206 -183 -152 -131 -122 -122 -133 -151 -155 -123 -60 -6 2 -38 -103 -165 -214 -249 -274 -289 -294 -288 -272 -258 -253 -253 -246 -229 -217 -219 -224 -218 -203 -196 -202 -205 -188 -154 -116 -87 -73
9045g3MOJ4J2jrKJ0nl4m5l1pRK4L8L5Qk3l0j8mkk%jj1k1k1nK1M2M0J4j5l2k7j2KJ0RLJPJ1
9026a07RPJ3K3J9Mj0j3lJ4K4J5j0l5l9k4pLJ1K1K6K2J5Nj1k8l2k2oPJ7L2M1L3J9QLoj6k7m2
9008d7m8m0j2J3J9P%joj6j5kPKoqqj6j8jK1L1K3Opj3nJ8L7L4J0j2j4mPJ0Nj2l2l5j7LRJ0J7
8989a06K9K3Mj4j5j0j1j5j7j2ooonlJPJ6K5L2L4K9J8jj8l0l6l4k2JK4K8J1j0k0j8j6j9j7m
8971a89POkrj4j8j3NL1M4L2Kk2k4k2k7l3j8K0M9M8K8J8K3J7nk6l0k6k4j9lJ1Ppj4j5k3l7l9
8954c11k4lJ9M0N3M4K1PQJ3Rmk1l4l1rJ8K5J3NPMj8m1m8m0k8j2J2L7M6L7L1L8M1K9Lk1l0k4
8937a39j5nMJ4J8J1JNJ8K0jk3k8k1j8j7oJ2K4J5jj0j1qkKJklpj4j9j3OK2K7K0J4J2Qpk7l1
8918a74qK2K8Mj1NL1K8qm6n3l7j6lknmQK1J8kj6pJ0J9K0K7M0L8J3k1m0l6k2j9k4j9nLoj8j5
$$ plain form
9045 -73 -69 -63 -49 -37 -38 -47 -45 -35 -40 -74 -119 -150 -157 -148 -124 -86 -51 -43 -66 -96 -114 -118 -120 -122 -122 -123 -134 -155 -176 -181 -160 -118 -78 -64 -79 -111 -138 -150 -148 -138 -129 -126 -125 -118 -107
9026 -107 -98 -91 -78 -55 -36 -32 -42 -55 -58 -44 -20 -5 -15 -50 -89 -113 -120 -117 -106 -85 -59 -37 -22 -17 -28 -56 -88 -110 -116 -109 -92 -60 -19 14 33 41 44 38 22 -5 -47
9008 -47 -95 -135 -147 -134 -115 -108 -108 -109 -115 -131 -146 -148 -141 -139 -145 -153 -161 -177 -195 -196 -175 -144 -121 -115 -122 -135 -140 -122 -85 -51 -41 -53 -67 -71 -64 -54 -49 -61 -93 -128 -145 -142 -133 -123 -106
8989 -106 -77 -54 -50 -64 -79 -89 -100 -115 -132 -144 -150 -156 -162 -167 -170 -169 -162 -146 -121 -89 -55 -26 -8 -9 -27 -57 -93 -127 -149 -148 -124 -96 -85 -95 -115 -133 -149 -168 -185 -189
8971 -189 -182 -176 -178 -187 -201 -219 -232 -227 -196 -152 -120 -118 -140 -164 -186 -213 -246 -264 -244 -195 -147 -119 -101 -78 -61 -66 -92 -122 -148 -172 -191 -194 -183 -176 -183 -197 -212 -235 -272 -311
8954 -311 -335 -338 -319 -279 -226 -182 -161 -154 -146 -133 -124 -128 -149 -183 -214 -223 -205 -180 -167 -162 -155 -151 -169 -210 -258 -298 -326 -338 -326 -289 -243 -206 -175 -137 -96 -67 -64 -85 -115 -139
8937 -139 -154 -159 -155 -141 -123 -112 -111 -106 -88 -68 -69 -92 -120 -141 -159 -176 -182 -170 -146 -131 -132 -142 -153 -161 -163 -161 -160 -162 -165 -172 -186 -205 -218 -212 -190 -163 -143 -129 -117 -109 -116 -143 -174
8918 -174 -182 -160 -132 -128 -139 -134 -103 -75 -83 -129 -182 -219 -235 -238 -240 -245 -249 -241 -220 -202 -204 -220 -227 -217 -198 -178 -151 -111 -73 -60 -81 -121 -157 -179 -198 -222 -241 -246 -243 -249 -267 -282
8900b82%N%jRJ7J4QNKJPJ6J6OLJ1J2mj8rJ0J0lJL0N0M0Rj3j7j1pl%jlljlqoPK1J5j3l4k7j
8878a43J0%lJ6L8L1ll0k7pJ1J6Prk5k9k7l1m0l3lK2J7j3k9j5J3K4J5NKMJ2K7M4M0J0j7j3J3
8861a20K5Ok2l0k1j1qj3k0k6j8RL5M1L0J9J8J5NmLJ8K5J6Jqj0j3k1k6k1j2nKRRjj2oJ3K3J2
8843i4pj6k1l0l1j8nmj0ML2M4K9QKK%kQK1K0Nn%Mnk3l2l2l1l4l4k0MK1J9NkJOLkprj0j0rj1
8822b76j3j1%J0J6J7J7J1NRK6M0M2L3J4j1l3l9k4j0j0j9j9lJ6K8K8J9J1O%j6l6m6l4j6lMO
8805b61LoqLK0K0J0LRJ3Nrj1MK3K7J0j3k4k5k3k1qJ9M4N1M5L4J7%p%LoqJMk1n2n2k2%knJ0
8786b06K5K0POJ4J6J6K0J9nl3k9J1M6L6j2n0m4j3Jj8m7m8k0J0J9J0klPK2K8K0NlknrJK8M4
8768a18L0jj6j5j4j8j5plnmjqk0k0oMKnqj4k5k4JL5N3M9M2M1L3J5koqj9l7m8m3k7qJ2K9L9
$$ plain form
8900 -282 -282 -277 -277 -278 -269 -252 -238 -230 -225 -223 -222 -215 -199 -183 -177 -174 -163 -151 -155 -173 -182 -172 -162 -165 -164 -134 -84 -44 -35 -48 -65 -76 -83 -86 -86 -87 -90 -93 -94 -97 -105 -111 -104 -83 -68 -81 -115 -142 -143
8878 -143 -133 -133 -136 -120 -82 -51 -54 -84 -111 -118 -107 -91 -84 -93 -118 -147 -174 -205 -245 -278 -281 -259 -242 -255 -284 -299 -286 -262 -247 -242 -240 -236 -224 -197 -153 -113 -103 -120 -133 -120
8861 -120 -95 -89 -111 -141 -162 -173 -181 -194 -214 -240 -258 -249 -214 -173 -143 -124 -106 -91 -86 -90 -87 -69 -44 -28 -27 -35 -45 -58 -79 -105 -126 -138 -143 -141 -132 -123 -124 -136 -142 -129 -106 -94
8843 -94 -101 -117 -138 -168 -199 -217 -222 -226 -236 -232 -200 -156 -127 -119 -117 -115 -115 -117 -109 -88 -68 -63 -68 -68 -64 -69 -92 -124 -156 -187 -221 -255 -275 -271 -250 -231 -226 -228 -227 -221 -218 -220 -227 -236 -246 -256 -265 -276
8822 -276 -289 -300 -300 -290 -274 -257 -240 -229 -224 -215 -189 -149 -107 -74 -60 -71 -104 -143 -167 -177 -187 -206 -225 -228 -212 -184 -156 -137 -126 -120 -120 -136 -172 -218 -252 -268 -271 -267 -261
8805 -261 -258 -264 -272 -269 -249 -229 -219 -216 -207 -194 -189 -198 -209 -205 -182 -155 -145 -158 -182 -207 -230 -251 -259 -240 -196 -145 -100 -66 -49 -49 -56 -56 -53 -59 -67 -66 -62 -83 -135 -187 -209 -209 -211 -216 -206
8786 -206 -181 -161 -154 -148 -134 -118 -102 -82 -63 -68 -101 -130 -119 -73 -37 -49 -99 -143 -156 -155 -173 -220 -268 -288 -278 -259 -249 -251 -254 -247 -225 -197 -177 -172 -175 -177 -182 -191 -190 -162 -118
8768 -118 -88 -89 -105 -120 -134 -152 -167 -174 -177 -182 -186 -187 -195 -215 -235 -241 -237 -235 -240 -248 -262 -287 -311 -310 -275 -222 -173 -131 -90 -57 -42 -44 -50 -58 -77 -114 -162 -205 -232 -240 -228 -199 -160
8749a60L7K5J5RNnk3l1k3pkprLJ7K0J1RJ8K6J7ok1k0j2j0j2j0lnj5k2j6mJNJ4K8L6K9J4JJ
8731h2J5K8K6Jl4n1m7k9j2lJOJ3K1J6lk1j3K3M9L7Jj9qJ4J9Rmj1j4j2mmj8l6l5j0J1J0qk1
8713a99k4j7oNQoj8j4QK5K8K2K1K2K0J7J7J3%j5j7qlj0rPK3J9%j0mON%%RJ5J9J8J4jj9l0k9
8694i8k5k6l4k9j0PJk1k3OL7L4PoQK3J9NJmj7k6k0lLQJ9K9J5j8l4j3J9L3K0kj5j4mLnj2lK0
8675a45L0J5oj1rj6k4j9mJ1J8K7K7J2j2k1j7j3j8j7kJ3J8J8J8J4MkKQJj4k0j8j3j1kOR%pk
8657a72J2K8L5K3ol3m2k8mJ2J9K3K4K1J2lk1l6m7n2m2j4K3M6M2K2J0J1J0krNK9L6J3j4k3p
8640i9RJ1%j7k7k8j8kJqj1NL0L6Pk9l7j7QJ0lj3j0lkmjMjj8l2k0J7M8M9K7J0J3J9J2nj5rk
8621a15krj8k4k5j7JJ4J3OJ3K6K9J4%lnj2j6j3j0j7k3j6lMJ0K3L4K6KrLK0K2J7J2Nj1k4j9
$$ plain form
8749 -160 -123 -98 -83 -74 -69 -74 -97 -128 -151 -158 -160 -167 -176 -173 -156 -136 -125 -116 -98 -72 -55 -61 -82 -102 -114 -124 -136 -146 -149 -154 -169 -191 -207 -211 -210 -205 -191 -163 -127 -98 -84 -83 -82
8731 -82 -67 -39 -13 -12 -46 -97 -144 -173 -185 -188 -187 -181 -168 -147 -131 -134 -155 -168 -145 -96 -59 -58 -77 -85 -71 -52 -43 -47 -58 -72 -84 -88 -92 -110 -146 -181 -191 -180 -170 -178 -199
8713 -199 -223 -240 -246 -241 -233 -239 -257 -271 -263 -238 -210 -188 -167 -145 -125 -108 -91 -78 -78 -93 -110 -118 -121 -131 -140 -133 -110 -91 -91 -101 -105 -99 -94 -94 -94 -85 -70 -51 -33 -19 -20 -39 -69 -98
8694 -98 -123 -149 -183 -212 -222 -215 -214 -235 -258 -252 -215 -181 -174 -180 -172 -149 -130 -125 -124 -128 -145 -171 -191 -194 -191 -183 -164 -135 -120 -138 -172 -185 -166 -133 -113 -115 -130 -144 -148 -145 -150 -162 -165 -145
8675 -145 -115 -100 -106 -117 -126 -142 -166 -185 -189 -178 -160 -133 -106 -94 -106 -127 -144 -157 -175 -192 -194 -181 -163 -145 -127 -113 -109 -111 -109 -101 -100 -114 -134 -152 -165 -176 -178 -172 -163 -163 -170 -172
8657 -172 -160 -132 -97 -74 -80 -113 -155 -183 -187 -175 -156 -133 -109 -88 -76 -79 -100 -136 -183 -235 -277 -291 -268 -222 -180 -158 -148 -137 -127 -129 -138 -133 -104 -68 -55 -69 -92 -99
8640 -99 -90 -79 -79 -96 -123 -151 -169 -171 -170 -178 -189 -184 -154 -118 -111 -140 -177 -194 -186 -176 -179 -192 -202 -205 -207 -211 -212 -208 -209 -227 -259 -279 -262 -214 -165 -138 -128 -115 -96 -84 -89 -104 -113 -115
8621 -115 -117 -126 -144 -168 -193 -210 -209 -195 -182 -176 -163 -137 -108 -94 -94 -97 -102 -114 -130 -143 -153 -170 -193 -209 -212 -208 -198 -175 -141 -115 -113 -122 -119 -99 -77 -60 -48 -43 -54 -78 -97
8603i7mM%j1j9k0qPJ1jpNK5K2kk1j8%J5K0J3kj2j3j4k7m1k7J1L6K2pj8lPKm%PLOK7N7O3L4
8584B1%j2ork8l7j6J0J6%qJQKj0j0nj0k3k4j0NRMPJ5J4jj1oJ3K5K4J5J1Pkqpmoj1j4j5j9j7
8564a22mJ2J0MJ3L8M8K2j7m3m6l8l1k4k1k0j5JJ4J3jj3j2kJ2K5L2L6L3K1lk4k2NK8K0j1m2
8547a24n2m5j8J4L3K9K5L0L3Rk4k7QL8L3Oj7k6k4j9j2j5l0m1l9k7j5oKOPJ5L3M8M4K0pk7l0
8530a92j7OJ6RMJ7L7M1K2%qrj7l3m9n0k6J3L8K7mj9%L3M1J9qk3k3j9j6j0NK7M4M4K7Poj3j6
8513h1j1KJ7K7K7J9QKjkpj7k3k1k1k2k0qLJpqOJ9J7%j8k1j0QJ8K0J6J2Nnj0oQK0K7K3J1lj0
8493a6rj1k1l3k7qN%rlJ2K0J6J9K5K1%j6pQJ0pj5rlj4k9l0j4kLQK2L3L4K5Qj4l4l3rJ7K2L
8474f2j3j0jj3m3o7o1l2jJ3J1KJJ2L0L9L3K2J8K0J5LkJ0K7L5K2Jk1m2n6n2l0lJ4K2K4K6J9
$$ plain form
8603 -97 -101 -97 -97 -108 -127 -147 -155 -148 -137 -138 -145 -140 -115 -93 -95 -116 -134 -134 -119 -99 -86 -88 -100 -113 -127 -154 -195 -222 -211 -175 -153 -160 -178 -181 -174 -172 -176 -176 -169 -166 -160 -133 -76 -13 21
8584 21 21 9 3 -6 -34 -71 -87 -77 -61 -61 -69 -68 -60 -58 -68 -78 -83 -93 -116 -140 -150 -145 -136 -132 -125 -110 -96 -97 -108 -114 -101 -76 -52 -37 -26 -19 -21 -29 -36 -40 -46 -57 -71 -86 -105 -122
8564 -122 -126 -114 -104 -100 -87 -49 -1 21 4 -39 -85 -123 -154 -178 -199 -219 -234 -233 -219 -206 -207 -220 -232 -234 -222 -197 -165 -129 -96 -75 -78 -102 -124 -119 -91 -71 -82 -124
8547 -124 -176 -221 -239 -225 -192 -163 -138 -108 -75 -66 -90 -117 -109 -71 -38 -32 -49 -75 -99 -118 -130 -145 -175 -216 -255 -282 -297 -303 -301 -295 -288 -273 -240 -192 -148 -128 -135 -162 -192
8530 -192 -209 -203 -187 -178 -174 -157 -120 -79 -57 -57 -65 -74 -91 -124 -173 -223 -249 -236 -198 -171 -175 -194 -194 -161 -120 -101 -109 -132 -155 -174 -190 -200 -195 -168 -124 -80 -53 -46 -52 -65 -81
8513 -81 -92 -90 -73 -46 -19 0 8 10 9 7 0 -17 -40 -61 -82 -104 -124 -132 -129 -128 -135 -143 -137 -118 -101 -101 -119 -140 -150 -142 -124 -104 -88 -76 -71 -76 -86 -92 -84 -64 -37 -14 -3 -6 -16
8493 -16 -25 -36 -57 -90 -117 -125 -120 -120 -129 -132 -120 -100 -84 -65 -40 -19 -19 -35 -42 -34 -24 -31 -46 -55 -58 -72 -101 -131 -145 -147 -144 -136 -114 -81 -47 -22 -14 -28 -62 -95 -104 -87 -65 -62
8474 -62 -75 -85 -86 -99 -142 -209 -270 -302 -303 -290 -279 -277 -276 -264 -234 -195 -162 -140 -122 -102 -87 -84 -86 -76 -49 -14 8 9 -12 -54 -110 -162 -192 -195 -181 -159 -135 -109 -90
8457i0Jj8k5j7LK5L5K3ql7m5l6k5j6oQK0J7O%JQJ6K5K4J0j2j8kJ6J9Jj8k4k2j4pj%JNJ4J3
8438a50jj7j6KK2L3L5K8J7MMJ7K1Jl4n5m8k6j2oLJ6J7jk4l0j3J1K3J5KmMJ5J9Qj1l1l9k9j1
8421b41LRJ6L0M1L2J0pmLLoj7k8l3k8j6kOJ0J8K5L0L3L1K0mk7l3l0k7k7j8jJ8L1M0L9K9J4
8403e8Njj2k2j4J4L8L4Pj5k4k6k4j8nlj7l4l1oJ5K0J2PJ3J3Jj6k1j5rmKRJ2J5J8J6Lj7k3q
8385a69J1J9J9J5Q%lNQlj6pJ8K9J1j2j8oLPJ1J8J5Jj6l1l9l8k2jJ5K2K7L0K1mk2j9j0j5k6
8367a64j6J4L4K8J7K1K6J0k1l3j8kJLJ1J4Nnj1j9m1n9n3k8jJ5J9J4Lpj4k0k1lL2N6M6J9KM
8350a42Nqj7j2jLlonjNJ1J2J3J5J6J1MMJ3J5Nj2k4k4rJ2K5J5j1l2l8l7l1j1J9M1L6J5nj2j3
8332a59pJLpj8j7nNKnj4j5nJ4L0K8J0nnPK1K3J3nj8j9j2nlnj0j9k4k1j4kK2M6M6J5k1l1k3
$$ plain form
8457 -90 -89 -107 -132 -149 -146 -121 -86 -63 -71 -108 -153 -189 -214 -230 -236 -228 -208 -191 -185 -185 -184 -176 -160 -135 -111 -101 -113 -131 -133 -117 -98 -97 -115 -139 -161 -175 -182 -183 -183 -182 -177 -163 -150
8438 -150 -151 -168 -184 -182 -160 -127 -92 -64 -47 -43 -39 -22 -1 0 -34 -89 -137 -163 -175 -181 -178 -162 -145 -146 -170 -200 -213 -202 -179 -164 -162 -166 -162 -147 -128 -120 -131 -162 -201 -230 -241
8421 -241 -238 -229 -213 -183 -142 -110 -100 -107 -111 -108 -105 -111 -128 -156 -189 -217 -233 -235 -229 -219 -201 -176 -146 -113 -82 -62 -66 -93 -126 -156 -183 -210 -228 -229 -211 -180 -140 -101 -72 -58
8403 -58 -53 -54 -66 -88 -102 -88 -50 -16 -9 -24 -48 -74 -98 -116 -121 -124 -141 -175 -206 -212 -197 -177 -165 -158 -145 -132 -131 -147 -168 -183 -192 -196 -194 -185 -173 -158 -140 -124 -121 -138 -161 -169
8385 -169 -158 -139 -120 -105 -97 -97 -100 -95 -87 -90 -106 -113 -95 -66 -55 -67 -85 -91 -88 -81 -70 -52 -37 -36 -52 -83 -122 -160 -182 -183 -168 -146 -119 -89 -68 -72 -94 -113 -123 -138 -164
8367 -164 -180 -166 -132 -104 -87 -66 -40 -30 -51 -84 -102 -104 -103 -100 -89 -75 -70 -75 -86 -105 -146 -205 -258 -286 -287 -272 -253 -239 -236 -243 -257 -277 -298 -301 -269 -213 -167 -148 -146 -142
8350 -142 -137 -145 -162 -174 -175 -172 -175 -181 -186 -187 -182 -171 -159 -146 -131 -115 -104 -100 -96 -83 -68 -63 -75 -99 -123 -132 -120 -95 -80 -91 -123 -161 -198 -229 -240 -221 -180 -144 -129 -134 -146 -159
8332 -159 -166 -165 -162 -169 -187 -204 -209 -204 -202 -207 -221 -236 -241 -227 -197 -169 -159 -164 -169 -162 -141 -118 -105 -110 -128 -147 -159 -164 -167 -172 -182 -201 -225 -246 -260 -262 -240 -194 -148 -133 -154 -185 -208
8313b08k2k9k0J1L6L1J0jjnqMK4L1J6pj3kPKrrMJ7J7RNLmk0l1k5rJLMJ9L5L3J4NK0M0L3Kk7
8293a4k9j4lkJMok4l8m1l8k9j0J1J8OpnNJ2J1QQJ0J5J9J5lj7j8nJkpoMNj0l2l9k1PK2J5Kp
8273b28mLJ1J7J3KkPJ9K1J4MKPJ9L2L4J8pk0j8nkoj2mJ1J6jk7l8k9j8j4oPJ0mj6kK3L1J1j6
8254a47l1l3l1k1oQJ9K3J9OpnNJ6J8J9J6Jk2l3k1MK5L1K1lk7l0qK0K6Rj8m3n3l9nK8L9L0K2
8236a78K0J4mj9k1j1JJ0K2K8K1Lj4j6j0omlmj0j6pJ4K3Qj2j1J3L1K2mk0pK9N4M1nm5n0l1k0
8219a74k6k1OL0K7PnkOJ1J3Qmj9k0nJ4K1J6Jj5k2j5jPMjoorj3j3j0rj9l3l7j8J3L4M2M9O0
8200a34N4K0k4n4n1k4RL3L7K8K4K8K3ml6m6l5k8k5j4J3L4L6K5Qj3k9k6mQkj7j8kJ0ROQRON
8182a53QRNjJOJ0Kj9l8m1k7j2JJ4K9L2J9JlPJ5J7J4RJnKJ6K0Kk3l0k1rrqMK5L3J7rk4k0qm
$$ plain form
8313 -208 -230 -259 -279 -268 -232 -201 -191 -192 -193 -198 -206 -202 -178 -147 -131 -138 -151 -153 -146 -144 -153 -162 -158 -141 -124 -115 -110 -107 -111 -131 -162 -187 -196 -195 -192 -188 -169 -134 -101 -87 -82 -62 -22 11 13 -14
8293 -14 -43 -57 -60 -62 -61 -57 -63 -87 -125 -166 -204 -233 -243 -232 -214 -208 -215 -220 -215 -203 -192 -184 -176 -166 -151 -132 -117 -120 -137 -155 -160 -159 -161 -168 -174 -170 -165 -175 -207 -246 -267 -260 -238 -223 -221 -228
8273 -228 -232 -229 -218 -201 -188 -186 -188 -181 -162 -141 -127 -123 -121 -114 -95 -63 -29 -11 -18 -38 -56 -61 -63 -69 -81 -85 -74 -58 -59 -86 -124 -153 -171 -185 -191 -184 -174 -178 -194 -196 -173 -142 -131 -147
8254 -147 -178 -211 -242 -263 -269 -261 -242 -219 -200 -194 -201 -206 -201 -185 -167 -148 -132 -131 -153 -186 -207 -203 -178 -147 -126 -129 -156 -186 -194 -174 -148 -139 -157 -200 -253 -292 -297 -269 -230 -200 -178
8236 -178 -158 -144 -148 -167 -188 -199 -198 -188 -166 -138 -117 -114 -128 -144 -154 -160 -164 -167 -171 -181 -197 -204 -190 -167 -159 -171 -182 -169 -138 -116 -120 -140 -147 -118 -64 -23 -28 -73 -123 -154 -174
8219 -174 -200 -221 -215 -185 -158 -151 -156 -158 -152 -141 -128 -120 -124 -143 -163 -168 -154 -133 -117 -116 -131 -153 -168 -169 -162 -158 -159 -165 -171 -180 -193 -206 -216 -225 -244 -277 -314 -332 -319 -285 -243 -194 -134
8200 -134 -80 -60 -84 -138 -189 -213 -204 -171 -134 -106 -82 -54 -31 -35 -71 -117 -152 -180 -205 -219 -206 -172 -136 -111 -103 -116 -145 -171 -175 -167 -169 -186 -204 -206 -196 -187 -181 -173 -164 -158 -153
8182 -153 -145 -136 -131 -132 -131 -125 -115 -113 -132 -170 -211 -238 -250 -249 -235 -206 -174 -155 -154 -157 -150 -135 -118 -104 -95 -94 -99 -97 -81 -61 -59 -82 -112 -133 -142 -151 -159 -155 -130 -97 -80 -89 -113 -133 -141 -145
8162a45nlKOOkj6k7k1KL1M9M5K5%k2l1k3kJ6K2Pj6k8k1JK0K5J5Krj5k0j9j2%OLmkOJ2J1On
8143a30k0k9k5pkj5k4j0J7K8K4K8M7N4L8J3L%rk3k9l1l6l6j8KRMjMJ1J4J4J0JjJ6L8L7J2j1
8125c3j9j4j3j1nnj6k7l0k6k5k2j5%J5K5K8J7jj5k0j5pMJ4J3jnJ8N2O6M6J0j6j8qK%njPJ2
8107d4Noj8l0l8k9qQQK%Kkj5k3j9mK2M7N3K2k0m1k9nOQOKmkQQnj8j5prk0k5j8p%J4L3M4K8
8086a35nk9k8qJpj9j5PK8L6L6K6Lk8m5k7J4M1L6J6MOJ1J0Mok1l1l0j7njoj8l3l6j7J7L6K8
8069b07J2PJ3J4J4K1K9K2nl3m6l6j5RJ9J0lo%%qnJ0J5NJK2M1K5j6m5m0k6k0j9j4qoJJ5K9K6
8051a98J7J6K2K1J2%j1k0l0k6qJ2J5qm1n5m2j9lNJ7K9L1J9OQJ9L1L6L3K3Qpk2l7m2k3J3M0
8034a59L1Jk0j4NJ7J1koLJ3Pqj4%J2Lj6k2qJ3K4K7K1Jk7m9n2m3k7pJ3K5K6K3K0J3mj8j9lJ3
$$ plain form
8162 -145 -150 -153 -151 -145 -139 -141 -157 -184 -205 -203 -172 -123 -78 -53 -53 -75 -106 -129 -131 -115 -93 -86 -102 -130 -151 -150 -130 -105 -90 -88 -97 -112 -132 -151 -163 -163 -157 -154 -158 -160 -154 -142 -131 -125 -130
8143 -130 -150 -179 -204 -211 -213 -228 -252 -262 -245 -217 -193 -165 -118 -64 -26 -13 -10 -10 -19 -42 -71 -102 -138 -174 -192 -190 -181 -177 -178 -174 -163 -149 -135 -125 -124 -125 -109 -71 -34 -22 -33
8125 -33 -52 -66 -79 -90 -95 -100 -116 -143 -173 -199 -224 -246 -261 -261 -246 -221 -193 -176 -177 -192 -212 -227 -234 -230 -216 -203 -204 -209 -191 -139 -73 -27 -17 -33 -51 -59 -57 -57 -62 -63 -56 -44
8107 -44 -39 -45 -63 -93 -131 -160 -168 -160 -152 -150 -150 -148 -150 -165 -188 -207 -211 -189 -142 -89 -67 -87 -128 -157 -162 -156 -148 -142 -140 -144 -146 -138 -130 -135 -153 -168 -175 -184 -204 -229 -247 -254 -254 -240 -207 -163 -135
8086 -135 -140 -169 -197 -205 -204 -211 -230 -245 -238 -210 -174 -138 -112 -109 -137 -182 -209 -195 -154 -118 -102 -98 -92 -81 -71 -67 -73 -94 -125 -155 -172 -177 -178 -184 -202 -235 -271 -288 -271 -235 -207
8069 -207 -195 -188 -175 -161 -147 -126 -97 -75 -80 -113 -159 -195 -210 -201 -182 -172 -175 -181 -181 -181 -189 -194 -184 -169 -164 -163 -141 -100 -75 -91 -136 -176 -202 -222 -241 -255 -263 -269 -268 -253 -224 -198
8051 -198 -181 -165 -143 -122 -110 -110 -121 -141 -171 -197 -205 -193 -178 -186 -227 -282 -324 -343 -346 -341 -324 -295 -264 -245 -239 -231 -212 -181 -145 -112 -89 -81 -88 -110 -147 -189 -212 -199 -159
8034 -159 -128 -127 -147 -161 -156 -139 -128 -130 -136 -133 -120 -113 -121 -135 -135 -123 -120 -136 -158 -166 -153 -129 -102 -81 -80 -107 -156 -208 -251 -278 -285 -272 -247 -221 -198 -178 -165 -169 -187 -206 -209 -196
8015a96J7Q%%J2K5K7J1j1k1j6j0j2k4l2k2NL5M7L2Lj8j8%J7J8Kj9k9j5J2K4Ol0n3l9mK1K1
7998b26J0Ljrj2lJ0J3MNJ8K9K5J1jqj6k5l3l5k6pJ7L0K8J7Kqj1nRJ1jj9k6k4k2k6k5j0J5L6
7980b86L5J5rj6j0oj0j4nJnj3kK2M2N1N6N6L5rm5n3m1l3k8j5RK8L1K1J4J3J9K1J6PLRJ6J6
7963f4Qqk7l8l3j6NK4L4K5kk7k6oRKojLj2k6j1K1L0Pj0NK1Ml2m5k2KLo%K0L0J9nk1j8nJ2K2
7943a61K0Ooj0n%JJKQJ3J1J2K0L1K8Qk1m1m5l3qK3M2L4Mk3l0k4k4l0l0j4NJ8K9L7L5J7nj4
7926a19j5k3l7m3l2j7j1j2mJ0K1L2M0M3L3J4PJ4K0J2kpopj0j1%J7L1L4K3Nqo%pk9m8m4k6n
7908a73RK4L5L1J8J1J6J6Lj0qMPqj8j5rj2j7j7j1rj4j4pknj5k5k7k1j2l%OJ5J8QnkJ8L3K4
7889a63Kj0mQJ1Lrj5nRJ8J4NJnj4k1j5JJ2J2OMJ0J9L0L7L4J6j1l4l9k6j2qj0nJ0J9Oj9l1k7
$$ plain form
8015 -196 -179 -171 -171 -171 -159 -134 -107 -96 -107 -128 -144 -154 -166 -190 -222 -244 -239 -204 -157 -125 -122 -140 -158 -158 -141 -123 -121 -140 -169 -184 -172 -148 -142 -172 -225 -264 -268 -247 -226
7998 -226 -216 -213 -214 -223 -235 -238 -228 -215 -211 -206 -188 -159 -134 -123 -124 -132 -148 -173 -206 -241 -267 -274 -257 -227 -199 -182 -180 -188 -199 -204 -195 -184 -185 -204 -230 -254 -276 -302 -327 -337 -322 -286
7980 -286 -251 -236 -245 -261 -271 -277 -287 -301 -306 -305 -310 -323 -325 -303 -261 -210 -154 -98 -63 -72 -117 -170 -211 -244 -272 -287 -278 -250 -219 -198 -184 -171 -152 -131 -115 -108 -105 -96 -80 -64
7963 -64 -56 -64 -91 -129 -162 -178 -173 -149 -115 -90 -92 -119 -145 -151 -142 -140 -146 -147 -144 -156 -182 -193 -172 -142 -135 -145 -140 -119 -115 -147 -192 -214 -212 -209 -215 -215 -195 -165 -146 -151 -172 -190 -195 -183 -161
7943 -161 -141 -135 -141 -151 -156 -156 -155 -154 -152 -144 -131 -120 -108 -88 -57 -29 -21 -42 -83 -128 -161 -169 -146 -104 -70 -66 -89 -119 -143 -167 -197 -227 -241 -236 -218 -189 -152 -117 -100 -105 -119
7926 -119 -134 -157 -194 -237 -269 -286 -297 -309 -313 -303 -282 -250 -210 -167 -134 -120 -113 -99 -79 -67 -69 -76 -82 -89 -99 -110 -110 -93 -62 -28 -5 0 -8 -14 -14 -21 -50 -98 -142 -168 -173
7908 -173 -164 -140 -105 -74 -56 -45 -29 -13 -10 -20 -28 -24 -17 -25 -43 -58 -67 -79 -96 -113 -124 -133 -147 -161 -168 -170 -175 -190 -215 -242 -263 -275 -278 -278 -272 -257 -239 -231 -236 -238 -220 -187 -163
7889 -163 -161 -171 -175 -167 -156 -153 -162 -177 -182 -173 -155 -141 -136 -135 -140 -154 -175 -190 -189 -177 -165 -159 -155 -145 -126 -96 -59 -25 -9 -20 -54 -93 -119 -131 -139 -149 -154 -144 -125 -119 -138 -169 -196
7871a96j3lMJ1K4M1N1M7K6mk3k7k3j8j4rpjRJ5J0lnNJ8K1J6J0lk1l3l4l0k9k6j4%NNJ2K0K1
7852a65K0K7L5K2j2l8l3j5pj3j5JJ9K7K1PnpNK0K3J4Jmllpj2j4j5k0k5k2nJ5K2J2lqnJL%o
7833a67j0mKj0l4m4k1J4L3L1K3J0rk8k3kJ4J0jorj4j2mKknKRJ0J3K1K1%j7nK6M2L0J6J6J4
7815f8kk2k4j4pj0j3k1l1l5j9J2K8K3J1RJ8K2J4Jj4l2m5m9l8j9mJ1K9M3M1K7J1OKj1k5k2p
7798b24M%lk%mKK2M0L7J9Okj7l5l9k8j8j8k2j9rJJ5K9L5K6J1PJ7K8K5%l2n0l4KK9L0J6J1J5
7780a29J4N%KNjnJJ2J6Ppj8j8j5j1j2j5j9j6j0mjJKOJ5K0K0J1nk1k1mK4M4M4K7Jk8n6p2o4
7761b75m0j1J3L1M2L7K0jj1j0%J3K4K3J4J0J2J2MqqLNok1k1qQJ4Rjq%J1J5Lj0oJ0J9J5J4K1
7743d3J8Jj6j2Jnl1n2n2m1l1rL4P7Q2M1j0m0l9k4rJJ1J8J8Mj9l6k8%J9J0j9m7n6m4j8J5M0
$$ plain form
7871 -196 -209 -212 -208 -197 -173 -132 -81 -34 -8 -12 -35 -62 -85 -103 -117 -126 -133 -134 -125 -110 -100 -103 -108 -103 -85 -64 -48 -38 -41 -62 -95 -129 -159 -188 -214 -228 -228 -223 -218 -206 -186 -165
7852 -165 -145 -118 -83 -61 -73 -111 -144 -159 -166 -179 -194 -193 -174 -147 -126 -119 -124 -131 -126 -106 -83 -69 -68 -72 -75 -78 -85 -97 -111 -126 -146 -171 -193 -198 -183 -161 -149 -152 -160 -165 -164 -161 -161 -167
7833 -167 -177 -181 -179 -189 -223 -267 -288 -274 -241 -210 -187 -177 -186 -214 -237 -239 -225 -215 -216 -222 -231 -245 -257 -261 -259 -261 -266 -264 -255 -245 -232 -211 -190 -190 -207 -212 -186 -144 -114 -98 -82 -68
7815 -68 -70 -92 -116 -130 -137 -147 -160 -181 -212 -247 -266 -254 -226 -203 -192 -183 -165 -143 -129 -128 -142 -174 -219 -268 -306 -325 -329 -318 -289 -246 -205 -178 -167 -161 -159 -170 -195 -217 -224
7798 -224 -220 -220 -223 -225 -225 -229 -227 -205 -165 -128 -109 -103 -105 -122 -157 -196 -224 -242 -260 -282 -301 -310 -309 -294 -265 -230 -204 -193 -186 -169 -141 -116 -116 -148 -198 -232 -230 -201 -171 -155 -144 -129
7780 -129 -115 -110 -110 -108 -103 -104 -109 -108 -96 -80 -73 -80 -98 -116 -131 -142 -154 -169 -188 -204 -214 -218 -219 -218 -216 -210 -195 -175 -155 -144 -149 -170 -191 -195 -171 -127 -83 -56 -55 -83 -139 -211 -275
7761 -275 -315 -326 -313 -282 -240 -203 -183 -184 -195 -205 -205 -192 -168 -145 -131 -121 -109 -97 -93 -101 -109 -106 -101 -107 -128 -149 -157 -149 -135 -126 -127 -135 -135 -124 -109 -106 -116 -122 -112 -93 -78 -64 -43
7743 -43 -25 -24 -40 -52 -51 -56 -87 -139 -191 -232 -263 -272 -238 -161 -79 -38 -48 -88 -127 -151 -160 -159 -148 -130 -112 -108 -127 -163 -191 -191 -172 -162 -181 -228 -284 -328 -346 -331 -291
7726b91M9L5J1rj6j2kPJ2J4J4J6J3PknKRRLmnrj1oJ2K5K0Loj1k0l2l1j1J4K9L5L3J6j8m9n4
7707b16m5l5k5%K6K5NmJ4L3L4K6K2K2J3J0K1L2K0pj7pPQPJ2J3Npj8k6l0j6J1L4L4J4ok4m5
7690h0o1o0m1k3j6j5qPK6M2M5L3J1j1k2k9k9k4nK1M4M4K3qk9k7pJ1J2jqkJ7K6J9kj8k2j4K
7673a79J3J2%kJ3L5L7K1Lmrk0k6k1j7k6l1j2J8K9J4kMJ7K2J9J5J0%nJJ3J9J4N%lmqj9l2l3
7654a19k1p%PJ4J1j0l0l5k4j8j5jJ8K1Pprj0j3qJ4L8M4K7Mj4j9rPJ3Moq%PJ1QNKPJ6J7%k3
7635a04l9l7k7j4plJJ2K1K2J6J4J8J4%j7j7kJ2J2%j1j5j1rj7k6k0NK7K6J1J%mj2j2omqrpq
7616b34j7k3j3PK9L9L4J9POPMkklqrMJ6Qj3k3j1%lo%RO%NJ1LqnRJ3jj8j9kJ4J9J1jqpjJ0K4
7594a23K8J1k1m1k8OL1K6ml4m1k0MJ5J3J2J8K3L0M2N2L7ml9m5l3k6k1lJ7J5lnJ3K5J9J4J5
$$ plain form
7726 -291 -242 -207 -196 -205 -221 -233 -235 -228 -216 -202 -188 -172 -159 -152 -154 -159 -157 -148 -139 -136 -140 -145 -154 -165 -171 -159 -134 -114 -111 -117 -128 -148 -180 -211 -222 -208 -179 -144 -111 -95 -113 -162 -216
7707 -216 -261 -296 -321 -321 -295 -270 -265 -269 -255 -222 -188 -162 -140 -118 -105 -95 -74 -42 -22 -29 -46 -53 -46 -38 -31 -19 -6 -1 -8 -26 -52 -82 -98 -87 -53 -19 -5 -11 -35 -80
7690 -80 -141 -201 -242 -265 -281 -296 -304 -297 -271 -229 -184 -151 -140 -151 -173 -202 -231 -255 -260 -239 -195 -151 -128 -136 -165 -192 -199 -188 -176 -177 -185 -187 -170 -144 -125 -127 -145 -167 -181 -179
7673 -179 -166 -154 -154 -156 -143 -108 -71 -50 -47 -51 -60 -80 -106 -127 -144 -170 -201 -213 -195 -166 -152 -154 -150 -133 -111 -92 -77 -67 -67 -72 -71 -58 -39 -25 -20 -20 -23 -27 -35 -54 -86 -119
7654 -119 -140 -147 -147 -140 -126 -115 -125 -155 -190 -214 -232 -247 -248 -230 -209 -202 -209 -218 -228 -241 -249 -235 -197 -153 -126 -122 -136 -155 -164 -157 -144 -140 -146 -154 -154 -147 -136 -128 -123 -121 -114 -98 -81 -81 -104
7635 -104 -143 -180 -207 -221 -228 -231 -230 -218 -197 -175 -159 -145 -127 -113 -113 -130 -147 -149 -137 -125 -125 -136 -151 -162 -171 -188 -214 -234 -229 -202 -176 -165 -164 -164 -168 -180 -192 -198 -202 -210 -219 -226 -234
7616 -234 -251 -274 -287 -280 -251 -212 -178 -159 -152 -146 -139 -135 -137 -139 -142 -150 -159 -155 -139 -131 -144 -167 -178 -178 -181 -187 -187 -178 -172 -172 -167 -156 -153 -161 -166 -157 -144 -145 -163 -182 -184 -170 -151 -140 -141 -149 -156 -157 -147 -123
7594 -123 -95 -84 -105 -146 -174 -168 -137 -111 -115 -149 -190 -210 -206 -191 -178 -166 -148 -125 -95 -53 -1 36 32 -7 -52 -85 -111 -132 -135 -118 -103 -106 -111 -98 -73 -54 -40 -25
7578b5Qj2k6j8nj0j9j6rj7m2n6m2j2J3J7Jj9k4j2MPLJ1L5N7N5L0mk2k1j1j0k5l9m0k8j0J0
7561c23K8M3M3L1J5OJ1K2K7J5rj8oJ0Qj4k8j6J3L6L4Qj9k9k2j4j5j4jJ1Mk1m1m1k1NK7L1K0
7544b04NMQJ0J1K1L3K6kk0j0J1J2mj6j1OJ8J6kk6l5j9RL0M1M4M2K7J4OMok5l9m1k3LK9L5J3
7526ek4n0m7k2OJ8Rrk0j3NK2K8K1NomJ1J2qk4j7QJ4kj0OK5K0lj3j4k3m6o0m9k7qMJ3J8K0K0
7508b19K1J4KnKJ1R%%RJ4P%JJ2J8J9J3ll1n0m1pJ9K1NmLJ7K3J7Kj9l1l0j9j0lNJ3J4PJjnk
7488a81J2K6J9loJ7L5K2j0k7k6j9j2KJ3Pj0j1LNj3k6j8j3k3k9qK1L0K1K4L5K9kl1l1qK1M4
7471a21N7N5L0j0m8o6m8j0J7J4lq%PN%lmkMJ0Jj0mJ9K8Qj5j5MJ9J9Qj1k9k9oJ9K4QjNJ5J0
7452e7qk7l0j6%%j2j6jJ1Jj8j7NJ9J1moJMlj2j7j4LK3K8J3jQL4M7L6Nk1l3k3nRJj6k5j5kn
$$ plain form
7578 -25 -17 -29 -55 -73 -78 -88 -107 -123 -132 -149 -191 -247 -289 -301 -288 -271 -270 -289 -313 -325 -321 -314 -311 -300 -265 -208 -153 -123 -127 -149 -170 -181 -191 -216 -255 -295 -323 -333 -323
7561 -323 -295 -252 -209 -178 -163 -157 -146 -124 -97 -82 -91 -109 -115 -105 -97 -111 -139 -155 -142 -106 -72 -64 -83 -112 -134 -148 -163 -177 -178 -167 -163 -184 -225 -266 -287 -282 -255 -224 -204
7544 -204 -199 -195 -187 -177 -166 -145 -112 -86 -88 -108 -118 -107 -95 -99 -115 -126 -120 -102 -86 -88 -114 -149 -168 -159 -129 -88 -44 -2 25 39 45 49 43 18 -21 -62 -85 -82 -53 -18 -5
7526 -5 -29 -79 -126 -148 -142 -124 -115 -124 -144 -157 -152 -130 -102 -81 -76 -82 -86 -75 -63 -71 -95 -112 -104 -90 -92 -102 -96 -71 -51 -54 -67 -81 -104 -150 -210 -259 -286 -294 -290 -277 -259 -239 -219
7508 -219 -198 -184 -182 -187 -185 -174 -165 -165 -165 -156 -142 -135 -135 -134 -122 -104 -85 -72 -75 -106 -156 -197 -204 -185 -164 -159 -163 -160 -143 -120 -103 -101 -120 -151 -181 -200 -210 -213 -208 -195 -181 -174 -173 -174 -179 -181
7488 -181 -169 -143 -124 -127 -133 -116 -81 -59 -69 -96 -122 -141 -153 -151 -138 -131 -141 -152 -149 -144 -157 -183 -201 -214 -237 -266 -274 -253 -223 -202 -178 -143 -114 -116 -147 -178 -186 -165 -121
7471 -121 -64 -9 21 11 -37 -103 -151 -161 -144 -130 -133 -141 -141 -134 -129 -129 -132 -136 -138 -134 -124 -123 -133 -137 -118 -90 -82 -97 -112 -108 -89 -70 -62 -73 -102 -131 -137 -118 -94 -86 -87 -82 -67 -57
7452 -57 -65 -92 -122 -138 -138 -138 -150 -166 -167 -156 -155 -173 -190 -185 -166 -155 -159 -165 -164 -160 -163 -175 -192 -206 -203 -180 -152 -139 -140 -132 -98 -51 -15 -10 -31 -64 -87 -92 -83 -82 -98 -123 -138 -140 -145
7432a45j7k4j9j7k3k7j2PJ2LQL0N2M4K0LKNjj4k4k3rQRj2l5l0KL4M1L1J6lk2k9j6LJ0JokR
7414a60J5J3Njrk0l4l7j8PJ8Nj7k5j6J1N0P6O4J7k8l7k5j6j3KK9M0K2rl1l3j7NK4L1K6J3q
7397h1l2l9j4K8M0J4k8m5l5j7JJ3K2K0J6J4J3Q%nnpj2j7j7j2NK6M1M0K5Pmrj6k2k6k6k2j6
7379a74rLJ5K2K2J7K1K8L0K1J1J8K5K0%k0l5l9m4m6m8m5k6J3M6N1K1j2j7NL2L8K1jj3j2rj2
7363h2j1JK1K5Nk1l0k1rklj5k9l0nK3K1j5m6m6k1jJ1K6L9L5J4nj0nkNJ5K1J4LlkOQLj1k2j9
7344a70j2j2j6nJ3J0k3n2m3oJ9K5K8L0J8koLMj1k2j7j0j0pKJ0RJ2K2K7J8RJ0J5Pmpj0k6l6
7326b16k6mNJJJ0J1kj6k2j3PK9L0lm1m5k1qj8j7J3M3M3K9K6L4L3J7J0J3J7J2OJjLRJ2NLJ2
7308a8K2J5pj9j8j4j7k5k9k9k2%K9M3L6K0Q%n%J1J0qk3j8pj3k7k7j0JlrJK1L9M0K3lj8rJ6
$$ plain form
7432 -145 -162 -186 -205 -222 -245 -272 -284 -277 -265 -262 -254 -224 -172 -128 -108 -105 -103 -98 -99 -113 -137 -160 -169 -161 -152 -164 -199 -229 -227 -193 -152 -121 -105 -108 -130 -159 -175 -172 -162 -161 -167 -169 -160
7414 -160 -145 -132 -127 -128 -137 -157 -191 -228 -246 -239 -221 -216 -233 -258 -274 -263 -213 -137 -73 -56 -84 -121 -146 -162 -175 -173 -144 -104 -82 -91 -122 -155 -172 -167 -143 -112 -86 -73 -81
7397 -81 -113 -152 -166 -138 -98 -84 -112 -157 -192 -209 -208 -195 -173 -153 -137 -123 -110 -102 -102 -107 -112 -119 -131 -148 -165 -177 -172 -146 -105 -65 -40 -33 -37 -46 -62 -84 -110 -136 -158 -174
7379 -174 -183 -180 -165 -143 -121 -104 -83 -55 -25 -4 7 25 50 70 70 50 15 -24 -68 -114 -162 -207 -233 -220 -174 -123 -102 -114 -131 -126 -94 -56 -35 -36 -49 -61 -70 -82
7363 -82 -93 -92 -71 -46 -41 -62 -92 -113 -122 -124 -127 -142 -171 -201 -206 -183 -162 -177 -223 -269 -290 -291 -280 -254 -215 -180 -166 -171 -181 -186 -188 -183 -168 -147 -133 -130 -133 -135 -129 -121 -118 -129 -151 -170
7344 -170 -182 -194 -210 -215 -202 -192 -215 -267 -310 -316 -297 -272 -244 -214 -196 -198 -204 -201 -197 -208 -230 -247 -257 -267 -274 -272 -262 -253 -241 -219 -192 -174 -165 -155 -140 -133 -137 -144 -154 -180 -216
7326 -216 -242 -246 -241 -240 -239 -229 -218 -220 -236 -258 -271 -264 -235 -205 -208 -249 -294 -315 -323 -341 -358 -345 -302 -259 -230 -204 -170 -137 -120 -110 -97 -80 -68 -62 -61 -62 -59 -50 -38 -33 -30 -18
7308 -18 4 19 12 -7 -25 -39 -56 -81 -110 -139 -161 -161 -132 -89 -53 -33 -25 -25 -30 -30 -19 -9 -17 -40 -58 -65 -78 -105 -132 -142 -141 -144 -153 -152 -131 -92 -52 -29 -32 -50 -59 -43
7290d3L0K9K0Ok1m5m0nK0Qk2l4k3j1rkQRKLK1L8L9K7K0Pk0m6n4l8j6%RJ7J7RkolNJ5K2J8M
7271c7j2k2k1j2jKnj8k4j7jJ1J3RNNJ1K1L1L1J9lk1k2j2ookJ6L7M2L0J3Kkqj7k1j9j5j1j3
7252e0j6j4jJ8K9J8mk2k5j9j2pnjjjLJ0J3Om%J3K2J5Jpj0j7k0rJ4L1L1K5K5K1Oj4k6j9j2j7
7234c2l6n3n3l2nJ6K3K2J9J6J3J1J4J5J1jj7l5n1n4m1k0kLMMKkj1j2nPK0L3M4L6Qk5l1nL2
7216a70N3N7M6K5OJJ3J7nl5m5l2j5qkPJ0KnJJ1J4ROOLjJMMok2l9l9j9NJ1ok4k2j2lKJ2J9J5
7196a50OLMRJ6K8L2J7pk2k6k7k8k3j2llj1k3l3k7LL1L5J5LKNknLJ8K9L0J7j1k8k1JJk3l9k7
7177b43r%J0L3M7K9mj9rKjonjRK7M3L9J2j9l5l4k7k2k6l7l6rK7M2K4mj5%J8K7K3J2NJ0K3L5
7159f4K8Oj5k4j7jJ1J1J0J4K5K8K3Rlj5k5l3l6l1j9okj2j7nJ3J6lk1j6LJ1Krj3j0pjNJ0J3
$$ plain form
7290 -43 -13 16 36 42 21 -24 -64 -69 -49 -41 -63 -97 -120 -131 -140 -142 -134 -125 -123 -120 -99 -61 -22 5 25 32 12 -34 -88 -126 -142 -142 -133 -116 -99 -90 -92 -98 -101 -96 -81 -59 -41 -37
7271 -37 -49 -71 -92 -104 -105 -103 -108 -126 -150 -167 -168 -157 -144 -135 -130 -125 -114 -93 -62 -31 -12 -15 -36 -58 -70 -76 -82 -84 -68 -31 11 41 54 56 54 46 29 8 -11 -26 -37 -50
7252 -50 -66 -80 -81 -63 -34 -16 -20 -42 -67 -86 -98 -105 -110 -111 -112 -113 -110 -100 -87 -81 -85 -85 -72 -50 -35 -34 -41 -51 -68 -88 -97 -83 -52 -21 4 29 50 56 42 16 -3 -15 -32
7234 -32 -68 -121 -174 -206 -211 -195 -172 -150 -131 -115 -102 -91 -77 -62 -51 -52 -69 -104 -155 -209 -250 -270 -272 -269 -265 -261 -259 -261 -272 -284 -289 -282 -262 -229 -185 -149 -141 -166 -197 -202 -170
7216 -170 -117 -60 -14 11 17 18 31 48 43 8 -37 -69 -84 -92 -94 -87 -77 -75 -80 -79 -68 -54 -45 -39 -33 -30 -31 -30 -26 -22 -28 -50 -89 -128 -147 -142 -131 -137 -161 -183 -195 -198 -196 -184 -165 -150
7196 -150 -144 -141 -137 -128 -112 -84 -52 -35 -42 -64 -90 -117 -145 -168 -180 -183 -186 -197 -220 -253 -280 -277 -246 -211 -196 -193 -191 -186 -188 -193 -190 -172 -143 -113 -96 -107 -135 -156 -155 -154 -177 -216 -243
7177 -243 -252 -252 -242 -209 -162 -133 -137 -156 -165 -163 -164 -170 -175 -176 -167 -140 -97 -58 -46 -65 -100 -134 -161 -183 -209 -246 -282 -291 -264 -222 -198 -202 -217 -217 -199 -172 -149 -137 -132 -122 -99 -64
7159 -64 -36 -30 -45 -69 -86 -87 -76 -65 -55 -41 -16 12 35 44 41 26 1 -32 -68 -99 -118 -124 -126 -138 -155 -160 -147 -131 -134 -155 -171 -168 -157 -155 -164 -177 -187 -194 -195 -190 -180 -167
7141a67K0K7K5J4ORJ4J1%olj0k6l6k2J1L2L0J0qk1k8k5qOQ%kjj0k5k7JM1N9L9Nj4j4j0j1j2
7123a18j0kOJ7K9K9J1j0j4kLj1k3k0oJKOJ6J7Orj6pJ1K6K0lk2k7l0m3m8k5J0K4J1KJ5L5L7
7105a12K1Kj3k5k6j6kKMJ5K8L0J1j7m0m4k6nnk7m3k4J1L1K5J5J8K7L1L3K9J6qk6k6j2lmj5
7088a70k7k9j6jkj3j2J3L8L7J6jjJ1K2K8K1nl5n1m4k5kK2M0L6Pk1k4rmj5k5k0nLOJ3K2L0L4
7070a58L4L3K9L0K9J8nk1k5k1k5l6l1nK3K8J4Joj1j5rPJ5Mj4j2J1K2Mk5l2j0J0J0lqnoj4o
7053a81J8M1M4L0J1jj0j3qlnj2k0j8j2nMJ4K4J9Jj4qJ8L3J6k2m0k0J4K3%k8l0j1RRqk9l4k7
7035b31j9j9k6k7j6LK7M9N7M6J9mpRK3J5nj7j4qj6l0l4k2oJ1K8M2L8J5mnLORJ7K0J0qj3lJ3
7017g4J8J1kpLK2L2J5j8l8l1lK5L6J6k4n9n7k0J9K9J7J3K3L1K4Lj7l0k7k0j5j5j2oJKKQJ5
$$ plain form
7141 -167 -147 -120 -95 -81 -75 -66 -52 -41 -41 -47 -50 -60 -86 -122 -144 -133 -101 -71 -61 -69 -90 -118 -143 -151 -145 -137 -137 -139 -140 -150 -175 -202 -201 -160 -101 -62 -57 -71 -85 -95 -106 -118
7123 -118 -128 -130 -124 -107 -78 -49 -38 -48 -62 -64 -61 -72 -95 -115 -121 -120 -118 -112 -96 -79 -73 -82 -98 -105 -94 -68 -48 -51 -73 -100 -130 -173 -221 -246 -236 -212 -201 -199 -184 -149 -112
7105 -112 -91 -89 -102 -127 -153 -169 -171 -169 -165 -150 -122 -92 -81 -98 -138 -182 -208 -213 -218 -245 -288 -312 -301 -270 -245 -230 -212 -185 -154 -121 -92 -76 -84 -110 -136 -148 -151 -155 -170
7088 -170 -197 -226 -242 -243 -245 -258 -270 -257 -219 -182 -166 -167 -168 -157 -135 -107 -86 -91 -126 -177 -221 -246 -248 -226 -186 -150 -143 -164 -188 -197 -201 -216 -241 -261 -266 -263 -257 -244 -222 -192 -158
7070 -158 -124 -91 -62 -32 -3 15 10 -11 -36 -57 -82 -118 -149 -154 -131 -103 -89 -88 -94 -105 -120 -129 -122 -107 -103 -117 -129 -118 -96 -92 -117 -149 -159 -149 -139 -142 -150 -155 -161 -175 -181
7053 -181 -163 -122 -78 -48 -37 -38 -48 -61 -69 -72 -77 -89 -109 -127 -139 -144 -140 -126 -102 -83 -82 -96 -104 -86 -53 -37 -59 -99 -119 -105 -82 -82 -110 -140 -151 -142 -133 -141 -170 -204 -231
7035 -231 -250 -269 -295 -322 -338 -335 -308 -259 -202 -156 -137 -141 -148 -139 -116 -101 -106 -123 -137 -145 -161 -191 -225 -247 -253 -242 -214 -172 -134 -119 -123 -128 -125 -119 -110 -93 -73 -63 -71 -84 -87 -74
7017 -74 -56 -45 -47 -54 -51 -29 3 18 0 -38 -69 -72 -47 -11 5 -19 -78 -135 -155 -136 -107 -90 -77 -54 -23 1 4 -13 -43 -70 -90 -105 -120 -132 -138 -137 -135 -133 -125 -110
6999a10J7J1QRJ2Kj8l8m5l9l1k2nK9O5P3M9J3j1j9j8j4oLJ1J3Rj2l5m0j6J8L0J5jJJ2J2nl1
6982a04m4l7nK5L8K5QKQJ7K2J6Jj4j8j3j3k2k9k8k0j2KK2L6K3j0l6l2qJ0J3J1J7K4J9Nl%P
6965i7%j7l5l8k0NJ9J6%j1j1qJK0M1M4K0koJrl1l9k3lNORJ5J3J6K8L4K2JjJ8K8J2j9l5l1j6
6946g8j1j3j0OJ8J3j0k7k9k8l1k8pK1L3K1%j6k0j6p%kpj1j3j3mJ8L5K9Kj8j8rLJ3J2mj8j0
6928b34K3M6L6J1oj4k5l2k4jJ6K6L4M3M0K4Oj0l0m8m3k1lmrqpj5j9nK0L3L5L6L4J1k9n3m1
6911b07jK5K2kj6j6nOJ9K9L1J7lj5rKMmj0pJMMQJ1Kj7k9k3oLjkKMloKJ0jk3l6k9j8j5k0j7
6891c35rOK2K9J3j6k9nL6O0N5L8K1J4J2J2QKLJ3J7Mj7k8k8j8qjpk2l2k2oJJ%KjnLJ5J5QJ3
6872a66K4J8j4m0l1jJ8J2nj3j0noj1lK1M0L0%j5oKqk3k6j9j5j2qj2k5k9oK8M4M0L6L6K6J1
$$ plain form
6999 -110 -93 -82 -74 -65 -53 -51 -69 -107 -152 -191 -222 -244 -249 -220 -155 -82 -33 -20 -31 -50 -68 -82 -88 -85 -74 -61 -52 -64 -99 -139 -155 -137 -107 -92 -93 -92 -80 -68 -73 -104
6982 -104 -148 -185 -190 -165 -127 -102 -94 -92 -84 -67 -45 -29 -28 -42 -60 -73 -86 -108 -137 -165 -185 -197 -195 -173 -137 -114 -124 -160 -192 -200 -190 -177 -166 -149 -125 -106 -101 -104 -104 -97
6965 -97 -97 -114 -149 -187 -207 -202 -183 -167 -167 -178 -189 -197 -196 -176 -135 -91 -71 -73 -79 -78 -87 -118 -157 -180 -183 -178 -172 -163 -148 -135 -119 -91 -57 -35 -34 -35 -17 11 23 4 -31 -62 -78
6946 -78 -89 -102 -112 -106 -88 -75 -85 -112 -141 -169 -200 -228 -235 -214 -181 -160 -160 -176 -196 -212 -219 -219 -221 -228 -239 -252 -265 -269 -251 -216 -187 -185 -203 -221 -230 -227 -214 -202 -206 -224 -234
6928 -234 -211 -165 -129 -118 -124 -138 -163 -195 -219 -220 -204 -178 -144 -101 -61 -37 -31 -41 -71 -119 -162 -183 -186 -190 -199 -207 -214 -229 -248 -253 -233 -200 -165 -129 -95 -84 -113 -166 -207
6911 -207 -208 -183 -161 -163 -179 -195 -200 -194 -175 -146 -115 -98 -101 -116 -125 -123 -119 -123 -133 -140 -139 -135 -131 -123 -112 -110 -127 -156 -179 -185 -182 -183 -185 -183 -179 -182 -188 -186 -176 -177 -200 -236 -265 -283 -298 -318 -335
6891 -335 -344 -338 -316 -287 -274 -290 -319 -324 -288 -228 -173 -135 -114 -100 -88 -76 -68 -66 -63 -50 -33 -29 -46 -74 -102 -120 -128 -129 -136 -158 -190 -212 -218 -217 -216 -216 -214 -215 -220 -217 -202 -187 -179 -166
6872 -166 -142 -124 -138 -178 -209 -210 -192 -180 -185 -198 -208 -213 -219 -230 -233 -212 -172 -142 -142 -157 -163 -161 -169 -192 -218 -237 -252 -264 -272 -284 -309 -338 -344 -316 -272 -232 -196 -160 -134 -123
6855a23RJ9K5J7N%rk2k1LL0L5J6rj8j2LQkj4k0k3l8n3m9k6rqlJ7M2M4K3rl5m5l3j2jrj5pO
6836c23J0ORJ5K1K9M4N2L3Kj6j0NJj6l2l0j5%LLRK1K1Oj0k0k3k3j4NK0K2K0K6K5Ok0l4l3l3
6818b38l0lL1M0J4j4j5jLqj1%RMnoLJ6J9Mk6n1m9j8K1M3M7M4L3J1j8l4k3NJ6jk6l4j7J4L8
6800b13N1M5K3mk3k6j9j4j1q%J4K7L1K9J8Lk1m7n6m0nK9N0N1L4Lk5l9l4k0%J4J4ok8k7oJ4
6783b22J1KJNLllNJ0J0J2J4Mj6k7j7RK3K1J6J8J8Pn%J6K9K6J9J6J2lk0k3j3rj8k7k5k2k0j4
6765a80lOLlQL0L7J4j8k7oK0K6J4Jqk2l4k8%K0RrlK2K5nl2k6%J0Mlnnr%K1M1M4K8Lj3qPJ1
6745d3ql2m3l6k1LK2K2KrJ4M5M1%m1n1l9l2k5j4LJ8L0L8L0J0lNK1K6J9Nj9m4n0k6KQJjQPq
6727a65j8j4j1j4j0QK1J3pj2oknlJ0K0J6LjOJ3Oqj2mPLj2k3k1j1pnMJ3J8K6M4N7M5Ol1m2l6
$$ plain form
6855 -123 -114 -95 -70 -53 -48 -48 -57 -79 -100 -97 -67 -32 -16 -25 -43 -55 -52 -44 -46 -60 -80 -103 -141 -194 -243 -269 -278 -286 -289 -272 -230 -186 -163 -172 -207 -252 -285 -297 -298 -307 -322 -329 -323
6836 -323 -313 -307 -298 -283 -262 -233 -189 -137 -104 -102 -118 -128 -123 -122 -138 -170 -200 -215 -215 -212 -209 -200 -179 -158 -152 -162 -182 -205 -228 -242 -237 -217 -195 -175 -149 -124 -118 -138 -172 -205 -238
6818 -238 -268 -271 -240 -200 -186 -200 -215 -216 -213 -221 -232 -232 -223 -219 -224 -230 -227 -211 -192 -188 -214 -265 -314 -332 -311 -268 -221 -177 -144 -133 -151 -185 -208 -203 -187 -188 -214 -248 -265 -251 -213
6800 -213 -162 -117 -94 -98 -121 -147 -166 -180 -191 -199 -199 -185 -158 -127 -98 -80 -77 -98 -145 -201 -241 -246 -217 -167 -116 -82 -79 -104 -143 -177 -197 -197 -183 -169 -175 -203 -230 -236 -222
6783 -222 -211 -209 -208 -203 -200 -203 -206 -201 -191 -181 -169 -155 -151 -167 -194 -211 -202 -179 -158 -142 -124 -106 -99 -104 -104 -88 -59 -33 -14 2 14 11 -9 -32 -45 -54 -72 -99 -124 -146 -166 -180
6765 -180 -183 -177 -174 -177 -169 -139 -102 -88 -106 -133 -139 -119 -93 -79 -78 -86 -108 -142 -170 -170 -150 -141 -150 -153 -131 -106 -111 -143 -169 -169 -159 -155 -158 -163 -168 -177 -177 -156 -115 -71 -43 -40 -53 -61 -54 -43
6745 -43 -51 -83 -126 -162 -183 -180 -158 -136 -134 -143 -129 -84 -43 -43 -84 -135 -174 -206 -231 -245 -242 -224 -194 -156 -126 -116 -119 -114 -93 -67 -48 -43 -62 -106 -156 -182 -180 -172 -171 -172 -164 -157 -165
6727 -165 -183 -197 -208 -222 -232 -224 -203 -190 -197 -209 -215 -217 -222 -225 -215 -195 -179 -176 -177 -171 -158 -152 -160 -172 -176 -169 -166 -178 -201 -222 -233 -240 -245 -241 -228 -210 -184 -140 -83 -38 -32 -63 -105 -141
6708a41k8k4j9j5j6j4lRNrrOK1K2J4J2J9K9L4L0J1rj3JK1K8J8%k2l7l5k3j4k2k9j6J1L0K7
6691a50K1K2J9ml7m8k9KJ4QMOJj7l4k9rLrk3j1K6O2P3O2L9K0Npj8k8l5l4k2nRJ5Nm%J2J9P
6672i9rj5rkJMQKj3k9l5k5jK6L7K6Olnlmj0k7n3o3m0jK2K1J5J5Qqj3JJ4RjNK2L0K5K1J9Rj1
6652a33l2l9l2j8%K1L7M6M2K5Qkrk4m5n1k5J5L1J6mmJ2K2J0j3k1kK0K1JqLJ5Nj0lJ7J8rk8
6634a27k3okokNJpkK0L7L2J0j1k2k2j4nmj3k4k8k5j8nK0M7N2K7kj3j0j5l2l6j6RK0K2K6K5
6617a37Pj9k8j0J5K5J8J3J1J2Kj8l3k8oJ0Q%MJ2Pj4l0k8k4k8l2j8RL1L3K1Jj1j1jRJ0J3K9
6599a76M5M1Rk3l2j6nj1j7oK1L5K0lj1kJpj4pPJ3J1J4J8J6%k3l4k6j0KRJ4J3Jj8k8k4k1k7
6581b51l1k3qKJ1K6L4K1mk0j6j0pmOQjqJJ9L0L2K5Qj9m8o1n4l2KL1M2L1J4NOJ1J5J8J8J6J6
$$ plain form
6708 -141 -169 -193 -212 -227 -243 -257 -260 -251 -246 -255 -264 -258 -237 -215 -201 -189 -170 -141 -107 -77 -66 -75 -88 -87 -66 -38 -20 -20 -42 -79 -114 -137 -151 -173 -202 -218 -207 -177 -150
6691 -150 -129 -107 -88 -92 -129 -177 -206 -204 -190 -182 -178 -172 -171 -188 -222 -251 -260 -257 -266 -289 -300 -274 -212 -139 -77 -38 -18 -13 -20 -38 -66 -101 -135 -157 -162 -153 -138 -133 -137 -137 -125 -106 -99
6672 -99 -108 -123 -132 -134 -133 -129 -121 -119 -132 -161 -196 -221 -222 -196 -159 -133 -127 -130 -135 -138 -142 -152 -179 -232 -295 -335 -336 -314 -293 -278 -263 -255 -263 -276 -275 -261 -252 -253 -248 -226 -196 -171 -150 -131 -122 -133
6652 -133 -165 -204 -236 -254 -254 -233 -196 -150 -108 -83 -75 -77 -86 -110 -155 -206 -231 -216 -185 -169 -173 -177 -165 -143 -133 -146 -167 -169 -149 -128 -127 -135 -132 -117 -112 -122 -125 -108 -90 -99 -127
6634 -127 -150 -156 -158 -164 -166 -161 -160 -167 -169 -149 -112 -80 -70 -81 -103 -125 -139 -144 -148 -161 -185 -213 -238 -256 -261 -241 -194 -142 -115 -117 -130 -140 -155 -187 -223 -239 -230 -210 -188 -162 -137
6617 -137 -130 -149 -177 -187 -172 -147 -129 -116 -105 -93 -91 -109 -142 -170 -176 -166 -158 -158 -154 -142 -135 -149 -179 -207 -231 -259 -291 -309 -300 -269 -236 -215 -214 -225 -236 -237 -228 -218 -205 -176
6599 -176 -131 -90 -81 -104 -136 -152 -157 -168 -185 -191 -170 -135 -115 -118 -129 -131 -130 -137 -151 -158 -151 -138 -127 -113 -95 -79 -79 -102 -136 -162 -172 -170 -161 -147 -134 -133 -151 -179 -203 -224 -251
6581 -251 -282 -305 -313 -311 -300 -274 -240 -219 -223 -243 -259 -269 -276 -280 -274 -266 -267 -275 -274 -255 -225 -193 -168 -160 -179 -227 -288 -342 -374 -372 -341 -299 -268 -254 -249 -243 -232 -217 -199 -181 -165 -149
6563a49K1J9J1J1K0K6Qk2m4m0k0QK9K6ml0k5njj7k5j0PNqqJ2L9N3M4J7j4k7k4j6j2oJ1K6K8
6546h6J9J0Jk0m7o3n8l2lK2K7J4oj4JK7M4M2L0J9J8J7Mk0l7l5j7rj4k0j0OJ3NNJ5J8kl5n1
6529b22l6rJ9M1M8L5Nk0k1nRJ8J9J2lj3j2oqj3rKJ2J2PNLJJjnkQJ6Lj8k1JK7L0J2j3k8l4l3
6509a86k7j9qMJ7K3K3J8J6J4J3RJqj2mJ2J9J5J4K1L1K7Mk3l8l1rJ1J4Pnj5k2j9oQRkrqkJk
6490a24kjKOQKj2j9j4lNLrk9m3l8j5RK5L5M4M2K7RPJ6K1J7J0QP%j9m0m2j6K2L3Pk4l0j6j2
6471a43k3k3lK1K7K2J9K4K7K4J4lk3m1m6l6j2J4L2L7K8J4%j2k0k1k1j3JJ2J3PNRLj9l4k2Q
6454a54K4J2mkRJ8K0J5PmoOK1K7J5Jj0j8k1j7jK4L8K6ol6n0n0m8m5k9%K7L6K5Nj5j8mJ2J4
6437a56J1J2J4jk6l5j8JJpmJ0J4J2J1J3J3J2J6J9Rj7l6l6j8nmqqmmj7l0k2jJ2MrpNJ2J2K1
$$ plain form
6563 -149 -128 -109 -98 -87 -67 -41 -33 -55 -99 -139 -159 -151 -122 -96 -100 -130 -155 -160 -161 -178 -203 -213 -206 -201 -209 -217 -205 -166 -113 -69 -52 -66 -93 -117 -133 -145 -151 -140 -114 -86
6546 -86 -67 -57 -56 -76 -123 -186 -244 -276 -279 -257 -230 -216 -222 -236 -235 -208 -164 -122 -92 -73 -55 -38 -34 -54 -91 -126 -143 -152 -166 -186 -196 -190 -177 -172 -167 -152 -134 -136 -171 -222
6529 -222 -258 -267 -248 -207 -159 -124 -119 -139 -160 -165 -156 -138 -119 -107 -110 -123 -135 -141 -149 -162 -171 -169 -157 -145 -138 -133 -130 -129 -128 -129 -134 -136 -128 -112 -109 -127 -148 -147 -120 -90 -78 -91 -119 -153 -186
6509 -186 -213 -232 -240 -236 -219 -196 -173 -155 -139 -125 -112 -103 -102 -110 -122 -126 -114 -95 -80 -66 -45 -14 13 17 -6 -44 -75 -84 -73 -59 -52 -57 -72 -94 -113 -119 -111 -102 -104 -113 -121 -123 -122 -124
6490 -124 -126 -127 -125 -119 -111 -109 -121 -140 -154 -157 -152 -149 -158 -187 -230 -268 -283 -274 -249 -214 -170 -128 -101 -92 -85 -69 -48 -31 -21 -13 -6 -6 -25 -65 -107 -123 -101 -68 -61 -85 -115 -131 -143
6471 -143 -166 -189 -192 -171 -144 -122 -103 -79 -52 -28 -14 -17 -40 -81 -127 -163 -175 -161 -129 -92 -64 -50 -50 -62 -82 -103 -124 -137 -136 -124 -111 -104 -99 -90 -87 -106 -140 -162 -154
6454 -154 -130 -118 -122 -124 -115 -97 -77 -62 -55 -59 -65 -59 -38 -11 4 5 -5 -23 -44 -61 -62 -38 0 26 20 -16 -66 -116 -164 -209 -238 -238 -211 -175 -150 -145 -160 -178 -182 -170 -156
6437 -156 -145 -133 -119 -120 -146 -181 -199 -198 -197 -204 -208 -198 -184 -172 -161 -148 -135 -123 -107 -88 -79 -96 -132 -168 -186 -191 -195 -203 -211 -215 -219 -236 -266 -288 -289 -277 -273 -282 -289 -284 -272 -260 -239
6418b39L4K9Lj6j0J3K6K2J1OJ%MQNj0l0m1l3j0K0L7K9Mj5j8j4j9l5m6m0k3kK1M2N7N9M6K4
6401a00jj9l0l0k0pMOKNK0M1N2M7L3J5j6m2m9k8ppj9k3k0j9j3LJ6J1mnKnk0j7lj1m5o2l5K
6383c98RKK0N4N9L1J1K1L6L2J1pj7j7j2qj4j7kK1K4Mj2j1rk0k5j2Kqk2j4J5L3K8J8J2%j7j9
6366b18JJ9J4nj6j4j0j2j0J0L3L7J2k1l2j7%ok3k3KL0M3M1L1J1qj2KJ1jk1j9lPjj1p%lj1j0
6347b10noj3j2%J4K0K1K2J4ql3l6j3J7K5J2kkJ2K8L9L8K3kk0j4MJ4%k0k3qNN%JM%j2k2k0p
6329a70PJ4Qkrj3j4j3nMNnj2qKPJ0J8L0L0J4oj5qNJ1Jj2j7j3k1m3n2k5K1M3K9MpnormJ2K7
6309a92K1pl3l7j6LOjOJ9K0%j8j5kQJ0J3J4J0N%nrmOJ2MmkJmoMR%mJ8N2N5J6k0k7j2j%%jo
6288a14nNOj5l8l7j6PJ6J4Noj0jJ1Qj0j8lJ8K3J1%rj6k8m0m6m0k0LJ6J3JKJ3K0J8J7K1K5J8
$$ plain form
6418 -239 -205 -176 -173 -189 -199 -186 -160 -138 -127 -121 -120 -120 -116 -108 -103 -113 -143 -184 -217 -227 -207 -170 -141 -137 -152 -170 -184 -203 -238 -284 -324 -347 -349 -328 -286 -229 -170 -124 -100
6401 -100 -101 -120 -150 -180 -200 -207 -203 -197 -195 -190 -170 -129 -77 -30 3 18 2 -40 -89 -117 -124 -131 -150 -173 -193 -212 -225 -222 -206 -195 -199 -204 -202 -207 -227 -244 -247 -258 -303 -365 -400 -398
6383 -398 -389 -387 -367 -313 -254 -223 -212 -191 -155 -123 -112 -119 -136 -153 -165 -173 -187 -204 -206 -185 -161 -157 -169 -180 -189 -209 -234 -246 -244 -252 -274 -288 -273 -240 -212 -194 -182 -182 -199 -218
6366 -218 -217 -198 -184 -189 -205 -219 -229 -241 -251 -241 -208 -171 -159 -180 -212 -229 -229 -235 -258 -281 -279 -249 -206 -165 -134 -123 -131 -143 -141 -130 -131 -152 -171 -174 -167 -168 -179 -186 -186 -189 -200 -210
6347 -210 -215 -221 -234 -246 -246 -232 -212 -191 -169 -155 -163 -196 -232 -245 -228 -203 -191 -193 -195 -183 -155 -116 -78 -55 -57 -77 -91 -87 -73 -73 -93 -116 -124 -119 -114 -114 -113 -109 -109 -121 -143 -163 -170
6329 -170 -163 -149 -141 -143 -152 -165 -179 -192 -197 -193 -188 -193 -205 -213 -211 -204 -194 -176 -146 -116 -102 -108 -123 -131 -126 -115 -114 -126 -143 -156 -177 -220 -272 -297 -276 -233 -204 -200 -207 -212 -218 -227 -231 -219 -192
6309 -192 -171 -178 -211 -248 -264 -261 -255 -256 -250 -231 -211 -211 -229 -244 -246 -238 -228 -215 -201 -191 -186 -186 -191 -200 -204 -198 -186 -182 -186 -188 -187 -191 -197 -193 -184 -184 -188 -170 -118 -63 -47 -67 -94 -106 -107 -107 -107 -108 -114
6288 -114 -119 -114 -108 -123 -161 -198 -214 -207 -191 -177 -172 -178 -188 -189 -178 -170 -180 -198 -201 -183 -160 -149 -149 -158 -174 -202 -242 -288 -328 -348 -345 -329 -316 -315 -313 -300 -280 -262 -245 -224 -199 -181
6270a81kk3k9j7RL4M8M8L5J4rk2j8rqj6j4%J3Jk3k9oK8M5L9K0QQJ4J6Jk3m2m2l2k2j6j0jM
6252b09JljK%mkKQPKnj2j7j7j3rrj1pKRJ3J9K5K3J1lj2qkLJj1k3j9JK1K2J5J4J6Lj9k9j7%
6232b42RJ3J3jk5k8LM2M6J9%NJ2OnmJ0K5L6L8K2mk4k4j7j3qJPjj4j5rj5k8k3OL5L6J5qk4l7
6213a70m6m3k5qJMJ0J4J3NJLMKRK4L6K8Kj7j8oLLNJ6L2L5J9pk4k0nKkqpjJNQJ0Omj0pklrj0
6191a51mnj8k6j1J4K7J6OQJ3RLNMjlJ1K1Qj6k1%J8J3j1l2m0k9oK4L9L6K5K0J7J0kj6k9k8o
6173a08K5L4J7JLJ0%k6m4m2k7oLok6l1oK8M6M2L1J7pl6n0l7j0J2J5LqmPPnnJ7L7K7kk0k1k2
6154a67k9k8qJ5L2L7L5J8joMJ2Oqj2kJ6L1K8Nj9j9jPrk7l1l1l7l5j3RJ0rk2j9nJ0K3K7J5j
6136a99jJ4K2Pj7l2k6j2oomPJ9K2K1K7L9L7J8LRK6L2L3K3Kl0m9l7pLj7m3n6n2l4kL1M3L2J5
$$ plain form
6270 -181 -183 -206 -235 -252 -243 -209 -161 -113 -78 -64 -73 -95 -113 -122 -130 -146 -160 -160 -147 -146 -169 -198 -204 -176 -131 -92 -72 -64 -56 -42 -26 -25 -48 -90 -132 -164 -186 -202 -212 -213 -209
6252 -209 -208 -211 -212 -210 -210 -214 -216 -214 -206 -199 -197 -202 -214 -231 -248 -261 -270 -279 -290 -297 -295 -286 -273 -254 -229 -206 -195 -198 -210 -218 -220 -217 -216 -227 -250 -269 -268 -247 -225 -210 -196 -180 -177 -196 -225 -242 -242
6232 -242 -233 -220 -207 -208 -233 -261 -258 -216 -170 -151 -151 -146 -134 -128 -133 -137 -127 -102 -66 -28 -6 -10 -34 -58 -75 -88 -96 -95 -88 -89 -103 -118 -127 -142 -170 -193 -187 -152 -116 -101 -109 -133 -170
6213 -170 -216 -259 -284 -292 -291 -287 -277 -263 -250 -245 -244 -241 -237 -235 -226 -202 -166 -138 -136 -153 -171 -177 -174 -171 -166 -150 -118 -83 -64 -71 -95 -115 -120 -118 -120 -128 -135 -136 -135 -130 -122 -112 -106 -110 -120 -127 -129 -132 -141 -151
6191 -151 -155 -160 -178 -204 -215 -201 -174 -158 -152 -144 -131 -122 -119 -114 -110 -111 -114 -103 -82 -74 -90 -111 -111 -93 -80 -91 -123 -163 -192 -198 -174 -135 -99 -74 -54 -37 -27 -29 -45 -74 -102 -108
6173 -108 -83 -49 -32 -31 -28 -18 -18 -44 -88 -130 -157 -163 -160 -166 -192 -223 -229 -201 -155 -113 -82 -65 -72 -108 -158 -195 -205 -193 -178 -175 -183 -187 -180 -173 -178 -183 -166 -129 -102 -104 -124 -145 -167
6154 -167 -196 -224 -232 -217 -185 -148 -113 -95 -96 -102 -98 -86 -80 -88 -100 -102 -86 -55 -27 -22 -41 -60 -61 -54 -63 -90 -121 -152 -189 -224 -237 -228 -218 -227 -249 -268 -273 -263 -240 -213 -198 -199
6136 -199 -200 -186 -164 -157 -174 -206 -232 -244 -250 -256 -260 -253 -234 -212 -191 -164 -125 -88 -70 -67 -58 -32 0 33 56 58 28 -21 -58 -65 -62 -79 -122 -178 -230 -264 -266 -235 -192 -160 -145
6118a45QRL%LPMpj7k4k6j6KJ9K4J8QjmOJ8J7MroJ%jQK3K9K0OmnLJ0J0jj5k1k8l2k2RL4K5o
6098f2k1oJ4J7J3J6K1Oj8l0k8k8m0m2k3QK8K7J0j2k6l2l2k8j6MK8L8K9J0NJ6K8K1nl0k7pM
6081a70j2l3k9lK3L9M5L7Ll8m7j5K1K6J0Jjqj5jK0K4Nj1pQJ7J6J0jj0pOJ3Pmj1k2l9m3k1R
6063b08K9M2N3N6L6Pj3j6k7m7n7m0pJ7K6K2J8J5J4J0RJ3J9Rj6m1m3k7j5mJ5L6M1J7k3n3n7
6046a90l2J1L7L1Q%J0J1j3l2j9J9M5M4K6Nj5k9k2JK4K8J1j4l3l8l4l2l8m2k7PL8M7L8K5K3
6030a21K2J0j1k0j3KLoj4j9j9j4mKj1l2k7ML1K5lj8j1PK3L5M1L2J4nj3j1mPPjj2qMNj3k4j6
6012a76MJ0jj1j0qrpJ0K7L3K3J0LlkNJ6J8Kj4j4kQK0L7N2M9K4J0K3M4L9Pk8m6m9m0j6J9N0
5994A07N4L0kj9rJ6L0L1K7K8K5J0j0k0j4kRJ5J5J4J3Rlk1l0k1j1j6k7k1kPqk9l6l1k8k9j7
$$ plain form
6118 -145 -137 -128 -125 -125 -122 -115 -111 -118 -135 -159 -185 -201 -199 -180 -156 -138 -130 -131 -135 -129 -111 -94 -90 -99 -105 -104 -104 -105 -97 -74 -45 -25 -19 -23 -28 -25 -15 -5 -6 -21 -42 -70 -102 -124 -115 -81 -56 -62
6098 -62 -83 -89 -75 -58 -45 -29 -8 -2 -20 -50 -78 -106 -146 -188 -211 -203 -175 -148 -138 -150 -176 -208 -240 -268 -284 -280 -252 -214 -185 -175 -170 -154 -126 -105 -110 -140 -167 -174 -170
6081 -170 -182 -215 -244 -247 -224 -185 -140 -103 -100 -138 -185 -200 -179 -153 -143 -142 -143 -151 -166 -167 -147 -123 -118 -129 -136 -128 -111 -95 -85 -86 -96 -103 -97 -84 -77 -81 -92 -114 -153 -196 -217 -208
6063 -208 -179 -137 -84 -28 8 15 2 -14 -41 -88 -145 -185 -192 -175 -149 -127 -109 -94 -80 -70 -61 -48 -29 -20 -36 -77 -120 -147 -162 -166 -151 -115 -74 -57 -80 -133 -190
6046 -190 -222 -211 -174 -143 -135 -135 -125 -114 -127 -159 -178 -159 -114 -70 -44 -39 -54 -83 -105 -104 -80 -52 -41 -55 -88 -126 -160 -192 -230 -272 -299 -292 -254 -207 -169 -144 -121
6030 -121 -99 -89 -100 -120 -133 -131 -128 -134 -148 -167 -186 -200 -204 -202 -213 -245 -272 -268 -237 -212 -215 -233 -244 -237 -214 -179 -138 -106 -92 -97 -110 -121 -125 -118 -111 -112 -124 -132 -128 -123 -136 -160 -176
6012 -176 -172 -162 -163 -174 -184 -192 -201 -208 -198 -171 -138 -115 -105 -102 -105 -107 -102 -86 -68 -66 -80 -94 -96 -88 -68 -31 21 70 94 104 127 171 210 217 189 143 94 54 38 57 107
5994 107 161 191 189 170 161 177 207 238 265 293 318 328 318 298 284 282 291 306 321 335 348 357 354 333 303 282 271 255 228 207 205 212 204 175 139 108 80 51 34
5977C4NJ7nn3r2q9m7JK4J8%pKK8M9M2J7LJ8L5K3j2l9m5l9k9oJ8K5J4QJ1Pj4k7k0pplJ6L6L0
5959f0R%kj6m0n0l7k3j8j1OJ7J8J4J7J4jj3j2mloqj0j5j4lMJmLROmoOJ9K9L8M0L0J7J8K3J5
5939grk5k3j6k3l2l1k1j5j0kM%oNK5K1j2l9l4qQPPJ3J6ROJ2J7J3Mknrj1mMLmj0rmOK0K6J6
5919a29nj9j8rJJ2K6L6L2J5rk9l5j9QK2J7M%jj4k6k1KJ3jj9k2j1JJ2K0J6nk0oK7M7L8K1J0
5901c8NllPJ0nk4k9k2k4l0k2LK2K0QJjkjPJ0QRK0K9J0l1o3o0k5J1K4J3nj3j1nlnj1j5j5lJ3
5882b39K0J6J2J0PKOJ5J4mj8%L8N9M6J5j2k3k8k8l1l6l6k4jJ7J7Kj6k8k7j3KMlJK5M9M8L1
5864a11J6J3Npj1JJ3Pj0k1k1k5l0j7K1N3M6Nk9k9qmj7k4lL2M5L0Jj5j7j6k4l2k7j2NJ3J5J6
5847a73J1QJ3K6L0J6nj0JOmj2JK1K6J5PPLj6m1m8k9lJ2J0MOJ7K3K0J1OMmk4l5k7jJ5J5J0K0
$$ plain form
5977 34 39 56 51 -2 -94 -183 -230 -229 -205 -187 -187 -194 -192 -164 -115 -73 -56 -53 -35 0 23 11 -28 -73 -112 -141 -147 -129 -104 -90 -82 -71 -64 -78 -105 -125 -132 -139 -142 -126 -90 -60
5959 -60 -51 -51 -53 -69 -109 -159 -196 -219 -237 -248 -242 -225 -207 -193 -176 -162 -163 -176 -188 -192 -195 -201 -209 -219 -234 -248 -251 -247 -246 -250 -247 -238 -232 -236 -242 -236 -217 -188 -150 -110 -80 -63 -45 -22 -7
5939 -7 -16 -41 -64 -80 -103 -135 -166 -187 -202 -212 -214 -210 -210 -216 -211 -186 -165 -177 -216 -250 -258 -250 -243 -236 -223 -207 -198 -192 -180 -163 -150 -146 -148 -153 -162 -173 -177 -173 -170 -174 -184 -193 -197 -191 -171 -145 -129
5919 -129 -134 -153 -171 -180 -179 -167 -141 -105 -73 -58 -67 -96 -131 -150 -142 -120 -103 -99 -99 -100 -114 -140 -161 -159 -146 -147 -166 -188 -199 -198 -186 -166 -150 -155 -175 -181 -154 -107 -69 -48 -38
5901 -38 -33 -36 -39 -32 -22 -27 -51 -80 -102 -126 -156 -178 -175 -153 -133 -125 -124 -125 -127 -128 -121 -111 -103 -94 -74 -45 -35 -66 -129 -189 -214 -203 -179 -166 -171 -184 -195 -200 -203 -208 -219 -234 -249 -252 -239
5882 -239 -219 -203 -191 -181 -174 -172 -166 -151 -137 -141 -159 -159 -121 -62 -16 -1 -13 -36 -64 -92 -123 -159 -195 -219 -220 -203 -186 -184 -200 -228 -255 -268 -266 -262 -265 -264 -239 -190 -142 -111
5864 -111 -95 -82 -77 -84 -95 -94 -81 -74 -84 -105 -126 -151 -181 -198 -177 -124 -78 -73 -102 -131 -139 -143 -160 -184 -187 -155 -110 -80 -79 -94 -111 -127 -151 -183 -210 -222 -217 -204 -189 -173
5847 -173 -162 -154 -141 -115 -85 -69 -74 -84 -83 -77 -81 -93 -92 -71 -45 -30 -23 -16 -13 -29 -70 -118 -147 -150 -138 -128 -124 -118 -101 -78 -58 -47 -41 -37 -41 -65 -100 -127 -128 -113 -98 -88 -68
5828f8K9J9j1k9j8MJ4J1OMjmQK5K5Qj4k5l3l6k5mJ7K7L1L1J7j3l9l5mK3K8J6mk2l0k9k1j8
5811a40k1j5KJ8K1J4Lrk2l5l9l0rJ4K7K7K1K0K1J9J2N%joj5k1j7kJ4J8J1NMMoj7j8j5k2l9
5793b19m5k7lRJ4K7M6M9K5qk2qJ9L7L3J3j3l0l3j6J2L8M7M6M1L8K2ql8m9m7m6m8m1j7%lk0
5777b25k6rJ4J8MrkK0L8L4J6Kjkj1k0j6KJ9J8%j9k5k1j0PK9N3O4N0J3j9l4k3lRJ4J1Jj4k1
5759g4j2NRlj4j3j1j7l0l6l3k7k1j8rJJ3J8J1oj1ML0M6N0M3K4pl8n0l5j2MRPJjMQJ0RJ3J6
5740a43J5OMJ3K4K7K3J2ql5n7n2k0K3N2N1L1K7M4O3M4on1n9m2k4j6j6k6l3k1QL1K7Qlnj5l0
5724a29k5LL2L1J1j0j8k2k5k1kJ8K7J9J1J4K6L4K8Pk5n5o1l1J0L2K1JoLJ3J8J3Mrk3l0l2k7
5707a75j1QJ7J3J0J2J4Nqj1pmnJJ0J1lj3j0KJ1J0%j3j6lK0L5K9Lk1l0j7KJ0kj5j2%PKKRJ8
$$ plain form
5828 -68 -39 -20 -31 -60 -78 -74 -60 -49 -43 -39 -40 -44 -36 -11 14 22 8 -17 -50 -86 -111 -115 -98 -71 -40 -9 8 -5 -44 -79 -83 -60 -32 -16 -20 -42 -72 -101 -122 -140
5811 -140 -161 -176 -174 -156 -135 -121 -118 -127 -149 -184 -223 -253 -262 -248 -221 -194 -173 -153 -132 -113 -101 -96 -96 -97 -103 -118 -139 -156 -158 -144 -126 -115 -110 -106 -102 -108 -125 -143 -158 -180 -219
5793 -219 -264 -291 -294 -285 -271 -244 -198 -149 -124 -132 -154 -162 -143 -106 -73 -60 -73 -103 -136 -152 -140 -102 -55 -9 32 70 92 84 46 -3 -50 -96 -144 -185 -202 -202 -205 -225
5777 -225 -251 -260 -246 -228 -224 -233 -235 -215 -177 -143 -127 -125 -126 -128 -139 -159 -175 -173 -154 -136 -136 -155 -180 -201 -211 -204 -175 -122 -58 -8 5 -14 -48 -71 -74 -65 -51 -40 -39 -53 -74
5759 -74 -86 -81 -72 -75 -89 -102 -113 -130 -160 -196 -229 -256 -277 -295 -304 -303 -290 -272 -261 -267 -278 -274 -244 -198 -148 -105 -81 -88 -126 -176 -211 -223 -219 -210 -203 -202 -203 -199 -191 -181 -172 -159 -143
5740 -143 -128 -122 -118 -105 -81 -54 -31 -19 -27 -62 -119 -171 -191 -168 -116 -65 -34 -7 37 100 144 138 87 28 -14 -38 -54 -70 -96 -129 -150 -142 -111 -84 -76 -79 -84 -99 -129
5724 -129 -154 -151 -119 -88 -77 -87 -105 -127 -152 -173 -175 -157 -130 -111 -100 -86 -60 -26 2 9 -16 -71 -132 -163 -153 -121 -100 -99 -105 -102 -89 -71 -58 -54 -63 -86 -116 -148 -175
5707 -175 -186 -178 -161 -148 -138 -126 -112 -107 -115 -126 -133 -137 -142 -141 -131 -120 -123 -136 -146 -144 -133 -123 -123 -136 -152 -155 -135 -100 -71 -68 -89 -119 -136 -134 -124 -126 -141 -153 -153 -146 -144 -142 -133 -115
5688a15J5Nmj2j9k6k6j6OK3J7j6m7m0lK0J4LJ1J9Oj8j9%RNJ1K9K9Kk8k7%K3K3J1JjKLkqlJ0
5668a33K0J2mj4j4j1nRK4L1K7J6Oqj8j8rmpj1j2j3j3pPJ0LLK1M0L3Lj9k6k9l1k2lKj5k8nL3
5650a79M8K6qj9pJ5L2L1J0j3k0j6j9k8k9k0j5j6j4jOlj6j4JJ2K1K8K5Nj2qMkk5l3j5QJ4RJ0
5632b27J7J4%j3j2%Nlj8k3j2J1L1L6K7J6J8K8L1J1j5k0JK8L2J8J0ROpj5j5j7k7l5k6qMLmj1
5614a52j8k1j1RK1K0P%QK5L7K7%k7m0l4j7JJ4K3K7K6J7kj7j5jRJj9m4o0o4n0k3LJ7K0J9J9
5597b65J9J6J0Jlj%%KJ5L0L4K8K4K7K6Rj4k6k5k0j7j5j1p%OKpoOJ4Jk0k7j6mjLRQ%m%jj2k5
5577b37k5j8j1%J7K8J7mrJ2L9M3K2mj4rmj6l8n1l7mK8M5M4L0J0pj0kOOJ1K1L0L1K8K8K5J3
5559C4qj7pK%j2k2k3j2NK6L3J5j1k2k5l2m6m5j9RJ4LkJ2K9L3K1Pmrj0ojLOJ1J4J3Pkj5k2j9
$$ plain form
5688 -115 -100 -95 -99 -111 -130 -156 -182 -198 -192 -169 -152 -168 -215 -255 -258 -238 -224 -221 -210 -191 -185 -203 -222 -222 -213 -208 -197 -168 -139 -137 -165 -192 -192 -169 -146 -135 -134 -135 -133 -130 -132 -140 -143 -133
5668 -133 -113 -101 -105 -119 -133 -144 -149 -140 -116 -85 -58 -42 -36 -44 -62 -80 -89 -93 -100 -111 -123 -136 -149 -156 -149 -139 -136 -133 -112 -72 -39 -36 -55 -81 -110 -141 -163 -166 -164 -179 -207 -212 -179
5650 -179 -131 -105 -113 -132 -139 -124 -92 -61 -51 -64 -84 -100 -119 -147 -176 -196 -211 -227 -241 -242 -236 -239 -255 -269 -268 -256 -235 -207 -182 -177 -189 -197 -193 -195 -220 -253 -268 -260 -246 -237 -227
5632 -227 -210 -196 -196 -209 -221 -221 -216 -219 -237 -260 -272 -261 -230 -194 -167 -151 -133 -105 -74 -63 -78 -98 -97 -69 -37 -19 -9 0 6 -1 -16 -31 -48 -75 -110 -136 -144 -140 -137 -141 -152
5614 -152 -170 -191 -202 -193 -172 -152 -145 -145 -137 -112 -75 -48 -48 -75 -115 -149 -166 -165 -151 -128 -101 -75 -58 -60 -77 -92 -93 -84 -83 -102 -146 -206 -270 -320 -343 -340 -323 -303 -284 -265
5597 -265 -246 -230 -220 -219 -222 -223 -223 -223 -221 -206 -176 -142 -114 -90 -63 -37 -28 -42 -68 -93 -113 -130 -145 -156 -163 -163 -157 -155 -162 -168 -162 -148 -147 -167 -194 -210 -214 -215 -212 -203 -195 -195 -199 -199 -200 -212 -237
5577 -237 -262 -280 -291 -291 -274 -246 -229 -233 -242 -230 -191 -148 -126 -130 -144 -153 -157 -173 -211 -262 -299 -303 -275 -230 -186 -156 -146 -153 -163 -165 -159 -153 -142 -121 -91 -60 -32 -4 21 34
5559 34 26 9 2 4 4 -8 -30 -53 -65 -60 -34 -1 14 3 -19 -44 -76 -122 -167 -186 -177 -163 -160 -162 -150 -121 -88 -67 -60 -64 -73 -83 -89 -90 -87 -81 -70 -56 -43 -36 -38 -53 -75 -94
5540i4oLlj5k1j6j3j7l2m3l7j0L3O7P0L9Jk0k3k6l3k4NL6M4L2K4K3J5%j2rmnj2rJJ4K3K5J4
5522a5qk2j4LNj1k5k7k4k9l5l5k2PM4O9N8J9j5k5k9l3l1j0QNj4j8jJ6J4JlJkj4k7k8k4k0j4
5505c25NL0M4M4L4L4L7L4J8MmoqJJ9L8M2L1Rk0n1o6n9m4l7l4k0jJj4k7j6LNj7m2m7k3J6M4
5487c68M9M0K6J2NPK2L1K6J3J0K1K7K5J7Qnj6j6nMQJ6L6N2N2L3J1j4l6m7m0k5j8j7qJ2L2M4
5470B4M9M6L7K0%k4m5n5n1m0l1k2j0JJ3K3L1L0K1J6J4J4J3J9L2M2N1P4J07J37J87L08M80N62
5456B073M09N8k86m47m23l30k51j94j60j41j18p5l7l3n2m8j4Pnj7%K5K2ok2j0J0K0J3%j6j8
5442f6lJ9K8K0Nlk0l7l6j3J9L3K2Okqk0l2l7l6l2k1%K4L2J8mj9k4k1j6jJ3J5Mj0j5j1kJ2K9
5424a90L7K1j0l6m1k1PK5K4J4J1K3L6L4J9Mnj5k5k7j7onj1j0%J0Qnj6j6mRJ0jj9l1l2j3J5
$$ plain form
5540 -94 -100 -97 -100 -115 -136 -152 -165 -182 -214 -257 -294 -304 -271 -204 -134 -95 -94 -114 -137 -163 -196 -220 -215 -179 -135 -103 -79 -56 -41 -41 -53 -62 -66 -71 -83 -92 -91 -77 -54 -29 -15
5522 -15 -23 -45 -59 -56 -51 -62 -87 -114 -138 -167 -202 -237 -259 -252 -208 -139 -81 -62 -77 -102 -131 -164 -195 -205 -197 -192 -206 -224 -225 -209 -195 -194 -197 -196 -198 -212 -239 -267 -291 -311 -325
5505 -325 -320 -290 -246 -202 -168 -134 -97 -63 -45 -41 -45 -51 -59 -58 -39 -1 41 72 81 61 10 -56 -115 -159 -196 -230 -250 -251 -250 -264 -291 -307 -304 -299 -316 -358 -405 -428 -412 -368
5487 -368 -319 -279 -253 -241 -236 -229 -207 -176 -150 -137 -127 -106 -79 -54 -37 -29 -34 -50 -66 -71 -67 -59 -43 -7 45 97 130 141 127 91 44 4 -21 -39 -56 -64 -52 -20 24
5470 24 73 119 156 176 176 152 107 52 1 -39 -70 -92 -102 -101 -88 -65 -34 -4 17 33 47 61 74 93 125 167 218 292 399 536 723 1031 1511 2073
5456 2073 2482 2540 2254 1807 1384 1054 803 609 449 308 190 115 78 45 -7 -55 -69 -62 -67 -84 -84 -59 -37 -43 -65 -75 -65 -45 -32 -32 -48 -66
5442 -66 -69 -50 -22 -2 3 0 -20 -57 -93 -106 -87 -54 -32 -26 -28 -36 -56 -88 -125 -161 -193 -214 -214 -190 -158 -140 -144 -163 -187 -208 -224 -225 -212 -197 -193 -203 -218 -229 -231 -219 -190
5424 -190 -153 -132 -142 -178 -219 -240 -233 -208 -184 -170 -159 -136 -100 -66 -47 -43 -48 -63 -88 -115 -132 -138 -143 -154 -164 -164 -154 -146 -151 -167 -183 -187 -178 -168 -169 -188 -219 -251 -264 -249
5407b49M0M5L2J7J0Pnj8j8jJ8K8K0Lk0l1k6qKkj2j4rmLJ0Rj2l9l9j6Mnk5l0j7mLPJ1LoKK6
5388c10M0K6O%PPlrmOJ2J8K4K2J0rj8j0MJ3J0NQJ5J4KojKj1k3j8MJ1ql1l7k6j3KK0L0K4J3
5369a82J9L9M1J5j7k9k9l1m2m0j9QK5L0L7M1L0Mk2l1k6k0j3%K0L0K1Kj7k4k1nJ9L1J6j6l2
5352a88j8OJ7Rnj9l1l2j6QK0Oj3j8j0omOL0N1N4L5J8J4K1K7K1Nj0k1j9rJLlj1j6j4j0mk%L
5334a24QJ7J9Qj0j5kJ2Rqj2J4M6N4K6j8m6m8k9j2qj0nQJ8J5Kpj3rLJ5J3qk4j4J5K7J2j0j1
5316a02MJ2Mopj%j4l9m9k8J5M5M1J2j0qJ3L1L1J2rj4mMlj4j0RK6K0mk4k6mK2L2J7rl2m0l8
5298a45k8j1mj4l2l3j1K0L7L5K8K7L2L4K6Rpj8l0l9l3j0Lj4m4n4l6j6j1pJ0L7N2N2L9J6j1
5282a51l0l1j9nRJ4Prj8j6j6k4k4KL4M0J8%kKKLRJ5J6K0K0Nk5l8k0RK0Nj5k6k7j6KK0K6K0
$$ plain form
5407 -249 -209 -164 -132 -115 -105 -98 -103 -121 -139 -140 -122 -94 -74 -71 -91 -122 -148 -156 -154 -156 -168 -182 -191 -195 -192 -182 -173 -185 -224 -263 -279 -275 -280 -305 -335 -352 -356 -353 -346 -335 -332 -338 -336 -310
5388 -310 -270 -244 -238 -238 -231 -224 -227 -236 -240 -234 -222 -204 -180 -158 -148 -157 -175 -185 -181 -168 -158 -153 -145 -130 -116 -114 -120 -121 -119 -130 -153 -171 -167 -156 -164 -195 -232 -258 -271 -269 -249 -219 -195 -182
5369 -182 -163 -124 -83 -68 -85 -114 -143 -174 -216 -256 -275 -267 -242 -212 -175 -134 -104 -100 -122 -153 -179 -199 -212 -212 -192 -162 -141 -139 -156 -180 -201 -206 -187 -156 -140 -156 -188
5352 -188 -206 -200 -183 -174 -179 -198 -229 -261 -277 -269 -249 -243 -256 -274 -284 -290 -294 -288 -258 -207 -153 -118 -100 -86 -65 -38 -17 -12 -22 -43 -62 -71 -70 -67 -70 -81 -97 -111 -121 -125 -127 -127 -124
5334 -124 -116 -99 -80 -72 -82 -97 -99 -87 -78 -86 -98 -84 -38 16 42 24 -22 -70 -99 -111 -119 -129 -134 -126 -108 -93 -91 -98 -111 -120 -117 -102 -89 -97 -121 -135 -120 -93 -81 -91 -102
5316 -102 -98 -86 -82 -88 -95 -96 -96 -110 -149 -198 -226 -211 -166 -125 -113 -123 -131 -118 -87 -56 -44 -53 -67 -71 -67 -70 -84 -94 -85 -59 -39 -43 -67 -93 -97 -75 -43 -26 -35 -67 -107 -145
5298 -145 -173 -184 -188 -202 -234 -267 -278 -258 -221 -186 -158 -131 -99 -65 -39 -30 -37 -55 -85 -124 -157 -167 -164 -178 -222 -276 -312 -328 -339 -346 -336 -299 -247 -195 -156 -140 -151
5282 -151 -181 -212 -231 -236 -227 -213 -206 -215 -233 -249 -265 -289 -313 -311 -277 -237 -219 -219 -221 -219 -217 -214 -205 -190 -174 -154 -134 -129 -154 -192 -212 -203 -183 -178 -193 -219 -246 -262 -260 -240 -214 -194
5264a94J0jj5k6k7j4MJ4J9K0K6L7L8K2kj0OK7K6Rmoj2k8m7n2l7j4kmj2j4mjj0j5JK8L6K1R
5246a98J4K7L0K4K2K1K0J4Lj7l7l9j8Jmk9m0l0j0KJ3K6L1K2NllkprojNJ2J6J0mj2j1kLLOJ2
5227a40J3JrqjNOJ0J5Qnj2%J2J0lqmlj4l0m0l8k3jJ4J5NOJ4K4K8L3L5K4Nj0j2j3j5rJ1K4P
5208g3k8m7l1ML4M1K7J1KJJloj3l0m8n0k5NJ8K0K9L8L1Lk4l0k1j0prj5j4qKmj8k4j2PJ3QL
5189b52JLPJ1Npj1LK0J8MkOJ6J1%kLOOOJ0Lk0m9n4l2%J4J2J0J3PkPL0M3K4lj0mloRL0L0%l3
5168a22m1k9j3lRJ5J1jqlQJ1jk1k6mK7M2K9J7K2L1K4jk2j8JK1K5J3Jmpj6l0l8l4k5qJ2L1L5
5150i0K2PKJj3l3l4j3J2K1J3LjKNMK%j3l7o2n6j5L5N3L2%j8j8j4j4j5j4lJ2K4K1Oj0k1k7k6
5132b70j2J1L2M1M2L6K5Oj1k1k4k5k5k1j0moj0qLJ2J3J3J6K2K7K8J9Jk7m5l8j2J0J2KJJ0J4
$$ plain form
5264 -194 -184 -185 -200 -226 -253 -267 -263 -249 -230 -210 -184 -147 -109 -87 -89 -99 -93 -66 -40 -31 -35 -41 -53 -81 -128 -180 -217 -231 -233 -237 -249 -263 -267 -268 -278 -293 -292 -264 -228 -207 -198
5246 -198 -184 -157 -127 -103 -81 -60 -40 -26 -23 -40 -77 -116 -134 -133 -137 -166 -206 -236 -246 -244 -231 -205 -174 -152 -147 -150 -153 -155 -162 -171 -177 -178 -173 -161 -145 -135 -139 -151 -162 -164 -161 -158 -152 -140
5227 -140 -127 -126 -135 -143 -144 -139 -133 -123 -108 -100 -105 -117 -117 -105 -95 -98 -106 -110 -113 -127 -157 -197 -235 -258 -259 -245 -230 -225 -219 -205 -181 -153 -120 -85 -61 -56 -66 -78 -91 -106 -115 -104 -80 -73
5208 -73 -101 -148 -179 -175 -141 -100 -73 -62 -60 -59 -58 -61 -67 -80 -110 -158 -208 -233 -228 -210 -190 -161 -123 -92 -89 -113 -143 -164 -174 -181 -190 -205 -219 -227 -225 -229 -247 -271 -283 -276 -263 -255 -252
5189 -252 -251 -248 -241 -230 -225 -232 -243 -240 -220 -202 -198 -200 -194 -178 -167 -167 -169 -166 -160 -154 -148 -138 -135 -155 -204 -258 -290 -290 -276 -264 -254 -241 -234 -236 -229 -199 -156 -132 -135 -145 -149 -152 -158 -149 -119 -89 -89 -122
5168 -122 -163 -192 -205 -208 -199 -184 -173 -174 -182 -185 -177 -166 -167 -188 -214 -218 -191 -149 -120 -103 -81 -50 -26 -27 -49 -67 -66 -45 -20 -7 -6 -10 -17 -33 -63 -101 -135 -160 -168 -156 -125 -90
5150 -90 -68 -61 -59 -58 -71 -104 -138 -151 -139 -118 -105 -102 -103 -101 -96 -92 -90 -90 -103 -140 -202 -258 -273 -238 -185 -153 -153 -171 -189 -203 -217 -232 -246 -249 -237 -213 -192 -186 -196 -217 -244 -270
5132 -270 -282 -271 -239 -198 -156 -120 -95 -89 -100 -121 -145 -170 -195 -216 -226 -230 -236 -246 -254 -251 -239 -226 -213 -197 -175 -148 -120 -101 -100 -127 -172 -210 -222 -212 -200 -198 -197 -187 -173
5115a73%k1l3l1k2j1MK1L7M0K7J0JJlj0j5j8k1k3nK6M4K4j0k8k1j1p%J2J7NmMK2K7J7Njkm
5097a30pj2j4mJ5K9K2%j5rPJ7J2kj4j3%J9K9K0pl4l9k1OJ7Oj5l1l7l0j0K0M1L6J2j0j0J0K8
5079a18K7J6J1J6J4Jj1q%nk3k9k0j2k0k8k2nQRQLoqRK9K9Lk3k8k4k1j9pJ6K6J3j3l0k4ML5
5061b27N0M1K0Mkmj2k0j4LJ5%l6n9n3k4%RMjlJOKrj7mK4M1L4Qj0rJJ0J5K2K7K3Lj9k4j4KN
5042a91kn%J1J8J5N%J0L2N4N7L9Kk7l8l2k5l0l5k4%K1K5K1J3MprLK0K2J1nj4j4qnj1k5k7p
5023a58J3Pj7k5mK5K9J2pj5j0loj8k8k0kROQJ5K0J0kkLNMMMLNJ4K2J4nk0k5k2j6mQJ3J0Nj
5004a42rj2j0j3k6l2k1LJ3RRK2L5L3K6K8L3K6J5J5K4K3nm3o5o4m8l0j2%OKlqj1j2mJ1J8Qj1
4986b22j3MJ5Jk4l3j6NJ5J1NNJ1J7J5Jj5j5KK2K6J6NQJ6J8Mj5j8%K3K6J0poJjj8m1n1m6k9
$$ plain form
5115 -173 -173 -194 -227 -258 -280 -291 -287 -266 -229 -189 -162 -152 -151 -150 -153 -163 -178 -196 -217 -240 -245 -219 -175 -151 -161 -189 -210 -221 -228 -228 -216 -199 -194 -198 -194 -172 -145 -128 -123 -124 -126 -130
5097 -130 -137 -149 -163 -167 -152 -123 -101 -101 -116 -125 -118 -101 -89 -91 -105 -118 -118 -99 -70 -50 -57 -91 -130 -151 -145 -128 -122 -137 -168 -205 -235 -245 -225 -184 -148 -136 -146 -156 -146 -118
5079 -118 -91 -75 -64 -48 -34 -33 -44 -52 -52 -57 -80 -109 -129 -141 -161 -189 -211 -216 -208 -199 -191 -188 -194 -202 -193 -164 -135 -132 -155 -183 -207 -228 -247 -254 -238 -212 -199 -212 -242 -266 -262 -227
5061 -227 -177 -136 -116 -112 -114 -118 -130 -150 -164 -161 -146 -146 -182 -241 -294 -318 -318 -309 -305 -306 -309 -308 -302 -300 -309 -326 -330 -306 -265 -231 -223 -233 -242 -241 -231 -216 -194 -167 -144 -141 -160 -184 -198 -196 -191
5042 -191 -193 -198 -198 -187 -169 -154 -149 -149 -139 -107 -53 4 43 45 18 -20 -52 -77 -107 -142 -166 -166 -145 -120 -99 -86 -82 -89 -98 -95 -75 -53 -42 -47 -61 -75 -83 -88 -99 -124 -151 -158
5023 -158 -145 -138 -155 -180 -184 -159 -130 -118 -125 -140 -150 -153 -159 -177 -205 -225 -227 -218 -212 -204 -189 -169 -159 -161 -163 -160 -155 -151 -147 -143 -140 -135 -121 -99 -85 -90 -110 -135 -157 -173 -177 -169 -156 -146 -141 -142
5004 -142 -151 -163 -173 -186 -212 -244 -265 -262 -249 -240 -231 -209 -174 -141 -115 -87 -54 -28 -13 2 26 49 44 1 -64 -128 -176 -206 -218 -218 -212 -210 -213 -221 -232 -244 -248 -237 -219 -211 -222
4986 -222 -235 -231 -216 -215 -239 -272 -288 -283 -268 -257 -252 -247 -236 -219 -204 -203 -218 -233 -231 -209 -183 -167 -162 -154 -138 -120 -116 -131 -149 -149 -126 -100 -90 -97 -103 -102 -103 -121 -162 -213 -259 -288
4968b88pJ6K6K2J5K0L1K8Kk8k7%K4K2Jk1l3m1l8k5oJ2K6L7L6K8K5K5J1k0m0k7nnk5k6LL6M8
4951a68M2L3J5j8m8n2l1%K1K7J9NkmnkJ2K9K6kl1l2j0J8L8M2K6Kj0l%j6k6j3J1J2rk5k4j9
4933a72j5qmqj3JK5L4J5jJQ%j3j0J0K5K4Rj1k6k3kJ6J2%npj8l3k7NK7K0lpQJ7QlLJ9K6K2J3
4914f1J2J2QJl%LKpk8m9n4l5rLNJ3K9L5K3J0RK0K9L6M1L2Mk6m1l2j6%J4K1J5kj4j0klj2k1
4895d8k1k2k8l5l1j1J9M2M9M8M7M0J7k0m3l6k0j7k4k2jK1K0jk5m3m1j5K3M0L0J3PJ0NJPRq
4878f4l1k9j3j2k6k1J4M8N2L6K7K2J6Krk0k8k6j8j1mJ3L1L8L1K5J5lnJ8L9K6RK4M8M1K4O0
4862C39J19J41J51K23L36M40O65J152J634J495N01p39j388j276r00o67n27l42k00j94k15j47
4852F01o2m7n3j4J9%j0K7L3k2m3J7N8J7j8RK7KK2J08J30M4jP0J16Q2J09K43L14L12M89Q88
$$ plain form
4968 -288 -295 -279 -253 -231 -216 -196 -165 -137 -135 -163 -190 -190 -166 -144 -143 -164 -197 -238 -276 -301 -307 -295 -269 -232 -196 -168 -143 -118 -107 -127 -167 -194 -199 -204 -229 -255 -252 -216 -168
4951 -168 -126 -93 -78 -96 -144 -196 -227 -227 -206 -179 -160 -155 -157 -161 -166 -168 -156 -127 -101 -103 -134 -166 -176 -158 -120 -78 -52 -50 -60 -63 -63 -79 -105 -118 -107 -95 -104 -129 -153 -172
4933 -172 -187 -195 -199 -207 -220 -219 -194 -160 -145 -146 -145 -137 -137 -150 -160 -150 -125 -101 -92 -103 -129 -152 -154 -138 -126 -126 -131 -138 -156 -189 -216 -211 -184 -164 -167 -174 -166 -149 -141 -144 -141 -122 -96 -74 -61
4914 -61 -49 -37 -29 -28 -31 -31 -28 -26 -33 -61 -110 -164 -199 -208 -205 -200 -187 -158 -123 -100 -90 -81 -61 -32 4 45 77 81 55 14 -18 -34 -34 -20 1 16 14 0 -10 -12 -15 -27 -48
4895 -48 -69 -91 -119 -154 -185 -196 -177 -135 -86 -38 9 49 66 46 3 -33 -53 -70 -94 -116 -117 -96 -76 -77 -102 -145 -186 -201 -178 -138 -108 -95 -88 -78 -73 -72 -65 -56 -64
4878 -64 -95 -124 -137 -149 -175 -196 -182 -134 -82 -46 -19 3 19 21 12 -8 -36 -62 -80 -91 -95 -82 -51 -13 18 43 58 55 50 68 107 133 142 166 214 255 279 339
4862 339 458 599 750 973 1309 1749 2414 3566 5200 6695 7196 6457 5069 3793 2893 2226 1699 1357 1157 963 748 601
4852 601 539 492 439 425 444 444 434 461 494 472 429 446 504 521 503 512 539 541 563 671 801 845 844 914 1030 1112 1221 1464 1778 2090 2579 3467
4838C467J242J671K781M411M919K850r13l754m189l152k228j771j297p59n09n05l99j97j50
4830A518k18j72n3n9j23n9M8Rp7j6R4N5l0L4J44J14P3J86K73J35j1R7K65K28J94M24O57O48
4818D378Q06J493K275K932M508P594R879P737R67n973q692p334n097l828k982j953j210j033
4810D467q97n11k64l38l54j51o0j88k01j4M2j03j12O7R7o9q6R7J41PL9K38K35L8N6K82L02
4798B760J61L37P52Q75Q67J429K421L173M346P375J1062J1043M800m211r810r775p076n028
4791A5501l929k782j715j317j248q91m62m07m92l08p3j32k61j42J5o5j64l1J04lj05L3J55
4781A281L4o4Q7K13Q8J1K03L41K09J93N18P47O62Q42J615K409L150N074Q427J0288P157k31
4771D3254o864q867p162m992l780k869j862j245j115r41n62l60m14l71j63q6j77j64k4lr9
$$ plain form
4838 3467 4709 6380 9161 13572 18491 21341 20428 16674 12485 9333 7105 5334 4037 3278 2769 2264 1865 1668 1518
4830 1518 1300 1128 1075 1016 893 834 882 891 814 798 892 947 917 951 1095 1209 1282 1468 1741 1876 1865 1962 2227 2455 2649 3073 3730 4378
4818 4378 5184 6677 8952 11884 16392 23986 33865 41602 42569 36596 27904 20570 15473 11645 8663 6710 5500 4467
4810 4467 3570 3059 2795 2457 2103 1952 1892 1704 1503 1489 1531 1428 1316 1383 1480 1411 1325 1422 1563 1570 1609 1847 2082 2120 2176 2458 2760
4798 2760 2921 3258 4010 4885 5752 7181 9602 12775 17121 24496 35558 46601 51401 47190 37380 27605 20529 15501
4791 15501 11572 8790 7075 5758 4510 3619 3157 2750 2258 1950 1877 1745 1484 1342 1357 1292 1128 1097 1201 1198 1093 1126 1281
4781 1281 1315 1251 1338 1551 1639 1650 1853 2194 2403 2596 3114 3861 4523 5365 6980 9389 12539 17613 26040 36328 43485 43254
4771 43254 36390 27523 20361 15369 11589 8720 6858 5613 4498 3557 2995 2635 2221 1850 1687 1601 1424 1260 1236 1233 1134
4762A134p5N4M4q8j00Klr4n2Q7R6PM2J58J38N3J42L25L51L59O63J113J426K013L454M970M593
4750B0812J574k241m301m045k889k076j604j110p03n68n27l69k02j71j74r9k8n9j06p9m6o9
4741I20q4l4Nj6l6j3rn2o8l0j7n1n4lJ6j7mP8J22R9J40K89M32N84R52J500J679J004k46j221
4728E865j428j124q00o13m50k82j84j63j39r3p1p3o2l8m2p2q5o1k3MJ6J1qk0j4jjj1j2mkj1
4714Ij4qJ4M1M6J4l1m6j6J5J3pqOQoj6j9l2m6m2j4J4K3J3kj3j4JJ8J8Mj0j2qpOL1M6L2Lj2
4696hj5k2l7m4k6PL0L6L7L4J9mk2k6j9j4qLJ6J4mk0k5k0j3lOMj2k6k5j4j0j6k3k2j9k3k8j9
4678c61NL1M2L4K5L0N0N8M0J2JJ6K4Rj8k8j0R%k7m3l1%K8L4K1qm1o1n9l5oJ9L8M9M7K7Jj2
4661i0j3j3j8k1j5j3k0k4pK1L5K3MjPJ0Jj1j2%J3J2lj8k0j5j7k9l7k9pJ7K7J9J1J6L1L3J4
$$ plain form
4762 1134 1059 1113 1157 1069 969 971 968 874 822 909 1005 1012 1054 1212 1350 1403 1545 1870 2221 2580 3243 4356 5782 7795 11249 16219 20812
4750 20812 22386 20145 15844 11799 8910 6834 5230 4120 3417 2849 2322 1953 1751 1580 1406 1307 1279 1220 1114 1035 989 920
4741 920 836 802 807 791 755 742 733 681 613 583 566 515 461 458 474 457 453 531 653 752 892 1181 1613 2197 3149 4649 6328 7332 7086 5865
4728 5865 4437 3313 2513 1900 1450 1168 984 821 682 589 518 445 383 345 303 231 146 85 62 66 82 93 85 65 51 50 49 38 26 22 20 9
4714 9 -5 -13 1 42 88 102 71 25 9 24 37 30 22 28 36 30 14 -5 -37 -83 -125 -139 -125 -102 -89 -91 -104 -118 -117 -99 -81 -77 -87 -99 -107 -114 -108 -77 -31 1 4 -8
4696 -8 -23 -45 -82 -126 -152 -145 -115 -79 -42 -8 11 7 -15 -41 -60 -74 -82 -79 -63 -49 -53 -73 -98 -118 -131 -134 -128 -124 -136 -162 -187 -201 -211 -227 -250 -272 -291 -314 -342 -361
4678 -361 -356 -325 -283 -249 -224 -194 -144 -86 -46 -34 -33 -17 7 16 -2 -30 -40 -31 -31 -58 -101 -132 -132 -104 -70 -49 -57 -98 -159 -218 -253 -259 -240 -202 -153 -106 -79 -78 -90
4661 -90 -103 -116 -134 -155 -170 -183 -203 -227 -234 -213 -178 -155 -151 -152 -145 -135 -134 -145 -157 -157 -144 -132 -135 -153 -173 -188 -205 -234 -271 -300 -307 -290 -263 -244 -233 -217 -186 -153 -139
4645a39rj4nnj8l1l1k4j3%J3J0qj8lK1K8J0oqPJ8J9Jk8n0m7l1j9j5pJ4L4L5K3QNJ1K7L8L6
4627a71K5K1J9Oj9l4j8J6L2J8j2l2l1j8%J0J0OOPMJ%%%QJ9K7J9Olnnp%RJ4J0PJ0J3Pmj3k2
4607f4k4k0j0nmlJKnr%J4K2J8J0Nnj2j4oKQJ3K4K9K1%j7j9pNMkolLQNnk2l5l5k1oMNKmkJ0
4586a50J7Jk4l1j3N%rOL4L7Ml1l8k0jPNoj8k3j7qmjKjqoJ2L1L0J1pj0kJ1K4L1K9K1K0J9J5
4567e6Jrj7k6l6l3j9JJ2J7J9J8J3J2J6J1mj9k3j8j1kJ5K6K3J0M%j1k7k4jJ6Rrj5j2j0j1lR
4549a64Pj2l0k5mJ6J9Rkj0j3k2l1l4j5J5L7M1L4K3Oj5l2m0l9l7k5JK6L4K6J9K0J9J0lplJl
4531b03ppmnrjK0M2L3ml6l4j0%qj7j4pkRK6L5K7K0J8J1j0k8k1OK6K8J9RjrpmoqlPOj1k4k2
4512a80rJjj0k2k5j9qJJ3K8L8L4J7MKkj0k1k5j5MK9L7J5k1m0k3QK3J6LkJOMnj3j3kJ7L6N1
$$ plain form
4645 -139 -148 -162 -167 -172 -190 -221 -252 -276 -289 -289 -276 -266 -274 -292 -295 -274 -246 -236 -242 -250 -243 -225 -206 -205 -233 -283 -330 -361 -380 -395 -402 -388 -354 -319 -296 -288 -283 -272 -245 -207 -171
4627 -171 -146 -125 -106 -100 -119 -153 -171 -155 -123 -105 -117 -149 -180 -198 -198 -188 -178 -172 -166 -159 -155 -154 -154 -154 -154 -146 -127 -100 -81 -75 -78 -83 -88 -95 -95 -86 -72 -62 -55 -45 -32 -25 -29 -42 -64
4607 -64 -88 -108 -118 -123 -127 -130 -129 -127 -132 -141 -141 -127 -105 -87 -77 -72 -77 -89 -103 -109 -107 -99 -86 -62 -33 -12 -12 -29 -48 -55 -50 -46 -48 -54 -57 -54 -46 -41 -46 -68 -103 -138 -159 -165 -161 -156 -154 -158 -160 -150
4586 -150 -133 -132 -156 -187 -200 -195 -195 -204 -198 -164 -127 -123 -154 -192 -212 -213 -206 -201 -207 -225 -248 -265 -273 -277 -278 -276 -277 -285 -291 -279 -248 -218 -207 -214 -224 -226 -215 -191 -160 -131 -110 -90 -71 -56
4567 -56 -55 -64 -81 -107 -143 -176 -195 -194 -182 -165 -146 -128 -115 -103 -87 -76 -80 -99 -122 -140 -151 -153 -138 -112 -89 -79 -75 -75 -86 -113 -137 -138 -122 -113 -122 -137 -149 -159 -170 -173 -164
4549 -164 -157 -169 -199 -224 -228 -212 -193 -184 -186 -196 -209 -231 -262 -296 -311 -296 -259 -218 -184 -161 -155 -170 -202 -242 -281 -318 -343 -342 -316 -282 -256 -237 -217 -198 -188 -191 -198 -201 -200 -203
4531 -203 -210 -217 -221 -226 -235 -236 -216 -174 -141 -145 -181 -215 -225 -225 -233 -250 -264 -271 -273 -264 -238 -203 -176 -156 -138 -127 -137 -165 -186 -180 -154 -126 -107 -98 -99 -108 -115 -119 -125 -133 -136 -129 -123 -134 -158 -180
4512 -180 -189 -188 -189 -199 -221 -246 -265 -273 -272 -259 -231 -193 -159 -142 -138 -136 -138 -148 -169 -194 -209 -205 -176 -139 -124 -145 -185 -208 -200 -177 -161 -158 -160 -159 -153 -149 -154 -167 -180 -182 -165 -129 -78
4493g8M7K5lj1%J1Mrj2j3k0l2l4k1mJ6L2L0J1rj0qk1l7k7QK9J8LJ0K1J4j0k0j0jqk1k1j0L
4475a68QLklLN%lJJ6K7K3Rmoj%k%Mmj9k7j3PJ0mj1jQ%j2j5j1j4k1k0pNQPPJ0J3J2J1J1J4J2
4454a34lk4l5k0JQJkRK0J9Mrj5j3j1j1k0k8k5j1LJ6K6M1M8M2K0Kqj0j5k2k5j3MPnj6mJ7K0
4436a71LqLJ4Jk3k5mJ4J1NRJ3OkQK6K9J5Joj6k8l0j7mLQJ8K3K1J5J4Qj1k5j6RK6K5K2K0Ol1
4417d1n8m7oK5K6Qrj8k5k7k2jK8N2N4K9kj4j0j0k3l1j9jKj2j8kK4L9L5J9Kqrnoj8l4m0l0j1
4398b14PJ7J9J1JnJJ1K1L1L8L1Nk5l8l3k2j6j5k0k9k5KL6M3J0l0m3k6KK2K8J9lj5kK2K3ll4
4381a98m4k8oJ4K9M2M3K9PlJ0K7K4%k2k4j9k5l0j8QK4K0J0Jrj7j0OJ2%j1j0nmOK9M2K2j3l0
4363a21j9JJ6K9L5K8Kk4l8l5k6j3lNJ7L3M2K5ok9k4j1j0k2k6j8j2j9l4l6j5J7M1M6L4J7Jj2
$$ plain form
4493 -78 -31 -6 -9 -20 -20 -9 -5 -14 -26 -39 -59 -91 -125 -146 -150 -134 -102 -72 -61 -70 -80 -88 -109 -146 -173 -165 -136 -118 -115 -105 -84 -70 -80 -100 -110 -111 -119 -140 -161 -171 -168
4475 -168 -160 -157 -159 -162 -159 -154 -154 -157 -156 -140 -113 -90 -81 -85 -91 -92 -92 -94 -94 -90 -94 -113 -140 -153 -146 -136 -140 -151 -152 -144 -144 -156 -171 -182 -196 -217 -237 -244 -239 -231 -224 -217 -207 -194 -182 -171 -160 -146 -134
4454 -134 -137 -161 -196 -216 -215 -207 -206 -208 -199 -179 -160 -156 -165 -180 -193 -204 -215 -235 -263 -288 -299 -296 -280 -254 -213 -165 -123 -103 -101 -109 -119 -134 -156 -181 -194 -190 -183 -188 -204 -208 -191 -171
4436 -171 -168 -176 -173 -159 -158 -181 -206 -210 -196 -185 -180 -171 -158 -152 -154 -146 -120 -91 -76 -75 -81 -97 -125 -155 -172 -176 -173 -165 -147 -124 -103 -88 -74 -66 -77 -102 -118 -109 -83 -58 -36 -16 -10 -41
4417 -41 -99 -146 -152 -127 -101 -93 -102 -120 -145 -172 -194 -195 -167 -115 -61 -32 -34 -48 -58 -68 -91 -122 -141 -142 -140 -152 -170 -172 -148 -109 -74 -55 -53 -61 -70 -75 -81 -99 -133 -173 -203 -214
4398 -214 -207 -190 -171 -160 -159 -164 -163 -152 -131 -100 -62 -31 -26 -51 -89 -122 -144 -160 -175 -195 -224 -249 -247 -211 -168 -158 -188 -231 -257 -255 -233 -205 -186 -189 -204 -206 -184 -161 -164 -198
4381 -198 -242 -270 -276 -262 -233 -191 -148 -119 -112 -115 -105 -78 -54 -54 -76 -100 -119 -144 -174 -192 -184 -160 -140 -130 -129 -138 -155 -165 -159 -147 -147 -158 -168 -173 -177 -171 -142 -100 -78 -91 -121
4363 -121 -140 -139 -123 -94 -59 -31 -29 -53 -91 -126 -152 -165 -168 -163 -146 -113 -71 -46 -52 -81 -105 -116 -126 -148 -174 -192 -204 -223 -257 -293 -308 -291 -250 -204 -170 -153 -152 -164
4347a64j8j0OK2K6J7QMRJ6K1J4jj6j9j5j5k5l0j6J0K0Pj2j5JJ3Rlqm%Knj7j5NL3L8J6mMK6
4328h5K7kl5m6l6k3j3%J1J7K1K3K1J1mj4j1MK1K1jl1m3l0oKloJQONJ5L2L8K5J1OJ2J1lk7m2
4310a12m0k0RK7K2%k4l2k3j1mKMkj9l0j9J1L4L3K0J1J2J4QKKJlpnMMj1l1l4j5J1J8Kj4j1J2
4291b04K9K3Nnmnj6l1l5k4rlorpNJ9K7K5K0J5J3J9K6K5Nk7m6l7j4%%oqJJ5K7K2Mj1pJ0K5K7
4272a27K0Rmj7k1k0j9j2KJ1Jk5m1k8kJ5J5J3K1L8N1N6M8K9Nj8l5l5j9opj5k1k5l4m3l7j5R
4255b83K5L9M5L2Oj2rKOOQMj1k3j6MJ4J2RRLopMJ8J8Orj8k0j5rmMJ2J3Lpj0o%LPMj3l4l6j5
4234b47J4L0L4L0K5J7Qkj2j2%J2Rqj9j4KRkk2k8j7PK4K9K2Rqk2k1p%pj6j0nj5l3k7QL9M1K1
4215a64lj4j3LJ5Ll0m8l1LK2K0J1OKLQJ0POJ3J8J2LQK0K1RMOLj4l1l2k4j9j8j5qpojQJ4J3
$$ plain form
4347 -164 -182 -192 -186 -164 -138 -121 -113 -109 -100 -84 -63 -49 -50 -66 -85 -100 -115 -140 -170 -186 -176 -156 -149 -161 -176 -175 -162 -153 -156 -164 -168 -168 -166 -171 -188 -203 -198 -165 -127 -111 -115 -111 -85
4328 -85 -58 -60 -95 -141 -177 -200 -213 -213 -202 -185 -164 -141 -120 -109 -113 -127 -138 -134 -113 -92 -93 -124 -167 -197 -203 -201 -204 -210 -209 -201 -195 -190 -175 -143 -105 -80 -69 -63 -51 -40 -43 -70 -112
4310 -112 -152 -172 -163 -136 -114 -114 -138 -170 -193 -204 -208 -206 -202 -204 -223 -253 -272 -261 -227 -194 -174 -163 -151 -137 -129 -127 -125 -124 -127 -134 -139 -135 -131 -142 -173 -207 -222 -211 -193 -191 -205 -216 -204
4291 -204 -175 -152 -147 -152 -156 -161 -177 -208 -243 -267 -276 -279 -285 -294 -301 -296 -277 -250 -225 -205 -190 -177 -158 -132 -107 -102 -129 -175 -212 -226 -226 -226 -232 -240 -239 -224 -197 -175 -171 -182 -189 -179 -154 -127
4272 -127 -107 -98 -102 -119 -140 -160 -179 -191 -189 -178 -177 -202 -243 -271 -273 -258 -243 -230 -209 -171 -120 -64 -16 13 18 0 -35 -70 -89 -95 -102 -117 -138 -163 -197 -240 -277 -292 -283
4255 -283 -258 -219 -174 -142 -136 -148 -157 -155 -149 -143 -135 -131 -142 -165 -181 -177 -163 -151 -142 -133 -130 -136 -143 -139 -121 -103 -97 -106 -124 -144 -159 -168 -172 -168 -156 -143 -140 -147 -157 -163 -163 -160 -153 -149 -162 -196 -232 -247
4234 -247 -233 -203 -169 -139 -114 -97 -89 -91 -103 -115 -115 -103 -94 -102 -121 -135 -133 -124 -126 -148 -176 -193 -186 -162 -133 -111 -102 -110 -132 -153 -160 -160 -167 -183 -193 -198 -213 -246 -273 -265 -226 -185 -164
4215 -164 -167 -181 -194 -191 -176 -173 -203 -251 -282 -279 -257 -237 -226 -220 -218 -215 -207 -197 -190 -184 -171 -153 -141 -138 -130 -110 -89 -80 -76 -70 -67 -81 -112 -144 -168 -187 -205 -220 -228 -235 -241 -242 -234 -220 -207
4196b07Lop%QPlj2j1lRJ7J6Lj0j0nj5l4l6j3J2J2JLK0K3Lj4rJ5L1L1K5J6Ojmqk0l0k1PK9K6
4176a56J1RJ5J2rk9k5jK3L7M0M0L6K9J3j0l2l4k5j5k0l1l1k0j2j5j1J1L2K5rl1j7J9L6K1j
4160a25kJ5K3J0oj3rqqnjpk1k7j9nmj3j9j1MJ9K6K1J0lqjJoj4j2l%jRL3M9L8J1j0k0k8k7j5
4141a82JOJLJ4J2oj9j0LLqj0mljJ2K7K2Kj5j7j4rjJ0J2%j4k2k4j7%K3L0K0J1J7K3J4qk6l1
4122a75l3l5l4l1k5j5LJ9K3J7J6K4K7K3J6J4J3Lj2j4jJ2Pj4l2l4k3j4j5k4l1k5pJ7L1L0K4
4106b75J9J6J0PJ3K4K1Nj5k3j7pKNKLJ6K6J7j1k9j9OK6L6M1L7K0ok9l8l6l1k6j7jK1L7L8K6
4089a06K0K0J2j0l2l4k8l2m2l6j0J2K0K4L4M0L3J8J1Qnk9m8m6k7pKjorj1j1pPK5L7M1L7K1
4072a15ol2m3m2l8l1k0mNPPOORJ9K5J2j0k0nJ3J9J7J5K0J8Oj2k5k1mRPkKJ2Pj5k7j1J7K8J8
$$ plain form
4196 -207 -204 -210 -217 -217 -209 -202 -205 -217 -228 -231 -222 -205 -189 -186 -196 -206 -211 -226 -260 -296 -309 -297 -285 -284 -281 -261 -238 -235 -249 -258 -243 -212 -181 -156 -140 -134 -135 -139 -147 -167 -197 -218 -211 -182 -156
4176 -156 -145 -136 -121 -109 -118 -147 -172 -173 -150 -113 -73 -33 3 32 45 35 3 -31 -56 -71 -91 -122 -153 -173 -185 -200 -211 -200 -168 -143 -152 -183 -200 -181 -145 -124 -125
4160 -125 -127 -112 -89 -79 -85 -98 -107 -115 -123 -128 -129 -136 -157 -184 -203 -208 -212 -225 -244 -255 -251 -232 -206 -185 -175 -178 -186 -187 -186 -192 -206 -218 -221 -221 -222 -213 -180 -131 -93 -82 -92 -112 -140 -167 -182
4141 -182 -181 -175 -174 -171 -157 -145 -151 -170 -180 -177 -174 -182 -192 -196 -199 -200 -188 -161 -139 -137 -152 -169 -183 -192 -193 -183 -171 -171 -185 -207 -231 -248 -248 -225 -195 -175 -164 -147 -124 -110 -118 -144 -175
4122 -175 -208 -243 -277 -308 -333 -348 -345 -326 -303 -286 -270 -246 -219 -196 -180 -166 -153 -150 -162 -176 -177 -165 -158 -172 -204 -238 -261 -275 -290 -314 -345 -370 -377 -360 -329 -299 -275
4106 -275 -256 -240 -230 -223 -210 -186 -165 -160 -175 -198 -215 -222 -220 -215 -213 -210 -194 -168 -151 -162 -191 -210 -204 -178 -142 -101 -64 -44 -50 -79 -117 -153 -184 -210 -227 -228 -207 -170 -132 -106
4089 -106 -86 -66 -54 -64 -96 -130 -158 -190 -232 -268 -278 -266 -246 -222 -188 -148 -115 -97 -86 -78 -83 -112 -160 -206 -233 -240 -238 -239 -245 -254 -265 -276 -283 -276 -251 -214 -173 -136 -115
4072 -115 -121 -153 -196 -238 -276 -307 -327 -331 -326 -319 -312 -306 -300 -291 -272 -247 -235 -245 -265 -270 -257 -238 -221 -206 -186 -168 -162 -174 -199 -220 -224 -215 -208 -210 -208 -196 -189 -204 -231 -242 -225 -197 -179
4053a79OPJ2J2Pnj6j5%J7K2J2Krk3l7l8k1%Pjj2j9j7mJ3K4K3J8J5J4RKQK8M4L2om4n7m7k8
4035b44j0J4L6M4K4kj7j8j7k2j9nJ1K1K7L0K3Oj4j9nJ9L9M0K5Kj6k1j0PJ5Qnj2rj2k4k9j3
4018a52J3K7J9PKJlj6l1l8k6MK6K4PKJ0J1mj9k2j5j0mJ0K5L6L9L4Rk6m3k8%Pqk2k0pQK5L7
4000a11L5J4pk0k4k5k2j2lLLjKJ6K5J0k6m8l4p%rj2kKpj0JNrk8l1j8mJ1K4K8K0K2M4N8L8%
3981a09j6JJ3jk2k8k0k0k4j3J3L3L4K5J7J1Lpj2pPJ8J9Pmplmj0j0OK6L2J6qj6pOKrj3mMpk5
3962a13l3k0%J7K1J9J2PPQMLJ0K1K1J0mj1k2l8m7l3jK7L8L6K3Mj5j7LK6K3ml7n0l8j1J6K8
3945a10J7lj6j2ooo%Llj0mJ8K8J6pj4m%j1l0m0k9rRJ5J1OOJ8K7K3NkQK4K3Lj3j5j6k3k7j0
3925a66J0J1pj4OL0L0J9K0L6L6J0k4l9l2k3k4k5j8plnnJJ2K3K5J5ql2m4m0k4j0JJ0J7K4K7
$$ plain form
4053 -179 -173 -166 -154 -142 -135 -140 -156 -171 -171 -154 -132 -120 -118 -127 -150 -187 -225 -246 -246 -239 -240 -252 -271 -288 -292 -279 -255 -232 -214 -199 -185 -176 -174 -166 -138 -94 -62 -68 -112 -169 -216 -244
4035 -244 -254 -240 -204 -160 -136 -138 -155 -173 -190 -212 -231 -236 -225 -204 -177 -147 -124 -118 -132 -151 -156 -137 -98 -58 -33 -31 -47 -68 -78 -71 -56 -48 -53 -65 -74 -86 -110 -139 -152
4018 -152 -139 -112 -93 -86 -84 -83 -86 -102 -133 -171 -197 -193 -167 -143 -136 -134 -124 -113 -117 -136 -158 -173 -183 -187 -177 -152 -116 -77 -43 -34 -60 -103 -131 -131 -124 -132 -154 -174 -181 -173 -148 -111
4000 -111 -76 -62 -69 -89 -113 -138 -160 -172 -175 -172 -169 -170 -168 -152 -127 -117 -143 -191 -225 -232 -232 -241 -253 -255 -253 -260 -270 -269 -264 -273 -301 -332 -350 -354 -343 -319 -291 -271 -249 -205 -147 -109 -109
3981 -109 -125 -124 -111 -112 -134 -162 -182 -202 -226 -239 -226 -193 -159 -134 -117 -106 -103 -110 -122 -129 -122 -104 -85 -78 -82 -89 -92 -96 -106 -116 -110 -84 -52 -36 -44 -60 -67 -61 -59 -68 -81 -85 -81 -88 -113
3962 -113 -146 -166 -166 -149 -128 -109 -97 -90 -83 -75 -71 -68 -58 -37 -16 -6 -10 -21 -43 -81 -128 -161 -162 -135 -97 -61 -38 -34 -49 -66 -63 -37 -14 -18 -55 -105 -143 -154 -138 -110
3945 -110 -93 -96 -112 -124 -130 -136 -142 -142 -139 -142 -152 -156 -138 -110 -94 -101 -115 -119 -119 -130 -160 -200 -229 -238 -229 -214 -203 -197 -191 -173 -146 -123 -118 -120 -112 -88 -65 -62 -75 -90 -106 -129 -156 -166
3925 -166 -156 -145 -152 -166 -160 -130 -100 -81 -61 -25 11 21 -3 -42 -74 -97 -121 -146 -164 -171 -174 -179 -184 -183 -171 -148 -123 -108 -116 -148 -192 -232 -256 -266 -265 -255 -238 -214 -187
3909a87K5J6Mpj3pQK3K5Qj3j3RL0K4ok9k4mO%j0j5j7j7j1LJ6J4JkJ1L1L4J9Lloj4k3k7k5k8
3890a91k4rJ0J3NOJ6J3oj9j0lj8l8l2JK6L0K8K5J5kqPK3K1J3J1Pqk6k4qNJrj1KK1L3L0J8O
3871f0nl2p0r1p3k9J4L9N1M6K1j0k5j8pKJ3K7K8J3Jnj1k1j7RK9J8j6l8l5j9kJ4K4J6mj0NK5
3854b03K7J2j%LMNRRnk6l9l2j6jOQJ0J7K3J9Jj9k6j5loj8k5j7mJjlKJ3J8J5Lpj0j0j5j8qJ6
3834c07L8M7M5L4J6knJ0L0L2K1Kj7l1l3k6k8m5n9l8J0N2O4N0L1J6Nnj1j0kRJ0ol2m4k8kRl
3817b03k4l0j7OJ5J2PJ3K2J9PjKNKLJ1J7RjPK6L2J2j2j7j0j2k2k0jRql1l2j2kj2k6k5j7j4
3798c13j8j6mJ1K6L2K3Jj0%J9K5J1ooJMJmpkPRJj2j5j1qoRL3M4K5j3l3k3kR%j6k5j8kJ2J6
3779b51J4J3QJJJ4L2L7J8rk6k2qRK2K8K8J6jj1j1mlrj1nMMLKNOOJ1K0K3J3ok3l2l3l5l0j5
$$ plain form
3909 -187 -162 -146 -142 -149 -162 -169 -161 -138 -113 -105 -118 -131 -122 -92 -68 -74 -103 -127 -131 -125 -125 -135 -150 -167 -184 -195 -192 -176 -162 -161 -163 -152 -121 -87 -68 -65 -68 -74 -88 -111 -138 -163 -191
3890 -191 -215 -224 -214 -201 -196 -190 -174 -161 -167 -186 -196 -199 -217 -255 -287 -286 -260 -230 -202 -177 -162 -164 -172 -165 -142 -121 -108 -97 -90 -98 -124 -148 -156 -151 -150 -159 -170 -168 -147 -114 -84 -66 -60
3871 -60 -65 -97 -167 -258 -331 -360 -346 -307 -256 -210 -189 -199 -224 -242 -249 -247 -234 -207 -179 -166 -165 -170 -181 -202 -219 -210 -181 -163 -179 -217 -252 -271 -273 -259 -235 -219 -223 -233 -228 -203
3854 -203 -176 -164 -165 -165 -162 -158 -153 -144 -135 -140 -166 -205 -237 -253 -254 -248 -240 -230 -213 -190 -171 -170 -189 -215 -230 -233 -239 -257 -282 -299 -303 -302 -303 -306 -304 -291 -273 -258 -255 -262 -272 -282 -297 -315 -323 -307
3834 -307 -269 -222 -177 -143 -127 -129 -134 -124 -94 -62 -41 -39 -56 -87 -120 -146 -174 -219 -278 -316 -306 -254 -190 -140 -109 -93 -88 -93 -104 -114 -116 -107 -97 -103 -135 -179 -207 -209 -200 -203
3817 -203 -227 -257 -274 -268 -253 -241 -234 -221 -199 -180 -173 -174 -172 -167 -165 -162 -151 -134 -125 -126 -119 -93 -61 -49 -61 -78 -88 -100 -122 -142 -143 -134 -142 -173 -205 -217 -219 -231 -257 -282 -299 -313
3798 -313 -331 -347 -351 -340 -314 -282 -259 -258 -268 -268 -249 -224 -213 -219 -225 -224 -220 -219 -223 -230 -232 -225 -216 -215 -227 -242 -253 -261 -267 -258 -225 -181 -156 -169 -202 -225 -227 -218 -218 -234 -259 -277 -279 -267 -251
3779 -251 -237 -224 -216 -215 -214 -200 -168 -131 -113 -122 -148 -170 -178 -169 -147 -119 -91 -75 -76 -87 -98 -102 -105 -114 -125 -130 -126 -122 -119 -117 -112 -106 -100 -89 -69 -46 -33 -39 -62 -94 -127 -162 -192 -207
3760b07OK1K1J0LNO%mjJ1K0J7jj8k8k6k0j0OJ9J7lk1j2J1J5nj8pJ3J7PLJ3K2K6K4J7Lj7k6
3742i1k3j4j0j2j6k1k0qJ1K0K1K4K7J9ok5k7j3kJMNkj3j9j5qKJ3L0M1L6J7Jj0j7k9l4j5J9
3724a59M2L1Lj5k5l2l3j3J4K4Oj3j4kNNNLnj0mKJkKMpj2OL1L7K3K3M4N2L0jj0knk3l3l2k9
3705h8l6m3l6k2j1mJ1K8L3K0%pOJ7Mk9n1m3k0nKJ2K8L5K8K1J6Jk9m3k2J8L5J9LLJk1m2l2J0
3687b33M8M7J3k4l3j0K0L2J5qj6j2qj1qMK4L6L3J7ok3k4j4oJJ0J5J1J%J0J3%j1qNJ0LmmOJ5
3669g4J7Qoj0mPQJj4k7l7l4k1j4j4pJ6L3K9Onnrj8j5J2M2M9M1K7J1j4m2n4m4k3lJ2J6OopL
3650a63J0KrnJ2J9Nj3j3J1L0K4jj5j1lpj1oJkj3j3JRkk2l2k1NL1M1L2J9J3J5J0pk7l5l3k6
3632b00j7pMK0M2O1N6K6j0k8l1l1l8l8l1k1j0jPOlj2j3j1pKJ1J2KmJ3L7M9M4L2K5J3%qjON
$$ plain form
3760 -207 -201 -180 -159 -149 -146 -141 -135 -135 -139 -140 -129 -109 -92 -93 -111 -139 -165 -185 -195 -189 -170 -153 -156 -177 -189 -178 -163 -168 -186 -193 -180 -163 -156 -153 -140 -118 -92 -68 -51 -48 -65 -91
3742 -91 -114 -128 -138 -150 -166 -187 -207 -215 -204 -184 -163 -139 -112 -93 -99 -124 -151 -164 -166 -165 -161 -156 -158 -171 -190 -205 -213 -211 -198 -168 -127 -91 -74 -73 -83 -100 -129 -163 -178 -159
3724 -159 -117 -86 -83 -98 -123 -155 -188 -201 -187 -163 -157 -170 -184 -186 -181 -176 -171 -168 -173 -183 -187 -185 -184 -186 -184 -180 -187 -199 -193 -162 -125 -102 -79 -35 17 47 46 36 34 29 6 -27 -59 -88
3705 -88 -124 -167 -203 -225 -236 -240 -229 -201 -168 -148 -148 -155 -149 -132 -128 -157 -208 -251 -271 -276 -274 -262 -234 -199 -171 -150 -134 -133 -162 -205 -227 -209 -174 -155 -152 -149 -148 -169 -211 -243 -233
3687 -233 -185 -138 -125 -149 -182 -192 -172 -140 -125 -133 -149 -161 -169 -180 -188 -184 -160 -124 -91 -74 -80 -103 -127 -141 -147 -146 -136 -121 -110 -109 -109 -99 -86 -86 -97 -105 -100 -90 -87 -91 -95 -89 -74
3669 -74 -57 -49 -55 -65 -69 -62 -54 -53 -67 -94 -131 -165 -186 -200 -214 -221 -205 -172 -143 -137 -142 -147 -156 -174 -189 -177 -135 -86 -45 -18 -7 -21 -63 -117 -161 -184 -187 -175 -159 -153 -159 -166 -163
3650 -163 -153 -151 -160 -165 -153 -134 -129 -142 -155 -144 -114 -90 -91 -106 -117 -120 -127 -138 -144 -143 -145 -158 -171 -170 -161 -163 -185 -217 -238 -233 -202 -161 -129 -110 -97 -82 -72 -79 -106 -141 -174 -200
3632 -200 -217 -224 -220 -200 -158 -97 -41 -15 -25 -53 -84 -115 -153 -191 -222 -243 -253 -254 -247 -241 -244 -256 -269 -280 -287 -285 -274 -262 -260 -264 -251 -214 -165 -121 -89 -64 -51 -51 -59 -60 -54 -49
3614d9rj9k0pJ1J6%k3l0j6rk3m7m6j1L0M6K9lk0j3MJ4RJQK0K6J5ok9l9k6PL4L4J5K%mj9k7
3596a74j4KLj1j5lJ5K8L6L7K2Mork1m5n6l0QJ8ok5j2J9L5L2K7L0L0K0R%j3l6n3m5j5RQqj1
3578b16OK6K1pl1k7JL2M4L1Nk4m6m4rL9O7N8K3ok1k2k1j5mOJj4k7k2KK6L7K8J0j0k3k9k3j0
3560a88jJlml%%LPJ2J4J4J6J8Qj5l7l5j3NKp%J5K1J3PJ1J8J7RJmkQJ2ol8n6l7RN0O1L3j5n7
3540a36o3l7j2kNK3L9L2RnjNKmmmlLJ2J4jj9l0k4j0OJ6J8J6K0L2L7K8J2mj4k2j8qnj9l1k0
3522a67PJ7%k3j8QK6J9Lnj%mkNJ1J3J5J4Lj5k5j4JLppKRRNmj6k2j2O%j9k1J1M2L9Qj0qjkl
3501a30jnj0kK3L9K4j0k9k5j5rj0pJPJ1J0RLlkQJ6Pk1m7m7k8qjJPJ3Rmj8j8%K8M5L9J4j5l5
3482a86m7n2m7l3j4QK2K0lk9l3pK5L8L6L8M5M3K2nj5j1JJ0J8K0J0kkJ0J6PojK1L8K8Lj7k4
$$ plain form
3614 -49 -58 -77 -97 -104 -93 -77 -77 -100 -130 -146 -155 -178 -225 -271 -282 -252 -206 -177 -180 -200 -213 -209 -195 -186 -185 -177 -157 -131 -116 -122 -151 -190 -216 -209 -175 -141 -126 -124 -124 -128 -147 -174
3596 -174 -188 -186 -183 -194 -209 -212 -197 -169 -133 -96 -74 -70 -76 -85 -106 -151 -207 -237 -229 -211 -217 -242 -254 -235 -200 -168 -141 -111 -81 -61 -52 -52 -65 -101 -154 -199 -214 -205 -197 -205 -216
3578 -216 -210 -184 -163 -170 -201 -228 -227 -195 -151 -120 -115 -139 -185 -229 -238 -199 -132 -74 -51 -57 -78 -100 -121 -136 -140 -134 -133 -147 -174 -196 -194 -168 -131 -103 -93 -103 -126 -155 -178 -188
3560 -188 -189 -188 -191 -195 -198 -198 -198 -195 -188 -176 -162 -148 -132 -114 -106 -121 -158 -193 -206 -201 -199 -206 -206 -191 -170 -157 -150 -139 -121 -104 -95 -94 -98 -100 -92 -80 -86 -124 -180 -217 -208 -158 -97 -64 -79 -136
3540 -136 -199 -236 -248 -250 -245 -222 -183 -151 -142 -147 -148 -143 -141 -145 -149 -153 -156 -153 -141 -127 -128 -147 -177 -201 -211 -205 -189 -171 -155 -135 -103 -66 -38 -26 -30 -44 -66 -84 -92 -97 -116 -147 -167
3522 -167 -160 -143 -143 -166 -184 -176 -150 -131 -128 -133 -134 -134 -138 -140 -135 -124 -111 -96 -82 -79 -94 -119 -133 -132 -129 -136 -143 -141 -132 -123 -118 -122 -138 -160 -172 -166 -166 -185 -206 -195 -153 -114 -106 -116 -124 -125 -127 -130
3501 -130 -131 -136 -146 -148 -125 -86 -62 -72 -101 -126 -141 -150 -160 -167 -166 -159 -148 -138 -129 -126 -129 -131 -123 -107 -100 -121 -168 -215 -243 -251 -252 -251 -244 -231 -222 -226 -244 -262 -262 -234 -189 -150 -136 -151 -186
3482 -186 -233 -285 -332 -365 -379 -371 -349 -329 -332 -361 -394 -401 -376 -338 -302 -264 -219 -176 -154 -159 -174 -185 -184 -174 -156 -136 -126 -128 -130 -120 -104 -97 -103 -104 -83 -45 -17 -14 -31 -55
3464e5k8l5m0l4j9rj5l6n1m4j8QK4K9K0%k3k4J0M7N5K8%jJ4K4K4K2J4ql0l5k0nlmNK2K8J9
3447a44Nnn%OQJrrKJ9K6K7K4J9Nj2k3j8pknj1j1pOJ9K0Kj9k0NL2L5K0RJ2J3Mqj5k0k6l7m0
3427a34l5k4j0KPOJknqj3nJ5L1L1J9J1J6J7RLPJ5J0oj6qJ4L8M7L4lm1n1l7k2k9m1m0k1oLJ3
3409b08K8L7L3J8Q%j1k1k3j4jPJ3J7J9J6P%pk2l8l8j6J9L9L6J9jj0pMQjj4j6njj3k8k9j8j5
3391b29k5l4k6qJ1K3K9K6J5KjMJ1Pkj2j3qmkLJ1J8J7PPK2M1M2J8j4l6l5j8jkj4k3j9oLJ0J9
3372a86K7J5j3k5rJ4J3j0k5j8rj8l6l5mL2M4K8Kj0jJ5K2J5Jj1k4l2k5mK1K6J4oj9k1rJ4K9
3355b18K6Pqj4j7j6rPJ9K7L3L9K7jk4k2mJ3K1J8Jk3l4k2mkj5k7k5qK4N7O3L2oj5MJ5Ooj1j4
3337a06k0j1J4L2K6Nj6k7k9j6LRJkRJ8Lk0k4qKNOJ3J0%j4l0n0n9l0K3N7N2L5L1K8Ll3m0j3
$$ plain form
3464 -55 -83 -118 -158 -192 -211 -220 -235 -271 -322 -366 -384 -376 -352 -323 -303 -303 -326 -350 -340 -293 -238 -210 -210 -211 -197 -173 -149 -127 -113 -121 -151 -186 -206 -211 -214 -218 -213 -191 -163 -144
3447 -144 -139 -144 -149 -149 -143 -135 -134 -143 -152 -150 -131 -105 -78 -54 -35 -30 -42 -65 -83 -90 -92 -97 -108 -119 -126 -120 -101 -81 -79 -98 -118 -113 -81 -46 -26 -17 -5 8 12 4 -11 -31 -57 -94 -134
3427 -134 -169 -193 -203 -201 -194 -188 -187 -189 -194 -202 -215 -220 -205 -174 -143 -124 -113 -97 -80 -71 -68 -61 -46 -36 -42 -58 -66 -52 -14 33 67 64 23 -28 -65 -87 -116 -157 -197 -218 -224 -221 -208
3409 -208 -180 -143 -110 -92 -84 -84 -95 -116 -139 -153 -154 -147 -134 -117 -98 -82 -75 -75 -82 -104 -142 -180 -196 -177 -138 -102 -83 -84 -94 -101 -97 -89 -90 -104 -120 -125 -126 -139 -167 -196 -214 -229
3391 -229 -254 -288 -314 -322 -311 -288 -259 -233 -218 -216 -217 -213 -202 -195 -197 -209 -222 -230 -234 -236 -233 -222 -204 -187 -180 -173 -151 -110 -68 -50 -64 -100 -135 -153 -154 -156 -170 -193 -212 -218 -215 -205 -186
3372 -186 -159 -144 -157 -182 -191 -177 -164 -174 -199 -217 -226 -244 -280 -315 -319 -287 -243 -215 -213 -223 -224 -209 -187 -172 -171 -182 -206 -238 -263 -267 -246 -220 -206 -212 -231 -252 -261 -247 -218
3355 -218 -192 -185 -193 -207 -224 -240 -249 -242 -223 -196 -163 -124 -97 -98 -122 -144 -148 -135 -114 -96 -95 -118 -152 -174 -178 -180 -195 -222 -247 -255 -231 -174 -111 -79 -85 -100 -96 -81 -75 -81 -92 -106
3337 -106 -126 -137 -123 -91 -65 -60 -76 -103 -132 -148 -145 -136 -135 -137 -128 -110 -107 -127 -151 -159 -157 -152 -146 -133 -123 -123 -137 -167 -217 -276 -306 -283 -226 -174 -139 -108 -80 -77 -110 -150 -163
3319a63J7K7J8kk7n0n9m5j2J9L6L6K2Noj0qmj%qj5j6j6j7j1OK1J8MQK7L8K0j1k7k6j7%K2L0
3301a77J1j9k8j1J1K3L1L6L1K0J2Mk2n3o2l6plnJ0L1L6K3J1Kj1k1j7qj3k0jL8N8M1J5%j6m1
3284a27n5l8j0MPJ7K8K1L%MJj2oJ4J9pl1k2QK4J5%mlmnMJ5J5Kj6k7k6j1J6L5K7kk1rJ6J7j0
3265a34k8j7NLj8k9j9olkRK2K4K0K3L5M1K8Jj8k1j4j2j5qJ0K1J2oj4j4j5k0j9nJ6L5M2L1J0
3248d9ooj0k7m7m1j0J6J7Kj1k3l7l9k9k1j8j1J1K8J8qj7JK3K4J0lrpOL4N9N9L2LqlKKNJ0Q
3229g0jnlpk2l4l4k6k5k2mK2L4K8K7L2K6Mj2lJ3J9J7K3K7J4j1j8j0oj4j2J1L5L6J8kj2j5j3
3212EjJ7K5J5kj3j8l0m5m1j6Nmk9l3j1QOKJ5K3Nl1m1j8PJ2QJ1J4Lj6k5k3j8j4mJ2K3K0Qjk
3193a92kmlOJ6J1nj9k2k3k6k3oJ1J1nj4mJ9L7M2K8Lj6j5KQqk9k9nK0K1kk6l3k9k4k3rJ8L8
$$ plain form
3319 -163 -146 -119 -101 -103 -130 -180 -239 -284 -296 -277 -241 -205 -183 -178 -184 -194 -202 -206 -207 -207 -215 -230 -246 -262 -279 -290 -284 -263 -245 -241 -233 -206 -168 -148 -159 -186 -212 -229 -229 -207 -177
3301 -177 -166 -185 -213 -224 -213 -190 -159 -123 -92 -72 -60 -56 -78 -131 -193 -229 -236 -239 -244 -234 -203 -167 -144 -133 -131 -142 -163 -180 -188 -201 -221 -222 -184 -126 -85 -70 -70 -86 -127
3284 -127 -182 -220 -230 -226 -219 -202 -174 -153 -150 -150 -146 -145 -157 -163 -149 -130 -137 -168 -190 -182 -158 -143 -143 -147 -150 -154 -159 -155 -140 -125 -123 -139 -166 -192 -203 -187 -152 -125 -127 -148 -157 -141 -124 -134
3265 -134 -162 -179 -174 -171 -189 -218 -237 -243 -246 -248 -239 -217 -193 -173 -150 -115 -74 -46 -45 -63 -84 -98 -110 -125 -133 -123 -102 -90 -96 -110 -124 -139 -159 -178 -183 -167 -132 -90 -59 -49
3248 -49 -55 -61 -71 -98 -145 -186 -196 -180 -163 -161 -172 -195 -232 -271 -300 -321 -339 -350 -339 -311 -293 -301 -318 -317 -294 -270 -260 -263 -272 -279 -273 -239 -180 -121 -89 -86 -94 -97 -95 -93 -88 -78 -70
3229 -70 -71 -76 -79 -86 -108 -142 -176 -202 -227 -249 -253 -231 -197 -169 -142 -110 -84 -80 -92 -95 -82 -63 -46 -23 4 18 7 -11 -21 -27 -41 -53 -42 -7 29 47 45 33 18 5
3212 5 4 21 46 61 59 46 28 -2 -47 -88 -104 -99 -103 -132 -165 -176 -168 -162 -160 -145 -122 -117 -148 -189 -207 -200 -188 -180 -169 -155 -152 -168 -193 -216 -234 -248 -252 -240 -217 -197 -189 -190 -192
3193 -192 -194 -198 -201 -195 -179 -168 -173 -192 -214 -237 -263 -286 -292 -281 -270 -275 -289 -293 -274 -237 -195 -167 -164 -180 -195 -193 -185 -193 -222 -251 -256 -236 -215 -217 -243 -276 -305 -329 -352 -361 -343 -305
3175c05L3Qj1j2JJ6K6L1K8K0J1kj7j8nJ0J0LNJ1OpqOJ1jj5j1j%LJ4L1L4K7K1J0j2l2k9pRM
3156a04j1k2k2j6nMOMPJ7K8L3K5Qj1k4k7k6k1pJ3K7K8K2J5%l0n6n9l2LL2M7M6L9K7J6jk0k1
3139f8LK5J6j7l8l9l4k8j5MPj0k4j9j0j2k5l0k8k1qPJ4J6K8N1O0L7OKJ8K5J2LJ1J2qk9l2k3
3122a61j7j5lJ0J4Kqplmj0j6j9j4lJ3K4L0K7J4nk7m0k7%K1J5mj1JJ6K1K0J9J3%j0lJ3J5Jq
3104a26jJ5J8Jk2l3k9j1LNoj3oNQJqj0j2j5j9qJ4L0K6PlJ0L4M6L7K5K4L0K9Pk1l3k6j3j2k2
3085g4l1l0j7jJ5J8Oj3k3j7kP%j1j8j7j5k2k7j5OJ4ok8k4JJ8J5QOlj5j6OK8K9J6J4J9K0J5
3068a64J8K6K5Nj3k1k1j4KK3L0K1PKJlqnPJ7K0K2K0Rok6m0l9k3qnj5j9j0OJ6J8J3%j5k0j0
3049a77J0K4L1L2K3Kk6m3m3l4k3j5oKJ0J2J0J0J2J4Mj8l2k9j3%PJ5K6L1K2Lj4k1j0RJ8J0k
$$ plain form
3175 -305 -272 -264 -275 -287 -286 -270 -244 -213 -185 -165 -154 -156 -173 -191 -196 -186 -176 -173 -168 -157 -151 -158 -166 -160 -149 -150 -165 -176 -177 -177 -174 -160 -129 -95 -68 -47 -37 -49 -81 -110 -117 -108 -104
3156 -104 -115 -137 -159 -175 -180 -176 -170 -166 -159 -142 -114 -81 -56 -48 -59 -83 -110 -136 -157 -164 -151 -124 -96 -74 -59 -59 -89 -145 -204 -236 -233 -201 -154 -108 -69 -42 -26 -27 -47 -68
3139 -68 -65 -40 -24 -41 -79 -118 -152 -180 -195 -191 -184 -194 -218 -237 -247 -259 -284 -314 -342 -363 -371 -364 -350 -334 -306 -255 -195 -158 -152 -150 -132 -107 -95 -92 -81 -69 -77 -106 -138 -161
3122 -161 -178 -193 -196 -186 -172 -170 -178 -185 -188 -192 -202 -218 -237 -251 -254 -241 -217 -187 -160 -146 -151 -178 -218 -245 -245 -224 -209 -213 -224 -223 -207 -186 -166 -147 -134 -134 -144 -147 -134 -119 -118 -126
3104 -126 -127 -112 -94 -93 -115 -148 -177 -188 -185 -180 -186 -199 -205 -200 -192 -191 -199 -209 -221 -236 -255 -263 -249 -219 -193 -186 -189 -179 -145 -99 -62 -37 -13 17 46 53 32 -1 -27 -40 -52 -74
3085 -74 -105 -135 -152 -153 -138 -120 -114 -127 -150 -167 -169 -162 -162 -173 -191 -208 -223 -245 -272 -287 -281 -267 -273 -301 -325 -324 -306 -291 -283 -277 -280 -295 -311 -305 -277 -248 -232 -218 -199 -179 -164
3068 -164 -146 -120 -95 -90 -103 -124 -145 -159 -157 -134 -104 -83 -76 -74 -73 -76 -84 -89 -82 -65 -45 -23 -3 6 0 -26 -66 -105 -128 -136 -141 -156 -175 -185 -179 -163 -145 -132 -132 -147 -167 -177
3049 -177 -167 -143 -112 -80 -57 -55 -81 -124 -167 -201 -224 -239 -245 -243 -233 -221 -211 -201 -189 -175 -171 -189 -221 -250 -263 -263 -256 -241 -215 -184 -162 -159 -173 -194 -204 -195 -177 -167 -169
3032a69nkoj1mK2M7N1L8K0Kj7k7k3j9k4l5l3j2Nnk9m2l1pJ1J8K3K7K4J1lj3j4nRJ8J8J0PP
3015a68Krj1MJ2ol6l9nL4M2K2lj5qPK0J9RlmKOJqk0k8k3j1%NJ0J3QmpOK0J9PLJ1J7J0qk7m1
2994a75l4kM0O3N2K1ok5l3l1k6k7l6l6j5J6L4L2K5L1M0L2mm7o5m3mJ4Jk3l2k4j6k0k2nL0O3
2978b57P8P1N2K6kk4k8j5oppNK4K9J4%lj1l3m9m0j0J8K8K4J6OmqqjNJ3J1Ko%J4K0J9K0K6K5
2959B7J4PNmk2k7lK3K6Nj1j7l1n9o4l2J1L4L6L4K8Rk1m0m4l7l4k6j1J3L1L8L3K2J4J2J2Oj
2942d4pj8l4m4l8k3j3pOK8L8K8J4RJ2RLjmpj1k0l1l8k8lJ1Jj7j3J2L4M2L4J3k0m2l3JK5K4
2925a52J0kj2j9j6jJ0RJ1K4L2J8oj8j4j3j9k0j6pJJ3J4jj4JL5M7J9j7k8j4JQJ1J2Nqj5j8j8
2907a67j6rMJ3K0K5J6nk1qJ8K4ol7l3%K5K5J2kj5k7l1k3j4j0nJPMkJK2M8O4N7L5Pj6k5k3j4
$$ plain form
3032 -169 -174 -176 -182 -193 -197 -175 -128 -77 -39 -19 -17 -34 -61 -84 -103 -127 -162 -195 -207 -202 -207 -236 -278 -309 -316 -305 -287 -264 -237 -213 -202 -205 -218 -232 -237 -228 -210 -192 -182 -175 -168
3015 -168 -166 -175 -186 -182 -170 -176 -212 -251 -256 -222 -180 -158 -161 -176 -184 -177 -157 -138 -129 -132 -136 -134 -128 -127 -135 -155 -183 -206 -217 -217 -212 -202 -189 -181 -185 -192 -186 -166 -147 -140 -137 -126 -109 -99 -107 -134 -175
2994 -175 -209 -211 -171 -108 -56 -35 -41 -66 -99 -130 -156 -183 -219 -255 -270 -254 -220 -188 -163 -132 -92 -60 -64 -111 -176 -219 -223 -209 -208 -231 -263 -287 -303 -323 -345 -350 -320 -257
2978 -257 -179 -108 -56 -30 -32 -56 -84 -99 -105 -112 -119 -114 -90 -61 -47 -47 -50 -61 -94 -143 -183 -193 -175 -147 -123 -107 -101 -105 -113 -121 -122 -117 -104 -93 -91 -97 -97 -83 -63 -44 -24 2 27
2959 27 41 48 53 49 27 0 -3 20 46 51 40 23 -8 -67 -131 -163 -152 -118 -82 -48 -20 -11 -32 -72 -116 -153 -187 -213 -224 -211 -180 -142 -109 -87 -73 -61 -49 -43 -44
2942 -44 -51 -69 -103 -147 -185 -208 -221 -228 -222 -194 -156 -128 -114 -105 -93 -84 -81 -82 -86 -93 -104 -124 -155 -193 -221 -224 -213 -212 -229 -242 -230 -196 -154 -120 -107 -127 -169 -202 -201 -176 -152
2925 -152 -142 -144 -156 -175 -191 -192 -182 -173 -162 -138 -106 -88 -94 -112 -126 -139 -158 -178 -194 -201 -200 -187 -173 -174 -188 -187 -152 -105 -86 -103 -131 -145 -144 -136 -125 -113 -108 -116 -131 -149 -167
2907 -167 -183 -192 -188 -175 -155 -130 -114 -119 -140 -148 -130 -106 -112 -149 -182 -182 -157 -132 -120 -122 -137 -164 -195 -218 -232 -242 -247 -246 -239 -235 -237 -236 -214 -166 -102 -45 -10 -3 -19 -44 -67 -81
2889h1ppj3j8k1k2j9j0KNqk4k1NK4Rk6m7l8j4J0L0M2L6J0j4j1RJ7Lj1qJlj6j5LK3L3L6L6K8
2870i2J6O%j1l2n1n4m4l2j5RL4M0K8J3Mlj2k1k4k1k0j7qjko%J6K5J8ml2n0m1oK9L6J3oML1
2852b83N0M0J5prJ2L5L7J1j4j1J8L9K6j6o0p5m8%L5L5J6Jqk2l0j4J5K6QoLK2K3J2QQmk4l3
2835a69k1qpj2qLJ8L5M3L1Jk3k5j6j0j3j5j8k2k3j1KJj3j8nJ1J5MlQL3N3M9J9j8l8l6k4j4
2817b44lPJ6J9K1K7K7J6NMJ5J4j1m5o3m7pL7O4O4M1J0j0j8k4k6j3J3K3Kl2m6l1j0kjJNQJ4
2800a80K2K1J0%MJ0NjMRnl1l8j2K3L9L4K4J7J1Nqk7m2m4k9j3ppJJ7K3J0j3k4j6%PKjMJ1R%
2781a76JJ2K4K4J6J1Oqk4k2jK2K4Mk6m3m5l5j8NL1M8M4K0nk1k3k0j4qnrqLJ7K4K1J6J2Pjo
2763a26omqj9k6j9ML0M1L5K2J5J4J1Kpqnlnqj1j3j4j2j0oj0k6m1l8j8%NNJ5L6M6L5J0qj4p
$$ plain form
2889 -81 -88 -95 -108 -126 -147 -169 -188 -198 -196 -191 -199 -223 -244 -239 -215 -206 -232 -279 -317 -331 -321 -291 -249 -213 -203 -217 -228 -219 -202 -199 -210 -218 -217 -220 -236 -251 -248 -225 -192 -156 -120 -92
2870 -92 -76 -70 -70 -81 -113 -164 -218 -262 -294 -309 -300 -266 -226 -198 -185 -181 -184 -196 -217 -241 -262 -282 -299 -307 -308 -310 -316 -316 -300 -275 -257 -261 -293 -343 -384 -390 -361 -325 -312 -318 -314 -283
2852 -283 -233 -193 -178 -185 -194 -182 -147 -110 -99 -113 -124 -106 -67 -41 -57 -117 -192 -240 -240 -205 -170 -154 -153 -161 -183 -213 -227 -212 -186 -178 -184 -181 -159 -136 -124 -116 -108 -112 -136 -169
2835 -169 -190 -198 -205 -217 -225 -222 -204 -169 -126 -95 -94 -117 -142 -158 -168 -181 -196 -214 -236 -259 -270 -268 -267 -280 -298 -303 -292 -277 -273 -276 -268 -235 -182 -133 -114 -132 -170 -206 -230 -244
2817 -244 -247 -240 -224 -205 -184 -157 -130 -114 -109 -105 -90 -76 -87 -132 -195 -242 -249 -212 -148 -84 -43 -33 -43 -61 -85 -111 -124 -111 -88 -86 -118 -164 -195 -205 -207 -208 -207 -202 -194 -180
2800 -180 -158 -137 -127 -127 -123 -113 -108 -109 -105 -96 -101 -132 -170 -182 -159 -120 -86 -62 -45 -34 -29 -37 -64 -106 -150 -179 -192 -199 -206 -205 -188 -165 -155 -168 -192 -208 -208 -201 -199 -200 -196 -185 -176 -176
2781 -176 -175 -163 -139 -115 -99 -88 -82 -90 -114 -136 -137 -115 -91 -87 -113 -156 -201 -236 -254 -249 -218 -170 -126 -106 -111 -132 -155 -175 -189 -197 -202 -211 -219 -216 -199 -175 -154 -138 -126 -119 -120 -126
2763 -126 -132 -136 -144 -163 -189 -208 -204 -174 -133 -98 -76 -61 -47 -36 -34 -41 -49 -54 -57 -62 -70 -81 -94 -108 -120 -130 -136 -146 -172 -213 -251 -269 -269 -264 -259 -244 -208 -162 -127 -117 -125 -139 -146
2744a46%%rj5j1jKmj3k0k0pK7O1P0M7J3oj3j3oL%j7k8j8lnj5j6pmKJ6L2K5nk6j9PK6L0J9k
2725f9k7l4j9kKmnKJ5K7L4K5Jk6l4k4rJJ3K5K5Nj9k6j6%MjrpOK2K8J7ql0l2j5%jj0j1%Mjo
2705a89LJ6J9J2jj5k9l4k6j3kJ0L3N4N1K3rk6l3k9k1j3j8k5j2J7L0J8MOQj8m7m5j5OMJJ8L9
2688b48M2K5Lj9l9m6l0kJ6J4N%KPJ5K2K9K4Qj3k5j9kJ2J3PJ%KQJ2Pkj0j1j4k0k1j1LRRJ3J7
2669b07J2LQK9M2K7nk7k4j6k3m0n2m7k4LK4K9K3J6J8K3K4K1J7J3Moj5j5j1ooj0j5j3jJ0J0
2652b07KjJ0J3ll0l9k0OK4L1L2K1Lqj0rj8k9k3qKLQK5M1L1%l2m1k0PK2J2moJ2L0L2J2k1m4
2634a94m6k4PL2M8N2L8J1j5j9n%j2l1l3k4j6j5rKJ3J8K6L3L4K7J8RKmkPJ4Rmj8k7k6j7mLn
2615a47k1k5oJ9K6J6J1J7K2J1mpjql0m4l4j0J3L2M4M0J6pr%lj0nJ4J8ml0k7pPNMJ6K6K6J6
$$ plain form
2744 -146 -146 -146 -155 -170 -181 -182 -180 -184 -197 -217 -237 -244 -217 -156 -86 -39 -26 -32 -45 -58 -64 -61 -61 -78 -106 -124 -127 -132 -147 -163 -170 -174 -172 -156 -124 -99 -104 -130 -149 -142 -116 -86 -67 -69
2725 -69 -96 -130 -149 -151 -149 -153 -158 -156 -141 -114 -80 -55 -54 -80 -114 -138 -147 -146 -133 -108 -83 -78 -97 -123 -139 -139 -135 -136 -145 -152 -146 -124 -96 -79 -87 -117 -149 -164 -164 -165 -175 -186 -186 -182 -183 -189
2705 -189 -186 -170 -151 -139 -140 -155 -184 -218 -244 -257 -259 -249 -216 -162 -111 -88 -97 -123 -156 -185 -206 -219 -237 -262 -274 -257 -227 -209 -205 -199 -191 -209 -256 -301 -316 -310 -306 -305 -287 -248
2688 -248 -206 -181 -178 -197 -236 -282 -312 -314 -298 -284 -279 -279 -277 -270 -255 -233 -204 -180 -172 -185 -210 -229 -231 -219 -206 -199 -198 -198 -196 -188 -176 -169 -171 -181 -192 -206 -226 -247 -258 -255 -246 -237 -224 -207
2669 -207 -195 -192 -184 -155 -113 -86 -91 -118 -142 -158 -181 -221 -273 -320 -344 -341 -317 -288 -265 -249 -231 -208 -184 -163 -146 -133 -129 -135 -150 -165 -176 -182 -188 -198 -213 -226 -227 -217 -207
2652 -207 -205 -206 -196 -183 -186 -216 -255 -275 -269 -245 -214 -182 -161 -158 -166 -176 -185 -203 -232 -255 -263 -261 -258 -250 -225 -184 -153 -153 -185 -226 -246 -239 -217 -205 -209 -215 -203 -173 -141 -129 -150 -194
2634 -194 -240 -264 -257 -225 -177 -125 -87 -76 -91 -110 -115 -115 -127 -158 -191 -215 -231 -246 -255 -253 -240 -222 -196 -163 -129 -102 -84 -75 -73 -77 -79 -72 -58 -49 -53 -71 -98 -124 -141 -145 -142 -147
2615 -147 -168 -193 -199 -180 -154 -138 -127 -110 -88 -77 -81 -88 -89 -97 -127 -171 -205 -215 -202 -170 -126 -86 -70 -77 -86 -86 -89 -99 -104 -90 -72 -76 -106 -133 -140 -133 -128 -124 -108 -82 -56 -40
2597d0Lj3k4k2j1pj7k2j2PJ3lk1k6j9lJ4J9Pj8k6mL0M3L3K0J5Prj8j4pj9l8l5pK6L8L4K5J6
2579h5mk6l3j6J1J9Kj7j8NK4K7K4K7L2J3k7o2o7m4j9jJ1J8Qj6l6m1k8rJ3L6N4O2N8M5K4%k1
2563e7l2l2k6j5%J3J9J7J0Mkj1j7k0j6lK0M5M7K1j3k9k3j5k0k3j3%Koj3j5j0jJ0J5Pmromp
2544b12j1j6j6qOJ1JnNK1J8%rMK0J6O%oj3j3KJ6J0qj8j3KK1M0L7Ll3l1LK4J0j2j5j2j8k0%
2526b13K5K5kj9j0J2L1L5K7Oj4j9j5k0l5l1lK3J6qj0J1K4J2m%J0Kj2jL4M9J8k2k3J2M2M0K2
2509A5J4Jk5m4l4lJ3Mj2k0k4l1k8j2NQJ%QJ7K4K4K1J1LMJ0J1jj4k4k8l0k2nRPj7m0m0k3kK
2490b67oj0%J8L1K7J6QN%mmPJ8K5K4K2K0J9J5J0%rj6j6qNJ6K1J2j1m0n3m7l1j7j1mKMlqkJ4
2471b28K7K3J3POkj6j9pKkoNJ6Nk0k9oJ8J9J7K7L7J5l1o0m6j9pj0oJ0K3K6K5K3K4K4K5K6K0
$$ plain form
2597 -40 -37 -50 -74 -96 -107 -114 -131 -153 -165 -158 -145 -148 -169 -195 -214 -217 -203 -184 -177 -195 -221 -225 -195 -152 -119 -99 -84 -77 -86 -104 -118 -125 -144 -182 -217 -224 -198 -160 -126 -101 -85
2579 -85 -89 -115 -148 -164 -153 -134 -132 -149 -167 -162 -138 -111 -87 -60 -28 -15 -42 -104 -171 -215 -234 -235 -224 -206 -198 -214 -250 -291 -319 -328 -315 -279 -225 -163 -105 -60 -36 -36 -57
2563 -57 -89 -121 -147 -162 -162 -149 -130 -113 -103 -99 -101 -112 -129 -149 -165 -168 -148 -103 -56 -35 -48 -77 -100 -115 -135 -158 -171 -171 -169 -175 -188 -203 -213 -214 -204 -189 -182 -186 -195 -201 -205 -212
2544 -212 -223 -239 -255 -263 -257 -246 -245 -250 -245 -224 -206 -206 -215 -211 -191 -175 -169 -169 -175 -188 -201 -199 -183 -173 -181 -199 -212 -210 -189 -149 -112 -109 -142 -173 -170 -146 -136 -148 -163 -175 -193 -213 -213
2526 -213 -188 -163 -165 -184 -194 -182 -151 -116 -89 -83 -97 -116 -131 -151 -186 -217 -220 -197 -181 -189 -199 -188 -164 -152 -156 -156 -146 -144 -156 -157 -123 -74 -56 -78 -101 -89 -47 -7 15
2509 15 29 30 5 -39 -73 -76 -63 -59 -71 -91 -115 -146 -174 -186 -181 -173 -172 -172 -164 -147 -123 -99 -78 -67 -64 -60 -50 -39 -40 -54 -78 -106 -136 -158 -163 -154 -147 -164 -204 -244 -267 -269 -267
2490 -267 -273 -283 -283 -265 -234 -207 -191 -183 -178 -178 -182 -186 -179 -161 -136 -112 -90 -70 -51 -36 -26 -26 -35 -51 -67 -75 -70 -54 -33 -21 -32 -72 -125 -172 -203 -220 -231 -235 -233 -229 -232 -240 -242 -228
2471 -228 -201 -178 -165 -158 -152 -154 -170 -189 -196 -194 -196 -202 -197 -181 -176 -196 -225 -231 -213 -194 -177 -150 -113 -98 -129 -189 -235 -254 -261 -271 -277 -267 -244 -218 -193 -170 -146 -122 -97 -71 -51
2453e1RNPJj5k9k6j2jKMNKkjjj3k5k3lOqk7k3mMjlJ2K0J1lkPOqk1j9mJ5K8L0K0J1J1J3Onq
2432a03klj9l5k7JK5K1pl0k1J1L4K6Kj5j6j2mJ5L1K8Kk5l1j6mqk2l5l5j9lRJ4J6J7Rlrrrr
2413b70%J3J3joJ4M5N4M0J9Jk0m1n1m8m2l6j9QK0jl1l5qJ8K1J6J6K0J5NPK1L0K4J5J2RKnJ
2396a55J6K5K3J5Pkljjj3k1rJ3J8ol2k7LK7K2Lj1j0oj0k4l5k5KK3J9%j3pQJ5J2P%mlJLmj0
2376a70j3qLRJ1Okj4l0l7j9K0M5K9rk7oJ7J1qpJ8L6L1K1K6K8Ol6o1n1k8k5m1n3m1j6NJ7K8
2359c35M1M3L0J0jKJ5K3K3J7J1RJ4J9J7%k3l6k4JK2L3M0L9K5Jk0l5m4n8o4m9k2LK1L5L6J5
2342a66j2k0kJ6J9K1L4M3K7j0m0m6l3j1J3L0K6Nj3j3KJ2Nk2m8n5l0J0M3N5N1L3Rj0j2%Opk5
2325a15l1j9njmkQJ3Qqk6k8j1J4K6J6j0k6k3pQJ8K1J7PMJ0J7J1mrjOmk5l4j5K0M5M0Qk6l5
$$ plain form
2453 -51 -42 -37 -30 -29 -44 -73 -99 -111 -112 -110 -106 -101 -99 -101 -102 -103 -116 -141 -164 -167 -161 -169 -196 -219 -223 -219 -220 -223 -211 -191 -180 -183 -185 -178 -172 -180 -201 -220 -224 -209 -181 -151 -131 -120 -109 -96 -90 -95 -103
2432 -103 -105 -108 -127 -162 -189 -188 -163 -142 -149 -179 -200 -189 -155 -129 -127 -142 -158 -170 -174 -159 -128 -100 -98 -123 -154 -170 -174 -182 -204 -239 -274 -293 -296 -287 -273 -257 -240 -231 -234 -243 -252 -261 -270
2413 -270 -270 -257 -244 -245 -251 -237 -192 -138 -98 -79 -78 -98 -139 -190 -238 -280 -316 -335 -327 -307 -308 -339 -374 -382 -364 -343 -327 -311 -291 -276 -271 -264 -243 -213 -189 -174 -162 -153 -151 -156 -155
2396 -155 -139 -114 -91 -76 -69 -71 -74 -75 -76 -89 -110 -119 -106 -88 -94 -126 -153 -150 -123 -101 -98 -109 -119 -125 -135 -159 -194 -219 -217 -194 -175 -175 -188 -195 -187 -172 -160 -153 -153 -157 -160 -159 -156 -160 -170
2376 -170 -183 -191 -188 -179 -168 -162 -164 -178 -208 -245 -264 -244 -199 -170 -179 -206 -212 -195 -184 -192 -199 -181 -145 -114 -93 -67 -39 -33 -69 -130 -181 -209 -234 -275 -328 -369 -385 -380 -363 -335
2359 -335 -294 -251 -221 -211 -212 -210 -195 -172 -149 -132 -121 -112 -98 -79 -62 -62 -85 -121 -145 -144 -122 -89 -49 -10 15 16 -4 -39 -83 -141 -205 -254 -276 -273 -252 -217 -181 -166
2342 -166 -178 -198 -200 -184 -165 -144 -110 -67 -40 -50 -90 -136 -169 -180 -167 -137 -111 -106 -119 -132 -130 -118 -113 -135 -183 -238 -268 -258 -215 -160 -109 -76 -67 -77 -89 -89 -83 -90 -115
2325 -115 -146 -165 -170 -171 -175 -177 -169 -156 -148 -156 -182 -210 -221 -207 -181 -165 -175 -201 -224 -231 -223 -205 -184 -167 -160 -156 -146 -129 -118 -122 -131 -132 -126 -130 -155 -189 -204 -184 -139 -99 -91 -117 -152
2307a52k1lJLJ5L4L9K7J2PRQ%j3k6l4k6j5j0j3mK1M1K8j0m0m2k1MK1L0K8J6LkLKj1k4k4rP
2289a41Nj2l6m7m2k5mJ2K2L0L7M0L7K9J8Qlj4k3k4k4k5k6j2J5L8L5Rj3j0J4K6J4rk2k1j6j1
2272a71kJ3K4K6J9Oj5l6m2k6plrnJ3K6J8LPK2J8j7m8m7k5j9l7m0rL0L7J6KJ0J9J7RJ0J5J4
2255a84RLnj4k0j6j4j6j9qOJ5J5J7K2K3J7RJ0J3J5Nj6k9k4%J5Lk3l1j4LKj1j5%K4L9L3J6k
2237a47oLJ4K2K9K6J0j4l4l4k2rnjNJ1J0Mklnj4k9l5k0J2L7L6J1j6l3l9m1m1l1pK1L5K7RM
2219b62K1M1M5L2K0J5Nk0m4m2j6Nlk0k3rJMJ3L1M3L6K4J4Kk0l1j2J8J6j9m6l5oJ3K0L1M8M4
2202f6J5k1l6l0j5kLPJ0J5J7J6J1%j9l5k5OL2K3kj0%Nj6l9m0k4j0pmOJ3J6J6J5J3OKJJJKR
2183a40J9K3J6jj1j0jLmj5j3lKnj7k3k1j8j5qLJ0Onj0KK4L6K6Qoorj3j5mJ1J7K0K3K3J1po
$$ plain form
2307 -152 -173 -176 -175 -172 -157 -123 -84 -57 -45 -38 -29 -21 -21 -34 -60 -94 -120 -135 -145 -158 -162 -141 -100 -72 -82 -122 -164 -185 -181 -160 -130 -102 -86 -83 -85 -82 -80 -91 -115 -139 -148 -141
2289 -141 -136 -148 -184 -231 -273 -298 -302 -290 -268 -238 -201 -161 -124 -95 -77 -69 -72 -86 -109 -133 -157 -182 -208 -220 -205 -167 -132 -123 -136 -146 -132 -106 -92 -101 -123 -144 -160 -171
2272 -171 -173 -160 -136 -110 -91 -85 -100 -136 -178 -204 -211 -214 -223 -228 -215 -189 -171 -168 -161 -139 -121 -138 -186 -233 -258 -277 -314 -354 -363 -333 -296 -280 -278 -268 -249 -232 -223 -213 -198 -184
2255 -184 -175 -172 -177 -191 -211 -227 -241 -257 -276 -284 -278 -263 -248 -231 -209 -186 -169 -160 -150 -137 -122 -117 -133 -162 -186 -186 -171 -168 -191 -222 -236 -233 -231 -242 -257 -257 -233 -194 -161 -145 -147
2237 -147 -153 -150 -136 -114 -85 -59 -49 -63 -97 -131 -153 -162 -167 -168 -163 -152 -142 -138 -140 -143 -148 -162 -191 -226 -246 -234 -197 -161 -150 -166 -199 -238 -279 -320 -351 -358 -337 -302 -275 -266 -262
2219 -262 -241 -200 -155 -123 -103 -88 -83 -103 -147 -189 -205 -200 -203 -223 -246 -255 -254 -250 -237 -206 -163 -127 -103 -89 -87 -107 -138 -150 -132 -116 -135 -181 -216 -222 -209 -189 -158 -110 -66
2202 -66 -51 -72 -108 -138 -153 -155 -152 -145 -135 -120 -103 -87 -76 -76 -95 -130 -155 -149 -117 -94 -96 -106 -106 -101 -117 -156 -196 -220 -230 -237 -241 -235 -222 -206 -190 -175 -162 -156 -154 -153 -152 -151 -149 -140
2183 -140 -121 -98 -82 -83 -94 -104 -105 -102 -106 -121 -134 -137 -135 -140 -157 -180 -201 -219 -234 -242 -239 -229 -223 -228 -238 -236 -212 -176 -150 -142 -148 -154 -163 -176 -191 -195 -184 -167 -147 -124 -101 -90 -97 -103
2164a03J0K0Pj7l1k6j8rKJ6K0J0lj3j5rJJ1J2O%ok0l1k6JK9L0Lk4l2j5J2K7K3Lj2mJ8L8M6
2146f9L9K4Jk1l2l1k3j1nkKRJ3Orj7j0MJ2J2J0MnqKJ3J3%j3j5j0PK8L7J7j8l6l0j9j6j0NJ1
2128a41KlRJ9Mj7j9nmj0kK0K7Mk0j6LJ0lj6j4oLPRONMJlqk3m0m0oL3L9Pk2j6JLolJ0QJJ2L5
2107a61L5Mk3j7PJ9J7RJj1j4kJ2J1mj5j5j3pJOkj6j8nPJ5J7J5%k0k7k1j4j0oOJ5J5K0L2M1
2088a16L3J9J5J7J2oj9k5l4m4m3k2MJ5J1Koj6k3j7KK2K7J7PMMjmjNPPRJ5J8J7J7J3lk7l2j9
2070a39qj6k5j0K2L5K1mj1kJ0K5L7M0L1J5ok1k1kJ9J4qk4j2RJ0kj1pJNKmj1j0JRJj7k7l2l8
2051a61m3l3jK7L5K7J5Opj7j7nRJ3J1J1J5J2Mopmnk1l2k7lK0L3L6L7K6Jk7l8l4k7j7jJ2J0
2033a73rj9oK2L4J8jmRJ8J3QJ0J3Kj7l2l5k9k0qQK1K7K2Mj3k2j6mJmj4k9m1m2k5LK5L2K8J8
$$ plain form
2164 -103 -93 -73 -66 -83 -114 -140 -158 -167 -165 -149 -129 -119 -122 -135 -150 -159 -158 -147 -135 -129 -129 -135 -155 -186 -212 -211 -182 -152 -149 -173 -205 -220 -208 -181 -158 -155 -167 -171 -153 -115 -69
2146 -69 -30 -6 -5 -26 -58 -89 -112 -123 -128 -130 -128 -119 -106 -100 -109 -126 -136 -132 -120 -108 -98 -94 -99 -107 -105 -92 -79 -79 -92 -107 -117 -110 -82 -45 -28 -46 -82 -112 -131 -147 -157 -152 -141
2128 -141 -139 -142 -133 -114 -110 -127 -146 -151 -155 -165 -167 -147 -120 -116 -136 -152 -149 -139 -142 -158 -172 -178 -175 -168 -159 -153 -148 -144 -143 -146 -154 -177 -217 -257 -263 -230 -191 -184 -206 -222 -221 -218 -224 -227 -217 -209 -208 -196 -161
2107 -161 -126 -122 -145 -162 -155 -136 -119 -110 -109 -120 -134 -136 -124 -113 -117 -132 -147 -160 -167 -166 -160 -162 -178 -196 -201 -194 -179 -162 -147 -147 -167 -194 -215 -229 -239 -245 -239 -224 -209 -189 -157 -116
2088 -116 -83 -64 -49 -32 -20 -26 -45 -70 -104 -148 -191 -213 -209 -194 -183 -181 -187 -203 -226 -243 -241 -219 -192 -175 -168 -164 -160 -161 -165 -166 -161 -154 -147 -138 -123 -105 -88 -71 -58 -61 -88 -120 -139
2070 -139 -147 -163 -188 -198 -176 -141 -120 -124 -135 -137 -127 -102 -65 -25 6 21 15 -6 -27 -29 -10 4 -4 -28 -40 -31 -21 -23 -34 -41 -40 -35 -33 -37 -48 -58 -57 -48 -47 -64 -91 -123 -161
2051 -161 -204 -237 -238 -211 -176 -149 -134 -128 -135 -152 -169 -174 -165 -152 -141 -130 -115 -103 -99 -105 -112 -116 -121 -142 -174 -201 -204 -184 -151 -115 -78 -52 -51 -78 -116 -150 -177 -194 -195 -183 -173
2033 -173 -182 -201 -207 -185 -151 -133 -134 -138 -129 -111 -98 -90 -80 -67 -65 -82 -114 -149 -178 -198 -206 -198 -177 -150 -128 -124 -137 -159 -175 -179 -178 -182 -196 -225 -266 -308 -333 -330 -305 -273 -245 -227
2015b27Kj5k6k6k1j8j3%K8N9P9P5N1K3OJjoj1j6k7l7m0l5k3j0jLNJ3K7K9J6KQJ4om1m8j4K4
1997a97L3K4J9Pk2m9l6NL0K5J6J5Qj3k3rMjj2qPJ4J1OkoNK9M9M2J5j6m3p2p8l7L2P1N8K6J3
1980f0J0pl0l0j1rl0l9j2J8J6j2j6J0L4K8J3J2J9Rrj0QK4K0QJljNLj6l9m0k0j0j2qJ7K9Ll7
1961a74n3l1lJ8L2M0L6J8jrrn%Lmj2pKkj6j9kK1K8J9Kj0j1llj8l4k9oP%oJJ2J5J7K1J9J2J0
1942a34J8K0Lj4j4l%pj0kJ1J7J0ql2l8k1MJ5J6J7J2ol0m3m0k7lL4O1O0L1MpomkOJ1J1Okj2
1923i8j5JJ9J6j0l3m0m1m6m1j7J7L8M1L4J9Mpojoj1q%%opknj9k8k0MK4K8J4j%J8L5L6K8K5
1905f7K4J4ql0m5n6o3n6l8j6LJ7J6jj3%K7L7J5nmLok4j9OK7K7K0J7J7RJJLnj7k4j5JJ3J4Q
1886a92mj3j6oPJ1nk5l1j4RK1J8J2Lj0k3k4rJ0J6J1J4L0N1N0K2j8m3m0j8mj1k1j4J5M8O2M9
$$ plain form
2015 -227 -225 -240 -266 -292 -313 -331 -344 -344 -316 -257 -178 -103 -52 -29 -23 -22 -23 -29 -40 -56 -83 -120 -160 -195 -218 -228 -229 -226 -221 -208 -181 -152 -136 -134 -126 -112 -118 -159 -207 -221 -197
1997 -197 -164 -140 -121 -114 -136 -185 -221 -216 -186 -161 -145 -130 -122 -135 -158 -167 -163 -164 -176 -184 -177 -163 -152 -146 -148 -154 -149 -120 -71 -29 -14 -30 -73 -145 -223 -260 -228 -157 -99 -73 -60
1980 -60 -50 -57 -87 -117 -128 -137 -167 -206 -218 -200 -184 -196 -212 -202 -168 -140 -127 -115 -96 -87 -96 -106 -98 -74 -54 -46 -45 -48 -49 -44 -41 -57 -96 -136 -156 -166 -178 -186 -169 -140 -137 -174
1961 -174 -227 -258 -261 -243 -211 -171 -135 -117 -118 -127 -136 -141 -141 -138 -142 -154 -161 -159 -161 -177 -196 -198 -177 -149 -130 -128 -138 -149 -152 -155 -173 -207 -236 -242 -235 -235 -241 -240 -228 -213 -196 -175 -156 -144 -134
1942 -134 -116 -96 -93 -107 -121 -124 -124 -131 -141 -143 -132 -115 -105 -113 -145 -183 -204 -200 -185 -169 -152 -140 -146 -176 -219 -259 -286 -289 -255 -194 -134 -103 -99 -106 -112 -116 -118 -112 -101 -90 -84 -86 -98
1923 -98 -113 -112 -93 -77 -87 -120 -160 -201 -247 -288 -305 -288 -250 -209 -175 -156 -152 -159 -165 -166 -172 -183 -191 -191 -191 -197 -204 -206 -211 -230 -258 -278 -274 -250 -222 -208 -209 -209 -191 -156 -120 -92 -67
1905 -67 -43 -29 -37 -67 -112 -168 -231 -287 -325 -341 -338 -321 -305 -306 -319 -319 -292 -255 -240 -245 -249 -246 -252 -276 -295 -289 -262 -235 -215 -198 -181 -172 -171 -170 -167 -172 -189 -213 -228 -227 -214 -200 -192
1886 -192 -196 -209 -225 -231 -224 -213 -218 -243 -274 -288 -279 -258 -240 -228 -225 -235 -258 -282 -291 -281 -265 -254 -240 -210 -159 -109 -87 -105 -148 -188 -206 -210 -221 -242 -256 -241 -193 -131 -82
1869h2K3Lnloj9l6m5m5k9%L1M1J6k4l8k0RK2K4K9L7L5K1Nmj4k0j9kJ5K3J7Kj2j7j9l1n1n2
1852b40j4M1O7M1j0m3m6k6%K3K8J3pj7j8k1k1j4JJ6K7K6J7Kmlj0k5l0j6Jqk4j9J2L6L7L0K5
1835a73J1j7l4k4kM%JNKj0j2poj7k2k1j6mK8O6P0L2j3k4nJ2J0KMJ1J3Nj1k7l2k3nMKqj3j2
1816b56mJ1K8M0M1K7Qj0j7j8j0NK1K3Oj8k4j5k%NJ2J3kj8j5NK2K1RJkmlJJoj3j3j4k2l2l6
1797b54k3kJ9K7J8LlPK6L4L2K3J1lj4j3oKMPR%j3j7jK3L1J8lj5j3ompj4k4k3j6j3k4m7n6l8
1779c58nJ8K0QKLJ0K3M6O5O4L8Mj8k4j6kN%j6k8k6j9j5j0MK2K8K1J1J0Qmj9k7k5k0j3JJ9L0
1761a85K9J7MmKJ1J3Mrj5j6j6j4j0jOJ2J3J1jj6k7l0l1k6qK0L9L5J3rj6pJ0K5K4J4RK0L2K1
1743e7rl9m9m7l7k1JJ6J2JNK1L3K5Nj1k4m2n7n1k1J4K9K3RKJjpj4j2jJ5L1M0L9L1J5mk4l8
$$ plain form
1869 -82 -59 -56 -61 -64 -70 -89 -125 -170 -215 -244 -244 -213 -172 -156 -180 -218 -238 -229 -207 -183 -154 -117 -82 -61 -56 -60 -74 -94 -113 -115 -100 -77 -60 -58 -70 -87 -106 -137 -188 -240
1852 -240 -254 -213 -146 -105 -115 -158 -204 -230 -230 -207 -179 -166 -173 -190 -208 -229 -250 -264 -263 -247 -220 -194 -177 -175 -179 -182 -192 -217 -247 -263 -262 -270 -294 -313 -301 -265 -228 -198 -173
1835 -173 -162 -179 -213 -237 -239 -235 -235 -234 -229 -227 -237 -249 -256 -262 -279 -301 -322 -338 -342 -314 -248 -178 -146 -159 -183 -188 -176 -166 -164 -160 -149 -136 -131 -142 -169 -201 -224 -229 -225 -223 -231 -244 -256
1816 -256 -260 -249 -221 -181 -140 -113 -105 -115 -132 -150 -160 -155 -134 -111 -105 -123 -147 -162 -164 -164 -159 -147 -134 -136 -154 -169 -164 -142 -121 -112 -111 -113 -117 -120 -119 -118 -124 -137 -150 -164 -186 -218 -254
1797 -254 -277 -279 -260 -233 -215 -212 -215 -208 -182 -148 -116 -93 -82 -85 -99 -112 -118 -116 -112 -105 -96 -96 -109 -126 -127 -104 -73 -55 -58 -73 -86 -92 -96 -103 -117 -141 -164 -180 -193 -217 -264 -320 -358
1779 -358 -363 -345 -325 -317 -315 -312 -302 -279 -233 -168 -104 -66 -62 -80 -104 -120 -122 -117 -117 -133 -161 -187 -206 -221 -231 -227 -205 -177 -156 -145 -135 -127 -131 -150 -177 -202 -222 -235 -234 -215 -185
1761 -185 -156 -139 -135 -139 -137 -126 -113 -109 -118 -133 -149 -165 -179 -189 -190 -184 -172 -159 -148 -149 -165 -192 -222 -253 -279 -287 -267 -228 -193 -180 -189 -205 -212 -202 -177 -153 -139 -130 -110 -78 -57
1743 -57 -66 -105 -154 -201 -238 -259 -258 -242 -230 -229 -224 -203 -170 -145 -140 -151 -175 -217 -274 -325 -346 -332 -303 -280 -271 -269 -268 -269 -276 -290 -302 -303 -288 -257 -217 -178 -147 -132 -136 -160 -198
1725a98l4j1J6L1K7J2LkoqjJ3K2K1J6J1jk6n0m8j8J6K4Qj2k5k3nK6N5O0M0J4QK8O6J11J30
1709B90R2Pp9j12r4o3m3l4k6k0j4%J4J3j1l5l8k6j6oPK0K1RJKNOOPJ0J8K6K4Rj0j7j8k5l5
1692a35l2j3Kkj6j8j4j1pKJ0PMJ7M1N1K9j1m4n0l2pNJKJ6K5J2j1k1j7j5k0j5LK6L5L2J7%j4
1674a68j4prj8j3QK9K7J5%j6k9k2NK6J6pj3KJ3PmkMQJ0Q%j6k8k4qPPnj2NM0O3N2K0mj3j5k3
1654i8k5k1k0k2j6KJ2jj7j5nqj9oL7P3O4K0j5j4J0K8L1J8kj7j5lJj0j8jK3K6Jk0j3NRJqj6
1636f4k4k9k4j5j5j9k0k5l5l6j4K3M0K7jk1k3mK5M2K6lj0J1L0J9loOJ2RM%j2j8kK3K8Pj4j3
1618a18LNj2k4j2J6L6L7K5Rrl2m0k2J5M2M0K7J3pl6n8m7k3j2k1k5qJ0Roj5j2%J5K3J5lj0l
1601b15PRJ3K4L1J3k1m6m7k4J1L8L6Ll3l9rK2K4OoOK7L9L3J9P%kkrk1l1k8j2RJ8Nk1l8l1j
$$ plain form
1725 -198 -232 -243 -227 -196 -169 -157 -154 -156 -162 -170 -171 -158 -136 -115 -99 -88 -89 -115 -165 -213 -231 -215 -191 -183 -195 -220 -243 -248 -222 -167 -107 -67 -53 -45 -17 49 160 290
1709 290 382 389 310 198 104 41 -2 -36 -62 -82 -96 -96 -82 -69 -80 -115 -153 -179 -195 -201 -194 -174 -153 -144 -143 -141 -136 -130 -124 -117 -107 -89 -63 -39 -30 -40 -57 -75 -100 -135
1692 -135 -167 -180 -178 -180 -196 -214 -228 -239 -246 -244 -234 -227 -223 -206 -165 -114 -85 -96 -140 -190 -222 -229 -224 -223 -221 -205 -180 -168 -179 -200 -217 -232 -252 -267 -264 -238 -203 -171 -154 -154 -168
1674 -168 -182 -189 -198 -216 -229 -221 -192 -165 -150 -150 -166 -195 -217 -212 -186 -170 -177 -190 -188 -175 -168 -172 -174 -170 -162 -152 -144 -144 -160 -188 -212 -220 -213 -206 -211 -223 -218 -178 -115 -63 -43 -47 -60 -75 -98
1654 -98 -123 -144 -164 -186 -202 -200 -188 -189 -206 -221 -226 -234 -253 -259 -222 -149 -85 -65 -80 -94 -84 -56 -25 -7 -9 -26 -41 -44 -43 -53 -71 -72 -49 -23 -22 -42 -55 -50 -41 -40 -48 -64
1636 -64 -88 -117 -141 -156 -171 -190 -210 -235 -270 -306 -320 -297 -257 -230 -231 -252 -275 -279 -254 -212 -186 -189 -199 -188 -158 -139 -142 -148 -142 -130 -121 -117 -117 -129 -147 -149 -126 -98 -91 -105 -118
1618 -118 -115 -110 -122 -146 -158 -142 -106 -69 -44 -35 -44 -76 -116 -138 -123 -81 -41 -14 -1 -8 -44 -102 -149 -172 -184 -205 -230 -238 -228 -219 -225 -240 -252 -252 -237 -214 -199 -202 -212 -215
1601 -215 -208 -199 -186 -162 -131 -118 -139 -185 -232 -256 -245 -207 -171 -168 -201 -240 -249 -227 -203 -197 -203 -197 -170 -131 -98 -79 -72 -72 -74 -76 -85 -106 -137 -165 -177 -168 -150 -145 -166 -204 -235 -236
1583b36K7M2M0L0J3pk1k2j4j0j3j7j6j4j7j7pNJ2ROOQJ2J4J5Ooj6j5nMjk3m1l7j1J5K2J9K6
1565b35L9L8K4J4J4Prk3j8nKJKjj0k1k2qKnk1k8j1J5K6J2rlK3M0K4nj6rqj5j0J2K3Nk4l4k0
1546b47qj1j0OK2J8KML0N6N7L6J0j1k7l4k5lJ8K8K5J3nk2l1l6m8n8m7j1K1K5RLJ4K7K9K1J6
1530a44J7K1J4pl4m3k4NJ9J4POkj8l1k2JK1L2L6M1L6J8lj9k7l0k9k4j4omlj%kpqm%NQQjj6
1510b14k2j9j7j7j1MK3K9K3J1OKKQJ7K3K2J4Jj4k7k6j5lmj4k2j9qnrpJ3L4L5J4ooNJ1J7L7
1492a34N6M5Nl4m6l2j4NK5L6K7Oj6k1j3j%j2k4j2PJ2rk4j0J8K6J0omRJ9K1J5Kj2j8j6j2j7
1474a43k4k4j8j1oLJ5K7L2L2K6K0J7J1kk0k6k0j4j7k2j3PK3K1J1jj0j2%J5J4oj8jK6L0Pj6
1458h7j6j2j8k8k4j1mKK4M9N0K1j1k0j0mrj3kJ7K8J9j0l6m5l8k0JK0K6J0j2k0j1rj8k1oJ7
$$ plain form
1583 -236 -209 -167 -127 -97 -84 -91 -112 -134 -148 -158 -171 -188 -204 -218 -235 -252 -259 -254 -242 -233 -227 -221 -213 -201 -187 -172 -166 -172 -188 -203 -208 -204 -205 -228 -269 -306 -317 -302 -280 -261 -235
1565 -235 -196 -158 -134 -120 -106 -99 -108 -131 -149 -154 -152 -151 -149 -150 -160 -181 -203 -211 -209 -214 -235 -263 -274 -259 -233 -221 -230 -233 -210 -170 -146 -151 -167 -176 -184 -199 -209 -197 -174 -169 -193 -227 -247
1546 -247 -255 -266 -276 -270 -248 -230 -228 -224 -194 -138 -81 -45 -35 -46 -73 -107 -132 -135 -117 -89 -64 -51 -56 -78 -109 -145 -193 -251 -298 -309 -288 -263 -254 -251 -237 -210 -181 -160 -144
1530 -144 -127 -106 -92 -99 -133 -176 -200 -195 -176 -162 -155 -149 -151 -169 -200 -222 -221 -200 -168 -132 -91 -55 -37 -40 -59 -86 -116 -145 -169 -183 -189 -193 -196 -197 -197 -199 -206 -214 -218 -218 -213 -205 -197 -198 -214
1510 -214 -236 -255 -272 -289 -300 -296 -273 -244 -221 -210 -204 -202 -200 -192 -175 -152 -130 -116 -115 -129 -156 -182 -197 -200 -204 -218 -240 -259 -267 -272 -281 -288 -275 -241 -206 -192 -198 -204 -199 -188 -171 -134
1492 -134 -78 -33 -28 -62 -108 -140 -154 -149 -124 -88 -61 -55 -71 -92 -105 -106 -106 -118 -142 -154 -147 -135 -144 -168 -178 -160 -134 -124 -130 -134 -125 -106 -85 -70 -68 -80 -98 -114 -126 -143
1474 -143 -167 -191 -209 -220 -226 -223 -208 -181 -149 -117 -91 -71 -54 -43 -45 -65 -91 -111 -125 -142 -164 -177 -170 -147 -126 -115 -116 -126 -138 -138 -123 -109 -115 -133 -134 -108 -78 -71 -87
1458 -87 -103 -115 -133 -161 -185 -196 -200 -198 -174 -125 -75 -54 -65 -85 -95 -99 -108 -121 -123 -106 -78 -59 -69 -105 -150 -188 -208 -207 -187 -161 -151 -163 -183 -194 -203 -221 -242 -248 -231
1441b31K4J6QJ1J6J8J2%oKJ1Kk1k9j1J3Rj7l1j9KJ5J2NlonjJjjjmqrpmOK3L9L5J7M%nj6j9
1420a54j0jkrj3j2rnPK2K2Nj9k7j3J2L0L1K1J4J3J6J5J3RJ1Rkk9n4n6l4qNPPKrj4kJ0Nj4k0
1401b30j5qoLK1K7J8J1J7K2Qj1j3J2L5L1Lk5l1j7j%j0k1k4j3J1M1M8K7jnJ0J6lk5k9j2PK1
1384a11K1Oj2j4jNmk1k9l0k4nK5M9N2M2K4Lj7j8mPkj4j4ponMRol0m0l4k9l0j8KJ4J1QJ7L2
1365a94L5K2MmJ2M8P1N8K1nqoj4j6OM7R5J36J68J89K15K52K78K53J57K0j10k01k45k41k03
1352H40j63j38j21r8p4o4o1n2l7k3j6j2mRK7M6N0L6J3nj0pj0k7n3o5m8j2J2J3J4K9L7J9j9
1337B6l6k7j1qrkOll0n3n1k7MK9M6N4M8K6kk4k8j2RK0J2mr%kk1m8n8m8k8nJ8L4K5Kj4rPK2
1318a81L2L4K4Mrp%Jqj7k1k1j4mJKjpk4m4m5k6mOJ3K9L5K0LPK7L8L2K1J1jj3k0k4k5j5J2L3
$$ plain form
1441 -231 -207 -191 -183 -172 -156 -138 -126 -126 -132 -130 -119 -117 -138 -167 -178 -165 -156 -173 -204 -223 -221 -206 -194 -189 -192 -198 -203 -204 -203 -204 -205 -206 -210 -218 -227 -234 -238 -232 -209 -170 -135 -118 -114 -114 -119 -135 -154
1420 -154 -164 -165 -167 -176 -189 -201 -210 -215 -208 -186 -164 -159 -178 -205 -218 -206 -176 -145 -124 -110 -97 -81 -66 -53 -44 -33 -24 -26 -55 -109 -165 -199 -207 -202 -195 -188 -186 -195 -209 -211 -201 -196 -210 -230
1401 -230 -245 -253 -259 -256 -235 -208 -190 -179 -162 -140 -132 -143 -156 -144 -109 -78 -75 -100 -131 -148 -149 -149 -159 -180 -204 -217 -206 -165 -117 -90 -91 -96 -86 -70 -73 -98 -127 -139 -132 -111
1384 -111 -90 -84 -96 -110 -111 -106 -110 -131 -160 -190 -214 -219 -194 -145 -93 -51 -27 -24 -41 -59 -63 -56 -58 -72 -86 -93 -99 -104 -100 -91 -97 -127 -167 -201 -230 -260 -278 -276 -262 -251 -243 -226 -194
1365 -194 -159 -137 -133 -137 -125 -77 -6 52 73 68 60 54 40 24 30 77 172 308 476 665 880 1132 1410 1663 1820 1840 1730 1529 1284 1043 840
1352 840 677 539 418 320 246 182 121 69 32 9 -7 -19 -23 -14 13 59 109 145 158 153 143 136 126 99 46 -19 -67 -79 -67 -54 -40 -11 26 45 26
1337 26 -10 -37 -48 -56 -65 -67 -61 -64 -94 -147 -198 -225 -221 -192 -146 -92 -44 -18 -20 -44 -72 -84 -75 -55 -43 -47 -56 -56 -58 -79 -127 -185 -233 -261 -266 -248 -214 -189 -187 -201 -210 -203 -181
1318 -181 -149 -115 -91 -87 -96 -103 -103 -102 -110 -127 -148 -169 -183 -187 -186 -184 -185 -192 -216 -260 -305 -331 -335 -329 -316 -287 -252 -232 -229 -222 -195 -157 -125 -104 -93 -94 -107 -127 -151 -176 -191 -179 -146
1299a46K5lj8j2lpj2rkjPK0K4Pj3j5nlj2j9j7j4j2nJ4L4L7K7J5QONKOJ0Oj3l0l2j9l%pj8j9
1280b16rOPJnjMjqj1j0j1j1mJjjQJ2ql3l0%J8Oj4j3LNjkPJ2PRK6M3M4K1j0l5m0k1J5M9O0L9
1259i3jl2l2j1Kpj7j6rrj2kJ2J2rk7k5rLKnlRJ3nl2l3OO2R4P8L7kk3k8k6k5l3m2m3k6PL7M7
1240b16L4Rqj4j1qqrj1qJJ2J1kj6j6kJ9L4L6K7J9J7J2nk2k3j3j0j7j3QK7K5Rnj0rKK3L3K2
1222g6QPPj3l3k7mPrk3j7JJ5K5L1K7RnlLLpj7k0j2JJ1Kj6l8m9m7k3J6M5L5Mj3lJ0QJ1L4N9
1203g6N6K4kj2j4j9k1j8pNRnk9m1k9j0%MQJ4J2ONQRJ2J8K2J2kj4k4l7m6l1pKrj6kJ8K4K1J6
1184a66J1lj3qQJ7J0%MJ4K0J7Poj8k1j1%%j0k1k1j6j2nJ2K7L0K4J9J7J0mj4rJK%loj3k2k2
1165a74j1kmj6k2nK4M1K6ok7k0mJoj5j9rJ6M6N6L7J0lqk1l4k6%J7J0rk0j6lJ5K7K8K3K6K9
$$ plain form
1299 -146 -121 -124 -142 -154 -157 -164 -176 -185 -187 -188 -181 -161 -137 -130 -143 -158 -163 -166 -178 -197 -214 -228 -240 -245 -231 -197 -160 -133 -118 -110 -104 -99 -97 -91 -81 -75 -88 -118 -150 -169 -172 -172 -179 -197 -216
1280 -216 -225 -219 -212 -211 -216 -217 -213 -214 -222 -233 -243 -254 -265 -269 -268 -269 -270 -262 -250 -258 -291 -321 -321 -303 -297 -311 -324 -321 -316 -317 -319 -312 -300 -293 -284 -258 -215 -171 -150 -160 -195 -235 -256 -241 -192 -132 -93
1259 -93 -94 -126 -158 -169 -167 -174 -191 -207 -216 -225 -237 -239 -227 -215 -224 -251 -276 -285 -282 -280 -285 -288 -279 -266 -271 -303 -336 -330 -268 -174 -96 -59 -61 -84 -112 -138 -163 -196 -238 -281 -307 -300 -263 -216
1240 -216 -182 -173 -181 -195 -206 -214 -222 -231 -242 -250 -249 -237 -226 -228 -244 -260 -262 -243 -209 -173 -146 -127 -110 -98 -103 -125 -148 -161 -171 -188 -201 -193 -166 -141 -132 -137 -147 -156 -154 -131 -98 -76
1222 -76 -68 -61 -54 -67 -100 -127 -131 -124 -133 -156 -173 -172 -157 -132 -101 -74 -65 -70 -73 -70 -67 -74 -91 -111 -123 -122 -111 -109 -125 -163 -212 -259 -282 -266 -221 -186 -182 -195 -198 -188 -180 -169 -135 -76
1203 -76 -20 4 2 -10 -24 -43 -64 -82 -89 -84 -75 -80 -109 -150 -179 -189 -189 -185 -177 -163 -151 -145 -140 -132 -123 -111 -93 -71 -59 -61 -75 -99 -136 -182 -213 -220 -218 -227 -243 -245 -227 -203 -182 -166
1184 -166 -155 -158 -171 -179 -171 -154 -144 -144 -140 -126 -106 -89 -82 -88 -106 -127 -138 -138 -138 -148 -169 -190 -206 -218 -223 -211 -184 -154 -130 -111 -94 -84 -88 -102 -111 -110 -108 -108 -111 -117 -130 -152 -174
1165 -174 -185 -187 -191 -207 -229 -234 -210 -169 -143 -149 -176 -196 -200 -199 -205 -220 -239 -248 -232 -186 -130 -93 -83 -86 -94 -115 -149 -175 -175 -158 -148 -157 -177 -193 -196 -181 -154 -126 -103 -77 -48
1148d8J5k1m2k5PJ5pk9k7j2oj2j6j8j6qLJ0J4J5J6J3%j2j2kPRJ3J8J0j4l7l3nK6M2M2L2J5
1130h0lj2j0j1j8k1j3JQMjjLJ1J4Qmj4j5j1j2j6j3lRJ5J4Lj3k6j9%J9K1Roj3j1mknj3j7j6
1111b64j0lKmj4k0j2JJ1J6J9J8J4J1J5K5L5M6M4K6ql0k7j4j5k6k5j2jKPJ6J5Kj1r%O%j4k8
1093b16l5k2JJ9K6K3K2J5Kpj1nJMmj7k3rJ4K6K8L1L3J8rj6KJ8Qj0j4nrk0j9pRK4L7L4J0j1
1075f4kK1J8j5l8k9prk5k9j0J6L4L9L3K0MoqkNKj6l1l0j6ppkJ2K8K7Qj9l6l3j3MQMNJ0%k5
1056a81m4l8j5PK0L2M1M1J7j8m0k6J1K9J7jMJ7J3j4l8m0k8lL3O1N8K8PJ1J5jk3k9k1j8k2k0
1040a58j6j3nJ0J8J0mqoqpJ0L0K2j0k8j5Kkj9j8%Qmj2%K1L1K0NJLjj3j5kJ2J1ORJ6J2%mLO
1020a02lj1lJ4K2J4lk0k9j9PK8K7J0%OJ8K3K1J7Pj3k9l8l1k5l0m0m6l7j8KJ0Lj2j8oJ6K7K2
$$ plain form
1148 -48 -33 -54 -96 -121 -114 -99 -106 -135 -162 -174 -180 -192 -208 -226 -242 -250 -247 -237 -223 -208 -192 -179 -179 -191 -203 -205 -198 -189 -176 -158 -148 -162 -199 -232 -237 -211 -169 -127 -95 -80
1130 -80 -83 -95 -105 -116 -134 -155 -168 -167 -159 -155 -156 -157 -154 -143 -129 -121 -125 -139 -154 -165 -177 -193 -206 -209 -200 -185 -171 -168 -181 -207 -226 -226 -207 -186 -177 -183 -196 -207 -211 -213 -218 -231 -248 -264
1111 -264 -274 -277 -275 -279 -293 -313 -325 -324 -313 -297 -278 -260 -246 -235 -220 -195 -160 -114 -70 -44 -52 -82 -109 -123 -138 -164 -189 -201 -202 -200 -193 -177 -162 -160 -171 -180 -180 -174 -174 -188 -216
1093 -216 -251 -273 -272 -253 -227 -204 -182 -167 -165 -172 -183 -188 -187 -183 -187 -204 -227 -236 -222 -196 -168 -137 -104 -86 -95 -111 -109 -91 -83 -93 -107 -112 -121 -141 -160 -167 -158 -134 -97 -63 -53 -64
1075 -64 -66 -45 -27 -42 -80 -109 -116 -125 -150 -179 -189 -173 -139 -100 -67 -47 -43 -49 -57 -59 -54 -52 -68 -99 -129 -145 -152 -159 -161 -149 -121 -94 -86 -105 -141 -174 -187 -183 -175 -171 -166 -156 -156 -181
1056 -181 -225 -263 -278 -271 -251 -219 -178 -137 -120 -138 -178 -204 -193 -164 -147 -148 -144 -127 -114 -128 -166 -206 -234 -237 -204 -143 -85 -57 -50 -39 -24 -25 -48 -77 -98 -116 -138 -158
1040 -158 -174 -187 -192 -182 -164 -154 -158 -166 -172 -180 -187 -177 -147 -125 -135 -163 -178 -176 -178 -197 -215 -215 -207 -211 -223 -223 -202 -171 -151 -146 -145 -142 -143 -156 -171 -173 -161 -150 -144 -135 -119 -107 -107 -111 -108 -102
1020 -102 -105 -116 -119 -105 -83 -69 -72 -92 -121 -140 -133 -105 -78 -68 -68 -62 -44 -21 0 17 24 11 -18 -56 -87 -112 -142 -182 -228 -265 -283 -281 -271 -268 -280 -298 -304 -288 -261 -239
1002b39J0J5K9L1J1j8k4pJ2J2lj1lJ7L6M2K7rm1m3j7J0J7J4J8K1J3%NK2J9mk3j7kkj3j8j7
986a30j5pRJ6ml8m1lM1N1K7KmKPJ1J3J8K0J8J1Jj6l4l6k2LK1K9L3L2K0mk1k0pJJjqk1l3k2
967a00%Qqk7k7j2jjmjPJ2J1JpjJ8L4L8L4K3Nj4k8k0onk1l8l4j3J1J8Qrj9k3k4j6MK4J9ql0
948b22k2MJ8Rqj8k0j9j1MK4M5N5N2L6J6Krk1l0k7j1OJ6J9K1K2J6%k2l4l0j1J4L1L8K8nm6o6
930a56n5k6kPOkj8k6j7RL1M0L9L0J3rk0j3JOjj2j9j7LL5N9N5K4qj6%J1Lj6k4j4nkLJ7K5Qk0
911g3l5l2l0l4k8oJ0J2RJ0J0lj9k3j5nLJ2J2kj6j0J3K4J2lJK2M0M7M7M2K8J0j0k6l7l3j8j0
894a04j7l3l1j2Njj9k3lK1K9J9QNRJ6J8J2jj5k3k8l4m0l3j5OJ9K3K2K0J4OklNJ9K7K0Lj1j2
876a34qlLJ5K1J8J2J1J5J5jk5m3m6l2qPLj7l3k8nK0L4L5K3Pj0j8rOJ6J5J7K4K8J6nj1lNKk
$$ plain form
1002 -239 -229 -214 -185 -154 -143 -161 -185 -192 -180 -168 -171 -182 -185 -168 -132 -90 -63 -72 -113 -156 -173 -163 -146 -132 -114 -93 -80 -80 -75 -53 -34 -38 -61 -78 -80 -82 -95 -113 -130
986 -130 -145 -152 -143 -127 -131 -169 -210 -213 -172 -121 -94 -92 -96 -94 -87 -76 -63 -45 -25 -7 4 5 -11 -45 -81 -103 -100 -79 -50 -17 15 35 31 10 -10 -17 -16 -15 -16 -24 -45 -78 -100
967 -100 -100 -92 -100 -127 -154 -166 -167 -168 -172 -173 -166 -154 -143 -142 -149 -150 -132 -98 -60 -26 -3 2 -12 -40 -60 -66 -71 -92 -130 -164 -177 -166 -148 -140 -149 -168 -191 -215 -231 -227 -203 -184 -192 -222
948 -222 -244 -240 -222 -213 -221 -239 -259 -278 -289 -285 -261 -216 -161 -109 -73 -57 -55 -64 -85 -115 -142 -153 -147 -131 -112 -91 -69 -53 -53 -75 -109 -139 -150 -136 -105 -67 -39 -44 -90 -156
930 -156 -211 -237 -239 -232 -226 -228 -246 -272 -289 -280 -249 -209 -170 -140 -127 -136 -156 -169 -168 -162 -163 -175 -194 -211 -208 -173 -114 -59 -35 -43 -59 -59 -48 -45 -61 -85 -99 -104 -106 -103 -86 -61 -53 -73
911 -73 -108 -140 -170 -204 -232 -238 -228 -216 -207 -197 -187 -190 -209 -232 -247 -252 -249 -237 -225 -227 -243 -253 -240 -216 -204 -207 -206 -184 -144 -97 -50 -8 20 30 20 -6 -43 -76 -94 -104
894 -104 -121 -154 -185 -197 -192 -193 -212 -235 -238 -217 -188 -169 -161 -156 -147 -131 -113 -101 -102 -117 -140 -168 -202 -242 -275 -290 -284 -265 -242 -220 -200 -186 -180 -182 -185 -180 -161 -134 -114 -111 -122 -134
876 -134 -142 -145 -142 -127 -106 -88 -76 -65 -50 -35 -36 -61 -104 -150 -182 -190 -183 -180 -197 -230 -258 -263 -243 -209 -174 -151 -144 -154 -172 -181 -175 -159 -144 -127 -103 -75 -59 -64 -75 -78 -73 -71 -73
857g3J1K6K2kk4k8j5jRMk1n3n7j8L2N3L4Omj%olPJ0lk0j6NK2J6nk8m0l9k2NL4N0M7L3J6Mj
838c4ql0o2p3m5jK8L0K8L6M2L1Nj8k9k5j3qk0m1m5k1OJ2MNJ9K8J7Kl%lj7l2m1l5j3K1M0L2
820b31J0nnoj5j7jK0K6J7QKnj7k2j0QJ3Lj3j7pJ7L6L1Nj5lK2K6Mj1KK4K5J2NONnpmrk2k9k2
800a71j4j9k6j8jJ2J5J5J5Kj1pK0M2L3Jk7k8jL2M4K4j5l3j6J5L2K3Jk0m0m7l7j9pjRK2K4J0
783a67oj1j5j6j2LJ2Mj1j8j5j2oLJ1PKLJj2k2j0J5K3J1LJ5L2L4K4J1MKOPMk%PKrj1JOj0k2
763a34j5LMllJ1K2K2J9J0nk1k0plj0j3jRJ1Mpl1n2n0j5K3L4K2J1RLj1j7lK2L6K6Mj2j5j4j8
744a75k4k3k1j9j1J4L7L8J8%jlj6k9k0JJ2J0JlkRK6L2K2Llkrk6k4NL5L4Lk7l0rRJ3J2J8K8
726i7J9qk8k1prk3j5J9N2N4L2Lk0l1k6j3j0j8k4j4JKoolok1k3nK1K7J2JPK7L9L4J6nk9m9o4
$$ plain form
857 -73 -62 -36 -14 -16 -40 -68 -83 -84 -75 -71 -92 -145 -202 -220 -188 -135 -101 -95 -99 -100 -100 -106 -109 -102 -92 -95 -115 -131 -126 -104 -88 -93 -121 -161 -200 -222 -217 -183 -133 -86 -53 -37 -33 -34
838 -34 -42 -72 -134 -207 -252 -253 -225 -195 -167 -131 -89 -58 -53 -71 -100 -125 -138 -146 -166 -207 -252 -273 -267 -255 -251 -246 -227 -199 -182 -180 -183 -183 -186 -203 -235 -276 -311 -324 -303 -263 -231
820 -231 -221 -226 -231 -237 -252 -269 -270 -250 -224 -207 -199 -197 -202 -219 -241 -251 -243 -230 -227 -240 -257 -264 -247 -211 -180 -175 -190 -193 -171 -145 -141 -152 -150 -126 -101 -89 -84 -78 -73 -78 -85 -89 -98 -120 -149 -171
800 -171 -185 -204 -230 -248 -249 -237 -222 -207 -192 -190 -201 -208 -188 -146 -113 -112 -139 -167 -168 -136 -92 -68 -83 -116 -132 -117 -85 -62 -61 -81 -121 -168 -205 -224 -231 -232 -223 -201 -177 -167
783 -167 -173 -184 -199 -215 -227 -224 -212 -208 -219 -237 -252 -264 -270 -267 -256 -249 -247 -244 -243 -255 -277 -287 -272 -249 -238 -235 -220 -188 -154 -130 -119 -115 -113 -107 -100 -96 -98 -98 -91 -89 -98 -109 -108 -102 -112 -134
763 -134 -149 -146 -142 -145 -148 -137 -115 -93 -74 -64 -69 -90 -110 -117 -120 -130 -143 -144 -135 -124 -120 -127 -158 -210 -260 -275 -252 -218 -196 -185 -176 -173 -184 -201 -204 -182 -146 -120 -116 -128 -143 -157 -175
744 -175 -199 -222 -243 -262 -273 -259 -222 -184 -166 -166 -167 -170 -186 -215 -235 -234 -222 -212 -211 -214 -216 -207 -181 -149 -127 -124 -127 -129 -138 -164 -188 -183 -148 -114 -111 -138 -168 -177 -168 -155 -143 -125 -97
726 -97 -78 -86 -114 -135 -142 -151 -174 -189 -170 -118 -64 -32 -29 -49 -80 -106 -119 -129 -147 -171 -185 -184 -182 -188 -194 -197 -203 -224 -247 -252 -231 -204 -192 -191 -184 -157 -118 -84 -68 -73 -102 -151 -215
707b15o3m8k8qRK2J9Kj0oJ3L1L4K5J4NMRJ1Nnj0j2j2rRL6M7K8%mJ5K5Pj8j8jJ2OkJJ3K0K0
688b7J8J1PLjj3l6m8l3kK3K4J3JjLJ1J1kj8k0j2oj0j6j2lJNJ1J7J5RN%j4l2l7k1LJ9K1J5R
669a09RJ5K2K0J5J1Qkj6k1pMok6l1j2QQmj4j5j9k7k5qJ6L3L6L2K1Kj9k9k7k1j6nQRoj4ML4
650a64M4K5ok1j9j3p%PJ5K0K1J5RJ2K3K1Lk0k9k2j3kMLoj2oQJ2Jrj4j2qkJ0L1N1N6L2j3m1
632a6l2JJ2j1l6m2l2k4j6%J2Rnj4oJ%qk2l4l1mL4N2M2K4K0L2L6K6Mj7l1l6k9j2PJ7J6Mj1j2
614a32jJ3J1pk1j0K1L7J5l0n6m3j1PNjlqj3j0JNqk8l0j0K1L9L7J6oj2nK%KJ7L5L9L0J8Nj1
595h0k3k0jQlj9k8k9l2l3k3kK4M4M9L9J9Mlqj5j9j2%jj9m2n1m0j2J5K1Nj0kK0L3K4J0MPRJ3
576a79K1L4L6J8j1l8m7m1k3jJ6K1J2LLJ2J5RK%JklKJ0J3OMJ0J5J5R%pj1pOK1K1Pj6l4l9l3
$$ plain form
707 -215 -278 -326 -354 -362 -353 -331 -312 -310 -320 -326 -313 -282 -248 -223 -209 -204 -200 -191 -180 -175 -180 -190 -202 -214 -223 -214 -178 -131 -103 -103 -107 -92 -67 -60 -78 -96 -97 -85 -79 -81 -80 -67 -47 -27
688 -27 -9 2 9 12 11 -2 -38 -86 -119 -121 -98 -74 -61 -60 -61 -58 -47 -36 -38 -56 -76 -88 -94 -104 -120 -132 -135 -134 -129 -118 -101 -86 -77 -72 -72 -86 -118 -155 -176 -173 -154 -133 -118 -109
669 -109 -100 -85 -63 -43 -28 -17 -9 -11 -27 -48 -55 -51 -57 -83 -114 -126 -118 -110 -114 -128 -143 -162 -189 -214 -222 -206 -173 -137 -105 -84 -82 -101 -130 -157 -178 -194 -199 -191 -182 -188 -202 -198 -164
650 -164 -120 -95 -101 -122 -141 -154 -161 -161 -154 -139 -119 -98 -83 -74 -62 -39 -18 -15 -35 -64 -86 -99 -101 -97 -94 -100 -112 -118 -110 -98 -97 -106 -120 -132 -140 -142 -132 -101 -50 6 38 25 -16
632 -16 -48 -47 -35 -46 -82 -124 -156 -180 -196 -196 -184 -175 -180 -194 -200 -199 -199 -207 -229 -263 -294 -298 -264 -212 -170 -146 -126 -94 -58 -32 -28 -45 -76 -112 -141 -153 -146 -129 -113 -109 -120 -132
614 -132 -133 -120 -109 -116 -137 -147 -126 -89 -74 -104 -160 -203 -214 -207 -202 -203 -206 -214 -227 -237 -236 -231 -239 -267 -297 -307 -286 -247 -210 -194 -200 -212 -217 -215 -215 -213 -196 -161 -122 -92 -74 -69 -80
595 -80 -103 -123 -124 -116 -119 -138 -166 -195 -227 -260 -283 -285 -261 -217 -168 -129 -110 -106 -109 -117 -132 -151 -163 -163 -164 -183 -225 -276 -316 -328 -313 -292 -287 -297 -299 -279 -246 -222 -212 -208 -201 -192 -179
576 -179 -158 -124 -88 -70 -81 -119 -166 -207 -230 -231 -215 -194 -182 -179 -176 -164 -149 -140 -138 -138 -137 -139 -142 -140 -130 -117 -111 -107 -97 -82 -67 -58 -58 -65 -76 -83 -77 -56 -35 -28 -44 -78 -117 -150
557a50k6j7nJ3K5K4J9K6M7N5L5qm4n6m0j5lqk0k4j4mOJ4K2K0QmnMMqj7j0J2K7K1MoMK2L1K5
539a6J1kj4k8l8l9k9j8j8k8l6k7lJ6K2K2L0M0L3J0onJlrnjj2k6k3j0qj3qJ2J6nk7j6J4K7J2
520b07rj4porj1rlRK4L1K9K0J6J5RLOJ4J2rk9l0j5prpKJ1J0QJ1Qqk5k0MK3K4J4Lno%Kok2k6
500a91j5lQJ4J5PjQL2M2K4%pj%pj3k1l5m2k7%J3J1J5K8L3J6j0k3j9oPJ0NjLJ8K8K0Lj2j6j8
480a08j1LJ8K0QoqlMLqk4l8m2l3j3NQjoJJ4K5K9K3J0npKJ1R%mj1k4l9l6j9nnpLJ4J7J3ROj
460b09prkJ1K4K9K1J2J2J8J1j5l7l4j6oj3k2k5j9nJ5K7K3J5J5K2J8Jj0oOOmj6k1j8j1qj0j1
442b48nLMmqqpmQK8M4M0J5j4m3n9n2k1J9M2M0K4Q%lkjKJ2K6L3K4OmNK1K8J2j4k9k1JJ2Nj1
422i6k2k1j4lL%j1j5mJ1J2jq%Mmj1%J8K1Lj8k6j8nJ2K7K9J7jqonqj1mJ1K2K2Mk0l8m1l0j5
$$ plain form
557 -150 -176 -193 -198 -185 -160 -136 -117 -91 -44 11 46 38 -6 -62 -102 -117 -120 -128 -148 -172 -186 -190 -184 -170 -148 -128 -120 -124 -129 -125 -121 -129 -146 -156 -144 -117 -96 -92 -98 -94 -72 -41 -16
539 -16 -5 -7 -21 -49 -87 -126 -155 -173 -191 -219 -255 -282 -285 -269 -247 -225 -195 -155 -122 -112 -118 -123 -122 -125 -134 -139 -140 -152 -178 -201 -211 -219 -232 -240 -228 -212 -217 -244 -260 -246 -219 -207
520 -207 -216 -230 -237 -243 -252 -263 -272 -275 -266 -242 -211 -182 -162 -146 -131 -122 -119 -113 -99 -87 -96 -125 -155 -170 -177 -186 -193 -191 -180 -170 -162 -151 -143 -151 -176 -196 -192 -169 -145 -131 -128 -133 -139 -139 -137 -143 -165 -191
500 -191 -206 -209 -201 -187 -172 -165 -166 -158 -126 -84 -60 -60 -67 -68 -68 -75 -88 -109 -144 -186 -213 -213 -200 -189 -174 -146 -113 -97 -107 -130 -149 -155 -148 -138 -133 -134 -131 -113 -85 -65 -62 -74 -90 -108
480 -108 -119 -116 -98 -78 -70 -76 -84 -87 -83 -80 -88 -112 -150 -192 -225 -238 -233 -225 -226 -232 -231 -217 -192 -163 -140 -130 -135 -142 -140 -129 -120 -120 -124 -135 -159 -198 -234 -253 -258 -263 -270 -267 -253 -236 -223 -214 -208 -209
460 -209 -216 -225 -227 -216 -192 -163 -142 -130 -118 -100 -89 -104 -141 -175 -191 -197 -210 -232 -257 -276 -281 -266 -239 -216 -201 -186 -164 -146 -145 -155 -161 -155 -149 -153 -169 -190 -208 -219 -227 -237 -248
442 -248 -253 -250 -246 -250 -258 -266 -273 -277 -269 -241 -197 -157 -142 -156 -199 -258 -310 -331 -312 -270 -230 -206 -198 -198 -201 -203 -204 -202 -190 -164 -131 -107 -101 -105 -100 -79 -51 -39 -53 -82 -103 -102 -90 -85 -96
422 -96 -118 -139 -153 -156 -153 -153 -164 -179 -183 -172 -160 -161 -169 -169 -165 -169 -180 -180 -162 -141 -138 -156 -182 -200 -205 -193 -166 -137 -120 -121 -129 -135 -140 -148 -159 -163 -152 -130 -108 -104 -124 -162 -203 -233 -248
403b48JJ6K7L0K6K1J2ol1n1n1l6j6%J2J9J9RmpJJ8K1Oj9k9j6NJ5J5J5J5J2J2K4L5L0Rj2j4
386a15mJ2K5L1J8lj6j7k0l5m6l6k2k3l7l4rJ7K8L4M6N2L5Jk2j8KJ9K5K6K6K6K3J6Mrj8k1k3
369f2k5k2j2mj5m1n5l9pK1L6M6N0L5Nj6j8j2k0l2l0j8j2j6j9mJ8L5M0L6K9K5K1Rj6m0l7j1
352a77J4K4K0J5Oj0k5l2l2k5j0RK1J2nj5j2mMROoj7j8j6j7j6lJ2J8J8K3K7J4j5l2j8PK1K0
335b05J6J8K5L1K5Jk8l6j5J2K1Qrk3l1l0j8nLJ0K6L8L0QlMOj0k9k4nRJ3J4Qqj8oJ7J9kk1j6
316a80lnk0k3j0LNjnkMOQPJ3K4L1K6J5RQKj2j9j2loj9k5j8j1j0j3rKJ1K0K7K9J8jk0k5k2j3
297b19m%mj3j5mRJ2LjMPmj9j9ojj1k3j4J7M1L6Qj7k1j1mJJ3L3M4L0pl9m5k1J4L2K3MmJKrj8
277b19j2%O%pkPJ2J3J2J3J1Nnj5j4lJpj6qJ5K6J4KJ2L6M7L2Mk2m0m5l6j5jnj5j0J5L9L8Rk2
$$ plain form
403 -248 -247 -231 -204 -174 -148 -127 -115 -121 -152 -203 -254 -290 -306 -306 -294 -275 -256 -247 -251 -258 -257 -239 -218 -212 -231 -260 -276 -271 -256 -241 -226 -211 -199 -187 -163 -128 -98 -89 -101 -115
386 -115 -119 -107 -82 -51 -33 -36 -52 -69 -89 -124 -170 -206 -228 -251 -288 -322 -331 -314 -286 -252 -206 -154 -119 -118 -140 -158 -156 -137 -112 -86 -60 -34 -11 5 9 0 -18 -39 -62
369 -62 -87 -109 -121 -125 -140 -181 -236 -275 -282 -261 -225 -179 -129 -94 -89 -105 -123 -135 -155 -187 -217 -235 -247 -263 -282 -286 -268 -233 -193 -157 -128 -103 -82 -73 -89 -129 -166 -177
352 -177 -163 -139 -119 -104 -98 -108 -133 -165 -197 -222 -232 -223 -202 -190 -195 -210 -222 -226 -222 -213 -207 -213 -230 -248 -264 -281 -297 -300 -288 -270 -252 -229 -202 -188 -203 -235 -253 -246 -225 -205
335 -205 -189 -171 -146 -115 -90 -89 -117 -153 -168 -156 -135 -127 -136 -159 -190 -220 -238 -243 -240 -230 -204 -166 -136 -128 -131 -127 -121 -131 -160 -184 -189 -180 -167 -153 -145 -153 -171 -177 -160 -141 -143 -164 -180
316 -180 -183 -188 -208 -231 -241 -238 -233 -234 -239 -241 -237 -231 -223 -216 -203 -179 -148 -122 -107 -98 -90 -88 -100 -119 -131 -134 -140 -159 -184 -202 -213 -223 -236 -245 -243 -232 -212 -185 -156 -138 -139 -159 -184 -206 -219
297 -219 -223 -223 -227 -240 -255 -259 -250 -238 -235 -236 -232 -225 -229 -248 -267 -273 -274 -285 -308 -322 -305 -264 -228 -220 -237 -258 -269 -273 -272 -259 -226 -182 -152 -159 -198 -243 -264 -250 -218 -195 -191 -195 -194 -192 -201 -219
277 -219 -231 -231 -225 -225 -232 -234 -227 -215 -202 -190 -177 -166 -161 -166 -181 -195 -198 -197 -204 -220 -228 -213 -187 -173 -171 -159 -123 -76 -44 -40 -62 -102 -147 -183 -198 -199 -204 -219 -229 -214 -175 -137 -128 -150
258a50k6%K9L2J0j4j9mJ4J7QkmLJ1J8K7K6J3j0k9l6m2m6l3%L0K9Nj3j5j4k1j8KK3K4RKPPj
239a51oNK3K7J4ok5l7l9k4%J9K0J4NKk%QJ4QkjRJ0mk0j2J4L5L3Rk4m7m4j4J9K8J8NMJj1l2
220a57m7m4k3NK2K1J3J3Rkj8j5LJ3QPK0L3K9J3ON%j2k4k3j9j5j8k5k5j2J1K4J7NNJ5J9Kj9
203a80l0k5j0MJ0J1J0RPJljMMknnpj6j5RL9M9K1k3m7k9J0L7L5J6mj6k1j0J2K7K1NKJ5K9K7
184c5J3ok1k9k5j2nj0j5qLKn%J6J9%k1k0lPnj9j5PK9M1L9K5Jk7l6k2%J6K0J8Qj2l3l3j6KO
165a61MQJ2QRK5L9K8ql9m1k6j2nQJ7J0rk2j9p%LJ1K2K9K6J5Jnnmj0j9j7LK4K7Qj3j8qJ2K8
146g1K9J4j1l6m1k2PK4J9NJJ3K3K2J7K1L1K8Rj3l3m6m9l9j9j0j4j7j2pj1k0k4k3j8oJ1K2J5
129b31JmJ1L2M2L5J9Lj0k5l5l1rJ6K2J1lmLJ2K0J9kk8k8QM5M7K1mj3k2l5l6j8OJ9J4lk2k1
$$ plain form
258 -150 -176 -176 -147 -115 -105 -119 -138 -142 -128 -111 -103 -105 -109 -106 -95 -77 -50 -24 -11 -21 -50 -86 -128 -174 -207 -207 -177 -148 -143 -156 -171 -185 -206 -224 -222 -199 -175 -166 -164 -157 -150 -151
239 -151 -157 -152 -129 -102 -88 -94 -119 -156 -195 -219 -219 -200 -180 -166 -161 -159 -161 -161 -153 -139 -131 -133 -134 -125 -115 -119 -139 -151 -137 -102 -69 -60 -84 -131 -175 -189 -170 -142 -124 -119 -115 -114 -125 -157
220 -157 -204 -248 -271 -266 -244 -223 -210 -197 -188 -190 -208 -223 -220 -207 -199 -192 -172 -139 -110 -97 -91 -86 -86 -98 -122 -145 -164 -179 -197 -222 -247 -259 -248 -224 -207 -202 -197 -182 -163 -161 -180
203 -180 -210 -235 -245 -241 -231 -220 -210 -201 -194 -193 -196 -197 -193 -189 -191 -196 -201 -208 -224 -239 -230 -191 -142 -121 -144 -191 -220 -210 -173 -138 -122 -126 -142 -163 -173 -161 -134 -113 -108 -106 -91 -62 -35
184 -35 -22 -28 -49 -78 -103 -115 -120 -130 -145 -153 -150 -148 -153 -153 -137 -118 -118 -139 -159 -162 -155 -160 -179 -194 -187 -158 -117 -78 -53 -52 -79 -115 -137 -137 -121 -101 -83 -75 -87 -120 -153 -169 -167 -161
165 -161 -157 -149 -137 -129 -120 -95 -56 -28 -36 -75 -116 -142 -154 -159 -151 -134 -124 -133 -155 -174 -181 -181 -178 -167 -145 -116 -90 -75 -74 -79 -84 -88 -98 -117 -134 -131 -107 -80 -72 -85 -103 -111 -99 -71
146 -71 -42 -28 -39 -75 -116 -138 -131 -107 -88 -83 -82 -69 -46 -24 -7 14 45 73 82 69 36 -10 -59 -98 -117 -127 -141 -158 -170 -177 -188 -208 -232 -255 -273 -279 -268 -246 -231
129 -231 -230 -234 -223 -191 -149 -114 -95 -92 -102 -127 -162 -193 -202 -186 -164 -153 -156 -160 -157 -145 -125 -106 -108 -136 -164 -156 -111 -64 -43 -47 -60 -82 -117 -153 -171 -165 -146 -132 -135 -157 -178
111a78nMpj6nJ1Mj6j4QK0NrMK1K2J1J0J0lj9k4j7pJJ1R%jJ6L0J7mnJ3K6K3K0J9Rj0j7qK%j4
91e3l1m3l9j1J9K7QroMLpj5j4j1pnrj5j8j1mj3l1l8j9J9M1K9kj7oJ0J0J0K6M3L5Lk7l9m4m1
73b98k3KJ0NRK3J9j0k9j3K4M1L5K2J1pl0l9k8oJ9L5L7K5Rlj7l3l8k4%K0L7N2N4L2MmJ2K7K6
55a2J3kj7l2m4n0m7l5j8j4k5l0j1K6M6L9J9NJJKLNQQLj0j5kK0L1K9K3K1J4Lrk0l4m5l7j5K
36b02LmonlNJ8K4J5Mkj1k7l8k9j3mjJ2L5M8M5L1J8J1PRJ4J2Nnj6l0l9l6k4j6j3nPJ0JnMJ8
17a78J6pl9n7n3l1KK6L2K2PkmnmJJ1K0K4K7K3J2LNJ4J9Nj6k5j6qj1k2k8k6j4RL0L4J3j2j0
-2b13RJ8Mj5j6kRJ2J7K6K1lk6k3ML3M8M9L3Mk5m0l7k6j1OJ5Mj9k6nK7M3L7J6j4m1m7l1j7k1
-19b23k7j1J7L4L1K6K6J5j2l7m1l4k8j7%J4K1L1M9N9M1J1jJ3K6J7rk9l3k2j3j6k8l9k9nK5
$$ plain form
111 -178 -183 -179 -186 -202 -207 -196 -192 -208 -222 -214 -194 -189 -198 -194 -173 -151 -140 -130 -120 -123 -142 -166 -183 -190 -189 -178 -169 -169 -170 -154 -124 -107 -111 -116 -103 -77 -54 -34 -15 -6 -16 -33 -41 -39 -39 -53
91 -53 -84 -127 -166 -177 -158 -131 -123 -132 -138 -134 -131 -138 -153 -167 -178 -185 -190 -199 -214 -232 -243 -247 -260 -291 -329 -348 -329 -288 -259 -261 -278 -284 -274 -264 -254 -228 -185 -150 -147 -174 -213 -257 -298
73 -298 -321 -319 -309 -304 -295 -272 -253 -263 -292 -305 -281 -240 -205 -183 -172 -179 -209 -248 -276 -282 -263 -228 -191 -166 -157 -160 -177 -210 -248 -272 -272 -252 -215 -163 -109 -77 -73 -77 -65 -38 -12
55 -12 1 -1 -18 -50 -94 -144 -191 -226 -244 -258 -283 -313 -324 -298 -252 -213 -194 -189 -188 -187 -185 -182 -177 -169 -161 -158 -168 -183 -185 -165 -134 -105 -82 -61 -47 -44 -53 -73 -107 -152 -189 -204 -202
36 -202 -199 -203 -209 -214 -217 -212 -194 -170 -155 -151 -153 -164 -191 -229 -258 -271 -275 -276 -264 -229 -181 -136 -105 -87 -76 -69 -60 -46 -34 -29 -34 -50 -80 -119 -155 -179 -195 -208 -213 -206 -196 -195 -200 -196 -178
17 -178 -162 -169 -208 -265 -318 -349 -347 -321 -289 -267 -260 -262 -266 -271 -275 -274 -263 -243 -219 -192 -169 -157 -154 -149 -135 -116 -111 -127 -152 -168 -176 -187 -209 -237 -263 -277 -268 -238 -204 -191 -203 -213
-2 -213 -204 -186 -182 -197 -213 -215 -206 -194 -177 -151 -130 -133 -159 -182 -178 -145 -97 -48 -15 -11 -36 -76 -113 -139 -150 -144 -129 -125 -144 -170 -175 -148 -105 -68 -52 -66 -107 -154 -185 -202 -223
-19 -223 -250 -261 -244 -210 -179 -153 -127 -112 -124 -161 -202 -236 -264 -281 -281 -267 -246 -215 -166 -107 -66 -55 -56 -43 -17 0 -9 -38 -71 -93 -106 -122 -150 -189 -218 -223 -198
-35a98M5M9M0K0ol5n3m9k0J3K7K0QPPjk2m2m5k2K1N2N2K6lj9l2m4m1k3nLJ0K3K7J8L%Jnr%
-54b02Olj8j7mMJ0K7M0K9%rJ3L1J7j3k6j9rj0j7k3j8LL0M3K9Oj0j3rMJ8K3J1mj3k3l5m0k5
-71b16lRMMJ1J9J8Opj6j4nMjj2j5jK1L5L5K1PJjoj0oMNmpQK4K0mk9l8l7l5k7rJ5K8J9joJ1
-92a81L2K7nl0k9j3lpj2j2%K1M8O2N3K0j4l0k2KJ7Qj8l4k5mOkj4j7j3j1j4j4lJ9L3K9J5J5
-109a20L2M5L9K4J0nk4l2j5J4K2Nj6k6k3j2JQKj0j7k1k8k9j2J1K3J7J0J5J9J0j0k9m0l6j9
-125b17JRPQK1K8J8qk9l7l3j7NJ7J4Jm%QR%j7k5j8mmj8k4qJ7K9K6K2K3L3M8O3O2M7K5Pj1l2
-144D2m8n5n4n7m8j9J8K6lm1n2l8j7oLJ5K2K2J9J5QJkPJ7J4JoKRN%MJ8K7K9L0K4Mk3l3k1q
$$ plain form
-35 -198 -153 -104 -64 -44 -50 -85 -138 -187 -207 -194 -167 -147 -139 -132 -125 -126 -148 -190 -235 -257 -236 -184 -132 -106 -109 -128 -160 -204 -245 -268 -273 -270 -260 -237 -210 -192 -189 -189 -188 -193 -202 -202
-54 -202 -196 -199 -217 -234 -238 -234 -224 -197 -157 -128 -128 -137 -124 -93 -76 -89 -115 -134 -143 -153 -170 -193 -211 -208 -178 -135 -106 -100 -110 -123 -132 -128 -110 -87 -76 -80 -93 -116 -151 -191 -216
-71 -216 -219 -210 -206 -202 -191 -172 -154 -148 -155 -171 -185 -190 -186 -187 -199 -214 -215 -194 -159 -124 -103 -96 -95 -96 -102 -112 -118 -114 -109 -113 -120 -112 -88 -68 -72 -101 -139 -176 -211 -238 -247 -232 -204 -185 -186 -192 -181
-92 -181 -149 -122 -127 -157 -186 -199 -202 -209 -221 -233 -233 -212 -164 -102 -49 -29 -43 -73 -95 -93 -76 -68 -86 -120 -145 -149 -143 -145 -159 -176 -189 -200 -214 -228 -231 -212 -179 -150 -135 -120
-109 -120 -88 -43 -4 20 30 25 1 -31 -46 -32 -10 -5 -21 -47 -70 -82 -81 -73 -71 -81 -98 -119 -147 -176 -188 -177 -154 -137 -127 -112 -93 -83 -93 -122 -162 -198 -217
-125 -217 -216 -207 -200 -192 -171 -143 -125 -133 -162 -199 -232 -249 -244 -227 -213 -212 -216 -216 -208 -199 -199 -216 -241 -259 -263 -267 -285 -309 -317 -300 -271 -245 -223 -200 -167 -119 -56 6 53 78 85 74 42
-144 42 -6 -61 -115 -172 -220 -239 -221 -195 -198 -239 -291 -329 -346 -352 -349 -334 -312 -290 -271 -256 -248 -247 -249 -242 -225 -211 -210 -216 -214 -205 -200 -200 -196 -178 -151 -122 -92 -68 -64 -87 -120 -141 -149
$$ [...]
-3131i6
##END=	
##END=	
