##TITLE=	Dec04-2021.20.fid
TM-VI-191, CD3OD

##JCAMP-DX=	6.0	$$ MestReNova 14.3.0-30573
##DATA TYPE=	LINK
##BLOCK_ID=	1
##BLOCKS=	2    
##ORIGIN=	Mestrelab Research S.L.
##OWNER=	hrzepa
##$MNOVA/LINK_BLOCK_TYPE=	ITEM	$$ NMR Spectrum
##$MNOVA/ITEM/POLYGON=	(XY..XY)
5321,5835
8722,5835
8722,8208
5321,8208
5321,5835
##$MNOVA/ITEM/Z=	0
##$MNOVA/ITEM/ANGLE=	0
##TITLE=	Dec04-2021.20.fid
##JCAMP-DX=	6.0	$$ MestReNova 14.3.0-30573
##BLOCK_ID=	2
##DATA TYPE=	MNOVA NMR VIEW DATA
##DATA CLASS=	MNOVA VIEW DATA
##$MNOVA/ITEM/ZOOM/X=	-4.0077130307847514956,	16.00802000001239378
##$MNOVA/ITEM/ZOOM/Y=	-638.25329738855361938,	7026.848876953125
##END=	
##TITLE=	Dec04-2021.20.fid
##JCAMP-DX=	6.0	$$ MestReNova 14.3.0-30573
##BLOCK_ID=	3
##DATA TYPE=	NMR SPECTRUM
##DATA CLASS=	XYDATA
##NUMDIM=	1
##ORIGIN=	Bruker BioSpin GmbH
##OWNER=	nmr
##.OBSERVE FREQUENCY=	400.32240192000000434
##.OBSERVE NUCLEUS=	^1H
##.SOLVENT NAME=	MeOD
##.PULSE SEQUENCE=	zg30
##LONGDATE=	2021/12/04 16:18:00.000
##.ACQUISITIONMODE=	SIMULTANEOUS (DQD)
##$ORIGINAL FORMAT=	Bruker XWIN-NMR
##$MNOVA/SCALES_VERSION=	9
##$PARAMETER FILE=	(acqus, ASCII, /private/var/folders/f6/rjf_tdyn2v98c5c0wvkgn4s80000gn/T/olXHllgKSwuBQFWb308aEw/20/acqus, 0)
$$ ##TITLE= Parameter file, TOPSPIN		Version 3.2
$$ ##JCAMPDX= 5.0
$$ ##DATATYPE= Parameter Values
$$ ##NPOINTS= 11	$$ modification sequence number
$$ ##ORIGIN= Bruker BioSpin GmbH
$$ ##OWNER= nmr
$$ $$ 2021-12-04 16:18:22.686 +0000  nmr@CZC2524DW0
$$ $$ /opt/topspin/data/agmb/nmr/Dec04-2021/20/acqus
$$ $$ process /opt/topspin3.2/prog/mod/shimcntl
$$ ##$ACQT0= -2.3109243697479
$$ ##$AMP= (0..31)
$$ 100 100 100 100 100 100 100 100 100 100 100 100 100 100 100 100 100 100
$$ 100 100 100 100 100 100 100 100 100 100 100 100 100 100
$$ ##$AMPCOIL= (0..19)
$$ 0 0 0 0 0 0 0 0 0 0 0 0 0 0 0 0 0 0 0 0
$$ ##$ANAVPT= -1
$$ ##$AQSEQ= 0
$$ ##$AQ_mod= 3
$$ ##$AUNM= <au_zg>
$$ ##$AUTOPOS= <26 >
$$ ##$BF1= 400.32
$$ ##$BF2= 400.32
$$ ##$BF3= 400.32
$$ ##$BF4= 400.32
$$ ##$BF5= 400.32
$$ ##$BF6= 400.32
$$ ##$BF7= 400.32
$$ ##$BF8= 400.32
$$ ##$BYTORDA= 0
$$ ##$CAGPARS= (0..11)
$$ 0 0 0 0 0 0 0 0 0 0 0 0
$$ ##$CFDGTYP= 0
$$ ##$CFRGTYP= 9
$$ ##$CHEMSTR= <none>
$$ ##$CNST= (0..63)
$$ 1 1 145 1 1 1 1 1 1 1 1 1 1 1 1 1 1 1 1 1 1 1 1 1 1 1 1 1 1 1 1 1 1 1 1
$$ 1 1 1 1 1 1 1 1 1 1 1 1 1 1 1 1 1 1 1 1 1 1 1 1 1 1 1 1 1
$$ ##$CPDPRG= (0..8)
$$ <> <> <> <> <mlev> <mlev> <mlev> <mlev> <mlev>
$$ ##$D= (0..63)
$$ 0 1 0 0 0 0 0 0 0 0.06 0 0 0 0 0 0 0.0002 0 0 0 0 0 0 0 0 0 0 0 0 0 0 0
$$ 0 0 0 0 0 0 0 0 0 0 0 0 0 0 0 0 0 0 0 0 0 0 0 0 0 0 0 0 0 0 0 0
$$ ##$DATE= 1638634701
$$ ##$DE= 6.5
$$ ##$DECBNUC= <off>
$$ ##$DECIM= 2496
$$ ##$DECNUC= <off>
$$ ##$DECSTAT= 4
$$ ##$DIGMOD= 1
$$ ##$DIGTYP= 12
$$ ##$DQDMODE= 0
$$ ##$DR= 22
$$ ##$DS= 2
$$ ##$DSPFIRM= 0
$$ ##$DSPFVS= 20
$$ ##$DTYPA= 0
$$ ##$EXP= <proton>
$$ ##$F1LIST= <111111111111111>
$$ ##$F2LIST= <222222222222222>
$$ ##$F3LIST= <333333333333333>
$$ ##$FCUCHAN= (0..9)
$$ 0 2 0 0 0 0 0 0 0 0
$$ ##$FL1= 90
$$ ##$FL2= 90
$$ ##$FL3= 90
$$ [...]
$$ ##$Sgu3PowerLevels= (0..7)
$$ 0 0 0 0 0 0 0 0
$$ ##$Sgu4PowerLevels= (0..7)
$$ 0 0 0 0 0 0 0 0
$$ ##$Sgu5PowerLevels= (0..7)
$$ 0 0 0 0 0 0 0 0
$$ ##$Sgu6PowerLevels= (0..7)
$$ 0 0 0 0 0 0 0 0
$$ ##$Sgu7PowerLevels= (0..7)
$$ 0 0 0 0 0 0 0 0
$$ ##$Sgu8PowerLevels= (0..7)
$$ 0 0 0 0 0 0 0 0
$$ ##$SguType= 3
$$ ##$ShimPowMaxUA= (0..63)
$$ 130000 130000 130000 130000 130000 130000 130000 130000 130000 130000 130000
$$ 130000 130000 130000 130000 130000 130000 130000 130000 130000 0 0 0 0
$$ 0 0 0 0 0 0 0 0 0 0 0 0 0 0 0 0 0 0 0 0 0 0 0 0 0 0 0 0 0 0 0 0 0 0 0 0
$$ 0 0 0 0
$$ ##$ShimPowMaxUC= (0..63)
$$ 130000 130000 130000 130000 130000 130000 130000 130000 130000 130000 130000
$$ 130000 130000 130000 130000 130000 130000 130000 130000 130000 0 0 0 0
$$ 0 0 0 0 0 0 0 0 0 0 0 0 0 0 0 0 0 0 0 0 0 0 0 0 0 0 0 0 0 0 0 0 0 0 0 0
$$ 0 0 0 0
$$ ##$ShimPowMaxUG= (0..63)
$$ 524287 524287 524287 524287 524287 524287 524287 524287 524287 524287 524287
$$ 524287 524287 524287 524287 524287 524287 524287 524287 524287 0 0 0 0
$$ 0 0 0 0 0 0 0 0 0 0 0 0 0 0 0 0 0 0 0 0 0 0 0 0 0 0 0 0 0 0 0 0 0 0 0 0
$$ 0 0 0 0
$$ ##$ShimPowRcbType= 3
$$ ##$ShimPowRes= (0..63)
$$ 1e-20 1e-20 1e-20 1e-20 1e-20 1e-20 1e-20 1e-20 1e-20 1e-20 1e-20 1e-20
$$ 1e-20 1e-20 1e-20 1e-20 1e-20 1e-20 1e-20 1e-20 0 0 0 0 0 0 0 0 0 0 0 0
$$ 0 0 0 0 0 0 0 0 0 0 0 0 0 0 0 0 0 0 0 0 0 0 0 0 0 0 0 0 0 0 0 0
$$ ##$ShimPowRng0= (0..63)
$$ 1 1 1 1 1 1 1 1 1 1 1 1 1 1 1 1 1 1 1 1 0 0 0 0 0 0 0 0 0 0 0 0 0 0 0 0
$$ 0 0 0 0 0 0 0 0 0 0 0 0 0 0 0 0 0 0 0 0 0 0 0 0 0 0 0 0
$$ ##$ShimPowRng1= (0..63)
$$ 1 1 1 1 1 1 1 1 1 1 1 1 1 1 1 1 1 1 1 1 0 0 0 0 0 0 0 0 0 0 0 0 0 0 0 0
$$ 0 0 0 0 0 0 0 0 0 0 0 0 0 0 0 0 0 0 0 0 0 0 0 0 0 0 0 0
$$ ##$ShimPowRng2= (0..63)
$$ 1 1 1 1 1 1 1 1 1 1 1 1 1 1 1 1 1 1 1 1 0 0 0 0 0 0 0 0 0 0 0 0 0 0 0 0
$$ 0 0 0 0 0 0 0 0 0 0 0 0 0 0 0 0 0 0 0 0 0 0 0 0 0 0 0 0
$$ ##$ShimPowRng3= (0..63)
$$ 1 1 1 1 1 1 1 1 1 1 1 1 1 1 1 1 1 1 1 1 0 0 0 0 0 0 0 0 0 0 0 0 0 0 0 0
$$ 0 0 0 0 0 0 0 0 0 0 0 0 0 0 0 0 0 0 0 0 0 0 0 0 0 0 0 0
$$ ##$ShimSysFunc= (0..63)
$$ 1 2 3 4 5 7 9 11 15 16 8 10 12 14 6 17 13 18 19 20 0 0 0 0 0 0 0 0 0 0
$$ 0 0 0 0 0 0 0 0 0 0 0 0 0 0 0 0 0 0 0 0 0 0 0 0 0 0 0 0 0 0 0 0 0 0
$$ ##$ShimSysMatrix= 0
$$ ##$ShimSysType= 1
$$ ##$TFXNUM= 0
$$ ##$TRIPLO2= 0
$$ ##$VTU= 2
$$ ##$VTUETH= <149.236.99.20>
$$ ##$VTUTY= <no>
$$ ##$WBREFAM= (0..15)
$$ 132.2 106.2 100 100 100 100 100 100 100 100 100 100 100 100 100 100
$$ ##$WBREFLM= (0..15)
$$ 0 0 0 0 0 0 0 0 0 0 0 0 0 0 0 0
$$ ##$WBREFPH= (0..15)
$$ 77.55 -65.76 0 0 0 0 0 0 0 0 0 0 0 0 0 0
$$ ##$WBSGU= (0..15)
$$ 0 0 0 0 0 0 0 0 0 0 0 0 0 0 0 0
$$ ##$XFAC= 2
$$ ##END=
$$ 
##$DECIM=	2496
##$DSPFVS=	20
##XUNITS=	HZ
##YUNITS=	ARBITRARY UNITS
##FIRSTX=	6408.3305663999999524
##LASTX=	-1604.3676804825092859
##DELTAX=	-0.12226593800080123864
##XFACTOR=	1
##YFACTOR=	0.021343695157367101323
##FIRSTY=	10.493317604064941406
##MINY=	0.55114597082138061523
##MAXY=	6388.04443359375
##NPOINTS=	65536
##XYDATA=	(X++(Y..Y))
$$ [...]
2792F268MKl2n3l9j0LJrk1l2l3j7LJ2J1kk9n1m4pJ3j2n0m7oK2J9J0J9J9j5n8p2n2k2JJ6J6
2787E726Jj5j3krl8o3o1l2NL1L0Pj1nQll3n4n2m5m0l4k5k6k8j5Jok6j2L9N8Oo0o2j2J9J1p
2782E153j8m1n5k4L1M2nm0j9J2QlJ6L2jn7o8k6QRKkj5l6l1JJ6nk8j9PJ3POJk3m7m0j7j7l9
2777D688m2jL6J5m1o8l6Kj1n2o0k1J0ol3k8lol4l8mK3J6J2L3M8K0k1l2k0l4n7l0M3Q2L9l0
2772D359m3jK5J0j3j3j3l0m8m2k2j4j9qK7N6M9Mm7o9n5k0J3K6J5j4l7l6j2J0J3Lnqk0m3n6
2768C922l7OM3L9Jm0n3l4oJ5K4K5J4j4m2n0l2j2j2k8l7k8j9j6j4PK8K1j8m6l1J0K9J2rrnk0
2763C584m1m1k0kMKMKkj0k1l6l6j7PJ0j2k6j0K5M7M3J9kkQMl1o7o6l1j0j9l0k0j2k5l0kK6
2758C164J2l1m1pK2Rj9l1k7j9kL1M5J0m5o3l5LNj6k6lL2L8Ql4m4k4nnj1kJ0RNQQj2l3k3J2
$$ plain form
2792 6268 6272 6274 6242 6189 6150 6140 6143 6144 6135 6114 6082 6049 6032 6035 6047 6058 6056 6027 5976 5932 5925 5938 5926 5876 5829 5823 5845 5864 5874 5893 5912 5897 5839 5767 5715 5693 5694 5710 5726
2787 5726 5727 5712 5699 5697 5688 5650 5587 5526 5494 5499 5530 5560 5567 5556 5551 5559 5556 5523 5469 5417 5372 5332 5298 5273 5247 5219 5204 5205 5199 5173 5161 5200 5258 5264 5204 5142 5130 5149 5160 5153
2782 5153 5135 5094 5039 5015 5046 5088 5083 5043 5024 5036 5044 5041 5057 5089 5088 5031 4963 4937 4945 4954 4956 4954 4939 4903 4872 4873 4889 4884 4856 4837 4844 4857 4864 4870 4871 4848 4801 4761 4744 4727 4688
2777 4688 4646 4645 4681 4696 4655 4587 4551 4553 4542 4490 4430 4409 4419 4413 4380 4352 4349 4343 4309 4271 4267 4290 4306 4318 4351 4399 4419 4398 4366 4346 4312 4255 4225 4268 4350 4389 4359
2772 4359 4316 4315 4340 4350 4337 4324 4311 4281 4233 4191 4169 4155 4136 4128 4155 4211 4260 4264 4217 4148 4093 4073 4086 4112 4127 4113 4076 4040 4028 4038 4051 4054 4049 4041 4021 3978 3922
2768 3922 3885 3891 3934 3973 3974 3934 3881 3847 3841 3856 3880 3905 3919 3905 3863 3813 3781 3769 3757 3729 3692 3664 3645 3629 3615 3622 3650 3671 3653 3607 3576 3586 3615 3627 3618 3609 3604 3584
2763 3584 3543 3502 3482 3480 3484 3486 3490 3492 3490 3480 3459 3423 3387 3370 3377 3387 3375 3349 3339 3364 3411 3454 3473 3471 3469 3477 3481 3450 3383 3317 3286 3276 3257 3227 3207 3195 3170 3140 3138 3164
2758 3164 3176 3145 3104 3097 3119 3128 3109 3078 3051 3032 3030 3061 3106 3116 3071 3008 2973 2976 2981 2965 2939 2936 2968 3006 3014 2980 2936 2912 2907 2902 2891 2889 2899 2908 2913 2921 2929 2917 2884 2861 2873
2753B873K2j1m8m7j5PLorkQK2L2K4kk7l3l3m0m5j8L6P6O3J2k8l7m0n3n5k6RJ1j4k2rkj6k3
2749B537KL0K5joPMk3m4l6j5j0j3lJ7K1O%QRj4l1j5J1%m5o4l2J5J8j5l6k7j6j3NM4O6L6k0
2744B382m5j7K2L0J1KJ2K0jl5m3j5J5J4jJMj9n0m0RK6j2m7j3M9O5L0kj8m0o6n1jK2rm3l2K
2739B116J4PPJ7J6RMrl5m5j5L0M4J9ormoj0j3j7j3RL0K3j1l3k7qPJ6K5K5J3OJ1J7Oj9m0l7
2734B114oL3M1J2k0k7k0k8m0j6L7O8M9J1j4k2k1nJ7J6j5l3j5J4J9J4K2L6K3qk0lK5M2M5K0
2729B345k8n9k7L8O4K4k2j9J9M1L8L8N2N1J2l5m9j8K3L0J4QK2M0M5M9O4P1N6L8L8M1K5MJ5
2725C048N1O8N6N5Q1R7O9K3K0O9J19J22Q6N6O2R0R9Q5Q1J03J29J29J25J49J85J96J82J87K19
2722F041K34K13J94K12K42K48K33K20K12K04J98J88J62J28J09R7N2k6q0p8p1j03j29r5n3r3
$$ plain form
2753 2873 2895 2884 2836 2789 2774 2781 2784 2778 2769 2767 2775 2797 2829 2853 2851 2824 2791 2758 2718 2673 2655 2691 2767 2830 2842 2814 2777 2737 2684 2629 2603 2612 2623 2609 2587 2578 2576 2560 2537
2749 2537 2539 2569 2594 2593 2587 2594 2598 2575 2531 2495 2480 2470 2457 2454 2471 2492 2498 2498 2506 2515 2501 2470 2455 2466 2466 2421 2357 2325 2340 2358 2343 2307 2280 2264 2251 2256 2300 2366 2402 2382
2744 2382 2337 2320 2342 2372 2383 2385 2397 2417 2416 2381 2338 2323 2338 2352 2351 2352 2356 2337 2287 2247 2256 2282 2270 2223 2210 2259 2324 2354 2352 2334 2294 2228 2177 2176 2198 2189 2146 2114 2116
2739 2116 2130 2137 2144 2161 2177 2186 2190 2181 2146 2101 2086 2116 2160 2179 2173 2164 2160 2154 2144 2131 2114 2101 2110 2140 2163 2152 2119 2092 2084 2091 2107 2132 2157 2170 2176 2187 2204 2210 2191 2151 2114
2734 2114 2108 2141 2182 2194 2174 2147 2127 2099 2059 2043 2080 2148 2197 2208 2194 2172 2151 2146 2163 2179 2164 2131 2116 2130 2149 2163 2185 2221 2244 2236 2216 2213 2238 2280 2325 2345
2729 2345 2317 2258 2231 2269 2333 2357 2335 2316 2335 2376 2414 2452 2504 2555 2567 2532 2483 2465 2488 2518 2532 2540 2562 2602 2647 2696 2760 2831 2887 2925 2963 3004 3029 3033 3048
2725 3048 3099 3167 3223 3278 3359 3456 3525 3548 3568 3637 3756 3878 3964 4020 4082 4172 4271 4356 4437 4540 4669 4798 4923 5072 5257 5453 5635 5822 6041
2722 6041 6275 6488 6682 6894 7136 7384 7617 7837 8049 8253 8451 8639 8801 8929 9038 9135 9187 9161 9081 9003 8932 8829 8700 8605 8552 8459
2718H459j98k50j98j30j27j71j85j58j32j21j13j09j16j30j35j29j22j12r5p3n7m1k3mRJ0
2715E549nk9l3MN9Q5O9N0O1Q5R5J03J21J33J14Q5Q3J14J46J56J52J42J25J05J06J23J35J27
2712H060J09R8P9L6k7p2p9o1o2j04j68k11k16k02j87j80j79j93k18k27k01j64j58j84k04j93
2709D892j61j34j20j05q5p3p7q5q5q0q8j10j25j14q9p4o6m8k5k8o0q2p0l8j9j9k2k6l5m2l5
2705B672k0j2j4k2l4n1n4l4kKk5n5n6j5L6N1J2m7p1n2l2l4k3K2N8L7qpL1L4j4m5k6mk8o1m8
2700B061KL2K3Jj8m0n3m2j1J2J6J7K6K4kl2l9j4K1L2Ok5l0mJ4NrjJ8J2j4k2ML2K9QJJ0Pj8
2695B039l5j5J8K0j7l9nN1O8L2nrMJ1J0Qlk5l1j3Kpk6j7QK3K2K9M1L7J7MNnl0m5k8lNLRK4
2690B132K9J1j9l1qM1O8M0j7l8lM3M0lk7j5L%nJ0L5L7J6LJ0J0j2l2j7J6L1J6JKKj6k9qL8O3
$$ plain form
2718 8459 8261 8011 7813 7683 7556 7385 7200 7042 6910 6789 6676 6567 6451 6321 6186 6057 5935 5823 5728 5655 5598 5557 5534 5530 5539 5549
2715 5549 5544 5515 5482 5486 5545 5630 5699 5749 5810 5895 5990 6093 6214 6347 6461 6546 6629 6743 6889 7045 7197 7339 7464 7569 7675 7798 7933 8060
2712 8060 8169 8267 8346 8382 8355 8283 8204 8143 8081 7977 7809 7598 7382 7180 6993 6813 6634 6441 6223 5996 5795 5631 5473 5289 5085 4892
2709 4892 4731 4597 4477 4372 4287 4214 4137 4052 3967 3887 3799 3689 3564 3450 3361 3287 3221 3173 3148 3120 3060 2978 2908 2870 2851 2832 2810 2784 2749 2707 2672
2705 2672 2652 2640 2626 2604 2570 2519 2465 2431 2429 2431 2406 2351 2295 2280 2316 2367 2379 2332 2261 2209 2177 2143 2120 2142 2200 2237 2229 2222 2253 2287 2273 2228 2202 2198 2170 2109 2061
2700 2061 2063 2095 2118 2119 2101 2061 2008 1966 1955 1967 1983 2000 2026 2050 2048 2016 1977 1963 1984 2016 2022 1997 1967 1963 1977 1982 1973 1972 1990 2002 1988 1966 1970 2002 2031 2039 2040 2050 2057 2039
2695 2039 2004 1989 2007 2027 2010 1971 1966 2017 2085 2117 2112 2103 2107 2118 2128 2136 2133 2108 2077 2064 2066 2059 2033 2016 2024 2047 2069 2098 2139 2176 2193 2197 2202 2197 2167 2122 2094 2091 2096 2099 2108 2132
2690 2132 2161 2172 2153 2122 2114 2155 2223 2263 2246 2208 2205 2248 2288 2285 2258 2243 2246 2246 2241 2251 2286 2323 2339 2342 2352 2362 2350 2318 2301 2317 2348 2364 2365 2367 2369 2353 2324 2316 2354 2417
2685B417N2J8j5l2k9nL2N8N9L5Mj0nLqk2j5J5L2K4J6K9L7Rk8l3%L1L5K6J4LmOK1K1J9L5N3
2681B898M2J4J1L0J5m2p2k5M6O5M0L5O3O8K5k2k6OK6J6qj2J1L9L8Nk6k1OL2M4M5L3J3PK1L2
2676C472K1J1L3O7O6K9jOJ9J3knOK7N4P4O1J8j3j1J0K5L9N8O1M2L0M1N0L4K8O5J00O3k6o1
2672D504mO2N2MmK3K9J4K7O9P2K5jM1R1Q1L2K0N1O2L3LJ0L1M2M8N3M9M0N3Q9J06Q3N0M3N3
2667F036M7L6M4O7Q1P8Q1R4J00Q6N4K6J2K0M3O5Q0R3J06J03Q3O0M5L3K4L3O9J10J26J24J16
2664H175J01P9P1R0J06R7R0J13J44J32Q9O9Q7J04R7Q9R6R9R1R3J18J39J35J14R4Q5J05J64
2660A1066K16K06J51J34J77K00J50R0J08J81K12J74J25J15J37J61J77J81J77J77J87J91J76
2657A4869J73K04K37K35K14K15K32K22J85J77K18K72K93K82K54K21K05K23K60K89L07L27L31
$$ plain form
2685 2417 2469 2487 2472 2440 2411 2406 2438 2496 2555 2590 2594 2584 2579 2582 2574 2552 2537 2552 2584 2608 2624 2653 2690 2699 2671 2638 2638 2669 2704 2730 2744 2747 2743 2749 2770 2791 2810 2845 2898
2681 2898 2940 2954 2965 2995 3010 2968 2896 2871 2917 2982 3022 3057 3120 3188 3213 3191 3165 3171 3197 3213 3205 3193 3204 3243 3281 3286 3260 3239 3245 3277 3321 3366 3399 3412 3419 3440 3472
2676 3472 3493 3504 3537 3604 3670 3699 3698 3704 3723 3736 3734 3729 3735 3762 3816 3890 3951 3969 3956 3945 3955 3980 4019 4077 4138 4180 4210 4251 4301 4335 4363 4428 4528 4591 4565 4504
2672 4504 4500 4562 4614 4618 4614 4637 4666 4680 4707 4776 4848 4873 4872 4913 5004 5085 5117 5137 5188 5250 5283 5286 5296 5327 5369 5417 5470 5519 5559 5612 5701 5807 5890 5940 5983 6036
2667 6036 6083 6119 6163 6230 6311 6389 6470 6564 6664 6750 6804 6830 6842 6862 6905 6970 7050 7143 7249 7352 7435 7495 7540 7573 7597 7630 7699 7809 7935 8059 8175
2664 8175 8276 8355 8426 8516 8622 8719 8809 8922 9066 9198 9287 9356 9443 9547 9644 9733 9829 9928 10019 10112 10230 10369 10504 10618 10712 10797 10902 11066
2660 11066 11282 11488 11639 11773 11950 12150 12300 12390 12498 12679 12891 13065 13190 13305 13442 13603 13780 13961 14138 14315 14502 14693 14869
2657 14869 15042 15246 15483 15718 15932 16147 16379 16601 16786 16963 17181 17453 17746 18028 18282 18503 18708 18931 19191 19480 19787 20114 20445
2655B0445K99K53K50K83K93K61K52L00L43L24K80K83L30L51L23K92K93L09L09L06L22L60L86
2652B7447L76L50L46L69L76L33K81K87L46L86L78L60L71L79L59L33L32L37L26L28L62L87L56
2649C5505L02K91L16L23L08L14L39L25K70K40K68L07L09K96K92K87K61K36K43K57K57K47K44
2646D2037K28J91J60J65J90K04K12K22K10J63J12J00J16J22J17J27J42J28R0O9Q5J08J20J28
2643D5546J39J34J06P5N9N2M5M3L9K0j3l1k0mnj1lPJj7k9k7k3k0k5m0o9r6j06j05j09j25j34
2639D5254j22r8q8j12j57j78j60j33j38j72j91j82j71j85j99j93j85j98k21k26k12k04k14
2636D1315k28k41k58k73k74k76k94l08k94k58k46k71l06l16l07k98k87k77k82l01l13l05k88
2633C4814k81k84k86k94l09l17l06k86k69k62k66k87l15l28l11k88k74k62k38k15k27k67k98
$$ plain form
2655 20445 20744 20997 21247 21530 21823 22084 22336 22636 22979 23303 23583 23866 24196 24547 24870 25162 25455 25764 26073 26379 26701 27061 27447
2652 27447 27823 28173 28519 28888 29264 29597 29878 30165 30511 30897 31275 31635 32006 32385 32744 33077 33409 33746 34072 34400 34762 35149 35505
2649 35505 35807 36098 36414 36737 37045 37359 37698 38023 38293 38533 38801 39108 39417 39713 40005 40292 40553 40789 41032 41289 41546 41793 42037
2646 42037 42265 42456 42616 42781 42971 43175 43387 43609 43819 43982 44094 44194 44310 44432 44549 44676 44818 44946 45036 45105 45190 45298 45418 45546
2643 45546 45685 45819 45925 46000 46059 46111 46156 46199 46238 46258 46245 46214 46194 46190 46185 46174 46171 46178 46179 46162 46133 46106 46083 46063 46038 45998 45929 45833 45727 45622 45513 45388 45254
2639 45254 45132 45034 44946 44834 44677 44499 44339 44206 44068 43896 43705 43523 43352 43167 42968 42775 42590 42392 42171 41945 41733 41529 41315
2636 41315 41087 40846 40588 40315 40041 39765 39471 39163 38869 38611 38365 38094 37788 37472 37165 36867 36580 36303 36021 35720 35407 35102 34814
2633 34814 34533 34249 33963 33669 33360 33043 32737 32451 32182 31920 31654 31367 31052 30724 30413 30125 29851 29589 29351 29136 28909 28642 28344
2631B8344k95k77k69k78k92k90k67k41k44k71k86k60k18k04k13k13k02k05k29k38k22k15k37
2628B2678k65k60k25j88j67j62j78k12k39k38k12j80j53j37j47j75j89j65j32j32j73k17k24
2625A8308j91j51j38j63j95j87j33r0j09j62j78j39r8j01j32j53j55j55j46j22r8j01j32j60
2622A4919j55j24r2q2r0r8r9r8j02j10j16j21j24j17r8p9p8r4j09j14j07q7n7m1o3j10j36
2619A2218j22r1p2o6o3o2o4o0n6o0p6r1r4r7j00q5n5l8n1p2p0n7o8r6j04p8n5n9q2j02r7p1
2615I804m3l4m7n3m2l3m7n9m2k2m4r7j14o9k2j7l6m5m5n6o5m8l1m7q4r7o8l1j8l1m8n8n7n3
2611H101m9m1l0k7n0p6p5m1k0k5k3RK3k6r4j01n2l0o0p6l9Kqm4n0l3l5n1m7k6k3l7l7k0k0
2606F769n1p7n9j7Qjl1o1p0n7k9jJ7K0Jl7o8o4l5k0l0m5m9m1l6l8m2m3l4j4ok4m5l0QK0nk9
$$ plain form
2631 28344 28049 27772 27503 27225 26933 26643 26376 26135 25891 25620 25334 25074 24856 24652 24439 24226 24024 23819 23590 23352 23130 22915 22678
2628 22678 22413 22153 21928 21740 21573 21411 21233 21021 20782 20544 20332 20152 19999 19862 19715 19540 19351 19186 19054 18922 18749 18532 18308
2625 18308 18117 17966 17828 17665 17470 17283 17150 17060 16951 16789 16611 16472 16374 16273 16141 15988 15833 15678 15532 15410 15312 15211 15079 14919
2622 14919 14764 14640 14548 14466 14376 14278 14179 14081 13979 13869 13753 13632 13508 13391 13293 13214 13136 13042 12933 12819 12712 12625 12568 12527 12464 12354 12218
2619 12218 12096 12005 11933 11867 11804 11742 11678 11618 11562 11502 11426 11335 11241 11144 11044 10959 10904 10866 10815 10743 10673 10616 10548 10452 10348 10270 10215 10156 10074 9972 9875 9804
2615 9804 9761 9727 9680 9627 9585 9552 9505 9446 9404 9382 9338 9241 9127 9058 9036 9019 8983 8938 8893 8837 8772 8724 8693 8646 8562 8465 8397 8366 8348 8317 8269 8211 8154 8101
2611 8101 8052 8011 7981 7954 7904 7828 7753 7712 7692 7667 7644 7653 7676 7650 7556 7455 7403 7373 7313 7237 7198 7200 7192 7148 7098 7065 7030 6979 6932 6906 6883 6846 6809 6789 6769
2606 6769 6718 6641 6582 6565 6573 6572 6541 6480 6410 6353 6324 6323 6340 6360 6361 6324 6256 6192 6157 6137 6107 6062 6013 5972 5936 5898 5856 5813 5779 5765 5759 5735 5690 5660 5668 5688 5683 5654
2602E654k9l1n1n3j4K5Qm2n4k0Kk6o5o7l7j3j1k4l2k5j3j5m0o0m7j7j2l1l4j3kk2l8k3qk5
2597D695n0m5k0j1j0jPj3m7m9k0Jmj2j5k6m3l2KJ1k8o6n6j6RQmk3l8l2KK4J1j8l0l2m8n5l5
2593C891onj2jOl2q2p3j5Qk9m9kM6K3l7n2j8LjPK8J4l8o5l3J2J3k4n3m8k5mQQjj8k9k6qJ3
2588C294J3j5m8n7m1k3j0KLj5l3k3LRj5l5l0rNMqk3k0RK8Km6n5k2%k2m3k3ONj7k2k3l8m6j2
2583B609L8M4Kl0k9j4nJ6M9N9L0j4m2n2m5k0Nj0n0o5k9J1Qj8k2JJ4Rlj6l8n2l6kJ3NlNJ2R
2578B344NJ8K5%n0p7n2KL4K4ok0j6rkJ0J1kj5lRj2m5l2K4M9lo5o3j1K0J2OJ2Mk3l3j4jj3l2
2573B010l7l2k5oK3L5J1k1l2k4j1LJ6J6%rOK1km5o0k6K4M7L6J3pj5j5j5k1l2k1K0N4L6l5q3
2568A797n2K7O7L8mj0Klj9k0k0l9n8l9OK6J1lPJ3NJQMj4j1K5M6J5l7n5l5j2nmlmJJ5J9Npl
$$ plain form
2602 5654 5625 5594 5543 5490 5476 5501 5509 5467 5413 5393 5395 5369 5304 5237 5200 5187 5176 5152 5120 5095 5082 5067 5027 4967 4920 4903 4891 4860 4826 4813 4811 4789 4751 4728 4720 4695
2597 4695 4645 4600 4580 4569 4559 4558 4565 4552 4505 4456 4436 4437 4433 4421 4406 4380 4337 4305 4307 4318 4290 4224 4168 4152 4161 4169 4165 4142 4104 4072 4074 4098 4109 4091 4061 4029 3981 3926 3891
2593 3891 3885 3880 3868 3867 3873 3841 3759 3686 3671 3679 3650 3601 3599 3645 3668 3631 3579 3561 3564 3563 3570 3598 3612 3574 3509 3476 3488 3501 3477 3424 3376 3351 3347 3355 3363 3362 3344 3315 3289 3281 3294
2588 3294 3307 3292 3244 3187 3146 3123 3113 3115 3118 3103 3070 3047 3050 3059 3044 3009 2979 2970 2975 2979 2971 2948 2928 2937 2965 2967 2921 2866 2844 2844 2822 2779 2756 2762 2767 2750 2728 2705 2667 2621 2609
2583 2609 2647 2691 2693 2663 2634 2620 2615 2631 2680 2739 2769 2755 2713 2661 2616 2596 2601 2591 2541 2476 2447 2458 2466 2448 2426 2427 2441 2450 2447 2431 2393 2341 2305 2303 2316 2321 2318 2323 2335 2344
2578 2344 2349 2367 2392 2392 2342 2265 2213 2215 2249 2273 2267 2247 2231 2222 2220 2230 2241 2239 2224 2221 2230 2218 2173 2141 2165 2214 2211 2146 2083 2072 2092 2104 2110 2122 2126 2103 2070 2056 2055 2042 2010
2573 2010 1973 1941 1916 1910 1933 1968 1979 1958 1926 1902 1891 1894 1910 1926 1926 1917 1923 1944 1942 1897 1837 1811 1835 1882 1918 1931 1924 1909 1894 1879 1858 1826 1805 1825 1879 1915 1880 1797
2568 1797 1745 1772 1839 1877 1873 1863 1865 1862 1843 1823 1803 1764 1706 1667 1673 1699 1710 1707 1714 1727 1732 1733 1741 1745 1731 1720 1745 1791 1806 1769 1714 1679 1667 1662 1658 1655 1651 1652 1667 1686 1691 1684 1681
2563A681j0m8p8m6K4N6K8olRml8n4m3j9kQJ8K8L0Rk0k6OL2Qm1n7k2J6K2J3RKj8k9j8JMlJR
2558A429Opj3lRJ1kj4j4mpk4k5NL4K2k2m2k1Mkj4rMJ0J3J9K0J0M%k5o2n9j2J5j8n7l9RJ1k7
2553A113l2J2M7L4J2J0J4Kj3k8m3m2lM8N1Nk2jJ6pk7nK2Nk7j8J4K2QPQj9m7l2M%k9j8L9O8
2548A148L2k0l6l4l7l3j7j2l3l6%L9L1lk3j9j3mJ0J0qk0nRrk8j4J5J9J%J0OjJ6L8K2k3l7l
2543I38K9K1rl2m2l7j5Mj2m4m1%K7J1pMJ4kj0RK1ol2oL4K5k2l7%L5K9J0Lok7l7j1L2M4Om8
2538H13o7l1J8K7PPL6L4k2o6l8J9K3j8k5J0K1j1l2qJ8J6RJ7Qk8m6k3Loj3J6N3M5Qj6k1k4k0
2533F93PK9J8ppJ3K0J3RKj5k7j7pj8k4J1M4J3n5p1pN4M4j2m5m9m2k9OL9L9J0j2mJ1Pj1j3J3
2528F23L4K3qj0K5N3L5nk5k5k6j9OK7J5rkK5L0Jk5l4m3m5k2RLk0rL6M9J3pK2M6K1k7m3l6l5
$$ plain form
2563 1681 1671 1623 1545 1499 1523 1579 1607 1601 1598 1607 1603 1565 1511 1468 1449 1447 1455 1473 1501 1531 1540 1520 1494 1500 1532 1540 1499 1442 1420 1436 1458 1471 1480 1482 1464 1435 1417 1418 1422 1419 1420 1429
2558 1429 1435 1428 1415 1412 1421 1432 1430 1416 1402 1398 1391 1367 1342 1347 1381 1403 1381 1339 1318 1322 1320 1306 1297 1301 1311 1324 1343 1363 1373 1377 1377 1352 1290 1231 1219 1234 1216 1159 1120 1129 1140 1113
2553 1113 1081 1093 1140 1174 1186 1196 1210 1212 1199 1171 1128 1086 1083 1131 1182 1187 1165 1164 1180 1173 1146 1141 1163 1168 1141 1123 1137 1159 1167 1174 1182 1163 1116 1084 1088 1088 1059 1041 1080 1148
2548 1148 1180 1160 1124 1090 1053 1020 1003 991 958 922 922 961 992 989 966 947 934 930 940 950 942 922 917 926 917 889 875 890 909 910 910 920 926 925 941 979 1001 978 941 938
2543 938 967 988 979 947 905 868 853 857 845 801 760 760 787 798 791 795 809 807 797 806 827 821 789 783 817 842 820 783 783 818 847 857 860 854 827 790 779 811 855 861 813
2538 813 746 715 733 760 767 774 810 844 822 756 718 737 760 742 717 727 748 737 705 697 715 731 740 757 765 737 691 668 671 665 652 668 721 766 774 758 737 713 693
2533 693 700 729 747 740 733 746 766 779 788 790 775 748 731 724 706 682 693 737 750 695 624 617 671 715 703 658 609 567 538 544 583 622 632 620 616 627 634 623 610 623
2528 623 657 680 672 662 687 740 775 770 745 720 694 675 681 708 723 714 712 737 767 768 743 709 666 621 599 608 611 591 582 618 667 680 673 695 741 762 735 692 656 621
2523F21k8lJ0j0k4OM6L6j0l1j6JKLJ0RRJ8K1Kj9j6nj3k0OL9L6Oj1j4k8m9l9LK5J2lJJj0j2
2518E62LJ0%j1j5k2k7pK2J6j7k6OL2K1jMK0K1J5J8J2j3k9j9LOJmj4k6j7J5K9Lj8%L1K1j0k0
2513E75m%j5j9lJ1J5J6Rj5l2j8PPrNL8L9ll2j3J9J8rk4j2OJ2ll2m8k5J3J8k2n1k9J3K1OJJ2
2508D43J1%QL5M1Lm2m9k2NJ2J0Pqk3j4K1M9L8PpJQjrkMmj7k6k6k0PM0M5Rk6j9J2J5j4k4J0
2503D88L8K1j9l8l0k3k1mK4L2J2j2j5lPJ1J5K0J6Qjj0k3l4k7pJ1J1MKPJ0RJ0J1Pmj3qRK6K6
2498E43Nk1k3KJ8nl4j5M1N7Jn3l3L3N5J6k0qJ9J2l1o8o3k0K8L3kl4k1J5K5PJJ3J6krlj4m4
2493D17m5j0Ok5m1J4Q4P5%m7k3J3J5MQJ5J4J1J2%j8rJ8J5k3m3j2J9nm7l8K0N5M1J1oj7j8Q
2488D48M2K9l2p1m1K1M9L3J4J1Nj0k8l2k3%K2J8rk4nJ6Oj1J0M9N0Ol1l2k7l5k3K2N5L6lk0
$$ plain form
2523 621 593 590 600 590 566 572 618 654 644 613 597 598 600 603 613 622 631 649 670 672 653 637 632 619 599 605 644 680 686 675 661 633 584 545 548 573 585 582 583 584 574 562
2518 562 565 575 575 564 549 527 500 493 515 531 514 488 494 526 547 546 550 570 591 606 624 636 623 594 575 578 584 585 581 567 541 524 539 568 571 553 553 584 605 595 575
2513 575 571 571 556 537 534 545 560 576 585 570 538 520 527 534 525 530 568 607 604 572 559 578 596 587 563 551 557 569 566 534 486 461 474 492 470 419 390 403 424 430 431 443
2508 443 454 454 462 497 538 541 499 450 428 433 445 455 462 454 431 417 438 487 525 532 525 526 534 533 524 522 526 522 505 479 453 433 440 480 525 534 508 489 501 516 502 478 488
2503 488 526 547 528 490 460 437 416 412 436 468 480 468 453 450 457 468 483 503 519 527 526 516 493 459 432 425 436 447 451 453 460 470 479 489 500 507 503 490 482 491 517 543
2498 543 548 527 504 506 524 519 485 470 511 568 569 516 483 516 571 587 567 559 578 590 559 491 428 408 436 469 467 433 412 427 452 459 460 473 489 487 478 475 461 417
2493 417 372 362 368 343 302 316 400 475 475 428 405 418 433 437 445 460 474 485 497 497 479 470 488 503 480 437 425 444 439 392 354 374 429 470 481 475 458 440 448
2488 448 490 519 487 416 375 396 445 478 492 503 508 498 470 438 415 415 437 455 446 422 417 433 439 428 438 487 537 543 512 480 453 418 395 417 472 508 505 485
2483D85j7k7l3j3J9K0MOK2J7qnK8L6km5n1l1qJ4K6Lm7o7j6N5O4J3l2k7NK5K7K4J4j2l8l6P
2478C99N3M6j8p3n0K6O8L3k6m0j5OOLRJ6J8J4%k0k0QK6Ok4k8nJ1J5J6J1j5l1j3J7J1k3k8P
2474C96L4K3MRJ3j0m2m5j4K2L8K7pl9m1j4J7K6K1J2lj6rJ4K1Mq%Lk0l9k2J3K6J1knj2k5k9
2469C32j2J1L0M2M7M5L6J3k3n3m4nK1QnJ8M4K0m5q0n0OL6L4K2J2J0J3J9J8Pnj7l0k9oK0J4
2464D74j4k6lK3J4j8l7k3RL0K4mk7k4nKj%QMj3j3J7L9L1RQJ4ml7l8J1N7M9mm7n8m8l4j3J6
2459C48K9J5npJ2K7K3Mk6n6n7j5M2N6K1oJ1L4J6l1m8k1J2K2K3K7J7j3m3m8l0kL0N2M2Nk5k5
2454D10j3j4j9oJ3J1j3l2j3L7Q4P7J2n5n8oK7Ll1j2K7L0nk5k2l8o6m5L0P8M7j0k3j0k8n5k2
2450B65N2P6J8l4j3L3L1%PM4M5kl4k3j4l7m5NO8P4K8j0j3j4k8l7k9k0j5OL5M2J2k6l9l1k0
$$ plain form
2483 485 468 441 408 395 414 434 438 444 466 483 475 470 498 534 532 487 436 405 397 411 437 440 393 326 310 365 429 442 410 383 388 413 440 464 478 466 428 392 399
2478 399 452 498 480 407 357 383 451 484 458 418 403 409 415 418 427 443 461 475 475 455 435 443 469 475 451 423 418 429 444 460 471 456 425 412 429 440 417 389 396
2474 396 430 453 457 466 479 469 427 382 368 390 428 455 448 409 368 354 371 397 418 430 427 411 402 416 437 441 433 433 436 416 377 355 368 394 405 403 398 386 361 332
2469 332 320 331 361 403 450 495 531 544 521 468 424 419 440 448 443 461 505 525 480 400 350 356 392 426 448 460 470 483 502 520 527 522 505 475 446 440 460 474
2464 474 460 434 431 454 468 450 413 390 399 429 453 449 422 398 393 395 394 394 402 406 393 380 397 436 467 476 484 498 494 457 419 430 487 536 532 485 427 379 345 332 348
2459 348 377 392 387 380 392 419 442 446 420 364 307 292 334 390 411 405 416 450 466 435 387 366 378 400 423 450 467 454 411 363 333 331 361 413 455 460 435 410
2454 410 397 383 364 358 371 382 369 337 324 361 445 522 534 479 421 415 442 445 414 402 429 459 454 429 407 369 303 258 288 366 413 403 380 370 342 287 265
2450 265 317 393 411 377 364 397 428 428 435 479 524 522 488 465 451 414 369 374 442 516 544 534 521 507 479 442 413 393 378 384 419 461 473 447 408 377 357
2445C57j6j1nNJ6J9Lj5j2PQj4k8j4kj0j0J7M5L9J6QJl2o0k9M3P5L3k2l1j2pj2OL2K8j1m2m1
2441C22k4rJ1L5M7K2j7k7MM0M5L0K1J4k4p6q7l5K2K1j2pL5L9j4n5k9K4L7Lk3j5J0L0L6J9j1
2436D02k6kK0on9o5oM8L8kj1J0J2j9l8j4J9K4J3J8L9M9K6j1l3l5k8j2J2K9J8k2n4l9J1M5K7
2432C78k2n2l8mK0K3J3QJ2J4R%kM%o%K7M0J6k6k9OL2J7qoJ1RnnJ6K8J8mk1k9j7NJ1j2l5k8
2426C68mkk0j6J5L1J1mK0M8K8k3m2j4K3M0L7J9j6n8p3m6mJ4OLK4N0M4Nk0%K9Rm8p3k8L1M4
2421D08K5J3Rj4l9k9JJk6l1KK9J8j%J1J3J1J3Jk7l8j3K0K6J8J8J7ll2l4j0J2Roj4r%OPJ4L1
2416D07M2K4qk5j4LMjJkj7k6j8j0j1j0QJ9Qj2k2k5k3qJ8K5pl8k8RK4RoKJ8L4M4L7Nk7k1J6
2411C98L7J9rj6lLqk4k5qMj2l8k8K4N9L9kj2NRkkOpk6k0MJ1jNL0L6J1j1j4j4j4PL6K7j6l1
$$ plain form
2445 357 341 330 325 330 346 365 368 353 341 348 356 342 314 300 298 288 278 295 340 379 395 403 404 372 312 283 326 401 434 412 381 369 362 350 356 388 416 405 363 322
2441 322 298 289 300 335 382 404 387 360 364 404 449 479 500 514 490 414 327 292 314 335 323 316 351 390 376 321 292 316 353 356 333 318 328 358 394 413 402
2436 402 376 374 394 388 329 264 258 306 344 342 331 341 353 334 296 282 301 325 338 356 395 444 470 459 426 391 363 351 363 392 410 388 334 295 306 351 378
2432 378 356 304 266 262 282 305 318 326 338 352 361 361 359 363 363 357 357 384 424 440 414 385 391 423 440 432 426 437 446 441 436 452 480 498 494 473 444 427 432 443 431 396 368
2426 368 364 362 342 326 341 372 383 379 399 447 475 452 410 396 419 459 496 515 499 441 368 322 318 332 338 341 365 415 459 464 444 444 473 482 434 361 333 364 408
2421 408 433 446 455 441 402 373 374 375 349 318 320 349 367 366 366 377 390 401 414 415 388 350 337 357 383 401 419 436 433 401 367 357 369 378 372 358 349 349 355 362 376 407
2416 407 449 473 465 440 426 429 433 432 433 431 414 388 370 360 349 339 347 366 374 362 340 315 292 284 302 327 320 282 254 263 287 296 290 292 310 344 388 425 430 403 382 398
2411 398 435 454 445 429 426 429 421 397 372 364 368 356 318 290 314 373 412 410 398 403 412 410 408 414 407 381 361 365 376 375 380 410 446 457 446 432 418 404 411 447 474 458 427
2406D27NK9Ll4k8jMolQkj9j9pllRJ7OqnJ0J9K3K9K1lj5mjj9k5RL6J1k6pM9N9Rl7m3m0m7l0
2400C48K2O5N5J0k5l1k7k3k2j8j0OJ2PQK3K1j6n2m3jJ9J0J5M5O1M4K0Lk1m8l7J5M8L1j1l6
2396D67m7m5j6K7K9k1n7l0J8L0K0K7L2Jm2l7RL0J0rLJ5Nj2j0jjmrj2rOK4K5K0K0J8j3m9m5
2391C67NM3K6k2m6k4J5L9L3J1MJ4J8nl1k8mMmkQmk6j7K2K9j6m5qM3L2k2l8rNpNO0R3N3j5l9
2386E17k2j6l5l7kL7L6Jk8k5onl1m9k3K5M5K1kJ3L3J3k9l8nJ2j4l1RP4Q1K0m5n7l0lPJ4J6
2381D41Rqj8j6rpj1j6pJ3L1K2ql0k3JJ4J1OJ2K0K2J0j1k6k1LL0M1K8Jk1k1nNj0k9k1J5L8K2
2376D77j0k9l0k8k2q%rj5J3N5O2J7l5m2k1j1k2k4KL2L3QrQL8M0Ml7m2pK4K4mk6j9J5M1L6N
2371D84j5j0OOoj1j2j4j5oMrk9l1j2MMLPNjMJ9J2j9l9j8J6K1OPK4K9J4LJkj1j6j8l2m3k1L3
$$ plain form
2406 427 432 461 464 430 402 401 405 399 396 404 402 383 364 357 354 351 360 377 383 375 370 380 399 422 451 472 469 454 450 449 430 405 414 450 461 435 428 477 536 545 508 465 425 378 348
2400 348 370 435 490 500 475 444 417 394 372 354 344 350 362 369 377 400 421 405 353 310 309 328 338 353 398 459 503 523 526 505 457 420 435 483 514 503 467
2396 467 420 375 359 386 415 394 337 307 325 355 375 402 434 435 393 356 365 395 405 396 399 414 419 407 397 396 395 391 382 370 361 367 391 416 436 456 474 461 412 367
2391 367 372 415 441 419 373 349 364 403 436 447 451 465 483 478 447 419 415 419 415 413 421 417 391 374 396 425 409 364 356 399 431 409 371 362 367 360 365 425 518 571 556 517
2386 517 495 479 444 407 405 442 478 479 451 426 420 415 384 335 312 337 382 403 401 414 447 460 431 393 388 400 386 355 364 438 519 539 494 437 407 404 411 425 441
2381 441 450 442 424 408 399 392 381 365 358 371 402 424 416 386 363 364 378 389 395 407 427 449 459 448 422 401 404 434 475 503 504 483 462 457 462 452 423 402 417 455 477
2376 477 467 438 408 380 358 350 350 341 326 339 394 456 473 438 396 375 364 342 318 320 352 385 393 384 392 430 470 474 437 395 388 412 436 432 406 387 402 443 479 484
2371 484 469 459 465 471 465 454 442 428 413 407 411 402 373 342 330 334 338 341 348 353 352 356 375 387 368 329 311 327 348 354 361 385 414 428 431 432 430 419 403 385 353 310 289 322
2366C22O8N2Nk6l0k0mJ5K8J6pk0j9j7j8j0J1K4J8MJMok0j6J5L8K5oj3RL0L0J9Oj5m3m9j7K2
2361D06K6JrMJ1nj8mJ5Rj7l3k5pMMmj0%J8J5j2k9qK1J9rk0%J4Mpnkj1qJ9M0K3poK3L3J2j2
2355D53k4l8n1l5J5N5M8J4pj1j2j0MK2J7nj1KKk1l9k6QL2L0J8J5J1ll1m4j9L1N5L4QRJ4j0
2351E00m6m3oJ1nj2K6O6N4Jm3n0l9k7j9j4j2p%JkJ2M5N9K5l2n8l6LK2K3K3K7K1ll1l4nK0M
2346D19l4m2jM3M0Rrj1j4j8j2lmKK4L9J9j2j4QJ6LkJ1J3mj8k1k3j7RK7Nl2k4L0N6K6lJ4L8
2341E33J5k9m0j6QJ3Pj8n0n3nN1O1K7jprj0MJ9J3ooRJ7Mj3l1n4o2k3L9O0K2l1m2j3K1L1J6
2336D51j2k7k2j3j6j5J1M4M4Pk0j1J9L6K8%l6m8k7krl5k9J2L6J4j7k3j2oJK2L2J0k3k6jK5
2331C62K7J9PllMQLPK3K4kk2lK7J7l0n3j8L2L6lm1m7k4KJ5Pj4k9k4nJ3J8J9K3L0K7J8J4K1
$$ plain form
2366 322 390 442 447 421 391 371 367 382 410 426 419 399 380 363 345 335 346 370 388 392 393 397 391 371 355 370 408 433 427 414 423 453 483 502 508 493 450 401 384 406
2361 406 432 433 424 428 439 434 416 412 427 436 419 386 361 354 358 362 358 348 348 366 381 369 340 332 353 372 363 343 343 357 361 354 349 347 336 328 347 387 410 403 397 420 453 465 453
2355 453 429 391 340 305 320 375 423 437 430 419 407 397 401 423 440 435 424 426 428 407 368 342 350 382 412 430 445 456 453 422 378 359 390 445 479 487 496 510 500
2351 500 454 411 405 416 411 399 425 491 545 546 503 453 414 387 368 354 342 335 335 336 334 346 391 450 475 443 385 349 352 374 397 420 447 468 465 434 400 395 415 419
2346 419 385 343 342 385 425 434 425 414 400 382 370 367 363 365 389 428 447 435 421 429 445 448 446 457 470 466 448 427 404 387 396 423 428 396 372 402 458 484 481 495 533
2341 533 548 519 479 463 471 484 491 473 423 370 365 416 477 504 503 496 487 477 481 500 513 507 501 510 527 531 518 487 433 371 348 387 447 469 438 396 383 404 435 451
2336 451 439 412 390 377 361 346 357 401 445 452 432 421 440 476 504 504 468 420 393 391 382 347 318 330 366 380 363 340 328 322 323 345 377 387 364 338 337 362
2331 362 389 408 415 412 409 413 421 424 431 454 478 476 454 451 478 495 465 412 394 426 462 459 418 371 347 349 364 371 357 328 304 299 312 330 349 372 402 429 447 461 482
2326D82K6J3qk1j7j5k2k7j8JJ6K0J4MKJ4K0Kl2l8oK8K8kk4k7j7jK0K6Nj9j6QJ8jk1j6%J0J3
2321D22J8J6jk7m2l5j5KJj0j2OL2M7M3L4L0K1ll4n2l7%L3L5Ok3k8j7ppj1j3nRK4K2%k4k5q
2316C65NJ6L2M0K3j6m0k9jJ6K1J8Nj8l4k8qRJ2NjjNQLJRK3L3L3K8Qk5m6k4K1L6km1l4KJ3j3
2311D29l9l3qJ2Ok2m5l6RN5O5L8Mj1j0KJ6K6J6ok5k8j1J4K9K3lk6l4l0k3j9j0lJ0K9M4L2j
2306D36k2j0J5J6MLJ3Mk3l5k2rqmJ9L2Ql7n9l5RL2K1jqlqk5k0J1L1J8LK2M2K0j9oL8L4k8n2
2301C97PN7J8m7l8J7K0k3k0L6M3k3o8k1M2L2j6j6K1K7KlJ3%l8l4J8N5L5J0K0M0J6l1m5k3%
2297D80MLQRjqqmjPJ3%l8o8o2j5L6N1K1j9k8%K8K7nl6m4k1J4L7L1J1RL1L7Ql1l0PK8Ml0l0
2291D25%J1j8m9l4K3O9O0Rl2l6j3Jnk0j8J0N0P0M6kj6J5M2J3n1p8m8kJ8J8K1J8ml5m1j9OR
$$ plain form
2326 482 508 521 513 492 475 460 438 411 393 394 410 430 444 448 450 464 484 486 454 416 410 438 466 464 440 413 396 395 415 441 446 427 411 419 437 436 415 399 399 409 422
2321 422 440 456 455 428 386 351 336 338 339 329 317 323 355 402 445 479 509 530 527 493 441 404 404 437 472 478 455 427 410 403 396 385 372 367 376 400 422 422 398 373 365
2316 365 370 386 418 458 481 465 425 396 395 411 432 450 455 437 403 375 367 376 388 393 392 391 396 404 407 408 417 440 473 506 534 542 517 471 447 468 504 502 461 427 429 442 429
2311 429 390 357 349 361 367 345 300 264 273 328 393 431 435 424 414 416 432 458 474 468 443 415 404 418 447 470 467 441 407 377 354 335 325 322 332 361 405 437 436
2306 436 414 404 419 435 439 442 455 459 436 401 379 370 362 358 377 409 417 380 321 286 295 327 348 347 339 336 328 303 283 294 325 343 346 368 410 430 411 405 443 477 449 397
2301 397 404 461 479 432 394 411 431 408 388 424 467 444 376 355 397 429 413 397 418 445 447 444 457 457 419 385 403 458 493 503 523 563 579 548 503 480 480
2297 480 484 487 495 504 503 495 487 483 482 489 502 502 464 396 334 319 355 406 427 408 380 380 408 435 430 394 350 329 343 380 411 422 431 462 499 507 476 446 453 481 485 455 425
2291 425 425 436 418 369 335 358 427 487 496 464 428 415 416 411 391 373 383 433 503 549 547 531 546 588 601 550 472 424 422 440 458 479 497 493 458 417 398 404 413
2287D13j8n2o8m3ML9M5L8L2K4PmQK9K2rl2l2k1j7j0LLj7l2j2L1N2L6J3J2J4j0n1n9k3K0L2
2282C67K7K4J7j3m0j9L6O5L6j0k1qrk2j8LJ6Oj2k2j8LL6N0L4Qlj2l6n2k6K1K8rl2oK1Rk2j8
2277C79J2K6Pj7k6k9k4oK0L1K1P%JNRPmj6j3nqj1jJ5J1mML7M3mn4m0K3N6K4j9j8J6L1J1j8
2272D79l0l3l3k1nnj8j4K0M3K4j7k8NM2M7K7QMJ0J3Lj9l5k8k0k8l5j0L0L1j3l9j1L5M2J1p
2267D25KJ2O%KKrj5j2qlJ1L2M5M0K5Pj1k6l2k8k2j9j7k2l2k8kK3K0lmK8N2L4lk1j0NMkjQJ2
2262D65PjlLMnj8k5k7k7k0%J5J4ONLj2k8j6RJ7MKJ6J9MmLjk4k6QL6K4KQK1Kk6j4K5L8J5lL
2256D98Jk0l2j4J3K3J8J1Kj0rkpk2k1JJ4RLRPj4k9j5N%j7j9lMlpLJ3Qrj9j0J2K2Pj3qJ9L0
2251D29J6MJ2J4j5n0m7pK4K6J7Pj3l5l2NL6K7j4l5j9QJ2lpJ1L6L8K2Kj4k0mK9M3Ko2p3j2N0
$$ plain form
2287 413 395 343 275 232 236 275 320 358 390 414 421 417 425 454 476 467 435 403 382 365 355 358 361 344 312 300 331 383 419 432 444 458 448 397 338 315 335 367
2282 367 394 418 435 422 382 363 399 464 500 490 469 461 452 430 412 415 431 437 425 403 385 388 424 474 508 516 513 501 465 413 387 408 436 427 395 389 410 419 397 379
2277 379 391 417 424 407 381 352 328 322 342 373 394 401 401 402 407 416 423 419 403 390 385 377 366 365 380 391 387 391 428 471 467 413 373 396 452 476 457 439 455 486 497 479
2272 479 449 416 383 362 357 352 334 320 340 383 407 390 362 367 409 456 483 491 495 505 518 521 502 467 439 419 391 356 346 376 407 394 355 344 379 421 432 425
2267 425 427 439 445 445 447 449 440 425 413 405 402 413 445 490 530 555 562 551 525 493 465 443 424 407 385 353 325 323 346 366 363 359 387 439 473 470 449 439 444 448 446 445 453 465
2262 465 472 471 468 471 475 470 452 427 400 373 353 353 368 382 388 393 396 384 356 340 349 366 370 372 388 407 411 407 410 409 385 359 367 403 427 429 437 458 460 434 420 445 483 498 495 498
2256 498 499 479 447 433 446 469 487 498 500 490 481 479 472 450 429 430 444 453 456 465 472 458 429 414 419 419 402 383 380 384 381 374 377 390 398 389 370 360 372 394 401 388 380 399 429
2251 429 445 449 461 475 460 410 363 356 380 406 423 430 417 382 350 355 391 418 404 369 350 358 370 367 360 371 407 445 467 469 455 435 431 460 503 505 443 370 358 408
2246D08M9J3%Mk1o6o6LP2P5L3nj3rllqj5rQJ5lk3j6RJ8Kj9j6J2L6K8nk3jK9J8l7p4n0OK9P
2241C89k2k4%K8L6J0k9m0pL6M5K2Jmkmjlj8k5rJ7J4j1j5PJ0j5k1J5M8K9lJ3N2M6kk8j4j2m8
2236D61o4k4J9Rk3j9K1M1K9K5L8K7j5m3k8qj7l9l0NL0L1K3J3lj5j4LJ8L0L7K9ml4l1%J5kj9
2231D72j5oolJ0J6lk6k2lMpqJ3L5L2Rj9k7pK3L8J5k5m7l4JK9L2Nk9l8pL1L5J4loj5l4m3k1
2226C60J5K9J3j4k1jK7K8kk6j7PRrj2MNj5k3JK8K3jj4j9k4j5J9N5N4K3mj7l0m5m0qK0K7J7
2221D07J0QJ4K3K6J4MQRj9n4m7%L3J7rkJ6Ok7m1k3rj7k8k3oRK8M7N1L1%k3k8j5J0L1L4J6q
2216D73k1k3k0j6kK5O0P3M5k2q2q9m4J0L8L4J6kj0mJ2K4K3J6Rpl0m3k1K6O0M5pn7o9m6j2M
2211C66koJ5M6N8M2J8Mok9m9m2j3J1K1L1M7M6J4j5j3Lnl6n2l3kJ6K1K1Pj4k4j3JKMK5M4K5
$$ plain form
2246 408 457 470 470 474 453 387 321 324 396 471 504 499 486 477 474 471 463 448 439 447 462 459 436 420 429 447 449 430 414 426 462 490 485 462 461 490 508 471 397 347 353 382 389
2241 389 367 343 343 371 407 417 388 348 341 377 422 444 445 441 439 435 434 431 413 388 379 396 410 399 384 391 401 386 365 380 428 457 454 467 519 565 563 535 521 509 461
2236 461 397 373 392 401 378 359 380 421 450 475 513 540 525 482 454 446 429 390 360 365 395 426 449 462 459 444 430 433 451 481 518 547 543 509 478 478 493 491 472
2231 472 457 451 445 442 452 468 465 439 417 414 418 411 403 416 451 483 492 473 446 439 462 500 515 490 443 409 410 439 471 476 447 409 402 433 468 482 479 473 458 424 381 360
2226 360 375 404 417 403 382 381 408 436 434 408 391 398 407 398 386 390 395 380 357 358 386 409 408 394 375 351 336 355 410 464 487 483 466 436 391 351 343 363 390 407
2221 407 417 425 439 462 488 502 506 514 523 504 450 403 403 436 453 444 442 458 464 437 396 373 364 347 319 296 290 299 327 374 425 456 456 433 405 390 400 431 465 481 473
2216 473 452 429 409 393 391 416 476 549 594 572 490 401 357 367 405 439 455 453 443 439 451 475 498 514 523 516 486 443 422 448 508 553 546 489 420 374 362 366
2211 366 364 358 373 419 477 519 537 541 535 506 457 415 402 413 434 465 512 558 572 557 544 547 542 506 454 421 419 435 456 477 484 470 446 433 434 436 440 465 509 534
2206E34j7m1k5kknJ0K2pn8o5pO1O7K0j8j8qqJL0M1Ol2k3J7K6rk9KM4M9J8j5m0n1l4KK7J4j1
2201D66j1RK2K0J0j2m1m3j4Oj7m0j1M3N1J4kJ5J4j2rL7N8J3m0l3JRrj3qj7k2JK8J7j4j4J0
2196D62J0k0k9oJ4NmLJk0k9mL1M2L1J9Mj4k4k1j6j7rRJ9J6J7K4J7rj5J5M4L6Kj5j3j6k4k7
2192D89k3j8%L5N8M3Lk0k3k7l4k5MK3K0J0Lkpqj3k6l5j3J5J0k2l4mK7K5J6K3K9J6KJ5K9ln2
2187E06n8j2K7K1LJ2K9K0rk0qJnj3j0rk2l7l6j4J1K2J9J2Loj1jK3M1K9ql8l7j2RJ8K2K9K7
2182E18J0mOL1L3mm0l5KJ2k0m8l5kMj6j2K9O2M5jl2k6kJ6J8Rkn%kj3j4RL1K4rj9J0N1N2J1
2177F42l7n4l7j1NM%PK0K1Kk2l0k7k5l4l8j7K6O6P0L3j0k1ML5M0K1Krj6k8l8l2qJ2J0j4m0
2172D72m6k5RL8M2K0j6l0j1J8K3Nj1nNNjmjlj3k4k6nL2N6L3j9m6k0J5J6kmJ5K0RMJ7L0K2J
$$ plain form
2206 534 517 476 451 449 447 442 452 474 467 409 344 337 398 465 485 467 449 441 433 434 464 505 511 479 456 473 499 490 461 463 507 556 574 559 519 468 434 436 463 477 466
2201 466 455 464 486 506 516 504 463 420 406 412 395 355 344 387 438 452 450 465 479 467 458 495 553 566 526 493 494 503 494 481 473 456 434 435 463 480 466 452 462
2196 462 472 452 423 417 431 436 432 435 436 416 387 383 414 456 487 506 510 496 472 451 435 418 409 418 437 453 470 494 511 502 487 502 546 582 584 569 556 540 516 489
2192 489 466 448 448 483 541 584 587 567 544 517 483 458 462 485 505 515 518 516 509 501 488 462 427 414 429 439 417 383 379 406 431 447 470 499 515 517 532 561 558 506
2187 506 448 436 463 484 487 499 528 548 539 519 511 512 507 494 484 475 453 416 380 366 377 399 418 430 433 427 416 415 438 479 508 500 462 425 413 422 440 462 491 518
2182 518 528 524 530 561 594 590 550 515 517 529 509 461 426 424 428 412 400 429 491 536 535 503 477 475 491 509 518 516 511 511 509 496 482 491 522 546 537 518 528 579 631 642
2177 642 605 551 514 503 508 512 512 519 539 560 562 540 510 483 458 424 386 369 395 461 531 564 554 533 537 572 612 633 635 626 610 582 544 512 504 516 526 512 472
2172 472 426 401 410 448 490 510 494 464 453 471 494 499 488 483 488 493 492 488 487 484 471 447 421 416 448 504 537 518 472 452 467 483 481 477 492 512 521 525 542 572 594 595
2167E95j9l2k6r%j5k6oK5J6k9m5JN7N5Nl3k7mJ4L1M9N0J6l1n7m7k0njKK2M3N1L6J0j7l0j6
2162E83J5L3J6k0l9l1j9rOK7K8Oj5j4lPK0L7L1%j8pNpj7LK2mn2n8j2L2L4J1j9m3m3lM0M0R
2157E72MK8K0l7p1l7J8K5%nJ4K2Qpj2j7rK2M7L0j3k9j1MLJ0L4L8Ml3k9mNokK7M0J5j9k1nj4
2152F09m6m8KN3M2lqL5O0L1j2k4k3l4l3mK2Qj7jL6M1J2kRMk7l2ML5J7k2l6j9J0M0N6K9k9n4
2147F81j4L9L5j6m6k3J6L5L1J9J2J2J7Ok5m6k6J3K1qk7oK0J6j0k2qJ6K9L2K2Jk5m6m8l0kJ9
2142F64L0L0K3Oj3j4RK0nl4k3K0L5lm1l4kPnoMql3l4jJ7j2n1m9rL0M1L8K9J8PRJ8J6mj7j4
2137F59mqk1k9k0lOJj4j9oJ2J3KKJ3J3rl5l6j5J3L5M0J4k8m0mM6N6K6mj4rKJ9J9j4m4j7M4
2132F42N6qo6m9J6M9L8J6mm2p3n4LL8L3L5N0L9k2o9m7J2L4%l9l9j3J1J1rl2l1jL4M6L4J6m
$$ plain form
2167 595 576 544 518 509 509 494 468 462 487 503 474 429 430 487 542 547 514 487 483 497 528 577 627 643 612 555 508 488 483 482 484 506 549 600 636 646 629 599 583
2162 583 598 631 647 627 588 557 538 529 535 562 590 596 581 567 564 571 591 628 659 659 641 634 639 632 615 618 640 636 584 526 514 546 580 591 572 529 486 483 523 563 572
2157 572 576 604 624 587 516 479 497 522 522 517 531 553 561 554 542 525 516 538 585 615 602 573 562 566 569 579 613 651 655 622 593 589 594 588 586 613 653 668 649 628 623 609
2152 609 563 515 517 570 612 609 601 636 696 727 715 691 668 634 601 597 619 627 610 609 645 686 698 696 705 709 682 650 654 689 706 684 648 629 639 679 735 764 735 681
2147 681 667 706 741 725 679 656 672 707 738 757 769 781 798 804 779 733 707 720 741 733 706 700 720 736 726 704 696 712 741 773 795 796 771 725 677 647 645 664
2142 664 694 724 747 753 740 726 735 755 750 716 693 713 748 745 704 670 668 675 670 664 668 660 627 593 592 609 597 546 497 488 518 559 597 626 644 651 660 678 694 690 673 659
2137 659 655 647 626 597 577 574 580 581 567 548 542 554 567 569 571 584 597 588 553 517 502 515 550 590 604 576 536 532 578 634 660 656 642 633 635 654 673 659 615 598 642
2132 642 698 690 624 575 591 640 678 694 690 648 575 521 524 562 595 630 680 719 697 628 581 593 627 627 588 549 536 547 558 549 517 486 485 519 565 599 615 611
2127F11k4l4j9LJ1QJ8L2L5K1Nj1l4n2l7LK8J9MJ2K0Kj8rJ5Pk6l3ON0M9J4j0j2j2k4k5MM8O4
2123G09L4j9m1j1K8J6m6r2o8pK9K7K7L8L3Jk5k8k7l6k3J6M1J9j6j5LJj3jJ9Qk0j1L3L8ol0
2118E85ML2km7l3J0J2k1k3J9L6Ll2l2j4lJ3L8L9Qj7j1lj2j5PK3Lk5j6K3M0K4PJ0J2lj8j2J8
2113F27M6M6Qm2n7k7J0J1j5k5oQ%j4pJ9L4K7Nj3j4NK5L1J6j2l9m5k6MJ1qj6QL7K5rj6J4K2
2108F48k1o5n5rJ3kqK3N5M1ql5j6J6K1KqPK2J8NOJ9K9K2kk8l8j2L6N8K6k7m7k9p%RK2J2k4
2103F69n3m1pJ2RJkKJ6K8J5j5k9rJ6K3K4L7M1J3j4oK0J8j4l0j6lrrLLj7k9rK1K6J1koj0j4
2098F64j1mMJ4K3K3Mk3l9l4mK9M2K6OLkl4o3m2K1N1K1j4oJ6Rj1kK7L2J9J9K9J3k9n2l6j3j0
2093F66j5oJ0K1K1Nk7n2l8QL7K5%nJ2K8K8J4nj4nJ5J9Ork0k6k5mK1K2J1K2N0M8%l4j1L0J7
$$ plain form
2127 611 587 553 534 537 548 556 574 606 641 662 667 656 622 570 533 536 564 583 587 599 619 621 603 594 609 616 590 557 563 613 662 676 666 654 642 618 593 597 645 709
2123 709 743 724 683 672 700 716 670 578 510 503 532 559 586 624 657 658 633 605 578 542 519 535 576 595 579 564 567 568 555 554 573 581 561 550 583 621 615 585
2118 585 589 621 619 572 539 549 561 540 517 536 572 575 543 511 497 494 507 545 584 592 575 564 561 549 534 541 564 567 542 526 549 589 613 620 630 642 639 621 609 627
2113 627 673 719 727 685 628 601 611 622 607 582 576 584 584 570 563 582 616 643 648 635 621 626 651 682 698 686 647 602 576 580 591 583 567 575 612 637 628 612 626 648
2108 648 627 562 507 498 511 509 501 524 579 620 612 577 561 577 598 600 592 599 621 639 644 650 669 698 720 718 690 652 640 676 734 760 733 686 657 650 650 659 681 693 669
2103 669 616 575 568 580 589 590 588 590 606 634 649 634 605 596 612 635 659 696 737 750 736 730 750 768 754 724 708 705 696 687 690 693 676 647 638 659 685 696 694 688 678 664
2098 664 653 649 653 667 690 713 717 694 655 621 617 646 688 714 720 723 721 687 624 582 603 654 675 661 655 671 680 669 667 694 726 745 764 793 806 777 725 689 676 666
2093 666 651 645 655 676 697 702 675 623 585 593 630 655 655 650 662 690 718 732 727 713 708 723 742 748 739 719 693 668 664 685 707 718 740 790 838 838 804 793 823 840
2088H40l9o2k6RNrJ4N0M3mm1l6k0k0k6pK8M3L0J3Kj7m7n0oM1M2Pj0NJ5lk8k8j1lnj4l2m4k6
2083E73J8M9M2K4J8J3j5m4l0J8N4M3Pk6l7k4J3M7N4K9nk8k6rOol0l1OL8K5j4k3QL3J8j8l2
2079G38j0K9M7K9qk5nK1K2PKNlj3ojk4o1o3j7L2M7L7K0jj2oJ0PqqNJk0j9QJ5qj2J8L6Pj8J6
2073H11O4M7k2o2m9k0rnKlj2%K0J6orJ2K5J7QJj7l0lM0L6j6m6k0J2J0mQK6J7OJ2J5j6m0k1
2068G95J5J1j5KM8M7k3p7m3L9P4L2l2n7l2QK3Rj1j0ORjPM2O5M0j7m9l8j1j1l2l8j0K4K1j5
2063G95l5j2K7L4Qj4pJ3K6K1kk4j9K4O8O6J9k4l4k9k9k8k1k1k4j2J8L0Qj5kK0Ol3m1qJ9J8
2059G86J9M2O2M0pl3j9NJ2POQ%k0l4k1QL4L9K7Mk2m2l4LL3J6l0n4l0OK4K5K4J2j9l6j2K7K6
2054H82j6l8oM2M6J6KK0L3J5k0l5k8j5nK%j6k7j5J3J8ok2lL1L7J7KL%j8k6j2RJ5J0PJ0J2R
$$ plain form
2088 840 801 739 713 722 727 718 732 782 825 821 780 744 724 704 678 671 699 742 772 785 787 770 723 673 667 708 750 757 747 752 767 764 736 708 697 694 689 675 643 599 573
2083 573 591 640 682 706 724 737 722 678 648 666 720 763 770 744 707 683 696 743 797 826 821 793 767 758 764 758 728 697 703 741 766 752 729 737 770 788 770 738
2079 738 728 757 804 833 825 800 795 816 838 845 847 852 849 836 830 829 805 744 681 664 696 743 780 800 799 787 781 791 798 790 782 787 788 768 749 757 772 764 752 770 806 813 795 811
2073 811 875 922 900 838 789 769 760 755 757 754 742 742 762 778 772 763 775 800 817 825 826 809 779 776 816 852 836 790 770 782 792 788 796 822 839 845 857 872 856 816 795
2068 795 810 821 806 808 856 903 880 803 760 799 873 905 873 816 784 792 815 824 813 803 809 818 817 824 866 931 971 954 905 867 856 845 813 775 765 789 810 795
2063 795 760 748 775 809 817 803 796 809 835 856 854 830 811 835 903 969 988 964 930 901 872 844 823 802 778 766 784 814 822 807 805 825 831 798 757 749 768 786
2059 786 805 847 909 949 942 909 890 895 907 914 920 928 928 908 874 853 861 895 934 961 965 943 901 867 870 903 919 889 835 805 811 835 860 884 896 877 841 829 856 882
2054 882 866 828 822 864 910 926 928 948 981 996 976 941 913 898 893 895 895 879 852 837 850 868 862 840 837 868 905 922 924 927 927 909 883 871 880 895 905 912 922 934 943
2049I43LjKJ9L6L0jk7k8j2kmnpj1j9k1j7LL6N4K5l6n5j1L3J7j7%M7L8k0m1RM8J7k0MM4J5o0
2044A008p5jO6N4ml1j2J3J8MqqKQlj6oL1N3L3j3m3m7m4n0m8j5M0P0M5j2n1m7k0PK8L9L1J1
2039A007NK5M2K3j8m3l7j6RK9K6j0m8m2LL4J6k2l6j2J9K5kl6l3J1N8N9K2j3j9j0NJ7J4rk3
2035A020JL5K9j7m0j7J2J3OJ9K5Lk6k4lRJ6K9L2J4lLJ6J2Jmk0n8p7k9M2N7J6rJ3K8Pj6LM1
2030A159M9K3j3l4l2qJ6J4lnJ1J5jnJ7K3j1l8j7K3K5pj9%Jk9m1JN9O5J5l1k7QK2Kj7qJ8K6
2025A246J3jlmolRJ2ok9l6k3NL6N7N1K1qj4rrmK6O0N1nn6o0k7oj4j7OL4L1%k4j5QK1J9Nj2
2020A320k1oJ8K7K1K6M3L4j7n5l5J2J5j4lN8Q9L6m4o3k4J6K3J7Qnj3j2qj6k6k0jL0O7Q7N8
2015A622j5o5m6PJ9k0n7m6PO6Q6L5n4r2l9L9N3J2pJ3J9j5m1l1j5j9j8RL3L0J9J6Nk6m0j1K1
$$ plain form
2049 943 946 945 947 966 1002 1032 1031 1004 976 964 962 958 953 946 935 916 895 878 881 917 971 996 960 905 894 927 944 927 927 974 1012 992 951 960 1008 1025 1005 1009 1053 1068 1008
2044 1008 933 932 998 1052 1048 1017 1005 1018 1036 1040 1032 1024 1026 1034 1031 1015 1009 1040 1093 1126 1113 1070 1023 979 929 881 866 906 976 1021 1009 958 911 891 898 926 965 996 1007
2039 1007 1012 1037 1079 1102 1084 1041 1004 988 997 1026 1052 1042 994 952 955 989 1005 983 947 935 954 979 977 941 908 919 977 1036 1058 1045 1026 1016 1021 1038 1052 1043 1020
2035 1020 1021 1056 1085 1068 1028 1011 1023 1036 1042 1061 1086 1089 1063 1039 1036 1045 1061 1090 1122 1136 1133 1136 1152 1164 1165 1161 1141 1083 1006 977 1019 1076 1092 1083 1096 1124 1131 1115 1118 1159
2030 1159 1208 1231 1218 1184 1152 1144 1160 1174 1171 1166 1177 1192 1191 1186 1203 1226 1215 1177 1160 1183 1208 1201 1182 1182 1183 1154 1113 1114 1173 1238 1253 1222 1195 1203 1225 1227 1210 1202 1220 1246
2025 1246 1259 1258 1255 1251 1245 1242 1251 1263 1257 1228 1192 1169 1174 1210 1267 1318 1339 1331 1317 1308 1299 1295 1321 1381 1432 1427 1371 1311 1284 1278 1264 1247 1253 1287 1318 1318 1294 1279 1287 1308 1327 1332 1320
2020 1320 1299 1293 1311 1338 1359 1385 1428 1462 1445 1390 1355 1367 1382 1368 1365 1423 1512 1548 1504 1441 1417 1433 1456 1473 1481 1476 1463 1451 1443 1427 1401 1381 1380 1410 1477 1564 1622
2015 1622 1607 1542 1496 1503 1522 1502 1445 1399 1406 1472 1558 1593 1539 1447 1408 1447 1500 1512 1505 1518 1537 1522 1481 1450 1435 1416 1398 1407 1440 1470 1489 1505 1510 1484 1444 1433 1454
2011A454J2j0MM2M8J9lJNj2k5j6lJRL1M2K5oqK4N9N8L1QJ0J4jl0l9k1KQlj1qlKLLKNLmj2j3
2005A697j1j5j1J0L0K4JmPMk2k7KK6J9J1K8M1J6j7mL3L0j5m2j8J5J9J8L6M6J9k4l5j5lj6j9
2000A834J1L7J7l7o0j5M6N2Nk5NM3K9k4m3rL4M7M1L6K1j0l4k4PK6K1J1J5K5K6Rj2j2J7L8J7
1996B165k6m1k0mj0j5PK4Rj7j1J3J7opL1O5N7J6j6k6k9l5k6ML9N5M8K6Kk1k9j1K1L7K4M%P
1991B321RNJ0J5%j7j0K2L8K0MJ7L7K4j1k5nJ6J0j7l4k4NK8L4L0L6N0M5J7rlJ5J1nkK3L5J4
1986B729j5k3j2orqQK8L8L0K0J5J5Mj1j0J9N5P1O1M0J5pj6%J6J0lJ0M6M7on7m0K4O2M4J1M
1981C199J3QkLJ9K7L1N4Q2O8Kn6n0kK1MoK2M7K8j5k6MM3N7M6K2kqJ3M5O6O3M8K7LrMK7L6K7
1976C983K0Pj7k9LO1Q2M8J3K3N5O1L7J1nqJ7P2J13R4L7KRL1M8O4P6O6M6M5O0N6L0K6N6P5N5
$$ plain form
2011 1454 1466 1456 1460 1502 1550 1569 1566 1567 1572 1560 1535 1519 1516 1517 1526 1557 1599 1624 1618 1610 1634 1693 1751 1782 1790 1800 1814 1813 1783 1744 1723 1725 1733 1730 1719 1711 1708 1710 1713 1716 1718 1723 1726 1722 1710 1697
2005 1697 1686 1671 1660 1670 1700 1724 1725 1721 1728 1732 1710 1683 1685 1711 1730 1741 1769 1810 1826 1809 1805 1838 1868 1853 1811 1793 1808 1827 1845 1881 1927 1946 1922 1887 1872 1869 1853 1834
2000 1834 1845 1882 1899 1862 1802 1787 1833 1885 1890 1865 1870 1913 1942 1918 1875 1866 1900 1947 1988 2024 2045 2035 2001 1977 1984 2010 2031 2042 2057 2082 2108 2117 2105 2093 2110 2148 2165
1996 2165 2139 2098 2078 2074 2064 2049 2056 2080 2089 2072 2061 2074 2091 2085 2078 2109 2174 2231 2247 2231 2205 2176 2141 2115 2119 2158 2213 2261 2287 2289 2268 2239 2228 2249 2286 2310 2314 2314 2321
1991 2321 2330 2335 2345 2360 2360 2343 2333 2355 2393 2413 2417 2434 2471 2495 2484 2459 2454 2470 2480 2463 2429 2405 2410 2438 2472 2502 2538 2588 2633 2650 2641 2638 2653 2664 2659 2657 2680 2715 2729
1986 2729 2714 2691 2679 2673 2664 2656 2664 2692 2730 2760 2780 2795 2810 2814 2803 2793 2812 2867 2938 2999 3039 3054 3047 3031 3031 3047 3057 3054 3064 3110 3157 3151 3094 3054 3078 3140 3184 3195 3199
1981 3199 3212 3220 3218 3221 3240 3267 3298 3352 3434 3502 3504 3448 3398 3396 3417 3421 3415 3437 3484 3512 3497 3471 3475 3518 3575 3621 3643 3641 3633 3646 3691 3757 3820 3868 3895 3898 3889 3893 3920 3956 3983
1976 3983 4003 4010 3993 3964 3967 4028 4110 4158 4171 4194 4249 4310 4347 4358 4353 4345 4362 4434 4547 4641 4678 4680 4689 4720 4768 4832 4908 4974 5020 5065 5125 5181 5211 5237 5293 5368 5423
1972E423K7K9M4M4M9P7R1N9J8L7R9J34J15R5J09J19R7P9R7J15Q9M8N3J03J35J37J41J64J63
1968G990J26J00J29J89K22K15K04K08K12K14K32K68K97L06L09L23L36L31L25L35L65L90M03
1966A4029M19M54N03N55N98O26O56P11P94Q73R21R58J036J169J318J440J557J707J898K101
1963C4323K318K580K908L287L707M186M759N439O236P161Q229R446J0811J2315J3926J5601
1961A47232J7308J8957K0311K0985K0628J9058J6222J2056O537n6o996j3276j8013k0770k1650
1959B18533k1130j9798j8116j6342j4589j2922j1372r962q714p643o729n916n180m552m046
1957E1522l626l241k896k605k346k080j832j662j566j472j339j195j083r98r31q82q41p73
1955B0154o71n87n64n70n42m80m36m31m26l85l23k77k53k37k26k30k47k53k33j96j61j44j37
$$ plain form
1972 5423 5450 5479 5523 5567 5616 5693 5784 5843 5861 5898 5997 6131 6246 6341 6450 6569 6666 6745 6842 6957 7046 7094 7147 7250 7385 7522 7663 7827 7990
1968 7990 8116 8216 8345 8534 8756 8971 9175 9383 9595 9809 10041 10309 10606 10912 11221 11544 11880 12211 12536 12871 13236 13626 14029
1966 14029 14448 14902 15405 15960 16558 17184 17840 18551 19345 20218 21139 22097 23133 24302 25620 27060 28617 30324 32222 34323
1963 34323 36641 39221 42129 45416 49123 53309 58068 63507 69743 76904 85133 94579 105390 117705 131631 147232
1961 147232 164540 183497 203808 224793 245421 264479 280701 292757 299294 299238 292242 278966 260953 240183 218533
1959 218533 197403 177605 159489 143147 128558 115636 104264 94302 85588 77945 71216 65300 60120 55568 51522
1957 51522 47896 44655 41759 39154 36808 34728 32896 31234 29668 28196 26857 25662 24579 23581 22650 21768 20927 20154
1955 20154 19483 18896 18332 17762 17220 16740 16304 15873 15447 15062 14739 14462 14209 13972 13746 13516 13269 13016 12783 12587 12426 12282 12145
1952A2145j40j46j48j36j18j20j37j37j03p4q2r9p7m2n4j07j21p3l9o9j03p6l2m4q9q7n2o2
1949I578j22j26m1L9K6l9n4j5J4J0lrk5m4l9j7j3k2pL1M5J0l6n1m3m4m7k8QK7J1j1j8rkNK2
1945H961M3M2J4k6m3l3oJ6K4K9L6M7M0J0j4KN4Q7O4J8OL0M4K1jPL0L1J6K1M8O7N2K1NJ6L5
1940I814L5J9J6M2P2O8L9L0P1J13R7K5k9j8L3O5N6M0N2R0J09Q0K3j1LL7N7O4P0P4N5K0J1N4
1936A1376J22J52J11L6nK3O9P2L4L1R2J55J53J02O2M6K8J5M5J06J29R5N8O6Q8Q0N5N2P3Q5
1932A3606R1J08J22J07O6M4N7P8Q4P9P7P6P4P4P5O7N6O3J00J47J67J41Q8O1Q7J27J27R0P8
1929A6217J14J33R2N0Q2J56J69J13P8R8J15R0Q3J30J62J24P4J00J62J55P6L3P4J34J47J39
1925A9100J44J40J12R4J22J61J62J41J39J54J41J00P5Q8J10J15J11J14J20J23J33J56J71J59
$$ plain form
1952 12145 12005 11859 11711 11575 11457 11337 11200 11063 10960 10886 10804 10705 10628 10586 10532 10425 10304 10231 10192 10123 10020 9944 9912 9868 9779 9692 9640 9578
1949 9578 9456 9330 9289 9328 9354 9315 9261 9246 9260 9270 9267 9258 9233 9189 9150 9133 9120 9098 9091 9122 9167 9177 9141 9090 9047 9003 8956 8928 8936 8963 8974 8963 8945 8936 8934 8939 8961
1945 8961 9004 9046 9060 9034 8991 8958 8952 8968 8992 9021 9057 9104 9144 9154 9140 9142 9196 9283 9347 9365 9371 9401 9445 9466 9465 9472 9502 9533 9549 9570 9618 9685 9737 9758 9763 9779 9814
1940 9814 9849 9868 9884 9926 9998 10066 10105 10135 10206 10319 10416 10441 10412 10394 10427 10492 10548 10588 10640 10730 10839 10919 10942 10931 10934 10971 11028 11092 11162 11236 11291 11311 11322 11376
1936 11376 11498 11650 11761 11797 11792 11815 11884 11956 11990 12021 12113 12268 12421 12523 12585 12631 12659 12674 12719 12825 12954 13049 13107 13173 13261 13341 13396 13448 13521 13606
1932 13606 13697 13805 13927 14034 14100 14144 14201 14279 14363 14442 14519 14595 14669 14743 14818 14885 14941 15004 15104 15251 15418 15559 15647 15708 15795 15922 16049 16139 16217
1929 16217 16331 16464 16556 16606 16688 16844 17013 17126 17204 17302 17417 17507 17590 17720 17882 18006 18080 18180 18342 18497 18573 18606 18680 18814 18961 19100
1925 19100 19244 19384 19496 19590 19712 19873 20035 20176 20315 20469 20610 20710 20785 20873 20983 21098 21209 21323 21443 21566 21699 21855 22026 22185
1923B2185J36J32J45J48J24R5R6J30J59J52J18R3R5J12J22J26J31J40J52J65J69J57J38J32
1920B5352J32J11P2O0J02J52J58J28J09J20J33J38J50J62J48J08Q4J00J25J23J08J07J08R6
1917B8186Q2Q7R7Q8O9P4J06J28J20R7Q4Q4Q9R0Q3O2M2M2O3Q2P9O7O1O4O5N6M7M6O2P6O9M2
1913C0589L2N7Q2O7K1lJ4L0J9JJ1L6M2K6J1J0J0KkRK6L1J8nk2k9l3m1m7m0k6k2l4l8k5j3l1
1908C0733p3r7q3m9k6l0m7o1o8o5n9o1p6r9j09r4n8l1k4l1m9p3j01j09r6q8j03j18j06q3r4
1904B8472j40j67j41r1o8q4j14j31j30j08q8r9j42j72j56j15r4r7j01j08j36j67j62j19r0
1901B5452j07j45j63j53j40j32j22j16j26j49j67j57j32j22j38j55j48j30j37j64j61j23j09
1899B2256j56k06j79j05q0j30j78j60j18j09j31j46j40j30j18j09j21j48j58j35j11j21j43
$$ plain form
1923 22185 22321 22453 22598 22746 22870 22965 23061 23191 23350 23502 23620 23713 23808 23920 24042 24168 24299 24439 24591 24756 24925 25082 25220 25352
1920 25352 25484 25595 25667 25727 25829 25981 26139 26267 26376 26496 26629 26767 26917 27079 27227 27335 27419 27519 27644 27767 27875 27982 28090 28186
1917 28186 28268 28355 28452 28540 28609 28683 28789 28917 29037 29134 29218 29302 29391 29481 29564 29626 29668 29710 29773 29855 29934 30001 30062 30126 30191 30247 30294 30340 30402 30478 30547 30589
1913 30589 30621 30678 30760 30827 30848 30845 30859 30889 30908 30909 30920 30956 30998 31024 31035 31045 31055 31057 31055 31064 31090 31121 31139 31134 31112 31083 31050 31009 30962 30922 30896 30874 30840 30802 30777 30764 30733
1908 30733 30660 30563 30480 30431 30405 30375 30328 30267 30199 30134 30075 30014 29938 29839 29730 29636 29578 29547 29523 29492 29443 29370 29269 29160 29064 28976 28873 28755 28649 28566 28472
1904 28472 28332 28165 28024 27933 27865 27781 27667 27536 27406 27298 27210 27111 26969 26797 26641 26526 26432 26335 26234 26126 25990 25823 25661 25542 25452
1901 25452 25345 25200 25037 24884 24744 24612 24490 24374 24248 24099 23932 23775 23643 23521 23383 23228 23080 22950 22813 22649 22488 22365 22256
1899 22256 22100 21894 21715 21610 21530 21400 21222 21062 20944 20835 20704 20558 20418 20288 20170 20061 19940 19792 19634 19499 19388 19267 19124
1896A9124j43j32j37j44j31j14j17j30j23j05j01j07r8r1j13j45j45j13r4j02j11j13j24j33
1893A6258j07o5o9j23j52j24r5j10j25q3l7o6j39j60j10p2r9j30j06o9p9j26j35q7m3n3r6
1890A3598j20j09q6p3o2n4o4r0r3o2l8o7j30j57j23p9p3r2r3p3n6n2n1m9n4o5q1j04j19j02
1886A1127o1l9o0q8q2o3p3r1o7j0Om6j03j09p2l8k6l6n7p5o6m6n1q4r2n5k6m4o9n5k3k9o4
1882I233p2m6l1m6n7m5l8n4p3p2o6o3n9m5m4n3n1l6m1p7r1n0MKm1n9l8k6m7n7k6Pqn3p3n9
1877G549m9n2m8k9k6m6n4k8ol0o3n0kJ2l0o9n2j9l3q2q7k9K5J3m7p6n0j4j6m2n2k0J5J5k5
1873F403o5p2o0m8l6qJ8Ql5o9n8k3mj3l2m8n6m3kL4K3k5n4m0j8k5m6m5k3j8l2l0%K5J5j7l8
1869E443m4m0k1Njn3j01p7MN8K8l8o2l9k0l2n0m1j0K3L8L2Pk5m1l9l1l0l3l9m7n4m6k4mmj1
$$ plain form
1896 19124 18981 18849 18712 18568 18437 18323 18206 18076 17953 17848 17747 17640 17542 17451 17338 17193 17048 16935 16841 16739 16628 16515 16391 16258
1893 16258 16151 16086 16017 15894 15742 15618 15523 15413 15288 15205 15168 15102 14963 14803 14693 14621 14522 14392 14286 14217 14138 14012 13877 13790 13747 13694 13598
1890 13598 13478 13369 13283 13210 13148 13094 13030 12940 12847 12785 12747 12680 12550 12393 12270 12191 12118 12026 11933 11860 11804 11752 11701 11652 11598 11533 11452 11348 11229 11127
1886 11127 11066 11027 10967 10879 10797 10734 10661 10570 10503 10493 10499 10453 10350 10241 10169 10131 10105 10069 10012 9937 9871 9825 9774 9690 9598 9543 9517 9473 9404 9349 9326 9297 9233
1882 9233 9161 9115 9084 9038 8981 8936 8898 8844 8771 8699 8633 8570 8511 8466 8422 8369 8318 8282 8241 8164 8073 8023 8027 8029 7988 7929 7891 7865 7818 7761 7735 7742 7734 7681 7608 7549
1877 7549 7500 7448 7400 7371 7345 7299 7245 7217 7211 7181 7118 7068 7066 7078 7048 6979 6927 6908 6875 6793 6706 6677 6702 6715 6668 6592 6542 6528 6512 6470 6418 6398 6413 6428 6403
1873 6403 6338 6266 6206 6158 6122 6114 6132 6140 6105 6036 5978 5955 5951 5938 5906 5858 5802 5759 5757 5791 5814 5789 5735 5695 5677 5652 5606 5561 5538 5520 5488 5458 5458 5483 5498 5481 5443
1869 5443 5399 5359 5338 5343 5342 5289 5188 5111 5115 5173 5201 5163 5101 5062 5042 5010 4960 4919 4909 4932 4970 5002 5009 4984 4943 4904 4873 4843 4810 4771 4724 4670 4624 4600 4596 4592 4581
1864D581lK1L4J3k2l1j4j1m0n9l4J2J8k4n4l3MLl0m8l4j0LLqk5l1j5OJ0jlnk0l7k8jJ2%j0
1859D089qk1n0o0l7j3j3j8j0jj0j2QK4Qj2mJ3rn7p1k9J8K6Mj5j4LJ9K1PkJ4L6K4k9p6p3k8
1854C642K0L3J2j5rL2N8L5qk8k5l4m7k6J8K4k9o9m9qjk3k3j2k7o3o6k5PJj4%K0Ol8n5k5J9
1850C208L1J4jkj5m1n1k0K5M0Rl1m7l8j3QPj6l3j2K2K6Kj3ooj6kL1K6l1p3m4NMk5j3K9K0m8
1845B910q4m0K1K4j8m0j8J2K4J5nk9m5m1j7J9M6M8K6J0J5K1mm5n0j7K1L0J6j2m3n5k7J7K7
1841B712ql6k4PK2L1L4J4l7p5o9l8j7oQJ9J4ML%j7k5qJ4J4%kok8l8j0K7K6kpJ6K0pl0l0k2
1836B443k0oJ5J0k0l1NN0N5K8Krj2pJRJ4K6L1Ql8n8l1L%k8l6j9j5l8n2k9J2L1J1j7k1oj2m7
1831B202o5k3M1M9qn2k8J8K1j1k4mJ1OMJ2Rpk0j7j2j1lJ4K1Qj7l0j5J5L6K6jpJ3J7k7p6o4
$$ plain form
1864 4581 4578 4599 4633 4646 4624 4593 4579 4568 4528 4469 4435 4447 4465 4441 4387 4354 4358 4361 4331 4283 4249 4239 4242 4245 4237 4212 4181 4166 4172 4182 4181 4178 4173 4153 4116 4088 4087 4099 4099 4089
1859 4089 4081 4060 4010 3950 3913 3900 3887 3869 3859 3858 3848 3836 3844 3868 3876 3864 3860 3873 3864 3807 3736 3707 3725 3751 3755 3740 3726 3729 3748 3769 3776 3774 3788 3824 3848 3819 3743 3670 3642
1854 3642 3662 3695 3707 3692 3683 3715 3773 3808 3800 3772 3747 3713 3666 3640 3658 3682 3653 3584 3535 3527 3526 3503 3480 3468 3441 3378 3312 3287 3294 3295 3281 3281 3301 3307 3269 3214 3189 3208
1850 3208 3239 3253 3252 3250 3235 3194 3143 3123 3148 3188 3197 3166 3119 3081 3068 3076 3083 3067 3034 3022 3044 3070 3072 3059 3053 3047 3031 3029 3060 3086 3055 2982 2938 2943 2947 2922 2909 2938 2958 2910
1845 2910 2826 2786 2807 2831 2813 2773 2755 2767 2791 2806 2801 2772 2727 2686 2669 2688 2734 2782 2808 2818 2833 2854 2850 2805 2755 2738 2759 2789 2805 2793 2750 2695 2668 2685 2712
1841 2712 2704 2668 2644 2651 2673 2704 2738 2752 2715 2640 2571 2533 2516 2510 2518 2537 2551 2555 2558 2558 2541 2516 2508 2522 2536 2536 2534 2528 2500 2462 2452 2479 2505 2503 2496 2512 2532 2525 2495 2465 2443
1836 2443 2423 2417 2432 2442 2422 2391 2396 2446 2501 2529 2531 2522 2510 2503 2504 2513 2527 2553 2584 2592 2554 2496 2465 2468 2468 2440 2404 2385 2370 2332 2280 2251 2263 2294 2305 2288 2267 2261 2249 2202
1831 2202 2137 2114 2155 2204 2196 2144 2116 2134 2155 2144 2120 2116 2127 2133 2137 2149 2158 2151 2131 2114 2102 2091 2088 2102 2123 2131 2114 2084 2069 2084 2120 2146 2145 2138 2151 2168 2141 2065 2001
1826B001lL7K6LJlk9n5m5qRpk6j2L0O1M4pm0k2J5J3l2n9l7MJ4MQK9L5J8pl3o1p2m6ML5L2K1
1821A840K8L9K9ol8l6mK6K5Jk1k4j9k0k1j4ppjK0L5K7RPRj0l9m3j3J3J4OMLkkLpl5n0k9%P
1816A697qj4oKJjKPJ1J8K5K5J7Mk1m9n7l5oONJ1K2J6nj6j2jNJ0J2J0QK0K7Rl1n4m3j6OJ8J5
1810A634j0l9m1rJ7%k8k8oPQK2M4L8rm8l9KK1mm0n1l2qQJ6K3K0PJPJ9J9J4J7J7%j9j3J2J4
1805A563j8l7j8J5K2J2J2Rj3l1j2J7Jm2n2j3J5kl0k7qJKMlj4j1J1K3J8K7N2M3j6o6m4J6L5
1801A441Rqmj0k5qL7N0Rk5j2J5Mk3k2KPj3j5J2L3J2l4o2n0k1JJ2J6J3pl2l1kK6L2L1L8K3l3
1796A386r0q4k1J3rk7J3O3N3Jk1LJ3k1n3l8OL3L2K0Orj8jL5M6Qm3m7kL4J9j3j0J5J3j5j8P
1791A279J2j4k3J7M9K5j6j5Rom9m9rPj9k8J4M2Pm2l5K1N0K7qj3MJ3nl2l9oL5L3j6n3l5J2L3
$$ plain form
1826 2001 1998 2035 2061 2064 2065 2062 2033 1978 1933 1925 1934 1927 1901 1889 1919 1980 2024 2017 1977 1955 1970 1983 1951 1892 1855 1859 1873 1877 1885 1914 1949 1967 1960 1927 1866 1794 1748 1752 1787 1819 1840
1821 1840 1868 1907 1936 1930 1892 1856 1852 1878 1903 1904 1883 1859 1840 1820 1799 1785 1778 1771 1770 1790 1825 1852 1861 1868 1877 1867 1828 1785 1772 1785 1799 1805 1809 1812 1810 1808 1811 1804 1769 1719 1690 1690 1697
1816 1697 1689 1675 1669 1671 1672 1671 1673 1680 1691 1709 1734 1759 1776 1780 1759 1710 1653 1618 1612 1618 1623 1634 1656 1672 1667 1651 1639 1638 1643 1653 1665 1675 1683 1703 1730 1739 1708 1654 1611 1595 1601 1619 1634
1810 1634 1624 1585 1544 1535 1552 1552 1524 1496 1490 1497 1505 1527 1571 1609 1600 1552 1513 1515 1536 1532 1492 1441 1409 1401 1409 1425 1448 1468 1475 1476 1483 1502 1521 1535 1552 1569 1569 1550 1537 1549 1563
1805 1563 1545 1508 1490 1505 1527 1539 1551 1560 1547 1516 1504 1521 1522 1480 1428 1415 1430 1428 1398 1371 1363 1364 1366 1370 1367 1353 1342 1353 1376 1394 1421 1473 1516 1500 1434 1390 1406 1441
1801 1441 1450 1442 1438 1428 1403 1395 1432 1482 1491 1466 1454 1469 1473 1450 1428 1430 1437 1424 1409 1421 1454 1466 1432 1370 1320 1299 1300 1312 1328 1341 1334 1302 1271 1269 1295 1327 1358 1396 1419 1386
1796 1386 1296 1212 1191 1204 1195 1168 1181 1244 1297 1298 1277 1280 1293 1272 1219 1181 1187 1220 1252 1272 1278 1269 1251 1250 1285 1331 1339 1296 1249 1247 1281 1300 1287 1277 1292 1305 1290 1272 1279
1791 1279 1291 1277 1254 1271 1320 1345 1329 1314 1323 1317 1268 1219 1210 1217 1198 1170 1184 1226 1233 1191 1156 1177 1227 1254 1246 1233 1237 1250 1245 1213 1174 1168 1203 1236 1220 1167 1132 1144 1177
1786A177K6J8J7OnOK6K2mk1j7j5k4k1%Rrl1l3k0j0pmnoRL5M6K4mkJ7Rl0n1j9L1M1Nk3qK6L5
1781A216J2j1j5j1j2j3j4k3m0m2j5J9L0K0PKKOJ7K7J5orNJk5l3PN5N3Pk3nK6K2qk8k4j6l0
1776A146n1n1j8J8K5O%K5M9K9k1m2j2L2L2qm2l9j9qjJ7M2N2K9j1l7k8JJ5Jj8rJ9K0j7m8l3
1772A045PK1KkK4M3K5lj1pj1j2OK6J5j2j7kJj3j2J0J5j3l7k5nj7m3l6QL7K2j8l6j2K5L7Rk9
1767A005l9j5QJ7K2L2K7PKK8M0Mm1l7OJ9j9m7l4j9l5l8PN5L8j8l5LK9Rj5kJ8J0j3j2Jrl8m5
1762H76k4oLL0O7O7On2m2J7N4L8Nm%LKKqk1j7NJ8Mj4j2qk2l7k3QK1RjLJrlK1L3K1J1K0K3N
1756A070j1mOrk6j2K6M0Pl2m3k4opk0k7j5OOj2j9jJ4Jj5MM6O2L6Qmj9m0l6LK9Pk3j1K3J8l1
1751I65o2l5K2O1O0K2l1o2m3QL7K6OOJ0Kj1q%nj4j0jjKK6N0L3k0n0k4K0L0Lj8j4lknoj0j9
$$ plain form
1786 1177 1203 1221 1238 1244 1239 1245 1271 1293 1289 1268 1251 1236 1212 1191 1191 1200 1191 1160 1127 1107 1097 1090 1086 1081 1075 1084 1119 1165 1189 1185 1183 1200 1209 1179 1128 1109 1140 1181 1186 1163 1155 1181 1216
1781 1216 1228 1217 1202 1191 1179 1166 1152 1129 1089 1047 1032 1051 1081 1101 1108 1110 1112 1118 1135 1162 1177 1171 1162 1167 1168 1143 1110 1117 1172 1225 1232 1209 1204 1230 1252 1244 1216 1192 1176 1146
1776 1146 1095 1044 1026 1044 1069 1075 1075 1100 1149 1178 1157 1115 1103 1135 1167 1159 1117 1078 1059 1051 1050 1067 1109 1161 1190 1179 1142 1114 1115 1130 1131 1113 1104 1123 1143 1126 1078 1045
1772 1045 1052 1073 1075 1073 1097 1140 1165 1162 1151 1144 1133 1121 1127 1153 1168 1156 1139 1137 1138 1125 1113 1123 1138 1125 1088 1063 1058 1041 998 962 970 1007 1029 1011 975 963 988 1025 1034 1005
1767 1005 966 951 959 976 998 1030 1057 1064 1066 1094 1134 1138 1097 1060 1066 1085 1066 1019 985 966 931 893 900 955 993 975 940 943 972 981 966 964 982 992 979 967 968 959 921 876
1762 876 852 846 849 879 946 1013 1019 967 925 942 996 1034 1039 1035 1035 1038 1040 1042 1034 1013 996 1001 1019 1023 1009 997 989 967 930 907 915 936 945 944 947 948 939 936 957 990 1011 1022 1042 1065 1070
1756 1070 1059 1055 1061 1052 1026 1014 1040 1080 1087 1055 1012 988 982 975 955 928 913 919 925 913 894 893 907 908 893 897 943 1005 1041 1049 1045 1026 986 950 953 982 989 966 955 978 996 965
1751 965 903 868 890 951 1011 1033 1002 940 897 905 942 968 974 980 990 992 981 973 973 968 954 944 943 942 944 970 1020 1053 1033 983 959 979 1009 1012 994 980 977 975 970 964 954 935
1746I35j9jJ7J6Kj2j2JJ1J7J3OLQK1K9K4Nk4m7m6j2K6K6j4m4j7M2N9Qn8o9k2K3L1J8J2J6J5
1741I87J3J3J2Jj2k1k8k2QM6M4om7k8J3Kn2o4j0L7J8k1j4K6M0K9K8L3Pm2o0l4pooRJ8J7K8
1736I49N1M5Kk1%J4k1o5n2lJ8NPL1K7j8m7k3J7K0rk8j7J0L0L2J1j7k9k1j1j0LK7L2%l7m1j2
1732H49J5K2K3K5K7J7kk3l6k5NK7K3PllmnmLOJ2J7RqrJ2K2ll3j9K2K8ql6j8OJj2mJ1kk8l1
1726H73j6j7m0m8k3J3L8N0M7K2j2j6J2L3J6j3j6LLj8k8j1PJ1J0Qjj3oK2L4Ok2qL0L5%j8%J3
1721I60j3m3l2LJ7%j5j4j5j5nNmj8JL9L9qm0pM2M2Lj7jJ3Nqj5k8l6k0J1J8JmK0M3L6K0J5J0
1716I85j3k7KM6N2J3k7l7l2l3k4LK6K4kk4k4j0J1K8L2K0kj8k2j3JNlrKK5L6K0j5m4m8j5L7
1711I26O5M2nj8QK3j2n4n5k1lnKK1K2LjJ6J4j8k8J9P5P1J6k0j4%pj1PK5J3j3k1nJ0Qm%J5K2
$$ plain form
1746 935 916 915 932 948 950 938 926 927 938 955 968 974 977 985 1006 1035 1059 1064 1040 993 947 935 961 987 973 929 912 954 1013 1021 963 894 872 895 926 944 956 972 987
1741 987 1000 1013 1025 1026 1014 993 965 943 951 997 1041 1035 988 960 973 975 923 859 849 886 904 883 869 895 935 964 992 1025 1032 990 930 896 889 883 877 886 904 921 949
1736 949 1000 1045 1047 1026 1026 1040 1019 954 902 899 917 922 929 960 987 969 922 899 916 936 927 899 882 892 922 954 965 948 919 898 887 877 880 907 939 939 902 861 849
1732 849 864 886 909 934 961 978 976 953 917 892 897 924 947 954 951 948 944 939 935 938 944 956 973 982 974 965 977 999 996 963 944 966 994 986 950 932 938 939 927 923 934 932 904 873
1726 873 857 840 800 752 729 742 780 830 877 899 887 871 883 916 932 919 903 906 909 891 863 852 859 870 880 888 887 874 868 890 924 930 908 900 930 965 965 947 947 960
1721 960 947 904 872 875 892 892 877 863 848 833 828 833 829 811 812 851 890 882 842 835 877 919 922 905 904 917 922 914 899 871 835 815 826 844 845 841 861 904 940 960 975 985
1716 985 972 945 947 993 1045 1058 1031 994 962 929 905 908 934 958 956 932 908 898 909 937 969 989 987 969 947 934 935 940 937 928 930 955 991 1011 996 952 904 889 926
1711 926 991 1033 1028 1010 1018 1041 1029 975 920 899 896 891 893 914 936 939 938 954 968 950 922 941 1016 1087 1103 1083 1069 1069 1062 1051 1058 1083 1096 1083 1062 1057 1067 1075 1071 1071 1086 1108
1706A108RpOL8L8mm2k5J4J0l2m5j1J7QmK0M5L0ok1j8k5k7JM5N1J4k9n1n6m3qK7K1nkL1L8J
1701A111k8mL1K6MRL2K0k8o3n2j5K2N1N9L3qk9k5k2l5l0QM4L7pl5k4PK2J2oj3mJpk7m3m2k5
1697I57LL6N0L7Kk0j7lLJRK3K3om7o2m1oJ1J6K5M2L9Ok4k4mpl4m4j0L4M1Pk2k2nmj1lJ9K7
1691I95J0j2j3oj2k1j5OQj3k5qJ6J9J4J9K0Lj3jJ9Ml6m6j4J3Lj5pJ0Mj3j0J8L4J9pk2j2J4
1687I27M4N0K6pk0k2k9l4j5K1K9Lj4J3N4M8j0o5o2j4K6K7J3J5K9L0Pj6k3k0k2k3j5klj8k5
1682I03j3LROLOJ6L2N0M8K2qj4mol0m9l6JK4J3j5k6rJ7K2Nj4j1J0J8%k7l2j6NJ9L3M1K3j6
1677A003l2nL1K3k9o2m4LL3K9Qj0mK5N1M5J1j2kR%j1%K2K6J3jj7m3n9l7NK0ONM3P9O7K1j4
1672A196k6m0o4p1l9RL6K4MMK2K9Nk1j8J2L2K3LjMpk9l6j6J0J5LlNQmj8j3RK4K5K5K6J2k5
$$ plain form
1706 1108 1117 1110 1116 1154 1192 1188 1146 1121 1135 1145 1113 1068 1057 1074 1082 1078 1098 1143 1173 1167 1146 1128 1103 1076 1077 1122 1173 1187 1158 1107 1051 1008 1000 1027 1048 1043 1041 1072 1110 1111
1701 1111 1083 1079 1110 1136 1140 1149 1181 1201 1173 1110 1058 1043 1065 1116 1175 1208 1200 1171 1146 1124 1089 1059 1067 1111 1148 1141 1106 1082 1089 1111 1123 1117 1104 1100 1101 1094 1067 1024 982 957
1697 957 960 996 1046 1083 1085 1065 1048 1045 1048 1049 1058 1081 1104 1098 1051 989 948 942 953 969 994 1036 1075 1081 1057 1033 1029 1022 988 944 934 968 1009 1016 994 972 967 963 952 949 968 995
1691 995 1005 993 980 974 962 941 926 932 940 927 902 894 910 929 943 962 982 985 972 971 990 994 958 912 898 911 914 899 892 902 906 893 883 901 935 954 947 925 913 927
1687 927 971 1021 1047 1040 1020 998 969 935 920 941 970 973 959 972 1026 1074 1064 999 937 923 949 976 989 1004 1033 1063 1070 1054 1031 1011 989 966 951 949 946 928 903
1682 903 890 893 902 908 911 917 933 965 1015 1063 1085 1077 1063 1059 1053 1023 974 938 939 963 976 961 935 926 943 965 970 956 945 955 973 973 946 914 898 903 922 955 996 1019 1003
1677 1003 971 966 997 1020 991 929 885 888 921 950 958 948 944 969 1020 1065 1076 1064 1062 1071 1071 1060 1060 1082 1108 1121 1120 1103 1060 1001 964 969 989 995 1000 1043 1122 1189 1210 1196
1672 1196 1170 1130 1066 995 956 965 1001 1025 1029 1033 1055 1084 1089 1068 1050 1062 1094 1117 1120 1119 1123 1116 1087 1051 1035 1045 1060 1063 1060 1065 1073 1069 1051 1038 1047 1071 1096 1121 1147 1159 1134
1667A134n8n8l4qJ7N0P1M7pm3l1KK1K0PloOK3K1JrMQj3k5KL5K3j7l3j4lj9k8jK8K4JjJ9K5
1662A178Mk0j4QJ6Mj6k3j3J3M0N4M3Nl6m6j9J0Lk5l4qK1K0%nJ2K3J2lkJorJ4M5M5J2j6j3j
1657A274lj9k2oJ3K6K5Ok7m6l2KK0J0rk4l0j7J0K5QrRM6M5J1MM3N6Qm2k5K3K9ol0l1m0n5l9
1652A181jQq%L9N0Pl1j1L3M5K8J3Kj2j2J6M2K4k5m6k7lQK0M1M4J6k0k7lK4L2K5Rj4l2l3j0
1647A392J3Pk1k8NL9L3%j5qpj7oK2K5KKM3N6Mn8n0MK5MkK4K2k3n5l4PJ3j0k4j4PL6O4O2K1
1642A560k2l3j4kmKK4L6K4kj3JK1K0ml1l1%L0M1L3K2Mk1m2l4lJ6Lk8l6nL4L6Oj8j2KKNL4O5
1637A666N4Mk6oJ8Mk7j8L4P1N4Qj4JJ8Nk4l5j6PJ1mj3mJ3K4K4J1j0k1j2Mjk6l6j8QJ9K3L1
1632A801M3L4Nk0k0PK8K0j2l4j9J4K3Mj4j0mrqJ1L0K9J7K2L5K3j2l9l1mJ7J8Ol%J6K7K4J3
$$ plain form
1667 1134 1076 1018 984 976 993 1043 1114 1161 1154 1111 1080 1082 1103 1123 1130 1127 1121 1127 1150 1171 1172 1163 1167 1175 1162 1137 1139 1174 1197 1180 1147 1133 1130 1111 1083 1082 1110 1134 1135 1134 1153 1178
1662 1178 1182 1162 1148 1156 1172 1176 1160 1137 1124 1137 1177 1231 1274 1279 1243 1197 1178 1188 1191 1166 1132 1124 1145 1165 1165 1160 1172 1195 1207 1204 1202 1203 1197 1188 1202 1247 1292 1304 1288 1275 1274
1657 1274 1271 1252 1230 1224 1237 1263 1288 1294 1267 1221 1189 1191 1211 1221 1212 1188 1158 1141 1151 1176 1184 1175 1184 1230 1275 1286 1290 1333 1389 1397 1355 1330 1353 1382 1376 1346 1315 1275 1220 1181
1652 1181 1180 1188 1180 1180 1219 1269 1276 1245 1234 1267 1312 1340 1353 1355 1343 1331 1347 1389 1413 1388 1342 1315 1312 1320 1340 1381 1425 1441 1421 1394 1391 1415 1447 1472 1481 1467 1435 1402 1392
1647 1392 1405 1412 1391 1363 1368 1407 1440 1440 1425 1417 1410 1393 1387 1409 1434 1436 1438 1481 1537 1541 1483 1433 1437 1462 1466 1464 1488 1510 1487 1432 1398 1405 1418 1408 1384 1370 1377 1413 1477 1539 1560
1642 1560 1538 1505 1491 1489 1485 1487 1511 1547 1571 1569 1556 1557 1578 1598 1594 1563 1532 1532 1562 1603 1636 1658 1662 1641 1599 1565 1562 1578 1581 1553 1517 1512 1546 1582 1588 1570 1558 1560 1562 1567 1601 1666
1637 1666 1720 1724 1698 1692 1710 1714 1687 1669 1703 1774 1828 1836 1822 1823 1841 1846 1822 1787 1771 1778 1789 1785 1772 1768 1781 1805 1829 1840 1830 1809 1797 1801 1800 1774 1738 1720 1728 1747 1770 1801
1632 1801 1844 1878 1883 1863 1843 1850 1878 1898 1886 1852 1833 1847 1870 1874 1860 1850 1846 1837 1829 1840 1870 1899 1916 1938 1973 1996 1984 1945 1914 1910 1927 1945 1951 1948 1948 1964 1991 2015 2028
1627B028NOKnqNK3K8J3j0j5NK5J7rk6k1pNJ5J6Jk3k4KK5L1L7N4N4J6k4k5mJj7k2nJ1J0MJO
1622B201J5J8jl6l4K7Q3O0k2o4k4M5P0M7Pk7l7rL1L6Nj0J4L3J2j8j7jrl3k9NL4M2M0L6K4J3
1618B527QMj7m3m4j5K6M8M3J9jJJ4J3pj1J4L4J9rlK6L7J6omJ5K4K0QLJ5L2K3ok2nNj5k5J5
1613B776O8O4J2j7KK0QjJ1J1qj0J8K4j6m6j8J5qn2l0N6J17R6L5onK1M9N4K3j2pK5L6J7lmM
1608C319J5M0N9M0lj5J3K4JqL1O5L3l0m1mK0J1J8N8P7M8J8L2N1K6k3l7j3%pML3L7kk8nL0K5
1603C912nrJ2K4J8K6N3O1M1K8M1M4J9lJ0L1J1k6k7RL3L3L7O2O7L7OJ1L1K7J0PK1L3L4L2K5
1599D776K1L2O0P4N1J8%j6n2p2k1P1J15P9K6K2M7N3M1M1M8L0oj7QM8O9O3M1K2K1K8J7j5k4
1594E699RM6M6K8L3N2M2J8L1P2Q1M1J1L3O2N3L4M6O6N2K0J8L9M0J5J0M0O4N5L8L6M1L8L9N3
$$ plain form
1627 2028 2033 2039 2041 2036 2028 2033 2056 2084 2097 2087 2072 2077 2102 2119 2110 2084 2063 2056 2061 2076 2092 2093 2070 2046 2048 2073 2104 2141 2195 2249 2265 2241 2216 2212 2213 2196 2174 2169 2180 2190 2194 2195 2201
1622 2201 2216 2234 2233 2197 2163 2190 2273 2333 2311 2247 2223 2268 2338 2385 2392 2365 2328 2319 2350 2386 2391 2381 2395 2428 2440 2422 2405 2404 2395 2362 2333 2338 2372 2414 2454 2490 2514 2527
1618 2527 2535 2539 2522 2479 2435 2420 2446 2494 2537 2556 2555 2556 2570 2583 2576 2565 2579 2613 2632 2623 2620 2646 2683 2699 2693 2689 2704 2728 2748 2756 2759 2774 2806 2829 2823 2801 2796 2801 2786 2761 2776
1613 2776 2844 2908 2920 2903 2905 2925 2933 2932 2943 2954 2946 2936 2954 2978 2962 2916 2898 2913 2905 2853 2823 2879 2996 3092 3127 3121 3116 3137 3186 3240 3263 3251 3244 3269 3305 3322 3319 3315 3319
1608 3319 3334 3374 3433 3473 3470 3455 3468 3492 3493 3485 3516 3581 3614 3584 3543 3539 3559 3570 3588 3646 3723 3771 3789 3821 3872 3898 3875 3838 3825 3825 3818 3822 3855 3892 3890 3862 3857 3887 3912
1603 3912 3907 3898 3910 3934 3952 3978 4031 4092 4133 4161 4202 4246 4265 4262 4272 4303 4314 4288 4261 4270 4303 4336 4373 4435 4502 4539 4545 4556 4587 4614 4624 4631 4652 4685 4719 4751 4776
1599 4776 4797 4829 4889 4963 5014 5032 5032 5016 4964 4892 4871 4942 5057 5136 5162 5184 5231 5284 5325 5366 5414 5444 5438 5421 5429 5477 5546 5609 5650 5672 5693 5721 5738 5723 5699
1594 5699 5708 5754 5800 5828 5861 5913 5955 5973 6004 6076 6157 6198 6209 6242 6304 6357 6391 6437 6503 6555 6575 6593 6632 6672 6687 6697 6737 6801 6856 6894 6930 6971 7009 7048 7101
1590G101O4N6M9N5O1M9L1L3N2O6O4N5M6L6K7L2M6N9O4P0Q1Q5O2K4KK1O4R7J01Q0M7J8J2M4
1586H854Q3Q5M0KJ6O0R1R3Q7P5N2L2M0O8P7N7L7M6P0Q7Q6P2N6N6P6R1P1L2K9P0J08R6N8M7
1582A1000P0R6J04Q8O5N0O0Q5J00R0P4P6Q3Q1P8R0J05J00P5N5M7M6M7N5O9P6P3P0P4R5J27
1578A3404J46J30R6Q8J12J27J03P0O2P0P3Q5J19J39J21R5J04J23R9M3K9P1J02Q6P2J07J50
1575A6026J48J16J07J22J18P8M9P1J26J60J41Q6M6N3R2J21J16Q4M2J9M0R1J29J26J02R6J01
1571A8606Q8P5R3J25J15O5L9O8J06J15J05J01Q9O6O6J03J37J29J07J04J02P8O9R9J27J03O7
1568B1147Q1J27J24O5K8N6J01J10R3P5M8K5M0J03J62J62J11O4M2M7O8R5J05R7Q6Q2O7M2L4
1564B3487N1O1N0M0O3J00J18J15J05Q7N8L6M0M6L0J5M0Q8R5M5KJ9O9R2P4N6N6O2O0N0L5J1
$$ plain form
1590 7101 7165 7221 7270 7325 7386 7435 7466 7499 7551 7617 7681 7736 7782 7818 7845 7877 7923 7982 8046 8116 8197 8282 8344 8368 8370 8391 8455 8552 8653 8733 8780 8798 8810 8854
1586 8854 8937 9022 9062 9064 9080 9140 9231 9324 9411 9486 9538 9570 9610 9678 9755 9812 9849 9895 9965 10052 10138 10210 10266 10322 10398 10489 10560 10592 10621 10691 10799 10895 10953 11000
1582 11000 11070 11166 11270 11358 11423 11473 11533 11618 11718 11808 11882 11958 12041 12122 12200 12290 12395 12495 12570 12625 12672 12718 12765 12820 12889 12965 13038 13108 13182 13277 13404
1578 13404 13550 13680 13776 13864 13976 14103 14206 14276 14338 14408 14481 14566 14685 14824 14945 15040 15144 15267 15366 15409 15438 15509 15611 15697 15769 15876 16026
1575 16026 16174 16290 16397 16519 16637 16715 16764 16835 16961 17121 17262 17348 17394 17447 17539 17660 17776 17860 17902 17921 17961 18052 18181 18307 18409 18505 18606
1571 18606 18694 18769 18862 18987 19102 19167 19206 19274 19380 19495 19600 19701 19790 19856 19922 20025 20162 20291 20398 20502 20604 20682 20751 20850 20977 21080 21147
1568 21147 21228 21355 21479 21544 21572 21628 21729 21839 21932 22007 22055 22080 22120 22223 22385 22547 22658 22722 22764 22811 22879 22974 23079 23176 23262 23344 23411 23453 23487
1564 23487 23538 23599 23649 23689 23752 23852 23970 24085 24190 24277 24335 24371 24411 24457 24487 24502 24542 24630 24725 24770 24772 24791 24860 24952 25026 25082 25138 25200 25260 25310 25345 25356
1560B5356j1LN7J01Q8L1j2qJ7K8L3M9O0L3k0m3oN6Q3O6L4J2ql6n4l9jJ9Jk8l0j0nk3k2J0M1
1556B5822K6j8m9o1p3p6m6jJ0k0m4l7l1n2p3n7k3j2k4k7j6j5l8o6p6o3l3npm4q1q2n6m5o4
1552B4443p5n5k8l7q2j20j14p3l7l2m5m4l0l4p2j08j10q8q0r5j03q1m8l6n3q3j01j01r1q5
1548B2302q7r1r2r1r2r1r4j08j26j28j05p9p2p7p6p3p3p4p5q5j10j25j09q5p9q6q0o4o9q2
1544A9624p2m4m6r2j34j34j20j26j34j11o1l4n1r3j23j25r8o1m4n7q4r7r5r1q5p1o1o6q5r5
1541A7034r3r7j07j11r5p5p4q4q6o9m6m2o1q2p9o2n9p7r3q5o5o1p7q7p3m5l4m5o2o9o3n5m9
1537A4672l6k5l7q1j16r8l7Pmm1n6m0k5l2n6p7p8n8l5l0n2p6p8n9l3j4lrj7qJ3J5j6m6l6L
1532A3301K0PmQK3J8Jq%J6J8j4o8j04r8p1o2p0o8o5q7j19j07m8j4m6j01j10q7q0q7o8k7k1
$$ plain form
1560 25356 25345 25348 25405 25506 25594 25625 25613 25605 25622 25650 25683 25732 25792 25825 25805 25762 25756 25812 25895 25961 25995 26007 25999 25963 25909 25870 25869 25888 25889 25861 25831 25821 25816 25793 25771 25781 25822
1556 25822 25848 25830 25781 25720 25647 25571 25525 25524 25534 25514 25470 25433 25402 25350 25277 25220 25197 25185 25161 25134 25118 25103 25065 24999 24923 24860 24827 24822 24815 24771 24690 24608 24552 24507 24443
1552 24443 24368 24313 24285 24248 24166 24046 23932 23859 23822 23790 23745 23701 23671 23637 23565 23457 23347 23259 23179 23084 22981 22900 22852 22816 22763 22680 22579 22478 22387 22302
1548 22302 22215 22124 22032 21941 21849 21758 21664 21556 21430 21302 21197 21118 21046 20969 20893 20820 20747 20673 20598 20513 20403 20278 20169 20084 20005 19919 19839 19775 19706 19624
1544 19624 19552 19508 19462 19370 19236 19102 18982 18856 18722 18611 18550 18516 18465 18372 18249 18124 18026 17965 17921 17864 17780 17683 17588 17497 17412 17341 17280 17214 17129 17034
1541 17034 16941 16844 16737 16626 16531 16456 16382 16298 16212 16143 16097 16055 15994 15912 15833 15771 15712 15635 15542 15457 15392 15331 15254 15167 15094 15049 15015 14970 14908 14839 14776 14721 14672
1537 14672 14636 14611 14574 14493 14377 14279 14242 14249 14245 14204 14148 14108 14083 14051 13995 13918 13840 13782 13747 13717 13665 13589 13511 13452 13419 13405 13402 13393 13376 13368 13381 13396 13380 13334 13298 13301
1532 13301 13321 13328 13324 13332 13355 13373 13374 13366 13366 13382 13400 13386 13318 13214 13116 13045 12983 12913 12845 12780 12693 12574 12467 12419 12405 12359 12258 12148 12061 11981 11894 11826 11799 11778
1528A1778o5j06r7o0m5o1p5p2n9n0n2n9n2k1kl3r7j13m8J6jo1o9j1K0j3m7k8Nj0m6n0l5n0
1524A0231p6n5LK4j6n1l9j4j8k8j1J0Pnrj9m4n2j3K9K5kML0K3j4k9j7k8o6p1j4L5K2k4m1l1
1519I656k9m4n6o1n4k4K4M3Jn3m9J0N0L4KMK8L0J0MK7M8K4l3p2o4m4n2p6o9l4j9m0m2KM6L2
1515I160k3n2m2l6m9n2k8qk3n1n4k7OJ1j7n4n7k0J2Kk0lM3N8K4rnPknJ6M1L2jj8j5j6k2j4
1510H689J1M0N1M3J4j1kM6Q8Q0L7K1N1R1R9P8N5M6N6P8R4R5R2J07J30J29J00R3J34J86J92
1506A1013J57J31J48J89K28K60K82K92L02L41M18M99N51N86O44P32Q36R59J113J285J433J553
1504B3952J691J874K060K186K251K285K270K123J804J345P98J81m81j103j601j945k167k282
1501C5241k288k205k073j917j739j562j422j320j204j041q66p46o95o62o00n18m61m43m32
$$ plain form
1528 11778 11713 11607 11510 11450 11405 11344 11269 11197 11138 11088 11036 10977 10925 10904 10902 10869 10772 10659 10611 10627 10626 10565 10496 10485 10505 10492 10445 10417 10422 10412 10366 10316 10281 10231
1524 10231 10155 10100 10103 10127 10111 10060 10021 10007 9989 9961 9950 9960 9967 9962 9953 9934 9890 9838 9825 9854 9879 9877 9881 9911 9934 9920 9891 9874 9846 9780 9709 9695 9730 9752 9728 9687 9656
1519 9656 9627 9583 9527 9466 9412 9388 9412 9455 9456 9403 9354 9364 9414 9448 9450 9454 9482 9512 9522 9526 9553 9601 9625 9592 9520 9456 9412 9360 9284 9215 9181 9162 9122 9080 9082 9128 9160
1515 9160 9137 9085 9043 9007 8958 8906 8878 8870 8847 8796 8742 8715 8721 8732 8715 8661 8604 8584 8596 8598 8578 8575 8618 8676 8700 8691 8686 8693 8691 8686 8702 8743 8775 8774 8756 8741 8725 8703 8689
1510 8689 8700 8740 8791 8834 8848 8837 8835 8881 8969 9049 9086 9107 9158 9249 9348 9426 9481 9527 9583 9661 9755 9850 9942 10049 10179 10308 10408 10501 10635 10821 11013
1506 11013 11170 11301 11449 11638 11866 12126 12408 12700 13002 13343 13761 14260 14811 15397 16041 16773 17609 18568 19681 20966 22399 23952
1504 23952 25643 27517 29577 31763 34014 36299 38569 40692 42496 43841 44639 44820 44339 43236 41635 39690 37523 35241
1501 35241 32953 30748 28675 26758 25019 23457 22035 20715 19511 18470 17604 16858 16163 15501 14901 14383 13922 13479 13047
1499A3047l99l54l16k83k37j92j85k21k48k21j62j18j08j11j10j13j12r2o4n4o4n5j4J6j0
1496I220o9j03q8o1n1n4m8l1j8k7m8n8m0j0Ook6l6l5k7j3LOj1l5m0k3l%j8m1l7nJ8Mk6j7K8
1491H180M1ro2m3K3N0J6j7jL3M1K3R%j7l0k6mJ8K4J3j2k9j5J7L0J4ML0N8N3J7j2j7qJ8M9N7
1487H516K1j7pL8M5%m0k5J4K5QonjQK5L7L0J5J4K2J8ONK8N5O6N3K4kjK2L2Ok2pM1O1L8J7L9
1482I196P3O8L0PK3N5O6N1K8J3J4K8L6L6M2O4Q0O9M3M2P1R3R1Q2R1J02R4P9Q1R3Q5O8Q1J32
1478A1307J73J61J21J07J19J24J18J30J74J98J73J29J25J65J99K00J75J46J15J00J17J65K05
1475A4746K13K06K04K04J92J70J61J73K03K32K34J95J49J49K02K49K40K02J90K08K10J82J72
1472A9286K06K60K92K92K75K56K45K59K91L12L12L20L52L82L78L63L72L97M02L91M07M57N00
$$ plain form
1499 13047 12648 12294 11978 11695 11458 11266 11081 10860 10612 10391 10229 10111 10003 9892 9782 9669 9557 9465 9401 9347 9283 9228 9214 9230 9220
1496 9220 9151 9048 8960 8899 8848 8794 8746 8715 8697 8670 8622 8564 8524 8514 8520 8514 8488 8452 8417 8390 8377 8380 8386 8375 8340 8300 8277 8274 8274 8256 8215 8178 8173 8191 8195 8169 8152 8180
1491 8180 8221 8212 8150 8107 8130 8180 8196 8179 8178 8211 8252 8275 8284 8284 8267 8237 8211 8207 8225 8249 8262 8250 8221 8206 8223 8253 8267 8271 8301 8359 8412 8429 8417 8400 8392 8410 8459 8516
1487 8516 8537 8520 8513 8551 8596 8596 8556 8531 8545 8570 8578 8572 8567 8566 8574 8599 8636 8666 8681 8695 8717 8735 8741 8746 8774 8829 8895 8948 8972 8970 8969 8991 9023 9029 9007 9000 9041 9102 9140 9157 9196
1482 9196 9269 9337 9367 9374 9397 9452 9518 9569 9597 9610 9624 9652 9688 9724 9766 9830 9910 9979 10022 10064 10135 10228 10319 10401 10492 10594 10688 10767 10848 10941 11026 11094 11175 11307
1478 11307 11480 11641 11762 11869 11988 12112 12230 12360 12534 12732 12905 13034 13159 13324 13523 13723 13898 14044 14159 14259 14376 14541 14746
1475 14746 14959 15165 15369 15573 15765 15935 16096 16269 16472 16704 16938 17133 17282 17431 17633 17882 18122 18324 18514 18722 18932 19114 19286
1472 19286 19492 19752 20044 20336 20611 20867 21112 21371 21662 21974 22286 22606 22958 23340 23718 24081 24453 24850 25252 25643 26050 26507 27007
1469B7007N05M97N08N29N40N56O09O80P17P03O92P36Q22Q92R24R40R75J029J089J143J190
1467D3283J232J283J350J424J487J544J620J719J819J910K013K161K328K467K570K676K816
1465G5702K984L168L372L596L819M037M276M563M884N201N508N821O153O493O820P117P374
1462A60888P587P751P853P871P825P772P768P804P826P772P607P335O979O552O020N339M518
1460B83067L604K633J588M76o37j696k707l693m621n429o112o697p173p506p726p883p974
1458B21514p947p819p675p538p345p062o753o477o197n859n489n139m796m412m003l623l273
1456A20107k896k471k044j676j410j282j307j482j805k285k884l472l898m110m133l998l733
1454G5221l418l143k910k666k411k219k108j997j829j653j530j444j349j242j153j080j016
$$ plain form
1469 27007 27512 28009 28517 29046 29586 30142 30751 31431 32148 32851 33543 34279 35101 35993 36917 37857 38832 39861 40950 42093 43283
1467 43283 44515 45798 47148 48572 50059 51603 53223 54942 56761 58671 60684 62845 65173 67640 70210 72886 75702
1465 75702 78686 81854 85226 88822 92641 96678 100954 105517 110401 115602 121110 126931 133084 139577 146397 153514 160888
1462 160888 168475 176226 184079 191950 199775 207547 215315 223119 230945 238717 246324 253659 260638 267190 273210 278549 283067
1460 283067 286671 289304 290892 291368 290731 289035 286328 282635 278014 272585 266473 259776 252603 245097 237371 229488 221514
1458 221514 213567 205748 198073 190535 183190 176128 169375 162898 156701 150842 145353 140214 135418 131006 127003 123380 120107
1456 120107 117211 114740 112696 111020 109610 108328 107021 105539 103734 101449 98565 95093 91195 87085 82952 78954 75221
1454 75221 71803 68660 65750 63084 60673 58454 56346 54349 52520 50867 49337 47893 46544 45302 44149 43069 42053
1452D2053r74r58r23q30p23o74o78o64n97n09m41m03l68l23k59j80r3NJ35K93M39N46O54Q21
1449C5349J053J295J507J655J702J606J365R98M83j95r68j661k131k347k375k278k102j884
1447C1072j662j464j306j184j073r60q56p89p47o84n85m90m32l98l66l34l17l10k95k69k42
1444A6309k21k11k15k24k17j86j45j01m7JRj6j8L7J17J69K08K76L61M23M65N21N77N77M98
1441A8947L81K50P1j77m37o32p37p83p93p61p03o37n68m92m20l65l29k98k74k63k57k40k10
1438A0273j84j73j68j65j55j34j08r8j12j25j05p7q0j15j27r8p1q3j04r0o2o3q9r2n8k9l3
1435G475n7p4q5q7o5k0Nj5n1o2m7l9m7n4n3n5o1n7m7m5m9m3l4m0o2p6p3o4n4l1k%l6p4q0n5
1431E686k7nPLj5k5j2Lmj5j6k1n7j04j06n8lJ0j2l7m4l9l3l9n5n8l8j8k4m5m3rPk0n6n6k7
$$ plain form
1452 42053 41079 40121 39198 38368 37645 36971 36293 35629 35032 34523 34082 33679 33311 32988 32729 32549 32456 32461 32596 32889 33328 33874 34528 35349
1449 35349 36402 37697 39204 40859 42561 44167 45532 46530 47013 46818 45850 44189 42058 39711 37336 35058 32956 31072
1447 31072 29410 27946 26640 25456 24383 23423 22567 21778 21031 20347 19762 19272 18840 18442 18076 17742 17425 17115 16820 16551 16309
1444 16309 16088 15877 15662 15438 15221 15035 14890 14789 14742 14743 14752 14736 14718 14755 14872 15041 15249 15525 15886 16309 16774 17295 17872 18449 18947
1441 18947 19328 19578 19649 19472 19035 18403 17666 16883 16090 15329 14626 13989 13421 12929 12509 12144 11815 11517 11243 10980 10723 10483 10273
1438 10273 10089 9916 9748 9583 9428 9294 9186 9088 8976 8851 8746 8669 8589 8474 8347 8249 8178 8095 7991 7901 7839 7776 7687 7595 7537 7508 7475
1435 7475 7418 7344 7259 7172 7107 7087 7092 7077 7026 6964 6917 6878 6831 6777 6724 6669 6608 6551 6504 6459 6410 6367 6333 6293 6231 6155 6082 6018 5964 5933 5931 5931 5895 5821 5741 5686
1431 5686 5659 5654 5661 5664 5649 5624 5612 5615 5611 5596 5580 5559 5502 5398 5292 5234 5231 5241 5229 5192 5148 5109 5076 5037 4982 4924 4886 4868 4844 4799 4756 4747 4754 4734 4678 4622 4595
1426D595j3l2n7m8pK4J4k6n2l7oKk0l9l7l0k9k7k2k7m1l4JK5Ok5k6qj5m4n6k9lj4m1m6k0O
1422C762Kk2l7k3JJ0%j0j2j9l3k9rnk7l0J1M1Qm7m0K0L5k8q4n6QK6KPM6N8J0n8r0q4n9l5j9
1417C191j1LK4L4J7j2j9nLjKJ2J4MPK9L6Rk9m2l0j1NJ6Rk5o3o7l8rrk5l6l5k9j8kR%j8k3k
1412B865K2K1JoKkk4l1ML4J4l4l8J3O0M9Ok0k2k1j5J0L3L2K0K4M1L7RqOM2P2Q2N9Rm2n7m7
1407C200m7o4p6p3p0o5l4K0M6K0k1j9RJ1k0l5j7K%mJ6L5J7k0l3rJ1%j9k0oKNJ5L2L7K6J3J3
1402B878K8M0M2L2J7J1J7K9L0K0J1J8L4N0N3L1j8o6q5p2o1p4q6p1m6m5o7p1m6k1j9k8k5j1
1398B429jLKqk5l3k2prj8j5qqj1%J2j0m8n5rL8L1pj1L2N4J5m3m1J2M7K5rlL1M2K2%j4k8l6
1393B316j4K7M2J0l7n7n1l3jM1O4M4RKK6M5M0K1mk6k2J8N7M7Lj5J8N3M8K4L2O8Q2N6J6QL2
$$ plain form
1426 4595 4582 4550 4493 4445 4438 4462 4476 4450 4398 4361 4355 4357 4337 4298 4261 4231 4202 4175 4153 4126 4085 4051 4052 4077 4083 4058 4032 4024 4009 3965 3909 3880 3877 3863 3822 3776 3756 3762
1422 3762 3764 3742 3705 3682 3683 3693 3693 3683 3671 3652 3619 3590 3581 3576 3549 3519 3530 3571 3579 3532 3492 3512 3547 3519 3435 3379 3387 3413 3415 3422 3468 3526 3536 3478 3388 3304 3245 3210 3191
1417 3191 3180 3183 3207 3241 3258 3246 3227 3222 3225 3224 3226 3238 3252 3256 3263 3292 3328 3337 3308 3266 3236 3225 3230 3246 3255 3230 3167 3100 3062 3053 3044 3019 2983 2948 2919 2901 2899 2908 2908 2890 2867 2865
1412 2865 2887 2908 2909 2903 2905 2903 2879 2848 2852 2886 2900 2866 2828 2841 2901 2950 2956 2936 2914 2893 2878 2888 2921 2953 2973 2997 3038 3075 3084 3076 3082 3124 3196 3278 3337 3346 3304 3247 3200
1407 3200 3153 3089 3013 2940 2870 2805 2771 2791 2837 2857 2836 2817 2826 2837 2817 2782 2765 2767 2767 2763 2779 2814 2831 2811 2778 2769 2780 2780 2761 2741 2735 2737 2742 2757 2789 2826 2852 2865 2878
1402 2878 2906 2946 2988 3020 3037 3048 3065 3094 3124 3144 3155 3173 3207 3257 3310 3341 3323 3257 3172 3100 3039 2965 2879 2808 2762 2717 2650 2579 2533 2512 2493 2465 2440 2429
1398 2429 2428 2431 2433 2425 2400 2367 2345 2338 2329 2311 2296 2288 2280 2269 2269 2281 2271 2223 2168 2159 2197 2228 2221 2210 2242 2296 2311 2268 2227 2239 2286 2311 2302 2299 2330 2372 2394 2394 2380 2352 2316
1393 2316 2302 2329 2371 2381 2344 2287 2236 2203 2202 2243 2307 2351 2360 2362 2388 2433 2473 2494 2490 2464 2442 2460 2517 2564 2567 2552 2570 2623 2671 2695 2727 2795 2877 2933 2949 2957 2989
1388B989M9K8j5k5J5N7L9k0l1L4R2N5m5r5n5MJm6o1k2J5Km4p0n7l2k2j9j1j0k9n8p1o9o3n8
1384B352l6j0j7n7q0m8QK8jl8m7l5k6k0j5rkkqj8j9j3j2k5l9l3j5llmkknqqj1k2l0k8lL1N4
1379A719L8kk6j2J3Nl5o3m8mL8N2L7J6K0L8L0k2o8n5jK3jj9NL0Pm6p0l7J6M2K0l0o5n7k0J1
1374A479K3K5J6pk5j2K1L3Qj2oKj4k8j9jOJ6L7L1k4p5n3K3P0N2Mk9n0n3k3K6M3J8qmOpj2J5
1369A492M2K4k6m0j0J7Jk6k2NJ4pl1l1j8j1oJ3L7L8Nk6k2J3L4K4Jj8l0l6l2j8j0oPL0M1K4
1365A436ql5m4l5kL5M3Lm6m9lL7L8J0j5k3k0nK2M3L1j1m0k2K4M6K2k0l8k7pONpk5k9nL1N0
1360A366M0J6%kQJ8J0k0m7m2j5kpJK9M6K9JlJ7K8K2Oj1k1j2J4K9J2j3rJ9L5K0qk5l5l8k7K
1355A431L3M7M1K1lk3l2k6j2LJ7K3J9J3J6J0j3l0j3K7M3J6rRM5M3lm6n0k8qJ0L2N5N7L8J0
$$ plain form
1388 2989 3038 3066 3051 3026 3041 3098 3137 3117 3086 3120 3212 3267 3222 3127 3072 3076 3077 3031 2970 2948 2963 2965 2921 2851 2794 2762 2740 2721 2710 2700 2671 2613 2542 2473 2410 2352
1384 2352 2316 2306 2289 2232 2152 2104 2112 2140 2139 2101 2054 2019 1993 1973 1958 1949 1947 1945 1937 1919 1900 1887 1875 1850 1811 1778 1763 1760 1757 1753 1751 1749 1744 1736 1728 1717 1695 1665 1637 1634 1665 1719
1379 1719 1757 1755 1729 1717 1730 1735 1700 1637 1589 1585 1623 1675 1712 1728 1748 1786 1816 1794 1726 1671 1670 1693 1692 1673 1678 1708 1715 1669 1599 1562 1578 1620 1640 1610 1545 1488 1468 1479
1374 1479 1502 1527 1543 1536 1511 1499 1520 1553 1561 1549 1543 1545 1531 1503 1484 1483 1489 1505 1542 1573 1549 1474 1421 1444 1514 1566 1570 1541 1491 1438 1415 1441 1484 1502 1494 1490 1496 1489 1477 1492
1369 1492 1534 1558 1532 1492 1482 1499 1500 1474 1452 1457 1471 1464 1433 1402 1384 1373 1367 1380 1417 1455 1460 1434 1412 1425 1459 1483 1484 1466 1436 1400 1368 1350 1340 1334 1341 1371 1412 1436
1365 1436 1428 1393 1349 1314 1312 1347 1390 1393 1347 1298 1295 1332 1370 1380 1365 1342 1322 1317 1339 1382 1413 1402 1362 1340 1364 1410 1432 1412 1374 1347 1340 1346 1351 1344 1319 1290 1285 1316 1366
1360 1366 1406 1422 1422 1420 1428 1446 1456 1436 1389 1347 1332 1330 1323 1324 1353 1399 1428 1429 1426 1443 1471 1493 1499 1488 1467 1455 1469 1498 1510 1497 1488 1507 1542 1562 1554 1529 1494 1456 1429 1431
1355 1431 1464 1511 1552 1573 1570 1547 1515 1489 1477 1480 1497 1520 1539 1552 1568 1578 1565 1535 1522 1549 1592 1608 1599 1608 1653 1696 1693 1647 1597 1569 1561 1571 1603 1658 1715 1753 1763
1351A763pj1j1j4k0j3J3M6O1M2Rj3j8k1k5j9RM0M7K9J1J3J9J2MK0N0N0J1k3lM7O7L9J4L0N5
1346B303M7J5QK6K4j4m0j5L9P6Q4P9N9J8j5PP4J19J07O7M4M3N3P6J11J31J16Q9P6Q0Q6R5J11
1342D179J15R4P9J03J49J57J21R6J14J54J80J96K08J98J68J60K05K69K94K80K77L09L57M02
1339H864M43M84N12N30N69O49P57Q70R85J117J266J423J609J848K131K415K691K999L366L721
1337C9249L944L982L887L686L329K785K193J799J772K092K657L373M138M791N175N222M917
1335I8991M232L166J890P46Q4O6O57J683K891L985M721M967M665L740K141Pk245m053n014
1332A27320n051m376l304k148j140m24o6j25o88j757l131m415n238n451n138m492l712k962
1330G3702k358j956j778j847k175k713l327l844m132m155l965l657l304k939k597k305k065
$$ plain form
1351 1763 1756 1745 1734 1720 1700 1687 1700 1746 1807 1849 1858 1845 1827 1806 1781 1762 1771 1811 1858 1887 1898 1911 1930 1942 1946 1966 2016 2066 2077 2054 2051 2098 2165 2204 2218 2248 2303
1346 2303 2350 2365 2373 2399 2423 2409 2369 2354 2393 2469 2553 2632 2691 2709 2694 2701 2775 2894 3001 3068 3112 3155 3208 3284 3395 3526 3642 3731 3807 3887 3973 4068 4179
1342 4179 4294 4388 4467 4570 4719 4876 4997 5093 5207 5361 5541 5737 5945 6143 6311 6471 6676 6945 7239 7519 7796 8105 8462 8864
1339 8864 9307 9791 10303 10833 11402 12051 12808 13678 14663 15780 17046 18469 20078 21926 24057 26472 29163 32162 35528 39249
1337 39249 43193 47175 51062 54748 58077 60862 63055 64854 66626 68718 71375 74748 78886 83677 88852 94074 98991
1335 98991 103223 106389 108279 109025 109109 109175 109832 111515 114406 118391 123112 128079 132744 136484 138625 138632 136387 132334 127320
1332 127320 122269 117893 114589 112441 111301 110877 110811 110686 109998 108241 105110 100695 95457 90006 84868 80376 76664 73702
1330 73702 71344 69388 67610 65763 63588 60875 57548 53704 49572 45417 41452 37795 34491 31552 28955 26650 24585
1328B4585j832j586j363j211j118j027r15q14p52p08o48n68m84m17l80l77l85l74l45l22l12
1325H647k91k50k10j91j80j64j56j67j80j72j61j72j95j81j20o2n1q2j08j05q5p8q5r1q2q1
1322D947j01j21j03n2k0l8q6j14r9o4m2n1r2j35j31o3J5K7l6r3q3k9%k2n5n9m3l6m1l9k8k6
1318C087m2m5k1RKm0o9n0oJ3j6o4r2p7l5qk0n1n9m1k0j6j7nPkk1k8j6lKN%j7m2o5p7p0l1J7
1313A976L8J9qoQkl1l8k3j3k0k2j3j9l8l4%K7J7mKJ7Ok4l7l1k7k5oK8M4K3mj3pj6m1o1n5k1
1308A566J7L4K4Nqj7k4k4j6j1j9l1l1j2J5L6L3on7o5j7L5L7Jj5rj2k6k1J2K7Oj4jK6L3K2J1
1304A504j0l9m7j1K6J5l2n4l6j0mpjNjj7l3l9k5J5N1M8Ol0l1oJ8K5Pk7m9l4OL1K7J8J4Jk2
1299A252k1PJ9j3n0m6j8j3k6j6K0L6J1k2k9j4NK5M6M8K3%%Jj6l2j8J5K3%j8j1kj2k2oK0J9
$$ plain form
1328 24585 22753 21167 19804 18593 17475 16448 15533 14719 13967 13259 12611 12043 11559 11142 10762 10385 10000 9626 9281 8959 8647
1325 8647 8356 8106 7896 7705 7525 7361 7205 7038 6858 6686 6525 6353 6158 5977 5857 5795 5744 5662 5554 5449 5364 5286 5201 5110 5028 4947
1322 4947 4846 4725 4622 4570 4550 4512 4426 4312 4213 4149 4107 4056 3964 3829 3698 3635 3650 3677 3641 3548 3465 3436 3436 3414 3359 3300 3257 3221 3180 3141 3113 3087
1318 3087 3045 3000 2979 2988 2990 2950 2881 2831 2825 2838 2822 2758 2666 2589 2554 2546 2526 2475 2416 2375 2355 2339 2322 2317 2324 2322 2301 2273 2257 2254 2256 2261 2261 2244 2202 2137 2060 1990 1959 1976
1313 1976 2014 2033 2025 2019 2027 2025 1994 1956 1933 1920 1900 1878 1865 1846 1808 1774 1774 1801 1818 1814 1816 1833 1839 1815 1778 1747 1720 1695 1689 1717 1761 1784 1780 1767 1760 1744 1703 1642 1587 1566
1308 1566 1583 1617 1641 1646 1638 1621 1597 1573 1557 1546 1527 1496 1465 1453 1468 1504 1537 1531 1474 1409 1392 1427 1464 1465 1450 1441 1429 1403 1382 1394 1421 1427 1413 1412 1438 1471 1493 1504
1304 1504 1494 1455 1408 1397 1423 1438 1406 1352 1316 1306 1302 1295 1294 1299 1298 1281 1248 1209 1184 1199 1250 1298 1304 1274 1243 1237 1255 1280 1287 1260 1211 1177 1183 1214 1241 1259 1273 1274 1252
1299 1252 1231 1238 1257 1244 1194 1148 1130 1117 1091 1075 1095 1131 1142 1120 1091 1077 1082 1107 1153 1201 1224 1224 1224 1225 1209 1177 1159 1174 1197 1197 1179 1168 1166 1154 1132 1126 1146 1165
1294A165j1k7j1J2J2prNJ3OlKRMpoMPrl1l4oK9L7J1j8j0J7J7k1m2qL7K8k7o3m5rJ4K3K5Mk7
1289A050l3kJ8nk4PN8N7Ok2KK5Qj7j7j3l1m3j9J4Qj7oL2L8om0k0J6J8kPL9M8J8j4k8l9n6n5
1284I60k2J5K6Rj0j7j6qllmRK6J7j6l2pJ9%m0l9J0M4K5pkK1J8rj7MJ2rl5k5RL1J7j4k8j3J6
1279I12L4K8Pj2j1J2K7Pl5n2j8L3M3Nk3rK0J8qj9nJ1J2J1J2jl3n7m4kL1K8Mj1oRK3L4M0L1
1274A046lm2o3n6l6j6JJ3OrrJ0K1J0mmOJ5K1J7j8o8p1nO2N0j2l3J0M1J7j9mL6M2Rk5k9j3P
1269I01J4nl8m3rK6K4kpJ1K2J5Ljoj5k2k2j3J2M0L7lm0k8J2K7J4J2L4L8J4kK4N7N1J2j8j8
1265A108nJ1K5K7Pj5j1J1J5pj8KK5J2j9j3M2R1P5J0l0k0Jqk9j7J9K1l0q0p1j8J9J5jlJ%LJ2
1260A157Rj8m0l2nNnj3j5k0k4j0Rll8n1j7J8J8MJ4L0J3k3l8l2l7l8nM1L0k1k7L6O9J3o0m8
$$ plain form
1294 1165 1154 1127 1116 1128 1140 1133 1124 1129 1142 1148 1145 1147 1156 1160 1153 1147 1151 1158 1149 1118 1084 1078 1107 1144 1155 1137 1127 1144 1161 1140 1098 1090 1127 1155 1128 1065 1020 1011 1025 1048 1073 1077 1050
1289 1050 1017 1015 1033 1028 1004 1011 1069 1126 1132 1110 1112 1137 1145 1128 1111 1098 1067 1024 1005 1019 1027 1010 1004 1036 1074 1068 1028 1008 1024 1042 1040 1047 1086 1134 1152 1138 1110 1071 1015 960
1284 960 938 953 979 988 978 961 945 937 934 931 927 936 962 979 963 931 924 943 943 903 864 874 918 943 936 934 955 973 964 947 951 963 954 919 894 903 934 951 937 909 896 912
1279 912 946 974 981 969 958 970 997 1004 969 917 899 932 975 980 957 948 968 986 978 959 954 965 977 988 1000 999 966 909 865 863 894 922 926 915 909 918 941 975 1015 1046
1274 1046 1043 1001 938 882 846 830 831 844 850 841 832 842 863 873 869 865 871 886 907 924 906 838 767 762 824 874 862 829 839 880 897 878 874 910 952 961 936 907 894 901
1269 901 915 910 872 829 820 846 870 868 861 872 894 909 912 911 905 890 868 846 833 845 885 922 919 879 851 863 890 904 916 950 988 1002 1000 1024 1081 1132 1144 1126 1108
1265 1108 1103 1114 1139 1166 1173 1158 1147 1158 1173 1166 1148 1150 1175 1187 1168 1155 1197 1288 1363 1373 1343 1323 1324 1316 1287 1270 1289 1310 1280 1200 1129 1111 1130 1145 1144 1141 1142 1142 1145 1157
1260 1157 1166 1148 1108 1076 1071 1076 1071 1058 1043 1023 999 989 998 995 957 906 889 907 925 929 943 973 986 963 925 893 856 818 813 854 884 863 836 872 941 954 894 846
1255H46J7L1j4m4k7moJK2K6OjJ3J1j7l0rRJj2%J5K0K2K6%m4n1oK4qm9k5L4N0Qk8k2ooj0j7
1250G46k5j2L5P3M5j6k9RJ6l2o0j7L0J3k4pL8L0k8n3j0L4L0OJJ2Rpk5m3m8j7L7N8K8j1j4%
1245G72mj0J7N1L6k2m9j2L4L0j1l9m0k7j0J4K7J1k1l5k1KJ9L2L3J8qk2j5J0M0O1N5J0m9p8
1241G99o2j5L0M6J5m2o6k4L4M1Nj0J3K3ok1OK8nn6n7j3J8J9J9K1jl9m5j0K0J6koPK1L1K9J
1236G62l3k5J5K7k0o7m1L7P8L9k7n0j6K7L6J6qj3onj2rOJ6Nj1j2%NjljJjNK2L6L5J9ol3n0
1231G37l7LM2M3J0k3k5rmrmJ8L3J8j3l0k1KK5L8L0mm2m4pL0K4j8n1m1lJ9Nj7lM2P6O1J5k2
1226H44m0m7m7k6J0L4L2J1j3l0k7%K2J4j9l7k4lMJ1K6K9Nk4k2PL1K7Qj4k9k8j4%jj4k1j9j9
1221E97j9j1MNmmK2N5N8K6j1k0qoj8j8QL6L0Jj5qJj%PJ0Jrj6k4k3OM8M5om6k0L1L8nl4k0N
$$ plain form
1255 846 863 894 880 836 809 805 799 800 822 848 854 853 866 877 860 830 821 830 831 819 819 834 854 876 902 902 858 807 801 825 817 768 743 777 827 835 807 785 779 773 763 746
1250 746 721 709 744 817 862 846 817 826 842 810 750 733 763 776 752 745 783 813 785 732 722 756 786 792 793 805 814 807 782 739 691 674 711 769 797 786 772 772
1245 772 768 758 775 826 862 840 791 779 813 843 832 793 753 726 716 730 757 768 747 712 691 693 712 744 777 795 787 765 750 760 800 861 916 926 877 799
1241 799 737 722 752 798 813 771 705 681 715 756 761 751 764 787 781 760 766 794 789 733 676 663 681 700 719 740 739 700 655 645 665 681 679 673 680 701 732 761 762
1236 762 729 704 719 746 726 659 618 655 733 772 745 695 679 706 742 758 750 737 731 726 714 705 711 727 732 721 709 709 714 713 710 709 710 709 714 736 772 807 826 820 787 737
1231 737 700 703 745 788 798 775 750 741 737 728 724 742 775 793 780 750 729 731 756 794 824 820 778 734 727 757 781 763 712 671 668 687 692 675 672 714 790 851 866 844
1226 844 804 757 710 684 694 728 760 771 758 728 701 701 723 737 718 681 657 654 658 669 695 724 729 705 683 690 721 748 756 742 713 685 671 671 670 656 635 616 597
1221 597 578 567 571 576 572 568 590 645 703 729 718 698 690 684 666 648 656 692 722 723 708 700 701 700 700 707 717 718 709 693 669 646 652 700 745 739 693 673 704 742 737 703 683 688
1216F88J2J2J9J6j0l6l3rQkk0j8RM2N9N9M7J1n2j04r0j5M3K8k1k7J3M5L7J3kj1k0j6pj0j5
1211F43JL1M0J4rpJ0J4Rjj1k0k0j7j6rJ8L7Rm3n2oL4K3jlKqlL5N8J1n9o9j8J8J1%J5J7j6m8
1206F14m0%L0L6K9J3rk0qJ6L3L0Rj9l1k0jlj6j1J1J0k7m8j4M4N6J2l2k9JJ8J2Knj8l1l0j0
1202E54K0M4N5M6J7j8l7k6nNMMROj3l2l4j0K0L8K7ol5l4j2ok5m0j5K8M6K8RPOj4l1j9OJ7M
1197E88JJ4J8mk5j5J7L5K6J3Qkk5l1lK6J9j7l3j6NN%J7M0M3K3lk0l3l8k3NK3J8NKRJ3Kj4k4
1191F49k5k2j5lJ0J0kKK5M0K2kNL1K4k2n8m8k2j4j6j1lnKK6M1J4k2k1J1J7nj0K0M3K1j7k5
1187F45mRJj0j3j0kJ3K5J4k0m7l5QL2J5j8k3JJ9J4%moj6j9j1rk0j5K4N9M6PoJ0J0j4k7j0J0
1182F23MrlPMj4l0k5QM7M9rq4r9m3J3K1JMK2K4J1PJ6J8J1QROkonoj1j6j6kK0L1J0k0k3LJ9
$$ plain form
1216 688 700 712 731 747 737 701 668 659 667 665 645 627 636 678 737 796 843 854 802 698 608 593 636 664 643 616 629 674 711 724 722 711 691 675 668 658 643
1211 643 644 675 715 729 720 713 723 737 746 745 734 714 694 677 661 652 670 707 716 673 621 615 649 672 671 668 670 662 659 694 752 763 704 635 617 635 646 646 661 678 662 614
1206 614 574 574 604 640 669 682 673 653 645 661 694 724 733 714 683 663 662 659 643 632 643 653 626 578 564 608 664 676 644 615 616 634 646 648 643 625 594 564 554
1202 554 574 618 673 719 736 718 681 655 650 655 659 663 672 678 665 633 599 589 609 647 674 668 633 599 587 581 556 516 501 529 575 603 612 619 625 611 580 561 567 584 588
1197 588 589 603 621 617 592 577 594 629 655 668 676 674 649 618 615 641 660 643 610 594 599 604 604 621 661 704 727 724 704 671 633 610 615 638 656 661 663 672 685 687 673 649
1191 649 624 602 587 584 594 604 602 604 629 669 691 689 694 725 749 727 669 621 599 585 569 558 555 550 552 578 619 633 611 590 601 618 613 603 623 666 687 670 645
1187 645 641 650 651 641 628 618 616 629 654 668 648 601 566 574 606 621 603 580 581 600 614 614 610 604 588 569 558 549 529 514 538 597 643 650 644 654 664 650 623 613 623
1182 623 627 618 615 622 626 612 582 557 565 612 661 652 568 469 426 439 460 461 465 487 511 522 529 545 563 574 582 591 597 595 589 584 578 567 551 535 533 553 584 594 574 551 554 573
1176E73Kk3k2%J6J2oj7jL7N8L0j8l0nNj7j7L2P4N3nl0j7%J1K3K2j4n2m8j0J2J4K0K5Ll5l8
1171F17oJ8J4J1J8J1rpK2L2Oj5qlk1k8jK5J3j1qJ5J8jj2j4k4l6k7lPmj2kPPJ0J6J2j0l0k2
1166E65J4M3L5ll1j4K2L0jk6j4J0Qk1m3l9j5J3L8N0L0j2n1m9j1L2L5Jk9j4K8M6J7j9j8J4L6
1162F57K5j3n2n9k6J4J9pk0kK1K3J8K9M4L5J1j0j8j8ML2K7k8q1p2j8J5J0RL2M2J8lJ2L8K6
1157G34j3k6J0N1M7jm0l0NJ4j1k7rJ4Kk7k5J4L9K2j4l3k4kJ5J6%oJ6M6M9K5Jj4k3k0KJ9mm0
1152G52k5M1P4K9k5j9J1nn4n9lL9K3j0JL6L4j4n6m2J4N8N5J8poRJ9J9J1j0l1k6J1M0J9l9p5
1148H07n0PM0K1k3l6pK1Ol0k2L2O1J9l5l0J9L3rm5l3jJ8J6Lj4j4J9N5L5l2p3n2k1k6m0j4K5
1143F30K5pj9mRJ2J7J7jj6%K9K4rj9pj5m5m9j5Pj4l5j9J4L5N6P6O4Rl2j1L1K1l3o2l8nQNK
$$ plain form
1176 573 575 552 530 530 546 558 552 535 534 571 629 659 641 611 606 611 594 577 609 683 736 731 701 684 684 695 718 740 726 674 626 616 628 642 662 687 690 655 617
1171 617 611 629 643 654 672 683 674 667 689 721 727 712 704 701 680 652 651 676 689 678 670 685 703 702 690 676 652 616 589 586 593 589 577 575 582 589 599 615 627 617 587 565
1166 565 579 622 657 654 623 609 631 661 660 634 620 630 638 617 574 535 520 533 571 621 651 639 588 539 528 560 595 596 567 553 581 627 644 625 607 621 657
1162 657 682 669 617 558 532 546 565 558 538 536 557 580 598 627 671 706 717 707 689 671 675 707 734 706 625 553 535 550 560 569 601 643 661 658 670 708 734
1157 734 721 695 705 756 803 802 762 732 737 751 740 713 704 718 720 693 668 682 721 743 729 696 672 670 685 701 701 695 711 757 806 831 832 818 795 775 777 796 792 752
1152 752 727 768 842 871 846 827 838 833 779 720 717 756 779 769 770 806 840 826 770 728 742 800 855 873 866 860 869 888 907 918 908 877 851 862 902 921 882 807
1148 807 757 764 804 825 802 766 759 780 786 756 734 766 827 846 811 781 800 833 824 779 746 745 763 779 782 768 754 773 828 863 831 758 706 685 659 619 605 630
1143 630 655 648 629 625 634 646 663 680 679 663 663 692 716 707 688 681 666 621 572 557 564 550 515 496 510 545 601 677 741 750 718 707 738 759 726 664 626 621 629 634 636
1138F36mlJ4K7Qk8m2l2k6k4mK0J5j0lL6N0K1jJ4K7Lj6QK9no3o4oM6M8J8j6l2j9J7L0qn5m7
1133E59PL6J2k1k3jJ6J7pm3n3j4L2K7o%L9L4m0q8m3L8O2L3J6K6J9j5l8k9j4jJ6L5L8K3J2K
1129F63j9l3j3K8M2J1k3k7j5j2j1njpj6j8j5MM4Q2O9Pn1n4j8J4K6K3J4MLOol8m6j6J9K3J5
1124F53L3N4K4m9q6n5oLkJ5L9L0krJ0K0PLJ4J2j8m5m0j7pqlLnj3PM2M7Rk3j1K3L9K9J5Nj0
1119G27k6j9LOk1m2l2pjjJ8M3L4rl1jL1J1m2n5j6K6K0j8m9m8j3M1O8L7k4l7J2N4L5qoK7K2
1114G09k3m8k7kJJ5M6M6j2o4m6J4L8Pj9j0RJ0OJ0Jk6m3j8K1L0nm1m5k1MJ1QJ1J8J6OljPJ1
1109F01J6K6L5L0J3JKJ2Ok3n6n7j4L0L0qk7oK5K7Onpj5j6NL1K8jj6lK0K6K3J0j4m0m2j6QR
1104F54MJ5L4L2Nk3l2k6j6pmpj0JK4L4J4k2l0JL5K9LlJ2Pk1k5PK1k0o8o6k9oNL3N9L1k0k4
$$ plain form
1138 636 632 629 643 670 678 650 608 576 550 526 522 542 557 547 544 580 630 651 650 664 691 694 678 686 715 710 647 583 577 623 671 689 673 641 622 639 669 661 606 559
1133 559 566 602 614 593 570 569 585 602 595 552 499 485 517 544 538 538 577 611 571 483 440 478 540 573 589 615 634 619 581 552 538 537 553 588 626 649 661 663
1129 663 644 611 598 626 668 679 656 629 614 602 591 586 585 578 562 544 529 533 577 659 728 735 684 630 612 626 652 675 689 693 696 702 696 658 612 596 615 638 653
1124 653 686 740 764 715 629 574 568 571 569 584 623 653 651 642 652 672 679 682 696 708 690 645 605 588 581 573 570 573 568 555 562 604 651 660 637 626 649 688 717 732 737 727
1119 727 701 682 685 691 670 628 596 589 588 587 605 648 682 673 642 641 672 683 641 586 570 596 616 598 549 501 488 529 597 634 610 573 585 639 674 666 660 687 709
1114 709 686 638 611 609 610 625 671 717 705 641 595 609 647 654 635 625 634 644 650 660 661 635 592 574 595 625 620 579 534 513 517 528 536 547 565 581 587 584 583 590 601
1109 601 617 643 678 708 721 722 724 736 742 719 663 606 592 622 652 644 617 611 636 663 669 664 657 642 626 631 662 690 689 673 670 690 716 739 749 735 695 653 637 645 654
1104 654 658 673 707 739 744 721 689 663 647 640 636 629 619 620 644 678 692 670 640 641 676 705 708 705 717 724 703 678 685 706 686 618 552 523 517 522 555 614 645 625 601
1099F01K0L3qk4K3P0M8jnK2K1opJ3Ol7n8k5K5L8J3j8k9rJ8K0j0k9%N0O3L4Qjj6m3n2k7kJp
1094G13JJ7K2J4LkOK7M1K0k2m0j8%j3k8rK6K1k0m3j9J5J3k1l9k3J0L1K9J7RJ5K4K2Jk3k6j3
1089G38mj2j7kRjj8nL1M2J1j9j1J0Oj5k4j7k0k7j2K0L1J9J1J7J3j1k4j2Jmj0oj0l1l7mK8J5
1084F49k1k1J5K7kl0k1LQNJ7L3K2rj7PL0K6RJKJrk3l8m4k0K7O0L9j6m6k2J5J3j9m0j7K5M9
1079F68L4nl2k8mQjoJ0K6J9nj8j7j7k6k8j3J0K9K9%m4o3k7K9M9L0J5J6J0j5l4l4l5m0j9K9
1075E00N4L6QL%k0k9nJ7Lj2K0O2M2k7n8k2J3ml0j4K2K7POK1J8qk5k0j3j7j7qpj7k1j2NK0L1
1070E29L5J5j8l2rK7L5J1k0l0j7LJ7J5Ml%mk0l2j1K7M1J4j9k2kPpl0l9k6OL2L2Jl1l4j4PJ4
1065D52J2Opj6j7j9k5nM9R1P1J4rMqn8p8k3M5M8PpJ6K2pl0k4j2rjJ8K4Nj5j4qj4k0j3KRJ4
$$ plain form
1099 601 621 654 646 622 645 715 763 762 757 779 800 794 787 800 806 769 711 686 711 749 762 744 715 706 724 744 734 705 705 755 818 852 860 859 843 800 748 721 719 720 713
1094 713 714 731 753 767 770 768 774 801 842 862 840 800 782 782 769 741 732 758 779 759 716 697 712 725 704 665 642 652 683 712 729 738 753 777 799 800 777 751 738
1089 738 734 722 705 703 712 711 693 688 719 761 772 753 742 752 758 743 719 702 682 655 643 663 694 713 724 741 754 743 719 707 708 704 694 688 678 647 610 606 634 649
1084 649 628 607 622 649 647 617 596 599 607 612 629 662 684 675 658 665 695 721 730 731 733 734 725 702 664 620 600 627 687 726 710 664 642 657 670 651 611 594 619 668
1079 668 702 697 665 637 633 641 640 634 644 670 689 684 666 649 632 606 578 565 575 604 633 633 589 526 499 528 577 607 622 638 648 633 599 565 530 490 471 500
1075 500 554 590 598 601 601 581 552 547 564 567 555 575 637 679 652 594 572 585 581 551 537 559 586 593 599 620 638 630 605 585 572 555 538 530 523 506 485 473 478 498 529
1070 529 564 579 561 529 520 547 582 593 573 543 526 529 546 561 565 562 562 558 538 506 495 522 563 577 558 536 534 541 534 504 465 439 445 477 509 510 479 445 431 438 452
1065 452 464 470 463 447 430 411 386 381 430 521 592 606 597 601 593 535 457 434 479 527 534 527 543 565 558 528 504 492 483 482 500 524 529 514 500 492 478 458 445 447 456 470
1059D70L1N4N0Qm1m7pL4K4j8l5rJ5%k7k0J1J6j4l8l1jL2N5M6Ok6j0K2J3l6n8k5K0L7K8Qk2
1055E15l9j3L0K1m1o6j2N1L9qkM5N8K4LJ1jm7o7l1J4J3j0j0J0J7LqrjQJ2Jj3lK7L1j2o3n8
1050D19MO5Q0N5K1mj7j4lKlj5l2l8k3J7N1M2Jk4lL4L6Jk0kK0Ol7o2m9k9l0l4j8J5K6J2lMK2
1045D73K6Pj4j5JJ5Pj6l0j3K1M1L1Jk1j5J4L7K8ol0k2LK4K9K2Lk7n5o5n4k7QM0N0L4R%KKk
1040E16qj4k0qK2L8J8qJL2L6Lk3j6oj9l3k0kkj1MK8L0Nk1k1oJ2K2J4nk0j7rqjK0L4J4j3JM5
1035E84N9K0k1j9kk3o5o7j7L7N4M2K4Kk4l0pK0K2OjPJ2OJok5m8m6j0K5K7Jj6j1%jmOK2K0p
1029E47l3l4j2OJ3J7K1J3qk1j3knj2lP%j7oK3L4Qk0k2j1lRK4K0j3l4rL2L9Ok5k8j4MJ8K4K1
1024E41K0J7ml6l9jK8jm4m0%Qk5l4KL0J5j1lJ7J6NJ1K0J3lKJ8K2J5Omj9j9KJ9Qj5k2j3nLJ3
$$ plain form
1059 470 501 555 605 613 572 525 518 552 576 558 523 514 529 529 502 482 493 509 495 457 426 425 457 512 558 564 538 528 550 563 527 469 444 464 501 529 537 515
1055 515 476 463 493 514 473 407 395 446 485 477 475 520 578 602 605 616 615 568 501 470 484 497 487 477 487 504 507 499 490 489 497 509 510 497 494 521 552 540 477 419
1050 419 423 488 568 623 644 640 623 609 606 608 605 590 558 520 497 514 565 607 608 584 581 615 651 652 632 630 650 656 619 557 508 479 449 415 397 412 438 450 447 451 473
1045 473 499 506 492 477 478 493 500 484 454 441 462 503 534 535 514 499 513 550 578 572 542 520 523 547 576 598 601 574 519 454 400 373 381 421 471 505 514 514 516 518 516
1040 516 508 494 474 466 488 526 544 536 537 569 605 608 585 569 563 544 511 491 489 487 476 480 508 538 543 522 501 495 507 529 543 538 518 501 492 484 483 503 537 551 538 539 584
1035 584 643 663 642 623 621 598 533 466 449 486 540 582 606 608 584 554 547 567 589 595 594 601 613 619 620 614 589 541 495 485 510 537 538 522 511 511 510 506 512 534 554 547
1029 547 514 480 468 474 487 504 525 538 530 509 496 494 489 477 474 481 481 464 458 481 515 523 503 481 470 467 476 500 520 507 473 464 496 535 541 516 488 474 478 496 520 541
1024 541 561 578 574 538 499 498 526 525 481 441 441 449 424 390 392 422 437 426 423 440 456 461 472 492 505 502 504 522 544 559 565 561 542 523 525 544 552 537 515 502 497 500 513
1019E13J5lj5kQj1l5k2J1J3j5j9J9M7L0j0k2nJ3J3lk6l6j5K7N0K9mpJ6K8Rj3j5ojkLJ6J6k
1014E87j8j3OJ2OLMpk5k2PK6Qj3JK3J5j7k1OK3Rnjpl2m6k5OJ5J1J5J3nk1qJ2PqNM0M8Rl1k9
1009E63KJ8J0LJ3K5J5rk6k0PL0L5K3J3J7K5K1Jk3l4l0j4J3M3N8L7ql5k0J2J9lk5k4rjjoj5
1004G00k6k5oJ5J7lk0j5KJ2Qjrj8l2l1%M2M9J5k2k5rj0k7l2j0J6K8J9Jj0LL1L3mm2l6lJ1K
999E88LJ6J1rj1PPqJL2L1j7m5qL8K9j3k5j3j3j1K3O7O6K5jkj7m9n5k9j3k8l4j3OKLK7L8Pl3
994E80l7j0J3J9J4P%OK0J8j0l2k0NOj4j5PK2K0ROjj2j4nmk1k6KL8M0Kk9k2KJk5m2k9r%%RJ6
988D85J4QJ2J1rl7l7oK0J2j4k2J0M9N7J7k9k5K8N9J9n3p2j8M3N5K3j4l4l2pJ7Rk8l9lK5%m6
983D48m2J6M9J4m8o0rM4N0J1k5l0j7j2mK9O6N1j2n0nO9P8J0m7m2j1j4l8l5OM8O5N2K0j7l2
$$ plain form
1019 513 528 525 510 508 516 505 470 448 459 472 457 438 457 504 534 524 502 497 510 523 520 494 458 443 470 520 549 545 538 554 582 591 578 563 557 556 554 557 573 589 587
1014 587 569 556 562 574 580 583 587 580 555 533 540 566 574 561 562 585 600 583 562 568 591 600 595 594 587 555 509 484 490 505 516 531 544 539 518 510 522 529 521 526 566 614 623 592 563
1009 563 565 583 593 596 609 634 649 640 614 594 601 631 666 689 702 719 744 765 766 743 709 679 665 678 721 779 816 808 773 753 765 784 781 756 732 723 722 721 715 700
1004 700 674 649 643 658 675 672 652 637 639 651 659 658 649 631 599 568 568 610 659 674 652 627 618 608 581 549 539 555 583 602 603 593 596 627 660 656 614 578 575 586 588
999 588 591 607 618 609 598 605 612 604 605 637 668 651 606 598 636 665 652 627 614 601 590 613 680 746 771 770 768 751 702 647 618 605 577 543 530 536 538 541 568 606 613 580
994 580 543 533 546 565 579 586 586 592 612 630 620 588 568 573 579 565 550 557 579 599 608 614 613 601 587 582 578 557 531 533 571 611 613 584 562 564 565 540 498 469 460 460 460 469 485
988 485 499 507 519 530 521 484 447 441 461 473 459 437 447 496 553 570 541 516 544 603 622 569 497 479 522 577 600 586 552 520 513 530 539 511 472 469 494 494 448
983 448 406 422 471 485 437 377 368 412 462 473 448 418 401 389 385 414 480 531 519 469 464 533 611 621 574 532 521 507 469 434 440 488 553 605 625 608 576
979E76k0lmqOL1K6j0l6k6lQRJ5J6pl1k2J1K4Nj8j2RJ0j0l3m2l3j0J5K5J9J7K3K1%j8j4jmj0
974D91LJ9J9OORqk8oM3O0K0k8l7k4j8k0j5j8k8j5L4P1M6lj5J1K2kk5k3j3j3j3poj3j1J4L7
969E22K8ql4k1J5L6K3Jmlj4k8j6J4J8j7m4k2J3J2pjL0L3%k2pJ4J0j0k1k0j8j7j9k3rL4P3O2
964E53J2j9nJ5Nj3j2lj4l4l8k5rQK3K6J1KJ2J5pl1j9J5K3kk3rK2K7RJJ8L4J6k0k8LK6Ok1j4
959E36J4J0k7l8lK4J4JJ3K5Jk2qJ4jl9m5j4OPJ1K2J5rj6jJ1OOJ6Rk1l5j2K4M0L3J3j1k4j2
954E33J4K1Jj3kJ2QKQJ8J8Oj2k8l1mL0L6K4L0M7K5m2q1n1j1k1m3j7K6J1m2m6K1P1N0J3K2N4
949F57M6jm5o2m9j6J7J5j7k5J4M6K0k2j4K6K7j6k4K4N7K0k5j1L1L2jLM2M9Pj5K7O5L7k5l8
944H56KK0j0m3m1j5MJ7K2Ok8l9qJ8%l7l1J5M0J1l6n1l7k7k8j5RJ8%k2k1lJ3Qj3l1l2j1J7L3
$$ plain form
979 576 556 553 549 541 547 578 604 594 558 532 529 537 546 561 577 570 539 517 528 552 557 539 527 536 546 536 503 461 428 418 433 458 477 494 517 538 538 520 506 505 501 491
974 491 494 513 532 538 544 553 545 517 511 554 614 634 606 569 545 527 507 492 474 446 431 465 536 582 579 564 575 597 595 570 547 534 521 508 501 495 482 471 485 522
969 522 550 542 508 487 502 538 561 562 558 555 541 513 497 511 529 512 468 446 459 471 464 463 493 526 526 504 497 511 521 511 490 470 452 435 416 393 384 418 491 553
964 553 565 546 541 556 561 548 536 533 519 485 447 422 413 421 444 470 481 483 495 510 503 472 453 468 491 489 466 457 479 506 515 516 534 568 584 564 536 539 565 571 550 536
959 536 550 560 533 495 492 516 530 531 544 569 570 548 540 554 553 514 469 455 461 468 479 501 516 507 491 490 501 507 513 529 538 517 482 470 494 534 567 580 569 545 533
954 533 547 568 569 556 554 566 574 576 584 602 620 626 614 586 555 551 581 617 641 671 718 743 701 620 569 558 537 494 477 503 514 472 426 447 518 568 581 603 657
949 657 703 702 657 595 546 530 547 562 545 520 534 580 600 578 564 590 617 601 577 601 658 678 653 642 673 705 704 707 749 798 805 790 817 882 919 894 856
944 856 858 878 868 825 784 769 773 790 812 818 790 751 743 761 761 724 693 708 748 759 723 672 635 608 580 565 574 592 592 570 549 546 559 567 554 523 491 480 497 530
939E30K9J3mj5j6lJ7K1Mj7k2j2omJ4M3N8M1Jk8k9kL4N5M1km1m5rK9L1j1o4p6l7NNk3k4PJ9
934E07nj8J6N0K9k0k4J6L1Jj3J6L6Pl1k6Klk9k3J5K7mk4PM4L3j2k7J6N4K8n3j03p4%L9J9j1
930D93oJ3J1nLL2M7K4k2n9o5l3K0N3M1Qj3j7k4l4k5m%pML8N5M3K2J4ll0l4kK0%k6j6J2Rj4
925E23j8%kk8l8j9OJ5K4K8J2j3j5J5L4J8j1j8j1j5k5k0NL0L8J7k1m9m4j8%LJ5K9J4k1l1KK9
920D40J5rmJ6J2n%J7J5jmLkj3lJ7J3ojK4K6kk3k0k1k6nL4M3Qj4JJ1j6l5qK7J8pJJ6pl5j2M1
914E19L8k4n9k6J3Oj3jK0J5kJJ3PrrRK0K2J3pl8m6j4K9M2L1J6Kk2m0k7OK5J3pj8j4NK9K8j0
909E36n0m9j1J9K1J3Noj1RM2L4j6m5j4L0K3j3j9J2K7Nj7j2nj4k1mJ6J7J1J3J1oj5J0M4L7q
905E99l7k3nj8l6k8lQJ0K3M1L8J1j3k3k9l1j8Jlk3k5NL3L0J0KLnqOK4J8qk2j3KJ0J5J5jk4
$$ plain form
939 530 559 572 568 553 537 534 551 572 576 559 537 525 519 515 529 572 630 671 672 644 615 613 647 702 743 741 700 655 646 675 706 695 631 555 518 523 528 505 481 488 507
934 507 502 484 500 550 579 559 535 551 582 583 570 586 622 629 598 572 574 571 542 519 534 561 557 533 540 584 617 605 578 594 648 676 623 520 446 446 485 504 493
930 493 487 500 511 506 509 541 588 612 590 531 466 433 453 506 547 555 542 525 501 467 442 438 438 431 435 473 528 571 593 607 604 574 540 538 558 558 532 516 528 537 523
925 523 505 505 503 475 437 418 424 439 463 491 503 490 475 490 524 542 531 513 502 487 462 442 447 477 515 532 511 462 418 400 400 403 418 447 461 440 409 411 440
920 440 455 446 442 458 470 465 465 482 497 496 492 495 493 480 477 494 507 501 500 524 550 548 525 505 484 458 453 487 530 538 524 525 536 520 485 477 504 522 515 516 532 525 490 478 519
914 519 557 533 474 448 461 467 454 453 473 488 486 487 500 507 498 489 498 518 540 553 546 508 462 448 477 519 550 566 568 546 506 479 485 510 523 516 498 484 489 518 546 536
909 536 486 437 426 445 466 479 484 478 467 476 518 552 536 491 477 507 530 517 498 510 537 542 525 513 508 494 473 469 485 502 513 526 537 531 516 526 570 607 599
905 599 562 539 534 516 480 452 449 457 467 490 531 569 580 567 544 515 484 466 467 464 441 416 421 454 484 494 496 499 494 486 492 516 534 526 504 491 493 503 518 533 532 508
899E08k2J3M7L8j2n3n0k0nroK6N4M2PnJ5K7Ll7n3l5rNml1m2j0M9P5M5LkJ6J1j1j5OJ7Jk2l1
894E24k7qJ4J9jqK4N7L1l3n1mL4J6j4pQql6l3j3j7k8JN0N8J4k3j5Njj4KL5L9%l4k2K1M1J3
889F09l0l6mK6L1K6J9Jk1j9J3L4J6qlOj6m7l5QK4Jj1J7M0K7jnLLPK9M8L9J8J5L1L6K2Kj5l0
884H70k7OM5M5km5l6J4N3M8J6m%Ooj9j3QRj2k0%J2j4n7o0j0M1M9K2lkJ4K7K2Jj6j2LPrk1j0
879I20J5K8K7J7Lj6k9k4mJ8L1M3M9M3L2K8L2L4L0K5K4K2J6J7K4J8pk4j4J2K6K2J7J0mj5rM
874A441Jj7k3j5k0l3k0J6L0om3l8j7k8n1l9KJ2k1n3m7k3j1j0j6k9l5oM1N2J0l1k3RJ9Pj%r
869I75j3J4M9M8J3pkkk6l4mL8M4K0MJ5L1K5jl2m5l0JJ7Jk4l4l0l3m0k3J2K7lm1m3j6pk8m3
865G73k6PK0J1kj5k9k2J3M2K0l9o3k4K8L5NrNJ5nl1l3rJ1J2mj6j6j3j6k1j2J1L0K3jj9j5J
$$ plain form
899 508 486 499 546 584 572 519 469 449 444 435 429 455 509 551 558 553 568 595 598 561 508 473 464 469 465 434 392 382 431 506 551 554 552 568 579 568 553 559 576 577 555 524
894 524 497 489 503 522 521 513 537 594 625 592 541 537 571 587 573 566 574 566 530 497 484 467 439 440 490 548 562 539 524 529 528 514 516 551 590 590 556 534 555 596 609
889 609 579 543 539 565 596 622 641 642 621 602 615 649 665 657 654 660 644 597 562 570 594 595 584 601 641 668 667 662 665 668 675 704 752 791 809 824 855 891 913 915 900 870
884 870 843 849 894 939 937 892 856 870 923 971 987 983 983 989 983 964 951 959 968 956 936 936 948 934 877 817 807 848 897 919 916 914 928 955 977 978 962 950 953 960 951 930 920
879 920 935 963 990 1007 1010 994 965 941 937 955 986 1029 1078 1121 1153 1181 1213 1247 1277 1302 1326 1348 1364 1381 1405 1423 1416 1392 1378 1390 1416 1438 1455 1465 1461 1446 1437 1441
874 1441 1442 1425 1402 1387 1367 1334 1314 1330 1360 1354 1311 1273 1256 1228 1177 1138 1140 1152 1131 1078 1031 1008 997 987 971 942 907 901 942 994 1004 973 950 959 978 985 984 984 975
869 975 962 976 1025 1073 1086 1079 1077 1075 1049 1015 1011 1049 1093 1113 1117 1132 1163 1188 1187 1155 1110 1080 1081 1098 1099 1075 1041 1011 978 938 915 927 954 951 910 867 851 844 816 773
865 773 747 754 774 785 783 768 739 717 730 772 792 753 690 666 694 729 734 725 730 745 740 709 676 667 678 690 686 670 654 641 625 604 592 603 633 656 655 636 621 622
860F22J8J9Oj3j9rkjJROj7l8l0kJ1jk0k7j8LK7L6K7J1MKj9n2o0k7K5M5K5nkK5K6k2p1n8MM4
854D83K3j3j2OLqNL1J7k8m4j2K1K7K7L6K8j1m0l3qKLQOrmL5O7M6rl9l9l9l6nL4L7OoJ9L2N
849F12k1j6kj8m1k4K2M2J5j7k5k2k7k4JL1L1RlRK0J1qj6j2kJ3K6K1rl4k3J0K2Oqprk4k6nO
844D84j4l2j1K5L3J4NJ4J6J0J2K1J0rpJ7K9J8PMj8m6l2K6N3Ko1m6J5K9k5o0j9M7O2L2QQLj6
839F08l3k8j3MJ6J8J0JPJ7J8QNJ3J6J0jj1k8m2k9NK7K1J5L7N3J9m4n9kM6J8m6n6rL0J4k1k2
834E92RL3L6J6qk2j6%Jj3j0J9L7J4k5l3pJ8J4mj5j0NK9M8M5K3ql1m1l4lL7O1N6K3j6l9l2r
829G40Mok0j7ooj2j4k1m2n0j1N3P8M0j5l4k0qqnkloKK1M0M5K9ml4k9J2N2M8J0k6l8l4j7MK0
824G10J6kk2l8m3k5J7M7M4K6K3J6j8n3l4K9O0K8j3nK1J3k4l9k3j0j7k1j1nj3qK2M0Rm5o6l2
$$ plain form
860 622 640 659 665 652 633 624 622 621 622 631 637 620 582 552 550 561 560 540 513 495 498 525 561 588 599 603 605 586 534 474 447 472 517 542 537 535 560 586 564 493 435 439 483
854 483 506 493 481 487 490 482 487 518 535 507 463 451 472 499 526 562 590 579 539 506 498 500 503 511 517 508 504 539 606 652 643 604 565 526 490 485 519 556 562 556 575 607 612
849 612 591 575 573 555 514 490 512 554 569 552 527 505 478 454 455 486 517 526 523 532 552 563 555 539 527 525 538 564 585 576 542 519 529 551 557 549 542 533 509 483 478 484
844 484 470 438 427 452 485 499 504 518 534 544 556 577 587 578 571 588 617 635 642 646 628 582 550 576 629 631 570 524 539 568 543 483 464 511 573 605 613 621 624 608
839 608 575 547 534 538 554 572 582 583 590 607 625 633 638 651 667 677 676 665 637 595 566 571 598 619 634 671 724 743 699 640 638 684 702 656 600 591 621 635 614 592
834 592 601 634 670 686 678 656 640 640 641 628 618 637 674 688 663 630 623 641 655 651 636 626 631 660 708 753 776 768 737 696 662 659 696 757 813 836 820 781 749 740
829 740 744 738 718 701 695 689 677 663 642 600 550 539 592 670 710 695 661 641 633 625 620 618 615 609 611 632 672 717 746 742 708 679 691 743 791 801 775 737 703 686 690 710
824 710 726 724 702 664 621 596 613 660 704 730 753 769 751 698 664 693 753 781 768 763 784 797 773 734 711 701 684 663 652 647 634 626 648 688 697 652 586 554
820E54J9L9L0J9J9J5LML0M1Mn0o1j8K0J6kNK5J8qj9j2j0j9j8mRJ4J8J7Mj6l2l6l4j7J0K3K
815F02l2l6j2PJ5K3K8J7%MJ5jk3j1K2J4l3n0qL0J3j3LK3jl7k0K9L9Mj7%Qj2l6l9l5k6%L4M6
810E34L7K6J9lk3j7OJ0JQK5Ql8n5k2J2J5Mmj8k4ON5N7Pk5mJ0j5k4K2N0mp9o2K5O8L0j5j4M
805E93J2K1L4K7Lj1j6l7n4k5L1L7j8n6k5K3K0j6j7J5L5K5J3J1Rok6m0m0j8J7M5M6K7pl7l9
800E56%M2L4k1n6l6%J2QJ0Ll0n0k2L0M2J4j4j4kMPQjj5k0k7l7k7K0O7O4K6JPNj8k3NL6L2N
795F25j6k5k6j2J7L6L0Mj9j8KL0L3%l4k9OK1Kj2NJ4j1l7j8J5Rk4k6RK7RlJ3J4j8m2j1L2K8
790F00loJ4oo0o5OO7M4j6k6ORk4k4K3M9J6j6jK9K1jLJ7ll4k1K5L2qk8ML2Ol6l1j%k7l4rK0
785E43L5N1O0L7j3l9j5J2mm3m1NL9K0j9k5kQrk5j8j4k9l6lM4N0J7mJ4L9L0nl6m7m0j5J3K7
$$ plain form
820 554 573 612 642 661 680 695 698 702 732 773 777 727 666 648 668 684 682 687 712 730 722 703 691 681 662 644 640 649 663 681 698 702 686 654 618 584 567 577 600 602
815 602 570 534 522 529 544 567 595 612 612 616 631 630 607 596 618 632 599 549 541 571 584 571 574 597 596 559 539 568 607 611 594 594 602 590 554 515 480 454 454 488 534
810 534 571 597 616 613 590 573 579 589 590 598 623 631 593 538 516 528 543 547 543 525 501 507 562 619 626 601 597 607 592 568 590 640 636 557 495 520 588 618 603 589 593
805 593 605 626 660 687 690 679 663 626 572 547 578 615 597 541 516 539 559 543 526 541 576 601 614 625 634 628 602 562 522 504 521 566 612 639 632 595 556
800 556 556 598 632 611 555 519 519 531 539 549 552 522 472 450 480 522 536 522 508 506 510 517 525 524 509 489 462 425 398 418 485 549 575 576 583 588 570 547 552 588 620 625
795 625 609 584 558 546 563 599 629 633 614 596 598 628 661 661 627 598 604 625 627 615 620 634 623 586 568 583 592 568 542 551 578 587 584 597 611 593 551 540 572 600
790 600 597 591 605 599 539 474 480 547 591 575 549 555 564 540 516 539 588 604 588 587 616 637 636 639 656 653 619 598 623 655 647 619 623 655 661 625 594 593 593 566 532 523 543
785 543 578 629 689 726 713 674 659 671 667 624 583 588 627 647 628 603 601 609 600 575 557 543 514 478 475 519 569 586 582 596 635 665 660 624 577 537 522 535 562
780E62J4NJ9M0M2K3Jj2j9j9j0jJ%Mjk0k7LM0M0Mk2k7k6j7J6N7N8K2jPlm5o0%Q4R8M0nLK4J2
775I04j2j0J1K4J7O%oj3j3ML2N1N1L6K8L8M9M3K7K0K3K0J4L2P7J18J24J01P7P7R3J06J08J11
771B368J29J59J74J65J53J62J75J65J41J30J23P9Kn4n6n1q5j33j43j21j14j38j59j57j50j46
767B618j28r3p7q9j03r2o7n2m0k5k1l8n3m0j3nk1l4m1n5p0n9j9J7K3J3Kj2l3m4l9l9o1q4p0
763A056k5RJ2QJ8K0j1m3k7L4P8N4rn2m5j4NLllNJk4m5k7K5N8K9k4l7jK5Ok0j0K7M2K4MkL%
758A124lMK8N9O7L7j2k6J5O4O6K8KKOOJ7L2K0k2m7k7MKj8j8jjk0k4rj1m0o8n8j7J0jl5n3l0
753A052J6L8J2k7k5RK8Mk0rJ8J1k9n5m0qPJnrj0qMK8M2K9ql8l9j7mqj4mRJ1%j5k9m1m0k6j6
748G75j8j2J9N1M4Nk2k2k2l4l2jK1Kl5m1k2j1j5rLnk2qM1O3K2m4o1k1K4L4J4nj7k3k8k5oK2
$$ plain form
780 562 576 581 600 640 682 705 706 694 675 656 646 645 646 646 650 649 629 602 605 645 685 689 667 640 614 597 613 670 728 750 749 756 753 708 648 648 732 830 870 865 868 892 904
775 904 892 882 893 917 934 940 940 934 921 908 912 944 995 1046 1082 1110 1148 1197 1240 1267 1287 1310 1330 1344 1376 1453 1571 1695 1796 1873 1950 2043 2149 2257 2368
771 2368 2497 2656 2830 2995 3148 3310 3485 3650 3791 3921 4044 4123 4125 4071 4015 3964 3879 3746 3603 3482 3368 3230 3071 2914 2764 2618
767 2618 2490 2397 2320 2231 2128 2036 1969 1917 1877 1852 1831 1793 1740 1700 1687 1682 1661 1627 1586 1531 1461 1402 1383 1400 1423 1436 1438 1426 1393 1349 1310 1271 1210 1126 1056
763 1056 1031 1040 1052 1060 1078 1098 1087 1044 1017 1051 1129 1183 1174 1122 1077 1063 1068 1071 1068 1065 1070 1071 1047 1002 975 1000 1058 1087 1063 1026 1025 1050 1056 1036 1026 1053 1095 1119 1123 1121 1124 1124
758 1124 1121 1125 1153 1212 1279 1316 1304 1278 1293 1357 1423 1451 1453 1455 1461 1467 1484 1516 1536 1514 1467 1440 1444 1446 1428 1410 1409 1408 1388 1364 1355 1344 1304 1236 1178 1161 1171 1170 1135 1082 1052
753 1052 1068 1106 1118 1091 1066 1075 1103 1107 1087 1078 1096 1107 1078 1023 983 975 982 983 978 969 959 951 955 983 1025 1054 1046 1008 969 952 948 940 926 922 931 942 942 927 898 857 817 791 775
748 775 757 745 764 815 859 864 842 820 798 764 732 731 752 754 719 678 656 645 630 621 624 619 597 589 630 693 715 671 610 589 613 647 661 656 639 616 588 563 557 579
743E79M2K5j2k6LL9L3qk8oK3J4j8k6kJ9Pj7k1%J0kj1KJ6Jl2m0j9lj3j9JL3M2L4K5J9om1n2
738E65k7J1K9K5J2PJ6K5J4j8m2l4lK4L2K3jk6k5MJ7pk6MN4N4Pj9jOk3l5nK1pm3l0J3K0pj3
733E91J7L4J4j3j3QK0J4ok7l0kL4M3J9oj1lok2m2n4m6j6J1K1K2K8L3J3k2l2nL3M5L3K0K0J6
728G33j2n0n6j4L6M0J0mJ6L2Qk9m5l8j7K1O3O6J9k3j4J0kk7rK5J7j3KM5K9l8m9K8P8K1o0n6
723G43RL9J8LJ0NkK4O0N6J4q%ol6m6j6J0kk2j5RJ7O%K3O3Q6O0Kl0pL2K6j7m4l6j8j2pKmj5
718I74qJ7L1J7lkJ1K1K1Qj9m6n0l3j5qKJ3PqlK2L7K6Nj2k5k5QN0N1Rj9pKl3o5l1L8O0J7k9
713A006k7kPQK2L4J8k1m3l3j7j4j7oJ7L7M0K6Kk2k9pK1K5RLJ4J6ok4j7%JjJ5L2J5j6j6J4L2
708A096K3J4K5K6Lk2k0mNJ3K2K5J1j3k7k1ML5M0Nk8j6K1K1k1m8l2j2j8k4j2j0l1l3PL9J5l4
$$ plain form
743 579 621 646 634 608 611 650 683 675 647 641 664 678 660 634 632 651 658 641 620 620 630 628 617 619 635 636 604 564 545 542 529 510 511 544 586 620 645 664 658 617 565
738 565 538 549 578 603 615 622 638 663 677 659 617 583 580 604 636 659 658 632 607 611 628 621 595 599 653 707 714 695 694 700 677 642 637 658 651 608 578 591 611 604 591
733 591 608 642 656 643 630 638 658 672 666 639 609 607 641 684 703 697 686 683 677 655 613 559 513 497 508 529 551 579 612 625 603 571 566 599 644 677 697 717 733
728 733 721 671 615 601 637 677 687 683 699 731 739 710 665 627 610 631 694 760 779 756 742 752 750 723 714 739 756 743 745 790 819 781 732 760 838 859 799 743
723 743 752 791 809 812 822 827 825 849 909 965 979 971 971 965 929 883 867 877 875 853 838 847 864 870 870 893 956 1042 1102 1104 1074 1067 1099 1125 1108 1064 1028 1010 998 991 993 989 974
718 974 966 983 1014 1031 1028 1026 1037 1058 1079 1087 1068 1022 972 939 924 916 918 931 938 930 927 949 986 1012 1017 1005 980 955 963 1013 1064 1073 1054 1047 1049 1016 951 920 958 1018 1035 1006
713 1006 979 977 984 992 1014 1048 1066 1045 1002 969 952 938 921 915 932 969 1009 1035 1037 1015 986 979 1000 1025 1034 1037 1051 1067 1061 1037 1020 1020 1021 1020 1035 1067 1082 1066 1050 1064 1096
708 1096 1119 1133 1158 1184 1187 1165 1145 1141 1146 1159 1181 1206 1217 1204 1177 1156 1160 1195 1235 1240 1212 1196 1217 1238 1217 1169 1137 1125 1107 1083 1071 1061 1030 997 1004 1043 1058 1024
703A024m2j4%oJK6L8K8J7Nj0j2QK0jk1lK4Lm6n3nK7Kl6m0j2J4K7K3rm5n0k6j6k8k1J8M4K8
698H81JkKj1k2jK3J2k1k9KK8K4Pjnj2k0k1k3k9l2j6PJ5RJ2L1L5Lk8j1L1K6l0n3mM0On0k8M9
693G95P1J8l0k6k0l6l5JJ5j0j4L0M9oo3m1J6J9j4%N6P3L3%%nl3m0nK5J8LPJ1j0k9j5QNk4l6
688G61oM2N4Qn9p3j8M5M5Kj3J5L4J5rj2k0l7l0J8N1J8m5n9j8J4Jk6j6K4N3M8K3pl3m7l7lL7
683G40N0L5Oj9l5m2k9JK1J7MJ0K9M2M0K4pm8o6m6j4j0j7kL0L1mk8j7jpj4kJ0PQK8L0pm5k6
678F77L2N4J1l7l2J4M7L9J9Mj2l0k5J8N3L3k7n1qM1L3oqK2K5jrJ2J4k4m1kM2K8k0l4pJ4Kj6
674H44qJ8L8M1K4kj5j9k4k5KM2L9k6p4m1L6O2K1j7qJ9K3J1lj6k5j6KKk0l0j4RJ9K5K8J8LJ0
669I53L1L2jl1k0PJ3mj9k3k1j9j7j5j2NK7K8J1PL1N0K7j5l2j3Mjj8k4j5%J2Rj0k3j4PK0J7
$$ plain form
703 1024 982 968 968 962 963 989 1027 1055 1072 1077 1067 1055 1063 1083 1082 1061 1058 1082 1085 1039 986 981 1008 1010 974 934 922 936 963 986 977 932 882 856 840 812 791 809 853 881
698 881 882 880 882 871 849 848 871 883 862 833 835 863 887 894 893 888 876 856 835 812 783 751 735 742 757 766 778 809 844 847 819 808 839 865 835 782 778 818 824 774 746 795
693 795 866 884 854 828 808 772 737 738 753 743 729 759 808 802 739 698 714 733 719 719 775 848 881 881 881 876 843 803 798 823 841 844 851 862 852 823 808 816 821 797 761
688 761 755 797 851 859 800 727 709 754 799 801 788 803 837 852 843 831 811 774 744 762 813 831 786 727 709 723 724 698 682 706 759 807 830 823 790 743 706 703 740
683 740 790 825 831 812 777 735 706 707 728 745 749 759 788 830 870 894 887 839 773 727 713 703 686 684 714 745 741 713 696 695 688 674 672 682 689 697 725 755 748 703 677
678 677 709 763 774 737 705 719 766 805 824 828 816 786 761 779 832 865 838 787 779 820 853 847 839 861 886 885 876 888 902 878 837 835 877 905 885 851 844 858 860 844
674 844 836 854 892 933 957 955 940 921 897 872 874 916 955 929 855 814 850 912 933 916 908 927 950 961 958 942 917 901 903 905 885 855 841 850 869 894 922 940 943 953
669 953 984 1016 1015 984 964 971 984 980 961 938 917 898 881 866 854 859 886 914 925 932 963 1013 1040 1025 993 980 984 983 965 941 926 926 938 947 937 914 900 907 927 944
664I44J2J1OOJ7M0M5J5l4n9m4nK1K3J9J8J1mj0J1L4K3qk0NK6K1QRNj2j0K9N6K0m9o6j2M0L9
659A181J2krk1j8K0N4M4Jj4J1M2M8L7J6j3m5n5l6lK9N7O3L2k2m8k7PJ6ORK2K2J7K3L5K0j5
654A496l3qK7L1Lk3k9j4J0K6L1K8K8K7J0j5j9J4N5O3L0qk2nJ8K8J5JMK1K1J0J1L3L6Kl0j9
650A854J8K7J0QK3J2k7l4J9P2N8mm0k0J7L3L1K6J8lk7m2m3k8j2qj8l0l5l1k1r%%oolqj9j6
645A736KJ4MnOJ9Pk6m5l3lK5L7K8ml9m5j2K9M3J8k3m5l1jQoj8nJ5J5LMK3L5K0j0l1l3k2j1
640A643j2k8l5k2KJ4J0KNJ4J8J3%j1j5j7k8l7k0J6K6pm0k7J5K8kk6j6J3L5M3L1mm1m5j1K0
635A504J1j9l1k0MK3K5Qj8k2kLk9o7o1j7K1K2jk0k0oRRok1k0okkMJ9K6J0k3m6m2j2Rnl4l5
630A120LL6K5qj6JPj1l2l1j9j6j3jJ3J3LNK2L3K3kk0k3j6j2j0j0j7k4k0MK9K8Qj0j7j9k3j9
$$ plain form
664 944 956 967 973 979 996 1036 1081 1096 1062 1003 959 954 975 998 1017 1035 1046 1042 1032 1043 1077 1100 1092 1072 1077 1103 1124 1132 1141 1146 1134 1124 1153 1209 1229 1180 1114 1102 1142 1181
659 1181 1193 1191 1182 1161 1143 1163 1217 1261 1262 1248 1259 1301 1349 1386 1402 1389 1344 1289 1253 1250 1279 1336 1399 1431 1409 1361 1334 1341 1357 1363 1372 1394 1416 1433 1456 1491 1511 1496
654 1496 1463 1455 1482 1513 1516 1493 1464 1450 1460 1486 1517 1545 1573 1600 1610 1595 1576 1590 1645 1708 1738 1730 1708 1703 1721 1749 1764 1765 1769 1790 1811 1821 1832 1865 1901 1903 1873 1854
650 1854 1872 1899 1909 1917 1940 1952 1925 1891 1910 1982 2040 2036 1996 1976 1993 2026 2057 2083 2101 2098 2071 2029 1986 1958 1946 1938 1920 1890 1855 1824 1803 1794 1794 1794 1788 1782 1779 1771 1752 1736
645 1736 1738 1752 1756 1751 1757 1776 1783 1757 1712 1679 1676 1701 1738 1766 1762 1723 1678 1666 1695 1738 1756 1733 1688 1657 1656 1664 1658 1640 1635 1650 1665 1668 1672 1695 1730 1750 1740 1709 1676 1654 1643
640 1643 1631 1603 1568 1546 1548 1562 1572 1574 1579 1593 1611 1624 1624 1613 1598 1581 1553 1516 1496 1512 1538 1531 1491 1464 1479 1507 1505 1479 1463 1476 1511 1554 1585 1581 1540 1495 1484 1504
635 1504 1515 1496 1465 1445 1449 1472 1497 1505 1487 1465 1463 1466 1437 1370 1309 1292 1313 1335 1334 1314 1294 1288 1297 1306 1300 1279 1259 1253 1251 1249 1253 1272 1298 1308 1285 1239 1197 1185 1194 1189 1155 1120
630 1120 1123 1159 1184 1176 1160 1161 1168 1157 1125 1094 1075 1059 1046 1045 1058 1071 1074 1079 1101 1134 1157 1155 1135 1112 1096 1084 1074 1064 1047 1023 1003 1007 1036 1064 1072 1062 1045 1026 1003 984
625I84oKjLJ3J2j8m8m6j2K1L4K8J4nj5rQJ8J3jj3k2k2j5nNQMj0k4j8RK6J2j2k0qmj3j3KK0
620H76K7K8K3Ok3m4m3k4%J6J4JqLJ5Rj9m2l4lK8L9L0J6PKJ%QJ6Mk7n3m7j4J4J8Mj4j3K0N5
615H72M4j3n4k8K4L1nj7J2K0k0n8l3K5N3L5Mk0l2k4NK7J2j7k0QK6J0j6k2j0NJ2Rjj1j3qj%
610H11lomjnj7j4J0L1J7j6k2OK3Kl3n3n9n2j1N6Q7M4k2l4%K0J0PK5L1J2lpk4n6n1JM7L9Lo
605G83J0J3%j3k4l9m0j0L5M9K4j1l1k6kK8L4Qj4jK7K0k2m8l1%J0ORK2L3L3K2nl0k1J1J7l0
600G96p5n5J3N4L7RO%k9n4l5OK8K1J6J6ll3l1OL1J2j2%L0L3QjJ6L4K4%j4j1j1j9l0k8j0J6
595G61K8K0QNjj3j9OM3M8J2k7l3j5j0k5l6k4LK1J4j0k6j1K2M3L7J3j0k2j9LK9L2Lk9l3rJ7
590G96K1Nj3j3J0L9M4K4Kj0j6k4k0kJ1Jrnkk1l8k2J3K7QnOJ3lk3j4J3L1K9J2j4l4k5J4L8J5
$$ plain form
625 984 978 980 979 982 995 1007 989 941 895 883 904 938 966 980 975 960 951 959 977 990 989 976 954 932 917 912 917 925 929 919 895 877 886 912 924 912 892 884 880 867 854 856 876
620 876 903 931 954 960 937 893 850 826 826 842 856 857 849 852 867 876 857 815 781 778 806 845 875 891 898 900 901 901 909 925 929 902 849 802 788 802 820 824 810 797 817 872
615 872 916 903 849 821 845 876 871 854 866 886 866 808 775 800 853 888 892 872 840 816 821 848 860 843 823 831 857 867 851 829 819 824 836 845 844 833 820 812 811 811
610 811 808 802 798 797 792 775 761 771 802 819 803 781 787 810 812 779 726 667 615 604 660 747 791 769 735 735 755 765 772 797 828 840 837 830 806 750 699 700 747 786 789 783
605 783 793 806 806 793 769 730 690 680 715 764 788 777 746 720 718 746 780 788 774 773 800 820 798 750 719 719 729 735 744 766 799 832 854 849 819 798 809 826 796
600 796 721 666 679 733 770 779 785 785 756 702 667 673 701 722 738 754 751 718 687 693 724 736 724 724 754 787 795 794 810 844 868 868 854 843 832 813 783 755 745 761
595 761 789 809 817 822 821 808 789 795 838 886 898 871 838 823 813 788 752 728 731 752 766 756 730 719 741 784 821 834 824 802 783 786 815 847 850 821 788 779 796
590 796 817 822 809 796 806 845 889 913 915 905 889 865 845 843 854 855 846 841 839 818 780 758 771 798 806 801 807 820 817 794 780 793 824 853 865 851 817 792 806 844 859
585H59k9l2J0L8J7j9j8NJ0j3k8j5llLK9M2Nn5p0j6N7Q3N8K2lj8k7k2jJ1Lj5k7k2pJ4K8K4n
580H70m3n6k5K9N5K4l0m8j2K8K5qk5qJ4J8J0J0K1L1K6Kk3k3NL0K6OMRpl9m1rRj0k3PM2K9j0
575H90k3jJ3MlM%j8j4J9M9M5K1Kj4k8k0MJ0j6l1JM1L6j0m1k8jJ7K5K1%j3LK3Lm4m9lL7K7Q
570I46J7K5%k8j0K5J5k3k1K3M1Rj4J0M1L8K0J4Kl0m7j8J9J5ojQk4o8l7N2R4K7o7p9j2M8N2
565A056L2K3K3Pk6m8k9K1M6J1m3m6NM2K4jQK4Pk2j5J3J3lJ0M6M7kl9k8nj6l8l4j0KJJ0J6k
561A080k1qL6N6K2l1n2k9JJ6J7J9K3Pk9m6j2M2N3J0k5oL5M0J1lOJk4l1jL4L6J7PKj0k2rJ7
556A229L0K2J7K7L0J5qj8kK1K9J3j2j3J8M5L1j1l5j7K1L7L0J8J2kk1k9j3J6L6L0Kl1m0j3L1
551A495M1%m3k7L9P9M3k3m1LM8N6M3L9L4J1j0pPJ0RK4N2O1M5K1lk7m6m0k2j1pJ7N4N5Rl1p
$$ plain form
585 859 830 798 808 846 863 844 826 831 841 828 800 785 782 779 782 811 853 858 803 733 717 774 857 915 937 934 916 889 867 866 877 880 865 838 816 809 823 851 875 870
580 870 827 771 746 775 830 854 824 776 764 792 817 809 784 776 790 808 818 828 849 880 906 908 885 862 867 897 923 929 933 942 935 896 855 846 855 845 822 829 871 900 890
575 890 867 866 879 883 880 884 884 866 852 871 920 965 986 988 974 946 926 930 940 924 893 894 935 971 961 920 892 891 908 933 954 954 941 944 967 970 926 877 874 911 938 946
570 946 963 988 988 960 950 975 990 967 946 969 1010 1019 1005 1015 1056 1094 1114 1128 1130 1100 1053 1035 1054 1069 1063 1062 1070 1046 978 941 993 1087 1114 1047 968 956 1004 1056
565 1056 1088 1111 1134 1141 1115 1067 1038 1059 1105 1116 1073 1027 1032 1074 1098 1097 1105 1129 1136 1114 1099 1112 1125 1122 1132 1178 1225 1223 1184 1156 1151 1135 1097 1063 1053 1055 1056 1066 1082 1080
561 1080 1059 1051 1087 1143 1165 1134 1082 1053 1054 1070 1087 1106 1129 1136 1107 1061 1049 1091 1144 1154 1129 1123 1158 1198 1209 1206 1212 1213 1189 1158 1157 1191 1227 1244 1251 1253 1243 1221 1212 1229
556 1229 1259 1281 1298 1325 1355 1370 1362 1344 1342 1363 1392 1405 1393 1380 1398 1443 1474 1463 1428 1411 1432 1469 1499 1517 1529 1527 1506 1477 1464 1480 1516 1546 1548 1517 1477 1464 1495
551 1495 1536 1536 1493 1466 1505 1584 1627 1604 1563 1566 1614 1670 1713 1752 1786 1797 1787 1780 1787 1797 1806 1830 1882 1943 1988 2009 2006 1979 1933 1893 1871 1860 1853 1870 1924 1979 1988 1957 1950
546A950N9R8O5nn1l9J1N0M0Jj5J1M1L8J2NK3L2K2J2J4J8J6J0J0J2J7L3M6L6J5J1L3M9L6J6
542B732K5O3R5R6O7L5K6L9N2M2J3rj0onJK1L6K5JpKOlmJ6M1N3N1L9J5j2j8RL9M1J5okNkmJ7
537C630N3P2O0L4J1j0k7l8l2j0J6M1N2M8M2M8N7L6lj5K3O9P2M8M5N9N0J8J0L9O2N2M1O4R3
532D810Q3M4K4L2M9O0P1P3N6K9J9K4K3J0J0L3N8P1P8Q5Q5P9P2P3P6P7Q5R2Q9Q3Q6J02J15J16
528F972J21J42J65J67J48J28J30J55J76J68J38J19J35J67J88J92J90J86J71J58J65J88K05
526A0674K12K26K51K62K47K23K21K36K49K54K58K63K79L06L30L25K91K48K20K05J95J89J75
523A6339J37Q7N1M3L3mm4o0o5r4j39j65j59j46j48j56j55j53j66j85j83j58j33j34j47j44
520A3952j19r8r9j05r7q8r7j10r0n3m6q9j28j16p7o3r1j22j32j23j14j23j57j99k13j91j63
$$ plain form
546 1950 2009 2107 2172 2167 2116 2077 2088 2138 2178 2179 2164 2175 2216 2254 2266 2271 2294 2326 2348 2360 2374 2392 2408 2418 2428 2440 2457 2490 2536 2572 2587 2598 2631 2680 2716 2732
542 2732 2757 2820 2915 3011 3078 3113 3139 3178 3230 3272 3285 3276 3266 3260 3255 3256 3277 3313 3338 3339 3332 3334 3340 3337 3333 3349 3390 3443 3494 3533 3548 3536 3518 3527 3566 3607 3622 3616 3614 3619 3617 3613 3630
537 3630 3683 3755 3815 3849 3860 3850 3823 3785 3753 3743 3759 3800 3852 3900 3942 3990 4047 4083 4080 4065 4088 4157 4229 4277 4322 4381 4431 4449 4459 4498 4560 4612 4653 4717 4810
532 4810 4893 4937 4961 4993 5042 5102 5173 5246 5302 5331 5350 5374 5397 5407 5417 5450 5508 5579 5657 5742 5827 5906 5978 6051 6127 6204 6289 6381 6470 6553 6639 6741 6856 6972
528 6972 7093 7235 7400 7567 7715 7843 7973 8128 8304 8472 8610 8729 8864 9031 9219 9411 9601 9787 9958 10116 10281 10469 10674
526 10674 10886 11112 11363 11625 11872 12095 12316 12552 12801 13055 13313 13576 13855 14161 14491 14816 15107 15355 15575 15780 15975 16164 16339
523 16339 16476 16563 16614 16657 16690 16686 16642 16582 16517 16423 16284 16119 15960 15814 15666 15510 15355 15202 15036 14851 14668 14510 14377 14243 14096 13952
520 13952 13833 13735 13636 13531 13434 13346 13249 13139 13049 12996 12950 12861 12733 12617 12540 12477 12386 12264 12132 12009 11895 11772 11615 11416 11203 11012 10849
516A0849j61j82k03k24k46k56k42k30k45k65k43j85j49j79k40k61k19j50j15j36j82j99j77
513F160j50j52j67j63j39j13r4p9q0r8j02p8o2r0j26j06m2j9o0r6q2n9p4q7o0k2l5p9q8n0
510C508j7k0l4l3l2m2m8m1m3n6o1m9k9k4l3m6m6k7kOj8n0m9j1J9J2k1m8m5k0QJ7Kk1l5l1j3
505B527RK4J7j3m0m4m0m2l4jL1K2j4j4L7P2M1k5o3n9n0n0m2j3J7K2Oj5k3j5lkroJ1J9jk7l1
500B179oJ5J2nj3mJ9L7L2Oj8j8qj5l1k2J1K7Oj7pJ5Rj6j9MJ5jj2PM1N2K9mj6LL7N3M0K1K2
495B460L2K0j1k5kK4K7J7J5J2lLM1O4L1j9j0N4Q4M0j2qL6O1N2L3J6OK5P2J08R0M2K1L7M7L6
491C516L5O4Q9R0Q2R8J27J42J38J38J56J84K08K21K29K47K88L59M41N09N56O10P05Q52J017
488A1101J163J301J476J710J953K136K218K203K076J784J281N78k37j029j662k051k185k121
$$ plain form
516 10849 10688 10506 10303 10079 9833 9577 9335 9105 8860 8595 8352 8167 8018 7839 7599 7338 7119 6969 6854 6718 6536 6337 6160
513 6160 6010 5858 5691 5528 5389 5276 5182 5103 5023 4925 4823 4745 4683 4593 4467 4361 4319 4300 4240 4144 4062 4003 3929 3842 3782 3760 3725 3646 3558 3508
510 3508 3491 3471 3437 3404 3372 3330 3282 3241 3198 3142 3081 3032 3003 2979 2946 2900 2854 2827 2825 2831 2813 2763 2714 2703 2722 2734 2713 2665 2620 2600 2608 2625 2627 2606 2571 2540 2527
505 2527 2536 2560 2577 2564 2524 2480 2440 2398 2364 2363 2394 2416 2402 2388 2425 2497 2538 2513 2450 2391 2341 2291 2249 2236 2253 2275 2281 2266 2243 2228 2225 2223 2214 2208 2219 2238 2237 2210 2179
500 2179 2173 2188 2200 2195 2182 2178 2197 2234 2266 2272 2254 2236 2228 2213 2182 2160 2171 2198 2204 2187 2180 2195 2204 2188 2169 2173 2188 2187 2175 2182 2223 2275 2304 2300 2284 2287 2324 2377 2417 2438 2460
495 2460 2492 2512 2501 2476 2474 2498 2525 2542 2557 2569 2566 2569 2610 2674 2705 2686 2676 2730 2814 2854 2842 2834 2870 2931 2983 3016 3032 3038 3063 3135 3243 3333 3375 3396 3433 3480 3516
491 3516 3551 3615 3704 3794 3876 3974 4101 4243 4381 4519 4675 4859 5067 5288 5517 5764 6052 6411 6852 7361 7917 8527 9232 10084 11101
488 11101 12264 13565 15041 16751 18704 20840 23058 25261 27337 29121 30402 30980 30743 29714 28052 26001 23816 21695
486B1695j942j728j520j328j143r68q10o79n64m69m02l64l30k83k35j97j50q9l7k0k4j1L0
483H432P8J28J89K54K98L29L80M59N43O29P44Q92J043J192J388J674K015K347K665L032L472
480C2183L919M258M400M297L903L146J970M39j228k725l786m303m332m065l707l360l006k606
478B5397k207j894j676j476j251j044q96p82o70n81n33m95m25l50l25l35l10k23j26p8p2o5
475I583m1nL0O4J02J58K37L28M12M78N47O50Q00R83J169J338J511J707J905K046K086K005
473B8093J770J323O54j50r38j579j992k157k124j984j803j595j381j214j117j033q96p28n96
470A0553n22m65m07l63l31l01k74k64k52k19j88j98k21k02j47j14j16j04o5m6o0n6j8Oj7m0
467E569k3nl1n9m4j7l3o8n8pK2Mj4r%pqMJ0kj3kJ3J5OmoNJ9K0kk6k2JK0K8L5L5J8mp%j5l8
$$ plain form
486 21695 19753 18025 16505 15177 14034 13066 12256 11577 11013 10544 10142 9778 9448 9165 8930 8733 8583 8494 8457 8437 8413 8402 8432
483 8432 8510 8638 8827 9081 9379 9708 10088 10547 11090 11719 12463 13355 14398 15590 16978 18652 20667 23014 25679 28711 32183
480 32183 36102 40360 44760 49057 52960 56106 58076 58515 57287 54562 50776 46473 42141 38076 34369 31009 28003 25397
478 25397 23190 21296 19620 18144 16893 15849 14953 14171 13501 12920 12387 11892 11467 11117 10792 10457 10147 9924 9798 9720 9648 9583
475 9583 9542 9537 9567 9631 9733 9891 10128 10456 10868 11346 11893 12543 13343 14326 15495 16833 18344 20051 21956 24002 26088 28093
473 28093 29863 31186 31840 31690 30752 29173 27181 25024 22900 20916 19113 17518 16137 14923 13806 12773 11877 11149 10553
470 10553 10031 9566 9159 8796 8465 8164 7890 7626 7374 7155 6967 6769 6548 6346 6199 6085 5969 5865 5800 5754 5694 5638 5620 5626 5609 5569
467 5569 5546 5541 5510 5451 5407 5390 5357 5289 5231 5224 5246 5250 5236 5227 5227 5220 5212 5216 5226 5224 5211 5209 5222 5237 5243 5239 5233 5238 5257 5277 5275 5249 5227 5228 5248 5276 5311 5346 5364 5360 5353 5353 5338 5300
462E300k6K6O3M5Kj6JK3L5L6K9RqmJ6L4L7L8M1L3ln4q1n8MO0Q2P3N3L0PKJ9M1M1J5mlQJ4J5
457E975K2L3M1M5M7M5M0L3L3M2N7O8O0M0L1M1N5O0N8O2O5N4L4K4L4M7N2M5L1K2K1L3M4N2O4
453G510Q7J02R0O0M4N4P6Q6Q1O6N2N6P9R0P0L2J5L1O2R2J16J17Q7N1M8P8J00R6Q5Q8R3R0Q8
448I972R3R1Q0Q2J01J11J00R5J19J45J32R5P3Q7J20J52J61J39R9P5Q9J15J27J33J49J57J43
445A3035J28J46J87K06J84J50J40J45J48J46J47J55J68J72J66J58J66J87K02K04K10K25K30
442A7005K14K00K04K13K06J99K11K24K22K33K70K94K57K01K03K63K93K59K26K46K83K93K90
440B2509L06L23L13K98L08L20L03K82K98L29L21K79K74L20L64L64L49L59L86M03M06M08L99
437C0221L72L46L57L97M24M12L77L63L86M18M24L99L85M06M35M33M09M03M33M55M43M22M29
$$ plain form
462 5300 5274 5300 5363 5408 5410 5394 5395 5418 5453 5489 5518 5527 5519 5515 5531 5565 5602 5640 5681 5714 5711 5657 5576 5518 5522 5582 5664 5737 5790 5820 5827 5829 5848 5889 5930 5945 5941 5938 5946 5960 5975
457 5975 5997 6030 6071 6116 6163 6208 6248 6281 6314 6356 6413 6481 6541 6581 6612 6653 6708 6768 6826 6888 6953 7007 7041 7065 7099 7146 7198 7243 7274 7296 7317 7350 7394 7446 7510
453 7510 7597 7699 7789 7849 7893 7947 8023 8109 8190 8256 8308 8364 8443 8533 8603 8635 8650 8681 8743 8835 8951 9068 9155 9206 9254 9332 9432 9528 9613 9701 9794 9884 9972
448 9972 10065 10156 10236 10318 10419 10530 10630 10725 10844 10989 11121 11216 11289 11376 11496 11648 11809 11948 12047 12122 12211 12326 12453 12586 12735 12892 13035
445 13035 13163 13309 13496 13702 13886 14036 14176 14321 14469 14615 14762 14917 15085 15257 15423 15581 15747 15934 16136 16340 16550 16775 17005
442 17005 17219 17419 17623 17836 18042 18241 18452 18676 18898 19131 19401 19695 19952 20153 20356 20619 20912 21171 21397 21643 21926 22219 22509
440 22509 22815 23138 23451 23749 24057 24377 24680 24962 25260 25589 25910 26189 26463 26783 27147 27511 27860 28219 28605 29008 29414 29822 30221
437 30221 30593 30939 31296 31693 32117 32529 32906 33269 33655 34073 34497 34896 35281 35687 36122 36555 36964 37367 37800 38255 38698 39120 39549
434C9549M49M44M21M17M49M70M52M18M04M16M23M18M17M25M33M26M08L98M10M34M44M32M10
431D9367M08M20M22M09M02M12M11L86L68L91M28M25L83L59L82M08L90L51L48L82M10M06L79
428E8447L59L56L60L64L56L36L14L01K94K94L12L40L44L06K56K45K63K65K40K28K47K62K43
425F5332K04J82J89K07K28K43K27J79J34J29J50J54J28J08J25J61J65J22P3O5R2J00O5K1K2
422F8805N9P6M6Pnmj7l4k2J8L8J9k1m9o4p9j00j12j10j04j09j26j38j41j46j69j96k02j89
419F6931j85j97k14k31k60k96l06k75k30k13k24k38k39k42k54k77k98k96k62k21k11k38k53
416F1271k33k18k62l32l51l05k60k72l05l12k86k65k60k44k12j93k14k59k77k56k30k48k95
413E5182l23l09k91l00l08k86k63k83l41l82l81l74l88m09m23m42m64m58m18l86m05m56m78
$$ plain form
434 39549 39998 40442 40863 41280 41729 42199 42651 43069 43473 43889 44312 44730 45147 45572 46005 46431 46839 47237 47647 48081 48525 48957 49367
431 49367 49775 50195 50617 51026 51428 51840 52251 52637 53005 53396 53824 54249 54632 54991 55373 55781 56171 56522 56870 57252 57662 58068 58447
428 58447 58806 59162 59522 59886 60242 60578 60892 61193 61487 61781 62093 62433 62777 63083 63339 63584 63847 64112 64352 64580 64827 65089 65332
425 65332 65536 65718 65907 66114 66342 66585 66812 66991 67125 67254 67404 67558 67686 67794 67919 68080 68245 68367 68440 68505 68597 68697 68762 68783 68805
422 68805 68864 68940 68986 68993 68988 68984 68967 68933 68911 68929 68967 68986 68965 68916 68852 68773 68673 68561 68451 68347 68238 68112 67974 67833 67687 67518 67322 67120 66931
419 66931 66746 66549 66335 66104 65844 65548 65242 64967 64737 64524 64300 64062 63823 63581 63327 63050 62752 62456 62194 61973 61762 61524 61271
416 61271 61038 60820 60558 60226 59875 59570 59310 59038 58733 58421 58135 57870 57610 57366 57154 56961 56747 56488 56211 55955 55725 55477 55182
413 55182 54859 54550 54259 53959 53651 53365 53102 52819 52478 52096 51715 51341 50953 50544 50121 49679 49215 48757 48339 47953 47548 47092 46614
410D6614m50m01l77l85m04m15m13m03l88l70l56l53l63l65l52l42l54l62l42l06k95k99k80
408C8239k47k51l08l51l27k63k24k32k60k85k87k52k05j98k43k85k73k37k35k58k62k43k45
405C2268k71k85k74k58k55k58k68k99l30l17k71k45k69l03l02k75k52k31k15k17k46k78k80
402B6069k55k24j99j92k13k44k53k29k03j96j98j94j95k07k07j85j68j80j99j91j71j62j60
399B1444j44j26j36j60j53j16j04j44j94j98j55j12j02j21j47j57j51j40j44j58j63j44j12
396A8163q3o9p1r2j22j37j28j12j08j12j12j02r5j01j14j21j07q7q1r5j06r3o6n7p3j03j19
393A5497j17r8p5p2r6j22j16p6m1m4p3q8p8p0q6j03r7o9n5o9q8p9n8n8q0r4q2p0p4p7n7m2
389A2993n5p4o7m7n9r5r6m3Oj7q0j05o8k5l3p5r5p6n2n7p5p3m4k4l9o5p0n3m4n3o2n4m1m2
$$ plain form
410 46614 46164 45763 45386 45001 44597 44182 43769 43366 42978 42608 42252 41899 41536 41171 40819 40477 40123 39761 39419 39113 38818 38519 38239
408 38239 37992 37741 37433 37082 36755 36492 36268 36036 35776 35491 35204 34952 34747 34549 34306 34021 33748 33511 33276 33018 32756 32513 32268
405 32268 31997 31712 31438 31180 30925 30667 30399 30100 29770 29453 29182 28937 28668 28365 28063 27788 27536 27305 27090 26873 26627 26349 26069
402 26069 25814 25590 25391 25199 24986 24742 24489 24260 24057 23861 23663 23469 23274 23067 22860 22675 22507 22327 22128 21937 21766 21604 21444
399 21444 21300 21174 21038 20878 20725 20609 20505 20361 20167 19969 19814 19702 19600 19479 19332 19175 19024 18884 18740 18582 18419 18275 18163
396 18163 18080 18011 17940 17848 17726 17589 17461 17349 17241 17129 17017 16915 16820 16719 16605 16484 16377 16290 16209 16114 16008 15915 15849 15792 15719 15616 15497
393 15497 15380 15282 15207 15135 15039 14917 14801 14725 14684 14640 14567 14479 14401 14331 14245 14142 14045 13976 13921 13852 13764 13685 13627 13569 13489 13395 13313 13243 13169 13092 13035 12993
389 12993 12938 12864 12797 12750 12691 12596 12500 12457 12463 12446 12366 12261 12193 12168 12135 12060 11965 11889 11837 11780 11705 11632 11588 11564 11525 11460 11390 11337 11293 11240 11178 11124 11083 11041
385A1041o0p6p7o2m1l3m8p6r0q4o9m9k5rj9m9o1m2k7m0o1n5k3%rk6l2k6k3k3k5k2k0k9n4p8
381I498q0n1k3j8k5k7k9m3n9m9k3oj1j7j4j2j4j0%KpqKOmmJ7K9%m7n9k3J1QrmK8N4N4L3Oq
375I064kK5M6L4%j7LK2Qj8j6J1J9kk2j4lj0k7l4m3n5m8j2Lk8o2m0J2K0k5m7j6J4Jk3k0nlP
371H697L7N6L4RK2N1M8J6PL0O1Q4J08J20J12J01J13J26J05P0O4P1L6m0q9q8q6j12j25r5p0
367I473r5j40j47j18r8r8r6p5n2l8m9q2j04p0LL0l5j22j29o2qj4l8m2l4k1jJ7Pj7rL1M6Rk2
363G800qK0J1k1k4OK8L3M3O4O5L9Oj4k7l8m2l9l6n0o8p6o3m2l3n2q3r4o8l1j6k3l7n1p4r7
358F908r8p2m4l0l0l1l1l1l6n8q9j02p0j3J8lm0n3m6m4m8m7m3m1k7NK9J1m0p4o4l3k0l2n3
354E528o8o7n7m3l0j0K1M0K3qj1J2J1l6p9o6j7J1kk7m0m8n2m1j9rj6j9rLLpk2m2n2l9j8k0
$$ plain form
385 11041 10981 10905 10828 10766 10725 10692 10644 10568 10478 10394 10325 10276 10251 10242 10223 10174 10113 10071 10044 10004 9943 9888 9865 9865 9856 9830 9798 9772 9749 9726 9701 9679 9659 9630 9576 9498
381 9498 9418 9367 9344 9326 9301 9274 9245 9202 9143 9094 9071 9065 9054 9037 9023 9011 8997 8987 8987 8989 8982 8974 8976 8982 8978 8974 8991 9020 9020 8973 8914 8891 8902 8910 8901 8897 8925 8979 9033 9066 9072 9064
375 9064 9062 9087 9133 9167 9167 9150 9153 9175 9183 9165 9149 9160 9179 9177 9155 9141 9138 9128 9101 9067 9024 8969 8921 8909 8912 8884 8822 8782 8794 8814 8789 8742 8726 8740 8741 8718 8698 8693 8690 8697
371 8697 8734 8790 8824 8833 8855 8906 8954 8970 8977 9007 9068 9152 9260 9380 9492 9593 9706 9832 9937 10007 10071 10142 10178 10138 10049 9961 9875 9763 9638 9543 9473
367 9473 9378 9238 9091 8973 8875 8777 8681 8606 8554 8516 8467 8385 8281 8211 8214 8244 8209 8087 7958 7896 7888 7874 7836 7794 7760 7739 7738 7755 7762 7745 7736 7767 7813 7822 7800
363 7800 7792 7812 7823 7802 7778 7784 7812 7845 7888 7952 8017 8056 8062 8048 8021 7983 7941 7902 7866 7816 7748 7672 7609 7567 7534 7482 7399 7305 7237 7206 7190 7167 7130 7079 7005 6908
358 6908 6810 6738 6694 6664 6634 6603 6572 6541 6505 6447 6358 6256 6186 6173 6191 6188 6148 6095 6049 6005 5957 5910 5867 5826 5799 5804 5833 5844 5804 5730 5666 5633 5613 5581 5528
354 5528 5460 5393 5336 5293 5263 5253 5274 5314 5337 5329 5318 5330 5341 5305 5226 5160 5143 5154 5152 5125 5085 5037 4985 4944 4925 4916 4900 4881 4872 4875 4878 4871 4849 4807 4755 4716 4698 4678
349D678m1m0kK2j4p4q8m2MJ2mj3j4j4j0lj4l8n2m0k5l2n2n5l1jK1K6Nl6o6n8k2QJ8J2nl2n0
344C838l5jNl1o3m9LM0L7Jl7n5l8kJ9Oj3qKj3m5n4k9%J0J1J1QKMPj3m1l3J0L0j0n5m3NJ9j8
339C382n2m7k9k2j2J2K4Mk6l3k6k5k4j3MNrk5m1n0l2J7M9K2m3p9n2jJ7lk6k3mNj3m8p1o1j7
335B634M0P6O1Rk9j2K5J9l5o6l1K3M1K6J5Qj3k6pJ0k2o7m2L9P0Mo7n5npn3o1j6K4K8J8J7k
330B571m4p3m9PM7M5Rk9l6j0J1ll4m1j6Mmj8j1J6L1J7j7m4l5jJ8%k4j3J2%m6o1k8RJ5J6M0
325B231O2M1nl6m2m7n1l9rK6M9N1J9l0n6l0J4K3jk0k0j3lJ4K4J0j1j3j2l6o6n6j4Kk1k8RM1
320A957K7kJK3K4RMKj8l8l0mJj2oJ5J6j3k6oJ1jj7j0J0J4jj4j5pLLj6m2l9mL5M6K6lk3k5q
315A847J1Rj1j9onl5n6k7K7M7J7k0l4l1j8KK6L3J6mj6j6nJ3K1Lj6j0J2J2j3k8k3j7j5jK5K1
$$ plain form
349 4678 4637 4597 4595 4617 4603 4529 4441 4399 4403 4415 4411 4398 4384 4370 4360 4357 4343 4305 4253 4213 4188 4156 4104 4049 4018 4017 4038 4064 4069 4033 3967 3909 3887 3895 3913 3925 3920 3888 3838
344 3838 3803 3802 3807 3776 3713 3664 3667 3707 3744 3745 3708 3653 3615 3613 3632 3638 3625 3617 3619 3606 3561 3507 3478 3478 3488 3499 3510 3518 3520 3524 3531 3518 3477 3444 3454 3484 3474 3419 3376 3381 3400 3382
339 3382 3330 3283 3254 3232 3220 3232 3256 3260 3234 3201 3175 3150 3126 3113 3117 3122 3113 3088 3047 2997 2965 2982 3031 3053 3010 2931 2879 2878 2895 2892 2866 2843 2839 2844 2831 2783 2712 2651 2634
335 2634 2674 2750 2811 2820 2791 2779 2804 2823 2788 2722 2691 2714 2755 2781 2796 2804 2791 2765 2758 2768 2746 2679 2637 2676 2746 2750 2683 2628 2623 2616 2563 2502 2486 2510 2538 2556 2573 2571
330 2571 2527 2454 2405 2412 2459 2504 2513 2484 2448 2438 2449 2446 2412 2371 2355 2359 2355 2337 2326 2342 2373 2390 2373 2329 2294 2293 2311 2311 2287 2274 2286 2286 2240 2179 2151 2160 2175 2191 2231
325 2231 2293 2334 2329 2293 2251 2204 2153 2114 2105 2131 2180 2231 2250 2220 2164 2134 2148 2171 2170 2150 2130 2117 2114 2128 2152 2162 2151 2138 2126 2090 2024 1968 1954 1956 1935 1907 1916 1957
320 1957 1984 1982 1983 2006 2030 2039 2043 2045 2027 1989 1959 1955 1956 1944 1938 1953 1969 1956 1930 1924 1935 1934 1917 1907 1917 1931 1930 1916 1901 1894 1897 1900 1884 1842 1803 1799 1834 1880 1906 1903 1880 1855 1847
315 1847 1858 1867 1856 1837 1831 1826 1791 1735 1708 1735 1782 1799 1779 1745 1714 1696 1698 1724 1757 1773 1769 1753 1737 1732 1745 1766 1769 1753 1743 1755 1767 1754 1726 1703 1686 1671 1670 1695 1716
310A716k1n3l2J7M4L9K6J1j1l0l3l0k9j5K1M0J0l9m6pJ9J5J2K8L2Ll1l5j9j1j2%J8K0PkkK
306A622jpqn%mk0k7lL4M4J1k1j2J9K6%j4LJ5j2m9m9j1J9Qj2j0Knk2j9NJ2rk4j2lk1l1MM8M5
301A506jj7J3L3Rk0j2Lok1j1Nkj5LL1K6nj1J2J5j3l2j8j1l0m1j3K7L2Qj0pRK8M8M3Kl7k9J3
296A504K8qn2o5m8j9J4M1M5K2QJ4J1j9m5k5K1L5J0pMJ1j4m3m2k2oKK0L0Rk1k3nkk4l7k8j6
291A258rQL3L6J2oJJk6m7k4K3M6K9Ooj3j7j2JPPN%j0j2opk3l0pJ6%l9m7j1K7L4K0J5J9K3K3
285A298J3j0k7j6RJ1oqQJ4JpJlk9l5KM2L7Lj1MK0J6%k4m1k9J0L8K7MMJ4Kk6l8l0k2j5JJ5L
280A220j8j8LJ3J3K1L2J6j9l4k6k1j9RM7M0k0n7k2K7K1j8j9J3J5k7n7l4J0L3L6L1K0MmOJ3
276A230Nnnmj1j6j0oj9l5k6NK1J7J2K5L0Ll8o1m4oK5K9RrlK1K2rl4j8J4K0KJ1M5N2Nm5m0m
$$ plain form
310 1716 1695 1642 1610 1627 1671 1710 1736 1747 1736 1706 1673 1643 1614 1599 1620 1660 1670 1631 1585 1578 1597 1612 1624 1652 1684 1687 1656 1621 1602 1591 1579 1579 1597 1617 1624 1622 1620 1622
306 1622 1621 1614 1606 1601 1601 1597 1577 1550 1547 1581 1625 1636 1615 1603 1622 1648 1648 1634 1637 1652 1640 1591 1542 1531 1550 1558 1546 1536 1538 1533 1511 1492 1497 1509 1500 1476 1464 1461 1440 1409 1413 1461 1506
301 1506 1505 1488 1501 1534 1543 1523 1511 1514 1508 1487 1476 1481 1479 1464 1467 1498 1524 1519 1508 1520 1535 1522 1490 1472 1461 1431 1390 1377 1404 1436 1444 1434 1427 1436 1464 1512 1555 1557 1520 1491 1504
296 1504 1532 1524 1472 1407 1359 1340 1354 1395 1440 1462 1470 1484 1495 1476 1431 1406 1427 1462 1472 1465 1469 1480 1466 1423 1381 1359 1353 1355 1375 1405 1414 1393 1370 1365 1363 1339 1302 1274 1258
291 1258 1249 1257 1290 1326 1338 1332 1333 1334 1308 1261 1237 1260 1306 1335 1341 1335 1322 1305 1293 1294 1301 1308 1313 1313 1303 1291 1285 1278 1255 1225 1218 1234 1234 1195 1148 1137 1164 1198 1218 1233 1252 1275 1298
285 1298 1311 1301 1274 1258 1267 1278 1272 1264 1272 1286 1287 1280 1281 1278 1249 1214 1216 1258 1295 1298 1287 1291 1311 1327 1327 1303 1262 1233 1243 1281 1308 1312 1316 1330 1332 1306 1268 1238 1216 1201 1202 1217 1220
280 1220 1202 1184 1187 1200 1213 1234 1266 1282 1263 1229 1203 1182 1163 1172 1219 1259 1239 1182 1160 1187 1208 1190 1171 1184 1199 1172 1115 1081 1091 1124 1160 1191 1211 1215 1211 1217 1230
276 1230 1235 1230 1225 1221 1210 1194 1184 1178 1159 1124 1098 1103 1124 1141 1153 1178 1208 1211 1173 1112 1068 1062 1087 1116 1125 1116 1113 1134 1156 1147 1113 1095 1109 1129 1131 1142 1187 1239 1244 1199 1159 1155
271A155J1koOPlKJ3nm8o4j8M7O9L5j3l4k2QK6J7qk0j9j8k3j2QPj5k3QL8K6rj7RL3L3K1Ok1
265A185n1n1mM6M8Ol4l6j8j3k7l2oL1M4K5mk4l0k2JL1M4L4K1J7J3j1m3n6m4k2njj2k2pK2K6
261A019j3m5k0L8O1L5Njmj0LL6M0j2o5n8j1J3KKK7K8j9o7n3QM7K8j4l2j9JJ3J7J5Kj3mL2N3
256A065K5k8m3j0L1L4J1j0j6k0k0j6j3rMK8L4J1j9k4j5j8j7J1M7M0j3m2j1L5L6J1MJ7Pl0m9
251A028l5j1JJ2K4K1pk8k0JQRJ8K9K5Mk1l9m6k6J0L4K1kLK6K4JqJ5L1J2k6m8m8l9j9PK6K1
246I88NjNP%rj7k0k1j7j2nJ5M3N5L8Mk3l9m9m1j0L0N0M0K0Kj7l2k7%L0L4J0k5l7j5K3M0L0
241A052J1kk2m8m8rK9L0J1J3K5Pl7m5jL9K4j9l4j2J0Nj6k6j3J3K8J8mrMJ3PLJ5K2J4NKj4m2
236I99n3l1noj4J0M6M7J1j6nJ3Mk0l2k8j4mK%%RJ5%k3j9J6M0J7l0m0kL7L2ql6k5QK7J8pl5
$$ plain form
271 1155 1166 1164 1158 1164 1171 1168 1170 1183 1178 1130 1066 1048 1095 1164 1199 1186 1152 1130 1138 1164 1181 1173 1153 1134 1116 1093 1081 1089 1096 1081 1058 1066 1104 1130 1121 1104 1113 1146 1179 1200 1206 1185
265 1185 1134 1083 1079 1125 1173 1179 1145 1109 1091 1078 1051 1019 1013 1044 1088 1113 1109 1085 1055 1033 1034 1065 1109 1143 1164 1181 1194 1183 1140 1084 1040 1018 1013 1012 1000 978 971 993 1019
261 1019 1006 961 941 979 1040 1075 1080 1079 1075 1065 1068 1104 1144 1132 1067 1009 998 1011 1013 1015 1042 1070 1051 984 931 939 986 1014 1000 968 949 950 963 980 995 997 984 980 1012 1065
256 1065 1090 1062 1019 1009 1040 1074 1085 1075 1059 1039 1019 1003 990 981 985 1013 1047 1058 1039 1015 1000 982 965 976 1023 1063 1050 1008 997 1032 1068 1079 1083 1100 1107 1077 1028
251 1028 993 982 983 995 1019 1040 1033 1005 985 986 994 1003 1021 1050 1075 1079 1058 1019 973 947 957 991 1012 1010 1013 1039 1063 1064 1056 1071 1102 1114 1088 1040 992 953 934 941 967 988
246 988 993 992 997 1004 1004 995 978 958 937 920 908 903 918 961 1016 1054 1058 1035 996 947 906 896 926 976 1016 1036 1038 1021 989 962 962 992 1026 1036 1011 974 959 982 1022 1052
241 1052 1063 1061 1039 991 943 934 963 993 1004 1017 1042 1049 1012 967 966 1005 1029 1010 976 964 974 979 963 937 924 937 965 983 979 970 974 987 994 997 1012 1034 1048 1053 1055 1041 999
236 999 946 915 910 904 890 900 946 993 1004 988 983 996 1000 980 948 920 906 902 904 904 904 913 928 928 905 886 902 942 959 929 889 887 924 956 948 912 887 895 922 940 933 898
231H98m6k1L4P0M7mj3K2K7l3r5p8jM8L8J7J4J3mj9j8j3j3pLol4l8nK5J5j9l0j4LQLoj5oK1
226G68M2L5J5QJ6J8Rpk9n3n5j8K7M2L0K5L2K9J1%%nj7j7jRMLJ4J5j5l7j2M2O3K5l2n7m2k2
221H63k1k8k0MK4K5J3J2J9J0j5l5j9K0M2K2k4n2l4J7N7N5J7k1l1j0Qml4m5j4L1M1Qk0j1J2
217H62Nk7m0j8QJ8K4L9M1K3MRJ1j8n9o1j8L4N7N6M1Nm2p2n7j2K0J8nj6kJ7J4j5m2l5jL1L7
212H34K0rl1k7ML8L9K0K1M0L1k1o1m3JOk2k2K2M7J4l9n1j9J2K1J7Qj5l4l2pJ5K1J0j4l7l7
207G20jM2N2K2j0j7nJ0K5L6K8Lk1k2qMjj6k7k1pKllRJ2rk5LM8M4j3m7j3M2N0J7mmj0k5j9K
202H40Qj1k2lJ9K1Mj3j9j5jJ0NKJ9L8K7oj9nlk3k5RL6J3l3m1qJ6Ok2l9k9RN4N4jn3m0J2L2
197H03Jk2qJ0KnJ5K9Pl0l8k6k4k2PM4L7j0m4m2l4m1l0J4M7K4k4k6K7P6P0K7jJ1L6M3J6l2o5
$$ plain form
231 898 852 831 865 935 982 978 965 987 1014 981 886 808 807 855 893 910 924 937 933 914 896 883 870 863 866 860 826 788 783 808 823 804 774 760 763 771 774 768 753 747 768
226 768 810 845 860 868 884 902 911 904 875 822 767 749 776 818 848 873 905 934 945 945 945 940 923 906 905 914 918 921 935 950 935 898 886 928 991 1016 984 927 885 863
221 863 842 814 794 798 822 847 860 872 891 901 886 851 832 852 894 916 892 840 806 823 880 935 952 931 900 890 898 894 860 815 801 832 873 881 861 850 862
217 862 867 840 800 782 790 808 832 871 912 935 939 948 959 941 882 821 803 837 894 950 991 996 954 882 825 813 833 851 846 830 828 845 859 844 802 767 766 797 834
212 834 854 845 814 787 791 829 868 888 909 949 980 959 898 855 856 862 840 818 840 887 901 862 811 792 804 825 842 850 835 801 769 762 777 798 808 794 757 720
207 720 719 761 813 835 825 808 803 813 838 874 902 905 884 862 854 858 857 841 814 793 786 788 785 782 791 803 794 769 772 820 864 851 804 791 833 883 900 896 892 882 857 838 840
202 840 848 837 815 812 831 852 856 843 824 809 808 818 823 825 844 882 909 903 884 879 876 853 828 837 873 886 853 812 804 820 826 804 765 736 745 799 853 852 799 759 771 803
197 803 804 782 774 784 786 781 796 825 832 802 764 738 714 692 699 743 780 770 726 684 650 609 579 593 640 664 640 614 641 717 787 814 813 824 860 903 919 887 822
192H22o0k6NJ1MRL1M0J4k3k7J5N0L0k9n9l8j0j5k9j8%oj5RM4K9k7m8pK8J2j1J0L7J0l6l4J2
188G04L0mk9j8JLJ6M5M3ll4lM4L8j8o3o6m6j5K5N5M6Mk5k1%J4J1rl0l1kK3K1J0J3J6pk9pL8
183G40M8Pk4j4jpj2MNk0k9OM6M0P%J5Rj6k2%J7RkJONLkj3k0rOLj0mJ3Ok3k9%J9Kj5oJ2Roq
177G46j3k9l4%N1P1M8J5j0k7k9j3Nnk9k4J1K8Kl3l3kK7L2J7j2l7l9j4J4K7L1L3K4kk2j9%J4
172G70J2Lqj8k1j2OJ7J9J1ok6l1j2PMj7j8OK3J2mjJ8L0K8J8ll0m0j9J7K9Pj7j5mqk6l0j0J8
167F79L4L2J8lk4l1k3j4j9k3nK7M4K9ok6j5J0K4J6jmJ1K4K2J2Jk2n3n9j0O6R6M8k0n1m1l5
162G08l3j3K4L6J0j6qK2L5J3j7l0j7J0K7J9j1l5m1k9j7oPK1K8K9L1K8Pk3m0k7KJ8J0j0j9j5
157F78j1j2j6j3nOJ8K2J5RJ9L4K3k5o0m0MJ1k7m7k2J3J6RK8O2O3K1j9k0PL4L6Nl6m7k1Lj7
$$ plain form
192 822 762 736 741 752 756 765 796 836 850 827 800 815 865 895 866 807 769 759 744 715 697 697 691 676 685 729 758 731 683 676 704 716 705 715 752 762 726 692 704
188 704 734 730 701 683 684 687 703 748 791 788 754 751 795 833 815 752 686 640 625 650 705 751 755 730 709 709 723 734 725 695 664 662 685 706 716 729 745 738 709 702 740
183 740 788 795 771 757 756 749 737 741 746 726 697 703 749 789 796 796 811 820 804 782 782 799 808 806 807 813 818 821 819 806 786 777 783 786 776 772 785 791 768 739 739 758 760 745 739 751 760 754 746
177 746 733 704 670 670 721 792 840 855 845 818 789 776 781 776 747 723 734 762 764 731 698 696 723 755 772 760 723 684 670 684 711 742 775 799 797 775 756 756 770
172 770 782 785 777 759 738 726 732 749 768 779 773 747 716 704 711 715 698 680 686 709 721 717 716 734 764 792 810 807 777 737 718 735 764 771 754 739 735 727 701 671 661 679
167 679 713 745 763 760 736 705 682 668 649 626 621 648 692 721 715 689 674 684 708 724 723 719 730 754 776 788 789 767 714 655 645 711 807 855 835 784 743 708
162 708 675 662 686 722 732 716 708 730 765 778 761 731 714 724 751 770 759 724 683 654 637 631 638 659 687 716 747 775 782 759 719 692 694 712 722 712 693 678
157 678 667 655 639 626 621 627 645 667 682 691 710 744 767 742 682 642 646 657 630 583 561 574 590 599 627 689 752 773 754 734 741 775 811 816 780 733 712 715 698
153F98n9o8l9j1ML3P9R0M6lmK3K0j4k8pMj8m1l1jJ5J3J5K7K5om6n2j3M2P0N5J7j8k8k0j1j5
148G43l0l3rJ8J8j1k5jK9L1J1LRRpj6oMlj5j4omj3k2k0pNml0l8mN4P6M9J2MJ4Mk3m4n0m7l0
142E81QM3N4M4M0L6Nm2o1l7j4j6j1K7O0L6k1m6k2%j2l0k1KJ0ONRJ1J4J6mm9q1n6J3N9M4Lj1
138E92PJ5j2m4l4K0O6N8J2k0j6JLooK%j3k4k3rJ3L4M7L8J5KNJ3J0pj3OM1N5K4l2n6k8J8L5
133G89K1Lnj3l0m1l6k5j8j4j3j4qJ9O0P5M3j2m6m5l5m0m8k9J5N2M9J7j1k2l3m2k1L3P2N1j
128F97j2K6M4Kn4n6rL0L2J7Kj8l6l3j0Kqj3PL1K6MjK2M3L2om4n9m1KL3J9k6m9k2J2Ok5k1K2
123E68M5K1qQM6M4Nk6k1mjlnnoLJ6J8PMJ2J8K2L0L0Qk2k2MPl3o6n2j1J2J6K7M2L7J3pj4j8
118G39k0k1l0m9m4%M2L9J2RL5M0nn6o2j5L8N6K4k2l8j2J7J3pj0JOPJ7K6J4nrj3l9o4m3J0L0
$$ plain form
153 698 639 571 532 521 525 558 637 727 773 770 766 789 809 795 767 760 764 746 705 674 673 688 701 716 743 768 762 716 664 651 693 763 818 835 817 789 769 758 743
148 743 713 680 671 689 707 696 671 670 699 730 741 744 753 762 755 739 733 737 734 719 705 699 695 682 660 640 633 638 634 604 566 562 616 692 741 753 757 771 775 752 708 658 611 581
142 581 589 632 686 730 770 806 811 769 708 671 657 641 630 657 717 753 732 686 664 664 652 622 601 603 613 619 624 633 644 658 674 670 621 540 484 497 556 600 603 592
138 592 599 614 602 558 524 544 610 668 680 660 644 645 648 642 636 638 638 625 601 578 569 582 616 663 701 716 718 723 736 746 739 726 732 773 828 852 820 764 736 754 789
133 789 810 813 808 795 765 724 688 663 645 631 618 604 596 615 675 750 793 781 735 690 655 615 567 538 553 605 654 671 660 638 605 563 542 575 647 698 697
128 697 685 711 755 757 703 647 638 668 700 717 719 701 665 632 622 624 616 603 610 641 667 671 670 692 735 767 761 717 658 617 619 652 671 645 596 574 586 592 567 546 568
123 568 613 634 626 634 680 724 729 703 682 678 677 674 669 664 658 661 677 695 702 706 718 736 758 788 818 826 804 782 786 793 760 694 642 631 643 659 686 728 765 778 771 757 739
118 739 719 698 668 619 575 575 617 656 668 677 712 752 747 691 629 614 652 708 732 710 672 660 677 690 683 673 674 680 687 704 730 744 739 730 717 678 614 571 581 611
113F11J0kJ6K6NmJ6K5ol4j4K5L1J6J4J7j1m4l2J8M0Nl5l0jNj7l2k1lJKJ2K6J3l0n8k7L5O3
108F31M0RQJ8J3JQJ7J0j3l0l7m0k9KL0K5nk2j3RK8L3K1krNOl0o1k8N0Q5M3k4m3j2K2K1Mj0
$$ plain form
113 611 621 619 635 661 666 662 678 703 697 663 649 674 705 721 735 752 741 697 665 683 723 728 693 663 662 667 650 618 597 594 595 597 609 635 648 618 560 533 568 631
108 631 671 680 688 706 719 720 728 745 755 742 712 675 635 606 608 638 663 658 636 623 632 660 693 714 712 703 708 714 684 623 595 645 730 773 749 706 694 716 737 741 731
$$ [...]
-1604D15
##END=	
##END=	
