##TITLE=	Dec04-2021.22.ser
TM-VI-191, CD3OD cosy
##JCAMP-DX=	6.0	$$ MestReNova 14.3.0-30573
##DATA TYPE=	LINK
##BLOCK_ID=	1
##BLOCKS=	2    
##ORIGIN=	Mestrelab Research S.L.
##OWNER=	hrzepa
##$MNOVA/LINK_BLOCK_TYPE=	ITEM	$$ NMR Spectrum
##$MNOVA/ITEM/POLYGON=	(XY..XY)
5321,5835
8722,5835
8722,8208
5321,8208
5321,5835
##$MNOVA/ITEM/Z=	0
##$MNOVA/ITEM/ANGLE=	0
##TITLE=	Dec04-2021.22.ser
##JCAMP-DX=	6.0	$$ MestReNova 14.3.0-30573
##BLOCK_ID=	2
##DATA TYPE=	MNOVA NMR VIEW DATA
##DATA CLASS=	MNOVA VIEW DATA
##$MNOVA/2D/THRESHOLD=	3.9147446155548095703
##$MNOVA/ITEM/ZOOM/X=	-0.9813552402563912036,	11.004811535457610816
##$MNOVA/ITEM/ZOOM/Y=	-0.9813552402563912036,	11.004811535457610816
##END=	
##TITLE=	Dec04-2021.22.ser
##JCAMP-DX=	6.0	$$ MestReNova 14.3.0-30573
##BLOCK_ID=	3
##DATA TYPE=	nD NMR SPECTRUM
##DATA CLASS=	NTUPLES
##NUMDIM=	2
##ORIGIN=	Bruker BioSpin GmbH
##OWNER=	nmr
##.OBSERVE FREQUENCY=	400.32200160000002143
##.OBSERVE NUCLEUS=	^1H
##.SOLVENT NAME=	MeOD
##.PULSE SEQUENCE=	cosygpqf
##LONGDATE=	2021/12/04 16:28:28.000
##.ACQUISITIONMODE=	SIMULTANEOUS (DQD)
##$ORIGINAL FORMAT=	Bruker XWIN-NMR
##$MNOVA/SCALES_VERSION=	7
##$PARAMETER FILE=	(acqu2s, ASCII, //ch-nmrserv10.ch.ic.ac.uk/Av400B/agmb/nmr/Dec04-2021/22/acqu2s, 0)
$$ ##TITLE= Parameter file, TOPSPIN		Version 3.2
$$ ##JCAMPDX= 5.0
$$ ##DATATYPE= Parameter Values
$$ ##NPOINTS= 129	$$ modification sequence number
$$ ##ORIGIN= Bruker BioSpin GmbH
$$ ##OWNER= nmr
$$ $$ 2021-12-04 16:38:00.544 +0000  nmr@CZC2524DW0
$$ $$ /opt/topspin/data/agmb/nmr/Dec04-2021/22/acqu2s
$$ $$ process /opt/topspin3.2/prog/mod/go
$$ ##$ACQT0= 0
$$ ##$BF1= 400.32
$$ ##$FnMODE= 1
$$ ##$NUC1= <1H>
$$ ##$NusJSP= 0
$$ ##$NusT2= 1
$$ ##$NusTD= 128
$$ ##$O1= 2001.60000002825
$$ ##$SFO1= 400.3220016
$$ ##$SW= 12.009563022959
$$ ##$SW_h= 4807.69230769231
$$ ##$TD= 128
$$ ##END=
$$ 
##$PARAMETER FILE=	(acqus, ASCII, //ch-nmrserv10.ch.ic.ac.uk/Av400B/agmb/nmr/Dec04-2021/22/acqus, 0)
$$ ##TITLE= Parameter file, TOPSPIN		Version 3.2
$$ ##JCAMPDX= 5.0
$$ ##DATATYPE= Parameter Values
$$ ##NPOINTS= 12	$$ modification sequence number
$$ ##ORIGIN= Bruker BioSpin GmbH
$$ ##OWNER= nmr
$$ $$ 2021-12-04 16:38:04.028 +0000  nmr@CZC2524DW0
$$ $$ /opt/topspin/data/agmb/nmr/Dec04-2021/22/acqus
$$ $$ process /opt/topspin3.2/prog/mod/shimcntl
$$ ##$ACQT0= 1000000
$$ ##$AMP= (0..31)
$$ 100 100 100 100 100 100 100 100 100 100 100 100 100 100 100 100 100 100
$$ 100 100 100 100 100 100 100 100 100 100 100 100 100 100
$$ ##$AMPCOIL= (0..19)
$$ 0 0 0 0 0 0 0 0 0 0 0 0 0 0 0 0 0 0 0 0
$$ ##$ANAVPT= -1
$$ ##$AQSEQ= 0
$$ ##$AQ_mod= 3
$$ ##$AUNM= <au_zg>
$$ ##$AUTOPOS= <26 >
$$ ##$BF1= 400.32
$$ ##$BF2= 400.32
$$ ##$BF3= 400.32
$$ ##$BF4= 400.32
$$ ##$BF5= 400.32
$$ ##$BF6= 400.32
$$ ##$BF7= 400.32
$$ ##$BF8= 400.32
$$ ##$BYTORDA= 0
$$ ##$CAGPARS= (0..11)
$$ 0 0 0 0 0 0 0 0 0 0 0 0
$$ ##$CFDGTYP= 0
$$ ##$CFRGTYP= 9
$$ ##$CHEMSTR= <none>
$$ ##$CNST= (0..63)
$$ 1 1 145 1 1 1 1 1 1 1 1 1 1 1 1 1 1 1 1 1 1 10 10 30 40 1 1 1 1 1 1 1 1
$$ [...]
$$ 0 0 0 0
$$ ##$ShimPowMaxUC= (0..63)
$$ 130000 130000 130000 130000 130000 130000 130000 130000 130000 130000 130000
$$ 130000 130000 130000 130000 130000 130000 130000 130000 130000 0 0 0 0
$$ 0 0 0 0 0 0 0 0 0 0 0 0 0 0 0 0 0 0 0 0 0 0 0 0 0 0 0 0 0 0 0 0 0 0 0 0
$$ 0 0 0 0
$$ ##$ShimPowMaxUG= (0..63)
$$ 524287 524287 524287 524287 524287 524287 524287 524287 524287 524287 524287
$$ 524287 524287 524287 524287 524287 524287 524287 524287 524287 0 0 0 0
$$ 0 0 0 0 0 0 0 0 0 0 0 0 0 0 0 0 0 0 0 0 0 0 0 0 0 0 0 0 0 0 0 0 0 0 0 0
$$ 0 0 0 0
$$ ##$ShimPowRcbType= 3
$$ ##$ShimPowRes= (0..63)
$$ 1e-20 1e-20 1e-20 1e-20 1e-20 1e-20 1e-20 1e-20 1e-20 1e-20 1e-20 1e-20
$$ 1e-20 1e-20 1e-20 1e-20 1e-20 1e-20 1e-20 1e-20 0 0 0 0 0 0 0 0 0 0 0 0
$$ 0 0 0 0 0 0 0 0 0 0 0 0 0 0 0 0 0 0 0 0 0 0 0 0 0 0 0 0 0 0 0 0
$$ ##$ShimPowRng0= (0..63)
$$ 1 1 1 1 1 1 1 1 1 1 1 1 1 1 1 1 1 1 1 1 0 0 0 0 0 0 0 0 0 0 0 0 0 0 0 0
$$ 0 0 0 0 0 0 0 0 0 0 0 0 0 0 0 0 0 0 0 0 0 0 0 0 0 0 0 0
$$ ##$ShimPowRng1= (0..63)
$$ 1 1 1 1 1 1 1 1 1 1 1 1 1 1 1 1 1 1 1 1 0 0 0 0 0 0 0 0 0 0 0 0 0 0 0 0
$$ 0 0 0 0 0 0 0 0 0 0 0 0 0 0 0 0 0 0 0 0 0 0 0 0 0 0 0 0
$$ ##$ShimPowRng2= (0..63)
$$ 1 1 1 1 1 1 1 1 1 1 1 1 1 1 1 1 1 1 1 1 0 0 0 0 0 0 0 0 0 0 0 0 0 0 0 0
$$ 0 0 0 0 0 0 0 0 0 0 0 0 0 0 0 0 0 0 0 0 0 0 0 0 0 0 0 0
$$ ##$ShimPowRng3= (0..63)
$$ 1 1 1 1 1 1 1 1 1 1 1 1 1 1 1 1 1 1 1 1 0 0 0 0 0 0 0 0 0 0 0 0 0 0 0 0
$$ 0 0 0 0 0 0 0 0 0 0 0 0 0 0 0 0 0 0 0 0 0 0 0 0 0 0 0 0
$$ ##$ShimSysFunc= (0..63)
$$ 1 2 3 4 5 7 9 11 15 16 8 10 12 14 6 17 13 18 19 20 0 0 0 0 0 0 0 0 0 0
$$ 0 0 0 0 0 0 0 0 0 0 0 0 0 0 0 0 0 0 0 0 0 0 0 0 0 0 0 0 0 0 0 0 0 0
$$ ##$ShimSysMatrix= 0
$$ ##$ShimSysType= 1
$$ ##$TFXNUM= 0
$$ ##$TRIPLO2= 0
$$ ##$VTU= 2
$$ ##$VTUETH= <149.236.99.20>
$$ ##$VTUTY= <no>
$$ ##$WBREFAM= (0..15)
$$ 132.2 106.2 100 100 100 100 100 100 100 100 100 100 100 100 100 100
$$ ##$WBREFLM= (0..15)
$$ 0 0 0 0 0 0 0 0 0 0 0 0 0 0 0 0
$$ ##$WBREFPH= (0..15)
$$ 77.55 -65.76 0 0 0 0 0 0 0 0 0 0 0 0 0 0
$$ ##$WBSGU= (0..15)
$$ 0 0 0 0 0 0 0 0 0 0 0 0 0 0 0 0
$$ ##$XFAC= 2
$$ ##END=
$$ 
##$DECIM=	4160
##$DSPFVS=	20
##.ACQUISITIONSCHEME=	NOT PHASESENSITIVE
##NTUPLES=	nD NMR SPECTRUM
##VAR_NAME=	FREQUENCY1,	FREQUENCY2,	SPECTRUM
##SYMBOL=	F1,	F2,	Y
##.NUCLEUS=	1H,	1H
##.OBSERVE FREQUENCY=	400.32200160000002143,	400.32200160000002143
##VAR_TYPE=	INDEPENDENT,	INDEPENDENT,	DEPENDENT
##VAR_FORM=	AFFN,	AFFN,	ASDF
##VAR_DIM=	512,	512,	262144
##UNITS=	HZ,	HZ,	ARBITRARY UNITS
##FIRST=	4405.4461538743908022,	4405.4461538743908022,	0.35097640752792358398
##LAST=	-392.8561297794385041,	-392.8561297794385041,	0.14738914370536804199
##MIN=	-392.8561297794385041,	-392.8561297794385041,	-0.041702162474393844604
##MAX=	4405.4461538743908022,	4405.4461538743908022,	10808.96484375
##FACTOR=	1,	1,	0.005895885924458617311
##PAGE=	F1=4405.45
##FIRST=	4405.4461538743908022,	4405.4461538743908022,	0.35097640752792358398
##DATA TABLE=	(F2++(Y..Y)), PROFILE
$$ [...]
##PAGE=	F1=1635.39
##FIRST=	4405.4461538743908022,	4405.4461538743908022,	0.27857729792594909668
##DATA TABLE=	(F2++(Y..Y)), PROFILE
4405D7L0k9O7K4o1KL3m1M8q6J7O5l6%LJ4O0r2M8j0l3L8L5R1k00jJ00q4R7o7K3k8m7J0P2o5
4067D4M2J38j67J49j00o3K9M7Op5K8J1lp5J40j20J27m4o7M6J6O4p1m0K9N9j41J72l7j15Lj1
3767B1J8K8L8p4qJ32q2J52j62J8m5JR7J2j06J2qJ36o9Lk7P4r8L0j7K2J1n9N0l2jk5N0p3J12
3438A31L6j38Q9j1K5k4N9j48K48j25n8k5k7L9K6mm7k9J61j0K7q3j0n4K5j7M7Q6j53L0R9r8
3138F7M2n1J00k7kn7R9r9j3N4l1J24j28J18j14J10L15O2r0k91L5j17Jl8J10p6O8q4N3N7J16
2847C13jj84o1K6J10j09n0L8J02p9q4K8K43j03n0K6rr7J16j3J88r8j22J07j75K42j61r6O6
2574A13R2j61J37n5J15p6Q3j04P8q3J13Pj26Q9j31O8Qj6M0Q3j35J44j19J7j9j1RR1j15q4J39
2283A91j46J19q0K27k96K20R7j77Q8j30J87j85J91j80M3kJ38n7j27J84j28J80O1l00J62m4
$$ plain form
4405 47 77 48 115 139 78 80 113 72 120 34 51 116 80 80 83 97 157 65 113 103 70 108 143 234 34 33 133 49 146 79 102 74 27 37 109 44
4067 44 86 224 57 206 106 43 72 119 125 50 78 89 86 11 151 31 158 114 47 93 109 173 102 62 91 150 9 181 144 29 32 21
3767 21 39 67 105 31 23 155 73 225 63 81 36 37 134 146 40 52 44 180 111 114 87 161 63 93 76 98 109 50 100 68 67 42 92 19 131
3438 131 167 29 118 107 132 108 167 19 267 142 84 59 32 71 97 93 46 17 178 168 195 112 102 48 73 56 103 189 36 66 165 67
3138 67 109 58 158 131 129 72 171 72 59 113 82 206 78 196 82 192 507 569 479 188 223 106 107 69 179 103 171 87 140 197 313
2847 313 312 128 67 93 203 94 44 82 184 105 21 49 292 189 139 165 156 59 175 162 350 252 130 237 62 304 143 47 113
2574 113 205 44 181 126 241 165 248 144 222 139 252 259 133 222 91 159 167 151 191 274 139 283 164 181 162 151 160 251 136 52 191
2283 191 45 164 84 311 15 235 332 155 243 113 300 115 306 126 169 167 305 248 121 305 177 357 418 118 280 236
2039B36K0N3l8K2o9L05J30l03L10k69K13jJ08qk92k66l4M0K%Q4N8m0J59l16J55J53l6J54j43
1757C87J05o3MQ8J72n15N72n5m03K6M50O15O43M15J51j57L42N98J044J097O62j016j414j205
1532B543m25j0m71M52j413M06P839r52m542j353m75l08k53pj54o2j12L6j51l45J363n47m84
1316E75j34J59j33j2n0J8J0Qr1K6o6K4k0M1N6j87L2J53j93J75r6J4j9j06J40jj45LO3Q2j46
1025A80K44l01O3qJ97j50J3k8M9l2j20J85K9k10J52p1j27K13j06q9J60Ok08J11J21j02K9p0
762A30M2J1M2n9q7J65p0Oj09J05OM9k2Nj27P5J7j4K4j53J43Ml9o4K69L74n87o0J50p1K50k91
462A14L92J39P99L36K31m65r12l73q2J35k53Q0J00p3J13j62k8N7m0r4J69q4N8n1K7P0m6n7
199A00pn8N4J3p6K80k00L6o1K4jK4J13j48pj3J80m2p9m8L3k8P0p6O7p4J74j37k1M2n9J27j78
$$ plain form
2039 236 256 309 271 293 224 529 659 356 666 397 610 609 717 709 417 151 117 157 159 159 243 301 261 420 104 259 412 376 530 387
1757 387 492 429 433 521 693 178 750 695 292 318 768 1383 2026 2441 2592 2435 2777 3375 4419 5516 6178 5162 3748 2543
1532 2543 2118 2108 1637 2089 676 1082 8921 7969 3427 2074 1599 1291 1038 1031 877 815 703 739 588 243 1606 1059 575
1316 575 441 600 467 455 405 423 433 441 350 376 310 334 314 355 411 224 256 409 216 391 295 309 290 184 324 323 178 181 244 326 180
1025 180 424 123 186 178 375 225 238 210 259 227 107 292 321 111 263 192 65 278 172 83 243 249 41 152 273 171 200 130
762 130 172 183 225 166 79 244 174 180 71 176 182 231 209 214 87 162 179 165 189 36 179 183 144 80 349 723 136 76 226 155 405 114
462 114 506 645 1444 1780 2011 1546 634 261 179 314 61 141 241 168 281 119 91 148 108 14 183 99 157 106 133 203 157 100
199 100 93 35 89 102 26 306 106 142 81 105 104 128 241 93 86 73 253 211 132 84 117 89 159 83 150 76 250 113 92 134 75 202 24
-111B4J08kj3j1l6On0j3J29o0OO1p4J32j65J40o8J7K3q7P2j15N4K8m6L5o3Q7m2j0
$$ plain form
-111 24 132 130 117 106 70 76 26 13 142 82 88 149 75 207 42 182 114 131 154 67 139 24 78 106 60 95 32 119 77 67
-393F7
##PAGE=	F1=1626
##FIRST=	4405.4461538743908022,	4405.4461538743908022,	0.47789627313613891602
##DATA TABLE=	(F2++(Y..Y)), PROFILE
4405H1jk1M8Ol7l6M2PO6p8l6O1J0o1N0L0Jk0Ok5Lk8L4R4j12ML2l1O4o1k0K2l6n9P5j7nJ87
4049B39j92K03j82o6O5NR1j30N1J9n3J6O5p6Q2nn7J3N6mj3r4L3J12j19J15j2j28K2m9M6k4
3748B9R8q4J3O5q3K01j56Mn3l3J21K3k6o1j3J32nk5m6Q6r0l0l0N1j4K8j4k4M4j09J31o0N9
3438A29R4j87O9N3m5m1Q5o5J42q4k4n6k4O2l7L2n5j5J67r1R0j13N8q6J2Ll8J26j32RQ0k9N2
3128A41j39J08R1j46P5k3L5j04R8j29K47p4Ro1L3K04K46k36k29J31j75O3j18J09L5q3kM0J7
2856A63K29L8k73j18L5J59k09Q0%L8k2L3j01J89lKj10J6L8j60P5J79N3j53J2j25K21p3j16
2584I7k6J41l4o2K6J10j42J77j36J02n0l5J74l16K57k42J43m9nL6J42k93L04k80R5N4M5j65
2321F8K39o2j60J06k3q5P9P2q0J1J31m0M7j91J59p2P3l3o9p9K36n7K5r4P6n6K80l92K26j13
$$ plain form
4405 81 80 59 107 113 76 40 82 89 155 77 41 102 112 51 101 131 132 112 118 93 96 68 102 196 84 88 120 89 153 92 72 94 58 -1 74 57 52 239
4049 239 47 250 68 2 67 72 163 33 84 103 50 66 131 55 137 132 75 88 144 140 127 33 66 178 59 174 162 34 56 7 53 29
3748 29 127 43 56 121 38 239 83 87 34 1 122 145 119 58 45 177 172 147 101 187 97 67 37 88 74 102 88 64 108 -1 130 70 129
3438 129 223 36 105 158 113 72 157 92 234 150 126 70 46 108 71 103 48 33 200 109 199 86 144 58 70 73 35 161 29 38 118 89 141
3128 141 2 110 201 55 130 107 142 38 136 7 254 180 189 128 161 365 611 375 146 277 102 165 47 156 191 108 106 146 163
2856 163 392 430 157 39 74 233 24 104 104 142 120 153 52 241 238 240 130 146 184 24 99 278 331 178 190 65 286 213 97
2584 97 71 212 178 116 142 252 110 287 151 253 203 168 342 26 283 41 184 135 130 166 308 15 319 39 134 188 233 68
2321 68 307 245 85 191 168 83 162 234 154 165 296 256 303 112 271 199 272 239 170 91 327 270 295 201 277 221 501 109 335 222
2039B22M0J10q8Q4j89M33N15M17k74j155M21O1J6l6l66j70j8J29J31k28K15nQ1J52k44R5k6
1786C23P2K00j67K13j72R0LL15l61J65J86k61J17l23M63Q15P17O32J56K69Q98J126J472J148
1560H096q39j865j606q97km85r3j083O66P544N041j2789r56M38j10j55j5k20J30k71J63j39
1354E53L51M07K81r70k29J36m6J0j06m6J91j71L8m7O9j31l4K2J64k28O5K1j5L6pj6O5k31J93
1081C25j0j26Q2j00R5l1J47j05j47P6M9M3j00j3Q3o7J7k5J18r2m5O7j44J56j3j11R7J10j80
809A56j31K24q7R9j56NJ17o0K8m4O7n8R5j96OJ08mJ8J16j89M9K5j8L1r4R8m4O4j29K34L53
518F83m61j00K12J28l53Q7L43K24Q53l5p4j30n99m17j72J14r6j38K04j83J60o8r8N5K6j57
274HJ02N9j0K2q9J97j83j6N9n7p6M3NK00p4p4o2R3r2M5J88j41n2n2J58P0j17r6R2r1J49j34
$$ plain form
2039 222 262 372 284 368 179 612 1127 1544 1270 115 536 597 613 577 211 41 23 152 283 55 270 265 346 498 254 349 323
1786 323 395 595 428 641 469 559 562 877 516 681 867 606 723 400 863 1678 2395 3027 3183 3452 4350 5476 6948 8096
1560 8096 7257 5392 3786 2889 2887 2402 2309 1226 1892 9436 14477 1688 732 1170 1060 905 890 670 800 529 692 553
1354 553 904 1311 1592 622 393 529 483 493 387 341 532 361 399 352 421 290 256 278 442 214 279 300 285 321 314 298 363 132 325
1081 325 315 189 271 171 266 235 382 277 130 206 255 298 198 185 268 201 218 193 311 219 174 241 97 253 240 129 226 336 156
809 156 25 249 162 261 105 110 227 167 195 151 218 160 255 59 65 173 169 187 303 114 163 188 170 201 107 205 161 225 96 330 683
518 683 222 122 334 462 109 196 539 763 1616 1581 1507 1377 778 361 189 303 207 69 273 90 250 182 84 139 165 8
274 8 110 169 159 181 92 289 106 90 149 92 16 59 64 264 190 116 54 147 55 100 288 147 95 43 201 271 154 58 150 59 208 74
-27G4jk8J57q1o8J16j12J15r1Q8r3K3M0l1p4M0k6Q3qo6Q9j11J61r4O7Oj8j9l5J29j98R6r9
-337C1N4J4n7N0J8k0
$$ plain form
-27 74 73 45 202 121 53 169 57 172 81 169 76 99 139 108 34 74 48 131 123 57 146 35 196 102 169 175 157 138 103 232 34 130 31
-337 31 85 99 42 92 110 90
-393I0
##PAGE=	F1=1616.61
##FIRST=	4405.4461538743908022,	4405.4461538743908022,	0.67270541191101074219
##DATA TABLE=	(F2++(Y..Y)), PROFILE
4405A14l9%L5l4jK9m6K7R6l4j12K4P8j27J15J3n5O2m2L2J5j15N3O2l5M8q4O3Nor4L2K1m0j
4077E9Qk6J90j65J94j91nql0J43m9n0P7j24J15n2J4L5M0q0rQ4j14P1p0pR3m9R0k8o8mj9J9
3758H4k6Q4j7n0L1o8K01j24j7Op5J04K6N0q1m2O6M2j8Ll0k1ql7l4M6N6p8pO8p3P0M5j07J74
3429B43j36M1J01r7n8N4M2m9MJ3l7J4k6qK7Nl6J23j19J05j62J20q6M1Or0J17p9JJ6L0N4j13
3119F1MJ92j80Q0j25J58r4M0m5J82Jo5l3n6J01M92m38j80K26k24J69j57J5J58k27J36o1L6
2856A66K44J18l29j72Q0J50j61P5k8J9l5J38j21N1R3O9l22J28J32j42o9R8J77r7j62P1M9M2
2593B62p0r0O4J44k86J83O2k25K75j37J56m2k26L26k85K40k03R8p5J0RJ28k08K61k53P9nJ10
2330C02j61J92M4j84N4M2q5O4q9J33j29Q0P5N6p6n5N7J1L6q3o7J36l3J50k44J77k25L97k43
$$ plain form
4405 114 75 75 110 76 75 104 58 85 181 147 35 59 137 10 125 138 83 145 103 135 150 35 88 150 115 163 79 142 147 141 47 79 100 60 59
4077 59 67 41 231 66 260 69 64 56 26 169 120 70 147 23 138 86 100 135 175 95 86 170 56 127 57 50 143 94 184 156 88 84 65 84
3758 84 58 142 125 75 106 38 239 115 98 104 29 133 159 209 128 86 152 194 176 179 149 128 120 83 49 95 151 73 66 134 61 131 176 69 243
3429 243 107 148 249 152 94 148 190 141 145 158 121 135 109 101 128 133 97 220 101 206 44 164 78 119 125 35 152 73 74 90 120 174 61
3119 61 65 257 77 157 32 190 96 136 91 273 274 209 176 120 221 713 275 95 321 97 266 109 124 282 55 191 130 166
2856 166 410 528 199 27 107 257 96 171 143 162 127 265 144 195 288 357 35 163 295 153 84 182 359 262 100 171 220 262
2593 262 192 102 166 310 24 207 269 44 319 182 338 296 70 396 111 351 148 246 171 181 190 318 110 371 118 197 192 302
2330 302 141 333 377 193 247 289 204 268 179 312 183 263 338 394 318 263 320 331 367 284 217 353 320 470 226 403 178 575 332
2058C32Q8j17K3J35k2L2m3K94O59J701p27j972L44M9l2j26n60N0J45kJ76q6J21j58K60K4o
1804E82Mq4P9J56m8J63p9J23m3J84O3j92L12n7J31j92l0L94R01J093P56O07J253J523J633
1570I232J249q90k533j710j960p29K472j311k370J162J9414J2190k8462l223k92k46k74k52
1401A467m20K79l84J31m8M94p47R32q83j35MP3k6j05r0J79j87P3j07J43j44m7p9K12j92N5
1156D48j30J84k16J63o2J06j13J0j5k4J18k35j6J63k5Q7k65K00j86J97j21O5p7J7O7j55J50
903C35Rj67J15n8j8J08j7j56K84j62p1J7QP5p9j29J97r2K7M3o5OJ18j16j10R0k3m0K28j78
621A79N8Mn3Q2p2J7m9J34j33K29J48k09o2K4M78l96o8L85O77J480M88q72j155m92l14j46p9
368B83O5j98J60j91Q8M6r4M6M0j78J1J17JP5k03K98l18Q1O7j3m4n1Q1NQ4j61m0J27j06J8K01
$$ plain form
2058 332 420 303 326 461 439 471 428 722 1381 3082 2355 383 727 776 744 618 58 108 253 251 427 341 462 304 564 588 582
1804 582 586 502 581 737 689 852 773 896 853 1037 1100 908 1220 1163 1294 1102 1072 1466 2367 3460 4216 4823 6076 7599 9232
1570 9232 10481 9591 7058 5348 3388 2659 5131 3820 1450 2612 22026 34216 5754 2531 2239 1993 1719 1467
1401 1467 1047 1326 942 1073 1025 1519 772 1704 821 686 690 763 737 632 542 721 534 607 500 643 499 452 373 585 393 448
1156 448 318 502 286 449 387 493 380 390 375 351 469 234 218 381 356 443 178 378 192 389 268 333 256 273 340 185 335
903 335 344 177 292 234 216 324 307 151 435 273 202 219 227 302 223 94 291 199 226 269 204 210 328 212 102 192 169 129 357 179
621 179 237 241 188 270 198 215 166 300 167 396 544 335 273 297 775 379 311 696 1373 2853 3341 2469 1314 822 508 362 283
368 283 348 150 310 119 207 253 159 205 245 67 78 195 196 271 68 366 48 129 196 183 139 88 169 174 258 97 57 184 78 96 297
77B97p7m2n8RJ63r4o2K1p0J62j20j03N3P0m8q3K00p9k2L2O4j58O9Q3n8r3P9Jo2P9o4O5n1N2
-243A55j8KM8Rm1p9K36k19Q4j02K0Ok9j7P8m7
$$ plain form
77 297 220 178 120 129 292 198 136 157 87 249 129 26 79 149 101 18 218 139 117 149 213 55 124 207 149 56 135 136 74 153 89 154 103 155
-243 155 137 139 187 196 155 76 312 93 177 75 95 101 72 55 133 86
-393H6
##PAGE=	F1=1607.22
##FIRST=	4405.4461538743908022,	4405.4461538743908022,	0.86751455068588256836
##DATA TABLE=	(F2++(Y..Y)), PROFILE
4405A47p7K0K4p4K2Q1l6n0J37K2j81rJ25j30J53k8j11J44q7R6J9j24L1j1L6Q9j53J20r7R2
4124A90j31oP2k6J0p4L1J29r2J46j48K4p2K6Q5O0j71J13j02J11j15P4pR1r7k7J01j53P2Ro
3833A17k7L6P9q6L4l6Oqk9P6N5j24O9n7J13m3p6P0j13R3L4P9o4l6m6Q9j0P2k08P9M6o6n5P9
3513A42N8j16L7K8j4mJ40k30K11p5K4J08j09p9J9J48k40R2N0j8N3j15K1K8P0r9J20j21J44
3241B73k05J06p0Q4J6j38J30r0M0lON9q4j3J53m6m8n2J15n4l1K7J12P0j01n3n1RO22n59r5
2950A29K19k71K79j41j10K46k09J40j53J18J26J87l09k25J25J10o2M6q1Q6j03K00j01r3J83
2715C36J43l85J06J75n2j39k4J75Ok88K45j43J55k7o5j20L23l13J60L2j84K45j31K18o5k50
2471A33K71j52J34j14Q0p4K4j8Q8j50J83j20L7q8J21p1O2J53j84K6N3Jl7q7J62q7n0J14J04
$$ plain form
4405 147 70 90 114 40 62 143 107 57 194 216 35 26 151 21 174 146 35 179 92 188 207 83 114 103 139 228 75 195 98 190
4124 190 59 53 125 99 109 35 66 195 103 249 101 125 53 79 164 224 53 166 64 175 60 134 127 218 121 94 195 42 114 123 117
3833 117 90 126 205 119 153 117 123 115 86 162 217 93 162 105 218 175 99 169 56 149 183 262 198 162 116 205 195 267 59 138 184 118 63 142
3513 142 200 84 121 149 135 131 271 41 252 177 201 309 200 121 140 288 48 140 190 172 225 110 131 159 229 130 250 129 273
3241 273 68 174 104 188 204 66 196 106 146 143 149 208 124 111 264 218 170 118 233 179 148 175 287 357 256 203 152 161 783 224 129
2950 129 348 77 356 215 105 351 142 282 129 247 373 560 251 26 151 261 199 245 164 250 147 347 246 153 336
2715 336 479 94 200 375 323 184 160 335 341 53 298 155 310 283 218 98 421 108 268 300 116 361 230 448 383 133
2471 133 404 252 386 272 352 278 302 284 372 222 405 285 322 234 355 284 346 499 315 341 394 395 358 271 433 346 296 410 514
2199E14lj65R4J2K5n3j1L3rJ43j61J03j49K65r3Mo7l8J17Q5o2Q0J33N89L275r61k737Q4o0
1926I87j15k47n13K31K33m1J18L8P4j81K85q9J83n2k2L8J06O5L8J08R8K1j4L31j79L03R7R7
1664A998O9J10K2P43J213J409J272J937K553K259J247j663l948j947k415k023J549Q07l105
1485B087o43K6410J6647l5843m191r67m10m40l69n99K82m07K4k8K87j52K9n42p0m8J02j04
1279A055o3r4M0q6N8j57J44j20k3j30J43j14Kr8J75l07K11r2P9J8p7n3M4J13k44r4K25j34
1016D21J74k37J91j71R9o3J37k71J53J2j06J03L4j50K5M4j73J97M4l24L75j43j0q5O9L0k3
762C52j43J47o3PJ07j37J8Q8k2p5m1M3j18K38j43R6j8q8J12p0k1j1J12r0K42j77P8J2l03P75
480I07kl18O37J479K947J766r77k914k263m94j48k18P7j58M5j30k8J15o3O3J2j60KKN8Q9k05
$$ plain form
2199 514 511 346 440 452 477 424 413 446 437 580 419 522 373 638 545 549 482 444 561 646 584 664 797 1386 4661 3700 963 1047 987
1926 987 872 625 112 343 576 535 653 691 765 584 869 780 963 911 889 927 1033 1098 1136 1244 1342 1363 1349 1680 1501 1804 1901 1998
1664 1998 2067 2177 2199 2942 4155 5564 6836 8773 11326 13585 14832 13169 9221 7274 4859 2836 4385 5192 2087
1485 2087 1444 27854 44501 8658 4467 3500 3090 2650 2281 1682 1964 1557 1581 1553 1840 1688 1717 1175 1105 1057 1159 1055
1279 1055 992 898 938 852 910 753 897 777 754 624 767 653 655 557 732 425 636 544 623 641 564 511 555 668 424 330 555 421
1016 421 595 358 549 378 477 414 551 280 433 445 339 442 476 326 351 395 222 419 463 139 514 371 361 276 345 375 352
762 352 209 356 293 300 407 270 288 376 354 279 238 281 163 401 258 354 336 248 360 290 269 258 370 280 522 345 423 435 132 907
480 907 905 587 1224 2703 5650 7416 6439 3525 1262 768 620 402 479 321 366 236 208 323 260 323 335 175 177 179 237 326 121
227A21L15l43R3M9Qmn2P0j39J84j65n7J24m6p4J87M4q1k7j45K51p0k8m5m5J36o4m7j5J7o4
-64H8j5J70l3j49J50L4j59R5J04j06o9P5M0j98J30j4pM6o3N4o4R0L6o2j28L37k07K1l0p8P
-355I5Pq4J37p2
$$ plain form
227 121 436 93 186 235 243 239 187 257 118 302 137 80 204 158 84 271 315 234 207 62 313 243 215 170 125 261 197 150 135 152 88
-64 88 73 243 210 61 211 245 86 181 285 179 110 185 225 27 157 143 136 182 119 173 109 199 235 173 45 382 175 196 166 88 95
-355 95 102 18 155 83
-393H3
##PAGE=	F1=1597.83
##FIRST=	4405.4461538743908022,	4405.4461538743908022,	0.83038890361785888672
##DATA TABLE=	(F2++(Y..Y)), PROFILE
4405A40q2M3N3j16K1J08L9k03J70P6k29Q3P0j35J63k0j69J83j13J24J8r4L6r1N7J37j38J12
4143B43k14J94j30k7O6PM7j64P3Q2k9P5q7M9j26N0J1J55j87Q2o1Q1p3K2mJ36j13m4Q8p3m6
3851H3R2K4j79P4J54j36Q9p2J3J5j6j2J41j90J32n0J9O1j80J54j12L9P5M4Klj78J20k1J52
3570C34k71O1J23j01rJ8P1j10Q5q4N9p8K05j85R8j9N0P4n0j38J2K16k83L3J03l5R9j38J2M6
3288A98Q8j68J82j36J94k37O5j7O0O9k19J76j10K4M6l6N2o3jO0R9j62M4L7%p6O7M5J37j00
3006C18j25M7n1N85n54j8J42k48L01q0k10K68j34J20j83J60m3K65k37k57J62L2L2j0j08J78
2762C52j55J70k6j42J49J96l13j4J99L0j69qJ9J15k35K02j72J14K2J0k15L61k46P4Rj17J95
2509D05j58K99p6j90J19k5J7l6N3m5O4n8R3j16Q0jJ3j13O1Ql2K07j36MK4J07j38k7J09%j10
$$ plain form
4405 140 58 101 154 38 59 167 206 3 173 249 20 103 173 38 201 181 12 195 82 206 224 130 166 75 132 269 131 243
4143 243 29 223 93 66 132 139 186 22 95 177 148 223 136 185 59 109 120 275 88 170 109 190 117 139 135 271 158 114 202 129 83
3851 83 175 199 20 94 248 112 201 129 142 157 141 129 270 80 212 162 181 242 62 216 104 143 218 262 264 261 83 203 182 334
3570 334 63 124 247 146 137 155 226 116 201 117 176 98 303 118 216 197 247 321 271 133 145 361 78 111 214 179 278 140 152 198
3288 198 286 118 300 164 358 121 186 169 229 298 79 255 145 169 215 179 231 168 167 227 326 164 208 245 245 169 236 281 418 318
3006 318 193 240 189 774 220 202 344 96 397 317 107 375 241 361 178 338 295 560 323 66 228 260 292 282 174 352
2762 352 197 367 341 199 348 544 231 217 416 446 277 269 288 403 168 370 198 312 334 344 129 490 244 318 327 210 405
2509 405 247 546 470 280 399 374 391 355 408 363 427 369 462 346 426 425 438 325 386 394 362 569 433 437 461 568 430 403 512 512 402
2218D02M4J66L4j79R3L0j0o6O8l0N0OJ7Qo6J25L2p8K9q2P1J94j38J10j4L35M874j206l305
1945A514k37j81k04l14k24L00K64p0R7Q1N7j61K63j36K83q3P2J7N8J55p9K56J01R8j00L82
1701B209l7K95K44Q8K19M32O2P10J085J890K092K969M210M038K043k629o242l472k194j957
1513F055k322J566j173q72J7149J6799k9664k745r26l54m47l18o25K06l94p4rl0O33n07m48
1316A500p3n4P9j45k6q8r3L2L7k21J26r8J5j27M9k5p5j1J09k94J76r0J8J11q6o5K3J16k37
1044E83p8J87j38J16j39J28p0k4j9J85l49K08q3RK8N1r8p4J15k28J67R0k84K83j32M8p3M6
781D55Kl2p9Q2p0L3R8j24L0L0J9Rj50J12j01P4m8J11l5q1J14q2oJ6N7k9K42m63L20O6k56M24
480G38N17k21R90K494N010L246q24m699m865j222k50k68o9j01m0j02l4N8k0P7l8q9j0r5P3
$$ plain form
2218 402 446 612 646 467 560 590 580 514 582 552 602 608 625 633 567 692 724 646 675 593 664 858 720 830 816 1151 6025 4819 1514
1945 1514 1277 1096 892 578 354 654 918 848 945 1026 1083 922 1185 1049 1332 1249 1321 1338 1396 1551 1472 1728 1829 1927 1827 2209
1701 2209 2172 2467 2711 2799 3018 3450 3512 4222 5307 7197 9289 12258 16468 20506 22549 19920 13678 10206 8012 6055
1513 6055 3733 5299 4126 3254 20403 37202 7538 4793 3867 3513 3066 2748 2123 2329 1935 1861 1852 1822 2455 1948 1500
1316 1500 1427 1373 1452 1307 1281 1193 1100 1132 1169 948 1074 976 991 864 913 888 813 802 911 617 793 703 721 832 746 681 704 820 583
1044 583 505 692 554 670 531 659 589 565 546 731 382 590 507 516 544 595 497 423 538 310 477 567 283 566 434 482 409 455
781 455 457 425 346 428 358 391 489 365 395 425 444 453 303 415 314 388 340 451 416 335 449 367 361 377 434 405 647 184 504 570 314 738
480 738 1255 1034 2024 4518 9528 12774 11950 7251 2386 1164 914 646 577 476 436 334 300 358 338 415 377 288 278 183 256
246B56J11j82K81k97N9L3J2L5j6K4j44J52j29n6O9N0j49J03J74j40L9j93K16l1mn7n7J14m8
-27B25J7q2N4m9j7R6M2j43R8K0j85J40J13j12k4J3P1j68O7K9j11J69p6Lq9J06L9m5j51L50
-308D00j39p9P7j17m5K7q7J19o2
$$ plain form
246 256 367 185 466 169 228 261 273 308 292 316 172 324 195 139 208 258 109 212 386 246 285 92 308 277 273 216 159 273 225
-27 225 242 160 214 165 148 244 286 143 241 261 76 216 329 217 193 206 277 109 176 205 94 263 187 190 101 207 246 201 50 400
-308 400 261 182 259 142 97 124 37 156 94
-393I4
##PAGE=	F1=1588.44
##FIRST=	4405.4461538743908022,	4405.4461538743908022,	0.79326319694519042969
##DATA TABLE=	(F2++(Y..Y)), PROFILE
4405A34q8O6P6j62M6P8J52k34J02J12k40J28J9j34J66j5j86J82j35J58J7o4O5j44j1J80q1
4152A87O2j94J80j34L1J8lR4j63K5Q4j6L6l6O3j38L3o2K49j62J0j9N0J0p0MJ86j31o1P1Jj34
3851G1J21P4j74L3J49j17P5r9K7L8lr9K26k56J96m3p5J66k85K43j06n7J59j7M2N0k90J43m0
3579A52K10j62n9J78j39L1m3Q3j09J29j59Q5j11K27r3n1M7Q8lN0j91PK50k22o9J13o3J37r1
3307B22o7P3J15k36K43j51K44k70K4J6J5J44k80K21j29QR6q5M1%l2l8K39k82J35PJ7p4P0k3
3025B63K05o8k49J66q9N22m92j1Q0j55J99L2k63K23m3P8j49J59j69K94j28k95J96n7J14n0
2781C13j20K35j60P4O6j25L9K62k27j07J65Q6j42J3j31K33j74J25r5J2J2R7k14K64j16j6j5
2527C54m9J43k04L59o7j09l4J03j11L3K6j6J02r7J10p2m6R7L1r4m1M6n5J92o9Jl2J88j77J2
$$ plain form
4405 134 46 112 188 26 72 150 302 68 170 282 42 170 189 55 221 206 20 202 67 225 242 178 243 99 88 268 187
4152 187 249 55 235 101 132 150 147 241 78 103 187 171 207 171 234 96 129 67 316 154 164 145 195 205 135 139 325 194 133 204 205 71
3851 71 192 266 92 125 274 157 232 133 160 198 195 96 322 66 262 219 144 310 25 268 162 105 264 247 289 339 49 192 152
3579 152 362 200 141 319 180 211 168 251 142 271 112 197 86 313 220 169 216 304 301 351 160 167 417 195 126 239 176 313 222
3307 222 155 228 343 107 350 199 443 173 197 213 228 372 92 313 184 192 288 203 244 244 212 174 413 131 266 273 290 216 286 263
3025 263 468 400 151 317 228 750 258 247 327 172 371 403 140 363 320 398 249 408 239 533 405 110 306 249 363 313
2781 313 193 428 268 342 408 283 322 584 357 250 415 501 359 372 241 474 300 425 330 342 354 451 237 501 385 369 354
2527 354 305 448 244 603 536 427 393 496 385 418 444 428 530 433 543 471 425 522 553 459 418 464 409 601 532 533 501 689 512 524
2246E24M2P4p8p6J98M4j24P5J2Kj06J22o1J39j66J59m1j9L1J20j53J30j08M5K39j39N4j63
1983G76L3O034j567l371n16k61k75j93l7L53K69j26J59M0N7j25K40r8K56p2J35M8oK31j23
1748A861L08J15J85q0L70Q5K66M22J10L13O98K95Q69J058K191K856M227O174O741L895l154
1551B9805q851o375k834j464K653q802K732J823p051J7846j5147r64j44o0k03j82m38O6l07
1372B103j81O7k91Q82n17l13j20l1%j26j1n8k01J02N4k36P5q3M3j11l0O5j52N0K0j74Q1p5
1110H32l4J21j2q8pJ13k36k0J07n2k0n1N7K4p1j2J98l24K00j87J13l6P9l7j63J34j66P3P3
837F08j49J18n4NQQK1p8mK7j14J07M2p4L7l4L5O6k02J55l6j28N2J32n2p4J11r9M6oM4rK49
527G58m90K88J00l4o1P62J89J400L564P306M652m20o316p733k300m65k94k28n7q9j21Pl5O
$$ plain form
2246 524 566 640 562 486 684 728 604 679 691 693 587 709 648 787 621 780 739 720 751 871 718 848 740 785 1024 885 939 776
1983 776 809 6843 5276 1905 1389 1128 853 660 623 976 1245 1119 1278 1318 1375 1250 1490 1392 1648 1576 1711 1759 1753 1984 1861
1748 1861 2169 2284 2469 2389 2759 2844 3110 3532 3642 3955 4653 4948 5817 6875 9066 11922 16149 22323 29064 32959 29805
1551 29805 20954 14579 11745 10281 12934 4132 6864 8687 1636 19482 4335 3371 3227 3167 2964 2782 2344 2410 2103
1372 2103 1922 1989 1698 2580 2063 1750 1630 1599 1599 1473 1462 1404 1203 1305 1359 1123 1198 1115 1158 1047 1017 1082 930 980 1000 826 907 832
1110 832 798 919 907 819 812 925 689 669 776 724 704 653 710 734 663 651 849 525 725 538 651 615 694 657 494 628 462 535 608
837 608 459 577 523 528 536 544 565 487 483 510 396 503 545 471 508 474 509 575 373 528 492 364 416 548 496 422 533 434 480 474 518 509 758
527 758 268 556 656 622 561 1323 1512 2912 6476 13782 18434 18014 11698 3965 1665 1200 906 678 621 532 411 418 383 389
302C89P6o2Qo3j51Q4J27j59K47k50K5K1K1J6M7m3q5P1n6n5J5J02j80pK77j83J21k00J40J4
20C07K5p0o9R3l3N9j68J11j4l5QJ01o9jM2k15J79J21j17Jp0J22j16KP3k41K65k6o7j11J27
-271B14L1l9r9K44l2j40J41j14j10L3k6K6j0
$$ plain form
302 389 465 403 411 348 197 281 408 249 496 246 271 292 313 329 376 333 248 319 263 208 223 325 145 138 415 232 353 153 293 307
20 307 332 262 193 286 253 312 144 255 241 206 214 315 246 245 287 72 251 372 255 256 186 308 192 194 267 26 291 265 198 87 214
-271 214 245 206 107 351 319 179 320 206 96 129 103 129 119
-393A19
##PAGE=	F1=1579.05
##FIRST=	4405.4461538743908022,	4405.4461538743908022,	0.72392439842224121094
##DATA TABLE=	(F2++(Y..Y)), PROFILE
4405A22q3P1R1j74Q3PK62k41K3J42j95R4j3p9J17K7j92J81j62J46Kl7J14j10j44K11m4K8j01
4133A46R6j45R7j3j4J06j41k2R4j2K4J3M2j22%n6K13j06k0J5n4J23j14k1K25r6p2L3L4j21
3851A32P4J06j37L8L2j0J6q4j0Q3kj58K78l03K32k1r5J91k47J79n9j70K11n8P1P8k33Q6n3
3579A67J69j0j50J80j32M1r0J35j66J92j52M3r3J30K9j29N4J24r5J43k21L4K47j78p2N5o6
3326A89J20nj48J14J14k39K18j44K64k29j9K5l7K08k98K08q5m5J12o4jO2r5m0K70l00J44K8
3063C27jo8P9n9K10%l72K66j52N72m81n3M7l5M1J42k72J63J8M2q2J09k11K78k5k65J55r0J52
2790D35p9j14K20q8o4J41p0p8L10j51j38R7J00p8Mk09K85r3M4ql8m9J41j48J32jo9j9l4J31
2509E12k18L44m5m6j40K05j80M6rJ8J31j24J34k0j61J64L9p3n1Qn0J66j8mo0J88j17j5M1P2
$$ plain form
4405 122 39 110 201 27 110 117 379 138 161 303 108 202 189 110 227 254 62 243 81 227 229 192 306 196 52 263 219 247 146
4133 146 242 97 194 181 167 273 132 110 204 192 216 229 271 149 149 93 306 200 180 195 141 264 150 129 354 258 186 219 253 132
3851 132 206 312 175 213 245 235 251 167 157 240 238 80 358 55 287 266 171 362 115 294 235 65 276 218 289 367 134 220 167
3579 167 336 326 176 356 224 265 175 310 144 336 184 227 134 264 293 164 218 342 247 390 169 203 450 272 200 255 189
3326 189 309 304 156 270 384 145 363 219 483 254 235 260 223 431 133 341 256 211 323 259 258 320 225 185 455 155 299 327
3063 327 326 258 337 278 488 488 116 382 230 802 321 268 315 280 321 463 191 354 372 414 332 441 230 508 483 218 373 283 435
2790 435 356 242 462 374 310 451 381 303 613 462 324 421 521 443 447 238 523 430 474 466 428 379 520 372 504 503 434 415 381 512
2509 512 294 638 593 547 407 612 432 478 469 487 618 494 628 608 447 611 650 577 526 534 484 650 632 628 568 756 639 624 665 737
2227G37kj47J49N0n0O0kN6j96J57m4J98l03K46l6n2L7J58k10J85q3K8K08r5mk96j80O338k065
1955D842k716p27k39k67L0L1L59K47j84K35l6J21j53K58m5J94m8J66Q8qK71j22L05J73K09
1720B984j8L84J42K55N59K20L60Q71N72J076J215K408L438N355P976R606O311l040j1185r464
1532B0025n451j374R534j8475N065L981P983J0821k3133o677L84J47J25j34j98n8j93k86J23
1354B209l13J249j470K73j27l1p9k6o0n0k06R1O0j98K0q9N1p3r0Q5j59R7p4l9j2j01j7P6M4
1081A041o5m1J13k46K4M0J5j10QNO5n5l4J39k00J72k65J76p3Q5Qk24J53j02oJ4Jl1N1q3N6
790F31lP2j54O4K3j91J78o3K2M0m5jR9k20J43N3k56R6J34l8p0J08j29J07n2P2j3K57m41K02
509F25J10P7J42K29P19J768M556R361N661K02p376j0393l509p02l48l55p2j11j17N5j21K2
$$ plain form
2227 737 735 588 737 787 737 797 795 851 655 812 768 966 663 909 873 821 858 1016 806 991 908 936 1144 1049 1045 749 569 6907 4842
1955 4842 2126 1399 1160 893 923 954 1313 1560 1376 1611 1575 1696 1543 1801 1756 1950 1902 2068 2156 2148 2419 2297 2602 2775 2984
1720 2984 2966 3350 3492 3747 4306 4526 4886 5757 6329 7405 8620 11028 14466 19821 27797 37403 43714 40674 29489 20025
1532 20025 14574 13200 22734 4259 9324 13305 21288 32109 8976 2299 2683 2830 2955 2821 2623 2565 2372 2086 2209
1354 2209 1896 3145 1675 1948 1821 1790 1711 1685 1625 1575 1369 1460 1520 1322 1342 1253 1304 1231 1141 1226 1067 1164 1090 1051 1039 938 921 997 1041
1081 1041 976 935 1048 802 826 866 881 771 779 784 849 794 760 899 699 871 606 782 709 794 802 578 731 629 623 637 638 607 658 575 631
790 631 628 700 546 610 633 442 620 557 579 619 574 573 672 452 595 648 392 488 622 584 514 622 493 600 548 620 607 864 423 625
509 625 735 812 954 1183 1902 3670 8226 17587 23248 23450 16074 5681 2172 1470 1122 767 695 584 467 522 401 423
302D23L6n6Q5j04j38O4J06j22K00j76k5K4L5j4Q7q8k4kPk4n2J19j28j04K90j81J36j89J35
30C20k4M9l6p1Q5n5R5k17J42M4p3p4J33L7j18Q7j81J21J07o1L3j76J63j02RR3k51K20L7r7
-252B39r5J15j0m5l9J25O5j70J51m5j62nL3p2P2
$$ plain form
302 423 459 403 488 384 246 310 416 294 494 318 293 317 352 338 425 337 313 311 318 294 242 361 233 129 419 238 374 185 320
30 320 296 345 309 238 323 268 363 146 288 332 259 185 318 355 237 324 143 264 371 310 343 167 330 228 237 330 79 299 336 239
-252 239 144 259 249 204 165 290 355 185 336 291 129 124 157 85 157
-393A57
##PAGE=	F1=1569.66
##FIRST=	4405.4461538743908022,	4405.4461538743908022,	0.6545855402946472168
##DATA TABLE=	(F2++(Y..Y)), PROFILE
4405A11p9P5J08j86J24n9L30k05o1J66j50N9m4k4O8O8j97J80j94J29K9n2J67p1k76K42oor
4133B37J3j58J65m6k5J19j20o8J04rJ3O2K1j10m1pJ36m6m5N1j60K37j58o7K43m1o2mO6j08
3851A92K9J32j05Q3j26J04m0o8m7J15j1j26K27k91K44l1o2J68j71R3l3j40J51n7N9O9j30N2
3589B80m7M0J37j89J50p6J3j31J92k29K50j02m3o4M5J08j64N6J54j92K30k08J8K49j29p9r
3335B60k7O1Q7k23J49J07k04J45r1K49j83n8M1q5K31k76J86n2n7Q7l8l8J27j57RK12k41R2
3072C13O0j0o9Q4n9J68O8m11K72k25P78n64j42N1P8j21K48k87J45L7Nj5M8j79K35N4k41J09
2809D30q1J47r2r2J86l6j31J46oj87L43r1j18kJ03k3j5k15L22k7m8O8o8q9J64j02%J15r6K
2527E07o5J55k07K73k7J4j83K33j89L8m5N2J18j09J38J2k24J99L6o2j0o1l8J44K4j8l4J03
$$ plain form
4405 111 32 107 215 29 153 94 424 219 158 324 174 233 189 165 233 301 104 284 90 219 248 196 363 292 16 258 252 246 237
4133 237 250 92 257 211 186 305 185 117 221 212 225 287 308 198 157 150 286 240 195 246 86 323 165 98 341 300 238 234 300 192
3851 192 221 353 248 331 205 309 269 201 154 269 258 132 359 68 312 281 219 387 216 309 276 136 287 230 289 358 228 280
3589 280 233 273 410 221 371 295 308 177 369 140 390 288 245 181 226 334 170 226 380 188 418 210 228 477 348 269 260
3335 260 233 294 381 158 307 414 210 355 264 513 330 272 313 228 459 183 369 317 260 347 309 271 398 241 250 462 221 313
3072 313 373 363 294 378 319 487 555 144 416 191 969 405 263 314 392 271 519 232 377 414 419 404 452 273 508 562 321 430
2809 430 349 496 404 312 498 462 331 477 471 284 627 536 418 416 519 496 481 266 588 561 513 581 513 424 588 486 486 601 505 507
2527 507 442 597 390 663 636 650 467 700 511 549 504 556 674 565 703 715 491 690 726 664 654 593 555 699 723 705 671 774
2265G74%p1O6J2J23j72P8L7J3L4j0J16k51J45RK07l41K35K2j14M3J97k37J87l7L3J19k5n7
1992A135l40k13N648k538j531p78j42j70K60L1K98J84k01K85j39J97j71K75J0J40j3J77J06
1776B510j5L07p9K60K28K27J9M51J88K29O15L32M46R13Q06J240J460K544L752O046R093J1785
1570D3357Q569k354j2631j1275r921k521J3281j9365L671L699J7205J6057l4280j0126k23
1429C143N6K57k82p8j35j21l49J16k34K219l669J199p4k9j54O8j14n3j40kO8j44j9j11M3m6
1185A415p7J2r3Q6j42N9n7j22MJ6Q6o5j3R2k75L0K0O2j37J0k2J8L8o6P0q7J33k63J50n8N9
894H83N8k80J73l7o5k3O0j00J09j35O1K9Q2j90Q7N4k73K44j67J17L8o0kQ5j82J02J05k84O9
621E58J49k9p2J06j60J68r7R9j6K38m19J99J18q3P22k91Q99K075N236J0733N987R67p594j2294
$$ plain form
2265 774 774 703 769 781 904 732 810 847 860 894 884 1000 749 894 903 1110 769 1004 1026 912 955 1152 915 1102 1065 1098 1217 1192 1135
1992 1135 795 582 6230 3692 2161 1383 1241 1071 1331 1362 1660 1844 1643 1928 1789 1986 1815 2090 2100 2240 2227 2404 2510
1776 2510 2495 2802 2723 2983 3211 3438 3457 3908 4096 4325 4940 5272 5718 6631 7437 8677 10137 12681 16433 22479 31572 43357
1570 43357 51926 49572 36941 25666 15745 13224 26505 7140 10811 14510 31715 47772 13492 3366 3143
1429 3143 3199 3456 3174 3096 2961 2840 2491 2607 2373 4592 923 2122 2048 2019 1865 1933 1819 1766 1626 1624 1692 1548 1529 1418 1461 1415
1185 1415 1338 1350 1257 1343 1201 1260 1203 1081 1085 1101 1187 1122 1109 1201 926 956 976 1038 901 911 889 907 945 879 949 862 995 732 882 824 883
894 883 941 661 834 797 732 709 769 669 778 643 704 733 815 625 712 766 493 737 570 687 725 665 663 748 566 668 773 489 558
621 558 707 678 606 712 552 720 623 722 706 944 525 724 842 759 1481 1190 2089 4164 9400 20133 26120 27087 19493 7199
396G199m600r39m03m05r3j23j02O1j66L2rm8J61j45j25M4Q6q0J57j43l4K2M4m9J21r6rk7L1
124C62J3j14J30q0j48K75j26O6j44J66j26R5qp9Q3p1Q8k23J45P6r0j33J59J38j98Q4j00K6
-139B66R9%O6k83K05q9J0J07k12J37O5q0q4R7m2m3m0Q5Q2j37J46J1j73q5J04j61J13
$$ plain form
396 7199 2599 1660 1257 852 759 636 534 595 429 461 452 404 565 420 295 339 425 345 502 359 325 347 391 342 463 367 358 331 362
124 362 375 261 391 311 163 438 312 378 234 400 274 369 361 282 365 294 382 159 304 380 290 157 316 454 256 340 240 266
-139 266 365 365 431 148 353 264 274 381 169 306 371 291 207 304 262 219 179 264 346 209 355 366 193 108 212 51 164
-393A64
##PAGE=	F1=1560.27
##FIRST=	4405.4461538743908022,	4405.4461538743908022,	0.62647950649261474609
##DATA TABLE=	(F2++(Y..Y)), PROFILE
4405A06n7N5P8j60J48m8L06j63j00J55j30L7o3L9J4O3j34J60j89R0O9j13K15rl37K32k7k7
4143B10O0k0j39J69o6qR3q9p5Q2J3l5J38j0r6o1J7J00l7l7R5k62K98j66r6K16J9n5KN8j00
3851B18K3R5n9J34k74J97n8n0p6J37l0o2J49k55K30m6k6J32j00L5k8r1P6j9K9J9mJ7l1q1K44
3560D45k05J25l6j4r9J95k91L00m8j09l6k9J53j67Q3J32k45K33j56PK59j18q4n0L5J6J19k56
3297A59J73J17j76N3l1K02r4r4K7p0J65k21J79m4l3L9j3o2J60j79O5J29j99P2Q1j7r1J19o8
3025C48J23J08l85K41l04J028o93k06N1J40j84K60k62J51J1LLJ9j44J90J19k06M6m4J19j01
2781D31n2J25j1j14J01N0k43L53o5q9o6R9Kn1j50L29or7Q8n8j03J50p4p2J70r3L3j22K00k09
2499D56K33m1N8j93K32j62j3j2L6P8m5R7M5k31K11J1n9K3p9l7J30L7m6L0oJ23j33R6m3J90
$$ plain form
4405 106 49 104 182 22 170 122 428 265 165 320 190 227 164 203 217 280 146 306 117 207 276 163 378 369 32 264 237 210
4143 210 270 250 111 280 214 206 299 210 135 217 230 195 333 323 227 166 183 283 246 209 304 42 340 174 78 294 313 258 260 318 218
3851 218 241 336 277 411 137 334 276 226 150 287 257 195 344 89 319 273 247 379 279 314 286 195 271 252 281 300 296 313 282 201 445
3560 445 240 365 329 315 216 411 120 420 372 263 227 198 351 184 267 399 154 387 231 238 497 379 295 245 280 296 415 159
3297 159 332 449 273 326 295 497 403 309 336 266 431 210 389 345 312 351 338 276 436 257 322 451 252 324 405 388 297 416 348
3025 348 471 579 194 435 131 1159 466 260 311 451 267 527 265 416 427 430 433 452 308 498 617 411 457 413 532 431
2781 431 379 504 493 379 480 530 287 640 575 486 420 519 521 470 320 649 643 546 634 576 473 623 549 477 647 554 587 465 665 456
2499 456 689 648 706 513 745 583 570 558 594 672 627 724 769 538 749 760 701 724 645 608 738 775 729 759 753 876 743 839 796 986
2218I86j46K6K7L0J9kJ39k61J12N7J92l17K01M6j56N9K13k20J38k8N7N7L5r0k80k09M288k833
1955B140r8o86j6k9M34%J69O8j45K56j67K43j94L17nR2L5J63J06L9K91m8K40K29K50K0M79
1701D183K70J99N99M07N00Q82R56J250J654K553L738O084R236J2623R992j239j2642j0585
1532C0660j4201n047O866q086J225M35P355J5257k3738p415L75L3K25m16r0j70o6l55P9j88
1344B738K816n296J946J5p6j59J27j68n8n9q7O1j26j5j14J1j2o4o0m9Q8j73Q8m8j57L9j5P0
1081A263q8P9L0k68J2K9O4j12j6j0o0J34r1Kk8J36k54J13m6M7P8l26K02rp0m9Q1j04R4j14
800G19OP7N6j67R4P8l15K74k57J76K9o9N5Pj13K8J24k17j1J90k3j07J51k06K05j25J22oK20
527I95m60K85J26m61J239j08M34K243N442J1085N545J703o808j3022n351j111m78l70j50j40
$$ plain form
2218 986 840 866 893 923 942 940 1079 818 930 987 1179 862 1063 1109 953 1012 1225 1005 1143 1115 1172 1229 1264 1174 894 685 4973 2140
1955 2140 2042 1356 1340 1311 1745 1745 1914 1982 1837 2093 1926 2169 1975 2292 2287 2379 2414 2577 2683 2722 3013 2965 3205 3434 3684 3704 4183
1701 4183 4453 4652 5251 5658 6158 7040 7996 9246 10900 13453 17191 23275 32511 45134 55126 53887 41245 30660
1532 30660 16459 11412 18278 10192 11417 11852 19207 34464 10726 3311 3686 3719 3944 3528 3438 3268 3202 2847 2926 2738
1344 2738 5554 258 2204 2219 2143 1984 2111 1943 1885 1826 1739 1800 1674 1659 1545 1556 1544 1480 1420 1371 1459 1286 1374 1326 1169 1208 1193 1263
1081 1263 1175 1254 1284 1016 1028 1057 1121 1009 993 983 923 1057 966 968 940 1076 822 935 889 936 1014 688 890 881 811 762 843 739 833 719
800 719 725 802 858 691 785 863 548 822 565 741 770 701 756 763 650 678 802 585 574 764 741 634 785 579 784 659 781 775 995
527 995 535 820 946 485 1724 1616 2050 4293 9735 20820 26365 28068 21260 8238 2887 1776 1298 928 778 638
340F38l8L6j68L0o7l4J98j51r2J0O5n6J12j18J3l7P8o3Q1n2j9kK6K2j19J22m6j86K80o7l4
48C62q7J96k27J19J3l2M3q2Q8k14J46P7j21r8J17J98k24O5k3o9J22K3P0k93K07j00K1J18j96
-224B19J04L8k4o6O5p6Jr1J33K0j00J16N0j46j66J65j56Q2
$$ plain form
340 638 600 636 468 498 431 397 595 444 352 362 427 371 483 365 378 341 419 356 437 385 366 364 390 412 293 415 369 183 463 396 362
48 362 275 471 244 363 376 344 387 305 393 179 325 402 281 183 300 498 274 339 316 247 369 392 462 169 376 276 297 415 219
-224 219 323 361 337 271 336 260 261 170 303 323 223 339 389 243 77 242 86 168
-393A68
##PAGE=	F1=1550.88
##FIRST=	4405.4461538743908022,	4405.4461538743908022,	0.59837353229522705078
##DATA TABLE=	(F2++(Y..Y)), PROFILE
4405A01l5L5M8j33J72l9K57j48p6J24j06K0q1J01m0N9p0J40j86N2J09j74K42L1l75K43m9m8
4143A74J29n3j41J53o7L1M1q5j9M0L9p7J93o2o1o1M2O3m9n0J67l39L12j38q6J41Q3m2qL3j12
3851A91Q1L6l3J69l55K44l9l9j08J38p1K3R2k18K15o1RP6n0kkm2JJ9kn2J02j%j81K87j94J27
3542C60j9o0n2K14l33K87J7j64k5l5J30j54J20J21k56J95r8%K49j29o9o9Q2m5J30k27J77J06
3279D53j90LK4J49nj31K5m6R0j77J73l7rqK7p0J46j64P2Q3j52N7R2l4j12J54p7P7J54l53K06
2988D20l00J157q02k50P2J76j90K04k19J61rj0J0Jr8J32J74j70j6pR0j16j7J07k8r2O1J06
2725E47l00L51n4m6j16R5K6o4o4K95k6j05O7k8r9J17o5q6J96r9N5j79K45j98K08o8Q6k03K31
2452G19j20n0K1K0L9J8K9N0k11K51m2q4P0q3l7J18N0p6J00j09J89j67J37r1K43j34j2L1L3
$$ plain form
4405 101 66 101 149 16 188 149 406 258 182 306 200 220 139 240 200 259 189 329 143 195 304 130 372 403 28 271 222 174
4143 174 303 250 109 262 195 226 267 182 163 203 242 165 358 296 235 174 216 279 230 180 347 8 320 182 96 237 320 278 270 303 191
3851 191 272 308 275 444 89 333 294 255 147 285 214 237 329 111 326 265 274 350 300 298 296 254 255 274 272 220 322 321 321 140 427 233 360
3542 360 341 281 229 443 110 397 414 250 225 190 320 166 286 407 151 346 248 248 497 368 299 230 312 267 397 170 347 453
3279 453 263 266 290 439 434 303 328 282 372 195 368 331 322 314 341 271 417 253 325 408 256 313 405 371 259 413 336 413 567 214 420
2988 420 120 1277 475 225 297 473 283 487 268 429 420 410 420 421 323 455 629 459 443 436 526 410 393 500 472 380 441 547
2725 547 247 598 544 498 382 477 503 439 375 670 644 539 606 578 479 596 531 445 641 542 597 418 663 465 673 605 691 488 719
2452 719 599 549 570 590 629 647 676 726 515 766 724 640 710 627 590 708 758 682 782 673 862 695 832 741 984 850 838 869 902
2180I02rOJ61k57R2P9J49k81J82O9j96P5K29k05Q9j7Q1nR3r4j93k53K711k842J229n03J15
1926A407J39M67p2jp0k8J71j68K43j80L39l9N7R9J20P8P9K61j7K21J97K39K1M23L57J75N11
1673E029M13N00P93R67J120J656K370L413N419Q336J1917J0218J90j1008o853j4678m606p683
1504G513O976k794m31J1701j838j5558m10j67n16j55o21k16j54l2l82Q9k66K323m825J933
1316B170P2j25j68J71k34p0J8j17K7j04nj17k0K0m9j18QR0k04J17l8j92P2l0O7j20J63p5k19
1044I90MM6N2j01k7J5j32K35j40mm4J48k37Q5k9M1O9l16K11Kp6p6J22q8L6n1m7J24j3j01Q1
753G79Q2l46L11l04J92K6p2J11p0m6m5J43j50r1K32j8j43J98k54K48j48J04M5J97n05L75J39
499I90n92J191N54l07K205N135J0315M398K279n204j2419n578j178n31l15j89j56K6J1j70
$$ plain form
2180 902 893 899 1060 803 895 974 1123 842 1024 1093 897 972 1201 996 1085 1068 1149 1144 1237 1143 950 697 3408 566 1795 1292 1407
1926 1407 1546 2013 1941 1940 1870 1842 2013 1845 2088 1908 2247 2208 2265 2364 2484 2562 2641 2902 2885 3106 3303 3542 3563 3986 4343 4518 5029
1673 5029 5442 5942 6735 7702 8822 10478 12848 16261 21680 30016 41933 52151 52341 41333 34480 19802 15196 7513
1504 7513 14489 11695 11264 22965 21127 5569 5159 4992 4476 4321 3700 3484 3330 3298 2916 3005 2739 5062 237 2170
1316 2170 2242 2117 1949 2120 1886 1816 1834 1717 1744 1640 1635 1518 1498 1518 1469 1351 1359 1449 1245 1362 1324 1132 1204 1174 1241 1121 1284 1209 990
1044 990 994 1040 1092 991 964 979 847 1082 942 938 894 1042 805 890 861 902 971 655 866 868 792 716 838 750 786 735 688 812 799 698 779
753 779 861 515 826 522 714 740 668 779 709 663 618 761 611 520 752 734 591 789 535 783 635 739 784 981 476 851 990
499 990 398 1589 2143 1836 4041 9176 19491 23889 26168 20964 8545 2967 1789 1258 943 754 598 624 635 465
311D65M9j04m2K14j56n9mO6l1O6j14L9q1J28l4jk4m4K2K2L0j24J14j1k03L05l5j61J4J84l03
20A87J70J4pLr4J10j84J26N7j30m3N4K36k22P1J1j21J19K1R4k83J90j32L6J34k00J33j5Om7
-261B94L2q3P0j83K23n2p3J06K6r4k21K28j51M9
$$ plain form
311 465 514 410 368 582 426 367 363 429 398 464 350 389 308 436 402 401 377 333 355 377 407 283 397 386 183 488 453 292 306 490 187
20 187 357 371 364 367 273 383 199 325 382 252 209 263 499 277 348 359 238 357 378 472 189 379 247 283 417 217 350 335 341 294
-261 294 326 243 313 130 353 301 228 334 360 266 45 273 122 171
-393A71
##PAGE=	F1=1541.49
##FIRST=	4405.4461538743908022,	4405.4461538743908022,	0.43440851569175720215
##DATA TABLE=	(F2++(Y..Y)), PROFILE
4405G3kK2Or3J87m6J90j27j6M6q6M8j00J02m3M1j3R2j38K6J26k04K18P0l50K13p2o1J71r3
4124A87q9J22p5O9j2n2K2j9R6j37K36r5n5o7P3M3o2n0K03l27K50r9p3R8J02l7lLj33J53m8
3833B24J8J62l12J95j0o5r8J50j03O8L4j40J66p6L4L6l8J9pj9l7K2K5j27J87j9mk04K78j66
3551A93J13l0o2NJ71l03K53M5k06Pk5R0j28J58Q3k60J83n6k4K43j53n2n2Q8m7R6j42J25J26
3279D39k35j1N6J17M0j79N9Nrj26J44rj1k6M6l9Q7r2M3M7j32P2O2k4j04J52j16R5J57l09J57
2988C56j50J063q68k36R8J57j32J21j45J31Lm9QK6p3Q0J97j54m2rQ8j20PJ01p0p0O2J15l13
2715A82L47n2k5j36Q6J6m2K0K23n2r5J1M0j12R4o5o1J79p4N3k09K70j91K15j41J27k06K19
2452F21j03n2O6k7L3N2k0L4j63K80j21r1Q4n4m8J07R3j41J60j64K12j64J34q9K22j34J8J9
$$ plain form
4405 73 71 93 99 6 193 147 337 210 194 240 154 202 102 204 161 202 189 281 143 169 295 91 309 379 29 242 170 109 280 187
4124 187 98 220 145 214 202 150 172 153 249 112 348 253 198 131 204 247 185 135 338 11 261 162 89 187 289 252 249 252 119 272 224
3833 224 242 404 92 287 277 212 114 264 161 229 263 123 289 213 247 283 245 264 257 238 201 223 248 121 308 289 285 81 359 193
3551 193 306 276 214 219 390 87 340 385 179 186 161 251 123 281 364 104 287 231 207 450 297 245 193 281 234 330 188 313 439
3279 439 204 193 249 366 406 227 286 291 282 156 300 291 280 254 300 261 348 256 299 346 214 286 348 324 220 372 256 351 508 199 356
2988 356 206 1269 401 165 263 420 288 409 264 395 398 349 357 383 310 390 587 433 391 382 470 350 357 458 388 318 380 495 182
2715 182 529 477 452 316 402 418 376 396 619 567 472 483 523 411 505 440 379 558 484 537 328 598 407 622 481 608 402 621
2452 621 518 466 532 505 538 590 570 604 441 721 600 509 593 539 491 598 691 550 710 546 758 594 728 639 861 727 745 764
2189G64Rj4QJ40k22R9O7J01k28J77M3j76Q4J88j44K2%P5rJ02j03m4j20J335j196M76k73J86
1926A347K25M11j89j24j87R2P9j28K04j35L35j09O2J23P8M0J19J86nK02J25K34L7K23M61J28
1682C834L69L50M17O54Q61Q58J478J942K784M245O688R912R341J725p907q43j0396J38J8736
1504D5186j9889j4262N683N4604J4161o4361r784l353j842j041j063m75j26j30m07J5n42J195
1335C569k519J116K5k00j33J18k57m2J5j19qr3L7j28m9M1o7r3RJ14k18J04j6k33J19n6R4j45
1072I85K13j68j68J2N1M3j07NJ5j80L18k36O6r0J50k16Q7n4P0M0k56J80Pp2j11J94r6m2M4
800F84p9J49q6k4O2N3l39L30l18J93J7p2J61j54M7j32J69j01j39K63n1j34K14k42K25j18M2
546F20R5K15n31M37P1rM83J133r62J931M335Q607K851K537l145j0630n238j104n65k52j85
$$ plain form
2189 764 773 759 767 907 685 784 851 952 724 901 944 768 852 1040 896 918 918 993 984 1086 983 939 819 2154 958 1434 1161 1347
1926 1347 1572 1983 1794 1670 1483 1575 1654 1526 1730 1595 1930 1821 1883 2006 2084 2124 2243 2429 2424 2626 2751 2985 3022 3245 3706 3834
1682 3834 4203 4553 4970 5624 6485 7343 8821 10763 13547 17792 24480 34392 43733 45458 37551 36708 26312 26450 45186
1504 45186 25297 11035 16718 71322 85483 21122 11338 7985 6143 5102 4039 3564 3438 3308 2901 2916 2374 3569
1335 3569 1050 2166 2191 1991 1858 1976 1719 1677 1692 1573 1565 1472 1509 1381 1332 1373 1306 1213 1222 1336 1118 1222 1206 973 1092 1036 1130 985
1072 985 1198 1030 862 874 925 968 861 866 881 701 1019 783 849 759 909 693 780 726 796 836 580 760 767 695 584 778 682 640 684
800 684 605 754 668 644 706 759 420 750 432 625 642 570 731 577 624 492 661 560 421 684 633 499 713 471 696 578 620
546 620 715 930 399 836 907 898 1381 2514 1552 3483 7818 16425 19276 21813 18668 8038 2800 1696 1131 879 694
349F94j63J03m9j38M5j38n7K39j77Jn8P9j2L5q7M4j28J70qq5K0m6L2J6K5j30J29oj88L27o3
58D26k17J20J23l23K01JJ7n2n8R3j33R5K5j38K5QK47k34R9Qj40J36j0R5k57K03j69K8J41j87
-224A73J62o0M2n3N0r6J00k63K96q4r5J22j7m1j53K10j59J7
$$ plain form
349 694 531 634 585 447 492 354 297 536 359 360 302 381 369 404 317 361 233 403 395 310 330 284 316 332 357 227 356 350 162 489 426
58 426 209 329 452 129 330 331 348 296 238 331 198 293 318 180 205 213 460 226 325 333 193 329 319 414 157 360 191 219 360 173
-224 173 335 275 317 264 314 218 318 55 351 267 172 294 277 236 83 293 134 151
-393A51
##PAGE=	F1=1532.1
##FIRST=	4405.4461538743908022,	4405.4461538743908022,	0.27044346928596496582
##DATA TABLE=	(F2++(Y..Y)), PROFILE
4405D5L1J0l6n3K02n4J22j05M3l0o8P6j17J02m6K4M3M3q3NJ02j92J83R7k82J41r0o9K13j33
4124A24l6R0q4J08o5k0P0p4J17j49K10j12l5n6J04K3o9m5J96k73J62q6l9P6J21l2Kk8j53K24
3842B71j26P4J13k27J40J5r2q8J63j34J12k5o1J16r0O0nk6M0j2Np7K7N0k00K71m3j1j87K26
3560B79j32J06m3o3O2J28k74K19P4k48L8j3M8j01J74K5k42J92j5m7K37j79l5l5P9o5M2OM8
3288B65J17k59lQ8Q5Q5k27Q4M5r8o6J07Qj3m4O3oK6j9J3J3j13Q7L2j4r7J52j41J29R7k43J25
2988B78J7Q47q60j99J47J15r5N4n4M7M8q3J1M0n8K8K19j37o7j2Q7j15M2Q4j23m6O1J35l16
2715I5L34o1mj57Q8J7l0R3J36r1p2l0J09j26P1o5l6J62n5M5j96K55j79K26k13J68k10K07q6
2443C95n5J11p4K8Q6o9J8j28K94j86q4R8k5o0R8J20k18K38k00J86j30R8l5J80j52M7QjnlJ05
$$ plain form
4405 45 76 86 50 -3 199 145 267 162 205 175 107 183 66 168 122 146 189 232 149 154 256 64 247 344 62 203 113 44 257 124
4124 124 88 178 94 202 137 117 187 113 230 81 291 179 144 88 192 215 146 101 297 24 186 100 61 137 258 226 228 200 47 271
3842 271 145 219 332 105 245 260 168 80 243 109 221 196 135 251 161 221 216 190 230 218 223 146 173 223 23 294 251 240 53 279
3560 279 147 253 210 147 209 337 63 282 356 108 146 133 181 80 254 279 37 229 214 167 404 225 190 155 234 169 211 217 265
3288 265 382 123 120 208 293 378 151 235 280 182 116 223 231 218 174 237 231 257 238 251 264 151 238 270 256 159 311 170 299 396 153 278
2988 278 295 1142 282 83 230 345 250 304 250 297 345 262 273 313 255 283 502 365 298 286 373 258 300 384 261 215 276 411 95
2715 95 429 368 364 207 295 312 282 375 511 420 348 318 427 301 372 307 271 433 378 423 227 482 303 529 316 484 274 481 395
2443 395 340 451 377 405 491 422 440 312 606 420 336 434 409 349 447 567 349 587 387 573 443 541 506 686 534 581 589 588 583 580 685
2152F85j88J06N6N2j76J74J6j56Q0J32p0l1J8O9j3J12j09J09J77J521k60j266j17J84K14K56
1908A575k42j82k33J97pq4J66q9L16j94O9J46L6KJ31Q3PJ83K9K04R5j02N61P7J86K45K91M73
1645C939O73N12J144J360J984K900M764P352P764L065m149N320m064O091N3729m7523l7514
1485G347J0364Q4149K9949r8079j7444o002k800j717j378p40j04k54m57j19r62J579j218O5
1316B179q9k59q5N9k84J8m2j15l8q2P8j38p8O2q4o8QJ38k32R3Nk74J66q7J15j42K08k42r9
1044F91K1N6L4j13L1J0j86L59l27J42j35J51j95Q8p2J03k1j43J33lo8j46K66j05j24J35p1
790E11J33j53N7K8J2l25L58k90J51J4o7K13k39J41k20J96n3j87K93p7j20J93j84J57n3l3J31
537E87K26m81M29o5O44M2J150j257J447L241O382J262K383j135q039m402r57n22j77j66j69
$$ plain form
2152 685 497 603 659 711 535 709 725 569 649 781 711 680 698 767 754 866 757 866 1043 2564 2304 1038 921 1105 1319 1575
1908 1575 1333 1151 918 1115 1108 1024 1190 1101 1417 1223 1292 1438 1474 1476 1607 1690 1697 1880 1909 2113 2208 2106 2667 2744 2930 3175 3466 3939
1645 3939 4612 5124 6268 7628 9612 12512 17276 24628 32392 35457 31308 36628 32564 38655 92384 44861 7347
1485 7347 17711 101860 131809 33730 16286 10284 7484 5767 4389 3649 3545 3291 2834 2715 1753 3332 2114 2179
1316 2179 2090 1831 1746 1805 1521 1539 1497 1382 1344 1262 1340 1202 1124 1186 1102 1034 1042 1180 948 1041 1046 772 938 851 966 824 1032 790 691
1044 691 712 768 802 689 720 730 544 903 576 718 583 734 539 627 555 658 637 494 627 624 556 410 676 571 447 582 511
790 511 644 491 548 576 588 263 621 331 482 496 429 642 403 544 324 520 467 280 573 496 376 569 385 542 489 456 587
537 587 813 332 761 696 1340 1382 2532 1275 2722 5963 12345 13607 15990 14855 6816 2414 1457 935 758 592 423
340D23J80j10j06N6j56l0K21j90O4j12R4OLn9M9j75K13J7j68O2m6M1J0K1j36J37nj32L08q6
58C94k68J96L2k51J82kM9j08k2P6q1N8j2j03N0l3K64k41J33l8j16J47m6R5k30K17k06J9J49
-214C04j76J92j00Q3j01J10j19J19l01L28j11j12J38o1J3q5J92j67j6
$$ plain form
340 423 603 493 387 443 287 257 478 288 352 240 334 340 343 284 333 158 371 388 220 282 236 277 287 308 172 309 304 172 480 394
58 394 126 322 354 103 285 283 332 224 202 278 197 255 243 140 190 157 421 180 313 275 159 306 260 355 125 342 136 155 304
-214 304 128 320 220 303 202 312 193 312 11 339 228 116 254 193 206 121 313 146 130
-393A30
##PAGE=	F1=1522.71
##FIRST=	4405.4461538743908022,	4405.4461538743908022,	0.22244583070278167725
##DATA TABLE=	(F2++(Y..Y)), PROFILE
4405C7J8J3m2J0J51o4N9o4P4p0rO0j07L5l7N2N2kk1l7Q8j41J04J28j79L7q4l8J66j40L9J2
4105A00m7J10q6JP2o3Q1r1R9n4k7n9J30nm6m5J50j96P0l9k9J29N6k3J3n6j01J92j68J14O5
3814B47j31N8M4q9r1J55j45J09k7j1P0q1N3l0j5N8Qkr8K7Q6j01J56p2pj49J61p5M3m3l3Q2
3513A57P4j62J20J12k65O9j8K3p2J52j0j37J14j0m1K25j96j7pL4m0OJ03m0J53k68k1J48J4
3241B00R6j83O4N8j37j7L6L5rl8N6K2k0K1J4l5q1P6KJ6r1J38j62J51L9j26M7J56N97p21j50
2950E4J38L4k1%j6rJ00j32K5M3m7l1K35r0r5l4R7p6K6J27j91l8P0J26j99K05m2Pj89Q5J6m
2650A74J16Q3j30j9q9J71j41O0o4rJ25l0M4j60J94j31K17k76K05k02J71o7m9J47j24K8J15
2396C59j01%r7K65j89p9R1J0q5Q4J14k24K69k12J21m5M5NJ38j79Q4jJ7k8jO5j54R7L9L5j24
$$ plain form
4405 37 55 68 26 36 187 123 182 118 192 122 113 173 66 101 64 116 168 166 145 108 196 55 159 287 108 145 61 23 189 49 88 100
4105 100 53 163 77 78 150 87 168 77 176 122 95 36 166 161 115 70 220 24 94 55 26 155 211 188 201 145 44 236 68 182 247
3814 247 116 174 218 129 38 193 48 157 130 119 189 108 161 131 116 174 182 180 82 109 195 94 250 178 171 22 183 108 151 108 75 157
3513 157 231 69 189 301 36 105 87 110 38 190 180 43 157 147 106 331 135 118 111 145 105 111 214 174 327 59 38 186 200
3241 200 296 113 177 235 98 81 117 152 143 105 161 183 163 184 198 163 82 158 160 176 85 223 61 212 251 125 172 328 925 204 54
2950 54 192 226 205 205 189 180 280 148 173 216 169 138 373 283 188 154 251 175 201 328 137 99 169 295 96 301 259 266 77 162 178 174
2650 174 290 373 243 224 135 306 165 225 161 152 277 247 291 131 325 194 411 135 340 138 309 242 193 340 216 244 359
2396 359 258 258 161 426 237 158 249 259 174 258 372 148 417 205 326 281 326 331 469 290 374 373 390 362 361 426 272 369 408 443 319
2105C19J61l7q3M0N2K5o3PN3j6J39j30K23M98K911o65k658j31K9J64J01k09j26k67K77q2k8
1851E04J10n9K85k42P6J39j0J1R1j7L0J48o9J68J78l94N75J2K5J66J23L34M68J99P88P84J320
1598E743J875L223M950N842L624j229R184J567J1917R1550o7104o2949l203P2383L1911q0911
1448B8373j4166n695k499j504j087o39p6j94m15j75j149K962j226p55j61k34o8Q1l00O8n1
1250A090j08l9n9R5j20p4L2m1o8L3J37k09N8M6l03J90r4J20j15J87k43o6J2P4Mp2M0k2j28
978C57L29l73K04j53J23j41N8n3R9m1n6O0Pq1j10K88j14j48J48k6Q3j50R6Qm4k57L29k38J08
706C12mk4J93k65K19k75J91k4j83K74p6r7J50j20J08k3r9J69K29k61J79k04J059k15O79r01
462I91Q81K074M200L3J791L41n254l232p12m55j46j14j48K32j30q3N6j52J6J74j89J14j38
$$ plain form
2105 319 480 443 360 400 452 477 414 421 474 458 597 467 690 1188 4099 3434 776 645 674 838 939 730 604 337 614 532 504
1851 504 614 555 840 598 674 813 803 814 905 888 918 1066 997 1165 1343 949 1524 1536 1561 1727 1850 2184 2652 2851 3639 4423 5743
1598 5743 7618 10841 15791 21633 25257 24028 33212 34779 46696 138246 71142 8193 4990 77373 109284 28373
1448 28373 14207 8512 6013 4509 3422 2783 2707 2513 2098 1923 774 3736 2510 1755 1594 1360 1292 1373 1073 1141 1090
1250 1090 982 943 884 979 859 785 817 776 708 741 878 669 727 773 470 660 566 686 571 758 515 449 461 535 539 467 507 485 357
978 357 686 313 517 364 487 346 404 351 450 409 353 413 420 339 229 517 403 255 403 377 460 310 406 414 370 113 442 204 312
706 312 308 284 477 212 431 156 347 323 140 414 338 241 391 271 379 356 257 426 655 394 573 369 1428 1213 1892 991
462 991 1872 3946 8146 8179 9970 10311 5057 1825 1113 658 512 398 250 482 352 269 325 173 189 363 174 288 150
246A50O6K2Km9P1k03K19M3k24J09k9lQL9j55J65j9o7K72o2k99K08k8j39J15%O1j60M7M6n5
-45A51M4o3l6N4m0K14k03J13m0j08J57q2R3j51J82k20KJ47j20J59j07J17r9J13j31J36j96
-299H6J98j34l8Q0q7N9k6J50j59m9
$$ plain form
246 150 216 238 240 191 262 59 278 321 97 206 177 174 182 221 66 231 212 145 417 355 56 264 236 97 212 212 273 113 160 206 151
-45 151 195 132 96 150 110 324 121 234 194 86 243 161 254 103 285 65 67 214 94 253 146 263 164 277 146 282 86
-299 86 284 150 112 192 105 164 138 288 129 80
-393H0
##PAGE=	F1=1513.32
##FIRST=	4405.4461538743908022,	4405.4461538743908022,	0.17444820702075958252
##DATA TABLE=	(F2++(Y..Y)), PROFILE
4405B9lQK6QN1m0j6M6J1j0m0R2j3r1m0O8N6n2P7j26J27j21j3K08q2p2k8M3k1l5P0j13M8L0
4086H2Mo2Q8M6p0qK2m7K9j3K2k8O4r7Q7n3L7j5k1R5l4l7N1K9j09J01n7%L7j6l3O4J7j30O6
3758A11l9J3K1q2R6M2r2j1M2k7O4mK3j37J53L0o8j2JJ1q6K1K1j8K4m2P1J4j11K42j91L2M9
3448A61j57N5RQ6o3Oo0pJ95r3j6Mm8L3P6n7n5K62j74j9m7nJ45j6j63J17n3P3j33l4N6n3M3
3138F8M2Q6j52Q8j0rK2j17J55o8JJ4m8K3L4l8K07L79m11r6j17L4J31j71M6oJ27o9j03Q7Pp7
2837E9J26L6m4r7O7L8j12K97l29J31j23J54M2j43O7R8j40J3n7Q3n1J57j83J15o7k3O2m2j4
2565A20q0J29j03J93j94O1n3K38j24L7j31N9J5o5J13m8n6K00k63K16j14J02K5n1j51O2J5%
2302A52Ok1J52j76J20j48J28j84K89r6p9M1J63k89J81O6j36P4j31J73j01J19n0J15k14J79
$$ plain form
4405 29 26 34 60 68 119 79 63 109 120 110 70 162 149 58 18 86 142 90 167 41 168 47 34 242 160 88 60 103 82 47 117 4 52 82
4086 82 86 24 112 158 88 80 102 55 84 71 93 65 129 32 119 66 103 88 67 162 128 91 142 171 62 163 106 106 143 127 94 158 175 45 111
3758 111 72 85 106 24 120 162 70 59 101 74 138 134 157 20 173 203 135 123 124 135 49 70 91 73 97 55 126 140 29 271 80 112 161
3448 161 4 59 68 154 91 97 37 30 225 132 116 120 72 105 181 124 69 331 157 138 91 86 231 215 52 169 116 189 56 22 78 25 68
3138 68 110 196 44 132 122 113 135 18 173 105 106 120 72 95 129 91 298 677 266 170 53 87 218 47 93 87 214 145 42 129 136 59
2837 59 185 221 177 80 147 185 73 370 41 172 49 203 245 102 169 267 127 140 83 166 115 272 89 204 137 114 176 134 120
2565 120 40 169 66 259 65 126 73 311 187 224 93 152 167 102 215 167 111 311 48 264 150 252 277 226 75 137 152 152
2302 152 158 137 289 113 233 85 213 29 318 222 143 184 347 58 239 305 169 243 112 285 184 303 253 368 154 333
2058C33j18J42k29K30k5J56j48n1P70M532j532l000k86m34O3O4J3L4k70K19m4j39L4L3P2L0
1814D49j13K16j48K09m0l9nK27k16K50J72J72m54L01M4J80N6K93L23J14M66N22J062J538K211
1579G790K912L430K408m77R594M840J6785J24442p1531p3439J476O571K2852m0897j0027k363
1429D366j691o98k01k26l52N4l52N6K38M78j2o65j62j12k34K86l02k0J90o5j73J1j0L9j3j18
1185C12J66k64J41K6j5l2J14L3k60P3J7j03K35j06J9j86J80k03O9J52j17j50L00j12m3Lj2
931B37m5j4O2r0Q2j06R7M5j40M5K1R0q0k4p1J99j73J11P8j50K3L8j20M8k7o8K17j66J90p6
649B33j28N3O4l4k5k5P3j72K58j02j61K94N7K03m09l8J158J37q56L9M83J074K539n94P88R84
405E893k820j995m04l23j37%j99K09L0j87O0N2j11J52j73R3ln2j2R3j28R0L6r7J42j2j09Q7
$$ plain form
2058 333 215 357 128 358 333 489 341 290 1060 5592 4060 1060 774 340 403 467 480 514 244 463 419 280 314 347 419 449
1814 449 336 552 404 613 573 534 529 756 540 790 962 1134 680 981 1025 1205 1261 1554 1877 1991 2457 2979 4041 5579 7790
1579 7790 10702 14132 16540 16063 25657 30497 47282 171724 100193 26754 28230 34801 57653 16756 6729 4366
1429 4366 2675 1977 1776 1550 1198 1252 900 956 1194 1672 1660 995 833 721 487 773 471 451 641 576 403 414 404 443 430 312
1185 312 478 214 355 381 366 334 448 481 221 294 311 208 443 337 356 170 350 147 216 368 251 101 401 289 246 249 237
931 237 192 178 240 150 232 126 223 268 128 173 194 284 204 180 109 308 135 246 324 174 197 235 115 163 136 68 285 119 309 233
649 233 105 158 222 188 163 138 211 39 297 195 34 328 385 588 179 141 1299 1436 580 619 1102 2176 4715 4121 4909 5893
405 5893 3073 1078 674 351 214 214 15 224 254 67 127 179 68 220 47 140 137 85 73 166 38 128 164 67 209 197 88 175
142A75j21J5M4Qk9N6k8J25Q8k03J8P5q6r6J6J71j01p9J26j71J35rp1L7L1M5n8n0R5j04P7p0
-158F1M5Q1np5j2m8J2J16r3J73jr2j12J85m3k2p3J19j67PP2KO5n5j24
$$ plain form
142 175 54 69 113 121 92 148 120 245 333 130 148 223 137 41 57 228 127 48 174 3 138 129 58 95 126 171 113 63 158 54 131 61
-158 61 106 187 182 107 95 47 59 175 82 255 254 162 50 235 192 170 97 216 49 56 128 130 195 140 16
-393A6
##PAGE=	F1=1503.93
##FIRST=	4405.4461538743908022,	4405.4461538743908022,	0.037542238831520080566
##DATA TABLE=	(F2++(Y..Y)), PROFILE
4405FN1L1M4J5q2Q7n0R2j42K09k09J94Q1j27l7k0Q7j89K02k9Q1j20j5J05K2n9k8M2r0oP8o2
4105A62J1K3L2l5M4M0j16k0J44j40P2J6j18K0J28p9NK2Q6p4J3K1j81K2O1J88j65M1M8j01J8
3814A88N0o8o7K06q5r2J28j1np6M8J21j64N2M2j60J47p0J99k17J45M6k81K09q8J60j00o6Q0
3542B71j3Pq7M1R0j09J58j08M8P8k01O7l8J22r9J4kj0J9M6j5L2k4J7R5l08J46K40j08Rk52
3250A26J62Q1N2k46M6J07J23j53m2M5p2K4K5J20j51M2P0pQo3Q5j3j43J54j33L4M1PL8J68m4
2959D91r0j59Q3J21k04J02k1P4K4j03L6N4n6j24J50R8j20m0J38j27K99k72J35j52P5J16l01
2706B27J54J73r3L0r5N3j47J87p4Q1l2j37J68n8K8o1M2r1K19j55o8P1J10K1m3j5k8M0jn1J11
2415E66p5J58k27K43q4k7J34j6j65J8J00l4m2N1J9JQ5j68J34j13J53J0j40O0J38j80J21J12
$$ plain form
4405 6 57 88 132 147 65 152 102 194 52 261 52 246 327 200 163 143 230 41 243 214 295 175 160 265 287 228 200 242 152 146 224 162
4105 162 173 196 228 193 237 277 161 141 285 145 217 233 115 135 263 184 189 211 297 223 236 257 76 98 159 347 182 223 271 170 188
3814 188 238 170 103 309 224 132 260 249 244 168 216 337 173 225 267 107 254 184 383 166 311 357 76 285 197 357 257 191 271
3542 271 258 265 178 219 309 200 358 250 298 376 175 242 204 326 227 241 239 229 248 294 279 311 287 304 399 91 237 477 369 378 126
3250 126 288 369 421 175 221 328 451 298 256 301 229 253 278 398 247 289 359 352 360 297 382 369 226 380 247 281 322 329 367 535 491
2959 491 401 242 325 446 242 344 323 397 421 318 354 408 352 228 378 476 356 316 454 327 626 354 489 337 412 528 227
2706 227 381 554 461 491 396 449 302 489 415 496 464 327 495 437 465 404 446 355 574 419 351 422 532 553 510 495 467 507 506 455 566
2415 566 491 649 422 665 581 554 688 672 507 525 625 591 549 600 619 620 705 537 671 558 711 721 581 641 779 599 720 832
2152H32j31R3j85J70m3O5K8J11j90K18k84K52j45K02l7J03n3n19L57N869k663k145l62m35
1926A108k6nK4J12j35J55M7j00k0J23l9J82p2J69j38K57RJ0K8K62j80K46O5O49r48N62J40
1673B485K25J33K52K43K60L22N19Q53J203J131R21M70n65j686P601N202K0316J44457n7243
1495A27099p2941K6347J58637P4359k26234n3515j3015o105l477k238j533r53o11o28l60m87
1344D345m61l92j39j95j52k15o8j27k72K5m7k57Mj85K7l4j15%k04J7j38R7r3n7K52l67M8q9
1081A208k6N7j1N1j92Q8j73jJ21o8j23N7P0j85J17q3k5rM9j67O0o9Q5J1m8m9j76K27j3q0j51
790E52K42j20N1Q4j34L5m7n0K5Nq7L6LK6J00k51L4J90k24L8P3n4m2J28j15j3J42m85Q11m59
509D94M23J446J781q50k941L44N52J496o62n11P32j133q05J91p8J2np0j37K60j19m3J54j92
$$ plain form
2152 832 701 794 609 779 736 801 829 940 750 968 684 936 791 993 956 1059 1006 487 844 6713 4050 1905 1543 1108
1926 1108 1082 1077 1101 1213 1078 1233 1280 1180 1160 1283 1244 1426 1354 1523 1385 1642 1651 1661 1689 1951 1771 2017 2082 2731 1783 2345 2485
1673 2485 2710 2843 3095 3338 3598 3920 4439 5292 6495 7626 8547 9017 8452 6766 14367 19569 39885 184342 127099
1495 127099 54158 80505 239142 313501 87267 33752 20737 14632 11155 8917 7384 6431 5820 5192 4832 4345
1344 4345 3884 3492 3353 3158 3006 2791 2723 2596 2324 2349 2302 2045 2049 1864 1891 1857 1742 1742 1538 1555 1417 1514 1421 1364 1616 1249 1297 1208
1081 1208 1182 1239 1228 1279 1087 1175 1002 1001 1122 1054 931 988 1058 873 990 907 882 873 922 755 815 746 831 842 794 745 569 796 783 703 552
790 552 794 674 725 809 675 710 663 613 638 643 556 592 595 621 721 470 504 694 470 508 581 527 485 613 498 485 627 142 953 494
509 494 917 2363 4144 3294 353 697 1249 2745 2083 1572 2304 1171 366 557 479 491 486 416 279 539 420 377 531 339
283C39R4l2r7J44j5q1K9N1j09J66j81L8J94k83J56o1K9m8J01j95J22Mj87L25j06p3J27q8p2
11B91q9K14J3j84J27q4N8L8p3J7M0j92J19l4R6l8j14J07p0J63j24Q1lj34J3L9m5J92M8l45
-271A27R1J08P1k14J01J40k05K0k3J9k05J99j36
$$ plain form
283 339 433 401 304 448 433 352 381 432 323 489 308 346 540 257 413 352 381 333 434 239 361 365 178 503 397 324 451 363 291
11 291 202 416 429 245 372 288 346 384 311 328 368 176 295 261 357 319 205 312 242 405 281 362 359 225 238 277 232 424 472 127
-271 127 218 326 397 183 284 424 219 239 216 235 30 229 93
-393I3
##PAGE=	F1=1494.54
##FIRST=	4405.4461538743908022,	4405.4461538743908022,	0.43666341900825500488
##DATA TABLE=	(F2++(Y..Y)), PROFILE
4405G4K3N5P7L6n7J22k0O0j24K35k10J57J30j25n9m8J07j96J78N9K7j28J6L7O9j9m5K4o1p6
4124C18Q5j3KM4M1k8L1k2k5r1K21j91Q3J4j13J7J09o3J8pJ32j33O1l6j52O2J4K04j60L9M9
3833E10j09J6M7k8j26K12k9j26J64K4n8n2J7J22j19L4M5j76J49j23L01k68J65rk02K16j93
3579D04K54q5j45J49k8k8l6K4M3l0M8n1O4J06k43Q0K7P3j20L3K3m7J2M3oO3OOP2k96J51K17
3279G83j15M9k76K02N7J7j89k4J64J54j66l9L4r2M3M2Q5q0m0J13%%m3O5J2j80J70r3L8m2O5
2988G14K2p5K09r3j25R2P2j72J40p9J20Np6K4N6p7j09Q3J99j52p2K17j61K74k44J56j66R0
2725H72Q7k53J43J96r7O0j21lp6J62k0K4j8o2J02l2K7n0L0q9K33j31p3R1P3K6j1%j7K2K2r0
2424A027J45o5J45k10K51o0k0R3J2j42J2J33l9j3MK4O4Q0j57J27n4J23K8j35O5Q9r3Q9J87
$$ plain form
4405 74 97 152 229 265 208 330 310 370 246 481 271 428 558 433 374 326 433 237 415 474 501 373 389 426 495 476 431 455 394 318
4124 318 403 390 392 436 477 449 480 458 433 342 563 372 455 469 356 373 482 419 437 430 562 429 490 454 302 364 378 582 422 461 510
3833 510 401 417 464 436 310 522 493 367 531 555 497 445 462 584 465 499 544 368 517 394 695 427 592 583 381 597 404
3579 404 658 573 428 577 549 521 485 509 552 522 570 519 583 689 446 526 553 626 506 539 562 515 527 570 564 627 633 639 711 415 566 783
3279 783 668 717 441 643 700 717 528 504 668 822 656 617 651 559 602 644 729 649 609 722 722 722 679 744 756 576 746 653 691 649 714
2988 714 736 661 870 777 652 744 816 644 784 705 825 830 754 778 834 757 648 731 930 778 706 923 762 1036 792 948 782 872
2725 872 959 706 849 1045 948 1008 887 884 808 970 950 974 956 894 996 964 991 941 971 882 1115 984 911 1002 1075 1101 1090 1090 1073 1095 1117 1027
2424 1027 1172 1107 1252 1042 1293 1233 1213 1306 1318 1176 1188 1321 1282 1269 1273 1297 1361 1441 1284 1411 1357 1480 1508 1373 1438 1527 1434 1523 1710
2152A710j41R7k06K01j3O7O8O8j29K10k78K29m3J94k4P4l3m45j18N967l915m61l99l99n4j2
1908B215MK42p0J90Q0l6j1J88mK00K8J81j28L05P3P2J08L46j71L02N5Q31r46P04J62L66K31
1654E517K31K78L55L58N30O17O73r7r37k168j707K245K077O13K0517J44003k5996o1183O0183
1476A46109L74828J71919m99165j15838l1178j3610p864n158l462k008j408j317j022j847
1344H979K935l093j191m09m02l22l38k62m25k08j48l76p8k67p5j45j72j40k36l3j95L6j55
1128C280j44J97l56m1q9q0K6q1%k17O0j52q2J07q6j49M0Pj81J08j08l8l7K3j76No5P9j9k8
847A803j34j00J29j2l3k34K84j52M8P0j39m0L5j32M8j1p1on1M3R5k34J4J86k37K7R8q4rM3
565A244q2k2J43m32O42q9O04L066L611o67o832r0N47N61q17q16K14l4N0K80l1P5r7o5j32K21
$$ plain form
2152 1710 1569 1666 1460 1661 1648 1715 1783 1851 1722 1932 1654 1883 1840 2034 2010 2084 2051 1606 1488 7455 3540 3079 2680 2281 2227 2215
1908 2215 2219 2461 2391 2581 2661 2625 2614 2802 2798 2998 3026 3207 3079 3384 3457 3529 3637 3983 3812 4114 4169 5000 4054 4758 4920 5286 5517
1654 5517 5748 6026 6381 6739 7269 7886 8559 8462 7525 5357 3650 5895 7972 8585 29102 173105 147109 85926 146109
1476 146109 520937 692856 193691 77853 46675 33065 25201 20043 16581 14573 13165 11848 10826 8979
1344 8979 11914 8821 7630 7221 6819 6497 6159 5897 5472 5264 5116 4740 4662 4395 4320 4175 4003 3863 3627 3594 3399 3435 3280
1128 3280 3136 3333 2977 2936 2847 2767 2793 2712 2712 2495 2555 2403 2321 2428 2342 2193 2233 2240 2059 2167 2059 2021 1984 2007 1831 1836 1771 1850 1831 1803
847 1803 1669 1569 1698 1686 1653 1419 1703 1551 1599 1669 1530 1490 1525 1393 1441 1430 1359 1353 1302 1345 1440 1206 1220 1406 1169 1196 1294 1210 1201 1244
565 1244 1162 1140 1283 851 1493 1404 2008 5074 8685 8018 1186 1096 1643 2204 1387 571 785 751 801 1081 1050 1125 1028 963 831 1052
321A052o9n0J01j97J14l4j21J27N5r5o3J57j86J46j09m4K25l05J25pL4q0J12k22J31K2k05
67F14K47p1k7O7o6k3j58K10O2k14R7k9N2J4o0RJ3j58N2N0M4k6j39J44p4J05r6P6K0j23m7M1
-233F06m0J70M3k89O6N7R0j92J22R0j64k9j00N3k51J45j47
$$ plain form
321 1052 983 933 1034 837 951 917 796 923 978 883 820 977 791 937 828 784 1009 704 829 822 856 776 888 666 797 819 614
67 614 861 790 763 830 764 741 583 793 855 641 738 709 761 775 715 724 737 579 631 681 725 699 560 704 630 735 639 715 735 612 565 606
-233 606 566 736 779 490 556 613 703 511 633 723 559 530 430 483 232 377 230
-393B30
##PAGE=	F1=1485.15
##FIRST=	4405.4461538743908022,	4405.4461538743908022,	0.99298489093780517578
##DATA TABLE=	(F2++(Y..Y)), PROFILE
4405A68k3Q5R5O5J2J36JN1j12K43j71R0J68j20p7n2J31j96J38J04K2j46PN3N0J7p2L9l0j09
4124E67N1K2J0N1N6j4K1r6N9j35K59k15J16k4p1oR5q2O1k7J51j84J15q2j11J13l2J62j10L6
3842G56J7q2jO5jj41J58L8j50J71N7j02j7j6J10o0j0P4j81J43j53L40k76J86q8r9K04k46L12
3570A008q7j85J79m6l5J0K0pK0J8n2Q4R4k23M3J20J0j28N5M4q1M1j4K4P0L2mM9k53J19K30
3279A155j39P7k56K14L4m7j05m3J77J82j80k7J9j08P0M9M7jq9J06J3rj3M1L3j97J90o1K4q0
2997A076Q8R3l15M09j23r0Q8M2j41J76j37J66k5m4JO6j13n3M5K49j72r7K89j73K31k02J55
2743A489j81J20N6k24J62J95r9R7j42p4L1J43j0lj4OK9J8L7n6J9o8K26j01q2J27K7L7J9L7
2462A821l5MN4r6J53n0J31j86K34k0kL7O0j36L1J35j4j9%K0J31L5q3Q8QJ14J9r9O4N3l7R2
$$ plain form
4405 168 145 230 325 390 402 538 539 590 478 721 550 640 808 688 611 559 690 494 632 736 758 612 619 672 722 739 667 706 676 567
4124 567 618 640 650 701 757 743 764 668 727 592 851 636 752 728 657 651 746 664 725 698 849 665 780 698 587 700 668 830 720 756
3842 756 773 691 690 755 754 613 771 809 659 830 887 785 768 752 862 802 792 866 685 828 675 1015 739 925 837 738 942 696 1008
3570 1008 921 736 915 869 834 844 864 857 877 895 843 927 1021 798 841 961 971 843 898 942 861 902 888 912 982 1014 1010 1059 806 925 1155
3279 1155 1016 1093 837 1051 1085 1038 933 890 1067 1249 1069 1042 1061 953 1023 1072 1119 1118 1029 1135 1148 1139 1126 1167 1200 1003 1193 1132 1156 1076
2997 1076 1164 1257 942 1351 1228 1138 1226 1268 1127 1303 1166 1332 1307 1263 1264 1330 1217 1164 1209 1458 1286 1189 1478 1305 1536 1334 1489
2743 1489 1308 1428 1484 1260 1422 1617 1518 1615 1473 1399 1430 1573 1563 1560 1546 1552 1581 1599 1636 1580 1599 1531 1757 1656 1574 1701 1728 1765 1784 1821
2462 1821 1786 1790 1844 1748 1901 1851 1982 1796 2030 2010 2008 2045 2105 1969 2000 2135 2121 2102 2102 2122 2253 2288 2205 2293 2301 2415 2434 2335 2399 2452 2415 2507
2161B507K05j13Q3j74J89M0N9J07L1o6J67k03J96L9J78j6Q1l6l19j45N086m596J097m09l61
1926C627m9J13N9L47k8K21J05J2J3K31O6K17J28K06q4L37J45J56K04M27j23L58R7R35p91Q23
1682G752K31N43L74K27L73N30M53O90O18N12m35n95j05K783M355K459J77P513J13584J4548
1495A56587m0210R6869O18576K88568q04272j86718n2897k2419j2883q351n538l455k194k086
1363A9577j748l105N285n205k171o87o62m65o28m56o01m58k95m86j72l71j87k71k83k47l04
1166F060o9k42o3k29k03Q5l38j35r8j51pj28q8k39L2j43j57J05j37j52ro9j63P2j28m1p6j4
903C275j76j8j02R4p3k4j90m0M1k9J0k73K73j87N9qj12q0Q4j90P0q0j8l9j12P5L9j72j3J52
621B236k35K0J04p7nj0p3p9K06l38L82K93Q51N514N504n02j1282p38N80q9q85m10R29Jl19
$$ plain form
2161 2507 2712 2599 2682 2508 2697 2737 2796 2903 2934 2868 3035 2832 3028 3067 3245 3229 3310 3274 2955 2810 7896 3300 4397 3988 3627
1926 3627 3578 3691 3750 4097 4069 4290 4395 4407 4420 4651 4717 4934 5062 5268 5184 5521 5666 5822 6026 6453 6330 6688 6785 7720 6929 7752
1682 7752 7983 8526 8900 9127 9500 10030 10483 11173 11791 12303 11868 11273 11168 13951 18306 20765 20942 28455 142039 156587
1495 156587 116377 213246 831822 1120390 316118 129400 76503 54084 41201 32850 27312 23857 21663 19577
1363 19577 17829 14724 20009 14804 12633 11946 11284 10819 10191 9735 9134 8676 8381 7895 7723 7352 7165 6894 6611 6364 6060
1166 6060 5991 5749 5686 5457 5254 5339 5001 4866 4768 4617 4610 4482 4394 4155 4187 4044 3887 3992 3855 3703 3694 3625 3462 3534 3406 3365 3289 3275
903 3275 3099 3081 2979 3073 3000 2976 2786 2746 2787 2758 2768 2495 2768 2581 2640 2632 2520 2440 2524 2334 2404 2324 2306 2267 2155 2230 2269 2097 2084 2236
621 2236 2001 2021 2125 2048 2043 2033 1960 1881 2087 1749 2131 2424 3275 8789 14293 13791 2509 1771 2351 2262 1377 967 1896 1897 1578
387A578J80n3R5j62m1j24J75l3m5N2j87J25l4j55Q2J37j14j33K46k35R8j4j03K07k98R3J3
133A350O9r7Q9k16J08K5j79J70q0L0%l3K3k18K25Q9k38P4J2M9o1nnj7j14RJ12Km3j46J70p4
-167A080N1k8L7J6j04p4M7p9J59L7k06J3M4O7j37Q8N1j18p2j65N8k53L5j86
$$ plain form
387 1578 1758 1705 1800 1638 1597 1473 1648 1615 1570 1622 1435 1560 1526 1371 1453 1590 1476 1343 1589 1354 1452 1438 1335 1542 1244 1337 1350
133 1350 1419 1322 1411 1195 1303 1328 1149 1319 1239 1269 1269 1236 1259 1041 1266 1355 1117 1191 1203 1252 1191 1186 1181 1164 1050 1059 1171 1173 1130 984 1154 1080
-167 1080 1131 1103 1140 1156 1052 978 1025 946 1105 1142 936 949 993 1060 923 1011 1062 944 872 707 765 512 547 361
-393C61
##PAGE=	F1=1475.76
##FIRST=	4405.4461538743908022,	4405.4461538743908022,	1.5493062734603881836
##DATA TABLE=	(F2++(Y..Y)), PROFILE
4405B62o8J13J14R3Q2J51K1M3j00K49j31K3K06j15r6n4J49k00J38J07K3j58kO8L2N2r4O0m1
4133I27j00J1N2J8N9P0%J1j70J49j74K54j98J44o6k9k9Q1j01J05m8J70k35J68j26p7J60m2
3870I84P3j3lj0n1j6Q1K6j55J04J04j72J77R0j47K0n0R7jn2J01j84J37j84L79k83K05j66N
3598A096J90k98L71r0k25K09o3m3N7J5n7O9j1n4J04Q3k03PK12n4j34P5O6j16P1p2N5P7N7j2
3316A382K6k11Q7K42j61J04k36K25J3j13j9o2J68J89j85lJ4j12Q6M4RP9j38J00K5j7J7J7O3
3044A633k03J89m9K4j02Q0K16n60O05j64o6Q3J3j21K01j83K22o6k3j0Q7j40J4mK90j82j12
2790A672L39k06J99j50J54j96J51K4j95J82J83j11J43j50j35J47J15j1l0rP2m3O8M6o1Qm6
2537B160K19p1r2J63j9L8L8Q4m2j3Q5j14J53k7J28j71K06J9J8j9J07j31N1J37J1j4PNJ87j0
$$ plain form
4405 262 194 307 421 514 596 747 768 811 711 960 829 852 1058 943 847 793 942 742 880 987 1010 852 850 918 950 1002 908 968 927
4133 927 827 838 890 908 967 1037 1037 1048 878 1027 853 1107 909 1053 987 958 929 1010 909 1014 966 1136 901 1069 943 866 1026 984
3870 984 1057 1044 1041 1031 980 964 1045 1071 916 1020 1124 952 1129 1219 1072 1092 1042 1139 1138 1086 1187 1003 1140 956 1335 1052 1257 1091 1096
3598 1096 1286 988 1359 1269 1044 1253 1190 1147 1204 1219 1162 1231 1220 1166 1270 1353 1150 1157 1369 1315 1181 1256 1322 1206 1277 1205 1260 1337 1394 1382
3316 1382 1408 1197 1284 1526 1365 1469 1233 1458 1471 1358 1339 1277 1445 1634 1449 1446 1460 1348 1434 1478 1487 1566 1428 1528 1553 1536 1553 1570 1633
3044 1633 1430 1619 1570 1594 1492 1572 1788 1228 1833 1669 1603 1686 1699 1578 1779 1596 1818 1752 1729 1719 1806 1666 1680 1676 1966 1784 1672
2790 1672 2011 1805 2004 1854 2008 1812 1963 1987 1792 1974 2157 2046 2189 2039 1904 2051 2166 2155 2125 2116 2188 2145 2213 2259 2198 2206 2160
2537 2160 2379 2308 2216 2379 2360 2398 2436 2520 2478 2465 2550 2436 2589 2562 2690 2519 2725 2744 2762 2743 2850 2719 2770 2907 2918 2904 2911 2916 3103 3093
2255C093rM9O9J07J0o3O2J8J7R6K23q5O9j32J89Q2M1J46pkJ24j30J64J21J63j0Q8l2j86n3
1973D222L932m090J546l78k80J0K93J27L83j3K25J31O1K6K63J47K44K19K18l8L68K29K49K89
1748H383M99n6M35J19J019n20Q89L09P31N45K51N30P67O33J023R09R24K91J088K196M211M708
1541B9884M498L266M022O0330N2008j4769J28458Q39707M00223j077670k51794p3948l0841
1419G3374j7537j1181p235n028k841k715k310l807M803n953k279r36q96n84r03o37p63o94
1250A1878m28n82k65m76k85l83l95l53l57r1k90j63l03k61k6l21k16r1k22m1j75j75k62Mj20
1016E601k18R0k04j41m3j45j46L6j46m5j15n1j77m0j38J14j24m7j91Lo7l2O7l26K49k23P0
762C611p1p2j21J34k48R2j48L4n2j50Q6m0j09l9J17k34J3J11p0%o4o5j35K70k19J49O12J123
$$ plain form
2255 3093 3084 3133 3202 3309 3319 3256 3318 3336 3353 3449 3672 3587 3656 3524 3713 3795 3836 3982 3975 3973 4097 3967 4131 4252 4415 4405 4493 4461 4275 4222
1973 4222 8154 4064 5610 5232 4952 4962 5255 5382 5765 5752 5977 6108 6169 6195 6458 6605 6849 7068 7286 7248 7616 7845 8094 8383
1748 8383 8882 8826 9261 9380 10399 9879 10768 11077 11808 12353 12604 13134 13901 14534 15557 16466 17390 17681 18769 20965 25176 29884
1541 29884 34382 37648 41670 102000 154008 139239 267697 1107404 1507627 429957 178163 104215 73374
1419 73374 55837 44656 37421 32393 29552 26837 24527 20720 25523 19570 17291 16355 15459 14875 13972 13335 12572 11878
1250 11878 11450 10868 10603 10127 9842 9459 9064 8711 8354 8263 7973 7810 7507 7246 7220 6899 6683 6592 6370 6329 6154 5979 5717 5721 5601
1016 5601 5383 5473 5269 5128 5085 4940 4794 4830 4684 4639 4524 4473 4296 4256 4118 4232 4108 4061 3870 3873 3806 3774 3841 3515 3764 3541 3611
762 3611 3540 3468 3347 3481 3233 3325 3177 3211 3159 3009 3095 3055 2946 2907 3024 2790 2803 2914 2844 2844 2780 2715 2580 2850 2631 2780 3392 4515
499D515Q349P139k88j5684j623N17k84k50p98Q50K05m37J36j8N8j98rj07J29Mm6lj34R4qj62
255A947J5J97j06j76K71k63M5P6j62J88k68Q1J2Q3j15O8j90J05K9j53R3q8Q7o7jO9k99K18
-8A696J37k40L1L1O6j15N2j9m8o9n7J54j8l9j75J74n2J9J8k4L4o4j02N3j17J48L1j23m0L1
-290A373M4q2N4J3p3j15k30O4k56p4k26
$$ plain form
499 4515 12864 20003 19715 4031 2408 2925 2641 2391 1593 2443 2648 2211 2347 2329 2387 2189 2180 2073 2202 2206 2160 2157 2023 2117 2109 1947
255 1947 1962 2159 2053 1877 2148 1885 1930 2006 1844 2032 1764 1845 1857 1940 1825 1893 1703 1808 1837 1684 1777 1689 1776 1709 1708 1777 1478 1696
-8 1696 1833 1593 1624 1655 1721 1606 1658 1639 1591 1522 1465 1619 1601 1562 1387 1561 1509 1528 1546 1522 1556 1492 1390 1443 1326 1474 1505 1382 1342 1373
-290 1373 1417 1335 1389 1402 1329 1214 984 1048 792 718 492
-393D92
##PAGE=	F1=1466.37
##FIRST=	4405.4461538743908022,	4405.4461538743908022,	1.9825735092163085938
##DATA TABLE=	(F2++(Y..Y)), PROFILE
4405C36r8J13J29J30J10J80K9N0r7K25o6n3K35j02j06l8J19j76J59N3M6j65j9J07j2P5q5Q3
4143A162p3l9n3O0M0N0Q7LJk08K02j76J79j23J73j49M7n8Q6j52J59n1J47k30J92j58p0K23
3880A271l7n6R9n1j8j8k7Q5K9r6qJ81j79J57J08j58N1j04R6M6p6J05j59J07j87L75k45J90
3617A481k17Q9J44k90L97r2k51K11o6k1O9J2q3Q4Np9J18O0j44m9K57r4j05O2O4j04Q7r9M0
3344A486Q4Q2j7Oj48K1K59j67J13j89K02Kj66O0o0J33J78j40%j2p5P8K3pJ32j54O9N2l2O3
3063A876k9P6j77J88m9%q3O8L33p71P70k06o6P7k1o6J86j84K36r4j1qJ18j54N6k6K68j56j20
2790B031L65k36J82r7J26k09J91Rj78J99J39q5J40j24j63K70M6l6j9k9J17r7J05P4o9%k0J76
2527B808rj37K06p4P9J6J36m5j3Q5j07J31MJ01j09J43N0K9l7J31j20O1J25M1k5M8l9K27n6
$$ plain form
4405 336 238 351 480 610 720 900 929 979 882 1107 1041 988 1223 1121 1015 977 1096 920 1079 1132 1178 1013 994 1101 1089 1164 1079 1162
4143 1162 1089 1050 997 1057 1097 1147 1234 1237 1238 1030 1232 1056 1235 1112 1285 1136 1183 1125 1211 1059 1218 1167 1314 1084 1276 1118 1048 1271
3880 1271 1234 1178 1277 1226 1208 1190 1163 1248 1277 1181 1173 1354 1175 1332 1440 1282 1333 1229 1325 1371 1295 1400 1241 1348 1161 1536 1291 1481
3617 1481 1264 1353 1497 1207 1604 1512 1261 1472 1406 1385 1454 1466 1383 1467 1472 1393 1511 1571 1427 1378 1635 1541 1436 1498 1562 1458 1545 1446 1486
3344 1486 1570 1652 1635 1641 1493 1514 1773 1606 1719 1530 1732 1734 1568 1628 1568 1701 1879 1739 1739 1727 1652 1730 1753 1746 1878 1724 1793 1845 1813 1876
3063 1876 1847 1923 1746 1934 1885 1885 1802 1870 2203 1432 2202 1996 1930 2007 1986 1920 2106 1922 2158 2064 2053 2045 2163 2009 2065 2039 2307 2151 2031
2790 2031 2396 2160 2342 2245 2371 2162 2353 2362 2184 2383 2522 2437 2577 2453 2290 2560 2606 2570 2551 2522 2639 2542 2647 2721 2652 2652 2632 2808
2527 2808 2799 2662 2868 2794 2873 2889 3025 2980 2967 3052 2945 3076 3080 3181 3072 3215 3265 3294 3257 3388 3268 3329 3454 3495 3470 3518 3479 3706 3650
2255C650P6OJ06J05Qk5N9J9PJ50J64k2N4o4J58J18rJ89k1M3R6m0J18J64J51kJ09o8k7P8K847
1964H197k852J086l07j40Q2M63J46L51m0K12J68Q4P7K59K09K79K53K17L3L69K74L75L31N41
1739A0667M8M39J64J034j99R05L70Q77O98K97O67J012Q41J386J305J537J215K424L401M430
1551C3518M352N659N821N815J4594P0373R294J47513R87543M81502j256455k96171q9720l7136
1419H6502k0835j3040q164o238l175l063k614l670J339n263j211j133j043p04j081p74q85
1260A4948q30n45o22l31n54l34m87m67m24l72j20k92k77l26l15j17k98k60r3k90o6j76k81
1044G071k48l9q6k41M6k35j20r3j70j50K1j74k8j54r9j41o3j76J25j55q5j35jj41m0J01l11
790D279J79k42P9j40k0j31J38k55R8k08O7o5j62J00j37j7o8O2k05L4Q2m6%j08n8j84L15j01
$$ plain form
2255 3650 3726 3732 3838 3943 3951 3926 3985 4004 4011 4161 4325 4303 4357 4293 4451 4569 4560 4749 4728 4771 4867 4827 4945 5109 5260 5258 5367 5299 5272 5350 8197
1964 8197 5345 6431 6124 5984 6066 6529 6675 7026 6986 7198 7366 7450 7527 7786 7995 8274 8527 8744 8777 9146 9420 9795 10126 10667
1739 10667 10715 11154 11318 12352 12153 13058 13428 14305 15003 15300 15967 16979 17820 19206 20511 22048 23263 25687 29088 33518
1551 33518 37870 43529 49350 55165 69759 140132 149426 296939 1284482 1765984 509529 213358 123638 86502
1419 86502 65667 52627 44463 38225 35050 31987 29373 25703 27042 21779 20568 19435 18392 17688 16607 15833 14948
1260 14948 14118 13573 12951 12620 12066 11732 11245 10778 10354 9982 9862 9570 9293 8967 8652 8535 8237 7977 7884 7594 7528 7352 7071
1044 7071 6823 6784 6698 6457 6503 6268 6148 6055 5885 5735 5756 5582 5554 5400 5301 5160 5097 4921 5046 4891 4806 4671 4670 4529 4489 4590 4279
790 4279 4458 4216 4295 4155 4135 4004 4142 3887 3985 3777 3844 3779 3617 3717 3580 3563 3495 3557 3352 3386 3468 3422 3422 3314 3256 3072 3387 3286
527C286J6P86J341J1122Q208j15j9124k600L86j08K61j062J66M03l58J49K3j8j95K0j06J22
321B603J0l4m9o0L2K4j85l3K42j16j71K49k49j0J56j81J40k32P5j7J08j27N4j37N9L1j08L2
58B106j21J27q3LJ15l57K02J60k17K0%J11j83J13k7q4m5o4J46j9m1j84J80m1oM4o9J2jj05
-224A692M9j34J04N8o8p4K4J1j7l1K5o4j20k57K3k29j73k53
$$ plain form
527 3286 3302 4088 5429 16551 24759 24644 5520 2920 3306 3198 3459 2397 2563 2966 2608 2757 2780 2762 2567 2587 2481 2603
321 2603 2613 2579 2530 2470 2502 2526 2341 2308 2550 2434 2263 2512 2263 2253 2409 2228 2368 2136 2211 2194 2302 2175 2229 2092 2151 2182 2074 2106
58 2106 1985 2112 2029 2032 2147 1790 1992 2152 1935 1955 1955 2066 1883 1996 1969 1885 1840 1776 1922 1903 1862 1678 1858 1817 1811 1855 1786 1798 1797 1692
-224 1692 1741 1607 1711 1769 1701 1627 1651 1662 1645 1614 1639 1575 1455 1198 1221 992 819 566
-393E66
##PAGE=	F1=1456.98
##FIRST=	4405.4461538743908022,	4405.4461538743908022,	2.1684434413909912109
##DATA TABLE=	(F2++(Y..Y)), PROFILE
4405C67j26J11J32J52J25J94L7N8j08J86J2j13K48j01j04oQ7j51J67j5Q1j57l6J46p1Q4p6
4152A123J07r0L6j31N2O3M2Q9qJ9k18K41j93J06m9K02k31J23q8R1k03K13n4J24k25K16j90
3898A167o3K86l1j86K12j00k6J5l7Q8L2l8j19K57j99J23J25j68Q1j56R4R3j00J10j25Q6j64
3645A257L15k05J73k25J32J16k62M09j09k77K14p0JQ0J1j10R9K1j05J34L5q3j05L01j33p7
3401A537N0O7q7O0q3J8Q8R1l4jp0o0K62j59J35j56J67j0k19J54m5Q4J53r5Kl7l8P1Jk4J86
3110B008j71L9O6o1J08p4J02j37J74o5rn1L0M25q83Q36k36n4P1n6k4J57j70K63j23LoJ49j82
2837B129Q3m8K46j16j15L78k80J65m3R8k24K33oj76K02R5n9J47r1j62L35k9p1J2l0J18j08
2584B683J24Q2p7qPJ32N5j84K50j28J05k1J89m9j3Q5j00J11L2P4o0O6Q1M0n5J55j09P2R9N7
$$ plain form
4405 367 241 352 484 636 761 955 992 1050 942 1128 1140 1027 1275 1174 1070 1064 1151 1000 1167 1152 1233 1076 1040 1186 1115 1199 1123
4152 1123 1230 1140 1176 1045 1097 1160 1202 1291 1283 1302 1084 1325 1132 1238 1189 1391 1160 1283 1195 1286 1083 1296 1242 1366 1141 1357 1167
3898 1167 1104 1390 1359 1173 1385 1285 1259 1274 1237 1325 1357 1319 1200 1457 1258 1381 1506 1338 1419 1263 1357 1450 1350 1460 1335 1421 1257
3645 1257 1572 1367 1540 1315 1447 1563 1301 1710 1601 1324 1538 1468 1469 1549 1560 1450 1549 1570 1465 1599 1634 1551 1446 1747 1614 1537
3401 1537 1587 1654 1567 1627 1544 1562 1650 1741 1707 1706 1636 1576 1838 1679 1814 1658 1825 1815 1596 1750 1705 1789 1942 1847 1849 1812 1774 1845 1846 1822 2008
3110 2008 1837 1876 1942 1881 1989 1915 2017 1880 2054 1989 1980 1929 1959 2384 1501 2337 2101 2047 2118 2062 2038 2195 2025 2288 2165 2168 2162 2311 2129
2837 2129 2212 2164 2410 2294 2179 2557 2277 2442 2399 2497 2273 2506 2500 2324 2526 2621 2562 2709 2618 2456 2791 2762 2691 2703 2673 2791 2683
2584 2683 2807 2889 2812 2804 2811 2943 2998 2814 3064 2936 3041 3020 3209 3160 3147 3232 3132 3243 3275 3349 3289 3355 3436 3476 3421 3576 3467 3539 3638 3695
2302C695l7Q9q2K67j03J62n2J29J04OJ3N5Oj5J89R1M0M0LJ29J38p1K30l5P4N4N0P2J94J24
2020E559OJ32j10J28J99J920j414K10k18K1J40N35J28K82q1J84J92R3J15K40K43K85K73K04
1795I266Q9L56K76M59L32N42J31M24J89R48J22Q35M10R16Q14L06P36J186R64J667J556K008
1588B4532J821K936L600L922L610N932P105Q069j470N7709K6734J49483J026505N12818j297558
1448E35748l09112r6506l9872k2050j3545q125o561l179l081k564k900k965m238N77j227j054
1297A9346p71j157q08r23q81n92n92l55n92l26n36m96m53l59j21k66l64l07l27j92k62k77
1091H389o7l43p7j49l59k21o7l9k49J5k51q6j28j82j39K0j89j0j92j34r2p2j98J35j87j08
847E020o6Rk01m7J34k82J24k62Q8j99L9j18Q1j87R7k78R0m8j46J14k35P5r6Oj76N4N5k2jj37
$$ plain form
2302 3695 3658 3747 3665 3932 3829 3991 3939 4068 4172 4178 4191 4246 4252 4237 4426 4517 4557 4597 4600 4729 4867 4796 5026 4991 5065 5119 5169 5241 5435 5559
2020 5559 5565 5697 5587 5715 5914 7834 6420 6630 6412 6433 6573 7108 7236 7518 7437 7621 7813 7906 8021 8261 8504 8789 9062 9266
1795 9266 9355 9711 9987 10446 10778 11320 11451 11875 12064 13012 13134 13969 14379 15295 16109 16415 17151 18337 19301 20968 22524 24532
1588 24532 26353 29289 32889 36811 40421 46353 53458 61527 60057 117766 144500 293983 1320488 1833306 535748
1448 535748 226636 130130 90258 68208 54663 46538 39977 36798 33717 31153 28253 25288 21050 21627 20400 19346
1297 19346 18575 17418 16610 15687 14806 14214 13622 13267 12675 12349 11813 11317 10864 10505 10384 10118 9754 9447 9120 8928 8666 8389
1091 8389 8322 7979 7902 7753 7394 7173 7106 7067 6818 6833 6582 6496 6368 6186 6047 6067 5878 5868 5676 5542 5450 5378 5180 5315 5128 5020
847 5020 4954 4963 4762 4715 4849 4567 4691 4429 4517 4318 4357 4239 4320 4133 4230 3952 4042 3994 3848 3962 3727 3802 3706 3712 3536 3590 3645 3623 3622 3485
565C485l8k37L54o%P71J455J3317Q505o4k0869l472K21J52L24j040l70M27k00J74P7r5j92
349B679M9j05J01Lrq0J3k9P0j94r5K73j12j53K22k39l8J80j82J13j97P0m8J35j41M1q4J3L4
77B290o4j4j41J67r8pJ46m01K00J83j95J1l1J55k51J74l5j20k1p1J38ok8k07J71j6j6O9j14
-196A868rO1j08M5j51O0Q5j3j08J7k2M8j02N2n6j25k70mj79k49k39
$$ plain form
565 3485 3447 3210 3564 3558 3558 4329 5784 19101 27606 27542 6673 3201 3422 3574 3898 2858 2488 2915 2715 2889 2966 2871 2679
349 2679 2728 2623 2724 2727 2718 2638 2651 2622 2692 2498 2403 2676 2564 2411 2633 2394 2356 2536 2354 2467 2270 2340 2292 2427 2286 2327 2243 2256 2290
77 2290 2226 2212 2071 2238 2140 2133 2279 1878 2078 2261 2066 2077 2046 2201 1950 2124 2089 1969 1948 1877 2015 2009 1981 1774 1945 1929 1913 1982 1868
-196 1868 1859 1920 1812 1857 1706 1766 1851 1838 1730 1747 1725 1773 1671 1723 1667 1542 1272 1268 1089 840 601
-393F01
##PAGE=	F1=1447.59
##FIRST=	4405.4461538743908022,	4405.4461538743908022,	1.9935259819030761719
##DATA TABLE=	(F2++(Y..Y)), PROFILE
4405C38j02R5J07J81O5K19K9P4j19J46M4j24K35p3j22L2M3j12J88j01R3j45j3J41j08Q7o1
4152A037J35j25J12j71J2Q0L5R4l2M9k04K16j47K2J2K28l13J95j07J04k45K23k8O8j69J94
3908A275j82o7L05j8k78K90j41k1K0k1P6J1O8k28L13k02P8J25j40Q1j93J15R4r2P5p4N1j15
3645A205K44j46J20k03J44P5j92L62r9k54J65m4K5M7K2j19R1N5j41J54Jk9j17K92j56l6PO0
3382A533l8J6m0k7R3R2m9j2Jj07K37j14J23j16J22k7k65K28JnJ34j7j8r0K9O9m3mJ92j60n
3091A733Q4q4J56j19P7m3J29n3l5k1J3M44q72P85k18n0P4r5K7Q3j14K35j22rL5J61k18R8l7
2819B044K02q4r4L35k94J72j0O4k15K34J1j72J91M1j4J19m8j25L34j03r0O8p2J07r8J08J22
2565B733j02J0K1P4J08k14K46j45J31o1K02rl0N3o6P4N2O2ll0Q8O8o0J36q0M7R0P0n0J32j20
$$ plain form
4405 338 236 331 438 619 684 903 932 1006 887 1033 1077 953 1188 1115 993 1025 1068 956 1144 1043 1136 991 978 1119 1011 1098 1037
4152 1037 1172 1047 1159 988 1000 1080 1115 1209 1177 1226 1022 1238 1091 1113 1125 1353 1040 1235 1128 1232 987 1210 1182 1250 1081 1275
3908 1275 1093 1026 1331 1313 1035 1325 1184 1163 1183 1162 1238 1249 1317 1089 1402 1200 1278 1403 1263 1344 1151 1266 1360 1268 1343 1269 1320 1205
3645 1205 1449 1303 1423 1220 1364 1439 1247 1609 1510 1256 1421 1377 1402 1449 1471 1352 1443 1498 1357 1511 1512 1483 1366 1658 1502 1466 1473 1533
3382 1533 1495 1511 1471 1444 1537 1629 1580 1568 1569 1462 1699 1585 1708 1592 1714 1687 1422 1650 1651 1646 1780 1763 1745 1655 1684 1753 1710 1706 1898 1738 1733
3091 1733 1817 1733 1889 1770 1847 1804 1933 1880 1845 1824 1837 2281 1409 2194 1976 1926 2000 1905 1932 2015 1901 2136 2014 2005 2040 2201 1983 2081 2044
2819 2044 2246 2162 2068 2403 2109 2281 2271 2335 2120 2354 2365 2193 2384 2425 2411 2530 2482 2357 2691 2588 2498 2566 2494 2601 2503 2611 2733
2565 2733 2631 2641 2662 2736 2844 2630 2876 2731 2862 2801 3003 2994 2964 3017 2951 3025 3077 3139 3136 3106 3194 3262 3202 3338 3258 3305 3395 3465 3415 3547 3427
2274C427K57j24K26r2J18J05OK4O5J3p4K34j3J22L1L1J04J31j35K48lM1O6P5O4J85Q8MJ58
2002E382j56K58L38J023J19q68r2J40J76M78O8K09j23J44K26N7J48K32K22K91K49J66J14L25
1776I126K47M86K89M99J71L53K13P44L92P23L90Q18Q36L14O92J208R74J728J558K121J901
1579B5783K680K966L006K803N537O936R098L567K8555L4583J33989R47409M86468j191320
1448E02060k87277r2607l8471k0959j2700p204n590k907k798k258k048m932m331K239j194
1307A9023r59p63j077p83q60q05n60n26l14n81k67n46m37m52k84j17j98m31k30l32k00k35
1100H066k25n7l27j17r0l70j66j23J1k13k6k23p9j22j64j44M9j88Jj82j83oj15j67J16j77
856D779j20Nl3k01k5J29k24N7k55R5k18P5p7Kr2O0k69P1j5j27J30l12J52j26k2j24Q8J1j5
$$ plain form
2274 3427 3684 3560 3786 3694 3812 3917 3923 3947 4012 4025 3951 4185 4172 4294 4325 4356 4460 4591 4456 4704 4701 4742 4808 4883 4947 5132 5220 5224 5382
2002 5382 5226 5484 5822 6845 6964 6096 6004 6144 6320 6798 6866 7075 6952 7096 7322 7379 7527 7759 7981 8272 8521 8687 8801 9126
1776 9126 9373 9859 10148 10647 10818 11171 11384 12128 12520 13243 13633 14451 15287 15601 16293 17501 18475 20203 21761 23882 25783
1579 25783 28463 31429 34435 37238 42775 49711 58809 62376 90931 125514 259503 1206912 1693380 502060
1448 502060 214783 122176 83705 62746 50046 42842 37252 34345 31547 29289 27241 22309 17978 20217 19023
1307 19023 18064 17301 16224 15441 14581 13776 13216 12690 12376 11795 11528 10982 10545 10093 9809 9692 9494 9063 8833 8501 8301 8066
1100 8066 7841 7784 7457 7340 7250 6880 6714 6591 6602 6389 6363 6140 6061 5939 5775 5631 5680 5492 5493 5311 5128 5122 5007 4840 4956 4779
856 4779 4659 4664 4631 4430 4405 4534 4310 4367 4112 4207 3989 4064 3987 3989 3897 3957 3688 3759 3744 3617 3747 3435 3587 3461 3439 3315 3403 3414 3399
584C399J6j79Lk67L38M1J36O06J412J4434Q046j77k0574m044L0L03P6q50m68L23r9K10J41
368B856j98j56N5j00Q4jk3p8Q4q3J03j77j24K56j09r5J63k29k7J80j66P1j59R2r9J54j51L1
105B154om8M9l4j7j86J88r2m4J93m00J67J82j53J9j08K04k58J88pj63qn5J28k5%k06J38PP
-177A814L6j18k6J14j01L8j52KJ34oj01lj1P3j84J05n9j15k32n1j25k74j86
$$ plain form
584 3399 3415 3236 3239 2972 3310 3351 3487 4093 5505 19939 27985 27808 7234 3190 3220 3523 3599 2749 2281 2604 2505 2715 2856
368 2856 2658 2502 2557 2457 2541 2540 2517 2439 2523 2440 2543 2366 2242 2498 2389 2294 2457 2228 2201 2381 2215 2286 2127 2219 2120 2274 2123 2154
105 2154 2148 2100 2149 2115 2098 1912 2100 2008 1964 2157 1757 1924 2106 1953 1972 1864 2068 1810 1998 1991 1828 1820 1765 1893 1868 1868 1662 1800 1807 1814
-177 1814 1850 1732 1706 1820 1719 1757 1605 1607 1741 1735 1634 1631 1620 1693 1509 1614 1555 1440 1208 1157 1032 758 572
-393E72
##PAGE=	F1=1438.2
##FIRST=	4405.4461538743908022,	4405.4461538743908022,	1.5712113380432128906
##DATA TABLE=	(F2++(Y..Y)), PROFILE
4405B66p6P8O9J95rK29K2R1j45R3Q9j20K07n8j26Q3j6q5K21j73J05j32J0J36j46R2o0J49j61
4133H28J88j96j5Q3J3R9n5R2j74J77j16o2P4K52l94K68j28J18k87K34lJ2j13J73j75q5L11
3880A119K8l39L14j55k1K1oO4rJ73l50L54j91M7J12j26R4k16J22Q1q5M2j0L1p9J58r2O1j40
3607A002J15L8j15L16r1k32J18k0N0J3L4j28Q2Q9j76J75l4K5j29K69j92J8k3N4J2k9Lp3R9
3335A270R2o2l8N9j56K12o9J13p7P8k6k91K46P4r9J11O0l7j43R5O7q6JJ84j34l6J02j07K04
3063A607j63L7L6Q5m1n2J7oL79p17O27j84l0P6j33P9Rn9K06j19k1P6J74k69R8k5J56n2p3K94
2781B012l07J77K4L0k08K37K8j83J66j2L0Q7j0o2K78j73j02J23j14J09p3P8J48j26K7L6J4
2527B234J62k45K44j62J42j14K14L1m8K2l2L8N6L6O9j12Q2Q2o5J16n0K0O9O9o3J74j58K46
$$ plain form
4405 266 190 268 337 532 523 752 774 865 720 813 902 782 989 931 805 888 872 787 1008 835 940 808 818 954 808 900 840 989 828
4133 828 1016 820 805 888 901 1000 945 1037 863 1040 924 862 936 1188 794 1062 934 1052 765 999 996 1008 895 1068 893 808 1119
3880 1119 1147 808 1122 967 946 967 961 1025 1016 1189 839 1193 1002 1049 1161 1035 1129 913 1035 1116 1031 1073 1063 1094 1015 1173 1081 1142 1002
3607 1002 1117 1155 1040 1356 1265 1033 1151 1131 1181 1194 1228 1100 1182 1271 1095 1270 1236 1261 1132 1401 1209 1227 1204 1258 1270 1241 1244 1171 1270
3335 1270 1362 1300 1262 1321 1165 1377 1308 1421 1344 1422 1396 1105 1351 1425 1326 1437 1497 1460 1317 1412 1479 1393 1394 1578 1444 1408 1510 1403 1607
3063 1607 1444 1481 1517 1602 1561 1509 1526 1520 1899 1182 1809 1625 1595 1671 1538 1617 1626 1567 1773 1654 1633 1709 1883 1614 1712 1687 1843 1791 1718 2012
2781 2012 1705 1882 1906 1936 1728 1965 1993 1810 1976 1964 1994 2081 2071 2009 2287 2114 2012 2135 2021 2130 2057 2135 2283 2157 2184 2220 2234
2527 2234 2396 2151 2395 2233 2375 2261 2475 2506 2458 2480 2448 2486 2542 2578 2647 2535 2617 2699 2634 2750 2700 2720 2789 2858 2795 2969 2811 3057
2265C057j57K76j45R2J05QL3P6K0j33K64j31K04K3M5O5J24j98K51J4QP9Q5M3J62L7KJ84k13
1992D280L78N22NJ745k017J5K43J41L52QJ33j48J17K45QJ68K10J57K55K12J15J11K64J77M70
1757H166K05M15J83K53K00N04N36N68L01O50P40K90N54J052Q43J565J280J872J533J894J846
1560B5450J993K086M731N656Q398J0212N317L2783J05095P70272M09128r64458k35959p8945
1429A01759l3292j7891j0826n846l119k473k355j913j773l047n774L221j003p91o83q98o60
1269A2636p00o30m87m16k34n27j51n01l37m07j83q5j02m69j26l07j81j80j60l3k97j43ll53
1044E624r6j66P6j63n4j80n9j01j34j33P8j87K5j56k19R2j42j22R8j69j32P7m7j74j7J09j50
790C578Lk33J16k39J11l5p7J2L2k18QK4j02J65l70J87j13n6p7J21l2qL4j99O7k64K70M8L14
$$ plain form
2265 3057 2900 3176 3031 3123 3228 3236 3269 3345 3365 3232 3496 3365 3569 3592 3637 3702 3826 3628 3879 3893 3901 3980 4065 4108 4270 4307 4309 4493 4280
1992 4280 4658 5180 5185 6930 4913 4928 5171 5312 5664 5672 5805 5657 5774 6019 6027 6195 6405 6562 6817 7029 7144 7255 7519 7696 8166
1757 8166 8371 8786 8969 9222 9422 9926 10462 11030 11331 11981 12721 13011 13565 14617 15460 17025 18305 20177 21710 23604 25450
1560 25450 27443 29529 34260 39916 48314 58526 63843 96626 201721 971993 1381121 416663 180704 101759
1429 101759 68467 50576 39750 33904 30785 28312 25957 24044 22271 19224 13450 16671 15668 14877 14194 13296 12636
1269 12636 11936 11306 10819 10403 10169 9642 9491 8990 8653 8246 8063 7978 7876 7407 7281 6974 6793 6613 6453 6420 6123 5980 5977 5624
1044 5624 5528 5362 5438 5275 5221 5041 4982 4881 4747 4614 4692 4505 4530 4374 4155 4247 4105 3983 4081 3912 3780 3857 3810 3636 3619 3728 3578
790 3578 3581 3348 3464 3225 3336 3301 3224 3236 3268 3050 3058 3082 2980 3145 2775 2962 2849 2793 2716 2837 2805 2797 2831 2632 2699 2435 2705 2753 3067
518C067L57J201J4223P013m90j8324m177j43L14l12n60k17J62n8K19J77k87j06O0r3O5nl5
302B051p7J56j36J29j64j13J99j02l2J13k10K4J40j46L6j23J15j49J72j61K1P3j09O4onk16
48A544K08q6q1K40m00J36J81j13K7j83K53k65K02K0k06Nl8J16k8M2k07J05L1L1Lj23n7J53
-214A510q0M5j39m1J69j3r4k3jR8k52J72o3j04j81q3m3k71j33
$$ plain form
518 3067 3424 4625 18848 25861 25371 7047 2870 2727 3041 2729 2169 1952 2114 2056 2275 2452 2165 2059 2119 2026 2091 2086 2051
302 2051 1974 2130 1994 2123 1959 1846 2045 1943 1911 2024 1814 1838 1978 1832 1868 1745 1860 1711 1883 1722 1743 1816 1707 1771 1765 1760 1544
48 1544 1752 1666 1585 1825 1425 1561 1742 1629 1656 1473 1726 1461 1663 1683 1477 1482 1444 1560 1532 1574 1367 1472 1503 1534 1537 1414 1357 1510
-214 1510 1430 1475 1336 1295 1464 1451 1357 1334 1333 1431 1179 1351 1288 1184 1003 920 877 606 473
-393D73
##PAGE=	F1=1428.81
##FIRST=	4405.4461538743908022,	4405.4461538743908022,	0.99169635772705078125
##DATA TABLE=	(F2++(Y..Y)), PROFILE
4405A68l5O3J9K01r0K10OJ00j41M6J07j14J61k0j42J25m7p6K45j98P6j25P2Q9j37P4p3J63
4143G27j68K04j59n4O3PR9q2J17j12R4o9j04R6K69m26K89j54J53k80J87K7o5j4J20j18j01
3889E46K65P0l21K56j57JmL2L2l6K50m08L48j51LP0n7P8j86J04M0m7pK6L7o1Q8n5L3q7P5J2
3589G89l5K15o0j75M7J9N9k2M0j31P4J31k24J99l4J3q6K18k10M8m7N2N2p6N9j01J03P3n4q9
3307H47J01j55J56j5P5l0K1K5l20K17J68j96J07J11l5j93J24Q3j22OJ68j08p4J14j28K44j81
3053A010l7J47K6k8o3L0J3K23m48L95j26JO8j60J36q6nJ81j04m9J34J50l05Q5%J17k5n2K61
2781A489l43K02L3mj85K07Q0j82J17m7O0O0J0RJ73k24j03J82j32P7l0K3J89j48N7K3l1J79
2518A741k36K04j33J23j48J74J06o9j9lJ7L6K1J24j79N8R4m4P2kj5M4M9p1K07j57J85j61K92
$$ plain form
4405 168 133 196 215 416 326 536 542 642 501 547 654 540 701 681 539 664 617 541 786 588 664 539 611 700 563 637 564 727
4143 727 559 763 604 550 613 620 719 637 754 642 736 667 563 659 928 502 791 637 790 510 697 724 659 645 765 647 546
3889 546 811 881 560 816 659 660 656 688 720 684 934 526 874 723 726 796 739 817 631 735 775 728 721 747 784 723 811 756 789 702 777 789
3589 789 754 969 909 734 781 800 859 837 877 746 820 951 727 926 892 905 819 1037 827 875 828 880 932 856 915 814 917 990 936 847
3307 847 948 793 949 934 1009 979 1000 1025 705 922 1090 894 1001 1112 1077 884 1008 1091 969 975 1143 1035 961 1075 947 1191 1010
3053 1010 973 1120 1146 1118 1055 1085 1098 1321 873 1268 1142 1143 1211 1051 1187 1101 1096 1277 1173 1124 1258 1408 1103 1188 1188 1305 1280 1228 1489
2781 1489 1146 1348 1381 1377 1192 1399 1479 1297 1414 1367 1427 1487 1497 1506 1679 1455 1352 1534 1402 1479 1449 1472 1661 1513 1570 1593 1562 1741
2518 1741 1505 1709 1576 1699 1551 1725 1831 1762 1743 1740 1757 1793 1814 1938 1759 1817 1911 1867 1939 1937 1922 1966 2015 1944 2151 1994 2179 2018 2310
2246B310j62L4R7K6RJ10J2j86K83k34K57K7K9L3J20k57K33L5m1J19M6M6J08LrK14k71M63P10
1973D164r99L230l079J22K82J05J77j2Q2j49P8K28l5J53J95N7K14J50P1Q4J82J07L97J11L10
1739F225J33J72J60K30N63L96J96M06N73K60L40P71O17J225Q30J353R22R51O98J083J483L735
1532B3322L772O359J1278m751K4017O9804N37746K99646o71403j67276n8699k5537j3558q543
1401B6177m594O16k069j880j651k511K181p296K907p23n77n49o21n02m80m24l50l14j41m25
1213F774o0l91j80l65p2m1k5m38k9k70r1j43r9nj98k02P9k75m2j92J08q5q4r9p4m3q4j34J00
941C340j39L0j21k42J84j96j4L8j30j04J14j02q5rR2j00k4k07J29k10R7Oj35J00J2j36o3O1
678B186q1J91l66J56j03n1n0J67n9l7Q7k37J45k25J67J6M95R3Q71J2708N642q83j4682l825
$$ plain form
2246 2310 2148 2182 2279 2305 2314 2424 2436 2250 2533 2299 2556 2583 2612 2645 2765 2508 2741 2776 2735 2854 2900 2946 3054 3057 3048 3262 2991 3454 4164
1973 4164 3165 6395 3316 3438 3720 3825 4002 3990 4072 3923 4001 4229 4194 4347 4542 4599 4813 4963 5034 5118 5300 5407 5804 5915 6225
1739 6225 6358 6530 6690 6920 7483 7879 8075 8481 9054 9314 9654 10425 11042 12267 13097 14450 15372 16323 17021 18104 19587 23322
1532 23322 27094 33453 44731 39980 63997 133801 671547 971193 299790 132514 73815 48278 34720 26177
1401 26177 21583 22199 20130 18250 16599 14088 16269 8973 11880 11157 10580 10031 9410 8908 8428 8004 7654 7340 7199 6774
1213 6774 6714 6323 6143 5778 5706 5665 5640 5202 5173 4903 4812 4669 4570 4565 4367 4165 4244 3969 3927 3735 3843 3758 3674 3575 3501 3458 3374 3240 3340
941 3340 3201 3231 3110 2868 3052 2856 2842 2880 2750 2646 2760 2658 2573 2564 2656 2556 2532 2325 2454 2244 2341 2347 2212 2312 2324 2188 2125 2186
678 2186 2105 2296 1930 2086 1983 1932 1882 2049 1990 1953 2040 1803 1948 1723 1890 1906 2401 2494 3365 16073 21715 20832 6150 2325
452B325l01K35n84k81Q3N7r1K13K07l45n3L7p0L3J0n6o5J92j60J33j14p9J17r7K4Q5k25J13
189A343O5j09K2j04J17j68J80j69J8J23j50R7j6L6k39K20q3j05K41l31Q4J66p7O0k46K41k02
-64A014J55N6k12K2j9R8m0P3j76M2M8O9n0q6o8J34l6M1j01p8J83l1o5m1J7R9k87K07m4r2j03
-355G29j13J0k23o0
$$ plain form
452 2325 2024 2259 1675 1394 1477 1534 1443 1656 1863 1518 1465 1502 1432 1465 1475 1419 1354 1546 1386 1519 1405 1326 1443 1346 1370 1455 1230 1343
189 1343 1408 1299 1321 1217 1334 1166 1346 1177 1195 1318 1168 1265 1249 1285 1046 1266 1183 1078 1319 988 1072 1238 1161 1221 975 1216 1014
-64 1014 1169 1225 1013 1035 1016 1114 1074 1147 971 1013 1061 1130 1080 994 926 1060 1024 1065 964 886 1069 1038 973 932 949 1048 761 968 924 832 729
-355 729 616 626 403 343
-393C43
##PAGE=	F1=1419.42
##FIRST=	4405.4461538743908022,	4405.4461538743908022,	0.41218140721321105957
##DATA TABLE=	(F2++(Y..Y)), PROFILE
4405F9PM9l3K09j71J89qJ08j38jJ26j08J15J7j57J67p2o2K25j80M1j23J36M0j26N5q6J76j74
4133B90K21j24r1M2JR8j09J43n0Kl0p2N4K78l80K42j65J82k76J38N7j42Q5O2o5r2J63J00k30
3861C32J51j22J8l4P1jo7L21m25L02j06l7L4J6J9j14Q2oj0n4O1M4m3J7j7Ml5L6j4M6J13k9
3560E53j19k3N8O8n6M5j34O6J73k71K22l3jm3J68k28P8p1M5Q7q7O7q2P2N8m1j44J39j14N8
3279E10M5M2J7l5P5l48J67K40k72J24J61l1k64J30J20j35jJ43p2j03J33j44K41j57j25K41
3035G02k2nq9K6N9Rj11J48p3K6P1j77J93j81L8J45q8p7J77J10k89M0M1R3j9n0K47l57K16L1
2753H34k6j53J66J24j81O7q1R0K1K0R0P9k65r3K29j59M5J3m3K19j58R7J1p7J96k27J68r8P4
2480I82j30J09J53q1m9K7mOnJ99k24K3R6l4J8N6l9J9K9q9K29j55J22j64L08j78k5Q9M3j3J43
$$ plain form
4405 69 76 125 92 301 130 319 311 419 281 280 406 298 413 430 273 440 368 306 531 351 392 269 405 445 319 374 288 464 290
4133 290 511 387 296 338 339 437 328 471 421 423 393 321 375 653 273 515 350 532 256 394 451 309 394 456 391 299 462 562 332
3861 332 483 361 379 345 416 415 348 669 244 546 440 403 437 453 472 358 440 434 424 370 431 475 432 449 432 436 401 437 423 469 582 553
3560 553 434 411 469 537 481 526 392 458 631 360 582 549 548 505 673 445 523 452 497 584 497 564 482 554 612 571 427 566 452 510
3279 510 555 597 614 579 654 306 473 713 441 565 726 695 431 561 681 546 545 688 616 513 646 502 743 586 461 702
3035 702 680 675 586 612 671 680 569 717 644 670 741 564 757 576 614 759 671 594 771 881 592 632 673 766 747 697 944 587 803 834
2753 834 808 655 821 945 764 831 750 840 861 881 971 1050 785 692 921 762 807 820 777 996 838 935 946 869 1065 838 1006 908 982
2480 982 852 961 1114 1033 984 1011 1007 1013 1008 1207 983 1006 1102 1068 1086 1142 1103 1122 1151 1062 1291 1136 1258 1094 1402 1224 1199 1288 1331 1318 1461
2189A461Rk33K69k83K93J7kj3J29l00K14N7r0J58pL4N6l2k4K38k78N17Q31p84L257l862K46
1936A878K55Q7K3mN8j39M9K00q8J38J80n7J59Q9K6N7J00K3L09J7K06P5Q1J03K3M58K61R5J64
1664D826L73J98J33M17L95Q07L39P94L10J78j92M32R66K659J916L734P126l867J2399L5966
1476F9909L01633J83051l77060r6467l6293j6907q750o624m062N253j959j531j536m011J2716
1335A7362p705k552m97m16l84l35l35k60k18k13k12m9l22L1k80k3l24L1nK2l51O3k38jj05
1100B684l9K4j00k61J61j96J2k19J40pj15j6r0J5l5j33J20q9L9q0k34K23k33J09k2r2q6J41
837A621j46J4j2O5l0k9j82J44j82Q3M8j95J69l0l3j13Q2p5K01k95P8n5n1l0K13q5o6J40k76
565I73K24j90N8k3N85j47N65J0164M220j231j0462l086l79J30o33o5K36K1j40J91K22l82J9
$$ plain form
2189 1461 1470 1237 1506 1223 1516 1533 1531 1518 1647 1347 1561 1618 1528 1686 1679 1713 1769 1737 1713 1951 1673 2190 3021 2237 5494 1632 1878
1936 1878 2133 2220 2243 2239 2297 2158 2207 2407 2319 2457 2637 2580 2739 2828 2854 2911 3011 3034 3343 3360 3566 3641 3722 3825 3848 4306 4567 4662 4826
1664 4826 5199 5397 5530 5947 6342 7149 7488 8282 8592 8770 8578 9010 9976 12635 14551 18285 25411 21544 33943 69909
1476 69909 371542 554593 177533 81066 44773 27866 19116 12492 8430 13683 11724 10193 8657 4646 17362
1335 17362 9657 7105 6608 6192 5808 5473 5138 4878 4660 4447 4235 4186 3864 3895 3615 3592 3268 3299 3294 3316 2965 3028 2790 2789 2684
1100 2684 2645 2669 2569 2308 2469 2273 2285 2066 2206 2199 2084 2068 1978 1993 1958 1825 1945 1856 1895 1815 1581 1804 1571 1680 1658 1566 1480 1621
837 1621 1475 1489 1477 1542 1512 1483 1301 1445 1263 1346 1394 1199 1368 1338 1305 1192 1274 1199 1400 1105 1183 1128 1077 1047 1260 1175 1109 1249 973
565 973 1197 1007 1065 1042 1627 1480 2045 12209 16429 15198 4736 1650 1271 1401 768 703 939 960 820 1011 1233 851 870
349H70J4m5%K5p7n3K27j82J15q5k4N7j14N8P9k19K02j1p2Rq6J21j87J88j78J5J74j92J31k7
67G33P7k62K31q0j32K34k19rJ56l6R3l09K29j38J08R1k17L7JQ0n8R9j04o2P0J12j02n0p7J15
-214F11OL8o3j15J98n0l7n9L0R5k81K02k1p4k1j37K1j32J2
$$ plain form
349 870 884 839 839 864 787 734 961 779 894 809 785 842 728 786 865 646 848 837 765 774 688 809 622 810 632 647 821 629 760 733
67 733 810 548 779 699 567 801 582 573 729 693 786 477 706 568 676 767 550 587 588 668 610 709 605 543 613 725 623 573 496 611
-214 611 617 655 592 477 675 625 588 529 559 654 373 575 554 480 459 322 343 211 223
-393B23
##PAGE=	F1=1410.03
##FIRST=	4405.4461538743908022,	4405.4461538743908022,	0.20376218855381011963
##DATA TABLE=	(F2++(Y..Y)), PROFILE
4405C4pO3n4J57j54R3k8J10n3j07J36j11J08K5j50J64o2n1J91j27J2j32J69mm7M9j25J43j64
4133G8J81m1r7J1l0J14j11J14M8j27J0L5n5K57j42K1j45J86j72MR2j55R9J1Ln1K7J09m1l3
3851B00n9J3m0R6n4l1K85l20J63n1p0LQ9n3nL9l7M1o2LQ6n4j4nj4L9l0k3Q7L3ll4p8M5O2l5
3513B12L2j47N8K24l13K23K6p7pJ52j73J1q9P9P0j9kj1LM9M8k66J62k8o2P0J0O4o8J43k61
3222A13j0K83k66R3J86L0l01N1J44m6q8J16J0j62J23j21K09p3k56L12l1j6o5l4J45q0J18o0
2959C24j03O1N7j54K29k17PJ21n0j16K07O5j24j31O2Q5k0o2K88m03K15N3n0p8Q5J70j73J3
2696C61n7L6JL6J27J05l25q3J83p4m3O4j09K11j57J71n7q9K36k51J49l3j6o4MJ95p5n1K7J9
2415D41n6m5K61k12m5Q3Jl6R6l5%Nj00K31j18L7j34K71j28j08N6Q9p7J80jk05K18l06K98J7
$$ plain form
4405 34 27 90 36 193 39 132 104 214 161 54 190 79 187 212 62 226 164 113 304 177 189 57 226 222 175 224 99 242 78
4133 78 259 218 121 132 102 216 105 219 267 140 150 185 130 387 245 266 121 307 135 139 231 76 175 186 189 138 165 274 233 200
3851 200 141 154 114 210 156 125 410 90 253 202 132 135 224 171 166 205 168 209 147 150 236 182 168 163 149 188 158 135 222 255 252 218 140 185 247 212
3513 212 244 97 155 379 66 289 315 238 231 383 210 221 132 211 281 262 260 249 252 301 349 83 245 217 155 225 235 299 231 374 113
3222 113 103 386 120 213 399 429 128 179 323 277 189 305 315 153 276 155 364 291 35 347 316 300 235 201 346 266 384 324
2959 324 221 282 339 185 414 197 204 325 275 159 366 431 307 176 238 323 303 241 529 126 341 394 344 266 351 521 348 361
2696 361 304 340 341 377 504 609 284 201 384 310 267 331 222 433 276 447 390 301 537 286 435 402 386 322 326 521 446 395 422 441
2415 441 385 340 601 389 344 427 428 392 488 453 453 458 358 589 471 508 374 645 517 409 465 554 477 657 656 451 669 363 661 678
2133F78j7r0J92l14J61M6j10J78o0N3l2pp1K91k22M86Q31J501J024m341N24J20J25q9l1O0
1889H86q6qJ27o7P3J91j94J25N9L3l2O7l8J78m3J31PN3M0m6K11J50M6nJ82J58K3O0K25M05
1607B911M2L26J1j98n90k49M20J652N45J406P66K214K369J0041J06852Q3005j37507l7234
1438C6782j5912q785l605m885n40M803l034j267j432J331J9604q341j0982o39l58k33j20j93
1269B194r9j07o9j64Qk06O0j59J00k74O3N6kj86Q5j91P2o4o3J22n6k62J67q8L4k24J19J12
1006I78j84P9j32O7Nj17Q9j6O9p7j60J80k53K25q1k7p2J11j57P7nL5K7k2j35J11j20M8N6j70
725D29J64o8P1j27N5p0J84r7j28N0p4n4K51o9j28K20l27K97j32n5MN26l30L54P135K949j384
471I646o546k125l79M8m23K1J72N3j78J54K43l49M5J7n6qK5l7j19K59j63P3m3K6L1j65P7Q3
$$ plain form
2133 678 661 571 763 449 610 656 546 724 664 717 685 678 607 898 676 1162 1993 3494 4518 177 701 821 946 857 826 886
1889 886 800 792 919 852 925 1116 922 1047 1106 1139 1107 1174 1136 1314 1271 1402 1409 1462 1502 1456 1667 1817 1863 1858 2040 2198 2221 2281 2506 2911
1607 2911 2953 3279 3290 3092 2502 2253 2673 4325 4870 6276 7042 9256 11625 21666 128518 211523 74016 36782
1438 36782 20870 12085 8480 3595 3055 7858 4824 3557 2125 3456 23060 14719 3737 3098 2740 2507 2387 2194
1269 2194 2095 1988 1919 1755 1763 1557 1617 1458 1558 1284 1347 1403 1401 1215 1300 1109 1181 1117 1054 1176 1120 858 1025 937 971 747 866 978
1006 978 794 873 741 808 813 696 785 769 838 761 601 781 528 753 672 645 573 684 527 604 599 634 661 639 504 615 495 543 599 429
725 429 593 525 596 469 524 454 638 541 413 463 389 335 586 517 389 609 282 579 447 392 396 922 592 946 8081 11030 9646
471 9646 3100 975 596 644 221 242 414 467 289 443 686 337 382 399 343 335 360 323 204 463 300 373 330 356 387 222 299 382
208C82k33K81p4l9M0q4P1j49J89j77J6J65j68J24m9J14k62K29p7o4J16m4j51J59k5J63l58
-45I5J90o4J8J33j72NL7M8n5J05M2k00O1J43j22kq4L8M0M0J2j62K05o5j0j9k6P4j47N5L1n2
-346A92M2j20poK2
$$ plain form
208 382 149 430 356 317 357 273 344 195 384 207 223 388 220 344 295 409 147 376 299 235 351 307 156 315 290 453 95
-45 95 285 221 239 372 200 205 242 290 235 340 382 182 243 386 264 262 178 216 256 296 308 146 351 286 276 257 231 305 158 213 244 192
-346 192 234 114 107 101 123
-393A23
##PAGE=	F1=1400.64
##FIRST=	4405.4461538743908022,	4405.4461538743908022,	0.40767157077789306641
##DATA TABLE=	(F2++(Y..Y)), PROFILE
4405F9m7N1K7J3mj1o1J5R4o6j3k1L1l9P8m0K3m6P4j8KK0k9l0P1Q2p1n0ok1M6j3rn1M2M9q5
4058E6J13q8l3J09n6R7R7k08QN1M3j23M9R0j62j9Q9K2p5J3J24j01k1j4P5k5n2J30J1l8n1J5
3758A26r3Q9k9o0L2J6L8PM3n8j5M0k2j5n6R5j16Q5o2N4j6N1O5j33k5J01o0M2n6J88p8n1J18
3448B45j81%J81Rj87J5L2k8J24j36J40j26N6J54j50j08J66p3j21P2N3j6R2J5q5PM1j69J55
3175A77J75j32j29j3J68j76OJ47q0r0O3L8O5N1j58Q4r7N8p9O8L70j16l3k78n1N9K5P9L7j74
2894F4K9N5nj1K4J99k29o2J9k8LK51j05j62J18j6N5o0J50q6j03J45j49j2N9O1K78k23Mk16
2612D7K45k12J19j8j15M7J38j42l3K43k26J24K5j59J42j18K3P6Oj27J94o0j13J62n4k8m2L6
2349A80pl1N2k1O0o8K4L6o9J44j08R8j7j72J36r8O3L5O4l2Lj27J74O0j61J32K7j54l2J65r5
$$ plain form
4405 69 22 73 100 113 109 98 37 52 146 80 67 46 77 38 116 76 99 53 127 109 111 131 102 72 143 225 154 104 98 77 123 110 101 50 92 141 56
4058 56 169 81 48 157 101 198 295 87 95 146 189 66 115 205 43 24 113 135 60 73 197 96 75 61 136 111 59 189 200 162 111 126
3758 126 33 122 93 33 65 81 119 126 169 111 96 136 114 99 43 138 22 107 45 99 83 134 199 66 41 142 82 124 68 256 178 127 245
3448 245 64 64 245 254 67 82 114 86 210 74 214 88 144 298 148 40 206 133 12 84 137 121 213 228 143 150 191 22 177
3175 177 352 220 91 78 246 70 76 223 143 53 116 154 219 270 112 196 99 157 78 146 516 400 367 89 38 97 122 201 238 64
2894 64 93 148 143 132 156 355 126 64 83 55 58 309 204 42 160 144 199 139 289 203 100 245 96 84 143 204 482 259 263 47
2612 47 292 80 199 181 66 113 251 109 76 319 93 217 242 83 225 107 130 206 212 85 279 219 106 268 214 186 144 180
2349 180 173 142 194 173 233 165 189 225 156 300 192 290 273 101 237 139 202 237 301 269 272 145 319 379 218 350 377 223 191 356 261
2058B61n5J26j20J00o4J46P4Q0O47L606j012k998j20k11M4m1k25O2J29p3l7J42j88J76l0k
1814D17p1K19j15M0N8p4L7K7R4j01O1K49l33J32J59j5P6L4J84k5J63K7L38J70M39J56M1o24
1551A763j77n79Q47J34L756k888K592N949J4227p929q325n91k99j573R10l63L311l767o353
1372F45j71J224N142J6876p797j3372r52l07r0j14r3p7j36j4l4n2m1k2o5M0j7j84J16o1J13
1138E57j04L7j06J17k27K48q2N8j55Q3oj2k56L80k94J33r1L5K9j19rrK00j41P5r3N8n4m3J33
856C42r5m3J08k01J10n4O7l0J21j31j9N1J4jn4j2M2R2j17j1j0K34k41J09p8n7K3R9j13J24
574B69r1P0m2n4J95R6l30L24M039J975j231l637j164k40m7K5Qp3O4J5j25K74m6j36R7j30J38
321B43j84K06j22J1ml3K0o0J77o9o5k1O3J8o0m9J14L6j11QN7j5L8j03J29j77N5P3l1pjJ17
$$ plain form
2058 261 206 332 212 312 248 394 468 548 1195 4801 3789 791 671 460 504 463 238 300 429 356 319 461 273 449 419 417
1814 417 346 565 450 490 548 474 511 538 632 531 592 841 508 640 799 784 860 894 1078 1053 1216 1243 1581 1751 2190 2346 2387 1763
1551 1763 1586 1007 1854 1988 5744 2856 5448 11397 25624 17695 9370 8779 8480 6907 7817 7454 10765 6998 645
1372 645 474 1698 6840 23716 15919 2547 1595 1288 1198 1084 991 914 778 764 730 678 637 615 550 590 573 389 505 444 557
1138 557 453 490 384 501 274 522 440 498 343 426 420 408 152 532 238 371 280 315 344 225 216 207 407 266 341 248 306 252 209 342
856 342 247 204 312 111 221 167 234 204 325 194 175 226 240 239 185 173 215 307 190 179 169 403 162 271 193 136 159 258 145 269
574 269 178 248 206 152 347 443 113 437 4476 6451 5220 1583 419 179 132 157 165 92 156 171 46 320 274 138 235 105 243
321 243 59 265 143 154 150 117 137 77 254 185 120 99 162 180 120 71 185 221 110 118 175 160 198 95 224 47 102 175 144 137 136 253
20B53j98K01j39k4o0K45j46Kn8j1R3M2j68J24p6J9j7K42j99m6P7k6K4pr4qM5O2r1J05m9O5
-280A82O4k33R7J08j64KL0O4o3j6N4l9
$$ plain form
20 253 55 256 117 93 33 278 132 134 76 65 158 200 32 156 80 99 82 324 125 79 156 130 154 147 53 45 90 152 61 166 117 182
-280 182 246 13 110 218 54 56 86 150 87 71 125 86
-393H6
##PAGE=	F1=1391.25
##FIRST=	4405.4461538743908022,	4405.4461538743908022,	0.36386165022850036621
##DATA TABLE=	(F2++(Y..Y)), PROFILE
4405F1l7L3Q4o5L5L2k2q0P9K6j18R0j3k7Q6j39Q3l9m5L8M0Q9j42K6O0J05l8j55R8r9N3K3J5
4096A37k7o5J30o5k3J02l6j3K5o9J89k45J11j03J38o6l8K00k29LN1RL9p9P9Ln6rJ12j25J6
3804I6J47j73J17l4j5l2J20j90J26j39L5J01q5J35j5j60J66n4M1r3P1n4M8j13Q1m4K8J64j63
3532A12j8R0j14J42m9L0O8j16O3j11p4J63J24j87M3oj22J47q1J28j49O5J14k6j47J25Oj42
3269G8R6p4Q0o7J59l3j95K14j52l2K47m1n0j54J83q2q5J39J5j84J37o6O3J93l38J70q9P6Q
2997B16j59O90k20Jk96j25M9L8j04K38j35q1R8N8j94M7K67j40l9j05K6P7OJ21j81nM6N6l7
2725B13j1K2q2J70j33PK0j44L70q9K6k10K01j47O9K9j83J32j5j8J0P9n4pJ2m0P1k5j38J20
2443B55K2j23J94j7j3j06P7M1p9J9L6r6P1l2R4Lj51Q3K0J55k97K35P9j61J7L6j64R1J27r5
$$ plain form
4405 61 24 57 141 76 111 143 121 41 120 146 28 118 105 78 164 25 108 69 24 62 102 191 49 75 135 240 202 47 145 46 99 122 137
4096 137 110 45 175 110 87 189 153 140 165 96 285 40 151 48 186 120 82 282 53 56 107 116 155 76 155 158 102 93 205 80 96
3804 96 243 70 187 153 138 106 226 36 162 23 58 159 74 209 194 34 200 146 187 94 165 111 159 46 127 83 111 275 112
3532 112 94 184 70 212 163 193 261 145 208 97 23 186 310 123 166 160 38 185 104 232 83 148 262 236 89 214 220 78
3269 78 174 100 180 113 272 239 44 258 106 74 321 280 230 76 259 177 92 231 246 62 199 133 196 389 51 221 132 208 216
2997 216 57 747 527 528 232 107 156 194 90 328 193 112 210 268 74 121 388 248 209 104 130 207 213 334 153 148 194 250 213
2725 213 202 224 142 312 179 186 206 62 432 343 369 159 360 213 282 311 128 260 245 227 237 316 262 255 267 227 298 273 135 255
2443 255 277 154 348 331 318 212 289 330 251 270 306 210 281 249 343 346 195 278 298 453 156 391 470 309 326 362 198 289 416 321
2161C21J37k88K18P4k3p4K05j98JJ82j85J3O9oL6L9j04J67k91N65M423j765k297l04k30o6
1917F19K3j62K1J08j6k0J16j51OK17m8p3J50j0RQ1n0N2J5J57j75J01K30j59M3J79l5J46l4
1645A340J82J99P6M6L72K33M51J44Kn09K18j53Q35M72O783q819P011J0767O7909J8451p6376
1448B9634j7685k974q05P38N99M501n828p355M07M76K211N530k359n387k12%r1j73k2o5r6
1250A044j03Q3n4k7oq0j33J88k34%K7M3j45J42j89J04j06N9j20K75k48P6m3J32k56J99j20
997E08k4M3l0j0q1L6j14J35o2O6j17J97k90R4R7o1p2K21k72Q4o1Pm2K16j77k4M6J5K9j23P9
706C13r1J79j23L2q6J63j9km3Kj99J73J9j01J45j42nQ1J64j96J31J56J518J277o47k213l97
452H9J88KMj7N7j36J48j57n5K50k32J55j28J88k36J95j4k06J07J9Nj36J79M5r1q3J52j92N4
$$ plain form
2161 321 458 170 388 462 439 365 570 372 373 555 370 383 452 446 482 521 417 584 293 858 5281 3516 1219 915 685 619
1917 619 642 480 501 609 593 573 689 538 544 761 713 640 790 780 789 870 820 872 887 1044 869 970 1200 1041 1084 1263 1228 1374 1340
1645 1340 1522 1721 1797 1843 2215 2448 2899 3043 3045 2536 2754 2601 3436 3908 10691 1872 8883 19650 87559 106010 29634
1448 29634 11949 8975 8170 8908 9507 14008 8180 825 1232 1708 3919 9449 7090 1703 1491 1491 1400 1227 1205 1140 1044
1250 1044 941 1024 970 943 937 857 724 912 678 678 705 748 603 745 556 660 554 613 493 768 520 596 553 685 429 628 508
997 508 484 527 497 487 406 442 328 463 401 467 350 547 257 351 448 387 315 536 264 348 287 294 252 468 291 267 313 328 357 234 313
706 313 222 401 278 310 224 387 368 366 323 325 126 299 318 217 362 220 215 296 460 264 395 551 2069 3346 2699 486 89
452 89 277 279 283 266 323 187 335 178 123 373 141 296 168 356 120 315 301 95 202 221 226 90 269 314 223 140 292 100 154
180A54k0N0J04q8Lk9O9M7j87K20k20Q2q4J42j57R1J39j56Q3j1j10J9Q1%jr4N1o8J67j35N5
-111A97r5N5j03K40q1m3j16J14LM9l0r1K6k1K5j1j7J00P8j74LJ39p2j23N5L7k0K1j0m6
$$ plain form
180 154 134 184 288 200 203 174 243 290 103 323 103 185 101 243 86 177 316 160 243 232 122 141 222 222 221 127 178 110 277 142 197
-111 197 102 157 54 294 213 170 54 168 171 220 190 99 125 104 129 118 101 201 279 105 108 247 175 52 107 144 124 145 135 89
-393H9
##PAGE=	F1=1381.86
##FIRST=	4405.4461538743908022,	4405.4461538743908022,	0.32005175948143005371
##DATA TABLE=	(F2++(Y..Y)), PROFILE
4405E4k3K0J04r6JQ5Mn0m8R2p5M1%M1Pp0K9n9Nm3L6J16j39J17n3J11oj76J20o4OOK6j5p4J12
4067A42kj17J87nj27J13j01J09j29O0q3R8Jj15K38j71k8M2m3J14n1m4R9j00j0J44j72N6J21
3795B26k03J42mj7k8J40k20J74j38n4J39j46J75K8j64J57q2J02j25M4Jj5n0K5j8NJ76j44L8
3523A64oj14J68l1o2J41n4o0pj15Q3J78j38L3j3j01L4L5N3r3N0N0N5j44O6O6j59J25j19J20
3241B05j74K14l6q9J08j09n8J69K6Mj20O1Jj05R3P2k04J47q6MK59k87R6m3N6N6k15P65r4r6
2959F20l67j12N6j4j79K96r5j06J00P8k27P7J78p1M0j70K6R7j19K16r2j07O5J2L5j22J01r2
2696A24J40q8M1%j61K31K0K4j20J01p0K8Ro8M7q5O7J4jO2j09K7J3K0ro8M9Oq1J46nN5j60O0
2377B59P2p1J7Pn6N3o4J07L6j66K1Q5J21k81K30J15j82PR2k15J33L6n7J22k39J66M8P2j41
$$ plain form
4405 54 31 51 155 59 60 145 149 99 51 143 68 109 109 150 157 87 116 57 62 19 55 171 32 149 96 207 201 25 145 81 87 93 119 104 30 142
4067 142 140 23 210 205 78 191 90 199 70 130 47 145 146 31 269 98 70 112 69 183 132 88 187 87 77 221 49 105 226
3795 226 23 165 161 144 116 256 36 210 72 18 157 11 186 214 50 207 125 227 102 146 147 132 82 107 89 94 270 126 164
3523 164 158 44 212 181 119 260 206 146 139 24 107 285 147 180 167 66 100 135 188 95 145 195 250 106 172 238 79 204 85 205
3241 205 31 245 209 120 228 119 61 230 256 260 140 201 202 97 190 262 58 205 119 123 382 95 191 148 204 260 45 810 716 620
2959 620 253 141 197 183 4 300 205 99 199 277 50 127 305 234 274 104 130 227 108 324 232 125 190 202 237 115 216 124
2696 124 264 176 217 217 56 287 307 331 211 312 242 270 279 211 258 173 240 254 253 315 206 233 246 266 257 189 238 244 163 309 304 359 199 259
2377 259 331 260 277 284 228 281 217 324 360 194 215 300 421 140 370 485 303 310 402 187 320 356 299 421 182 348 396 468 327
2105C27K16k11O5J31j50M1k9R6m0P5j69J37k82Q46L868j347k381m04j66r2Lo1K0L8mM8N9j33
1842E01j5K37m0l5L5Q6l0R3l2K0M1J45j56O6J35k2%K44j74J70K0M4K88J3Q9K02K58K72K4k20
1560B259n77L86J30N91P4O509p590N689Q221O4524K0045o9587j7738n101j339M47R38N217
1391A3098m504p596r8J315O406J9185j1027j3557j024k94j90k10r5q4mk81J14o1j04Q4j09
1194I64j87K28k23n8Q5n8q0P8r1ql9j9j09K61j95M9m1J47j94Q1j9q7P2l2J1j52J34j66Q7L4
912D73q7lJ88k81P6P6q9KK04j96jm3k6k5J58p0q5j5R2pj17J03q4R9n6Qj8j8J35m1m0L0j81
602A61J23N9j64J90j25n1J32J17j98K40N4P67N86O0j478k79J62O2rj23J03j59J51j38j91L12
358C64k51J88j52K24j64O2N5k18N8P4on7K7J45j31pP0k21R7mk9J35j9l4o6J13J4r2J28j17
$$ plain form
2105 327 543 332 397 528 378 419 390 486 446 521 352 489 207 1053 4921 3574 1193 789 623 531 534 473 493 531 527 575 634 501
1842 501 486 723 683 648 683 769 739 832 800 820 861 1006 850 916 1051 1029 1029 1273 1099 1269 1289 1333 1621 1634 1723 1925 2183 2455 2479 2259
1560 2259 1682 2068 2198 2789 2863 9372 1782 7471 15692 80216 100261 30674 12936 7835 6496 6943 7881 13098
1391 13098 8594 998 900 2215 8621 27806 16779 3222 2198 1904 1714 1504 1409 1325 1321 1040 1154 1093 989 1073 964
1194 964 777 1005 782 724 809 751 671 749 658 650 611 592 483 744 549 598 557 704 510 591 572 485 557 525 536 384 518 352 439 473
912 473 386 383 571 290 366 442 353 355 559 363 362 319 293 268 426 356 271 256 348 341 224 327 243 342 286 294 276 258 393 352 312 342 161
602 161 284 343 179 369 244 193 325 442 244 484 538 1305 1891 1951 473 194 356 418 409 286 389 230 381 243 52 364
358 364 113 301 149 373 209 271 326 108 166 240 234 177 204 349 218 211 281 60 157 153 124 259 240 206 140 253 267 175 303 186
77A86Oq1J12j48Q6J07k8p6P5j35P5k2O9J6j10N6r2J90j21M5n3j0l7J22Pm7j21P3jP8Qj34M8
-233A43o5M3k9k4J13P2j13nM2L5j02k4N2j8L7j2j0
$$ plain form
77 186 192 111 223 75 161 268 240 164 239 104 179 157 226 242 132 188 96 286 165 210 157 147 110 232 239 192 71 144 143 221 229 95 143
-233 143 78 121 92 68 181 253 140 135 177 212 110 86 138 120 157 145 135
-393A35
##PAGE=	F1=1372.47
##FIRST=	4405.4461538743908022,	4405.4461538743908022,	0.20408432185649871826
##DATA TABLE=	(F2++(Y..Y)), PROFILE
4405C4j5J7J10n3o6J01L6k0n7M1Oo1PR6o8K2mq2P6j9r0J08q4J78j55Q8K6j22Q6n4J8k6N9m8
4086H5p5N2P7m4Q0N6k10J44n2l3QPK7o6R2j08J51o2p2M9q1J32nj15J42j14k6J85j48L0O3j26
3786D3J10m7N8l8J14j48J21p4q2P8roM9m8N2q3J57r7m3P8j31L5l5J5NJ39q9R3j01n9J18L5
3485B10j43J25M4j67J18j45j4J84n8J1ol9r7J16K0j7ql3J20j39J4J20j21R3j11J08j20J37
3222B02p5M5rpo0K0N4P4n6r3J00r5J1J19j49J25j40m0K76j82j6%O9Q4j07O39J29k69m26n3
2941A70L8mj06J06j3r6M4J05j79O5M5j6J54j96J2Q2j56K04L6k43J57p7J03k09J64q4O7j1L8
2668B00j7l1o6J19N8m2j7M1j1l9P7p1j17J46j8q5J97k09O8K5L6r0P7l6k1J0J9J6P6r6L5K3
2368B57k1M4o5k9Q8q8M0Q8j00p4R6Q1j88J48J66j80pJ09j88J48q1kQ6r5pM2J16r1J34j45M2
$$ plain form
4405 34 19 36 146 93 27 128 164 144 87 128 134 73 80 176 108 130 126 44 120 101 11 119 35 213 58 146 172 50 136 82 100 74 133 85
4086 85 10 62 139 95 175 231 21 165 113 80 88 95 122 56 148 40 191 129 57 106 25 157 152 37 179 65 39 224 76 106 169 43
3786 43 153 106 164 126 240 92 213 139 57 135 126 120 169 121 173 90 247 150 107 185 54 89 54 69 74 213 124 217 116 57 175 210
3485 210 67 192 236 69 187 42 28 212 154 165 159 120 23 139 159 142 134 101 221 82 96 216 95 188 77 185 65 202
3222 202 127 172 163 156 96 116 170 244 188 95 195 100 111 230 81 206 66 26 302 120 104 104 173 257 150 789 918 649 223 170
2941 170 208 204 98 204 191 95 139 244 65 130 175 159 313 117 129 211 55 259 295 52 209 132 235 26 190 106 173 162 200
2668 200 183 152 86 205 263 221 204 245 234 195 272 201 84 230 212 127 324 115 183 208 244 154 231 195 174 184 203 219 295 199 234 257
2368 257 236 280 215 186 274 186 226 314 214 140 236 317 129 277 443 263 256 365 177 325 244 242 328 233 226 268 384 293 427 282 324
2077C24Q9o3Q8j98K06p1J2j31K8P5R80K707m20k729m26pn2j11J40k6n9%J29L5j74L2J41j7
1814E02P3j73K24p8P2k%O3N6M3j07K8R2q2L27k25M7J55j01K70n7J37L0K27J85J3k78o04M6
1541H83J88K28k81L879l590K443K436L3399L921k8861q167l237q45Q27R69N042r79m564J226
1363D917L521J7305O0006l1057m6192l943j236m17l51l19k98n4m50Kr2j70J35j22k22J70k01
1166I32r2N3n6l3o7P0j73L7l8j32J99j38J9k1J09p9j06J24j07N2k2L7j86J85j86L0J30k03
903C38L2J70j69n9J29j56J01J01l2j20K3n4O5q2J66j26j40J49K3j90J18lm0L3k1M1j66K22
640C53m5j0J5j14M9O0j37J51o4l8R4J20j52J69q0Q55J35J63q15m34J07P8M3k80Q7j01J73j13
377B69q2R6j58J79j73K11l8j42J42j70LO9j7O4j69K44j64J01j2j86J06j4j09J29N8Oj79J86
$$ plain form
2077 324 413 350 438 240 446 375 387 256 284 359 1339 4046 3626 897 471 464 412 301 441 415 356 356 485 520 346 378 519 502
1814 502 575 402 626 548 620 618 618 681 737 780 673 701 793 711 1038 813 860 1015 914 1184 1127 1264 1294 1521 1706 1719 1441 837 883
1541 883 1071 1299 1018 4897 1307 3750 6186 39585 43506 14645 6478 3241 2396 3223 4192 9234 8255 3691 4917
1363 4917 8438 25743 85749 54692 8500 4557 3321 2904 2553 2234 1936 1882 1432 1434 1342 1172 1307 1185 963 1133 932
1166 932 840 893 837 804 737 807 634 671 633 501 700 562 581 560 669 590 484 608 501 553 531 568 382 567 381 411 541 338
903 338 370 540 371 312 441 285 386 487 455 335 358 304 369 287 453 327 187 336 359 169 287 284 244 277 256 297 131 353
640 353 308 298 313 199 248 308 171 322 258 220 314 434 282 451 371 1226 1361 1524 709 275 382 460 503 223 310 209 382 269
377 269 187 283 125 304 131 342 304 162 304 134 137 206 189 253 84 328 164 265 253 67 173 159 50 179 237 243 64 250
114B50p4N4kK6j21N4K1j17L5O9Q6j59Q9j13O9j9J08p2j0j6r2J63p1P6n9o5M6j0J14j10l2k6
-186I2%J03N7j65P3nl7m1n0J04M8j6j1o7J12k5j37Q2K7k0NL8
$$ plain form
114 250 176 230 228 254 133 187 208 91 126 195 281 122 211 98 167 148 256 184 174 158 66 229 158 234 175 110 156 146 260 150 118 92
-186 92 92 195 252 87 160 155 118 77 27 131 179 163 152 85 197 172 35 117 144 124 129 167
-393A67
##PAGE=	F1=1363.08
##FIRST=	4405.4461538743908022,	4405.4461538743908022,	0.088116921484470367432
##DATA TABLE=	(F2++(Y..Y)), PROFILE
4405A4pJ4J03k2l6K0O8RL3j06R8j51RJ45r9P1np5P6J7j30M5m0K25k56O5N8o8N3m6L0n7R1q0
4086F6l7L3P9L7m5R8j87Q1J0p7M1j2J13j70J35o4L3J6o5K2l2M3L7j06J37r1o7J98j23Mjn2
3786E4J17j31J39m2Q7p6O9j1j04K1Q6j45O9P0r0l8J66l3j40J44j93R1okk1P6l4J47j75J7L8
3495A50P0j44M8J25j52J34j42j5L3L8OjK0n2J1L0J8n8j12K07j15o3J48m6J3l5Q0o0O5j44J50
3204B07m6L5n2j21P8J37pj79J51m7r2J45m8O7j69K3J50q1p3J4P0J02m0N54L47m48m79J0RP9
2922B96j29m2Q1p2k3J21j20O2j08J7K89k01k1M9l1M6J24k82J83r3Q6j84J46j9k7M2L4l6L4
2650B22j20K3R4L5j36J55m3n8J69j83jR6m1j27K33j81R4l8J16k10J85n5o6J02j08O4M2j3K9
2377B79l9J3Q6j24qJ19o4o4J07K1j20J8O4p1L1J85j18m2R6j03J15j05K0K0J1j32Q2O4J7K3
$$ plain form
4405 14 7 21 124 102 66 86 154 163 196 90 188 37 46 191 92 163 158 83 159 176 46 91 51 276 20 85 143 75 128 82 112 55 146 66
4086 66 29 62 141 178 133 231 44 125 135 58 99 87 200 30 165 101 134 150 85 107 75 118 155 49 186 95 28 226 103 107 106 54
3786 54 171 40 179 137 224 148 217 206 102 123 209 64 133 203 113 75 241 208 68 212 19 110 104 102 81 157 123 270 95 112 150
3495 150 220 76 124 249 97 231 89 74 107 145 151 150 170 118 129 159 177 119 7 214 99 36 184 138 151 116 196 136 201 57 207
3204 207 161 196 144 23 101 238 231 52 203 156 64 209 161 228 59 82 232 151 78 92 162 264 224 778 1125 677 198 208 217 296
2922 296 167 125 206 134 111 232 112 174 66 83 372 171 150 199 168 214 338 56 239 146 232 48 194 175 148 190 224 188 222
2650 222 102 125 219 254 118 273 230 172 341 158 157 253 212 85 318 137 231 193 309 99 284 229 163 265 157 221 263 250 279
2377 279 240 253 339 215 207 326 262 198 305 326 206 224 288 217 248 433 315 273 369 266 381 276 296 316 327 195 277 341 358 381
2096C81k4o5R9j0J62l37K54k2j13j5n5K91R28J641L63k939l46K56Pk91L08k2n1o2J38J05k06
1842C75Q7mL7J54l26L16q9M0J9K0M2j2K60k31l2J38j45L54n3j75K77j49J80qJ35N5J11K39
1579A615k6k15l41l00K38L11R81j561O76P42J161J6625P352k1032m136K7j5J90m04K203L853
1382G944r32K649O168L0380J12022n5276q7600p524k301p69n89n57o33k28n71j48j44j76J20
1203A835k01k10P4k24q8k1j1k2j65J38k63J8J8j67J27q1j2k2M7J3k31K06j04J7k5M5j55J28
941F64j45PJ78k30j3J36p4j67K10k37J86l5R7j69P6r1J48l57L66r5j92J21J08k65J29M1j31
687B66P6j1J8j43J68n2K6Nn4l3N1l6L7Ol1M9K35k47J12j99O71N6j66j11m01R8O3O4l60O2l6
396A83K01q9K6p9k6J30j53J49L9k54J80p7pm3NJ23k31K54j45J32l3j51J16m4o8k0J34P2k67
$$ plain form
2096 381 357 292 391 381 543 206 460 438 325 310 255 546 1474 3115 3478 539 193 449 456 165 473 451 400 338 476 581 375
1842 375 462 458 495 649 323 639 550 590 609 629 671 659 919 688 656 794 649 1003 950 775 1052 903 1083 1075 1210 1265 1376 1615
1579 1615 1589 1374 1033 733 971 1282 2263 702 1378 2120 3281 19906 27258 6226 2090 2117 2102 2292 1888 4091 7944
1382 7944 7012 9661 15829 46209 158231 102955 15355 7831 5530 4761 4172 3615 2982 2754 2183 2035 1891 1715 1835
1203 1835 1634 1424 1498 1274 1186 1165 1154 1132 967 1105 842 860 878 711 838 757 745 723 770 783 552 758 654 671 646 691 536 664
941 664 519 526 704 474 461 597 523 356 566 329 515 480 577 408 484 393 541 184 550 455 263 384 492 227 356 397 266
687 266 342 331 349 206 374 322 348 353 299 266 317 281 318 324 293 342 577 330 442 243 914 970 804 693 292 390 453 517 157 219 183
396 183 384 295 321 242 216 346 193 342 381 127 307 230 223 180 185 308 77 331 186 318 285 134 250 206 138 118 252 324 57
124E7K26j98K00j33J69k47J88o8n1J8k0J50r0Mk9j4O2Q7j66Q1r5j4R4o0J19n3p1L8j32K28
-158B80j71N6r0L7R2P1j96R8N4j16nk6M6k4Q9rr3P6O1j56L7P8j18O3M4
$$ plain form
124 57 283 85 285 152 321 74 262 194 143 161 141 291 201 205 176 162 224 311 145 226 131 117 211 151 270 217 146 184 52 280
-158 280 109 165 75 112 204 275 79 177 231 115 110 84 130 106 195 186 93 169 230 74 111 189 71 134 178
-393A78
##PAGE=	F1=1353.69
##FIRST=	4405.4461538743908022,	4405.4461538743908022,	0.19119904935359954834
##DATA TABLE=	(F2++(Y..Y)), PROFILE
4405C2k8MQ6J3oj4M7O7P4k21J53k06M0J21o6Q3pp7R6L1j60M7m3K24k75P5K7l6N1o0M6n6J39
4096B01j30j0P4LQ0j41J42j34L5L0j3n0JJ59j58J17p4l8M9n8M9l0ON1j12J73j15p7K03q7k4
3804A22j9m4J23j34J42n3P6n1M6J3j18L1J34k13N5J18j53M3J17Pj62J20j38O6M3l1n0L4OJ45
3523B75j73M7j5J00j27k1J63r4R4j49K1p7J03KJ8K9k2l8O9k2m9o0J67j40j6J09om9J4N0l2
3232A71O5j41J10l2M3n7p1j5J85Pj56J01Oj09Q6kL6j07mP7k3o9J0Q8P0rN47M31n15n30K9L
2931B25J52j77m2N6n7j7P4q0Q7j71J2L45j87m8L7M0m5J47k27J25o3M0j20R9N1r0P8J2q7Q3
2650B52n7r6J42M2j58J74k5p3J58k02R7K3m5r9J86j13Q8j02J83k59J93k1q9J12j11O5kN5J3
2377C31n3jJ42j74J3J11m3j00J05Q3j38k1R6p7K1J62q2p0Q9n9R3o6J3l5L4j15J07QO2l1M7
$$ plain form
4405 32 4 8 94 107 101 87 134 201 275 54 207 1 41 162 96 179 172 95 191 222 62 109 66 290 15 90 117 81 132 72 118 62 201
4096 201 71 61 135 138 218 77 219 85 120 150 137 87 88 247 89 206 132 94 143 85 134 104 110 161 49 222 107 30 233 146 122
3804 122 103 59 182 48 190 137 213 162 208 221 103 134 268 55 110 228 75 118 235 242 80 200 62 128 171 140 90 124 130 275
3523 275 102 149 134 234 107 86 249 155 249 100 121 44 147 149 167 196 174 136 205 183 134 74 241 101 85 194 188 139 153 203 171
3232 171 236 95 205 173 216 159 88 73 258 265 109 210 216 107 193 191 227 120 116 193 170 101 111 199 269 260 807 1238 723 193 222 225
2931 225 377 200 158 214 157 140 214 134 221 50 62 407 220 172 209 249 204 351 124 249 186 226 106 205 256 166 244 256 169 252
2650 252 195 99 241 283 125 299 274 201 359 157 254 277 232 133 319 206 294 192 375 116 309 288 199 311 200 265 263 318 331
2377 331 278 277 419 245 258 369 326 226 331 414 276 255 351 274 295 457 375 305 394 335 428 362 375 340 374 259 366 374 436 405 452
2086D52j41J27J0J54l38K43J4j88M1n8L27P75J019P38k860j13K84k1l38M07Lk5q9J25J57k52
1842D53J21l2M7J53l03K87q2L4K3L6L1k6K89k15l9J01j31L12O8k20K59j51J33L3J03J22n7
1588A349K52k09l16j77J48L27N08J220j221l06J517L936L1397K3796m3610j0390k343p28l66
1410D784l94l136O949J682L988Q685M2919J66120p8687j30508j1242l328j185q34p56r41m52
1250C664o65k79j86k12R5k97j73l2k87n9m6on3j74P6k38k8O3k18J32q4j5m6j1O4k56K00q8
987H41kk3J1j10O1j25M0J60k29j6Q7n3j50K00k56K09j01J30j56O7q8J78m71M35q7j84R6J62
725F26k94J29J0q6L3%qq8J21q0N9j5j9p1M1J8l0P3m0K7L67m20J56j75J31M42n60K03k41J05
443D14L4L8k52J26j57J73n0R4j78L0J05j42J41L8k19J16Mj0j12K6J14j82K11j12J04k7j37
$$ plain form
2086 452 311 438 448 602 264 507 521 333 374 316 643 1418 2437 3175 315 202 486 465 127 534 537 512 423 548 705 453
1842 453 574 542 589 742 439 726 644 678 701 737 768 742 1031 816 777 878 747 1059 1127 907 1166 1015 1148 1181 1284 1406 1349
1588 1349 1601 1392 1076 899 1047 1374 1882 3102 1881 1575 3092 7028 38425 62221 18611 8221 5878 5150 4784
1410 4784 4390 1254 8203 9885 13873 22558 65477 231597 152910 22402 11160 7832 6647 5813 5057 4116 3664
1250 3664 2999 2720 2534 2322 2417 2120 1947 1915 1628 1569 1523 1517 1464 1290 1366 1128 1100 1163 945 1077 993 978 932 921 985 729 929 841
987 841 839 816 827 717 778 653 693 853 624 608 695 642 492 692 436 645 544 674 518 585 497 675 204 639 552 368 464 626
725 626 332 461 471 385 418 418 410 322 443 363 422 407 388 317 358 376 346 419 379 406 773 353 509 334 465 907 347 550 309 414
443 414 448 486 234 360 203 376 326 420 242 272 377 235 376 414 195 311 315 305 193 219 333 151 362 250 354 327 190
189A90J14o3n3p2J71R5k99K50k16K00j89K50l05K54j26k2L3m4J41k8p2L9o8J24M5j79R8j13
-74A55J9M9m9J50r1m2J2j21K39k09P5m7J6P7M6j63J02M5j54M9k4N1o2P0K6p6PJ08j79M7J05
-365B31k00J16L2
$$ plain form
189 190 304 241 188 116 287 382 83 333 117 317 128 378 73 327 201 179 212 168 309 281 209 248 180 304 349 170 268 155
-74 155 174 223 174 324 233 191 203 82 321 112 187 140 156 233 279 116 218 263 109 158 134 185 123 193 219 143 150 258 79 126 231
-365 231 31 147 179
-393A79
##PAGE=	F1=1344.3
##FIRST=	4405.4461538743908022,	4405.4461538743908022,	0.29428121447563171387
##DATA TABLE=	(F2++(Y..Y)), PROFILE
4405D9k6J5N2L2j2kj5J66P7k90J60j72%J08l7Q9qp8R9L0k11J10m9K17k72J06k6k6N6p1K5o
4105I0J40j43OJ05l8P8j91J49p6oN1N1j41J3J85j66J11p2m0J2m1Q5l0l0O4j18K11j40q6K07
3823B40n7n7Np6J54j11J19r0Q0r4R2K1j14N7Q5j84K8J54k15J25O2M2j44N6p9M6P3q1l7L3J5
3532A48J14j06Kj7R7j05q4K01l7L9j71P6q4Q5jL8L9l5m5P7r5K3k9J34j60K9P1L4j10O2K1n
3232B06O6j39P0j8N2p9l6m5K11nj58P0Q1j26K7L4pm8l8N7Mo5NJ33k1K3O23L86m64o02K8J9
2931B44J62j98j7Mo6M9Qm7J07j86N1L55k19n5M4M7o1J08j48N0m9J7l6M1J11j52J14j6j43J51
2650B70n9o6J47Kj41J45L1j13J24j42J35m1m1p0J38o3O3j02J75k46J77Qj17J38r9K6pR0l7
2377C25K2o4J97k26L9J09n3q5P7J19j41m2J47j46M7J73j26l9P4k4O1l7Or2O7q7J42m1L7j6
$$ plain form
4405 49 23 38 90 122 110 108 93 259 336 46 206 34 34 142 105 194 186 108 207 237 26 136 87 304 32 138 112 86 142 71 96 90
4105 90 230 87 93 198 160 238 47 196 120 114 165 216 75 88 273 107 218 146 106 118 77 162 132 102 166 48 259 119 33 240
3823 240 183 126 131 55 209 98 217 127 207 113 205 226 112 169 254 70 98 252 37 162 224 266 122 178 99 145 218 137 100 133 148
3532 148 262 156 158 141 238 133 49 250 213 252 81 157 73 158 157 195 234 199 154 231 136 159 130 264 104 133 204 238 128 190 211 206
3232 206 272 133 203 185 237 158 122 77 288 283 125 195 276 150 177 211 204 156 118 175 179 114 119 252 231 254 877 1263 799 197 225 244
2931 244 406 208 191 195 129 178 186 139 246 60 111 466 247 192 236 283 222 330 182 232 183 200 164 205 316 164 278 262 119 270
2650 270 211 145 292 294 153 298 329 216 340 198 333 292 251 181 319 256 319 217 392 146 323 331 214 352 253 279 272 362 325
2377 325 347 283 480 254 293 402 349 264 341 460 319 277 424 278 325 498 372 333 407 383 444 407 413 321 388 301 443 402 439 423
2096D23M8j45J45J9P6k67K13L2j98K2k7L12O17P81P97k595pJ85p1j27M03Qn2q4J29J40k97
1842D80J53j7J3J54k81L00j16L8L7jN2OJ96j47p7O6j16L45j9j50J90j37J01j3O7O7j77J33
1579A147l57j24J13N97J35M53Q17o45o58J214L229L2295K6085m2997j1079l010r11l49J89
1401F144j429M054K876M971J0475N2101K10589r5895j65746j4280m156j569j028r01j194o20
1250D392p31l81k28k49Q4l78j23j23l51l0p0jq0j77j4j57r4Q9k55J51q7j7o5o5Q3k28J79q7
987I87k2k2k2o5Mr5O3J33k18rK7m3j27J94k42J80r4O7o7M8r0K05n15M33p5j72Q7J46k54J13
706E55j5l6j5POp4P9j03R2l4J6j10L0P3r2J45q5N2M22n86L15j74k28R25l74l87p9J14LJ4j44
415C12J88k83J41JQ9j79M1Q3j27J50l2j16L7O4l5j18K6J05j33K11j22Q2j5j46R2o9k6n0J43
$$ plain form
2096 423 471 326 471 490 566 299 512 544 346 368 341 653 1270 2051 2848 253 246 431 360 233 636 644 592 508 637 777 480
1842 480 633 616 629 783 502 802 686 724 761 760 812 818 1014 867 790 856 740 1085 1066 916 1106 969 1070 1057 1124 1191 1014 1147
1579 1147 790 666 779 1376 1511 1964 2781 2136 1478 2692 5921 38216 64301 21304 10225 7215 6304 5955 6144
1401 6144 4715 8769 11645 16616 27091 79192 289781 193886 28140 13860 9704 8135 7107 6206 5012 4392
1250 4392 3661 3280 3052 2803 2887 2509 2386 2263 1912 1882 1812 1811 1731 1554 1540 1383 1289 1378 1123 1274 1187 1170 1105 1040 1123 895 1074 987
987 987 965 943 921 856 860 765 828 961 743 734 761 718 591 785 543 723 629 696 629 677 587 792 277 710 635 463 550 696 442 555
706 555 540 504 489 496 502 428 507 404 496 462 478 368 398 471 379 524 439 491 913 327 642 468 240 1165 791 404 325 439 442 456 312
415 312 500 217 358 359 448 269 310 393 266 416 384 268 305 369 334 216 242 347 214 425 303 385 370 224 316 247 221 171 314
142C14R2k76K36j88J33j72K58k98K71j53lL9k6Q9M4j37O5q0J50l1j00O6j22O0J0l3J39q7k7
-130B33k7m6J74j96O0J%O3K1j25J12pj50R9k8N5r9N6O7r6j4J01j70Q9Q0k36J32K1
$$ plain form
142 314 406 130 366 178 311 139 397 99 370 217 214 253 227 316 360 223 288 208 358 327 227 293 171 231 241 208 347 260 233
-130 233 206 160 334 138 198 199 199 262 283 158 270 263 113 212 184 239 140 196 263 167 153 254 84 173 253 17 149 170
-393A70
##PAGE=	F1=1334.91
##FIRST=	4405.4461538743908022,	4405.4461538743908022,	0.29428121447563171387
##DATA TABLE=	(F2++(Y..Y)), PROFILE
4405D9NJ4K0K0LK9q6K30M8k83J40j16m1R0J5N7k4p0J19Pj96J48p5J62j93J01o4kM7p9J9O7
4105A61O4j12J5R8n7O4j69J19n1l7Q6O6j78M1J59j63J13r2l0lk7J13j8l9M0j00K00j50p2K22
3823B63l9j03L1j15K09j22Q6q2O2j21J25J8j25Q7K4p0qJ59k54J68L1N6j50J4j8K4O1r3jM5
3542A62oO5j5m6LO2m4j38J99j0j0j78J33o2N7l5Q5K3m2m7Q4j57R0J4Q3j41J4R3K6j45J08l2
3241A93O6J0j54Q5m0J09j04m8pK12m2j54N5J46j72J1K8Qj7o0N2Mn5KJ72j12N0O88K76l47o36
2950B19K1K0J41j80j2p9rQ2l9J5P0j27K7L48k26p6O4M5p3N5n2m2j5M8Rj8J50k09J50n8j71
2659G8K40j13PJ14qj28J28L5j17O5l6J37j09l7l8J16m4M0n4J10j91J39J1j16J65j01J0MQ0
2387C87q7J27j41K19k33M9R4n5p1Q6J08j21q3J89j98P4J72j73M1M4oJ5k4L5j47J26q4J50n9
$$ plain form
4405 49 54 68 88 108 111 140 54 284 332 49 189 73 32 122 137 194 170 100 219 226 30 178 103 265 72 173 109 107 154 75 94 161
4105 161 225 113 128 226 169 233 64 183 132 95 181 247 69 110 269 106 219 127 97 94 67 180 162 123 163 63 263 113 41 263
3823 263 224 121 152 37 246 124 210 128 190 69 194 212 87 174 198 128 120 279 25 193 224 280 130 144 126 150 211 118 117 162
3542 162 156 221 206 160 163 225 181 43 242 232 222 44 177 115 172 137 222 245 203 156 240 83 173 187 270 129 143 236 262 117 225 193
3241 193 259 269 115 200 160 269 165 117 110 322 280 126 181 327 155 166 194 202 185 125 177 181 126 128 300 188 238 926 1202 855 219
2950 219 240 260 401 221 209 130 121 203 164 179 249 122 149 497 271 195 259 304 231 286 234 192 177 225 234 216 366 157 307 249 78
2659 78 318 205 212 326 318 190 318 353 236 301 265 402 293 256 218 334 290 330 276 386 195 334 345 229 394 293 303 307 387
2387 387 300 427 286 505 272 321 415 360 289 375 483 362 279 468 270 344 516 343 384 428 422 437 413 448 301 427 343 493 434
2114D34qM3Qj10J08M6j8j53J72Nj69MK3K56M88P26P60k299lJ21l8P1L26j8q9q5J07J12k99
1842E21J79%l4J55k50K96j43N1N2n7J02lJ02o8j04L1j09M44k18L8O3q8N7r1O7m6o8P7R4L48
1560A398J35M12j72J71J43O90j394L03K89K0933J7988k4755p453k161o16j67O89J54K448K984
1372A2019N365J1129N5713K34719j02619j85027j5994m580j853j088r76j301p32p21m56k29
1222C369k88N7m05q0j70l89k5r2K1j17j65q1n4j77J31l05J57o0k5r3j03R8k18J90j18J8n9
969A017l3j8q6j5M5J15k00nmm9p7J19j75J15n3qK4Mn0J87n09M01q8j16P1J01j63N6m2J1n0
678E25j9K8l3M4j24J16n2N1j30QJ06j15J92j31Q3L67o40M68j98k44R75k21p39L2N6N5l0j61
415B69K94l69J38N6N1j52L4O1j08J68r2k7l6J28r6p0K3O8r9K18j50R2l3j35P5l6n0JJ23M4
$$ plain form
2114 434 426 469 477 367 475 521 503 350 522 527 358 362 385 641 1129 1855 2615 316 313 434 396 467 793 775 686 601 708 820 521
1842 521 700 700 666 821 571 867 724 775 827 770 872 869 971 903 799 830 721 1165 947 985 1048 960 1017 926 993 947 879 956 1050 1398
1560 1398 1533 1945 1773 1944 2087 2777 1383 1686 1975 22908 40896 16141 8688 6527 5911 5744 6433 6587 9035 12019
1372 12019 17384 28513 84226 318945 216326 31299 15305 10725 8872 7784 6808 5507 4775 4054 3598 3369
1222 3369 3081 3138 2733 2653 2483 2094 2069 1977 1998 1881 1716 1635 1581 1404 1535 1230 1387 1327 1302 1209 1106 1204 986 1176 1058 1076 1017
969 1017 984 966 880 865 910 1025 825 820 816 767 690 809 634 749 696 688 712 716 666 853 344 745 657 541 612 713 550 606 564 575 525
678 525 506 534 501 545 421 537 485 536 406 414 520 405 597 466 549 916 276 744 546 302 1277 1056 317 349 405 460 430 269
415 269 563 194 332 388 439 287 321 382 274 442 350 323 287 415 319 249 272 340 241 459 309 401 368 233 308 272 222 223 346 390
133C90k16K18j53N8j28K33k62K27j45K8J4KP1M7j63R0q7J29o6pj0q3Q6l7J9Q4l9n4m3J5R1
-158C09j49N6L7m0O0k5l7Q6q8o0R5j6M7j21J8J09r0l0P1j23P6N0k21J38K1
$$ plain form
133 390 174 392 239 297 169 402 140 367 222 250 264 266 337 384 221 311 224 353 287 280 270 187 273 236 255 339 300 246 203 218 309
-158 309 160 216 253 213 273 248 211 297 209 149 244 228 275 154 172 281 191 161 232 109 185 235 14 152 173
-393A73
##PAGE=	F1=1325.52
##FIRST=	4405.4461538743908022,	4405.4461538743908022,	0.29428121447563171387
##DATA TABLE=	(F2++(Y..Y)), PROFILE
4405D9L5J4j2QJ3N5j15K52K3k71J22o0q3P2O7K6m1o3J34k1j39J44r6J13j14R5j02K4L7q8J4
4114I2J40j1q2K3R2p6N0j48R0k6o8J21Q0k14O9J33j60J15j13LKl4J20om8J5q2J90j60n7K36
3823B86k2j49N8j53K63j33O2o4jn2Q1K2j00P2l3M9n0J60k53J71NP5j55k9M3JN0j05L6N6k7
3532A64J5P7r5K5K6J8j92J97J5l2j58J26j8K3p5J33Pm4m4N0j77J51N3L1j22MJ21k4j39J49
3250B65q9J36m6j68R8o1J65j29n9L1K13q5j54P0J58k00J0K8K7j8k8L0j2l8MJ63j66R4O84J70
2969A093k25o49L6K2J19j61qj35P4O1n4P1K9q8j8L51k22r8Q4M2q4KM4j40J4J21J2q3J84k55
2687A39J97p4j72K76j37M4M5Mr4J09L9j20ON9J29j66k3nR3l6PLN6j35J02K3j03J80j14nJ5
2396C42P1j38K27k24K30j65L2N4n8n7R6R6r7j17J98j96P4J44k08J31J3J3l2j0P4j92J74r1
$$ plain form
4405 49 84 98 86 94 107 162 47 299 322 51 173 113 30 102 169 195 154 91 225 204 65 209 113 226 112 207 105 129 166 78 92
4114 92 232 221 139 162 254 178 228 80 170 144 76 197 277 63 132 265 105 220 107 110 112 78 198 192 144 159 77 267 107 50 286
3823 286 264 115 173 20 283 150 212 148 147 95 176 198 98 170 137 186 136 296 43 214 219 294 139 110 153 154 204 99 135 191 164
3532 164 179 256 161 186 212 230 38 235 250 218 60 186 168 191 116 249 256 212 168 218 41 192 245 276 154 158 279 255 116 265
3250 265 176 312 266 98 196 135 300 171 112 143 356 271 117 187 345 145 155 183 210 192 164 194 182 144 148 311 145 239 923 1093
2969 1093 868 219 255 277 396 235 227 92 166 227 173 244 273 185 167 518 296 198 282 324 240 242 286 146 160 281 293 210 394 139
2687 139 336 262 90 366 229 273 318 322 228 337 376 256 262 321 450 284 261 256 349 313 320 323 379 244 346 369 266 446 332 327 342
2396 342 413 275 502 278 508 343 375 429 371 314 410 506 409 292 490 294 368 512 304 435 448 461 429 419 493 301 475 384
2133C84J60p7n3J01l3p4O6O7o0o9J36j7j30lO9J95M15O42P19k007OJ42k3Q2K46m8j12p2R0
1861G42R0k50J74K2p6J58k19L01j60O6O6j13J53LK4j7p6J6q2M64l29J87j8kN0j00J37n6J42
1588A297K13L45K61j2J93k35Kj39K333k662O58O85R291j633j002l856q45j32LQ94J120J736
1382H515K539N122J0470N2921K32344r7189j83593j5960m532j944j047r50j268p04o56m73
1232C595k16l14N8m03k3k04m13or9N5j38j39j50N0k46J88l56J62l2l3j06j28J13k09K02j48
987A060N7r7k8M1j74O4J3Q3j82jk1m2k6M3j06M9j3q2J15l9j2J70n03L68j01o0N6N6p1ko9N7
687F03o4k2K9j4Rj46J61m8O6j72PJ60j59K19j77J17K31n26N01j99k75Q16q7p44P2J3J49j16
424D04k42M22l76J30R5lj26K9M2q3J50j05J5p3J87j62k2J9L2o5K26j79J02n1j24N8mp3N1J05
$$ plain form
2133 384 544 467 414 515 482 408 474 541 481 412 548 531 401 398 467 662 1077 1719 2438 431 437 579 556 638 884 836 724 652 742
1861 742 832 582 756 778 702 860 641 942 782 848 914 801 954 957 981 964 888 904 822 1286 957 1144 1126 1124 1174 1074 1211 1155 1297
1588 1297 1510 1855 2116 2104 2297 2062 2064 1925 4258 1596 2254 2939 12230 10597 9595 5739 4894 4762 4765 5659 6779 8515
1382 8515 11054 16176 26646 79567 311911 214722 31129 15169 10637 8693 7646 6696 5428 4724 4068 3595
1232 3595 3379 3065 3123 2720 2697 2493 2080 2074 1975 2030 1892 1753 1603 1653 1407 1595 1239 1401 1369 1336 1230 1102 1215 1006 1208 1060
987 1060 1117 1020 992 1033 859 923 936 1019 837 836 815 773 747 790 684 733 720 638 753 714 702 872 369 737 636 576 632 688 617 615 546 603
687 603 539 517 546 532 541 395 556 508 574 402 409 569 410 629 452 569 800 274 775 576 301 1117 1030 286 358 371 520 404
424 404 162 584 208 338 433 430 304 333 375 292 442 337 352 279 466 304 282 301 333 268 494 315 417 366 242 300 296 223 274 379
142C79mj58K02j20j5q4K07k27J84j37N9j1L1N2M9j89J16r4J08j01Q6q7m3J11q3P1K9Rq1n9
-139B00P7Pj02N2P3q0N6p0N1O0j70L0R3nL4j49K3J10p6l4kl3N7J5k06J43K1
$$ plain form
142 379 375 217 419 299 284 200 407 180 364 227 286 275 306 358 407 218 334 240 348 247 333 246 203 314 231 302 331 340 259 200
-139 200 277 284 182 234 307 227 283 213 264 324 154 184 277 272 306 157 180 290 214 180 178 145 202 217 11 154 175
-393A75
##PAGE=	F1=1316.13
##FIRST=	4405.4461538743908022,	4405.4461538743908022,	0.30781075358390808105
##DATA TABLE=	(F2++(Y..Y)), PROFILE
4405E2L9J9qm7O2M8j28K32Kk21Q8j3p1M2Q6Ln3o3J31j0j08J38j23P8p1J10q1KL5p7j1J79o9
4096A92k8j8R4r8N5q7L2l7l2J02R1k06P6O4q5N6j08N9nl2R4J6n4K3j16J86j22l6K02Kj65M0
3795A55j15K69j69J7J6p9O0l3K9k6Om2R9m1J27k17J27K4P9j63j5N5l9N4p2L7O7o6k5J48j30
3504A37O7j8P0k05J61L5m9j01N5M4lq7J29J7k5r2M8j01J07P5Mj23j5J70q9j11J68j13J66j07
3222B14j11P6o9K14j55o2N3J94j05j55J07J25k02K6PM1Lk3M6q4J8J0J22j89J41O25Q4j57n66
2950B28K2RJ07j31j9j42J33K9m0P9K4p4q2L44k07p7O3O3j13j7R6j59QJ41K5j17J92k50K01
2678C36n7j92K89j25RpM1o3J09K5j22k3J09J08j59m5M4N0m0LL7Oo1M7K1o3J74j07l9M8L3j35
2377B51K72k65K14p0pKm4m4J04O0m2j53J91j53J8J21j77J77j4K1q9J8J11k19K14j13J46o4
$$ plain form
4405 52 91 110 102 55 117 165 37 269 271 50 138 125 54 96 182 185 132 69 200 190 82 220 97 175 104 214 133 135 170 93 82 261 192
4096 192 164 146 240 142 197 110 142 105 73 175 266 60 136 200 115 171 63 122 117 85 179 195 141 164 48 234 112 76 278 280 115 155
3795 155 40 309 140 157 173 94 154 121 150 124 130 88 187 146 273 56 183 207 286 123 108 163 124 178 106 143 210 144 119 267 137
3504 137 204 186 256 51 212 247 198 97 152 196 193 106 235 252 227 135 183 82 189 264 268 145 130 300 211 100 268 155 321 214
3222 214 103 179 110 324 169 107 160 354 249 94 201 326 124 150 157 198 201 178 224 140 158 168 290 101 242 867 951 794 228
2950 228 250 259 366 235 216 74 207 236 196 275 299 225 143 487 280 203 266 329 216 199 295 136 144 285 310 193 385 135 336
2678 336 279 87 376 251 260 253 294 231 340 365 243 220 329 437 278 233 277 327 287 290 327 333 272 319 340 277 451 344 305 353 386 251
2377 251 523 258 472 402 395 397 353 309 413 473 431 278 469 316 334 455 278 455 441 462 373 391 502 283 497 384 530 466
2114D66q7J37l7q5P8M8n7k7R8%j18K3M2J81M24M84P17j777j0J81l9K0J42j6q8p9O5J00j89
1842E97J40on0J70k22L06j42K7J17j15J17L7j6j7j2K0r2M53l23K27m0L5O9p3J98k4J90K99
1579A870L40J8j72R7j19l2n2K839k972J160K166J2399n511l481m872l71J66R6P92J380J403
1382G144J939M344Q716M4382K03997q1079j61819j4185l987j866q76q84j059n79n50m24j70
1222C044l11O9l64j6j70l72n1l2O5j65j01j67J26l00K62l97J29K1n1r8j52J32j84J96j66R4
978A041j24k7J14k65J52n2Q3j31m0K0o2nj8m1j2L9j15J45n2J9J45m76L31r9k9O3jQm3p8O1
687E51l8n2K9N2n1j38J70k5N4k05NJ88j61K03j80J28L9l24M39j73k55N12M5n17L2LK45j91
424C85k48M68l57J12Q1m5q1M4j2o5R1k1k7m1J69j66rL9k5k0K06j58P7m9j29P2J7j17P9J03
$$ plain form
2114 466 379 516 479 394 472 520 463 436 534 534 416 439 481 662 1086 1570 2287 510 500 681 642 662 804 788 700 621 686 786 597
1842 597 737 731 681 851 629 935 793 820 937 822 939 976 960 943 931 951 859 1312 989 1216 1176 1211 1280 1207 1405 1381 1571 1870
1579 1870 2210 2228 2056 2153 2034 2002 1950 4789 1817 2977 5143 17542 12031 8550 3678 3307 3473 3569 4361 5741 7144
1382 7144 9083 13427 22143 66525 270522 189443 27624 13439 9452 7586 6710 5826 4767 4188 3638 3214 3044
1222 3044 2733 2802 2438 2422 2252 1880 1829 1797 1862 1697 1596 1429 1555 1255 1517 1120 1249 1270 1219 1121 969 1101 917 1113 947 1041
978 1041 917 890 1004 739 891 839 922 791 751 771 709 704 686 645 633 672 557 702 650 669 814 338 669 570 541 604 603 611 568 490 551
687 551 513 461 490 542 491 353 523 498 552 347 352 540 379 582 402 530 569 245 684 511 256 768 813 296 328 331 576 385
424 385 137 605 248 360 441 396 315 359 347 282 373 352 325 284 453 287 278 317 292 272 478 320 397 348 219 291 308 191 270 373
142C73k5j17J88r1l4j04J95j82J08r3Q1m5O7K8K2j64J32j10N9o1R7j01NJ03j05Q6j2N4j07
-130B47o2P1k6m3N5Q0j02%l6R5J5k04J16P3KJ9j62M3R2n2m2p8P6Jj9j33J11J0
$$ plain form
142 373 348 231 419 328 294 190 385 203 311 218 299 254 321 349 371 207 339 229 288 227 324 223 228 331 226 312 300 354 247
-130 247 185 256 230 187 242 322 220 220 184 279 294 90 206 279 281 300 138 181 273 221 179 101 177 178 159 26 137 147
-393A47
##PAGE=	F1=1306.74
##FIRST=	4405.4461538743908022,	4405.4461538743908022,	0.32134029269218444824
##DATA TABLE=	(F2++(Y..Y)), PROFILE
4405E4M4K4nj02J11M1j39K10j8j72N5L4n8J1J05k0o4o3J27Jr8J12j30O3k8J26o1j9L3o6n8
4114E0J97j05M8o0R5j20O2k6k7m7MP6R7j56M3MKm7o0J09j7l0O8L8o0L1j50J82q5j4J67K8j82
3804A15K7p1K32j63l2R1j59J74j47L4M0o8J8Q1k4J03j82Q3M2Q4j71%M5r9P9j9J7N8q1l9J78
3513B46j23Q3q8J43j97J04L4m5k3l7Q5qp8J04NJ6j20M6k4M3P5qj06j4J57j29n6J85j37J98
3232C31j70n9M9n6J99j54l8N5J54j15j46J44R2j95N4k5M6J3k9P3j47Q0K1N0j60J53N31O9j59
2959F61m64K7j4Q5q1j0j68J70mk5Q7J8n8j46L36j92n7M2J06j21n6J26j68J3J52K5j57J96k03
2687A20J63k9k00K58p0l2o3P7l2J08J1j12m1J28N8q5q5Q8Jk8J5J8j3Qj4K0k3J67r9p3Q0%j25
2377A96K60k79K07L6m8m9l0l0R7J0K6j74J84j10m4R3j17J66l5L5j33N9J49k46K39j49J47l6
$$ plain form
4405 54 98 122 117 15 126 167 28 238 220 48 103 137 79 90 195 175 111 48 175 176 78 190 60 123 95 221 160 141 174 108 50
4114 50 247 142 190 130 225 105 167 141 114 67 71 147 244 88 131 135 137 90 30 139 122 92 160 198 138 169 19 201 116 102 269 297 115
3804 115 142 71 303 140 108 199 40 214 67 101 141 73 91 172 148 251 69 152 194 278 107 107 152 53 132 113 130 188 107 68 246
3513 246 123 206 118 261 64 168 202 157 134 97 182 174 96 200 205 221 101 147 123 166 241 233 127 113 270 141 85 270 133 331
3232 331 161 102 151 95 294 140 102 157 311 196 50 194 286 91 145 120 166 179 150 223 76 156 177 227 67 220 751 820 661
2959 661 197 224 210 295 214 204 36 206 202 177 264 282 224 78 414 222 165 207 313 192 136 262 94 107 259 284 127 323 120
2687 120 283 254 54 312 242 210 147 224 192 300 311 199 158 286 344 259 174 262 263 235 250 268 255 263 249 269 246 413 314 241 321 321 196
2377 196 456 177 384 420 372 323 293 263 360 370 396 222 406 296 252 345 228 394 359 394 261 320 469 223 462 313 460 424
2114D24j37J61m3r5Q9L0n4J6N9J7j05M8J5J68M77L73O39j619m0K05n3m4N3L1n1p2M1J10j44
1842D99R4k2j0J68k37L10j24j2J69j31O7Q5m2l1L8J5j11M11k65J69QOJ03o8K32l2J11L21K71
1570A992k11l19O2N5Ko8K325k122J039J963J1423K33p525o057q09K82J33N50J089J134J411
1372F582L243O282L2201J56640n8297j25027j1104l103j617o71p86o95l85m10l40j12k94R5
1203B202l11J8j07l32r5M8Q9j82n6j55J46l36L57m38R6Q7n5p6j63J38j74K06j71J32j52k5
959F91J86l56K39j17Q3p9p9P5o9J8q0K5p4R1j47J74o4M4J14m06K51r1PO9n7Q7q4q8O6Ko8J6
659C79J02r6j17J66j7N8k26NK15j76J73j78J42j46l4K31r8j57J44J45k41J4J3K84k40j33L82
405E94l44R1O7q7l8O1o8m6N3Q5r0l1J51j70NN8q2K6J85j37N2m7j34Q7O4j36M3J24n1q3J75
$$ plain form
2114 424 287 448 405 310 399 429 375 391 450 467 362 410 425 593 1070 1443 2082 463 423 628 575 531 584 615 564 492 533 643 499
1842 499 593 571 561 729 492 802 678 666 835 704 771 856 814 783 821 836 725 1136 871 1040 1048 1054 1157 1089 1321 1289 1400 1721 1992
1570 1992 1781 1462 1524 1579 1581 1513 3838 1716 2755 4718 16141 16374 8849 2792 1983 2265 2398 2948 4037 5171 6582
1372 6582 9825 16107 48308 204948 146651 21624 10520 7417 5800 5129 4343 3648 3263 2853 2513 2401 2107 2202
1203 2202 1891 1909 1802 1470 1375 1423 1512 1330 1274 1119 1265 929 1286 848 944 1031 976 900 737 875 701 907 736 868 716 691
959 691 877 521 760 643 726 647 568 643 574 592 512 537 463 554 407 581 517 561 675 269 520 429 436 505 448 535 451 363 429 431 363 379
659 379 481 385 268 434 417 475 249 254 469 293 466 288 430 284 250 481 383 226 370 515 274 288 301 585 345 212 594
405 594 250 341 408 321 283 344 276 230 283 368 278 247 398 228 233 291 209 235 420 283 335 288 154 241 305 169 212 336 285 202 377
114C77o3n3j23J84j38L2m9J03q0J04Nnj41J50j27L6NM7r7M9R1j28J00n3J01j14m3O6o0oL7
-177B07Q7j23k9K3R3Nk22J35N7J5K6j56M4N3qk8j55J85n4n4n9P8%
$$ plain form
114 377 314 261 138 322 184 216 167 270 190 294 299 294 153 303 176 212 217 264 167 216 307 179 279 226 327 213 170 236 176 170 207
-177 207 294 171 142 165 258 263 41 176 233 248 274 118 162 215 207 179 24 209 155 101 42 120 120
-393A20
##PAGE=	F1=1297.35
##FIRST=	4405.4461538743908022,	4405.4461538743908022,	0.30909928679466247559
##DATA TABLE=	(F2++(Y..Y)), PROFILE
4405E2K7J7L0o9N0L6r6J33k8q9kL7pj3Q6j2m1r1J02L5j15J14j36P5l3J35k6o3M0m4o7J52j08
4096H1Q8o2P7j19L5M8r3m1M5M2Q6q7J8p0R6j01j8J03n0RK9N3n9N4j28J08rKQ2M5j37Mk4J47
3776B54j18r8J69j61J99j39n9Q9n4J1NL0N7j23J9R2O3j48RL2q8P6Nk7P1r8m3J80j03Q7j32
3485E7J86j53J4L7l3M1q6R4kn9M1PN3j54L1M0L0L9K0j47O9R2j68oJ91j59K19j61m1J1k9J62
3185B36j39k0O6J05p6j49J45O3k07R7j9oL5m4J24j72Q5L5kj19J24M47O3k12l18J3QN1o4M1
2903A91j49J26J0o4P7N8m6j48K56j37n2QJ24q8r5J29j50MJ15M2j42J58j11P4J7j67J52Nn8
2631A39q9R1j3Q2L9j31l3J23lK7j33J07j4n8R0n8k0O8o0L6k8J36k7j38J19n3o1K05k81J82
2349B44J17l5j18qk3Q5qO1j68J35j7j16N3q0J51m2N0j61Q9J68k56K37j47J06K0j66J46qj36
$$ plain form
4405 52 79 96 126 57 107 143 47 180 152 63 61 98 91 78 164 152 111 20 122 157 42 156 20 95 62 197 171 108 148 104 37 189 81
4096 81 169 107 184 65 100 148 55 14 59 101 187 100 118 48 144 43 25 128 78 87 116 169 110 164 36 144 135 137 219 264 127 131 107 254
3776 254 136 38 207 46 245 106 47 136 82 93 98 128 185 62 81 173 236 88 97 129 41 117 122 95 166 68 25 205 102 189 57
3485 57 243 90 104 141 108 149 63 157 155 96 137 144 197 43 74 114 144 183 203 56 125 217 49 43 234 75 294 133 92 103 74 236
3185 236 97 77 143 248 172 23 168 231 24 121 102 96 131 87 211 39 124 159 157 38 162 609 672 460 142 155 163 214 150 191
2903 191 42 168 178 114 191 249 203 55 311 174 122 130 254 166 71 200 50 54 169 211 69 227 116 190 207 40 192 197 139
2631 139 50 141 128 210 249 118 85 208 205 232 99 206 192 134 224 166 146 214 154 190 162 298 271 133 252 199 138 343 62 244
2349 244 361 326 208 200 177 262 254 315 147 282 265 149 202 122 273 231 281 120 209 377 121 358 211 317 337 171 317 309 173
2077A73R5L3j01Q9QL1q8Q4j7J37N66N13L25j554l7K04p2o5p3J34l4n1L3R3j06O1m9M3J23k31
1795B67L27j34n4K11j06k1J38o6r7J50m0j13L30j92J14N5q2J18p8K60n9k2K69K36k70m10l7
1541F94K18L2j42J187p63N72P19M356L91j127m519p51L46J81L10N88Q30R14K110L713J9126
1344B8985J01514l4187q1855p395k076j254m83o92k49j53k79k19o8k61J48k55K0k6k60j46
1156H09J24R8j59kj33J27l32M05m16K6J56o1l8j37J14j45J61j22J11r6o6K40l77K63j48P7
912D79m3q0J18r4M8j23M4q6J24j41J45o6O0R3k64J16m6j3J03j01J19q0q9N2M2r2J0J21j10
640B46r1J26K7M7j85m6K20j43J04j20J03j65K75j68j9n6j11J57J3PM2K65k38n1L10l57J03
387B95K9j10m3J11r7k5pJ84j37k7J20j32j5Q9j37P8J32o9nj9j26Q0R7j16l2J55k7r2J35l4
$$ plain form
2077 173 268 301 200 289 297 328 240 324 307 444 1010 1523 1848 294 257 461 389 324 251 385 351 300 333 426 320 381 332 375 498 267
1795 267 594 460 406 617 511 490 628 562 465 615 575 462 792 600 714 769 687 805 727 987 928 906 1175 1411 1141 731 694
1541 694 912 944 802 1989 1226 1798 2517 6873 7264 6137 1618 867 1213 1394 1704 2292 3122 4036 6146 9859 28985
1344 28985 130499 96312 14457 7062 4986 3732 3249 2557 2308 2155 1876 1657 1589 1328 1476 1221 1241 1215 955 809
1156 809 933 1031 872 870 737 864 532 937 521 547 703 642 604 467 581 436 597 475 586 490 424 664 287 550 402 479
912 479 436 356 474 380 428 305 349 263 387 246 391 325 385 478 214 330 284 271 374 273 392 312 223 275 317 225 235 356 246
640 246 155 281 308 355 170 124 344 201 305 185 288 123 398 230 211 155 44 201 214 221 263 528 290 239 549 192 295
387 295 324 214 171 282 185 160 153 337 200 173 293 161 146 235 98 176 308 239 234 215 89 169 266 150 118 273 246 154 289 255
105B55l8j37J53p6n0j9R6q0J22J1m1j21J80j15j0N9k4o7Q1M5r6Q4m8R2p6m1K0p8M1M2R7j35
-196A26m5O8N0Oj79R1L6K0L7j17L8J8J2J8j26J48q2o0j1K0%
$$ plain form
105 255 217 80 233 157 107 88 184 104 226 237 196 75 255 140 130 189 165 98 179 224 128 212 164 256 180 139 159 81 122 164 261 126
-196 126 81 149 199 205 26 117 153 173 210 93 131 149 161 179 53 201 119 59 48 68 68
-393F8
##PAGE=	F1=1287.96
##FIRST=	4405.4461538743908022,	4405.4461538743908022,	0.29685828089714050293
##DATA TABLE=	(F2++(Y..Y)), PROFILE
4405E0J0J0O4l5j1L1n3N5l7on9M0M4l6O6lJr7N7M6j39J07p4J7k8J53Qj06M2k7l4O4j04J33
4086A49o6O0j18QJ35j47L4J7oO4l0j9l8J02l3m6P5j07M8j0O8n8R8q5J4M5J8lO2r2j9K3M7r0
3767A00m7J13p8J71p9r9N8K3o8n8P7Po5m5J36L8p8j8J6OL1j0p1Q3q9j9J24n7M9j34J82p3q1
3457D5L5j6J11l0m5J9k3j3J7M1r6j9O9N9l9P5j63J20oq9l3J92j85K27q5q1jk2J04q4m1Q7O5
3147A95l4o6L7O4j57O2j6n9N5o1J55p5%M1Mj05P0L35N9k66j62RL0J9n4Q8q7L8J9j08O2R3j2
2837A73m4O7n3n0k9J11mj39J28j32pN7L5j8L1k2j8P3m2n3O7l8J4m4lN8O9j40j4J02q1J25j14
2527F5O9kr4J61j35k7J50q7L2n4J04M6k03J58q3K6Q1j56M7J73pj71K0j1L6K2M7j24Q3P2j19
2236A19n6m5J33m7O8j24M3J72j95J49r0M4N5j04K9R7j91N3P4j54J56o3K4n0J42m5J08N67R58
$$ plain form
4405 50 60 70 134 99 88 119 66 121 84 78 19 59 103 67 133 130 131 34 91 137 -2 105 31 48 20 173 181 75 117 90 56 120 16 149
4086 149 83 143 25 33 168 21 55 72 66 130 100 81 43 145 112 66 141 34 82 72 140 82 180 95 109 154 172 169 231 139 120 143 190 100
3767 100 53 166 88 259 180 81 139 162 94 36 113 120 55 10 146 184 106 88 104 110 141 131 60 143 54 35 159 102 151 17 199 126 45
3457 45 80 64 175 145 100 119 96 83 100 141 45 26 95 154 115 190 27 147 141 52 19 211 26 253 168 87 86 64 168 84 43 130 195
3147 195 161 95 132 196 39 101 85 26 81 20 175 100 100 141 145 40 110 445 504 238 76 85 115 134 80 168 81 119 138 30 92 185 173
2837 173 129 196 143 93 64 175 171 32 160 28 21 78 113 95 126 104 86 159 117 64 131 93 107 63 60 118 187 47 33 135 54 179 65
2527 65 134 132 38 199 64 37 187 100 132 78 182 228 25 183 100 126 207 51 98 271 264 93 113 102 138 160 207 83 166 238 119
2236 119 63 18 151 104 172 48 91 263 68 217 127 171 226 122 151 248 57 110 184 30 186 123 147 97 239 194 302 869 1827
1964A827k07j536P5J45k0j01j36J29pj8LN5m2N5j50J08Q1k19L45j45j12K37l7j53K18o4j84
1711A47K40q4j04K39j30O5J06j49P1J1K20m3j13J16K70m7l01m70L28J25K36k50J5N03L78P661
1466I040K33p205j639L70l6K0L0Q9O09M01J129J513P821N0514j3727m1548l811j075q34l69
1279A525n90J64M6j76j26k5k27J90k08L1O6j87j98J78Q8j32N7p9N7k46L69l26n9J72l4k3m7
1025B60K2j01J16p2Q3L8j68K39k54J53j30L5J5o2J11q9Q4j61N4j11J58j35J15o6O6O3n2q8
762A23Pk4J43j40J08l4r4L2P7j22M7R6r7l9P2N4L0o7j38J84j09L4o5N8J77L03m65r1M4N4q8
471G0R4k0N0K24j71j2J99l36J51qj34m9J62j32ql0K36j37n9J19o3j06J31j27N6Q7Qp1%m2P
180H9R8m6j18J76L9j43J00Kk5j50J37Kr0l1P4r7J51K5j19JJ05p0k3O4r1l1J09pk3K7l7Q8l9
$$ plain form
1964 1827 1620 84 159 304 284 183 47 176 169 151 154 209 167 222 72 180 261 42 387 242 130 367 330 177 395 331 147
1711 147 387 303 199 438 308 373 479 330 401 412 632 589 476 592 862 815 514 44 372 497 733 483 498 1001 1379 9040
1466 9040 9273 2068 429 799 763 783 813 902 1511 1912 3041 4554 12375 62889 49162 7614 3803 2728 1894 1525
1279 1525 935 1099 1145 969 843 818 591 781 573 604 670 483 285 463 551 419 476 397 454 208 577 251 192 364 330 307 260
1025 260 282 181 297 225 308 346 178 417 163 316 186 221 236 174 285 196 280 119 173 62 220 85 200 134 200 263 211 123
762 123 130 106 249 109 217 183 89 121 198 76 123 219 122 83 155 209 239 172 34 218 109 143 78 136 313 616 151 60 104 158 70
471 70 164 144 194 418 247 235 434 98 249 241 107 58 220 88 80 50 286 149 90 209 146 40 171 44 100 187 195 124 124 82 89
180 89 187 141 23 199 238 95 195 197 172 22 159 161 71 40 114 17 168 193 74 75 180 110 87 151 60 29 138 131 108 135 98 186 147
-130A47m0mp5O7K5R9j56RM4J0J0r3NK0L0N3p2j0K5K2N2n6P0o3k1m1l0%
$$ plain form
-130 147 107 103 28 95 120 219 63 72 116 126 136 43 48 68 98 151 79 69 94 116 168 112 182 119 98 57 27 27
-393B7
##PAGE=	F1=1278.57
##FIRST=	4405.4461538743908022,	4405.4461538743908022,	0.2936369478702545166
##DATA TABLE=	(F2++(Y..Y)), PROFILE
4405D9Kj8P6K3n2LQrn2M1o3OQ7l5M5j1L7o2J0L1r7O1qm9J4J05K7j15L2k3J3Mj1K6j7M6r4r
4049B1J38j03K3oRRj4QK9J3M2o5K3j17O8j9O8n9R7m4pL6N0p9N0m7J3L4m7n9M6J7j9J40k7j00
3711A22NQ8j28o0P7pm3J7P8ol2m6L5M0K6k9p3O7l8j4L0K5j9n9J02k6j10L3lJ18O3j67J7j5
3391F8l7P9k3no5N1R1r9J05o3P0r7M7q9J70j38J57l3j24K0j9L4mo9R4M8j0mn6Q6q3j6Kj9l1
3063C8N0K7J8l2K6M4j10K3K33k3k59j5L1L2rm1J01k0k9J9l9o3J28L0J4o6M0p6l0P4N1j07J03
2753A63j16K4k1k2J04n8M1m7M8N4j01J4LP7j51QL3J10p5k3J1L2K2l9l2N3o2J42j57M9P2n8
2452I8M9j09M5J03o3K3q7R1n9M9r0J24K2j61N7l2l4J17Ko2pJ50p0r6M8m7j3O9J7n7Q2p1J9
2142A07RjK4K1j42K21j44n1N7M7j8j10qN7J27k2N0M52J439n98j299N4k4Q3j57P5k12J3O5%
$$ plain form
4405 49 51 33 109 132 80 83 91 82 30 71 8 14 101 66 111 100 137 75 85 116 19 80 72 23 37 142 169 54 86 63 76 80 69 95 78 124 30 21
4049 21 159 56 79 73 82 91 77 85 114 127 169 104 127 10 78 59 127 68 165 121 114 150 200 121 171 124 137 171 124 65 111 128 109 249 222 122
3711 122 127 215 87 27 104 97 54 71 149 143 111 65 100 140 166 137 64 131 93 79 109 134 115 56 158 132 22 55 52 170 233 66 83 68
3391 68 31 110 87 82 17 68 159 60 165 102 172 75 122 33 203 65 222 189 65 85 66 100 96 27 121 169 159 155 99 185 102 86 88 69 38
3063 38 88 115 133 101 127 171 61 84 317 294 35 20 51 83 74 33 134 114 85 104 65 2 130 160 174 108 148 72 42 116 167 60 163
2753 163 47 71 50 28 132 74 115 68 116 170 69 83 86 163 12 20 53 163 88 65 76 108 130 91 59 112 50 192 35 84 156 98
2452 98 147 38 83 186 123 146 59 150 91 140 50 174 196 35 92 60 26 143 145 83 76 226 156 60 108 61 48 117 134 77 159 88 107
2142 107 116 115 139 160 18 239 95 44 101 148 130 20 12 69 196 174 224 676 2115 1517 218 272 248 331 174 249 37 50 115 115
1861A15m5j8J82r8o4J4N4J11j04j7L6Q4j46J13O3j04O3m6M9J4o3J25j1J0r0J66K5J48p3QJ06
1570F07J62j27l21J9J29O30k65m55O68J392J3935K487j6145j284j41l74j82k47l25O36k90
1372E09M18n4J191J2496r32j1237r29k44l41l24K34k1l53p5n5Q0k64K23j39n5K04j14l4p1
1147A13P6p4Q3J2n5R9L7q9k8r8N4o3J35j13L5j2n1R0J51j01j2M5j18Op5L1M7j0l4J36j36o
847G5lJ3n3M7k8N2oJ47j97K6L1M1j01M7J5o0L0K1o0R0l7k7M0j8N6j6Q5j52N8j3l8k8L0L93
527D60K79m43k02J10M3j1j19l5j0K18j4o8J01k71J57l3j18K5P5j37M4Q9R4p8j22R4M4j15O6
255A23mp4L5P2q6k9M6l5P9J7n0O7Q9j43K5kJ5o8J9P5m8n3loO4J01j55O7k6RK3mp7m0P5n5M3
-92H6kJ4K8k8j2L2j3m6N1R4j47N3kJ3m4j8L7n6K1J9%o0O9k5P6OJ6l6Pp7k2j1
$$ plain form
1861 115 70 52 234 136 72 86 140 251 147 130 166 250 104 217 280 176 239 193 242 256 193 318 307 317 227 393 418 566 493 501 607
1570 607 769 642 321 340 469 1099 834 379 1047 2439 16374 18861 2716 1432 1291 917 735 488 163 799 509
1372 509 927 873 2064 14560 13628 2391 1462 1218 877 553 787 766 413 338 283 363 99 322 183 128 332 218 184 113
1147 113 189 115 198 210 155 254 291 202 174 76 130 67 202 89 124 112 61 151 302 201 189 234 116 122 47 78 125 115 81 217 81 75
847 75 72 85 32 79 51 103 97 244 47 73 104 145 44 91 106 46 76 97 37 127 90 63 103 85 141 125 210 58 116 103 65 37 67 460
527 460 739 296 94 204 247 236 117 82 72 290 276 208 309 38 195 162 44 69 144 7 51 140 234 156 34 128 172 57 123
255 123 119 45 80 152 66 37 83 48 127 144 94 161 250 107 132 130 145 77 96 171 123 70 67 61 125 226 71 138 112 121 144 140 63 23 98 43 86
-92 86 84 98 126 98 86 118 105 59 110 204 57 110 108 121 77 59 96 40 61 80 80 20 89 64 140 146 162 126 133 56 34 23
-393B3
##PAGE=	F1=1269.18
##FIRST=	4405.4461538743908022,	4405.4461538743908022,	0.29041564464569091797
##DATA TABLE=	(F2++(Y..Y)), PROFILE
4405D9J5k7M8L8o8LK2l7k9M1k0K2K5JJ5k7O6l1J0k2q6O9Rp8N6N7Nq3K3j9J8j4P7q6L1L2m3
4058F2jP8l8Ql4K9m1l6Q3L3n5O9m6J3q5K5pO2o4Q9qJ5j6Q8j50L9lM0M0r5o3J01l0L3J03K0
3720B58j06k6R0j41j5P6k1m1N7K0m9J4p3N2P4K2m8p5N2Oj4k7O1m1k1K2K2p7J0LJ19J06j98
3410I1k0m1LJ18j07O4o3lQ6j12J08J0M8j63J42j03J41r6Q9J8j67M1%k1M4m3P4M%M1r6P6j3
3100A50j00K2K2n1Q5o5O0nj6P9j20K3J78j97P5o7qMJ5k1L8K0l8NJ5l3RN4N4j45J00p5nNP4
2772A41o4Q9j10M4k4mP5m8JJ6k8R7m8p7JR9j37%K3Q2mk6o6J62o5l3q0P5kO8r3P1lk4M8r5K1
2424H2N5M6o0l8O9j23J35l1l8K1m2J5m4j2J08l6Pq0J58l4o7P0j06M1PN0j7n2Pk6N5km4R6j10
2096F0J82j23ro5J79j22j0K2RM1J3ML41J642o66j132m9j04J65k33J82k65J4M5Ln7m6K56n3
$$ plain form
4405 49 64 37 85 123 55 58 80 43 14 55 35 57 82 83 98 71 137 106 116 94 8 77 86 8 64 121 126 43 66 47 65 51 128 42 73 105 62
4058 62 61 139 101 109 75 104 63 27 110 143 88 157 111 124 39 64 57 119 55 144 136 151 135 223 73 112 109 149 189 94 31 132 102 135 238 258
3720 258 152 126 216 75 60 136 115 74 131 151 102 116 43 95 169 191 143 68 120 126 112 85 146 105 84 106 128 51 61 64 183 289 91
3410 91 71 30 33 151 44 108 45 42 128 16 124 134 182 19 161 58 199 103 192 210 43 84 84 63 107 64 138 142 142 183 87 163 150
3100 150 50 72 94 43 128 63 123 118 102 181 61 84 262 65 140 73 65 69 84 63 101 121 83 88 103 70 79 133 187 42 142 67 62 67 141
2772 141 77 166 56 100 76 72 147 99 100 116 88 185 137 60 61 160 23 23 46 128 124 98 32 194 129 96 16 91 89 157 64 135 132 108 156 61 82
2424 82 137 183 123 85 154 31 166 135 97 118 76 91 47 35 143 107 114 34 192 158 91 161 55 96 103 153 136 84 91 65 120 118 74 170 60
2096 60 242 119 110 45 224 102 92 114 123 164 177 181 522 2164 1498 366 317 213 378 145 327 62 76 121 124 67 21 277 224
1823B24j58K9J30o8qP5j69J70qj07J62J5j57P1J12p5k6J50j64J66q6J70j52L17n4L7q9R7n7
1551E47k50K6J04P16p00N03%J293J4001K951j5644j839n05l95j59k18j02L46j84JO31M365
1344E488R605p893n906l68K7j5j32N89k06j144J50k4J69l3j01P7j08R5k0O8j86L0Nl7O2m2
$$ plain form
1823 224 66 95 225 157 149 224 55 225 217 110 272 287 130 201 313 238 212 362 198 364 278 448 296 613 559 596 507 604 547
1551 547 297 323 427 1143 443 946 946 2239 16240 19191 3547 1708 1203 808 649 431 329 675 491 492 1123 5488
1344 5488 15093 7200 1294 926 953 938 806 1395 1189 45 195 171 340 307 206 283 175 270 250 318 132 162 167 130 192 150
$$ [...]
-393B4
##END NTUPLES=	nD NMR SPECTRUM
##END=	
##END=	
