##TITLE=	Sk5TiKBJRjGyioYgifNB$A.25.ser
TM-VI-191, CD3OD hmbc

##JCAMP-DX=	6.0	$$ MestReNova 14.3.0-30573
##DATA TYPE=	LINK
##BLOCK_ID=	1
##BLOCKS=	2    
##ORIGIN=	Mestrelab Research S.L.
##OWNER=	hrzepa
##$MNOVA/LINK_BLOCK_TYPE=	ITEM	$$ NMR Spectrum
##$MNOVA/ITEM/POLYGON=	(XY..XY)
5321,5835
8722,5835
8722,8208
5321,8208
5321,5835
##$MNOVA/ITEM/Z=	0
##$MNOVA/ITEM/ANGLE=	0
##TITLE=	Sk5TiKBJRjGyioYgifNB$A.25.ser
##JCAMP-DX=	6.0	$$ MestReNova 14.3.0-30573
##BLOCK_ID=	2
##DATA TYPE=	MNOVA NMR VIEW DATA
##DATA CLASS=	MNOVA VIEW DATA
##$MNOVA/2D/THRESHOLD=	3.3475437164306640625
##$MNOVA/ITEM/ZOOM/X=	-0.47669846964044454429,	14.506009999935889354
##$MNOVA/ITEM/ZOOM/Y=	-9.5219447936452610293,	250.03239999719292541
##END=	
##TITLE=	Sk5TiKBJRjGyioYgifNB$A.25.ser
##JCAMP-DX=	6.0	$$ MestReNova 14.3.0-30573
##BLOCK_ID=	3
##DATA TYPE=	nD NMR SPECTRUM
##DATA CLASS=	NTUPLES
##NUMDIM=	2
##ORIGIN=	Bruker BioSpin GmbH
##OWNER=	nmr
##.OBSERVE FREQUENCY=	400.32280223999998725
##.OBSERVE NUCLEUS=	^1H
##.SOLVENT NAME=	MeOD
##.PULSE SEQUENCE=	hmbcgplpndqf
##LONGDATE=	2021/12/04 17:25:51.000
##.ACQUISITIONMODE=	SIMULTANEOUS (DQD)
##$ORIGINAL FORMAT=	Bruker XWIN-NMR
##$MNOVA/SCALES_VERSION=	9
##$PARAMETER FILE=	(acqu2s, ASCII, /private/var/folders/f6/rjf_tdyn2v98c5c0wvkgn4s80000gn/T/Sk5TiKBJRjGyioYgifNB$A/25/acqu2s, 0)
$$ ##TITLE= Parameter file, TOPSPIN		Version 3.2
$$ ##JCAMPDX= 5.0
$$ ##DATATYPE= Parameter Values
$$ ##NPOINTS= 129	$$ modification sequence number
$$ ##ORIGIN= Bruker BioSpin GmbH
$$ ##OWNER= nmr
$$ $$ 2021-12-04 17:45:27.564 +0000  nmr@CZC2524DW0
$$ $$ /opt/topspin/data/agmb/nmr/Dec04-2021/25/acqu2s
$$ $$ process /opt/topspin3.2/prog/mod/go
$$ ##$ACQT0= 0
$$ ##$BF1= 100.660544
$$ ##$FnMODE= 1
$$ ##$NUC1= <13C>
$$ ##$NusJSP= 0
$$ ##$NusT2= 1
$$ ##$NusTD= 128
$$ ##$O1= 12079.3932956644
$$ ##$SFO1= 100.672623393296
$$ ##$SW= 260.03107487261
$$ ##$SW_h= 26178.0104712042
$$ ##$TD= 128
$$ ##END=
$$ 
##$PARAMETER FILE=	(acqus, ASCII, /private/var/folders/f6/rjf_tdyn2v98c5c0wvkgn4s80000gn/T/Sk5TiKBJRjGyioYgifNB$A/25/acqus, 0)
$$ ##TITLE= Parameter file, TOPSPIN		Version 3.2
$$ ##JCAMPDX= 5.0
$$ ##DATATYPE= Parameter Values
$$ ##NPOINTS= 12	$$ modification sequence number
$$ ##ORIGIN= Bruker BioSpin GmbH
$$ ##OWNER= nmr
$$ $$ 2021-12-04 17:45:31.020 +0000  nmr@CZC2524DW0
$$ $$ /opt/topspin/data/agmb/nmr/Dec04-2021/25/acqus
$$ $$ process /opt/topspin3.2/prog/mod/shimcntl
$$ ##$ACQT0= 1000000
$$ ##$AMP= (0..31)
$$ 100 100 100 100 100 100 100 100 100 100 100 100 100 100 100 100 100 100
$$ 100 100 100 100 100 100 100 100 100 100 100 100 100 100
$$ ##$AMPCOIL= (0..19)
$$ 0 0 0 0 0 0 0 0 0 0 0 0 0 0 0 0 0 0 0 0
$$ ##$ANAVPT= -1
$$ ##$AQSEQ= 0
$$ ##$AQ_mod= 3
$$ ##$AUNM= <au_zgonly>
$$ ##$AUTOPOS= <26 >
$$ ##$BF1= 400.32
$$ ##$BF2= 100.660544
$$ ##$BF3= 400.32
$$ ##$BF4= 400.32
$$ ##$BF5= 400.32
$$ ##$BF6= 400.32
$$ ##$BF7= 400.32
$$ ##$BF8= 400.32
$$ ##$BYTORDA= 0
$$ ##$CAGPARS= (0..11)
$$ 0 0 0 0 0 0 0 0 0 0 0 0
$$ ##$CFDGTYP= 0
$$ ##$CFRGTYP= 9
$$ ##$CHEMSTR= <none>
$$ [...]
$$ 0 0 0 0
$$ ##$ShimPowMaxUC= (0..63)
$$ 130000 130000 130000 130000 130000 130000 130000 130000 130000 130000 130000
$$ 130000 130000 130000 130000 130000 130000 130000 130000 130000 0 0 0 0
$$ 0 0 0 0 0 0 0 0 0 0 0 0 0 0 0 0 0 0 0 0 0 0 0 0 0 0 0 0 0 0 0 0 0 0 0 0
$$ 0 0 0 0
$$ ##$ShimPowMaxUG= (0..63)
$$ 524287 524287 524287 524287 524287 524287 524287 524287 524287 524287 524287
$$ 524287 524287 524287 524287 524287 524287 524287 524287 524287 0 0 0 0
$$ 0 0 0 0 0 0 0 0 0 0 0 0 0 0 0 0 0 0 0 0 0 0 0 0 0 0 0 0 0 0 0 0 0 0 0 0
$$ 0 0 0 0
$$ ##$ShimPowRcbType= 3
$$ ##$ShimPowRes= (0..63)
$$ 1e-20 1e-20 1e-20 1e-20 1e-20 1e-20 1e-20 1e-20 1e-20 1e-20 1e-20 1e-20
$$ 1e-20 1e-20 1e-20 1e-20 1e-20 1e-20 1e-20 1e-20 0 0 0 0 0 0 0 0 0 0 0 0
$$ 0 0 0 0 0 0 0 0 0 0 0 0 0 0 0 0 0 0 0 0 0 0 0 0 0 0 0 0 0 0 0 0
$$ ##$ShimPowRng0= (0..63)
$$ 1 1 1 1 1 1 1 1 1 1 1 1 1 1 1 1 1 1 1 1 0 0 0 0 0 0 0 0 0 0 0 0 0 0 0 0
$$ 0 0 0 0 0 0 0 0 0 0 0 0 0 0 0 0 0 0 0 0 0 0 0 0 0 0 0 0
$$ ##$ShimPowRng1= (0..63)
$$ 1 1 1 1 1 1 1 1 1 1 1 1 1 1 1 1 1 1 1 1 0 0 0 0 0 0 0 0 0 0 0 0 0 0 0 0
$$ 0 0 0 0 0 0 0 0 0 0 0 0 0 0 0 0 0 0 0 0 0 0 0 0 0 0 0 0
$$ ##$ShimPowRng2= (0..63)
$$ 1 1 1 1 1 1 1 1 1 1 1 1 1 1 1 1 1 1 1 1 0 0 0 0 0 0 0 0 0 0 0 0 0 0 0 0
$$ 0 0 0 0 0 0 0 0 0 0 0 0 0 0 0 0 0 0 0 0 0 0 0 0 0 0 0 0
$$ ##$ShimPowRng3= (0..63)
$$ 1 1 1 1 1 1 1 1 1 1 1 1 1 1 1 1 1 1 1 1 0 0 0 0 0 0 0 0 0 0 0 0 0 0 0 0
$$ 0 0 0 0 0 0 0 0 0 0 0 0 0 0 0 0 0 0 0 0 0 0 0 0 0 0 0 0
$$ ##$ShimSysFunc= (0..63)
$$ 1 2 3 4 5 7 9 11 15 16 8 10 12 14 6 17 13 18 19 20 0 0 0 0 0 0 0 0 0 0
$$ 0 0 0 0 0 0 0 0 0 0 0 0 0 0 0 0 0 0 0 0 0 0 0 0 0 0 0 0 0 0 0 0 0 0
$$ ##$ShimSysMatrix= 0
$$ ##$ShimSysType= 1
$$ ##$TFXNUM= 0
$$ ##$TRIPLO2= 0
$$ ##$VTU= 2
$$ ##$VTUETH= <149.236.99.20>
$$ ##$VTUTY= <no>
$$ ##$WBREFAM= (0..15)
$$ 132.2 106.2 100 100 100 100 100 100 100 100 100 100 100 100 100 100
$$ ##$WBREFLM= (0..15)
$$ 0 0 0 0 0 0 0 0 0 0 0 0 0 0 0 0
$$ ##$WBREFPH= (0..15)
$$ 77.55 -65.76 0 0 0 0 0 0 0 0 0 0 0 0 0 0
$$ ##$WBSGU= (0..15)
$$ 0 0 0 0 0 0 0 0 0 0 0 0 0 0 0 0
$$ ##$XFAC= 2
$$ ##END=
$$ 
##$DECIM=	3328
##$DSPFVS=	20
##.ACQUISITIONSCHEME=	NOT PHASESENSITIVE
##NTUPLES=	nD NMR SPECTRUM
##VAR_NAME=	FREQUENCY1,	FREQUENCY2,	SPECTRUM
##SYMBOL=	F1,	F2,	Y
##.NUCLEUS=	13C,	1H
##.OBSERVE FREQUENCY=	100.67262339329600707,	400.32280223999998725
##VAR_TYPE=	INDEPENDENT,	INDEPENDENT,	DEPENDENT
##VAR_FORM=	AFFN,	AFFN,	ASDF
##VAR_DIM=	512,	512,	262144
##UNITS=	HZ,	HZ,	ARBITRARY UNITS
##FIRST=	25168.397401625570637,	5807.04592319999756,	0.92919641733169555664
##LAST=	-958.48414287705929837,	-190.8319313673060833,	0.56153070926666259766
##MIN=	-958.48414287705929837,	-190.8319313673060833,	0.00099871191196143627167
##MAX=	25168.397401625570637,	5807.04592319999756,	17.715181350708007813
##FACTOR=	1,	1,	0.0031958541095928622716
##PAGE=	F1=25168.4
##FIRST=	25168.397401625570637,	5807.04592319999756,	0.92919641733169555664
##DATA TABLE=	(F2++(Y..Y)), PROFILE
$$ [...]
##PAGE=	F1=-11746.7
##FIRST=	25168.397401625570637,	5807.04592319999756,	0
##DATA TABLE=	(F2++(Y..Y)), PROFILE
466D0N4M7QP7Qo7J08L6j11l0J06Pj44ml4Q4j26J46o6N4N0l4p8p5O8M7J6j38PL9K3m3J77p6
67A76j24J7l4J23q5Q6oM6M4k21J15q2J01p3l8K9L2j8k3O4Q5j98
$$ plain form
466 40 94 141 149 226 234 167 275 311 200 170 276 283 139 135 101 185 59 205 139 193 243 209 131 56 124 171 187 49 56 95 118 75 252 176
67 176 52 69 35 158 73 159 153 199 243 22 137 55 156 83 45 74 106 88 65 129 214 16
-191A6
##PAGE=	F1=-11848.9
##FIRST=	25168.397401625570637,	5807.04592319999756,	0
##DATA TABLE=	(F2++(Y..Y)), PROFILE
5807D1J40k7j04M4JJ60n7L5j42K19j38j39J6J15M5k9M5j4p5N2j5L1r8J44j09n1PL8M1J3mj18
5431F7J38l2R6n0q6n0MrL2O5o3R2n4j20Q9R5p2l2j5L5m9J56j27j4N9N3K1j69R9J37L5k28n7
5044D6L2m6R7Qj4J36l3j69J98r1o6M9JJ4r5J16M8j71J6mJ4l3J45r2n3P1rl1Q2p7J12j21M7
4657A27k1k7Q3Oj4p1PK47N8k31p6N6K9%L3o4m2M0n3m4R9P5o9k8k2Q5n9n3qM2Q2j14M8j1m6
4246F4N7J0Q9m2p7l2Q0R1n4m3j13K42Ok41O8kJ72j20j02kJ09o7k7J29J08k05jK0l1J46k03
3882B9Q8p4P2pn6J04M2n8n5N3p7lj0Q2qR7Q5k49M2J62N0l9Rp1j9j49l7J66p2J05J89j10k07
3495G4m4J74j7o1J6pP7Ln4L9P7j55m4O7Q0r2r0O0J03O5j61n2M3Q9j68J02l4J6O5Mq4J03J33
3107C27m6j42j5j7J6JJ11m2j57N5P6O7j22l2Q8K8q9O0l4q4J35p2O6r5j5K25q4r4J27k8j4k
$$ plain form
5807 41 181 154 50 94 95 255 198 233 91 310 172 33 49 164 209 180 225 211 136 188 173 204 106 250 141 90 97 135 176 189 185 67
5431 67 205 173 269 219 133 83 87 78 110 175 112 204 150 30 119 214 142 110 95 130 81 237 110 96 155 208 229 60 159 296 331 103 46
5044 46 78 32 129 137 123 259 226 57 255 164 98 147 148 162 67 183 231 60 76 72 86 53 198 106 53 124 115 84 166 89 201 80 127
4657 127 106 79 162 168 154 83 90 337 395 164 88 144 173 173 206 142 100 140 87 43 142 217 148 120 98 183 124 71 63 105 187 73 121 110 64
4246 64 121 131 220 178 101 69 149 240 186 143 30 272 278 37 105 103 275 155 53 51 160 93 66 195 303 98 97 117 86 232 29
3882 29 117 43 115 108 52 156 198 140 85 138 61 58 48 130 122 219 304 55 97 259 309 270 279 208 189 40 3 169 97 202 391 281 74
3495 74 30 204 187 126 142 135 212 215 161 200 277 122 78 145 225 133 43 103 206 271 110 58 101 190 22 124 90 106 171 175 91 194 327
3107 327 281 139 124 107 123 124 235 193 36 91 167 234 112 80 168 196 107 167 133 49 184 112 178 83 68 293 209 115 242 214 200 198
2732A98J1r0o3L8l8L1K3J32p7J8j38J01l7m2J69k0o6M0l9j06Q7J22j39L0K8j4j32K1J99o9
2380A78q0K0Q2q6O4k6L9J33j2k25M7O8RO2K3l4j25J3k1OR9q3l4j3P3j07K3L0k4r2M0K9J29
1992B05j33P7kQo4J13n1l0k7j5j1K7p8P6N5m7K09k8j64p1N5k3J64k9j23k3J22J66j91L4j54
1628D7R8r4P7q0O4J0M4L3p9l7Lo7P3l0oL6LJ20r5m0Q9K8j44O5l1J9N5p2k5M5o4J21r2l7MM1
1206H2O6mj41L6K04o0n7n7L2J24o7j34J77P8j44q5J20l5r1J81j09M3j8J23r5j19K6P5M5j02
854I4n5J81K0j61P3M%Ml7Lq8L2OJ49J18k60J59j62n0j0J85j9j59R0L4q1Q5Qo0J5R5q2r1N7
455I7O8l2O1L1l2P1j9p5kO5j6j34K5ON2j31J93p8O6K5j1j15n3N3K3jo9Lj4kQK14k5j78o1N1
32F4R9r1O9K6L9J4j82R8q1R4p2kl2N4j4m4P7P4j51
$$ plain form
2732 198 209 119 56 94 56 87 110 242 165 183 45 146 109 67 236 216 150 190 151 45 132 254 115 145 173 159 27 48 247 178
2380 178 98 118 200 114 178 152 191 324 312 87 134 202 211 273 296 262 137 150 129 135 234 151 117 104 177 70 93 123 99 7 47 76 205
1992 205 72 149 147 155 91 204 153 123 96 81 70 97 19 95 150 103 312 284 120 49 104 81 245 216 93 70 192 358 167 201 47
1628 47 145 51 128 48 112 122 166 199 120 83 86 19 92 62 56 92 95 215 120 80 169 197 53 118 87 106 161 89 64 109 45 166 74 37 41 82
1206 82 148 144 3 39 243 183 126 69 101 225 158 24 201 279 135 50 170 135 44 225 116 159 141 264 169 50 76 151 196 94
854 94 39 220 240 79 152 156 156 160 123 126 38 70 76 225 343 83 242 80 30 20 205 186 27 117 151 70 155 163 103 118 213 131 40 97
455 97 165 133 194 225 193 264 245 170 168 233 217 83 108 114 166 35 228 150 216 241 230 115 62 115 138 137 68 71 57 55 63 277 252 74 13 64
32 64 163 72 141 167 206 220 38 136 55 149 77 75 43 97 83 39 116 190 39
-191C9
##PAGE=	F1=-11951.2
##FIRST=	25168.397401625570637,	5807.04592319999756,	0
##DATA TABLE=	(F2++(Y..Y)), PROFILE
5807F0R6j1r3K8J3J66r0M2j25J90j12r8QP8J9mP1o5p6P9k9L7p4J12j37L3K1L1J6J2j8o3J49
5420B66o9J09j19q9L4j7r3R4P9o3O9j01n5O0J50o2j22PJ04n3J00p7j04N6N4M3j63R5J20N7
5068C10k24k4nl7J12Nj6J45n9j18J68j00j03N4J5Kp3Q9O3r9n9LQ2o7J60q3q6K3j9P1K9q3J42
4680B18j37Q5o6q6J35j2L9m9o4K85Oj99r9P0K3k3M4n6k5J0q7P3N6P9r7K4lK3o6n6M4M0O3j48
4281D4J13k8l1j3K3J11q0k6oJ6J21o4n5j05K33K0k45M1P4Q1r6o5J7J13q3k6P2R0j75N0K4m7
3906I8J40k28P3l3L0nj2J01N2j02m2L3K9k0o8J39n8J46J0k56M7J76N4ok1q3j4j00l3J73r6
3542A24Q3J54j49j55KJ46j1l3K1l2N3jn9O0M1q3p6O5J35j74k8K3Q0P8j35n6Q0O3k02J34j7
3178A31nP5Pj25Q3J51j5j24k9j1L6m2O4qj44Q2N3M5p3j44J10P7q2N9o6o4J08j7N4k3p7K24
$$ plain form
5807 60 156 145 52 80 93 259 169 211 86 276 164 66 74 152 171 167 238 173 97 176 147 184 110 222 85 118 139 170 186 198 180 117 266
5420 266 197 306 187 98 132 115 22 116 195 132 201 100 45 105 255 193 71 78 182 129 229 152 48 104 158 201 38 133 253 310
5068 310 86 62 57 20 132 137 121 266 207 89 257 157 54 108 123 125 52 141 204 105 46 49 131 64 224 141 55 78 59 130 159 76 218
4680 218 81 166 100 14 149 137 176 127 63 348 354 155 56 126 149 126 170 114 89 99 12 85 141 220 123 147 144 167 101 45 89 129 192 44
4281 44 157 129 98 85 108 219 139 113 107 123 244 180 125 20 253 273 28 69 143 224 128 63 80 193 110 84 156 246 71 121 145 98
3906 98 238 10 83 50 80 75 63 164 216 114 72 105 134 114 46 185 127 273 283 27 74 250 304 298 277 194 180 80 47 220 124
3542 124 207 361 212 57 59 205 194 161 182 150 203 202 143 203 244 161 85 150 285 111 83 106 186 264 129 73 153 216 14 148 131
3178 131 126 201 208 83 166 317 302 178 149 138 174 132 196 188 44 126 179 224 151 7 117 194 112 171 105 41 149 132 186 163 86 310
2802C10j15j00R4OK0kL2j17k1jp5L3L6J33q5P0j00J7K0q1J49o3p2M8J8j23P9J20j29K8N4j
2427A82j29J5J81m3j13N1N2p5M0n4O5J18Ok02K1O4N6P8j4l2p2k6p1O8R0j43O0n2P5r6MJ7j6
2039A05q8Q2j4K14j64QkJ5o8J13n8pk0k8J5L0q5N4O6j16J92k0p9l0PnP2K5j10m1J56J21k13
1652A27J8n5L0l7K6n4N5l4K9O2n2J6p1l6R4m1mL1j5J13r5qQ8j3j03j1M0j9O5l4l6J6k2P0o8
1241G2j8QM9O2lj23oJ83r0L8p8qJ28j13m4J35O7j65q3J62p4o8K07j18L9m4J28n4j47KJ16%
866A60m9o1J72M2j63P0m7k1J3k0K8j8M0j22K51Q3l08K13j59q7N3J31n5j04O9L9j01L5L3%l
502A14Q1j24j1L0R2p8M2N9MK2n8l7J3L6k4q9%N3J4j14K12o8M1Njj24k7P0Mm4Nj0n3RJ9K26
79B89L7k18k0L1L5p3N3M6K0j7j46R6l8L9n9J0K6Lk5p0Q0N4r5
$$ plain form
2802 310 195 95 189 195 215 213 245 128 107 106 31 64 100 233 148 218 118 135 155 74 223 160 88 136 154 31 110 230 101 129 183 182
2427 182 53 68 249 206 93 144 196 121 161 107 172 290 296 94 115 179 235 313 299 267 195 169 98 166 256 113 173 121 196 100 104 121 105
2039 105 17 99 85 299 135 143 141 156 88 201 143 136 116 88 103 133 48 102 168 52 244 224 145 115 122 117 189 214 104 63 219 340 127
1652 127 145 90 120 83 109 55 110 76 105 167 115 131 60 24 118 77 73 104 89 202 107 99 187 174 71 60 100 81 146 112 76 92 70 140 72
1241 72 54 62 111 173 170 47 41 224 134 172 94 86 214 101 57 192 259 94 11 173 99 31 238 120 159 115 243 189 42 44 160 160
866 160 111 50 222 264 101 171 124 103 116 96 124 106 146 24 275 358 50 263 104 17 70 201 146 42 111 150 49 84 117 117 114
502 114 195 71 60 90 182 104 146 205 209 231 173 136 149 185 161 72 72 125 139 25 237 169 210 215 214 90 63 133 137 93 98 88 35 44 63 289
79 289 326 108 88 119 154 81 134 180 200 183 37 133 95 134 75 85 111 114 89 19 99 153 58
-191E8
##PAGE=	F1=-12053.5
##FIRST=	25168.397401625570637,	5807.04592319999756,	0
##DATA TABLE=	(F2++(Y..Y)), PROFILE
5807F7O1nn9lK1J73j10L5j00J57o8m7J3Pj2JR7r1n7P4l4L8p3Q1j43J26K6J3Nmm5J7J60j11
5408B10J07j84n0O9j5j12J05Q4o8N0j40M4nJ89m1k06K2J78n1K7l1j43J2M5O8j41Q4R0Q0j97
5056H0Om3K5O2ooJ23p0o4J41j09j03L0L4k2m3M6P4lj21J4J33r9J79p7o3q9MJ27jj09J63j30
4669H3J15p2o6R1l6J01n8r5K75m4j68j00O9J5m4P1l4j8lj7L5M2O9j19P5J4m8o0k5O1L6N7j42
4281F0J32k2m2p2PJ27j05M2J8l9J38p0o8q3J90K8k24K2J40M7j06m8K8J09r6M0k2L8j20J07
3929A56Op4J35j93K1Rj9OJ2J18M7j44j4J5J13j3r0J37j16K09n8j86j0J50L8L7l9q9km7j5J56
3553B56j22P1Q5j53p2L7J05j8mK8n7K8j5n6R2%jj01N3J77k15L6l0L7Q0p3n7Q9M6j95J05K1
3178A77k0M5J5j55P0J41Oq2j6oM8j19Q1qj11R4OK7Lj23k0J38r9P3q6m5N2N5M9M7j09J94j38
$$ plain form
5807 67 128 123 64 61 82 255 145 180 80 237 169 122 135 142 130 131 228 137 80 154 120 158 85 166 23 149 175 188 193 189 144 161 321 210
5408 210 317 133 83 152 137 25 130 214 146 196 56 100 95 284 243 37 59 237 186 213 182 39 51 96 164 23 107 197 277 80
5056 80 86 43 68 130 124 118 241 171 107 248 139 36 66 100 78 35 81 155 152 31 45 178 79 258 181 118 29 33 160 159 50 213 83
4669 83 198 126 60 151 115 216 158 63 338 294 126 26 95 110 66 137 103 85 82 65 100 142 211 92 167 181 133 73 48 109 145 202 60
4281 60 192 170 128 56 63 190 85 127 145 106 244 174 106 23 213 241 17 39 179 226 120 72 100 209 113 153 131 169 49 156
3929 156 162 88 223 30 51 60 41 47 59 177 224 80 66 81 194 181 91 228 112 321 263 77 67 217 255 292 253 164 162 115 100 256
3553 256 134 205 290 137 65 102 207 189 185 213 156 184 169 113 205 205 204 103 156 333 118 154 124 161 241 168 111 200 246 51 156 177
3178 177 157 202 217 62 132 273 279 197 181 175 223 104 185 177 66 160 166 193 196 73 53 191 92 165 79 34 86 141 190 237 128 322 184
2791A84j23Q6L8K3kN1j46O3k9j43O0K9J24q3J14p4j0M5j33J22r8p2N7P3j34P3Q9j06L3P8K
2427A91j21K4J58j3j39O0J4n4J5o9O4R3J5j79L9N0J14O7m0l0j2m6j43J22Q0j92J60q4P6q8
2075A32mJ1k9n9J11q5K80j70n4k4L2m6R4o4J8J0p3N8J9n0k7Q7j40J38k3ML7m8K6j5O7q5o7
1687F1J69N9k08OM9j3l0k3J9K6q1J8R7m3O9j34QP2j9j3L8o8J05p0J7O7k8n5p5J00p1O9K5m8
1288I5j2RJ7n0K4jM5M7K4j05m4J52j13J11p5j9J03j62M0P9O4j75k2J39j17M6J40j07J7q7J32
924A95np3o0Q7l1On7J60L7j42N6q9j0n%O7K0N3j74K72M3k68J91j62o9P8O1p7j4PL8o5m5M7
525G2L3j0P1j39O9j9J07j18L9P5K6l2p5PNL8j7j5p3Q1lm5J52m9kKj2j12RJ17j5j03O0j9o3
114D2N6j1J94R9k34jL6n0m9O0M5nl8j18J05J5l0l8lR9l9l3o4L9L2m4
$$ plain form
2791 184 61 147 185 208 206 257 111 174 145 2 62 91 215 132 246 172 162 207 74 196 98 26 83 156 22 95 184 78 111 189 191
2427 191 70 94 252 239 100 160 174 120 135 66 130 223 238 59 98 148 262 329 289 259 247 201 58 180 260 68 228 144 220 132
2075 132 128 139 110 51 162 77 357 187 133 109 141 95 189 125 143 153 80 138 157 107 80 167 27 165 142 146 183 135 161 146 213 128 61
1687 61 230 289 81 87 136 123 93 70 89 115 34 52 149 106 175 41 49 121 102 89 127 59 164 94 111 178 150 95 20 120 49 118 143 95
1288 95 83 92 109 59 83 82 127 174 198 93 49 201 88 199 124 105 208 46 86 165 229 54 32 171 54 100 240 133 150 63 195
924 195 190 117 57 144 113 119 62 222 259 117 173 84 74 69 69 136 156 209 35 307 350 82 273 111 42 120 181 104 90 97 135 70 25 72
525 72 105 95 166 27 96 77 184 66 105 180 206 174 99 106 111 149 132 117 44 125 122 77 229 180 178 180 168 56 65 182 167 64 124 105 42
114 42 98 87 281 380 146 145 181 131 82 142 187 182 144 26 131 146 116 78 75 174 135 102 38 77 109 65
-191F5
##PAGE=	F1=-12155.7
##FIRST=	25168.397401625570637,	5807.04592319999756,	0
##DATA TABLE=	(F2++(Y..Y)), PROFILE
5807E8M5jj9l1J3J72j09J4p0J29k4nK8o7m0j1J19q6k7M6l0L1r0N3n1J38K5k6J6l5p1Q8J76
5420C58j46Q4k11LN4J2r1P8Q4p6M6j70J00k8K02k4k60K6K37m7l3nj30k4QP5j08P5N2R5j54
5056H2J8n9O2J0k0J8P5o6qJ15j17o2j2O9o4j0j6J05P1j59J9J67j17J80o9m0j37PJ30nj39J66
4680A94j04J27o2m5N7m4J32q4q7K25p7j46m7K4Ll7R7j4l1J4ljM6N2j32J21K2j08m4K5N3K4
4305A50N7j16J26Oq0n7p9J30j05R8N2n8J13p1p3n5J24K8j72J2J81N9j13o2QJ01j02R7p6l6
3953H7m5J40j5j08J28j24JJ1n3MK2J33M4j82M1pJ50kj08J33j65K68r5j34l4P8KQ1l6q0LNP
3565A50J19j49P2kp8j6O2N2n5L3M1o9J0m1n5J38l3O5j23L5J99k16N7n3qO9Mp2R6L9j91O6O4
3178B10k1j9K9j53N3R9J3k2K6k3N7j95J48m2p7J10n2J9Q1q9j07J41j35J05n9o8j7J34N0R1
$$ plain form
5807 58 103 102 83 52 65 237 128 142 72 201 177 172 200 133 93 82 201 115 88 134 104 135 45 98 47 185 210 184 200 165 94 182 358
5420 358 212 296 85 88 142 154 63 141 225 149 195 25 125 97 299 275 15 41 278 231 198 193 63 39 47 122 14 89 141 236 82
5056 82 100 41 103 113 93 111 186 120 112 227 110 48 36 105 41 31 15 120 191 32 51 218 101 281 212 172 35 42 172 167 28 194
4680 194 90 217 155 110 167 123 255 171 84 309 232 86 39 63 66 29 126 112 81 95 92 91 137 189 57 178 200 92 48 73 126 150
4305 150 207 91 217 223 143 86 7 137 32 130 182 124 237 166 93 38 162 190 18 30 211 270 157 95 103 204 102 199 123 87
3953 87 42 182 167 59 187 63 64 75 22 26 48 181 225 43 84 77 227 225 117 250 85 353 258 124 90 168 170 251 215 135 138 143 150
3565 150 269 120 192 190 112 96 158 210 155 188 229 160 170 129 74 212 179 244 121 156 355 139 196 143 135 204 208 136 232 271 80 146 210
3178 210 189 170 199 46 99 198 211 189 215 192 249 54 202 160 83 193 141 160 241 152 45 186 51 156 97 29 12 146 196 287
2826B87j19J56j48j42R2O1kj2O6j69J60m2j65P3j8J14p5J29m6kN1j72P1r7k9K3J08j29Q1L8
2474A43r8N1R5rj10L0J47K6j57M0l1j3qp2L5O4J5j12N8K4J68L6m9l4L8m9k09J52P6k23K43
2110B67r3O4p3j1Nn3j8J29j71L20j43j11n4N6j2O9p2M2L9j14J05qj6j14J23j29O5k2O0J11
1758B41j01N5o7Q2n0r7J52Lj17l8J05k1o8o1J15K4r4m2J22n0J22j50OL1J8k1N3j48J06j9J5
1394A06L4j2jm4N8j20P5P8n5k3J6l5j5N0rK5K7N3p1r8J40j28J44n6K8N6k23J08J7P4j87K4
1018C6J37j07R5O8q0j6j20J25L5K9q3j7m5N2n1J64jj07M2j07M4o5L0J01J3O6j67K36Nj71J27
654B68j74j7P4lm9L8o3K8J5n5jJ0nN2l9O3q1J05j38O1O8K3q4o7O1k8O8%K2j14P1K0OP2l0m1
232A36J6m8q4N1J69l8j48Q7j9n7Q7l2J32J46k22NO3j36l6Q7K8l0l7p1P9N5p9j9l3J61p5k2
$$ plain form
2826 287 168 324 176 34 126 187 185 173 239 70 230 188 23 96 78 192 117 246 200 198 249 77 148 51 22 45 153 24 105 143
2474 143 45 96 191 182 72 102 249 275 118 158 127 114 106 34 69 133 148 36 94 118 286 322 273 239 277 228 19 171 247 24 267
2110 267 174 238 165 154 159 106 88 217 46 366 223 112 58 114 102 171 99 141 180 66 171 163 147 33 156 27 92 70 130 241
1758 241 140 195 128 210 160 63 215 218 101 63 168 147 79 18 133 157 63 21 143 93 215 65 71 102 120 99 152 4 110 91 106
1394 106 140 128 127 83 141 21 96 174 119 96 112 77 62 112 103 128 155 208 137 39 179 51 195 139 167 223 0 108 125 199 12 36
1018 36 173 66 161 229 149 133 13 138 173 202 119 102 57 109 58 222 221 114 156 49 93 28 58 159 172 238 71 307 312 141 268
654 268 94 77 151 148 99 137 74 102 117 62 61 71 66 118 79 142 61 166 28 89 157 180 96 29 90 62 130 130 152 38 109 129 135 207 177 136
232 136 152 104 20 71 240 202 54 141 122 65 152 120 252 398 176 181 244 108 72 159 187 157 120 49 128 183 104 85 52 213 138 116
-144A16o1nK3m
$$ plain form
-144 116 55 50 73 69
-191F9
##PAGE=	F1=-12258
##FIRST=	25168.397401625570637,	5807.04592319999756,	0
##DATA TABLE=	(F2++(Y..Y)), PROFILE
5807C8M8J8Km3nJ48r0j8m2J19%L2M8j28o3j5J15n5j6L4k8J9o9PL7J28K3q3M0o6n3R0J99j65
5408B06M2j48nJ9N1o8M9P6q7O1j80J02pJ92k3k60PK63l7o5mj00kk4K4n1N5QR6j05J0m3O5l8
5009G9l1P3ln2M4Q3j21j1k1R7r5MmQ5R2j71RJ89j15J46n4j5j31l4J23J7j60J47o7J11m8k5
4633A41M4l4J24j09n7J56p8j23Rj2kJ9N5on4M6l2qM4L2j34J57K1j38j6N8M5mN5q3J07M8j37
4246A34K2q5Jl2Q1R7m8N9p5o6k8N4K0j10K3J93O9r1q3m7R4r8J30q6o8k2J52k5j38J09n0Qj
3859I3n7k7L2J29N6j89Q9l3J34Rj18J26j87L03r3j13k5%n2J10j4m1k0N2K9O6j76P9q4P1j0
3495A39P9nj20P9O0o3qo3o5J93m1Q6j35J2J89j85O1n5m6M5P9r6J04L5j87L0J04j6r8M9j15
3131D6K2L5J0M3Q7o1O0j69J45p9n5J33r2K7J24o1r7N8j60J42j8j16L9R6M7R6j08J16j36j31
$$ plain form
5807 38 86 104 106 63 58 206 116 98 56 175 175 207 255 127 64 49 164 109 93 127 99 118 49 56 93 221 244 161 201 135 82 172 371 206
5408 206 248 100 95 114 165 97 146 222 135 196 16 118 111 303 280 20 27 290 253 188 184 84 82 58 82 31 86 94 190 85 95 52 117 79
5009 79 48 121 118 66 110 193 72 61 40 137 42 46 42 127 219 48 57 246 131 277 223 208 77 43 166 183 23 170 103 214 166 141
4633 141 185 151 275 166 109 265 187 64 73 61 59 78 133 127 73 119 87 79 123 155 21 178 199 61 45 103 148 144 199 116 223 271 134
4246 134 156 71 72 40 121 218 170 229 154 88 60 114 134 24 47 240 309 218 135 88 182 84 214 128 60 38 190 165 27 136 86 94 93
3859 93 36 9 41 170 226 37 126 93 227 236 118 244 57 360 267 154 129 129 77 187 173 132 112 164 193 259 83 162 78 149 139
3495 139 218 213 93 172 232 169 161 98 33 226 185 271 136 148 337 152 213 158 112 157 236 140 244 279 92 122 226 210 112 161 46
3131 46 68 103 113 156 243 182 242 73 218 139 84 217 125 152 276 215 118 176 16 158 140 24 63 159 206 302 194 310 174 43
2779D3Q4P3l9m0P2j63K34n4j67Q9p3J10o8J09pJ3N4j81qpk8RQ7j06J00Mj35Q3J00l6r2K7J49
2391B36O9j71Lp9N6k7n6j9K9MP5oj7K07nm3n1P4l6k29J27Q2j66K34q4L8m3l1Jp5K2J36k42
2004A3L16q7j55p0O5J8M8q3N8O3j08J18m9J4j18J05j27L5L0K9J60j36O9r2P8mj20J06k5J1
1652A62p4R2oj18j5J33N1j11q5J02n3J73j41k5j3N8k8O9j01j5M6k1NK5N2l2K6j08P0P7n6k2
1276A17Rp5L8M8j0j1OP4j5j45J21j27J29k6J06J2k16Q5l2Q5j44qJ67o5Q2Jm6n1m1M0L8J26
901B72q4j50LL7l4J74n6p1L4r7R0j11O2J18l6P3j28J74k6n4N9j91N0N1m3K1L3j26K3R3n7k7
525G6m7OK0Q2N3j36P4j05O1N4kj15N4K2p1Q5K2K3j19M6O4L6oj5l7J4j04k4O9K08o0j75R4j3
126A34l9R9n1O5J64j85RJ06j87m1J04%n0qk3J5Q0q7kp8K02j11Po7m0N4K0
$$ plain form
2779 43 127 200 161 121 193 30 264 210 43 132 59 169 101 210 203 216 270 89 81 74 46 55 142 36 136 140 5 88 188 152 60 87 236
2391 236 305 134 137 58 114 87 31 12 41 45 120 114 97 304 299 256 205 279 243 14 141 223 57 291 207 245 202 171 172 97 119 255 13
2004 13 329 242 87 17 82 100 148 65 123 186 78 196 147 161 43 148 21 56 86 115 275 139 208 116 194 190 70 176 151 162
1652 162 88 180 174 56 41 174 225 114 29 131 78 251 110 85 72 130 102 171 70 55 101 80 85 110 162 130 156 48 118 195 139 117
1276 117 126 51 89 137 127 116 122 196 181 36 157 30 159 133 239 251 35 120 88 173 29 21 188 123 205 206 160 109 68 108 146 272
901 272 188 38 41 78 44 218 162 91 125 28 118 7 69 187 151 224 96 270 244 190 249 58 108 159 116 137 170 44 67 160 103 76
525 76 29 35 55 137 190 54 128 23 84 138 136 21 75 97 26 111 133 156 37 83 147 183 177 162 125 139 35 11 80 288 228 53 147 134
126 134 95 194 143 208 372 187 196 302 115 74 178 178 128 120 97 112 192 105 103 25 227 116 123 56 16 70 90
-191I0
##PAGE=	F1=-12360.2
##FIRST=	25168.397401625570637,	5807.04592319999756,	0
##DATA TABLE=	(F2++(Y..Y)), PROFILE
5807B1N8N2lm6j1R1n8n1j8J20KO5O7j64p7L0N6k4k8M6l4J1lrK5J26K5j43O4p9K0NK26j65k
5396A95m1o6JP7l9K1N2r6Q4j49M8M1J69l7k26j6K50k3o7j8o3K8l8m2K9J9k8Q3o7j1KL9p4J1
4997D8J11r8k3O8M6j17L4nJ11j17MK1P2Q3j63j0J92q6P0l2J9j22p9J14O2j61J05k0O4m0NM6
4622B02k6R2j22j3Q2m5q1J2j6K6QJ8Jp4Q0o6NJ5J9j05J61Mj09kO8M3n1M4m2P8R1j99J32r6
4222A34j17M9M7J40l1Lq8m3qMLo8O8J67N4l9r1j17Q3p8J30o0j5j05J57j2j16L0J1J5Jo4qJ
3823C7J08Q9j60J02o0Q2J6j16J15j57K82o1j14Nl9m6L5K2J5p1R4M5Nj96Q5q7J49NQ5n4j82
3460C3J17P2m5k9o1q1K38k9O6j35j8J51j37P6n3o4OJ35j16J07K6j74PJ32j1j68O8o6pj1M4
3096G3M3J44j13O0o1P1j00n1J52r3M9J20l9o6k6r3J05mj52R9P0L1O3q4P9r7j30J10N7o4q2
$$ plain form
5807 21 79 131 128 82 71 162 104 53 35 155 157 222 289 125 48 78 134 110 82 128 94 105 102 93 118 244 269 126 190 111 131 136 362 197 195
5396 195 154 88 89 166 127 148 200 104 188 39 87 128 297 260 34 18 268 245 178 160 97 125 87 45 74 93 65 148 81 70 72 111 37 48
4997 48 159 61 38 106 152 35 69 64 175 58 62 83 155 238 75 65 257 171 241 209 228 106 27 141 203 42 147 127 191 151 156 202
4622 202 176 268 146 133 215 170 89 101 85 111 119 137 138 64 144 78 83 98 117 12 173 177 68 66 134 177 126 170 128 206 297 98 230 134
4222 134 17 66 113 253 222 225 137 94 86 90 93 25 93 260 314 275 184 67 150 72 202 142 127 22 179 167 51 81 92 107 108 44 36 37
3823 37 145 234 74 176 116 198 214 98 213 56 338 277 163 168 129 83 118 140 155 84 178 223 228 32 117 30 179 184 269 215 33
3460 33 150 222 177 148 87 6 244 215 281 146 128 279 142 218 165 101 107 242 126 233 259 85 92 224 213 45 113 47 40 29 73
3096 73 116 260 147 207 146 217 117 66 218 125 174 294 255 189 163 70 175 171 19 118 188 219 282 198 277 180 50 160 217 153 71
2732G1N9o1K04p2j39R2j15J16p2O1M2K1N9j61r0J17q8L4M7p5J19jj18N5P1o8o8J4J70J00j83
2368A41l4o7R2n2k6K0j5rJ62n6o3K19m7l3p1R4j4k12P8R3q9J97o8kko4Np8L8J33k01J95j5
1981B49j67j5oK4L7r3O0P7m4Q3r2L6m7M7j16L5O9k0J63j49P1j08O1M8j25M3JQ8r9O3J3j34
1605E3M3J10Q4j41q9M1l3K10j26o3m5R0l7Q3l1j03P0p0J5N0Q6n5J9o9Q1K2m5k0lq4P7L3%n9
1206I4qQ4N0j42N9j06P2K0J77k5k11N6m2P1q1l5J76l6N8n4j6p1K6J0LJ83p0k05P9q3jJ72j01
819A03l9K6n6R3r3N4J25j04O0n7Q4m5O9Lk03J09K2m9Q3nj62N4J14o3m3o5kM6J22N0j63Ok3
431E1J1O0l5LO6m0n2ON4Qr4K5R2N6n5j1K5k9j00j1N5K25p0j83Q4Lk0R2p4J6J45j31K5J52j95
20A54m0P8l2o5M0Mo0R3n4J4j16K13j47L5p3k3P5L7
$$ plain form
2732 71 130 69 273 201 62 154 39 155 83 144 186 207 266 105 15 132 44 78 125 50 169 168 50 105 176 108 40 54 224 324 141
2368 141 107 40 132 80 54 74 59 50 212 156 93 312 265 232 161 255 241 29 107 200 111 308 240 238 236 172 177 99 137 270 69 264 249
1981 249 82 67 61 85 122 29 89 166 122 205 113 149 102 149 33 68 137 117 280 131 202 94 155 203 78 121 122 210 111 174 187 53
1605 53 96 206 290 149 60 101 68 278 152 89 44 134 97 180 149 46 116 46 61 111 197 142 161 92 173 195 150 130 127 43 120 153 153 94
1206 94 86 170 220 78 137 31 103 123 300 275 64 120 78 149 68 33 209 173 231 177 161 90 116 126 129 312 242 37 116 33 32 204 103
819 103 64 90 34 127 34 88 213 109 169 112 196 151 220 223 20 129 151 102 185 180 18 72 186 123 80 15 13 59 181 231 68 74 51
431 51 62 122 87 90 156 116 64 70 124 132 38 63 155 211 156 145 170 141 41 30 85 310 240 57 141 144 124 216 142 158 303 172 197 349 154
20 154 114 192 160 95 135 139 79 172 118 132 16 229 82 117 44 21 96 133
-191A33
##PAGE=	F1=-12462.5
##FIRST=	25168.397401625570637,	5807.04592319999756,	0
##DATA TABLE=	(F2++(Y..Y)), PROFILE
5807C9M4P7j4n0qK8k9m4j7J07j4R5Q4j75p7P8Kj9n0O7m4OO8j3k4J26L1j84O9n6P8r1K46j44
5408A92k0L0j29J1O7%lJ6j05J00q9k6R3J44o3j74k5J96nm7l5k2N2o2q4J15k3m0N4n1k7N2o
5021H6n5Q1R0j47K1L0J1j08O3K0J19j50RL9P3P0j47l3J83m2l0j3O5j16j08Q6J23j38M9K8J
4657A60m6M4O1l1M7j22M1J7Mm8j0qO7m4j4K4q4J07o1j2k1J6n5J32k3m6NO2L9j07L2QL9J24
4258B97k57K52j17j38K8O6J54k2l6j08j1Kk4Nn7J35R7J1L4q0j67N1m2J00j8L8j77J37K2p6
3906I9l5K2J2J6p8M1n3R1J39j42J08q5J5J9r3R3q1J98j4j16M2m7Nq2M4O2j26J27N5n2j67M5
3530F2M1O8M9Q1q9j23M6O6k4n3l0o7K25kL2j28n6R3p9J05n9n5m2J64j21R7J2j38qJ40j3j77
3154A7N2l2j8P9N6n4J63j61N2N0oj01o0J54o6P6Q4j7k6r6k0P1k6j49J22P7ONm8M6m0j58J89
$$ plain form
5807 39 83 160 146 96 88 116 87 43 26 133 119 214 298 123 46 124 126 107 57 124 80 86 154 141 117 243 274 90 159 103 181 90 336 192
5408 192 172 202 73 84 151 151 148 164 59 159 70 44 137 281 218 44 19 215 210 163 128 106 158 96 12 127 104 64 118 67 40 92 86
5021 86 31 112 202 55 76 106 117 9 72 92 211 61 70 109 182 252 105 72 255 213 183 170 235 119 11 97 220 82 131 159 160
4657 160 114 158 219 188 235 113 154 171 175 127 117 109 176 132 118 142 58 165 104 92 71 87 32 164 141 95 100 162 201 94 126 134 173 297
4258 297 40 292 175 37 65 131 285 263 227 119 108 110 86 91 34 169 266 277 311 231 64 115 73 173 155 193 16 153 175 99
3906 99 64 86 98 114 36 77 24 115 254 112 220 135 150 169 76 169 88 286 272 156 198 151 156 74 118 180 54 181 236 184 17 62
3530 62 103 171 220 301 212 89 135 201 177 124 94 27 252 250 282 154 98 191 112 217 158 103 61 225 104 201 213 75 67 207 194 17
3154 17 69 37 19 98 154 100 263 102 154 204 198 97 37 191 125 201 285 268 242 146 126 197 171 22 144 221 227 232 184 230 190 32 221
2767B21J1o8r3pN7J40r9o9P1j19J11r5NR1K4N5j15m4J14j69O6K2m8J27Kq8M3Pq5m5MK03R7
2380C27j92l5K5L7q7PM4j1LJ64p2r6J96q7l1p9J00Oj83O7Q6l8J75o1m2L6j08L2p0K5J20j33
2004A25P0M9j35J0m6j7L9q8L6Q0M5K6j23M2L0J1q1JR4l7J24j38P1j09J9R2j05k3Q6Q3j18L7
1628A50K7j10O8Q6J12j79n1m8K2K12j08r4n6J04m7Q4M1j34M5o8M8K6Q9j08M5k0R2n4k2j9j7
1265A16o1Q1K3J5j07j2Q7J05j22kq1J0R0J95n2j96K0j9L2k4l2J55k0M0q0j1n4M1K0k4J89n1
889B71j62Q8j45k7J53j03rpJN9o5N5J25j42jK7k4m5J84l6j66J04Nk7J11n5j34P7P7o5n8l6
513C0j5J21P0N5j65q3O7n7Q4m1R7O0r2k0j08R7J1m7LP7P3n9k3R8q1n1o2M7K12n7j72N7K6p
114A45O8j00JR0p1N4J90j81k2L0p0p8R2J4j23Q9J1K7j28J99j54J4o7K9O2O2
$$ plain form
2767 221 232 164 71 64 121 261 162 93 164 45 156 61 66 157 181 236 121 77 191 22 88 110 62 189 191 103 146 153 68 23 27 230 327
2380 327 135 100 125 162 75 82 126 115 118 282 210 114 310 223 192 113 213 219 36 103 189 151 326 265 223 259 151 183 113 138 258 125
2004 125 195 244 109 119 73 56 95 7 43 123 168 194 71 113 143 154 73 74 168 131 255 117 188 79 98 190 85 62 148 231 113 150
1628 150 177 67 135 221 333 154 103 55 77 289 181 87 31 135 88 172 213 79 124 56 104 130 219 111 156 136 228 174 152 133 116
1265 116 55 136 159 174 67 55 142 247 125 123 42 52 142 337 285 89 109 90 122 98 66 221 201 241 161 150 96 137 157 133 322 271
889 271 109 197 52 25 178 75 66 59 60 119 54 109 234 92 91 118 94 49 233 197 31 135 140 113 224 169 35 112 189 124 66 30
513 30 15 136 206 261 96 13 80 23 107 66 163 223 131 111 3 100 111 64 67 144 217 158 135 233 152 101 39 86 298 241 69 126 152 145
114 145 213 113 114 204 133 187 377 196 174 204 134 56 148 162 39 128 139 166 38 237 83 97 30 59 121 183
-191A83
##PAGE=	F1=-12564.8
##FIRST=	25168.397401625570637,	5807.04592319999756,	0
##DATA TABLE=	(F2++(Y..Y)), PROFILE
5807F4L2Q1j9n5qj5j8K1m0O4m1J22R3j64o5J06k0l9n8O7n4PJ34k4p1J13M0j88M6qJ06j41K33
5420C01j01qM5j53OL2M1j9k4j00Q7ro5J00J25r9j02k8J18J1k2m4J9O7r4o3J59o3l3J9n6LN5
5032A05m7PJ05N9j45L7qoj05O5M7J30j81ON7P8N9j32n6J68Rj24pJ07j13o2j3J91r6j2P0m6
4657A47q2Q9Q4n4Oj14Q5j0L2l1l1OJ07j22m2P1q6J24l0o3l0J0k3J08n1J7K0M1K6j56M3N0q
4269A33J39k40K98j46j39JJ30J30j8n3j29J6Om8L7m8J90lm8J13n3j74j8kO1K1P7j83O9O3m1
3906A41k8k5j7M3r1R3j02P3J96j41J02j02m5J5l8O1mP8M0j08P1n5M5j21K2Q5j61J45N6r4q0
3542E4k6J11j2J11P0j02m8k8M4j2o8J9p2J97L5J2j23j01K7k3J43p5j9p3J45r3O2Lo1k7J05
3178A75j7j05j4k0MJ39N9r9J28j79K7J31o0q6m6J03l0R8M1NJ4j41L9M0o8r9R9J06k5n5nK8
$$ plain form
5807 64 96 177 158 103 95 80 62 83 43 107 66 188 281 117 52 158 138 99 41 108 54 61 195 171 100 213 253 65 111 103 209 68 301
5420 301 200 192 237 84 90 122 163 144 120 20 107 98 33 133 258 159 57 29 147 158 136 92 111 178 84 21 180 117 84 103 47 50 105
5032 105 58 65 170 229 84 121 113 107 2 67 114 244 63 69 126 204 263 131 75 243 252 128 121 228 115 53 40 231 135 123 193 147
4657 147 65 154 238 184 190 76 161 151 183 152 121 127 234 112 70 141 55 179 149 86 56 66 43 151 100 117 137 178 204 48 91 141 133
4269 133 272 32 330 184 45 46 176 306 288 235 106 122 128 80 117 69 259 256 208 321 268 94 76 74 135 156 233 50 119 182 141
3906 141 113 88 71 114 23 116 14 87 283 142 244 142 97 112 74 135 131 209 249 141 212 157 202 81 103 188 27 172 228 134 54
3542 54 28 139 127 238 308 206 158 130 174 162 94 113 41 238 273 285 162 61 88 65 208 133 114 41 186 93 155 158 97 70 175
3178 175 158 53 39 19 23 162 221 122 250 71 98 229 169 83 37 140 110 208 249 254 268 127 166 206 138 39 138 244 219 164 159 187
2802A87J2j86K75n1n7p1r9J44P9j29L4L3r6R6j31j2R7L3K3m6MJ01k27P1K5m0J23jm1M4p8m8
2427F8n1K5K15N5j91PP2qj26M3M1j5J4J69n6j07J43j21m3n3Q0J3j30R0N7k0J69o3p3N8j53
2063A09R0p2lR8n5j7P8q4J3m3q5M7m3lM7J22k9j21J7Q7Rl8o9J21l4O5j09Q3r0m1R7n2q0J76
1664A91L7j31J3L1o5P3O9J25k16K0j05O1J74q5j07m5R7n6O3J02j48K2j6M3%P1j70J04K5Q8
1312B65j24J2j9l6k9O4J6L4j43mR2J27j00l2p5NJ33J60p1j64j3jpK7l0J24kK8n9m9oJ0M7l4
912A46J60l3j08R6j45j01J26n4Pm4N1Nl7O0J16j15o0N0r2M8J58o1j19P1J9j1J18j08q3Q8K0
549A68n5n3k3rJ69J1O9j53q0O7o7M9nJ25N1j30J2o1mM9k2j9K3Q8k1m7J51j10k0j13M1J69j1
161B39j49J5N5pL4j19K3Rj6Q3K12j58Rj0j22q0J32Qj03J8R4L1j33J90j22o9k4N4L7R2
$$ plain form
2802 187 199 13 288 237 180 109 10 154 233 104 138 171 75 171 40 28 125 158 181 135 139 240 13 84 109 69 192 191 150 194 116 68
2427 68 17 42 257 312 121 128 200 192 66 109 150 135 149 318 262 155 298 177 134 81 161 174 44 134 191 171 340 277 204 262 109
2063 109 199 127 124 222 167 150 228 144 157 114 29 76 33 30 77 199 170 49 66 153 162 124 55 176 142 207 98 181 91 50 147 95 15 191
1664 191 228 97 110 141 76 149 218 343 127 147 42 103 277 192 85 40 137 81 144 246 98 120 104 147 147 218 48 152 177 265
1312 265 141 153 134 98 69 133 149 183 40 36 128 255 155 123 48 53 186 346 275 111 98 97 90 117 87 211 209 237 178 129 123 133 180 146
912 146 306 273 165 261 116 15 141 87 94 50 101 106 69 129 245 130 70 120 28 76 234 173 54 125 144 133 251 143 60 148 168
549 168 113 60 37 28 197 208 277 124 44 111 44 93 88 213 264 134 146 85 81 130 108 89 112 200 179 132 283 173 153 40 81 250 239
161 239 90 105 160 153 187 68 91 100 84 167 379 221 230 220 98 18 150 158 55 73 167 198 65 255 133 64 40 94 131 223
-191B23
##PAGE=	F1=-12667
##FIRST=	25168.397401625570637,	5807.04592319999756,	0
##DATA TABLE=	(F2++(Y..Y)), PROFILE
5807H4K8O2j3n3k0j6l6Q9o4J5n2J31Q3j38m2J17j9o3l4L0o6J8J82m5r0P3N2j53nM4J11j19
5431I1J77m9MM3j33m5MP0l0n0l9mQ2n7N2J10j33j0m3N9LJm8N8P0j22qJ71q6k4k1m6M4J2m7
5021E6L3J15K7j22M8l2jj06M3N9J51j82k1P6Q0M6j23p3J52N1j73j4J20j14Lo0J92m5o4R5n6
4657A61j38J29J05q3j8r4Q5J6K1k9l6K4J32k12k8R8q0J29Mj25lj2RP6n4M8M6KKj59R2M5n0
4269A03J30j32K40j81j41O4J43Q2rn8j40K6Pp0P5k0K22j08j00J74k1j53j03L2L9L8J00j56
3941H3MQ9lJo0p6P8p9J04j03L3K38j41P4j06p4lK9M2M8o1R2q1P8p4P7j09j2Q9j42J23M2j11
3553H9j9mO6p4J75N5r0Rq2K0j1o5O6q1J43P9K6j28j41j8jJ70r0L2o5P1l1PJ8J6m3K5j3m6m3
3143B2j8L9J51M8r4P9j52qJ50p2o8rPLJ13KK1M9j55P7J3j18k1M2J45n8r0L6L8L2j43K78j14
$$ plain form
5807 84 112 174 161 108 88 72 36 125 61 76 24 155 238 100 58 175 156 93 59 89 23 41 223 178 88 161 213 60 55 99 210 91
5431 91 268 219 223 266 133 88 92 162 132 82 43 39 121 64 116 226 93 83 40 99 102 103 55 113 183 61 53 224 138 114 93 47 91 103 56
5021 56 89 204 231 109 157 125 124 18 61 120 271 89 68 144 224 270 147 74 226 277 104 90 210 96 99 39 231 186 122 217 161
4657 161 23 152 257 174 156 62 147 163 184 155 119 143 275 63 35 133 53 182 186 61 58 46 55 131 77 125 171 173 175 16 108 153 103
4269 103 233 101 341 160 19 83 226 308 299 241 101 127 134 64 139 119 341 233 133 307 286 133 30 62 101 139 239 83
3941 83 87 176 173 174 114 38 116 37 141 38 71 309 168 242 136 62 59 88 130 178 117 209 128 206 132 209 100 88 177 35 158 200 89
3553 89 70 66 132 58 233 288 198 207 125 145 134 69 135 54 197 276 302 174 33 15 14 184 94 126 61 132 101 108 126 142 99 124 111 65 22
3143 22 4 43 194 242 148 227 75 67 217 145 77 68 75 78 191 193 214 263 108 185 198 80 59 101 246 188 98 134 172 204 61 339 225
2755B25m0m7j13J37L3j52J44op4Q5j60L9K9N2m8M7K6R0k32N3L9n6J08pPN2j58K5o9L3K25n
2380B82j76N8Q3l8j57P6J2k3K6J74j7j03P8j45o9K5J9Km4J06L2l2J75p1q9N3j71J56r3k8O7
2016A68K2n0O4l8J7j8j05J0j9K4LJ31n7q0k0Q1M3Lj56J45k3Mn5R9q4l9J6K6j01K14j5j27k5
1628E8K4kN5O4J16k40J04p8K9J12n9j00k5Q4n5J2J39j47J4L9K4k1M2j27R3N6O4j51L5j6n9
1265H4j1M0RN7j55J2R6J16r3k7q0K9J49J04q5j15l0j0l2P1m2R4K5J9lj18M9m2Q9m6J22k3n6
877A97J01j25j58Q2NJ3m4Q1m0l1O1J00o7l1k5K4K2O4p7r4M5O1j7J18j53l8R0l7l2jl0pJ62
490B19l0R0j35o0O2n1j1L0J26L0j50M4Po2O2k2l6m2R3L1o6J79j02j4j51L4J02O1j23l0Q4k4
114A45Lq6L0j9k3Q6K15j32M7j7j94k7J09pk1q7J80J9j29J78q8j57L8N7LJ22
$$ plain form
2755 225 185 138 25 162 195 43 187 181 107 192 32 71 100 152 104 151 177 267 35 88 127 71 179 172 179 231 73 98 29 62 287 282
2380 282 106 164 247 209 52 128 140 117 143 317 300 197 275 130 61 86 105 107 63 169 201 169 344 273 184 237 66 222 129 101 168
2016 168 190 140 204 166 183 165 60 70 51 75 78 209 152 72 52 133 176 179 23 168 145 149 94 193 109 70 86 112 11 225 210 83 58
1628 58 82 80 135 199 315 75 179 101 130 242 183 83 58 142 87 99 238 91 105 144 168 147 189 62 155 211 275 124 159 143 84
1265 84 73 113 122 179 24 36 132 248 155 128 48 77 226 330 245 130 100 90 58 129 87 181 206 225 222 104 153 111 200 154 276 253 197
877 197 298 173 15 97 102 115 71 152 112 81 142 242 175 144 119 143 165 229 152 58 103 164 147 265 112 74 164 127 95 94 64 57 219
490 219 189 279 144 84 146 95 84 114 240 270 120 164 171 109 171 149 113 71 164 195 129 308 206 192 41 75 177 238 115 85 169 145
114 145 148 62 92 73 50 136 351 219 266 249 55 28 137 130 109 22 202 221 92 270 182 25 63 120 123 245
-191B45
##PAGE=	F1=-12769.3
##FIRST=	25168.397401625570637,	5807.04592319999756,	0
##DATA TABLE=	(F2++(Y..Y)), PROFILE
5807I4L0K9km0m2J3n2J22q5k6L3O3L8j04qJ14mp8q%p3L5J87p1o3J1O0j02k9M4J05o9J19nK
5396B38N5j06j18K5N9m2m6Ll1J08o1J2R2j41P9q0N7m0J4n1P9O4j24L5J71p4k9p3J2L7m0%R
5009I3J12Nq7N4l9J0r4K2L0J76j47o2R1P3L2j20p3J27Q3j85rR6j22P2l8J16J0j02J01n0j37
4645C8J12J21j01po3J0Q3j5m1k0M2J28k63Q8Po6J16M0j80L0m1O3K2j5L4P4n1k7l6Q0Op7R9
4258A90l5J72k11p5J25R8K3J2n6j43K1Lo3Q0K9K24j87r7J67Oj14j35jM9K2J08j07m4R1M1L2
3894B25p6j24R8n2P4q4RK52j31K6r6m8n1P7M5Q1k00J37l6N5j06J08q2k7P4q1Q2J2r8jM1j5
3518H8p0J90L8n4M5j22Mk1l3Q2p7O0J27O9j41j43M9n6J14r4Q0m2k6N0m7N3N7m6q5J0Lo0J0
3131A2N1J30K3n9M4j13j1R9m3m6Op7J8J22j5J3P5j39Q8Lj38L0k0J71r3n7M5P7J2j04K51j61
$$ plain form
5807 94 124 153 151 111 69 82 30 152 67 41 74 137 175 71 63 177 173 95 87 87 14 49 236 165 102 113 173 71 42 86 191 122 241 236 238
5396 238 293 187 69 94 153 111 65 68 37 145 84 96 188 47 126 46 103 63 77 26 105 169 45 80 251 177 148 75 87 124 84 84 93
5009 93 205 210 123 177 138 148 54 76 106 282 135 73 164 237 269 149 76 203 286 101 92 188 66 138 100 216 226 124 225 175 38
4645 38 150 271 170 163 100 110 193 178 137 117 159 287 24 112 119 53 169 209 29 59 18 81 103 88 122 196 145 118 82 162 168 91 190
4258 190 155 327 116 41 166 264 287 299 243 100 121 124 61 141 170 394 207 110 277 283 169 34 33 82 104 212 105 61 152 193 225
3894 225 149 25 123 71 145 61 70 322 191 217 121 73 22 99 144 225 25 162 126 181 75 183 101 74 148 67 149 161 63 62 103 88
3518 88 18 208 246 192 237 115 119 98 65 147 70 130 257 326 185 42 91 35 149 55 135 93 67 117 70 123 180 134 49 59 62 2 12
3131 12 63 193 216 157 201 88 77 176 133 87 93 16 34 156 141 154 229 90 178 181 43 73 53 224 131 74 119 196 208 104 355 194
2755A94k1k5j08J07Nj30K05l2o3P9j64N6pN7j26J48J1Q0k24Q6K8q8Q7j1M0O3k08Q1n2QK24
2391C00o1j42R3O7n1j65R3l2l2M5J68L1r1J7j50p7R4n6j7N5J03K0o1J79p2r8K8j03J58j29
2039A14l3L2Q2n0K7nL1J9j10k6k2N3NQ4m3n3qLR7L9j81J01j3m7L4R7j11j2n1P6j08K20o1r2
1640H8o3j4Q0J3O5R0k42J73l1j5M4l2p7pQ2l8n1J26j32K5P5Ml9J1RJ9O9L0j19K7qp9j7K2p
1229H1Q3j43L7R2P9j03mo9L3J54N7r6n8k9m4l2J08q1P2P2mO4j86Q5p5J29o8Q7j7k2R9r3j67
842D1J1N6J2j4J00o1n2N0P8l2J8r0J26k1kq5r1L7J06l6J09j73j5R2r0kP4k6k2J00l4J03j14
455A53n3Q2n6m2M3J25nj57P1P6p2L5k1l9p7N1P7p2J87n7l2j68L0L4J26j02n9R6n0j2Lj6L5
67A34p8M2J97j02Q0J3k61L1N1qN9j36K15mj22J51n7j86O5N2l7J46
$$ plain form
2755 194 173 148 40 147 152 22 227 195 132 211 47 103 96 153 27 175 186 266 42 128 156 68 155 144 184 247 39 120 68 76 300
2391 300 239 97 190 257 206 41 134 102 70 115 283 314 223 240 90 13 107 51 34 89 192 212 151 330 258 160 188 85 243 114
2039 114 81 113 195 145 172 167 198 217 107 81 59 112 117 201 158 105 97 100 197 236 55 156 143 96 130 227 116 104 53 129 21 241 180 88
1640 88 25 11 91 104 169 259 17 190 159 144 188 156 79 72 154 116 65 191 59 84 159 163 124 135 144 163 232 262 143 170 162 83 66 88 81
1229 81 164 21 58 150 229 126 122 53 86 240 297 201 143 114 70 38 146 65 137 209 205 269 83 168 93 222 154 241 224 202 301 208 41
842 41 52 108 120 106 206 145 93 143 221 189 207 117 243 222 220 135 44 81 187 151 260 87 72 164 74 72 146 120 98 198 164 267 153
455 153 100 182 126 84 127 252 247 90 161 237 165 200 179 140 63 114 191 119 306 249 217 49 79 113 239 137 78 174 124 112 115 99 134
67 134 56 98 295 193 273 286 25 56 107 99 158 22 237 233 111 262 205 19 84 136 99 245
-191B45
##PAGE=	F1=-12871.5
##FIRST=	25168.397401625570637,	5807.04592319999756,	0
##DATA TABLE=	(F2++(Y..Y)), PROFILE
5807I6L3rNj3o0L9m5J16j03n2J23K5n4p1L9J04J5p8JJp8M0J57r5nk5N0p0Lk1R7j9P7J6qQ0
5384C11q7j90R7J7o1k0J2J8Q2r5PN4n9R2j29P7o9J5m1N1N0q7M8J67k5n3j38R5Jq8O2l5R5%
4985A74m9N7l6K5p0J0l0J92r2r8R6N8K2j25l9P7J06j87OO8j34J32j3L7O0j24R4n0j02Q1J27
4622B73r6K7m9q7J50n0o5J4N5R3j72J02r0m3Q3P6j91K0k5R0m5M0LR6j15k1P7O1l2q7N9L3J18
4234C02k10K4J34L0l1M6n3j49J3orL0Q7J91k11l8Q9J7n9j02p8O8k5R8m4p1P2Q8N7q3j35Q4
3859A26k3K5o2J9K28j06k9p1lp0O5O5J03k13O5J6Qj38J38o0j7M6j7N6k6n8k9Q3r0N4Q9J8o
3471A86P1j51ql5J4O5o4k9J69J21j49j30P7o8O0p2Q2j1j26J25q1O8Q1l3j17l3N8m4kN3R8j9
3096A56j5M5r5OK5Oj0j5o4j8R4K5n6R3r5O6K7q2k2mJ16j25N1J2J16k5q7K03j81Jmj06Q3j0
$$ plain form
5807 96 129 120 125 112 52 91 46 162 59 7 130 155 101 30 69 173 188 110 111 112 34 74 231 136 131 106 156 86 89 68 165 146 223 239 231 311
5384 311 224 34 131 148 87 67 79 97 179 84 91 145 86 178 49 126 57 72 31 82 132 45 93 260 235 182 44 139 140 52 114 79 174 174
4985 174 125 182 146 171 101 111 81 273 181 83 179 237 259 134 95 172 278 91 97 165 31 163 150 187 247 123 217 167 65 146 273
4622 273 177 204 155 68 218 168 103 117 172 265 93 195 105 62 145 221 30 50 25 115 70 110 113 209 94 73 150 211 179 92 151 184 302
4234 302 92 116 250 280 249 295 242 93 106 100 91 121 208 399 188 150 239 256 197 95 17 85 60 158 114 43 115 203 260 177 42 126
3859 126 103 128 66 85 313 207 178 107 104 34 99 164 267 54 119 135 143 5 143 83 66 112 95 151 125 67 38 121 31 85 174 192 186
3471 186 257 106 98 63 77 142 78 49 218 339 190 60 137 69 129 57 139 128 2 127 46 114 195 162 45 12 70 26 24 77 175 156
3096 156 141 186 91 97 122 128 118 103 39 21 115 140 84 177 82 148 175 93 71 67 183 58 109 121 237 212 125 328 147 148 144 38 121 111
2697A11o0J98m0o1P6j54O0j5K5l6J07m6P2k05J60j3j18O7lL6P9j96Q4lk6J85r5r4J07L0n5
2333A77j39Q6p8k8P8J32O9p6k7j32J0M5r8P4K2Q9K3j03J76o3j01j1J8J10j65j4NJ14m5j1R
1969A46O0N6j20l2m5O5J1M3nm8J3n6J26P6j76L1kp9J17R5j55nk1M1j02K02r6l5l2j3M9j7M7
1582A39M9j36J24K0o2nj1n1OR9j0n8J8r6M3P7mn9j2J33l8P0%n7lPr7k7K0m8J14j32Q0Q0L2
1171B05j24J3k4J0J48L1j12Pk7q2jJ32j36N4J32m7J20k34R9o5J40q1M9j2j2Q9n6j49m4Q5K
807A10L3J14o7q4K3N2k0P3j19J97p4l5q0j05O4J18n4Q7j63j9J06j34K1J45pm7RJ6Q1q9o3J23
431B12q6l0K9J33m7j60Q6J30n4rrk5o5m9J03n5J76J0o7j58L2L9J01q9o3Q5p6nP2o7Q1j14O
44F7J51o1Q9P2k55J1j4M5R0j51K22l3j12J00k8j41M7M0p2J60
$$ plain form
2697 111 51 249 209 148 224 70 130 115 140 104 211 165 237 32 192 179 61 128 125 161 240 44 128 125 99 284 189 95 202 232 177
2333 177 38 124 46 18 96 228 297 221 194 62 72 117 19 93 115 204 227 124 300 237 136 125 143 253 88 74 79 193 148 137 146
1969 146 206 262 142 110 65 130 141 184 179 131 144 88 214 290 114 145 143 64 181 276 121 116 95 136 34 236 140 105 73 60 109 92 139
1582 139 188 52 176 196 134 129 118 67 73 172 162 104 122 26 69 146 142 83 71 204 166 236 236 179 176 183 86 59 79 31 145 13 93 173 205
1171 205 81 94 70 80 228 259 147 154 127 45 44 176 40 94 226 179 299 65 164 99 239 158 207 195 183 272 216 67 23 108 110
807 110 143 257 190 106 129 181 161 234 115 312 238 203 123 18 82 200 146 233 70 51 157 23 44 189 182 135 144 160 241 152 89 212
431 212 126 96 125 258 211 51 137 267 213 204 195 170 105 56 159 104 280 290 223 65 97 136 237 148 85 170 94 89 161 94 175 61 67
44 67 218 157 246 318 63 74 60 105 195 44 266 233 121 221 193 52 99 139 67 227
-191B27
##PAGE=	F1=-12973.8
##FIRST=	25168.397401625570637,	5807.04592319999756,	0
##DATA TABLE=	(F2++(Y..Y)), PROFILE
5807I0L2l4lK2n0L4l5R9j15j3J45K6j34l8N1R5L1o4j0J1r8N1J12j10N7k6L5o2L4o8Q6J5M4
5420B10J4j9J06p5k16J49j4q7MK1M0Q7j49L5mM3Q0j75Q2o2J0k8nK8l5N1J58M9q4j91J64n4
5044A33r1R5q8P1J2j7N7k7M4m1%o5J59l2j21J00L2K0j38K5NJ26j78kO3j33J63Ml0J00j29Q4
4669B01o8n0N1J27p8O5m4j20J38o3r8N3N9L4m3Q7j55j2L2J14j66rJ3P7j05Q2j6J00j76R2Q4
4305B06L4o0q0K0O5R2j48O1J20l2p2Q2m6j63Qj4O2m8J33J33j78J1J2J2Po1r7M0p2O3K5q0M2
3917G7J27P2q8j28N6J4l2m9O2J70p3o8m2L3o3K8R2J13j90k4O0m5l3M1n9J6J4K7M1m6j6p6J11
3530A22o5P4J8rL4R9j65k5m7N6L1n3l7J28J64j44j18Q2o3N7m7M8K3j05O9r5M5J05Jl7q0K6
3154I2l1qL3Q4q6J9P7r3J9l9O2L1n8l7J0PJ04j73J19m1QQ9l7j01Q1Rj10J16lJ30n6r8J42j69
$$ plain form
5807 90 122 88 85 107 57 91 56 155 40 27 172 198 64 26 77 172 203 139 129 140 42 93 205 95 152 126 161 99 133 65 151 166 210
5420 210 224 205 311 236 20 169 155 68 72 93 133 220 71 106 102 145 225 50 132 70 80 52 47 75 40 91 249 298 214 23 187 133
5044 133 42 137 49 120 132 115 172 145 189 148 148 83 242 210 89 189 221 241 103 128 133 259 81 79 142 9 172 176 146 246 117 201
4669 201 133 83 134 261 183 248 204 84 222 159 61 114 173 207 164 251 96 84 116 230 64 55 68 145 40 122 106 206 30 122 206
4305 206 240 180 100 120 185 277 129 190 310 278 206 288 242 79 87 73 135 87 220 353 175 186 198 210 217 156 59 99 27 90 115 35 77
3917 77 204 276 188 60 116 130 98 49 111 281 208 140 98 131 68 96 188 301 111 87 147 102 69 110 51 67 81 108 149 103 87 11 122
3530 122 57 131 149 140 174 273 108 83 36 92 123 70 33 161 325 181 63 145 82 139 92 140 163 58 127 32 77 182 183 146 66 92
3154 92 61 53 86 170 84 103 180 87 106 67 129 160 102 65 75 82 186 13 132 91 99 188 151 50 131 140 30 146 143 273 217 119 261 92
2755I2K3K1j11P2j9rJ82k8o4P3j39P9k9l3Q9N1j26O3j61K31o8j37N1J6pJ03j56O8N8m4J02
2391B43j05l8J01k1n7q2N8q7M4N7N2Q8o6m4r3N2Nm6J30n7P5L7j48J61m3r2n8J23N9j87J6J0
2016H7J03m2m6PR8Q2j30rp3N1OL1K6m5K9o5J05J20j67l1Pr5J67J08j86l3L1j0o2J49j16J8
1640A15QnLMnQl9N8N5j02j0j3k1QJ32J6m1r6J3oK7Pq0KJ87o8O5qj1l4L4j17j3K1p6J08j09
1206A7J14O1j5j28oM7j6J28K1j34P9m3j08M0J52j49NJ85j03J53k55R6k2J16o0J4j9k3P1k0
854A98j15l5N6nP5J26o9j11j5J9l0J31j17K34j29l9n8j03R5R3o5N0j30l0J35j15l2J96K1p6
502A55o9Q8K7n7p9J64j29J8lJ49p7j40M6J63k3m7ROn0j41R4j6J48P8j04j23L9Q6J5q6n0O2
126A53q4LJ08j09J05j37K6O6MN6J39k23k3p6J41O9j66K24n5j02L0jp1L1K2r2J60
$$ plain form
2755 92 115 136 25 97 78 69 251 223 159 232 93 172 143 110 199 250 124 187 26 257 189 52 103 119 112 215 59 127 185 141 243
2391 243 138 100 201 180 123 41 99 12 56 113 165 253 187 143 50 102 107 61 191 134 209 246 98 259 216 124 66 189 248 61 77 87
2016 87 190 148 102 109 207 289 159 150 77 128 134 165 191 146 175 110 215 335 168 137 144 49 216 324 138 105 136 126 64 213 97 115
1640 115 123 118 121 125 120 128 89 147 202 100 90 77 56 64 196 212 171 75 88 82 109 116 36 38 225 157 222 214 203 169 203 86 73 94 18 126 17
1206 17 131 192 177 49 43 90 74 202 223 89 168 125 17 57 209 60 65 250 147 300 45 141 119 235 175 189 170 147 218 198
854 198 83 48 104 99 174 300 231 120 105 124 94 225 108 342 213 174 116 13 108 201 136 186 56 26 161 46 14 210 231 155
502 155 86 174 201 144 65 229 100 118 115 264 187 47 93 256 233 186 195 201 151 10 104 88 236 314 210 87 126 212 227 141 91 153
126 153 69 72 180 71 176 39 65 131 135 191 330 107 84 8 149 218 52 276 221 119 149 148 77 108 130 38 198
-191A98
##PAGE=	F1=-13076
##FIRST=	25168.397401625570637,	5807.04592319999756,	0
##DATA TABLE=	(F2++(Y..Y)), PROFILE
5807G8K6l5k0M3j5Ql5Q6j20M1J39M3j23m2J5R6L4m0l5Rj19O5O1j14J08k1L1n9N9p2P0K2J4
5420A98nk4J19o2j62J25k4j01RN6J4J13j92N7n1J20O5k05O5k2j0j9l6J3k6O6J39J29j06j84
5068E9J63j19rO0j38M9L0MN4k2P0j6j5m5O7J9j27J10kK9j61J10q1J46j29o7P9p1J19J2q0J28
4692B26j20Q6j09J3J5J27o4J01l7r0N1n2j19P2N7l3R3M7j71J7j1J43j43j4K2N7j39R2j0Q2
4340A89j54J60M3Op5n9j4O7R1p1N7Q7o1r2J03l0j87J3kJ04j17J43O1j00L2l8jP2k2j06J7p8
3964C8j3R1q2K2J41P9r5j06J6N7p3n2J18Q9l9p3j9N0m4j2J26J07j84p0Q3q8N4k9p2N5rL6K7
3577A29l8J4q4R0kM3ql5L9J35j64m1n3Q5Jp0N8mJ84j26j07P1m8R0l7J6N5q7J1p8kJ15M5L8
3178B35j00j9j8jj2J15j65J7J19q7J6o8J06O4j08k0N7o9J69j77Q4k7p1J64pj55J47o6l4P5
$$ plain form
5807 78 104 69 49 92 77 85 50 136 16 57 196 239 116 74 89 185 219 179 144 153 34 99 160 46 154 133 164 105 164 92 162 184 198
5420 198 193 169 288 226 64 189 165 64 73 129 143 256 64 121 70 190 255 50 115 93 83 64 28 41 15 81 220 349 243 59
5068 59 222 103 94 154 16 65 95 99 153 131 201 185 170 125 192 211 84 194 192 221 60 170 89 235 106 39 118 47 166 178 98 226
4692 226 106 192 83 96 111 238 174 275 238 148 199 147 28 100 157 124 217 264 93 110 99 242 99 85 107 164 25 117 107 189
4340 189 35 195 238 244 169 110 96 163 254 183 240 327 266 174 277 247 60 73 71 175 58 201 262 162 194 156 155 227 205 99 116 38
3964 38 25 116 34 56 197 276 181 75 91 148 75 23 141 230 191 118 99 149 105 93 219 326 142 72 155 67 121 92 20 75 66 102 129
3577 129 91 105 21 111 109 152 144 109 148 283 119 78 25 110 111 41 99 95 279 153 46 117 69 159 122 138 193 106 117 39 37 152 197 235
3178 235 135 116 98 97 85 200 35 52 171 84 100 32 138 202 94 74 131 62 231 54 138 111 40 204 197 42 189 123 89 164
2826A64K1J10p6j13N7j14L5N1j26P7k7J8J56Jo3O5j23J16n9r4J96J0k06N2q7K68j27j38L9
2485H3L2o8J35j14O0J04m3Nj03J9P8n9p9mJ9kL1N3l8Q2o0l1m2L9j5K6J67j31O0O6j88J30j0
2098B02p0q2J53K7j85L6L2P8m7p6oJ41Q8j33L3r4J8j9N2L2l0L8n8O1J72j53q3J4j02J73J41
1734C53j97p1O8n3KP6r0K5M5ll8N1n3j4kJ8O2j16L8n4J7LJ54L5l2j17O3m6n9L2q6M7J47o7
1335A38N7J5pn8P8j38J7Qn3N4n8J07L5n2q0l7P5k5J07J4j51J47q4j01O0J69j33m9K12j55J53
971B65k54R4K8O8%Oo3l6M2Rp3oK3jR0J38o9j30n2k4m8J81r6K40j73k4k8p1J01O0p1Qr9K9J16
560A80j03n7J82N2j08o3Q6j8j6o3J53j48O8m3J65p9r5n5J75Mo5K9M1m0j29j3L5J06J30j30
208A81o2L6J23p2q8l2L9n5k2J21j35J06j27O5k4Q8k4J98j79m4l6J34M0j79K09o7q6m8K4PK2
$$ plain form
2826 164 185 295 219 106 163 49 84 135 9 86 59 77 233 234 171 236 113 229 170 76 272 282 76 128 41 309 182 44 83
2485 83 115 47 182 68 128 232 189 194 91 110 188 129 50 46 65 63 94 147 109 191 131 100 58 97 82 108 275 144 204 270 82 212 202
2098 202 132 50 203 230 45 81 113 191 144 68 62 203 291 158 191 97 115 96 148 180 150 188 130 191 363 210 127 141 39 212 353
1734 353 156 85 153 100 102 178 88 113 158 155 117 168 115 101 99 117 179 63 101 47 64 67 221 256 224 107 170 124 65 97 11 58 205 138
1335 138 195 210 203 145 223 85 102 110 57 111 53 160 195 143 63 26 101 76 183 197 46 193 109 8 68 237 104 55 267 112 265
971 265 11 105 133 201 201 207 144 108 150 159 86 80 103 102 192 330 261 131 79 55 7 188 92 332 159 135 107 36 137 197 126 134 35 64 180
560 180 77 20 202 254 146 83 169 151 135 72 225 77 145 102 267 188 93 38 213 217 152 181 222 182 53 40 75 181 311 181
208 181 119 155 278 206 118 86 125 70 48 169 34 140 13 78 54 142 118 316 137 93 57 191 231 52 261 194 108 60 84 91 113
-156A13jr2J46
$$ plain form
-156 113 112 20 166
-191A66
##PAGE=	F1=-13178.3
##FIRST=	25168.397401625570637,	5807.04592319999756,	0
##DATA TABLE=	(F2++(Y..Y)), PROFILE
5807F2K0j3LnK4j6m6Q2q8N9J21N7q3o5pJ07K7j3p2rj33Q0Mq3J22k1L5m7Q1n3O6Nj7k7k6J15
5384B46m3r7P6k0q3nJ04m8J46j98L9n0J45M8k11M0L6n1qjL2p2O2Q8J98j06j67J35j77J02Q
5021A68j29J4J5K1M6k7R5Ll8Ml8M5j08J28m1M8j93K04j52J43n6j08N2kN8Qj09J42j03J05j45
4657E0O1l2J27o4J36k7m5n4k3q5K7N7o0J72lj44L9l0J55j27j6J8L8j34O8J2M1o7J51jj2p9
4281A49l4m3N9R5rL6M3m3q9R8j1k08K8K5J07j50J00pnL2o1NJ12Rj15Pq0k5R5q4K0J30P9j04
3882A61p0k2Q7p8k9J16Jj0m8%N2k0n1J61R3j94p8Q4j08R5o1n2N6j4RLmL7q2O9L6RMl9KJ66
3460B81j52m7n1J01jj19J26r6J64r5q7M0k9J30k8oP7p1l7k7K3K6Q6Q6r6o3mJ4p2J71j91m0
3084A3J37o7Kk7R6Q0j52kJ03j37K03j45P9n4j06J80L4j40J33q9k0L8Q2N8q6q7p3%QQ5j24O5
$$ plain form
5807 62 82 69 72 67 91 75 29 111 23 82 203 260 177 112 105 212 239 226 154 145 12 92 96 13 135 114 149 102 183 130 196 201 184 157 131 246
5384 246 203 106 182 162 79 74 178 130 276 78 117 67 212 260 49 89 125 74 66 65 97 25 87 175 373 267 100 235 58 160 168
5021 168 39 53 68 89 135 108 203 206 168 172 134 179 71 199 158 206 13 217 65 208 152 44 96 94 152 160 51 193 90 195 50
4657 50 111 79 206 142 278 251 206 152 129 44 71 128 68 240 237 93 132 102 257 130 114 132 170 36 104 116 157 90 241 240 228 149
4281 149 115 72 131 226 217 253 296 253 164 262 251 43 71 96 203 53 153 146 141 173 112 117 229 238 123 130 50 25 120 36 56 186 265 161
3882 161 91 69 156 78 49 165 166 156 108 108 160 140 89 250 343 149 71 155 47 142 81 29 85 71 80 83 79 116 34 103 139 148 152 113 115 281
3460 281 129 82 31 132 131 12 138 42 206 111 24 64 35 165 137 131 208 137 100 73 96 122 208 294 198 135 131 145 73 244 53 13
3084 13 150 83 85 58 154 234 82 80 183 46 249 104 183 129 23 203 237 97 230 141 121 159 241 299 213 126 53 53 61 146 22 87
2708H7l7K9J26L6n5N1j12J58r7j20K43j3k49K7k0K82j75j20L4K9q5J33o7N2J17k6o5j13P3
2368A23M1l1r6J2j5O8LO6r2N2o0J2Jk3pR3J82j90M5J07j99P4L0m6o6R8K7j62L7N3N6o0r6k0
1969A7J72P4j13O8j02rn4Q3QKM2n7J9K18j33j25J7o7J06J81j96q2P8q4P4Jj2k5P3qo6R1p3
1582A18j8j1J5L8n5M4q9M9J0J37M7l6r4R4p0j22L6o2K7R7m1N2N0l6p4J32j50L7j6k9J4LP8
1194A75Mp5k5K3kk2J06lj06J52j27p0N7J69j10r2K15j82J07j53K9O0NR0K7j39l3jL3l2K6L
819A09J4O9J50o3j40q1m2Q9L6p4K21j89olm1J06M1p2%j14J17P4j20k6J10Q1j41L3jj4LmP7
431A99r0O1p6J67o1n8j23J39J0n7M6O6k9j06m6K5N5J54j31J4K1J33j38q7k1L3mp8J20j14N8
67H2pLm5J23j14K34j30m3lJ14K5j83J64o8o1n1JN4K3k8p3J19
$$ plain form
2708 87 50 79 205 241 186 237 125 283 186 66 309 296 47 74 54 336 161 41 75 104 19 152 85 137 254 228 163 50 123
2368 123 164 133 37 49 34 102 105 171 79 131 71 83 84 61 54 147 329 139 184 291 92 166 196 150 84 182 209 47 84 137 193 133 37 17
1969 17 189 263 150 218 116 107 53 136 144 146 188 131 150 368 235 110 127 60 166 347 151 69 147 63 137 138 126 101 174 166 100 191 118
1582 118 100 89 104 142 87 131 42 91 101 238 285 249 155 249 179 57 93 31 58 155 114 166 216 180 106 238 88 125 109 80 94 97 175
1194 175 179 104 79 102 100 78 184 181 75 227 100 30 87 256 146 54 269 87 194 41 70 130 135 225 252 113 80 79 112 80 106 109
819 109 123 192 342 279 139 58 16 105 141 67 288 99 93 90 49 155 196 124 124 10 127 201 81 55 165 246 105 138 137 123 126 122 199
431 199 109 170 94 261 200 142 19 158 168 111 157 223 194 88 42 67 122 276 145 159 180 313 175 88 67 100 96 18 138 24 82
67 82 75 78 33 156 42 276 146 103 100 214 239 56 220 152 91 40 41 95 118 90 17 136
-191A36
##PAGE=	F1=-13280.6
##FIRST=	25168.397401625570637,	5807.04592319999756,	0
##DATA TABLE=	(F2++(Y..Y)), PROFILE
5807D5K0RN1p8M5k5o0Q0l8M9J01N5l9q8mJ25J9Oj13m2r6N6n6L8M3k7M3k6J00k8O9k4m1m1l2
5396I6J00j7m5J7j3l1k9J39j09J65j73j1lJ24K5j92L5Q4j04KL8M9p5M1LK50p9j53R0j88J86
5032B22m3j02Jk4M1L4m0J04J7o9O2j22L7n0J35p4P2j74K44j69P3J0q0j7O2j3lr5J17q6J32
4669B02j23N0q6J29p7J63j2mj45Ok8m4O3L2J02l3r8M7l4J60j18k8J2L7j03K4L6j2RJ19l5j1
4293B00p6j5p3Q3O3L9LkK6p8P1Ok17N3L4R8j61L6n9P9K6n6M6R8L0j26J6r7KO7q3K6J16P6j15
3882A36k6l1P2o0JQ5q0J5j1K1M3jq4J91Q1k16n4O1j05R8o0k2M2rm0k9N4M8q3P2L3j5L3k2k9
3471A09J56j33m2n1J19J5j10Q3q2N7n8j2k0K3J05k1k2Q5n0p0L4N5o8J15R5p1r1J1K4j33K21
3107B73j97l1P1m1pL2O9P9j86L1J28j82J93r6R1r0n4R9R9j09Q3q2n8K4J57j0q8k1j28K7j0
$$ plain form
5807 45 65 74 125 47 92 67 7 87 49 98 199 254 215 127 123 248 267 273 160 118 22 78 22 60 103 76 119 93 193 165 234 210 169 128 96
5396 96 196 179 134 151 138 107 78 217 108 273 100 89 86 210 235 43 78 162 58 60 98 147 72 113 116 366 287 134 224 36 222
5032 222 179 77 78 54 95 129 89 193 210 141 203 81 118 68 203 129 201 27 271 102 175 185 105 88 150 137 134 39 156 70 202
4669 202 79 129 43 172 95 258 246 242 97 103 75 31 94 126 228 195 97 144 110 270 152 124 136 173 70 94 130 118 127 246 211 200
4293 200 124 109 36 119 182 221 224 222 248 170 241 247 30 83 117 215 54 90 31 110 136 80 126 224 254 128 144 47 49 116 33 59 175 251 136
3882 136 110 79 151 91 92 177 97 112 101 122 165 164 80 271 352 136 82 143 38 136 76 54 96 87 47 18 72 120 37 109 142 127 160 138 109
3471 109 265 132 90 39 158 173 63 146 64 121 63 51 31 54 159 138 116 201 151 81 115 170 102 217 312 241 150 161 185 52 273
3107 273 76 45 116 75 68 100 169 248 62 93 221 39 232 136 227 137 83 182 281 172 255 173 115 139 296 286 198 177 49 76 66
2744F6J04j27M7l9K4J01O9m2L1j09J90j31j04K25k0k20l4K7K76k02r1M5Oj9O3j1K3R5Mq3j44
2380B0J15nO8p5p5k5J09l5P8r5K0o3N8K1j08K7J34J76k22K1J60j84QO8l7l5PO3j35L2O3M0
2004A94q5j01K7J32M1o3P2r3pl2M6l3M1M6p5jK37j06j58J4J0j2K04j86m4O7j16J44o0O4q0
1640H7Q6j6p6J06o9k0j7K8J1K6Mr8O6K8R7M9n0o4J31p5j37jn7j2P2oN0P1p1q5J87j52L8m0
1241I1lj7O5L6k1q1QR5p5k9J28k6l9J28j35q1P9J45q7j17J88j60LPm9N8o2J87O3k08j5l8L1
854F9LN1%L2J8J61m8j44r7L7J16r7m3J63j51nJj8J11M8p0L4j36J51K2j54M3J2R9j66J76m1
478A77j1m9O2k8J5K1r2J48l8k8j18N2j5k7N9P1qq5j7k3QJ40r4Q2oJ18j76n7k6N3J8q9Q0n7
79F0j1R5q8%J00j21J87r0k1OR4L3j72Q8o6k7M8l7J5L1m8m2P8
$$ plain form
2744 66 170 43 90 51 75 176 245 203 234 125 315 184 80 305 285 65 31 58 334 132 41 86 92 73 136 125 148 243 247 164 20
2380 20 135 130 198 123 48 23 132 97 175 80 100 37 95 116 8 35 169 345 123 144 304 120 128 196 159 124 131 194 59 91 154 194
2004 194 109 8 35 167 208 145 217 124 117 85 131 98 139 185 110 109 346 240 82 96 106 94 298 112 68 135 19 163 103 167 87
1640 87 173 157 81 187 118 98 81 109 120 146 150 52 118 146 243 292 242 178 309 234 97 96 39 27 99 93 143 214 143 58 245 93 131 91
1241 91 88 71 136 172 151 70 78 173 98 69 197 171 132 260 125 44 123 268 181 64 252 92 95 102 53 111 49 236 299 91 76 38 69
854 69 72 123 123 155 173 334 286 142 45 82 198 101 58 221 70 65 66 48 159 207 137 171 35 186 208 54 97 109 208 42 218 177
478 177 166 117 179 151 166 187 95 243 205 177 59 111 96 69 128 199 191 106 89 66 74 214 120 202 196 314 138 81 55 108 126 37 117 60
79 60 49 144 56 56 156 35 222 132 111 117 211 244 72 160 94 67 115 78 93 124 76 34 112
-191A12
##PAGE=	F1=-13382.8
##FIRST=	25168.397401625570637,	5807.04592319999756,	0
##DATA TABLE=	(F2++(Y..Y)), PROFILE
5807C0K9J3R8j02J3j0m4M3lL8Q5L3mj02K5J45J1J1j44p7l3J3j7N2l0l9M9PJ08rO9n4n3l7m6
5396F8Q1J3j8l9j2M5m9J39j33J53j37p0O4Q1Jj46O2R4j54NO2N0n0K8q6K76k7j40K9j10J90
5032B70r0p4j8l8N6K9m1P9K7j04J16j55j7N5J12r0Q6j46K72j57l9N8l2n8J09q1j6l9N3p2J48
4669B03q6K9j07J06p2J53LJ9j78QK5p7M9J19j2J0q7M3m1J66j16m2KP2p0k2M1n0N2O8n1J1o6
4281A02j1p4J30k3P1l6k4J11o2L0J5k15Q8K0Q5j63rK6J9K0j7P5N3M4j35L7j18RM7p2M4J02
3906A69P2j29J4j8K6m4L1N3j34L5J5M5L2Nr4J97P6k40j4K5r2Q8k7k0L6kq3K7K9M0p6Q4%k9
3506I7O5Kj0Q5j11l1n3J39K7r7J4k3n4mN1KK6L0k4l9Q0k0q6Q8O5j32J39O5l8q5J9J9j59K25
3107B72j83k5J7k9QP3L7O9k09P7J29j75J19l0R9j16LJ8J73q4K7o4j28M2K21q6q1M8r5m2K0
$$ plain form
5807 30 59 72 170 68 81 71 27 70 67 105 190 223 219 117 142 287 298 309 165 88 55 68 51 103 73 34 83 90 198 189 258 204 151 114 68
5396 68 149 162 144 105 93 138 89 228 95 248 111 41 105 186 187 41 103 197 43 48 110 160 110 138 52 328 301 161 190 80 270
5032 270 180 106 88 50 106 135 94 173 200 96 212 57 40 95 207 117 203 57 329 172 133 191 159 101 210 129 113 74 127 55 203
4669 203 117 146 39 145 73 226 229 248 70 78 103 26 75 194 182 192 105 148 107 273 157 115 117 189 119 97 138 88 140 208 157 168 102
4281 102 91 17 147 124 195 159 135 246 184 214 229 14 102 122 207 44 35 61 80 100 83 158 211 255 120 157 39 48 95 23 67 169
3906 169 241 112 126 108 134 90 121 174 40 75 90 135 167 172 78 275 351 111 97 122 30 118 91 71 107 105 22 49 78 118 42 126 126 97
3506 97 162 164 154 239 128 97 44 183 210 113 127 104 50 46 97 99 125 155 131 92 172 152 66 154 219 87 226 291 253 168 187 206 47 272
3107 272 89 64 81 52 60 133 170 239 30 107 236 61 180 150 249 133 136 154 327 243 270 206 78 120 341 255 174 222 127 85 105
2744A05R3j39L6k5jQ5R6l1Nj16K06j51p3J78j8j53r2O6K35k05n9O9j4ML9L3j4M6L8o2j58J21
2368A44m5J75p3j50j7J25o0O0o9J7o3P3K7q9l3J50J50k21j4K18j60l6Q5m5J4r4J17j05K4O6
2016A71K0j16n1M7O5M%M3p0K9J2j7n9N6N2j09J7K09p5j82LJ00p4J37j42ON9j09J48r2J07j13
1640G6Q6j8p3Q6m4k1OJ9J1O1m1r0P6M9M9M4o9l3J68o6j37m2m8J0J4OM3O9q5r5K25j41K8o0
1241F3L1n2J19j0k1o1qJ67j05o8J53m6K3R3j08j22J20J11o8j23J31r5j01J40j06K0l7J91R4
901C25k26j3rl0J5O8J2M5m8J67j8j44j12J05J24j89L1M0o2k5j1pJ15P5o7O5j56J57l8j39J00
537A50p5P8j07K71J6p5j53J21j34J19j8q9J09j8kj13Kn8J8O0M9L5p4ll8j2P6j5J16l5Q9j87
161A03Ok6P1lp8O3n3K2J00j88L9P5n1Q5o1J3rP2O4j47J3q5K5J18n4k5M5m5k1L0
$$ plain form
2744 105 198 59 95 70 69 154 250 219 224 108 314 163 90 268 250 97 5 71 306 101 42 111 97 101 140 173 159 205 243 181 23 144
2368 144 99 274 201 51 34 159 99 159 90 107 44 117 144 55 22 172 322 101 87 305 145 109 194 149 163 69 186 81 105 171
2016 171 191 75 24 71 136 140 140 183 113 142 154 137 78 134 186 77 94 303 228 46 49 149 75 212 70 76 135 26 174 82 189 76
1640 76 162 144 71 157 113 92 98 117 128 189 148 58 134 183 232 276 207 174 342 276 139 97 49 59 73 79 122 191 106 11 236 95 123 63
1241 63 94 42 161 151 130 69 61 228 123 55 208 162 185 278 170 48 168 279 211 88 219 124 23 163 57 77 40 231 325
901 325 99 86 77 47 62 130 142 187 139 306 288 144 32 137 261 72 103 143 81 56 45 38 153 228 161 226 70 227 189 50 150
537 150 75 153 46 317 333 258 105 226 92 211 193 104 213 195 193 80 82 24 42 102 151 186 112 109 71 59 135 120 236 201 290 103
161 103 109 83 154 151 73 136 83 105 205 17 56 131 80 165 104 117 108 180 244 97 110 25 50 168 114 89 134 89 68 98
-191I8
##PAGE=	F1=-13485.1
##FIRST=	25168.397401625570637,	5807.04592319999756,	0
##DATA TABLE=	(F2++(Y..Y)), PROFILE
5807B6K9PJ36q6m6K6n4L5jL6P3lJ4j05P7J61%Lj56r5Oj6M3K1o9n6M4N5R7kN8p8m7j9n9N6M0
5373A51j8o1l1J23n9J00j11J12j03o7P8L6k0o7P9Q4j87j0P4K3jJ8j20K47L8j23m7j1J71j30
5021A68m6m7k3N9L7k7K9L4j35J47j19j8P4P8q4Q0j31L06j36j57R0J5o9J44j37k7Rjm6J25n4
4657A38K0q3N9k1Q5J2J6j37k2O0n9J2J45j15J30j30M1o4J67j08l9k2J34m6p0K7l8M2Km7M6
4293A35m6j8RJ15j32Q8o8K3J39m0k6J8j85J08pO5j43JP7l8JL3O7J7N1j23M3j11k3K0k5P0P5
3906A70O9j44M4j2k0l9O2L1r3jJ8N8K4%n7J52P5k55K9j7n4O4J7m6L7Pq5O7rK0n5Q2l7l8R4
3495A58K6L6pr3k3m9J47L3p8n8L1o5K1O0L5K1l1l8n7O5J3r5J31N3j75J78Rj9m3K1lj21J56
3107B39j33l6om3M1Q4NN5j81Q4J09j22QM9Q9j21N9l7K17o6j5m0j84P0K43j63n6R1p1r1P5O6
$$ plain form
5807 26 55 62 198 112 66 92 38 73 72 108 181 178 192 87 164 325 325 328 172 77 83 67 110 131 62 6 50 105 202 200 258 180 133 114 55 111 151
5373 151 133 72 41 164 105 205 94 206 103 36 114 150 130 63 142 226 39 29 103 126 125 143 23 270 308 185 138 127 298 168
5021 168 122 75 52 111 148 121 150 184 49 196 77 59 133 211 127 207 76 382 246 89 179 194 125 269 132 105 114 113 67 192 138
4657 138 158 75 134 113 198 210 226 89 67 127 68 80 225 110 240 110 151 87 254 146 107 85 219 173 103 130 92 134 136 89 135
4293 135 89 71 80 195 63 151 83 106 245 205 179 197 12 120 113 178 35 36 113 75 76 109 176 193 244 121 164 53 30 50 25 95 170
3906 170 239 95 139 127 107 68 130 161 68 67 85 143 167 167 110 262 337 82 111 94 40 104 121 75 112 119 34 101 92 112 57 139 102 64 158
3495 158 184 220 213 120 97 48 195 228 150 92 123 58 79 139 174 195 164 126 69 134 147 52 183 236 61 239 248 229 186 207 204 83 239
3107 239 106 70 64 21 62 146 151 206 25 109 218 96 104 153 242 121 180 143 360 294 279 239 55 125 368 205 149 240 169 78 153 219
2732B19j54M2kl2P2J16l6k1j32K04j47l1J18j7p6r1P5J52j90k5R3j1l1O3N4m2k1O9k6j40R4
2368A46n3K42p3j99j6J41n5ml6L0p4R0K1n8r0J47J08j79o3K74j53k6N8n7P4j41J27p4K2O4
2016A93oj48J4M5Nk3M4mm2Q7M8o0m5K5N8j45N1J48m4j55j1J36l3l4K1l9O7p9R2q1J05j19Q3
1628A54op1L5j0pK9nJ2O5p0p2Q3O6OL1q3qJ95m9j30p6j4O9n4j7K3M8n9n9J82j15J8o6O2p3
1218C4J31m7J2k7n8K14q5j08J39n6P4M8o1j65J60Q2n7j09N3j2l6Q5j55j4P2R8J09j92l1K3
866A21n6k4Q5L5N0j15J69K2j41j30J64J05k28J20j10K4m2Kk3J17J03o3P3j57J40r6j5P9r6
525A13j9J8L05J01j63k67J69k00J76m4o9N7oK0j11k5J0j4L4%J00o7k3k0pj1P7J17n8N9j73
161G9O8j6Q1m8o5P9r7R2P7k15J0L8J8J7l5M4m0L9J07j09rp2K7J25p3l2N7k1j5j5
$$ plain form
2732 219 65 107 105 73 145 261 225 204 72 276 129 98 216 199 123 32 107 259 69 44 137 126 95 158 212 170 149 218 192 52 146
2368 146 93 335 262 63 47 188 133 129 93 123 49 139 160 102 12 159 267 88 25 299 146 120 178 121 195 54 181 107 129 193
2016 193 187 39 53 98 103 80 124 120 78 165 213 153 108 133 191 46 97 245 201 46 35 171 138 104 125 86 153 74 166 85 190 71 154
1628 154 148 77 112 102 95 124 119 131 196 126 54 137 203 209 240 157 149 344 295 165 89 75 144 90 73 96 144 85 26 208 93 111 45 107 34
1218 34 165 118 130 103 45 259 174 66 205 149 223 271 210 45 205 287 230 121 174 162 126 211 56 42 114 212 321 129 98 121
866 121 65 41 126 161 211 96 265 287 146 16 180 285 57 177 67 91 49 51 28 145 248 185 258 101 241 145 130 209 113
525 113 94 112 417 518 355 88 257 57 233 189 120 177 171 191 80 55 65 51 85 85 185 118 95 75 68 57 134 251 193 252 79
161 79 147 131 212 164 99 178 81 173 250 35 45 83 101 118 83 127 87 126 233 124 115 43 70 195 122 90 147 126 111 96
-191I6
##PAGE=	F1=-13587.3
##FIRST=	25168.397401625570637,	5807.04592319999756,	0
##DATA TABLE=	(F2++(Y..Y)), PROFILE
5807D7%NJ56o1r5O7q8O7m0N1O5m2J1p6J17J71j3j6j45r5J8l4P1oo8n9J9J09O9oK8q6k5Nn9
5396F2J9N9l3j2m3J24n4L0o0O7q4J1K6Nk8J9P4O5j98m1R0m5O1Nn0J34J01r5j26P7J42j59j7
5009A26p9PN4N2j1j9L6j07J02n0K6K6N4p1N6j08L29j14k42J04L9o3J70j72l8M1l3j7P3l2J8
4645A57m3K4K0K6J6j9p2l1P2m8pJ12j64K50j93N9j05J57p5j3o2J88l3j11jJ9j0o5k7Q5k3j7
4269F6P9Q9j83O4m8R6P9j2r6K6j12Q4k6K4p3rP6k8l9P0L6PN7p5J0q6o7J1M0P9L6O8j55N7j7
3859A28n3k9P6K0j2m0KN2J8mJ5O7O9k51O2n2J4J4N1p8L6J9p7P9k3Jl0O3n4m8J11M9Q0p6q7
3448A12l0k9J35L6n5r7M7k2K4M9P1Op3m3m5L9J9j05J63K8k07K35m7l5K6J9m1n1N5n4m0k6k4
3060D0K4O9k2M0p7K2P1m2j08J37N5j04J06n7K11m9l5j1j71N2K24k36%Q4n0j14J32L3j54O1
$$ plain form
5807 47 47 52 208 147 52 119 31 98 58 109 174 132 143 67 184 355 342 326 181 86 104 70 141 135 67 8 27 136 205 199 227 141 116 121 62
5396 62 81 140 107 95 52 176 122 152 92 159 75 86 112 117 89 108 182 247 49 8 98 53 114 119 69 203 304 209 83 160 302 143 126
5009 126 47 54 108 160 149 130 166 59 161 111 137 163 217 146 202 94 423 309 67 171 210 147 317 145 107 148 115 98 171 139 157
4645 157 114 138 158 184 200 181 109 78 150 102 95 207 43 293 100 159 54 211 136 123 61 249 216 105 104 123 113 48 21 106 83 66
4269 66 145 234 51 115 67 163 242 230 134 160 48 132 106 130 57 48 124 96 57 127 163 170 227 152 162 76 9 20 60 139 175 243 88 145 128
3859 128 75 46 122 142 130 90 92 144 162 158 173 240 309 58 120 68 82 96 147 69 105 124 47 126 103 104 74 137 83 35 146 195 275 199 112
3448 112 82 53 188 224 169 72 119 97 121 170 241 247 174 131 86 125 144 39 202 230 23 258 211 176 202 221 180 129 184 130 90 64 40
3060 40 64 133 111 151 74 96 167 125 17 154 209 105 211 154 365 316 281 270 99 151 375 139 139 223 173 59 191 224 70 131
2708A31J3m9N0J25n6l7j49J78j08K0O0l4lq6R4N5j68J4J06Mj03J26N4n3r3Q9J0j01N1k7K52
2344C65o4k17k0J49l5q7nM5p1R8kk7q3R1N7r6o0K53j74L1mo5J28j11P5m3L8N5l8j57N6L1l7
1957G6pK1m1l1J54P5p3k0j6N4j63O7R0j6q1J1O3K1j39J74j25Q4o0K1l0P1j09Q4K0q2k9K8K5
1570A17K3k2k6O9p1m8Q5P8k4J4q7OK04l2j21q5K6J21j20l7rJ5J4m2J18p5J2o0Q1o0Q2o1N7
1182A42%r9K20l5j13P2n0J05j0jj91J79O2m8p5k4N7K1K7j98K2R7K2J04j33m6L9l8j00J05O2
819A75M3j66J73N6j35j41K06N8j92J75k19N4n5M4m0J03J17n4N7j36J02j44J42M3j00j17J11
502A60L30J80k35l67K00j78J42n4l9KnL7j07n0J03n0Mn6J65m8q4K1Jk7J00R5o8L8j37J01k
138A72R2r9n3J08j65J70N0j96j0n0Q2j6J2M7n8l0J49o3K1o0J0Q8r7qO5J2k2m6
$$ plain form
2708 131 144 95 145 270 214 177 28 206 98 118 178 144 141 55 149 204 36 50 156 160 57 183 237 184 91 180 190 89 140 113 365
2344 365 301 84 64 213 178 91 86 131 60 158 156 129 46 137 194 98 38 291 117 148 144 79 207 96 171 128 166 221 183 26 82 113 76
1957 76 69 90 49 18 172 247 174 154 138 192 29 96 186 170 89 100 163 184 45 219 94 178 118 139 109 180 71 155 175 93 64 92 117
1570 117 140 118 92 161 90 42 127 205 181 195 108 114 318 286 165 80 106 227 107 70 61 76 90 48 166 91 103 43 124 64 146 85 142
1182 142 142 43 263 228 115 187 137 242 232 231 40 219 281 233 158 134 191 212 239 41 63 160 182 286 153 107 146 108 8 113 175
819 175 218 52 225 281 146 5 211 269 77 252 33 87 32 76 36 139 256 202 259 123 225 81 223 266 166 49 160
502 160 490 670 435 68 268 90 232 178 139 141 136 173 66 16 119 69 73 17 182 134 50 71 72 45 145 240 172 210 73 174 172
138 172 264 165 112 220 55 225 275 79 69 19 101 85 97 144 86 56 205 142 163 103 113 201 104 96 161 173 151 105
-191A05
##PAGE=	F1=-13689.6
##FIRST=	25168.397401625570637,	5807.04592319999756,	0
##DATA TABLE=	(F2++(Y..Y)), PROFILE
5807H6l5LJ48m2j23J05j16J07j08Q3N9p1n%J10J70k9l5j17r6L2o1P1k4l8m2j2J47M0k2j3p3
5431I9MK7n5k1O6m8P8m0O3l8n4JL7q0Q6k6Mj6P3O0M1j90n8J12n3J2j3K7M0J54o6j70J19J15
5032B90j77Lq7K5M9O2jm1K5m0NL3N3k9N3o5K3o4L31r7k66R9K6m9J84j78n7O1m4%J5k2K1N%
4622A46K9NK0p8qNN2n3pL7n4K23k47J02j31J18jpq1J91k6j34k9Q3o9k6k7N6j1kJ17N4j60K3
4222A10MJ04J8J0j64O1n5M7j9m2J8n5O7J5q9R1lK6O5jo0n9q3Q8J4Q0rO8j56N7l4o6K3L5J8
3812A24N5n7j3L1J1JR3k4N5k16O3p1Q1m7P4j09L7K9p4Q5j6j6j1L2n1n1J10P4J05j02r2o5J7
3424F2R4M4k8p6QJ9L5L1J03k3r9k1mJ6j9j07J78J2j97K48p4r2J06J1q3K3m2L1j6q3K7k5L8
3037I7m2K7L9m3J5M8p8R5Jo5J31n8J68k6l5J4j43L0J91l02R6J5k2j18J70Oj20P3J4n8K9J18
$$ plain form
5807 86 51 54 202 160 37 142 26 133 25 108 167 96 91 91 201 371 342 307 190 94 126 65 136 112 74 32 20 167 207 185 172 99
5431 99 103 130 75 54 120 72 150 110 173 135 81 82 119 39 125 99 103 87 160 220 261 71 13 125 72 84 71 98 138 292 226 56 175 290
5032 290 113 116 29 54 103 165 164 123 148 108 113 146 199 170 223 158 181 117 448 351 85 184 210 161 345 167 110 171 127 127 142 120 141 146 146
4622 146 175 180 200 122 114 119 171 118 111 148 94 317 70 172 41 159 158 151 70 261 235 101 72 155 86 60 33 89 78 76 193 247 87 110
4222 110 114 218 236 246 82 143 88 135 116 74 92 37 104 119 30 121 118 144 209 208 148 89 6 94 108 188 179 247 91 148 114 48 71 106 124
3812 124 179 122 109 140 151 152 245 221 276 60 123 52 133 86 160 51 88 117 43 128 112 96 85 117 66 15 125 199 304 202 110 45 62
3424 62 156 200 172 96 104 123 158 189 292 269 170 149 145 161 142 35 213 225 28 276 202 110 216 227 144 167 125 156 140 57 84 59 97
3037 97 55 82 121 78 93 141 63 158 159 94 225 167 335 309 274 288 145 175 366 64 160 175 153 35 205 211 91 164 178 120 149 267
2661B67q5l5p7M8l3O8K2p1M6q5J12l2j07K8R7K2j77J96N4n9j56R6L7m6%NK25m1k15j3J37j9
2286B09j56J9N9l7P3l1Mm5K0NMm7K09k22J12q6n6J55o4K6j3P2M6p6j39O5J1n7L5n0L7k2R7
1898A57R4n5%m8M0j63P5L9Pj9L4k3M7o1J70k00J02m9m7M5K8r7R1M4r8q9O3O1ok5o5N3n2k8
1499B5Q4Q6l8lo7LJ86k6j02j9JJ59j78m5m1rR2n7P3k9ln7R5l3J4n1Q3L0j22J87K8q9k3j9J04
1089B39p1N9j89J63N2l6k4o9Q2N9j8k21R9N0k8Q0p5l9L3J0j03M4Q1K6j89J82O7j29r8J94j0
725B21r2J84k39Kn4Q2m2P0J17m1K4r5N0j76K87J1j13j69J54L26K39k65m21J98j23Q1n5nm3
384A13j9N1r8j4J18p9j9NJ11j6j38M0RL1M6O0o0K9q1R4PJ09j46l4J34k34K36K4j73J4o3M2
9I9l5O3L6n3q6J35j4O1o2QM3j26L4P1M4l8o1
$$ plain form
2661 267 182 147 70 118 85 153 175 104 150 65 177 145 38 66 163 185 8 204 258 199 43 139 176 130 130 135 360 319 104 91 228 209
2286 209 53 72 131 94 167 136 140 95 115 120 124 77 286 64 176 90 34 189 125 151 138 210 256 180 41 106 117 60 95 45 82 60 157
1898 157 251 196 196 148 188 25 100 139 146 127 161 138 185 124 294 94 196 147 100 145 173 76 167 211 113 24 87 148 142 117 52 105 53 25
1499 25 109 195 157 154 87 90 276 250 148 129 130 289 111 66 25 16 108 51 124 95 92 35 130 97 111 60 143 173 51 238 266 177 154 135 239
1089 239 168 227 38 201 253 217 193 124 206 265 247 26 125 175 147 227 152 113 146 156 53 97 178 204 15 197 264 135 37 231 221
725 221 129 313 74 76 22 104 62 132 249 208 232 137 187 11 298 309 196 27 181 507 746 481 60 258 135 216 161 156 113
384 113 94 145 47 33 151 72 53 58 169 153 15 55 64 95 141 201 141 170 89 183 190 299 153 119 253 19 255 279 106 120 57 99
9 99 64 127 163 110 24 159 145 206 144 152 195 69 103 174 218 180 119
-191A19
##PAGE=	F1=-13791.8
##FIRST=	25168.397401625570637,	5807.04592319999756,	0
##DATA TABLE=	(F2++(Y..Y)), PROFILE
5807A33m2k1J16m1j28J37r3J03j38P3N8p9j0N7Q5J57m1m7q4r9O2j05M3k9J5nm6J56J8m3o0
5443A02j9J0M1m7n8O0l6J50m1oj3j10L8K7l8Q8p2L0pJ07M5J6j68p0J40Mj11mM6k5J93m0j51
5056H1R6R8j75mn0PN2N8jl3%K1q8J17N8q5P7p4j4%L15r1k53R1ml3J81j59p3O3l5kl0k7K6N7
4633A67j7MK1K7j37N8O1Mp3J4n9R6J39k82J58j12O9O9l8q1J56k2j25k2J01j12P7p4K9k7J4
4269H3J31J4j19J6J0J03qJ5j97J09l2PJr8Q7q4L9N0j14P5l4N8Q8O9j46l0r0J67j3P3n3O8j43
3882A02M5n1o0Q3k6J8R0m8k6J3rJ8J60r5L3j58L5p3J21r4Q3j35N3K0p4J04jl7%j0l6k4P3J01
3483A95J06q4r4r5M6K8O5kk8m0M3N0NJ25o0j13K6L7kp1q3J66K0j66K03p0j46J67jj19P9j07
3107H0R4K6j58P9p3%l4KJ35p1k5R0k1M4o6j1J29m8J01Mj8K4j26K6J63l22J77r1K5j19J74O
$$ plain form
5807 133 91 70 186 145 17 154 61 164 26 99 157 78 68 125 210 367 326 279 195 96 158 53 96 67 82 77 31 187 205 162 102
5443 102 83 93 134 87 29 89 53 203 162 156 143 33 71 98 60 148 76 106 99 206 251 267 99 29 169 173 62 58 104 79 272 232 81
5056 81 177 275 100 96 46 53 105 163 162 129 129 150 62 179 237 152 229 155 141 141 456 365 112 203 199 166 347 188 115 178 143 141 111 84 110 167
4633 167 150 154 175 202 65 123 184 188 115 129 70 166 305 23 181 69 138 207 169 88 244 222 97 75 176 64 141 67 96 69 83
4269 83 214 228 109 125 135 238 230 245 48 157 125 132 133 35 122 38 77 127 13 88 54 112 200 269 123 93 3 170 157 230 177 245 102
3882 102 147 96 36 119 93 111 201 153 127 140 131 149 309 214 247 89 124 51 172 78 161 26 79 99 25 129 128 91 91 81 45 21 94 195
3483 195 301 217 123 28 74 102 167 165 137 97 140 190 195 320 260 147 173 210 208 137 54 220 240 74 277 207 61 228 227 108 187 80
3107 80 174 200 42 121 48 48 14 16 151 80 55 145 124 168 102 91 220 172 273 277 259 283 157 183 346 24 201 110 135 16 190 196
2732A96o3O5Ko7K2R4j16j0K4j01L6J04Qj03N4q1J15r2JPO2L7j16J42O7p4j98R5M6J6n5L3J78
2344C28j3k02J6R8j4j93L9O8KK9n1L9om2l3Q5n8J94k17J29j75k0J35rmJ0J16M1j12j31P6j0
1969A15n7N7o3J09j6k5J05j0J5o4J7j50J01k1K7NN4p4J9M6J46k53J17m6p8J10j3q3R4N7j12
1605A29j23Q8Q3m0j4O5n9q3j8O5R2m6j2k2jJ27l6j1O9j13J81k18m5j8M7M2q2N3ll1n9J15j
1218A21m3k6P3O5j29J27R0m5j21L8O4j18J08j70J17N0j9L9p3N8P9m5j89J40k7n3M7l7nNP6
854A97q3k8P7Pj51J67M1j14l5J66r1L1J60k37l6k3Q1l4K7J05k2j5m6Nr5K82j1j30j78J61K80
490D58K71k42m07J50o5L0n5K3p0m3O0p5M4Q2j03l9J00K0K5q0n7K4Q0pJ9l3K8j1M6LJ34j79
114A31JJ45k52K34Nj54O0l8qn9P8L1m2k8lL2R7o5QQj44P1P5O9o1n8
$$ plain form
2732 196 133 198 200 133 155 249 133 123 147 46 82 186 194 91 145 64 179 87 88 95 157 194 78 220 287 213 15 110 156 172 117 150 328
2344 328 315 113 129 227 213 20 59 127 129 158 107 146 140 98 65 150 92 286 69 198 23 3 138 129 125 135 251 292 180 49 125 115
1969 115 58 115 52 161 145 120 225 215 230 166 183 33 134 113 140 145 199 125 144 190 336 83 200 154 76 186 173 90 184 241 129
1605 129 6 94 177 137 123 188 129 46 28 93 185 139 127 105 104 231 195 184 253 140 321 103 58 40 87 129 47 100 97 66 7 122 121
1218 121 78 52 125 190 61 188 278 233 112 150 214 96 204 34 151 201 182 221 148 206 285 240 51 191 164 111 158 121 116 121 197
854 197 114 86 163 170 19 186 227 113 78 244 153 184 344 107 71 48 129 95 122 227 205 190 144 149 54 336 325 195 17 178 458
490 458 729 487 80 230 165 195 140 163 93 50 110 35 79 161 58 19 119 139 164 84 27 51 131 124 143 110 138 127 173 176 310 131
114 131 132 277 25 259 264 110 170 132 124 65 143 174 132 104 101 133 230 165 173 181 37 108 183 252 191 133
-191A33
##PAGE=	F1=-13894.1
##FIRST=	25168.397401625570637,	5807.04592319999756,	0
##DATA TABLE=	(F2++(Y..Y)), PROFILE
5807A83l1o3P5n9p7J27n0P9j04%O4o5ON7O5J33m7m3n4r2J00j51K2j4L2L5q2J41Ro7q8O1j8
5420H4M7m0q0M6J3J74m5o7J2o1j2J9L0M5j23O7j1J37L6pj45q4J64N1j81O5l1n8K02k7j06N8
5044A72R7j37n3j5rN7M1j2Ml8O5j53J83M9j38J16r1n5P1K95r6k25Q0k8k0J60j21p5M2j5j4
4680A37n1m9L9R9k5n1P3K8j49J05J01n8j01N2p9J39O0k41J46q1P6Q5q0q6J07j8q7K1O9j23
4328E8J46j26M0n8J7J27k8p1L3k4J07OLj45R9l5j7Pq7Q9o3mM2o1j4NK7J31J15k26J4r2K16
3941B31l4O1q8O3j15K5n7m9J20p4K1Q7k0l0Qm4L5K14j35Rj06Ko3J25r0N8j45Q9k1p6J52Lo5
3553I1Qm9l1K3K0J22Q7l8q3m6j4n3J04J5J2o2N0N5k4J33r7j12Q4O5k6j10m3J39M2j49J36m9
3178B00j20J58k0j25R1j25J19P0k00R6j06k1N4k2J07n4J8K5J3K4j29L8J07k2J6M0J1Qj25M5
$$ plain form
5807 183 152 89 164 105 28 155 105 184 80 80 144 79 85 142 207 340 293 250 196 104 204 53 75 61 93 128 46 187 196 129 41 102 84
5420 84 131 91 11 57 70 244 199 132 144 83 71 90 120 165 42 109 98 235 271 264 119 35 199 250 69 134 103 45 247 220 114 172
5044 172 269 132 79 64 55 112 153 141 145 107 172 19 202 251 113 229 138 83 154 449 353 128 208 180 160 320 199 124 166 151 137
4680 137 86 37 76 175 150 99 172 200 51 156 257 199 98 150 71 210 270 29 175 94 170 255 175 89 196 178 91 112 181 58
4328 58 204 78 118 60 77 204 176 105 138 114 221 227 230 85 184 149 132 139 52 141 78 74 116 55 41 46 73 204 319 93 107 15 231
3941 231 197 258 170 233 118 143 86 37 157 83 104 191 171 141 149 105 140 354 219 228 122 124 61 186 96 154 9 98 77 1 153 156 91
3553 91 99 50 19 42 62 184 271 233 150 104 90 37 141 156 168 106 156 211 187 320 223 111 195 260 234 124 81 220 262 113 249 200
3178 200 80 238 218 93 184 59 178 248 48 144 38 17 71 49 156 102 120 145 158 182 53 91 198 176 192 232 243 251 126 171
2826A71J48k32J54j96R7j09J26M9k6M3j8q2L7O4j50L3J11j36j2J33%j08L0n6Q6j26J19j3L
2485A40M7m0Q3R8j08j96Q5J9P9j06N9J24J2j89O9L1j4j90N3P1K0j6l3O1Rp9l7J17q2J97j44
2121A40P7j65k3L5M9LPJ53M6j42j28Q6k6m8O3k5J19Lj50J03M9L0o4pj32J33p7M3j1O1n4p1
1746G7J46J23k87J24m5l5J24n4n8Q5N7j21j10Q5R2o8QK30j37j55k4L4R5o4j1K6J8M2o2J82
1394C17R9k78J81k28m7L0Q6qr2M3j6l4j2O8K5n3k0K9J02j18M8J42Pj99J03pq0P9j41O3M0J0
1018A39R6o3K2Q4n2j33J54j11o0J4k5N0l6J44n5q3M1nq7J47rp6K9J22j68J46J13k19m7OP1
654A49k3j5Q5mm4jpl5K21j5j44j57J53J89K77j74l42Q0j9Oo6M3p6n5M9m0P2M4j04OJ20p6O4
267A61j7j34M1R6m8j0JM0N4l7j5J61j87M7J42k52J93jj41J13ok3p8L5M0l4L5j03M8J13o7M
$$ plain form
2826 171 319 87 241 45 142 33 159 208 182 225 207 125 162 226 76 109 220 84 72 205 205 97 127 71 157 31 150 137 140
2485 140 187 147 230 328 220 24 109 128 207 101 160 284 296 107 176 207 193 3 56 127 147 131 98 159 168 89 52 169 87 284 140
2121 140 217 52 29 64 113 116 123 276 322 180 52 138 112 64 127 102 221 224 74 177 226 256 192 185 53 186 109 152 141 202 148 77
1746 77 223 346 59 183 138 103 227 173 115 200 257 136 26 111 203 135 143 373 236 81 57 91 186 122 111 137 155 197 135 317
1394 317 416 138 319 91 44 74 160 152 60 103 87 53 41 109 134 81 61 90 192 74 122 264 271 72 175 168 88 167 26 89 129 139
1018 139 235 172 194 278 226 93 247 136 76 90 65 115 79 223 168 85 126 121 34 181 172 96 125 247 79 225 338 119 72 78 149
654 149 126 111 196 192 148 147 140 105 326 311 167 10 163 352 629 455 113 193 174 180 114 157 81 26 75 35 107 151 47 53 173 97 161
267 161 144 10 51 147 99 89 90 130 184 147 132 293 106 153 295 43 236 235 94 207 201 178 100 135 175 141 176 73 121 234 167 171
-109A71j0j30P7P7Q3q7l5
$$ plain form
-109 171 161 31 108 185 268 181 146
-191A46
##PAGE=	F1=-13996.4
##FIRST=	25168.397401625570637,	5807.04592319999756,	0
##DATA TABLE=	(F2++(Y..Y)), PROFILE
5807B33j7j07K8q4J8Q1j3N1o3p1P4l6J0K9O0R6m1k4k3p5J31j72O1rl0O1j04J01J4q9k2N8n5
5420G1M7l1o2L6L8J67m8j08K9mn0nR5J6j76Q9k7J64K7k1j25q8J65Q1k00J39q9o2J53k6o1K7
5044A61J13p3j14j9pN4K1l0N5q3R5j55J90M1j82J56j09r3J32K74j03j90N6l2j2J16o9n4mR
4692A44k4l9n8M6J01k2j00J41jj01J17J17j19j25R0l1Q0J0j59P8m8J12P4j01j10N3pm3O5K8
4340A68r8J72j72O8p9KJ06o4k1P0r4J20N1j2q1O2l9k0j4n4Q0l3k8LJn0O1o6J75J35k85P5j02
3953C7K32m8M5j05M9p7Ln0m9J36j06L3N0K2k2J9r2M1K58j51j1o5k5m5Q5l2Pj06R6p1l4J71
3577A95lr7J8m7n1N4k4J20N7J5n9Rp6p2J01RL2o7N5M4m6J24j28r2J37P4n4j26JJ06O2j31N2
3190A92k2m6J17m2j00N8j11J19J07j92P5j11%P0l3N2j7O2l1J8L0j58N7P5J9p6P3M6l0j43Q5
$$ plain form
5807 233 216 109 137 53 71 152 139 190 127 56 130 94 104 133 193 289 248 224 201 126 257 85 146 137 107 168 64 165 179 90 68 126 71
5420 71 118 87 25 61 99 266 218 110 139 135 85 80 175 191 15 104 77 241 268 247 122 34 199 280 80 219 130 68 221 195 134 161
5044 161 274 201 87 68 61 115 136 106 161 78 173 18 208 249 67 223 114 21 153 427 324 134 190 158 146 262 193 139 135 144
4692 144 120 81 23 69 170 148 48 189 188 87 204 321 202 77 167 136 216 226 67 145 97 209 283 182 72 125 118 75 140 168
4340 168 70 242 70 138 59 61 167 103 82 152 58 178 229 217 136 198 159 139 125 71 151 118 90 93 94 44 105 39 214 349 64 139 37
3953 37 269 221 266 161 210 133 136 86 37 173 67 100 150 172 150 169 77 118 376 225 214 149 124 79 164 132 139 33 129 58 24 195
3577 195 192 95 113 66 15 69 45 165 222 237 178 187 111 39 140 149 181 114 169 213 167 291 163 71 208 282 228 102 103 209 271 140 192
3190 192 170 124 241 199 99 157 46 165 272 80 155 44 44 114 81 133 116 178 147 165 195 37 94 169 188 112 185 231 201 58 143
2826A43J47j48J23k41J40r8P7J13l4J2l5j05P2M8j79O2J77j34r1J55rr5LPJ5q4J70k2p0M7
2474A66L3L5J31j49j72R0m2J37j48R2P7J4j76J34n3mj55N6P5%m8L3M9no7l3J08j10K05p3M1
2110B41j24o9nN2M7l4J69O0j64j11Q1l3l7O5%J15K9k25O3J05M5n1k3j20J54j16N7n0N0Rj52
1746B8K01J04l00J13l3L9J08r3k4O6M9j21r1Q7R5q7L5L75k10k15l6J8R0j00pP7N1m1r6M10
1394D92R3m57J60k11m3O1J27m3q2L2o2M3qRL0k4l3l2J25q4l7J78M8k41J50q4M7k8r7O7m9O1
1018A08J21n7KQ2n1p4J50j77n4j3l1J05o5J83k7j12j6nl1J33n7nN8P3k21K19N4j83l5K7O3
654A64j8l7N8Pn4K4J4j9J31mj40j05J26O9K64q7k50K4kPr0N6o5k6NjN8J5m1M8Q8j59Q3M2j44
243D1K1P9o2J3j1P5R7j37l9J71j62R0J31k66J49J1j35J60L2j9r0m1O4k2Q0j15K1R0p0rj1r9
$$ plain form
2826 143 290 142 265 24 164 66 143 256 222 234 199 94 166 214 35 97 274 140 49 204 195 100 103 110 125 41 211 189 119 166
2474 166 199 234 365 216 44 134 92 229 81 173 250 264 88 222 169 165 10 66 141 141 93 126 175 170 103 70 178 68 273 200 241
2110 241 117 48 43 95 142 108 277 337 173 62 143 110 73 138 138 253 282 57 120 225 270 219 196 76 230 114 171 121 171 180 28
1746 28 229 333 33 146 113 152 260 167 143 209 258 137 46 133 228 141 176 551 341 126 90 108 198 98 91 168 219 178 82 492
1394 492 585 128 288 77 34 95 222 179 97 129 67 110 102 111 141 117 84 52 177 93 56 234 282 41 191 107 154 126 29 96 47 108
1018 108 229 172 174 256 205 131 281 104 50 37 6 111 46 229 202 90 74 69 38 171 114 109 167 240 19 238 292 109 74 101 164
654 164 146 109 167 174 120 144 158 139 270 266 126 21 147 216 480 393 143 167 165 172 82 138 73 47 52 51 109 124 83 131 219 60 143 185 41
243 41 62 141 79 92 81 156 253 116 77 248 86 176 307 41 190 201 66 226 258 239 149 108 172 150 230 115 136 226 156 147 136 37
-132C7O9P0Q8j05n
$$ plain form
-132 37 106 176 264 159 154
-191A54
##PAGE=	F1=-14098.6
##FIRST=	25168.397401625570637,	5807.04592319999756,	0
##DATA TABLE=	(F2++(Y..Y)), PROFILE
5807B73lj39k2p6Q1L4LL6l1j06P1rlqO5N3k1ORo0J53j75J08j7j07P0r8M0K8j09Q0J4q5M2k0
5396G7l3N5K1J43m6j18L3L5o1m9J56Oj64M5n7J82J0k5j08o7J31Q9j83K15j00p7Q5l2k3NJ30
5032B75Oj59o4RL9J0n3J02j23J18j38J66N0j98J73j17m5R3K44r5j58K7k6lM7j2j2o5K7j2j2
4669I4k1K1O0pm8J31o1m8J23J15j63j36J09NJ0jj06J4j9J49O3q8j33j3L3l8R8ln2J69j92P9
4293A44p6j7P4p0RJ16j24O8J12j4n1J8l5ln5k5Q5j4m0l2N0k8N2q8J65J32l13J33j23K30n6
3929B24K6r8K7l9j7l6n9J36j25N4mO2ML9j38K9K87j50l0k6n1j1NM8m5n8R3r8j2J98lj33K5
3542A24j8p5O9m8Q8K9N5k5N4j22l6O2j2K9p2P2K1m8R4j53n6J76O2q2j10L4P2P0r7m5J3L7P3
3154B35o6o5Rq6J16J33j66M5r5jP3n1RK0Q9n1PN1j49M8N0M8j48R1P2n9j26P9J54q5Q4k11J21
$$ plain form
5807 273 270 131 109 33 114 148 151 187 156 50 121 112 109 101 166 219 198 204 213 153 306 131 239 222 115 185 87 127 155 46 126 140 55 97 77
5396 77 44 99 120 263 217 99 132 167 106 57 213 219 55 100 43 225 235 210 102 35 166 255 72 287 187 110 195 163 140 145 275
5032 275 281 122 58 67 106 116 63 165 42 160 22 188 238 40 213 96 51 144 388 293 135 162 136 133 180 168 156 91 118 106 94
4669 94 73 94 154 147 99 230 169 121 244 359 196 60 169 174 184 183 77 91 72 221 284 196 63 50 83 45 143 140 88 257 65 144
4293 144 68 51 125 55 64 180 56 124 236 222 171 189 154 151 96 71 156 142 102 70 120 92 144 56 221 353 40 173 50 280 224
3929 224 250 152 179 140 123 87 28 164 39 93 89 151 155 194 56 85 372 222 192 166 115 104 109 157 112 54 147 49 37 235 232 99 124
3542 124 106 31 100 52 140 169 224 199 253 131 95 157 145 174 102 174 195 147 241 88 32 208 270 188 78 112 184 254 157 112 125 162 235
3154 235 169 104 113 27 143 276 110 155 60 59 132 81 90 110 199 148 155 206 57 105 155 203 55 146 218 159 33 112 266 181 265 54 175
2767A75p2O9J43p2k2m2j30J13N3j71L5K20j30j48J67k6o9lP5n5j5J66k2j44M4Q8PJ43j74j41
2415F2J07j18J80j77J35M8j4j60J93j43M3j49P9Q5n4m9J03J4l9mn6R0j28K03k8N4j07r3M3
2075A20l1R9r4J52Q4j79o2M7k8k5O8pJ15N0k29j2J41N8k6l1j19J57j27O6r0J9P6j34J61Q9
1722C08k68N2K7P7Q1j24J0M7L9j07p4Q6J02r9N3M72k77k38m7J4P9j42qJ34Q4j12j20O03P0
1382G22o09J24j74k0N9J72o6o9M0j19J28k5l1J2J1m0n8R4m1m4J38O2k39J59j46J82j29m5J22
1042A70j37P4R0n8J0Q2n7j8J33k15k4l6N1M1m4J59j0j15n8nJJ17n2M2N4K2j63J67nj33qM0
666A15N4k2k8K7Qm0K0M1j4K2J7j03o0J07m9K30rj59Qk6K8j21O7m6JkJ6MNN7P2L2k00O2R0j37
243F7NM8l9N6o5J25J26k24rR0j06J19J19k67Q5L8j25J83O9lr8j03Q4oR0r2QL7p2k9mo7O6N0
$$ plain form
2767 175 103 172 315 243 221 179 49 162 215 44 79 299 169 21 188 162 93 90 165 110 95 261 239 95 139 227 234 377 203 62
2415 62 169 51 231 54 189 237 223 63 256 113 156 7 86 171 117 68 171 185 146 142 86 176 48 251 223 277 170 77 120
2075 120 89 188 94 246 330 151 89 136 108 83 151 144 259 309 80 68 209 267 241 210 91 248 121 187 97 116 192 58 219 308
1722 308 40 92 119 196 277 153 163 210 249 142 68 154 256 157 210 682 405 167 120 134 213 71 63 197 281 169 49 652 722
1382 722 113 237 63 43 102 274 208 139 179 60 188 163 132 144 155 115 57 151 110 66 204 266 27 186 40 222 93 48 170
1042 170 33 107 197 139 149 231 174 156 289 74 50 14 65 106 62 221 211 96 38 33 34 151 99 141 195 217 54 221 216 83 75 115
666 115 169 147 119 146 154 114 134 175 161 183 200 97 37 144 95 325 316 157 165 139 167 46 113 67 68 66 82 86 91 148 220 252 52 114 204 67
243 67 72 120 81 137 72 197 323 99 90 180 74 193 312 45 130 168 43 226 295 292 194 91 175 169 259 167 175 212 140 111 107 40 106 156
-156A56Q6j02K0
$$ plain form
-156 156 242 140 160
-191A60
##PAGE=	F1=-14200.9
##FIRST=	25168.397401625570637,	5807.04592319999756,	0
##DATA TABLE=	(F2++(Y..Y)), PROFILE
5807B97Mj49o5k2Q0moM6k3q6N1Lk0m7P1J1QL8M5n9J66j67J38k3j74O1n6l2M3j02J49l2j01
5420D3K6Lj6P2lJ06l5r0J9N7m2j16K04Jj37K2j01J82k5j8q6j5O0P1j32K74p7j03K6l3jj6J40
5032B60R3j95j20L5RJ3o8J27j41J31j17J16Q1j77J54j07J1L2J94n7j42K4l8J7l7L0M2j23L9
4692H6K5nRKJ2J7J8J12j31lJ22R8j81j32J04J8m9J6p3k0j8J71O1n3j08k4M0q2Q6j6NJ49j67
4305H9M3n2j5L8%k7J46q3o5J67pn4k2j8J8q9j0R9j4l9l9O4nK8n7J23J14l02J56j38K16n8K
3917B09p2Pql2k2p1J29j29O7l6P5M5N2j66kL01j43m4J1p7L0r2J26r0nP7r3rK28Oj73K2J5j05
3518C1J01o7M7J3P1J1P8j39j4M4l6J1q7J09oj6L5j64J1J62K9j03m9L6L8O7m8j36O4R9K8r0
3143A30l8l3m4J18J40j48K6p8j5O0o2NL3Q1l4kP0j25M9L9L2j56P6O5m4k9j9J51m2L6j73R1
$$ plain form
5807 297 301 152 87 65 145 141 135 181 158 72 123 126 106 59 130 141 149 187 232 173 339 172 310 287 113 174 118 86 129 27 176 144 43
5420 43 69 72 56 128 125 231 196 106 125 182 140 24 228 229 92 114 13 195 170 152 66 51 111 182 50 324 247 144 170 137 136 120 260
5032 260 353 158 38 73 82 95 27 154 13 144 27 143 224 47 201 94 105 137 331 274 132 156 118 135 98 128 170 47 86
4692 86 111 106 115 117 129 146 164 276 145 142 264 362 181 49 153 171 122 138 65 45 27 198 259 206 98 74 114 32 118 102 107 256 89
4305 89 132 80 65 103 103 76 222 139 74 241 234 180 158 140 158 69 59 158 144 105 66 130 125 153 96 219 333 31 187 49 265 207 209
3917 209 137 144 136 104 82 11 140 11 78 42 117 162 214 48 46 347 204 160 171 94 124 32 158 68 63 140 47 38 266 272 99 121 136 31
3518 31 132 65 112 125 196 207 285 146 132 176 140 151 64 173 167 151 186 22 33 195 224 121 72 108 146 213 165 29 93 192 220 130
3143 130 92 59 15 133 273 125 151 73 58 118 56 61 94 175 141 139 209 84 133 172 204 48 124 189 145 116 97 248 206 242 69 160
2767A60k2Q2J37j19n5l1j28J21P0j54pK38j20j57J50m9l8K6J10r0J6J48j2k06M7J12mJ30j73
2427A82j12J29j61J75j86J72K9n2j29K16k16J28j71J07R6j15rJ26k6p1P7r9P6j32J81pJ19
2110C27j18q9O4r6J39j44J04J12j87J7j7qj5O7l6J29N4k07o3J43O5J0k8j30J45j07O5j13k1
1769F2J14j02J32O5k06l4J29O6M9j41L3L7L1q1o7Q4J13j06N3N06l25k15n8J7O4j53k8J86J06
1429C31j69j18P09M0o98Q2j26J1M1K13p8p0P6j59J66l9n6rL6m0m5K4mPO1M4k00J24q4K01j87
1065H4j7J68j29K0J6n7L6Q1o9L1J05k18K0n0Q3lpJ15j2r3l2l4j4J01J6K2L7k2q0Q0m9p5K3
678G7M6L9l8MMLlj8O0jp9L1k6m6J13r3J30L4q9K5p4N8j48Q5k7J2K6J7n6J4J36R2m7k02K4J24
255B07j23pJ4J3O9j18J75J52k82O7p3k8J28J12k20j4P3r9J61J00J9j04j01O5MO8o2J7j2p9
$$ plain form
2767 160 138 220 357 238 183 152 24 145 215 61 54 292 172 15 165 116 78 104 214 124 140 288 276 70 117 229 225 355 182
2427 182 70 199 38 213 27 199 228 176 47 263 47 175 4 111 207 92 83 209 183 112 189 90 166 34 215 208 327
2110 327 209 120 184 88 227 83 187 299 112 129 112 104 89 156 120 249 303 96 33 176 241 251 223 93 238 131 196 83 62
1769 62 176 74 206 271 65 31 160 226 275 134 167 204 235 154 87 171 284 178 231 737 412 197 139 156 220 67 39 225 331
1429 331 162 44 753 793 95 177 51 62 103 316 238 168 244 85 251 212 156 147 183 143 98 122 118 125 186 230 30 154 70 271 84
1065 84 67 235 106 126 142 85 121 202 133 164 269 51 71 21 104 101 94 209 197 104 72 38 24 125 141 163 200 178 98 178 129 54 77
678 77 123 162 124 128 132 135 132 114 174 173 94 125 99 53 166 73 203 237 148 173 99 157 9 94 67 79 105 122 66 80 216 308 261 59 83 207
255 207 84 77 91 104 173 55 230 382 100 167 94 66 194 306 86 72 145 46 207 307 326 222 121 186 190 258 196 213 201 122
-97A22m8Ok1N0J3R1p1J9
$$ plain form
-97 122 74 80 59 109 122 213 142 161
-191A61
##PAGE=	F1=-14303.1
##FIRST=	25168.397401625570637,	5807.04592319999756,	0
##DATA TABLE=	(F2++(Y..Y)), PROFILE
5807B96Kj35p8mO9k8k9Q9m7l7L5lk2p8O0k2L9O4P7o6J70j54J42k1k20M7Pp7L1m5J52o6r8j1
5408C9M8k8P4k1N9j3l0pO4J3j44J63j0r7L0j10J37q6kk8K6qJ1k2K65l5j28j9j6Jl9J33J78
5021C98k16j67O4l0L1l9Q8q4R5o6K1J13j57J36q1L9qJ22Qj46O5q3N0m6k6J00j45M4M7k3L5
4657A39j8k5M1O2J04j86L4J14P0j76j21Q1J4p8L8oJ5o7J11P2k5m0mNq3Oj0N8J23j15l0j3K
4269I2J9M6o0J61m6j55J79lp1m7PL5r4j9J15l0k7k2M5Q%j2Q5Q9k51J26j15J77n8l0l5jJ3m0
3870H1no1J04q1J4K4J1Q9M4j62m0K84j30n0M2j00O6q3Q8j03L0M4m6k4K51J9k12OM9j36J48
3506A61q3J0J2O7L7P0j27lM3n5pj19J70k6L8m3o6QQ5j5j16M9LON4Qj21O2J13j4j16j7l7%J27
3096A58J22j51J8o6k3J8k4M8MRLPQ0r2O1L2k0j12N8J3LL2p6J37k2j6j31N1M4R0J13j59q5l
$$ plain form
5807 296 298 163 85 81 150 122 93 182 135 98 133 130 108 30 90 68 107 171 248 182 352 198 340 319 99 146 153 76 107 62 214 148 50 39
5408 39 87 59 133 112 171 158 128 121 185 198 54 217 207 110 140 30 167 81 79 51 77 69 80 58 323 288 160 141 125 126 87 220 398
5021 398 182 15 79 49 80 41 129 45 140 74 95 208 51 187 106 145 137 259 267 121 186 103 153 107 81 181 36 80 127 104 139
4657 139 121 96 137 199 303 117 151 265 335 159 38 119 133 55 93 87 102 35 146 218 193 153 149 154 71 77 67 125 248 133 103 90 92
4269 92 111 157 97 258 212 57 236 233 162 115 122 157 63 44 159 129 102 80 125 133 133 121 206 295 44 170 55 232 174 144 109 108 121 81
3870 81 76 15 119 38 52 76 87 176 220 58 18 302 172 122 164 64 130 47 135 32 62 106 60 36 287 306 94 100 149 13 161
3506 161 78 88 100 167 204 274 147 144 187 132 125 6 176 150 188 145 79 87 172 157 41 90 93 99 153 161 40 102 215 201 85 68 31 31 158
3096 158 280 129 147 81 58 76 52 100 104 113 116 123 203 111 172 204 184 72 130 143 146 178 102 239 217 201 70 121 165 255 368 209 124 121
2697A21o0N7Q3j34l0K23j01j38J20o5%N5J13j01K0J19Pk45O4R9JR4j42r6J53j38J03j43J53
2356A92J2p5q2J91k05J70j84J12J01j51K9J17n7o4J18j44O7j19J41KK04j41o8N4j42J68j51
2039I5J4J40j93J15j01K4nN4n7J50L8j84o6J05O4N6j6j48J23o4N0j01n1R8q4J42K1j39n5J76
1687B01L7J6j43M0M5K5o0o1Q2J29j11L3M73l47j46o7K1M4j08n4K02J12k09r9P10J2o98L5o3
1347E1L2K8K36q1r3J31j84J63m1p1j6M2l7k6l0J0N8%J5j45N6N6J44k04j8J93j03k7n7LOP3
971A64o4N3P3j90N8p0Q5j1J4Q8l3n7mn6l8R0Q4k7K4o0Rqn0l2L7M7J5n8M6j0%M5q2P4J4j04
549F6j1O5n0J40j02K0M0n3N4j19Q7j03N5j6J4N7J7p3J9J65J06j36j87%J44j07j0j6O4N2j43
185C9K04J80l20J37k26M0J19J13j51q9Q4o9J09J20M7j11n2K0%L7l0L0m0q4n7J0L2K0l4J13
$$ plain form
2697 121 61 118 201 67 37 260 159 21 141 76 76 131 244 143 163 282 289 44 108 207 208 302 160 64 217 79 182 39 192
2356 192 204 129 47 238 33 203 19 131 232 81 110 227 170 106 224 80 147 28 169 171 375 234 166 220 78 246 95
2039 95 109 249 56 171 70 94 89 143 86 236 274 90 24 129 193 249 233 85 208 144 194 93 42 140 56 198 219 80 25 201
1687 201 238 254 111 151 196 221 161 100 182 311 200 233 706 359 213 146 167 211 103 49 251 363 154 55 765 777 79 114 51
1347 51 83 111 347 266 173 304 120 283 242 171 155 197 160 134 104 114 172 172 187 42 98 154 298 94 76 269 166 139 82 85 91 164
971 164 100 153 226 36 94 24 109 98 112 200 167 110 106 50 12 102 186 159 183 123 132 124 74 42 79 126 141 83 129 119 119 164 82 156 170 66
549 66 55 120 70 210 108 128 168 115 169 50 137 34 89 73 87 144 161 88 107 272 378 242 55 55 199 92 82 66 130 182 39
185 39 243 423 103 240 14 54 173 286 135 46 130 61 170 290 337 226 174 194 194 231 201 231 191 107 50 60 92 112 78 191
-167A91k7o
$$ plain form
-167 191 164 158
-191A58
##PAGE=	F1=-14405.4
##FIRST=	25168.397401625570637,	5807.04592319999756,	0
##DATA TABLE=	(F2++(Y..Y)), PROFILE
5807B68j1j00n5l1N4m2m3J53r8K2L0k3%q8J8k6N1P4R7p1J63j39J20qk32M4N6q3qKJ48q2q6
5420G4o4J10o2N1k9J0J8M4l0O0R2j55O8l7n1N9j10J05j09JN0J3j0o6O5J87J3j43n0K7j4o5
5044E2J06K43k14j61O5p3N5rM0k4O6nk1P0j49J28m1L9l6M8Q3j69J37j36P8K2j53J49j33N1
4692A08K7m9N5l9m3N9P7J02k07O5J01L3j55j01M7Kk4L1P5J9r3qQ7k1N5Mm1n8o8J3R0J01o5
4305A79j16L4J8J0N3p8J69j3j60J16nq1m4K1M0p2l5J21m7j3oK5Kk3K1O7O9j81O1k9R0n7o8
3917F8pJ5L1m1J2l5P8n4m8J03l5J13J0j28m9K09j09m5O4r5O1npl3j6mM3m3K45K4k37j8P8j19
3518B6J58q9k2J8O2M0L1r1lO6o5j6n3J26l1Q1j15K2Mko5l7O8m1k2L3O1o5M5J09m7j45K2J1
3119G4l2J63R5j68J6o6oo0R4N1j5j09L9L1Q1m8P1J6q3l6M6n7L6O9q9J23k5o1r1J1J10Q5Q0
$$ plain form
5807 268 257 157 102 71 125 83 40 193 95 117 147 124 124 36 54 28 79 153 250 179 342 203 323 315 83 127 183 100 92 94 242 160 74
5420 74 10 120 58 109 80 90 108 152 122 182 274 119 187 150 99 158 48 153 44 45 95 108 98 32 97 284 297 154 104 131 117 52
5044 52 158 401 187 26 91 18 73 64 104 80 146 141 120 190 41 169 128 167 131 179 262 93 230 94 172 194 41 190 57 108
4692 108 135 86 141 102 59 118 195 297 90 155 256 289 134 33 80 82 58 89 164 183 90 82 169 148 203 207 166 108 40 53 143 244 179
4305 179 63 97 115 125 178 100 269 256 96 212 207 126 82 103 143 71 36 157 110 97 91 116 118 95 116 183 252 71 132 103 193 136 68
3917 68 61 76 107 66 78 43 121 67 19 122 87 200 210 82 33 242 133 88 152 57 118 113 106 73 57 53 96 53 298 322 85 67 145 26
3518 26 184 95 73 91 153 193 224 133 130 196 131 115 62 188 157 238 123 145 149 147 82 45 113 72 50 83 144 79 124 233 186 41 63 74
3119 74 42 205 300 132 148 82 76 16 110 161 146 37 76 107 188 140 211 227 144 108 154 97 133 202 113 236 211 150 59 70 180 265 345
2732C45j84j04L0KlQ7j06j8J69o9j39J07n0L7N0R3j01J3P8L6k35Q1M9J7N5r5j00J72r2K7q1
2368G1R0mn7m7J28q0J19j85J08R2j61N4R4o8pQ8j74N7r1Q7L8K51j64l8K6j76J88j03j05J56
2016A87j71J91j78N0OK2rJ31J0j67l3L3N5J06Pj69J07j8K6n6r1O3q1J72m1p5j0J50J3j1j35
1652H4L5P1J9n7m8Q0J46j14lL89l41m4p6K0K4l5q2K08R5k29p1O14j0n95k6J3M0K4K32p0j45
1288A48J91j96J35k9p7mK7l1rn0oR5m4Jr6k8K08P4k05l4J97n5p5n1P4j02N8j4K1M8j39P5p5
901C2M9J8J5P3n8k0Ln9m2Q0J13p3K5r4R3o8Pl6J8N1j4p7Q0j7NR4j59R8J3m1q1J19n9J66j45
490A09k2L9o2Q0j15P6l6J8%J3O7K3o1J4J62J14k25j49JJ43r3rl5R7J3j20J90K10l47J96j99
126I2o0R9J25q6j11O2n1M8J27P7j13J1l0j7K0KK7m5q3m5lP6rq5J62ml7
$$ plain form
2732 345 161 57 87 89 86 173 67 49 218 149 10 117 67 104 154 247 146 159 237 273 38 119 168 185 240 145 45 217 125 152 71
2368 71 161 157 100 53 181 101 220 35 143 235 74 128 222 154 147 235 61 118 27 114 152 403 239 201 227 51 239 136 31 187
2016 187 16 207 29 79 85 107 98 229 239 72 39 72 127 233 240 71 178 160 186 130 39 102 21 193 152 77 67 217 230 219 84
1652 84 119 190 209 152 104 184 330 216 213 602 261 217 141 161 185 150 68 276 371 142 71 685 675 80 54 67 107 131 363 293 148
1288 148 339 143 278 249 172 168 195 164 155 105 99 194 150 151 55 27 235 309 104 70 267 212 137 86 160 58 116 102 123 171 32 107 32
901 32 81 99 114 187 129 109 112 53 11 91 204 131 156 62 155 87 94 58 76 127 113 36 116 99 104 198 39 137 150 109 28 147 88 254 109
490 109 87 126 64 144 29 105 69 87 87 100 167 190 129 143 305 419 194 45 46 189 96 87 52 149 162 42 232 442 95 291 92
126 92 32 131 256 170 59 121 70 118 245 322 209 220 190 173 193 195 222 177 94 49 46 122 113 28 190 186 149
-191A49
##PAGE=	F1=-14507.6
##FIRST=	25168.397401625570637,	5807.04592319999756,	0
##DATA TABLE=	(F2++(Y..Y)), PROFILE
5807B12k7n6rp9K8m4L9J47j62Q1K7m3K9j01JJ3QO7J04o8J47j29Q1J3j96N8O4q2l4J9J52q1
5431A79p3q8J38r2jl3J9QJ09l7N0J74j68l7n9j8Q4j01J05l2rL1j1J0l2J4Q5N5j44o5R0l8o2
5044E1L1K75j80j15M7p6L8lK7J2L9O0kl6j31J06PK1o6jJ45k00K18j71Q1R8k49J75j29O7pp0
4669F2O0n6l9O1O9J02j94R3R2j2j30o5J7NM1M1J02kj11j09R9n1J61Kr4k2q6J9J04R0l2j78
4293C9O3K7OK6q3J70K0j06Nqo5k0PL7m8l0J14n5pLJ7j8m1K8O9O7j13J7N4j7n6p1k4O1M9m6
3870G1K4j8O3n8m1J08m0J18m0p3o2J18o3l8P6m9lO2o1K9o9k5J16o1K14J4k39k9Q6o1J30q1
3495A18m6J4P3K1k5m1j5J13o3k3LP3l1J07j71Q1J6p8r8Q1J7p4m3OJ00l0M3J15n8j63P7J8p6
3107D1K07P0j72Pp1J6l6J17L3k1j35l1O2Q3lP2rj30N6K0q1KQ9p0J13m4r2n3J1J34O6M4j89
$$ plain form
5807 212 185 129 120 41 69 25 64 211 49 130 157 114 143 42 43 56 64 131 235 167 314 185 266 279 83 141 205 123 89 108 260 179
5431 179 106 18 156 64 63 30 49 57 166 129 179 353 185 148 89 71 155 54 159 127 118 149 138 148 116 130 215 270 126 61 151 113 51
5044 51 82 357 177 62 109 33 71 68 95 107 146 206 204 168 37 143 150 171 105 104 249 49 267 96 177 275 26 201 72 139 132 62
4669 62 122 66 27 88 157 259 65 158 250 238 108 43 60 65 106 147 249 247 136 27 126 75 236 238 144 122 36 55 159 249 217 39
4293 39 102 129 135 161 78 248 268 162 167 159 94 74 81 118 70 40 154 99 92 95 112 94 53 81 150 217 104 121 175 158 102 31 7 68 117 71
3870 71 95 77 140 82 41 149 109 227 187 114 52 170 107 69 145 96 93 155 94 123 54 29 145 84 298 312 73 44 130 69 199 118
3495 118 72 86 159 180 155 114 99 212 149 126 129 202 171 278 107 188 204 126 28 109 126 52 9 15 115 85 128 243 185 22 99 117 41
3107 41 248 318 146 153 82 98 62 179 212 191 56 25 87 170 167 239 230 100 156 176 95 97 186 116 229 185 93 40 51 185 251 295 106
2720A06n9MM4l8Q1p2%J26l7j36O6JN9J8O3j00MK8P6j57P4l1M5M2o6j09J68m0k0n1J7j1J5n4
2321E6N7M8O0j67Q7P0j56P9O3n7N7K1j62J9n0K8J18K24j76plj87J89k2j17N6n4J54j44j8J4
1957H0j9R9O8j3j42ln0L3J50L7j81J06J1lRj62O0k7J38j06k7L1J14mk5j17K5J07J0p1k4P5
1582A79J57j16m0K82l22P4q9J4MM4j16K23O5k34l9M50k4m03r7P4M9K1K06m6k21K39j87R8j4
1241B31o6J8jk3km5l3J13p6J7o9kK38Ok03n1J85Pj20K6Q4k08L8O0m6L6p4P0p0KO5lN8p8Qo
819H6k9k8O2J01r3L7j12J45o7J9l7j6O6k5p1N3k0J5J35k08J30l2K5p5J16q2J83j91lL7r7P9
443A03l0%K5k1L0J1M8L9m8OJ45J13k93p2QJ18q2j0m4J13m0o9J52K40l51K19j47j43N3J50m2
79A81j19M9m5rJ22J06j03O5p1l9L0L1ol9o7l1k0R9k6q6J83qo5
$$ plain form
2720 106 47 51 95 57 138 66 66 192 155 19 85 86 145 163 226 126 130 158 234 77 151 120 165 207 141 32 200 160 140 89 106 95 110 56
2321 56 113 161 221 54 141 211 55 134 197 140 197 218 56 75 25 53 171 395 219 212 209 22 211 189 72 128 74 228 84 66 80
1957 80 61 160 228 215 73 70 20 53 203 240 59 165 176 173 182 20 80 53 191 85 58 89 203 199 174 57 82 189 199 128 104 179
1582 179 336 220 180 462 140 214 125 139 143 187 71 294 359 125 86 536 512 109 12 86 135 156 362 316 95 334 147 245 231
1241 231 165 183 182 159 157 112 79 192 116 133 64 62 300 306 103 52 237 244 124 150 234 26 64 124 78 114 40 110 40 42 107 104 162 84 92 86
819 86 57 29 91 192 99 136 24 169 102 121 84 68 134 109 38 91 71 86 221 13 143 111 136 61 177 95 278 87 84 121 24 103
443 103 73 73 98 77 107 118 166 205 157 163 308 421 128 56 64 182 100 90 46 159 119 50 202 442 91 310 163 20 73 223 181
79 181 62 111 66 57 179 285 182 247 176 137 167 198 192 153 86 55 35 134 108 22 205 197 132
-191A32
##PAGE=	F1=-14609.9
##FIRST=	25168.397401625570637,	5807.04592319999756,	0
##DATA TABLE=	(F2++(Y..Y)), PROFILE
5807A40m7rM4q4l6M9P8R1k03J16J9n4N0j20K2L1k9N3R3m7J20j31M5L5j23O7M9r3l3QJ65o5
5431B01o4r7J43j07m0nR4q2J19k1M0K33j74j20%m7N1p4J23K0KJl1J4j0k7j3Q3j26l8J30o6
5056A12j4l7K11j14n9L0p5J6j3M8J6RJ22K9j38r0N3N5oq9mJ61k17K83j67M2J66k90J73j35
4704G8Q0l6o5L2p2K8ON8Q8j48J12R2o0j05l0J3J8M5P8J02l4j15j51R2r1K35qj44J0o7J8J12
4328A71R6k3j74L6K9J2l0q1J58O3k0j27lk0rk1K7k7kR6m3k1J9J5m4n3J7O9Q6o1L9O8j11m7
3929H4J0oRN5o0L2j2M5p4QO8l3J21q3k3q0L2K8n2P6oo5J02p1M2r5K4J16p7J67j1k08j6O6n
3518A08J05p2n8JQ6qn7%m7J73m4m6M2K4l6J28k09J12M0j30n5R2k2r4LJ1L7j4M0J33m2j58R4
3131A37Nj02K32M9j53op3J7K3J09Nl0j03q5M4Q4L2O3l5j37J27k3n0p0P9l3J07p2r9k5P6R4
$$ plain form
5807 140 93 84 128 44 8 57 135 226 23 139 158 104 154 34 56 87 58 111 204 157 277 146 191 226 103 170 219 126 93 101 266 201
5431 201 137 40 183 76 36 31 125 43 162 141 181 414 240 120 120 73 124 50 173 193 195 196 165 179 169 142 129 212 86 48 178 112
5056 112 98 61 272 158 99 129 54 70 57 105 121 130 252 281 143 53 106 161 155 66 62 223 6 289 122 164 330 40 213 78
4704 78 158 122 57 89 17 45 51 109 197 49 161 253 193 88 58 71 89 134 212 314 280 165 14 106 15 250 242 98 108 41 59 171
4328 171 267 244 70 106 135 147 117 36 194 257 237 110 107 87 78 57 84 57 55 151 108 87 106 121 77 24 41 110 196 135 174 242 131 84
3929 84 94 88 97 152 92 124 112 157 83 91 159 126 247 164 141 61 93 121 69 145 139 74 176 105 147 52 76 192 115 282 271 63 47 113 108
3518 108 213 141 83 84 170 162 105 105 58 231 187 141 183 207 171 299 90 202 242 112 57 149 127 33 36 47 84 70 110 243 201 43 137
3131 137 142 40 272 321 168 162 89 106 129 238 243 213 110 25 69 153 185 248 213 76 203 180 130 60 139 106 213 141 42 17 93 187
2755A87L3Qj67L9q3O9n3P7n2J3J20k4j08j4N8P5k1K9j00J1k7J17o0O9j26Q7O9p6j08J28J0
2391A80l2o4n3K5R2q0K8J09Oj31M6L6j32J00K9l1J04n6r4o1j%J80J43j75K3j6j22J19O1r0
2028A43m3K6R7o3q4JrJ55Kk1j09J0n6JJ13P0j85J23J4k5P3j74QL7Q6j24l8O5P0j4k4p7KJ38
1628A88Lp4pN7J61j17o6J86l03J79j02Nj6J09j47K44L0k24pK66l8j74j01M1P2J1J67j0l07
1288B6K62j50O2qm1M4l7mj3l1n2J13q5N1o9O8K04m6j98o8J68O9j52R3O9k70J9J06j03M0qM6
912A05o8K2O6l8L5q3K0j6L1j9M0N8n9L5p0J15k8k9mn5J01kq1j6k5L7J53j63J21j16P0m8J24
525B13j27J83j84M1J5p7%M8m0M6n2O2QNO4m5NJ20J02l28K7MQ9p0j6m6J15r0k8J20K58k97J74
138B99r5j57k3J73k9j25N6m7l5Q8J27p1R0r2m1M1N4n9l8l2l0k9J00k7l6J57k7q7
$$ plain form
2755 187 220 228 61 100 17 86 33 110 58 71 191 167 59 45 103 178 157 186 86 97 70 187 127 196 70 157 226 150 42 170 180
2391 180 148 84 31 56 148 68 96 205 211 80 126 162 30 130 159 128 232 176 82 21 20 20 200 343 168 191 175 53 172 233 143
2028 143 100 126 223 160 76 77 68 223 225 204 95 105 49 50 163 233 48 171 185 160 233 59 67 104 190 66 28 93 163 149 125 48 50 188
1628 188 191 117 110 167 328 211 145 331 28 207 105 110 94 203 56 300 330 106 99 365 327 153 52 93 165 176 343 333 26
1288 26 288 138 200 192 151 195 158 154 141 110 58 171 86 137 68 136 340 294 96 28 196 265 113 206 275 5 24 130 27 67 59 105
912 105 37 59 125 87 122 39 59 43 74 55 95 153 94 129 59 174 146 117 113 58 159 157 76 60 35 72 225 62 183 67 137 89 213
525 213 86 269 85 126 141 64 64 112 72 118 66 128 136 141 205 160 165 285 387 59 86 90 179 109 93 47 162 72 44 164 422 125 299
138 299 204 47 24 197 168 43 99 52 17 105 232 161 251 159 118 159 213 154 116 84 54 25 125 98 62 219 192 105
-191A05
##PAGE=	F1=-14712.2
##FIRST=	25168.397401625570637,	5807.04592319999756,	0
##DATA TABLE=	(F2++(Y..Y)), PROFILE
5807G3p1L5Q2k8kM7O1L3j95J13km7N2j17L2M8o0M8O5kP8j48L7M3n0O5M0j24mk2J79l8n8j03
5408F0J32j10kJ7R9j28P4J1L1K56j63j58Q7q0n4k9J45L3L7k5m7mLn4q7Q8o5L3J09r9M3mJ6
5021A65l0oJ5q3Oj6O4Ok6J71N6k05n1qR9l4m8RJ03j25K30j23l6K23k90J58j36P9n4l0j9k7
4645C7N5o5O1M0q1J16R2r9p5j2J2J6L5J24Q3n9j00j43R0l1J50k2j51J0n3M1J06J13l1j46m
4281A09L2K8r2n9J04J17P0k35JK0k7k9OpL7P7j3n4N3Pp1m6N4j5J19k7Q4M4j79k4O3K4l1N1
3882A91p5M1j2K1r4O5K3l2J25j03Or7l1J35q5O5K0r0J12o9K1r7P3J10q5J14m4j55oN8L3R0
3506B28o2o0k2Q7l1l1Pq6K12j6q0P4k7m4J52k10R8O5j55nP0m5r7M1L1j9qJ3J47%j62Q9j0r0
3107E4K15L3j15j4o4j4Q1J02k3n0p6o7JP9M9M4m5j14J61p4j2o5rJ4J02q2m5n5J32M9qk6j13
$$ plain form
5807 73 2 37 119 91 89 136 197 230 35 148 146 99 151 34 66 114 54 102 167 165 243 95 132 175 125 190 230 106 102 80 259 221 163 60
5408 60 192 82 80 97 196 68 142 153 184 440 277 119 206 126 72 43 188 221 258 233 186 182 185 131 44 132 67 100 209 110 153 149 165
5021 165 135 129 144 61 67 51 115 121 95 266 322 117 66 58 157 123 75 84 187 62 292 169 133 356 66 224 88 167 113 83 64 37
4645 37 92 27 88 128 47 163 255 156 81 69 81 97 132 256 339 280 180 37 127 96 246 224 73 83 30 71 177 290 259 113 109
4281 109 141 169 77 18 122 239 309 74 75 95 68 39 45 38 75 152 139 85 138 145 74 28 82 67 186 159 243 287 108 84 147 171 140 191
3882 191 116 157 145 166 72 137 160 128 253 150 156 59 28 163 78 143 163 73 185 116 137 40 113 223 138 252 208 53 47 105 138 228
3506 228 166 106 84 171 140 109 116 30 242 226 146 220 193 149 301 91 189 254 99 94 164 119 22 63 94 75 67 80 227 227 65 154 144 54
3107 54 269 302 187 173 109 95 176 278 255 205 129 62 63 142 191 235 190 76 237 163 151 86 77 91 193 111 66 11 143 192 184 158 45
2720D5R3j04O2o9O5m1J6J35l5o6o3P3P8n2Lj07P0j9O8K1P1k13J31J07j02j12P8N3k6r8%K7
2344H9R8q6N3P5l2p9j2pm6O8klJ26j23np3jL9J30M4j64N5j1l7L3J26n5p5L4L1L5j14l9N8J36
1934B66n3k5p8K0l1K4kR9j80J41kk7J16j36q6R8M6q3q7O6K4j4j9j0l7J49Kl6k0K5J55j12p4
1546A19J40j81J14j07Pl6J37j63K61Lk04K0J26p1L0j01j0J09pJ24K7k79J57q8M5l1j4O9o6
1206A30K4l8k1n8J05n3O2q1J20J57p2j70r3J52J13j62J19M0k63K4P4n9j0N1J7q5P4N7q7Ol0
842D3pK1M6j5PQPJ3l6Q2J7j06O7r4J47L2j29p7j0N8J36j02J28j73N6qJ40j83J59j06N0nn9
455A07n7Q2k6K3m3O1Mm8Q8n1K8Q4P8l19J01MN8n2j9l5R7r1m8J06K53k01P9n2j35j3J18l8j21
67B2N9n2M0k4J27k1Q3q5j2J7O5r5n6K4m9k2P5j4NJ33m7j02
$$ plain form
2720 45 138 34 96 27 92 51 67 202 167 101 38 111 189 137 140 33 103 84 152 173 244 31 162 269 167 55 133 186 160 62 62 89
2344 89 187 101 154 229 197 118 106 99 53 121 119 116 242 119 114 41 40 79 209 253 89 144 133 96 129 255 200 125 159 190 225 111 72 130 266
1934 266 213 188 110 130 99 123 121 220 40 181 179 152 268 132 46 144 190 107 20 86 110 96 77 67 30 179 181 145 125 150 305 193 119
1546 119 259 78 192 85 92 56 193 30 291 294 90 110 236 165 195 94 84 193 186 310 337 58 215 127 172 141 127 196 130
1206 130 154 116 95 37 142 89 151 70 190 347 275 105 12 164 277 115 234 274 11 35 109 50 40 91 108 23 97 154 67 73 43
842 43 36 57 103 88 95 103 110 123 87 169 186 80 147 53 200 232 103 26 16 74 210 108 236 63 119 111 251 68 227 121 171 166 107
455 107 50 132 106 129 86 147 151 103 191 140 168 252 330 11 112 116 174 122 103 68 165 74 26 132 385 184 263 211 76 63 181 143 22
67 22 81 29 69 45 172 151 234 149 137 154 219 124 68 92 43 21 96 82 87 220 173 71
-191G1
##PAGE=	F1=-14814.4
##FIRST=	25168.397401625570637,	5807.04592319999756,	0
##DATA TABLE=	(F2++(Y..Y)), PROFILE
5807G6lk3M6L6K9M4L3j9j76J15k6l0L6p6KP5r1N9L2N6K4j81Q5J5JM9N5j77M9m4J67mn3j00
5408H1J00j04N0L2P4j50L1M9K0K40j33j51J38r2j68L2J52J4Q3l5o5m0J2o5n9nO7N4P4j37J05
5044B04M2j71L1L9Pr8QJ6M2j4n8J97O9k19l0l6J17o3O0k1K6m1J74n9j27K67k60J30j23O3o4
4680A08Ml2J6M8p9L5l2j5J10Q2j18l8j2jpL3J63N5o7p1j13J03mO1l2q1k3p5P7Q1J36m6j22
4293A44k9M8L6j14l1%J75J33k60l3K4n2Ok8K2M7O7K6r7J02qr5l2R4j19J50mJ19Ok15J2Q8O1
3906B43o6M3q0M3j5%j11J15om7J21r6J6j09JJ52j21M1L4q3J16p3k3p6J11R7p7O5q0q7j5Q4
3530A17M3Q2m6n8n3P4m5RRq8J85J9j13J01p7m4J75j72L9Q2j51L5L6n0q0N0M4k8ll3J35N6j70
3143H0O2j9m9J67K3o7j3m1o7J17J00m3p7o5l1qO3N1K4l7r5J75j21J2lj15O5J00m2j5r1J46
$$ plain form
5807 76 73 50 96 132 161 205 238 219 43 158 132 102 138 62 64 139 48 107 139 195 219 38 123 138 139 188 243 66 115 71 238 234 181 81
5408 81 181 77 127 159 233 83 114 163 183 423 290 139 277 185 17 49 201 215 298 263 198 158 170 105 46 41 108 162 236 99 204
5044 204 246 75 106 145 152 54 62 78 120 106 48 245 314 95 65 29 146 83 143 122 148 107 281 222 95 362 102 232 109 172 108
4680 108 112 80 96 144 65 100 68 53 163 245 127 89 77 76 69 102 265 320 253 182 69 172 168 229 197 116 93 18 95 176 312 266 144
4293 144 115 163 199 85 54 54 229 362 102 69 93 41 47 19 41 88 155 181 84 186 178 83 51 145 26 176 172 291 297 82 94 182 243
3906 243 177 220 140 183 168 168 57 172 166 119 240 144 160 51 52 204 83 124 158 75 191 118 95 19 130 227 150 215 135 48 33 117
3530 117 160 242 196 138 85 159 114 123 132 44 229 248 135 236 159 115 290 118 157 239 88 123 159 109 29 79 123 95 92 59 194 250 80
3143 80 142 123 74 241 264 197 184 143 76 193 293 250 173 108 77 69 132 183 207 170 75 250 129 141 138 23 88 188 146 131 40 186
2767A86J7n3n4m6R8p4P3r6K8plJ33o1nm1K3N5o5jp3J17J0k7O9Q1k51J40J29j14j32M2P9j6
2380A61q8Q0k4Q3p0P3J7m4k3p4n3N5J2j9J5J29j69P4l2j4M9N4m9j17O5J1K2l9J66qo7ol1J25
1981B64j15q7J29Q9r1l5n2L4OM8q7R6j47J30k7mJ27p9j56J25K5m9q7K6j9K2k4L1n1J14J2J9
1605A87m4rJ39j05o0J43j08K1r6L2l5R4j50K60rj79M1P9j29J53r1p4J54l2Q4N5j99J3mM9p9
1241A01pR1q2N4o9j8n4J00nM9q9J43J05p2j08j14J25J29j55J06Lk25N4K2K7o8R8pr1O8P6j43
866D4oN5j4M2J5j2l5l3N5rmN5N8j90J58j26J94N9j88j00L7L5Q7l4J37j79oL4J60k10Q7qL4
478A92qm9p4O7J3rPK1Jq3Q9o1Q7M0L9k53J01J7K6l1ok3O8n1p3P1K11r1l0k3r1J5N8m4o1%m2
44B0R7p0O8K2O3n4J8l4O9r1q5Q1p8RK4NK9J08n7j08
$$ plain form
2767 186 203 150 96 50 148 74 147 51 79 72 69 202 141 136 95 118 173 108 107 34 151 161 134 203 284 33 173 302 188 56 98 177 161
2380 161 73 153 129 212 142 215 232 188 165 91 38 93 105 86 101 230 61 135 103 89 138 192 143 26 91 102 124 85 251 243 176 170 139 264
1981 264 149 62 191 280 189 154 102 136 142 190 103 199 52 182 155 151 278 199 43 168 193 144 57 83 64 86 62 93 42 156 168 187
1605 187 143 134 273 168 108 251 143 164 68 100 65 159 9 269 260 81 122 201 72 225 134 60 214 182 266 321 122 135 131 180 101
1241 101 94 185 103 157 88 70 16 116 111 160 71 214 319 247 139 25 150 279 124 230 233 8 62 84 111 43 141 134 43 111 187 44
866 44 38 93 79 121 136 124 89 56 111 102 98 153 211 21 179 53 247 306 118 18 55 90 177 143 280 101 95 129 289 79 166 158 192
478 192 184 135 61 128 141 132 139 160 161 78 167 106 193 233 272 19 120 137 163 132 126 103 171 120 47 118 329 238 208 185 94 109 167 123 62 62 20
44 20 117 47 115 137 200 146 164 130 199 108 23 104 26 35 59 64 93 201 144 36
-191C6
##PAGE=	F1=-14916.7
##FIRST=	25168.397401625570637,	5807.04592319999756,	0
##DATA TABLE=	(F2++(Y..Y)), PROFILE
5807A25pl1k4R1N3M7ln8j52J30l1k8K0l4m8J04j17P8J3J02l0j83J27l3K8L0Q3k36J11l8J15
5443B04L2m8q4N0r0R4M8K2j53J8P6LJ92q6j19J52q5j62OJ39j7J20k6q7q3K5o4K0n1J23M6M1
5068B56j82J68Q5k34k5P7Nj10K6N4%m6l2J51O3j72l4K4P5q7J49o0l7J6J27J0j95K81k14R8
4715B37j03M1o6J7oL7L9p3j4p0K2R8N7j12oj1k9m7M1J88K5n5l7o0J06Lj8k8ok8q7O1N4J53
4316C23n2j12k9P0K6j15m0j6J67J58k33q5J4m6M0j8J9K0O7O5j41J51k3j09k3J09j74J51QJ34
3964C06l4k15M8R7R1r2L2p1L4j8rj25J47rp8J08o9K0j16M2J39j54QM2o2J26p3o2%P8O9m9L1
3577A82j01k0JQ5L8N7rn9q6M5m5K3K4o9J23N4j33J25j23j9J83j25l1Q1j05N5mm1o0L5M8j1
3201A18mn4Q4J12j67J6k0%J09K1k0orr5R2J08m8j01q2J4OM3M8Nj8r3J80j49J3P1j40P0J05
$$ plain form
5807 125 118 87 63 154 207 254 251 193 41 171 140 112 132 98 50 154 37 115 128 230 200 17 144 111 139 169 252 16 127 89 204
5443 204 236 188 104 154 64 158 206 228 75 93 169 172 364 278 159 311 226 64 70 209 192 312 286 199 116 141 77 97 46 169 215 256
5068 256 74 242 327 93 68 145 150 40 66 120 120 74 42 193 256 84 50 74 149 62 211 151 114 130 257 267 72 353 139 237
4715 237 134 175 109 126 120 157 196 123 109 39 61 159 216 104 98 87 58 11 52 240 265 210 173 113 219 222 204 176 170 142 55 116 170 323
4316 323 271 159 130 200 226 111 71 55 222 380 147 62 76 30 70 52 71 91 158 223 82 233 210 101 78 187 13 164 172 306
3964 306 272 57 105 202 293 201 233 162 196 178 169 44 191 182 104 212 143 163 47 89 228 74 82 124 62 188 115 53 53 131 200 151 182
3577 182 81 61 62 147 185 242 233 174 88 133 88 111 135 66 189 243 110 235 112 93 276 151 120 201 96 151 147 106 46 81 129 118
3201 118 114 60 144 256 89 105 85 85 194 215 195 189 180 85 177 285 237 136 54 68 74 117 165 170 152 59 239 90 103 174 34 104 209
2814B09Rk6j20J48kr6p6JQ1j7J01j27j9N2l4R9r2O9mk0%o1L6j8J08Rq8R0R6k57J31J30j06
2427B06j53J8Q5rj6R7q3P6m1P0l2l4K8j21n2Q2l7k0K1J23j76J13J2mL5l1r3N2j4J0K1r5J87
2039B25M8m5o9n4J65r8j28J88L5j10n6k8M7N2P0j16M4q8Q5n1M4R9j8j54R2J7l4o4nm3P6l3
1664I3K2l2M0K4O7o1k7J12r9l3J60q2o3o3O0j9Pq5K19oj57O2Q4j50J68o9j32J84n5N0O3j22
1288A60q7Q5O1j08m8R8p2P2r4j6k4P5J8L4q8J37N4m6l3j38J05J20j36P8m2j49P1K0O3j08J40
924B02k3q2jJ19j93N1O7jL9qj1q5m6O1k3L5K2R6j65J46j46K30P6k34p3M6MK5L7J37j71n3O4
537A42J77j97k1P7NJ0m3p9L8N5l6O6k9%q4N6o4J68j%k26R7M5mk1K2j7L8j5o4K5J37Mj18%m5
114I8L9Ql1mn7pJ05p7nL3N6j2K4q5O5n4n5P2r1M2l9K5L2Q1n3o9
$$ plain form
2814 209 218 192 72 220 218 122 46 47 128 111 212 85 66 118 84 183 91 160 156 136 136 75 111 93 201 210 122 212 308 51 182 312 206
2427 206 53 71 156 147 131 228 145 221 180 250 218 184 212 91 39 121 84 64 85 208 32 145 157 153 188 157 64 116 102 112 133 38 225
2039 225 273 228 159 105 270 172 44 232 267 157 101 73 120 172 242 126 170 82 167 116 160 259 241 87 179 196 162 98 93 50 126 93
1664 93 115 83 123 147 214 153 126 238 139 106 266 184 121 58 118 99 106 21 240 234 77 139 223 73 241 172 40 224 169 219 282 160
1288 160 73 158 219 111 63 161 89 161 67 51 27 102 120 154 66 203 257 211 178 40 145 265 129 207 165 16 87 107 170 62 202
924 202 179 97 96 215 22 73 140 139 178 170 159 74 28 89 66 101 123 219 54 200 54 284 360 126 53 99 103 128 165 302 131 78 142
537 142 319 122 101 178 183 193 150 71 109 164 128 194 165 165 81 137 73 241 240 240 14 111 156 152 131 153 136 174 159 95 120 257 261 143 143 98
114 98 137 145 114 110 53 46 151 74 69 102 158 146 170 85 150 96 41 113 22 64 25 50 82 163 110 41
-191D1
##PAGE=	F1=-15018.9
##FIRST=	25168.397401625570637,	5807.04592319999756,	0
##DATA TABLE=	(F2++(Y..Y)), PROFILE
5807A63k8k9p7J21P0N8m2q3j18J47kn1K4k2r0J08j25R0J4J26p7j11Q9o9L8J5J08k14J01k0
5455A14M8O3l7o1qo2J17N9m2j43L5Q9k0J19k9q0J40o0j21k7J13k3J17qj05j14M5n6O0lJ01
5091B21K9J3k26K29J11k25j27J12Oj07N4P2m3r3Q0J9L3p9m0Q4M6q6J75q9q0L9R6P1k14K49
4739C30j63P1q5K0n9PL4O2K6o0o9o3J9Q1K3q0KNo2L0n2J71Jk6q%R9Jp8qL1rq4OM5J59m1j19
4293A57nQ8Nj27m4K0J10J52j82j34L3KJ2JK1j5O5R3j78J91l6j05k1R4j45J05KJ28o7j75O3
3929A08J02J03j02K0n1Qj4oj23J44J3j18R1k6K8j21M6J26j78j5L7l9J40o3k5L4J0K0nJ2q1
3565G5K5L6N1L4mN1o3j11Ml0JM8l8N4P5j34J47j58L6J70r6q0N7k1N2l7k8n0JM5J3rn5K1J58
3154B40j47l2j9L9N7K6K0KK2q2QJ24l4r6r9J4K6K4N1oj5q6J74j51mJ30j37P3J15M0m2j30J40
$$ plain form
5807 163 135 106 29 150 220 278 236 153 35 182 180 129 153 131 41 149 24 114 128 254 177 66 155 86 124 139 247 33 134 114
5455 114 162 225 188 127 119 57 174 233 191 48 83 172 152 271 242 162 302 242 121 94 207 184 301 293 188 74 119 63 123 120 221
5091 221 250 263 37 266 377 152 25 137 143 36 90 162 119 26 106 125 158 79 39 123 169 83 258 169 89 128 224 295 81 330
4739 330 167 238 153 173 114 121 155 217 243 183 114 51 70 151 174 94 96 101 39 69 17 188 189 163 155 155 254 255 177 169 200 191 107 113 158 317 276 157
4293 157 152 240 245 118 74 94 204 356 174 40 73 75 87 88 109 94 159 252 74 265 229 124 103 197 52 157 159 287 220 45 108
3929 108 210 313 211 231 180 188 174 168 45 189 202 84 175 149 177 56 102 228 50 35 72 33 173 110 85 119 129 149 144 156 75
3565 75 100 136 187 221 217 268 205 94 98 68 69 117 79 133 208 74 221 63 99 269 173 93 150 129 181 144 116 66 67 112 125 116 61 82 240
3154 240 93 61 42 81 138 164 184 186 208 126 134 258 224 128 29 43 69 93 144 138 123 37 211 60 56 186 49 122 237 277 235 105 245
2767B45j2j30p6PN2N5J27j50o8J08o0N1j16J38L6m3p5m1R9nQ7j4j13R5J11k46J21J16q2j55
2415F2mP8j9P4Q2j42Q2rN1o4pO6j48k2N0n7j7J5J19j33R8L9K4Nj01nQ3k5j3m1j02J71J01j7
2016B74j38%J08p8j42K24j3j13q3nN4R5Q9j05l7j8K2n8J02L9L2j14M6J3l2k2k5n1R9l5MNl3
1628A04J8Q8o2j7Q2j01qJ72o7j22k1O2%p6k4J84Jj41Q8Q6j60J55l3j58J76p5K3M8n7j21J57
1265B01O7j15q1N6l1O7j04j1K0L8%K2p7J10RkL5j51Q3R5r3N1r8m4O4M6O0j32J83m2p0q1J56
877B31k04J13L8J4K3j8rj36l4N5k3O7l9J30r1Q3j43K43Q1k47m3N1l2m1J05J21j55o9P4J89
525C34j71j15J27k6M3l2p9K3O9n5J13o1pp8K3n7K35k8j3k00M8P9j1m7N5j6J2J0l7j4N0P0j67
138G7M0k9N9l4mL5q2J4R4q4m6MQ2K1Lj09M0mmM2p2N3q8L4K0N1m0N
$$ plain form
2767 245 233 103 27 34 86 141 268 118 50 158 98 149 33 171 207 164 89 48 147 142 229 215 102 197 308 62 183 299 217 62
2415 62 58 136 117 191 273 131 213 204 255 191 184 250 102 80 130 73 56 71 190 57 155 194 218 223 122 117 200 175 162 121 19 190 291 274
2016 274 136 136 244 166 24 248 235 122 39 34 88 183 272 167 130 112 134 76 178 217 249 135 181 194 162 140 115 64 163 128 132 137 104
1628 104 122 210 148 131 213 112 104 276 209 87 66 128 128 52 28 212 213 72 160 246 86 241 208 50 226 151 174 222 165 44 201
1265 201 268 153 72 128 97 164 60 49 69 107 107 129 52 162 171 169 204 53 136 231 138 189 91 47 111 157 217 85 268 226 156 75 231
877 231 27 140 178 192 215 197 188 52 18 73 50 117 78 208 117 200 57 300 381 134 91 142 110 69 174 295 140 71 145 334
525 334 163 48 175 149 192 160 81 104 173 118 231 170 163 85 108 51 286 258 245 45 93 172 161 114 169 153 165 175 138 124 174 244 77
138 77 117 88 147 113 109 144 62 76 170 86 40 44 126 147 150 41 81 77 73 115 43 96 8 42 62 113 73 78
-191G8
##PAGE=	F1=-15121.2
##FIRST=	25168.397401625570637,	5807.04592319999756,	0
##DATA TABLE=	(F2++(Y..Y)), PROFILE
5807A80m2l8q2J06P8P4p3r7o2J43M1p7N0m3r4O2j02P4L1J28j15l7M2q4L5J2J12j49N5ljP9
5431B03k4l7n1k9J24N3q2j17L7R6m2K9K6m2J12j9p1n5Q6PP0Kj13j03O2o0N7N4P9J0lk31K47
5044B75J16k02j56J00Kr4Q9P2q6p7J38r7m0L3k8J08L6p5J67j05j02K9Q1J15j99J87j09N7p5
4704A60Nl8l2Q1R1J0m0r1o4MN0Qm6j8L3p1J09p7M7j0RJ1M9Q8mj12J5K9K3n7q2N8J54j0j35
4293A47L1R0j5j31k4J7N2J24j20j50R3J3l3J7L0k7M2J06k01K13m6q8k0N5p9O4k1J05r0j01
3941E3M5J07J00r5Rk5l5kOr4R9M9j58Q3K8K6j22K1J09j75M9n7QJ26n9M3N4o1l5L6Km5O4O2
3542B16RL5r7J25o5j14m4pl9O1OMO3j10J61j62O9J60q9r9J2P4L9m8k2n2n0L8L7j3m8l5J89
3154B04j11l6k7L4K3L5M3QM4m8q6J40qn9m9o5J1QO6On9m1J44j24j3J38j37R0J12O0n1j20J31
$$ plain form
5807 180 138 100 18 124 202 276 203 106 44 187 228 151 201 158 64 126 24 98 129 257 142 105 147 63 98 110 222 73 128 125 124 203
5431 203 179 142 91 62 186 239 157 40 77 173 131 160 186 144 256 237 166 111 197 204 274 276 163 60 122 62 119 173 252 262 259 28 275
5044 275 391 189 33 133 135 41 130 202 116 39 177 80 40 73 45 153 189 114 281 176 74 103 184 299 100 287 178 235 160
4704 160 165 127 95 176 267 277 237 146 82 86 136 144 98 80 113 42 151 74 121 111 120 131 180 268 264 152 167 196 219 162 80 138 292 282 147
4293 147 178 268 253 122 98 115 167 291 171 21 114 127 94 111 141 114 156 262 61 274 228 140 120 175 96 160 139 244 154 53
3941 53 98 205 305 210 219 194 159 157 163 69 168 217 59 142 170 196 74 95 204 29 78 21 29 155 96 139 193 132 97 133 135 90 154 216
3542 216 225 260 163 288 223 109 65 58 19 80 86 90 153 43 204 42 111 271 182 83 95 169 208 160 138 86 36 74 111 98 50 15 204
3154 204 93 57 30 64 87 122 165 173 217 169 83 223 215 156 107 42 53 61 127 133 74 33 177 53 40 178 41 131 243 303 252 132 263
2767B63j7j54m7j6J0J22J43j61j08J40q1J9l3R2O7m8j40lJ42j8N4m4j01Q1J24k22J08R5m9
2427B18j33j7P4o6J54M7j85J02J5K4p8K5R2j59nJ8l8k4KJ18j02R2L7O1k9j38Q2O8lk7j25l6
2051F4J02J28J7j98Q2Jo7j05K13m1j08o4KL4J11J06p4j22M9m8j2J24l0O0n7J0Rl6L2l9o5R8
1675A76l2NM2o5k6P8n0K4O3j19jJ79m8j19j6L7J5q6k9J62Lj22J12Q1j72J37Nj66J52q8KJ7
1300A51pj15K21O1j23p4k6L0N5j10j2O8J0n0J1o3P5k7O0P4j45N2O4j4K9j52L8N0N8N4j37K20
924C26o4n2j13J32j69J56nJ9mj2j0j58l0R9k6O1j26J60k2J6j20K28Q1k22j9N5o5q5J42Q8j33
560A28n5O1J94j50j50J26n2Q0j1p3M0L1o3J32n4k1r5L1n8K63l9Lj61k4R8J8j12P8k0rL1lm1
173A23k4Q8j39Q2o2P7o9K5N6p6K7O9r2m7J7P2L1l7o9j7J8L9J7m3N9j20L7jK9l3P5
$$ plain form
2767 263 246 92 45 29 39 161 304 143 35 175 94 113 80 172 239 191 51 48 190 172 226 182 81 162 286 64 172 267 218
2427 218 85 68 142 76 230 277 92 194 209 233 155 180 272 113 108 126 88 64 66 184 82 174 211 272 243 105 187 255 252 225 100 64
2051 64 166 294 311 113 195 196 129 24 237 196 88 24 26 60 171 277 203 81 130 82 70 194 164 224 167 177 186 150 182 143 78 176
1675 176 144 149 191 126 100 178 128 152 215 96 95 274 226 107 91 128 143 57 28 190 193 71 183 264 92 229 234 68 220 132 134 151
1300 151 144 29 250 311 188 114 88 118 173 63 51 119 129 79 90 27 102 75 135 209 64 116 180 166 195 43 81 131 189 243 106 326
924 326 262 210 97 229 60 216 211 230 226 214 204 46 16 115 89 150 24 184 162 178 58 286 367 145 126 181 116 31 173 261 128
560 128 73 134 328 178 28 154 102 182 171 98 138 169 106 238 184 163 68 99 41 304 265 268 107 83 181 199 87 165 145 136 167 164 123
173 123 99 187 48 130 68 145 76 101 157 81 108 177 85 38 55 127 158 121 52 35 53 92 109 66 125 5 42 41 70 37 112
-191A12
##PAGE=	F1=-15223.5
##FIRST=	25168.397401625570637,	5807.04592319999756,	0
##DATA TABLE=	(F2++(Y..Y)), PROFILE
5807A81l0p6l2M1Q5Q5r1j05J2J09P8q3Q4q5o6No9L1N3J17j45L7j4o8PK9Q8q2J2J0mO4j9j5
5408A44n3k1J33K7n6r2j9J08m9o5O3j0P9L3k7p8O6N0J1j4j05m3N6p4K7J07N8nrj69J96J00
5032C69j69j34P8j2r2J34O9j31qJ37j44k2oj8J10K9n6J51j08j19NP9J35j72J11m2N2p1%qr3
4669E4J26J21pk0o5r2j0RM0m8m4N0n6J60q7p6qL8L0O7P3qj16K6KO3oj66N8J43K9j37N6P7k7
4258B49r2jl9lQ3n7j01J31Jq2K6M4j0lJ06k04K07m9p3qROK7m9P3j02k4J3J10Q4p0JNq9J3K1
3835A53m3K1Q9j80Q7O8J1j17nP6j05R1j03K3R9r7J02Q8j23n2M2j2j6J12P2l1L8j96J91o2r0
3471A31o9pRl1O4%qm1J44j16L9J64q9j03l4J46K3k9l1o4q8L6L9j0k1mJ05o5Ml1j9J0L7N0J1
3060A52M6nj29J30J5j9j2j01m6mR4M7j59L7J04p9j0J01j30J05P5P8m9r8J27j2j71k6k4JJ33
$$ plain form
5807 181 151 75 43 84 169 254 163 58 70 179 257 174 258 173 107 112 43 74 127 244 99 136 122 54 61 90 178 96 108 118 114 178 159 144
5408 144 91 70 203 230 174 82 63 171 122 57 120 110 189 222 195 117 183 233 244 230 125 82 138 64 91 198 256 251 242 73 269 369
5032 369 200 66 144 132 40 174 243 112 104 241 97 75 69 51 161 190 134 285 177 58 63 142 277 105 216 174 226 155 155 147 54
4669 54 180 301 294 274 209 117 107 116 156 108 64 114 58 218 131 55 47 85 115 182 255 247 131 157 159 222 216 50 108 251 280 143 199 276 249
4258 249 157 156 117 114 197 140 39 170 171 89 115 159 149 146 252 48 255 206 133 125 134 140 167 118 191 89 65 78 188 272 202 203 208 119 132 153
3835 153 110 131 220 40 127 195 206 89 84 160 55 146 43 66 165 68 170 258 135 83 125 113 97 209 281 250 288 92 283 221 131
3471 131 62 55 64 33 97 97 89 48 192 76 115 279 190 87 53 199 222 193 162 98 10 46 85 75 54 50 155 90 94 63 44 54 91 141 152
3060 152 198 193 64 194 209 190 178 77 31 27 121 168 9 46 150 71 61 162 32 137 212 290 241 143 270 258 87 61 37 38 171
2697A71J45j59j04J05r0L4N8MQ2m2j63L5J49m7J7o5l9K2J35j87Q7P5j3j06rQ2j33J95Lk03
2344C9J32K2jp0M7J06j55%Jol0qJ10r2R8J9R5o0j36J18M7L7l0j89QO2J16N6k30J31r2o9k3
1957E3J50m4j02Nj1K1O4J20l2j74P5j06P8J01q6O5jpKl8Q8m8q5P1k4L1O7o2p6L2l1Q7O1j33
1558A11l3J82k5q0l5JK0l4p7J41Lq9J25N9j79J18L7j70J29r0j3j0K8r4K67M2j35m5j08R1N3
1194A90j25k1J24lj02mm7L9%Q3N9j22J7L2Q8Kj56O0L3L8N7j21K42q3l3j05O9j13J94m5Nm1
819B11Nj3j24l0J28l8N0j59J26K5m7q5J94P9j65kN9q3m6Q1L9j03k3L2J86j38q9N8p2J06K2
455A84n6O0l2n6J12Ml5j52R0q7K53l5M1j19q1Q9O6j67N9k9j6M9K9n6m5L9k2O7j11R4r3M6N6
67A46m2L7L3r7j5P9J2K8o3m0Ll6O0mj8N8j18K5k7N2m5J08
$$ plain form
2697 171 316 157 53 158 68 102 160 164 246 204 41 76 225 178 195 130 91 113 248 61 148 223 210 104 95 177 44 239 242 39
2344 39 171 193 192 122 169 275 120 120 121 115 85 77 187 95 193 212 307 247 111 229 276 313 283 94 102 164 280 336 106 237 145 76 53
1957 53 203 159 57 62 51 72 136 256 224 50 125 19 97 198 112 177 176 169 171 133 221 173 88 159 135 166 233 171 95 127 96 183 244 111
1558 111 78 260 235 155 120 121 141 107 30 171 174 85 210 269 90 208 245 75 204 114 101 91 119 25 292 334 199 154 46 137 190
1194 190 65 44 168 165 63 59 12 51 51 134 193 71 88 120 208 210 54 114 147 185 242 121 363 280 247 142 211 98 292 247 252 211
819 211 216 203 79 49 177 139 189 30 156 181 134 49 243 322 157 155 214 131 85 166 205 102 79 111 297 159 70 128 56 162 184
455 184 128 188 156 100 212 216 181 29 119 32 285 250 291 172 91 180 246 79 138 109 93 142 171 115 70 109 87 154 43 137 44 90 146
67 146 104 141 174 77 62 141 153 181 118 78 81 45 105 101 83 141 23 48 21 73 28 136
-191A36
##PAGE=	F1=-15325.7
##FIRST=	25168.397401625570637,	5807.04592319999756,	0
##DATA TABLE=	(F2++(Y..Y)), PROFILE
5807A72Mj26J6j3R3P3q8j16Q5N9R3o0J18j35k1oq0j0P1R8j56Q5o4l1l7O2N0l6k3K4L8K6m5
5420A20J4j3l2J35oRr9p9J11l5n9j0K2N6Q2nr6N8P4j9o8p9K6M8r1j4J45L5j3kj03J35P0j23
5021A94j13Q3k6j11J83P1j73N3J26j55L4p6m0J02J6k3J38j06j40%O7J29j40K6N2M1p0OK1j61
4669HJ61J43k2mj4j24k0l7J02q2k9J4k5J90q2j64lN1N3M6N1j1q7J2j8R6N8j54m2J33O7j12
4293A55N8M6k3j9Kj15m3M0j2l2J58j2j29K5N5K3m6R7j88J74m5o9J8l0Q5jp0L9j00L0KR1O0
3906B24l2nM0j26NL4K1p5J22j40O5P6j3j00oJ5j6J05j22K1J15j63J25J33j74k1J7l1QJ55O3
3542C20o8M1k43K01n1m8n7l9O1j02J00J4r5M3J14p1nJ71p8j10m3J49PJ9n4p9k9K9j9oK0J8
3166A10lk2M3l5o2K0K2L9J5K5L8j01Q8K7QJ8j22p0j6J09R3j57j7R6l7l5P7r0R7j5R8l6p4J31
$$ plain form
5807 172 176 50 66 53 146 219 131 15 100 159 252 192 310 175 154 148 68 58 129 227 71 156 92 61 24 86 136 100 77 101 139 165 120
5420 120 134 121 89 224 218 227 128 49 160 125 66 56 78 134 216 211 115 173 247 228 160 81 107 155 64 50 195 230 217 215 112 247 317 194
5021 194 81 164 138 27 210 281 108 161 287 132 166 90 50 152 168 145 283 177 37 37 104 233 93 119 171 212 142 148 169 8
4669 8 169 312 290 286 272 148 128 91 193 111 82 96 71 261 179 15 12 63 116 162 213 202 115 127 109 205 263 109 67 200 267 155
4293 155 213 259 236 217 219 104 61 101 89 57 215 203 74 99 154 177 131 228 40 214 169 100 118 88 173 172 102 141 41 71 73 164 224
3906 224 192 187 227 101 106 140 161 86 208 68 133 209 196 96 90 105 89 194 72 93 208 45 170 303 129 108 125 94 102 257 320
3542 320 252 293 50 251 200 152 95 56 117 15 115 129 34 77 191 120 115 286 208 98 55 204 211 230 176 97 68 97 78 72 92 110
3166 110 107 85 128 93 31 51 73 112 127 152 190 89 177 204 212 230 108 38 22 131 224 67 50 146 109 74 151 61 158 143 241 205 131 262
2767B62Rj84j8k7K9J02J35j49n2Pq6R4J07q1Q2l5j49O5J30q2j3m8L4o9J45j53N9O2J9q6J6
2403A25Q8j41J54m7j63J32J4k0l8N4J02j37ljJ3k3oQ6q8R5OJ14p8j14J19K2Q3k6j98lN4P5
2028B50R7k27J28j28m3J4O3k3r8M2j6M8j8J24J8j44Qn1P7O3j13N2M1ool6J35n0j07K4j1P3
1652A80P4m8r7l3j4J56O4j32q6J72lm4n0l0J0K8j04J11Qm6J26Nj81J14N5j66J10q4k1J8L3
1288A25p3K63J3j43pj57J28O4j46l8J81oj14j4l6J1P4M0Jr5j4J6J70l2j28N9K0j1N8q3K42
924C68r1j4q8Om8K15o4k8p9K2j8o3k3J26m4M3j45N9L7r1n4J62P6r7LO7q6lOj3o7J1oJ63j30
513A12J7j5r2J12N8k7N9r2k1M7J02m0j92J22j18K00j8R0q1j16N5J11j64j9l6J2M7N0n9j3l3
150E8P6L0j45J10r4M6L8J1M2pr7L2J18m3L5n5p6M8o0N4k3jM5q8J2n7J02m8Q8
$$ plain form
2767 262 271 87 69 42 71 173 308 159 107 114 28 122 229 148 230 195 46 111 241 159 146 98 132 63 208 55 114 176 195 109 125
2403 125 213 72 226 179 16 148 162 142 104 158 260 123 120 119 132 109 103 189 101 196 202 316 238 124 243 265 348 322 124 121 175 250
2028 250 347 120 248 120 77 91 154 131 33 75 59 107 89 213 231 87 95 44 121 184 71 123 164 158 152 116 251 201 94 118 107 180
1652 180 254 206 109 76 62 218 282 150 64 236 233 189 139 109 119 147 43 154 162 116 242 247 66 180 235 69 179 95 74 92 125
1288 125 52 315 328 185 178 21 149 213 67 29 210 204 90 76 40 51 125 165 166 71 57 73 243 211 83 142 162 151 209 126 368
924 368 277 263 175 181 133 348 284 256 177 199 181 118 95 221 177 220 75 134 171 80 26 188 264 167 170 237 151 148 154 141 74 85 79 242 112
513 112 129 114 22 134 192 165 224 132 111 158 260 220 28 150 32 232 214 304 223 107 162 273 109 90 54 66 113 163 104 91 58
150 58 134 164 19 129 35 81 119 130 172 165 68 100 218 175 210 155 79 127 67 121 98 97 142 54 66 9 111 63 151
-191A51
##PAGE=	F1=-15428
##FIRST=	25168.397401625570637,	5807.04592319999756,	0
##DATA TABLE=	(F2++(Y..Y)), PROFILE
5807A61L6j35K1j8Q5K9o5r4J06J0P5j0J47j90L4K0j21k5P8P2j38Q7j02KoL9K6l6l6M1Q5kj15
5420F1N3N3l7J14k8N0j03j06P9j1Qr5M7N4R3j8r5N0O9j1j36k5N9L9j01k7J31J2j5J4m6P2M2
5032B46p2j00J12l2j39K11Q0j96Q7J10j58P0q2q0Q1JJ7J27j08j56L9J8R8r6m1J43J2o1J7M0
4680A88j46J06J50l1NM1j48k3p4J48j22L6p3K2J97o3j66k5M0O8MJ2j1l4k2K5P2J22j03j74
4328B1J28R3o1L9Kj1N7j1j73l5K6l2J7J76pj80K8M6O3p7R0j64J24k7q3N8n8J31j0p5No9M3
3941G4L7L2K4J3qP9j19n1N2Q3j67J34o4L5M7k7q1K1o1N4J07j36K2J52j70O4J73k09J8Lm2L9
3565A28J59M2j04M6j75J03l8Ol6p0Q8j00Q7J3j12O7R4l9k9J50m6j24k5R7j2R0r3r1N1M1o1
3201A07j6M5K5q2KO9l5p6L0nJ7K5j6P0n2O3K5K7L0j30m8l2J13J22j49q8J32j2q2O9m7R7j37
$$ plain form
5807 161 197 62 83 65 150 179 114 20 126 136 211 201 348 158 192 212 91 66 144 216 78 165 63 65 59 98 124 88 52 93 178 176 61
5420 61 114 167 130 244 216 266 163 57 136 125 133 38 85 139 232 214 119 169 238 227 91 66 125 164 63 36 167 179 164 178 132 204 246
5032 246 174 74 186 154 15 226 306 110 197 307 149 219 137 57 138 139 156 283 175 19 58 76 174 78 37 180 192 131 148 188
4680 188 42 148 298 267 272 313 165 142 68 216 94 130 57 79 276 213 47 22 62 130 134 146 135 101 79 104 176 298 195 21
4328 21 149 242 181 220 222 211 268 257 84 49 75 43 60 236 229 49 77 123 186 109 199 35 159 132 49 107 49 180 170 95 100 31 74
3941 74 111 143 167 180 172 251 132 81 133 216 49 183 119 154 201 174 93 114 53 107 214 78 100 252 82 146 319 110 128 131 89 128
3565 128 287 329 225 271 96 199 161 167 131 61 149 49 136 149 37 104 198 159 130 280 234 110 85 182 170 260 167 76 127 168 107
3201 107 91 136 161 79 81 150 115 39 69 64 81 106 90 160 108 171 196 223 253 123 75 43 156 278 129 41 173 161 79 148 101 198 61
2814F1J14k3n7J41M8j87j9l6N3P3J20j38K2r4l5J11J25j53O8k8j21R9Q8j02k5MO9j21J22j28
2462E1K9N6M3q1M9P5r5Q6r8n8O7mk9J7N1P8j11j2JJ5kON3p6N9J9J13q4q6J04kJ20j8j67m9
2051A20O3K7J29k01Q7r0Oql5K2q4K9j7Q9p8J00O9q3j01M9L7K7j10K9O4Oj4l5J68m1j26l6J9
1664H1J07O7m3q5q3QJ95O1j10j22J29J1k2n5n1pQ2r8Q1J7j0J20q6j64J21O0j47Q7p2j9R3J1
1288A57p4K29j7j44L3j26R2Q5j43p2K22lj06j8m6lJ14J8o1p4j3K2J77o7o4M7J3o3M0l7K19
924C37q1Mo6m8J4K08n6p1j08L5k9MmR3l0L4j38K8J0q6k4J37N2m2nQ1q3K7n3n4k7K7l9J23j13
513E7J26n7j11R2Q3J0L1j34L9n0K16l4j91R3j24J10J2J39n7j32J0J35j19j14K2M1ON2n7Pq
150I3P7j4j50J19o7K3LP1M0m7q0P8J22r3N8l6j40R6n9M9l5OJ6m5J1p2J21m4N8
$$ plain form
2814 61 175 152 95 236 284 97 78 42 95 168 288 150 172 78 43 154 279 126 194 166 45 144 232 130 105 109 178 57 179 51
2462 51 80 136 179 98 147 222 127 213 115 57 124 120 91 108 159 237 126 114 115 130 128 134 187 111 170 189 302 218 132 236 234 354 336 169 120
2051 120 183 210 339 138 225 135 141 133 98 120 36 65 48 137 59 159 228 145 44 93 130 157 47 76 140 146 132 97 265 224 98 62 81
1664 81 188 255 212 127 44 52 247 308 198 76 205 216 194 139 88 81 163 65 146 163 153 273 187 23 144 204 57 144 72 53 146 157
1288 157 83 312 295 151 184 58 150 235 92 20 242 239 133 115 69 66 180 198 137 63 50 72 249 182 118 165 178 115 155 118 337
924 337 256 260 194 146 160 368 312 241 133 168 139 143 139 232 202 236 98 126 136 50 26 163 215 173 168 249 166 193 140 86 59 86 47 170 57
513 57 183 126 15 107 190 200 231 97 136 86 302 268 77 170 46 156 168 307 250 118 128 263 144 30 52 93 99 151 94 101 93
150 93 170 156 6 125 58 81 84 155 195 148 68 146 268 175 233 197 57 153 94 143 108 114 130 85 96 24 145 101 159
-191A59
##PAGE=	F1=-15530.2
##FIRST=	25168.397401625570637,	5807.04592319999756,	0
##DATA TABLE=	(F2++(Y..Y)), PROFILE
5807A46N0j01jKO6k5l1n8R2j7K1N6J67k42R0N2j58k3Q8M2j18O7j24J6O3KJ8p5j0M6J09lj64
5420D3N2J21l2P1k1L5q6j01K3RO0j08N7O5P9o2o9L4M0K1j31JL7K1r4J2M6qj6K9jJ5K3j7r5
5009E3J54l0j35J77R2j91Q4R1j52Q8m0j01L9%M0J10j11j35N0k0M8k1L2P6l2m1K6N3j22M2J35
4645B59k7NQ2j50k5q9J47j45J23j66P5J77l7j58l5L7P2k6n4pK8n0J30k4J78n2k44Q3J00KJ1
4281B20m9NJ10l0j90PN8o4j3J79K1k36P0mQ9r1R5j47P8Mo0N1q0J32Ro8l3k1L2R5l6k4N6j3
3882A52J22r3j22P9J26k05R5RK1j5j2p8N7r8P2R8j43K2J82j31rJ77k22M8J0m0P1J24J7j42
3530A72N0q4Kk5N7k1q1Q9r4Q9lp8N2P8j4k9R4Jj41jL0l5J66j44q8J30M7p9k7N2L2j11qQ2k6
3119A34p0L1l5qM3m4P0j5O1K0L8K0j23qo1J36J22j48j27J85kj29N5j5J11j76N4k5n0J46J05
$$ plain form
5807 146 196 95 94 96 162 137 106 48 140 123 144 200 367 125 215 267 109 86 174 216 98 165 41 57 120 122 140 65 55 101 210 207 43
5420 43 95 216 184 255 234 269 183 82 105 114 174 66 123 188 267 205 136 170 210 231 100 101 138 159 65 77 123 115 99 128 127 142 165 148 53
5009 53 207 177 42 219 311 120 204 295 143 231 191 90 129 129 169 279 168 33 83 63 111 90 122 198 166 125 151 204 82 124 259
4645 259 232 237 319 169 144 55 202 57 180 14 89 266 229 71 36 73 145 119 65 58 86 36 166 142 320 268 24 107 207 209 220
4281 220 171 176 286 256 66 73 131 67 54 233 254 18 88 84 173 82 177 30 108 112 52 103 23 155 164 96 63 42 74 169 133 109 165 152
3882 152 274 181 59 138 264 59 154 163 184 169 157 79 136 38 110 208 65 87 269 138 129 306 84 132 142 102 173 297 314 172
3530 172 222 138 140 115 172 151 70 159 65 154 151 73 125 203 189 160 254 255 114 113 143 108 274 130 42 172 219 140 113 165 197 86 78 160 134
3119 134 64 95 60 52 95 51 121 106 167 187 225 245 122 114 53 189 311 163 36 221 219 90 145 130 241 65 119 94 44 190 295
2755B95j77j5l8M4M7J12j35R9j23j5R1J24k12M6j3q9J28K9p7j4K2Q6j14O6j14ON1N5q2P3L9
2391A95k0M2j25j4J8k0l1P8N5L8q3k3pOK5L0J8m8k2O7R0p8o0Q9k5J34rj12j04P5j3J45j62
2004A49K9j3L1k4j27Q5p5kl1J31o9K7J17k5j81J01NJr1RO9J4j8m2J84j8j34o1O1Q4N5n7m5
1617A39j02M9J78M6p0j38P0Rj2n4o3j8J19o0O2J6J6J07j98j9K7N5j14O0n3mJ56j7q6J79l4
1253B46j34O7p7L5J09r4j23K30Jq8k3n5l4J44Mr5o4L2K4J17r4L8J6Mo8qj0J75n2K2k7j04N7
866A71J72k4j12j18M2n1O2K7L8J1J4j37L3m4OoJ12nk0k3R8p9M6q8m5j3J6m9N9l6J61o2j34
478B2P4Q0M2j5j32Q7j44L12k0j95N9j08J3M9J77m9j32l5J27n0j28R0Mj7L0n3rM7P4o0j15J04
103A29l3Km2J21K3p7m1J07R2j31Q9j7j82J25n6N3l5Qk2qK3q4J22l4L1
$$ plain form
2755 295 118 103 65 109 156 268 133 232 109 94 185 309 97 143 130 41 169 198 121 107 129 215 101 167 53 59 110 165 83 156 195
2391 195 175 217 92 78 96 76 45 123 178 216 133 110 103 109 134 164 182 134 112 179 269 191 131 220 195 329 320 208 104 179 166 311 149
2004 149 178 165 196 172 45 130 55 53 22 153 84 111 228 203 22 123 128 129 38 47 116 130 112 70 254 236 102 41 102 186 241 184 139
1617 139 37 86 264 310 240 102 172 181 169 115 52 34 153 93 155 171 187 294 96 77 104 159 45 105 52 48 204 187 101 280 246
1253 246 112 179 102 137 246 152 29 259 260 172 149 94 60 204 208 113 49 81 105 222 128 166 182 186 118 110 100 275 223 245 218 114 171
866 171 343 319 207 89 131 80 142 169 207 218 232 95 128 84 90 84 196 191 171 148 246 167 213 125 80 67 83 34 93 57 218 156 22
478 22 96 176 218 203 71 158 14 326 306 111 170 62 75 124 301 252 120 85 212 162 34 124 128 111 141 88 79 126 200 140 25 129
103 129 96 98 56 177 200 123 82 189 281 150 239 222 40 165 109 162 127 135 113 105 128 44 166 132 163
-191A63
##PAGE=	F1=-15632.5
##FIRST=	25168.397401625570637,	5807.04592319999756,	0
##DATA TABLE=	(F2++(Y..Y)), PROFILE
5807A21M9m7k5J7M3o2%k5O5no1J22J72k83J35P9j76j8J12J0j17N1j28J2J36k6mj11L8L7J10
5443B21K1j21l1J64k0K6J2m0l8q6j5lR5j07Q1P5O9j22k1QON9o8j8J0j9p2N0l4k1l1L5L4l3
5044F6K4L8r2J91k5j31J18J02j57M5P3j27Q7K3j05rJ6M2Q3j09j00M0l6kP2Q1ko7j7L2O3j04
4669A13j2J00j1NR6j28k8q1R7j07J69j29K2J31j2j41k8K3O8k4q9MK8J6J55j29K22j7k53K0
4316H0R0O1j9j00J8J36n2j52K3Q8n7n3J53O8k50R9n0O5r5J17j42N6K8nJo3N4N9m8q5K6K3J47
3929B21r4p0R0k2J64p2j71J06J45k04L8N5K6q8L4j06R3q0M0Q2j47K1J84o5l3J24k07O4K6l8
3577A16J01O9jj76M8no1rQ6j9o9P2r1J02k1l8L6N8Oj3J6N8j58K7j4l8J88j95l4J51M1p8k4
3190A31L8M6j05k9P9on4K2o3j1M4oL5k6O6K2L7j4q6K5r5J70R3j52j00K15mj64K8MJ26j39k5
$$ plain form
5807 121 170 123 98 115 158 96 96 71 136 131 70 192 364 81 216 295 119 101 213 223 106 157 29 41 177 151 147 36 74 111 221
5443 221 242 121 90 254 234 260 272 232 194 108 93 90 185 78 159 234 303 181 160 168 174 233 165 147 157 138 66 116 82 61 30 65 99 66
5044 66 90 128 36 227 202 71 189 291 134 179 252 125 212 235 130 121 137 179 262 153 53 93 57 55 127 208 206 139 122 154 217 113
4669 113 101 201 190 195 291 163 135 54 151 44 213 84 106 237 225 84 56 79 147 123 34 38 66 82 237 108 330 313 60 80
4316 80 170 231 212 112 130 266 214 62 85 173 116 63 216 284 34 133 83 148 53 170 28 84 112 107 108 45 99 158 110 25 51 74 221
3929 221 127 57 147 125 289 217 46 152 297 93 131 186 212 124 158 52 145 65 105 187 40 61 245 180 147 271 64 128 154 116
3577 116 217 286 285 109 157 152 91 82 168 149 80 152 61 163 142 104 140 198 204 191 207 265 107 134 120 82 270 75 41 192 233 155 131
3190 131 169 215 110 81 160 154 100 122 59 48 92 86 121 95 161 183 220 206 120 145 50 220 313 161 61 276 272 108 136 140 266 127 102
2802A02o0MQ2J72j53kl2PJ8J16j47J66j07l0P6J13k63K5L1p5J41m0kolJ08r4J7j01j6N2N8
2427A57p9P5j6O7K9j21l3pk8j9J05P3nn2l4l0pN0O1rpj38J41N4p0l6Q3m1J13%m9j38P2l6J36
2016B61j13j8O0L1j9j73J27q9Ro1J42l0l2J52J2j75M8npq0nN9J4j6n4J75K1j21j6O3J2N7r6
1628A33Rj08J00J33J3j6j44J4ojn3n3J2Q6KN1LM1Q3k81J36r0M6o8L3l1K5J81n2r3J21l0j12
1241H4R0l7k7J31qj83K12ko0l1n4q1J62rq6o7Q7K1L1r7J42k6j8k8k6m6J19j0M9L2j74P2J17
854B79K0j43j00L9p2R3O1k3P8k0j46O5j07J20PR9p4j4m5J13p4M7q3%k7j3k7k0P4J23l9j66
478B5Q3M1O0n1o6P2j10K70oj95K6q0n6P8J97n2j16n9O9K8p0J05n5Rj4m5n6R8R9r7q9R2Nj2
79A28q3J44nr7J6J20L6j51J17mj60J03n5N9k3J6o2OM6r5J16k3J3
$$ plain form
2802 102 42 46 128 300 147 145 113 120 138 254 107 273 166 136 212 325 62 87 118 43 184 144 142 136 133 241 147 164 63 47 99 157
2427 157 78 153 137 204 233 112 79 72 44 25 130 203 198 146 112 82 75 125 186 177 170 32 173 227 157 121 204 163 276 276 227 89 161 125 261
2016 261 148 130 190 221 202 29 156 67 76 15 157 127 95 247 259 84 132 127 120 40 35 94 108 92 38 213 234 113 97 160 172 229 133
1628 133 142 34 134 267 280 264 120 134 128 127 74 21 33 119 121 172 175 216 299 18 154 64 110 42 75 44 69 250 198 105 226 196 84
1241 84 174 137 110 241 233 50 262 260 200 169 115 34 196 187 101 34 121 142 173 76 218 192 174 146 120 74 193 183 232 264 90 162 279
854 279 299 156 56 95 23 116 177 154 232 212 66 131 24 144 151 250 176 162 117 230 156 203 120 120 93 80 53 33 107 230 191 25
478 25 108 149 209 158 92 164 54 324 318 123 149 69 13 91 288 236 120 61 130 158 88 193 138 147 133 88 32 130 229 132 43 135 140 128
79 128 45 189 184 87 103 223 259 108 225 221 61 164 109 168 145 161 99 105 151 56 172 149 162
-191A62
##PAGE=	F1=-15734.7
##FIRST=	25168.397401625570637,	5807.04592319999756,	0
##DATA TABLE=	(F2++(Y..Y)), PROFILE
5807H3M5J3m4J9J4o2J1J4K4L4j16J47J57l00J56R2j64k0J47j9j35M8j15lJ89l4n5j10P6K0
5455A12R5N8p0r7J75j1%N7j53L6o4po2J05j09J15Q0O1j75L4j5k2R0j6l4Mq6l7P4p4nj4l4M9
5056F0l0L9N6r0K07k2j32N6J08j05k1N4p3P9P7j01n1K9L2M9r0p2L0l7k7J37R1o2p4KL9P1r5
4669A34n0M3J7K4P6r3l2n0K1J6J16n1m0O9Mj12qrN8jk3mo4J05J40k06K51kk46j8P2J08n1j40
4269E4K7J39p7o5KJ02l0n1J02J14k31R4n6Kq2J32j38N8J9L0l1j9n3J06j2j05L2J0J82j39q9
3906B7J00l9K01o2j82J24J39j90LO1M7j49Q2j49J27n7J8O3j47K8J35J4rM4j71O6M1n5J31J6
3553B57pj58lN3p0K0O7l5l6M9r1J17l1nK5K5K4Pn8J11j71N6KJJ03j79J1R6K1n2JjO3q1m1N7
3131A47K7l4Kp8PJ9L9M6p8N4L1J9n8j6L3j10J90M1j57k0K22j4j92JQJ33j04m6q3P0l3K30j19
$$ plain form
5807 83 128 141 97 116 130 68 79 93 117 151 35 182 339 39 195 287 123 103 250 231 96 144 29 26 215 181 126 16 92 112
5455 112 207 265 195 98 273 262 262 319 166 202 138 131 69 174 65 180 260 321 146 180 165 143 233 217 183 187 101 64 138 64 59 45 11 60
5056 60 30 69 125 35 242 220 88 144 252 147 126 180 107 186 263 162 111 140 172 221 131 59 89 52 25 162 253 191 117 119 158 229 134
4669 134 84 127 144 168 244 151 119 69 90 106 222 171 131 200 204 92 84 75 133 132 109 105 41 146 286 80 331 329 83 65 137 245 194 54
4269 54 81 220 143 78 80 182 152 101 203 317 86 180 124 126 44 176 38 96 115 145 114 95 42 148 136 31 63 73 255 116 27
3906 27 127 88 289 227 45 169 308 118 121 182 229 80 162 13 140 83 101 164 17 45 180 194 185 229 58 124 165 110 241 257
3553 257 250 92 89 142 72 92 159 124 88 137 46 163 132 127 152 177 201 208 150 261 90 146 148 149 252 73 84 180 201 149 150 149 212 131 90 147
3131 147 174 140 142 64 71 90 129 175 97 151 182 201 143 127 160 50 240 281 124 104 326 312 120 121 129 262 158 112 29 99 66 296 177
2744A77J4k8l5j2J32j69K06q0m1P1R9l14L1R3r2J33j00Q0rl0J31p7k1q2n1P0O1p1N5n0J19
2380B10L1j15n2lk1NP0R0l8j2n3n3j6N8R5k2L0j48J12J9o6j0P7m2N5J0J0j29M0l8J02o2oP6
1981B04PMj55J26j19N1p9J18Nm8J73K7j72j0J0nq9j9M6Nok7R4P2p4K1N9o9Q3j20L2j15J52
1593A82P0l0M0j43k6l0K2l4K1KoP1L9pO5M8j90J13j73L4qJ2k1M8J77q5q7N2Pq5R9j8q4J41
1194B16R7k23J65j9k1l7l9j36J59k9j8q4J21K2l6m3J70p3n5J9Jj14O7L1R4Q7k48O3O0N8j60
830I5m6J7J8PP2p3J60p0j59J11r9J55K5P4j42Lo6J22o5K8l4L4m0m4oj6R1P7nj97J00j4O2l7
431A38%Rm6J92Oj84Nn0l1L1J96n6q5l5m5J00j5J10j23P8p0l6n0Q2J40j26q1Q4M5k3j15J44
56A89l5j06P2J19k2j46J23Mj18P2n9O4lL1r1j0P2j01J13j8j
$$ plain form
2744 177 191 163 128 116 248 79 285 205 164 235 334 20 51 144 52 185 85 165 156 126 257 180 159 77 26 96 157 86 141 91 210
2380 210 241 126 74 71 50 55 125 215 177 165 112 59 43 101 196 174 204 56 168 187 121 111 188 146 201 211 221 92 132 94 196 134 128 204
1981 204 211 215 60 186 67 118 39 157 162 114 287 314 142 132 142 137 48 29 75 80 74 47 141 213 139 160 219 150 233 113 145 30 182
1593 182 252 222 262 119 93 63 85 51 72 74 68 139 178 171 236 284 94 207 34 68 60 72 51 99 276 191 104 156 163 78 177 159 75 216
1194 216 313 90 255 236 215 178 139 3 162 133 115 31 152 174 138 95 265 192 137 156 157 43 110 141 235 322 74 137 197 255 95
830 95 49 66 84 91 163 90 250 180 21 132 33 188 213 287 145 148 82 204 139 167 133 167 127 83 77 61 152 229 224 27 127 113 175 138
431 138 138 147 101 293 299 115 120 70 39 70 266 210 125 90 45 145 130 240 117 195 125 89 39 121 261 135 54 138 183 160 45 189
56 189 154 48 120 239 217 71 194 198 80 152 93 157 154 185 94 84 156 55 168 150 149
-191A49
##PAGE=	F1=-15837
##FIRST=	25168.397401625570637,	5807.04592319999756,	0
##DATA TABLE=	(F2++(Y..Y)), PROFILE
5807D7N2M9n5Lj3j2j3N5k1P9r8J06J20k80J38R0j18l5J74l6j57N3r6qK00j4j27m6P5pO4J03
5431B72k9j32J56j0J0R3k63J14k8J0j23P6j15J55P8M9k12Q9k9l8J09Rl4J4j57j1Q9p5J4K1
5079A02j1m1M2K1K3j03K14j9j42QJ08m3r6L1OQ5Q9r5p6K0K3J2n7m8L4l6j7J44P3r9m6PN2P2
4680B37r1o7l4M8P5K9o8k6oJ9N9L1M8r7OK0q3J1n1M0L5L9rj44J71J09k33K55Jk32l7N9J37
4293B51q4j32RJ27j02K9l0R5Ok1O1J38k04O8n5l7m5J16j33N8lL9l9L4n3L7L0q9QrJ99j68n3
3906D8O0n4K22o4j62J30J13j70j2M1P5j73R6j02P8m1J0N6j12K9J9Q9L7j6j43O3N4r5J58j8
3553B16Jp0j04Q7n1N3K2p2J0L0q7J20k4J2K0k0L8K7r2J25j70Q0M7K3Mq1k3J8qRL3o3Q0n0l6
3143A04K3O3j4k8o7J6j6P1Q5j20K0L9j9q8O7K1q3J69j9j43P6K02k9k13pj0J28p8l9n7Q7p0
$$ plain form
5807 47 99 148 93 96 83 71 58 113 92 171 73 179 299 19 157 247 129 94 268 232 75 128 32 24 224 210 83 37 112 105 169 272
5431 272 243 111 267 257 267 360 97 211 183 193 70 146 31 186 264 313 101 190 161 123 232 241 207 221 64 53 142 67 81 102
5079 102 91 50 92 113 136 33 247 228 86 94 202 159 63 94 100 185 274 179 103 123 146 158 101 53 87 51 34 178 251 152 106 113 165 237
4680 237 146 79 45 93 168 197 129 103 97 116 175 206 254 157 163 183 100 111 60 100 135 174 165 21 192 301 68 323 324 92 55 114 251
4293 251 167 35 44 171 69 98 68 163 169 148 209 347 143 211 156 119 74 190 57 115 112 151 112 146 93 130 160 71 79 70 269 101 48
3906 48 108 54 276 212 50 180 293 123 111 152 227 54 150 48 126 85 95 151 39 68 87 176 213 197 54 117 171 76 234 216
3553 216 217 147 43 130 79 132 154 82 92 122 35 155 131 143 163 143 181 208 116 241 71 151 198 221 225 144 121 139 131 140 173 110 190 140 104
3143 104 127 190 176 148 81 97 81 152 237 117 137 176 157 69 136 157 74 243 224 81 157 359 330 117 110 100 228 150 111 54 141 71
2767G1K08p6K4k9p1k5J47j88K04n3l3P2R1l10M1J09j17J06j19J08rj6J29p0m9n5o8P8O1p1
2415I0L0%P3L3j10k3Kk3K0K5Q5n7L6q0n9oL3J20j8N2r0K6Lo2QO2k9k6K1N6p9j8k1N2j2N8L4
1981B06l2L7j21J19j57J01j01J06K9m4J97K2j74m5L0Jj16l4M2k2J8L9n2J31kL3N0j39J34q0
1628A76k1j18J81Np9Q6j27l9l6L1L2L7k3q2J15K6lQ6Mj08P4j96K5M8qk2N7J58j06o6k4O5o6
1241H2J02j9j12J18K03k30R5m7K3l7pj51R7o1R8j13J28K6n1RJ45j12r1M2M0j63L3N4J55J10
889C66l03M1K4O9j43J2k3J20m7J9j01K38j27j03R0m9J33M4L6k09M7p5J15n2pN0M3m8p4RJ3
525A08Q4M1J4k06R9o6N9L8Jo2K0J08J0j56J2k9j7oJ85n5m4jo7Q0RR9j74J56j26k6J7L7J49
138B91j54p7P8P6l3j37J31m3p9P1J15n6j17Q8J1q9N4o2O2K0N3j03n2R0q9J09k1j4
$$ plain form
2767 71 279 203 227 198 127 102 249 61 265 212 179 251 342 32 73 182 65 171 52 160 151 135 264 194 145 90 22 100 161 90
2415 90 120 120 193 226 116 93 95 72 92 117 202 145 181 101 42 36 69 189 171 223 133 159 162 100 108 170 141 115 136 192 113 95 74 126 114 172 206
1981 206 174 211 90 209 52 153 52 158 187 143 340 362 188 143 173 174 58 24 66 44 62 101 49 180 178 211 261 122 256 176
1628 176 155 37 218 223 144 230 103 64 28 59 91 128 105 23 138 164 161 247 251 143 217 21 46 94 86 64 121 279 173 107 83 148 82
1241 82 184 165 53 171 374 144 239 192 215 178 171 20 117 56 154 41 169 195 144 153 298 186 95 137 177 14 47 101 256 366
889 366 63 104 128 197 54 66 43 163 116 135 34 272 145 42 132 83 216 260 296 87 134 59 174 122 115 165 208 160 86 95 108
525 108 192 233 247 41 140 74 133 171 172 110 130 238 248 92 104 75 58 52 237 182 138 137 70 150 159 258 84 240 114 88 105 142 291
138 291 137 60 138 214 181 44 175 132 53 124 239 183 66 154 165 76 130 68 130 150 203 100 48 138 49 158 137 123
-191A23
##PAGE=	F1=-15939.3
##FIRST=	25168.397401625570637,	5807.04592319999756,	0
##DATA TABLE=	(F2++(Y..Y)), PROFILE
5807F3M1M2n3l2k6O1n4Q6n6J14q5Q3O9k29R0P3m7o2J79l8j68O1q2oJ76L2j53j6P9m3J6J48
5431B63oj36J17j7N1J09l00J39K6Mj60K2q5J54O9L3k26J33l0n1J10J7j7K8j73m0R4o5K2N8
5079A43K6p9M8J5j1j15K11j3j56k2J06J7r4k6M9J12N9r0p0o%k4rpL7m1k1J32M1j06PrO7O5
4680B36q9o4l1j6J48k0p8PM2O7K6m9J41j48l2M7q0K4q9J8P3Q6oj68J66P0k07K27Mk17l7N4
4305A05J47j20o2j5Q4j00P2m8O5L8K4M1J34j69K2n7l4j1R1j34N4k4K1k5R0k0o1N8o8ok4J97
3929B65j76j6J8m2K04p7j18J22P2j47j6J8R6j47O2rOm4J3O9q2L7r0J14Q5l6j41N9P2j42J65
3565A94k8K9J9j56Q1m9Q1j4j23N3K7p4J02LJ1J5o6M3N3o5P0j37Q3Q3K5p3K7p5m8m9J13M3j28
3178G0Q4j9j6pQ4Qo3l4J2n7R2J21j42k0M8p6n7J05Pl0J19p0n7J15J53m5k26J9n6J12o3k4j4
$$ plain form
5807 63 104 146 93 61 35 96 42 128 72 186 101 184 253 24 114 187 140 78 257 219 51 112 30 24 200 232 79 63 142 99 115 263
5431 263 257 121 238 221 272 381 81 220 246 250 90 112 27 181 250 283 57 190 160 109 219 236 219 247 74 34 128 63 85 143
5079 143 169 90 138 153 142 27 238 225 69 47 153 170 76 50 99 211 270 180 110 104 104 80 71 64 101 60 39 171 212 106 113 104 171 236
4680 236 147 83 52 36 184 164 86 93 135 202 228 179 320 172 140 187 107 131 42 60 133 219 213 45 211 281 74 301 305 88 51 105
4305 105 252 132 70 55 139 39 111 63 128 166 190 231 365 196 218 161 127 116 207 73 127 103 124 99 189 169 108 166 98 92 68 265
3929 265 89 73 91 49 253 176 58 180 252 105 89 107 203 56 118 109 115 71 84 153 71 108 18 132 217 181 40 99 171 29 194
3565 194 166 195 214 58 139 90 171 157 34 87 114 40 142 145 156 171 105 148 201 136 206 69 152 235 260 187 214 139 91 42 155 198 70
3178 70 154 135 119 112 196 204 141 107 119 62 154 275 133 113 161 85 28 133 140 110 229 159 102 217 370 325 99 118 62 174 111 87 73
2791G3Q6k6J15k9K7l5j01RJ36j88J54l2nP5R1k67L3R0j25O2p8N4jN3R2p8o2k2l6M6N4p9NP9
2391A70j2K9r7M3j2l8M1OL4o0Q2j09m1J2PJ09jN4l2m5J3l5kK7pr3K2Q1j6p4PjK9J27j7p2O7
1957A96q0J02j87J40j21J09M2l3K16Pj68n4L9J3j50m8N9o7M0J05j10R5P6K2L3j79J85j8r1
1617A73j25J90n4j11R7q5j1Nl3R8K2m9o0O1J7J8R7m0o3L7j69L4Q2l2k1M9J32j07l7r2J20n6
1241H7J01l1p6L0K85j96J8q2O6k7L8j90O2l9J53j46J13K9k9L1J16j34p8J2N5j37%M5K07R7
889C80l27K7K3L4n6J0m5J82m7o4q9K69j80k4M3j5J06N7nk47R0p3R4l8m1J37L2n3r5K3L7R2
513B37J4Jj82P4j06Q2R3l1j16P8K6Mj11N3k6k0l4J64m6LK2n2N2nP4j57J76j63j7P4L2J13j76
126A30o6P7Q3m4j35J05j3l5J4J10m5j03L7K2p6N3o4M2M1Q1j02j03R3m2Q7l4k5
$$ plain form
2791 73 159 133 248 219 246 211 110 119 255 67 221 189 184 259 350 83 116 206 81 143 65 119 118 171 263 185 123 101 65 111 165 86 91 170
2391 170 158 187 90 133 121 83 124 130 164 104 186 77 36 48 55 164 163 217 185 140 153 118 116 143 136 43 65 146 130 56 63 62 91 218 201 129 196
1957 196 116 218 31 171 50 159 201 168 384 391 223 169 208 221 71 23 82 15 55 160 50 145 221 243 276 97 282 264 173
1617 173 48 238 184 73 170 85 74 79 46 144 166 117 57 118 135 153 250 210 147 184 15 49 131 99 78 127 259 152 115 23 143 87
1241 87 188 157 81 111 396 200 218 136 202 175 213 23 85 46 199 53 166 195 166 197 313 179 101 113 168 31 31 76 283 380
889 380 53 80 103 137 81 91 46 228 181 117 28 297 117 93 136 121 227 284 279 32 122 49 143 105 64 201 233 180 85 108 145 237
513 237 251 252 70 144 38 120 213 182 66 144 170 174 63 116 90 70 36 200 154 157 179 127 179 174 248 91 267 104 87 161 193 306 130
126 130 64 141 224 180 45 150 137 102 116 226 181 78 115 137 61 114 50 92 133 214 112 9 102 60 147 113 88
-191H8
##PAGE=	F1=-16041.5
##FIRST=	25168.397401625570637,	5807.04592319999756,	0
##DATA TABLE=	(F2++(Y..Y)), PROFILE
5807A06J1K1l9p6K5O9p1Q8p2J33q3P9J8j86P1L1K2q2J46k0j53O1p6JJ26R2r9o0R0p5m1J87
5431B44rj07O8l0J02J03k54J09Q8k5j85k9oR8N9J6j97J42l2o5R1L0J2L0j38j05R5o6K7R4O9
5068B29r6K3J3l8q7J74nj60l7R9O7l3l6j5J42J4q5m1rn0k3K0M9Pm8l9J07K6p5L5l3P8N0q8
4669A35m3N1j04J63n7j25P2Q5R8j9r2J90j86k7Q4j12K5j12K4Q4J12Oj67J15L5j49J76J7k00
4328G9j6M7J38j52Nj5L0m9M3l3J7N3O9L6J15j35k9o3KJ4O4j38M6l3k2OJ36Rj26M6m1pl2J89
3929B53j72LroJ57r5n9R7K8j25j7QR7p7J6O6n4m9J2R3p2N5l8l4J21j9j54M3R6q0M6j5P5P7
3530B68j86P8o6J05l1j60O6L8o6Q2M6jLr7L7Q3k0k3o4O0R0J3j20J25j20m9l1J33K1j57N6M
3154A17J5j3P1K9r4PJ3j09J08J30j47m7O1j20N1L9KK7O2q7N4J10Q2o0k30O9j11Q2m7j5L4P3
$$ plain form
5807 106 117 138 99 23 48 117 46 134 62 195 112 191 209 23 94 125 147 65 211 191 38 99 23 24 150 242 143 83 173 98 57 244
5431 244 235 128 196 166 268 371 117 226 314 289 104 75 69 167 226 242 45 187 155 90 181 211 223 253 115 10 105 39 66 160 229
5068 229 133 156 169 131 44 218 213 53 16 115 182 149 113 98 240 254 169 128 119 69 46 66 115 122 74 35 142 168 93 128 95 173 223 135
4669 135 92 143 39 202 145 20 92 177 275 256 164 354 168 141 225 113 138 26 50 134 246 252 85 200 235 86 262 279 79
4328 79 63 110 248 96 101 86 116 67 110 77 94 147 216 252 367 232 203 140 142 156 220 82 128 95 73 79 215 224 98 144 103 96 64 253
3929 253 81 84 75 69 226 131 72 169 197 72 55 63 160 83 99 165 111 62 74 167 95 150 112 78 199 180 26 69 165 85 131 116 191 268
3530 268 82 160 94 199 168 8 74 112 46 128 174 173 176 79 116 199 179 156 92 152 242 255 135 260 140 91 60 193 214 57 113 117
3154 117 132 119 190 219 125 132 145 36 144 274 127 80 141 21 72 111 113 140 202 115 169 279 361 301 71 140 29 111 64 49 83 156
2779A56L5J5J6K0l9j25R2R5j74P5k2L5P7R9k25K2N8j18J1k2j2pJ52L6r7n5RmJ7M3p8rJ13p6
2380A13J9o0J03m4n5P2K3n9m3J04j14j9J5K9L8K0M5K1r7M0Rl4k2J3n1l2O0L4j00L0l0L8J76
1992B42n2r4Q6m3P3j90J48j38J26N0k0K15j7j41m6L4L4j79o3R1n4j6J62p2pJ29qRj81K16M2
1628C36j49j37J88r6m9Mj0PK4p7J40oo0j7mJ7M1R2p3n6J1j21O1Q9n2j3K3J11q8j5o7R0m3P7
1229A78m1j4p8L27j31m8j08R6rQ5k32O3M0J06j74Q3K9lM6R5j31l3j9J5p1l2M0K25N9l16L2
866G9J9j2L9nl4J83k5j08q8K73k17K6J7jP9N7l3j51J5o9P3l0l3J79On8j05M1N7J18j7l6j27
478A12L2j33J36Q1o0j12R0m2mo4J06l8j1m9J16l0M6L0n4N5l0L9p7J23j60j4J07M5O0j87m2
114G1Q1N8n8r8O7L6j0m6J05qj22J4L2l9M6p0oN3J09r2r7L3L0M7n0j7
$$ plain form
2779 156 191 206 222 242 203 78 170 265 91 166 144 179 256 355 130 152 210 92 103 81 69 62 214 250 153 98 107 103 120 163 85 76 189 113
2380 113 132 72 175 131 76 148 171 112 69 173 59 40 55 84 122 142 187 208 111 151 160 126 104 117 66 34 94 128 28 58 28 66 242
1992 242 190 96 182 139 212 22 170 32 158 208 188 403 386 245 199 233 267 88 25 116 62 46 208 136 129 258 250 259 78 294 336
1628 336 187 50 238 142 93 97 87 94 118 41 181 175 115 98 94 111 152 244 171 115 126 5 66 155 103 90 113 224 136 121 54 144 101 178
1229 178 137 123 45 372 241 193 85 181 172 257 25 88 128 234 60 143 172 169 215 310 179 146 127 142 71 39 79 304 363 47 79
866 79 98 86 125 120 86 269 244 136 48 321 104 130 147 146 225 282 249 98 113 44 117 87 54 233 239 181 76 117 174 292 275 239 112
478 112 144 11 147 228 168 56 146 104 100 36 142 104 93 44 160 130 176 206 152 207 177 216 139 262 102 88 195 240 300 113 71
114 71 152 210 152 54 121 157 147 101 206 198 76 90 122 83 129 59 53 106 215 123 26 59 89 136 86 69
-191F9
##PAGE=	F1=-16143.8
##FIRST=	25168.397401625570637,	5807.04592319999756,	0
##DATA TABLE=	(F2++(Y..Y)), PROFILE
5807A34k5J6j2p5M6L8o0O4p6J47q7Q0j9j29P5k5N0p5P1J6j11M4o5K2N3J37k8j13R8r5p4J96
5431B18l1n2K1l2J24Q0j83Q6J40o7j97p0O4M7M4J3j28J10m6p8N0O1N2J1r5j19N8p7M1J09J07
5068B61j00j5J5o1k4J17Oj29l4N4J03K1m5p5J55k2p8j3K6p5K5rP8m7n1m7P0N8l5Qm7P9K6q1
4669A14j1J26j23J09q5o8L7J19R4n2q2J71k10J5J17j55J3j11O9N8J13K2j58M3J1p5J05M2j72
4328G6J0L3J22j76N1ml0K3rJ4l7M6J01L7R3j08o5o3M3K8M3j47L9k6p1L6J64K5j33k0j0Nl3
3941E7J81j60Jj7K2J14j08MN9lj09PoP0J3J1P2r4l2jJ00q1R1rj40J30K0j35j6J13J2j04J6
3553G8J20J05k14Q5q3J24l6j42L2M4o8P5R3j2k0r7K3J01%j08K5L2O4j3j37K05j32j2qJ06j9
3190B11j36LJ3M8jL7M7j13M0L4j55J07J02j38m7Q9j9j7k3JP3J1n0J11J09Pp5k23J17j30K2
$$ plain form
5807 134 109 125 113 38 84 122 62 126 50 197 110 190 171 42 117 92 142 67 138 154 43 87 22 44 97 234 206 93 191 96 22 218
5431 218 187 135 156 124 248 328 145 231 371 304 107 37 101 148 192 205 77 187 141 63 113 174 226 237 142 23 81 4 45 154 261
5068 261 161 146 161 100 76 193 199 70 36 90 193 214 169 94 249 227 149 136 162 87 112 103 181 134 83 36 106 164 129 137 90 169 195 114
4669 114 103 229 106 215 130 62 99 218 312 260 178 349 139 154 271 116 129 18 87 145 258 280 122 165 176 101 206 248 76
4328 76 86 119 241 65 116 112 82 105 96 110 73 119 220 257 350 242 177 114 157 185 228 81 120 94 23 59 223 248 115 95 85 90 57
3941 57 238 78 79 62 84 198 90 94 153 150 41 48 42 112 125 136 208 114 82 81 181 100 191 182 42 172 192 57 41 154 166 62 78
3553 78 198 303 89 174 91 215 179 37 69 113 45 120 213 201 181 84 107 208 208 100 125 157 221 208 71 276 144 132 124 230 211
3190 211 75 78 91 139 138 175 222 109 149 183 28 135 237 99 52 141 122 105 82 83 156 167 117 228 337 344 269 46 163 33 55
2826E5j4%M4N6Q7o9M8Rk8j48J94M4j59J4l9P1P4J11j83PK2j08l4L8J3q0K18j8j22k2K1J6m
2438A14M2n1NO0j07J1J5J13q0p0J11N7j44j2P6n6l5PP0n8L5L8O2j18N8N3o7p0K3K7m4j6N1
2051A00n8J6j2qK01o3q4Q5k2L7j56J15j46J52N9j8J83l9r3k9J7N9j86q4J27k8r2K06m5o3J46
1687B77m5k0j47K15R2j87j50J86j19O7q4K4j9M7p2J34m3n0J7l2J8M3P9q6p6K2o7N8P4n6nj3
1312H2J04o0mk0M8j5J7m2L9j32K85m8q7r6R0MJ23k27M6R1N3j91M1M7LN5Q6j05j0ql9j3p1N1
912I7K12J8k74L5j4j5R6lj4J40Nj06j16K76k34M7J4qN7M5m1m4o8o5N7k8J5J66k9o4r3O1P3
525A98J52n9p6n6j7j37J69L6o2o0N0q6L1o9J51n7J6n6N6oP0K8p4O9m5OLM5j02k4J11N6Qj72
126I7j4Q3No9l0L1O5Lr0J00K2j50L1K6L2K6q6n6N8J24q7p8j0Q1J1o0K4
$$ plain form
2826 55 41 41 85 141 228 159 207 216 188 40 234 278 119 133 94 165 239 350 167 174 196 88 54 92 105 25 243 225 103 81 102 118 114
2438 114 156 105 110 170 63 74 89 202 122 52 163 220 76 64 140 84 49 56 126 68 103 141 203 85 143 196 129 59 82 109 65 49 100
2051 100 42 58 46 38 239 176 92 177 155 192 36 151 5 157 216 198 381 342 249 220 237 296 110 26 153 125 33 239 194 131 277
1687 277 232 212 65 280 372 185 35 221 102 169 85 109 90 137 65 199 156 106 123 91 109 152 231 145 69 91 24 82 156 100 95 82
1312 82 186 126 122 102 150 135 152 110 149 17 302 254 167 71 161 165 288 61 107 198 251 60 101 148 151 206 292 187 177 169 130 117 46 97
912 97 309 327 53 88 74 59 155 152 138 278 283 177 61 337 103 150 164 156 213 258 217 173 105 40 97 69 84 250 221 157 64 125 198
525 198 350 291 215 159 142 5 174 210 148 88 138 52 83 14 165 108 124 68 124 118 188 216 142 211 166 172 175 220 118 94 205 261 269 97
126 97 83 166 171 102 72 103 168 171 81 181 203 53 84 110 142 168 82 26 84 208 121 43 33 114 125 65 89
-191H9
##PAGE=	F1=-16246
##FIRST=	25168.397401625570637,	5807.04592319999756,	0
##DATA TABLE=	(F2++(Y..Y)), PROFILE
5807A35o5M6J8o3L4Ml1K4p4J64q6P1m2n3P5m9J6m4j3N3o8K2l2L8K2J06L2j46R3j02m4J45n8
5420A28J0j1jQ4M9j10Q6J68j10j91r9J09J2K3K6o2Q4p8q3j0J09J01k9o6q8J5j4J1O3J29q3
5056A72n7K7q7M4P3J8q1m5J4J24N4o5r9J41m0o9mP4o0M2k4Q8j12m5l0L0J14k9l9l6O3ko2J7
4657A09J91j28N3j17L4k9J38N6n9m2J00k20P6J40j85j2r1J11M4R3L2j42l0JLJ7P0j28K5J2
4305A22J08j83O6J4q3J22q9P4q7K4J09M7O9r3p1l9N3L5L1j53K8lm1k1J80K2r6r7LK3l2J79
3929B21j30k9qL7P9j07N2K9kj05N3m7L5R2L3L1j13lj8Q8j04J45j3j59R9O2j15o3J04Q2k05
3565B1N8J18J18k36R2q5J33l8j31N1J3p8Q7J27j5m6q2K2R1qj56J00J2J3m5j12K43r8pj3J00
3201B49o5r0l9RP3J4NO2j16N2P1j62P5M9j29lJ18M9j06k8l1R7k3RJ20J20m7r3j92J26j15m5
$$ plain form
5807 135 70 116 134 71 105 109 78 102 28 192 106 177 135 82 157 108 124 80 67 120 52 74 42 80 102 208 240 94 187 85 41 186 128
5420 128 138 127 126 210 259 149 235 403 293 102 3 112 124 147 173 111 195 117 34 24 133 234 205 139 51 66 52 63 126 255 172
5056 172 115 142 55 99 172 190 109 64 78 202 256 191 92 233 193 124 120 194 134 176 152 240 128 83 53 83 197 168 129 93 156 154 92 109
4657 109 300 172 225 108 142 113 251 307 248 206 306 86 162 302 117 105 14 125 169 262 294 152 122 123 126 143 213 85 110 122
4305 122 230 47 113 127 44 166 77 151 64 88 197 244 313 220 149 110 163 198 229 76 104 101 60 39 219 241 145 48 51 74 42 221
3929 221 91 62 54 91 170 63 115 144 142 37 90 43 78 170 203 234 121 118 100 188 84 229 216 57 156 218 103 40 144 226 21
3565 21 79 197 315 79 171 86 219 181 50 101 114 36 123 250 235 189 107 129 220 212 56 156 168 181 136 24 267 169 162 149 249
3201 249 184 94 55 64 137 151 156 218 102 154 225 63 138 187 58 55 173 222 116 88 57 154 131 140 260 380 333 240 48 174 59 14
2826A4L8J8J3M6J10j18N1NKj72K85Kj46Kp3O4O7J23j43oj2j08k9Q6O9r2J46n7j33K6OJ4rN4
2427A43oK9l9j15J7R5Q5j14n3J28Q7j66j7L0K4p2jJ01j29K1N2Q1r0L6P8q1q9J3P5k9n9J9J8
2039G2j2Km4J94n0o0P7k0Lj12O9r4J39O9l5J16n1l1pqP8j62r1J42Oj58K15l1q6J44q2m7q5
1652F0J79J28k08j49J90j22J58p6k4q5R6l6Q7q0j0J9j7PK7O9p7o2M1o6M2M1l9jm9J13l1jJ7
1265A41J9J8o4l1O6q6J38L0q3m8N7lJ34j84J2J29%j90qJ17k8M0Q5n7k9K1m6J8r8L9J87j0k15
877G1J6n9M7R5J5LO4L9p7j41K64k31N0K3k3M3J9l0L1j27l5L0l1N1J44p1o9n7P6Q8J80j09r4
490A95J0o6j26J67nk7k9Jj00J09j22J71q2N0o1J5K2O5J9r7P3m2j6N3l0%m0Q5N7l1j28MP5o0
91A09o6N2J8M6Nj11R6L1j54O0MJ08Qj04o7N0J10r4n5oQ0j0n6O6
$$ plain form
2826 14 52 70 83 129 239 121 172 177 179 7 292 294 148 150 77 141 208 331 188 182 170 62 33 119 188 96 242 185 52 78 84 98 89 143
2427 143 137 166 127 12 29 124 209 95 42 170 257 91 74 104 128 56 55 156 27 48 100 181 91 127 205 124 35 48 123 94 35 54 72
2039 72 60 62 18 212 162 102 179 159 162 50 119 25 164 233 198 314 263 232 225 217 295 133 42 184 190 32 247 216 130 274 192 145 60
1652 60 239 367 159 10 200 78 236 160 136 51 147 111 198 118 108 127 110 117 144 213 136 74 115 49 91 132 93 92 43 156 125 124 141
1265 141 160 178 114 83 149 63 201 231 148 100 157 154 288 104 116 245 245 55 47 164 136 176 261 204 175 196 150 168 70 109 296 286 71
877 71 87 28 75 170 185 188 252 291 214 73 337 106 156 179 156 199 218 188 219 92 57 87 56 107 251 180 111 54 130 218 398 289 195
490 195 205 139 13 180 175 148 119 120 20 129 7 178 96 146 85 100 122 187 206 109 182 140 124 177 147 147 107 192 249 218 90 94 169 109
91 109 43 95 113 159 164 53 149 180 26 86 90 198 206 102 35 85 195 101 46 40 120 110 54 120
-191A20
##PAGE=	F1=-16348.3
##FIRST=	25168.397401625570637,	5807.04592319999756,	0
##DATA TABLE=	(F2++(Y..Y)), PROFILE
5807A08q1Q9L5o1J8k5Lj9m8J64p4M8o4L1O4n7j9j7%Km4MJ5N3L7QO2j45P0r3j2R1p1O2k6L9
5384A47J1J9m3J04J66j43j56o3N8lj0N4lP1j25n0M1J8J55p7o2l7jK7Lj4J23m4r4N4j17R2O2
4997A63K2l8n8j3J33O3r5q2J03k8p0k6J20j8M3k4Q4j76k9PKJ40l8q3NK9k8k9K9K38j18Lj52
4610G9J22p1J40lm0JPk17J34J53j88m8n9J43N1N7L0j20q6MP0p0R0q0K8j5J02j70N2M0o3J72
4234B45j79J24j32NQ9O3M5r5m4LK4M7L2j34j6L5oq6J87Km3q8n6L3k4J66o6q4LN3M4r3P3J6
3835A43K5j30Q8q3L6J21O1j5j14J5l9P5j27K03m9j34R1Q4j07r5Q9J12k10P9N6J29k40R1o3
3495I2J21m4j15J04m4q6J13J37j6o3p0L2O0k9j30J14Qm1q1J1J73l3n4k9J16j12l1o0mQ5K4
3131A48j0P2j02M1J10j52N0K3j42L7J43P8j84K8r3Q8l4N3J05J42o5j10j49R3r0p3O0K2j2M8
$$ plain form
5807 108 27 116 151 90 108 83 86 67 19 183 109 157 93 124 188 131 112 95 95 97 53 57 72 125 162 170 232 87 157 64 52 143 72 134 108 147
5384 147 158 177 134 238 404 261 105 42 100 97 87 141 138 209 84 34 75 93 248 171 109 72 71 98 101 87 210 166 72 126 9 101 163
4997 163 185 147 89 76 209 272 177 95 198 170 100 74 194 176 219 195 279 103 74 81 83 223 185 102 107 136 108 79 108 346 228 231 79
4610 79 201 130 270 267 227 228 235 18 152 305 117 69 10 153 204 261 291 171 85 89 159 89 179 99 127 112 214 44 96 136 73 245
4234 245 66 190 58 63 152 215 260 165 121 124 148 195 227 93 77 112 106 20 207 209 166 78 22 55 31 197 131 47 50 103 147 54 127 143
3835 143 168 38 126 43 79 200 261 246 132 147 108 183 56 259 210 76 167 251 144 49 138 250 40 119 175 304 64 155 92
3495 92 213 169 54 158 114 28 141 278 262 199 129 161 221 192 62 176 184 143 62 73 246 213 159 130 246 134 103 43 39 124 148
3131 148 138 210 108 149 259 107 157 180 38 75 218 296 112 140 47 135 101 154 259 401 336 226 77 170 80 7 67 89 77 125
2779A25R9j12QJ7M1j65L17k3j32K1p9lN6J24j06j0l8j27P2Q4Q4q3M1p7p2J8l0KJ1O9K9N0j23
2391H8m7j2J26M1j35K5R2R1j49n0L2N9j05%J05j12k1O5O2k6j7O8o9m3jM1No6JN5m0Lk1J30
1992A75k5m0O7k8k2o9K6l4J38O8p1K6m1L2J2l8P9r9o6J18M4j95J77k6r8J36j05o4pJ09J45
1628C24k15n4J32j09K01m4p2j16J19rL2j03M9j9J4j7RO8n0j4K1p7K1jpNo7J09KOK9%N1j47
1229G1j1N7k5K0O4l0j3M8m1J06j11k6J58m6j73lJ75p3j3Q5Op8M1j0M3j10qJ68k2j58j7j8N8
842A14O1M0Pk6P3l6j44K26k04M3L3l6L5j9mO6j60K1j0l1O2J22j11p1kQ4J00J90j59p1M7j06
466A34j10J48lQm1m0o2J34j50J60j09P7o2RL9L8Oj06N6j9k8O3q3J19n6L5N3n4o8J1N5j17J6
79E3O4K3pj0r4Q0K7r4M3l0J77qj09o1N1P4j15j3nN3om4Q9
$$ plain form
2779 125 224 112 120 137 178 13 330 307 175 196 117 114 170 294 188 178 140 13 85 169 253 170 211 134 62 80 50 52 63 132 161 211 88
2391 88 41 29 155 196 61 86 178 269 120 70 102 161 56 56 161 49 28 93 155 129 112 180 111 68 67 108 113 47 48 103 63 66 45 175
1992 175 150 110 177 149 127 58 84 50 188 256 185 211 170 202 214 176 255 156 90 208 252 57 234 208 110 246 141 77 70 179 324
1628 324 109 55 187 78 279 235 163 47 166 157 189 86 135 116 130 113 122 190 140 126 147 70 91 90 83 88 21 130 132 138 167 167 218 71
1229 71 60 117 92 112 176 146 133 181 140 246 135 109 267 221 48 45 220 147 134 219 225 147 188 178 221 111 103 271 249 91 74 56 114
842 114 175 215 222 196 269 233 89 315 111 154 187 151 186 167 163 229 69 90 80 49 111 233 122 51 49 133 233 423 264 193 240 134
466 134 24 172 169 177 136 96 34 168 18 178 69 146 84 93 132 170 176 70 126 107 79 142 59 178 122 157 210 156 88 99 154 37 53
79 53 117 140 133 123 29 109 136 42 85 55 232 224 115 54 105 179 64 51 46 99 93 49 138
-191A38
##PAGE=	F1=-16450.5
##FIRST=	25168.397401625570637,	5807.04592319999756,	0
##DATA TABLE=	(F2++(Y..Y)), PROFILE
5807F2K9L3L1o3Pm1K5n5K4J19n2K6r5J06M1o5Jk6N9q7l9pP2O8M7q9N4j09L4o1kN1o3Q1k6O0
5384A50n1kJ8J20J39j57r4m9nOm6P8M9O9j73OR7r8K02j10p3QJ2L3%o8P2J1j12R1p5L4Q8J4
4985A84j0o4l2J33N1j30k2M3L1r2q6J54M3L7j9P1k24lM8k5J30m2j05N5j4m5J1J8K60q6l7j86
4610D7J76p6J24o9%L4q2r3O4J56j63r1k2J70O6J7J2r1j10QJ09j30R5m3K4m7J07j41J9P4j8
4246A26J90k40J38j57pM5Q5J3j07KM1k3P9M2q3j05Q0J8r8J56l3Nm3r3K4MJ01K2j36pQ9J2q3
3859E7P0J3N8j80J19q9N1J07Q9m3j09J2n7P4j15K16j06q7J20Q1j10j25R1R7j85J21l9J44k16
3518E9P8k4Q7n5p8J47j03q1J35J22j3p0o6M6K1n2p0R8J8p1r8Q4J07L4j33l7J43j56L3o1k7
3154A7Q6K5KP0p8K0J30j23L9M9j79K3J68Q2k21Q9j32L9j4N7P7J74n3j23j10L7n3r0Q2Mk6N9
$$ plain form
5807 62 91 124 155 92 99 58 83 28 52 171 119 145 50 156 197 132 133 107 166 79 40 33 105 173 220 131 185 76 110 49 47 98 35 116 90 150
5384 150 99 97 115 235 374 217 123 74 69 75 29 107 156 225 52 58 155 57 259 149 76 84 96 129 129 61 133 144 32 123 48 82 170 184
4985 184 174 110 78 211 262 132 110 153 184 92 6 160 203 240 221 292 68 65 113 88 218 176 71 126 112 67 78 96 356 270 233 47
4610 47 223 147 271 202 202 236 154 61 125 281 118 27 5 175 241 258 270 179 69 77 186 56 151 108 132 85 192 51 70 144 126
4246 126 316 76 214 57 50 95 180 193 86 88 129 106 185 227 144 39 119 137 39 195 162 167 124 31 55 59 160 182 46 39 128 140 57
3859 57 127 140 198 18 137 48 99 206 295 252 143 155 98 172 57 273 167 80 200 281 171 46 137 234 49 170 131 275 59
3518 59 137 113 200 145 67 214 111 30 165 287 274 204 138 184 205 153 83 181 199 128 30 114 221 255 122 85 228 72 105 44 17
3154 17 103 128 130 200 122 142 272 149 188 237 58 81 249 331 110 199 67 106 92 149 226 400 347 224 114 151 98 8 90 94 68 127
2779A27O4o2o5M2O6j51L17k6j16M1o4o1L0R7o9nn1o0Q8Q3N1m9p3p7L2l3m9L5L0L3M0N9j46
2391G8J7m2J23qj19R1N2O0j21q1Q8L1j18LQ4p1K2K2K6K9n4J3k9J0Pm1N4p2N4K9o9oJ4O8jk8
1969A15M8l6k9l5LkJ60N2j13p2K2O2J7o3N2lj7O2P7k11J15j6j20J32j00l6K7K7J36k02P1O7
1593A90j00K04j2r1n2N6noq8Q6p9L2l8lP1j9K7j7o5ql0K5K2o1N8M6K7J0j5P5j96lK0N0K1k9
$$ plain form
2779 127 191 129 64 106 172 21 338 312 196 237 173 112 142 239 170 165 114 54 142 225 276 227 154 77 109 76 27 62 92 125 165 224 78
2391 78 95 53 176 168 49 140 192 252 131 50 138 169 51 54 138 67 89 111 137 166 112 125 96 106 113 72 126 54 108 137 68 62 76 144 143 115
1969 115 163 127 98 63 66 64 224 276 163 91 113 175 192 129 181 178 161 223 300 89 204 188 68 200 100 64 91 118 254 52 123 190
1593 190 90 294 282 191 139 195 190 184 96 182 103 135 97 94 165 146 173 156 91 83 53 78 100 39 97 143 170 180 165 240 44 41 61 111 132 103
$$ [...]
-191A75
##END NTUPLES=	nD NMR SPECTRUM
##END=	
##END=	
