##TITLE=	9HwX45s1SmS1SeMIoj8NPg.24.ser
TM-VI-191, CD3OD hmqc

##JCAMP-DX=	6.0	$$ MestReNova 14.3.0-30573
##DATA TYPE=	LINK
##BLOCK_ID=	1
##BLOCKS=	2    
##ORIGIN=	Mestrelab Research S.L.
##OWNER=	hrzepa
##$MNOVA/LINK_BLOCK_TYPE=	ITEM	$$ NMR Spectrum
##$MNOVA/ITEM/POLYGON=	(XY..XY)
5321,5835
8722,5835
8722,8208
5321,8208
5321,5835
##$MNOVA/ITEM/Z=	0
##$MNOVA/ITEM/ANGLE=	0
##TITLE=	9HwX45s1SmS1SeMIoj8NPg.24.ser
##JCAMP-DX=	6.0	$$ MestReNova 14.3.0-30573
##BLOCK_ID=	2
##DATA TYPE=	MNOVA NMR VIEW DATA
##DATA CLASS=	MNOVA VIEW DATA
##$MNOVA/2D/THRESHOLD=	9.4303693771362304688
##$MNOVA/ITEM/ZOOM/X=	-0.98135677571250334861,	11.004809999983093505
##$MNOVA/ITEM/ZOOM/Y=	-4.6325299116681737388,	174.98660000188448294
##END=	
##TITLE=	9HwX45s1SmS1SeMIoj8NPg.24.ser
##JCAMP-DX=	6.0	$$ MestReNova 14.3.0-30573
##BLOCK_ID=	3
##DATA TYPE=	nD NMR SPECTRUM
##DATA CLASS=	NTUPLES
##NUMDIM=	2
##ORIGIN=	Bruker BioSpin GmbH
##OWNER=	nmr
##.OBSERVE FREQUENCY=	400.32200160000002143
##.OBSERVE NUCLEUS=	^1H
##.SOLVENT NAME=	MeOD
##.PULSE SEQUENCE=	hmqcgpqf
##LONGDATE=	2021/12/04 17:12:30.000
##.ACQUISITIONMODE=	SIMULTANEOUS (DQD)
##$ORIGINAL FORMAT=	Bruker XWIN-NMR
##$MNOVA/SCALES_VERSION=	9
##$PARAMETER FILE=	(acqu2s, ASCII, /private/var/folders/f6/rjf_tdyn2v98c5c0wvkgn4s80000gn/T/9HwX45s1SmS1SeMIoj8NPg/24/acqu2s, 0)
$$ ##TITLE= Parameter file, TOPSPIN		Version 3.2
$$ ##JCAMPDX= 5.0
$$ ##DATATYPE= Parameter Values
$$ ##NPOINTS= 129	$$ modification sequence number
$$ ##ORIGIN= Bruker BioSpin GmbH
$$ ##OWNER= nmr
$$ $$ 2021-12-04 17:24:33.539 +0000  nmr@CZC2524DW0
$$ $$ /opt/topspin/data/agmb/nmr/Dec04-2021/24/acqu2s
$$ $$ process /opt/topspin3.2/prog/mod/go
$$ ##$ACQT0= 0
$$ ##$BF1= 100.660544
$$ ##$FnMODE= 1
$$ ##$NUC1= <13C>
$$ ##$NusJSP= 0
$$ ##$NusT2= 1
$$ ##$NusTD= 128
$$ ##$O1= 8556.27425043792
$$ ##$SFO1= 100.66910027425
$$ ##$SW= 179.955338625584
$$ ##$SW_h= 18115.9420289855
$$ ##$TD= 128
$$ ##END=
$$ 
##$PARAMETER FILE=	(acqus, ASCII, /private/var/folders/f6/rjf_tdyn2v98c5c0wvkgn4s80000gn/T/9HwX45s1SmS1SeMIoj8NPg/24/acqus, 0)
$$ ##TITLE= Parameter file, TOPSPIN		Version 3.2
$$ ##JCAMPDX= 5.0
$$ ##DATATYPE= Parameter Values
$$ ##NPOINTS= 12	$$ modification sequence number
$$ ##ORIGIN= Bruker BioSpin GmbH
$$ ##OWNER= nmr
$$ $$ 2021-12-04 17:24:37.078 +0000  nmr@CZC2524DW0
$$ $$ /opt/topspin/data/agmb/nmr/Dec04-2021/24/acqus
$$ $$ process /opt/topspin3.2/prog/mod/shimcntl
$$ ##$ACQT0= 1000000
$$ ##$AMP= (0..31)
$$ 100 100 100 100 100 100 100 100 100 100 100 100 100 100 100 100 100 100
$$ 100 100 100 100 100 100 100 100 100 100 100 100 100 100
$$ ##$AMPCOIL= (0..19)
$$ 0 0 0 0 0 0 0 0 0 0 0 0 0 0 0 0 0 0 0 0
$$ ##$ANAVPT= -1
$$ ##$AQSEQ= 0
$$ ##$AQ_mod= 3
$$ ##$AUNM= <au_zgonly>
$$ ##$AUTOPOS= <26 >
$$ ##$BF1= 400.32
$$ ##$BF2= 100.660544
$$ ##$BF3= 400.32
$$ ##$BF4= 400.32
$$ ##$BF5= 400.32
$$ ##$BF6= 400.32
$$ ##$BF7= 400.32
$$ ##$BF8= 400.32
$$ ##$BYTORDA= 0
$$ ##$CAGPARS= (0..11)
$$ 0 0 0 0 0 0 0 0 0 0 0 0
$$ ##$CFDGTYP= 0
$$ ##$CFRGTYP= 9
$$ ##$CHEMSTR= <none>
$$ [...]
$$ 0 0 0 0
$$ ##$ShimPowMaxUC= (0..63)
$$ 130000 130000 130000 130000 130000 130000 130000 130000 130000 130000 130000
$$ 130000 130000 130000 130000 130000 130000 130000 130000 130000 0 0 0 0
$$ 0 0 0 0 0 0 0 0 0 0 0 0 0 0 0 0 0 0 0 0 0 0 0 0 0 0 0 0 0 0 0 0 0 0 0 0
$$ 0 0 0 0
$$ ##$ShimPowMaxUG= (0..63)
$$ 524287 524287 524287 524287 524287 524287 524287 524287 524287 524287 524287
$$ 524287 524287 524287 524287 524287 524287 524287 524287 524287 0 0 0 0
$$ 0 0 0 0 0 0 0 0 0 0 0 0 0 0 0 0 0 0 0 0 0 0 0 0 0 0 0 0 0 0 0 0 0 0 0 0
$$ 0 0 0 0
$$ ##$ShimPowRcbType= 3
$$ ##$ShimPowRes= (0..63)
$$ 1e-20 1e-20 1e-20 1e-20 1e-20 1e-20 1e-20 1e-20 1e-20 1e-20 1e-20 1e-20
$$ 1e-20 1e-20 1e-20 1e-20 1e-20 1e-20 1e-20 1e-20 0 0 0 0 0 0 0 0 0 0 0 0
$$ 0 0 0 0 0 0 0 0 0 0 0 0 0 0 0 0 0 0 0 0 0 0 0 0 0 0 0 0 0 0 0 0
$$ ##$ShimPowRng0= (0..63)
$$ 1 1 1 1 1 1 1 1 1 1 1 1 1 1 1 1 1 1 1 1 0 0 0 0 0 0 0 0 0 0 0 0 0 0 0 0
$$ 0 0 0 0 0 0 0 0 0 0 0 0 0 0 0 0 0 0 0 0 0 0 0 0 0 0 0 0
$$ ##$ShimPowRng1= (0..63)
$$ 1 1 1 1 1 1 1 1 1 1 1 1 1 1 1 1 1 1 1 1 0 0 0 0 0 0 0 0 0 0 0 0 0 0 0 0
$$ 0 0 0 0 0 0 0 0 0 0 0 0 0 0 0 0 0 0 0 0 0 0 0 0 0 0 0 0
$$ ##$ShimPowRng2= (0..63)
$$ 1 1 1 1 1 1 1 1 1 1 1 1 1 1 1 1 1 1 1 1 0 0 0 0 0 0 0 0 0 0 0 0 0 0 0 0
$$ 0 0 0 0 0 0 0 0 0 0 0 0 0 0 0 0 0 0 0 0 0 0 0 0 0 0 0 0
$$ ##$ShimPowRng3= (0..63)
$$ 1 1 1 1 1 1 1 1 1 1 1 1 1 1 1 1 1 1 1 1 0 0 0 0 0 0 0 0 0 0 0 0 0 0 0 0
$$ 0 0 0 0 0 0 0 0 0 0 0 0 0 0 0 0 0 0 0 0 0 0 0 0 0 0 0 0
$$ ##$ShimSysFunc= (0..63)
$$ 1 2 3 4 5 7 9 11 15 16 8 10 12 14 6 17 13 18 19 20 0 0 0 0 0 0 0 0 0 0
$$ 0 0 0 0 0 0 0 0 0 0 0 0 0 0 0 0 0 0 0 0 0 0 0 0 0 0 0 0 0 0 0 0 0 0
$$ ##$ShimSysMatrix= 0
$$ ##$ShimSysType= 1
$$ ##$TFXNUM= 0
$$ ##$TRIPLO2= 0
$$ ##$VTU= 2
$$ ##$VTUETH= <149.236.99.20>
$$ ##$VTUTY= <no>
$$ ##$WBREFAM= (0..15)
$$ 132.2 106.2 100 100 100 100 100 100 100 100 100 100 100 100 100 100
$$ ##$WBREFLM= (0..15)
$$ 0 0 0 0 0 0 0 0 0 0 0 0 0 0 0 0
$$ ##$WBREFPH= (0..15)
$$ 77.55 -65.76 0 0 0 0 0 0 0 0 0 0 0 0 0 0
$$ ##$WBSGU= (0..15)
$$ 0 0 0 0 0 0 0 0 0 0 0 0 0 0 0 0
$$ ##$XFAC= 2
$$ ##END=
$$ 
##$DECIM=	4160
##$DSPFVS=	20
##.ACQUISITIONSCHEME=	NOT PHASESENSITIVE
##NTUPLES=	nD NMR SPECTRUM
##VAR_NAME=	FREQUENCY1,	FREQUENCY2,	SPECTRUM
##SYMBOL=	F1,	F2,	Y
##.NUCLEUS=	13C,	1H
##.OBSERVE FREQUENCY=	100.66910027424999896,	400.32200160000002143
##VAR_TYPE=	INDEPENDENT,	INDEPENDENT,	DEPENDENT
##VAR_FORM=	AFFN,	AFFN,	ASDF
##VAR_DIM=	512,	512,	262144
##UNITS=	HZ,	HZ,	ARBITRARY UNITS
##FIRST=	17614.246348710370512,	4405.4455391999963467,	0.30462285876274108887
##LAST=	-466.31298099976766025,	-392.85674445383250486,	0.53989130258560180664
##MIN=	-466.31298099976766025,	-392.85674445383250486,	0.00065302179427817463875
##MAX=	17614.246348710370512,	4405.4455391999963467,	107.17391204833984375
##FACTOR=	1,	1,	0.0040670269606295833195
##PAGE=	F1=17614.2
##FIRST=	17614.246348710370512,	4405.4455391999963467,	0.30462285876274108887
##DATA TABLE=	(F2++(Y..Y)), PROFILE
$$ [...]
##PAGE=	F1=-4959.92
##FIRST=	17614.246348710370512,	4405.4455391999963467,	0
##DATA TABLE=	(F2++(Y..Y)), PROFILE
1654I3L0N7q7O7o9J0J3P4p4m1l6J0M2J12N0j38k7N3q7K01m9om5M8l8Ql0p2J4J30J7j17n3m4
1335A6M3n6J14p3R1J87o2k1l6l9q0n1K9k5M6j9QK6m4N7O0j2j15m1M0J78M5k06J20K6j05J03
1034B04k7k6J9Lm3J76J45k70j35K56Q4q7j12K4n2q4Q0j2j4J04j5j14J3M6q7R7m4k2k2J78q0
743A83J10oj23N9N1j10p9J21j43k1O4M1n2J58k00P5k6o2J70J04j60n4n5J78m7j46J01p3O4
471A22j0KL5J2O2j5j6j07M1M3j54J46j13MJ91j39O4J0j12n3L3M7P2j4j05R2p0K1k5L1M9j08
171C6J08l1J57n7j00l7j5R8J24m7j45J1N9M1j70N1J49j19n3Q2mm1j0K2J16k4r9k9mP6mj1K25
-139C55j06j62m8J6P8L0j00Q4J46j71k0m6R4k0O9j53L2P6R3n5m5l1P7o4n5O9o3
$$ plain form
1654 93 123 180 93 160 91 101 114 188 114 73 37 47 89 201 251 113 86 139 52 253 204 198 153 201 163 171 141 69 83 213 230 113 60 16
1335 16 59 3 117 44 135 322 260 239 203 164 84 33 62 37 83 64 72 98 54 111 171 159 44 3 43 221 266 60 180 206 101 204
1034 204 177 151 170 173 130 306 451 181 46 302 386 299 187 211 159 75 155 143 129 233 218 104 117 163 76 173 129 107 85 263 183
743 183 293 287 164 223 274 164 85 206 63 42 106 147 95 253 53 128 102 40 210 314 154 100 45 223 176 30 131 58 122
471 122 112 114 149 161 223 208 192 85 126 169 15 161 48 52 243 104 168 178 66 13 46 93 165 151 46 138 68 89 64 95 144 36
171 36 144 113 270 213 113 76 61 159 283 236 91 102 161 202 32 83 232 113 60 142 138 97 87 109 225 201 102 73 69 145 141 130 355
-139 355 249 87 39 55 133 163 63 147 293 122 102 56 150 130 199 46 78 154 247 192 147 116 193 129 74 143 80
-393H0
##PAGE=	F1=-5030.68
##FIRST=	17614.246348710370512,	4405.4455391999963467,	0
##DATA TABLE=	(F2++(Y..Y)), PROFILE
4405A91n0j15L7L7o7P5n2J0J42q1JN6Ro5o4P2J27j6j16l9m5kj5P7J3n3N0P3l7jmN6m8n3J01
4077B04p3m8L6O7N6ql4p6K2j02N5M8oQ4Q2k09Q5r9j1J14q2o1%R3j5m8o5J51j8ko2n0Q1N8L3
3748B00j25oN3j1J58j78l0P2J7l8rP0p8K0L1j9rrn3L8J05l6o8M2J7q7j9L9N2K8q7R8n4%m2
3419H2QJ22j28l5M7l5N2p9Q3p6J21j03R5n8M1k9J40K18k16k02JJ09J26Q5k00q6NK28k50J32
3138A98p9J42j41L2j32J89j03J02j51J26K8j39K9J18k9kj61J16j5l0K7O3j3j1j6m7lJq0K01
2856B20k7j66R5l2K4k2O1q9N5r1J0O8n6Q0l9Q0k8n7o5J54j2n2n6J19j39J9NL6l0K5n1Mj7R7
2537A23k4O2N1p2Q0NJ5J9k40J31j24N8Ko0P3J2j7n4R4RNO9p2J6N3r3J4P0p3P7J4J7o7L5r7
2208A11J36pj28q7K1N4M8n8n9N5J01p8o2K7Q6J63k06M2m5o9J29L4k9M2j32J2j1J33j43K39
$$ plain form
4405 191 141 26 63 100 33 108 56 66 208 127 128 184 193 128 64 136 263 247 131 92 47 45 30 107 120 67 117 190 153 152 148 204 156 103 204
4077 204 131 83 119 186 242 234 200 124 146 44 99 147 141 225 307 98 183 84 73 187 105 44 44 137 122 74 9 160 142 140 78 28 109 167 200
3748 200 75 69 122 111 269 91 61 133 150 112 103 173 95 115 146 127 118 109 56 94 199 163 95 137 154 67 48 87 139 167 80 178 124 124 82
3419 82 90 212 84 49 96 61 113 34 117 41 162 59 154 96 137 108 248 466 250 48 49 158 284 369 169 83 88 316 66 198
3138 198 119 261 120 152 20 209 106 208 57 183 211 72 101 219 190 188 27 143 128 98 125 188 175 164 148 101 98 99 19 220
2856 220 193 27 122 90 114 92 153 64 119 28 38 106 50 130 91 171 143 86 21 175 163 111 55 174 35 54 59 95 65 90 39 43 26 123
2537 123 99 161 212 140 220 225 240 259 19 150 26 84 86 26 99 111 94 40 134 143 148 217 145 161 214 121 135 205 132 209 223 240 173 208 111
2208 111 247 240 112 25 46 100 148 90 31 86 187 109 47 74 160 323 117 159 114 45 174 208 179 221 89 101 90 223 80 319
1926C19o2k13lJ18J12j76k8O6J00q9p5K4J49N9k31Q8L4L9o9j05M2J35n8rJ16K2j49j4l3k2
1645H7O1m3Lj5M8j3M9J9j21j9mM2J09N9j26o7N2p7K26l6k1p7L2RRo1p5J4J44K3p3m1n6ll1
1316B7R0p9Q3J64l4k5o7l6r5RJ5kN3j3l7K6oM2O8n0q7k7M1J70L7k41J62kq5J40l7p5O3n0j2
987A30J53J42k71j06K09J24q5p1J7o5n4M5MK1L1j1q7k5N6j09P0j9j3PJ71j10R8j0q1K8O9j24
687A34j07R1j03L0M6O0p4J91j76ROo5J94rj11ml7J13l7j33J23o8L6K1k5M3PL1m0J8j02L3J9
377A14p0J15j12j3J58j25P5kJ7o1m9O9O0o3p4R8j5n1JN3P6j74P9K5J35p4o8p2O0N7J17k0j53
67A13o3R7L6j59O9J35j45m6M9M1l7J6QR0K2j21k1j8O4k6K0K69p6k31Pl4O4M6j44P8J96k03
-233I6K6j05J40n2L1r0O5J01L3q2j9l0J08r1o7O6m5
$$ plain form
1926 319 257 44 41 159 271 95 67 133 233 144 69 93 242 301 70 158 192 231 162 57 99 234 176 167 283 305 156 142 109 87
1645 87 148 105 108 93 141 128 177 196 75 56 52 94 203 262 136 69 121 44 270 234 213 136 168 177 186 125 50 64 208 231 158 117 61 58 27
1316 27 117 38 121 285 251 226 159 123 28 37 52 50 103 90 53 79 73 115 183 133 46 19 60 230 267 26 188 186 101 241 204 129 192 142 130
987 130 283 425 154 48 257 381 296 225 242 177 123 168 172 193 224 213 126 101 157 48 118 99 86 93 264 154 252 242 161 189 258 134
687 134 27 118 15 45 91 151 77 268 92 101 107 42 236 227 116 112 75 188 151 18 141 73 109 130 105 148 155 186 146 164 62 95 114
377 114 44 159 47 34 192 67 142 140 157 96 47 116 176 113 39 137 122 71 72 125 201 27 106 131 266 192 124 52 112 169 286 266 113
67 113 50 147 183 24 93 228 83 37 86 127 90 106 114 204 226 105 84 66 130 104 124 393 317 86 93 59 123 169 25 103 299 96
-233 96 122 17 157 105 136 46 111 212 245 163 144 114 222 131 64 130 85
-393H5
##PAGE=	F1=-5101.45
##FIRST=	17614.246348710370512,	4405.4455391999963467,	0
##DATA TABLE=	(F2++(Y..Y)), PROFILE
4405A59o5o4N8Ln2O0n7RJ52n9m2J32k1q6o6O4J48k1j08l7n5j3N2Q2m3o8K9R6n5K5J3L5m2m5
4086A18N6m9l3kR1P7Mp6r4L9j02J26L5o3Q1N0r7M4r6j4J17o7o8k3L6K2o1M3J50p3mo8p0L9
3767F8Q7N5j44%L1qJ96k04l8Q1k0ok8Q4l5k1M3p4M4l5k7L1J22r0j9j1oo5J3N9J0K9n6J23m7
3438A42p4O0jJ32j69o1J1KN7m2L8k6Q5n5J25p5n7o9K02K23k09j61j0P8N6R6j13o3j10K87k24
3147G5J36j24J37j17N9j27J82j19R7j44J46J9j40qR7m6P3j57J10j2l8oK5L6JL6n7j7l5l6J53
2856A99k5j41N4j3L2JJ4KJ02j90O3O0o9K5lQ5l5j08NJ51l2m8o9R8j11j2P2Nr2N0Mm9J2Q6l1
2527I2N2P6n5O4k0K8L5k14O8q3N4l0oM7k4J8l3M1oL3Q0j19R2O2r0k3O2n4O3L0M3p6Lj16J34
2199B28Pj31o8O2jM2n3n0O3J03r8j7m3J59J89k15k0l8l9R6L8o4K2p7OL1J10j66K28j05j52
$$ plain form
4405 159 94 30 88 91 39 99 42 51 203 144 102 234 213 127 61 125 273 252 144 107 52 39 91 173 130 62 91 187 132 157 170 205 163 118
4086 118 174 125 92 90 181 258 262 186 92 131 29 155 190 127 208 258 161 205 109 95 212 145 77 54 90 112 51 94 244 171 167 99 29 68
3767 68 155 210 66 66 97 89 285 81 43 124 104 98 70 154 119 98 141 67 111 76 49 80 202 112 93 82 76 11 24 83 93 122 66 189 142
3438 142 68 128 127 259 90 29 40 42 99 57 95 69 154 99 224 149 92 23 225 448 239 78 68 146 202 298 185 122 12 299 75
3147 75 211 87 224 107 166 39 221 102 199 55 201 220 80 72 169 123 196 39 149 137 99 93 118 154 155 191 134 117 82 46 199
2856 199 174 33 87 74 106 107 121 123 225 35 98 158 89 114 111 196 161 53 58 209 177 129 60 158 47 35 107 112 20 70 74 25 37 123 92
2527 92 144 220 165 229 209 237 272 58 126 43 97 67 61 108 84 102 69 110 104 137 217 98 190 252 162 139 201 147 210 240 283 207 210 94 228
2199 228 235 104 36 98 97 139 86 36 99 202 104 87 44 203 392 177 157 119 80 176 214 150 172 95 101 132 242 76 304 199 47
1908D7J8Q2Q5j70LM8O9n5l0K9J23J0j98J13J6j3o7k6NJ86r5k2J41K4j67j4Mq3O3pn8N0P2n8
1588A25M1J11j95ok5J9J22O0j09j03O6p2K20k6k2o9k3O2J2p8o3QJ37K8k5m3o9l9K0N5r3Q5
1288A11J38pn8o2m7J4nm7J6L3M6p6jN6J7N5q9n9OP0R6K4j40R8m0n0J54m5j30J18n7j9J11J36
969C67k57l0J03J70n5n1Kn9m2j0L7O0l9J1n9r5P0j01L9J7k9P2J41r9J6rqpO4j05mj8m6K2J
640F9P6o5J96j63l6N8m0J46j00m7QlL4j3j05J52r3J9N7n8M1ORl9M2n1qM7n9N5q5l8J23j01
321C4P1MJ16l2n8J9K6r1n2R5Mm0j3O4R9k16P1L9R3p0k6q7J37j6J07k0j33q0Q2L3j24N0J09
11A95j24n0M8M4l4M0rO3O3j30j7k7O5n0O2K61l7k71L5k9K5M7r5K3K03k05N4o5R3q2m5L9R1
-299A81O1k3j02J9m8J40j00p6N1j5
$$ plain form
1908 47 65 147 232 62 65 113 182 127 97 126 249 259 61 174 190 177 110 84 89 275 180 158 299 323 156 142 146 63 126 119 61 111 183 125
1588 125 166 277 82 76 51 70 192 252 143 40 106 34 254 228 206 137 114 176 188 110 47 55 192 220 195 152 83 44 64 119 26 111
1288 111 249 242 184 122 75 89 84 37 53 86 132 56 55 111 128 183 94 35 41 111 207 231 91 189 149 99 253 208 78 196 139 120 231 367
969 367 110 80 183 353 298 247 249 190 148 138 175 235 196 207 148 53 123 22 61 78 49 121 262 163 179 170 162 155 219 114 110 92 46 68 69
640 69 145 80 276 113 77 135 95 241 141 94 102 99 133 120 15 167 74 93 150 92 133 139 148 109 151 100 92 139 80 135 50 12 135 34
321 34 105 109 225 193 135 154 180 89 37 132 136 96 83 147 246 30 101 140 233 163 137 50 187 171 278 258 125 45 127 160 36 86 195
11 195 71 21 69 113 79 119 110 173 236 106 89 62 127 77 139 400 363 92 127 98 123 170 75 98 301 96 150 85 178 96 51 90 181
-299 181 242 219 117 136 88 228 128 52 103 88
-393H8
##PAGE=	F1=-5172.21
##FIRST=	17614.246348710370512,	4405.4455391999963467,	0
##DATA TABLE=	(F2++(Y..Y)), PROFILE
4405A17p5L8L3j6m8L8n3lJ54Qj28K17n7r5n1J2J64qr4j2l4k1O5Q0r8o4pJ11q1M8M4Jl6k2J7
4077A44l2j8l6R7J08K0j28j07Q4r7J49N8j41J02kNpq2KJ44p4o2m3k6M3m8J18J47j29np0q8
3776B6lJ19P8j27l3J7J2J93j99n6Q6m7Rm9R1Rm0M9r5P7o4kO7Q7j48N6n8l8K3K9jk6K3k4J54
3448A95m0j13J23MJ11j88p2J7N2j8J5l%L6K6J15p6j38K9J22K06j86j19j1L3j0Q7j9k9p9J95
3157B65j89J41j56J07p5N4o4J35j09Q7j37J44J4j36j2M2l0J31j47Q5j4m6k1OP1j2O9n8J7j03
2875E9K6R1l9r1oK0K2L1l0J00J39k69Q9O5p8k3L2P4l8j14N5J35n9n1m7N3q5j8J04K7j15JP9
2565A39r6NO8k9M1R8l5L1l7M4N9j74Kn4N2n7L2J9m6N0k2qj4P2O4j44J52P3r1m7L8k7L5O0N7
2236C10q1j4j42J02K9j03o5R8l2N6m6m2M3Q9j13M5p0J48K05k13n4Jl4L9O9r0k6K9l2M5P7j52
$$ plain form
4405 117 42 80 113 97 49 87 34 31 185 193 65 282 225 130 79 91 255 247 153 141 107 86 151 231 133 69 62 173 92 140 184 185 149 127 144
4077 144 112 94 58 155 263 283 155 48 132 35 184 242 101 203 201 206 199 117 119 263 189 127 84 58 101 53 171 318 189 184 114 26
3776 26 23 142 220 93 60 77 89 282 83 27 113 66 75 26 117 126 86 135 40 117 53 51 118 205 57 113 55 17 40 69 68 42 65 41 195
3448 195 155 42 165 169 280 92 20 37 89 71 86 83 83 119 145 260 184 46 75 197 403 217 98 87 120 110 197 178 149 70 265
3157 265 76 217 61 168 93 147 83 218 109 196 59 203 217 81 69 111 81 212 65 150 136 90 69 75 146 134 203 145 162 59
2875 59 85 176 137 46 40 60 82 113 83 183 322 53 142 207 129 106 138 212 174 60 115 250 191 140 93 146 61 43 147 174 59 60 139
2565 139 43 48 116 87 128 226 191 222 185 229 288 114 116 62 114 57 89 108 62 112 90 82 68 140 204 60 212 285 194 147 185 158 193 253 310
2236 310 229 215 73 175 204 101 36 134 102 158 112 70 113 202 89 134 64 212 417 204 150 151 117 156 225 135 109 138 106 151 228 76
1936G6J92j45o5P3J4L1r6JK4N1oj0L6P3n1j53J46pm8m9LJ7J97j38l9J59K1j64J0M2j12N2%
1626A35n6P4P0j13L9J80k31l2j8k5J41N5q7j19Q8q0J85k6J2k5j02R1K2q2m9K5R5L5K1o4q2
1335G7m8P6K0j17Q8J25J4j05k6n3J21m7r8K7jJ31j25l7J24pK6j17l4N7R8j1NpK7p7k6J55m2
1025A93j85J76k0o3N3J28k23N7k8K18pn2j3n2l6o9Q3R0r6M5k9j51N8m4L3Qo4J37J08o0j03
734I2J6N9l8L2n8O8m4m3K4n6Q6n2J95j71o1J19l4Q9j21rj4K6m1K0n3J71j28kR6r5L0J1J0K
415A26L4j2j2N8r5pn2k6O5o8N9L9J52Jo3j9j5r3l3P1L%k6O1J22k26Q4LM1m6J5l2J50r8J00
86B61m9j08k4L1K4p3PQ1p1m4O9qj6M8l1M4R2j26k3k5P1o7Q4K29Mk67K4j0NL1l4nJ60j90Q4
-243A78l7M5q4n8J13R0po8j05O3r3J72q6q5L6J0
$$ plain form
1936 76 268 123 58 131 145 176 80 81 105 156 150 140 176 249 198 45 191 184 136 87 90 107 304 166 127 286 307 143 153 195 83 135 135
1626 135 79 153 223 110 149 329 98 66 48 23 164 219 132 13 101 21 206 180 192 167 65 156 178 96 47 72 167 202 223 159 77
1335 77 29 105 125 8 96 221 235 130 104 51 172 125 27 54 53 184 59 22 146 139 165 48 14 71 169 158 163 156 183 106 80 235 193
1025 193 8 184 164 101 154 282 59 116 88 306 299 247 234 182 146 77 160 250 154 199 170 19 77 33 66 74 10 147 255 195 92
734 92 108 167 129 161 103 171 127 84 108 52 138 86 281 110 49 168 134 223 102 93 79 105 64 84 31 202 74 72 168 73 103 114 124 126
415 126 160 148 136 194 99 92 40 14 79 11 70 109 261 262 199 180 165 72 39 110 113 113 87 148 270 44 128 131 172 126 141 109 259 161 261
86 261 212 104 80 111 135 62 69 150 79 35 104 96 80 128 97 141 233 107 84 59 130 63 147 376 380 113 137 127 132 163 129 124 284 94 178
-243 178 141 186 102 44 157 247 240 172 67 130 37 209 123 38 74 84
-393H4
##PAGE=	F1=-5242.98
##FIRST=	17614.246348710370512,	4405.4455391999963467,	0
##DATA TABLE=	(F2++(Y..Y)), PROFILE
4405G1l2R0jk5m8K5m1j5J28Q6k04K85r3q9k9n6J59K6q1J8j1l4M1R5j36m3n8J27j05O3P3l9
4105A47k8K0j5k8rk0P0J22L2j72p6J06r7J28J13k21J39o3P7o1o2L4J69p6m4p3o4M0l2J70J35
3814C61j74Lp2p7k2J16Q7r9n7J7L9J41j70m8N9n0j0j6M7M2l6N1p5P2q2QJ28L1j77J02o7l0
3513D2N5K1p0k2jlJ79m6r0J23J9O3j82j7jN3q2Q2l6j0nJ04P7o3j72J38J8J63j50p8pj8m8M9
3194H5O9jm3J14j48J42j54L0mJ5K3R0r3P8j39J28J3j34K8j5j3J56j35N1j5n8L6L7Km0P8n0
2894A33O9j62P7L8o5l1m9L9pO4o2J81J62l15R9P0p7n5N6N2m2n6N7J10q5o2jLp1lR5O4j27k2
2574G7J16j21k3N5k1L5J09j2j4n0N5Q9j21n5m7N8o4M2No2O7k5m2qJ05L6j54J87P1q6n0J7q
2265A61kJ03N5q1k6j69P3M3n0o5J13m6Q6m0n0J4O3j05R6o4Q0K04j99o2N4l7l3J14j00q8J40
$$ plain form
4405 71 39 129 128 103 55 80 39 24 152 238 34 319 226 137 108 52 211 237 156 174 163 129 170 265 129 86 28 155 50 113 186 147
4105 147 119 139 124 96 87 67 137 259 291 119 43 149 52 180 293 72 211 148 225 164 102 136 305 229 185 112 48 88 56 226 361
3814 361 187 190 118 41 19 135 222 123 66 83 122 263 93 45 104 54 44 28 75 117 81 132 57 129 47 55 183 214 37 139 72 42
3513 42 97 118 48 26 25 22 201 155 65 188 207 270 88 71 70 123 41 123 87 77 72 176 253 190 18 156 174 337 187 109 102 84 36 85
3194 85 154 153 110 224 76 218 64 94 90 105 128 218 125 203 64 192 205 71 99 84 71 227 92 143 128 70 106 143 145 105 183 133
2894 133 202 40 117 155 90 59 10 49 42 106 44 225 387 72 171 241 164 109 165 217 175 119 176 286 201 139 138 141 70 67 162 226 99 77
2574 77 193 72 49 104 83 118 227 215 201 151 206 295 174 119 72 130 66 108 113 51 118 93 51 43 148 184 30 217 288 202 152 169 161
2265 161 159 262 317 236 210 41 114 157 107 42 155 109 195 155 105 119 182 77 173 109 189 393 194 132 186 149 116 230 130 42 182
1973A82n8K0M3j06J44j58J5Q4l1k5J6k4J3M9J4J1L7J4j11r5J69k9n7J3n3M3J91j72n1J57K0
1682B65j35M8O5j23N5k0m3R2N2j65L4K15k21n4k5qR3M0o0o3N9p9J14j4N5L3j17M1L0q0l4M8
1382I8M2M1O5r2r6l7J20j2j07N5J22K8j40J6k5J56q6j12K8K5J46j73m2J49l3pj19J9Q2J04
1100B15j19k0J29l9r6k8J53k6j01R1L9j16j8J16j44J14j32K32M5o3k2n3l5m8P9Q6j36Q1Lq8
818I9k5kM7l9n9J39Q1j8k04Q9O6n5k4lJ07m3n1M7q8P6n9K01j86o9J62m2M2n8k1m0K7q7N4j2
499E2J79j38m3J33j29J9J0M3L4K1mJM8j25n1rLJpJ3R5J24K5o9n0m4q1nK7jL3l2N7J45k10R0
161A55n1orM4M5J31j72R9r6q2M8JLk0m1N4j3nO1p1J9L6n0L6J02j11l7j2P2p3P5J95M2k34o
-167A29J1J0mJ9k1J01j77J41l3qn8K5Q5P1p7j00p2R4q6J19m5j02L9J1
$$ plain form
1973 182 124 144 187 81 225 67 82 166 135 110 126 102 115 164 178 189 226 240 129 34 203 174 117 130 77 120 311 139 88 245 265
1682 265 130 178 243 120 175 155 112 204 256 91 125 340 119 65 40 32 125 165 105 42 101 22 136 122 177 210 93 134 164 84 50 98
1382 98 140 181 246 154 58 21 141 129 22 77 199 227 87 103 78 234 148 36 64 89 235 62 20 169 136 129 10 29 111 215
1100 215 96 76 205 166 70 42 195 169 68 159 198 82 64 180 36 150 18 250 295 232 210 157 122 74 153 239 103 184 187 99
818 99 74 72 119 80 21 160 241 223 19 108 174 119 95 92 199 156 105 152 64 140 81 282 96 27 189 147 189 131 110 70 97 10 64 52
499 52 231 93 50 183 54 73 83 126 160 181 177 178 226 101 50 41 44 45 38 51 146 270 295 226 176 132 51 46 73 72 105 73 130 275 65 155
161 155 104 98 89 133 178 309 137 236 140 58 106 107 110 90 49 103 90 85 146 75 94 130 80 116 218 107 70 58 130 57 132 327 369 135 129
-167 129 140 150 146 165 144 245 68 209 176 168 110 135 220 291 214 114 42 136 50 169 124 22 61 72
-393G2
##PAGE=	F1=-5313.74
##FIRST=	17614.246348710370512,	4405.4455391999963467,	0
##DATA TABLE=	(F2++(Y..Y)), PROFILE
4405B7N2R0m2k4m7L2l8j0P2J41k24L10j27o6j1p4Q8Q3q0M3J1m4k2J23j46j4r4J26r2M7R2q2
4105A00qO9m3l5pL7M8R1L0j90j3R2p5M9J82k67J65j17J09j13l4Q0J68o6j6j10o6J0k3K08J05
3814C60k00J9o7m4j7Q8P0p0o2L6M9O9j27k7K1m0k4L5k4N2j5N3o4O7q2J3J76k6j56J02q2oQ5
3504A62mj16K9Jj5J57p1o9J24L4Nj60K7k3N0p1J10n9n6J0J14K9l7j48J91n6J02j02m7jo1K7
3204G6n8J08Lj3O5j00J38j19p0P9n0J09O4q8P4j41R6J4j32Q4j9m0J56j27K1j2p4J29N3r0n7
2912G9O6m5J20j90J08nq8K0j0k0k0P5q1K41J65l26R3P1o4o9O6K6m9J0N1Q2j08p5O3m3p4J1
2612H0P4R5j11k7J13j23o5N4k0M9J02J0n5o5N4J25o0j06n0O5o2M2Qp5O8l3o9J9J14Rj50J91
2311B01M9p1k8J4j2l6J45M0p7l9j67R0LJ0n5J00n8J15k3p0k0L4o6J16m3KJ78j79n4J09l7j10
$$ plain form
4405 27 79 169 127 103 56 88 50 40 112 253 29 339 212 146 135 61 149 232 152 195 206 162 140 263 117 103 9 135 43 90 182 100
4105 100 92 161 118 83 76 113 161 252 282 92 79 171 96 145 327 60 225 108 217 104 70 150 318 252 236 126 60 70 47 255 360
3814 360 160 179 112 68 51 139 209 139 77 113 162 231 104 77 98 58 34 69 45 97 82 135 71 138 56 69 245 219 63 165 83 77 162
3504 162 158 42 71 72 57 214 143 74 198 232 237 77 104 81 131 60 170 111 55 65 179 208 171 23 214 158 260 158 111 110 49 76
3204 76 18 126 129 116 181 81 219 100 30 109 59 168 232 144 218 77 173 187 55 139 120 80 236 109 130 118 44 173 226 136 79
2912 79 145 100 220 30 138 133 45 65 55 35 15 90 9 250 415 89 182 253 189 120 186 212 163 173 224 306 198 123 186 143 69 80
2612 80 154 249 138 111 224 101 36 90 70 119 221 231 176 111 165 290 230 124 74 139 77 119 127 52 120 87 18 37 151 160 10 201
2311 201 250 179 151 165 153 117 262 302 225 186 19 109 112 122 67 167 109 224 201 131 111 145 79 195 152 154 332 153 99 208 171 61
2011F1J57r4j04J93n6m4J7k7R2j08J1O3o0n6J14l6J7M0J0M3K4m0j47k2J54m3n2Q4j38O2J77
1720B92j84m8J22K3p6Q6O5j34Q5n1o2J28L2j97J7K13j80Pj09N0J4Lk4LK4o1NqJ09R7q1k9L1
1410A62q0k1N9nM7J06j01r8l7J28l4p4LJ18M4j47L5OJ50j11r4K9P8J12j93j5J09o3k7m7K5
1119F4R4Q1j95lJ97r5q1j8J12rj1j1R6j49l7M2nJ09o2P4Q9o2l1o2m0P1J6L5j46R6L4k7m2p
800A17N1q1n1J20O0J7j70Q5L2o1q7M0J23l3n4Q1r3N1p9K06j83l5J37n5J2K1l1m4j3oJ3k3J77
490B44j22q6J55j33K6k5P9M1J4k1J7L3j34k6J4kJKk1J39O7K9p5p5l4q3L5j5OK7l7O3J64j74
171I3P5j04RkM1J19R5k25J05j44l1Q8pk5K6q5L4L1M2L5j20N8K6n5K1R8r1o4J3O8p4M7J72O8
-149C37j96k6L3K4n0N7l7N3j62K10n5o1nQ9M9M5j29j00j3R2k1j5J0j06N0k0
$$ plain form
2011 61 218 124 20 213 157 113 130 103 195 87 98 161 101 45 159 123 140 180 190 233 257 217 70 48 202 159 107 191 53 115 292
1720 292 108 60 182 205 129 215 280 146 231 180 118 246 278 81 98 311 131 138 29 79 93 96 72 75 99 38 43 35 144 241 160 131 162
1410 162 82 61 120 115 162 268 167 69 32 160 126 52 55 173 217 70 105 111 261 150 56 85 163 275 82 67 176 113 86 39 64
1119 64 158 239 44 41 238 143 62 44 156 147 136 125 221 72 35 77 72 181 119 193 282 220 189 127 87 158 174 209 63 159 193 166 124 117
800 117 168 87 36 156 216 233 63 148 180 119 32 72 195 162 108 189 96 147 68 274 91 56 193 138 150 171 140 96 83 77 90 67 244
490 244 122 36 191 58 84 59 138 179 193 172 189 222 88 62 76 74 75 77 56 195 262 291 216 141 107 24 59 44 50 77 40 103 267 93
171 93 168 64 73 71 112 231 326 101 206 62 31 119 112 87 113 28 62 93 135 170 50 108 134 79 100 198 107 43 56 124 50 97 269 337
-149 337 141 115 148 172 122 179 142 195 33 243 188 127 122 211 260 305 176 76 63 155 134 119 129 23 73 53
-393E3
##PAGE=	F1=-5384.51
##FIRST=	17614.246348710370512,	4405.4455391999963467,	0
##DATA TABLE=	(F2++(Y..Y)), PROFILE
4405IJ00Q3q0rm9M5m1PJ0J54k12L24j56l3jm7k5J54r2N9L2m1j15J50j30J3o6P3n2J7R5j21
4105E5L7R1o0m1j6Q6N6M1Pj69J9Q2l8n7K44k61J59j47R9j54K5J03J37n0J9j42l6m1j6K23N7
3814C12j99M1n0j3k2Q5K7m8n6O5M5Lp9j0jm7J8K2n8L9J2N6n7N1p3L8J90q0j35J14j19M3J12
3504B26m2j23M6J4j5J27j04p7J43M4m3j39M8m2M8MR9p1r2O4L8j6Oj16K13r1L2m7k2ln7R0m2
3194A00Kj2MN0n1J28p7n7N5p6J25N8r6P7j27L9K3j23J33op6J45j27jjq2K02M8j68l6L9m5J46
2884B13j87J20m0r0M5K6p0M0J8n7K45J46l04P2O5m5o6O9mn8N9M7N6j21q8J38p7r2J7O1J03
2593B41o3l4Q6j07j13O1k2Q0P9K6p6q3M0J59Jj50m7O2n9L9K2q7O3l2o6K0J07j3j16J49J0m5
2293A32RL1l4m9J64J3o8n5o9Q7p8O0m1P3p2J26J0r6m8OrJ03j1m9J17j54m2J56l1j72J75p3
$$ plain form
4405 9 109 192 112 103 54 99 58 65 75 229 17 341 185 152 151 104 79 233 141 200 232 191 76 226 96 109 43 116 64 81 176 55
4105 55 92 183 123 82 66 152 208 249 256 87 106 188 150 93 337 76 235 88 187 33 58 161 298 248 267 125 89 48 32 255 312
3814 312 113 154 104 91 69 154 181 133 77 142 187 190 111 101 100 53 71 93 35 74 86 142 85 136 63 101 291 211 76 190 71 114 226
3504 226 184 61 107 121 106 233 129 52 195 239 196 57 105 63 111 115 214 143 51 115 153 137 143 27 240 149 181 134 112 109 52 142 100
3194 100 102 90 94 144 93 221 144 87 142 66 191 249 153 230 103 142 165 42 175 169 93 238 111 110 109 27 229 277 109 73 112 67 213
2884 213 26 146 106 16 61 87 17 57 75 18 263 409 105 177 242 197 131 200 196 138 197 244 300 179 91 229 152 60 77 138 241
2593 241 178 144 230 123 10 71 49 129 208 234 158 75 115 274 275 125 78 140 81 120 142 55 118 86 20 40 147 134 18 167 177 132
2293 132 141 172 138 89 253 266 198 143 74 161 83 143 102 175 103 229 239 143 95 101 92 195 184 135 252 98 56 212 181 9 184 111
1992A11m6J65k9j27kP4N4p9l0L6o7l9J44k1K7J3jP7np7j05JJ11m5m8J44k00O5J50j74k7N7
1692A07L7%J11M3j48J40q3j09J74J6j94j1J71j28J12j84N3k5o2M2M1j9l1Q3O3r5J41k5p6K8
1410A72p2k2N1l6N2J43q4q8m8Q6m7k5m3R8O9j33K9K8J20j20m4K6J08P5j80JN9r8jqK4J09L4
1100B35j85P2J36j42l5K8M6k1N4j00J31j44M1j04R2R9ln6J13l3m1p7m7J74k9l0r1M1N9K1l5
809A69rM0j10m2R9L5L5j18Q1No6j05L0J25k1n0J13q1J5q7J98j52pQ4o2mQ1k0m5o1N4J5p0J70
490B39r4j06J50j04M2p5R0L1Qn2L7K3j22M1J5k0J9qm5J72J1Mp9q3M5j31P1j7J1j3k8M7J72
180B51j25M6j39J04m0j5J75N4k53J16j27J8N7qm6N8j05NN8Q3%j41R1L4m1j9Q7p2j00N1O1p5
-121D3J4J56Q4j66k3N2L3r7P6n5L3o3J87r5j03O3J19OK9j52m7j0R5L8j34N1q7M4o1
$$ plain form
1992 111 65 230 201 74 72 146 200 121 91 127 60 21 165 144 171 184 183 260 255 178 73 74 185 140 92 236 36 101 251 77 50 107
1692 107 144 144 255 298 150 290 207 98 272 288 94 83 254 126 238 54 107 82 20 62 103 84 53 136 199 104 245 220 144 172
1410 172 100 78 129 93 145 288 204 116 68 154 107 82 39 137 206 73 102 130 250 130 86 112 220 295 115 116 175 77 76 68 92 201 235
1100 235 50 122 258 116 81 109 155 134 188 88 219 75 116 12 104 203 200 144 257 224 183 106 59 233 204 174 83 124 183 204 169
809 169 160 200 90 48 147 182 217 99 180 185 119 14 44 169 148 98 211 130 145 58 256 104 97 181 119 115 196 176 131 70 124 139 69 239
490 239 145 39 189 85 127 52 142 173 181 129 166 189 67 108 123 103 122 114 69 241 252 256 177 94 139 8 79 62 73 60 32 79 251
180 251 126 172 33 137 97 82 257 311 58 174 47 65 122 114 68 126 21 26 84 167 167 26 117 151 110 91 178 106 6 57 118 43
-121 43 57 213 297 131 108 160 193 96 172 117 150 87 274 179 76 139 258 264 293 141 94 84 179 217 83 134 47 91 30
-393C0
##PAGE=	F1=-5455.27
##FIRST=	17614.246348710370512,	4405.4455391999963467,	0
##DATA TABLE=	(F2++(Y..Y)), PROFILE
4405C4Q9P1j08K6n7M6m3L6m3J20j44L04j80Jjj0j18K17j13O1N1k3j68J14r3L3k9K0j8RQ9j52
4105B1R3Q1o1m9k9J10P7Rl7j21L3O3Qj42K60k19J38j56O9j06N3P0Q7l4N5j58Qr4MJ98mj68
3804E9N6r%l5J00k7l4n1R7K9l8l5lPq0P4j8o2K8M1N2l8Nn8R5J59j28j20J48j52R6J19q9j07
3485H1M5K6MR4j22j04J57M7o1j22L4n4N3R6O5p1q6Q0o1m6P4r6K02r1l6Rjj8j1J11m8o2nk6
3166E7P2j9J12l8k6J2n8P7N9j05Q8r6l6M2j05J63Jr4J25j36j1J9o9K24K4k14J6K2k9J09j63
2875B3J18o8m8L2M6j01Q7j9l2K28J12k55L0N6k4n2P7l6o6P6M5L7j23r4K10r3r9nQ1O8km5M8
2565B12p5j12K0j8J20M2L1o7r0J3J76N3j82l0M0n7L5K9r0O4k0l9j4R2k5p2R1m5MM1N4n6k5
2255A00J34k2n4n2L9O0j34R5l1M0p1J00N7j19o3kL0O5K9o0L1j15k3J68k3j10O2l7mJ41J8j85
$$ plain form
4405 34 123 194 86 112 55 101 58 94 51 171 27 331 151 152 151 141 23 240 127 188 239 216 48 162 69 102 73 93 75 84 173 21
4105 21 114 195 134 85 56 166 243 252 215 94 127 190 198 56 316 97 235 79 148 42 95 165 252 218 273 115 123 29 33 231 227 59
3804 59 115 106 106 71 171 144 110 59 156 185 147 112 109 116 36 110 92 30 58 99 151 113 118 60 155 314 186 66 214 62 158 277 188 81
3485 81 126 152 156 250 128 24 181 228 167 45 79 25 78 174 239 168 82 162 101 55 129 33 235 144 108 117 116 98 87 198 150 88 83 57
3166 57 129 110 222 184 158 170 112 189 248 143 231 135 99 141 36 199 200 106 231 95 84 103 34 258 282 68 84 106 77 186 23
2875 23 141 73 25 57 103 2 89 70 38 266 378 123 153 209 185 133 210 174 108 184 229 266 143 49 259 166 67 62 143 211 209 164 212
2565 212 137 25 45 27 147 189 220 153 63 76 252 305 123 93 133 76 111 140 50 114 94 55 41 133 108 36 127 82 86 127 181 125 100
2255 100 234 212 158 106 145 205 71 166 135 175 104 204 261 142 79 77 107 172 201 141 172 57 34 202 179 69 131 94 90 231 249 64
1955F4l6J79K5j06o7N3j2l4P7K1L1k4j1R9m3r1nj5N1l2n9J78j96N6R4j51lpO6O7J18Pj61K04
1635C37j11j49K07jj62k9R9q6K20k12nk4l2L6M3p0NK62J53l36P1M2j08K9m9l2K6n1N7J71o5
1344B36p3l8on0M2o0M8R8j03KM0P4j18L6J2J01N3j54J6J5j11N4k7J9J27k6j34J17Q2j79RP1
1044A73J8n8Q6j69J37r2Q5j03L8R5L7j45J20K3m9r7m6K17n6o1j7n1O8M9j5MJ7j21j3P5rL9
743A79p2Q9lq1p2PQ9j2m8J38n9k9o9J70j09OL5m9k4J22Mn9r6Q6M2j33J75p2j07J26n9N1j06
433F0O8J3kq3O4K4r8R9K2l7K7j3o7J95k6m4p7l7J21j67O3rmnKk1J66p5J7j30J61o4r3K00J8
105B68k54J31n0pL0j4m5O7q4k6M6J06k8j35J14O1k7o1O7n5n5K1M8o5qJ18R3j39pO7L0j29P2
-205A50p3N5L8J21j38j14J19J12m2L2j42J5m4J06Q7j97M6o0L7r4
$$ plain form
1955 64 28 207 232 126 59 112 100 66 143 164 195 171 160 259 216 125 120 105 156 124 65 243 47 103 197 46 43 36 102 169 287 294 133 337
1635 337 226 77 284 283 121 92 191 105 325 113 108 84 52 88 131 61 66 328 481 145 216 258 150 179 130 98 124 73 130 301 236
1344 236 163 125 119 69 111 51 99 197 94 96 136 210 92 128 140 241 294 140 156 171 60 114 87 106 233 207 73 190 272 93 102 173
1044 173 191 133 219 50 187 95 180 77 115 210 247 102 222 245 196 99 53 270 214 153 136 85 153 202 187 191 208 87 74 149 140 179
743 179 107 196 193 112 40 47 136 124 76 214 155 126 57 227 118 124 159 110 86 208 212 153 57 143 185 52 227 155 48 174 115 166 60
433 60 128 141 139 56 120 144 46 145 167 130 157 144 77 272 246 202 125 88 209 42 105 96 92 87 89 68 234 159 176 46 207 143 50 250 268
105 268 14 145 95 88 118 104 59 126 42 16 62 168 140 5 119 180 153 92 159 104 49 70 118 53 45 163 256 117 110 177 207 78 150
-205 150 77 132 170 291 153 39 158 270 228 260 118 133 89 195 282 85 131 71 108 14
-393A4
##PAGE=	F1=-5526.04
##FIRST=	17614.246348710370512,	4405.4455391999963467,	0
##DATA TABLE=	(F2++(Y..Y)), PROFILE
4405D8P4N4j19P1o1K2l8P3q2N0LK24j99K5oL3j02J75j30N1O1jj11k6l3K9Rl0NK3Q4j67J29
4096A38N0m1o2m5J09J06Kq9p1O2J6N4j50J91j63J14j50M1j5M1J8L8k7R1j48L8j21K7J43p2
3814A25q3L4M3pm4J12o6k2o7J25J1n2Nj3L9j23J16n9m1K7O5L4j1o8j7J58R4j65j00J83j26
3523A07R9R2j33p6L4L6M2O1j17o9P8M9n2o9jl6K5J55Ro5n9P2j45j5J11p6J44n8q8N1K0m5L6
3213A17J25p4q1M5j11J18j5R1lkl1k7PN8j06J02n2j15P2p7J63%q5R6j49j0M1n2K06j1k07O5
2912I8K1%L3j27J01p2j1J9M1q3P9k9k1K10P6j87m0N3ol2R8p5o0N3M9K0j14n8K36r1p6l9J12
2603A78j2N4n4J5m1q4m8J5J45lK1l0q6nJ64R1k02%Ln4K2K9q0P3%k4n0P6k6k2L7q3O2K8P1n6
2265A24RP2n8l5K0Q8Jj61J26k6Nl6K6J02j26o0K6K5PO9n3m4l6NJ13j2m4n9RJ4J26P7j93p5
$$ plain form
4405 48 122 176 57 128 67 89 51 124 42 92 95 319 120 145 139 172 70 245 115 166 227 226 115 89 56 85 94 64 69 92 176 9 138
4096 138 188 147 85 40 149 255 257 168 97 159 175 229 79 270 107 221 71 112 97 138 156 194 167 258 110 148 27 54 197 125
3814 125 42 76 119 112 68 180 114 92 25 150 161 109 114 101 140 17 133 74 33 60 125 159 148 80 63 221 315 150 50 233 107
3523 107 206 298 165 89 123 159 201 262 145 76 154 203 151 82 81 45 70 225 234 169 110 182 37 22 133 57 201 143 55 106 126 81 117
3213 117 242 168 87 132 21 139 124 215 212 210 179 152 159 217 111 213 161 46 118 41 204 204 119 215 66 56 97 45 251 240 33 98
2912 98 119 119 152 25 126 54 43 62 103 20 99 70 49 259 335 148 108 161 155 123 221 146 86 139 188 208 94 36 272 181 105 66 178
2603 178 166 220 166 181 140 56 8 23 168 165 186 156 70 65 229 320 118 118 121 67 89 118 38 111 111 87 37 113 87 65 102 19 81 109 180 124
2265 124 133 205 147 112 132 220 221 60 186 160 165 129 155 257 131 71 97 122 129 198 145 101 65 70 183 171 127 68 77 91 217 294 101 26
1945B6K45oj62q4J38L0r0KQ2K1n7j7J01p8p8R4k6nj8q9J78j29O0jj14J2J4M9R5J11k7j75K58
1635C60j30j48K06k5j17k8K4o5K94j94r2rL9NM5r5J3L98K25m80o5J05j30L2pl5j2o0O0J90
1354C04o5m8jj30pQ6n5LJ09o2m3M3K5j05J22j4O3N0j33L8rp5N6n6PJ40p7q7J53M9k02L3J05
1044B17Oq8R6k05J05mR0j06rR9N3j91J17R1n0j17n0K04o9l4K8j18M2N4J4K5j1j15L9N4p3L4
743A28l6J10Lj12m6N4J6k0m8J54l5n9l9J19p1QLj3o1J59L3r2j15R4Q2j93K02o4j04R1j2M7
443A83j06K5j1k0l4L6L2p7J38L8m8J6j2p5J98m0j04o0M8J40j94O0j4k9L4J8p7J52k7pj16J91
142B58p2j54J83mj85R9Jm1K3l1j3M9m8k8pJ09l9q5J03R2k2q3L4l5%j0L9n5j9M9J06r3j0P9
-177A90K5j36M5q8J04J03L7j62p7J30P9q5N5j11N0q2J19J21k16J6k9L4q8
$$ plain form
1945 26 271 265 103 19 157 187 97 99 181 202 145 128 229 151 73 167 141 136 118 29 207 78 138 137 23 35 49 98 193 304 277 102 360
1635 360 230 82 288 263 146 118 142 77 371 177 85 76 115 120 165 70 83 481 706 226 161 266 136 168 161 126 114 54 114 304
1354 304 239 191 190 60 53 139 84 87 196 134 91 134 159 54 176 162 225 275 142 180 171 96 152 96 103 243 166 79 232 281 79 112 217
1044 217 223 135 231 26 131 127 217 111 102 201 254 63 180 271 221 104 54 258 189 155 183 65 107 161 175 200 189 74 113 167 94 128
743 128 92 202 205 93 47 101 117 97 49 203 168 109 70 189 118 126 129 116 55 214 247 155 40 134 216 23 225 161 57 148 136 183
443 183 77 102 91 71 37 73 105 28 166 204 156 172 160 85 283 243 139 79 127 267 73 133 119 90 124 142 65 217 190 183 67 258
142 258 186 32 215 211 26 125 126 85 108 77 64 113 65 37 30 139 100 15 118 210 188 105 139 104 104 94 133 78 59 108 214 121 111 190
-177 190 215 79 124 36 140 243 280 118 41 171 250 165 220 109 159 77 196 317 101 117 88 122 34
-393C4
##PAGE=	F1=-5596.8
##FIRST=	17614.246348710370512,	4405.4455391999963467,	0
##DATA TABLE=	(F2++(Y..Y)), PROFILE
4405E2N6L2j06J13n1k4l0J11r8l8J57J36k08K9lP9p8J11j31L7N5J1m7j12K7j0L0o1J5M5Q5
4114A84j55J25Ojp8o2Q7J42J1j37k7J09n6R4j21R2j10R2j34K9L8L4k7lk1J24j22M0j25O6P9
3823A73j33L2j0P2j8m0J01o8Pj00J10Rn2M6m7Q5j47J14m2l3J8Q7LOj45P3J87J0j79m3J61o4
3523A73P5L9j64l6J8L8R7K7j09k1k2N6l6J2om7NJ64o5n8k2N2j33L8O1m5N7oq8M3M3q0P3J36
3204B69j07o4R0j85J53k9P0L1Qp4J2n9M1r4J16lj58Q3m1J30qn2O5j48j4O0m3J63m4j10M8K1
2903A27K6k5q6P1l3rJK1n6N0k3j2J89M7j10j30O1Rj7J33j20k8J2N7j7r6M4J80p0m0m6J16j09
2593A17Q6n0j2rn8l8lJ49l6oJ4q2kJ37J13k10L2l3m5mJ9n8R1K1j9q6O1nK0Kj4Oj1Q0l3K9%
2246A63q1j2J30Q5p1j67J51k2l6L1o2J15j09m2O1Jo2J00m8q5M7J8O0oJ2j44L7QJ16J36j84
$$ plain form
4405 52 108 140 34 147 96 72 42 153 55 17 174 310 102 131 128 207 129 240 109 146 201 212 165 53 80 70 100 39 54 99 184
4114 184 29 154 160 159 81 19 106 248 259 122 95 204 148 242 121 213 103 195 61 90 128 162 135 132 111 235 113 153 28 94 173
3823 173 40 72 62 134 116 76 177 109 116 16 126 135 83 129 82 167 20 134 92 59 77 164 167 173 28 101 288 298 119 76 237 173
3523 173 248 287 123 87 105 143 240 267 158 137 115 171 135 147 141 94 99 263 198 140 118 170 37 75 136 91 148 142 54 97 140 60 133 269
3204 269 162 98 188 3 156 127 197 228 236 162 174 115 156 62 178 175 17 100 59 189 181 129 194 46 32 92 49 212 168 58 106 127
2903 127 153 128 42 113 80 71 72 93 37 87 64 52 241 288 178 48 109 118 101 234 114 86 98 155 138 42 86 266 196 156 110 226 117
2593 117 203 153 141 132 74 36 33 182 146 140 154 72 70 207 320 110 142 109 64 60 79 21 112 133 114 28 89 84 104 106 92 98 87 167 134 163 163
2246 163 82 70 200 285 214 47 198 176 140 171 109 224 115 73 134 135 73 173 125 40 87 105 165 159 171 27 64 72 188 324 140
1955A40j03K86m9k05j2J63M3j55n7J37lp3j7Q0q3k8J43k6l6k6q6J01j6P6j20l6J6M3K2Q7R6
1664C02m6j81K76j40j18J95n9p5ql3l7K86j39j77MJ16j7N1p6k7M01K12m58j47J39j41L4M6
1401A83k3l9p9N5J97r1j1N4k30J02N0n0qR8k7r3L7Jn4J47m9J9N4j32P0j2k1J9o4j0J34r7n1
1091G9J66L9k06L0J23mr4R3j80L3Q6O0j05n0J02N3j85R8J57m8j29p3J59p0L8L8j19m3N0M3
809A41M1l9q6R6L9j42L1j4J39J5j59j1J13m5m5n6J69j9m0k3L9m0Lj3L0j03J95O3j36j20Q6
518A09J21j94J99o3j02M9K6K9p7k3l6k8J02o6M2o6J48O1n0k0Ko0J73l8j63j6R9J32j93O1l2
227A26n3P2K7j13J41J6k5j17K11o7j73J18or5N0K2o6K9n5M2Jqk9l7Q1k8l9Q7J13k3p1rj4M7
-92A55l5L9n5m3j5J15k3l5R1K7j26Qp6J24J39n3j48l7J22L1j01P6o8N0j02J18J39k14pOL4
$$ plain form
1955 140 37 323 274 69 57 220 263 108 51 188 185 112 95 175 92 64 207 181 145 119 33 134 118 194 74 38 54 97 119 206 302
1664 302 256 75 351 211 93 288 229 154 146 113 76 362 223 46 50 166 149 200 124 97 498 710 252 105 244 103 137 183
1401 183 160 121 42 97 294 203 192 246 16 118 168 118 110 208 181 88 125 126 72 219 170 189 243 111 181 169 148 167 103 93 227 130 79
1091 79 245 284 78 108 231 227 133 226 46 79 165 225 120 70 172 225 40 138 295 247 118 45 204 134 172 210 91 48 98 141
809 141 182 143 57 153 192 50 81 67 206 221 62 51 164 119 74 18 187 168 128 105 144 104 107 94 124 21 216 279 143 23 109
518 109 230 36 235 172 70 119 145 174 97 74 38 10 112 46 88 22 170 231 181 161 163 103 276 238 75 59 158 290 97 158 126
227 126 73 145 172 59 200 216 191 74 285 218 45 163 157 62 112 134 68 97 42 84 85 77 48 11 92 64 25 112 225 202 131 122 108 155
-92 155 120 159 104 61 46 161 138 103 194 221 95 103 27 151 290 237 89 52 174 205 104 180 112 162 60 178 317 103 96 102 136
-383A36p1
$$ plain form
-383 136 65
-393F5
##PAGE=	F1=-5667.57
##FIRST=	17614.246348710370512,	4405.4455391999963467,	0
##DATA TABLE=	(F2++(Y..Y)), PROFILE
4405E3L1J3n7J23k5n9m1J34p9l8J87O2k05J2J7J24p4M3j13K9K6NMq1K8n9L1m6ON2R1j43J14
4096A65n0N4r3o9M9J84J0j64PJ53j31J24q8J2p7P6j12K9M9K9m3l9qJ48r2J1j12J30K2j06J9
3804H7mN5j5k7O6m0M6j20N0L2n8Q4r8J28j54P9N4o9kJ15l6Rj43J25J74o8j60K5Q1J1M9k9j45
3495A02k0PK4J57kj16K7j12Q0l9J07rq3OJ55j40n7K4K1m6J3K3%l5M6m3lO6j12R5J36j25l3
3185A14J09k01J37m8N7O7Kj15N2q2j1n1J10L6j09K4pP3k1jL5j11l9O6l5J02n8LQJ5M4l9m6
2875H0L6Oj1l5Ok3kj1LJ66K5l4j56J3K5j7J72j63J9K3M9j03l6J07J02l4rk4R8k02Q9k7l4J3
2556A11l6Ql8J37m2l9L6q0RJ17J26k11O3o1k6j8j9l0J00N1k3j24O1L5L6k0J5m3k5Q2JK9p0
2246A12q5J8K15P0j34j51J55j4q1J05r1M4o2k4Q7j8j16J00m5n8P0K5L2qN3j46Nj6J06J82j65
$$ plain form
4405 53 84 97 40 163 138 79 38 172 93 55 242 304 99 111 128 252 178 221 108 137 163 168 172 91 119 60 91 45 51 103 194 51 165
4096 165 115 169 76 7 56 240 250 86 93 246 115 239 151 163 86 162 50 79 128 157 114 75 67 215 123 134 22 152 174 68 87
3804 87 83 138 123 96 162 122 168 48 98 130 72 156 58 186 32 111 165 96 94 209 173 182 39 164 338 270 110 135 216 227 276 247 102
3495 102 82 89 113 270 268 152 179 67 147 108 215 206 123 129 284 144 87 111 132 86 99 122 122 87 133 90 87 153 41 136 272 147 114
3185 114 223 22 159 111 168 235 237 122 174 92 81 30 140 176 67 91 84 157 136 135 170 59 20 86 51 153 95 98 106 121 165 126 80
2875 80 116 122 111 76 82 59 57 46 49 215 240 206 50 63 88 71 243 80 99 122 171 68 32 139 241 207 198 174 272 70 159 132 98 111
2556 111 75 83 45 182 140 101 137 57 66 183 309 98 161 100 74 56 37 7 107 158 135 11 72 107 143 123 138 95 70 152 153 182 112
2246 112 27 45 260 330 196 45 200 186 105 210 119 163 101 77 164 146 30 130 85 27 97 122 154 146 199 53 58 42 148 330 165
1955A65j28L15j00j78K8J64L9k03m3J20l5o3j4M3j6RJ37k0m6n7l6l5J09J01k25L6K7L3J1O0
1673A98Q3m5j69K43j42q9J99r2m9K6o8J7J87o3k33NK00k6M3m6q2K31P0k17p9R7j34K6R6J0
1391A97m4j07M1J81j35L6J09j84J09on4qR3qj38K6J9%J17q4RL3j50J05JL1l4m4j6R3p0k5J44
1081B37M0j90NJ21j6p6Q6j34K2J04Pr2q8J05M1r5K2K12m7j30r7Q9m8J08K3p6j19M5M9L0n3
790H5l3J29L1j99N0k0J70K4k14M7J45q4p4m5J66k1J8k1n7j3mj0N4r3J79J00j75j05N8J42j52
499G8J62m9j04NN0kk3n6j6M0P4j24O0n7J25Q9m7p8L4k1J17l2k02M0J00J08j61O5n6n3P6L0
199A72j27J35N4l9j30K28n6j68M5Rk7QK1n3K9n0N9n9K4k5PjKk5O5J20k6l3m6MP3m9M6o9p2
-130D6OM8M4n9J08L5j14k4n1J14J51j38q3l5J17j5n1M5k4K3p9Q1J39j99j1M8K9n4
$$ plain form
1955 165 37 352 252 74 102 266 305 102 59 179 144 81 67 110 94 103 240 220 174 117 81 46 155 256 31 67 94 127 138 198
1673 198 281 236 67 310 168 79 278 186 137 163 95 112 299 236 3 8 208 182 225 179 97 328 398 181 102 199 65 91 187 197
1391 197 153 46 87 268 133 169 278 94 203 197 143 135 228 220 82 108 127 127 244 160 169 202 52 157 158 189 155 111 95 188 118 93 237
1081 237 277 87 92 213 197 121 207 73 95 199 206 114 26 131 172 77 99 311 264 134 37 126 78 186 209 133 14 59 108 138 85
790 85 52 181 212 13 63 43 213 237 23 70 215 131 57 12 178 157 175 154 97 84 80 70 124 31 210 310 135 30 88 230 78
499 78 240 191 87 92 142 140 117 61 45 85 159 35 95 38 163 252 205 127 161 140 257 225 23 63 163 271 110 175 119 66 142 172
199 172 45 180 234 195 65 293 237 69 114 123 96 104 125 72 101 51 110 51 75 50 57 56 58 33 98 218 192 159 113 117 190 141 187 118 46
-130 46 52 100 144 85 193 228 114 90 39 153 304 166 83 48 165 150 99 144 120 143 64 145 284 85 74 122 151 97
-393I7
##PAGE=	F1=-5738.34
##FIRST=	17614.246348710370512,	4405.4455391999963467,	0
##DATA TABLE=	(F2++(Y..Y)), PROFILE
4405E4JKPJ11J3o2q5J32l4n0J88J5j79k8N0J62q7k3q3L7k1j6L3lJ7j03K1JJ3J9J00j27J04
4096A79j18J15j01n7M0J76pj49J9J73j84J40n8k8q1O7q4K4L5K4rr5K4J62p0m2o2J78j8p9l8
3804G6L0K3Kj5K5rQ4j50J6N9o7J10j46J55j58L6J80j20k9J44o5rp5J28J32j21j17P5k5Q3L2
3513B84q6o0n1J1mJ96j9j51P2j55J16q1J98k2j27J6J48j87k8M6l4K9j9nN3p4M9Rn4Q8j16R0
3213A32J18j14oJ02j82R3o1N8R7j7j37P1l6n6J7M0M8o6pJ2J2l9N7No1n7N6k1L8j6M5k7MN0
2894A52j6lKK1Jq4NJ0o1mK3J44MK9j01q1L0k5J91j94O6O6L6j74L0J10K4J1KK1P1k75P2J2o1
2565E4K2j4O5n4R1j2n4%p3K5J10J29k01Q3p8%jn6j2O5Q9k6j35N6P2K6m1K1q6K2O6K7Oj18m8
2236B0J7K54N2j64j28J40Lj30J68n5q6Jj8J07l2q8J6JLRK7L9k6Q1j42kk3O2K00j37j40L23
$$ plain form
4405 54 55 57 64 175 188 126 41 173 139 89 277 292 113 85 135 297 210 187 104 141 120 104 137 134 151 48 69 70 83 102 202 75 179
4096 179 61 176 75 18 58 234 227 78 97 270 86 226 168 140 59 126 42 66 101 125 116 21 45 207 137 95 33 211 193 114 76
3804 76 106 129 131 116 141 132 216 66 82 141 74 184 38 193 35 71 251 131 102 246 181 172 97 225 357 236 119 194 169 252 284
3513 284 198 138 87 98 94 290 271 120 192 37 153 72 270 248 121 137 285 98 70 116 82 111 92 87 140 66 115 124 70 158 42 132
3213 132 250 136 130 232 50 143 82 140 237 220 83 154 118 62 79 119 167 101 94 106 118 79 136 141 80 23 79 58 96 80 125 98 102 152
2894 152 136 133 135 156 157 73 78 88 27 23 46 190 194 223 122 41 71 46 237 43 109 175 211 37 67 177 201 212 214 235 306 31 103 115 54
2565 54 76 62 127 73 164 152 98 98 25 50 160 289 88 171 93 93 92 36 24 89 178 152 17 73 145 171 130 151 65 87 153 180 186 68 20
2236 20 37 291 343 179 51 191 194 64 232 177 91 92 74 181 149 61 77 78 81 90 117 156 130 211 69 67 44 106 306 169 29 352
1936C52j50q4J0J56J8k09J7L8n9l6rRP5J2J23j4n3r6K3n5J13J29k31PM7MJ1J3Q6l6j31J64
1635B44j40p2K23j10n2O9p8P2M2J2j69MK01k7J1k0j27pJ25j53R9Kq8j5J29N1l8j30M1J30j77
1344E2Q2J40j13J15n5o7qJ00pj66QO0L5P2j12N1l0j03N8K3P9r6JlJ9j3jR5M0j58j9R0k6m3
1025A00P6q3N4P0n1o0p8O0L3J4o7K48n3j15q1kJ3J09oj9r5L2Mj9k2MJ25L3k11N5l7J90K8k35
706A4Q2J49j05r2pJ38m1Q0j8j36NPJ3K9n3J26J43j82j04M2J35j19J14j3j04k9O0m1M3n7RN3
405A41K3j15P3o2R4J13l9j53R0K2M5l3j51J9Q3O9j08O9p7j7L4K6r7J10Q3n2j43K43m4j53K
114I5K7J1l6RLK6k6K6j01K9qM7m3J4l5L7J18k9J5o8J8P0m6N4q9r9R9n0N4n7J29M5j14m3m8
-214C4J09J46j99J3o8J14m8K9j9J0j7j2J0J24j57pQ8J7m2
$$ plain form
1936 352 202 118 128 284 302 93 110 148 89 53 44 53 128 140 263 249 196 100 123 68 181 310 79 86 133 137 148 161 247 211 80 244
1635 244 104 32 255 145 93 162 84 156 198 210 41 45 246 219 230 210 83 76 201 48 147 149 61 46 175 226 188 58 99 229 52
1344 52 134 274 161 276 221 154 146 246 239 73 81 141 176 248 136 187 157 54 112 135 214 118 119 116 135 122 121 216 256 98 79 169 143 100
1025 100 176 93 147 217 166 106 28 88 121 135 68 316 263 148 67 65 78 187 181 162 67 99 103 84 62 66 191 224 13 68 31 221 249 14
706 14 96 245 140 48 41 179 138 218 200 64 69 76 89 118 65 191 334 152 48 90 225 106 220 207 103 74 134 93 136 79 88 141
405 141 164 49 122 60 154 267 228 75 165 187 232 199 48 67 150 219 111 180 103 86 120 146 49 159 242 190 47 290 246 93 95
114 95 122 133 97 106 109 135 109 135 34 63 55 102 59 73 38 75 193 164 179 111 129 199 153 207 118 19 118 68 122 65 194 239 125 82 34
-214 34 143 289 90 103 35 149 101 130 111 121 104 92 102 226 69 62 150 167 125
-393A25
##PAGE=	F1=-5809.1
##FIRST=	17614.246348710370512,	4405.4455391999963467,	0
##DATA TABLE=	(F2++(Y..Y)), PROFILE
4405E8k8J3M3R8N5n3j38J01K9q5J71Mj26q6Q2J91j10p1n5O1p5k3J9Q5Rj45J9M2M2l1J08j06
4105I8J06j86J61r6o1P5J24k9q8jJ63j99J40l2l4j07N9n6QOK9O3j11kJ81n5r7PJ86m6o8r3
3804D5O8lK3poQJ14j72K1N2o2J16j71J59j44j8L00j68n7J68p5m1rJ25P4j37p8J11j35J44K8
3513B73j07K4r0K7j2J84j8k14J08j03J19j57K70m4j69L0J43j73M4J6r9N2m3k4J00k0k5N1j00
3241D3J02p7O0Q0p4OP6j32L7n9O9J05m4r7K3L7k2Oj8L5m3oQl0o0J04j9k1n7L9mmN2K4n5mM3
2894A23J7N1l1J5K7j22KM0q5LNJ28k6P4l5j32Ok7J76j93R3R5K8j63K3R9m0N8j4Q3M2k91N7
2584H6L5q6oJ7J12l9J1M2n1q0j6MJ11J23j75Q4q5K2K2o2k0JJ33j7j11L6R0kn7J6j21J15N0
2274A82L2l8q2l9k6K58L2j55j17J27K5j64J96Kj59J3k5J21m0m3n5R0nn7K3P3o0R9j50L8rn
$$ plain form
4405 58 30 43 86 184 239 186 48 149 178 93 264 268 142 56 138 329 219 148 93 154 79 56 75 160 169 24 43 85 127 96 204 98
4105 98 204 18 179 83 22 97 221 192 104 103 266 67 207 175 141 34 93 37 45 51 80 143 32 30 211 156 59 66 252 206 138 45
3804 45 113 110 133 126 120 128 242 70 91 143 81 197 26 185 41 23 323 155 98 266 191 150 141 266 340 203 125 236 101 245 273
3513 273 166 190 100 127 115 299 281 67 175 72 191 34 304 260 91 121 264 91 135 151 52 104 61 37 137 117 92 143 43
3241 43 145 68 128 208 134 140 216 84 121 62 131 236 192 95 118 155 133 139 121 156 113 107 115 85 25 129 110 89 32 71 67 63 115 139 84 80 123
2894 123 140 191 160 175 202 80 82 122 37 40 45 173 147 221 186 54 60 33 209 16 109 204 232 69 92 191 151 209 195 278 320 29 86
2584 86 121 35 29 46 158 119 130 172 121 41 25 29 140 263 88 172 87 109 131 69 49 50 183 166 55 91 181 179 122 138 17 132 182
2274 182 214 176 94 55 29 287 319 164 47 174 199 35 231 233 74 87 62 183 143 100 45 135 130 73 96 169 109 208 58 96 87 82
1973H2J73j02j20K89j79J6k6J41j6j45M8o2n0j7pJ4J05J6J13j1o7j26Q2j6N6J54k02n7P3l2
1692A27J9n0J11l0o6O1j31JJ72p7j03J19p0J09r5N9p9K2J78l7l0pj24K85M46o14qo5k7o2J16
1401A50R0l9j33O7M4r8L3J19k9J13q2q1j3J09j7j61k6J01O0K8j17J01j02K2q4N0J13j49N7
1128A26J4m7K9K3M9K7j20j5K9k1k0O2l5P8L4r6j5k5mL1Q1j39K62o3q7l7n1L7O4m1L5o1M1k6
809A19m7L4k5J00M5j98M0k4J87K0k07P0J31j02j01K4J18o8J23j5j52lK5L9j8k8P0J85j56j21
527F5L5J21j12O4L6r5l7M8p8J11l8nN1l8l2N8p8P5J25k9k27J63M7k5m7o9k9Q3J6n4O4q2K9
217A16k4K5k5M8R8n7j53K57l6j33pL4L2q7mO5L6j7j8j00kJ8P0o7K4n4J7J05l4N4p1L3L8k1
-102A60N1j07r6J59n3m4oJ39M3j27l8n9J06J26j84N8r5R7n9P0n9K7n3O6o1J00o8k8J14Kl9
$$ plain form
1973 82 255 153 33 322 143 159 133 274 258 113 161 99 49 32 25 39 144 160 273 262 195 69 151 135 191 345 143 86 159 127
1692 127 146 96 207 177 111 172 41 42 214 137 34 153 83 192 97 156 77 99 277 240 210 203 79 364 810 196 188 123 96 34 150
1401 150 240 201 68 135 179 81 114 233 204 317 235 154 141 250 233 72 46 147 207 235 118 219 117 139 55 105 218 69 126
1128 126 140 93 122 145 194 221 101 86 115 94 74 136 101 179 213 117 102 77 73 104 185 46 308 245 158 121 70 107 171 130 165 104 145 119
809 119 72 106 81 181 226 28 68 44 231 251 44 114 245 143 42 66 184 116 239 224 72 69 94 133 115 87 157 342 186 65
527 65 100 221 109 173 209 114 77 125 47 158 120 115 166 128 96 154 76 151 276 247 20 183 230 205 158 89 60 143 159 105 169 87 116
217 116 92 117 92 140 238 181 28 285 249 116 109 143 175 88 84 149 185 168 150 50 48 66 136 69 93 39 56 161 127 181 110 143 181 160
-102 160 211 104 8 167 114 70 64 203 246 119 81 22 128 254 70 128 33 130 71 141 82 109 56 122 61 161 93 65 179 181 142
-393A42
##PAGE=	F1=-5879.87
##FIRST=	17614.246348710370512,	4405.4455391999963467,	0
##DATA TABLE=	(F2++(Y..Y)), PROFILE
4405F2l5K5M7R1R5m4j80L6R7j17J26K5n1j41R4K04j32p6n1R8j19K9p4J58Oj59K7M2Q0p6J11
4114A98q4J19j73J12p0q6J05O6l2j3m1J34j73J24ok7q5Ol5k8kN7J09r8n3J95m3j02K7J61o3
3823A99n4j04N9j0L6kk1RJ30j71M3J0l3R6j67J42j00l8L38k01p8J79o1p6L4J19J1j09o1J34
3542B53k27J88M0q5N1j08M2MJ37Lk66J05k0J22k35L07o1j91L1J33j14R3nj32Pn4J9P5O2r2
3260H2O2j34J03j3K9K5k4J4M4p5lk4N8Q3o2k5n7Q9K9no9K3m6K5k2l9m1Q8k3Jm8J5J0j4P8Q
2922A42q0kM0K8J13n9lN9j28k4O2r1K5l5J16o1J04K4j54l3j6J35j19N5R4K2j14LP8q8J05n6
2621A42J45K3k54Q1K4q9m2J9J23lp7R7n4j10N1o1J13J03j28O1q4L2M2n1k3o7J53J1p9J3R4
2330B05m0o3J0p1J36M5L2j02J8p7q2K43Lj11j18J28M1j47J59N9j32n4l0J22m6pm7J23l4j10
$$ plain form
4405 62 27 52 99 190 285 241 61 97 194 77 203 228 177 36 130 334 202 126 75 173 54 83 9 167 173 14 41 83 163 87 198
4114 198 114 233 60 172 102 16 121 187 155 142 101 235 62 186 180 153 68 74 39 11 9 66 175 77 24 219 176 74 101 262 199
3823 199 145 41 100 90 126 124 103 112 242 71 114 124 91 187 20 162 62 24 362 161 83 262 201 125 159 278 289 180 119 253
3542 253 26 214 254 169 220 112 154 158 295 298 32 137 117 239 4 311 250 59 90 223 109 202 197 65 72 18 37 112 174 82
3260 82 144 10 113 100 129 154 130 144 188 113 110 86 144 227 165 140 83 172 201 196 127 150 104 129 107 68 27 115 92 93 45 60 70 56 134 142
2922 142 62 60 100 128 241 182 179 238 110 86 148 57 82 47 163 102 206 230 76 43 27 162 43 98 192 214 100 103 181 93 198 142
2621 142 287 310 56 137 161 72 30 49 172 169 92 189 135 25 76 15 128 231 103 164 80 112 154 103 80 13 166 177 98 111 205
2330 205 165 102 112 41 177 222 254 152 170 93 11 254 257 146 28 156 197 50 209 268 136 82 52 174 128 121 74 197 163 53
2049E3K5J09j02J07j58J08qm1R4o6n3K02j57O6m9J15o0j4L5j56K6n8lM0P7K8J07j2q7j35J24
1757A57J3K3J61j57j33J01o1L2j24J61l6K1k9o4N5L9J7j02R0p4J23j14J3pM3J42p2n4no7M39
1466E31O19q10j35p6Lp8O7J14n7j08J07n2L6l0L0N6J01q1q7k2J09l2j17p5J28P8kq2J01j35
1185A01J14k05P1J24j85J12K0o2J6M4K7%r0J8l2K6m0L3NQ2Nj14K9K3k4K4R5j84K49o6n1Rr2
875H2K8L1p7P5k2M8l5j2L2o0O7O2j82J8K1J63%j82O0J00p7j05N3R6q9J37j9j18j2K4O2m9l1
565H9K8K09j10j32J4J19j33L1Q2p4j4Rp6J45j8n1M6j02Q9K6r5Q1J15k0k12J59N0q3p2J9p7
274D2J12l6j9M4n7N7o6M0K9j7R3m4j60K66l1j10j6M1N0j37j6J12N2j5o1r5k3L5Q3r5N3p6M2
-36G7O3m7O6n7N4j5K5K8j10n6J55j5j63Q3J27K6j48qm0P3R8j05L1q4N5m8N5o0K2m5J01j01
$$ plain form
2049 53 78 187 85 192 34 142 134 93 187 121 68 270 113 179 130 245 185 171 206 50 76 18 15 55 132 160 267 255 168 33 157
1757 157 170 193 354 197 64 165 104 136 12 173 137 158 129 65 120 159 176 74 164 90 213 99 112 105 148 290 218 164 159 92 531
1466 531 1150 340 205 129 132 54 121 235 178 70 177 125 161 131 161 217 318 237 150 128 237 205 88 13 141 219 217 135 236 101
1185 101 215 10 81 205 20 132 152 90 106 150 177 177 87 105 73 99 59 92 97 179 184 70 99 122 98 122 217 33 282 216 165 174 82
875 82 110 141 64 139 117 165 130 118 150 90 157 219 37 55 76 239 239 57 117 217 140 35 88 184 95 232 213 95 83 107 169 120 89
565 89 117 326 216 84 98 217 84 115 197 123 109 118 42 187 169 118 164 62 151 177 82 163 278 258 46 205 255 172 100 119 42
274 42 154 118 99 143 86 143 77 117 146 129 222 178 18 284 253 143 127 168 218 81 65 177 229 214 153 58 35 70 153 58 111 35 77
-36 77 140 93 159 102 156 141 166 194 84 28 183 168 5 88 215 241 93 85 45 118 216 111 142 58 113 65 120 60 82 37 138 37
-337C7P2L6p2J26j2m3
$$ plain form
-337 37 109 145 73 199 187 144
-393A44
##PAGE=	F1=-5950.63
##FIRST=	17614.246348710370512,	4405.4455391999963467,	0
##DATA TABLE=	(F2++(Y..Y)), PROFILE
4405F4k9K5M2Q7J27m0j92o2J58j25N7P0K1j50O2J95j52j8p8J33j42O8q1J17Oj06J1JJ18j11
4124G6J05o4J41j53M6k7j20J22OkM4r0J01j16R3K0j0m4n2k5j8L5L9Q4q0o7J77l2p5J4J06o6
3823A68k6n6j1NL2J0l4OJ28j37N1m5J0N5j38J13m0k8L00k12q5J69k6j08M6J12m3m7o4J37j88
3532E4J27N9n1K4r9N2K9Q2M0k37J0O0J27k34K54o9j47j6J00n0J23qj53l2k2P1l0J45j15L4
3250A28p4K1N4Jk9J4K8K4m3j2J7L1M4o3L0r6Q8Q2kj17L1p5P3p0j5k0M8J0Jm7j7J8j2P5J6j07
2912C5QO8j2J77p5k6Q6j11o8P7r7O1p4J07q8J30N4j56o9RQ1m3QO1K3m2j9M8j19J46j19J93
2612B54J6j90J18K3j07l3k2J14L8j28J12o5l8L3j06J08P0p4K3p7K8N0rk3l2M7N0m7pQ4p6n5
2311G9J0j0J23N3L4j74J36j16j15J89m1m7j08J29L7r7R0J07q6j22lR1n2J5j2J25n8j34M1J17
$$ plain form
4405 64 35 60 102 189 316 276 84 22 180 55 112 182 203 53 115 310 158 140 62 195 53 121 40 157 163 57 68 69 187 76
4124 76 181 117 258 105 151 124 4 126 132 130 174 84 185 69 162 182 172 128 76 51 33 68 107 191 111 44 221 189 114 128 234 168
3823 168 142 86 75 80 112 122 88 94 222 85 136 91 101 156 18 131 91 63 363 151 66 235 209 101 147 259 216 169 105 242 54
3532 54 181 240 189 213 114 166 195 277 317 80 90 150 277 43 297 228 81 65 165 115 238 230 77 45 23 94 64 209 94 128
3250 128 54 75 129 130 101 115 143 167 124 112 129 160 204 141 171 75 163 245 243 126 157 82 155 85 70 50 98 108 109 62 45 63 51 126 142 35
2912 35 43 111 99 276 201 175 261 150 82 159 62 123 49 156 68 198 252 96 27 36 117 74 82 143 166 124 105 153 34 180 61 254
2612 254 270 80 198 221 114 81 59 173 211 83 195 130 92 125 19 127 197 123 146 69 97 147 138 115 83 130 180 133 126 210 134 79
2311 79 89 79 202 255 289 115 251 135 20 209 168 121 13 142 179 82 172 279 193 71 68 159 107 122 110 235 177 43 84 201
2030B01j35R5j17J48j9n4ml2L6R0p7M1m0P9j04J32Rj96O4j02J4L2M2M1J05j5j08r8J16L2K4
1739B00J34j00k06J20p3M7m7Q0n1J02o0k4O1q4J32p8N8j18J24n2m6OO4R0j39m1pMK76N75n90
1448C57j60o7L1r6L4J12q9n3J44j40J48o0q6J30P6n4p7l7R4m8m8p1Q4R0nl2N4j15J45k18L4
1156G7R9j56J22Ol8l7O3L1l3q0O6m6O2o7j7L2O4j5r5O2O0k6PQ5j88K01n3j7M6j57K0K4j00
847BQ4K0M7k8L7J0p4L8P0j62j0Q1J25k9j60N7N9l8j07Q6O8r9J25m1n8MkP9n5n9RK02n6j18
527A07k4J26j73N4Q8m2J9m2m7J56oj19M9j24J75k0r8J05Q7j3j68J27L7j25r3R8j13J42n9m
246A00QoO4q6O5M6o5P1pj68K63l0q2l9N4O7j76l0J35O4j1r6r9k2L4R6j20R5q8R2J3p1M4k9
-74H6Q1p5Q0j5q6l3J27L0j18M4J04lj76M4pL5P2n6Om7Pk0J2m0lK4O4r2M5J06j15J20k0n1
$$ plain form
2030 201 66 161 44 192 173 119 115 83 119 209 132 173 133 212 108 240 249 53 117 15 29 61 103 144 249 234 126 28 144 176 200
1739 200 334 234 28 148 75 122 75 155 104 206 146 122 183 99 231 153 211 93 217 165 119 125 189 279 140 99 92 96 372 947 357
1448 357 197 130 161 65 99 211 122 69 213 73 221 161 75 205 281 227 150 113 207 159 111 40 124 214 209 177 231 116 261 43 77
1156 77 176 20 142 148 110 73 136 167 134 54 120 74 136 69 52 84 148 133 38 100 160 134 141 226 38 239 186 169 215 58 78 102 2
847 2 86 106 153 125 162 172 98 136 206 44 34 115 240 211 51 108 167 129 22 108 176 77 202 161 103 107 105 184 129 70 79 281 225 107
527 107 83 209 36 90 178 136 155 113 66 222 216 97 146 22 197 177 79 184 271 258 90 217 254 129 36 134 21 163 104 100
246 100 108 102 166 80 145 191 126 197 190 22 285 255 173 134 188 255 79 49 184 248 237 141 42 20 54 150 30 125 37 129 142 71 115 86
-74 86 167 92 172 157 71 38 165 195 77 121 225 222 46 90 83 118 190 134 140 93 100 80 92 52 49 73 137 45 90 196 81 201 181 130
-393A30
##PAGE=	F1=-6021.4
##FIRST=	17614.246348710370512,	4405.4455391999963467,	0
##DATA TABLE=	(F2++(Y..Y)), PROFILE
4405F7l4L0L6P7J49m3j69m7O8r4L4P8N6j19J0J61j64P7j00J45j58P4p6P9Nm6jk8J32j34Q7
4114A52m5J59j29j8K2j31J10m9N5O5j42P7m3M9M5K0j3r3k3J3L6L6L5n8o7J45j8m7NL3n7OJ
3804A31q5L6J6L6n9J7J06q9M5q0L7Pr6Q4Rk6K38j89p5J31J9j29K7J04p9L5p8J12r4N7P5l9
3504B04l2o5N2N3L6Q3k02p8J12J31j99J74o7p2n4K3LJ34Kj72J1k8R6j40K05j02jPl5O8j6p1
3204F0K7M8K8n0mN7lKm2N0q0L6J30J2j42N5j23J20j21K8l4L5N5ko5l9J1j0O0M6j41L4J05q1
2884F2K29p1m8R5q7j10P8r4R8j07J00o7J45L8j57p5M7L3j6k7J6M2K4l9J2r6J29j22J47K4j06
2593I7J48L7j40k2o2J10O7j17P0q3M1J6j16Q8K7k3j8o7J2M5N9j8J1o9P6j9j5N9r5m0K0J2J06
2283A97P2L9k44K57j46j25J28r7J5m7Q5J5m0K4J35m7j63M2M6o3K3K2J14o9j08M2R5j38N4m0
$$ plain form
4405 67 33 63 99 176 325 282 113 66 134 40 74 152 208 89 99 260 96 173 73 218 60 134 58 137 142 96 95 67 199 65 152
4114 152 107 266 137 119 141 10 120 71 126 191 49 126 83 132 177 197 184 91 68 81 117 153 188 130 63 208 190 143 148 181 124 130 131
3804 131 46 82 98 134 75 92 198 109 154 74 111 118 22 106 115 89 327 138 63 194 213 84 111 215 136 171 93 205 111 168 243 204
3504 204 172 107 159 212 248 331 129 51 163 294 95 269 202 130 76 99 102 236 238 66 77 49 145 5 210 108 107 114 79 147 131 60
3204 60 87 135 163 113 109 166 163 165 123 173 93 129 259 271 129 184 61 181 60 88 54 89 144 142 77 38 49 39 99 145 4 38 143 62
2884 62 291 220 172 267 180 70 148 54 152 45 145 78 223 261 104 29 76 109 93 66 82 124 148 109 121 25 154 32 179 203 97
2593 97 245 282 142 120 58 168 235 118 188 105 146 162 46 134 161 138 120 53 65 110 169 151 162 93 169 150 135 194 99 59 79 91 197
2283 197 269 308 64 321 175 50 178 81 96 49 134 149 109 133 268 221 58 100 146 83 106 128 242 173 65 107 202 64 118 78
2002G8J56l3o2q8kJ26j4jj9JM3j14K28qk00M9j21L3RJ1M3J12k2j16m4P3M9M6Q2m1k04O2o3
1692D9O2L7Qp8J58m5l2N1j50K12n6N4j84J18ln6oQ3K3j83j2KL8J24j9N1o2q1Q6j25K6Q4j07
1382F7OJ60k01K21p5j68J75L4rn2n3O6o3K2n2K6R5ROnp7J33k02K2N2r0J10k3j3r2Q2M6m8j04
1063EJ18k4O2o9o8M6K9l4l8R2O9k9j5P5j59J19j4KO9k29J8L7ml7N5L9pP3pn7K1N1j30m1J32
734A50P6n9j34N9J6lr5J14L7r8R4q1J4M1l8Q2m5r6J9J60pp6o7J36j57P6M8j3M0q9k3J71Mj99
415E7O9l7J34o8p6J24N2j0j28R3J6j52n1J10j16J28n5J6l4M8O6j05R2M2r1N1M0j80K47l2m8
124B02p0O5Q2j93m5J28O6kj15r4k2J7J13j14J11o7J21j9j03kJ1J04j23J28p3l3l0P9O6m8J3
-167A53Q1m1j63N9K4RO5o5jPl9K0Mn6k9P7J2n3K5J44j47R8k4n8
$$ plain form
2002 78 234 201 139 51 49 175 161 160 141 142 185 71 299 291 91 140 19 52 61 72 115 227 205 89 45 118 167 213 295 254 50 112 49
1692 49 111 148 156 78 236 191 159 210 60 272 216 270 86 204 201 145 139 222 245 62 50 52 90 214 195 246 184 103 189 64 90 174 67
1382 67 73 233 32 253 178 10 185 219 210 158 105 171 108 130 78 104 199 208 214 209 132 265 63 85 137 47 157 134 121 29 111 157 109 5
1063 5 123 99 161 92 24 70 99 65 27 119 188 159 144 219 60 179 165 167 236 7 25 62 58 21 76 115 108 181 174 117 138 189 59 18 150
734 150 226 167 33 92 108 105 10 124 161 63 157 76 90 131 93 175 130 34 53 213 206 130 63 199 42 118 166 153 193 104 81 252 256 57
415 57 126 89 223 155 79 203 255 245 117 210 226 74 23 133 17 145 90 106 72 120 186 81 173 215 124 175 215 35 282 250 202
124 202 132 197 279 86 41 169 235 233 118 24 2 19 132 18 129 62 183 164 61 59 70 174 51 179 106 73 43 122 188 140 153
-167 153 234 193 30 89 113 122 187 122 121 128 89 109 113 57 28 105 117 64 89 233 86 184 160 102
-393A02
##PAGE=	F1=-6092.16
##FIRST=	17614.246348710370512,	4405.4455391999963467,	0
##DATA TABLE=	(F2++(Y..Y)), PROFILE
4405G1n4N1K8N5J56m8j20J4q7m3J26K0J4n9l6J04j56J67r8J35j84O5p0O8pRqj8J16j58O2k6
4105H9J63r8o7N7j20Q8n7P5N9j84O0L5nO5N4Mj13k3M2K2L8k0l1p3J13Kk3Pl1l9J8N7j31N9
3786I2%P5j05M9Q0o3M0p9K9j6p3P8J9k5J69j35o0P5O3j25rQ1r3J10q8O3rL1Q3n3r2j7M5O6
3466B06PJ20j76j23J24J27j31Q1o2qo2o6M3J22J7j91R3o9J28j21J16o9jP3n1K3j6o8j6P0M9
3175A69r0J0R8l7l5kL2l9k7J63K7j17P6j78J52j57O8o2M9P1%q8l0j8pL8Q6j17K0J11j14K40
2875B92n2o5Q2o9j40O5o0J10j35J00nJ50oj71n1Q7Pm5l5K3N5L8n6j5l4N1pm0M5j4J65N5j76
2565A49rj03J30P0p4J0j00J08%r2O0k2J6n5n5PPJ40mN2j34L7L%K2r0l0M0oQ7R5M3k95L60j64
2236B03j30J09q2k2KM6j2J3k3J43k8j69P6Rp2J8M4R3o5n2K2O3j09qL4J52l9p1j30K7J86p6
$$ plain form
4405 71 17 68 96 151 307 259 139 153 66 23 149 169 183 124 88 192 36 203 105 240 56 121 51 119 112 121 113 95 211 53 115 89
4105 89 252 154 87 144 24 112 55 130 189 5 65 100 95 160 214 218 105 82 124 146 184 164 133 60 173 175 152 159 128 89 107 164 33 92
3786 92 92 167 62 111 191 128 168 89 118 102 29 107 126 101 270 135 75 150 213 88 79 160 67 177 89 152 143 174 257 204 112 95 140 206
3466 206 213 333 157 34 158 285 154 235 173 165 103 37 80 202 219 28 121 52 180 59 175 106 105 178 127 150 134 66 50 120 169
3175 169 79 89 187 150 115 113 145 106 79 242 269 152 228 50 202 45 113 51 100 171 171 83 53 35 28 66 152 35 55 166 52 292
2875 292 240 175 257 188 48 113 53 163 28 128 123 273 267 96 45 132 139 94 59 82 137 175 119 104 70 121 114 74 119 105 270 325 149
2565 149 140 37 167 237 163 173 73 181 181 89 149 127 143 88 33 40 47 187 183 235 101 138 141 141 163 73 43 83 77 164 259 302 7 367 203
2236 203 73 182 100 78 80 126 114 127 104 247 219 50 126 135 63 81 125 218 153 101 123 186 77 69 103 255 216 145 15 42 228 152
1936A52J8p9N5J5o8K39lk12K2j18N3%k3K9J28l3r8l1M1O8O4M1Jj59l6k8O8Q6k6j10J80qn6
1626A72K2j27K19l9O5k38J01K1m6jJ02m8o3o5J8K5P40O2p35Oj39J62j56L2M3j5l0J49k14K32
1344B55q1r6J02j7K5j1o4K4o9P4l5k1R0K4K9m9n2R9j66L0%k6J05n2jj01P4N3l5o1P2mM9n6
1025A08q2L4j4j8JJ25N2l8l5P1j15K3M2MP9j68k4j7O9n1NJ2K8Q3mk8J6J4q8n4J38K5p8o9L3
696G9k5J4l2J02Mq9N6o9L1P1o1O6l1j05K7J06J7j8r3J45r0M6J6jM3j18j2J88J7k76J00L1R2
387B31j12k8J16K5j0r8N7nj47L1O0r5O6l1N4o2P7P4j35J20K6r8N2P3j88K14l5qr5O7Q5j77
86A04n8R2N3J5j16k3l5J4O2n9P3k7J32k9j27o0O5J01j42J52j37L0l2K1Q9K1%O6q2o2k3N0o
-224A22P9j19QO8q1O3K7j00l3Q5l1ojJ73j63N8k2o0
$$ plain form
1936 152 170 91 146 161 93 332 329 117 139 21 74 74 51 80 208 175 77 46 87 155 219 260 261 102 66 38 106 192 166 56 236 228 172
1626 172 194 67 286 247 312 74 175 196 150 149 251 203 140 75 93 118 858 920 185 191 52 214 58 90 133 118 88 237 23 255
1344 255 174 78 180 163 188 177 113 137 68 142 107 86 176 200 229 180 128 227 61 91 91 65 170 118 117 16 90 143 108 47 119 115 164 108
1025 108 26 60 46 28 29 154 206 168 133 204 89 112 154 158 237 69 45 28 97 46 51 63 91 174 170 142 158 172 84 30 168 193 115 46 79
696 79 54 68 36 138 142 53 109 40 71 142 81 147 116 11 38 144 161 143 50 195 105 151 167 166 209 91 79 267 284 8 108 139 231
387 231 119 91 207 232 222 124 181 176 29 60 120 25 91 60 114 52 129 203 68 188 214 116 168 241 53 267 232 224 129 196 281 104
86 104 46 138 191 206 90 67 32 46 108 49 122 95 227 198 71 11 76 177 35 187 50 80 48 69 158 179 179 245 163 101 78 128 122
-224 122 201 82 90 158 77 140 167 67 34 119 88 82 81 254 91 149 127 67
-393F7
##PAGE=	F1=-6162.93
##FIRST=	17614.246348710370512,	4405.4455391999963467,	0
##DATA TABLE=	(F2++(Y..Y)), PROFILE
4405H0o4O7J3J9J49n4n4O6j89j4J93Lq4K1p1L8o2J61p4J15k25N8l0N3l8N2j0J2R9j89L4NJ38
4096B18o2q6O2r5O9j9M1M4j25l8J07o6P9Q2Nj05k4O6JM3o7nr6R1K8kJ5n7j7j3J04j20M5j0
3776I3J14j56Q7O2o6M7p1J2pp7R4rk4J11o3n8K5R2r3m%p2J45r5QN4K7Q9p4j26J8L8N9jJ38
3448C17j55j25J02J11m4oo3L5n4r3N3P8K6j51J19j11J52q2kk4N2J00o3l9J1l1j00Q1P5j35
3166C4L3J25o5o0N1j1nq1J77L3m5R1k22J63j74R0p6O7N1Oj04%l9qRJ22r4J3Q6q7K05l0p6N4
2847B33o7j41L6J1P9j46J04O6J41n1j87j0J19k1q7j3O8M1K1o4k2j2j5Q8j27j0O7J73O7k09
2565A32Pj28J61N0k4m1j10J47j6l7K7p3M2q1k0L5l1J43K6Q6j48n8K2L5k0o9k6O5m4O5J12L6
2265B65j99L19j68j34J21k2j10K2J8j7M4n1J35l1j41P7rp0MN4O7n0Rj4L6o5k7N1J35k8q3j05
$$ plain form
4405 80 16 83 96 115 264 210 156 222 33 19 212 215 131 152 81 119 57 218 144 259 34 92 62 115 77 129 119 131 230 41 75 80 218
4096 218 156 70 132 37 106 87 128 172 47 9 116 50 129 211 216 111 87 153 154 197 130 125 29 120 148 146 161 104 87 74 178 58 103 93
3776 93 207 51 138 200 134 181 110 122 115 38 132 123 99 210 147 89 114 206 113 109 109 37 182 87 95 149 176 265 191 65 83 121 180 179 317
3448 317 162 37 139 250 206 200 137 172 118 25 78 156 182 31 150 39 191 109 107 83 135 235 172 133 144 113 13 94 169 34
3166 34 67 192 127 67 118 107 102 21 198 231 186 277 55 218 44 134 58 125 176 182 78 78 39 31 40 162 68 81 167 80 285 255 179 233
2847 233 166 25 61 72 151 5 109 175 316 265 78 68 187 166 79 66 134 175 196 132 110 98 83 171 44 34 101 274 341 132
2565 132 139 11 172 222 198 157 47 194 178 141 168 95 137 56 36 71 40 183 209 295 147 89 111 146 126 57 31 96 52 117 229 265
2265 265 66 385 217 83 204 182 72 94 112 95 139 88 223 192 51 128 119 49 53 107 174 124 133 119 155 90 63 114 249 221 138 33
1964C3K3K10q8j6j29J03j0j6K18K7k26rj03P4J1n4KJ45m4o5o0L3P8O3N1Qj24j14K0O6R2k3
1664A76j02J34L5p1l6n2J85k6P5k54P9J1k7L2J11j01J8j14N8L1J145L31j362p0k04K20j70
1410E2M2J7R5r6J17j89J91p4l0P0n4K3M2o4k8o1R7k8n1P5K3M8o1n9O2j08L7m2L7Q9p0Lm9K5
1091H1L8ok2K6jL1l6o6J5l9P7n1J44J7n3l8P1p2p1J06j2Q4r7l7q2J11k6j4k8L3O3K6j4J5j8
762A55l9o3J10k2p9K9j5n0qN7P0k1p7J9P8n6M1n8M1l0l5j8R6k3L5q6J51m7RJ3pK4j18j0J93
433B59M0k40K5Q0O7j40J7Q0J8j5p4J7j5m2j1M8r2pK9P4o1P2Q5j69J47kr1P8P5j78J59l3L3
124B33r7N3P2j32o3M2J8L9r7N1n6M3j4k1L9J0J32j4j34n6N5P3j24J51k01P8k4k8R8O7NO1j18
-186A41L0j10O4j6J06j61PJ17j20J01N0j33m2P8n1L7l7K01j65J0k0n1
$$ plain form
1964 33 56 266 178 162 33 136 126 110 328 355 129 120 17 91 102 48 50 195 151 86 26 59 137 200 251 259 135 21 41 107 199 176
1664 176 74 208 243 172 136 84 269 243 318 64 143 154 127 159 270 169 187 73 131 162 1307 1638 276 206 2 222 52
1410 52 94 111 206 110 227 38 229 155 125 195 141 164 206 142 114 53 150 122 71 146 169 217 156 97 159 51 88 46 83 172 102 105 56 81
1091 81 119 113 91 117 116 147 111 45 60 21 98 47 191 208 155 117 188 116 45 151 139 223 126 89 7 118 92 78 50 83 146 172 158 173 155
762 155 116 53 163 141 62 91 76 26 18 75 145 124 47 66 144 88 129 71 112 82 47 29 125 102 137 51 202 155 164 177 170 194 76 66 259
433 259 299 59 84 164 231 91 108 188 206 191 117 134 119 77 66 114 22 15 44 118 57 129 214 45 192 190 99 177 252 74 233 200 233
124 233 136 189 261 129 66 108 126 165 68 119 63 106 92 71 110 120 252 238 104 48 103 176 52 203 2 80 56 28 126 193 198 259 141
-186 141 171 61 125 109 215 54 61 178 58 159 209 76 34 112 61 98 61 262 97 107 87 36
-393C6
##PAGE=	F1=-6233.69
##FIRST=	17614.246348710370512,	4405.4455391999963467,	0
##DATA TABLE=	(F2++(Y..Y)), PROFILE
4405I3m1N1mk4J29n5QJ05j59l5J61K4j87R9r2k7N3J18l5R5k44L2M3J1p4P7kM0R2k16J2M2Q2
4096A72k4p9L9o0M6J1J0L2n9m8R0j27Q5R3no2l4Q0j7N3j02K1q6M3L7K4K0n0lo1J39p7J1k6
3776H6J50j93J13N0q1O7p4PMp7J06m9k7Q4po6oR7l9L1j03j3J21j07k6Q3L1R4q4j04J1L8K5
3466A42RJ32j35j09P5Q0M5p5o6N1m0n7N5J6J6m5O5j15J33m3j14K4J27J10q8r2N9Nj44M0R9
3175A60j44O2J10q6o6J00m0j2m7R7K6N3J01k44J59j83J01p0P1RRj03M0m3rk4J44q1RM7m1J67
2875B72j6p8K0p9q3j1O8K8p1M4J25J08q4j66K7J24n3j10J6R0K1Qn6j8k0o4J47m1j10M4J81
2584B63O3k31K3p1J27K6J5o6j10J48l3L2kj16N3r4M6M4kL8P5J05j46j29L3O1n5n6j7Q8o2L0
2283H0J07J4p1K41j49j44J42K6j76J8JJ0M9p0J28n1q9L1j1m3j5O8L1l7O0n6K3k1K0OR1Lr3
$$ plain form
4405 93 52 103 99 75 204 149 157 262 103 68 229 253 66 165 73 46 99 217 182 277 33 65 108 119 45 122 120 160 252 36 48 90 172
4096 172 148 69 108 48 94 105 115 147 88 40 130 3 88 181 176 114 80 160 143 196 94 115 29 72 109 133 153 103 100 39 178 101 112 86
3776 86 236 43 156 206 125 192 118 125 129 52 158 109 82 166 159 93 87 184 145 176 73 60 181 74 48 131 162 256 172 68 79 117 142
3466 142 151 283 148 39 114 194 239 164 98 149 109 52 107 123 139 94 159 44 177 134 20 44 171 281 193 101 160 165 21 61 160
3175 160 16 78 188 102 36 136 96 84 37 134 160 213 314 70 229 46 147 77 148 157 166 63 103 60 51 27 171 90 99 146 105 272
2875 272 256 178 198 119 36 25 93 121 50 94 219 327 243 77 104 228 175 65 81 171 192 200 144 126 106 42 189 148 38 82 263
2584 263 326 95 118 47 174 200 215 149 39 187 154 186 184 68 121 27 73 117 115 153 228 333 187 58 91 152 97 41 24 112 50 80
2283 80 187 201 130 371 222 78 220 246 70 88 89 99 148 78 206 155 66 97 86 43 28 96 127 90 150 94 117 96 116 122 213 216 123
1973A23p4J8K16p4o0j28R5m3K5J89P4k28m1q3Q9M0p3j5J38n5l9p0QP0N0J14j7j15j16K9O1
1682A08O0J7m5L5N8n7j26K9J50k1P8k23O5l8J1P7Q8j24m6l5P8RR37J74j077%j61J66j48O6
1401A05K2J46j35P6j66J30m4J5N9o2qJ02o0p5l6R2m0n9N4NO2l9j02M8l6K7m3O3N6p3J2rj6
1091G1J9J8PJj6J5j6k8%j5J06q1J37k2p6j9P0l6j21J36l9R0n5m0r5J19k0K1k2k2K0O8j7J2
772A70l1J5p2N5n9o2J22n3m5JP6K6l4o4lJ91r2m9l7K3m6L5k3J23j17O2m4J46l2k2K9k5j4q7
452F3pJ69P8j82p3J22O3j45K9K7M0k3n2j9j3N9r2R2j18P0j0L5l1N6Q0j82J58m1p6J13M8j42
152I6Q3k6P1p2L1L6o5n8Ol9O8p0R3o7O6o3j3K3L5J20J9j26p1N7M4q0J33j88K5lm1R2P1J7O5
-177B69j42R5j75O1k5J32j35k0J29j59J27O4j38o0O9m6P0n4J99j57l9j7k9
$$ plain form
1973 123 49 67 283 209 149 21 116 73 98 287 361 133 92 9 98 138 65 50 188 133 94 24 32 102 152 266 249 134 18 47 108
1682 108 168 185 140 175 233 176 50 79 229 208 286 63 128 90 101 178 266 142 96 61 139 148 1085 1259 182 182 21 187 39 105
1401 105 127 273 138 214 48 178 134 149 208 146 138 240 180 105 69 161 121 62 116 121 183 144 42 90 54 81 38 101 157 84 96 87 71
1091 71 90 108 115 116 100 115 99 71 71 56 162 81 218 196 120 101 171 135 14 150 111 201 146 106 11 130 110 131 109 87 107 175 158 170
772 170 139 154 82 137 78 16 138 85 40 41 117 143 109 45 42 233 141 92 55 78 32 67 44 167 50 112 68 214 182 160 189 164 150 63
452 63 56 225 303 121 48 170 233 88 117 144 184 161 109 90 77 136 44 136 18 88 78 113 82 138 218 36 194 153 77 190 238 96
152 96 179 153 224 152 183 219 154 96 102 63 131 61 154 87 153 90 77 100 135 255 274 148 77 134 178 98 231 43 68 65 24 116 187 204 269
-177 269 127 222 47 108 83 215 80 60 189 30 157 221 83 23 92 46 116 62 261 104 65 48 19
-393A9
##PAGE=	F1=-6304.46
##FIRST=	17614.246348710370512,	4405.4455391999963467,	0
##DATA TABLE=	(F2++(Y..Y)), PROFILE
4405A07j7L4k6n3R1m6N2J22r8l7P1O0j99R7r8l9R7Q4J7P5k04m2J04l1q9P8J0N8Q6k04NM0J7
4096A22J2o6J1k5J8K3%K7j1k7N7r7RP4k3K1o0Q0k5O9j24M1j1j7k1O6J3m1Oq6J55j8l7m9J75
3767B41k06J19L9q1Q9r1K0j0m5R9q0l5Q2J6p0j8P5K9O7j80K5R0j31j6P4L0R7p5p0MM3l1K9
3457A29J05j08q4N5K7J22j19n5L2k5k1Q3k3j2M7Kp6N9j1n6k2J46J14j18j28J13K7j60j6J20
3175A47j01O5O6r4m6J18l1n5J9k8J8J50R6k36J47j87J04o0O9l7Kq0P6l5ko1J48p6PPJJ40j5
2865B36o6j2j01J9LK2j6J3rJ56N0j04p7L2R8p7r2K3Q0nNk7rm9r0J65N2j41k8J97L9k35L2L
2546H7P4K2K9o1r7J14n1R3j5j44N5r8J13K9K4o6J32J07j47r4K0K6o5p3J6R3n2JP8k5N7J49
2246C31j04j63J50O3k12Kj1N1M8q6J28p8k3n3j1J9k8R3j2m7Q8r5L1J2Q0l7J9N0j00m7J3K01
$$ plain form
4405 107 90 124 98 45 136 90 142 264 166 129 200 260 61 158 60 21 118 202 219 294 90 48 152 121 32 110 120 178 264 60 65 105 122
4096 122 134 68 79 54 72 95 95 122 111 84 141 44 53 127 104 125 65 145 120 189 65 106 95 78 57 123 136 95 101 15 170 152 115 66 241
3767 241 35 154 193 112 201 110 130 120 75 174 94 59 141 157 87 69 144 173 240 60 85 175 44 28 102 132 229 154 84 88 131 100 129
3457 129 234 126 42 97 124 246 127 72 104 79 58 141 118 106 153 155 79 138 127 71 49 195 309 191 63 176 203 43 27 147
3175 147 46 111 177 83 37 155 124 69 88 60 78 228 324 88 235 48 152 92 161 124 126 46 122 87 85 24 172 96 103 110 111 251 236
2865 236 170 158 57 76 79 101 85 98 89 245 295 191 114 146 244 167 75 98 178 173 178 151 142 93 3 168 220 79 51 248 287 52 84 87
2546 87 161 183 212 151 54 168 117 210 195 51 106 8 121 150 174 108 240 347 200 106 126 152 87 14 30 123 71 72 150 125 182 331
2246 331 227 64 214 277 65 67 56 107 155 69 197 119 96 43 32 51 23 116 104 57 145 50 81 93 173 136 155 205 105 58 71 272
1945B72m7q2q0M0l8qJ59J23k09o4n5Q5P8p8j9J09o7k0l5n4N8L3J75m4j41m5PN0PQ5J8m3K9
1635A99nj49J2J21k2O9j43O1j16P6J18Mr6N4R6j49o0N32L64o14j81j06K9p0J04L6J38j27K9
1363B04j57N9K1L2M0m9m0J57n2j09K0N0o3n4N7rL3Oj15N9j9PLL5Pm5K1Qn8K5J7K2nl4QnK5
1016A02j2lJ14q5J09n4j04J9O5qq4Q7o8J02o1k7p7J27m2Q2j0p6k8R7k1Mk7P3p7j6p5qJ53p0
696A01m6M0N8k5l3n0MK42r6j58NRqK2J6J31j59J8K3J25l7l5N2m5o4l9J8J00J25j20j66J57
396A65P7j38Lk0P9l1k1k7j8J07j34J40j32J26o1j0J8M8M3j53J36q3n1J28Lp4j2j3J01k6J4
105A84k3J2m7rp1P1n6J00o0P2q5j3K1N3Q9N8j08r9O9L5k8J00j94k1L0l8Q0N3J7P3j49J28k01
-205D3L9l7J46q1k4J02j81J27O7j18m3L9m4J04m1J56j45p5kj1
$$ plain form
1945 272 225 143 63 103 65 57 216 339 130 66 11 96 174 96 77 186 119 99 64 10 68 101 276 232 91 46 53 103 110 195 213 170 199
1635 199 194 45 57 178 156 225 82 143 27 103 221 225 129 183 279 130 70 602 966 352 171 65 94 24 128 164 302 175 204
1363 204 47 106 127 159 199 150 110 267 215 106 126 176 113 59 116 107 140 146 31 90 71 78 81 116 123 78 99 107 49 74 91 113 108 74 82 77 102
1016 102 90 87 201 116 225 171 67 86 151 143 59 146 78 180 119 92 15 142 100 182 172 96 68 165 144 148 121 194 117 101 26 18 171 101
696 101 55 95 153 128 95 45 49 291 195 37 42 51 43 65 81 212 53 71 94 219 182 147 199 154 90 51 69 169 294 174 8 165
396 165 242 104 107 87 166 135 114 87 69 176 42 182 50 176 115 105 123 171 214 61 197 114 63 191 194 120 108 95 196 170 184
105 184 161 173 126 117 46 117 61 161 101 173 88 75 96 149 238 296 188 89 158 193 165 265 71 50 80 42 122 175 192 265 116 244 43
-205 43 82 45 191 110 86 188 7 134 201 83 40 79 35 139 98 254 109 34 32 21
-393B1
##PAGE=	F1=-6375.22
##FIRST=	17614.246348710370512,	4405.4455391999963467,	0
##DATA TABLE=	(F2++(Y..Y)), PROFILE
4405A20MJ9n0m0M1m5P1J12k6j9m0Q5j05Kp2K6K9O7P0O3j54j24J39o1p1N5K8O6O4j52Mjk7M8
4086A26n8j1lj4K4J4L3JQL0p1l2K1m7J29j00O4k1R1j28M2N7l5j12J12ml9J0n6J35L3r0o0J69
3767B18j88J00K2l6Q8j17N5n3J4P3q1l6O9J2o9QRJ03R6k26M0O2j62L3M8K0R3n2o7L2M0q5M6
3457A09O9p1n4M2l7J73j36j5Kk4j1J14l4l2R7l8m6k5QN8m3R1J20j40j23J33L0j60n6J38q2
3166E7Q0K7r1k5J10op4M8j06O5J52O1j98J36j85J09o7O7o0k6l4R4k2J7r0J22o8J0l3K8J21
2875B19k5l6l7q8Q5J5m3k5O9m3J57k5j12N0J8N4q1n0J1M9l2LK2kq5l2Q9J22j52m7J83Pj85
2565E3j3P2J7M6J3k9o7N3o2J20pj51N9p7J43mL9j28J72Q9j57rJ4m5n2o9L1P5m5pN8n1J30O6
2246B77l7j93J39Q8k18j5k2Q1N7r7J32r7M7n1l4J5k9J15m1q9R6r3K3K9J29n8n6R1r9k6RJ58
$$ plain form
4405 120 124 143 93 53 94 49 120 232 206 187 147 232 127 129 57 83 112 179 249 312 158 34 173 112 41 96 124 190 254 102 106 105 78 126
4086 126 68 57 54 40 64 78 111 112 120 150 79 47 68 21 150 50 114 93 184 56 98 155 120 8 120 116 77 87 31 166 199 109 49 218
3767 218 30 130 152 116 204 87 142 89 103 176 95 59 128 140 71 79 88 191 287 61 101 163 1 34 82 102 195 143 76 108 148 63 109
3457 109 178 107 53 95 58 231 95 80 82 58 47 161 127 95 192 154 108 83 91 149 106 197 317 177 54 187 217 57 1 139 57
3166 57 137 164 73 48 158 152 78 126 20 85 237 298 100 236 51 160 93 160 100 74 40 134 112 129 39 161 93 103 70 98 219
2875 219 194 158 121 33 118 133 90 65 134 91 248 223 111 161 179 233 152 102 113 162 130 133 155 153 68 36 125 247 95 48 231 238 53
2565 53 40 112 129 175 188 159 92 145 83 203 196 45 104 27 170 166 205 77 249 338 181 172 186 141 89 20 51 126 81 74 132 81 211 277
2246 277 240 47 186 274 56 41 19 100 157 60 192 95 142 91 57 72 43 158 117 28 124 31 54 83 212 154 98 189 90 64 73 231
1945B31j7o6n9K8L2j32J18J52j69o5k1N5J19p9k4P9p3kpo7P3K0J35n0j94O1j4K4n0J70N7p7
1645A88m0P0q7o4O5k5M4l6N5j06N9J73j50M1M51om89J75K646K050l706r11j89j22k2J02L2
1391A98R3p5j6j66j1J14K8lj8o0J97m8j24J08k3p7n4J02Mo1N0n2L8o2JM6jn3L5RJo7L9k5K0
1063H7%l8K5j6P4k5%J01p0P4o6j39O2O5Mm5M4r0J21j08J0n4J39q7J54lj18o8J01kj4j6J29
753B31p4o8l9j9J52o8n0P2M0p6k4l1K5K38p7j91K4k9P2o5Q4J03j46n4Q6R5n2k6P7o2j09kO8
443A05j1J76o1j67J18R5j26n2k6J02l3Pom9J12q4J27j28J39j03k9P0M4j5j15J05j10j2J01
171A74m8J8j14LJ20L1Lq9Q0l2k3n2M7o5Q6l2N5q6LJ8Q5K7Q5q4j17P6N3J7N1k04m6O1k5M3M6
-158A65nQ0j36J31j94J6n4J42k5mN7j30N9N5q0RJ4o7J35l5J06j29q7L2k1
$$ plain form
1945 231 214 148 89 117 149 17 135 287 118 53 32 87 206 127 103 182 109 107 100 33 106 126 261 211 17 78 64 88 38 208 265 188
1645 188 148 218 131 67 132 107 151 115 170 64 123 296 146 187 638 632 143 318 2964 5014 1308 397 208 86 64 166 198
1391 198 291 216 200 34 23 137 165 162 144 84 281 233 109 217 194 117 63 165 169 108 158 106 144 82 83 129 128 75 110 119 120 53 92 67 87
1063 87 87 49 74 58 132 107 107 208 138 212 146 7 69 134 138 93 137 47 168 60 70 16 155 68 222 219 101 33 134 132 118 102 231
753 231 157 89 50 31 183 115 65 137 177 101 77 46 71 309 232 41 65 36 108 43 127 230 84 30 116 211 159 133 210 148 39 37 105
443 105 94 270 209 42 160 255 129 77 51 153 120 127 121 72 184 100 227 99 238 135 106 176 220 205 90 195 85 73 174
171 174 126 144 30 33 153 184 187 98 178 146 123 71 118 53 139 107 162 76 79 97 182 209 294 210 93 169 222 239 290 86 40 101 76 119 165
-158 165 160 240 104 235 41 57 3 145 120 116 173 43 102 157 77 86 100 33 168 133 239 110 23 55 34
-393C4
##PAGE=	F1=-6445.99
##FIRST=	17614.246348710370512,	4405.4455391999963467,	0
##DATA TABLE=	(F2++(Y..Y)), PROFILE
4405A28K1J2p5JM9r6N9P8M5Qj06M9J6j01NM5m3N4J20N8j06j99J38o7n0L6M8P1K3p3ko0m5Q8
4086A29m5l5Nl4MM6N3l0N6J2n9l0l0L3J07j35L7j5J17r9kJ11m3p4M5k5l1Jj9J22N8j34j8R0
3767A68j34N4%O3M8j39J00q2N4M0n4k6K5oo1P3p0J46J14k47M2L4q7mL9JQ4l6r2Q7K3j22N2
3457H7L7j8l0K6m8J50j20J9L6l2p1J24j8l9J02l9m5r8K5J53l9J6J24j31q4J01J6j37n8J27
3175A36q3R9kp9j5Q1K3n5M2p0Q6Q6j0j40J34j82J29j03P1n2p2J7R9j0M1j04P3l6K5r0M3R3
2875A75l9Rm8j9P7J3j07NP5n6J41r7p6J43oRn8j7KJ0l0k5P9Nj20L5J2J34j14j4J13j4r9r0
2556HJ10l7Q3j5K4k9j9m8Q8K5j49Q0o7J59m4L6j06J52N8j69P8J7j21k6l1K6M1n9oP5j3R2J9
2246B32K3k19J04J07j99j7mM6P7r6J33r4J05Pn3n5l7J40o0j20R9j9o2L2J55o1o0O6r4pRQ3
$$ plain form
4405 128 149 161 86 87 136 40 99 177 222 230 124 173 189 88 93 138 95 149 269 327 221 22 160 93 43 79 127 198 221 148 146 86 41 129
4086 129 84 49 54 20 24 70 123 93 149 161 102 72 42 75 182 47 84 69 186 87 85 196 153 79 124 99 68 69 50 172 230 96 78 168
3767 168 34 88 88 151 199 60 160 78 132 172 118 92 117 111 50 123 53 199 313 66 108 142 55 51 90 91 175 139 47 134 157 35 87
3457 87 124 106 76 102 54 204 84 103 139 107 36 160 142 103 205 166 121 23 48 201 162 178 302 171 87 188 204 67 9 136
3175 136 53 152 150 71 56 137 160 105 147 77 163 249 239 99 233 51 180 77 148 96 24 41 140 130 171 67 140 104 129 39 82 175
2875 175 136 145 97 78 155 168 61 66 141 85 226 129 53 196 190 199 141 124 126 136 106 81 160 165 45 80 92 226 112 98 211 197 98 8
2556 8 118 81 164 149 173 144 125 77 165 190 41 121 54 213 169 205 99 251 309 140 218 235 114 88 57 83 124 65 59 134 121 213 232
2246 232 255 36 140 247 48 31 27 73 150 54 187 93 198 205 152 97 60 200 140 20 119 100 38 70 225 164 104 170 76 69 78 161
1945A61J6k3n1M6Q8j66J1J31j16m9RK3J47p9k8M9o8J4Nn2J17K2Nj7j11L8m3j4l3J92N4q3j06
1635H9J43l6p4j8j2j0O9L5n9OK61k99K24Q88j48q59N48N711M195q016j840l66j48j46P6NK8
1382B47Qn3j96N6R1K2o0L2o9K03n1j24K13j06o7p3J63J0j45P3JJ2j08J5P8l4j14J37ml2j6
1091A09K5q2JJ0j1N1m4R3m0%O9m3M3m5p4j4R2j5oLr3J41p2j9o1J43j28K12nj46q7R1L9l9j2
762H6J73o5p7m4m7J45n4m4Q8K6j25rj2N0J97m4j45Po3J19j46J53M7j14n6P6O5o6kJ01p4r2
462E4m1J32j32K19j3j43Q0J13j08j28M7O1k7K2J5q5R4JR4j05J15j22j6J04L4o9r1P8j15L2
180A00L9p1J01j24k1P5R5pj46J22j6m4j8L5r4P6J1J2p4M5KJ35n3Q6o1j06O6R1M7nk04m0P3
-130A27jk7O1m9Q5j06J06j64J4jM3K9L0no5K0Ql9P0Qp9J30n1O7j04p6N5l1
$$ plain form
1945 161 177 154 103 149 237 71 82 213 97 48 57 80 227 148 120 169 101 115 120 68 185 207 212 195 84 122 79 65 32 224 278 195 89
1635 89 232 196 122 104 92 82 151 186 127 133 394 95 319 1207 1059 200 748 6459 10654 2638 798 432 284 138 214 219 247
1382 247 255 202 6 62 153 175 115 147 78 281 230 106 319 213 146 73 236 246 101 174 175 187 79 94 172 138 24 161 157 125 109
1091 109 134 52 53 63 52 103 59 152 112 112 181 138 181 136 62 48 140 125 119 122 29 170 98 79 18 161 33 245 240 94 7 98 137 98 86
762 86 259 194 117 73 26 171 117 73 161 187 62 53 41 91 288 244 99 106 43 162 16 169 216 102 46 122 187 121 119 220 146 54
462 54 13 145 13 232 219 76 156 269 161 33 80 141 114 136 151 66 160 161 255 150 265 143 127 231 265 196 105 183 68 100
180 100 139 68 169 45 24 99 194 187 41 163 147 103 85 120 26 102 113 125 51 96 98 233 180 266 205 99 165 256 303 298 94 54 127
-130 127 126 99 160 111 196 90 196 32 46 45 88 117 147 142 77 97 105 66 136 144 65 195 144 211 107 31 86 55
-393E5
##PAGE=	F1=-6516.75
##FIRST=	17614.246348710370512,	4405.4455391999963467,	0
##DATA TABLE=	(F2++(Y..Y)), PROFILE
4405A30L0J5q6L6J03j85M5K9J01L5q5o9J35j57Q0K4r2K2J60O3o9k15O5m8l8K8O9P7l2J5rj25
4105E2k3J12l1n5Rj6k4M4Q3r0J06On8pm5Q0O2j53K1k3J47n4p6J45m1k2k1n1jj3JJ26M2j33
3786I9L1k6n3J0n0J83j2j21J21n6L0J5j8k2k5k3n1J45q6J03J25k45L1Qjk7L3j6Q1l9j15J26
3485A55nj33M9J8M1k4Mj2Q0p1J3J04l6j30Q5K6m9P6oo1q6K7J54j6n9J22q1o1N8rr4p3J21o0
3166F7J05k9p0oK4N4j7K1l0J06L9j07p5J42j83J71j67Q8l9o4J2J00nO1j00K2J9M6j42N4L0
2875A27n3N7l9J5P3kj52L8M7n3J27j53R3Q4l9j9rojj6J7o5R5J1j29Q7l4O9j3jL2j0l6q8N0
2546A04p3J08l7Q8Oq3j4J1O8j49J15o0J58p1J5m8J06K3j64J30K6j80kRL6Kr7JJ10L8J5K2M8
2236B61k27N7J26j64oK2j9Q2q5J28o3J41O6p5j24n3J61p4j20J27K6j46J8J53m7Ok1q4J3Nj2
$$ plain form
4405 130 160 175 89 125 228 43 88 117 218 253 168 99 234 77 157 181 89 111 271 334 265 50 115 67 29 57 126 203 171 186 177 52
4105 52 29 141 110 55 64 48 24 68 151 61 167 173 115 108 63 143 205 52 73 50 197 143 67 212 171 149 128 77 76 63 64 190 232 99
3786 99 130 104 51 61 11 194 182 61 182 126 156 171 153 131 106 83 32 177 91 194 319 74 105 113 112 85 118 102 183 144 29 155
3485 155 150 17 66 84 125 101 105 93 173 102 115 219 183 53 138 164 115 191 185 124 38 65 219 203 144 266 185 124 182 173 79 6 127 67
3166 67 172 143 73 67 91 145 128 149 119 225 264 157 82 224 41 212 45 133 94 30 42 142 137 198 98 120 139 185 43 97 127
2875 127 74 131 92 107 180 178 26 64 111 58 185 32 125 209 170 151 142 136 135 119 136 71 166 177 48 135 101 170 157 156 188 178 142 54 104
2546 104 31 139 102 190 196 113 99 110 178 29 144 84 242 171 186 138 244 267 103 233 259 79 77 86 122 124 27 28 138 176 191 213 261
2236 261 34 91 217 53 47 69 50 132 47 175 112 253 319 244 120 67 228 154 34 161 187 41 59 212 165 171 150 66 79 84 72
1945G2M8L8l9O4J15j73k9L6n6l4M2OJ44q2k3J0m4K0Pk4J53L0j46N3j5kp8n3M6J49J7q1j32
1635C9J87Qn6p5J6q9J45Rmm8L60k87K64J310l01j209R80R066O558j2775k833n69j99k74L7
1401B60l6l9R5o9j69R2L4K4q4O1o6J70o9j12L14j75m8r6K11lj88Q2L7k3j41M1J00n7j26J86
1119B06lq0M7Qj25pJ7PO9o4Q3o2PK6j4K3Ok9q5J41o3K4l0p4J56J8r1q4J29j22K19k1j62m4
800B6P8N2n8j3J87n3o7q7l6J12l8k7Q9J7j63J6kP2J30nq8jq3J32j61J67k1p0j5J4M7p1K3J27
480B30q7o2o3J58r7J15J0j09O2J19q2j67Q9NqJ8L1r3N1Q4M9n9O3j02OJ15J6r9r0N3j00P3l2
171I7J6Q1q7l7k8J56j5j51R9ro9L8L3j01N9M2m5n6R6k2J87j22N2m2p3N0J31O5n9j84k1P3K4
-139A78j07Q4r8Q2o3O3j16L3L2k3N5N7q3OL3p5mJ23Rp2R6q9M8o8n3P2m3
$$ plain form
1945 72 120 158 119 183 298 125 96 132 76 42 84 90 234 152 129 139 95 115 122 98 251 281 135 188 173 171 93 40 86 235 252 171 39
1635 39 226 234 178 103 119 30 175 184 180 132 492 205 469 1779 1478 269 1249 10315 16873 4098 1265 696 497 223 260
1401 260 224 185 280 211 42 134 168 192 108 169 103 273 204 92 406 231 183 87 298 295 107 189 226 203 62 103 203 146 20 206
1119 206 203 123 170 178 53 46 63 70 139 75 158 96 103 129 115 138 144 115 30 171 108 132 102 28 184 202 111 27 156 34 253 232 70 26
800 26 104 156 98 85 272 219 152 65 29 141 103 76 165 182 19 35 33 105 235 230 142 141 58 190 29 196 175 105 90 104 151 80 103 230
480 230 143 81 18 176 79 194 204 95 157 276 194 27 116 121 113 131 162 69 120 204 253 194 257 155 161 276 292 193 103 156 56 129 97
171 97 113 194 107 70 42 198 183 32 131 122 53 91 124 23 82 124 79 23 119 97 284 162 214 172 99 149 280 345 286 102 81 154 178
-139 178 71 155 57 139 76 139 23 56 88 65 120 177 94 100 133 58 54 177 186 114 210 121 169 101 48 120 77
-393G7
##PAGE=	F1=-6587.52
##FIRST=	17614.246348710370512,	4405.4455391999963467,	0
##DATA TABLE=	(F2++(Y..Y)), PROFILE
4405A24L2K8p4M7J68k84L9%J22N2k9j99K35j37R9j9j04l0J78P9m5j85n2ok0K6P4Q2q3Q8j3
4114A93j64L6Q6k2o0J1Jk6J2J15j55J44On3K8q0J10K6j50J6l6J75j3j56J66l4K8p9q3M6k0
3823F8PJ39j0p0M3j13J6J6l0J56p4m3R7j5j5LJ3l2n7l2l0J84q3L7J35k20JrQ1l3J6l2R3m8
3504A59r6R9m2j14N6QQ3l0k4J9J8qk2J76l2j67J3R3p0L5M8o1p0M2R2J8j19J13j0n4J9l3n3
3194H6n7P6RR1n9p1Qn5R1K2pNJ19J1k00k0J63j88K20k35J14m0k3j6R6rP0p8oO6O4j67O9o7
2875H2m5P5j5J2P9k5j31RLk3J13q7J59jp4l0N6j0rk6O8o5O0J2j21J33p3l0J18j2l2J2j1p5
2556I6j9l7N6m0J52K6j27K1m8Q7j60J48m4J37o9j1pN9Oj21J10M3j87rM3N6l7j02kJ09P7m6
2255A60O1K9k01K2J35j33kL7k6K8p0J15j5J56J14r6j75p6J74q7j03J84M6j99k8J29j7Q1j13
$$ plain form
4405 124 156 184 110 157 325 41 80 80 202 254 225 26 261 124 223 204 100 70 248 327 282 97 45 39 19 45 119 201 118 206 193
4114 193 29 65 151 129 69 80 81 55 67 182 27 171 177 124 152 72 182 208 58 74 38 213 200 44 210 176 204 125 42 88 68
3823 68 75 214 204 134 177 64 80 96 66 222 148 105 202 187 172 175 188 156 99 67 37 221 138 175 310 90 91 82 163 130 146 114 207 159
3504 159 63 162 120 6 62 70 153 123 99 118 136 128 106 282 250 83 96 189 119 154 202 141 71 113 205 223 104 217 207 153 172 139 86
3194 86 29 105 114 205 146 75 83 28 119 141 134 139 258 269 69 49 212 24 244 9 123 83 60 44 140 131 201 123 117 183 247 80 149 82
2875 82 37 112 97 109 188 163 32 41 44 21 134 47 206 205 131 101 157 147 138 112 180 115 175 187 66 199 126 96 214 202 170 182 171 96
2556 96 77 40 96 56 208 234 107 128 80 167 7 155 111 248 179 168 161 220 226 105 215 258 71 62 105 161 124 22 20 129 206 160
2255 160 221 250 49 71 206 73 71 108 82 110 40 155 140 296 410 314 139 63 237 150 47 231 277 78 50 179 162 243 130
1983A30o4L2j2m4J7R8j3O5J12j63m3m4J0m8P7MJ08q1ml5j1J0OJ1J65M3k72J33M6k2j12p1Q7
1673A15J20m0p1p4J48N4m1q1K4j26J51qN0q7M35k16K36J636m31j475J395J1986Q646j6977
1448E369l669p58k67l74j0p1r7J64o2j25Q4qL7n5L7n2J19j00q5L77k11l9j03K36l8j90R0N4
1185B53n7j57O7J08o7r8J79J4j32J02Mj57J8PqQ6p3O0q7K8j6lK2O3oj14J69j12L3n1l9J65
884B01Q4j55q2R4r3J96m8j50JJ08J7o2j3J67m0n5j42M4L9l7%Q0J5j42J9j6Q3M7L5l2nr5J23
574A86j43J55q0k0L3o8M7o7M7J45r9m8l4J38l2J7jp5O3J06n4j36M8l9J8MM1m8J6R9KMlm4J1
246A89J10pr1j15L1p1J12r5J36J7o2n9p3J79j8j24M1l0m5P8M3n1QL1r0j4J06m4K21j58j1l0
-55A14l4N9J47P1r7j45oO6M3j63R1j10M7j9J7l7K6N2k3L7O4j62P1O8j52K3J53Qm7M5j31M2
$$ plain form
1983 130 66 98 86 42 59 157 144 209 321 158 115 71 81 33 110 114 222 141 137 102 91 101 107 118 283 326 54 187 233 211 99 28 115
1673 115 235 195 124 50 198 252 211 130 154 28 179 171 221 134 569 353 589 2225 1794 319 1714 13700 22346 5369
1448 5369 1700 942 675 301 291 220 123 287 225 100 184 176 213 158 195 143 262 162 77 454 243 204 101 337 299 109 199 253
1185 253 196 39 106 214 147 49 228 242 110 212 216 59 77 84 76 162 89 149 62 90 74 71 93 156 150 36 205 93 126 75 36 201
884 201 285 130 48 142 49 245 197 47 48 156 173 111 98 265 225 170 28 72 111 74 74 154 169 27 46 30 113 160 195 163 158 63 186
574 186 43 198 118 98 131 63 110 43 90 235 136 88 54 192 160 177 176 101 164 270 216 80 128 89 107 111 152 104 120 219 221 225 222 178 189
246 189 299 292 201 86 117 46 158 63 199 216 154 95 22 201 183 59 100 70 25 103 146 95 103 134 44 30 136 92 313 155 144 114
-55 114 80 139 286 357 260 115 109 175 218 55 146 36 83 64 81 44 70 122 99 136 200 38 109 177 25 48 201 209 162 207 76 118
-355A18j6l2Q4o1
$$ plain form
-355 118 102 70 154 93
-393I3
##PAGE=	F1=-6658.29
##FIRST=	17614.246348710370512,	4405.4455391999963467,	0
##DATA TABLE=	(F2++(Y..Y)), PROFILE
4405A08L1M4l9L3K27l64K7J1J02N7K4k23K36r5R4p0r2n4J40J02k9j30j08k1M5J9L6P9r3J07
4124B04j3j37N9L6j8m4QJ5l5j0J38j86J41Pl6O9j40J33nj25Rk1J73J6k16J78k6O1j21o8N9
3833A05l3J4J52q7L6K1r9NL2j4Q9j24O2N3J6n0LL6n8o3k4j1J84q2k2J50j74m7nJ36k9rm7J12
3513B28m4r1N1p7m9N8JJ01l7n6L6l3N7p0K35j8j81o8J63r2rJ04k5j10P0K0N9j57J01N2m6j0
3213A63m7l2j7%J03P1q2q1K5n7O2L3k1J8J30j4k24j7J86j70K39k24Q2l0rk8O9j7O5l6rQ7P5
2903B93j63Q0j61QK7J6j1R1n2o8n2M2L9J0jJ56n9q7n0J23j1l8k2R4m7K7Pj10J85j27j03K23
2603B59l1o0K8j4n4q3L3j9m2K01L0j43N0l6M3j21J03j4R8m1k5kJ7J6n9M2O1j30m5M9P8p6m2
2293G1rM4R2m9Q8j5j45L2J12j21lM4ll7n6Q5L6J55J42j19j91r9J72r4p8K45O0k25r4R8K2J37
$$ plain form
4405 108 139 183 144 177 404 40 67 78 180 237 261 38 274 179 273 203 111 57 197 299 270 140 32 11 56 75 111 190 97 204
4124 204 191 54 113 149 131 87 95 110 75 65 203 17 158 165 129 198 58 191 186 61 70 49 222 238 22 200 174 235 114 46 105
3833 105 72 86 238 151 187 208 109 114 146 132 221 97 159 212 228 178 181 217 159 96 72 61 245 163 141 291 117 70 65 201 172 163 116 228
3513 228 184 93 144 67 18 76 77 178 141 85 121 88 145 75 310 292 111 43 206 114 105 209 184 74 144 164 223 66 167 219 173 163
3213 163 116 84 67 67 170 241 159 78 103 46 108 141 120 138 268 254 30 13 199 29 268 44 126 96 87 59 128 111 176 140 131 218 293
2903 293 130 210 49 57 84 100 89 180 128 60 8 50 89 99 98 254 195 108 58 181 170 132 110 204 157 184 191 81 266 139 36 259
2603 259 228 168 196 182 128 45 78 59 17 218 248 105 155 119 162 41 144 130 228 187 162 160 177 193 134 176 237 107 62 111 189 113 71
2293 71 62 106 198 149 237 222 77 109 221 100 97 141 138 101 45 130 166 321 463 344 153 54 226 132 54 299 359 134 40 138 160 297
1992B97j81m4M6l5M2o7R4J8N2Q6j47o0l0M3p4R4NN2p3L4m6k0j2PM2J52N9k67J16O3j6j36o3
1682C1Q7J01r4m0LO4J05m5m0Mj08R4oR0j03M60j33J73J796n10j603J712J3781R969j9646m138
1438B004q93l31m25n9q1j29J89m1p6M7l2N6j5qk9O8j30k5L64k06n1q4K31r3j41Q9N3p9j51
1166B2P8J04o9p4J58M0j76J38K1j79N1j7l2J00p1L3r0M7l7l1L6J11Jj09J67j33Lm8OJ61J08
875C19j88m5M1q1J81q2o8j3J42k1n8j2J23l0m5j21R0k3o1J6P1K0j01J0k2P1l2O7J6pj07J09
574A59j25J38j15L4P3j44M9n1Q2J38j07n1PJ02L9l3m0n1P4P1l1q7j7p2M5mM4K6K7K7l9P1o5
264A74K5JR7l1m9j51Rl3J44j37K19l6m6q9k4J29rj16L0p4O7K3O4qm0nr6J7Q9n6K22j57q6j0
-55E7j5J16J11O7j09j02RM7N3j78P8o8rK%K0%O6j6K0N9j58N2J02j95M2J53Kj1j2r9LL4k7R3
$$ plain form
1992 297 116 72 118 83 125 58 152 170 222 308 161 101 71 114 40 134 139 191 118 152 106 86 74 81 123 275 334 67 183 246 230 94 31
1682 31 118 219 125 85 88 152 257 212 172 176 68 162 156 246 143 603 470 643 2439 1929 326 2038 15819 25788 6142 2004
1438 2004 1111 780 355 296 215 86 275 234 158 205 173 229 214 206 177 245 115 90 454 248 197 113 344 251 110 199 252 173 22
1166 22 100 204 135 61 219 259 83 221 242 63 114 97 65 165 94 127 37 84 47 16 52 163 164 55 222 89 92 44 50 211 319
875 319 131 86 127 46 227 145 77 64 206 185 127 115 238 208 163 42 132 109 48 64 135 155 54 64 42 113 81 148 164 157 50 159
574 159 34 172 57 91 164 20 69 18 100 238 131 80 87 189 228 195 155 104 178 249 218 131 114 42 87 83 127 153 180 207 168 239 174
264 174 199 200 297 266 217 66 75 42 186 49 268 232 186 97 73 202 193 77 107 33 100 123 187 179 139 134 38 55 144 88 310 153 67 57
-55 57 42 158 269 336 227 125 134 181 234 56 134 66 57 59 59 79 79 145 129 149 208 50 102 204 9 51 204 206 195 183 84 87 121 94 187
-383A87r0
$$ plain form
-383 187 97
-393I7
##PAGE=	F1=-6729.05
##FIRST=	17614.246348710370512,	4405.4455391999963467,	0
##DATA TABLE=	(F2++(Y..Y)), PROFILE
4405H5K7N8NKK73l95rL5P8N0O0j92J99n9P8j19p2JJ5J29j4o8o7q1Q3K4j8O3m5N6qr2Q0l1q
4077A23j7JK8m8k7J48j71R2JoJ09j96J37l1q0OK7J13L4k30J79k8P3j39J9K3o4K7J47j62J50
3786B38j9l9l0K9%Pj55J76jK9o0J0N2r5m7lnJ58q3o9J71j16r3K1J44k0l6n9J31j9j13jq7K9
3466D5M8lJ07l8r1L8p5J14j17K73jj65j10J76j03m2J50K8j91J07m4J05j73J04P1k7l0n6l1
3194F9L8q0J89M1q7q2L2j0K2mLpJ44n5j39l6J48j32K24j92N4J4l3l8K0j7L8K2oR5P8j31Q0
2884B62k34N2l0M7k7Q6p3pk0R9L1p2OJ40o5o1j02J73jr1qR2j9J1lr6K34j79r3K20m4m6K9l7
2565A74l0j24Q4j2p9J99K6j32P4oqp1J1L2M6jk3k3k0N5j9j8O8o3n9K7R1j12J9opO1J5P6o0
2236A85p6N4Q5j21qM8J9p4m0M0O8J44J46j41j67j04J40r4m9K87P7k24j70P6N8J67k15l9N6
$$ plain form
4405 85 112 170 175 177 450 55 46 81 159 209 269 77 276 217 295 176 104 105 120 249 235 167 100 19 102 126 108 171 126 182 174 82 162 131 123
4077 123 106 107 135 87 60 208 37 129 130 124 233 37 174 143 63 69 96 209 243 13 192 164 237 98 117 140 76 103 250 88 238
3786 238 219 180 150 179 179 186 31 207 206 235 175 185 237 142 95 92 87 245 162 93 264 148 55 76 220 200 164 105 236 217 104 103 16 45
3466 45 93 90 197 159 68 106 31 145 28 301 300 135 25 201 98 56 206 234 43 150 106 211 38 142 213 186 156 100 69
3194 69 107 27 216 257 170 88 120 110 132 128 131 124 268 213 74 38 186 54 278 86 140 154 121 83 103 86 124 146 140 235 313 182 262
2884 262 28 80 50 97 70 156 83 76 56 155 186 114 120 260 195 134 32 205 204 113 105 197 178 189 186 90 324 145 52 272 228 182 211 174
2565 174 144 20 104 92 13 212 238 106 180 174 166 95 106 138 184 183 160 137 117 172 153 135 203 140 81 108 199 87 106 100 93 154 169 245 185
2236 185 109 163 248 127 119 167 186 112 72 112 180 324 470 329 162 58 198 104 55 342 419 195 25 101 159 326 111 72 128
1964A28n5J18q7L2M7L6M8j36p8M5O2q2P7mnn7Q5j1q8k7MO2J19P6j79L9M1J5j45l9N8Q7j21
1654F5K6K5k0J62p6K3k6n9J4NJ16j09M41o1Q8J753n22j562J860J4008J0200k0131m114r49
1429A157l64m18j06n8j21J59k0k9ml9P6J5n4LJ8j29M7K72j59q5m1J99j59l8O7L5q3j10O0Q4
1147A75o6n2J26O4j93J40N5j79Q2n9n2J12o4Nj8Ql2Kj8J30pq8J42j08p5j5N6J38Q4j62Rj7
847A23r6J77j07L5o0J57l7n4j2O7k2l6k4Q3n4p9j2P0K1q1OmM9o2N0N6pj24J16j21J06j03O7
537H8R9j36j5lJ09R6j01o7L7O7J03m8p1m7Q0K2j7k1r2m3QJ2L5R3N9p0n8J15r6O2j4Q5n0J0
217B31j66j6JJ63j72K61o5l3j26L7Q4J2j27O7m9O5l0R4L1r1m9q4L1P3n1J85j29j24O5k2J40
-74B06K6N3r1p5L8QN7j67O9l7j7qL1J8k8P3k5J7M6r2k2J27j98N7J20qK7o2J5n3N1m0R7j25
$$ plain form
1964 128 73 191 104 136 183 219 267 131 53 98 160 78 155 151 146 89 174 163 75 48 52 114 233 309 130 169 210 225 80 41 99 186 65
1654 65 91 116 96 258 182 205 179 120 134 139 255 146 587 526 614 2367 1845 283 2143 16151 26351 6220 2106 1157
1429 1157 793 375 269 211 90 249 229 200 196 157 233 248 194 197 215 86 133 405 246 161 120 319 160 122 189 224 141 31 91 175
1147 175 109 57 183 247 54 194 249 70 152 93 41 153 89 94 76 84 52 54 36 166 159 71 213 105 30 15 71 209 293 131 140 123
847 123 27 204 97 132 72 229 192 138 126 193 171 135 111 194 140 61 49 119 140 59 65 61 110 48 98 154 147 23 139 18 124 21 88
537 88 187 51 36 33 142 238 137 70 107 174 277 229 158 111 191 213 196 175 83 40 48 60 95 188 247 177 119 234 138 200 186 271 221 231
217 231 65 49 50 213 41 302 237 204 78 115 199 211 84 151 102 167 137 231 262 171 122 38 69 142 91 276 147 23 88 66 206
-74 206 232 285 194 119 157 165 222 55 124 87 70 62 93 111 83 156 131 148 194 102 80 207 9 66 186 178 205 143 158 105 156 116 213 88
-393H8
##PAGE=	F1=-6799.82
##FIRST=	17614.246348710370512,	4405.4455391999963467,	0
##DATA TABLE=	(F2++(Y..Y)), PROFILE
4405F1K4N9M5l4K96l64n1L2P2L6P9j60J70l5N3j54n1Q9j37J55jj5k5r9R9L0o0L6J9j7ln1J07
4096B05j07K8l%L7o6m2J44j43L7j3K7J42j94R0n4k0K8P0ML7j83J65m7P2j31J06pr7M2J15k05
3795C7K37n9K6n9JJ9p4q6J98n6K1m0K5N4j30j9K4j4J18q5r9J90n6j11L4J21j3n8o0J43K1j51
3495I9m2L5j3J9OJ14l6j30L0m0Q7r6K29J3j19p8R4r6l8J55P5k50J21r1J46j63J29K8Kl6p8
3204G6l2R3q5J93po7o2K1K6J9o7N8o2J64j13o2k2J05j03J99j57M1O9o4n5m2J4k6R2j6J06P1
2903C05q0O7k78P5o2O7jK6p7L0L5J43L2j23l7R9j6l0j46J89K1j50RO5J5Npp9K63k04p4J71
2603B53m6qK5p1j2j22J05L4j22J50K2r3R2Nl7k0j07Q7qL8k1m3n1J03ok8L9j5m1kQ8j38O8J4
2283A32j3l9J17M3q5k0P6O0j23j8N5L2r1j8J5N6J31J22j58j08q7Q1q7j8K93R5j99k36O8P5
$$ plain form
4405 61 85 144 189 155 451 87 36 68 140 176 255 95 265 230 283 129 78 167 30 185 184 169 144 45 144 174 114 150 169 152 149 98 205
4096 205 98 126 123 123 160 94 52 196 53 90 77 104 246 52 142 88 68 96 166 170 207 24 189 142 214 83 189 182 85 127 242 37
3795 37 274 215 241 182 183 202 128 42 240 184 205 165 190 244 114 95 119 105 223 138 39 229 173 62 96 217 204 146 86 229 250 99
3495 99 57 92 79 98 104 218 182 52 82 42 129 33 262 275 156 78 172 76 38 193 268 18 139 48 194 31 160 188 190 154 76
3204 76 44 137 52 245 238 171 109 130 156 175 108 166 104 268 155 93 71 176 73 272 115 156 225 161 106 64 78 52 144 128 234 305
2903 305 225 292 14 89 27 94 93 119 42 72 107 250 282 159 122 221 205 175 29 218 239 89 98 163 178 183 176 97 360 156 82 253
2603 253 207 199 224 153 141 19 124 158 36 186 208 115 207 212 175 155 48 135 127 165 144 101 50 153 147 119 158 143 102 100 188 50 118 132
2283 132 119 80 197 240 155 135 211 271 148 130 185 217 126 108 123 179 310 432 274 166 79 160 73 55 348 443 244 8 76 151
2002A51J77k06o8O4n9J66r0l1P2K2J3j40l3Q0R6q6M4l2m3l5J33L2j74jk2O5P5R1r2k1rO1j40
1692F0KJ3O4j08Q0J7q5K13j17O8k6Jp2kJ42j23L97j8LJ522m75j366J818J2607R281j8320l593
1438A983r16l49l62j43rr7J01lJ0n4l4R4L2r1L9k3q4Q8J40q1j33RJ55k25R8K3Qp0n0L4M2n8
1138G4k9Q8P3j41P2R7j50J05j17m9J09m9k1O2m9l1P5o7J19k7o7J01l9q5m8Q6J06J9n3M2p6
847A30r1J42j07J02j03J42j4o3j7J7j7k8Q2O8o3q4o4Q5Lq2ML4L4nn2R2kj21J36j05K5k0L2
537I0J06j13n6L9J31L7q2q4M5M8J42m8p8n6P3k5rN3j54N8p5J0RJ31R5j46l2J03p7L6k1Q0o4
227A66O8j44k3oJ81k22K74o7j9j63R8M4M0j43J16k2L2p5J23O7j30r1p9M3O1l1J24q6n7Q4q
-64A55J01p4K8n0p1Q5n0O5j46P6l2kj6O5km7P0n0L3K2k4q5J33j66P5O0j4N3r4J28q7N6o1R1
$$ plain form
2002 151 328 122 54 118 59 225 135 104 176 198 211 71 38 118 214 128 172 140 97 62 195 227 53 52 30 95 170 261 169 148 139 200 60
1692 60 62 75 139 31 111 128 43 256 139 207 181 182 110 108 250 127 524 506 509 2031 1556 190 2008 14615 23896 5576 1983
1438 1983 1067 718 356 213 204 107 208 205 215 161 127 221 253 162 201 178 94 182 322 241 108 117 272 47 145 168 176 106 56 90 132 74
1138 74 45 133 206 65 137 234 84 189 72 23 132 83 62 124 75 44 119 52 171 144 77 178 139 54 6 92 198 217 164 206 130
847 130 39 181 74 176 73 215 201 138 121 138 121 93 175 243 180 96 32 117 120 38 42 76 110 105 53 145 143 22 158 53 78 58 90
537 90 196 83 27 66 197 234 152 68 113 161 303 255 177 121 194 169 160 213 59 117 42 52 61 192 287 141 109 212 135 171 150 230 166
227 166 234 90 67 61 242 20 294 227 208 45 143 187 227 84 200 178 210 135 258 325 195 104 25 68 129 98 222 136 79 163 155
-64 155 256 182 210 160 89 174 124 189 43 119 87 85 69 134 132 85 155 105 138 160 136 51 184 18 93 153 139 192 98 226 139 195 134 225
-383B25j51
$$ plain form
-383 225 74
-393G4
##PAGE=	F1=-6870.58
##FIRST=	17614.246348710370512,	4405.4455391999963467,	0
##DATA TABLE=	(F2++(Y..Y)), PROFILE
4405E6J5M1O7o7K94k85p0qP9K1Q4j29J42k1K1j69k9J75j45M6J1J8Nq8J08L6q3PO6o7Kl2J39
4096B40j84R6j3MM0q5n4J24j01pk1K9J63j45K0m8K0O3J04j21J6r6J38p3O5j03J66k7j13N2
3814A49O1j72K49q5P7p6m6M3j27L5J47r9nJM5L9j48QN1l4P6q8q6J72nj00K9Q0pp4m3J45O0
3504B72j86mR2o2k6L3J29m1j64K0K8Rk4J30J8m7n2jo4J1J05R7j79L8r5J45j39J59n3L0k3j14
3204D2k5J36n5J58p3k6k1rM9M1j34J19j14J80j72j7J4P6r2J73j22L4J17p9q0j03Q6o8J08n3
2922I0J33N4k8M5k77O8l7N1M4o9m9K5R5J74L8j57q7L4O8k1j54J71N3j78QK1N0kLn9K60j91
2621A76q4J19l5K5L0j05j1q2J14O9j60Q8K3l6J08j0m2K9j87R7l5M7l3m2k9R2rJ1k6Pjj5O4
2311A57j10N8N7Qj57J94J5p7KR4M1j22l2O9K9r6J0K3%J21P5j63l1o1J9q3K5K48J09j53k46
$$ plain form
4405 56 71 112 179 112 406 121 51 43 122 143 227 98 240 219 240 71 42 217 72 118 129 147 152 64 172 208 125 132 198 131 133 101 240
4096 240 56 152 139 143 183 98 44 168 67 60 39 68 231 86 106 58 78 141 245 124 140 44 182 109 174 71 237 210 97 149
3814 149 210 38 287 202 279 203 157 200 73 108 255 156 151 152 197 236 88 96 147 113 189 101 15 187 182 82 111 191 184 110 67 212 272
3504 272 86 82 174 112 86 119 248 207 43 63 91 100 76 206 224 177 125 124 60 71 176 273 94 132 37 182 43 202 149 179 156 42
3204 42 17 153 98 256 183 157 136 127 176 217 83 202 88 268 96 79 93 169 77 250 128 162 279 200 120 17 103 35 143 90
2922 90 223 277 249 294 17 85 48 99 143 74 25 50 145 319 357 200 113 147 215 194 40 211 264 86 94 115 165 163 166 107 367 176
2621 176 92 211 176 201 231 126 115 33 147 216 56 144 167 131 239 229 187 216 29 126 91 138 105 63 34 126 117 128 102 109 108 93 157
2311 157 47 105 162 170 13 207 222 145 147 241 282 160 128 197 226 130 140 163 163 284 359 196 165 104 123 40 65 313 422 269 23
2020B3M7O7J71j61j29P0m2J78q6p9Q5J4j3j27J00J3J36r4J2p5l6k1J50P0k57N8m6M2L3J05
1739B08l1n1n7R6j25M9j0Oo3Q8J1q1K11j38N5M2L7j38n6J81j48L45j6n9J157l84j064J609
1476A674R920P439j4666k700q04k78k79j67M7p4M0J4K9q6k4J10L8j12P5l4m5J02QJ2j60K1
1232A00J19j42Q9k8k3m2PJ7j2m4qO0N1k7n3J32r6J19j74j8Q8k3k0Q3j13k5J61j07J08m8n9
941G2N5M5l4j25R3Q2p0J11M3j28o2Q4q9J14j20R6M2q6l0j1j0j9J67N0n7r0q9R4m0q2J3O8L2
631A19M7j37J14J0r7J40r9j1PkR6r9n1O1J50k4n9r7L8N6J43m7o7o1N4o2NJ13j71J32q0n3l6
321C2J28J30j76K4L6j1m8j9R1p4J09j04j6l6K03k38K12m1pj77J34RP0j51J55lj1j05J42R6
39C54j44j20p7M1N1oO6m7NJ05J8M3j61kNr7J50j14Q7j23Q4m8J8j1Q9l3m2N8q2P9l0K5j20J20
$$ plain form
2020 23 70 137 308 147 18 88 46 224 138 59 144 158 145 18 118 131 267 173 185 110 74 53 203 273 16 74 28 70 103 208
1739 208 177 126 69 165 40 89 79 85 22 110 121 40 251 113 168 210 247 109 53 234 86 431 415 356 1513 1129 65 1674
1476 1674 11594 19033 4367 1667 863 585 306 139 186 112 152 166 195 109 85 195 233 121 196 162 117 219 227 239 79 100
1232 100 219 77 166 138 115 73 80 97 85 41 33 93 144 117 64 196 100 219 45 27 115 92 72 155 42 17 178 71 179 131 72
941 72 127 172 138 13 106 188 118 229 272 144 82 166 77 191 71 167 209 123 93 82 72 53 220 270 213 123 34 128 88 6 19 87 119
631 119 166 29 143 153 56 196 97 86 93 91 187 88 37 98 248 224 165 68 106 162 305 258 191 130 184 122 127 240 69 201 121 68 32
321 32 160 290 114 138 174 163 115 96 187 113 222 118 102 66 269 31 243 202 195 18 152 161 231 80 235 232 221 116 258 354
39 354 210 90 13 54 105 99 165 118 123 228 246 289 128 126 131 34 184 70 157 34 118 70 88 77 166 133 91 149 67 146 116 141 21 141
-280A41j07R1j1kN1j07K03j04P3q3P2j43
$$ plain form
-280 141 34 125 114 112 163 56 259 155 228 145 217 74
-393G4
##PAGE=	F1=-6941.35
##FIRST=	17614.246348710370512,	4405.4455391999963467,	0
##DATA TABLE=	(F2++(Y..Y)), PROFILE
4405G9O%O7q3K56j82o8l0O3LQ5j02J04mj6j64K1K10r4q8J4L0J9n3J11L7q0k2Q5p9Ql3J62k41
4086B1J68l5LM4j01o4R1m4j2Rn6J68q1l0RJQ8J38j88m7j2R3j00O6p1J91m2j09O3oj01K20r0
3776A84J03p8r9O5j07Q7R2j09m2M2O6J1j37K4P2o2M0q7rQ1K7o6J8L3pp8oJ29Q4j96P1R3r9
3466A40q7Q0J53n7j87J6O0n2L5M6J4L7l9q9KM0M6Q7p3k8p2J03j21J85j29L8J3j21j6J28k1
3175A31J23j50L1K7n1N5P6j83J63j37J76j98j4N7N5r5J50r5L1J48o8j08r7J14j4K6j22J80
2912B11L0PJ7k24L6QK8Q2j52kk5J54J83M3j74j22n1J64l0j29J23R2j46k6k9Q0j9L0l3K16j52
2621A90j03P7j9L7M5j16m0k7J37P0j79K4K5K3J32m1l1O6j82L1pPp0j4N1Kj6O5p5NK9mJ8j6
2302I4k3J18K5j22R9%l4j3J04L1j18m6R2Rr4L9M7p3J17J6j40L0l7k1q0P1J51J13r3k08L0M0
$$ plain form
4405 79 85 85 152 69 325 143 75 45 108 111 196 94 198 194 178 14 35 245 151 63 77 107 126 73 184 221 141 119 204 125 133 100 262 21
4086 21 189 154 157 201 100 36 127 83 71 80 24 192 111 81 90 91 179 317 129 82 70 163 63 129 58 249 207 98 161 155 54 274 184
3776 184 287 209 110 175 68 155 247 138 96 138 204 215 78 102 174 112 152 65 56 137 164 98 116 149 142 64 58 187 271 75 146 239 140
3466 140 53 133 286 229 42 58 118 66 101 147 161 198 159 70 72 112 158 245 172 144 72 175 54 239 110 148 161 40 24 152 131
3175 131 254 104 135 162 111 166 242 59 222 85 261 63 49 106 161 66 216 121 152 300 232 124 27 141 127 153 31 211
2912 211 241 248 265 41 77 85 113 195 43 41 16 170 353 396 222 100 49 213 183 54 177 269 123 97 68 148 129 159 126 342 190
2621 190 87 164 145 182 227 111 71 44 181 251 72 96 121 144 276 235 204 270 88 119 112 119 49 35 86 88 72 137 62 67 96 92 110 94
2302 94 71 189 214 92 191 191 157 144 248 279 161 115 207 216 122 161 208 135 252 268 128 158 121 100 20 91 242 355 262 54 84 124
2002A24J49r1j33ooJ56q0q4O4J1k7L3Q2m8J65j13qj04K6l9J19R8k52N5m9J2pJ21nn5l7N5j09
1692A7R4Mq3j6O7J3j5J60j23l1J86L1j73j10J94j56K75o0q2P44k78n88J162O579N116j0045
1448B882j646o33j62j96j85R5n2k0M3J5p9k9J27L3j07J11lo5J08r7J03j34m2J14ooo4m7j6
1175D2N1Nn4k2OO4j9R8j56J28l1J22k09MP9J1J2K9j30J4J79j39R9n5p5J7J18J3j89R5P3j09
875G1K25L1j66l7L4p9R1j01K4J16j01o3KmMJ93L1l8j02p2Q7j03J9J5K6L0Q0j72J05K8r5J42
574B21r5Kj1l4Q1r6k5P6J58p1m0j03L5P2J13m5m7n4K4p6L5J32j59J86o4j02q3O9J60j59O5
283A65l9P0j51pJ16q2J23n6np2K30k06P3MJj29J06k1J01j52J81On0j24J46J14j28j27n7J0
2D0K9K0L3k7N0J26M7k1k15rM5p3J38j15Q4j06P4p5L5NJ01p2j2M1p4J14r7K9j09Q1l1R7o7L2
$$ plain form
2002 124 273 182 49 43 37 193 113 29 93 104 77 110 192 144 309 196 188 84 110 71 190 288 36 91 42 54 47 168 163 108 71 126 17
1692 17 111 115 32 16 83 96 81 241 118 87 273 304 131 21 215 59 334 274 192 936 658 70 1232 7811 12927 2882
1448 2882 1236 603 441 245 60 155 103 83 126 141 62 33 160 193 86 197 194 129 237 140 243 109 67 181 175 169 105 58 42
1175 42 93 98 44 22 28 92 73 171 15 143 112 234 25 29 108 119 131 160 30 44 223 84 183 128 53 70 188 201 12 107 180 71
875 71 296 327 161 124 158 79 170 69 93 209 108 45 47 43 47 240 271 233 131 59 146 43 62 77 103 133 213 41 146 174 79 221
574 221 126 128 117 83 164 68 43 119 277 206 166 63 98 170 283 238 191 137 161 85 120 252 93 279 215 113 30 99 259 100 165
283 165 126 196 45 38 154 72 195 139 134 62 292 86 159 163 164 35 141 120 221 69 250 256 206 82 228 342 214 87 30 40
2 40 69 89 122 95 145 271 318 297 82 73 118 45 183 68 152 46 120 45 80 85 186 114 102 143 69 183 86 115 6 87 56 153 86 118
-318A18J2r2K10j03R9r5L6r0
$$ plain form
-318 118 130 38 248 145 244 149 185 95
-393I5
##PAGE=	F1=-7012.11
##FIRST=	17614.246348710370512,	4405.4455391999963467,	0
##DATA TABLE=	(F2++(Y..Y)), PROFILE
4405A12Mk3M3o0J49q8l8rK0l3R0p6N3K2n4p5K6J81m4j65J6J1J9pJ06L3m9n1P2o1J6l6J65k36
4086C3J85m5k3N6j09o7N9J6nK5j08J21k2l8N5l1R5J70j79p0k0L1j21Q0m9J86n6q7P7p2k2J67
3786B32o9R8o4j44P9m2Q6M0p9m8L5Q3k4j04L6Q2q5Ro5K6%L6j6J4k0ro8M4R3Q6j75J29Q1j15
3466A62j34J16J76p9j95K1N0q0O9j3PJ16m0j51Q2L8LM5M3o6p6P2j12K04j74J3O9q5l1R2JJ00
3166B43j91O5O5r7M6J14j99J76j27J45j68j8O6K7j03J33p8K5J59l3j28o8J19M3l9j42J71N
2903B11J2j2j37mN3PJ06j57k1k5J57J65L7j75j24l5J44n6q1N3J34p6p0o6Q9m3O6QJ30j04j08
2612G8N0oK3O4r2o3JJ64M3j85k0J6O7J70o7j3Q1j81qL0l1j09K6Q7q2j6J03k2Nm2K7m5Q9j18
2293B4J88K5q5JmL0n0J02L1j09n6J16k2p8N4P6j37J06l8o0L2j9k3n1P0L2R4k4j33J8QJ15j2
$$ plain form
4405 112 116 93 136 76 225 137 99 90 110 77 167 91 144 166 112 37 63 244 200 35 51 62 81 74 180 213 164 113 185 124 140 104 269 33
4086 33 218 173 150 206 97 30 89 105 100 125 17 138 116 78 133 102 197 367 188 118 98 129 8 88 39 225 169 82 159 87 65 232
3786 232 163 261 197 53 132 90 176 216 137 89 124 207 183 79 115 197 112 121 56 82 82 118 102 116 96 87 19 63 156 242 67 196 277 162
3466 162 28 144 320 241 46 67 117 37 106 93 100 216 176 25 107 145 148 193 236 170 94 166 54 258 84 97 166 81 50 142 143 243
3166 243 52 117 182 85 131 245 46 222 95 240 72 54 120 147 44 177 99 124 283 250 122 54 173 216 177 35 206 211
2903 211 223 211 74 70 123 130 236 79 58 33 190 355 392 217 93 58 202 146 65 118 252 176 106 40 129 86 152 160 290 186 78
2612 78 128 122 145 209 117 54 55 219 262 77 57 73 140 310 243 230 311 130 122 152 121 12 38 125 43 27 130 108 113 71 98 53 142 24
2293 24 212 237 152 153 149 179 129 231 262 153 97 213 191 113 167 243 106 212 174 114 146 127 104 53 123 155 249 225 92 110 118 233 221
1983B21j07j05K7J08p6Qm0J3NJ48L8q5J69j39pp1O3o7N3J15j70km1J5m2J17on0Nj9o1R5M2
1673A54j45K0J7J3N9J11r9j07L19Jj83n8R7j03J60j36o6L68j74o0O00L312K826n477o61m14
1429C74m4j29j72Q5k7o7R1m3J3m8R3K0p5J39L0j21J13j59J79j04j20J48O3r0o8l5j3N4j1n8
1147A8nK3Q0j01J98j22J1RJ14j97NQ2M0M5n7m0j8J62j57Q5m2j05mJ51M9j89O2P3m5K17J2j77
847A77k4jq0M6m6m3J68p8p0Mj1L2J63J8j6j21k7P3j40R8K3j5J7R6j84Q6M7j08J34q6K8l0o9
537F1P4p6j9Q1J56r6k6q4L5O2P3m1j8m2qo2O6J09j38K32l8j21j19nJ57j15P3r1J38j93OJ07
236A38q3J03j0J1j04K52j61q8O0Jo5N8m3J29j46J95%p3j31J28J21q2j17l3Kl6M6L1k0N9J47
-55B89O7p3k25N4J6j0N1l8M2j09N9j02N5J5J02j17M1K1k3J16j38k7n5K7M1Q9p8N2l6m1J34
$$ plain form
1983 221 114 9 36 144 68 76 36 49 54 202 240 155 324 185 178 107 170 103 156 271 101 99 58 73 31 148 142 92 97 78 17 112 154
1673 154 9 29 46 59 118 229 130 23 342 343 160 102 199 96 256 120 54 422 248 188 788 4100 6926 1449 788 374
1429 374 330 201 29 114 87 20 111 68 81 33 126 146 71 210 240 119 232 73 252 148 28 176 239 149 81 46 33 87 76 18
1147 18 13 36 116 15 213 91 102 111 225 28 33 115 155 200 143 103 85 247 90 175 133 28 24 175 224 35 97 170 125 342 354 177
847 177 153 152 72 118 72 29 197 119 49 53 42 74 237 255 239 118 91 164 24 122 145 130 147 243 59 145 192 84 218 132 160 130 61
537 61 135 59 40 121 277 181 155 71 106 168 241 200 182 140 132 70 136 245 107 339 301 180 61 56 213 98 171 80 218 25 31 138
236 138 55 158 148 159 55 307 146 58 118 119 54 112 69 198 52 247 247 174 43 171 292 210 93 60 62 26 72 103 83 142 289
-55 289 356 283 58 112 128 118 169 131 173 64 123 21 76 91 193 76 117 138 115 231 93 66 11 38 79 168 90 142 106 65 199
-346A99q4J25r4j3j0
$$ plain form
-346 199 115 240 146 133 123
-393A23
##PAGE=	F1=-7082.88
##FIRST=	17614.246348710370512,	4405.4455391999963467,	0
##DATA TABLE=	(F2++(Y..Y)), PROFILE
4405A38J1j1K3m2J0k9K8J5kj01J02m7J8K8q6J5J4J34nj67M7n8J3K6R1K1Rq2L4l4K7k3J43k09
4086E1J83l6q2P3j02m9O0L3qK3j07M4J7lO5n4Q5J88j46n0o2l7k8Jl9J56o9n3R6j24N7Q2k9
3776A36O9l5j54O8PQ6j1k8j1j3Q8n6p2N5Q4r2j9k8J5m7J5L9J7o2k2j1N9M0O5j31J66O5j04
3466A78j04P4J88r6j92L4K5q2P5n8J1J72n0j71J39K1j4j3J37p7j01N3j04K09j76m6J38n4m1
3194G5O1kQ8j23K0P5j31J6J42j66J55r6R0j18J4L7j4j06J28p0QJ50J6j30o6J42R9q8j11J14
2912B09j8rl3m1m3R7k2J23j25o1MJ35J17J3j59q2N2K9q9k9k9J73Oj03p8P0o4J05N8J4n8q9
2612G3L0OqP5m0k1m9J86Jj83j2k0P7K11o2KO9j93nL8l8p5JQ3j25LQ0Q0J6j37N2j09J73j53
2293B6K00Qn5o4KQ4r1Q3M1q9o6J34n2m7N0R5j75P5o0M0j0qOk4N0n9K8N2l6Jj8P8N4q0j27l
$$ plain form
4405 138 149 138 161 119 129 100 128 143 141 40 142 95 113 141 55 70 84 218 213 46 93 35 48 74 165 186 195 113 147 113 140 117 260 51
4086 51 234 198 116 189 87 38 98 131 123 146 39 83 100 97 162 108 193 381 235 185 123 86 58 59 20 176 107 54 150 26 83 165 136
3776 136 205 170 16 84 91 177 166 138 127 114 202 146 74 129 213 121 102 74 89 42 57 96 113 51 29 18 77 117 182 51 217 282 178
3466 178 74 148 336 240 48 82 107 25 100 42 53 225 175 4 143 164 150 137 274 197 96 149 45 254 78 32 170 116 75
3194 75 136 134 222 99 119 194 63 79 221 55 210 114 204 86 100 137 123 17 145 75 83 233 249 119 53 195 294 206 95 209
2912 209 191 182 149 108 65 162 140 263 138 77 81 216 333 346 187 105 157 186 97 68 39 212 218 115 37 107 43 148 206 220 162 73
2612 73 103 109 101 176 136 115 66 252 253 70 58 38 115 326 264 266 335 142 137 175 137 62 63 146 21 24 104 184 200 63 115 6 179 26
2293 26 226 234 179 115 117 201 110 193 234 145 79 213 161 114 164 259 84 159 99 139 129 121 127 103 153 94 122 174 138 139 121 199 253 173 46 43
1955D3M7o7J08q8LO4J61j5r7J43j65J6QP1r5k9J18n5n8m2M8n5P6po1J4o9M4K7R2j49L5k6k2
1635A8J24P3r0J6K47l1j70j8K1m1O1j34m0K7N4J50J74P15J012j804M5j22j2q2j21%LqN6o1
1354F2P7m2J0kl3J56L6j77J17j75K29r3j19J49P0j57k7Nk6Ql7rjL6Q1r3J91p3m5j9R5j47K1
1044F8O5N7O8j40O1p4J39j51N6j1r5oR5O3j24PO7J8J92qj57k3k7p1k1L8LQ6j9l4n2k6N4J21
725B19J6lj45L4N3j02R8L2m1qJ01j84O4O4j28J20p2N4l8j11R4k1o1O6J46r6j6k4J5J7M7l6
424A54J5k9l1k4O5O4j03K63rj09j61K1O5p3M7q9J60j51nO0o8N6L0K5j17K51j10j53K8%pOk9
114D2J25j29J92j7p1j36R4J19j7r6kJ0p5K9M5kPJ64P3r4k07J18k5K7l5N2kj15N1j16P8RR3
-196A89j62J03mL1J11j50j15K7lP3O3m6M5o4J2K6m7J26p9o5P5
$$ plain form
1955 43 90 23 131 43 46 110 271 256 159 302 137 153 161 232 137 108 226 171 113 71 119 64 140 133 72 86 17 61 88 180 31 66 40 18
1635 18 142 215 125 141 388 357 187 169 190 149 210 76 36 63 117 267 441 1156 2168 364 409 287 275 193 72 72 75 67 123 62
1354 62 139 97 107 105 72 228 264 87 204 29 258 165 46 195 265 108 81 86 60 68 31 22 21 57 138 45 236 163 118 99 194 47 68
1044 68 133 190 258 118 179 105 244 93 149 138 43 37 132 195 71 78 145 163 355 347 190 167 140 69 48 86 89 175 156 122 70 44 98 219
725 219 235 232 87 121 174 72 170 202 161 153 254 70 134 198 70 190 118 172 134 23 117 96 35 101 247 151 135 111 126 143 190 154
424 154 169 140 109 85 150 214 111 374 365 256 95 116 181 108 155 66 226 75 70 130 62 118 148 173 56 307 197 44 72 72 65 71 42
114 42 167 38 230 213 142 6 100 219 202 106 104 114 39 68 113 111 118 282 355 261 54 172 147 174 139 191 189 74 125 9 87 96 189
-196 189 27 130 126 157 268 118 3 30 27 100 163 117 162 98 110 136 89 215 136 71 146
-393A46
##PAGE=	F1=-7153.64
##FIRST=	17614.246348710370512,	4405.4455391999963467,	0
##DATA TABLE=	(F2++(Y..Y)), PROFILE
4405A51K5J9J3n6q1l0J23K8Pj74R9j6M8k9j10O7QQ1J7j04Q2j30K0K5O2%Q2j11j4j6M3KJ06
4096B37j79J79j1j67R0p8%R3ok4Lr8nL1N9M8o4O8J77j12j8q6p2N9p6rQ1q1pJ17q7M6l1K4L0
3767A31Jr1J8MJ16n7NL8n1P5p9m9P6Q4q6m2lpj1kK3J3n3k7PO1k3L2p0J75N3p2o2J4J86j00
3429B27j80N2K7j02P2q4J4J97o6j46J56ljm5J65o6j36M0q2J89j46m7J33l9k7M7l7P5m2j0O1
3138A96j40j8J36j04J31o5K1o6N3Ro6p6J19o2k2J17O1j06r1J86J40j24r3Q0l3m6k3K6q1J40
2856A99o0J35q8q7K8J25M7l1j28rJ01o0j22J7pR3Q1j12q3M5n6J28R7j05j9n2%L9l1M6K1L3
2556A85j08J99m1j80L1k0QK40k5J5L4k12L8Pj7o2lO2r6j0K9J74J9j63M0q2J39j30J56j7l9
2265A71o3K6Q7j27M9N5n0q5J43p1j1L2R8j73J0mP0n0kM8%J5n9q9J28M2k7l1M5R0n3j44j7J3
$$ plain form
4405 151 176 195 208 152 71 41 164 192 199 25 124 108 156 127 17 84 92 173 190 86 168 38 58 83 145 145 227 116 102 86 129 131 237
4096 237 58 237 226 59 149 71 71 164 158 134 137 39 34 65 124 172 108 176 353 241 223 137 65 124 48 39 120 39 32 149 62 108 77 101 131
3767 131 132 41 59 63 179 122 127 165 114 189 110 61 137 221 135 93 90 83 72 70 93 106 53 26 33 94 71 103 33 208 261 189 127 141 327 227
3429 227 47 99 126 24 96 12 26 223 157 11 167 164 163 118 283 217 81 121 39 228 82 35 168 129 102 149 112 187 145 135 196
3138 196 56 38 174 70 201 136 157 91 144 153 87 11 130 68 46 163 224 118 27 213 353 229 136 216 183 137 114 140 59 199
2856 199 139 274 186 99 127 252 299 268 140 131 232 172 50 67 60 153 234 122 39 84 28 156 253 148 129 77 77 116 85 131 152 185
2556 185 77 276 235 55 86 66 74 314 289 304 338 126 164 171 154 92 89 151 55 45 74 248 267 104 144 62 201 71 227 210 171
2265 171 108 134 221 94 143 198 148 63 206 135 124 156 254 81 91 87 157 107 105 153 153 168 109 20 148 190 163 132 177 267 214 70 53 66
1945F6j3J21p9pP4J43o4q6Q7j80N0R7P8j20r1Q6P1q8o5Q6o3K9Pq7kJ3N2o2J36j53Q0m4n4J31
1626A49N1r7J41J46m6j40%j7%Ok3r3O2J03N3n1L97K04m58k32J71p0m9j11n5L7L8K1PM2k5m5
1326A16k8j2J62J0k10J21j57K52j00n8J18M4k03M8K2k9j9k8j6K1L5O0p3J63j5n3r2O7o9L8
1044A15M1N8P8j89J37j44J20j19J2L1m9k3lN6j6n4N2N5J72k6j05l1n1m5n3R2M6j0M6jj16l5
743D1O7R0K4j3j62R9K5n8Q9L5n2l6R5j65L4P5j41J07n3O2l1j01Q8K1j06L2J28p5MM7k7n0N2
433A45k6L8k4l2J8K9J4m6K65J6p2k07O8om8pl2J29j25mK9m5RO0L2j19K31n8j04j01L4J2m7
124B6N6M9q2J57l8m9r8J6J06N3o5L2J2q8LN1K5q3J73O6p2k02J63m9L5j00J27l9j14N2j14J01
-177A10j4Q0j50J03k8Q1J04j48p8J0k5P4K1QK9p2N1m9j3Q3n6r9J36
$$ plain form
1945 66 53 174 95 88 162 305 241 155 242 62 112 209 287 167 76 162 233 145 80 166 103 132 139 52 50 63 115 53 189 36 116 72 18 149
1626 149 200 103 244 390 344 204 204 187 187 193 170 77 139 242 295 244 641 845 387 155 326 256 207 96 41 78 116 137 144 186 161 116
1326 116 88 76 238 248 38 159 2 254 154 96 214 258 55 103 125 96 77 49 33 54 89 149 76 239 224 171 79 146 77 115
1044 115 156 214 292 103 240 96 216 97 109 140 91 68 65 121 105 51 103 158 330 304 199 168 117 72 19 111 157 147 193 192 76 41
743 41 108 198 222 209 47 146 171 113 202 237 185 149 244 79 113 188 47 154 101 163 132 31 119 140 34 66 194 119 123 170 143 93 145
433 145 119 157 133 101 119 148 162 116 381 397 325 118 186 180 132 125 93 222 97 93 122 77 86 146 178 59 290 232 128 27 61 73 26
124 26 82 131 49 206 168 119 21 37 143 196 131 163 175 87 90 141 166 83 256 322 250 48 211 162 197 97 224 185 71 123 9 110
-177 110 96 176 26 129 101 182 286 138 60 70 45 119 140 148 177 105 156 107 94 177 121 22 158
-393A58
##PAGE=	F1=-7224.41
##FIRST=	17614.246348710370512,	4405.4455391999963467,	0
##DATA TABLE=	(F2++(Y..Y)), PROFILE
4405A47M4N3jq0q4k1J43L0L6k01N2J0J07j10j12O8J1L0K2JJ00j98J6M2K0k8J49j27m4k8O8
4114A15K4P1j47J69J9k03L9l6O5J30o3m6l4p7rJ4J20J3n5N3J26q9J8q2l9Q8j34K3Jn1K1J24
3814A68m9Qj03N3k0L5l9J7m8J79n7m2Q9o2L7q9k5R1P7p7n2%j6M9K0l7j3lj9l0P2o8j9J4J38
3485A79M9l4l6l3J69q7j57P0N6j59P9l5m4J91q5j15J67k9L1j9J07l5j75L0l3J37r9JO7l7O
3194A27N2q1L7K3j0L8j24PM2l6J33m7n3j2P3rj16j2R9n5l6M5R1n8n8J80J46j48q5O6l8p7K0
2884A24L7j07J76j01J35n7q9M9J24k7q9q6O7J14j14j43N5Q2o8J31q4r2M2l7J37J09k03J3j3
2612H5l2R5k8m2P8P9j49K05p3j67O6ko3K21L3K6j5k17R8n8K6o9J3L5n8l3J0K19Rj29J9p5J02
2302B09j03J09m3l3j2O6M4j49jP4Nj06J32o9QJ8Q3j38l4P8J6p3jR0K4k9k2k8O3O1o0k2RQ8
$$ plain form
4405 147 191 244 243 163 79 58 201 231 267 66 118 128 235 125 13 81 92 122 144 145 245 47 63 105 125 97 246 119 75 47 115
4114 115 139 210 63 232 251 48 87 51 116 246 183 137 103 26 17 31 151 164 109 162 288 199 217 135 96 184 50 73 74 23 44 168
3814 168 119 127 24 77 57 92 53 70 22 201 144 102 191 129 166 77 52 143 220 143 91 91 75 124 144 107 94 91 72 42 114 46 27 41 179
3485 179 228 194 158 125 294 207 50 120 176 17 96 61 17 208 123 8 175 146 177 158 265 230 55 85 52 189 90 91 158 121 127
3194 127 179 98 135 158 148 186 62 69 111 75 208 161 108 96 169 160 44 32 131 76 40 85 176 118 60 240 386 238 153 219 181 104 124
2884 124 161 54 230 129 264 207 118 167 291 264 175 89 156 270 156 13 68 150 82 213 129 37 79 42 179 288 85 98 85
2612 85 53 148 120 78 156 235 86 291 218 51 117 115 52 273 306 332 317 100 198 140 166 97 110 145 87 54 64 283 292 163 182 107 209
2302 209 106 215 172 139 127 193 237 88 87 161 166 60 192 123 131 149 232 94 60 138 154 81 80 170 194 165 143 115 178 239 179 157 166 254
1983B54k4j48j8K9KJ08o3j8O4J12r2o1K1r8LJ63R8j41r7lJ87q8j08J19n9j6K3r0K9O0K5j03
1682G0J08j31J29p2o7R7M6r9K34L0l4j07mrJ3rL1j36Q3Q9J1r6J116N99j314n46L20j09k8j21
1401I4o0P1L6mQ2j2Ro8n5j7J54l8j72Q6r5K19j08J4Q7Pk25J28K2k9Jkp9M5L5K1n9J36M1m8
1081B17j55L3J4M7J7N3O8j85J63j97R9p1l8P4%m6q0L1Q2j08M6N1J58l9l2m1p2j8mP3O2p9Q5
772B08K7j66k5O0P5L3m1j34J28j6j3P9L1n6n6Q2j27jP4j37J02k9M1j0m5M6L1j19%Q9l7M0R2
462B26q0j17R3rL0k9oM9k8l3L9K25L0j9k46J01l0l6o9K7R4j22LK4k0l2P9K8j22K07j2o1j58
152B6Q0k1o4J08l4k3J07n5k5o5K3L1J12l1N8Kj03lM7N1j66J68N5j9k31J94n6J6j32J78o4j04
-149F0N4j03J22m8P4r3M1m6J27R4j38l0Qp0Q1k8P1J6o8O8o1j7K6m2n1J11
$$ plain form
1983 254 230 82 64 93 95 203 140 122 186 298 206 145 166 68 71 234 332 191 94 91 278 190 82 201 142 126 149 59 88 148 173 70
1682 70 178 47 176 104 37 134 180 81 315 345 311 204 200 191 204 195 226 90 173 262 273 177 1293 1892 578 32 352 243 215 94
1401 94 34 105 141 137 219 207 216 148 93 76 230 192 20 106 11 230 122 136 223 230 5 133 155 126 127 125 46 91 126 147 88 224 265 217
1081 217 62 95 109 156 173 226 294 109 272 75 174 103 65 139 139 93 13 44 126 18 64 115 273 234 202 161 89 71 67 140 202 123 208
772 208 235 69 44 104 179 212 171 37 165 149 136 215 246 190 134 216 89 88 162 25 127 98 139 129 84 130 161 42 42 131 94 134 226
462 226 146 29 122 113 143 114 108 157 129 96 135 360 390 371 125 226 196 160 91 118 212 90 93 117 97 65 144 172 50 257 245 184 26
152 26 106 85 21 129 95 72 179 124 99 34 57 88 200 169 227 229 126 123 170 221 55 223 278 259 28 222 166 182 50 228 164 60
-149 60 114 11 133 85 159 66 107 61 188 282 144 114 122 52 133 105 176 192 124 192 131 114 140 98 47 158
-393A58
##PAGE=	F1=-7295.17
##FIRST=	17614.246348710370512,	4405.4455391999963467,	0
##DATA TABLE=	(F2++(Y..Y)), PROFILE
4405A27P2P6k7r8m9L0R4L0P2k18J5K4J56j70j17M7K8j3J3J14J05k53j2R8l7n9J96j26l1o4
4124B3R2J8N8j15J48M1j51r9J8J31J57j23o1q1j0KJ4J14l1k7M2L6p6N2n7K0R2j70N0o5J1N
3823E8J38k5m0qj7p2K7j5L6l6J94k6j33J23n0k2p7J6Q7M8p1m6rLQ4L7o8n8N1k2l6O4m8k2Q
3495G3Q1N1j9k7m4J35o7j14P9Q2k13O7K3q7J62j06o0J51n4P5L0J1Pk10J8K7Q1m1J5J4m4M8
3194A44O8r8m3O9QJ8r4M0p1K3J62m3j17M0O8k4j39L8Q4n3k5l5Q8J4J9J38J10j59p7N5k5q2
2894A01M5J9j05J93j39J17l6o4O7J25r2j43m1J21R9j38j08N9J44j82J16oj15P6o3J54R2k53
2631D3L9Rl2J34k2j38J13J07j63K13r0j46Q0No9J27R2L8o5j70J26j42Q1q7L7J5j9o2K7K02
2349B83j6n0Lq6O6p5O9o5k2L2J15oj56n7R4O5j15R3m5MJ8N1q9K7O0o2q1nJ22M8p7NL7M5M9
$$ plain form
4405 127 199 275 248 150 101 131 225 255 327 109 124 148 304 134 17 64 92 79 92 206 311 58 46 144 107 48 244 118 87 23
4124 23 115 133 191 76 224 265 114 15 33 164 321 198 137 56 46 48 62 176 145 118 160 196 120 172 115 135 227 57 107 42 53 58
3823 58 196 171 131 123 106 34 61 46 82 46 240 214 81 204 154 132 55 71 158 206 135 89 80 83 167 204 136 78 129 107 71 135 87 65 73
3495 73 154 205 186 159 115 250 183 69 148 230 17 84 107 20 182 76 16 167 113 188 218 229 236 26 44 71 152 111 126 140 96 144
3194 144 212 114 71 140 148 166 72 112 41 64 226 183 66 106 174 150 11 49 133 80 55 20 108 122 141 279 389 230 153 208 183 101
2894 101 146 165 60 253 114 231 195 131 198 323 231 88 47 168 267 129 21 80 224 42 158 152 37 113 50 204 296 43
2631 43 82 91 59 193 171 33 146 253 90 303 213 67 147 152 83 210 302 340 275 105 231 89 170 83 120 135 116 54 81 283
2349 283 267 217 220 134 200 125 194 129 107 139 254 248 92 35 129 194 79 172 127 131 149 200 111 138 198 136 55 50 172 220 143 148 185 230 279
2020B79r2J3m4N6J2j34j4N2mR3m1l6L5Q3r0k8rK9q8J61J28j58p0r1K54o1j56J34l4n0K2o3
1720H8Q3N4%j03K9o5J51j04r6N9N7o9K61q2Oq4k4L5PlK9j33J9Q5J5m8R38N13j159m27K95j03
1419B24k2j31k2J10j6k3J49p3N6o9q5k7J34r4m0Kn8J70r5O9N9k2j54J18J3l1L5J6j33N5M4
1128A59k9m2J09Q1l9j78OO7M2NM4M1j45J51j70M4l8m9P8L9o7l4L6J6r6N9m1J47m3M7m5q2k0
818E3L3P5N8j10R0M2j88KL3P4L0p2l9J00p0L2P1J8n9o1O4p4k5M8j04R5j1jK4KOJ1q8MJ1J0
480H4Q0J02j30q2O5J0Nn3M2P1q6p7J33J51L6L2k71J13j8l0j05N0P3j34J2N0qo0Q7J6j40J95
180B13K4l0j24Q4o8m1J03r7K5O1n8k2l8O6l0J48kO9j8j12KK7P5k05J42N1L0k52J80m4k2j23
-121A4J94o0j01M9p7J32r0P9n5k5m3J63Q1j23J0K1j19R3p0J28J0n8N8n3l4No1KP8
$$ plain form
2020 279 187 200 156 212 224 90 76 128 124 217 176 140 175 258 168 140 131 160 72 233 361 203 133 42 296 235 79 213 179 129 151 88
1720 88 171 225 225 122 151 86 237 133 37 96 153 84 345 263 269 185 161 196 203 200 229 96 115 200 215 167 1105 1618 459 32 327 224
1419 224 202 71 49 159 143 120 269 196 252 183 98 71 205 111 71 73 15 185 90 159 218 196 42 160 173 142 177 193 60 115 159
1128 159 130 88 197 278 239 61 67 134 176 181 225 266 121 272 102 146 108 59 137 176 109 75 111 127 31 90 49 196 153 200 155 73 53
818 53 86 161 219 109 199 241 53 55 88 162 192 120 81 181 111 143 214 232 173 112 176 102 77 125 21 116 105 104 128 130 136 147 59 63 74 84
480 84 164 266 136 54 119 129 134 81 123 194 108 31 164 315 351 383 112 225 207 177 72 122 195 61 73 123 115 55 142 158 18 213
180 213 237 207 83 167 99 58 161 64 89 150 92 70 32 98 68 216 214 283 265 153 155 182 257 52 194 245 275 23 203 159 137 14
-121 14 208 148 47 96 19 151 61 140 85 60 17 180 261 138 148 169 50 143 73 201 211 153 211 158 124 129 68 70 148
-393A48
##PAGE=	F1=-7365.94
##FIRST=	17614.246348710370512,	4405.4455391999963467,	0
##DATA TABLE=	(F2++(Y..Y)), PROFILE
4405I9J05P9o4r4j8P6M6L1J03k26jK3J82j94j18J3N1m0OJ96R5k72k6J45j08p0J98j02jn2P9
4114A41k6O6q7J18M7r2j15l3J83J74j81o1j11O2pL8P7p3PL5o5o4P0k3P2R5j80P2j18L6kJ63
3814B18lr7R2l7j05k5JL9KJ85Oj97J26k6r1k9M9Q4j2p5k2rL2Q4M0o4j06R9l2j1L8j3k9j1N0
3485A51N3l5l9MP7n0o0Q0Q9k20JR3j12J16j24NJ22p8J17P9q0M7k07k6P7N7Npj5n2Q2Q7q6j36
3166A5R0K8Qn9N5j04J4J92m5j56P9M2l7q0J7O8o2joj3Q2R7R4M5j55n7L0No0K1jo0J83j66P4
2837A77k5j6Q5J21j39j68oJ36O0j35k8L9J69j69j6J13j58J22j06J54O0k43N8NlJ41j1j63P3
2565A27J08j47K29r6j31Q6j2n3L0J31M8j01p3J07k16J24j02N8J3J4q4L3J57n1N6qj09L9n1
2293A26M4q2J8K2J66l8j52q9R1J15j09L7j2j3K9J6m7J08K3j39p7j5J36O9j10LR4N4L3j09O1
$$ plain form
4405 99 204 283 219 125 107 183 229 260 363 137 136 159 341 147 29 42 93 53 59 255 350 78 52 197 89 19 217 115 114 62 141
4114 141 115 181 94 212 259 167 52 19 202 376 195 134 23 85 78 116 193 120 127 162 97 33 103 80 152 247 67 139 21 57 55 218
3814 218 215 118 210 173 68 43 44 83 85 270 276 79 205 179 88 59 108 192 180 105 83 74 106 190 230 166 60 159 127 116 154 141 112 101 151
3485 151 204 169 130 134 211 161 101 181 270 50 51 144 32 148 24 29 151 73 190 269 189 236 29 3 80 137 142 135 120 68 150 237 151 15
3166 15 105 133 141 82 137 33 47 239 194 38 117 159 122 42 59 127 65 64 58 45 127 224 318 363 208 151 181 186 126 147 146 86 269 103 177
2837 177 152 136 221 342 203 35 29 165 225 90 62 101 270 101 85 198 40 162 56 210 270 27 85 90 87 228 217 54 127
2565 127 235 88 317 221 90 176 164 111 141 272 320 219 146 253 37 161 59 117 130 144 60 93 250 199 255 247 138 177 126
2293 126 170 88 106 128 294 256 104 15 106 221 112 149 137 124 153 169 122 230 253 114 37 22 158 227 117 120 214 268 301 192 253
2002B53j13J1N9j07nM7rP9qo7lO3n7QL4N1j22R7J57j68l9r2K16k1j88J26J1p2Jl0J23M3j5
1692B63j04m5K2J52j30j12pQ0j4K32j72O7q1m3R5j4Mkr3o0P4K9M4L43J97n23j22J89p6k6j30
1401C7L9J57r4m7J97j29R8n9j09k8J06j31P5j3q9J09k8O9M4l9r3J06%l8O2L3j59M3O1q4rP3
1100A60R5k3j62J2N7L4NL6Mr0J16p2j4n0j0M1N9q0oQ0p9l2O9j28R8l8J07l7o2o5N4Q7M3r8
781A11O3L2j70K3QP7J1r1O1P4j36Q1O4no6m5M3k1l4%k9O6j5l6O6K6k3l6j6Om8N1J04Q4j52
452A28j2lK8mr5R7Q5j06p2J44O3L8O9k82J10J7k8j07K8P3j51J8J01j1q5J00kr6J24M5j4n3
152A47Q4j23j5Q1j16L9K0m4m3oR4n8J82J8N9m7j03J8j9R7k10J29N3M5k14R0k0n6n0J45k0j13
-149D4K3l8J36j40R4m1o0L6J13O2j06L4L9j50R9q5J62Rm7K4m9m5L7j20M1N8
$$ plain form
2002 253 140 151 210 103 98 145 136 215 207 140 137 200 143 151 185 236 114 211 368 200 161 69 285 264 76 202 213 141 142 112 235 278 263
1692 263 159 114 136 288 158 46 39 119 105 337 165 232 151 108 203 189 193 191 98 38 112 141 185 528 725 202 80 269 193 167 37
1401 37 76 233 139 92 289 160 258 199 90 62 168 37 112 99 10 119 91 160 204 165 72 178 178 140 202 235 76 119 180 96 87 160
1100 160 255 232 70 82 139 173 178 214 218 128 244 172 158 108 98 139 198 118 112 192 113 81 150 22 120 82 189 152 90 25 79 166 209 111
781 111 174 206 36 59 67 144 155 64 125 199 63 144 208 203 137 92 135 114 80 80 51 117 102 66 132 158 135 99 83 89 41 92 196 280 128
452 128 116 113 141 137 42 139 224 118 46 190 253 291 360 78 188 205 177 70 98 171 20 38 139 128 43 143 141 45 169 214 200 147
152 147 231 108 93 174 58 97 117 73 30 24 118 60 242 260 319 272 169 187 168 265 55 184 237 282 68 158 138 82 32 177 157 44
-149 44 67 29 165 25 119 78 18 54 167 229 123 157 196 46 145 60 222 231 184 208 159 114 151 31 72 130
-393A30
##PAGE=	F1=-7436.7
##FIRST=	17614.246348710370512,	4405.4455391999963467,	0
##DATA TABLE=	(F2++(Y..Y)), PROFILE
4405F9J40N8j01o6%J00PL7J18k18KJ0J81j78j01j6N1n4J4K25Q0k60J0J47j77m4J36o0K5l0
4124A05P7q8Q1o6Q7L4m5q2r3K14J74k32m1p6O8j6N9L8j05L0L3j27K0kj1J05J04j64Q3j41J9
3833D2oJ88K3j51J75k7j65m7L8J3J9J72K8k22J13Lj43K9O1Q9q7q3RJ8M2N9L0l7j42J40m9K8
3532A60LJ9n4pM0N1n7o1P9J9m9j1Q4P5j99p1J50j24O8q0PR8j03J46J14j42P3j68j6K8P4J9
3232A65m2j2o0R3J03o1j34K9K7Rk7O1n2l5J70m8j55Q5J3m7j2j0M7p3L6L7j3L5J58N5l3j32
2931A77j6k2N4l5l8j3J8J52j78Rj4L9J02J07j59j50J7J06%j02N4J3J60j14q7J75k14J63j23
2659H1J03K4j80P2j7K4J30Rj40%Q4j07K52r8j25R0n6l2k9J34N3j11K8O8k06Q5r9O5L2L5r2
2368G7NJ12q9J67j8j35K8l7M3j03Q1l4K09m7j43p3M9J48r7k1K2l2M9j6k1J77oj95o7jR8Q7
$$ plain form
4405 69 209 267 166 100 100 200 207 244 362 144 146 156 337 159 58 42 93 39 53 278 358 98 108 255 78 34 170 110 135 105
4124 105 182 94 175 109 196 230 185 103 10 224 398 166 125 49 117 101 160 198 93 123 156 29 49 47 36 141 245 81 164 23 42
3833 42 36 224 247 96 271 244 79 32 70 83 102 274 302 80 193 196 53 82 143 232 145 62 71 89 131 190 220 183 41 181 132 160
3532 160 163 182 128 121 161 212 155 94 173 192 143 132 216 291 92 21 171 47 115 35 42 140 37 183 297 155 228 60 44 72 146 165
3232 165 123 111 51 144 247 186 52 81 108 117 90 151 99 64 234 186 31 116 129 82 70 60 107 34 70 107 94 129 287 342 309 177
2931 177 161 139 193 158 120 107 125 277 99 108 94 133 235 342 183 33 50 156 156 54 108 121 281 167 80 255 41 204 81
2659 81 184 208 28 100 83 107 237 246 106 106 190 83 335 237 112 202 146 114 85 219 272 161 189 257 51 136 37 102 134 169 77
2368 77 82 194 105 272 254 119 147 110 153 50 131 97 306 259 116 43 92 240 143 122 144 112 161 145 124 301 295 100 33 32 130 217
2067B17j11l6J37P5K1j08J08j82k0J02q6J5J1pO3L3j09l6N8j4N3P8J7j28K6J72j68j2o1J42
1786B50K0j91R7P2r2l1qJ44L6j3j16p5Q4J37j38p7n8L8M0J84k18J20r0l2J27m1ml5m5n3K2
1495E4K4J32j12J10j28N0P8o2l1q6P7K02j68q2K21j62J09m8j10k0Q0n2N7J3j31L3P8J8M4m6
1213A42n6R3j2m9P1N6j54PQ3j35N2J6Q7%j26L7J0L1J7K5k2m9Q0L6m8r0L5QN8q1qJ20j36L4
894A32O9j17ll9J28k0k7p7K7Q2K1n1L2j6j17L3oP5k2p8J28O5j94J27M9l2p6qK5Pl6m7P1K5
574A30n0m2R8K9l2r9P8j3o0O0J13N2j23J9p1M6J8j13J08R4q0p3J13k2M5Q0k73R5O7l3r3j9
274D9Q7j12k0J51k5r3J19l3nJ1N8j7M0Q0j84K1M1p7J0k4j1m1LQ6p9K38L1K4q2p0M2q9J17k04
-45D2J54M2K9j48k6J0m2lR0L5j30j8NJ39j30M5m1L6J3N5L5r0L7N3j52R7p6J72J3l5k5m7m7
$$ plain form
2067 217 106 70 207 282 303 195 303 121 101 203 117 132 143 136 199 232 123 87 145 131 184 262 279 151 177 349 181 169 108 250
1786 250 270 79 176 248 156 125 117 261 297 284 168 93 177 314 176 99 41 79 119 303 85 205 115 83 210 169 165 130 85 32 54
1495 54 78 210 98 208 80 130 208 146 115 29 106 308 140 58 279 117 226 178 68 48 128 76 133 146 15 48 126 144 188 142
1213 142 86 179 167 118 189 245 91 98 181 46 98 114 201 201 75 112 122 153 170 195 173 124 204 240 192 102 137 145 203 122 114 234 98 132
894 132 201 84 81 42 170 150 123 46 73 155 176 125 157 141 24 57 51 126 104 26 154 219 25 152 201 169 93 85 110 117 81 34 105 130
574 130 80 38 136 165 133 34 112 99 39 99 212 264 141 160 89 135 153 40 148 242 162 89 202 180 225 305 32 127 194 161 68 49
274 49 136 24 4 155 130 37 156 123 118 129 187 170 210 290 106 127 168 91 101 77 66 25 28 114 35 273 304 328 246 176 218 129 246 42
-45 42 196 238 267 119 93 103 61 58 148 183 53 35 40 179 49 94 53 89 102 157 192 102 139 192 40 137 61 233 246 211 186 139 92
-355I2Q8j71M7N5
$$ plain form
-355 92 180 9 56 111
-393A11
##PAGE=	F1=-7507.47
##FIRST=	17614.246348710370512,	4405.4455391999963467,	0
##DATA TABLE=	(F2++(Y..Y)), PROFILE
4405D6J68K2j34j6JR1j6M7J12j94K5j2J52j26o4k5J2o3K6K19O3k26N6J39k17m4P2j3L9lQ5
4114B22j37P6m7O3Mj8l4j21K17J55k72Pl8N5j3O7Jj23L6M0o5J2j2m6Q0J17j25P6j39j3LJ85
3814B13N0j88K26lk34j8N4ojJ52L9k23J08L2j31L1O6R3j43p8K7N0K7K5J5pj61J80p3O5l3M5
3513A99q4K1L0M3n5o4J19j8o2K2R9M7j63o1J15j28L5j1j9Q2j16J43J26j64P5j17j1l6J10P
3232A64o2J2o3P9J12l2j25LqJ7lP5j2m6R2m8j11N9j0m2L8m3L1n1O0N4L7n1J91K5j06r0L3q7
2912I2J10j7j12LR4J09j74o9K5O5J15Q3j50j51P2O0p6j1Q3j7J24m2n5J43k62J86j10Qlq9Q7
2621A21m3L4J03L9r9o5M3n1K68r6j19Q5j15j4l6R4N1p6R1K5j46Kp1N5O8L5q8n0Q4j19K58l0
2321B38j57M2m2O2j14J23r0K30l3j38n8J7J67q1p3N0n3P7l5j4K19j7k25n8K5L7R8q4p5J39
$$ plain form
4405 46 214 236 102 86 87 178 162 209 321 127 152 140 292 166 102 77 89 26 52 271 334 108 164 303 86 42 114 101 140 137 222
4114 222 85 161 114 177 181 163 129 8 225 380 108 115 77 132 119 186 187 64 100 140 75 87 75 29 109 226 101 177 38 25 28 213
3814 213 263 75 301 298 64 46 100 94 93 245 284 61 169 201 70 101 167 260 117 39 66 116 143 168 183 176 15 195 122 187 154 199
3513 199 115 136 166 209 154 90 209 191 129 151 250 297 134 73 188 60 95 84 65 147 31 174 300 136 211 94 83 47 157 164
3232 164 102 114 51 130 242 210 85 88 80 97 94 169 157 111 203 155 44 103 93 51 89 46 77 26 86 140 177 126 317 342 236 146 179 92
2912 92 202 185 73 76 170 279 105 36 61 126 241 324 174 23 95 155 79 68 151 134 258 216 161 304 42 228 118 126 123 34 121
2621 121 78 112 215 254 155 90 133 82 350 254 135 220 105 91 55 149 200 124 215 240 94 96 25 80 148 183 95 45 129 10 268 238
2321 238 81 123 81 143 29 152 62 292 259 121 63 80 247 166 93 143 90 167 132 118 337 320 95 37 62 99 197 113 38 177
2039A77R4J4q9J41k31JJ06r0N5m8lM8O9j46n3O7RJ05R9m5j15k5J63j54Rl0P0N3j59N5J37j12
1739A72o6lJ43L6Mj33l2P4J10j25on6p8Q0J38j85J11q9J1J16p5l2m7ql0L3LJ61J05K50m04
1448A78k1Pp8k8MO9K32k25j10K19j50N6m2p1qO0M3kM7j45J3J18m8O2n2m1P2k3n4O0Q3j24l7
1138F4R5j40J04n8O3K5q4O3m8N3K4J1j4m7N7J14o4j22O0pM6o8m2J45j29P3N5r8k0p2J05mJ1
828A51n7JL9pJ3K7p9o5M4j9O5n3mJ06P6j87J17L0o1q1L6J3%l8n4J60j5j15%R1J9j8p4P7m8
499I0m5M8J15J4m7Oj34O1O0r2P3R6l2j01Q3q7O1O2j97L9J08m2q5k4O1l3j2J13l7n6J18p6Q2
189A90r9P3l6J35P2k40O3j2ql3p4L3Mk9N3q2K88M2l1j17j3O4j49J12j90J99J2%o0j50L7L2
-111H6PL3Q4j42l4J4J51q4n3j4J11k3J7Mp8K1N9j37R8n9J64K2j7p9l6m4J27j51j3O1
$$ plain form
2039 177 271 285 196 337 106 107 213 123 178 130 127 175 244 98 45 112 121 226 325 280 165 140 303 149 158 128 198 251 92 147 284 172
1739 172 106 103 246 282 286 153 121 195 305 180 174 118 40 120 258 73 184 95 106 222 147 115 68 60 30 63 66 227 332 582 178
1448 178 157 164 86 58 62 131 363 138 28 247 97 153 111 40 32 92 135 133 180 35 48 166 118 180 128 87 159 136 82 142 225 101 64
1138 64 159 19 123 65 128 153 69 132 84 137 161 172 158 111 168 282 218 96 156 149 195 127 85 230 101 174 229 131 111 39 144 140 151
828 151 94 95 134 127 140 167 88 23 67 48 113 60 56 162 238 51 168 198 137 56 92 105 105 67 13 173 158 43 43 134 153 135 61 138 90
499 90 45 93 208 222 175 181 47 108 168 76 149 245 213 112 195 108 169 231 34 73 181 139 54 30 91 58 46 159 122 66 184 108 190
189 190 91 164 128 263 335 95 158 146 138 105 31 64 68 39 92 10 298 340 309 192 179 243 94 206 16 215 227 227 167 17 54 86
-111 86 93 126 210 68 34 48 199 115 62 48 159 136 153 157 79 100 159 22 120 61 225 247 230 151 115 71 198 47 34 95
-393I5
##PAGE=	F1=-7578.24
##FIRST=	17614.246348710370512,	4405.4455391999963467,	0
##DATA TABLE=	(F2++(Y..Y)), PROFILE
4405C5J80j2j55L8j4N8k7N5Q2j37N0l8J02n0j4l3m1n7J8J96N1j86R6J31k16q0K9K5M3K5R6
4114B50j57M5l1N4l9j1J8j07J86J16l01Q9k0L9KN8l2j07K1N4j7k7L4n0J2J23q0M9j13l2L1
3823E7J30P1k02K43K5k83N4K0om5J24M1k08J29M7r2lP4R1j42n4LN9MnQJj14J71r8Q9o7O7j04
3504H5O5ML0k1m7J07k8p7L8J27J4j26l9O1j20K4K6k2P7j27J22J05j49N9o5j0j00J38j9l9K5
3213A18o3N8J10nj21Pm5K3J4J04%m4pl9l9K3k5LL2q4L0K2M0M4Q9j26J87J0j60l1P1j41J55
2903B10oj86R2J03O1j54p7L6L5J24N6j20j54J28J1j16O4P6m5P0L4rR7k83J78p8j03J9k2R8
2621A39n0J9N6P8m9j10jJ2K62r7r8P0j75J1j0J7M0QR5rq6o8k6L6J00J7p6p4M1K0J55m6j64
2311C7P5n5P6q4J12j06K07nj45l7mJ70o5j10P1q2J10l8k3K31j3k31n4N4rR1n6m2O7J00Pn5
$$ plain form
4405 35 215 203 48 86 72 130 103 158 240 103 153 115 217 167 153 120 79 22 40 236 287 101 197 328 112 32 61 86 129 154 250
4114 250 93 138 107 161 122 111 129 22 208 324 23 112 92 131 133 191 159 52 73 127 110 83 117 67 79 202 122 171 58 26 57
3823 57 187 258 56 299 324 41 95 115 109 64 188 229 21 150 197 105 102 176 267 125 71 74 133 137 132 140 141 27 198 100 189 122 189 85
3504 85 150 154 184 163 116 223 195 118 156 283 297 171 132 193 73 97 123 101 178 51 173 278 129 188 123 113 13 151 132 93 118
3213 118 55 113 223 218 97 104 59 82 96 200 200 156 149 110 71 94 69 72 104 20 50 72 112 156 245 119 306 316 156 125 196 55 210
2903 210 204 18 110 213 274 120 43 79 114 238 294 174 20 148 159 43 107 183 138 208 242 233 330 47 225 147 44 63 41 139
2621 139 89 108 164 242 193 83 82 94 356 259 161 231 56 67 57 74 114 122 217 208 122 54 28 64 164 181 105 31 72 92 247 201 37
2311 37 112 57 133 49 161 55 262 257 112 75 71 241 176 66 137 55 165 127 104 335 322 91 37 91 82 173 117 75 142 242 249 194
2011A94J55k52M0R4j16J14j01j3L9P9j55o1Q3MJ58J03j20r3m7J31j25K3kJ0O9j04J4J91j19
1739A93r1j6J21L3L1j31L6OP8r5Q3n9j84J02J07j20O4o4M3R8j08o4l6K7l8P3LJ56M7J86l26
1448A55jk1j01PN6M2K43k63r4J79r8jn4l0NL8J10n7P5j35M3R7j05R4o4m0L7l0m5M9J03r6n5
1138D3P2k8O7j08J6M0l8P5r8J05J2j2K9q3N9J35o5j25N5oL5m5r7J49p2Q1L4o8nj12O9NM6l0
818A35rqn0P9M7p0r7P7m7M7l9K3N8J02j66J03J2q6p0O0Nk4m8J2J91m6j46J0O7J0Qj4K9q4k4
490D7K1J19k3M7k9j50M5R5p0M6Q5J2j32N6j20P7L2p1oQ9l6r6O3o0M2%N8l4OJ01j19J51j81
180F5Q6o5K15N7k81J06o8O6p3r2N0L3n9K0J5K35N1r2j48N5Q4j41M0j16J83l2k7L5j33n6R5
-111A08L3l6J33j52k1j1J67l9j60N9J29n7%k7o7JN9j00P9l4J30L6Qj22lm9J30j20n7P0
$$ plain form
2011 194 349 97 137 231 115 229 128 115 154 233 78 17 100 104 262 365 245 152 105 236 111 134 132 142 211 107 121 312 193
1739 193 102 86 207 240 271 140 176 182 260 165 248 189 5 107 214 94 158 94 137 235 127 63 27 54 16 89 92 248 295 481 155
1448 155 154 133 32 39 95 137 380 117 23 202 104 103 49 19 24 62 172 115 190 55 98 195 90 184 120 80 117 87 42 91 194 98 43
1138 43 115 87 154 46 62 102 64 139 41 146 158 146 175 92 151 286 221 96 151 145 180 135 38 187 115 196 230 162 157 45 114 119 165 135
818 135 126 118 68 147 194 124 27 104 57 104 65 88 146 248 82 185 197 111 41 101 106 82 34 46 237 191 45 55 122 132 140 126 155 71 47
490 47 68 187 164 211 182 32 77 172 102 148 233 245 113 169 49 126 158 87 81 170 134 38 101 41 83 83 141 107 113 214 95 246 65
180 65 151 86 301 358 77 183 115 181 108 16 66 99 40 60 75 310 361 269 121 176 260 119 159 43 226 194 167 202 69 13 108
-111 108 141 105 238 86 65 54 221 182 22 81 210 153 153 126 59 60 119 19 98 64 194 230 238 116 113 64 194 74 17 87
-393H7
##PAGE=	F1=-7649
##FIRST=	17614.246348710370512,	4405.4455391999963467,	0
##DATA TABLE=	(F2++(Y..Y)), PROFILE
4405C2J75k6j57P6m2J9l4N9L1k5M5n9L6L3M0m2r5k1j9J56M5j49J22J22j81j16KL9L7N3J04
4114B60j51Mk1O6r2j3N8o1J31P1j72M3k6K2K1L5n7l1KM2j4o6Q4l8k0J07m7Om8n5N0O4P9j99
3795C4K41M3k55R9m8%o9O9M0j12J18L1o8m2R0Q4r4n9j4M2j9j9L0l9KJ06j08P9r3Q3r3J02l7
3485A24J8K2l3Q2j8q9M7J59j3j02k3Rj00L1L5oQ5j64J30N1j19L5j6j8j03R9m3K1J0n5M6R0
3185A92J7j17J9n4J6L6J24rl9j01mK6Rk6L1kp0OO0K5J7J29j64J37J0j84L1Q9j62J71Kj86J48
2875A77P1J6j20n1%OJ28L2q0j07J21l4p9N4O5o3PJ01K8M9k67J42m4j11P4p2J01l3pmJ16lj32
2565H1l3O2K34j03n4M6k02N2lp4L0J06N5j6m8r2KK2J11j0o4j2l3J10N3o4j25P6m1M7l1P7q5
2255G4J55K7j66nj5J56n2j27Q4j17J40k8l9K14lk15m8Q0k1N5m5J4JQ6mj4J51k46N4R8j53J85
$$ plain form
4405 32 207 181 24 100 58 77 43 102 133 108 153 94 130 163 203 161 66 45 26 182 227 78 200 322 141 25 27 66 103 156 260
4114 260 109 113 92 158 66 53 111 50 181 252 80 123 97 119 140 175 118 87 89 131 117 51 135 97 77 184 137 143 95 40 90 154 233 34
3795 34 275 318 63 162 114 114 45 114 154 42 160 191 123 81 171 255 161 102 88 130 111 92 122 83 85 191 83 162 69 152 59 161 124
3485 124 142 164 131 213 195 106 153 312 299 197 174 183 83 114 149 143 228 64 194 245 126 161 145 127 24 123 80 101 111 56 102 192
3185 192 209 92 111 57 73 109 233 224 185 84 80 106 115 89 120 118 48 54 114 139 156 285 121 258 268 84 115 204 42 213 215 29 177
2875 177 248 264 144 93 93 99 227 259 179 72 193 159 80 134 199 136 143 244 272 321 54 196 152 41 115 43 144 111 104 100 216 213 81
2565 81 48 110 344 241 187 233 31 83 80 6 36 142 197 181 133 41 43 65 176 166 102 90 57 167 220 156 31 107 66 113 82 159 74
2255 74 229 256 90 85 70 226 174 47 131 14 154 126 87 301 298 83 35 115 94 149 104 118 119 205 201 187 338 92 146 244 91 276
1955B76j23n4N7L1j10n5P4j7K00J05k00o5m0P9q1K4K5l4O9m5k0K28j03j02l2Q5J1O0r2P1q6
1664A36M8n1J69o1k19O6R3q4K8l1O2R0j38m4m6O7pL9kJ67k19J4k5Q2j9p1L8L8mK34k80j9J02
1354A53m1J24m7j58MJ4J36r9Q6j00N0Q6j44J33q2l3k4k9j6Q7Q0j02j4oR3K9r4l1J0K0M7q7
1053D5J36j6m7P5j25Q0J07n7r8K4PM1k9j28J08mP3J6k9J3j24K0lQ0pk0j9j06J29P6k4j60J21
743A55r0L0kJ0QJ28j43J02kj02n1O0km1m6N4K10o1j18m7N1RL0K5j1j02lk1J34n8J29o1q9O
424I1Q2p2M8N7M0j45L1j15O8L0J7j3L8lr6J11j60R0J3j1%N5P5j51J93j84O0p4K48L6l02J36
124A93j14J30j05m3LM6p0j2J24J54N2j43j62J14R6q2o2k9J29p7m7J28q0q9N6Q4j15J94j65
-149A08j9l3J85mk17Q6J26p5pn2n1K7M7n0J3lO7N5L4j44M0p0J06q1p5P2
$$ plain form
1955 276 153 99 156 187 77 22 96 79 279 384 184 119 79 158 77 101 126 92 161 116 96 324 221 119 87 172 183 243 151 222 136
1664 136 184 133 302 241 22 88 181 97 125 94 156 246 108 64 18 85 78 117 115 282 63 77 52 134 115 44 82 120 116 350 70 51 153
1354 153 112 236 189 31 35 49 185 86 172 72 122 208 64 197 115 82 58 29 13 100 180 78 64 58 151 180 86 55 65 85 132 45
1053 45 181 165 118 193 68 148 255 198 100 124 131 172 143 15 123 119 192 208 179 192 68 88 85 165 158 138 119 13 142 218 194 34 155
743 155 65 95 93 103 111 239 96 198 196 94 43 103 101 60 14 68 278 217 99 52 103 112 142 167 156 54 51 30 164 106 235 174 85 91
424 91 173 101 149 206 246 101 132 17 85 115 132 119 157 154 58 169 9 99 112 101 101 156 231 80 273 89 149 75 323 359 57 193
124 193 79 209 104 61 64 110 40 28 152 306 358 215 53 167 263 181 119 90 219 142 95 223 143 54 110 194 79 273 108
-149 108 89 56 241 237 20 106 232 157 150 98 47 74 121 71 84 81 148 203 237 93 133 63 169 88 13 85
-393H5
##PAGE=	F1=-7719.77
##FIRST=	17614.246348710370512,	4405.4455391999963467,	0
##DATA TABLE=	(F2++(Y..Y)), PROFILE
4405C7J56k2j41R4q0J0k8L8l7J25mn9k5R0Q7n0j41K5m6R3M2j21J37J05j26j05l5L2J8Q1J03
4114B53j33k6k0R5j34J8L7lO7O5l3m7m4J1K8Qo9P0%Km2n9Q5j9k1Q6l4m9N4q6N4LP9j83K29
3786B42M1j67J14j17lm0l2M4J5J04j2p1n9J03P4m0q1k2J3m0%O6q3J06K2q6K4q5O6l8J05p8
3485H5K2M1k5N9J0j00O4J77l0r1j8l6o8M4K8K0J03k27J77j3r6OK1l3o7K5pL9k0l4M1N7K8j03
3166G9L0l8KO8J10k6l1j48N3M0J7k2K8l3j5k9N4K0j5J45j44M1K4j60N8R5j56J59J5j64J77
2875B34L6k0p2n2l8QJ10K2m2o2R0o6m2K9O5o4o3J50M8Qk24Q9k2rO0j36R4nj9n9J38K5j37m4
2556C0Q9J91j14PK4j86P7pn5OJ00%J1l5q4RJ5J03k1p6N9n9J35k4q2n4L8LoJ7M3o5J17N0j97
2227E9L9j2J20m3j20Q4o9P4qn5J78Lj78l1R5k0J0m1O6k8M8k6L2J32k16L2J17j88K60j21j13
$$ plain form
4405 37 193 171 30 124 44 54 26 64 27 152 148 89 64 154 241 191 50 75 29 122 164 43 180 285 159 54 19 51 69 150 253
4114 253 120 94 74 169 35 53 90 87 154 219 186 139 95 106 134 142 73 143 143 145 103 44 129 110 89 175 141 92 146 60 114 117 196 13 242
3786 242 283 116 230 113 110 70 38 82 97 201 189 118 59 162 236 196 115 93 106 66 66 132 49 155 177 91 115 30 96 58 163 85
3485 85 107 148 123 182 192 92 156 333 303 212 194 158 90 134 162 182 285 58 235 222 126 132 153 120 53 78 71 110 90 56 97 154 182 79
3166 79 109 71 73 141 251 225 194 46 99 139 156 134 162 129 114 85 139 159 144 289 145 186 210 50 108 203 47 206 221 57 234
2875 234 270 250 178 126 88 96 206 228 186 124 214 148 106 135 200 136 73 223 271 279 55 144 122 113 173 37 131 126 107 48 186 211 74 30
2556 30 119 310 196 203 227 41 118 111 56 62 162 162 173 138 54 63 78 181 160 84 143 84 219 195 113 59 97 100 94 111 154 89 206 256 59
2227 59 98 86 206 163 43 127 58 132 124 69 247 250 72 41 136 116 126 85 151 123 171 145 177 309 93 125 242 54 314 193 80
1936H0J06q5qkml4K18J17k74l2j0J3k6QN5o6N8Km5K39o3j01m3N7l6Q5m2P2j67K0mK32n6k22
1617D2L3Q7p3loQ6Q3j63J8r3J09J6Mj4J78r6K10l00J0Ko8N6K2p1K10k38M1K5RL25p1l03j6
1307E1J0J15j19P7n1L0R1j60J63r8nr8M9l1J27M7j55M4o5J78lo8m9j8O6j3k7J39m5r0R9j51
1006D0J06N0m0o3j1K8P6l9j01PN2N6PJ8K8j00m0k2J02Qm0Mp2P1J00K0k03J58j27ML0nl8J45
687B09j15J07j0j04m1M6jk7rJ6K08n1p3j22M9K1L0M3l5r8J6m6J46r8J82p4l8J2M2j14P7J3
387A61M8j26Rp5J7Q6M1k0jM2q7J24j78O3K9q9O9P0M2j57J97j18Qm3K22Ok98J39j32J62j20
95I1Ll7M5k0p9K27N6M3j73j09J06R9j9j35K4O8j02o4K04k9j12QJ43j88K60j77l8m1J98K0k17
-196E5M4J24o8j6p2k0P3M6l6m8K1J3P1M1j33O0j01P6m0o9O3
$$ plain form
1936 80 186 101 93 91 87 53 271 388 114 82 72 85 59 67 122 56 114 116 71 310 247 146 103 160 124 209 167 239 72 92 88 320 264 42
1617 42 75 162 89 86 80 166 249 86 104 11 120 136 140 126 304 208 418 118 128 130 62 118 140 69 279 41 82 107 116 441 370 67 51
1307 51 61 176 57 134 83 113 204 44 207 109 104 6 55 24 151 198 43 87 22 200 197 129 80 62 128 115 88 227 182 92 191 40
1006 40 146 196 156 93 82 110 186 147 46 53 105 161 168 186 214 114 74 52 154 162 122 126 54 125 225 245 42 200 73 77 107 102 64 209
687 209 94 201 191 87 46 92 91 64 55 71 279 228 155 33 82 103 133 176 141 43 59 13 159 61 243 169 131 143 185 71 148 161
387 161 209 83 92 17 34 120 161 141 140 182 95 219 41 104 133 44 113 183 225 68 265 147 155 112 334 340 42 181 49 211 91
95 91 94 57 102 82 3 230 286 329 156 47 153 252 233 98 122 190 88 24 228 199 87 95 238 50 310 133 95 54 252 272 55
-196 55 99 223 155 139 67 47 120 166 130 82 103 116 187 228 95 155 54 130 90 21 84
-393H4
##PAGE=	F1=-7790.53
##FIRST=	17614.246348710370512,	4405.4455391999963467,	0
##DATA TABLE=	(F2++(Y..Y)), PROFILE
4405E4J21j2j26J09j16L1mJ7J9J07o2l9j6N7J17n2j71O7n8K7L5q6J34P6p3p0o6L7j3J04Q8
4114B36j12m4k2J24j35L9rN4MJ41jj31m8NNon9J55nl8p7PK0Ok0Q8m5j03J66j13M3m3P3j13
3795D2J72J3o1J20j49j9j3o0%R0J11n7q1j6O6O7j6r3l2j8n2N1P5k4J11o0m5n7L1o6M1P5r5
3485E1O2J3k5M3M5j15R9J67m2q2k4p1k7N1J8N1J20l01K47n4r6k3M0n1k4m2J03k6m3jL6J2K6
3175A37p4M4j6j0R9O4l9k1j13N6L1L2j2J1n6N0o9K7L2m9J36p0p9M2q5K7R8j39J35L7j64K04
2875B66J0m2k2o7m8J9O1K9j7l1M5p3k7J0P6m5j19J60M7k2j67M2k2R2L5j66P9K4j9m4R2L0j24
2565F2m0R2J43j29P7J1j81J00Km4J8O2n0N5l0r2K3J6Q3Jj23J16n6J37p4r6rMN9k4K2J7o2J05
2246A95O3k22P9lP7m4r1P0j3mJ0o9J41kj24rJ01k4k9mP6k3ko1Q3J03j63k9J41k02L20j11j75
$$ plain form
4405 54 175 163 37 146 30 61 57 74 93 200 138 99 83 140 257 205 34 101 43 70 105 19 153 229 156 86 20 57 44 148 236
4114 236 124 80 58 182 47 86 77 131 135 276 275 144 96 101 106 100 41 196 191 153 76 83 103 109 89 177 132 29 195 82 125 82 155 42
3795 42 214 227 166 286 137 118 105 45 45 135 246 189 108 92 158 225 209 116 84 66 14 65 140 116 227 167 122 65 96 30 71 146 51
3485 51 113 126 101 144 189 74 173 340 298 216 192 121 94 145 163 214 334 33 280 226 130 107 147 96 72 30 133 107 64 63 99 111 137
3175 137 63 107 91 81 180 244 205 184 71 127 158 190 178 189 133 183 114 141 173 124 260 190 111 153 68 95 193 54 189 226 62 266
2875 266 276 234 212 145 97 116 177 206 189 158 203 130 103 113 189 144 25 185 232 210 43 85 63 155 190 24 103 127 108 64 156 186 62
2565 62 22 114 257 128 205 216 35 135 137 93 111 173 123 178 148 56 79 95 178 179 56 172 116 253 179 83 74 78 137 113 135 152 90 195
2246 195 258 36 115 112 189 145 54 124 111 107 117 48 189 187 63 54 155 131 102 98 174 151 149 88 171 274 111 82 223 21 341 230 55
1936E5J76j89R4N8j29k9K01J43l13LJ8n1K4j9Q1p4L4K3l4J95qr1n9M5q2J02j2N6j69m1M2K44
1635B94l8k00K3P7n4n5KJ19P0j82P2j01J22K6k5k0J55P7L34m80n8K2j23P6K6j45J72p6Jm2
1354F9P1N12j10m25m9J3O7j13N0Mj3J08j48J66r9L2p0N4q9J56M8j73L3k0J54k5m7p2lR4q1
1063I4L2J45o9j28Q7j49J25qk5m0k7N9J28q4q1m8P1L2NO0M8n9r1k4Q3J5o9M4k4OJ07M7k18
753D4J86j37m2N0qp7J43p9J13j2q6m8K1J9Mll4J79rk4j68M2L4NM2m3q0L7k4J25j31J98o5k3
433A49M3K3j92J08l0M0p3pl2RJ07K9l6k5Q5p9J23j75L3M7j27J15N3J2j38J65l0l5MJ73k6k69
133D4J00r1J33j10L3o7M8O7j42K82m4K2j78qM8Q9L5j62K9J1p4k0J73J0j30k7J88k29L04j76
-149A58p1l7J97L5k09j9J32l2l3p6J4R8M7k7r3L1J3O8J6j02O0j32M7Km9M3
$$ plain form
1936 55 231 42 136 194 65 36 237 380 67 70 88 37 61 42 123 49 83 106 72 267 259 168 109 154 72 174 162 218 49 8 50 294
1635 294 256 56 79 156 102 47 49 168 238 56 128 27 149 175 150 130 285 362 696 216 158 180 57 133 159 14 186 110 111 69
1354 69 140 652 542 117 68 81 148 35 85 89 76 184 36 202 103 135 65 119 30 186 234 61 94 74 228 203 156 84 81 175 94
1063 94 126 271 202 74 161 12 137 129 104 64 37 96 224 140 59 11 82 114 119 179 227 168 77 53 136 151 82 126 102 108 215 262 44
753 44 230 93 51 101 93 16 159 80 193 181 95 47 68 87 91 88 54 233 224 200 32 74 108 113 155 112 32 69 45 170 39 237 172 149
433 149 192 215 23 131 101 141 68 61 29 38 145 174 138 113 198 119 242 67 100 147 20 135 188 200 62 227 197 162 166 339 313 44
133 44 144 53 186 76 109 42 90 157 15 297 253 275 97 89 137 226 261 99 128 139 65 45 218 228 98 71 259 30 334 158
-149 158 87 50 247 282 73 54 186 154 121 45 59 157 204 177 84 115 128 196 212 110 170 38 85 87 38 81
-393H1
##PAGE=	F1=-7861.3
##FIRST=	17614.246348710370512,	4405.4455391999963467,	0
##DATA TABLE=	(F2++(Y..Y)), PROFILE
4405G6Q0qr4J05j39L5J9K7O3O6j10j1K0nJ23m7j74R2o5j1J5mQ5L2m0l0p8N8k1J03O0j00n6
4096F6k2J41j11J9j9J00m5K47m6k01k6Qn0%k0J90k0o5j00O7m1L4l1J10p2o8J80j29K6o4N8
3804A16l9J16l0M2J14j41l0k1k9m8R4J33r3o1L6J0N1k7p6n3l7J2M1M5O8R5j13j8q9J01j34
3513C5M7L0o9J01k1l9K5P5j29J41J32n3o3l8r8J6N4NQ4J23l19K75o5j08m4L8o7J5n0J57j02
3222H8m0L5K5l8Nl3O7Lk4J22Lm3kp5L8K2M6Omp2J09j09qO1p6J04L1j69M3l0j3R9j07J00O2
2894B26j76K18kn4K3p8j4RoM4ok1km4m4OR4j0q4N9L1l8j12O3k3R9Kj26K9M6plL0J3r2j5N8
2546I3J02j37J35Qj98J20K3l7K2M3q3Q7j9j19M6K7N5M7j80J37k4J28j05j03Kj8J21Kk3Jp4
2255G9J10O7k00Q5oM3n6n1M2L5o0J0p6J16j0o5NJ03m0m8O1M5jm4q9J20O8j03j00J51j42L09
$$ plain form
4405 76 156 148 54 159 20 55 74 101 164 230 120 109 129 124 247 200 26 118 53 42 57 53 138 170 130 100 22 80 59 162 222 122 66
4096 66 44 185 74 93 74 174 129 376 330 129 103 111 61 61 41 231 211 146 46 113 72 106 75 185 113 45 225 96 122 58 116
3804 116 77 193 163 205 319 178 148 127 98 50 144 277 184 123 159 169 220 193 117 64 27 39 80 125 193 288 175 157 68 169 35
3513 35 82 112 43 144 123 84 109 184 55 196 328 275 212 174 76 92 146 151 235 358 39 314 249 141 97 135 68 83 33 190 88
3222 88 48 83 108 70 75 42 109 112 88 210 213 170 168 93 131 153 199 205 201 129 238 129 121 182 106 210 241 72 115 85 72 171 64 164 226
2894 226 50 268 266 212 235 157 143 152 146 190 184 163 161 117 73 79 173 163 79 138 169 131 19 82 59 158 160 34 63 109 102 99 129 142 50 35 93
2546 93 195 58 193 201 3 123 146 109 131 174 91 178 159 40 86 113 168 215 35 172 148 276 171 68 70 52 173 175 152 153 79
2255 79 189 256 56 141 135 178 122 71 113 148 88 98 22 138 128 63 68 171 131 83 144 189 188 144 55 175 243 140 40 191 49 358
1955C58j02k26K52j04M5R1k83MJ53J72k70%K0o4K4k4P8n1JJ5K4Q9M7p4q2L8r5J08k1M2n7m3
1654F5j4J79j1j49L3N1j7j03k6J53N4j82R3o3J09K3n4j5Q8J67L36m68m2K8j68N9N2r6L5O8
1372A85n2p6J34O37j53n03q7J0J4p8RN1m9J08r2J18p8O3n8O5j46J65Q0j29n3M2J02k9l9r9
1091F2L7J12j33P9J49r1j45L9q5J02n1j7m5nR6J65j50m7mK0j3j2R2Q1k6j22pL6J6r9Q3K0k6
781A11Q3N3k05J94r9r8L8J3o1O7l2J09ln3p5qO3K3j7o5J05O9J7j63J8L9m1L4m1n8O1j7J22
471A83j54J96l9n5Q7L0j77K0o3L5j1j0L1L6N0J8n5m3J14p7J22j52%O5p1O9K2pr9J01N3n6N7
161B20J24n9k25K7%O1p7L7q2P1J43k16L13j26nj63P5NO7P5j46j3l4J1NJ09L0j36l4J95k18
-130C4K98j56r5l2J78L8k00m1J05K4n4k2KR7L5j3j17K5N1N8k3o8N1j53K5M0l0K2
$$ plain form
1955 358 256 30 282 178 223 314 31 35 188 360 90 90 110 46 70 46 124 73 74 89 113 202 249 175 93 131 36 144 123 165 108 65
1654 65 51 230 219 70 103 154 137 34 8 161 215 33 126 63 172 195 141 126 214 381 717 249 207 235 67 126 178 82 117 185
1372 185 133 57 191 828 675 172 85 95 109 31 40 91 42 150 58 176 98 161 103 168 22 187 267 138 85 127 229 200 161 62
1091 62 99 211 78 157 306 215 70 109 24 126 75 58 13 8 104 269 119 72 68 88 75 63 155 236 210 88 81 117 133 34 117 137 111
781 111 194 247 42 236 137 39 77 90 29 96 64 173 170 117 42 34 97 120 103 38 143 212 229 66 84 123 82 116 75 17 78 61 183
471 183 29 225 186 131 218 248 71 91 28 63 52 42 73 109 159 177 122 79 193 116 238 86 86 151 80 149 171 164 65 166 219 163 220
161 220 344 285 60 87 87 148 71 108 26 97 240 24 337 211 206 43 118 123 190 265 119 106 72 83 88 197 227 91 57 252 34
-130 34 332 176 81 49 227 265 65 24 129 153 99 77 79 176 211 198 81 106 157 215 192 124 175 22 47 87 57 79
-393G9
##PAGE=	F1=-7932.06
##FIRST=	17614.246348710370512,	4405.4455391999963467,	0
##DATA TABLE=	(F2++(Y..Y)), PROFILE
4405I8L6j0m3Q0j41J3N1L0P8L8j31J6M5n3J05l2j44Q8o7j3j9O5M7pm3Jn4P3j4R2L7j02o7j4
4086C9J35o2m2J1J27p6L30j20k49K3J8p6nLJ84m0p2j11J11o5N1n3J36j04J3J23j37J6m2K5
3804I1QP5p0J24R7j11l3m9lp8P5J59j17pO1l2K0n5l2q0OK9K8j7J61Q0j25k3o2J07j35oj9j1
3485E6J05j7o5OR0j29J60Q8o6k6n2j19N6M4lJ17J03k54K31n1j18m2J4o0K2l0J56j58oO1J2
3194A25q2j0k4J09J4m6J33n2m0L1n9MJ8N2L6qq0J44j38m2J02q6O0J26j94J5k4m5R3n8O3P9
2894B16j79K10mo0N5p5L1qo6N8j4k5l1J6q0K1R1L6m5m8Kl2k2J05Jk8l5j8m6N4OL6k2om2MP
2546F3P4q3J14J7j31L9M1k7J2M7q3P5jj34N6N2J8R4j88R7K5J22j30j02j5k1J77L6q1j2r1J17
2246A77P0j48Q0l5K4p1olP3p3k0n3Q5Ll4OJ10p1l0J05LK8o4p1J07L4o0j21J08o9K80r3k37
$$ plain form
4405 98 134 124 81 161 20 33 84 114 192 230 99 115 160 107 212 180 36 124 57 44 25 90 137 130 87 88 34 107 93 185 222 120 53 39
4086 39 174 112 70 81 208 132 462 342 93 116 134 58 53 56 240 200 128 17 128 63 114 61 197 93 106 229 92 108 66 91
3804 91 99 174 104 228 325 214 181 132 129 51 126 285 168 161 222 190 210 155 123 43 49 78 106 89 250 330 205 182 120 227 92 86 67 56
3485 56 161 144 79 85 175 46 206 294 228 202 150 31 87 131 128 245 348 94 325 274 156 114 128 68 90 60 216 58 52 113 125
3194 125 43 33 9 118 132 86 219 167 127 158 99 103 121 173 209 201 121 265 127 85 187 101 161 287 93 108 84 39 132 74 137 216
2894 216 37 247 243 183 238 163 194 186 120 178 164 139 108 124 44 65 156 192 147 99 101 69 47 152 153 125 90 72 26 80 86 122 100 94 52 56 63
2546 63 137 54 168 185 54 93 134 107 119 166 83 158 157 23 79 131 149 243 55 152 177 299 169 67 52 31 208 244 163 151 60 177
2246 177 247 99 179 144 168 97 91 88 161 88 68 15 100 103 69 75 185 114 84 189 192 220 156 85 192 226 166 45 153 84 364 271 34
1936C4K98j2K6Q3l88MR5J90j94k3J5o7J5oN3j7l3LQ4l1Q4m7j11L0m8Q6o2M1N5n9l0P5J8p6
1617H5N2J5K2j16rR2M4j19L9rR4J0q4JqK50K12l46J8K8j47k2R0l8k6J06r1o5J72O89j96n22
1316B21j17Jl2mm2O2k1M1j3L2l3P9o1P7j85J52J31o1j59J00L9j3m6j20Q1J19j54J07J46j12
1034B15j39j6j0O6o5pJ7j2P5J77k17K7PJ3m7p1R8J35j6j35QmJ8p5O4N0j6K7M1j45J55k1j25
725G2l1N9m7j1K4P6K4j8j23j5J05K7m2k2n1J73M0j42OL6r2L2m3k3P1l0J29j66J95Lj39J42
424B19M3j17j12J8J3k6jR7M3k2K4n0o0R7q3J31j11m2Q6k3K2ono6K7J07m5J08Q1q2j83n3R8
114A27Ln6K4o2Q6J89k82L13j79k5j26J17j5L8J04j01p2p5Q8J2O0L3j23%J40j73K49j08q7m7
-167E2J46K7j95R1n5Q6o5N5m0Q0Pmj12OR1N4n7m0M7j53OO0j7J5
$$ plain form
1936 34 332 320 346 429 41 45 140 330 136 113 128 61 76 70 123 106 73 76 160 129 213 166 55 85 37 123 61 102 157 98 68 143 161 85
1617 85 137 152 174 58 49 141 185 66 105 96 190 200 116 117 109 359 571 225 243 271 124 102 192 154 128 234 143 78 250 939 743 221
1316 221 104 105 73 69 27 89 68 109 96 128 95 174 113 190 5 157 288 227 68 168 207 194 148 28 109 228 74 181 327 215
1034 215 76 60 50 116 51 44 61 49 124 301 84 111 118 131 84 13 111 246 230 95 103 99 117 42 106 156 140 167 208 63 218 197 72
725 72 41 100 53 42 66 142 166 148 25 10 115 142 100 78 27 200 240 98 104 140 48 80 37 14 85 55 184 18 213 216 77 219
424 219 262 145 33 51 64 38 37 134 177 155 179 129 69 166 83 214 103 61 147 124 146 140 135 69 96 203 158 266 347 265 82 29 127
114 127 130 74 98 36 122 311 29 342 163 138 12 129 114 152 256 155 83 8 96 108 168 201 78 78 218 45 294 186 99 52
-167 52 198 225 30 121 66 152 87 142 102 182 189 185 73 79 170 224 167 127 174 21 27 87 70 85
-393H5
##PAGE=	F1=-8002.83
##FIRST=	17614.246348710370512,	4405.4455391999963467,	0
##DATA TABLE=	(F2++(Y..Y)), PROFILE
4405A12lj6J1N2j32L5M4LO8K6j21M1N3q0P3rj02O6o3rk2Q8K1j7n9moQ2oP4L1j02q0J2Q9J0
4067A60j31P3J25r0L69j94k59P5L6l6n1j1J55n5n4p8J09n1M4p5J48j28P2N6j39L0Jj2J4M7
3786A50p7J64O6p3l6p4J6r6N3J82j32N1P0n2k9o7Lq3N6MM6q2K18O7j02n1k0Q8j27m9m5K5Q6
3476A50J2r4J0P8r4J33N0q5K7n9j01N6K1oJ42O2j55J59j5j22k1j4l9Lk9J33j78L6Q3Jr5N5
3175A04o6R4K0p8J31q8l2Q2m7o1J4L9P7J0q6J41j43n8J35p5L5J70j95kn2o2P0lL6Q2j52J75
2875B15lo7P2n8O2j3r7N2l5k8nN1p1J5N4P9j3j12l7J5L3J17J6j72o8J16p0QLP6n2j9MJk1M9
2537I7nM3L3n3l2K3j2j3O9m9J7J3j04L6Q1j6J22j63N3N9J28j57r6m0j5K19N9j31k9j00J14
2246A51P5q1Q5r9K4p6L5n9R3m3o9J4K3L8l8JJ19j08J9J06l4O1n9m3Q5Ln0r6L8j4K55q2k09
$$ plain form
4405 112 109 93 104 156 24 59 103 106 174 200 79 120 173 93 166 157 55 121 58 49 27 115 136 119 60 56 50 132 126 200 231 129 49 61 150 160
4067 160 29 102 227 137 506 312 53 128 164 128 77 66 221 166 112 34 143 92 136 61 209 81 153 209 70 100 101 89 103 150
3786 150 73 237 303 230 194 120 136 40 93 275 143 194 264 212 183 116 119 36 92 96 142 60 278 345 243 192 172 260 133 84 39 64 150
3476 150 162 68 78 156 62 195 245 160 187 128 27 83 104 98 240 302 147 306 291 169 148 134 95 98 69 202 24 60 143 144 49 104
3175 104 38 132 152 74 205 117 85 167 120 59 73 112 189 199 113 254 111 53 188 113 148 318 123 121 69 7 77 74 110 192 40 215
2875 215 212 145 217 159 221 208 111 163 128 100 95 146 75 90 144 223 210 98 61 76 109 226 242 70 2 118 48 56 59 135 83 64 68 69 48 97
2537 97 92 135 168 115 83 106 94 81 150 101 118 131 27 63 144 128 250 87 140 199 327 170 74 34 19 238 297 166 137 37 151
2246 151 226 145 230 131 155 79 114 55 148 105 36 50 73 111 73 74 193 85 104 210 176 237 178 135 220 223 173 77 115 101 356 274 65
1936F5L10N6M4M3m20l6N4J72j16m5J5q5K2J6K8J5p1J3J14j14P7j2j25PL4M8o6M3R1q6k7NK6
1626I5MP2k2N1j20K3ON3m4l9L2Q3jj06J5n7L58K3k44O2L4r0j17J24J0l6P9j09l6J87O75k28
1326G37m85j26lm9N4o2J7K5m1P0p0K9P7q2R3j66Q9J92J0k58J45k6J8o6p3N8J16j46J19J35
1044C31j30j13k1JM0o6J9P7m2M1J69k62J24qJ4n2n4j5K01l1j26J3l0K8l2L4M9J9m2K0l7O0
743A79P8j40r0Q8n4oM1PO7J0j66K6Q9K8o9N5m4R2M4j22J4K1j17L8n7J5P0o4J38j50J85N6k59
433CJ96M3m1j57P4Pq1MJ48L2r3N6qo8Qr1J46n5r4J07J1k9pJ1m9m3J20JJ48M6r2j50k8Q8rq0
95G4L0l7P8K11l21K74j97k8l9Q5j2J1J16m7q5m2J8J2L2K5q1M8M5j21J78m3n2p1J09nj36J86
-205B15j72J06n4J12q8O4l0j5o7j2R9N6p1k4N0j45OM7oK4
$$ plain form
1936 65 375 431 475 518 98 62 116 288 172 127 142 57 79 95 123 138 67 80 194 80 157 145 20 27 61 109 43 86 177 91 64 69 95
1626 95 99 171 149 200 80 103 109 162 118 79 111 194 193 87 102 45 403 426 182 244 278 188 71 195 205 169 248 139 103 290 965 737
1326 737 252 126 123 74 128 66 83 108 67 137 67 96 173 91 184 18 107 299 309 51 196 170 188 122 49 107 223 77 196 331
1044 331 201 88 67 68 108 42 61 138 96 137 306 44 168 160 174 122 68 53 254 223 97 110 80 108 76 110 159 178 136 156 119 179
743 179 257 117 27 115 61 55 96 103 170 180 14 40 129 157 88 143 99 191 235 113 127 148 31 69 12 27 97 33 171 21 206 262 3
433 3 199 242 201 44 118 125 44 48 196 228 135 191 183 115 123 32 178 123 29 136 147 118 111 122 73 30 150 151 299 345 253 103 75 163 154 74
95 74 104 67 145 356 35 309 112 84 45 130 118 129 245 198 113 71 89 101 133 158 77 125 170 49 227 184 132 61 170 165 29 215
-205 215 43 149 95 207 119 183 153 138 71 59 158 214 143 119 169 24 30 77 71 95
-393I5
##PAGE=	F1=-8073.59
##FIRST=	17614.246348710370512,	4405.4455391999963467,	0
##DATA TABLE=	(F2++(Y..Y)), PROFILE
4405A11k9k1N8L4j23R1J8n9M0K8q1O4M1q6L9K7q1M2n5j1pQ5Nml3l2PQ4jM5L9p8j07N4K2Q1
4067B07j69R8R0q8L60k49j88P6N5J1j02k9J08m2k5l5Q9l9L2r4J52j34R8lj30O9K5l8j7L2l6
3776H4J49L0m1m4p9K5r7M5J84j39Q6P3m8r0k0k7n7R3l3R0r8J93N7o4q7K7N4j09q5j9PN4M4
3466A58j19M9M2l5P0L5j20Q8n5n0K5k3RJ45J2n2Q2L8j25J0l8k8nm2Q5j35M1J01oq4J14r1N2
3157A48J8j09J13j01k1J45j6j03Jm6J22M7q8R7j11l3J21m9M1J53j91mq6lJRL1P0j10J42pp9
2856A02P1l1P2%r2K1o8J1N3L1m3nJ9J08J0j30m7L3N8J07K0k87P2P6o5l4l9J22m8k8J4j4%P
2537G6K5kN1J6m4m6Ll7R0%o5K1n9J3J04l1J21j27M6N8J45j89q1n3k6K46O3j59n4r1R5Q4nR7
2218B85j90M3n2N0q8P2Qq6M2k8O7m9mJ25j41P1P8o3R2k8k2P2k4p3m8k6J0K31n7j76L12Q6Q6
$$ plain form
4405 111 82 61 119 153 30 121 139 80 120 148 67 131 172 86 125 152 71 113 58 47 40 125 130 126 93 61 68 152 151 196 235 157 50 104 126 207
4067 207 38 136 226 138 498 249 61 137 192 203 101 72 180 138 113 78 167 128 160 66 218 84 182 179 49 118 143 105 88 120 84
3776 84 233 263 222 178 99 124 27 72 256 117 203 276 228 138 118 91 34 127 94 184 86 279 336 272 185 212 266 157 72 53 60 114 158
3466 158 39 88 130 95 165 200 80 168 113 63 88 65 74 219 231 179 261 299 174 184 146 118 113 71 156 21 62 163 157 73 187 96 148
3157 148 166 57 170 69 48 193 177 74 75 29 151 198 110 207 96 63 184 135 176 329 138 134 48 45 46 55 86 156 46 188 181 102
2856 102 173 142 214 214 122 143 75 86 139 170 127 122 141 249 259 129 82 115 173 280 300 13 85 161 96 62 23 145 97 69 83 69 69 76
2537 76 101 99 150 166 122 76 79 42 132 132 67 88 29 42 146 115 236 109 155 213 358 169 88 35 9 255 318 159 105 14 109 193 188 285
2218 285 95 138 86 136 48 120 128 42 84 56 123 74 70 195 54 125 203 140 232 204 182 254 230 157 109 83 93 324 267 91 403 489 575
1908E75rm15o6L7J15m6n5K0j20M7L5J0L4j05M8J03j02j7L3o0j9L9K2rL0L9j02k4L6l7P0R0
1607A97m6O5j28O8q6Q3J0q9K9P3%r8QL8L38j01k02N0M5k4j86J37M4l8L9j07kJ80O06k40m07
1316B56j06Nl6P1o9m7N3q5J29j46P4O3j11J05j18J6K49O4l29J74q3N5q8LmJ02j13J13J22j46
1034A73o1qk8K4p7N6J27n7j6J43k32J76k9Rm4k1p3J90n7r9Qm5M7j4L5K3N7j11QQ9o9J76j41
725A59q7N4o8L9M7q1J06L4j53J5O9K9r0J34mj9L4j10M6j2r3K9m0MP3j08J40j13J71J07k16
433I6Q1QL7j21O1jr4%J78Qj50J09M5q0j03pP6Mj14R6K0q0L5K4m8l8L2Q0J62J7q5j29J7N3K
105A91j27P0l2M9K14l12J92j84pJ8N4QoJ06Kn8m9o1MK3J5k5R4n5p9R7L2j3q0P6o5J0J81j96
-214H7N7k8J38j29N6n1o1J6jM6O3o8k1N7j42K3J0RL9
$$ plain form
1908 575 566 151 85 122 237 191 136 156 36 83 118 128 162 57 105 208 106 89 122 62 43 82 104 95 125 164 62 38 74 37 107 197
1607 197 151 216 88 156 70 153 163 74 103 176 176 78 86 124 462 361 159 209 254 230 44 181 225 187 226 119 117 297 903 663 256
1316 256 150 155 119 190 121 74 127 42 171 25 99 162 51 156 38 54 303 367 38 212 129 184 96 99 95 197 84 197 319 173
1034 173 112 104 76 100 23 79 206 149 133 276 44 220 191 200 156 135 62 252 195 96 104 59 106 92 127 150 207 96 104 193 124 300 159
725 159 72 126 58 97 144 63 169 203 50 65 134 163 73 207 203 184 218 108 154 142 49 78 38 42 115 7 147 34 205 312 96
433 96 177 185 222 101 162 161 67 67 245 253 103 212 257 177 74 67 143 147 33 129 149 69 104 128 80 42 74 154 316 333 248 119 136 189 191
105 191 64 134 102 151 365 53 245 61 54 72 126 134 128 234 236 178 129 68 72 95 110 85 179 124 45 142 174 161 81 157 92 102 283 87
-214 87 144 116 254 125 181 130 69 85 84 130 193 125 104 161 19 42 52 61 100
-393A00
##PAGE=	F1=-8144.36
##FIRST=	17614.246348710370512,	4405.4455391999963467,	0
##DATA TABLE=	(F2++(Y..Y)), PROFILE
4405I3m0j4Q5L2j06J34lj35KL8j8Q0J6q0K6N9r3L4n1j4LP3%J4Qj9l7Q0JOM4k5j50J05k9J18
4067B37j55Q7M0p7L10k70p2M2P2M4j43m0N3K0j6rO5l8K2j08J60j26R6l9r0Q7K5n6n8K6J7J15
3767B21lk3n9n7K7q4N4J61j32Q1P4k7j50Q1j21j6J26p3J43q9J30M4k6j20P2J3q0j16J6k1L8
3476H4N0j22R0OK5jN7j74J31l9j2Pq0O6R3k8K5K1J04j34M1n7k7J0m7Om4NJ10po3J62j02KJ1
3147A69j30Q6r4j3K06K0j05No8L2Q9q3K5l8JP9k1O0R7j75mj11N4K8q8M8M8o9J25j3r3N2kN9
2828A76L3o0l3j01J07O0Lk0k4QJ16J9j22m9L0Q6P5Rk65J00M5m9n4m5J14k9n2J6l8M4k3jqO6
2509A34O0k0j01lrO1M3j47O5p3J5J14j6Q7r3O4M0J61k22n3m6m3K31N0j58q1m4L9R9P0J08k82
2208E0P8j5L8o8QO0p4L2o4P7n0mJ22j60J05L6q0J18J9j0O8m7j18K3q2NJ94qj48L06P2J33n1
$$ plain form
4405 93 53 39 124 156 50 184 181 46 48 86 68 148 164 84 110 169 76 110 59 45 48 121 121 135 143 124 87 167 168 174 218 193 43 148 119 237
4067 237 82 169 209 132 442 172 100 142 214 258 115 75 128 148 132 123 188 150 172 64 224 98 194 155 65 152 177 121 63 89 106 221
3767 221 218 195 136 79 106 22 76 237 105 186 260 233 83 164 43 27 153 80 223 134 264 308 282 162 234 247 167 51 67 46 84
3476 84 134 12 102 108 133 132 189 15 146 107 95 102 22 88 181 153 178 199 303 169 210 153 126 136 89 95 51 56 166 159 96 258 156 158 169
3147 169 39 125 31 18 224 244 139 144 76 108 197 114 139 101 102 181 160 220 317 142 138 27 81 109 21 69 117 48 173 160 67 119 117 176
2828 176 209 149 116 15 122 182 185 165 141 149 265 284 162 113 143 229 304 313 48 148 193 144 90 45 159 130 78 94 56 100 77 76 68 134
2509 134 194 174 73 70 61 122 165 18 83 10 25 139 123 210 117 181 221 382 160 107 61 18 249 299 141 60 16 55 154 224 332 50
2208 50 128 113 151 83 91 151 77 109 45 122 72 68 190 30 135 171 91 209 228 218 286 239 121 144 62 67 261 253 105 411 483 616 565
1898E65l84p4L0M6J0m5K7j68Q5M6mL8j13P9O2l9j30P6lk1J0J1K3K8l1m6k8N0q0Q8J01m5O2
1588B26j47J29j66J13L8r6k4O7J2n4k7J13K70j39j55PL6L3k08J22O2m0J4r8K6J54N00k28l06
1316B34o0K2j9O0n6r9L9o3J33j27M1M4r8O9o8m0K91Q9l63J86j17Q3j03O3o2Q1n4P3J16j58
1034A37J9k9n6J8p6Q1J55n1q7J07j36J70m4mk6K0o5R9o3p2Jm7N6k0N6lP9j72L5J83k03K53
734C15j28o5Lo4O8O9j70J22N6j18j1N0L2j01J98J2r6K3j09R9o3m6Nj1j0P4j01Q7p9J67J45
443C53j69j0p6J04o9M3j6p5%J87k2j73J57Q5r1j87J00k3O0r7N6lj02R9K4o5On4J29J44ro4
142B42j15M7K4J2j64J27l9KK04k53Q5j36RM4L5L1j7Q3L7k6o3j01l6K5J0K5J36j27o5K6R8J4
-158A74o2M8j44J58J37j83RmJ36j52O1n0j21J01J8k3O8m8k7N1j41M9m0L1N0
$$ plain form
1898 565 181 107 137 183 193 148 175 7 92 138 134 172 59 138 200 161 31 107 104 83 93 104 127 155 124 78 50 100 20 108 209 164 226
1588 226 79 208 42 155 193 97 73 140 152 98 71 184 454 315 160 167 203 236 28 150 212 172 186 88 114 268 768 540 234
1316 234 174 196 177 237 181 82 121 58 191 64 105 149 51 120 52 12 303 392 29 215 98 181 78 141 79 160 106 179 295 137
1034 137 156 127 71 89 13 94 249 198 111 218 82 252 208 204 178 198 133 232 169 97 98 51 107 87 143 140 219 47 82 265 62 315
734 315 187 122 125 61 129 198 28 150 206 88 77 127 159 58 256 268 172 195 86 185 122 76 81 70 60 134 33 120 41 208 353
443 353 184 174 98 202 133 176 160 85 85 272 250 77 234 319 228 41 141 118 178 81 137 134 32 131 155 90 96 42 171 315 306 242
142 242 127 174 198 210 46 173 134 136 340 87 172 36 45 89 124 155 138 221 258 232 169 68 32 57 67 92 228 101 36 62 160 174
-158 174 112 160 16 174 311 128 137 133 269 117 178 128 7 108 126 103 171 123 96 147 6 55 15 46 96
-393I6
##PAGE=	F1=-8215.12
##FIRST=	17614.246348710370512,	4405.4455391999963467,	0
##DATA TABLE=	(F2++(Y..Y)), PROFILE
4405E6l1J3R0L8q0J46j6j91K5j3M2Q6j0p4L7P8j34O1o2j2NN7lL3L4J2q3P0Kk6K5M6k00J57
4086A78n3J16j30P9po9K36k50K6J8Q4N3j63m7J0J02l2RL1l6Pj02J70j15Q0n2m5Q0J5o8q8K3
3786F0N8Q7k6k1p5j7K9p9O5J41j14M2O9Lj83J76j63k4J44j04J79p9P6K8kj39J07k8l8j48L8
3495F2k8P5Jn8N1RN5l8Q8j54O1j7J1Kr1J01Nl8M4PJ56j46O6p6l0M7l8o6J4k6J02ml2J94j02
3166B07n1%j33N5l6k4K28M8j02K0m1r0J05o2n0N1J4M8lP2K7j38j1j23R3Q0j28RL1l6J10j0
2865A60j02J6K9K0P6j6r4k8J06L4j5j0l4J7J07J4r9m8K2J12K6j5j98R7L1k1o9j3P5k3q7L4
2565A04o4Q7j5p0PP6P1J8j13l6M2K1O7j59J07j10j1J08J5L7p1Q2L6J58k46ol7m7J66K5j31
2274A11n2k0j8J01J25J11k87P8j0J6m1k8Q6o4J3q0P4m4NJ02j58J08jq5J33P1mO7o0j69R8j21
$$ plain form
4405 56 25 38 128 166 86 232 216 25 50 37 79 165 155 81 118 196 62 123 61 49 54 111 108 141 175 187 104 174 176 150 175 221 21 178
4086 178 125 241 111 190 183 114 350 100 126 144 228 281 118 71 81 183 151 160 191 155 162 60 230 115 195 143 98 178 193 125 37 60
3786 60 118 205 179 158 83 66 95 16 81 222 108 150 219 222 39 215 52 28 172 68 247 168 244 272 270 131 238 210 172 24 62
3495 62 34 109 110 52 103 112 167 129 217 63 124 107 118 120 29 130 135 97 141 148 304 158 224 148 118 165 127 61 75 49 151 147 115 309 207
3166 207 156 156 23 78 42 18 246 294 192 212 171 81 186 124 74 125 139 187 184 256 283 145 134 11 104 184 56 65 96 60 170 160
2865 160 58 74 103 123 199 183 89 61 167 201 186 176 142 159 266 280 181 133 155 267 293 278 80 177 208 187 118 105 180 157 70 104
2565 104 40 127 112 42 49 125 196 214 101 65 107 128 195 36 143 33 22 130 145 182 111 193 229 387 141 135 98 51 217 242 111
2274 111 59 39 21 122 247 358 71 149 139 155 114 86 172 108 121 41 115 71 76 178 20 128 127 42 175 246 242 309 249 80 178 57
$$ [...]
-393A32
##END NTUPLES=	nD NMR SPECTRUM
##END=	
##END=	
