##TITLE=	Dec07-2021.10.fid
T Mies TM-VI-199 in CD3OD ; 13C{1H} spectrum using Av500 ; Dec07-2021/10

##JCAMP-DX=	6.0	$$ MestReNova 14.3.0-30573
##DATA TYPE=	LINK
##BLOCK_ID=	1
##BLOCKS=	2    
##ORIGIN=	Mestrelab Research S.L.
##OWNER=	hrzepa
##$MNOVA/LINK_BLOCK_TYPE=	ITEM	$$ NMR Spectrum
##$MNOVA/ITEM/POLYGON=	(XY..XY)
5321,5835
8722,5835
8722,8208
5321,8208
5321,5835
##$MNOVA/ITEM/Z=	0
##$MNOVA/ITEM/ANGLE=	0
##TITLE=	Dec07-2021.10.fid
##JCAMP-DX=	6.0	$$ MestReNova 14.3.0-30573
##BLOCK_ID=	2
##DATA TYPE=	MNOVA NMR VIEW DATA
##DATA CLASS=	MNOVA VIEW DATA
##$MNOVA/ITEM/ZOOM/X=	-40.596698769735169776,	243.39200001155776931
##$MNOVA/ITEM/ZOOM/Y=	-6742.6506500244140625,	72168.9033203125
##END=	
##TITLE=	Dec07-2021.10.fid
##JCAMP-DX=	6.0	$$ MestReNova 14.3.0-30573
##BLOCK_ID=	3
##DATA TYPE=	NMR SPECTRUM
##DATA CLASS=	XYDATA
##NUMDIM=	1
##ORIGIN=	Bruker BioSpin GmbH
##OWNER=	nmrsu
##.OBSERVE FREQUENCY=	125.77036383080600501
##.OBSERVE NUCLEUS=	^13C
##.SOLVENT NAME=	MeOD
##.PULSE SEQUENCE=	zgpg30
##LONGDATE=	2021/12/07 11:36:00.000
##.ACQUISITIONMODE=	SIMULTANEOUS (DQD)
##$ORIGINAL FORMAT=	Bruker XWIN-NMR
##$MNOVA/SCALES_VERSION=	9
##$PARAMETER FILE=	(acqus, ASCII, /private/var/folders/f6/rjf_tdyn2v98c5c0wvkgn4s80000gn/T/QAaPelGLTHy9ahYhOm3Acg/10/acqus, 0)
$$ ##TITLE= Parameter file, TOPSPIN		Version 3.2
$$ ##JCAMPDX= 5.0
$$ ##DATATYPE= Parameter Values
$$ ##NPOINTS= 14	$$ modification sequence number
$$ ##ORIGIN= Bruker BioSpin GmbH
$$ ##OWNER= nmrsu
$$ $$ 2021-12-07 15:06:39.869 +0000  nmrsu@nmrpc
$$ $$ /opt/topspin/data/agmb/nmr/Dec07-2021/10/acqus
$$ $$ process /opt/topspin3.2/prog/mod/shimcntl
$$ ##$ACQT0= -1.89075630252101
$$ ##$AMP= (0..31)
$$ 100 100 100 100 100 100 100 100 100 100 100 100 100 100 100 100 100 100
$$ 100 100 100 100 100 100 100 100 100 100 100 100 100 100
$$ ##$AMPCOIL= (0..19)
$$ 0 0 0 0 0 0 0 0 0 0 0 0 0 0 0 0 0 0 0 0
$$ ##$ANAVPT= -1
$$ ##$AQSEQ= 0
$$ ##$AQ_mod= 3
$$ ##$AUNM= <au_zg>
$$ ##$AUTOPOS= <24 >
$$ ##$BF1= 125.757789
$$ ##$BF2= 500.13
$$ ##$BF3= 125.757789
$$ ##$BF4= 125.757789
$$ ##$BF5= 125.757789
$$ ##$BF6= 125.757789
$$ ##$BF7= 125.757789
$$ ##$BF8= 125.757789
$$ ##$BYTORDA= 0
$$ ##$CAGPARS= (0..11)
$$ 0 0 0 0 0 0 0 0 0 0 0 0
$$ ##$CFDGTYP= 0
$$ ##$CFRGTYP= 9
$$ ##$CHEMSTR= <none>
$$ ##$CNST= (0..63)
$$ 1 1 145 1 1 1 1 1 1 1 1 1 1 1 1 1 1 1 1 1 1 1 1 1 1 1 1 1 1 1 1 1 1 1 1
$$ 1 1 1 1 1 1 1 1 1 1 1 1 1 1 1 1 1 1 1 1 1 1 1 1 1 1 1 1 1
$$ ##$CPDPRG= (0..8)
$$ <waltz16> <> <waltz16> <> <mlev> <mlev> <mlev> <mlev> <mlev>
$$ ##$D= (0..63)
$$ 0 1 0.00345 0 0 0 0 0 0 0.06 0 0.03 2e-05 3e-06 0 0 0.0002 0 0 0 0 0 0
$$ 0 0 0 0 0 0 0 0 0 0 0 0 0 0 0 0 0 0 0 0 0 0 0 0 0 0 0 0 0 0 0 0 0 0 0 0
$$ 0 0 0 0 0
$$ ##$DATE= 1638876976
$$ ##$DE= 6.5
$$ ##$DECBNUC= <off>
$$ ##$DECIM= 560
$$ ##$DECNUC= <off>
$$ ##$DECSTAT= 4
$$ ##$DIGMOD= 1
$$ ##$DIGTYP= 12
$$ ##$DQDMODE= 0
$$ ##$DR= 21
$$ ##$DS= 4
$$ ##$DSPFIRM= 0
$$ ##$DSPFVS= 20
$$ ##$DTYPA= 0
$$ ##$EXP= <c13f>
$$ ##$F1LIST= <111111111111111>
$$ ##$F2LIST= <222222222222222>
$$ [...]
$$ 130000 130000 130000 130000 130000 130000 130000 130000 130000 130000 130000
$$ 130000 130000 130000 130000 130000 130000 130000 130000 130000 130000 130000
$$ 130000 130000 130000 130000 130000 130000 130000 0 0 0 0 0 0 0 0 0 0 0
$$ 0 0 0 0 0 0 0 0 0 0 0 0 0
$$ ##$ShimPowMaxUC= (0..63)
$$ 130000 130000 130000 130000 130000 130000 130000 130000 130000 130000 130000
$$ 130000 130000 130000 130000 130000 130000 130000 130000 130000 130000 130000
$$ 130000 130000 130000 130000 130000 130000 130000 130000 130000 130000 130000
$$ 130000 130000 130000 130000 130000 130000 130000 0 0 0 0 0 0 0 0 0 0 0
$$ 0 0 0 0 0 0 0 0 0 0 0 0 0
$$ ##$ShimPowMaxUG= (0..63)
$$ 524287 524287 524287 524287 524287 524287 524287 524287 524287 524287 524287
$$ 524287 524287 524287 524287 524287 524287 524287 524287 524287 524287 524287
$$ 524287 524287 524287 524287 524287 524287 524287 524287 524287 524287 524287
$$ 524287 524287 524287 524287 524287 524287 0 0 0 0 0 0 0 0 0 0 0 0 0 0 0
$$ 0 0 0 0 0 0 0 0 0 0
$$ ##$ShimPowRcbType= 3
$$ ##$ShimPowRes= (0..63)
$$ 1e-20 1e-20 1e-20 1e-20 1e-20 1e-20 1e-20 1e-20 1e-20 1e-20 1e-20 1e-20
$$ 1e-20 1e-20 1e-20 1e-20 1e-20 1e-20 1e-20 1e-20 1e-20 1e-20 1e-20 1e-20
$$ 1e-20 1e-20 1e-20 1e-20 1e-20 1e-20 1e-20 1e-20 1e-20 1e-20 1e-20 1e-20
$$ 1e-20 1e-20 1e-20 1e-20 0 0 0 0 0 0 0 0 0 0 0 0 0 0 0 0 0 0 0 0 0 0 0 0
$$ ##$ShimPowRng0= (0..63)
$$ 1 1 1 1 1 1 1 1 1 1 1 1 1 1 1 1 1 1 1 1 1 1 1 1 1 1 1 1 1 1 1 1 1 1 1 1
$$ 1 1 1 1 0 0 0 0 0 0 0 0 0 0 0 0 0 0 0 0 0 0 0 0 0 0 0 0
$$ ##$ShimPowRng1= (0..63)
$$ 1 1 1 1 1 1 1 1 1 1 1 1 1 1 1 1 1 1 1 1 1 1 1 1 1 1 1 1 1 1 1 1 1 1 1 1
$$ 1 1 1 1 0 0 0 0 0 0 0 0 0 0 0 0 0 0 0 0 0 0 0 0 0 0 0 0
$$ ##$ShimPowRng2= (0..63)
$$ 1 1 1 1 1 1 1 1 1 1 1 1 1 1 1 1 1 1 1 1 1 1 1 1 1 1 1 1 1 1 1 1 1 1 1 1
$$ 1 1 1 1 0 0 0 0 0 0 0 0 0 0 0 0 0 0 0 0 0 0 0 0 0 0 0 0
$$ ##$ShimPowRng3= (0..63)
$$ 1 1 1 1 1 1 1 1 1 1 1 1 1 1 1 1 1 1 1 1 1 1 1 1 1 1 1 1 1 1 1 1 1 1 1 1
$$ 1 1 1 1 0 0 0 0 0 0 0 0 0 0 0 0 0 0 0 0 0 0 0 0 0 0 0 0
$$ ##$ShimSysFunc= (0..63)
$$ 1 2 3 4 5 6 7 8 9 10 0 37 38 35 16 15 14 13 12 11 28 27 26 25 24 23 36
$$ 22 30 29 20 21 34 33 32 31 17 18 19 0 0 0 0 0 0 0 0 0 0 0 0 0 0 0 0 0 0
$$ 0 0 0 0 0 0 0
$$ ##$ShimSysMatrix= 0
$$ ##$ShimSysType= 4
$$ ##$TFXNUM= 0
$$ ##$TRIPLO2= 0
$$ ##$VTU= 2
$$ ##$VTUETH= <149.236.99.21>
$$ ##$VTUTY= <no>
$$ ##$WBREFAM= (0..15)
$$ 100.1 100 100 100 100 100 100 100 100 100 100 100 100 100 100 100
$$ ##$WBREFLM= (0..15)
$$ 1 0 0 0 0 0 0 0 0 0 0 0 0 0 0 0
$$ ##$WBREFPH= (0..15)
$$ -0.06 0 0 0 0 0 0 0 0 0 0 0 0 0 0 0
$$ ##$WBSGU= (0..15)
$$ 0 0 0 0 0 0 0 0 0 0 0 0 0 0 0 0
$$ ##$XFAC= 2
$$ ##END=
$$ 
##$DECIM=	560
##$DSPFVS=	20
##XUNITS=	HZ
##YUNITS=	ARBITRARY UNITS
##FIRSTX=	30608.396841751193278
##LASTX=	-5105.3439157822776906
##DELTAX=	-0.54495675223214268268
##XFACTOR=	1
##YFACTOR=	0.27621384619093491963
##FIRSTY=	-16.99669647216796875
##MINY=	-181.8410797119140625
##MAXY=	65608.09375
##NPOINTS=	65536
##XYDATA=	(X++(Y..Y))
$$ [...]
14502 6 -1 -17 -29 -41 -64 -93 -115 -132 -151 -161 -145 -111 -90 -96 -101 -79 -36 5 39 68 82 70 38 4 -17 -28 -26 -7 17 21 -11 -61 -88 -63 4 70 96 78
14481 78 44 20 3 -17 -39 -41 -21 -4 -19 -58 -79 -58 -15 17 28 26 11 -24 -75 -116 -133 -139 -146 -145 -121 -79 -40 -14 -1 1 2 14 38 54 43 17 10 32 55
14460 55 48 19 -3 2 36 75 101 112 122 137 144 129 104 92 87 60 10 -25 -19 7 21 14 5 -2 -20 -41 -44 -27 -12 -18 -35 -43 -39 -29 -20 -16 -17 -22 -30 -41 -52 -52 -36 -12
14436 -12 5 7 -4 -23 -41 -44 -34 -23 -20 -18 -8 2 1 -10 -19 -24 -38 -62 -78 -75 -58 -40 -19 1 9 -1 -19 -25 -15 -3 -5 -27 -63 -94 -99 -76 -45 -29 -28 -29 -33 -49
14413 -49 -75 -100 -114 -118 -104 -63 -4 37 45 36 33 32 12 -21 -42 -35 -18 -12 -14 -12 -11 -23 -48 -73 -99 -129 -154 -151 -111 -55 -16 0 9 31 63 83 68 18 -37 -65 -59
14390 -59 -38 -21 -5 10 13 -4 -26 -30 -22 -19 -23 -17 1 11 4 0 10 23 13 -14 -35 -37 -30 -28 -31 -34 -37 -37 -34 -33 -41 -57 -74 -86 -93 -95 -98 -107 -125 -135 -118 -82 -58 -55 -57 -53 -58 -86
14364 -86 -112 -102 -60 -22 -3 8 22 22 4 -2 26 75 103 99 83 76 80 86 85 67 33 3 0 27 76 132 178 188 152 93 55 60 90 120 137 133 105 62 21 -12
14343 -12 -43 -65 -60 -24 19 46 50 35 13 3 21 51 54 20 -13 -11 18 41 45 38 28 16 10 17 27 33 48 84 125 143 132 109 75 27 -19 -39 -32 -22 -14 10
14321 10 59 97 90 42 -19 -68 -93 -96 -82 -50 0 59 85 52 -10 -33 6 64 93 94 89 67 13 -50 -80 -65 -33 -12 -4 -3 -2 12 48 83 93 83 89 118 133
14299 133 107 60 36 44 58 54 42 36 30 3 -45 -85 -86 -56 -32 -26 -18 10 42 44 14 -18 -34 -42 -53 -58 -48 -28 -9 5 21 29 13 -24 -55 -57 -35 -21 -29 -43 -45
14277 -45 -47 -68 -97 -101 -70 -43 -53 -92 -119 -113 -87 -65 -59 -70 -81 -71 -36 -5 -15 -65 -114 -129 -101 -48 2 24 10 -18 -33 -33 -31 -26 -5 24 32 11 -12 -11 1
14256 1 -5 -33 -55 -47 -10 40 85 98 68 14 -29 -49 -62 -86 -108 -101 -62 -20 0 19 67 134 172 145 82 42 45 59 53 34 23 20 14 6 11 27 43 55 70 90
14234 90 102 90 50 -1 -40 -50 -36 -19 -10 -4 4 11 8 -9 -38 -73 -103 -109 -80 -33 4 21 20 1 -32 -65 -72 -45 -2 31 46 47 42 34 28 21 7 -15 -42 -72 -100
14212 -100 -121 -129 -131 -143 -163 -171 -150 -120 -115 -140 -160 -145 -102 -64 -54 -59 -53 -19 31 71 79 56 27 15 17 9 -21 -56 -64 -37 -2 15 9 -4 -12 -3 20 53 77 78 53
14189 53 21 0 -4 -4 -14 -29 -33 -12 21 39 26 5 10 46 91 121 136 144 144 125 89 46 2 -41 -78 -87 -57 -4 37 48 44 53 86 120 124 88 31 -16 -37 -30
14168 -30 -3 28 55 71 78 72 50 19 3 9 18 6 -23 -44 -45 -47 -69 -103 -129 -140 -137 -115 -69 -15 14 11 -3 -6 -3 -14 -41 -60 -47 -4 41 62 47 8 -31 -55
14146 -55 -63 -63 -60 -53 -46 -47 -60 -80 -94 -93 -80 -66 -62 -70 -84 -93 -91 -76 -57 -50 -58 -65 -51 -11 30 48 41 21 -4 -44 -96 -142 -157 -141 -114 -99 -97 -90 -63 -26 -5 -13 -34 -40
14122 -40 -26 -18 -39 -86 -128 -146 -140 -125 -103 -69 -29 -5 -11 -32 -44 -40 -40 -60 -90 -111 -118 -120 -116 -96 -59 -16 7 0 -34 -72 -92 -87 -69 -52 -35 -15 1 13 25 39
14100 39 43 29 14 13 11 -14 -49 -54 -23 3 5 8 45 97 123 116 100 90 80 69 62 58 47 30 22 28 34 30 23 22 25 21 1 -38 -87 -122 -131 -123 -119 -117 -93 -37 25 61 60 42
14075 42 33 49 81 108 103 66 13 -31 -56 -65 -63 -50 -23 9 33 36 26 24 32 34 24 20 31 40 27 7 14 54 102 132 140 137 130 120 105 80 48 29 34 44 29 0
14052 0 -6 22 59 80 97 124 145 141 120 102 85 56 25 13 22 33 35 32 24 5 -21 -43 -47 -39 -28 -16 9 51 93 109 96 81 85 97 88 62 53 69 82 71 50
14030 50 36 11 -41 -100 -131 -136 -138 -131 -88 -14 39 38 1 -27 -26 -6 11 11 -4 -22 -29 -30 -28 -19 -4 -13 -61 -119 -135 -107 -79 -77 -83 -69 -42 -20 -5 2 -6 -30 -49 -45 -32
14006 -32 -24 -18 -6 -6 -34 -76 -103 -102 -80 -39 17 64 78 58 27 -3 -31 -41 -21 11 27 23 29 51 58 29 -15 -42 -51 -62 -81 -88 -72 -54 -59 -94 -134 -143 -109 -60
13984 -60 -38 -58 -90 -95 -66 -37 -40 -72 -100 -103 -90 -79 -63 -18 46 83 62 15 6 47 84 73 26 -19 -51 -76 -86 -68 -31 -3 2 5 12 10 -16 -56 -87 -98 -98
13963 -98 -99 -103 -106 -97 -66 -12 48 91 102 89 70 61 63 60 39 5 -28 -56 -81 -98 -93 -66 -38 -33 -51 -71 -75 -55 -17 18 22 -16 -72 -99 -77 -37 -13 -5 5 23 25
13941 25 -1 -45 -72 -62 -19 29 55 50 28 16 21 27 21 11 12 23 30 28 26 23 4 -36 -86 -125 -149 -169 -179 -163 -108 -25 52 94 85 36 -13 -30 -10 21 37 29
13919 29 5 -24 -47 -47 -21 8 15 0 -21 -33 -35 -25 2 39 63 62 58 71 82 55 -13 -88 -131 -138 -120 -81 -27 18 39 41 41 30 -6 -47 -41 29 110 133 94
13898 94 48 35 38 19 -21 -48 -35 0 23 20 8 11 31 53 61 56 48 42 40 47 62 73 64 36 9 -1 -1 -6 -26 -60 -101 -134 -142 -132 -125 -136 -144 -123 -82 -60 -75 -107
13875 -107 -129 -136 -135 -125 -101 -72 -56 -65 -88 -113 -129 -128 -112 -89 -74 -72 -79 -88 -92 -82 -56 -27 -8 -1 1 -1 -22 -59 -98 -124 -140 -146 -139 -121 -106 -103 -104 -100 -93 -95 -101 -100 -86 -62
13851 -62 -35 -17 -25 -64 -102 -104 -72 -51 -65 -82 -60 0 49 49 6 -45 -79 -87 -82 -82 -103 -140 -166 -160 -123 -74 -32 -8 -11 -36 -67 -82 -71 -41 -13 5 23 56 101
13830 101 136 138 118 104 104 92 54 16 9 27 48 62 78 76 29 -52 -108 -101 -62 -44 -45 -32 0 12 -15 -55 -71 -59 -40 -19 9 35 43 30 14 9 6 -13 -56
13808 -56 -103 -123 -103 -63 -42 -58 -95 -127 -151 -172 -183 -170 -134 -93 -69 -65 -76 -88 -84 -49 5 45 50 38 44 68 73 37 -13 -34 -17 3 -3 -34 -63 -75 -66 -34
13788 -34 9 39 35 5 -19 -19 3 34 61 66 36 -15 -55 -62 -48 -35 -34 -37 -38 -36 -25 0 19 12 -24 -63 -74 -53 -22 -7 -15 -32 -38 -23 0 7 -14 -50 -73 -68 -45
13765 -45 -32 -41 -69 -105 -139 -159 -152 -117 -73 -38 -14 3 15 18 22 40 65 78 72 68 78 93 103 116 142 164 158 115 52 -9 -49 -52 -19 24 45 35 13 0 -4
13744 -4 -7 -10 -5 9 24 28 23 26 40 43 10 -41 -70 -62 -49 -60 -78 -69 -39 -18 -18 -20 -19 -22 -29 -25 -17 -29 -60 -71 -38 12 39 36 20 3 -12 -19 -12 5 22 43 72 88 57
13720 57 -19 -104 -155 -160 -137 -105 -77 -61 -58 -63 -68 -74 -85 -108 -136 -148 -125 -72 -22 -5 -24 -53 -64 -55 -47 -58 -84 -104 -97 -71 -46 -37 -40 -42 -29 4 42 50 13 -37 -56
13697 -56 -32 4 26 34 24 -15 -81 -131 -129 -89 -56 -42 -27 7 55 100 127 120 76 28 7 2 -20 -58 -69 -40 -7 -2 -8 3 27 38 37 49 71 77 57 34 27
13676 27 28 26 26 31 33 26 24 34 45 46 48 65 80 74 60 64 80 67 23 -1 26 73 80 43 4 -9 -19 -46 -86 -120 -142 -145 -126 -101 -99 -130 -165 -177 -172 -171 -180 -187 -185 -177 -166
13652 -166 -151 -142 -149 -165 -177 -176 -160 -133 -104 -87 -81 -73 -56 -41 -32 -21 -3 3 -13 -40 -53 -47 -34 -10 30 74 99 98 79 43 -9 -62 -84 -68 -30 11 50 74 72
13630 72 56 53 72 90 86 62 32 8 0 7 15 0 -36 -60 -53 -32 -18 -11 -6 -14 -41 -66 -63 -33 -5 1 -17 -55 -87 -89 -56 -22 -16 -31 -35 -19 -6 -15 -40 -62 -70 -60 -42
13607 -42 -31 -35 -39 -25 2 14 -1 -24 -23 5 38 56 63 76 102 122 111 76 53 67 96 93 41 -25 -63 -65 -52 -41 -24 10 49 66 57 47 59 79 76 43 5
13586 5 -23 -47 -74 -93 -100 -104 -113 -109 -77 -30 5 18 18 7 -19 -57 -86 -93 -76 -43 -10 0 -19 -48 -59 -51 -45 -42 -22 16 43 30 -10 -37 -23 19 54 59 44 36 43
13563 43 43 13 -36 -75 -86 -84 -87 -90 -78 -43 9 63 98 103 84 57 30 0 -37 -73 -96 -102 -88 -52 -8 22 26 10 -7 -13 -4 18 46 58 39 -4 -47 -71 -81
13542 -81 -95 -117 -129 -119 -103 -100 -104 -84 -37 6 16 6 7 19 14 -19 -60 -81 -76 -58 -38 -26 -30 -44 -47 -25 8 33 36 21 -2 -29 -53 -68 -66 -43 -7 26 45
13521 45 51 44 23 -4 -19 -11 6 16 23 39 55 43 6 -29 -47 -60 -74 -69 -42 -28 -56 -105 -127 -111 -87 -76 -77 -82 -92 -100 -100 -98 -104 -114 -108 -82 -55 -37 -11 33 75
13498 75 86 66 41 26 12 -13 -39 -48 -36 -22 -23 -39 -49 -34 7 56 82 70 35 11 16 42 66 81 94 110 121 123 120 113 96 76 67 72 70 45 14 6 25 45
13477 45 51 52 63 78 78 59 38 32 44 64 78 80 68 46 23 11 9 6 -5 -26 -49 -74 -96 -96 -64 -20 3 -1 -17 -30 -46 -68 -78 -58 -19 11 16 2 -15 -30
13455 -30 -47 -74 -108 -133 -131 -115 -115 -135 -145 -116 -66 -36 -43 -73 -106 -124 -115 -81 -43 -30 -49 -82 -108 -115 -105 -89 -75 -62 -41 -20 -19 -39 -50 -40 -33 -50 -70 -60
13434 -60 -32 -31 -60 -78 -60 -27 -6 3 8 -1 -34 -72 -95 -102 -96 -74 -37 -4 3 -15 -45 -73 -94 -107 -116 -132 -152 -162 -152 -128 -92 -39 19 50 33 -11 -48 -66 -79
13413 -79 -95 -109 -116 -117 -110 -97 -92 -108 -130 -132 -107 -77 -60 -46 -25 -10 -24 -72 -125 -157 -159 -140 -108 -57 8 65 78 43 4 6 46 79 72 46 41 68 100 112 104 87
13391 87 55 1 -56 -78 -52 -10 8 3 -7 -26 -75 -146 -186 -153 -60 33 82 77 40 1 -16 -15 -14 -29 -63 -106 -139 -135 -83 -13 29 26 6 -1 -10 -50 -113 -160 -160
13370 -160 -128 -93 -70 -51 -25 4 22 16 -2 -6 14 38 44 33 18 1 -21 -32 -11 29 57 56 44 39 40 34 19 1 -17 -37 -53 -62 -67 -69 -65 -59 -56 -47 -22 16 49
13347 49 61 51 23 -10 -29 -17 7 5 -43 -114 -171 -200 -202 -175 -123 -75 -51 -43 -30 -17 -23 -40 -42 -24 -13 -22 -34 -28 -13 -9 -11 -12 -16 -36 -64 -83 -90 -93 -80 -40 6
13325 6 18 -18 -61 -68 -42 -14 3 22 44 57 52 41 31 26 23 21 6 -29 -73 -93 -71 -28 6 22 26 27 30 33 30 11 -18 -38 -39 -30 -24 -19 -4 16 22 7 -16 -26 -11
13302 -11 12 19 -3 -39 -59 -54 -37 -22 -4 14 21 9 -4 -6 1 8 12 16 14 7 9 22 29 24 30 59 84 75 45 23 8 -25 -67 -77 -48 -14 1 7 5 -21 -65 -77 -33
13278 -33 24 45 30 10 -4 -16 -7 42 106 135 125 119 140 154 129 80 50 49 49 25 -16 -45 -44 -29 -27 -50 -78 -86 -72 -57 -60 -75 -80 -65 -42 -26 -16 -3 14
13257 14 21 14 8 15 21 16 13 32 50 28 -35 -83 -76 -40 -27 -42 -56 -65 -96 -146 -161 -111 -36 -3 -27 -69 -100 -128 -164 -180 -144 -71 -5 25 35 39 27 -8 -51 -75
13235 -75 -81 -87 -91 -77 -49 -34 -46 -69 -83 -82 -68 -35 7 31 26 20 39 67 71 46 18 8 11 15 11 -3 -13 3 44 68 43 -7 -36 -44 -70 -122 -157 -147 -128 -136 -150
13213 -150 -129 -83 -65 -90 -120 -122 -109 -110 -121 -119 -95 -65 -46 -38 -42 -60 -91 -115 -113 -84 -45 -14 3 11 10 -1 -18 -23 -5 25 40 21 -16 -41 -36 -20 -21 -38 -45 -25
13191 -25 11 41 51 48 48 54 53 27 -17 -52 -60 -58 -69 -86 -84 -59 -32 -9 23 67 91 75 34 -4 -34 -56 -63 -53 -52 -72 -83 -53 -2 16 -12 -56 -86 -107 -131
13170 -131 -150 -148 -121 -74 -20 13 8 -23 -50 -61 -65 -63 -47 -22 -13 -28 -49 -63 -78 -95 -95 -73 -51 -48 -49 -33 -4 18 29 30 15 -13 -37 -33 -8 22 50 73 74 44
13148 44 4 -17 -11 4 15 12 -7 -34 -46 -36 -24 -30 -44 -46 -38 -42 -60 -67 -47 -18 0 6 6 -4 -33 -68 -84 -76 -58 -45 -32 -7 25 38 16 -26 -60 -77 -83 -77 -48
13126 -48 -5 17 -5 -57 -104 -126 -120 -88 -38 3 22 33 61 102 123 107 67 26 -1 -17 -21 -13 3 22 35 42 59 96 137 147 122 93 84 77 50 18 10 22
13105 22 20 -13 -62 -96 -100 -73 -31 0 4 -1 1 16 28 36 48 58 46 16 -6 -11 -18 -41 -69 -85 -82 -60 -28 -3 0 -8 1 39 77 86 58 7 -49 -96 -126 -149 -173
13083 -173 -182 -149 -80 -22 -2 -9 -24 -49 -89 -125 -135 -123 -105 -80 -43 -8 5 3 0 -6 -32 -76 -106 -96 -51 -10 -6 -36 -57 -38 8 34 10 -38 -71 -73 -56 -33
13062 -33 -11 2 10 25 42 31 -31 -114 -155 -130 -83 -58 -59 -63 -68 -80 -83 -55 -9 15 1 -24 -29 -20 -14 -7 18 49 51 26 17 43 60 22 -45 -65 -15 43 55 30
13040 30 16 21 12 -23 -61 -80 -86 -89 -76 -36 18 50 39 1 -21 -11 11 15 -11 -49 -80 -99 -109 -111 -105 -91 -73 -59 -69 -107 -149 -153 -120 -91 -95 -104 -80 -41 -36 -79
13018 -79 -131 -150 -143 -144 -164 -179 -161 -114 -72 -58 -57 -38 5 42 41 15 -10 -28 -50 -73 -80 -72 -62 -54 -35 1 40 67 81 87 87 78 63 40 14 -4 -6 -3 -18 -61 -110
12996 -110 -141 -146 -133 -101 -53 -7 16 18 15 24 38 39 20 -9 -34 -49 -59 -73 -90 -107 -124 -140 -154 -165 -170 -165 -146 -123 -109 -99 -72 -29 -1 -12 -39 -46 -30 -28 -59
12975 -59 -106 -139 -147 -125 -76 -24 -9 -44 -95 -119 -108 -86 -72 -64 -55 -46 -43 -43 -36 -20 -11 -27 -67 -101 -102 -71 -39 -29 -47 -86 -134 -165 -158 -127 -110 -125 -147 -153 -149 -151 -161
12952 -161 -164 -149 -119 -82 -58 -67 -110 -156 -177 -175 -169 -169 -166 -156 -147 -141 -133 -117 -90 -60 -32 -15 -11 -20 -45 -85 -123 -135 -108 -59 -21 -16 -44 -80 -94 -76 -47 -44 -78 -126 -158
12930 -158 -172 -173 -161 -133 -102 -74 -45 -12 13 15 -2 -16 -16 -6 3 5 -4 -20 -29 -20 -3 1 -10 -34 -62 -83 -87 -71 -53 -44 -40 -34 -35 -51 -68 -67 -55 -50 -51 -40 -20 -8 -1
12907 -1 18 47 57 35 3 -14 -15 -11 -9 -26 -70 -119 -129 -87 -31 -3 -6 -24 -48 -73 -81 -63 -42 -39 -46 -38 -26 -38 -76 -107 -105 -83 -72 -85 -118 -153 -173 -171 -158 -150 -153
12884 -153 -153 -147 -142 -144 -144 -131 -106 -77 -51 -28 -10 2 7 -2 -33 -83 -134 -167 -173 -154 -117 -75 -44 -32 -34 -43 -59 -85 -114 -132 -134 -132 -134 -124 -86 -25 19 20 -15 -50 -56 -32
12861 -32 -2 5 -16 -52 -77 -88 -105 -136 -156 -136 -91 -68 -88 -121 -128 -107 -89 -92 -106 -115 -116 -118 -131 -159 -191 -209 -208 -200 -196 -188 -163 -123 -88 -68 -63 -71 -92 -117 -132 -139 -148 -154
12838 -154 -142 -109 -74 -51 -31 -8 0 -31 -90 -135 -142 -126 -116 -125 -144 -162 -176 -178 -168 -150 -133 -121 -102 -69 -27 -1 -14 -58 -95 -92 -64 -55 -88 -128 -125 -67 9 65
12818 65 83 67 25 -29 -74 -90 -87 -95 -130 -179 -214 -215 -188 -150 -121 -108 -105 -95 -62 -13 25 34 22 11 -1 -37 -97 -145 -141 -93 -46 -27 -26 -24 -21 -29 -44 -57 -62 -58 -46
12795 -46 -28 -10 6 18 23 21 20 28 33 13 -29 -60 -41 19 85 123 123 91 54 44 71 100 86 24 -45 -81 -77 -52 -38 -58 -103 -143 -155 -158 -181 -216 -231 -212 -175
12774 -175 -132 -82 -40 -33 -62 -97 -117 -134 -161 -179 -167 -135 -109 -98 -93 -86 -73 -50 -28 -30 -58 -84 -86 -75 -70 -67 -60 -70 -113 -165 -185 -166 -137 -119 -108 -99 -97 -103 -121 -159
12752 -159 -214 -254 -246 -210 -187 -188 -181 -150 -118 -102 -91 -82 -100 -147 -182 -171 -136 -123 -141 -169 -197 -226 -235 -195 -111 -32 7 8 -4 -13 -6 14 35 34 13 1 20 58 74
12731 74 46 -9 -50 -53 -33 -17 -14 -9 8 29 46 54 48 14 -49 -121 -173 -200 -211 -206 -175 -118 -52 0 19 1 -34 -49 -25 18 48 54 38 -1 -66 -126 -137 -92
12710 -92 -34 -9 -18 -34 -40 -37 -26 -11 -5 -22 -54 -82 -99 -114 -126 -110 -57 4 30 13 -11 -6 24 50 54 44 41 41 26 -13 -64 -100 -109 -100 -83 -56 -13 31 52 42
12689 42 23 22 34 29 -6 -59 -104 -130 -140 -137 -118 -85 -47 -23 -18 -20 -12 5 8 -16 -50 -65 -60 -55 -55 -51 -46 -61 -93 -117 -116 -104 -91 -68 -28 1 0 -19 -27 -24 -27 -29 -10 15
12665 15 10 -32 -70 -65 -28 5 30 63 101 115 80 12 -49 -80 -90 -106 -132 -139 -105 -47 -4 8 6 7 13 27 53 87 111 113 95 61 17 -15 -19 -1 8 7 20 55
12643 55 79 62 21 1 10 25 27 14 -6 -26 -25 4 37 36 1 -29 -34 -30 -35 -38 -24 -11 -22 -55 -81 -86 -81 -78 -75 -68 -63 -66 -66 -50 -26 -24 -61 -117 -145 -128 -89 -64 -55 -42
12619 -42 -22 -18 -44 -82 -103 -104 -107 -124 -143 -141 -113 -73 -47 -49 -65 -63 -27 24 51 37 4 -23 -44 -61 -61 -25 36 84 98 101 117 132 115 66 26 25 50 69 72 61
12597 61 34 -15 -77 -126 -147 -142 -124 -110 -106 -111 -117 -117 -112 -107 -106 -122 -163 -207 -212 -162 -96 -64 -62 -49 -16 2 -17 -50 -55 -25 18 54 71 67 45 19 -1 -24 -57 -86 -94
12575 -94 -83 -61 -30 6 28 18 -8 -20 -17 -24 -46 -62 -63 -74 -102 -119 -100 -68 -62 -75 -65 -22 9 -11 -73 -134 -166 -170 -163 -161 -171 -185 -185 -161 -128 -101 -78 -50 -24
12553 -24 -23 -48 -74 -79 -60 -34 -10 4 5 -8 -22 -21 -7 -1 -12 -29 -40 -52 -71 -87 -75 -34 4 11 -16 -56 -89 -111 -120 -107 -77 -53 -59 -86 -100 -76 -38 -34 -87
12532 -87 -163 -209 -197 -151 -117 -114 -122 -118 -100 -81 -70 -58 -47 -50 -72 -92 -83 -39 18 75 127 172 193 170 108 37 -7 -11 17 49 53 22 -20 -45 -36 2 55 98 113
12511 113 90 47 10 -9 -20 -30 -29 -14 3 8 1 -7 -17 -40 -71 -87 -75 -46 -20 -2 7 -2 -41 -91 -117 -112 -100 -101 -100 -65 -8 18 -28 -127 -212 -231 -189 -135 -110
12490 -110 -116 -136 -151 -158 -159 -156 -154 -156 -155 -145 -130 -123 -125 -120 -96 -67 -53 -53 -45 -17 14 25 5 -38 -93 -142 -161 -135 -77 -17 28 62 91 109 113 113 125 143 141 101 40 -7
12467 -7 -29 -36 -45 -56 -61 -59 -59 -66 -72 -71 -64 -64 -72 -77 -71 -58 -53 -63 -76 -75 -53 -16 31 79 106 90 37 -15 -34 -15 15 39 53 54 43 28 18 13 7 6 32 81 114 98 46
12442 46 8 12 39 54 40 4 -41 -83 -105 -103 -88 -81 -92 -114 -129 -126 -115 -106 -105 -104 -97 -94 -103 -113 -113 -102 -95 -99 -102 -96 -81 -63 -44 -31 -41 -81 -132 -168 -183 -192 -208 -220 -213
12419 -213 -184 -147 -117 -103 -94 -78 -49 -22 -13 -19 -22 -17 -25 -62 -111 -128 -96 -42 -6 0 -3 -2 0 -5 -8 1 15 9 -22 -58 -68 -51 -25 -9 -5 -6 -10 -20 -42 -73 -105 -126 -132
12395 -132 -131 -134 -135 -119 -87 -59 -55 -69 -83 -91 -102 -124 -151 -167 -168 -159 -151 -148 -147 -144 -144 -153 -169 -180 -177 -155 -126 -104 -101 -113 -118 -101 -74 -60 -64 -71 -69 -69 -78 -79 -52 -12 1 -20 -51
12371 -51 -56 -39 -22 -21 -25 -23 -13 -3 3 9 12 11 9 15 37 68 83 70 38 10 2 14 41 68 77 60 32 7 -10 -26 -42 -53 -63 -72 -72 -60 -54 -70 -92 -86 -60 -61 -104
12347 -104 -145 -140 -105 -73 -45 -11 14 6 -17 -18 2 -1 -38 -63 -45 -14 -12 -44 -78 -99 -104 -87 -56 -39 -57 -88 -102 -97 -95 -97 -88 -77 -85 -107 -114 -105 -114 -154 -180 -148 -71
12325 -71 -8 8 -10 -47 -97 -144 -157 -116 -48 -5 -23 -79 -117 -97 -41 -10 -43 -117 -168 -167 -138 -125 -141 -166 -176 -167 -152 -142 -139 -137 -133 -126 -121 -119 -113 -99 -84 -79 -81 -72 -39
12303 -39 2 15 -18 -77 -117 -109 -64 -17 8 11 -3 -29 -60 -85 -91 -84 -82 -100 -132 -148 -123 -67 -22 -19 -48 -66 -53 -32 -38 -71 -102 -115 -120 -128 -128 -105 -72 -64 -92 -125
12281 -125 -126 -96 -74 -87 -123 -153 -160 -151 -135 -117 -107 -116 -139 -150 -133 -106 -101 -124 -150 -153 -132 -101 -73 -48 -27 -19 -27 -43 -53 -51 -48 -63 -90 -101 -78 -40 -26 -45 -72
12260 -72 -85 -88 -87 -79 -63 -48 -42 -41 -44 -62 -97 -128 -134 -127 -129 -138 -129 -93 -47 -7 17 18 -17 -78 -132 -150 -134 -101 -71 -60 -73 -102 -127 -140 -148 -153 -141 -104 -56 -17 3 0
12237 0 -33 -92 -153 -196 -213 -206 -176 -131 -92 -68 -49 -22 -2 -9 -39 -63 -71 -81 -105 -130 -141 -150 -173 -205 -212 -170 -94 -34 -37 -97 -165 -197 -198 -202 -228 -253 -251 -228 -209 -206
12215 -206 -206 -201 -197 -198 -192 -162 -108 -55 -29 -29 -37 -45 -62 -94 -124 -138 -139 -136 -123 -91 -43 4 41 56 35 -24 -96 -135 -125 -91 -68 -62 -65 -73 -90 -105 -98 -64 -21 4 4 -10
12192 -10 -19 -20 -24 -45 -78 -110 -130 -140 -138 -111 -58 -2 24 13 -19 -52 -76 -97 -120 -136 -131 -107 -85 -90 -113 -121 -96 -57 -33 -20 13 72 118 118 79 43 30 33 42 64
12170 64 105 144 160 163 189 254 329 384 427 488 576 671 759 841 913 947 923 855 778 703 612 493 363 264 217 206 192 153 98 49 28 34 51 59 52 47
12151 47 59 77 69 21 -40 -82 -98 -108 -119 -120 -103 -74 -47 -28 -18 -23 -43 -67 -84 -78 -44 -3 12 -3 -18 3 52 86 86 66 35 -17 -87 -137 -138 -106 -75 -54
12130 -54 -30 -9 -14 -47 -83 -99 -93 -86 -97 -130 -167 -180 -162 -132 -118 -129 -156 -188 -211 -210 -183 -139 -86 -28 15 17 -19 -49 -34 7 26 2 -45 -100 -155 -196 -201 -173
12109 -173 -136 -108 -86 -74 -89 -125 -153 -151 -129 -109 -97 -83 -64 -39 -3 38 62 44 -13 -86 -149 -190 -203 -191 -164 -138 -118 -106 -96 -85 -74 -71 -85 -115 -148
12090 -148 -172 -185 -192 -196 -185 -144 -73 -8 1 -42 -84 -76 -38 -24 -48 -74 -76 -69 -68 -67 -68 -91 -133 -150 -119 -78 -79 -118 -147 -145 -130 -121 -113 -109 -118 -136 -141 -125 -108 -109 -123 -131 -129 -120
12066 -120 -104 -84 -72 -84 -124 -167 -184 -168 -141 -135 -149 -151 -117 -70 -43 -40 -35 -15 -6 -29 -68 -88 -82 -75 -88 -107 -102 -62 -2 50 79 79 57 32 21 21 10 -27 -72
12045 -72 -97 -101 -113 -147 -190 -223 -237 -230 -197 -153 -135 -159 -190 -192 -175 -185 -226 -250 -218 -146 -86 -65 -72 -82 -83 -80 -81 -87 -99 -123 -163 -201 -206 -171 -128 -106 -100 -88 -69 -58
12023 -58 -53 -36 -12 -4 -13 -15 2 12 -14 -66 -99 -87 -43 0 6 -31 -94 -139 -138 -100 -55 -27 -21 -34 -62 -99 -136 -169 -197 -218 -229 -226 -205 -172 -142 -131 -134 -134 -126 -131 -160
12001 -160 -198 -217 -206 -178 -145 -112 -81 -59 -51 -56 -62 -61 -47 -20 11 31 20 -25 -82 -111 -88 -32 23 56 69 70 59 37 9 -18 -46 -69 -82 -91 -110 -138 -156
11981 -156 -145 -110 -73 -57 -67 -86 -90 -71 -48 -52 -82 -108 -102 -71 -41 -26 -20 -9 9 19 0 -52 -104 -119 -100 -83 -84 -84 -67 -50 -53 -65 -67 -67 -80 -95 -85 -53 -37
11959 -37 -60 -106 -141 -148 -136 -124 -124 -128 -123 -109 -113 -145 -179 -180 -156 -146 -161 -176 -171 -163 -169 -180 -176 -159 -145 -140 -138 -139 -140 -135 -129 -138 -161 -173 -154 -122 -105 -103 -92 -67 -51 -64 -91 -106
11935 -106 -95 -68 -37 -17 -16 -29 -46 -61 -76 -83 -71 -46 -34 -50 -76 -82 -67 -53 -50 -45 -26 -3 5 0 -8 -27 -67 -118 -150 -147 -123 -105 -97 -87 -69 -51 -40 -38 -42 -52
11914 -52 -74 -103 -134 -158 -176 -193 -212 -226 -219 -186 -147 -126 -122 -115 -96 -86 -108 -165 -233 -285 -308 -304 -281 -253 -228 -207 -185 -153 -116 -89 -80 -87 -95 -92 -76 -61 -66 -95 -127
11892 -127 -122 -70 -3 26 3 -42 -72 -75 -63 -50 -43 -46 -59 -68 -64 -60 -77 -109 -132 -125 -97 -74 -72 -89 -110 -117 -104 -81 -64 -53 -47 -53 -79 -116 -135 -118 -75 -36 -23 -44
11871 -44 -86 -127 -151 -162 -168 -155 -100 -8 73 102 87 63 41 0 -63 -116 -130 -111 -90 -90 -117 -172 -247 -313 -327 -272 -184 -127 -137 -188 -219 -196 -137 -87 -71 -84
11851 -84 -108 -135 -158 -166 -153 -130 -114 -115 -119 -111 -94 -89 -111 -149 -176 -180 -168 -157 -153 -153 -156 -164 -179 -192 -187 -156 -114 -87 -94 -120 -135 -126 -111 -115 -140 -163 -164 -143 -118 -108 -117 -130 -135
11828 -135 -134 -134 -132 -118 -95 -75 -53 -18 27 51 27 -24 -60 -54 -18 14 22 6 -15 -22 -12 -7 -27 -69 -109 -129 -129 -109 -66 -14 15 0 -53 -113 -157 -184 -199 -199 -184
11806 -184 -160 -138 -124 -112 -97 -82 -73 -72 -66 -48 -22 -5 -11 -40 -74 -92 -83 -60 -43 -40 -35 -19 -5 -10 -27 -38 -43 -63 -105 -142 -139 -95 -42 -19 -31 -61 -89 -109 -124
11785 -124 -129 -119 -100 -82 -69 -58 -55 -70 -94 -101 -88 -88 -127 -184 -223 -236 -245 -253 -240 -202 -167 -148 -126 -81 -36 -22 -41 -67 -86 -100 -103 -81 -38 -2 -1 -38 -92 -139
11764 -139 -164 -161 -136 -99 -65 -45 -46 -60 -73 -80 -95 -128 -164 -176 -148 -94 -43 -28 -64 -129 -176 -182 -164 -154 -152 -142 -124 -117 -124 -121 -99 -78 -78 -97 -131 -185 -244 -265 -221
11743 -221 -146 -94 -82 -83 -82 -88 -105 -115 -115 -120 -133 -132 -105 -76 -76 -105 -137 -157 -166 -166 -161 -168 -201 -237 -244 -222 -213 -244 -292 -305 -265 -191 -118 -68 -52 -72 -116 -154 -160 -136 -103
11721 -103 -81 -67 -49 -29 -21 -27 -28 -6 25 46 55 68 84 78 33 -29 -72 -74 -42 -5 0 -38 -83 -82 -30 21 20 -28 -81 -114 -130 -135 -128 -116 -106 -100 -98 -114 -158 -212 -235
11698 -235 -214 -176 -149 -135 -119 -98 -80 -78 -102 -148 -185 -183 -153 -133 -133 -118 -67 -11 4 -16 -41 -54 -75 -110 -135 -127 -94 -64 -56 -68 -94 -122 -141 -136 -107 -71 -49
11678 -49 -51 -62 -65 -61 -58 -52 -31 -3 7 -5 -24 -32 -34 -29 0 56 102 97 54 23 26 43 47 34 2 -52 -110 -138 -127 -112 -122 -140 -136 -108 -79 -54 -17 29 57 40 -17
11656 -17 -77 -100 -81 -51 -49 -81 -111 -116 -108 -108 -112 -102 -79 -67 -68 -66 -57 -54 -59 -50 -16 20 34 26 12 -8 -44 -84 -104 -95 -71 -47 -33 -34 -61 -102 -134 -145 -150 -167 -192 -206
11633 -206 -202 -190 -180 -172 -160 -142 -120 -102 -96 -99 -94 -75 -56 -54 -68 -86 -108 -146 -202 -251 -268 -247 -204 -159 -134 -136 -157 -174 -170 -154 -139 -130 -118 -104 -98 -110 -134 -155 -167
11612 -167 -170 -170 -165 -151 -130 -111 -103 -100 -87 -58 -25 -5 -11 -42 -79 -96 -71 -14 42 72 80 91 115 138 144 130 104 70 31 -2 -19 -18 -15 -26 -44 -53 -54 -70 -117 -170
11590 -170 -191 -174 -146 -123 -96 -57 -16 10 29 52 76 88 80 51 5 -39 -50 -20 3 -31 -117 -196 -225 -228 -251 -308 -366 -384 -349 -287 -234 -210 -196 -169 -134
11571 -134 -116 -116 -113 -97 -86 -103 -143 -180 -190 -168 -132 -111 -117 -133 -136 -128 -132 -142 -127 -79 -46 -69 -130 -169 -156 -111 -70 -44 -32 -31 -38 -53 -76 -102 -127 -155 -189 -220
11550 -220 -217 -169 -108 -78 -82 -84 -57 -14 20 41 49 41 23 11 11 9 -9 -34 -44 -45 -61 -90 -108 -102 -94 -99 -101 -75 -37 -31 -76 -138 -173 -171 -152 -130 -110 -92 -74 -50 -23
11528 -23 -9 -19 -40 -52 -64 -93 -131 -143 -116 -82 -73 -79 -72 -44 -18 -16 -52 -129 -222 -287 -293 -265 -251 -270 -290 -283 -254 -220 -183 -138 -98 -85 -103 -130 -137 -117 -87 -66
11507 -66 -56 -50 -47 -58 -86 -105 -97 -72 -57 -58 -64 -67 -76 -92 -104 -101 -87 -70 -47 -16 16 37 31 1 -38 -63 -63 -47 -34 -30 -33 -52 -93 -142 -170 -165 -141 -118 -103 -102 -119 -135
11484 -135 -121 -75 -38 -41 -72 -90 -78 -57 -47 -48 -50 -54 -63 -80 -100 -114 -118 -114 -111 -114 -120 -120 -114 -105 -97 -88 -78 -64 -48 -37 -32 -22 -4 10 5 -9 -9 6 3 -41 -98 -112 -63 9
11460 9 51 32 -36 -117 -171 -182 -173 -170 -174 -164 -131 -91 -63 -48 -37 -27 -25 -38 -60 -74 -72 -61 -62 -81 -94 -81 -50 -23 -9 1 9 -1 -36 -71 -86 -93 -112 -135 -132 -93
11438 -93 -48 -34 -56 -87 -105 -111 -115 -119 -115 -95 -57 -6 43 68 59 34 19 19 13 -17 -56 -70 -50 -14 13 25 30 36 43 42 23 -15 -64 -106 -136 -148 -136 -98 -50 -23
11417 -23 -26 -49 -71 -94 -123 -157 -184 -199 -204 -201 -188 -166 -141 -119 -100 -88 -85 -84 -75 -64 -73 -105 -136 -142 -135 -144 -171 -191 -193 -190 -190 -175 -138 -104 -94 -95 -82 -72 -95 -141 -162 -130
11394 -130 -68 -19 -1 -14 -44 -62 -45 -10 1 -17 -33 -23 -12 -24 -47 -55 -57 -71 -85 -82 -77 -100 -137 -152 -144 -149 -176 -191 -175 -158 -164 -174 -162 -144 -153 -188 -219 -225 -208
11373 -208 -185 -170 -177 -192 -186 -147 -107 -97 -104 -97 -74 -63 -70 -70 -51 -34 -39 -55 -53 -33 -19 -22 -35 -50 -60 -67 -70 -76 -90 -108 -120 -122 -123 -123 -119 -112 -119 -145 -168 -156 -109 -64 -49
11349 -49 -60 -68 -62 -57 -72 -101 -124 -129 -118 -100 -75 -47 -23 -15 -24 -36 -44 -57 -87 -128 -149 -132 -97 -82 -98 -120 -121 -101 -86 -91 -101 -94 -70 -61 -82 -110 -110 -79 -44 -28 -24
11327 -24 -27 -49 -89 -114 -98 -60 -43 -57 -73 -64 -38 -18 -15 -22 -30 -37 -53 -99 -168 -222 -230 -210 -202 -210 -202 -169 -139 -135 -140 -134 -122 -122 -125 -118 -101 -84 -57 -12 33 49 28 -8 -48
11303 -48 -89 -124 -136 -118 -81 -43 -14 -7 -28 -66 -95 -99 -80 -56 -45 -59 -89 -113 -125 -142 -177 -214 -223 -202 -178 -164 -149 -115 -65 -15 25 53 60 44 16 -8 -18
11283 -18 -14 -12 -28 -69 -120 -159 -185 -211 -239 -256 -257 -255 -258 -252 -223 -188 -179 -197 -206 -182 -141 -111 -96 -82 -67 -64 -70 -65 -40 -15 -12 -28 -45 -51 -42 -24 -16 -40 -94 -145 -162 -154 -149
11260 -149 -149 -132 -95 -58 -29 8 58 88 69 11 -54 -103 -123 -116 -104 -113 -146 -174 -182 -182 -188 -193 -185 -171 -154 -125 -81 -50 -49 -58 -56 -65 -111 -176 -213 -214 -207 -203 -187 -153 -122 -105
11237 -105 -88 -62 -41 -31 -29 -40 -73 -107 -107 -70 -39 -50 -93 -143 -196 -250 -283 -276 -244 -213 -188 -166 -151 -150 -150 -144 -137 -144 -161 -175 -175 -159 -125 -90 -83 -111 -147 -166 -169 -177
11215 -177 -190 -199 -197 -181 -144 -93 -56 -50 -54 -40 -14 -8 -36 -74 -87 -62 -18 6 -13 -62 -97 -99 -87 -82 -80 -75 -76 -93 -106 -103 -103 -131 -177 -211 -229 -240 -237 -204 -151 -106 -71
11193 -71 -33 10 38 42 27 -12 -83 -161 -204 -201 -188 -192 -204 -208 -209 -206 -172 -102 -39 -31 -66 -94 -89 -74 -84 -121 -154 -162 -150 -142 -144 -139 -116 -93 -97 -121 -131 -106 -66 -48 -63
11170 -63 -90 -98 -65 -7 27 9 -45 -94 -123 -146 -161 -138 -74 -20 -23 -70 -113 -136 -158 -191 -218 -220 -198 -168 -142 -122 -106 -96 -93 -97 -101 -97 -80 -56 -33 -19 -22 -37 -47
11149 -47 -41 -35 -53 -94 -133 -157 -172 -177 -160 -126 -100 -89 -65 -15 25 26 6 9 30 30 -6 -53 -89 -113 -128 -135 -146 -178 -217 -228 -203 -173 -172 -199 -239 -272 -279 -244 -193
11128 -193 -171 -188 -200 -171 -127 -118 -149 -177 -166 -127 -94 -88 -107 -134 -149 -148 -139 -127 -109 -85 -70 -82 -114 -141 -151 -146 -126 -84 -38 -22 -50 -93 -109 -95 -77 -74 -76 -66
11107 -66 -47 -33 -26 -29 -50 -86 -115 -116 -94 -74 -63 -48 -24 -12 -24 -43 -44 -30 -24 -36 -50 -61 -74 -92 -102 -99 -95 -102 -115 -121 -111 -82 -35 17 56 72 77 84 88 76 54
11085 54 35 17 -10 -53 -96 -125 -138 -141 -139 -135 -131 -124 -113 -102 -98 -104 -113 -120 -123 -125 -127 -121 -106 -91 -92 -113 -138 -143 -121 -86 -59 -49 -50 -61 -93 -156 -235 -298 -315 -291 -248 -208 -180
11061 -180 -170 -182 -211 -228 -208 -158 -111 -90 -87 -90 -94 -100 -102 -103 -119 -156 -192 -194 -162 -126 -104 -83 -49 -15 -2 -16 -48 -93 -152 -209 -238 -219 -163 -101 -67 -73 -101 -113
11041 -113 -84 -28 7 2 -20 -24 -5 1 -28 -75 -99 -86 -62 -57 -77 -106 -133 -152 -157 -139 -101 -58 -27 -15 -23 -43 -62 -72 -81 -101 -131 -159 -174 -181 -186 -186 -177 -163 -148 -129
11019 -129 -107 -89 -78 -63 -31 -5 -16 -65 -108 -108 -82 -78 -111 -154 -165 -136 -89 -49 -30 -23 -14 -3 -5 -32 -72 -98 -94 -63 -18 19 25 -7 -60 -100 -120 -134 -144 -138
10998 -138 -120 -118 -140 -157 -144 -121 -127 -159 -180 -176 -173 -189 -208 -209 -200 -203 -215 -209 -170 -117 -77 -63 -65 -70 -73 -77 -89 -106 -115 -108 -84 -54 -32 -25 -25 -13 11 28 13 -23 -54 -67
10975 -67 -79 -106 -138 -155 -157 -157 -152 -131 -102 -93 -122 -170 -200 -192 -159 -127 -111 -101 -83 -64 -63 -91 -130 -161 -178 -188 -185 -159 -115 -77 -67 -79 -94 -104 -112 -125 -143 -163 -171
10954 -171 -157 -126 -102 -111 -142 -164 -153 -125 -107 -108 -118 -129 -139 -144 -140 -136 -151 -185 -213 -212 -185 -151 -128 -128 -152 -185 -199 -178 -140 -111 -93 -80 -74 -78 -83 -85 -102 -150 -200 -211
10932 -211 -191 -193 -233 -267 -251 -201 -163 -149 -147 -152 -159 -145 -99 -53 -38 -47 -53 -60 -88 -121 -121 -97 -99 -142 -179 -169 -136 -122 -132 -145 -155 -166 -168 -152 -131 -126 -138 -158 -182 -199
10910 -199 -188 -149 -114 -111 -120 -108 -87 -91 -125 -163 -190 -218 -243 -242 -213 -185 -173 -156 -126 -112 -136 -168 -165 -127 -91 -77 -67 -45 -22 -13 -14 -16 -24 -42 -55 -49 -29 -21 -37 -66
10889 -66 -90 -105 -118 -132 -141 -134 -111 -80 -57 -57 -77 -101 -114 -123 -140 -166 -176 -152 -103 -62 -47 -53 -60 -58 -47 -35 -29 -29 -28 -25 -29 -49 -78 -102 -121 -145 -169 -178 -171 -171 -190 -205
10866 -205 -191 -161 -151 -169 -186 -181 -172 -180 -197 -202 -193 -182 -176 -162 -139 -121 -127 -159 -202 -234 -240 -226 -214 -223 -249 -274 -287 -287 -270 -228 -171 -131 -129 -149 -160 -159 -165 -187 -208 -217 -226 -244
10843 -244 -243 -196 -115 -49 -34 -63 -103 -126 -129 -120 -110 -107 -111 -119 -125 -120 -102 -82 -88 -129 -176 -202 -213 -241 -279 -284 -242 -192 -173 -173 -147 -93 -44 -23 -21 -33 -63 -101 -112 -84
10821 -84 -48 -32 -31 -25 -19 -30 -57 -76 -80 -80 -92 -119 -147 -161 -148 -120 -105 -117 -139 -155 -175 -216 -254 -251 -200 -140 -103 -88 -86 -99 -127 -147 -145 -134 -132 -128 -96 -36 20 48
10799 48 44 15 -29 -77 -115 -141 -158 -169 -176 -179 -184 -189 -183 -164 -137 -117 -114 -132 -156 -157 -121 -68 -41 -66 -125 -171 -173 -140 -110 -113 -144 -168 -166 -154 -157 -175 -189 -193 -198 -209 -218 -219 -220
10776 -220 -222 -213 -192 -174 -162 -139 -93 -46 -36 -70 -115 -137 -125 -98 -77 -72 -81 -96 -113 -131 -143 -142 -126 -102 -75 -42 -6 13 2 -34 -75 -104 -123 -141 -158 -168 -165
10756 -165 -152 -137 -127 -123 -122 -120 -118 -110 -88 -64 -59 -86 -126 -148 -143 -126 -113 -105 -95 -85 -74 -60 -43 -29 -22 -19 -16 -11 -6 -4 -5 -8 -10 -13 -25 -58 -103 -145 -177 -200 -216 -217 -208 -209 -231
10731 -231 -257 -267 -259 -250 -246 -246 -247 -249 -245 -224 -185 -143 -110 -86 -66 -56 -59 -68 -71 -62 -50 -51 -73 -103 -124 -127 -127 -137 -145 -128 -90 -63 -60 -63 -55 -52 -76 -102 -85 -20 43 67 60 49
10707 49 32 0 -25 -14 17 22 -19 -68 -77 -49 -15 -2 -21 -70 -133 -184 -207 -217 -232 -245 -235 -211 -196 -193 -179 -148 -124 -124 -126 -106 -74 -58 -63 -71 -79 -100 -133 -154 -141
10686 -141 -107 -75 -58 -55 -71 -109 -155 -187 -197 -197 -203 -212 -215 -208 -188 -157 -130 -130 -166 -212 -234 -235 -246 -282 -321 -330 -301 -251 -200 -165 -156 -162 -159 -136 -110 -103 -111 -120 -128 -143 -161 -167 -160
10662 -160 -153 -147 -125 -93 -81 -111 -164 -198 -197 -172 -139 -109 -87 -78 -77 -78 -80 -89 -101 -99 -69 -14 43 83 91 74 43 13 -7 -22 -46 -84 -129 -163 -179 -189 -205 -223 -237
10641 -237 -253 -277 -298 -301 -288 -277 -268 -245 -205 -163 -124 -77 -26 -2 -22 -63 -93 -104 -109 -108 -89 -57 -32 -25 -27 -39 -67 -110 -153 -183 -192 -173 -137 -112 -113 -118 -108 -103 -136
10620 -136 -184 -190 -147 -115 -133 -160 -138 -84 -63 -90 -113 -99 -79 -97 -140 -160 -135 -86 -46 -30 -30 -36 -44 -54 -64 -63 -48 -28 -30 -67 -126 -174 -187 -166 -129 -94 -69
10600 -69 -58 -62 -79 -99 -109 -109 -103 -97 -89 -84 -97 -128 -152 -143 -103 -68 -61 -71 -74 -74 -85 -107 -117 -98 -61 -29 -18 -35 -77 -126 -156 -165 -180 -223 -274 -286 -249 -199 -173 -160
10578 -160 -131 -85 -43 -14 9 20 4 -33 -64 -75 -88 -121 -156 -176 -195 -227 -256 -244 -190 -137 -124 -145 -171 -182 -176 -156 -128 -107 -101 -99 -84 -62 -60 -89 -125 -138
10558 -138 -122 -99 -84 -77 -82 -114 -174 -230 -251 -235 -208 -183 -159 -138 -136 -150 -154 -136 -117 -112 -102 -60 -4 18 -12 -63 -98 -113 -125 -143 -166 -183 -184 -165 -141 -133 -139 -134 -117
10537 -117 -123 -170 -221 -222 -174 -134 -138 -163 -172 -163 -154 -143 -115 -82 -73 -97 -129 -141 -135 -129 -121 -101 -69 -42 -33 -44 -77 -130 -177 -182 -137 -81 -60 -76 -92 -80 -52 -39 -51 -75
10515 -75 -97 -116 -135 -153 -161 -156 -147 -142 -143 -144 -139 -128 -113 -97 -83 -79 -88 -98 -91 -69 -53 -64 -106 -168 -231 -271 -275 -243 -188 -125 -69 -45 -72 -131 -176 -177 -149 -130 -133 -142 -145 -143 -142
10492 -142 -139 -130 -118 -105 -93 -86 -94 -112 -129 -136 -135 -130 -116 -95 -81 -84 -100 -112 -112 -110 -120 -144 -177 -204 -208 -182 -140 -111 -114 -138 -157 -157 -146 -135 -122 -99 -79 -87 -130 -182 -204
10470 -204 -188 -153 -123 -103 -86 -69 -58 -59 -76 -105 -130 -147 -168 -208 -256 -279 -254 -190 -119 -72 -59 -68 -74 -67 -65 -96 -159 -211 -216 -178 -133 -105 -88 -76 -74 -89 -110 -112
10449 -112 -83 -43 -33 -74 -140 -192 -217 -228 -227 -198 -139 -86 -73 -95 -111 -94 -49 4 46 56 37 11 -3 -28 -84 -150 -184 -184 -188 -217 -247 -248 -226 -199 -170 -139
10429 -139 -125 -142 -171 -182 -176 -174 -172 -150 -112 -91 -104 -131 -145 -142 -143 -163 -188 -185 -139 -83 -65 -94 -128 -132 -117 -113 -123 -128 -129 -138 -149 -153 -164 -206 -260 -277 -249 -218 -217 -223 -207
10407 -207 -178 -161 -147 -117 -79 -56 -48 -28 5 30 36 31 20 -1 -27 -33 -11 7 -14 -78 -147 -179 -160 -110 -69 -59 -74 -84 -73 -48 -28 -29 -50 -82 -112 -130 -138
10387 -138 -133 -114 -89 -77 -84 -88 -74 -55 -56 -86 -119 -135 -128 -101 -58 -13 3 -27 -94 -157 -188 -184 -169 -161 -153 -132 -106 -104 -132 -164 -172 -170 -189 -228 -260 -275 -288 -298 -286 -249
10365 -249 -223 -230 -243 -222 -170 -126 -114 -117 -108 -78 -44 -25 -28 -45 -53 -45 -28 -16 -18 -38 -76 -117 -146 -167 -196 -230 -236 -195 -135 -108 -127 -167 -192 -192 -174 -157 -151 -145 -116 -68
10343 -68 -45 -78 -139 -169 -151 -129 -137 -156 -153 -132 -126 -139 -147 -136 -115 -101 -98 -97 -94 -94 -102 -124 -158 -193 -209 -197 -177 -176 -196 -206 -185 -149 -139 -163 -194 -210 -212 -206 -183 -144 -113
10321 -113 -107 -108 -89 -64 -66 -92 -106 -97 -92 -108 -119 -103 -76 -65 -65 -60 -57 -72 -96 -104 -94 -91 -111 -134 -138 -120 -99 -88 -89 -91 -78 -45 -14 -10 -41 -84 -113 -119 -111 -96 -78 -64
10298 -64 -69 -102 -146 -173 -174 -170 -182 -197 -190 -162 -138 -120 -81 -16 30 26 -2 -19 -30 -65 -111 -127 -112 -106 -135 -171 -186 -185 -177 -159 -140 -148 -185 -205 -174 -120 -87 -80 -71 -60
10276 -60 -72 -108 -135 -129 -103 -84 -86 -112 -148 -169 -164 -156 -164 -174 -156 -121 -106 -115 -115 -93 -84 -112 -152 -174 -186 -211 -241 -247 -224 -186 -147 -116 -113 -146 -188 -200 -176 -149 -148 -171
10254 -171 -203 -232 -247 -239 -213 -189 -177 -174 -169 -156 -139 -127 -126 -130 -124 -108 -101 -117 -134 -129 -113 -115 -134 -139 -117 -86 -62 -42 -33 -56 -105 -135 -113 -67 -49 -69 -96 -111 -125 -141
10232 -141 -140 -117 -96 -104 -132 -153 -154 -140 -117 -86 -57 -52 -79 -119 -145 -151 -148 -145 -142 -142 -156 -189 -218 -222 -210 -209 -216 -200 -142 -76 -55 -89 -136 -147 -115 -69 -51 -74 -121 -160
10211 -160 -174 -174 -187 -223 -264 -281 -266 -235 -220 -236 -272 -307 -325 -326 -308 -272 -231 -200 -179 -154 -119 -86 -68 -61 -57 -61 -74 -87 -88 -80 -76 -78 -80 -86 -99 -117 -122 -109 -90 -83 -96
10188 -96 -118 -130 -125 -109 -94 -81 -71 -70 -80 -85 -69 -47 -56 -93 -116 -101 -82 -100 -140 -164 -166 -172 -182 -176 -159 -163 -197 -230 -237 -228 -216 -196 -175 -172 -190 -198 -176 -147 -144 -158 -160 -144
10165 -144 -134 -139 -145 -138 -123 -114 -117 -127 -134 -132 -124 -112 -96 -80 -89 -133 -185 -198 -165 -126 -114 -121 -122 -116 -107 -95 -90 -107 -140 -153 -130 -104 -105 -119 -116 -104 -109 -127 -129 -113 -109 -126 -145 -150
10141 -150 -146 -135 -112 -93 -96 -112 -107 -79 -60 -72 -98 -114 -120 -126 -133 -134 -135 -143 -147 -132 -97 -60 -49 -76 -124 -152 -138 -106 -95 -107 -109 -91 -79 -88 -90 -65 -35 -38 -77 -127 -175
10119 -175 -229 -280 -298 -274 -234 -219 -240 -282 -316 -327 -304 -248 -180 -135 -134 -149 -132 -74 -24 -23 -51 -66 -65 -77 -100 -104 -89 -100 -160 -224 -246 -235 -234 -251 -259 -245 -217
10099 -217 -184 -150 -133 -145 -180 -213 -232 -243 -245 -228 -195 -161 -138 -127 -122 -121 -113 -96 -83 -94 -125 -150 -155 -146 -141 -148 -164 -176 -173 -155 -138 -134 -139 -146 -154 -168 -180 -185 -184 -174 -149 -113
10076 -113 -92 -96 -96 -62 -20 -23 -75 -122 -125 -108 -109 -125 -129 -112 -87 -64 -51 -60 -91 -124 -137 -135 -135 -133 -119 -101 -104 -124 -133 -116 -89 -82 -97 -120 -140 -161 -182 -200 -203 -188 -159
10054 -159 -127 -101 -83 -73 -73 -86 -107 -128 -140 -145 -143 -134 -119 -102 -92 -92 -98 -103 -105 -108 -115 -119 -99 -55 -12 1 -18 -50 -64 -55 -31 -14 -18 -40 -56 -43 -10 15 16 0 -20
10031 -20 -42 -71 -100 -123 -137 -140 -123 -92 -74 -86 -113 -122 -106 -89 -82 -76 -72 -88 -125 -152 -145 -129 -141 -178 -208 -216 -212 -201 -168 -113 -66 -49 -55 -65 -73 -74 -63 -40 -17 -12 -23
10009 -23 -39 -46 -32 8 53 65 39 14 25 59 73 47 -2 -56 -101 -128 -129 -118 -123 -152 -180 -176 -142 -108 -100 -110 -111 -96 -87 -111 -156 -190 -200 -206 -222 -229 -212 -188 -181 -180
9987 -180 -162 -137 -134 -140 -113 -45 10 10 -30 -70 -96 -119 -133 -125 -108 -108 -122 -119 -85 -53 -54 -84 -106 -107 -104 -113 -111 -71 -2 37 6 -72 -138 -162 -165 -173 -188 -199 -209 -223 -233
9965 -233 -230 -223 -220 -218 -209 -197 -193 -188 -164 -119 -73 -47 -48 -72 -107 -133 -140 -140 -155 -190 -224 -239 -237 -227 -215 -201 -190 -185 -178 -163 -152 -161 -189 -210 -201 -167 -139 -137 -149 -153 -145 -133 -125 -118 -111
9940 -111 -100 -69 -15 31 28 -33 -107 -143 -139 -124 -117 -104 -75 -39 -18 -23 -46 -73 -91 -98 -100 -110 -131 -157 -181 -198 -206 -207 -199 -180 -151 -122 -102 -95 -104 -132 -170 -191 -178 -152
9919 -152 -147 -167 -188 -200 -224 -265 -299 -303 -289 -265 -216 -137 -66 -46 -72 -105 -139 -185 -227 -229 -191 -153 -136 -128 -124 -141 -179 -203 -191 -166 -154 -147 -131 -124 -145 -175 -179 -161 -152
9897 -152 -152 -136 -102 -81 -93 -120 -143 -170 -209 -242 -238 -196 -148 -118 -110 -117 -134 -149 -146 -113 -66 -38 -49 -86 -114 -106 -70 -37 -33 -57 -86 -99 -93 -77 -57 -31 0 23 18
9876 18 -16 -64 -110 -149 -175 -180 -165 -142 -118 -96 -86 -101 -133 -152 -140 -119 -113 -111 -86 -45 -32 -70 -125 -156 -154 -142 -133 -129 -137 -162 -194 -207 -194 -172 -160 -157 -151 -134 -105 -68
9854 -68 -38 -38 -69 -108 -128 -136 -148 -158 -137 -95 -78 -110 -151 -148 -103 -68 -70 -83 -82 -84 -121 -180 -217 -209 -186 -188 -224 -265 -280 -265 -240 -225 -226 -231 -232 -231 -234 -234 -224 -209 -211 -240 -278
9831 -278 -285 -248 -191 -148 -128 -123 -131 -159 -205 -247 -270 -279 -288 -295 -293 -278 -254 -220 -176 -136 -118 -128 -159 -200 -235 -239 -212 -179 -172 -187 -194 -190 -196 -227 -260 -267 -245 -222 -219 -244 -281 -305
9808 -305 -300 -278 -269 -275 -263 -210 -142 -106 -117 -143 -156 -159 -173 -203 -235 -254 -262 -273 -288 -294 -282 -252 -216 -182 -160 -156 -165 -162 -130 -92 -84 -114 -155 -189 -229 -276 -303 -286 -239 -197
9786 -197 -179 -174 -168 -160 -161 -180 -214 -239 -228 -183 -144 -147 -185 -225 -248 -251 -238 -209 -180 -164 -163 -164 -158 -145 -126 -111 -121 -159 -205 -231 -235 -224 -200 -166 -139 -136 -149 -161 -172 -191
9764 -191 -211 -215 -207 -205 -216 -222 -220 -217 -213 -194 -158 -128 -114 -108 -108 -125 -156 -170 -153 -128 -127 -143 -153 -154 -161 -179 -191 -182 -154 -122 -100 -99 -114 -123 -117 -111 -127 -161 -187 -190 -179 -171 -167 -160 -148
9740 -148 -143 -153 -173 -185 -184 -192 -231 -287 -322 -322 -313 -323 -343 -346 -331 -319 -318 -315 -299 -278 -269 -284 -319 -355 -363 -330 -274 -232 -226 -245 -261 -254 -231 -218 -233 -264 -270 -221 -138 -74 -70 -120
9717 -120 -193 -250 -265 -238 -195 -173 -178 -186 -171 -141 -120 -114 -111 -106 -116 -147 -178 -184 -173 -181 -226 -280 -311 -314 -308 -307 -304 -288 -258 -226 -206 -199 -192 -170 -140 -124 -131 -142 -147 -155 -168 -162 -119
9694 -119 -62 -36 -51 -78 -92 -99 -109 -115 -110 -104 -111 -135 -170 -203 -219 -211 -188 -170 -155 -125 -81 -47 -45 -68 -94 -112 -120 -116 -107 -110 -126 -137 -128 -114 -113 -121 -125 -133 -155 -184 -200 -194 -171
9670 -171 -148 -133 -124 -112 -98 -106 -155 -222 -257 -246 -227 -230 -240 -236 -232 -249 -270 -262 -233 -215 -214 -206 -186 -177 -184 -183 -158 -122 -93 -76 -74 -83 -83 -56 -22 -19 -50 -82 -89 -85 -86 -84 -71 -64 -76
9646 -76 -100 -115 -112 -101 -93 -101 -124 -137 -116 -72 -44 -50 -68 -76 -81 -91 -98 -99 -109 -136 -156 -151 -137 -137 -150 -160 -172 -202 -244 -277 -286 -276 -251 -220 -205 -217 -232 -214 -167 -129 -120
9623 -120 -126 -128 -130 -144 -161 -160 -137 -104 -81 -81 -105 -138 -162 -168 -158 -149 -156 -184 -216 -224 -202 -177 -176 -189 -188 -175 -180 -214 -247 -247 -219 -183 -149 -118 -99 -96 -93 -67 -35 -36 -79 -123 -130
9600 -130 -114 -107 -115 -109 -79 -52 -50 -69 -87 -101 -118 -136 -147 -150 -158 -178 -210 -242 -260 -253 -221 -188 -171 -161 -136 -90 -44 -17 -15 -35 -69 -97 -103 -98 -112 -154 -195 -207 -201 -204 -221
9577 -221 -227 -213 -201 -213 -243 -271 -292 -310 -323 -318 -303 -305 -330 -347 -324 -273 -241 -251 -278 -291 -280 -251 -206 -159 -141 -163 -199 -210 -201 -205 -228 -250 -257 -254 -238 -203 -165 -147
9557 -147 -138 -101 -36 1 -25 -87 -124 -115 -85 -55 -38 -47 -86 -133 -159 -157 -141 -119 -98 -86 -89 -98 -105 -120 -147 -170 -167 -147 -136 -137 -143 -156 -191 -235 -260 -260 -250 -246 -248 -266 -311
9534 -311 -369 -397 -377 -335 -299 -277 -255 -227 -200 -184 -190 -210 -211 -165 -97 -64 -86 -127 -144 -139 -139 -143 -141 -144 -179 -241 -285 -273 -211 -145 -122 -157 -226 -282 -295 -263 -212 -168
9514 -168 -152 -161 -174 -171 -157 -158 -187 -223 -242 -242 -241 -247 -254 -258 -266 -284 -301 -302 -286 -267 -255 -248 -236 -217 -203 -200 -206 -216 -225 -231 -235 -234 -222 -189 -138 -94 -86 -117 -155 -171 -173 -184 -209 -231
9490 -231 -238 -237 -240 -249 -257 -252 -228 -195 -171 -164 -161 -151 -152 -185 -227 -232 -184 -120 -88 -98 -120 -121 -95 -69 -75 -112 -142 -138 -119 -119 -138 -152 -161 -193 -251 -294 -291 -262 -240 -227 -211 -192 -181
9466 -181 -185 -198 -213 -218 -207 -193 -201 -231 -257 -262 -266 -284 -302 -300 -281 -256 -225 -198 -201 -244 -297 -323 -318 -297 -259 -201 -146 -121 -121 -110 -72 -22 12 17 -16 -73 -122 -141 -146 -159
9444 -159 -167 -147 -115 -111 -134 -144 -123 -105 -114 -132 -134 -133 -154 -196 -233 -258 -278 -293 -289 -262 -220 -177 -144 -131 -136 -143 -139 -122 -102 -88 -84 -89 -93 -87 -75 -75 -91 -105 -94 -65 -41 -40
9422 -40 -56 -78 -93 -95 -81 -58 -41 -44 -72 -115 -157 -187 -201 -193 -164 -129 -110 -113 -114 -87 -43 -22 -42 -86 -124 -149 -168 -186 -191 -177 -143 -107 -92 -113 -155 -182 -172 -137
9401 -137 -107 -100 -117 -147 -180 -205 -216 -225 -245 -272 -275 -225 -137 -69 -65 -109 -141 -129 -104 -105 -130 -145 -139 -131 -132 -126 -104 -83 -80 -92 -104 -121 -156 -202 -235 -240 -222 -206 -211 -239 -270
9379 -270 -280 -267 -250 -245 -244 -232 -203 -173 -159 -168 -192 -212 -226 -244 -274 -303 -309 -294 -280 -278 -279 -276 -275 -277 -269 -239 -201 -174 -162 -152 -142 -141 -149 -152 -143 -124 -98 -73 -60 -75 -111 -141
9356 -141 -143 -126 -116 -125 -134 -124 -102 -99 -133 -185 -222 -238 -254 -271 -262 -211 -148 -122 -144 -180 -196 -192 -185 -178 -159 -127 -96 -83 -92 -112 -130 -137 -135 -136 -150 -173 -186 -182 -167 -149 -130
9333 -130 -112 -106 -117 -133 -134 -119 -100 -83 -58 -26 -9 -23 -55 -75 -74 -68 -68 -74 -77 -77 -76 -79 -86 -88 -75 -54 -44 -56 -75 -90 -105 -126 -137 -122 -101 -111 -146 -172 -171 -163 -164 -164 -158
9310 -158 -161 -183 -197 -182 -154 -148 -172 -208 -243 -278 -302 -297 -261 -218 -195 -194 -195 -186 -176 -185 -211 -225 -211 -190 -189 -198 -188 -158 -139 -146 -154 -141 -117 -101 -91 -86 -97 -126 -153 -159 -161 -169
9287 -169 -159 -108 -44 -16 -24 -29 -12 -1 -28 -88 -159 -221 -258 -263 -245 -225 -208 -186 -166 -170 -202 -238 -249 -232 -204 -181 -163 -136 -99 -75 -98 -159 -206 -199 -162 -140 -139 -128
9266 -128 -107 -109 -140 -160 -137 -90 -62 -67 -90 -111 -125 -135 -158 -202 -253 -272 -250 -220 -221 -243 -242 -200 -148 -129 -153 -188 -199 -179 -152 -136 -134 -140 -153 -168 -167 -145 -126 -133 -150
9245 -150 -145 -117 -100 -108 -114 -98 -81 -94 -134 -175 -210 -248 -288 -314 -322 -320 -316 -305 -283 -257 -245 -260 -291 -306 -282 -232 -196 -185 -170 -124 -65 -34 -45 -83 -126 -162 -170 -136
9224 -136 -72 -22 -25 -86 -176 -258 -309 -320 -300 -267 -237 -213 -190 -171 -165 -176 -186 -176 -151 -140 -153 -169 -162 -135 -110 -101 -108 -132 -166 -186 -169 -121 -75 -53 -51 -63 -88 -118
9204 -118 -136 -137 -132 -130 -134 -152 -186 -221 -234 -220 -200 -193 -204 -232 -270 -301 -309 -305 -309 -320 -311 -275 -231 -199 -177 -165 -168 -176 -176 -171 -183 -206 -207 -181 -172 -206 -242 -225 -168 -131 -141 -172
9181 -172 -195 -208 -221 -231 -228 -203 -160 -115 -89 -85 -93 -109 -144 -195 -232 -234 -215 -197 -185 -179 -190 -210 -203 -157 -114 -126 -182 -229 -243 -235 -212 -174 -143 -147 -173 -190 -201 -233 -281
9159 -281 -299 -275 -250 -252 -257 -239 -217 -224 -256 -281 -284 -272 -251 -223 -195 -173 -158 -149 -150 -159 -170 -186 -200 -188 -130 -50 -11 -48 -125 -176 -174 -142 -113 -96 -79 -54 -34 -43 -91
9138 -91 -152 -181 -162 -123 -101 -105 -119 -128 -128 -122 -114 -101 -81 -55 -31 -22 -38 -85 -159 -228 -253 -228 -193 -193 -218 -232 -226 -222 -229 -234 -229 -225 -223 -216 -213 -231 -257 -250 -198 -140 -109 -100 -94 -95 -116
9114 -116 -149 -176 -187 -180 -155 -125 -104 -94 -83 -73 -82 -109 -135 -157 -193 -235 -248 -224 -208 -227 -247 -229 -192 -179 -190 -199 -204 -221 -241 -236 -207 -184 -187 -208 -228 -238 -229 -210
9093 -210 -203 -221 -239 -225 -187 -152 -122 -83 -54 -70 -128 -181 -204 -222 -254 -275 -251 -195 -152 -143 -159 -184 -213 -240 -253 -242 -220 -213 -236 -263 -255 -206 -158 -158 -200 -239 -245 -225
9072 -225 -199 -185 -189 -205 -207 -176 -130 -116 -157 -226 -276 -279 -247 -214 -204 -218 -232 -229 -214 -205 -207 -209 -193 -150 -87 -32 -18 -46 -78 -85 -80 -86 -94 -88 -73 -64 -57 -53 -78 -150 -226 -242
9049 -242 -196 -155 -165 -196 -199 -174 -153 -144 -132 -106 -73 -55 -60 -79 -87 -72 -58 -73 -110 -135 -134 -128 -127 -123 -115 -127 -168 -207 -215 -199 -186 -182 -179 -175 -174 -170 -159 -148 -152 -172 -194 -202 -189
9026 -189 -166 -156 -167 -179 -173 -158 -154 -158 -142 -108 -91 -114 -160 -201 -228 -233 -207 -159 -129 -141 -173 -197 -217 -243 -260 -246 -215 -197 -200 -210 -221 -237 -253 -257 -255 -266 -292 -309
9005 -309 -291 -231 -142 -56 -6 -3 -38 -91 -145 -173 -152 -97 -61 -75 -113 -131 -130 -137 -151 -151 -141 -150 -181 -200 -189 -167 -153 -143 -126 -115 -122 -140 -145 -134 -126 -141 -176 -216 -240
8984 -240 -234 -198 -149 -111 -106 -127 -147 -147 -139 -149 -175 -185 -166 -143 -138 -138 -122 -102 -98 -99 -81 -46 -29 -45 -74 -94 -107 -123 -141 -157 -174 -198 -218 -217 -194 -161 -139 -132 -128 -106
8962 -106 -70 -46 -54 -85 -117 -139 -149 -146 -137 -142 -169 -197 -201 -194 -202 -226 -247 -269 -314 -373 -403 -378 -323 -272 -236 -217 -218 -237 -251 -245 -234 -243 -272 -297 -305 -301 -298 -294 -281 -255 -223 -196
8939 -196 -185 -198 -239 -295 -329 -305 -230 -162 -148 -177 -205 -212 -207 -202 -194 -192 -205 -231 -251 -260 -265 -264 -247 -225 -224 -243 -255 -255 -262 -283 -290 -264 -226 -201 -188 -174 -168 -177 -188 -188 -183 -188 -197 -199
8915 -199 -200 -211 -232 -254 -282 -310 -318 -290 -246 -220 -225 -250 -289 -330 -345 -307 -237 -194 -210 -253 -282 -299 -337 -405 -463 -469 -426 -380 -364 -365 -351 -318 -290 -283 -288 -297 -311 -326 -319
8894 -319 -277 -214 -158 -122 -107 -111 -127 -139 -144 -151 -161 -155 -123 -91 -91 -119 -147 -166 -185 -196 -186 -159 -145 -154 -159 -139 -114 -119 -163 -222 -261 -271 -261 -247 -239 -235 -228 -213 -194 -178
8872 -178 -178 -200 -233 -251 -246 -242 -255 -265 -239 -183 -140 -138 -156 -162 -155 -160 -186 -217 -232 -228 -223 -227 -233 -227 -207 -188 -176 -169 -164 -164 -166 -162 -155 -160 -174 -177 -161 -147 -154 -165 -155 -136 -139 -161 -165 -131
8847 -131 -81 -49 -50 -79 -125 -165 -178 -169 -158 -147 -121 -83 -60 -64 -76 -76 -70 -68 -61 -39 -22 -42 -95 -144 -157 -137 -113 -112 -140 -177 -196 -190 -179 -186 -211 -238 -251 -247 -228 -204
8825 -204 -184 -173 -170 -172 -181 -198 -217 -230 -229 -213 -188 -174 -179 -187 -179 -169 -186 -229 -262 -263 -254 -257 -256 -221 -163 -125 -125 -148 -172 -195 -211 -202 -165 -126 -119 -153 -208 -251 -260 -242 -223 -220 -223
8802 -223 -217 -207 -213 -232 -245 -248 -266 -306 -340 -337 -305 -270 -235 -188 -139 -128 -165 -212 -227 -221 -229 -251 -249 -214 -180 -178 -182 -151 -88 -45 -60 -126 -203 -260 -283 -281 -270 -261 -248 -224
8780 -224 -199 -192 -202 -212 -216 -220 -228 -227 -211 -192 -178 -160 -135 -113 -97 -77 -48 -34 -57 -98 -115 -96 -77 -84 -106 -107 -79 -53 -61 -96 -122 -114 -91 -85 -91 -71 -17 29 23 -31 -101
8758 -101 -167 -225 -260 -253 -210 -164 -130 -104 -93 -113 -157 -186 -181 -169 -181 -206 -208 -176 -134 -112 -112 -120 -123 -124 -141 -181 -226 -253 -256 -255 -262 -262 -242 -212 -189 -172 -155 -150 -168 -199 -216
8735 -216 -217 -222 -237 -244 -236 -232 -246 -258 -243 -207 -187 -200 -225 -238 -232 -217 -200 -186 -188 -210 -239 -251 -239 -207 -165 -123 -100 -116 -163 -206 -220 -213 -212 -227 -246 -252 -252 -261 -282 -302 -296
8713 -296 -252 -188 -143 -140 -170 -205 -235 -266 -289 -286 -255 -222 -208 -203 -189 -165 -144 -136 -138 -150 -167 -178 -177 -179 -203 -239 -259 -251 -230 -208 -180 -153 -159 -212 -280 -317 -313 -292 -268 -228
8691 -228 -177 -145 -157 -199 -245 -284 -317 -330 -311 -273 -245 -240 -244 -250 -258 -258 -229 -172 -112 -74 -58 -57 -76 -118 -159 -169 -147 -124 -130 -163 -201 -226 -234 -235 -240 -253 -266 -266 -250 -231
8670 -231 -219 -216 -214 -201 -180 -165 -176 -207 -231 -232 -224 -223 -224 -216 -208 -216 -232 -227 -192 -152 -135 -139 -143 -139 -124 -94 -54 -35 -59 -109 -149 -158 -144 -115 -76 -53 -76 -137 -185 -182 -157 -159 -185
8646 -185 -185 -131 -63 -40 -68 -110 -130 -132 -131 -140 -157 -169 -160 -126 -88 -76 -96 -116 -112 -93 -86 -101 -133 -183 -251 -320 -360 -359 -332 -301 -271 -242 -217 -198 -182 -171 -177 -196 -206
8625 -206 -192 -166 -147 -132 -105 -74 -70 -103 -151 -186 -206 -223 -243 -259 -260 -237 -186 -129 -104 -129 -173 -194 -193 -193 -201 -190 -153 -120 -122 -148 -168 -179 -191 -202 -200 -188 -187 -203 -221
8604 -221 -231 -246 -273 -300 -306 -291 -266 -242 -221 -210 -211 -217 -217 -205 -193 -197 -219 -244 -249 -230 -204 -190 -183 -175 -170 -173 -172 -154 -141 -167 -219 -238 -196 -140 -131 -166 -187 -169 -136 -114 -103
8581 -103 -92 -87 -95 -116 -145 -175 -193 -183 -148 -109 -91 -101 -125 -140 -126 -90 -69 -88 -124 -135 -113 -96 -117 -170 -220 -241 -226 -192 -174 -192 -219 -217 -193 -194 -237 -285 -305
8561 -305 -312 -331 -345 -322 -267 -217 -193 -190 -194 -201 -197 -176 -150 -141 -153 -173 -193 -220 -247 -260 -253 -230 -195 -153 -126 -139 -178 -209 -219 -227 -239 -231 -184 -123 -91 -103 -141 -182 -216
8540 -216 -242 -257 -257 -242 -212 -174 -153 -167 -208 -247 -257 -241 -215 -195 -182 -168 -154 -145 -145 -147 -138 -124 -124 -154 -204 -245 -256 -242 -225 -217 -212 -204 -193 -184 -170 -148 -135 -148 -181 -205
8518 -205 -207 -203 -210 -217 -203 -181 -181 -205 -226 -233 -242 -263 -270 -234 -171 -124 -106 -93 -66 -41 -41 -61 -89 -123 -159 -176 -155 -117 -103 -123 -145 -143 -133 -139 -154 -154 -132 -102 -76 -58 -58
8496 -58 -82 -114 -126 -116 -108 -118 -137 -152 -158 -148 -115 -76 -65 -91 -118 -121 -117 -141 -187 -223 -230 -215 -188 -162 -150 -161 -179 -183 -179 -179 -180 -170 -159 -167 -188 -195 -180 -166 -165 -164 -154 -146
8473 -146 -143 -126 -95 -86 -128 -196 -239 -240 -220 -199 -178 -160 -158 -176 -198 -204 -194 -179 -164 -148 -137 -145 -181 -235 -284 -319 -345 -367 -371 -343 -289 -244 -233 -252 -269 -250 -194 -130
8452 -130 -102 -124 -166 -179 -153 -121 -112 -125 -143 -155 -162 -168 -177 -198 -228 -259 -286 -315 -346 -356 -330 -276 -222 -191 -189 -204 -213 -201 -178 -171 -187 -207 -211 -211 -233 -270 -295 -290 -268 -249
8430 -249 -239 -235 -225 -199 -160 -128 -126 -152 -181 -181 -148 -103 -76 -85 -113 -132 -129 -123 -136 -163 -183 -184 -172 -153 -125 -89 -54 -31 -26 -46 -90 -141 -175 -180 -173 -173 -191 -219 -245 -259
8408 -259 -265 -275 -296 -319 -321 -296 -263 -242 -242 -254 -266 -268 -255 -226 -189 -154 -131 -125 -134 -145 -146 -140 -142 -157 -179 -200 -221 -239 -244 -232 -213 -204 -205 -199 -179 -158 -148 -141 -119 -83 -60 -74
8386 -74 -123 -188 -245 -279 -280 -258 -234 -229 -247 -277 -308 -317 -282 -207 -141 -133 -171 -201 -201 -200 -226 -257 -258 -230 -204 -194 -195 -201 -207 -199 -164 -123 -112 -134 -149 -131 -101 -104 -148 -204 -239
8363 -239 -248 -250 -261 -277 -284 -285 -290 -305 -319 -316 -290 -243 -190 -164 -191 -253 -298 -296 -271 -252 -230 -188 -143 -125 -127 -126 -125 -151 -195 -220 -214 -207 -209 -192 -147 -113 -123 -159 -187 -203 -223
8341 -223 -238 -231 -204 -170 -126 -75 -51 -84 -157 -217 -243 -257 -280 -298 -291 -265 -246 -243 -253 -263 -269 -272 -279 -290 -293 -278 -252 -228 -207 -185 -166 -163 -180 -207 -233 -253 -259 -245 -215
8320 -215 -178 -140 -108 -99 -118 -148 -163 -168 -183 -208 -216 -200 -186 -198 -222 -231 -218 -204 -201 -201 -194 -179 -165 -161 -172 -188 -196 -193 -180 -156 -111 -49 -4 -11 -73 -158 -225 -242 -199 -126
8298 -126 -74 -78 -120 -151 -149 -133 -131 -144 -160 -177 -198 -219 -234 -240 -236 -210 -166 -128 -128 -158 -181 -178 -168 -175 -198 -219 -227 -223 -205 -184 -179 -202 -235 -245 -225 -196 -179 -174 -180 -199 -224
8276 -224 -235 -226 -216 -228 -257 -275 -268 -248 -235 -235 -235 -227 -213 -206 -215 -234 -249 -250 -237 -221 -212 -214 -225 -240 -252 -256 -250 -237 -223 -213 -201 -180 -154 -145 -162 -193 -214 -219 -216 -209 -197 -186 -186
8252 -186 -195 -204 -218 -247 -281 -285 -253 -222 -226 -248 -251 -237 -237 -258 -270 -258 -247 -262 -282 -275 -247 -230 -238 -252 -264 -288 -326 -346 -321 -270 -231 -220 -212 -193 -176 -183 -210 -239 -257 -260
8230 -260 -243 -204 -153 -109 -80 -71 -93 -149 -219 -269 -283 -271 -243 -202 -153 -118 -113 -131 -148 -155 -156 -154 -142 -119 -101 -109 -146 -184 -185 -147 -98 -70 -60 -56 -63 -92 -130 -156 -174
8209 -174 -209 -257 -290 -295 -292 -292 -276 -237 -204 -209 -235 -247 -235 -216 -194 -161 -122 -100 -104 -128 -171 -225 -262 -257 -226 -209 -223 -256 -301 -362 -419 -434 -396 -346 -324 -318 -301 -270
8188 -270 -253 -265 -293 -313 -310 -278 -235 -216 -237 -276 -291 -274 -258 -276 -322 -360 -361 -329 -289 -256 -232 -221 -228 -246 -255 -242 -218 -202 -191 -171 -146 -142 -170 -214 -244 -247 -237 -229
8168 -229 -231 -238 -244 -254 -276 -310 -340 -347 -332 -309 -284 -262 -245 -235 -226 -215 -212 -225 -239 -240 -239 -257 -291 -317 -322 -321 -318 -300 -260 -220 -197 -186 -170 -159 -174 -214 -257 -279 -280 -277 -287
8145 -287 -297 -279 -232 -195 -209 -257 -283 -261 -226 -219 -238 -259 -271 -276 -267 -247 -232 -233 -237 -231 -234 -268 -313 -323 -283 -232 -213 -229 -252 -258 -248 -237 -241 -265 -301 -331 -334 -302 -244 -186
8123 -186 -149 -137 -140 -150 -172 -200 -225 -242 -249 -231 -182 -125 -104 -130 -175 -205 -218 -232 -250 -268 -280 -287 -286 -280 -279 -284 -292 -307 -334 -357 -352 -330 -326 -342 -335 -288 -250 -264 -296 -286
8102 -286 -237 -203 -203 -202 -176 -146 -135 -137 -142 -153 -173 -185 -177 -162 -153 -145 -127 -104 -94 -110 -147 -177 -181 -166 -162 -181 -205 -221 -240 -265 -264 -218 -163 -151 -169 -168 -148 -157 -209 -253 -256
8079 -256 -246 -259 -281 -287 -291 -319 -356 -367 -352 -344 -360 -389 -414 -427 -421 -391 -347 -306 -272 -239 -211 -200 -210 -228 -242 -248 -247 -246 -251 -261 -264 -252 -241 -246 -262 -265 -239 -201 -183 -192 -206
8057 -206 -197 -165 -137 -128 -127 -113 -84 -61 -60 -83 -121 -157 -179 -189 -208 -243 -272 -280 -281 -300 -320 -302 -249 -213 -223 -249 -247 -217 -185 -161 -142 -126 -116 -108 -106 -120 -143 -145 -112 -66
8035 -66 -41 -39 -37 -35 -55 -107 -170 -220 -256 -288 -323 -345 -340 -307 -264 -231 -209 -189 -178 -186 -209 -220 -209 -188 -167 -147 -137 -159 -206 -234 -222 -196 -189 -185 -149 -89 -62 -100 -181
8014 -181 -254 -283 -259 -205 -158 -142 -143 -142 -150 -191 -255 -301 -301 -276 -263 -281 -315 -334 -319 -280 -251 -251 -262 -257 -234 -219 -231 -268 -319 -374 -420 -443 -441 -425 -398 -355 -302 -259
7993 -259 -245 -257 -272 -272 -254 -233 -222 -213 -198 -184 -188 -206 -212 -193 -166 -142 -120 -105 -118 -161 -201 -207 -192 -185 -193 -202 -213 -236 -262 -277 -285 -295 -288 -245 -190 -181 -234 -305 -339 -328
7971 -328 -294 -262 -240 -224 -206 -191 -197 -223 -240 -232 -215 -210 -204 -182 -164 -179 -205 -198 -165 -154 -178 -200 -199 -197 -203 -182 -122 -67 -63 -90 -110 -131 -181 -251 -296 -300 -286 -280 -277 -270 -254
7949 -254 -234 -218 -222 -256 -300 -319 -302 -272 -254 -247 -233 -204 -177 -176 -200 -227 -247 -280 -342 -402 -419 -393 -368 -362 -348 -307 -263 -245 -248 -246 -233 -216 -194 -164 -139 -127 -122 -112
7928 -112 -106 -111 -118 -122 -142 -196 -264 -306 -305 -280 -249 -220 -200 -196 -204 -211 -208 -204 -205 -218 -241 -261 -258 -236 -219 -222 -224 -200 -154 -121 -121 -142 -159 -154 -131 -113 -120 -147 -166 -166 -172 -203 -237 -235 -200
7904 -200 -162 -138 -121 -111 -114 -117 -105 -83 -81 -103 -130 -148 -170 -204 -234 -247 -248 -246 -237 -215 -180 -138 -94 -61 -53 -67 -83 -100 -129 -166 -182 -167 -149 -163 -202 -232 -244 -254
7883 -254 -277 -305 -321 -313 -284 -250 -234 -239 -245 -230 -204 -193 -207 -222 -219 -210 -211 -208 -181 -138 -119 -143 -193 -239 -268 -281 -281 -277 -283 -300 -299 -254 -190 -159 -184 -227 -241 -216 -176 -149
7861 -149 -149 -176 -218 -248 -250 -230 -211 -210 -231 -262 -277 -263 -247 -266 -313 -333 -295 -234 -205 -208 -199 -167 -145 -151 -166 -169 -168 -177 -188 -189 -187 -198 -212 -211 -196 -188 -193 -189 -159 -115 -83 -70
7838 -70 -64 -55 -50 -55 -54 -31 8 46 72 87 99 127 192 302 443 607 818 1112 1512 2046 2749 3553 4199 4358 3926 3129 2308 1651 1158 796
7822 796 554 390 237 85 -15 -49 -70 -117 -166 -184 -177 -171 -171 -178 -202 -236 -247 -223 -185 -153 -117 -75 -52 -62 -87 -116 -163 -226 -266 -253 -214 -190 -174 -137
7804 -137 -88 -64 -81 -116 -147 -172 -187 -187 -173 -153 -131 -114 -117 -148 -191 -222 -240 -254 -267 -273 -281 -295 -302 -288 -258 -226 -198 -171 -154 -157 -170 -182 -198 -234 -277 -290 -253 -182
7783 -182 -117 -93 -121 -183 -238 -259 -253 -241 -225 -197 -165 -147 -152 -179 -217 -246 -238 -191 -139 -123 -138 -154 -158 -158 -152 -129 -102 -100 -130 -163 -176 -177 -185 -200 -219 -251 -296 -331 -332 -301
7761 -301 -260 -225 -201 -194 -206 -224 -234 -233 -233 -244 -263 -280 -286 -278 -265 -258 -252 -234 -204 -184 -191 -210 -207 -171 -132 -118 -125 -132 -129 -129 -133 -136 -140 -158 -185 -191 -171 -161 -206 -289 -350 -350 -308 -267
7737 -267 -244 -231 -222 -220 -224 -226 -213 -182 -150 -149 -187 -230 -237 -204 -159 -113 -62 -17 -3 -18 -28 -29 -55 -119 -180 -197 -186 -184 -188 -184 -182 -200 -222 -222 -209 -213 -230 -237 -237 -254 -273 -260
7714 -260 -217 -187 -181 -169 -143 -143 -191 -247 -258 -225 -190 -184 -202 -226 -245 -255 -262 -271 -273 -260 -246 -252 -271 -264 -212 -145 -105 -102 -118 -141 -167 -193 -216 -239 -255 -253 -232 -209 -207 -235
7692 -235 -285 -337 -365 -355 -321 -294 -282 -270 -249 -233 -233 -243 -254 -262 -267 -264 -263 -279 -305 -310 -284 -255 -246 -248 -241 -227 -225 -234 -233 -212 -184 -165 -161 -172 -192 -213 -225 -225 -213 -193 -172 -157
7670 -157 -149 -149 -161 -188 -218 -235 -233 -218 -191 -158 -139 -150 -175 -179 -152 -127 -130 -153 -169 -173 -170 -163 -161 -178 -213 -239 -235 -205 -164 -123 -90 -85 -112 -155 -196 -237 -276 -297 -285 -251
7648 -251 -218 -205 -225 -280 -338 -350 -298 -219 -158 -124 -105 -100 -110 -118 -110 -95 -91 -96 -96 -96 -108 -126 -132 -132 -144 -171 -208 -251 -294 -317 -309 -280 -254 -234 -218 -222 -253 -289 -300 -294 -300
7625 -300 -320 -326 -311 -292 -280 -264 -244 -241 -252 -248 -208 -151 -113 -107 -123 -144 -155 -157 -163 -186 -212 -213 -189 -171 -180 -203 -219 -224 -221 -201 -168 -142 -142 -156 -167 -176 -199 -233 -246 -221 -176
7603 -176 -155 -177 -220 -246 -244 -227 -214 -207 -205 -208 -217 -226 -239 -267 -311 -342 -333 -300 -282 -285 -279 -234 -166 -114 -100 -110 -120 -124 -136 -170 -215 -244 -244 -227 -206 -183 -158 -138 -123 -96
7581 -96 -63 -53 -82 -128 -155 -160 -166 -187 -220 -259 -294 -309 -303 -294 -285 -255 -203 -174 -201 -243 -237 -188 -155 -161 -176 -187 -217 -271 -311 -311 -300 -302 -307 -299 -293 -300 -300 -275 -251 -251 -260 -247 -216
7558 -216 -192 -176 -153 -128 -119 -124 -126 -120 -118 -125 -135 -147 -170 -203 -238 -265 -274 -260 -240 -243 -272 -293 -283 -266 -280 -328 -378 -407 -413 -397 -359 -318 -295 -295 -302 -306 -306 -294 -259 -212 -192
7535 -192 -219 -258 -260 -215 -167 -160 -192 -223 -235 -240 -246 -234 -191 -147 -140 -159 -158 -128 -108 -128 -156 -154 -137 -152 -213 -285 -318 -298 -243 -188 -165 -173 -185 -186 -186 -192 -195 -183 -172 -181 -202
7513 -202 -210 -207 -211 -229 -246 -244 -228 -213 -208 -214 -230 -247 -262 -277 -286 -283 -268 -253 -245 -239 -232 -227 -221 -207 -201 -223 -266 -287 -261 -217 -198 -205 -216 -222 -233 -239 -223 -194 -173 -153 -113 -66 -54
7490 -54 -91 -135 -140 -122 -126 -167 -209 -215 -188 -165 -168 -188 -202 -208 -216 -227 -228 -221 -223 -241 -257 -257 -256 -274 -304 -319 -311 -285 -255 -233 -229 -227 -202 -151 -118 -140 -201 -255 -289 -318 -338 -326
7467 -326 -283 -243 -223 -214 -200 -187 -184 -193 -219 -266 -318 -344 -335 -317 -309 -305 -288 -257 -222 -189 -159 -129 -100 -85 -101 -156 -230 -292 -326 -338 -337 -326 -312 -298 -280 -258 -245 -250 -257
7446 -257 -245 -216 -185 -152 -115 -98 -127 -183 -215 -209 -193 -192 -201 -212 -227 -243 -238 -216 -203 -213 -221 -214 -206 -209 -199 -160 -127 -141 -193 -230 -225 -200 -182 -177 -178 -185 -190 -174 -132 -92 -94 -141
7423 -141 -192 -204 -177 -148 -148 -176 -221 -274 -317 -330 -306 -275 -265 -269 -264 -247 -229 -213 -191 -176 -188 -221 -253 -274 -284 -270 -220 -158 -136 -167 -217 -250 -259 -250 -225 -198 -189 -196
7402 -196 -199 -190 -182 -174 -147 -112 -117 -180 -260 -301 -292 -263 -242 -242 -261 -285 -289 -278 -269 -265 -246 -217 -207 -219 -214 -180 -159 -184 -225 -239 -234 -244 -267 -276 -263 -249 -236 -221 -217 -242 -279 -292
7379 -292 -273 -245 -218 -188 -164 -154 -144 -117 -85 -86 -124 -165 -183 -187 -196 -214 -239 -275 -316 -350 -372 -383 -389 -398 -418 -445 -454 -427 -378 -333 -297 -268 -251 -252 -258 -259 -268 -303 -346 -365
7357 -365 -354 -327 -283 -216 -150 -126 -139 -147 -125 -98 -95 -106 -113 -123 -159 -227 -303 -352 -359 -335 -308 -290 -277 -266 -266 -277 -279 -257 -228 -209 -190 -167 -166 -213 -280 -308 -284 -246
7337 -246 -221 -198 -171 -169 -218 -302 -373 -393 -359 -302 -262 -253 -250 -227 -193 -177 -180 -185 -188 -203 -224 -228 -214 -201 -199 -197 -200 -219 -245 -248 -231 -225 -237 -234 -204 -173 -171 -189 -208 -231 -262 -291
7314 -291 -309 -319 -312 -272 -210 -176 -194 -228 -227 -188 -152 -148 -172 -212 -256 -293 -318 -336 -346 -342 -322 -304 -297 -296 -303 -328 -365 -383 -364 -326 -292 -258 -210 -160 -139 -159 -206 -254
7293 -254 -283 -292 -292 -293 -287 -259 -217 -192 -195 -205 -208 -214 -232 -248 -244 -235 -240 -259 -276 -281 -267 -225 -163 -116 -115 -155 -209 -258 -290 -288 -255 -217 -202 -207 -215 -224 -234 -226 -189 -141 -112 -100 -79
7270 -79 -44 -21 -28 -54 -73 -76 -72 -69 -62 -47 -33 -41 -78 -119 -132 -118 -103 -102 -104 -106 -122 -153 -176 -175 -167 -174 -188 -195 -195 -194 -187 -174 -168 -175 -178 -161 -138 -126 -121 -115 -126 -173 -232 -261 -246 -206
7244 -206 -167 -144 -146 -173 -209 -237 -254 -258 -242 -209 -182 -174 -172 -171 -188 -235 -280 -290 -270 -250 -230 -197 -164 -162 -184 -191 -160 -115 -84 -69 -55 -39 -32 -50 -94 -144 -168 -159 -148
7223 -148 -159 -177 -182 -188 -220 -267 -301 -314 -320 -318 -297 -271 -268 -287 -300 -292 -268 -231 -186 -158 -164 -176 -145 -71 -6 11 -11 -56 -105 -139 -143 -136 -155 -199 -231 -235 -236 -249 -264 -268 -271
7201 -271 -276 -264 -232 -203 -197 -211 -240 -282 -319 -325 -299 -261 -221 -177 -151 -177 -239 -285 -291 -293 -311 -319 -302 -291 -304 -307 -267 -217 -200 -204 -187 -154 -144 -162 -171 -159 -153 -171 -196 -209
7179 -209 -220 -239 -254 -250 -229 -209 -207 -233 -275 -311 -316 -295 -267 -254 -260 -277 -290 -286 -271 -258 -248 -239 -239 -261 -294 -306 -282 -249 -239 -252 -270 -279 -274 -255 -233 -228 -245 -259 -254 -244
7157 -244 -243 -245 -235 -228 -241 -264 -266 -240 -203 -173 -162 -184 -238 -296 -323 -316 -305 -309 -321 -326 -325 -331 -352 -376 -384 -371 -359 -369 -387 -374 -325 -283 -283 -308 -317 -305 -289 -276 -250 -216 -198
7135 -198 -209 -228 -234 -230 -236 -252 -267 -266 -256 -251 -255 -259 -246 -221 -205 -213 -239 -271 -298 -311 -306 -288 -271 -253 -226 -200 -202 -228 -241 -212 -161 -132 -140 -161 -170 -167 -168 -194 -246 -304 -336 -331
7112 -331 -303 -268 -237 -220 -226 -246 -257 -249 -232 -215 -198 -187 -196 -225 -255 -278 -298 -305 -281 -240 -225 -248 -268 -254 -224 -208 -203 -195 -194 -211 -236 -256 -282 -310 -308 -260 -203 -180 -179
7091 -179 -164 -142 -146 -175 -192 -182 -173 -190 -229 -272 -294 -277 -242 -232 -256 -263 -220 -175 -190 -251 -294 -310 -342 -395 -424 -412 -393 -380 -346 -283 -229 -209 -198 -173 -153 -162 -188
7071 -188 -205 -215 -222 -219 -205 -199 -211 -222 -215 -200 -195 -199 -195 -181 -160 -136 -116 -98 -73 -37 -22 -65 -151 -220 -235 -215 -199 -198 -198 -191 -181 -174 -177 -183 -179 -157 -145 -168 -209 -227 -221 -226 -256
7047 -256 -284 -293 -303 -318 -314 -280 -245 -226 -203 -153 -102 -92 -128 -183 -227 -240 -223 -201 -204 -225 -226 -197 -175 -184 -201 -200 -196 -212 -238 -252 -261 -276 -286 -271 -243 -228 -226 -217 -198 -191
7025 -191 -205 -232 -259 -274 -267 -246 -233 -227 -212 -189 -191 -232 -274 -265 -207 -145 -114 -115 -137 -165 -185 -188 -186 -191 -197 -193 -187 -198 -232 -273 -295 -278 -230 -186 -172 -172 -149 -103 -79 -102 -139
7003 -139 -155 -154 -167 -196 -221 -230 -219 -192 -164 -161 -184 -202 -198 -194 -215 -245 -257 -249 -238 -226 -213 -207 -206 -193 -167 -155 -172 -190 -180 -152 -131 -119 -108 -111 -137 -159 -160 -167 -214 -278
6981 -278 -312 -305 -283 -259 -227 -203 -210 -239 -254 -248 -243 -254 -275 -305 -345 -376 -373 -344 -323 -318 -315 -306 -299 -288 -264 -236 -224 -229 -240 -256 -272 -267 -227 -183 -171 -181 -188 -204 -252 -304 -305
6959 -305 -258 -223 -227 -236 -228 -227 -251 -275 -270 -246 -218 -186 -156 -155 -189 -226 -245 -264 -302 -349 -377 -380 -367 -344 -313 -283 -258 -237 -226 -235 -252 -262 -269 -293 -326 -338 -321 -302 -301 -306
6937 -306 -309 -321 -344 -349 -324 -298 -304 -339 -368 -364 -326 -272 -231 -221 -228 -228 -214 -201 -200 -208 -224 -257 -298 -326 -330 -318 -297 -271 -256 -267 -288 -291 -280 -286 -315 -337 -332 -312 -287 -253 -225
6915 -225 -230 -268 -307 -334 -370 -425 -465 -458 -414 -356 -306 -283 -297 -328 -335 -313 -300 -317 -338 -340 -332 -331 -320 -286 -245 -221 -210 -207 -220 -248 -269 -270 -266 -268 -264 -249 -244 -256 -270 -278 -302
6892 -302 -343 -361 -328 -270 -223 -190 -165 -165 -196 -227 -224 -203 -194 -198 -197 -202 -230 -266 -282 -277 -270 -266 -265 -268 -263 -230 -175 -138 -136 -139 -122 -109 -130 -162 -166 -155 -166 -194 -206 -199 -195 -193 -172 -136
6868 -136 -114 -111 -104 -87 -77 -85 -113 -168 -248 -324 -357 -339 -297 -253 -218 -205 -218 -239 -249 -251 -253 -246 -225 -210 -211 -201 -167 -138 -147 -166 -154 -124 -119 -138 -144 -134 -138 -156 -150 -115 -94
6846 -94 -115 -150 -168 -169 -168 -165 -152 -131 -109 -92 -98 -128 -157 -158 -147 -153 -172 -177 -171 -180 -212 -248 -276 -290 -275 -219 -156 -122 -110 -83 -47 -48 -94 -144 -169 -188 -213 -236 -255 -284
6824 -284 -316 -326 -307 -279 -250 -211 -177 -183 -227 -259 -256 -240 -226 -204 -174 -172 -208 -245 -255 -249 -243 -222 -187 -169 -181 -193 -180 -165 -179 -206 -210 -185 -160 -153 -167 -195 -227 -251
6804 -251 -270 -292 -311 -307 -282 -258 -238 -198 -134 -82 -64 -73 -99 -153 -226 -280 -293 -286 -288 -293 -289 -292 -319 -354 -379 -393 -404 -398 -363 -311 -263 -234 -228 -242 -252 -226 -178 -166 -213
6782 -213 -279 -313 -318 -325 -344 -358 -358 -346 -329 -319 -333 -358 -358 -318 -267 -238 -233 -242 -265 -296 -314 -314 -316 -321 -305 -269 -254 -280 -312 -306 -273 -244 -225 -210 -208 -221 -222 -191 -154 -144 -158
6760 -158 -180 -220 -280 -325 -329 -322 -344 -371 -354 -298 -263 -266 -269 -243 -209 -202 -223 -255 -279 -282 -268 -252 -246 -237 -225 -232 -266 -294 -284 -263 -282 -338 -378 -371 -338 -305 -276 -251 -235 -233
6738 -233 -236 -242 -243 -229 -207 -211 -260 -320 -337 -307 -263 -233 -223 -232 -257 -272 -257 -232 -233 -257 -267 -245 -218 -215 -237 -268 -299 -320 -329 -326 -310 -277 -238 -221 -232 -243 -232 -214 -209 -205
6716 -205 -191 -191 -231 -282 -301 -289 -280 -277 -259 -231 -221 -227 -218 -187 -155 -131 -100 -64 -49 -71 -125 -202 -280 -321 -296 -238 -208 -223 -254 -283 -320 -360 -377 -369 -365 -372 -372 -358 -352 -366
6695 -366 -380 -372 -349 -333 -343 -384 -431 -438 -381 -298 -251 -255 -277 -289 -285 -257 -207 -164 -157 -171 -169 -153 -151 -152 -127 -87 -87 -133 -173 -177 -171 -178 -182 -171 -164 -171 -175 -178 -202 -249 -285 -293 -298 -313
6671 -313 -319 -310 -313 -338 -353 -338 -314 -303 -302 -305 -318 -331 -315 -279 -266 -287 -290 -247 -197 -188 -213 -240 -268 -299 -306 -269 -215 -182 -169 -162 -170 -197 -220 -213 -194 -196 -219 -246 -273 -305 -335
6648 -335 -358 -380 -402 -409 -400 -395 -402 -391 -347 -298 -278 -281 -279 -265 -242 -213 -186 -180 -191 -196 -184 -176 -174 -150 -100 -67 -83 -125 -155 -172 -187 -195 -190 -184 -177 -150 -106 -92 -132 -188 -223 -252
6625 -252 -303 -357 -371 -339 -284 -215 -145 -120 -167 -243 -285 -280 -261 -244 -219 -190 -183 -209 -264 -327 -361 -329 -246 -182 -177 -201 -216 -239 -295 -350 -361 -340 -326 -312 -272 -225
6606 -225 -214 -231 -235 -218 -211 -222 -241 -271 -324 -373 -378 -346 -321 -315 -314 -318 -340 -356 -328 -273 -248 -267 -285 -275 -259 -260 -270 -272 -269 -267 -264 -269 -290 -309 -299 -267 -241 -233 -225 -211 -197 -183
6583 -183 -165 -154 -157 -160 -146 -123 -105 -81 -43 -21 -44 -93 -126 -141 -162 -188 -195 -189 -187 -183 -162 -142 -140 -143 -135 -139 -178 -214 -197 -149 -125 -120 -86 -36 -36 -98 -163 -199 -227 -256 -255
6561 -255 -228 -221 -249 -271 -269 -270 -287 -290 -281 -297 -335 -344 -306 -277 -290 -314 -316 -317 -336 -340 -299 -249 -232 -248 -275 -310 -344 -343 -294 -249 -257 -303 -332 -329 -310 -290 -268 -253 -247 -244 -240 -250
6538 -250 -275 -294 -294 -282 -266 -247 -233 -244 -269 -274 -247 -210 -179 -149 -131 -147 -189 -216 -217 -228 -269 -313 -327 -320 -311 -304 -303 -314 -323 -313 -302 -326 -372 -381 -331 -265 -220 -192 -176
6516 -176 -182 -198 -185 -157 -167 -222 -258 -239 -207 -207 -221 -229 -250 -294 -314 -281 -234 -213 -206 -195 -204 -246 -287 -296 -297 -309 -300 -248 -195 -186 -207 -223 -234 -238 -203 -120 -46 -31 -51 -68
6495 -68 -99 -166 -242 -293 -334 -378 -387 -329 -257 -238 -259 -268 -269 -294 -330 -338 -327 -329 -333 -313 -285 -286 -304 -313 -324 -353 -366 -322 -260 -244 -273 -291 -287 -291 -307 -310 -301 -296 -287 -258 -235 -245
6472 -245 -257 -230 -187 -175 -190 -193 -198 -239 -303 -344 -355 -356 -336 -285 -247 -273 -333 -357 -338 -319 -303 -260 -210 -202 -222 -211 -173 -161 -184 -196 -193 -224 -294 -352 -378 -404 -439
6452 -439 -452 -437 -417 -393 -343 -290 -276 -282 -249 -183 -152 -173 -190 -180 -187 -226 -248 -228 -198 -185 -169 -140 -134 -167 -205 -226 -238 -239 -208 -159 -137 -157 -186 -215 -271 -348 -401
6431 -401 -411 -408 -414 -410 -395 -382 -368 -332 -297 -302 -329 -320 -271 -240 -241 -231 -192 -164 -171 -187 -201 -225 -241 -225 -205 -231 -268 -239 -158 -126 -169 -212 -212 -218 -248 -243 -183 -140 -168 -222
6410 -222 -248 -255 -251 -209 -146 -135 -183 -206 -163 -122 -139 -166 -165 -182 -250 -313 -316 -299 -308 -317 -294 -287 -333 -386 -400 -410 -453 -489 -476 -459 -482 -500 -458 -394 -364 -348 -306 -263
6389 -263 -246 -210 -126 -67 -102 -179 -216 -232 -291 -356 -343 -267 -208 -185 -159 -139 -167 -224 -251 -248 -257 -269 -244 -205 -205 -236 -245 -237 -256 -298 -321 -320 -327 -338 -326 -306 -302 -296 -267
6368 -267 -242 -246 -235 -175 -123 -154 -232 -271 -266 -277 -304 -297 -267 -276 -322 -353 -357 -362 -349 -282 -200 -176 -202 -216 -215 -244 -295 -308 -282 -273 -296 -316 -327 -348 -355 -317 -277 -284 -296 -237
6346 -237 -145 -125 -187 -233 -224 -214 -233 -249 -251 -264 -270 -225 -164 -167 -235 -292 -318 -349 -371 -332 -269 -277 -347 -374 -336 -324 -371 -396 -358 -327 -352 -382 -375 -367 -377 -356 -288 -232
6325 -232 -223 -220 -206 -226 -297 -356 -375 -394 -429 -430 -386 -362 -383 -397 -377 -370 -392 -384 -327 -288 -307 -333 -329 -332 -358 -361 -320 -282 -259 -207 -136 -130 -205 -262 -246 -225 -247 -258 -218
6304 -218 -184 -199 -209 -184 -182 -236 -269 -234 -202 -231 -262 -238 -219 -261 -297 -268 -232 -258 -286 -244 -185 -197 -248 -258 -234 -222 -207 -171 -172 -236 -273 -219 -165 -209 -280 -261
6284 -261 -190 -191 -261 -307 -319 -348 -361 -290 -190 -177 -243 -279 -262 -255 -265 -235 -176 -157 -171 -157 -134 -162 -204 -169 -87 -66 -98 -69 37 116 116 102 95 32 -92
6265 -92 -185 -205 -210 -217 -176 -98 -77 -132 -167 -142 -129 -160 -161 -100 -64 -93 -102 -35 23 7 -19 0 1 -73 -134 -84 18 77 130 257 403 468 494 591 718 740
6246 740 670 642 671 656 616 692 854 873 696 569 644 729 648 567 691 860 848 815 1026 1297 1305 1274 1670 2294 2565 2753 3791 5617
6230 5617 7264 9470 15250 25532 35209 36781 28651 17307 10046 7757 6616 4586 3039 2928 2933 2078 1413 1822 2239
6220 2239 1550 602 651 1147 856 171 331 1035 967 332 581 1648 1901 1228 1530 3236 4227 3877 5035 9303 13846 17734
6208 17734 28629 54911 89577 110201 101098 71262 43906 31209 26765 21153 14856 12469 12713 11164 8322 7911
6199 7911 9444 9000 6410 5429 6787 7057 5243 4636 6454 7366 5803 5183 7527 9341 8142 7704 11322 15115 15148 16287
6188 16287 24714 36144 44748 62133 108808 178657 228097 217378 156081 91994 58100 46945 37097 24632
6181 24632 18289 18358 16560 11325 9013 11051 11471 8094 6029 7807 8938 6627 4940 6969 8936 7354 5738 8041
6171 8041 10991 10102 8535 11653 16650 17414 17069 24040 36562 45947 58787 98019 168033 230846 237526 182513 110041
6162 110041 64118 48033 39197 26570 17438 16227 15836 11201 7154 8011 9599 7340 4344 5080 7113 5956 3465
6152 3465 4167 6671 6288 3966 4654 7896 8433 6273 7269 12164 14642 13601 17066 28148 38733 47821 74830 135398
6143 135398 206537 237439 203284 133738 78008 53921 44296 32542 21503 17967 17765 14166 9328 8475 9851
6134 9851 8595 5687 5407 7127 6814 4667 4468 6337 6636 4896 4628 6617 7423 5985 5850 8563 10565 9980 10922 16429
6123 16429 22630 26836 37062 63107 97680 116700 104006 69774 38535 23306 18237 13542 8128 5583 5548 4671
6115 4671 2556 1593 2168 2194 1047 414 981 1281 533 0 532 1005 481 -56 409 1012 650 111 640 1551 1471 1066 2070
6102 2070 4096 5396 7076 13152 24418 34764 36568 29007 18544 11493 8535 6861 4964 3524 3021 2748 2147
6093 2147 1593 1476 1476 1195 829 736 800 707 507 463 543 504 358 340 459 482 356 297 381 420 310 212 233 239 130 36 66 99 27 -34
6077 -34 24 85 15 -77 -39 47 27 -51 -51 -10 -46 -108 -75 1 -12 -85 -98 -79 -132 -200 -152 -33 0 -50 -59 -32 -70 -139 -110 -10 8 -64 -99 -78 -99
6058 -99 -145 -104 -7 -5 -100 -141 -105 -124 -215 -247 -194 -191 -265 -281 -205 -175 -237 -258 -172 -101 -128 -164 -146 -152 -219 -241 -169 -118 -166 -226 -221 -215 -261 -289 -249 -218 -242 -245
6037 -245 -184 -144 -186 -239 -250 -271 -322 -319 -244 -210 -266 -292 -217 -153 -197 -264 -256 -233 -271 -301 -251 -198 -233 -289 -266 -209 -206 -228 -212 -198 -243 -285 -256 -210 -227 -264
6017 -264 -248 -218 -233 -238 -176 -122 -163 -238 -243 -210 -222 -249 -219 -179 -208 -253 -216 -133 -118 -167 -193 -195 -231 -279 -278 -261 -301 -357 -339 -270 -249 -276 -264 -216 -214 -268 -304
5997 -304 -299 -295 -298 -281 -266 -282 -286 -233 -182 -218 -300 -325 -294 -284 -289 -248 -197 -223 -304 -336 -307 -299 -323 -303 -232 -185 -184 -177 -158 -177 -220 -218 -173 -153 -163 -144 -107 -122 -174
5976 -174 -172 -105 -66 -97 -133 -139 -150 -172 -156 -109 -104 -164 -229 -270 -313 -352 -346 -319 -348 -424 -456 -416 -379 -382 -376 -339 -317 -320 -293 -229 -193 -202 -207 -203 -251 -347 -395 -359 -313 -305
5954 -305 -294 -251 -219 -218 -201 -159 -160 -226 -283 -282 -271 -289 -299 -271 -252 -268 -274 -240 -210 -219 -229 -218 -223 -257 -273 -256 -272 -341 -394 -380 -353 -360 -362 -324 -294 -310 -328 -301 -265
5933 -265 -256 -240 -190 -158 -192 -247 -258 -241 -235 -231 -209 -205 -249 -307 -336 -347 -351 -323 -264 -233 -254 -271 -237 -187 -160 -138 -110 -116 -164 -186 -154 -140 -192 -237 -209 -160 -173 -222
5912 -222 -240 -243 -274 -301 -277 -238 -245 -270 -257 -235 -264 -310 -296 -241 -233 -278 -306 -296 -301 -343 -382 -399 -413 -427 -425 -409 -398 -386 -364 -350 -350 -330 -274 -234 -257 -299 -298 -271
5891 -271 -264 -256 -206 -144 -127 -145 -151 -153 -190 -232 -217 -158 -117 -108 -97 -91 -123 -172 -187 -178 -188 -195 -148 -80 -75 -140 -202 -229 -252 -275 -260 -229 -252 -325 -360 -314 -251 -234 -248
5870 -248 -257 -255 -245 -214 -169 -140 -137 -140 -149 -178 -210 -213 -202 -221 -258 -260 -224 -201 -211 -220 -209 -206 -230 -264 -293 -317 -322 -294 -259 -255 -265 -245 -204 -189 -200 -201 -196 -227 -285 -313 -301
5848 -301 -295 -310 -315 -309 -321 -343 -329 -289 -288 -333 -359 -330 -285 -255 -221 -188 -197 -245 -265 -231 -202 -222 -260 -273 -268 -263 -252 -239 -240 -241 -205 -152 -153 -216 -260 -238 -201 -212 -255 -290
5826 -290 -310 -316 -285 -224 -192 -220 -266 -280 -279 -288 -300 -305 -321 -354 -363 -332 -295 -277 -255 -216 -192 -200 -210 -207 -225 -280 -326 -338 -351 -389 -414 -388 -345 -322 -299 -253 -221 -241
5805 -241 -288 -320 -345 -382 -405 -393 -378 -392 -402 -369 -327 -326 -353 -359 -350 -366 -405 -433 -439 -432 -403 -351 -308 -305 -321 -327 -331 -350 -358 -330 -294 -288 -297 -285 -271 -291 -333 -354 -352 -360 -377
5783 -377 -375 -351 -319 -283 -242 -219 -223 -228 -216 -220 -271 -335 -360 -355 -361 -376 -372 -359 -366 -387 -393 -385 -388 -391 -373 -343 -324 -307 -277 -263 -293 -336 -338 -307 -296 -318 -338 -343 -345 -341 -317 -292 -296
5759 -296 -308 -286 -236 -202 -200 -200 -188 -179 -177 -183 -209 -258 -299 -305 -306 -345 -404 -429 -415 -392 -365 -321 -287 -303 -354 -390 -400 -413 -414 -361 -268 -200 -184 -185 -181 -192 -225 -245 -239 -231 -237
5737 -237 -239 -226 -219 -230 -250 -272 -295 -307 -297 -292 -316 -345 -334 -290 -259 -247 -229 -211 -228 -270 -292 -292 -307 -332 -328 -304 -310 -341 -339 -288 -252 -264 -276 -254 -232 -236 -231 -190 -150
5716 -150 -156 -193 -224 -249 -277 -290 -272 -244 -232 -232 -242 -275 -325 -357 -357 -357 -372 -371 -337 -307 -311 -328 -319 -293 -280 -284 -286 -275 -255 -230 -214 -224 -249 -262 -261 -274 -305 -320 -309 -303
5694 -303 -324 -356 -380 -397 -397 -360 -305 -282 -299 -300 -259 -216 -209 -214 -193 -161 -152 -163 -177 -195 -217 -218 -194 -182 -204 -231 -235 -230 -233 -226 -200 -190 -220 -256 -258 -242 -242 -257 -273 -301 -340
5672 -340 -356 -340 -340 -390 -444 -447 -412 -388 -382 -369 -356 -359 -354 -318 -279 -279 -301 -303 -290 -299 -326 -333 -322 -331 -363 -383 -377 -356 -319 -258 -198 -174 -179 -176 -163 -166 -182 -179 -153 -142 -169 -211
5649 -211 -241 -262 -285 -313 -343 -363 -358 -326 -290 -257 -212 -154 -125 -150 -191 -195 -171 -159 -156 -131 -93 -88 -129 -181 -220 -247 -254 -221 -167 -130 -124 -127 -139 -180 -244 -293 -315 -332
5628 -332 -350 -356 -354 -377 -435 -489 -492 -436 -355 -297 -292 -328 -360 -354 -326 -303 -280 -241 -198 -176 -175 -189 -228 -289 -330 -322 -292 -286 -297 -297 -297 -327 -369 -380 -365 -361 -367 -351 -326 -327 -334 -297
5605 -297 -232 -218 -273 -328 -338 -339 -365 -392 -387 -369 -359 -342 -313 -301 -310 -301 -255 -219 -241 -298 -341 -362 -376 -380 -364 -348 -351 -354 -328 -281 -239 -217 -222 -269 -355 -441 -489 -499 -490
5584 -490 -473 -450 -429 -409 -372 -318 -277 -272 -284 -285 -281 -291 -311 -318 -305 -288 -288 -309 -342 -368 -378 -385 -402 -417 -412 -391 -376 -360 -326 -285 -275 -298 -312 -299 -282 -278 -269 -252 -265
5563 -265 -325 -394 -436 -456 -472 -472 -446 -415 -401 -391 -367 -344 -344 -353 -351 -340 -342 -359 -380 -394 -392 -370 -342 -332 -338 -338 -335 -349 -378 -383 -357 -345 -374 -407 -403 -374 -353 -350 -358 -383 -417
5540 -417 -432 -421 -411 -408 -379 -315 -262 -259 -281 -292 -300 -326 -356 -371 -388 -420 -443 -432 -408 -394 -379 -354 -357 -410 -462 -458 -421 -406 -409 -391 -362 -356 -351 -301 -224 -191 -220 -259 -275
5519 -275 -285 -302 -313 -322 -352 -386 -378 -327 -293 -314 -368 -419 -454 -467 -445 -403 -377 -380 -385 -380 -384 -408 -428 -419 -384 -336 -290 -271 -292 -331 -348 -338 -329 -334 -336 -331 -335 -345 -331 -281 -220
5497 -220 -179 -170 -187 -218 -237 -231 -223 -237 -260 -257 -223 -191 -180 -187 -210 -246 -272 -263 -235 -219 -210 -187 -177 -232 -333 -393 -369 -310 -276 -266 -250 -226 -209 -200 -199 -216 -246 -268 -279
5476 -279 -302 -338 -357 -349 -343 -350 -354 -349 -360 -392 -409 -395 -378 -383 -392 -388 -387 -395 -391 -364 -351 -379 -413 -414 -391 -382 -391 -392 -378 -365 -362 -369 -396 -442 -476 -476 -453 -435 -423 -406 -391 -384 -373 -353
5452 -353 -346 -364 -384 -382 -372 -381 -401 -409 -408 -408 -397 -359 -320 -315 -342 -365 -372 -373 -371 -353 -324 -301 -285 -263 -245 -254 -281 -294 -277 -254 -254 -278 -309 -326 -325 -321 -334 -367 -392 -382 -340 -293
5429 -293 -266 -268 -296 -324 -325 -301 -289 -309 -336 -348 -356 -374 -376 -334 -270 -239 -259 -295 -309 -298 -282 -276 -289 -318 -345 -352 -351 -368 -403 -432 -445 -450 -453 -445 -427 -415 -416 -414 -391 -351 -320
5406 -320 -314 -328 -339 -341 -342 -350 -351 -338 -332 -355 -385 -378 -332 -298 -305 -326 -335 -339 -350 -348 -317 -282 -271 -273 -261 -248 -259 -283 -291 -284 -288 -300 -290 -256 -226 -216 -218 -225 -244 -270 -290 -303 -321
5383 -321 -343 -352 -341 -324 -316 -323 -340 -353 -355 -350 -355 -366 -364 -354 -363 -395 -411 -387 -356 -356 -372 -371 -361 -364 -365 -339 -313 -334 -392 -427 -413 -380 -354 -330 -315 -328 -355 -362 -346 -336 -338 -333
5360 -333 -331 -368 -430 -451 -408 -356 -342 -353 -361 -377 -406 -411 -366 -309 -291 -307 -321 -326 -345 -382 -416 -436 -446 -441 -420 -392 -366 -337 -305 -287 -291 -301 -301 -301 -307 -298 -255 -194 -150 -133
5338 -133 -143 -187 -266 -348 -396 -406 -402 -399 -392 -379 -360 -337 -313 -300 -305 -314 -313 -303 -298 -294 -283 -266 -249 -233 -223 -236 -276 -324 -359 -377 -388 -393 -395 -400 -407 -397 -364 -332 -321 -323 -324 -328
5315 -328 -344 -352 -330 -288 -266 -279 -301 -302 -278 -249 -236 -244 -265 -284 -297 -311 -324 -328 -321 -321 -339 -361 -373 -371 -354 -313 -257 -217 -213 -228 -231 -217 -199 -171 -126 -78 -59 -83 -134
5294 -134 -189 -237 -270 -281 -277 -276 -285 -301 -312 -310 -294 -276 -272 -285 -295 -284 -256 -227 -212 -220 -253 -299 -338 -367 -396 -421 -421 -390 -353 -329 -309 -279 -249 -246 -281 -341 -400 -425 -404
5273 -404 -368 -369 -411 -441 -425 -394 -388 -394 -369 -312 -254 -218 -210 -238 -297 -347 -354 -335 -327 -331 -327 -324 -350 -391 -401 -375 -354 -356 -352 -326 -306 -318 -349 -370 -379 -382 -377 -361 -347 -342 -335 -323 -317
5249 -317 -317 -306 -283 -267 -272 -276 -260 -235 -230 -251 -282 -301 -306 -306 -318 -339 -346 -330 -317 -340 -378 -383 -347 -311 -300 -292 -263 -236 -243 -275 -298 -301 -298 -299 -306 -319 -335 -341 -336 -339 -360 -383 -389 -382
5225 -382 -379 -384 -387 -387 -389 -392 -405 -437 -478 -491 -456 -407 -395 -428 -470 -491 -490 -477 -459 -435 -406 -382 -378 -401 -427 -421 -384 -359 -380 -420 -434 -425 -429 -455 -470 -459 -447 -450 -452 -438 -424
5203 -424 -432 -450 -444 -409 -366 -334 -311 -298 -306 -339 -384 -420 -431 -421 -405 -400 -405 -407 -400 -397 -411 -423 -397 -327 -258 -240 -269 -298 -294 -269 -260 -282 -317 -336 -326 -306 -305 -328 -348 -342 -328
5181 -328 -338 -372 -392 -377 -356 -360 -379 -383 -364 -335 -304 -267 -235 -224 -234 -250 -271 -301 -332 -344 -340 -340 -350 -355 -345 -333 -324 -312 -293 -276 -271 -272 -271 -263 -250 -238 -239 -257 -273 -260
5159 -260 -225 -203 -214 -247 -285 -326 -360 -369 -348 -317 -297 -286 -277 -280 -305 -341 -371 -390 -397 -386 -367 -365 -393 -423 -421 -392 -367 -360 -364 -369 -367 -354 -332 -320 -330 -350 -359 -361 -374 -401 -427
5137 -427 -440 -439 -417 -370 -313 -278 -278 -299 -317 -321 -312 -307 -321 -351 -363 -333 -283 -265 -296 -343 -370 -385 -416 -458 -471 -436 -381 -343 -334 -343 -362 -386 -401 -386 -350 -333 -357 -398
5116 -398 -415 -400 -380 -377 -394 -427 -471 -503 -492 -442 -394 -385 -406 -426 -433 -436 -445 -459 -475 -486 -490 -490 -490 -475 -429 -369 -335 -335 -331 -297 -258 -245 -243 -218 -184 -181 -217 -252 -261 -262 -272 -286
5093 -286 -291 -292 -299 -315 -336 -358 -372 -369 -350 -328 -310 -300 -302 -320 -343 -353 -342 -326 -326 -348 -383 -411 -421 -413 -400 -387 -373 -366 -378 -396 -380 -316 -245 -222 -247 -273 -277 -278 -290 -299
5071 -299 -288 -271 -264 -268 -275 -281 -291 -303 -314 -332 -362 -397 -419 -413 -379 -338 -315 -324 -350 -374 -384 -379 -354 -312 -277 -268 -283 -298 -304 -299 -280 -245 -209 -202 -232 -276 -307 -317 -310 -296 -284
5049 -284 -277 -275 -285 -318 -368 -409 -418 -404 -388 -369 -338 -305 -292 -306 -333 -364 -391 -400 -384 -364 -367 -393 -419 -434 -439 -427 -388 -345 -331 -346 -360 -363 -370 -377 -361 -326 -312 -343 -395
5028 -395 -431 -440 -436 -428 -418 -403 -371 -320 -276 -271 -303 -336 -350 -350 -343 -329 -322 -343 -378 -379 -341 -308 -310 -323 -322 -323 -348 -373 -373 -365 -382 -414 -432 -434 -446 -473 -492 -489 -469 -440 -415 -410 -424
5004 -424 -436 -434 -437 -460 -480 -468 -434 -409 -397 -384 -373 -378 -395 -400 -387 -368 -345 -317 -295 -292 -299 -303 -318 -360 -405 -414 -384 -350 -323 -284 -232 -198 -202 -221 -223 -198 -168 -158 -188 -249
4982 -249 -300 -305 -284 -285 -318 -340 -320 -284 -269 -272 -268 -252 -241 -239 -230 -210 -190 -184 -194 -218 -253 -286 -301 -291 -264 -235 -212 -203 -208 -230 -260 -283 -280 -245 -199 -177 -197 -240 -272 -274
4961 -274 -263 -260 -269 -271 -262 -265 -298 -344 -367 -354 -333 -328 -337 -345 -350 -354 -349 -336 -331 -347 -381 -417 -448 -462 -447 -410 -381 -373 -371 -360 -350 -354 -363 -360 -349 -338 -329 -318 -311 -311 -307 -301 -314 -347 -364 -344
4935 -344 -318 -330 -366 -383 -374 -369 -383 -399 -407 -409 -397 -360 -312 -279 -263 -246 -231 -240 -270 -291 -291 -287 -289 -287 -280 -275 -267 -244 -225 -245 -297 -333 -336 -336 -351 -358 -338 -312 -299 -284 -253 -225
4913 -225 -229 -253 -266 -260 -250 -248 -262 -290 -319 -332 -329 -324 -321 -313 -315 -343 -377 -372 -330 -312 -353 -414 -442 -436 -426 -420 -410 -397 -389 -376 -353 -339 -348 -359 -348 -325 -323 -341 -350 -336 -310 -294
4890 -294 -303 -336 -367 -359 -316 -277 -266 -264 -258 -270 -314 -353 -341 -291 -248 -228 -206 -176 -157 -152 -149 -154 -181 -226 -274 -328 -396 -452 -456 -417 -389 -401 -430 -443 -436 -419 -391 -361 -347
4868 -347 -348 -346 -336 -337 -344 -331 -288 -256 -267 -305 -333 -349 -372 -398 -391 -343 -289 -274 -303 -342 -362 -359 -346 -332 -321 -315 -317 -325 -336 -345 -353 -363 -380 -406 -427 -423 -392 -363 -361 -376 -374 -359
4846 -359 -367 -404 -425 -399 -357 -343 -358 -374 -392 -430 -474 -488 -463 -431 -418 -421 -423 -409 -373 -330 -309 -328 -365 -381 -365 -331 -292 -256 -237 -248 -276 -290 -286 -282 -290 -310 -339 -370
4825 -370 -378 -346 -302 -287 -306 -327 -337 -345 -348 -328 -300 -307 -359 -411 -429 -430 -439 -454 -458 -446 -424 -393 -367 -372 -408 -438 -434 -409 -388 -376 -364 -357 -356 -346 -315 -280 -268 -283 -301 -307 -305
4803 -305 -311 -337 -382 -426 -444 -436 -418 -395 -358 -306 -261 -242 -249 -279 -330 -386 -418 -415 -395 -374 -357 -352 -378 -432 -473 -472 -438 -401 -371 -353 -355 -378 -403 -420 -444 -481 -508 -500 -464
4781 -464 -423 -378 -331 -302 -304 -312 -295 -260 -241 -248 -267 -293 -328 -353 -344 -314 -299 -302 -288 -241 -199 -201 -243 -292 -335 -377 -410 -409 -364 -305 -279 -298 -331 -345 -343 -344 -351 -347 -333 -331 -346
4759 -346 -353 -339 -324 -327 -334 -327 -305 -278 -241 -193 -156 -152 -171 -188 -200 -213 -217 -204 -199 -232 -295 -345 -358 -345 -317 -275 -234 -224 -254 -295 -324 -341 -349 -339 -307 -275 -266 -281 -302
4738 -302 -317 -331 -350 -374 -388 -375 -336 -292 -267 -258 -254 -265 -303 -346 -355 -325 -302 -329 -387 -419 -395 -340 -304 -317 -375 -449 -510 -547 -561 -557 -530 -480 -417 -368 -353 -362 -356 -315
4717 -315 -266 -256 -291 -337 -372 -412 -460 -484 -456 -399 -358 -347 -344 -333 -323 -327 -350 -393 -433 -429 -371 -302 -275 -298 -332 -350 -347 -322 -279 -245 -247 -273 -289 -284 -279 -288 -303 -324 -355
4696 -355 -388 -400 -390 -374 -357 -334 -321 -345 -389 -398 -351 -288 -259 -272 -310 -353 -378 -366 -336 -340 -393 -444 -445 -410 -385 -391 -409 -416 -397 -348 -286 -246 -249 -267 -260 -226 -196 -197 -227
4674 -227 -259 -261 -216 -148 -105 -111 -146 -180 -213 -251 -284 -297 -286 -261 -224 -183 -154 -145 -147 -157 -187 -232 -257 -241 -208 -197 -204 -204 -192 -191 -207 -225 -227 -215 -202 -207 -238 -278 -299
4653 -299 -300 -307 -327 -329 -305 -305 -366 -446 -468 -424 -381 -386 -418 -441 -448 -444 -431 -421 -423 -421 -378 -299 -233 -208 -200 -183 -167 -179 -211 -236 -251 -269 -286 -283 -259 -236 -230 -239 -257 -285 -324
4631 -324 -367 -398 -408 -399 -384 -374 -369 -360 -342 -322 -309 -301 -289 -268 -244 -223 -204 -184 -177 -200 -256 -319 -359 -369 -362 -342 -302 -255 -232 -248 -284 -308 -307 -290 -267 -252 -258 -280 -300
4610 -300 -314 -342 -389 -426 -426 -407 -402 -411 -403 -375 -351 -347 -343 -314 -264 -223 -221 -266 -331 -371 -363 -334 -330 -360 -397 -417 -423 -423 -421 -425 -442 -459 -458 -439 -424 -423 -427 -422 -408 -387 -358 -328 -307
4586 -307 -296 -292 -303 -341 -388 -414 -409 -389 -366 -334 -302 -288 -293 -291 -270 -245 -235 -238 -244 -247 -243 -224 -198 -190 -206 -230 -243 -249 -251 -240 -217 -200 -208 -232 -259 -289 -318 -325 -305 -282 -279 -284
4563 -284 -275 -259 -263 -293 -326 -336 -322 -295 -278 -284 -305 -325 -342 -370 -410 -433 -418 -382 -354 -341 -331 -320 -317 -330 -355 -389 -416 -418 -396 -378 -377 -382 -379 -375 -376 -362 -319 -271 -251 -262
4541 -262 -281 -295 -304 -296 -265 -236 -237 -257 -265 -259 -264 -280 -278 -254 -243 -262 -281 -272 -253 -252 -262 -257 -243 -242 -257 -271 -277 -287 -312 -346 -379 -400 -396 -379 -375 -397 -422 -422 -411 -420 -453 -479 -479
4518 -479 -470 -469 -460 -422 -363 -311 -286 -287 -305 -329 -350 -363 -374 -382 -374 -339 -290 -258 -264 -296 -332 -352 -352 -336 -318 -308 -308 -305 -296 -296 -315 -348 -375 -391 -407 -429 -444 -430 -380 -319 -283
4496 -283 -294 -336 -371 -377 -366 -361 -364 -364 -356 -342 -326 -311 -309 -322 -337 -335 -316 -295 -279 -267 -274 -316 -379 -425 -432 -419 -411 -414 -431 -471 -521 -544 -523 -489 -470 -454 -420 -386 -390 -432 -462
4473 -462 -449 -407 -369 -348 -339 -338 -339 -340 -347 -365 -389 -406 -422 -449 -476 -476 -438 -381 -325 -281 -254 -247 -255 -263 -269 -284 -307 -321 -317 -307 -301 -288 -264 -247 -258 -294 -332 -350 -343 -322 -319 -355
4450 -355 -411 -442 -427 -398 -395 -411 -413 -390 -364 -357 -364 -369 -365 -358 -351 -339 -317 -297 -304 -349 -405 -427 -399 -350 -309 -278 -252 -242 -261 -295 -321 -339 -370 -408 -427 -412 -381 -352 -323
4429 -323 -289 -262 -250 -245 -238 -244 -286 -349 -386 -366 -308 -255 -218 -188 -164 -174 -227 -289 -318 -309 -293 -286 -276 -259 -258 -288 -329 -354 -362 -371 -378 -362 -326 -291 -267 -238 -202 -187 -219
4408 -219 -280 -330 -357 -378 -402 -415 -402 -380 -377 -403 -444 -479 -498 -502 -489 -458 -416 -373 -339 -322 -327 -355 -389 -408 -398 -363 -321 -289 -280 -297 -332 -362 -369 -350 -318 -292 -284 -293
4387 -293 -303 -296 -273 -259 -271 -303 -328 -324 -298 -272 -262 -266 -275 -280 -281 -274 -257 -229 -195 -169 -163 -182 -213 -240 -256 -266 -274 -277 -277 -294 -340 -395 -415 -394 -373 -389 -423 -427 -391 -349 -327
4365 -327 -321 -322 -339 -378 -423 -447 -447 -436 -425 -420 -426 -442 -454 -446 -418 -382 -351 -335 -337 -347 -345 -317 -274 -240 -233 -253 -284 -307 -315 -318 -326 -334 -327 -304 -277 -253 -227 -206 -212 -246 -281 -298
4342 -298 -311 -338 -363 -357 -332 -324 -342 -352 -328 -281 -237 -203 -180 -174 -189 -208 -214 -208 -207 -224 -249 -266 -277 -301 -345 -389 -406 -398 -400 -437 -486 -512 -508 -506 -524 -554 -572 -565 -531 -473
4320 -473 -411 -375 -385 -427 -472 -497 -499 -485 -465 -451 -443 -432 -405 -361 -307 -257 -226 -214 -213 -208 -195 -186 -194 -221 -262 -303 -332 -341 -340 -348 -372 -393 -387 -356 -331 -330 -344 -352 -351 -360 -385 -414
4297 -414 -432 -440 -447 -448 -432 -403 -380 -377 -393 -419 -450 -473 -478 -469 -463 -461 -446 -416 -392 -391 -398 -390 -371 -360 -360 -353 -337 -328 -341 -373 -411 -446 -462 -453 -431 -424 -440 -460 -454 -412 -352 -310 -305 -322
4273 -322 -326 -301 -266 -243 -229 -215 -213 -240 -280 -303 -311 -338 -389 -425 -420 -393 -373 -357 -335 -326 -347 -382 -402 -411 -444 -505 -555 -552 -497 -425 -365 -332 -327 -337 -346 -351 -366 -394 -420 -435
4252 -435 -446 -470 -499 -504 -473 -423 -379 -346 -315 -298 -313 -356 -391 -386 -353 -321 -303 -296 -294 -292 -282 -259 -242 -251 -281 -305 -311 -310 -312 -313 -310 -313 -327 -343 -355 -369 -388 -404 -422 -460 -512
4229 -512 -540 -517 -468 -433 -409 -369 -319 -300 -331 -381 -410 -410 -396 -379 -367 -364 -359 -332 -277 -225 -209 -231 -269 -300 -313 -307 -291 -286 -306 -342 -375 -400 -425 -443 -428 -380 -335
4209 -335 -318 -314 -299 -286 -302 -337 -344 -304 -253 -237 -253 -266 -264 -258 -259 -265 -273 -284 -295 -303 -317 -342 -362 -355 -318 -269 -228 -214 -245 -313 -367 -356 -296 -260 -292 -369 -438 -469 -464 -434
4187 -434 -397 -372 -354 -326 -295 -296 -343 -404 -434 -423 -391 -364 -363 -399 -452 -475 -453 -424 -425 -438 -425 -398 -402 -438 -463 -446 -407 -373 -351 -343 -357 -384 -405 -413 -429 -459 -480 -472
4167 -472 -454 -456 -481 -504 -507 -490 -463 -430 -399 -380 -386 -415 -447 -460 -455 -450 -460 -474 -476 -466 -459 -454 -445 -434 -431 -438 -446 -455 -463 -464 -459 -462 -479 -478 -434 -370 -344 -364 -380 -356 -320 -315 -337 -341 -304
4142 -304 -245 -198 -187 -221 -284 -349 -388 -392 -370 -340 -329 -358 -408 -438 -431 -416 -423 -437 -430 -405 -397 -426 -471 -495 -480 -438 -399 -382 -378 -366 -341 -322 -326 -343 -352 -350 -353 -365 -380 -387
4120 -387 -386 -384 -394 -426 -470 -504 -516 -515 -508 -488 -450 -418 -420 -457 -499 -518 -502 -464 -429 -415 -418 -415 -394 -375 -380 -401 -417 -421 -423 -421 -404 -376 -363 -375 -391 -390 -377 -370 -364 -337 -288 -239
4097 -239 -220 -231 -254 -275 -297 -323 -346 -356 -355 -348 -335 -318 -310 -326 -358 -375 -368 -358 -369 -396 -418 -425 -428 -438 -450 -451 -432 -393 -342 -293 -259 -249 -262 -286 -303 -300 -278 -244 -204
4076 -204 -171 -164 -185 -208 -209 -206 -231 -277 -294 -262 -222 -221 -248 -268 -280 -301 -328 -339 -343 -366 -404 -424 -414 -398 -392 -383 -362 -349 -354 -349 -308 -258 -248 -286 -331 -348 -343 -339 -341 -337 -326
4054 -326 -312 -299 -291 -296 -323 -362 -384 -374 -346 -330 -333 -334 -323 -311 -319 -345 -368 -370 -344 -308 -292 -315 -359 -385 -378 -359 -343 -319 -279 -247 -249 -270 -285 -299 -329 -365 -379 -368 -364
4032 -364 -383 -398 -386 -354 -328 -328 -352 -384 -401 -386 -353 -327 -311 -286 -255 -242 -259 -284 -295 -297 -307 -326 -341 -346 -348 -352 -360 -367 -361 -338 -308 -294 -305 -323 -330 -327 -326 -333 -347 -362 -368
4010 -368 -357 -336 -327 -337 -354 -365 -367 -361 -344 -325 -324 -343 -360 -354 -334 -320 -319 -322 -322 -318 -309 -293 -273 -250 -227 -217 -228 -254 -282 -310 -341 -359 -337 -283 -244 -258 -307 -347 -347 -313
3988 -313 -266 -228 -204 -182 -152 -137 -175 -258 -329 -355 -363 -381 -382 -334 -268 -251 -298 -359 -391 -401 -403 -392 -367 -354 -378 -424 -453 -442 -404 -363 -342 -344 -361 -383 -405 -417 -407
3968 -407 -379 -358 -358 -366 -366 -377 -419 -476 -504 -488 -455 -430 -411 -392 -373 -357 -341 -336 -362 -404 -420 -399 -376 -381 -396 -385 -351 -330 -335 -352 -360 -359 -349 -335 -327 -333 -344 -345 -342 -353 -383
3946 -383 -420 -453 -476 -486 -475 -447 -419 -399 -390 -396 -425 -475 -521 -536 -518 -492 -486 -503 -520 -515 -493 -477 -482 -492 -483 -454 -428 -415 -406 -390 -375 -367 -355 -321 -277 -257 -270 -294 -308
3925 -308 -323 -361 -409 -433 -427 -424 -447 -471 -465 -431 -396 -370 -336 -290 -251 -238 -244 -247 -234 -209 -192 -205 -252 -308 -341 -350 -353 -352 -334 -301 -281 -288 -301 -301 -296 -303 -311 -307 -310 -341 -381 -391
3902 -391 -372 -362 -375 -375 -334 -281 -256 -259 -261 -259 -273 -303 -321 -313 -302 -311 -335 -352 -357 -359 -358 -342 -301 -246 -200 -181 -191 -220 -256 -296 -339 -374 -381 -355 -318 -301 -310 -328 -340 -345 -344
3879 -344 -331 -303 -274 -256 -251 -250 -250 -262 -296 -343 -378 -381 -359 -344 -356 -382 -395 -382 -358 -336 -319 -310 -315 -328 -327 -301 -269 -253 -251 -254 -269 -303 -341 -358 -352 -344 -344 -354 -374 -404 -421
3857 -421 -403 -361 -336 -352 -396 -437 -458 -461 -455 -452 -454 -445 -409 -363 -350 -383 -425 -438 -426 -413 -409 -395 -363 -326 -309 -323 -354 -382 -401 -421 -447 -459 -441 -407 -388 -384 -368 -337
3836 -337 -324 -348 -378 -381 -368 -367 -379 -384 -390 -417 -449 -449 -412 -383 -392 -414 -410 -381 -366 -391 -435 -451 -411 -329 -248 -209 -221 -261 -306 -338 -348 -339 -336 -364 -415 -451 -440 -387 -326
3815 -326 -288 -284 -298 -304 -285 -245 -206 -189 -208 -262 -333 -386 -403 -394 -385 -386 -395 -405 -417 -431 -444 -462 -483 -490 -470 -438 -426 -434 -430 -391 -336 -298 -288 -289 -291 -293 -294 -290 -278 -258 -239 -239
3792 -239 -275 -332 -373 -372 -343 -322 -327 -344 -354 -353 -347 -339 -336 -343 -350 -346 -328 -318 -337 -375 -400 -396 -383 -389 -410 -414 -392 -377 -399 -441 -460 -446 -434 -444 -457 -447 -420 -396 -378 -359 -351
3770 -351 -369 -401 -415 -407 -403 -419 -430 -404 -346 -297 -276 -269 -252 -225 -217 -250 -321 -394 -429 -412 -362 -318 -308 -330 -364 -387 -388 -374 -365 -378 -407 -427 -421 -396 -380 -385 -394 -387 -366 -358
3748 -358 -374 -396 -397 -373 -348 -334 -323 -302 -277 -260 -255 -252 -248 -244 -237 -219 -204 -214 -253 -291 -297 -275 -258 -260 -276 -298 -323 -335 -312 -264 -230 -236 -262 -287 -307 -329 -329 -288 -227 -197
3726 -197 -214 -244 -249 -237 -233 -247 -266 -281 -295 -307 -305 -283 -260 -265 -306 -354 -377 -371 -361 -353 -334 -299 -281 -306 -347 -350 -307 -263 -260 -290 -320 -338 -353 -359 -334 -282 -234 -222 -246
3705 -246 -278 -302 -319 -326 -317 -294 -278 -288 -317 -334 -323 -295 -270 -258 -266 -298 -340 -364 -353 -327 -315 -327 -351 -369 -380 -384 -383 -378 -372 -364 -353 -337 -306 -258 -217 -220 -270 -324 -345
3684 -345 -349 -370 -402 -413 -402 -397 -408 -418 -417 -414 -413 -402 -382 -373 -377 -373 -347 -325 -331 -356 -377 -384 -378 -362 -344 -339 -344 -339 -322 -320 -351 -391 -409 -403 -391 -376 -351 -320 -289 -252 -206 -175 -179
3660 -179 -206 -220 -210 -194 -190 -196 -206 -220 -241 -272 -312 -352 -369 -364 -360 -373 -385 -370 -335 -309 -304 -311 -332 -375 -423 -444 -422 -381 -358 -369 -410 -455 -472 -444 -390 -338 -301 -274
3640 -274 -264 -280 -309 -328 -340 -364 -392 -394 -358 -316 -298 -299 -300 -305 -327 -366 -406 -435 -448 -441 -418 -396 -391 -409 -439 -466 -482 -491 -506 -523 -520 -483 -433 -413 -435 -472 -495 -496 -484
3618 -484 -466 -445 -425 -408 -396 -396 -410 -417 -400 -368 -344 -334 -321 -299 -281 -275 -282 -308 -356 -403 -415 -397 -391 -421 -462 -477 -463 -440 -416 -394 -377 -360 -329 -283 -250 -257 -298 -348
3598 -348 -383 -386 -353 -306 -289 -317 -354 -358 -331 -312 -315 -323 -318 -309 -318 -346 -375 -388 -381 -367 -364 -376 -394 -408 -415 -414 -412 -419 -434 -435 -406 -375 -382 -422 -450 -450 -450 -467 -468 -433 -400 -405 -426 -422 -400
3573 -400 -402 -426 -433 -406 -376 -366 -368 -369 -374 -380 -375 -363 -358 -367 -384 -407 -436 -451 -429 -386 -366 -380 -401 -404 -399 -392 -369 -329 -298 -296 -307 -312 -317 -329 -333 -318 -300 -295 -293 -285 -285 -311 -336 -321 -273
3549 -273 -243 -258 -293 -316 -323 -327 -331 -335 -346 -369 -392 -394 -369 -339 -326 -337 -358 -376 -389 -396 -392 -375 -358 -353 -364 -377 -384 -383 -376 -366 -372 -402 -440 -448 -412 -364 -338 -340 -344 -331 -306 -284
3526 -284 -279 -295 -326 -356 -375 -383 -385 -384 -382 -386 -399 -421 -442 -452 -440 -404 -366 -350 -365 -392 -413 -417 -397 -356 -310 -290 -308 -340 -357 -354 -339 -320 -302 -299 -322 -356 -378 -380 -372 -364 -370
3503 -370 -400 -447 -478 -460 -401 -349 -332 -339 -339 -327 -319 -328 -347 -365 -374 -375 -365 -344 -314 -286 -275 -285 -306 -324 -339 -359 -389 -421 -441 -445 -434 -415 -396 -383 -380 -387 -403 -421 -434
3482 -434 -431 -407 -370 -335 -315 -312 -314 -316 -322 -339 -361 -369 -358 -344 -348 -374 -405 -419 -411 -391 -368 -343 -308 -270 -253 -270 -304 -325 -334 -355 -392 -414 -397 -368 -365 -387 -394 -360 -306 -272
3460 -272 -267 -269 -257 -239 -240 -266 -291 -285 -259 -253 -280 -311 -315 -298 -289 -290 -277 -246 -220 -222 -244 -265 -276 -283 -289 -284 -259 -220 -195 -209 -254 -294 -300 -287 -292 -326 -365 -383 -384 -389 -408 -430 -435
3437 -435 -417 -395 -391 -410 -427 -423 -410 -415 -443 -466 -463 -436 -401 -365 -333 -302 -264 -216 -177 -187 -256 -341 -387 -383 -367 -366 -369 -356 -335 -332 -353 -375 -385 -388 -404 -432 -455 -459 -447 -436
3415 -436 -442 -465 -489 -497 -495 -503 -522 -521 -477 -412 -374 -385 -413 -422 -405 -380 -356 -338 -343 -381 -432 -462 -458 -440 -430 -427 -420 -403 -381 -359 -343 -333 -325 -321 -338 -381 -432 -472 -508 -553 -584
3393 -584 -566 -509 -467 -467 -469 -429 -368 -341 -358 -374 -355 -314 -274 -238 -207 -202 -239 -299 -340 -347 -346 -368 -408 -428 -405 -350 -296 -263 -256 -270 -295 -307 -291 -264 -267 -315 -373 -400
3372 -400 -393 -387 -400 -418 -422 -410 -396 -392 -398 -407 -409 -403 -404 -431 -474 -507 -515 -508 -497 -475 -435 -392 -367 -370 -387 -398 -387 -357 -329 -329 -356 -381 -381 -368 -374 -400 -418 -415 -413 -427 -432 -397 -331 -278
3348 -278 -262 -266 -264 -256 -259 -286 -326 -360 -366 -346 -327 -333 -352 -348 -308 -266 -258 -270 -277 -283 -317 -377 -428 -446 -445 -437 -415 -379 -353 -358 -384 -413 -446 -484 -510 -503 -477 -462 -458 -441 -407 -380
3325 -380 -381 -394 -391 -370 -344 -320 -296 -280 -282 -304 -327 -333 -325 -320 -329 -342 -348 -353 -367 -387 -394 -379 -358 -342 -330 -326 -347 -389 -418 -406 -385 -410 -480 -529 -511 -455 -417 -417 -431 -443 -452
3303 -452 -455 -445 -418 -385 -355 -339 -353 -395 -437 -442 -407 -368 -355 -374 -411 -449 -467 -453 -419 -400 -409 -421 -407 -381 -379 -405 -433 -444 -448 -454 -452 -438 -430 -437 -446 -439 -426 -425 -434 -434 -432 -448
3280 -448 -478 -493 -479 -459 -458 -463 -454 -436 -429 -435 -435 -422 -410 -415 -432 -448 -462 -472 -473 -464 -453 -450 -451 -441 -417 -390 -375 -378 -392 -403 -392 -356 -317 -302 -310 -314 -290 -256 -243 -253 -250 -217
3257 -217 -184 -186 -211 -216 -193 -178 -201 -246 -285 -312 -330 -334 -320 -309 -323 -348 -350 -326 -304 -308 -339 -389 -442 -466 -434 -363 -311 -309 -331 -339 -333 -330 -332 -331 -339 -368 -396 -393 -365 -349 -365
3235 -365 -392 -407 -407 -397 -373 -343 -330 -338 -348 -347 -348 -357 -359 -349 -350 -386 -436 -459 -447 -422 -397 -365 -327 -303 -299 -299 -301 -323 -371 -422 -448 -450 -438 -421 -407 -413 -438 -448 -420 -378 -370
3212 -370 -400 -423 -405 -360 -321 -301 -289 -280 -277 -291 -321 -354 -373 -363 -324 -270 -224 -203 -216 -256 -305 -343 -366 -378 -379 -369 -358 -357 -357 -337 -301 -278 -290 -328 -365 -380 -367
3192 -367 -336 -310 -307 -323 -337 -339 -342 -354 -364 -355 -324 -283 -248 -242 -282 -354 -419 -447 -446 -440 -437 -429 -408 -370 -325 -302 -321 -365 -384 -364 -344 -359 -377 -347 -288 -266 -299 -334 -325 -297
3170 -297 -298 -326 -334 -302 -259 -246 -272 -314 -351 -375 -391 -403 -411 -414 -413 -406 -389 -367 -355 -367 -394 -416 -421 -414 -396 -370 -344 -328 -326 -339 -364 -385 -383 -364 -363 -395 -429 -427 -405 -411 -450
3148 -450 -486 -496 -492 -482 -448 -384 -323 -289 -269 -256 -272 -340 -433 -495 -501 -468 -428 -406 -410 -426 -428 -413 -405 -414 -422 -408 -387 -382 -381 -357 -315 -292 -305 -344 -398 -464 -522 -537 -494
3127 -494 -418 -351 -311 -289 -263 -230 -207 -222 -273 -327 -358 -377 -403 -429 -438 -438 -449 -462 -448 -407 -374 -368 -375 -376 -385 -413 -452 -484 -510 -535 -550 -534 -485 -424 -378 -362 -377 -412
3106 -412 -448 -469 -470 -450 -414 -377 -354 -352 -367 -399 -443 -479 -493 -486 -473 -457 -434 -418 -435 -475 -500 -488 -458 -431 -398 -352 -324 -342 -383 -396 -359 -303 -264 -251 -256 -274 -297
3086 -297 -305 -282 -233 -186 -165 -175 -198 -214 -223 -238 -270 -304 -321 -316 -300 -281 -262 -254 -262 -280 -291 -291 -286 -279 -269 -257 -248 -248 -252 -259 -273 -296 -326 -367 -414 -442 -422 -367 -331 -348 -390
3064 -390 -398 -363 -326 -324 -349 -374 -395 -422 -448 -455 -443 -430 -425 -416 -386 -337 -288 -261 -270 -317 -380 -424 -424 -383 -332 -304 -309 -335 -366 -397 -427 -445 -426 -365 -300 -276 -295 -316 -304
3042 -304 -269 -234 -212 -204 -217 -248 -277 -282 -273 -275 -298 -318 -317 -293 -266 -255 -267 -288 -290 -264 -233 -218 -209 -179 -139 -123 -141 -170 -187 -202 -226 -248 -257 -258 -261 -266 -278 -315 -374 -413
3021 -413 -397 -341 -297 -293 -314 -335 -348 -357 -355 -341 -323 -312 -306 -299 -302 -334 -394 -446 -448 -399 -342 -315 -323 -344 -369 -397 -423 -434 -429 -425 -434 -451 -463 -467 -460 -449 -438 -425 -396 -349 -311
2998 -311 -313 -349 -381 -391 -391 -387 -363 -316 -277 -271 -286 -298 -301 -306 -313 -316 -319 -329 -337 -341 -360 -404 -451 -468 -452 -433 -429 -436 -450 -471 -491 -491 -471 -452 -452 -463 -460 -424 -362 -300 -270 -279 -311
2975 -311 -353 -409 -470 -505 -494 -455 -418 -383 -336 -294 -295 -343 -400 -431 -437 -437 -434 -427 -424 -428 -434 -436 -441 -446 -442 -427 -411 -401 -388 -369 -355 -358 -372 -381 -375 -349 -307 -266 -250 -266 -303 -341
2952 -341 -372 -393 -400 -393 -380 -364 -343 -318 -298 -288 -291 -308 -342 -385 -420 -443 -460 -473 -469 -446 -415 -392 -378 -371 -375 -391 -403 -397 -373 -353 -358 -387 -419 -430 -414 -386 -365 -354 -348
2931 -348 -345 -341 -323 -289 -264 -278 -319 -352 -363 -369 -372 -352 -308 -280 -299 -348 -389 -402 -389 -358 -324 -308 -321 -346 -368 -393 -430 -469 -493 -503 -506 -498 -476 -456 -451 -448 -438 -433 -442 -437
2909 -437 -397 -351 -348 -383 -397 -361 -311 -295 -315 -349 -385 -417 -429 -414 -393 -388 -389 -371 -337 -316 -332 -370 -395 -388 -356 -317 -281 -247 -228 -251 -319 -391 -418 -395 -372 -383 -410
2889 -410 -421 -415 -420 -437 -439 -413 -386 -381 -388 -380 -360 -359 -390 -419 -414 -390 -394 -441 -490 -498 -464 -422 -401 -398 -393 -374 -339 -304 -281 -275 -281 -294 -313 -332 -336 -324 -315 -319 -326 -324 -324 -343 -376 -402 -415
2864 -415 -429 -444 -442 -416 -387 -377 -383 -383 -375 -376 -395 -415 -400 -342 -271 -230 -229 -244 -254 -265 -288 -315 -332 -346 -376 -422 -462 -478 -476 -472 -476 -484 -481 -452 -403 -364 -353 -360 -362 -360 -372 -400
2841 -400 -429 -450 -467 -480 -488 -493 -496 -485 -450 -412 -410 -443 -476 -479 -462 -444 -421 -391 -366 -360 -363 -360 -358 -366 -377 -368 -342 -323 -329 -353 -367 -349 -313 -298 -329 -383 -418 -421 -411 -407 -402 -393 -404
2818 -404 -445 -490 -503 -483 -452 -424 -401 -391 -406 -436 -457 -459 -457 -463 -476 -488 -488 -465 -414 -350 -306 -297 -316 -346 -374 -393 -403 -408 -409 -396 -363 -320 -292 -293 -317 -353 -392 -422 -428
2797 -428 -412 -392 -390 -407 -425 -427 -407 -374 -345 -340 -366 -409 -440 -441 -417 -389 -366 -342 -317 -311 -338 -384 -419 -436 -447 -457 -446 -414 -392 -402 -424 -424 -399 -383 -391 -402 -400 -393 -393 -392
2775 -392 -377 -347 -316 -294 -284 -288 -303 -315 -310 -301 -308 -337 -362 -354 -317 -288 -295 -322 -338 -339 -346 -364 -370 -350 -330 -352 -423 -508 -570 -603 -616 -608 -575 -525 -472 -430 -400 -377 -356 -328
2753 -328 -295 -270 -270 -287 -290 -256 -200 -165 -180 -233 -282 -300 -286 -253 -216 -196 -210 -249 -291 -318 -333 -346 -361 -378 -397 -405 -386 -345 -309 -296 -289 -269 -245 -244 -270 -304 -333
2733 -333 -357 -373 -378 -371 -365 -360 -350 -333 -310 -283 -255 -242 -269 -340 -424 -489 -520 -525 -524 -529 -537 -535 -517 -497 -495 -503 -504 -492 -471 -437 -382 -327 -315 -360 -430 -483 -504 -500 -478 -446 -426
2710 -426 -432 -451 -458 -447 -431 -422 -413 -398 -386 -388 -400 -409 -409 -401 -385 -363 -345 -342 -354 -364 -366 -378 -424 -495 -554 -569 -543 -498 -448 -412 -404 -425 -446 -441 -416 -393 -388 -398 -418 -433 -419
2688 -419 -374 -329 -316 -317 -295 -252 -229 -241 -266 -288 -324 -377 -415 -412 -390 -384 -396 -407 -412 -409 -383 -327 -266 -232 -225 -223 -220 -222 -230 -242 -267 -308 -352 -378 -389 -402 -413 -402 -377 -367
2666 -367 -383 -403 -405 -395 -387 -391 -406 -430 -455 -470 -468 -454 -431 -408 -394 -393 -400 -408 -417 -423 -408 -371 -347 -377 -438 -471 -453 -422 -411 -406 -377 -337 -317 -326 -344 -361 -378 -389 -382 -369 -379
2644 -379 -419 -462 -480 -465 -428 -384 -349 -345 -373 -405 -410 -382 -346 -331 -341 -363 -377 -375 -364 -369 -403 -457 -499 -509 -506 -521 -553 -564 -521 -439 -361 -318 -312 -332 -371 -417 -457 -479
2623 -479 -484 -466 -423 -361 -315 -318 -367 -425 -454 -444 -409 -363 -317 -282 -271 -287 -313 -334 -345 -354 -357 -353 -355 -375 -400 -394 -348 -298 -290 -326 -364 -369 -342 -314 -312 -344 -395 -438 -451 -436
2601 -436 -407 -381 -372 -389 -431 -477 -505 -512 -511 -507 -496 -484 -480 -480 -465 -431 -396 -374 -358 -335 -308 -295 -302 -318 -332 -338 -341 -339 -331 -315 -299 -300 -332 -393 -465 -529 -571 -576 -540 -477 -418
2579 -418 -381 -354 -324 -298 -295 -324 -373 -420 -451 -463 -463 -457 -445 -421 -391 -375 -385 -408 -422 -422 -424 -438 -446 -434 -413 -418 -457 -499 -506 -477 -451 -449 -457 -451 -432 -419 -413 -401 -380 -361 -356
2557 -356 -361 -364 -358 -339 -315 -303 -314 -339 -356 -362 -364 -365 -362 -365 -394 -439 -460 -430 -375 -347 -358 -384 -394 -393 -394 -404 -410 -401 -382 -370 -368 -364 -347 -333 -348 -393 -437 -462 -475 -488 -492 -471
2534 -471 -430 -388 -358 -347 -360 -387 -398 -377 -342 -330 -345 -355 -333 -289 -254 -250 -277 -321 -357 -371 -369 -364 -356 -341 -326 -322 -334 -354 -380 -409 -424 -409 -381 -374 -397 -418 -406 -372
2513 -372 -338 -306 -266 -233 -237 -281 -334 -366 -382 -397 -416 -435 -449 -457 -452 -430 -400 -382 -384 -395 -402 -405 -410 -415 -413 -399 -388 -400 -437 -472 -474 -439 -396 -372 -359 -335 -303 -288 -303 -328
2491 -328 -337 -332 -324 -311 -285 -251 -230 -228 -237 -253 -279 -309 -322 -314 -295 -283 -281 -287 -295 -294 -273 -244 -234 -250 -272 -277 -273 -278 -294 -305 -299 -286 -283 -296 -317 -332 -337 -348 -383 -423 -429 -392 -354
2468 -354 -357 -390 -410 -403 -390 -397 -427 -462 -483 -475 -447 -430 -441 -456 -442 -408 -387 -389 -390 -373 -356 -345 -325 -287 -259 -268 -301 -318 -298 -260 -233 -233 -254 -276 -279 -264 -254 -271 -311
2447 -311 -351 -375 -386 -385 -373 -358 -356 -376 -403 -414 -400 -368 -330 -293 -270 -275 -308 -340 -342 -323 -322 -358 -397 -402 -377 -359 -366 -382 -396 -411 -431 -448 -455 -452 -441 -421 -397 -377 -366
2425 -366 -362 -371 -393 -410 -401 -374 -354 -348 -332 -295 -265 -283 -351 -432 -489 -507 -499 -490 -496 -511 -509 -477 -432 -402 -396 -401 -400 -384 -360 -345 -344 -347 -338 -324 -327 -346 -357 -346 -334 -338 -342 -320 -285
2402 -285 -275 -304 -345 -368 -368 -364 -373 -398 -423 -425 -395 -350 -319 -314 -327 -346 -362 -363 -346 -315 -284 -257 -238 -235 -262 -314 -370 -407 -419 -416 -404 -387 -366 -351 -355 -388 -436 -471 -475 -455
2380 -455 -423 -384 -351 -344 -368 -397 -399 -376 -358 -364 -377 -370 -338 -303 -290 -311 -354 -401 -433 -446 -441 -422 -394 -362 -328 -294 -270 -270 -296 -332 -366 -395 -414 -413 -397 -385 -389 -399 -406
2359 -406 -421 -442 -445 -418 -383 -366 -362 -356 -359 -383 -403 -383 -334 -301 -298 -295 -276 -266 -284 -310 -322 -324 -329 -326 -306 -283 -279 -291 -304 -314 -336 -369 -395 -400 -385 -365 -346 -321 -279 -231
2337 -231 -211 -240 -297 -349 -387 -423 -452 -459 -451 -450 -452 -430 -388 -367 -385 -407 -403 -390 -394 -403 -391 -365 -350 -347 -342 -344 -367 -390 -380 -341 -315 -328 -369 -416 -455 -471 -460 -446 -463 -502
2315 -502 -516 -479 -418 -372 -346 -329 -315 -302 -283 -264 -266 -300 -342 -358 -345 -326 -321 -327 -333 -336 -343 -358 -373 -374 -358 -344 -353 -376 -387 -374 -355 -350 -361 -375 -384 -384 -371 -349 -330 -327 -335
2293 -335 -344 -352 -365 -385 -405 -420 -426 -422 -412 -407 -413 -431 -457 -481 -490 -484 -479 -495 -522 -529 -504 -476 -473 -490 -493 -468 -437 -422 -421 -416 -394 -355 -313 -288 -289 -311 -329 -318 -279 -237 -221 -242
2270 -242 -279 -304 -302 -279 -250 -228 -219 -221 -228 -238 -260 -296 -326 -329 -309 -291 -293 -310 -330 -358 -398 -430 -436 -427 -433 -458 -472 -458 -429 -406 -390 -367 -338 -320 -318 -321 -318 -320 -338 -364 -383
2248 -383 -388 -393 -403 -406 -390 -364 -351 -356 -367 -372 -371 -355 -321 -288 -294 -345 -400 -413 -389 -367 -361 -350 -328 -324 -363 -423 -463 -470 -463 -460 -457 -443 -411 -373 -344 -334 -330 -309 -266 -226 -213 -228
2225 -228 -254 -277 -290 -291 -296 -328 -386 -433 -442 -429 -422 -425 -415 -394 -382 -386 -390 -391 -412 -456 -498 -512 -497 -461 -410 -365 -361 -394 -417 -400 -377 -396 -449 -489 -505 -518 -529 -515 -478
2204 -478 -452 -447 -429 -380 -331 -313 -313 -303 -289 -296 -321 -341 -345 -336 -317 -296 -287 -299 -315 -318 -322 -349 -385 -396 -377 -360 -367 -377 -366 -341 -326 -334 -351 -360 -350 -323 -293 -277 -273 -257 -223
2181 -223 -197 -213 -270 -329 -361 -368 -368 -375 -388 -392 -370 -316 -255 -231 -257 -303 -332 -343 -368 -420 -471 -493 -490 -488 -496 -498 -484 -465 -455 -457 -463 -461 -450 -433 -426 -436 -455 -462 -446 -411 -374
2159 -374 -348 -342 -354 -367 -363 -342 -315 -286 -253 -227 -239 -293 -363 -414 -444 -457 -445 -405 -359 -344 -366 -400 -420 -421 -404 -373 -338 -322 -339 -378 -415 -431 -416 -380 -344 -321
2139 -321 -310 -298 -285 -276 -266 -253 -249 -271 -313 -355 -379 -390 -394 -392 -389 -385 -374 -351 -325 -314 -317 -321 -321 -326 -340 -357 -381 -415 -443 -441 -417 -406 -423 -441 -441 -437 -452 -476 -491 -495 -499 -497 -477
2116 -477 -444 -415 -398 -392 -399 -415 -427 -425 -427 -447 -470 -468 -441 -416 -403 -386 -363 -353 -366 -378 -367 -347 -344 -359 -371 -373 -378 -397 -423 -448 -473 -498 -512 -514 -519 -548 -588 -606 -591 -567
2094 -567 -556 -548 -523 -496 -493 -502 -485 -439 -410 -427 -461 -461 -419 -365 -318 -286 -276 -295 -318 -317 -298 -300 -338 -382 -399 -386 -358 -327 -302 -289 -283 -272 -259 -266 -309 -377 -439 -472 -467
2073 -467 -435 -398 -376 -371 -369 -358 -345 -341 -351 -371 -394 -410 -418 -428 -449 -472 -475 -452 -420 -397 -384 -371 -355 -342 -334 -327 -315 -291 -262 -237 -222 -209 -196 -198 -232 -289 -347 -406 -475
2052 -475 -536 -538 -465 -369 -324 -354 -421 -482 -527 -557 -565 -541 -493 -439 -401 -396 -424 -459 -471 -452 -425 -416 -429 -451 -462 -452 -422 -384 -351 -323 -291 -257 -240 -260 -310 -363 -393
2031 -393 -399 -393 -381 -366 -354 -357 -377 -397 -405 -405 -407 -410 -403 -385 -368 -356 -339 -314 -299 -314 -353 -390 -410 -419 -428 -435 -431 -420 -413 -416 -419 -418 -425 -449 -467 -444 -375 -306 -284 -307 -334 -344 -353 -373
2007 -373 -379 -350 -306 -288 -303 -323 -321 -306 -300 -314 -335 -345 -338 -323 -319 -335 -355 -357 -341 -325 -317 -315 -318 -331 -349 -355 -344 -334 -342 -361 -378 -393 -411 -421 -411 -388 -371 -362 -344 -315 -295
1985 -295 -299 -320 -341 -364 -392 -418 -428 -428 -433 -448 -463 -472 -476 -478 -472 -459 -444 -430 -417 -406 -406 -416 -425 -422 -407 -387 -369 -365 -382 -405 -409 -389 -371 -387 -436 -487 -510 -501 -480 -466 -462 -453
1962 -453 -431 -412 -421 -456 -487 -495 -485 -472 -456 -435 -416 -406 -403 -400 -400 -410 -422 -430 -439 -456 -474 -474 -456 -437 -425 -410 -382 -350 -330 -334 -355 -381 -404 -428 -450 -456 -429 -386 -372 -413
1940 -413 -478 -520 -528 -527 -530 -525 -501 -470 -446 -422 -379 -318 -268 -258 -293 -338 -362 -367 -385 -426 -470 -498 -516 -534 -538 -521 -503 -508 -522 -514 -479 -440 -407 -377 -358 -364 -385 -392 -379 -365
1919 -365 -366 -380 -407 -450 -490 -502 -488 -476 -469 -448 -418 -403 -402 -384 -345 -326 -354 -392 -393 -363 -337 -332 -337 -337 -330 -325 -340 -387 -448 -482 -482 -480 -491 -489 -452 -403 -370 -350 -328 -316 -328
1896 -328 -356 -388 -433 -489 -523 -509 -467 -432 -415 -412 -431 -467 -489 -475 -459 -479 -515 -521 -494 -469 -458 -443 -417 -400 -401 -411 -428 -454 -466 -445 -409 -394 -400 -401 -389 -393 -421 -453
1876 -453 -469 -467 -450 -417 -376 -346 -335 -341 -355 -364 -358 -348 -355 -375 -376 -354 -350 -380 -401 -379 -351 -365 -408 -440 -461 -490 -515 -517 -513 -520 -514 -478 -447 -446 -430 -379 -355 -395 -416 -351 -276
1853 -276 -275 -271 -163 -32 2 52 299 681 1088 1825 3360 5394 6695 6296 4594 2867 1875 1397 990 619 429 349 226 87
1840 87 31 26 -16 -74 -88 -87 -121 -149 -126 -110 -168 -248 -253 -199 -172 -192 -209 -207 -217 -238 -247 -251 -270 -286 -268 -246 -276 -353 -418 -435 -416 -377 -320 -266 -246 -264 -295 -317
1819 -317 -328 -331 -337 -354 -376 -378 -353 -336 -352 -387 -413 -434 -455 -459 -433 -409 -420 -449 -455 -435 -419 -416 -411 -400 -392 -384 -368 -350 -340 -329 -307 -288 -295 -318 -336 -353 -385 -426 -453 -460
1798 -460 -460 -447 -400 -321 -238 -180 -156 -169 -210 -260 -304 -344 -386 -417 -420 -402 -391 -394 -400 -394 -376 -350 -329 -333 -358 -375 -365 -345 -339 -337 -332 -350 -413 -483 -499 -462 -429 -431 -439 -426
1776 -426 -403 -390 -388 -385 -376 -355 -325 -308 -328 -374 -408 -415 -417 -425 -422 -400 -378 -378 -387 -389 -380 -367 -348 -326 -317 -333 -364 -391 -407 -413 -416 -422 -426 -403 -338 -265 -234 -254 -279 -272 -242 -220 -217 -228
1752 -228 -253 -280 -288 -272 -259 -269 -290 -303 -317 -344 -374 -389 -394 -403 -415 -415 -401 -386 -381 -383 -382 -369 -342 -317 -310 -321 -325 -313 -302 -306 -311 -301 -286 -283 -290 -295 -298 -303 -300 -279 -261 -278 -326
1728 -326 -365 -368 -353 -349 -357 -354 -329 -296 -280 -290 -321 -361 -402 -435 -449 -439 -418 -405 -397 -379 -350 -328 -325 -337 -355 -382 -412 -421 -395 -355 -335 -340 -349 -360 -390 -444 -495 -507 -477
1707 -477 -434 -415 -433 -468 -480 -457 -424 -415 -436 -458 -459 -441 -416 -392 -372 -354 -336 -320 -319 -344 -390 -433 -460 -472 -468 -442 -396 -349 -319 -307 -297 -281 -263 -253 -257 -273 -296
1687 -296 -320 -336 -342 -345 -359 -390 -423 -429 -397 -343 -299 -289 -314 -348 -365 -353 -320 -282 -252 -240 -255 -290 -315 -307 -281 -272 -291 -316 -332 -355 -400 -451 -479 -482 -474 -458 -431 -411
1666 -411 -420 -449 -468 -471 -470 -468 -448 -409 -374 -360 -353 -341 -343 -376 -421 -440 -419 -381 -359 -364 -381 -387 -368 -334 -320 -347 -392 -408 -378 -336 -321 -339 -364 -374 -374 -379 -392 -398 -380 -339
1644 -339 -298 -283 -300 -327 -338 -328 -315 -313 -326 -353 -388 -415 -415 -391 -365 -355 -349 -338 -330 -343 -372 -395 -414 -446 -491 -522 -523 -505 -481 -444 -400 -374 -383 -406 -410 -391 -371 -358
1624 -358 -348 -344 -354 -373 -389 -398 -407 -413 -416 -429 -463 -497 -502 -477 -457 -455 -454 -438 -422 -424 -437 -449 -463 -484 -499 -493 -471 -453 -442 -432 -420 -411 -404 -395 -381 -362 -335 -299 -265 -252 -265
1601 -265 -291 -315 -326 -327 -325 -327 -332 -335 -335 -335 -338 -340 -339 -334 -324 -310 -297 -289 -286 -288 -292 -298 -302 -307 -329 -373 -416 -421 -386 -358 -374 -418 -438 -410 -365 -344 -354 -364 -352 -330 -328 -356 -396 -427 -445
1577 -445 -455 -451 -432 -417 -434 -471 -488 -465 -428 -408 -406 -410 -421 -440 -452 -437 -409 -389 -376 -356 -337 -344 -383 -425 -452 -468 -478 -470 -442 -410 -387 -374 -370 -381 -402 -413 -403 -384
1556 -384 -372 -371 -373 -377 -377 -364 -342 -336 -362 -404 -428 -416 -388 -374 -393 -429 -444 -422 -393 -405 -459 -500 -489 -452 -437 -450 -459 -453 -449 -452 -442 -413 -389 -382 -374 -355 -346 -365 -394 -412 -430
1534 -430 -470 -521 -544 -523 -484 -457 -454 -469 -486 -481 -443 -389 -356 -361 -385 -401 -401 -394 -390 -395 -410 -427 -433 -424 -409 -390 -362 -329 -317 -339 -379 -411 -427 -431 -427 -418 -423 -450 -481 -485 -457 -423
1511 -423 -406 -406 -416 -436 -464 -480 -468 -432 -392 -372 -380 -404 -416 -401 -376 -377 -400 -405 -363 -302 -274 -292 -329 -358 -381 -406 -425 -423 -405 -384 -370 -362 -361 -362 -351 -317 -267 -229 -225
1490 -225 -254 -292 -313 -310 -299 -300 -319 -345 -368 -390 -411 -412 -382 -336 -311 -321 -338 -334 -304 -273 -259 -267 -299 -348 -392 -410 -410 -416 -429 -429 -402 -360 -324 -296 -270 -255 -259 -273 -280 -284
1468 -284 -299 -322 -339 -346 -359 -393 -435 -463 -469 -462 -449 -436 -423 -412 -408 -417 -433 -441 -433 -416 -404 -398 -396 -394 -394 -394 -397 -400 -401 -390 -375 -378 -407 -444 -470 -489 -504 -495 -445 -380 -354 -374 -401
1444 -401 -404 -395 -394 -388 -364 -331 -312 -312 -326 -354 -387 -414 -432 -453 -478 -486 -466 -439 -424 -408 -377 -352 -370 -435 -513 -561 -558 -508 -449 -427 -454 -492 -499 -480 -459 -444 -422 -398 -386
1423 -386 -381 -373 -371 -389 -412 -416 -408 -419 -445 -452 -431 -411 -408 -404 -390 -389 -418 -455 -474 -480 -481 -465 -421 -376 -374 -423 -490 -535 -541 -508 -458 -428 -436 -466 -485 -484 -478 -475 -472 -469 -472 -480 -480 -462 -428 -389
1398 -389 -359 -346 -345 -349 -358 -377 -401 -404 -379 -344 -326 -324 -319 -304 -289 -278 -271 -276 -307 -357 -398 -408 -394 -381 -377 -371 -347 -305 -266 -249 -255 -276 -306 -339 -353 -321 -255 -201 -195 -217 -230
1376 -230 -231 -251 -298 -338 -337 -304 -269 -255 -267 -301 -350 -395 -420 -429 -437 -452 -464 -467 -475 -505 -549 -566 -527 -450 -388 -368 -371 -364 -347 -349 -378 -403 -397 -368 -340 -319 -291 -251 -229 -255
1354 -255 -321 -380 -396 -383 -381 -403 -424 -423 -416 -426 -448 -455 -437 -403 -366 -334 -320 -335 -367 -392 -398 -392 -382 -365 -343 -329 -327 -329 -334 -357 -401 -440 -444 -420 -405 -420 -446 -455 -446 -442 -451 -455
1331 -455 -433 -390 -349 -331 -334 -355 -387 -420 -430 -410 -372 -339 -312 -286 -269 -272 -290 -296 -290 -302 -357 -432 -483 -485 -455 -421 -401 -407 -440 -481 -501 -487 -458 -437 -426 -410 -392 -392
1310 -392 -418 -450 -464 -461 -454 -442 -409 -358 -321 -322 -347 -368 -376 -389 -422 -466 -504 -523 -520 -495 -450 -396 -347 -316 -301 -291 -279 -276 -292 -324 -357 -391 -437 -487 -509 -486 -445 -432
1290 -432 -452 -472 -463 -432 -398 -369 -351 -355 -386 -426 -443 -423 -380 -340 -314 -305 -311 -329 -356 -382 -403 -420 -433 -435 -416 -383 -359 -366 -400 -441 -471 -481 -470 -452 -441 -440 -438 -427 -421
1268 -421 -431 -443 -433 -405 -386 -390 -406 -422 -434 -441 -435 -419 -402 -385 -359 -333 -336 -379 -430 -451 -438 -416 -411 -429 -456 -473 -466 -437 -401 -369 -347 -346 -372 -404 -407 -376 -339 -319 -305
1247 -305 -290 -287 -305 -328 -340 -355 -384 -401 -376 -325 -298 -315 -350 -376 -386 -382 -356 -322 -309 -330 -363 -387 -399 -408 -411 -405 -394 -372 -338 -311 -322 -365 -395 -380 -346 -333 -342 -343
1227 -343 -332 -327 -336 -344 -351 -375 -419 -457 -464 -446 -421 -401 -391 -401 -428 -456 -471 -478 -483 -476 -450 -421 -419 -446 -472 -471 -451 -435 -434 -449 -479 -515 -530 -498 -425 -356 -329 -341 -361 -373
1205 -373 -383 -399 -413 -420 -425 -426 -407 -357 -288 -235 -216 -229 -268 -330 -399 -440 -427 -377 -336 -336 -364 -389 -388 -364 -332 -316 -329 -372 -423 -457 -461 -446 -431 -430 -435 -427 -398 -367 -369 -413
1183 -413 -467 -494 -492 -482 -470 -441 -394 -355 -345 -356 -363 -363 -368 -386 -405 -413 -412 -408 -405 -405 -407 -405 -385 -341 -290 -261 -270 -307 -340 -353 -355 -370 -402 -435 -456 -464 -460 -440 -402 -360 -330 -318
1160 -318 -317 -326 -344 -362 -371 -374 -384 -401 -406 -396 -394 -417 -448 -453 -422 -375 -338 -316 -309 -320 -355 -406 -454 -484 -492 -478 -443 -400 -374 -374 -384 -379 -357 -337 -330 -338 -360 -401 -456 -496 -500 -473
1137 -473 -446 -441 -459 -489 -520 -534 -517 -473 -424 -398 -412 -452 -482 -468 -415 -359 -334 -346 -378 -413 -439 -445 -428 -400 -383 -384 -402 -430 -463 -490 -500 -491 -466 -433 -399 -377 -372
1117 -372 -374 -372 -365 -363 -365 -363 -358 -363 -384 -414 -444 -474 -504 -524 -525 -511 -498 -494 -490 -473 -444 -415 -402 -406 -427 -459 -490 -505 -502 -494 -490 -477 -449 -428 -443 -487 -520 -520 -498 -476 -457 -446 -454
1094 -454 -473 -473 -440 -403 -389 -384 -368 -356 -374 -413 -440 -451 -470 -495 -501 -483 -474 -491 -517 -531 -524 -491 -429 -372 -365 -414 -463 -471 -454 -447 -450 -446 -442 -455 -483 -505 -508 -498 -483 -467 -459
1071 -459 -448 -413 -354 -309 -310 -344 -371 -377 -379 -386 -388 -382 -385 -410 -444 -459 -431 -371 -318 -312 -344 -368 -355 -321 -302 -308 -330 -362 -395 -410 -398 -376 -368 -369 -360 -336 -311 -296 -289 -302 -342
1049 -342 -389 -416 -415 -403 -388 -371 -372 -415 -483 -529 -526 -499 -481 -479 -485 -487 -473 -428 -359 -304 -288 -298 -308 -318 -342 -381 -416 -438 -453 -468 -479 -482 -484 -482 -462 -424 -390 -386 -411 -439
1027 -439 -450 -446 -434 -415 -391 -379 -396 -429 -440 -411 -357 -311 -290 -297 -322 -344 -348 -342 -347 -364 -376 -379 -391 -423 -452 -459 -458 -460 -453 -429 -410 -424 -454 -467 -463 -461 -455 -420 -368 -342 -360
1005 -360 -399 -439 -481 -513 -511 -482 -468 -484 -496 -483 -468 -474 -482 -463 -433 -432 -461 -486 -488 -476 -452 -406 -342 -295 -287 -305 -313 -296 -270 -263 -280 -307 -328 -343 -349 -338 -311 -299 -323
983 -323 -360 -373 -362 -350 -341 -319 -297 -313 -366 -402 -385 -344 -322 -312 -288 -264 -280 -339 -404 -449 -476 -485 -472 -450 -439 -441 -441 -433 -429 -432 -435 -434 -432 -429 -424 -425 -434 -433 -398 -340 -291 -272 -270
960 -270 -262 -247 -234 -233 -241 -245 -243 -246 -271 -306 -321 -314 -326 -391 -478 -529 -525 -494 -466 -442 -415 -389 -376 -382 -412 -449 -462 -429 -376 -340 -329 -327 -332 -361 -400 -413 -384 -344 -325 -332 -358
938 -358 -395 -425 -427 -403 -386 -393 -400 -376 -324 -275 -252 -258 -278 -290 -284 -278 -302 -355 -395 -386 -340 -296 -273 -259 -251 -259 -290 -331 -362 -372 -371 -377 -395 -407 -389 -342 -303 -302 -328 -344 -328
915 -328 -297 -285 -300 -324 -342 -365 -406 -452 -469 -448 -419 -410 -412 -404 -395 -403 -415 -402 -368 -343 -336 -327 -311 -304 -306 -297 -277 -276 -313 -359 -384 -392 -398 -398 -385 -376 -386 -408 -421 -425 -422 -407 -380 -360
891 -360 -359 -358 -337 -311 -305 -322 -341 -358 -370 -359 -318 -277 -274 -302 -317 -311 -314 -347 -392 -433 -469 -488 -461 -391 -323 -302 -322 -350 -373 -403 -439 -467 -470 -446 -403 -362 -344 -349 -350 -325
870 -325 -293 -290 -328 -375 -395 -382 -362 -362 -382 -400 -395 -374 -356 -351 -361 -391 -441 -486 -486 -428 -351 -305 -307 -335 -359 -360 -333 -287 -249 -241 -262 -289 -314 -345 -376 -376 -335 -288 -284 -326
848 -326 -376 -407 -431 -454 -461 -445 -426 -420 -406 -370 -339 -353 -404 -443 -447 -445 -454 -451 -412 -359 -334 -348 -373 -378 -353 -310 -277 -281 -321 -365 -388 -392 -388 -373 -342 -302 -264 -232 -218 -244
826 -244 -310 -373 -397 -391 -381 -367 -336 -310 -324 -365 -388 -385 -390 -417 -429 -399 -345 -310 -308 -328 -358 -390 -412 -421 -422 -410 -374 -326 -302 -320 -359 -389 -408 -427 -440 -434 -414 -392 -374
805 -374 -367 -383 -424 -464 -477 -470 -467 -469 -456 -421 -377 -340 -305 -276 -272 -301 -345 -372 -367 -345 -334 -352 -393 -433 -452 -446 -433 -427 -432 -438 -433 -410 -382 -373 -392 -420 -433 -425 -413 -403 -378 -333
782 -333 -291 -284 -312 -341 -337 -305 -276 -268 -272 -271 -259 -249 -249 -261 -279 -293 -297 -293 -288 -286 -285 -285 -294 -312 -329 -337 -341 -349 -352 -336 -308 -287 -284 -298 -327 -369 -410 -429 -420 -398 -380 -365 -353 -353 -373
757 -373 -406 -438 -457 -461 -452 -436 -420 -398 -360 -312 -280 -281 -307 -339 -362 -378 -398 -428 -461 -470 -442 -405 -407 -457 -509 -517 -481 -432 -395 -379 -396 -445 -500 -527 -520 -503 -492 -482 -463
736 -463 -443 -435 -446 -464 -462 -422 -358 -311 -306 -328 -340 -331 -323 -337 -365 -374 -339 -270 -210 -192 -212 -245 -279 -316 -349 -364 -364 -372 -387 -381 -342 -307 -316 -357 -381 -371 -350 -348 -362 -375 -381
714 -381 -383 -381 -373 -360 -347 -349 -376 -410 -413 -373 -321 -299 -307 -310 -298 -293 -315 -356 -397 -429 -449 -452 -434 -404 -377 -367 -369 -360 -325 -285 -282 -324 -364 -370 -372 -416 -487 -525 -509 -479 -471 -470 -447
690 -447 -401 -354 -324 -320 -344 -375 -383 -357 -321 -300 -290 -286 -297 -325 -353 -371 -393 -430 -466 -468 -434 -382 -330 -288 -263 -261 -272 -289 -316 -354 -390 -410 -413 -410 -402 -390 -389 -406 -426 -417
668 -417 -373 -322 -294 -294 -303 -304 -304 -328 -380 -435 -461 -459 -448 -435 -410 -385 -388 -421 -453 -473 -495 -521 -515 -456 -390 -370 -394 -411 -398 -370 -347 -343 -363 -399 -418 -405 -389 -409 -452
647 -452 -465 -432 -387 -361 -351 -350 -369 -402 -421 -416 -408 -416 -422 -408 -393 -398 -417 -423 -410 -394 -384 -376 -371 -373 -384 -403 -427 -441 -431 -402 -384 -395 -411 -403 -377 -366 -382 -406 -421 -431 -445
625 -445 -464 -484 -501 -505 -486 -447 -412 -398 -400 -404 -403 -402 -398 -384 -359 -339 -343 -370 -395 -405 -406 -417 -437 -452 -455 -448 -436 -420 -411 -421 -450 -481 -495 -487 -462 -431 -412 -415 -435 -451 -459 -473
602 -473 -496 -506 -479 -430 -396 -389 -394 -390 -382 -383 -391 -391 -374 -346 -330 -338 -357 -367 -364 -368 -391 -421 -440 -442 -434 -411 -376 -350 -364 -409 -439 -425 -389 -369 -371 -369 -354 -343 -351 -374 -398 -420 -442
579 -442 -467 -496 -526 -545 -538 -502 -458 -433 -430 -433 -428 -423 -429 -440 -440 -424 -408 -407 -415 -418 -407 -396 -393 -391 -378 -353 -331 -324 -328 -336 -351 -375 -401 -411 -394 -355 -308 -273 -263 -286 -341 -416 -492
555 -492 -541 -547 -527 -518 -540 -569 -569 -534 -496 -477 -466 -435 -382 -337 -330 -363 -409 -430 -408 -367 -341 -339 -348 -365 -403 -461 -504 -512 -506 -514 -521 -495 -448 -422 -433 -443 -418 -365 -310 -270
533 -270 -249 -252 -274 -292 -306 -341 -414 -497 -544 -540 -504 -456 -409 -383 -390 -418 -440 -450 -454 -452 -438 -415 -394 -376 -355 -340 -347 -369 -379 -375 -386 -425 -469 -498 -526 -564 -587 -568 -527
512 -527 -511 -527 -535 -512 -479 -467 -468 -458 -431 -406 -392 -381 -365 -350 -347 -362 -392 -429 -460 -478 -483 -481 -474 -460 -433 -388 -327 -270 -252 -289 -367 -450 -512 -549 -564 -558 -540 -523 -510
491 -510 -491 -462 -445 -458 -489 -499 -473 -435 -417 -421 -425 -422 -425 -445 -473 -493 -496 -481 -450 -418 -404 -417 -445 -465 -475 -480 -474 -445 -402 -374 -381 -406 -420 -420 -420 -423 -425 -423 -411 -375 -317 -269
468 -269 -263 -285 -287 -254 -225 -234 -269 -305 -340 -378 -402 -391 -362 -349 -359 -375 -386 -399 -418 -441 -471 -507 -523 -498 -449 -419 -416 -410 -383 -357 -355 -363 -358 -339 -321 -306 -288 -270 -269 -283
446 -283 -295 -288 -269 -265 -300 -366 -433 -475 -489 -478 -439 -384 -355 -381 -434 -458 -446 -443 -473 -503 -500 -473 -444 -406 -355 -323 -347 -406 -445 -434 -393 -350 -317 -293 -281 -285 -306 -346
425 -346 -397 -442 -470 -487 -496 -485 -452 -416 -392 -373 -355 -353 -377 -404 -410 -404 -405 -402 -380 -361 -375 -403 -398 -362 -336 -333 -327 -311 -317 -352 -369 -340 -309 -326 -379 -416 -410 -375 -330 -293 -286
403 -286 -311 -344 -359 -363 -372 -381 -383 -387 -404 -417 -410 -396 -399 -409 -400 -378 -377 -416 -469 -499 -492 -454 -403 -363 -351 -359 -371 -385 -417 -465 -506 -523 -519 -503 -478 -437 -387 -344 -325 -342 -383
381 -383 -419 -426 -404 -378 -360 -347 -336 -335 -347 -357 -345 -311 -284 -290 -328 -367 -385 -386 -391 -401 -392 -355 -314 -296 -304 -320 -329 -329 -319 -308 -316 -353 -395 -411 -395 -364 -336 -315 -302 -293 -287
358 -287 -285 -304 -346 -384 -389 -371 -369 -393 -417 -419 -407 -397 -390 -384 -380 -378 -372 -363 -360 -361 -352 -327 -302 -290 -292 -304 -324 -338 -325 -290 -272 -295 -336 -361 -366 -366 -359 -337 -314 -324 -368 -417 -445 -463
334 -463 -485 -504 -499 -466 -426 -404 -408 -433 -465 -489 -496 -496 -505 -535 -574 -593 -576 -534 -495 -473 -458 -445 -439 -450 -464 -463 -443 -426 -434 -471 -517 -541 -529 -489 -447 -418 -401 -398 -409 -424
313 -424 -421 -389 -347 -316 -298 -289 -298 -338 -390 -420 -418 -407 -405 -402 -377 -337 -304 -296 -313 -340 -359 -354 -334 -327 -347 -381 -403 -409 -408 -405 -398 -390 -388 -393 -393 -382 -373 -373 -374 -364 -344 -326 -316 -309 -302 -298 -302
287 -302 -317 -336 -354 -371 -393 -420 -437 -430 -402 -378 -376 -385 -377 -346 -316 -309 -322 -338 -345 -336 -310 -280 -273 -302 -342 -362 -361 -361 -367 -364 -353 -365 -407 -438 -415 -358 -329 -354 -397 -415 -408 -405
264 -405 -411 -409 -394 -384 -392 -411 -428 -433 -421 -388 -351 -339 -367 -407 -422 -409 -394 -391 -392 -394 -412 -453 -494 -505 -486 -454 -421 -387 -358 -346 -346 -335 -311 -290 -289 -301 -318 -342 -370 -389
242 -389 -392 -388 -387 -387 -388 -400 -429 -459 -469 -464 -468 -496 -539 -581 -611 -621 -605 -565 -520 -480 -445 -410 -386 -390 -423 -460 -478 -471 -449 -421 -388 -357 -343 -360 -401 -443 -467 -466 -444 -414
221 -414 -396 -401 -422 -445 -458 -465 -467 -464 -452 -430 -406 -393 -403 -434 -464 -475 -472 -472 -468 -439 -382 -329 -312 -335 -386 -456 -526 -566 -560 -529 -508 -500 -483 -459 -450 -461 -469 -457 -438 -432 -438 -443
198 -443 -451 -469 -494 -508 -496 -460 -412 -364 -327 -306 -305 -328 -369 -399 -386 -333 -281 -270 -294 -323 -340 -358 -390 -430 -458 -468 -463 -448 -428 -407 -390 -377 -363 -349 -343 -356 -387
177 -387 -430 -473 -505 -518 -509 -481 -443 -410 -392 -397 -413 -413 -385 -353 -359 -405 -447 -450 -435 -450 -502 -550 -566 -564 -556 -527 -464 -396 -367 -384 -414 -428 -429 -426 -412 -381 -350 -348 -373 -393
156 -393 -385 -361 -348 -348 -340 -315 -295 -306 -346 -389 -418 -440 -458 -465 -459 -459 -478 -506 -518 -506 -488 -479 -479 -473 -456 -431 -406 -383 -363 -347 -339 -336 -332 -321 -301 -274 -248 -238 -256 -297 -347
133 -347 -391 -429 -454 -449 -407 -356 -331 -340 -362 -383 -411 -450 -481 -486 -476 -474 -483 -485 -466 -437 -417 -406 -395 -374 -355 -352 -370 -397 -415 -419 -413 -401 -384 -378 -397 -434 -465 -478 -487 -507 -526
111 -526 -526 -504 -486 -487 -502 -513 -514 -512 -515 -522 -525 -519 -515 -524 -543 -551 -538 -516 -493 -472 -454 -451 -464 -474 -466 -450 -443 -446 -444 -438 -435 -441 -455 -478 -505 -510 -473 -414 -376 -376 -386 -377 -359 -353 -364 -384 -410
85 -410 -435 -442 -417 -378 -359 -382 -433 -481 -498 -488 -474 -480 -504 -524 -529 -529 -539 -550 -543 -518 -494 -481 -468 -443 -411 -385 -372 -369 -375 -389 -411 -430 -426 -389 -333 -292 -295 -333 -374 -391
64 -391 -384 -375 -384 -412 -449 -481 -501 -509 -504 -482 -447 -416 -406 -420 -445 -464 -468 -454 -426 -401 -392 -406 -428 -441 -438 -428 -424 -428 -434 -436 -434 -424 -409 -393 -387 -390 -393 -392 -399 -424 -452 -457 -433 -400 -378
39 -378 -369 -363 -360 -364 -378 -395 -410 -413 -390 -341 -292 -272 -282 -299 -315 -348 -408 -469 -494 -476 -440 -409 -384 -359 -340 -342 -370 -415 -462 -494 -495 -470 -437 -417 -412 -409 -398 -394 -418 -468 -516
17 -516 -538 -542 -554 -582 -602 -587 -542 -495 -458 -420 -380 -361 -378 -413 -435 -447 -475 -515 -534 -512 -476 -457 -453 -450 -450 -463 -472 -450 -404 -377 -388 -410 -415 -409 -417 -440 -453 -444 -426 -416
-5 -416 -418 -425 -433 -442 -459 -477 -474 -436 -382 -352 -368 -417 -474 -519 -538 -516 -456 -389 -352 -348 -359 -372 -384 -388 -381 -371 -371 -376 -374 -368 -369 -372 -362 -346 -345 -363 -378 -385 -402 -432 -445 -421 -386 -377
-29 -377 -396 -413 -411 -398 -380 -359 -353 -379 -419 -431 -404 -373 -381 -424 -463 -473 -459 -442 -431 -420 -408 -399 -401 -412 -418 -408 -388 -370 -355 -348 -359 -395 -431 -433 -398 -363 -354 -363 -367 -368 -382
-51 -382 -407 -430 -444 -448 -442 -430 -430 -455 -489 -511 -518 -525 -529 -514 -486 -466 -461 -457 -454 -468 -499 -519 -509 -485 -468 -454 -430 -404 -389 -386 -384 -387 -405 -429 -440 -434 -421 -400 -369 -342 -341 -367
-74 -367 -398 -424 -444 -451 -433 -397 -376 -379 -379 -354 -323 -315 -329 -339 -336 -329 -323 -317 -315 -326 -347 -372 -399 -429 -445 -423 -370 -323 -312 -329 -344 -335 -294 -243 -220 -256 -330 -391 -413 -428
-96 -428 -468 -512 -519 -481 -437 -416 -412 -407 -394 -373 -347 -332 -347 -386 -415 -409 -385 -369 -370 -378 -393 -423 -455 -470 -471 -482 -511 -532 -522 -482 -439 -411 -402 -405 -410 -405 -388 -367 -341 -313 -294
-118 -294 -303 -343 -383 -400 -404 -420 -451 -479 -489 -486 -479 -471 -465 -457 -436 -393 -338 -299 -295 -322 -366 -412 -442 -445 -431 -425 -440 -464 -479 -471 -446 -422 -418 -440 -463 -460 -431 -404 -396 -399 -400 -402 -416
-142 -416 -441 -466 -486 -493 -486 -468 -452 -446 -455 -479 -513 -543 -549 -538 -536 -552 -563 -553 -538 -542 -563 -581 -582 -563 -526 -481 -447 -431 -424 -416 -417 -431 -436 -409 -376 -386 -440 -481 -470 -423 -384
-164 -384 -363 -336 -292 -254 -252 -287 -328 -343 -335 -336 -361 -395 -419 -433 -440 -428 -388 -334 -291 -263 -248 -268 -335 -405 -417 -370 -324 -320 -325 -304 -273 -273 -306 -338 -348 -339 -326 -318 -324 -340
-186 -340 -347 -347 -367 -420 -466 -461 -424 -415 -450 -486 -489 -471 -452 -420 -361 -305 -290 -317 -346 -356 -365 -394 -434 -458 -459 -453 -454 -460 -459 -451 -448 -461 -491 -514 -503 -452 -388 -351 -356 -384 -402 -395
-209 -395 -367 -325 -280 -253 -265 -311 -363 -398 -412 -411 -398 -382 -373 -370 -357 -330 -308 -307 -322 -334 -332 -310 -267 -214 -184 -207 -268 -323 -341 -328 -318 -332 -375 -432 -476 -493 -497 -513
-230 -513 -547 -578 -577 -537 -473 -404 -343 -298 -278 -286 -310 -328 -326 -319 -335 -375 -403 -388 -347 -321 -327 -343 -338 -309 -279 -270 -289 -317 -332 -332 -337 -365 -402 -420 -409 -390 -383 -392 -409 -435
-251 -435 -471 -510 -538 -535 -495 -435 -389 -374 -377 -380 -383 -389 -388 -374 -369 -394 -430 -435 -401 -359 -339 -334 -329 -324 -335 -366 -417 -487 -562 -606 -596 -544 -484 -439 -415 -404 -389 -362 -337 -345 -397
-274 -397 -470 -528 -547 -531 -494 -454 -428 -423 -433 -452 -469 -462 -421 -362 -324 -316 -317 -311 -312 -330 -348 -344 -323 -309 -310 -320 -336 -358 -372 -372 -372 -390 -416 -428 -415 -388 -358 -333 -323 -336
-296 -336 -358 -368 -359 -342 -322 -297 -275 -271 -289 -315 -341 -368 -386 -379 -342 -292 -250 -223 -210 -211 -233 -277 -335 -386 -405 -387 -351 -325 -318 -328 -354 -383 -386 -351 -308 -301 -336 -372
-316 -372 -379 -373 -378 -392 -400 -401 -402 -398 -382 -362 -356 -366 -383 -397 -403 -402 -399 -404 -419 -428 -419 -403 -405 -431 -461 -477 -478 -469 -458 -450 -453 -471 -493 -503 -496 -475 -451 -425 -397 -369 -344 -325 -312 -307 -314 -331
-341 -331 -354 -372 -380 -379 -375 -378 -399 -435 -468 -485 -487 -480 -463 -439 -424 -426 -435 -428 -400 -363 -324 -282 -247 -238 -258 -288 -306 -312 -315 -317 -321 -332 -349 -352 -331 -302 -291 -299 -305 -298 -295 -322 -383 -459
-365 -459 -518 -536 -506 -447 -387 -354 -355 -381 -417 -448 -464 -460 -437 -405 -377 -363 -366 -380 -395 -397 -381 -360 -352 -360 -367 -363 -359 -365 -379 -393 -414 -441 -451 -419 -361 -316 -298 -285 -270 -279
-387 -279 -326 -382 -415 -433 -462 -499 -522 -527 -533 -542 -530 -497 -476 -495 -540 -565 -550 -509 -472 -456 -460 -471 -482 -490 -494 -493 -483 -470 -464 -478 -510 -537 -529 -478 -419 -392 -400 -412 -403 -384
-409 -384 -373 -367 -360 -357 -366 -378 -379 -375 -379 -381 -373 -376 -414 -476 -520 -533 -538 -551 -548 -513 -463 -424 -400 -380 -364 -350 -333 -317 -325 -366 -409 -417 -397 -389 -402 -412 -394 -356 -320 -300 -302 -331 -383
-432 -383 -439 -478 -488 -468 -423 -369 -330 -321 -331 -344 -352 -359 -368 -372 -363 -349 -348 -367 -389 -389 -365 -338 -335 -359 -385 -392 -378 -353 -333 -332 -356 -397 -435 -451 -445 -430 -420 -419 -423 -425 -420 -400 -361
-456 -361 -316 -294 -320 -387 -452 -470 -431 -367 -324 -324 -353 -375 -371 -347 -330 -334 -354 -380 -401 -413 -417 -424 -437 -443 -419 -378 -352 -360 -375 -371 -354 -350 -364 -385 -407 -429 -439 -425 -400
-477 -400 -387 -387 -378 -356 -348 -362 -377 -379 -387 -413 -433 -420 -388 -379 -403 -436 -457 -471 -491 -517 -540 -548 -527 -482 -441 -429 -443 -455 -453 -444 -434 -425 -423 -436 -448 -441 -430 -452 -508 -547 -526
-499 -526 -470 -429 -418 -414 -407 -418 -454 -499 -528 -535 -524 -502 -476 -451 -426 -398 -377 -371 -367 -350 -331 -336 -363 -386 -399 -417 -440 -444 -417 -388 -382 -391 -401 -417 -444 -464 -464 -457 -455 -438 -385
-522 -385 -324 -308 -345 -393 -418 -428 -436 -433 -413 -397 -408 -435 -444 -425 -397 -389 -410 -454 -500 -524 -516 -483 -443 -413 -413 -444 -486 -501 -480 -448 -437 -445 -450 -446 -442 -435 -407 -352 -297 -276
-544 -276 -297 -332 -352 -350 -348 -361 -381 -388 -380 -378 -400 -429 -436 -417 -394 -384 -380 -367 -352 -349 -355 -352 -336 -322 -327 -341 -340 -321 -304 -313 -342 -372 -396 -426 -470 -514 -531 -513 -480 -454 -442
-566 -442 -440 -445 -455 -459 -440 -393 -344 -316 -310 -302 -285 -273 -274 -278 -273 -271 -289 -322 -350 -368 -393 -427 -453 -461 -461 -473 -495 -513 -521 -519 -515 -510 -501 -479 -440 -395 -369 -371 -393 -424 -459 -483 -482 -463
-590 -463 -456 -469 -469 -423 -349 -293 -272 -268 -275 -306 -359 -404 -423 -430 -441 -447 -430 -396 -375 -382 -403 -419 -421 -417 -418 -424 -428 -427 -429 -448 -483 -519 -535 -524 -497 -478 -479 -496 -507 -502 -491 -489 -492 -482
-614 -482 -453 -422 -406 -411 -434 -463 -477 -464 -438 -428 -440 -449 -439 -425 -426 -431 -418 -387 -369 -382 -415 -441 -445 -433 -423 -422 -415 -387 -342 -309 -299 -297 -288 -283 -297 -325 -354 -385 -426 -466
-636 -466 -484 -477 -464 -450 -427 -402 -401 -423 -436 -414 -377 -356 -360 -375 -389 -392 -375 -342 -324 -343 -380 -399 -394 -388 -388 -382 -369 -367 -376 -376 -364 -364 -387 -405 -396 -385 -403 -435 -444 -428 -426 -452
-658 -452 -478 -476 -460 -452 -444 -410 -349 -295 -283 -320 -377 -422 -440 -441 -434 -416 -378 -334 -309 -311 -329 -350 -371 -385 -371 -330 -299 -319 -387 -461 -500 -493 -449 -395 -366 -372 -391 -393 -380
-680 -380 -374 -382 -388 -392 -419 -473 -518 -519 -483 -442 -408 -366 -317 -282 -282 -310 -339 -354 -361 -373 -398 -431 -459 -473 -468 -450 -420 -387 -362 -356 -366 -379 -384 -376 -361 -348 -348 -360 -377 -391 -403
-702 -403 -422 -450 -471 -470 -445 -419 -415 -429 -435 -415 -390 -397 -440 -485 -504 -513 -548 -610 -658 -656 -613 -565 -543 -546 -554 -550 -528 -498 -479 -481 -495 -507 -519 -538 -560 -566 -547 -522 -507 -498 -480
-724 -480 -458 -454 -474 -494 -498 -493 -496 -507 -515 -518 -517 -507 -485 -461 -443 -421 -379 -329 -303 -309 -331 -353 -380 -421 -459 -475 -466 -447 -432 -429 -438 -448 -448 -441 -441 -447 -446 -430 -409 -392 -369 -335 -304
-748 -304 -291 -289 -288 -296 -320 -337 -318 -274 -263 -321 -418 -493 -515 -492 -443 -387 -351 -361 -411 -460 -474 -458 -442 -440 -438 -422 -399 -383 -383 -394 -414 -438 -452 -450 -444 -452 -466 -468 -453 -434
-770 -434 -419 -402 -386 -390 -414 -431 -422 -403 -404 -424 -439 -441 -438 -433 -417 -397 -387 -388 -382 -369 -365 -382 -410 -433 -448 -458 -460 -458 -458 -455 -440 -414 -388 -366 -346 -329 -326 -344 -370 -387 -387 -374
-793 -374 -364 -367 -382 -394 -397 -400 -408 -411 -396 -379 -383 -410 -435 -446 -448 -438 -400 -345 -304 -297 -307 -321 -352 -411 -467 -485 -468 -448 -440 -434 -416 -387 -358 -344 -357 -396 -427 -416 -368 -323
-814 -323 -317 -357 -423 -488 -523 -517 -488 -459 -432 -395 -356 -345 -384 -460 -531 -564 -550 -504 -455 -422 -406 -399 -396 -390 -374 -345 -309 -280 -261 -253 -257 -274 -295 -317 -341 -366 -377 -367
-835 -367 -350 -338 -324 -297 -275 -287 -339 -402 -449 -480 -492 -479 -449 -430 -434 -445 -446 -446 -465 -495 -508 -494 -463 -435 -418 -412 -414 -414 -401 -375 -344 -320 -315 -338 -384 -436 -476 -492
-856 -492 -490 -484 -485 -487 -469 -427 -394 -412 -483 -548 -547 -479 -394 -347 -356 -401 -447 -464 -449 -421 -401 -390 -384 -388 -411 -447 -471 -465 -432 -389 -349 -318 -299 -294 -305 -331 -362 -382 -389 -391 -399
-878 -399 -407 -408 -405 -405 -401 -383 -354 -333 -335 -351 -353 -329 -292 -268 -269 -293 -329 -367 -396 -410 -412 -412 -417 -419 -411 -403 -413 -438 -457 -448 -422 -404 -412 -442 -482 -513 -520 -503 -479 -465 -447 -407 -352
-902 -352 -320 -327 -345 -341 -320 -311 -315 -307 -283 -281 -331 -411 -464 -464 -439 -427 -435 -440 -431 -426 -449 -494 -530 -525 -484 -441 -421 -424 -436 -458 -494 -532 -546 -530 -510 -510 -528 -545 -547 -533 -502 -469
-924 -469 -456 -467 -469 -435 -382 -361 -392 -445 -490 -524 -559 -586 -593 -580 -556 -517 -466 -429 -437 -481 -513 -495 -446 -414 -423 -447 -452 -429 -401 -381 -361 -336 -321 -331 -349 -351 -347 -370
-945 -370 -418 -450 -437 -401 -377 -375 -378 -384 -403 -434 -459 -469 -464 -448 -424 -411 -413 -414 -395 -374 -386 -427 -451 -433 -398 -384 -396 -414 -422 -420 -413 -403 -399 -406 -422 -440 -454 -453 -427 -383 -351
-967 -351 -352 -372 -385 -381 -375 -382 -402 -426 -444 -447 -438 -430 -429 -426 -411 -394 -387 -386 -375 -356 -348 -361 -383 -399 -406 -406 -399 -382 -366 -357 -352 -343 -331 -319 -304 -291 -297 -334 -388 -430 -443 -431 -408 -390
-991 -390 -393 -422 -453 -457 -436 -419 -426 -447 -471 -504 -544 -566 -543 -492 -461 -469 -490 -489 -467 -434 -392 -342 -314 -335 -387 -415 -389 -336 -299 -289 -289 -290 -306 -342 -371 -365 -339 -331 -357
-1013 -357 -391 -404 -395 -383 -372 -354 -333 -332 -353 -369 -359 -337 -332 -341 -335 -307 -285 -289 -302 -294 -260 -232 -236 -268 -307 -336 -352 -355 -344 -322 -303 -298 -312 -339 -373 -402 -413 -407 -405 -427
-1035 -427 -462 -475 -451 -419 -408 -418 -419 -396 -361 -340 -346 -371 -393 -391 -367 -346 -353 -373 -378 -366 -370 -411 -466 -492 -473 -434 -403 -389 -379 -363 -345 -339 -348 -353 -340 -317 -315 -348 -396
-1056 -396 -425 -421 -394 -361 -335 -318 -308 -303 -313 -342 -377 -387 -359 -321 -313 -343 -384 -410 -422 -431 -438 -429 -403 -371 -344 -322 -306 -300 -310 -335 -365 -393 -414 -425 -429 -431 -437 -437 -418 -388
-1078 -388 -376 -400 -440 -461 -454 -439 -438 -453 -470 -475 -467 -460 -475 -510 -537 -537 -527 -543 -582 -604 -584 -538 -493 -457 -426 -412 -425 -454 -476 -484 -488 -492 -490 -479 -466 -455 -451 -458 -476 -490
-1099 -490 -488 -479 -473 -459 -427 -396 -393 -412 -415 -388 -365 -380 -421 -438 -407 -359 -343 -374 -422 -451 -452 -441 -432 -419 -403 -402 -429 -459 -451 -401 -351 -349 -394 -448 -483 -493 -485 -462 -430 -407
-1121 -407 -408 -426 -433 -416 -393 -388 -390 -375 -343 -328 -346 -373 -388 -398 -419 -436 -431 -419 -428 -448 -446 -419 -400 -403 -403 -387 -376 -389 -413 -426 -433 -443 -445 -432 -429 -459 -510 -549 -571 -591
-1143 -591 -612 -620 -617 -612 -602 -576 -539 -516 -514 -515 -503 -488 -484 -492 -501 -501 -483 -444 -398 -363 -341 -320 -305 -314 -351 -385 -393 -393 -417 -460 -484 -464 -422 -398 -402 -410 -404 -394 -402 -437 -478 -498
-1166 -498 -485 -446 -403 -384 -402 -440 -473 -489 -499 -501 -484 -444 -411 -415 -450 -476 -470 -443 -415 -393 -384 -393 -412 -415 -388 -352 -339 -353 -378 -403 -425 -435 -423 -397 -381 -393 -423
-1186 -423 -440 -420 -376 -348 -363 -395 -396 -356 -319 -322 -350 -364 -361 -366 -391 -416 -422 -408 -376 -334 -303 -308 -344 -386 -417 -441 -449 -420 -364 -339 -378 -441 -460 -426 -388 -382 -391 -390 -376
-1207 -376 -354 -329 -324 -360 -417 -442 -418 -385 -387 -408 -410 -395 -395 -416 -429 -425 -429 -452 -468 -453 -428 -421 -437 -449 -441 -417 -385 -355 -339 -346 -370 -391 -389 -366 -344 -350 -388 -432 -450 -439
-1229 -439 -432 -451 -486 -511 -517 -521 -528 -526 -502 -464 -441 -456 -502 -540 -535 -487 -437 -422 -444 -476 -503 -522 -532 -517 -466 -394 -333 -305 -308 -322 -333 -344 -359 -370 -358 -324 -291 -282
-1250 -282 -299 -330 -368 -415 -465 -502 -515 -504 -474 -440 -416 -411 -421 -439 -456 -458 -428 -373 -333 -333 -349 -343 -319 -317 -348 -379 -387 -402 -454 -525 -563 -548 -506 -472 -454 -452 -468 -496
-1270 -496 -517 -510 -479 -448 -444 -474 -517 -541 -525 -473 -404 -348 -330 -350 -378 -383 -361 -339 -337 -359 -399 -446 -487 -506 -510 -520 -531 -510 -445 -372 -332 -323 -318 -305 -298 -301 -304 -300 -292 -275
-1292 -275 -249 -236 -264 -322 -359 -344 -305 -294 -331 -388 -427 -425 -388 -345 -321 -317 -318 -319 -324 -334 -333 -320 -310 -316 -331 -341 -344 -346 -342 -327 -305 -288 -285 -303 -348 -407 -437 -419 -385 -382
-1314 -382 -415 -447 -454 -452 -451 -443 -422 -406 -408 -416 -413 -407 -409 -417 -424 -436 -456 -462 -433 -382 -343 -325 -316 -313 -329 -355 -363 -347 -337 -351 -369 -370 -373 -400 -431 -428 -394 -366 -350 -323 -285 -272 -298
-1338 -298 -331 -341 -348 -379 -417 -419 -391 -374 -390 -410 -411 -407 -416 -429 -428 -407 -377 -349 -327 -315 -319 -336 -362 -387 -399 -394 -385 -388 -396 -386 -362 -351 -367 -383 -377 -358 -346 -343 -341 -346 -361 -371
-1360 -371 -357 -338 -340 -355 -353 -332 -320 -327 -331 -324 -331 -367 -408 -424 -414 -398 -386 -388 -415 -459 -486 -474 -447 -437 -437 -421 -391 -377 -389 -408 -417 -417 -415 -411 -407 -402 -386 -361 -357 -398 -456 -478
-1383 -478 -464 -457 -475 -476 -425 -354 -317 -315 -314 -300 -300 -327 -360 -377 -385 -404 -447 -504 -541 -525 -465 -417 -425 -465 -479 -451 -420 -411 -415 -417 -427 -453 -475 -469 -440 -407 -372 -333 -310 -328
-1405 -328 -384 -439 -470 -484 -495 -497 -474 -428 -379 -346 -332 -330 -334 -334 -321 -300 -292 -316 -360 -399 -425 -448 -476 -490 -469 -426 -386 -357 -326 -298 -290 -307 -324 -323 -307 -292 -275 -252
-1426 -252 -235 -238 -260 -284 -298 -301 -297 -291 -292 -306 -322 -324 -314 -316 -348 -400 -440 -446 -429 -411 -409 -423 -449 -484 -514 -518 -492 -454 -429 -413 -395 -376 -365 -355 -337 -324 -343 -390 -427
-1447 -427 -432 -424 -426 -422 -396 -361 -350 -371 -405 -437 -459 -470 -468 -466 -469 -462 -431 -392 -366 -354 -336 -313 -311 -346 -400 -442 -454 -439 -411 -393 -400 -426 -452 -465 -459 -432 -401 -397 -436 -494
-1469 -494 -529 -536 -541 -559 -578 -582 -565 -526 -468 -415 -398 -417 -441 -450 -448 -451 -463 -481 -501 -503 -475 -439 -424 -426 -412 -385 -385 -420 -444 -428 -410 -436 -481 -489 -454 -422 -412 -400 -375
-1490 -375 -363 -382 -416 -437 -441 -431 -411 -388 -370 -349 -308 -259 -237 -260 -302 -335 -357 -376 -390 -392 -391 -395 -396 -382 -353 -314 -267 -223 -216 -265 -349 -419 -451 -454 -437 -403 -366 -351
-1511 -351 -358 -363 -346 -324 -322 -332 -332 -323 -327 -347 -363 -362 -364 -387 -418 -427 -412 -395 -398 -416 -428 -415 -377 -333 -316 -330 -346 -336 -306 -291 -296 -304 -307 -327 -371 -408 -409 -385 -368 -372 -389 -408
-1534 -408 -427 -433 -422 -406 -403 -406 -401 -385 -377 -380 -382 -371 -356 -353 -366 -384 -391 -381 -367 -379 -425 -469 -473 -433 -389 -372 -380 -396 -411 -420 -422 -417 -406 -386 -365 -365 -390 -407 -375 -301 -235 -215
-1557 -215 -234 -275 -334 -397 -429 -414 -382 -379 -408 -430 -421 -395 -376 -363 -342 -313 -297 -312 -350 -384 -395 -388 -379 -371 -363 -358 -356 -344 -308 -260 -226 -219 -227 -245 -278 -319 -349 -356 -354 -356 -362
-1579 -362 -369 -380 -388 -383 -373 -378 -398 -408 -403 -413 -459 -507 -516 -489 -460 -440 -417 -398 -401 -417 -414 -381 -342 -319 -306 -294 -285 -287 -295 -294 -275 -241 -214 -225 -279 -343 -384 -405 -432 -461
-1601 -461 -465 -442 -421 -430 -460 -489 -507 -513 -503 -482 -466 -464 -469 -474 -478 -478 -465 -448 -446 -458 -465 -459 -455 -465 -476 -473 -461 -449 -431 -407 -388 -388 -398 -399 -379 -340 -288 -237 -202 -194 -206 -227
-1624 -227 -251 -273 -293 -322 -365 -400 -396 -364 -351 -378 -411 -410 -386 -370 -355 -313 -248 -207 -222 -278 -330 -352 -343 -328 -338 -382 -426 -434 -416 -412 -438 -466 -475 -476 -484 -481 -443 -382 -342
-1645 -342 -349 -383 -405 -392 -357 -329 -328 -346 -354 -336 -304 -294 -326 -388 -440 -449 -409 -349 -304 -293 -310 -338 -364 -379 -378 -360 -333 -312 -304 -310 -325 -347 -373 -395 -396 -375 -352 -352 -369
-1666 -369 -368 -334 -295 -287 -311 -333 -332 -316 -297 -280 -262 -250 -247 -259 -292 -347 -403 -431 -422 -399 -388 -390 -393 -392 -391 -395 -402 -406 -399 -380 -363 -366 -390 -413 -421 -423 -432 -445 -448 -438 -418 -389 -363
-1690 -363 -365 -407 -470 -509 -503 -464 -423 -401 -398 -393 -371 -346 -355 -408 -459 -453 -390 -330 -316 -333 -344 -344 -352 -366 -360 -327 -300 -309 -343 -365 -356 -330 -309 -297 -293 -298 -319 -349 -373 -381 -380 -394
-1712 -394 -430 -474 -500 -497 -478 -464 -455 -437 -402 -368 -360 -373 -383 -380 -382 -400 -417 -407 -373 -341 -331 -341 -358 -370 -366 -343 -315 -309 -327 -352 -373 -396 -426 -451 -468 -493 -537 -574
-1733 -574 -565 -519 -479 -468 -467 -448 -417 -387 -358 -325 -302 -306 -330 -349 -353 -358 -374 -389 -393 -397 -415 -439 -439 -397 -331 -283 -290 -353 -439 -506 -531 -521 -486 -436 -383 -346 -340 -355 -363 -347
-1755 -347 -315 -287 -275 -274 -288 -335 -411 -478 -499 -480 -463 -464 -463 -439 -417 -425 -448 -454 -442 -440 -453 -455 -437 -426 -436 -444 -422 -377 -341 -332 -348 -382 -419 -435 -423 -409 -422 -444 -440
-1776 -440 -406 -376 -370 -365 -343 -318 -316 -331 -349 -373 -413 -455 -471 -456 -445 -461 -491 -500 -479 -444 -413 -390 -377 -379 -392 -400 -391 -370 -355 -346 -335 -326 -331 -348 -359 -359 -363 -387 -420 -444
-1798 -444 -461 -480 -491 -475 -437 -407 -400 -411 -423 -434 -438 -430 -419 -417 -415 -392 -347 -310 -302 -313 -323 -327 -322 -303 -282 -288 -330 -374 -391 -393 -415 -455 -487 -501 -512 -522 -518 -500 -485 -473
-1820 -473 -445 -405 -383 -383 -373 -338 -306 -306 -321 -317 -300 -309 -358 -415 -446 -451 -445 -431 -395 -335 -267 -220 -211 -241 -296 -354 -396 -410 -401 -389 -390 -397 -382 -338 -294 -286 -319 -368 -414 -448
-1842 -448 -457 -424 -361 -315 -324 -371 -410 -415 -412 -439 -495 -546 -561 -537 -497 -461 -442 -447 -471 -491 -487 -471 -474 -502 -525 -507 -448 -377 -316 -267 -237 -238 -265 -296 -308 -306 -304 -311 -324 -334
-1863 -334 -330 -314 -301 -314 -354 -390 -390 -358 -331 -335 -357 -365 -346 -319 -310 -321 -336 -346 -361 -393 -433 -457 -459 -455 -460 -466 -451 -416 -382 -366 -362 -359 -357 -363 -375 -376 -358 -341 -349 -382 -413 -428
-1886 -428 -440 -466 -495 -503 -488 -470 -456 -432 -399 -391 -429 -483 -500 -469 -423 -389 -369 -354 -346 -339 -323 -302 -306 -354 -425 -485 -517 -524 -511 -484 -462 -461 -479 -496 -495 -480 -457 -430
-1907 -430 -401 -383 -387 -409 -432 -443 -434 -409 -384 -380 -401 -434 -465 -490 -512 -522 -512 -490 -474 -476 -484 -482 -466 -450 -443 -438 -427 -414 -415 -432 -452 -463 -467 -464 -443 -401 -361 -351 -363 -366
-1929 -366 -342 -315 -309 -318 -313 -288 -265 -265 -289 -326 -372 -428 -480 -509 -499 -463 -425 -400 -380 -357 -336 -330 -348 -383 -427 -467 -486 -471 -426 -373 -329 -297 -286 -311 -373 -442 -479
-1949 -479 -472 -438 -405 -387 -382 -383 -378 -358 -328 -306 -311 -339 -366 -362 -327 -296 -303 -340 -372 -375 -361 -351 -349 -349 -351 -354 -348 -329 -312 -310 -313 -313 -323 -359 -396 -390 -341 -292 -272 -267 -262 -271 -306 -343
-1973 -343 -359 -365 -384 -402 -389 -358 -354 -392 -434 -442 -417 -383 -352 -324 -310 -317 -328 -328 -326 -337 -353 -355 -342 -340 -355 -368 -365 -359 -376 -414 -447 -454 -432 -393 -357 -343 -359 -389 -408 -409
-1995 -409 -406 -409 -411 -394 -352 -303 -273 -284 -336 -400 -440 -443 -427 -411 -395 -372 -349 -343 -351 -356 -348 -338 -340 -360 -386 -408 -417 -413 -404 -399 -398 -395 -382 -351 -310 -283 -290 -322 -343 -337 -329 -348 -383
-2018 -383 -391 -366 -344 -353 -373 -371 -343 -314 -307 -327 -363 -396 -411 -409 -402 -393 -374 -355 -359 -383 -394 -373 -350 -352 -366 -361 -343 -342 -361 -373 -370 -368 -374 -374 -366 -363 -364 -343 -300 -274 -295 -346 -390
-2042 -390 -419 -442 -457 -457 -447 -440 -438 -432 -427 -435 -456 -485 -519 -553 -569 -551 -517 -500 -508 -514 -495 -465 -447 -449 -460 -472 -483 -485 -466 -432 -404 -398 -413 -434 -450 -453 -436 -404 -380 -386 -420
-2064 -420 -444 -423 -361 -289 -242 -231 -249 -275 -288 -279 -259 -252 -268 -305 -362 -440 -517 -558 -546 -501 -454 -421 -397 -377 -361 -349 -346 -363 -396 -415 -398 -365 -365 -410 -463 -477
-2084 -477 -449 -411 -388 -375 -366 -369 -388 -407 -400 -367 -334 -327 -343 -362 -373 -381 -388 -392 -392 -394 -397 -387 -355 -315 -289 -289 -314 -353 -388 -413 -430 -446 -449 -422 -369 -328 -328 -352 -368 -369 -383
-2106 -383 -423 -465 -476 -454 -422 -406 -414 -438 -467 -492 -512 -526 -528 -516 -502 -501 -514 -527 -529 -516 -496 -478 -468 -464 -460 -457 -463 -483 -502 -503 -497 -505 -528 -548 -558 -567 -573 -556 -508 -452 -413
-2128 -413 -390 -375 -372 -390 -416 -430 -442 -468 -502 -516 -503 -485 -470 -440 -394 -364 -377 -415 -437 -430 -413 -410 -431 -479 -548 -609 -624 -590 -539 -504 -492 -495 -510 -528 -526 -501 -480
-2148 -480 -488 -513 -521 -506 -502 -531 -575 -599 -584 -538 -478 -431 -422 -445 -469 -466 -447 -436 -436 -437 -431 -421 -411 -406 -410 -420 -422 -410 -405 -418 -430 -419 -392 -375 -372 -369 -373 -401 -433 -430 -396 -386
-2171 -386 -433 -493 -510 -493 -491 -516 -531 -515 -482 -451 -421 -393 -374 -363 -350 -340 -349 -379 -408 -423 -430 -433 -425 -408 -396 -386 -361 -326 -317 -356 -416 -453 -455 -434 -402 -359 -326 -328
-2192 -328 -366 -411 -436 -440 -429 -403 -366 -333 -323 -342 -382 -425 -457 -470 -464 -450 -434 -414 -387 -359 -346 -351 -367 -382 -398 -428 -481 -545 -592 -602 -572 -522 -484 -475 -485 -489 -477
-2212 -477 -467 -477 -495 -502 -501 -507 -511 -492 -454 -436 -453 -472 -455 -421 -410 -426 -431 -404 -361 -323 -299 -297 -329 -384 -433 -459 -477 -496 -497 -461 -411 -385 -395 -419 -434 -436 -430 -424 -430 -446
-2234 -446 -447 -414 -358 -325 -337 -374 -397 -394 -382 -379 -394 -420 -448 -457 -431 -380 -332 -314 -314 -303 -269 -239 -240 -270 -304 -332 -362 -391 -397 -376 -356 -363 -384 -393 -389 -395 -411 -410 -384 -357
-2256 -357 -352 -361 -365 -358 -352 -356 -375 -404 -432 -441 -431 -426 -445 -472 -473 -438 -391 -365 -363 -362 -344 -323 -327 -370 -424 -448 -427 -380 -333 -295 -270 -266 -279 -289 -285 -293 -342 -426 -497 -520 -502 -472
-2279 -472 -446 -419 -389 -368 -368 -388 -405 -392 -357 -333 -343 -365 -362 -333 -314 -320 -336 -351 -383 -434 -468 -458 -432 -435 -465 -476 -446 -405 -386 -382 -377 -376 -396 -434 -469 -487 -484 -464
-2299 -464 -441 -432 -444 -461 -466 -462 -454 -436 -403 -371 -360 -367 -370 -360 -353 -370 -410 -462 -515 -556 -567 -538 -483 -434 -410 -407 -413 -418 -417 -402 -376 -359 -371 -410 -445 -452 -437 -428 -439 -455 -452
$$ [...]
-5105a12
##END=	
##END=	
