##TITLE=	Dec04-2021.20.fid
TM-VI-199, CD3OD

##JCAMP-DX=	6.0	$$ MestReNova 14.3.0-30573
##DATA TYPE=	LINK
##BLOCK_ID=	1
##BLOCKS=	2    
##ORIGIN=	Mestrelab Research S.L.
##OWNER=	hrzepa
##$MNOVA/LINK_BLOCK_TYPE=	ITEM	$$ NMR Spectrum
##$MNOVA/ITEM/POLYGON=	(XY..XY)
5321,5835
8722,5835
8722,8208
5321,8208
5321,5835
##$MNOVA/ITEM/Z=	0
##$MNOVA/ITEM/ANGLE=	0
##TITLE=	Dec04-2021.20.fid
##JCAMP-DX=	6.0	$$ MestReNova 14.3.0-30573
##BLOCK_ID=	2
##DATA TYPE=	MNOVA NMR VIEW DATA
##DATA CLASS=	MNOVA VIEW DATA
##$MNOVA/ITEM/ZOOM/X=	-4.005464102252559222,	16.005770000004368114
##$MNOVA/ITEM/ZOOM/Y=	-878.80594372749328613,	9707.7052001953125
##END=	
##TITLE=	Dec04-2021.20.fid
##JCAMP-DX=	6.0	$$ MestReNova 14.3.0-30573
##BLOCK_ID=	3
##DATA TYPE=	NMR SPECTRUM
##DATA CLASS=	XYDATA
##NUMDIM=	1
##ORIGIN=	Bruker BioSpin GmbH
##OWNER=	nmr
##.OBSERVE FREQUENCY=	400.4124024600000098
##.OBSERVE NUCLEUS=	^1H
##.SOLVENT NAME=	MeOD
##.PULSE SEQUENCE=	zg30
##LONGDATE=	2021/12/04 15:34:00.000
##.ACQUISITIONMODE=	SIMULTANEOUS (DQD)
##$ORIGINAL FORMAT=	Bruker XWIN-NMR
##$MNOVA/SCALES_VERSION=	9
##$PARAMETER FILE=	(acqus, ASCII, /private/var/folders/f6/rjf_tdyn2v98c5c0wvkgn4s80000gn/T/kSz$bNAxQbGu+iwNY6BFcQ/20/acqus, 0)
$$ ##TITLE= Parameter file, TOPSPIN		Version 3.2
$$ ##JCAMPDX= 5.0
$$ ##DATATYPE= Parameter Values
$$ ##NPOINTS= 11	$$ modification sequence number
$$ ##ORIGIN= Bruker BioSpin GmbH
$$ ##OWNER= nmr
$$ $$ 2021-12-04 15:34:49.096 +0000  nmr@CZC10666PP
$$ $$ /opt/topspin/data/agmb/nmr/Dec04-2021/20/acqus
$$ $$ process /opt/topspin3.2/prog/mod/shimcntl
$$ ##$ACQT0= -2.36344537815126
$$ ##$AMP= (0..31)
$$ 100 100 100 100 100 100 100 100 100 100 100 100 100 100 100 100 100 100
$$ 100 100 100 100 100 100 100 100 100 100 100 100 100 100
$$ ##$AMPCOIL= (0..19)
$$ 0 0 0 0 0 0 0 0 0 0 0 0 0 0 0 0 0 0 0 0
$$ ##$ANAVPT= -1
$$ ##$AQSEQ= 0
$$ ##$AQ_mod= 3
$$ ##$AUNM= <au_zg>
$$ ##$AUTOPOS= <31 >
$$ ##$BF1= 400.41
$$ ##$BF2= 400.41
$$ ##$BF3= 400.41
$$ ##$BF4= 400.41
$$ ##$BF5= 400.41
$$ ##$BF6= 400.41
$$ ##$BF7= 400.41
$$ ##$BF8= 400.41
$$ ##$BYTORDA= 0
$$ ##$CAGPARS= (0..11)
$$ 0 0 0 0 0 0 0 0 0 0 0 0
$$ ##$CFDGTYP= 0
$$ ##$CFRGTYP= 9
$$ ##$CHEMSTR= <none>
$$ ##$CNST= (0..63)
$$ 1 1 145 1 1 1 1 1 1 1 1 1 1 1 1 1 1 1 1 1 1 1 1 1 1 1 1 1 1 1 1 1 1 1 1
$$ 1 1 1 1 1 1 1 1 1 1 1 1 1 1 1 1 1 1 1 1 1 1 1 1 1 1 1 1 1
$$ ##$CPDPRG= (0..8)
$$ <> <> <> <> <mlev> <mlev> <mlev> <mlev> <mlev>
$$ ##$D= (0..63)
$$ 0 1 0 0 0 0 0 0 0 0.06 0 0 0 0 0 0 0.0002 0 0 0 0 0 0 0 0 0 0 0 0 0 0 0
$$ 0 0 0 0 0 0 0 0 0 0 0 0 0 0 0 0 0 0 0 0 0 0 0 0 0 0 0 0 0 0 0 0
$$ ##$DATE= 1638632088
$$ ##$DE= 6.5
$$ ##$DECBNUC= <off>
$$ ##$DECIM= 2496
$$ ##$DECNUC= <off>
$$ ##$DECSTAT= 4
$$ ##$DIGMOD= 1
$$ ##$DIGTYP= 12
$$ ##$DQDMODE= 0
$$ ##$DR= 22
$$ ##$DS= 2
$$ ##$DSPFIRM= 0
$$ ##$DSPFVS= 20
$$ ##$DTYPA= 0
$$ ##$EXP= <proton>
$$ ##$F1LIST= <111111111111111>
$$ ##$F2LIST= <222222222222222>
$$ ##$F3LIST= <333333333333333>
$$ ##$FCUCHAN= (0..9)
$$ 0 2 0 0 0 0 0 0 0 0
$$ ##$FL1= 90
$$ ##$FL2= 90
$$ ##$FL3= 90
$$ [...]
$$ 90 74 58 42 26 10 0 0
$$ ##$Sgu3PowerLevels= (0..7)
$$ 0 0 0 0 0 0 0 0
$$ ##$Sgu4PowerLevels= (0..7)
$$ 0 0 0 0 0 0 0 0
$$ ##$Sgu5PowerLevels= (0..7)
$$ 0 0 0 0 0 0 0 0
$$ ##$Sgu6PowerLevels= (0..7)
$$ 0 0 0 0 0 0 0 0
$$ ##$Sgu7PowerLevels= (0..7)
$$ 0 0 0 0 0 0 0 0
$$ ##$Sgu8PowerLevels= (0..7)
$$ 0 0 0 0 0 0 0 0
$$ ##$SguType= 3
$$ ##$ShimPowMaxUA= (0..63)
$$ 130000 130000 130000 130000 130000 130000 130000 130000 130000 130000 130000
$$ 130000 130000 130000 130000 130000 130000 130000 130000 130000 0 0 0 0
$$ 0 0 0 0 0 0 0 0 0 0 0 0 0 0 0 0 0 0 0 0 0 0 0 0 0 0 0 0 0 0 0 0 0 0 0 0
$$ 0 0 0 0
$$ ##$ShimPowMaxUC= (0..63)
$$ 130000 130000 130000 130000 130000 130000 130000 130000 130000 130000 130000
$$ 130000 130000 130000 130000 130000 130000 130000 130000 130000 0 0 0 0
$$ 0 0 0 0 0 0 0 0 0 0 0 0 0 0 0 0 0 0 0 0 0 0 0 0 0 0 0 0 0 0 0 0 0 0 0 0
$$ 0 0 0 0
$$ ##$ShimPowMaxUG= (0..63)
$$ 524287 524287 524287 524287 524287 524287 524287 524287 524287 524287 524287
$$ 524287 524287 524287 524287 524287 524287 524287 524287 524287 0 0 0 0
$$ 0 0 0 0 0 0 0 0 0 0 0 0 0 0 0 0 0 0 0 0 0 0 0 0 0 0 0 0 0 0 0 0 0 0 0 0
$$ 0 0 0 0
$$ ##$ShimPowRcbType= 3
$$ ##$ShimPowRes= (0..63)
$$ 1e-20 1e-20 1e-20 1e-20 1e-20 1e-20 1e-20 1e-20 1e-20 1e-20 1e-20 1e-20
$$ 1e-20 1e-20 1e-20 1e-20 1e-20 1e-20 1e-20 1e-20 0 0 0 0 0 0 0 0 0 0 0 0
$$ 0 0 0 0 0 0 0 0 0 0 0 0 0 0 0 0 0 0 0 0 0 0 0 0 0 0 0 0 0 0 0 0
$$ ##$ShimPowRng0= (0..63)
$$ 1 1 1 1 1 1 1 1 1 1 1 1 1 1 1 1 1 1 1 1 0 0 0 0 0 0 0 0 0 0 0 0 0 0 0 0
$$ 0 0 0 0 0 0 0 0 0 0 0 0 0 0 0 0 0 0 0 0 0 0 0 0 0 0 0 0
$$ ##$ShimPowRng1= (0..63)
$$ 1 1 1 1 1 1 1 1 1 1 1 1 1 1 1 1 1 1 1 1 0 0 0 0 0 0 0 0 0 0 0 0 0 0 0 0
$$ 0 0 0 0 0 0 0 0 0 0 0 0 0 0 0 0 0 0 0 0 0 0 0 0 0 0 0 0
$$ ##$ShimPowRng2= (0..63)
$$ 1 1 1 1 1 1 1 1 1 1 1 1 1 1 1 1 1 1 1 1 0 0 0 0 0 0 0 0 0 0 0 0 0 0 0 0
$$ 0 0 0 0 0 0 0 0 0 0 0 0 0 0 0 0 0 0 0 0 0 0 0 0 0 0 0 0
$$ ##$ShimPowRng3= (0..63)
$$ 1 1 1 1 1 1 1 1 1 1 1 1 1 1 1 1 1 1 1 1 0 0 0 0 0 0 0 0 0 0 0 0 0 0 0 0
$$ 0 0 0 0 0 0 0 0 0 0 0 0 0 0 0 0 0 0 0 0 0 0 0 0 0 0 0 0
$$ ##$ShimSysFunc= (0..63)
$$ 1 2 3 4 5 7 9 11 15 16 8 10 12 14 6 17 13 18 19 20 0 0 0 0 0 0 0 0 0 0
$$ 0 0 0 0 0 0 0 0 0 0 0 0 0 0 0 0 0 0 0 0 0 0 0 0 0 0 0 0 0 0 0 0 0 0
$$ ##$ShimSysMatrix= 0
$$ ##$ShimSysType= 1
$$ ##$TFXNUM= 0
$$ ##$TRIPLO2= 0
$$ ##$VTU= 2
$$ ##$VTUETH= <149.236.99.20>
$$ ##$VTUTY= <no>
$$ ##$WBREFAM= (0..15)
$$ 135 116 100 100 100 100 100 100 100 100 100 100 100 100 100 100
$$ ##$WBREFLM= (0..15)
$$ 0 0 0 0 0 0 0 0 0 0 0 0 0 0 0 0
$$ ##$WBREFPH= (0..15)
$$ 71.66 -68.25 0 0 0 0 0 0 0 0 0 0 0 0 0 0
$$ ##$WBSGU= (0..15)
$$ 0 0 0 0 0 0 0 0 0 0 0 0 0 0 0 0
$$ ##$XFAC= 2
$$ ##END=
$$ 
##$DECIM=	2496
##$DSPFVS=	20
##XUNITS=	HZ
##YUNITS=	ARBITRARY UNITS
##FIRSTX=	6408.8703656999996383
##LASTX=	-1603.8278811825093726
##DELTAX=	-0.12226593800080123864
##XFACTOR=	1
##YFACTOR=	0.014287159263091831971
##FIRSTY=	10.73584747314453125
##MINY=	3.7127330303192138672
##MAXY=	8825.1865234375
##NPOINTS=	65536
##XYDATA=	(X++(Y..Y))
$$ [...]
4039 689 716 730 735 731 711 683 666 667 672 673 679 693 704 701 699 709 724 726 718 714 715 717 725 749 773 774 755 737 729 713 685 668 679 705 718 711 689 663 642 638 647 649 634 626 651
4033 651 702 743 756 747 731 704 669 633 602 571 547 541 562 593 616 629 640 653 667 683 699 709 704 691 681 682 687 689 690 692 691 679 659 654 673 695 689 657 637 657
4029 657 697 717 707 691 686 684 675 670 680 692 690 676 667 666 665 662 665 674 671 648 616 597 597 606 612 611 604 597 595 607 631 658 672 667 645 617 585 551 517 489 470 460 464 489 533
4023 533 574 591 583 575 587 612 629 630 629 642 670 696 713 725 739 751 748 732 712 699 692 685 668 641 618 625 674 738 768 743 690 653 645 655 668 686 711 737 755
4018 755 759 744 709 666 632 615 607 604 609 627 646 653 643 624 606 592 583 580 581 583 581 574 565 558 549 539 535 548 573 588 576 547 524 521 530 539 542 539 529 512 498 496 512 546 596
4013 596 645 669 653 611 573 562 574 593 609 620 629 630 617 584 540 506 498 512 533 548 558 567 568 554 529 515 526 557 592 618 628 626 622 634 672 720 750 750 735
4008 735 730 736 737 718 687 656 638 638 650 659 649 623 595 580 578 584 599 617 625 621 613 613 617 615 604 586 563 544 545 571 601 615 615 619 629 625 598 567 559 570 580 578 572 575 589
4003 589 612 636 654 664 670 673 669 659 650 644 632 607 578 567 578 599 618 633 644 636 601 562 553 579 613 627 627 638 668 699 708 693 666 643 624 608 594 587 590 597 600
3998 600 594 585 578 566 540 504 475 462 462 469 483 505 529 545 555 564 575 590 613 645 677 701 719 738 757 773 785 792 781 744 696 668 670 684 687 676 658 636 611
3993 611 591 585 589 596 598 596 592 595 609 627 634 627 615 615 626 644 657 655 627 580 544 536 541 535 519 517 539 569 593 610 623 632 638 649 668 689 706 716 719 712 694 667 630 591
3987 591 561 550 556 568 572 563 540 506 479 480 511 550 576 586 590 595 604 614 625 642 664 682 678 649 619 613 627 637 630 620 616 611 597 587 595 616 631 640 654 672 679 672 665
3982 665 672 688 705 719 731 737 731 707 668 630 609 607 609 602 587 569 545 513 484 474 481 489 486 480 480 486 499 516 525 515 493 484 499 529 553 572 592 613 629 634 629 613 589
3977 589 567 559 567 585 604 615 614 607 605 608 600 572 543 540 569 607 636 653 663 668 671 677 685 688 684 682 688 689 675 646 615 589 567 554 559 585 619 637 630 607 584 574 575 576 571 559
3971 559 547 544 558 587 618 640 651 657 664 670 675 686 706 728 738 728 708 689 674 665 669 689 715 733 737 738 740 734 705 663 630 625 637 649 649 638 619 596 580 579 592 611
3966 611 628 643 647 633 602 573 562 573 597 622 638 642 640 636 632 623 613 611 621 632 636 635 640 653 665 668 659 635 598 561 539 533 529 519 508 506 518 537 556 575 595 616
3961 616 633 642 641 633 631 643 660 667 662 654 649 640 619 592 579 590 616 637 640 626 609 606 621 640 648 645 646 658 669 669 663 664 672 680 682 681 677 669 658 646 629 599 569 558 570 586
3955 586 588 583 591 617 652 679 688 674 643 613 596 591 590 590 600 617 636 651 664 668 655 624 589 562 546 536 531 529 522 500 468 440 426 425 431 443 459 482 510 537 555
3950 555 564 570 578 584 582 576 580 594 605 602 591 585 591 608 633 663 684 685 661 623 589 570 569 587 612 626 613 575 529 493 476 481 505 540 571 591 601 604 597 581 563 551
3945 551 545 536 521 507 498 499 512 531 542 537 530 543 575 601 599 580 566 567 573 586 615 659 698 716 713 697 673 639 607 593 604 628 646 649 642 643 665 700 725 728 718 711
3940 711 711 709 703 700 706 714 714 701 679 652 620 584 549 525 524 544 566 576 575 580 599 622 644 665 683 683 658 625 611 620 635 646 659 678 693 695 691 693 703 709 705 695 688 684
3935 684 679 667 648 626 606 594 587 588 598 612 623 634 654 683 703 694 661 634 638 675 725 768 793 793 772 737 694 652 619 598 583 566 548 534 523 509 494 491
3930 491 508 540 573 602 621 625 613 596 584 575 560 534 507 492 497 522 563 617 675 714 718 686 642 611 602 610 627 647 664 679 694 711 722 719 704 686 668 653
3925 653 652 667 683 679 658 649 664 689 704 713 723 721 692 650 617 598 579 558 551 566 590 615 638 658 670 681 705 743 770 767 738 705 680 669 670 677 672 654 632 615
3921 615 599 586 595 633 678 703 706 708 716 720 714 707 700 685 662 641 633 630 625 625 633 646 665 695 736 765 766 744 723 708 691 666 644 632 619 598 575 569 585 609 631 652
3915 652 677 696 695 674 649 631 621 612 611 627 661 696 715 716 706 689 668 647 631 622 620 622 624 615 591 563 548 555 577 595 600 592 575 551 532 530 554 596 630 637 624 613
3910 613 619 638 656 671 687 701 703 689 669 654 643 631 617 608 605 599 591 589 603 634 674 713 736 732 705 674 658 661 672 682 686 685 679 664 640 616 603 603 611 610 596 579
3905 579 575 592 629 676 719 750 770 782 779 749 695 643 615 609 610 621 647 675 682 666 652 657 673 679 673 658 638 616 597 580 562 547 557 597 641 663 667 675 687 687
3900 687 678 680 699 719 724 721 727 747 774 794 792 762 717 681 664 659 661 671 678 669 645 632 641 656 655 640 625 616 608 606 616 638 663 687 710 727 731 732 737 741 729 702 679 674 679
3895 679 679 663 636 607 589 584 581 569 552 549 571 610 646 665 660 636 607 592 600 619 629 619 595 578 585 611 634 637 625 615 620 635 645 639 613 584 569 575 585 585 584
3890 584 599 630 657 671 683 699 712 709 696 683 677 673 667 661 657 653 644 628 605 583 570 570 580 597 617 626 617 599 588 588 584 569 555 560 587 625 665 700 724 736 738 734 725
3884 725 714 703 686 654 613 582 573 579 589 604 624 641 649 654 665 673 662 637 620 621 630 635 633 628 618 604 589 581 588 619 668 709 719 709 708 725 742 740 719 690 657 625
3879 625 609 618 641 661 664 653 633 615 611 624 645 663 677 685 679 652 613 578 556 543 533 526 522 523 533 557 595 638 677 703 711 703 688 671 654 637 624 618 613 600 579
3874 579 557 546 548 561 581 606 638 671 692 689 664 634 612 608 623 652 681 692 686 679 677 665 641 625 632 647 651 652 670 693 691 661 639 644 663 675 684 699 713 712 702
3869 702 693 678 649 622 619 638 660 674 686 697 697 694 701 719 729 725 717 719 720 711 693 676 666 662 663 667 669 665 663 670 678 680 679 680 684 683 674 657 639 630 644 681 719 730 710 683 674 692
3863 692 726 757 770 763 743 719 697 683 680 684 690 695 706 724 738 739 729 720 710 692 675 672 682 687 677 663 656 653 644 635 628 619 604 593 588 570 525 474 452 469 502 534 567
3858 567 608 645 662 653 627 594 562 540 534 541 559 591 638 685 717 730 726 709 688 678 689 701 694 668 647 640 630 605 576 565 576 595 608 616 624 635 643 646 644 640 640
3853 640 644 644 631 601 563 535 536 565 602 623 627 628 634 629 602 561 533 533 555 588 625 659 683 695 701 703 693 668 645 645 672 708 731 733 724 720 728 746 762 768 763 752 738
3848 738 719 698 682 673 663 646 631 634 654 678 691 696 700 701 695 685 683 691 704 711 710 700 684 669 669 689 718 740 746 742 736 732 732 736 739 731 714 694 682 676 665 644 617 602 610
3842 610 640 672 684 664 617 567 536 532 544 555 563 568 565 545 512 485 482 500 528 562 599 628 641 640 636 634 628 623 627 648 676 698 707 703 696 700 718 735 731 705 679 667 665
3837 665 661 657 657 656 653 651 662 687 714 736 748 746 734 719 710 702 683 658 640 639 646 651 653 660 678 701 718 722 714 702 686 668 654 657 681 708 718 708 689 668 649 636 642 667
3832 667 699 724 735 733 721 707 701 704 711 717 719 709 684 656 635 619 598 578 580 612 653 684 711 737 750 736 713 709 721 720 699 684 692 709 713 704 695 685 667 642 618
3827 618 597 576 565 571 583 583 576 591 642 707 751 763 762 770 793 820 837 827 790 743 716 720 743 757 747 713 664 610 564 536 529 535 546 563 594 635 666 673 665 669
3822 669 701 745 769 758 725 693 669 653 644 640 634 616 592 572 559 544 526 519 530 549 559 560 568 592 629 665 684 687 683 687 700 708 704 699 709 732 752 757 747 732 721
3817 721 721 730 739 737 721 697 674 662 665 678 688 694 714 753 786 788 766 752 756 759 754 757 777 795 788 760 725 696 676 674 686 690 671 645 637 643 639 622 614 624 639 648 658 683
3811 683 716 740 745 733 711 688 675 674 674 668 659 650 642 640 653 688 726 745 741 728 724 725 723 713 703 696 690 682 676 684 708 738 756 757 742 722 706 694 681 660 633 615 618 637
3806 637 656 663 661 658 660 667 674 671 651 624 615 635 674 714 745 765 771 762 741 708 656 591 540 526 548 580 603 619 635 653 667 672 666 654 651 665 689 701 684 647 618
3801 618 615 637 668 697 719 734 735 718 697 697 724 756 759 732 706 706 725 732 717 697 695 713 735 744 735 711 673 631 600 593 603 618 631 650 674 695 703 704 703 690 659
3796 659 619 598 605 626 640 642 643 655 677 702 718 718 705 696 703 721 733 732 726 722 712 679 628 582 565 575 593 604 604 596 578 553 532 527 537 550 557 559 562 572 591 613
3791 613 623 611 582 560 563 592 632 665 681 681 675 673 681 689 685 669 653 653 667 686 701 708 703 684 660 651 667 696 714 709 690 669 650 636 636 658 686 693 674 641 612 597
3786 597 600 619 645 659 656 650 655 674 699 721 736 738 724 694 651 601 560 543 552 575 595 604 604 602 604 613 622 624 623 634 658 676 674 661 654 651 631 594 563 561 581 601 610 611 611
3780 611 607 596 584 586 606 635 664 693 725 758 781 792 801 811 808 776 723 676 651 646 650 663 681 697 701 698 696 705 721 738 751 755 747 719 674 631 615 631 657 667 663
3775 663 666 685 704 709 702 699 702 704 697 687 685 697 712 709 681 652 651 674 684 661 625 608 613 620 627 647 681 710 720 716 714 724 745 763 764 742 711 694 695 701 695 676 646 620
3770 620 615 636 663 668 648 630 636 653 659 645 627 619 621 625 628 628 633 647 671 698 715 712 694 670 656 658 666 669 663 658 661 667 669 673 687 707 728 748 771 791 795 774 733 684 642
3764 642 610 585 563 545 541 549 556 552 545 553 578 605 621 627 632 634 630 616 593 564 536 527 550 600 652 678 668 642 621 612 601 587 580 589 604 608 604 603 606 600 582 566 557 545 528
3759 528 528 565 628 688 728 753 766 764 751 744 752 764 764 750 727 699 671 656 663 682 691 686 684 701 728 743 739 733 739 754 761 755 743 733 720 701 676 649 622 600 591 594 599
3754 599 595 593 605 630 654 673 691 711 726 728 719 707 701 703 708 702 678 646 626 619 612 596 583 589 614 646 675 695 704 709 723 747 763 756 737 724 720 710 689 675 679 691 693
3748 693 679 662 659 679 708 727 728 718 711 703 690 673 660 649 632 608 591 586 585 586 594 611 627 633 635 640 650 660 668 671 669 667 677 702 734 760 771 764 738 706 686 687 699
3743 699 706 702 689 670 652 640 637 635 631 631 637 636 618 593 583 593 609 620 627 637 646 647 647 661 695 741 774 780 760 733 709 684 655 637 650 689 730 750 752 752 755 757 752 736
3738 736 711 688 674 666 651 622 593 584 604 644 682 706 716 724 730 723 691 643 603 585 589 604 626 652 678 697 702 691 665 631 606 603 619 645 663 663 647 635 644 664
3733 664 668 648 629 635 660 674 665 647 638 641 650 659 666 672 674 672 664 651 636 628 632 655 694 742 784 808 809 788 750 713 696 704 715 705 680 661 658 662 665 672 694 721 733 721 691
3727 691 658 630 616 617 630 649 665 675 685 699 717 729 729 724 729 751 779 792 780 752 725 706 691 672 660 674 722 780 816 822 817 810 797 772 749 745 754 754 735 712
3722 712 699 694 686 677 680 692 700 699 705 732 770 796 800 790 775 755 736 726 723 711 688 676 689 708 710 695 682 675 662 643 639 661 695 721 731 723 697 662 637 633 636 630 619
3717 619 618 631 650 662 660 645 625 616 625 644 657 666 679 696 710 715 714 712 715 727 743 749 735 713 704 710 715 708 699 697 703 708 713 722 732 733 725 714 710 712 715 712 711 719 735 746 738 718 701
3711 701 697 697 693 683 677 680 689 696 696 693 698 708 707 680 634 592 568 553 534 515 508 518 540 559 565 563 565 581 603 626 656 704 754 778 763 732 711 699 677 642 611 598
3706 598 607 631 658 678 689 701 721 737 741 740 746 761 769 764 749 731 716 705 701 695 671 636 613 617 638 655 665 674 680 672 655 642 641 642 629 606 592 604 639 675 689 677
3701 677 650 628 619 617 612 603 609 643 693 724 717 694 690 706 714 696 672 660 654 644 636 644 656 651 630 612 609 610 613 628 650 661 650 638 643 654 642 606 568 548 545 547 548 541 527
3695 527 509 502 507 516 521 531 555 593 636 676 709 725 719 698 683 690 715 744 769 790 811 829 832 821 812 817 828 822 793 759 729 696 646 596 575 587 601 592 568 556
3691 556 564 583 601 614 624 633 645 652 639 603 575 589 645 704 732 729 716 705 695 684 672 659 648 652 675 709 739 760 776 786 786 779 771 756 727 687 652 635 631
3686 631 637 654 685 723 753 764 753 734 721 712 695 669 651 660 683 691 677 660 652 644 625 606 600 603 601 597 600 618 642 667 689 707 716 723 733 745 754 754 745 729 717 717 729
3681 729 739 742 746 762 777 772 750 732 727 724 712 700 693 688 677 668 666 666 658 642 628 620 617 617 622 629 632 626 616 608 612 634 665 690 702 711 722 728 718 697 679 671 672 679 687 687 671 644
3675 644 629 639 666 686 691 687 687 691 694 698 706 712 711 704 704 714 720 707 684 668 663 659 652 649 652 646 622 597 596 625 665 695 704 693 673 662 663 667 665 664 679 705 723 724 714 693 660
3669 660 619 591 583 581 572 557 550 550 553 565 595 632 651 644 631 634 650 656 645 627 625 643 666 679 674 653 629 615 618 632 640 635 627 624 626 622 614 614 631 657 673 665 641 620 616 627
3663 627 636 635 632 637 651 665 672 668 649 617 588 574 571 563 549 542 548 559 573 596 634 675 705 724 741 758 761 743 710 681 666 660 654 643 631 627 636 655 677 687 677 651
3658 651 628 623 635 655 679 703 719 716 697 674 651 621 591 574 571 564 551 553 581 611 618 605 597 598 597 594 595 597 590 582 594 624 651 665 678 696 703 689 669 660 659 651 644 654
3653 654 684 724 760 788 798 785 753 724 709 705 704 698 687 672 660 657 666 682 692 689 671 645 623 614 619 632 646 659 676 697 716 724 711 681 651 642 662 698 723 723
3648 723 703 678 654 632 621 633 663 685 686 684 701 732 750 745 730 718 705 682 655 637 629 616 591 562 546 550 560 561 552 550 564 587 604 614 624 631 627 623 640 682
3643 682 725 746 744 736 734 741 761 788 806 805 789 769 754 745 738 729 711 685 660 640 624 616 630 659 677 669 654 657 679 699 702 692 676 659 652 659 674 679 674 666 655 637 616
3638 616 606 608 610 602 594 597 608 622 634 642 644 646 651 658 658 652 650 655 662 662 662 670 690 721 752 765 753 731 725 737 744 731 710 696 689 684 681 678 670 659 663 683 692 664 616 582 571 572 579
3632 579 602 633 650 645 638 649 665 658 622 575 539 520 518 521 518 507 502 515 546 577 597 608 617 624 627 622 614 609 612 623 637 646 643 627 605 590 590 602 610 607 595 587 592 608 629
3626 629 654 684 714 734 740 737 733 725 706 671 631 611 620 642 649 629 599 585 595 615 631 646 662 675 678 669 654 633 614 613 640 685 723 746 762 771 760 723 676 639
3621 639 619 615 630 661 690 699 685 656 619 580 555 554 567 579 596 632 680 709 705 682 662 652 644 636 628 624 624 627 630 633 640 652 662 658 642 624 610 593 568 538 510 493
3616 493 497 525 560 580 583 585 595 604 606 610 620 627 626 625 627 622 607 599 612 635 642 631 619 615 610 599 587 573 558 557 594 663 730 758 747 720 696 684 681 680 672 656 640 627
3611 627 615 607 611 624 633 633 634 648 670 691 713 740 763 768 753 731 712 694 672 650 638 644 667 696 716 719 707 689 666 643 629 628 630 625 616 618 629 636 631 621 614 606 596
3606 596 593 603 625 649 676 704 725 726 709 686 670 660 644 623 613 630 671 711 726 714 692 671 654 644 640 640 641 653 683 711 707 670 635 640 683 732 766 783
3601 783 782 762 731 712 716 727 729 722 717 717 715 703 682 662 652 659 680 702 710 702 684 655 623 605 613 641 667 679 683 687 685 671 656 653 664 675 679 684 696 708 712 710 708 706 699 695
3595 695 704 726 746 755 761 773 780 766 732 700 688 692 702 714 733 753 764 761 755 759 768 767 744 708 679 672 679 687 694 711 739 761 764 750 734 725 724 730 735 730 716 706 710 723 735
3590 735 747 766 787 796 783 758 734 719 718 730 749 763 765 757 743 726 711 704 703 700 695 695 704 714 714 704 697 699 706 712 712 707 711 733 771 805 813 787 742 703 693 714 742 749 731
3584 731 708 703 713 724 731 739 746 748 749 755 764 768 768 770 769 758 738 721 704 681 657 648 660 678 687 688 694 702 707 704 700 694 681 665 659 671 695 711 707 692 687 700 714 705 672 641 638 666
3578 666 703 722 709 670 627 600 591 593 606 629 652 661 661 664 673 679 682 693 716 731 728 718 718 723 722 721 727 733 722 699 682 677 664 634 603 587 585 589 595 601 604 605 614 637 662 674
3573 674 676 675 675 672 663 650 634 614 594 584 598 638 691 734 748 737 721 709 702 697 699 703 700 684 668 658 649 636 630 640 653 650 641 648 674 698 707 709 714 715 701 672 640 620
3567 620 623 655 703 738 744 736 737 747 749 731 698 656 608 559 524 514 526 550 575 589 586 570 556 561 586 616 638 650 654 654 652 652 658 666 675 680 681 677 668 656 642 629 623 627 638
3562 638 649 659 674 700 730 747 741 713 671 629 602 604 628 651 657 651 655 673 693 691 664 621 586 571 578 591 594 587 589 618 668 712 727 713 691 682 693 716 737 744 739
3557 739 732 736 751 770 783 786 778 757 737 734 754 777 779 756 724 695 671 652 647 654 662 661 662 678 701 713 708 697 685 673 664 663 661 646 618 603 618 651 675 685 694 712 731
3552 731 739 735 729 731 746 766 780 782 776 766 753 737 728 730 731 724 717 718 721 709 689 678 683 683 669 657 667 695 718 722 707 679 651 637 638 639 629 618 621 634 641 640 652 683 716
3546 716 732 733 732 735 739 739 732 719 707 699 694 684 676 681 696 702 688 664 645 634 627 626 636 655 676 700 726 743 737 713 692 680 668 653 641 640 650 672 705 739 756 750 734
3541 734 723 717 707 690 669 650 642 649 664 665 642 616 617 654 695 708 688 663 653 657 656 645 630 618 607 590 571 561 564 577 596 618 639 649 647 643 646 654 658 656 649 638
3536 638 628 626 631 642 657 675 685 676 649 627 626 635 631 614 606 621 645 660 661 659 664 673 681 688 701 720 735 739 735 731 728 713 686 666 673 702 729 748 765 788 811 829 845 859
3530 859 860 848 837 834 829 805 765 731 713 706 698 690 686 687 689 689 692 701 714 722 715 694 669 646 626 607 593 594 611 639 669 696 715 717 693 644 589 557 562 593 626 653 679
3525 679 706 725 728 725 728 733 727 709 697 700 708 706 694 682 679 690 711 732 740 733 724 727 742 757 765 768 765 753 735 720 717 725 733 732 719 703 698 708 725 730 714 686 665 661 670 680 684
3519 684 680 665 643 620 610 625 659 696 715 706 679 652 641 644 651 653 652 646 626 587 541 516 523 550 579 599 612 621 624 626 627 625 617 615 632 666 694 699 686 672 667 674 692 718
3514 718 741 750 749 746 746 742 734 726 720 711 701 703 719 732 723 694 669 660 664 679 710 752 784 794 790 789 794 795 791 787 788 788 778 755 716 671 638 630 642 658 674 693 707 700 675 651
3508 651 641 640 635 628 629 639 656 677 691 680 641 595 563 553 556 577 622 682 738 777 802 810 801 787 784 791 786 764 744 744 757 769 778 784 782 770 758 759 768 776 780 773 736 660
3503 660 574 523 520 536 544 550 571 605 635 651 657 658 653 643 632 628 633 640 642 638 642 659 682 699 711 731 767 807 837 850 848 835 818 804 788 762 728 704 701 708 713 720 734
3498 734 751 762 768 774 773 760 742 733 734 738 744 751 755 750 746 759 784 801 795 771 740 709 688 685 693 690 671 654 647 641 627 617 621 626 615 597 588 579 551 517 508 531 552 551 548 569 602
3492 602 617 611 613 636 668 689 692 681 667 658 663 675 683 684 685 685 677 660 641 629 625 631 647 669 686 696 704 711 706 691 683 693 714 735 758 793 832 859 874 887 894 871 818
3487 818 773 771 804 836 845 836 816 784 752 743 766 800 816 807 793 799 825 853 867 865 857 851 841 820 794 780 785 799 801 781 747 718 707 712 725 741 766 802 837 848 831
3482 831 803 782 770 767 774 790 802 803 795 786 772 742 701 669 660 671 691 706 707 690 666 650 655 675 695 699 681 650 628 635 671 719 760 782 782 762 732 706 692 683 671
3477 671 654 631 602 580 575 586 600 612 638 683 726 741 731 713 695 672 650 643 649 649 640 640 666 705 732 743 750 758 759 760 768 779 772 743 710 689 676 667 666 682 704 714
3472 714 709 698 687 672 655 648 659 683 714 749 786 819 839 848 848 836 803 758 718 700 704 720 733 732 715 688 661 643 627 607 582 562 555 559 562 560 554 551 553 560 571 590
3466 590 615 639 657 670 677 683 690 707 736 765 777 764 736 708 687 668 648 627 613 609 615 626 638 648 648 637 626 624 634 643 645 644 646 657 681 717 752 769 759 737
3462 737 722 719 718 709 690 665 641 623 614 612 615 626 648 671 683 685 687 692 691 686 688 702 714 711 698 692 696 702 702 698 701 719 751 782 790 776 765 776 801 820 829 835 837 822 789 756
3456 756 739 737 738 737 742 755 766 764 754 752 767 787 788 760 718 681 652 625 600 589 598 626 661 692 708 711 712 716 710 679 631 593 580 587 602 619 635 645 658 681 711
3451 711 732 740 745 750 741 708 669 651 659 676 692 712 739 761 767 764 764 772 783 787 783 778 781 788 790 785 778 774 769 759 750 748 743 721 693 683 705 736 745 729 710 707 719 734 744 747 746 744
3445 744 750 764 775 772 759 748 745 745 741 739 746 754 748 726 701 687 685 692 712 746 778 791 783 768 752 730 701 676 668 672 672 660 637 614 593 580 582 606 653 706 740 742 722
3440 722 704 702 714 731 748 760 760 744 717 695 685 681 674 664 659 665 671 670 666 672 686 691 679 656 633 615 606 619 660 711 745 753 751 753 755 751 743 732 714 690 672 668 669 659 649
3434 649 657 685 707 701 674 650 643 649 660 673 685 687 673 650 630 625 635 653 665 665 664 675 705 738 752 740 712 685 674 686 716 743 749 738 734 753 780 790 779 766
3429 766 762 757 738 712 694 692 700 711 721 730 742 760 790 827 854 856 838 823 831 857 878 880 875 879 883 864 819 777 764 776 790 803 827 864 896 912 915 914 907 887 861 836
3424 836 814 795 788 797 813 820 825 850 898 949 985 1005 1021 1029 1025 1020 1031 1059 1092 1136 1203 1294 1385 1452 1489 1502 1497 1490 1495 1506 1492 1434 1350 1275 1218 1160 1092 1023 964 920
3419 920 896 896 912 918 903 879 858 843 839 857 896 931 936 914 887 868 858 857 870 893 913 917 904 885 870 866 874 882 879 860 836 821 820 825 822 808 792 792 809 826 833 831 829
3414 829 823 806 786 778 785 791 786 770 754 740 729 724 734 760 794 815 807 773 740 734 752 770 771 763 753 738 720 709 714 724 725 721 725 733 727 700 668 648 638 633 635 650 671 682
3409 682 678 672 675 684 690 694 704 721 739 757 775 790 789 773 750 731 714 698 695 717 755 783 781 757 728 709 700 696 688 676 666 665 666 656 633 609 596 592 588 583 582 587 594 605 621
3403 621 642 662 682 702 716 719 719 728 748 767 775 775 770 757 735 719 728 758 785 788 766 739 718 705 696 692 693 698 708 726 749 770 778 773 762 750 736 723 712 708 712 725 746
3398 746 763 763 747 729 719 715 711 712 719 726 727 730 745 767 772 749 712 689 694 712 720 710 695 699 719 731 712 676 654 664 686 697 694 690 692 696 699 704 710 711 704 692 684 682 683 686 690 688
3392 688 672 647 627 627 648 678 704 721 727 721 704 682 665 659 664 671 675 683 702 726 745 755 768 789 805 807 805 815 837 856 867 873 870 843 794 754 754 794 848 891 910
3387 910 903 876 840 807 782 760 740 721 699 676 660 646 625 594 578 597 645 694 729 754 763 749 722 709 720 733 725 701 673 643 615 607 634 678 707 714 719 737
3382 737 755 755 734 703 677 666 672 683 684 673 658 648 638 627 621 625 641 665 691 710 708 685 658 650 665 688 708 726 748 776 794 793 777 768 786 827 867 885 879 860
3378 860 840 827 829 848 877 900 902 879 843 807 783 776 784 798 799 778 745 722 723 741 754 754 747 739 725 701 674 658 659 671 684 694 701 703 700 687 660 620 579 552 544 552
3372 552 571 595 619 636 645 647 644 637 628 620 613 604 598 605 629 658 680 694 709 730 748 752 744 731 721 717 717 715 699 664 625 602 603 617 632 651 678 710 725 713 686 665 663
3367 663 668 667 657 654 669 708 758 798 812 797 771 755 753 755 754 757 771 789 796 789 777 767 759 745 720 686 654 636 632 629 623 625 650 689 717 720 712 711 726 752 781 801 800 782
3362 782 766 768 783 796 802 804 798 769 720 670 646 657 693 725 733 716 700 703 724 748 761 761 746 716 682 657 643 636 636 651 676 691 690 683 679 668 643 618 617 643 676
3357 676 700 709 705 692 682 686 696 692 669 650 657 685 710 718 713 702 695 704 736 779 803 794 763 728 695 662 640 640 656 673 687 706 729 741 733 719 716 725 733 734 734 740 749 754 749
3351 749 737 728 728 734 735 730 729 742 759 763 743 704 661 637 641 658 662 649 649 683 727 740 717 694 696 705 694 667 642 627 618 621 638 657 665 665 672 680 670 640 618 625 656 693
3346 693 722 733 719 683 651 644 659 676 680 676 671 670 667 654 629 608 603 615 633 650 673 704 730 739 736 736 736 725 701 680 674 684 704 727 740 733 712 697 699 709 718 727 739
3341 739 745 736 717 701 693 689 689 697 709 718 727 739 744 734 719 724 750 769 761 738 723 722 727 739 759 774 775 766 760 754 739 719 705 700 699 709 731 748 738 706 685 690 702 708 722
3335 722 755 793 816 829 852 884 906 912 912 910 899 886 883 887 880 849 809 779 760 747 740 743 757 776 793 804 808 809 815 825 832 830 824 821 819 812 804 801 812 837 868 887 884 870 861
3330 861 858 848 823 798 789 796 801 797 784 771 761 753 741 722 703 706 736 778 811 829 837 834 820 801 784 762 731 700 691 711 743 773 790 791 774 754 750 762 771 765 760 767 777
3324 777 778 769 757 739 713 693 694 705 702 688 689 709 722 710 690 696 726 754 756 742 731 732 739 747 753 760 769 774 767 745 717 694 678 664 652 647 652 661 662 654 642 638 649 665 672 664
3319 664 654 655 668 681 690 705 733 767 796 816 823 812 780 740 710 701 707 715 715 704 692 686 689 691 691 698 720 745 753 731 695 671 666 671 671 660 644 632 629 638 663 699 732 748
3313 748 748 744 747 751 744 728 717 715 714 709 704 704 703 695 683 676 673 667 656 656 679 719 758 787 809 830 844 837 809 774 747 724 697 670 658 665 683 700 713 722 726 727 732 746 771 798
3308 798 819 830 832 832 838 849 852 836 802 762 722 690 670 668 675 682 684 685 688 698 714 735 755 772 785 795 801 801 792 777 761 746 736 736 741 740 727 708 696 700 710 711 698 683
3302 683 681 693 703 698 681 661 648 649 668 703 745 783 810 817 795 752 717 711 733 760 777 777 761 734 709 701 714 734 746 746 736 727 731 755 794 829 847 847 837 828 830
3297 830 839 838 814 782 770 787 817 835 838 838 844 856 868 870 858 841 826 811 789 766 751 745 738 732 739 765 796 818 838 867 895 903 883 851 827 815 812 812 809 804 803 814 835
3292 835 855 868 872 867 861 873 915 972 1012 1013 990 968 962 966 974 980 986 993 1002 1007 1002 984 956 924 894 870 852 837 824 811 801 798 807 825 842 845 835 821 814 816 815 806 795 791 795 798
3286 798 793 775 752 737 741 760 783 803 818 825 822 812 801 795 787 772 754 743 749 767 784 784 763 733 711 707 715 728 741 752 754 748 740 735 733 732 726 711 688 667 664 679 695 698
3281 698 691 697 726 769 804 818 813 803 799 798 798 805 826 850 857 835 801 779 777 786 793 792 779 756 732 717 717 728 742 759 777 803 838 877 907 917 911 903 904 908 905 889 860 827
3276 827 800 789 794 806 813 816 823 840 862 877 879 867 846 823 806 798 797 792 774 751 736 738 745 743 732 727 736 747 743 725 713 722 743 754 746 733 734 754 780 804 824 834 825 794
3270 794 764 757 772 784 777 758 744 739 738 742 758 784 809 827 841 853 862 863 859 857 859 858 848 826 799 778 771 777 791 801 802 793 779 764 750 729 701 675 667 681 704 724 741
3265 741 763 788 815 842 869 892 910 925 937 938 923 899 883 877 865 833 796 772 768 777 794 815 829 819 784 749 740 758 782 796 796 788 776 757 732 708 688 675
3260 675 667 665 670 682 695 706 719 742 770 788 787 776 770 776 788 802 814 823 826 822 816 814 819 830 847 865 880 881 862 831 804 791 787 780 763 747 741 746 747 742 741 759 791 818 827
3255 827 827 831 838 834 816 801 807 832 856 868 872 875 869 851 830 828 843 855 848 832 826 840 865 894 923 941 932 896 856 840 851 868 880 886 889 887 885 893 917 944 962 973 984
3250 984 988 971 938 911 901 902 907 915 922 920 907 892 886 885 883 878 870 850 815 786 789 826 868 890 893 896 909 925 931 921 906 900 908 921 925 919 912 914 923 931 928 911 887 873 878 901 927
3244 927 945 954 957 954 953 959 970 971 955 927 898 880 879 902 942 978 993 985 961 930 898 875 865 866 866 863 861 862 866 870 875 883 896 917 942 961 968 970 979 994 1003 988 954 914 883
3238 883 862 848 842 846 858 872 875 855 819 786 778 797 823 842 854 865 869 852 816 781 767 773 787 803 823 842 850 849 853 870 894 913 929 945 954 951 937 924 919 916 909 903
3233 903 900 900 894 880 867 865 877 896 910 913 908 901 898 897 895 889 886 891 906 924 933 929 908 874 834 811 818 845 861 856 851 870 912 960 1003 1040 1065 1062 1025 965 907 865 850 862
3228 862 898 947 994 1026 1032 1012 980 956 945 939 926 899 864 834 827 849 888 922 937 939 937 936 933 926 916 908 907 917 930 934 927 921 927 945 961 963 955 945 945 962 997 1046 1093
3223 1093 1117 1110 1084 1059 1044 1035 1030 1039 1070 1114 1148 1159 1150 1137 1131 1136 1143 1143 1135 1136 1160 1205 1255 1296 1320 1326 1320 1314 1312 1299 1262 1210 1165 1134 1107 1072 1036 1013 1006 1008 1017 1034 1056
3217 1056 1078 1092 1098 1099 1106 1128 1162 1194 1206 1194 1161 1126 1106 1110 1125 1133 1132 1129 1120 1094 1053 1025 1027 1048 1060 1050 1027 1010 1011 1038 1082 1119 1129 1118 1105 1095 1082 1061 1043
3213 1043 1035 1038 1052 1077 1108 1132 1144 1153 1170 1197 1229 1260 1281 1284 1270 1251 1240 1239 1249 1272 1307 1341 1364 1382 1409 1452 1496 1523 1522 1509 1499 1499 1497 1482 1464 1462 1487 1532 1576
3208 1576 1603 1606 1593 1586 1604 1643 1682 1705 1717 1739 1780 1829 1867 1884 1883 1878 1878 1884 1889 1887 1879 1870 1869 1887 1928 1987 2055 2131 2209 2280 2336 2384 2445 2530 2626 2713 2784 2848 2919 3012
3203 3012 3131 3273 3426 3580 3729 3871 4007 4139 4274 4414 4560 4717 4887 5070 5266 5479 5710 5945 6165 6376 6610 6893 7216
3200 7216 7557 7907 8268 8643 9030 9435 9867 10327 10811 11326 11884 12488 13136 13834 14595 15423 16317 17286 18351 19522 20786 22135
3197 22135 23579 25142 26840 28679 30660 32773 34999 37315 39707 42164 44673 47212 49751 52230 54551 56586 58196
3195 58196 59224 59503 58878 57272 54717 51367 47475 43350 39283 35484 32048 28994 26315 23997 22010 20297 18791 17453
3193 17453 16270 15242 14346 13543 12800 12109 11474 10887 10334 9811 9330 8897 8499 8119 7754 7407 7077 6761 6467 6207 5977 5754
3190 5754 5522 5288 5061 4840 4614 4387 4177 3998 3839 3676 3502 3334 3197 3097 3017 2938 2855 2772 2697 2633 2578 2530 2491 2457 2427 2396 2356
3187 2356 2304 2247 2192 2142 2094 2045 1997 1947 1888 1820 1755 1708 1682 1667 1653 1638 1627 1627 1640 1660 1670 1656 1618 1567 1514 1465 1424 1398 1394 1412 1442 1474 1498 1510 1514 1512
3183 1512 1501 1475 1438 1396 1359 1333 1319 1311 1296 1264 1226 1207 1218 1246 1263 1249 1210 1169 1152 1165 1189 1202 1206 1214 1224 1217 1188 1155 1136 1125 1104 1075 1054 1050 1058 1072 1084
3178 1084 1089 1089 1102 1136 1174 1189 1180 1169 1164 1153 1128 1105 1101 1110 1111 1097 1076 1066 1072 1093 1125 1159 1193 1225 1246 1243 1217 1180 1143 1103 1058 1013 978 950 932 930 943 957 955 938
3173 938 922 913 908 906 908 910 914 930 963 999 1007 981 948 940 965 1011 1061 1098 1109 1094 1073 1072 1095 1126 1148 1156 1156 1154 1161 1185 1220 1248 1253 1234 1206 1183 1167 1151 1135 1127 1131 1142 1144
3168 1144 1133 1123 1136 1172 1206 1217 1211 1210 1225 1246 1269 1299 1335 1367 1387 1394 1388 1371 1351 1345 1355 1360 1344 1315 1293 1280 1266 1256 1267 1297 1315 1303 1277 1259 1245 1221 1189
3164 1189 1169 1167 1169 1165 1156 1151 1151 1162 1186 1213 1227 1218 1199 1189 1196 1209 1210 1195 1177 1168 1167 1161 1150 1150 1169 1192 1200 1198 1201 1209 1203 1176 1144 1125 1117 1113 1113 1120 1128 1132 1136 1144 1152 1154 1155 1165 1183 1197 1202
3158 1202 1210 1227 1245 1244 1220 1182 1148 1126 1115 1109 1105 1103 1101 1093 1076 1046 1008 975 965 982 1011 1027 1015 980 940 917 925 961 1000 1013 991 952 918 900 891 885 886 897 919 943
3153 943 955 949 937 940 965 995 1010 1001 982 965 954 939 906 858 814 792 788 787 785 794 821 851 866 868 872 888 907 922 926 916 895 876 873 887 912 940 964 976 972 957 940
3148 940 924 914 922 948 968 959 930 913 920 924 903 869 846 837 823 801 785 781 781 782 788 801 807 798 788 793 811 829 835 836 841 853 867 880 890 894 892 888 891 900 907 899 874 841 815 806
3142 806 810 819 826 829 833 844 866 898 928 945 946 942 948 959 957 934 904 882 864 834 797 773 776 800 830 856 876 891 900 902 896 886 881 894 926 965 1000 1026 1039 1040 1041 1047 1053 1047
3137 1047 1032 1023 1027 1028 1018 1002 985 959 922 897 902 922 927 914 906 916 929 929 921 913 908 906 910 921 932 943 960 985 1003 1001 980 948 909 866 833 821 823 826 833 858 893 918
3132 918 916 897 882 883 898 914 917 901 875 853 845 852 873 912 965 1020 1061 1079 1073 1055 1039 1034 1032 1024 1007 990 983 983 985 984 980 973 972 984 1009 1036 1055 1062 1058 1049 1040 1038 1042 1049 1046 1029 1000
3126 1000 965 937 923 921 924 929 934 935 927 911 901 906 914 908 892 886 908 949 989 1018 1038 1051 1053 1044 1029 1016 1005 992 973 947 924 927 969 1029 1064 1050 1006 974 968 971 961 942
3121 942 931 940 966 1003 1047 1087 1106 1100 1079 1060 1051 1052 1069 1105 1145 1160 1136 1092 1065 1066 1077 1079 1071 1066 1068 1076 1083 1082 1070 1048 1030 1028 1043 1064 1076 1076 1065 1054 1055 1067 1076 1067 1049
3115 1049 1043 1062 1093 1120 1136 1144 1152 1172 1206 1238 1243 1218 1186 1171 1165 1149 1125 1108 1104 1100 1095 1101 1117 1121 1099 1066 1049 1053 1065 1071 1075 1089 1115 1148 1179 1200 1213 1221 1225 1214 1182 1143
3110 1143 1123 1134 1165 1195 1218 1236 1248 1251 1243 1236 1244 1270 1310 1356 1403 1450 1488 1508 1516 1531 1573 1639 1703 1746 1766 1769 1765 1755 1745 1742 1753 1776 1798 1805 1797 1783 1771 1754 1723
3105 1723 1681 1647 1634 1641 1652 1658 1658 1655 1652 1645 1631 1614 1602 1605 1621 1646 1672 1697 1718 1736 1750 1762 1771 1770 1760 1750 1748 1754 1761 1766 1769 1775 1789 1820 1868 1927 1983 2032 2078 2119 2143 2141
3100 2141 2122 2111 2127 2172 2230 2276 2297 2300 2307 2331 2372 2416 2454 2485 2513 2545 2578 2604 2616 2612 2598 2578 2547 2503 2457 2423 2400 2370 2322 2265 2222 2203 2203 2207 2206 2204 2211 2230
3096 2230 2258 2287 2318 2356 2396 2429 2452 2466 2475 2478 2483 2498 2519 2536 2543 2552 2568 2588 2613 2657 2724 2788 2823 2836 2849 2874 2904 2948 3025 3134 3249 3349 3435 3519 3599
3091 3599 3677 3766 3880 4012 4148 4287 4430 4575 4718 4870 5039 5226 5424 5643 5901 6192 6492 6788 7091 7417 7769 8146 8561 9031
3088 9031 9559 10135 10749 11398 12084 12818 13616 14490 15438 16447 17511 18636 19838 21122 22481 23901 25370 26890 28475 30133
3086 30133 31848 33571 35236 36789 38201 39470 40619 41677 42683 43657 44597 45473 46247 46874 47296 47441 47252 46711 45833 44657
3084 44657 43241 41666 40021 38364 36728 35138 33628 32227 30946 29780 28722 27756 26856 25990 25143 24326 23559 22855 22224
3081 22224 21679 21233 20891 20641 20467 20358 20321 20370 20513 20747 21073 21502 22040 22690 23456 24341 25344 26450 27644 28921 30279 31706
3079 31706 33180 34670 36151 37606 39032 40435 41828 43218 44622 46061 47537 49014 50424 51707 52822 53744 54445 54902
3076 54902 55099 55028 54677 54039 53109 51881 50351 48527 46449 44178 41789 39352 36930 34581 32351 30268 28340 26561 24928
3074 24928 23446 22122 20948 19900 18952 18080 17259 16464 15682 14923 14201 13523 12887 12289 11732 11213 10720 10242 9771 9311 8864
3071 8864 8438 8042 7688 7378 7101 6834 6562 6285 6024 5798 5607 5440 5290 5150 5012 4862 4693 4518 4357 4219 4098 3985 3882
3069 3882 3789 3704 3622 3543 3470 3408 3354 3301 3239 3167 3096 3040 3005 2980 2955 2928 2898 2853 2788 2722 2682 2668 2655 2627 2598 2587 2581 2553 2490 2409 2327 2252 2193 2156 2143
3064 2143 2137 2125 2105 2084 2071 2072 2089 2109 2116 2105 2085 2066 2046 2021 2001 1992 1987 1972 1941 1903 1868 1843 1828 1817 1802 1786 1782 1795 1809 1802 1772 1733 1697 1661 1619 1583 1561 1552
3060 1552 1543 1527 1503 1474 1445 1422 1408 1404 1409 1426 1448 1462 1459 1448 1448 1460 1462 1439 1398 1360 1338 1331 1333 1337 1337 1332 1327 1333 1349 1363 1369 1374 1388 1406 1416 1411 1392 1362 1326 1295 1285 1303
3055 1303 1337 1374 1410 1452 1491 1510 1501 1480 1467 1461 1439 1391 1336 1303 1302 1310 1301 1275 1253 1248 1250 1241 1217 1195 1189 1192 1180 1143 1098 1068 1058 1054 1053 1065 1089 1108 1106 1093 1088 1094 1101 1101 1099
3049 1099 1093 1079 1063 1060 1069 1080 1085 1094 1113 1132 1144 1154 1170 1192 1214 1238 1263 1282 1291 1300 1312 1320 1318 1319 1342 1381 1411 1416 1403 1384 1366 1354 1359 1385 1419 1443 1440 1409 1359 1307 1264
3044 1264 1228 1195 1165 1142 1122 1099 1076 1067 1072 1076 1078 1093 1131 1178 1209 1214 1197 1172 1149 1139 1147 1168 1189 1201 1201 1190 1169 1139 1107 1079 1065 1072 1096 1125 1153 1181 1213 1240
3040 1240 1248 1237 1215 1196 1186 1188 1200 1215 1223 1224 1228 1241 1258 1269 1280 1306 1352 1395 1404 1372 1323 1288 1271 1258 1243 1237 1249 1267 1274 1265 1243 1215 1189 1176 1175 1164 1124 1068 1024
3035 1024 1010 1022 1052 1090 1124 1137 1126 1106 1092 1089 1095 1111 1133 1156 1175 1194 1213 1228 1231 1218 1192 1164 1150 1157 1179 1199 1210 1217 1230 1248 1265 1277 1282 1281 1282 1297 1320 1329 1312
3030 1312 1282 1258 1245 1235 1227 1234 1257 1279 1286 1285 1294 1320 1351 1371 1371 1357 1348 1360 1397 1439 1464 1462 1444 1432 1446 1487 1537 1571 1584 1585 1592 1609 1631 1650 1663 1672 1678 1690 1711 1738
3025 1738 1763 1784 1803 1821 1834 1833 1814 1774 1717 1658 1615 1593 1582 1568 1550 1536 1530 1529 1530 1538 1557 1584 1613 1637 1657 1668 1671 1663 1646 1622 1598 1580 1572 1574 1581 1591 1601 1613 1626
3021 1626 1638 1651 1671 1705 1746 1778 1789 1786 1785 1792 1802 1810 1824 1850 1888 1932 1982 2035 2083 2125 2165 2207 2237 2243 2236 2243 2270 2299 2313 2319 2333 2363 2398 2418 2408 2369 2319 2278
3016 2278 2249 2218 2175 2130 2099 2080 2055 2014 1966 1930 1916 1919 1926 1927 1913 1882 1851 1846 1878 1924 1951 1952 1946 1946 1942 1920 1891 1871 1849 1803 1739 1687 1665 1659 1650 1640 1642 1652 1665 1684
3011 1684 1718 1761 1795 1813 1829 1860 1907 1957 1992 2003 1996 1989 1996 2009 2008 1989 1968 1963 1969 1965 1939 1906 1889 1894 1904 1897 1873 1847 1835 1837 1842 1845 1845 1842 1838 1836 1844 1864 1890 1908 1909 1898 1891 1897
3006 1897 1913 1935 1961 1985 1995 1982 1959 1947 1949 1954 1960 1977 2005 2029 2033 2026 2027 2047 2086 2139 2194 2237 2265 2287 2314 2339 2347 2338 2322 2310 2307 2312 2315 2303 2275 2247 2228 2207 2176 2138
3001 2138 2102 2064 2012 1950 1894 1855 1825 1799 1780 1773 1777 1794 1817 1830 1822 1809 1812 1829 1839 1830 1819 1821 1827 1828 1822 1820 1825 1839 1863 1890 1908 1908 1903 1910 1936 1977 2029 2085 2130 2153 2152 2132
2996 2132 2103 2077 2069 2082 2105 2131 2160 2190 2211 2216 2215 2227 2255 2283 2294 2292 2288 2295 2308 2314 2308 2304 2319 2349 2375 2382 2380 2382 2384 2380 2377 2390 2414 2432 2433 2427 2430 2451 2495 2555 2621 2681 2736
2990 2736 2790 2842 2890 2941 3000 3066 3129 3190 3250 3301 3330 3344 3366 3406 3458 3515 3585 3679 3795 3932 4085 4242 4389 4521 4651 4793 4946 5105 5280
2987 5280 5485 5718 5961 6208 6469 6756 7070 7412 7797 8239 8746 9313 9930 10590 11292 12043 12845 13682 14520 15342 16172 17062 18051
2984 18051 19147 20334 21595 22905 24220 25487 26655 27683 28533 29170 29575 29734 29620 29202 28482 27521 26411 25241 24080
2982 24080 22997 22046 21240 20563 19991 19513 19107 18730 18338 17916 17473 17025 16586 16170 15796 15475 15214 15021 14902 14859 14889 14994 15185
2979 15185 15463 15820 16248 16754 17355 18054 18835 19679 20586 21568 22627 23748 24924 26172 27525 29017 30671 32502 34507 36660
2976 36660 38930 41302 43769 46298 48816 51225 53428 55335 56860 57922 58458 58440 57886 56858 55442 53740 51868 49941
2974 49941 48048 46223 44446 42676 40865 38972 36985 34936 32890 30909 29033 27290 25699 24263 22964 21778 20693
2972 20693 19707 18814 18018 17332 16771 16326 15971 15679 15435 15237 15098 15033 15046 15131 15286 15522 15847 16250 16718 17254 17872 18581 19385 20285
2969 20285 21276 22328 23386 24398 25334 26196 27015 27839 28717 29674 30710 31803 32911 33980 34947 35745 36289 36476 36225 35508
2967 35508 34354 32825 30998 28975 26872 24795 22823 21011 19398 17995 16785 15737 14823 14013 13284 12622 12022 11465 10914
2964 10914 10345 9768 9213 8698 8224 7788 7401 7074 6802 6557 6308 6042 5771 5524 5315 5134 4959 4785 4627 4495 4380 4260 4129
2962 4129 3999 3877 3754 3626 3505 3409 3342 3281 3207 3117 3020 2920 2824 2743 2690 2658 2627 2578 2513 2448 2399 2371 2356 2337 2305 2265 2234 2220 2216 2203 2169 2117
2958 2117 2063 2020 1989 1966 1947 1936 1927 1905 1862 1812 1774 1759 1757 1760 1766 1770 1761 1734 1701 1681 1683 1703 1735 1770 1799 1810 1799 1773 1747 1734 1744 1776 1813 1833 1824 1798 1774 1765 1763
2953 1763 1756 1747 1741 1739 1736 1735 1750 1783 1816 1835 1845 1852 1859 1864 1882 1918 1955 1974 1986 2020 2080 2137 2171 2193 2220 2248 2271 2301 2355 2426 2496 2560 2630 2709 2791 2867 2938 3008 3075
2948 3075 3139 3204 3280 3371 3477 3585 3684 3777 3881 4005 4146 4295 4452 4620 4802 4999 5217 5459 5726 6017 6338 6696 7089 7522 8010
2945 8010 8567 9182 9838 10543 11318 12174 13088 14030 14975 15898 16762 17532 18203 18803 19381 19973 20588 21196 21740 22148 22353 22310 22016
2942 22016 21514 20882 20194 19509 18855 18234 17615 16959 16243 15463 14636 13793 12979 12234 11568 10976 10457 10025 9686 9428 9232 9083 8977
2939 8977 8908 8878 8899 8976 9102 9258 9440 9651 9905 10216 10600 11063 11596 12183 12819 13509 14255 15040 15824 16567 17242 17859 18458 19090
2937 19090 19807 20642 21606 22685 23847 25055 26252 27355 28266 28912 29254 29265 28913 28188 27125 25797 24291 22703 21136 19684
2934 19684 18396 17271 16290 15440 14715 14091 13534 13003 12468 11914 11341 10759 10187 9650 9164 8731 8341 7993 7693 7443 7240 7075
2931 7075 6941 6829 6732 6656 6620 6633 6679 6734 6803 6911 7066 7254 7464 7705 7988 8303 8623 8944 9281 9628 9953 10217 10413 10560 10690
2928 10690 10830 10991 11169 11330 11418 11387 11221 10939 10579 10181 9777 9386 9012 8647 8278 7885 7452 6981 6499 6041 5624 5245 4894
2926 4894 4570 4282 4034 3825 3648 3493 3347 3212 3096 2999 2907 2812 2719 2637 2566 2493 2414 2332 2255 2188 2134 2088 2041 1990 1945 1916 1894 1859 1810 1766
2922 1766 1735 1706 1668 1627 1597 1578 1562 1543 1521 1497 1470 1446 1431 1426 1425 1423 1418 1408 1397 1394 1398 1387 1345 1286 1247 1248 1266 1272 1263 1258 1273 1303 1337 1370 1392 1389 1359 1313 1272 1244
2917 1244 1226 1214 1208 1205 1199 1188 1171 1154 1142 1137 1133 1115 1082 1052 1048 1062 1063 1035 998 986 1012 1055 1085 1092 1080 1058 1034 1022 1026 1040 1049 1039 1015 992 981 980 980 978 976 975 970 958
2912 958 945 932 912 882 852 834 828 824 824 839 876 928 979 1013 1018 994 954 927 925 938 949 950 947 941 934 926 921 914 897 874 860 870 901 937 970 1002 1037 1066 1085 1098 1121
2907 1121 1161 1203 1225 1221 1207 1199 1197 1188 1167 1147 1143 1156 1170 1174 1166 1154 1140 1124 1110 1099 1086 1058 1016 983 983 1012 1041 1050 1043 1037 1037 1037 1030 1015 995 974 960 962 984 1023 1071 1114
2902 1114 1136 1134 1123 1121 1128 1132 1123 1101 1073 1053 1056 1080 1108 1123 1134 1161 1208 1254 1280 1287 1288 1293 1300 1310 1323 1337 1353 1376 1409 1439 1447 1423 1380 1341 1320 1317 1321 1321 1312 1297 1282 1273
2897 1273 1268 1262 1252 1244 1239 1240 1243 1248 1246 1230 1200 1171 1158 1161 1163 1153 1134 1125 1137 1163 1180 1171 1142 1115 1108 1118 1133 1152 1183 1220 1241 1237 1223 1220 1228 1235 1234 1226 1220 1221 1232 1250 1258 1241 1201
2891 1201 1154 1112 1084 1077 1096 1125 1143 1148 1159 1190 1230 1257 1259 1240 1207 1171 1144 1128 1114 1102 1105 1133 1174 1206 1214 1201 1176 1142 1105 1070 1043 1024 1011 997 974 949 939
2887 939 959 998 1028 1031 1013 988 966 953 953 960 962 955 949 956 975 995 1014 1036 1064 1098 1133 1158 1160 1133 1093 1062 1047 1035 1018 1004 1008 1024 1042 1059 1084 1114 1137 1144 1149 1165
2882 1165 1184 1186 1169 1146 1133 1128 1121 1111 1101 1093 1081 1058 1023 988 971 980 998 1004 989 966 944 920 893 874 870 870 854 828 814 822 839 853 867 886 901 898 879 859 851 859
2877 859 878 899 911 912 909 908 904 891 880 881 888 886 877 875 886 897 901 908 922 921 893 856 844 868 906 936 953 961 957 945 941 960 994 1024 1038 1037 1017 974 916 868 848 854 869
2871 869 873 860 837 823 833 862 891 908 914 919 924 924 912 886 847 799 750 712 696 710 754 809 853 877 884 880 863 833 803 789 796 812 825 827 812 786 763 755 755 753 753
2866 753 771 805 827 820 799 790 796 800 793 786 788 788 779 767 768 787 812 832 840 837 829 818 803 781 753 733 736 760 793 825 859 900 943 972 975 953 926 920 945 983 1011 1018 1003
2861 1003 965 905 841 804 810 842 871 879 864 834 802 786 792 808 819 822 825 825 815 798 785 776 763 747 737 739 738 728 721 728 744 752 745 725 707 710 746 806 857 872 862
2856 862 855 865 876 874 866 870 888 907 919 925 931 934 931 925 927 943 962 967 948 912 868 830 812 820 842 853 845 833 836 843 835 813 795 787 777 756 734 722 719 721 729 742 749 741 727 726
2851 726 749 793 845 885 896 882 862 852 849 839 819 797 783 778 783 798 814 820 812 795 778 767 769 786 807 822 827 827 825 819 806 788 767 750 744 752 764 759 735 705 683
2846 683 676 685 710 740 758 752 733 722 722 725 723 723 735 762 798 829 845 847 850 865 884 889 875 849 821 793 770 758 757 754 741 725 719 728 740 746 742 733 726 730 748 773 788 782 756
2840 756 723 691 663 642 631 631 640 660 689 726 763 789 794 780 757 739 730 731 737 742 734 713 696 701 726 751 762 763 759 747 724 700 693 704 724 744 757 753 731 708 699 701
2835 701 703 709 736 782 812 803 765 726 703 698 716 755 802 836 847 836 816 797 783 766 737 694 659 651 667 687 696 695 690 686 682 677 673 676 697 731 759 764 754 745 743 738 728
2830 728 717 708 704 714 746 791 825 829 809 780 757 750 760 777 790 800 813 834 854 865 867 860 839 806 781 774 775 763 734 702 677 660 651 661 691 723 736 724 704
2825 704 695 700 712 725 739 752 757 755 756 766 777 777 770 767 769 764 751 742 751 768 778 781 786 799 817 837 858 872 875 870 861 843 814 784 770 773 776 767 750 736 732 740 755 769 767 744
2819 744 709 677 656 650 657 672 684 686 685 689 700 705 696 679 668 675 700 733 756 758 745 735 743 764 774 760 741 742 766 785 778 753 734 728 725 716 705 689 665 638 623 623 623
2814 623 622 637 674 710 718 702 690 695 701 693 684 697 733 774 802 818 822 806 758 690 635 617 627 642 654 674 698 710 698 677 664 658 649 643 651 667 673 668 673 697 727 744
2809 744 749 750 750 747 745 747 743 727 710 714 739 764 772 763 751 745 745 746 744 738 733 730 725 719 728 764 814 846 837 798 756 729 719 719 727 739 753 765 773 778 786 800 817 828 830 826 825 819 791 737
2803 737 683 661 677 700 701 681 663 656 645 627 620 642 680 703 703 702 722 752 765 753 732 724 733 751 765 767 753 735 728 734 742 739 728 729 748 771 785 788 791 793 784 766 749
2798 749 743 736 716 687 670 680 707 728 730 711 685 669 676 697 717 735 764 806 846 866 864 851 824 779 720 663 621 599 597 613 629 632 625 622 629 633 631 630 639 650 659 671
2792 671 695 722 741 752 761 762 754 741 737 737 729 713 703 712 733 753 762 758 743 726 715 711 704 686 655 616 578 554 553 571 595 619 646 677 705 724 738 755 774 793 808
2787 808 816 812 793 761 725 688 654 627 610 605 605 611 625 648 667 670 657 641 634 633 632 631 642 672 711 749 780 800 801 783 763 763 783 806 822 836 853 869 877 878 875 867 847
2782 847 821 794 772 756 750 754 758 758 755 754 752 748 747 751 753 748 740 743 761 782 790 784 774 773 791 821 846 851 841 828 815 799 782 770 762 745 720 707 721 748 765 767 769 785 809
2777 809 832 853 878 904 918 910 885 859 843 833 822 805 786 770 756 743 734 736 748 757 757 754 761 776 787 787 789 799 807 797 772 756 760 771 772 766 765 766 749 712 671 646
2771 646 632 612 586 578 603 651 692 709 707 699 693 694 706 727 740 730 697 666 652 656 661 654 635 605 577 564 571 583 588 588 600 622 638 640 642 666 709 750 770 773 766 752
2766 752 730 710 704 713 728 738 742 742 738 728 715 709 712 717 714 707 710 727 752 770 771 750 723 714 732 766 792 801 804 813 829 841 838 822 802 793 799 803 788 756 729 717 710 696 679
2761 679 670 667 661 657 668 694 720 736 748 760 765 758 742 729 722 717 707 694 690 706 745 790 814 807 786 778 786 789 767 738 733 760 788 783 746 706 690 693 702 710 719 733 744 750 756
2755 756 766 777 777 763 738 712 691 679 675 674 676 678 686 699 712 721 731 756 791 814 811 793 783 781 772 749 728 728 754 797 844 888 919 937 947 953 946 919 882 849 822
2750 822 796 776 771 784 805 824 832 819 790 764 760 775 786 778 759 744 738 740 750 762 759 734 704 692 706 728 743 751 753 747 731 710 698 698 697 686 669 662 667 676 682 695 726
2745 726 768 807 836 855 860 848 830 829 849 868 862 840 826 834 858 891 932 978 1019 1046 1059 1064 1064 1064 1062 1049 1025 1003 1003 1021 1038 1036 1025 1022 1028 1035 1037 1039 1041 1041 1041 1050 1070 1089
2740 1089 1093 1086 1079 1076 1070 1055 1038 1026 1019 1012 1005 997 986 973 962 952 938 912 887 878 886 894 884 864 845 830 812 789 770 760 759 762 768 782 808 844 876 893 895 895 903 916 924 925
2734 925 922 918 917 925 942 959 963 953 941 939 951 977 1016 1061 1096 1106 1083 1035 976 924 893 882 880 877 874 875 879 878 870 856 841 823 802 784 781 797 820 839 856 879 902 900
2729 900 859 800 758 747 751 755 766 795 826 834 810 775 749 734 719 707 705 712 719 724 735 757 783 801 807 803 785 756 731 724 730 725 701 677 676 694 712 723 736 755 768
2724 768 764 748 733 726 730 740 747 745 741 751 778 808 822 813 785 745 702 669 661 680 713 743 759 763 765 771 781 787 790 797 812 826 825 807 779 753 733 717 706 698 691 682 669 650
2719 650 629 617 619 632 649 667 688 705 708 692 670 656 648 639 626 624 640 666 684 687 683 678 677 680 688 697 697 682 665 665 689 728 767 794 801 784 747 704 671 659 670 701
2714 701 741 779 809 829 838 831 803 762 726 705 701 704 713 736 771 804 811 786 749 728 725 726 717 698 680 666 659 664 681 700 712 718 727 739 746 743 736 733 736 741 741 730 711 700 711
2708 711 739 760 761 747 738 738 741 744 753 770 785 792 789 782 771 753 737 733 743 756 762 763 765 763 749 728 715 723 743 758 759 752 753 765 774 768 746 727 726 741 749 734 706 683 678 690
2703 690 712 740 771 801 821 824 805 774 744 724 712 710 724 756 787 798 791 782 776 765 752 753 777 811 832 833 823 812 806 807 810 807 794 773 749 725 703 688 684 691 704
2697 704 718 730 740 745 748 746 744 750 766 782 783 768 756 762 784 809 834 851 849 821 787 770 771 769 753 737 734 739 733 711 686 669 662 660 660 666 679 703 733 761 782 792 798 804
2692 804 814 832 853 865 858 829 792 764 745 727 701 679 674 682 690 690 695 709 719 712 697 690 692 687 675 674 689 703 697 678 664 663 666 678 705 743 771 775 765 762 776 799 816
2687 816 815 794 765 743 732 730 730 732 736 740 744 751 755 746 721 694 676 665 650 629 611 606 619 650 690 721 726 708 684 669 663 666 682 710 737 751 753 752 755 766 788 811 817 801
2681 801 773 745 716 687 666 663 672 676 676 684 700 713 724 745 781 809 812 794 777 769 765 758 744 722 699 687 699 729 760 776 770 743 713 701 716 742 757 756 747 739 736 741
2676 741 753 761 749 720 689 671 665 666 671 681 692 699 703 700 689 676 678 702 736 758 760 748 736 736 747 763 777 782 775 755 729 711 711 723 732 729 719 711 712 722 738 748 746 738
2671 738 734 734 729 720 717 727 735 734 733 740 742 724 694 675 685 719 759 788 789 758 713 677 658 651 657 686 731 766 777 777 784 797 799 783 760 744 738 737 737 737 739 745 752 749 733 711 697
2665 697 695 700 709 717 722 717 698 670 638 601 565 535 512 496 493 510 546 587 619 637 642 635 622 617 629 650 668 677 682 685 679 665 658 671 701 729 748 761 771 772 760 743 735
2660 735 741 757 772 777 769 754 744 748 766 783 780 752 714 690 693 712 722 718 710 705 698 688 686 700 720 731 732 730 723 703 676 658 660 675 690 705 725 750 777 799 815 823 831
2655 831 842 853 855 851 855 879 911 930 928 914 895 872 837 797 767 760 772 783 780 771 768 773 772 762 752 747 748 752 763 777 781 768 755 763 787 802 794 780 778 784 782 766 745 725
2649 725 706 694 704 745 798 831 834 821 809 798 783 767 764 775 790 805 829 865 904 929 931 916 893 871 853 839 827 815 805 795 783 774 771 764 737 695 664 664
2645 664 687 710 724 731 731 719 698 677 665 665 677 700 723 729 714 689 667 657 663 685 712 728 720 689 650 617 602 601 603 605 612 630 645 647 648 668 700 721 722 724 742 764
2640 764 769 765 767 779 790 797 803 807 799 779 763 760 763 759 741 715 692 679 677 682 694 715 734 737 724 716 729 746 746 726 700 675 651 635 640 659 668 660 653 660 667 659 647 647 652 640 608
2634 608 584 591 624 661 691 721 756 784 792 778 761 759 766 764 749 739 749 770 782 774 755 736 724 719 725 744 778 819 849 850 813 756 708 684 677 673 672 685 714 747 768
2629 768 776 779 783 780 761 730 703 694 708 736 759 761 747 740 754 775 784 780 783 799 809 799 785 780 776 754 723 716 742 777 795 796 794 797 805 819 838 849 838 815 801 810 832 845
2623 845 839 813 774 740 729 740 750 735 701 673 666 678 697 718 743 767 780 779 771 762 753 744 744 755 773 788 800 810 817 817 805 783 759 736 714 693 673 655 641 639
2619 639 652 679 703 706 687 665 664 683 707 720 725 724 715 700 698 722 761 783 776 757 752 758 756 731 695 668 662 669 683 699 720 746 770 786 794 794 790 782 775 771 768 767 773 788 798
2613 798 792 777 765 761 759 757 765 779 780 754 715 688 675 666 655 647 643 639 635 644 669 699 721 733 742 749 748 734 714 700 697 699 698 698 709 735 758 765 760 757 755 739 707 679 670 672 676 689
2607 689 722 760 778 769 756 760 781 798 793 768 734 707 692 681 663 642 637 652 671 678 682 701 739 776 798 809 820 831 831 819 798 770 736 710 706 719 721 701 675
2602 675 668 679 683 671 662 681 723 757 760 736 704 684 680 681 678 675 691 734 785 815 810 787 763 745 729 722 729 743 746 734 721 724 741 760 777 798 824 846 850 837 818 808
2597 808 816 838 858 854 822 778 745 730 721 713 709 713 711 698 687 696 723 750 770 793 820 835 824 800 786 793 813 839 864 873 859 834 820 825 831 823 805 789 776 757 741
2592 741 742 760 782 798 812 824 832 830 823 813 797 771 744 730 734 747 759 768 775 787 807 833 856 863 848 815 777 743 718 694 668 647 643 661 687 707 720 726 727 720 709
2587 709 701 698 698 696 690 678 662 648 635 621 608 608 628 656 670 663 647 635 627 620 619 630 649 670 692 722 759 796 827 848 855 848 838 841 861 884 899 899 884 850 796 736
2582 736 689 663 653 651 659 676 693 701 707 727 761 788 788 769 750 740 728 706 679 661 658 668 688 711 730 740 746 757 774 791 803 808 804 787 757 720 681 646 626
2577 626 629 643 645 628 606 602 622 650 675 692 703 702 683 651 617 597 596 610 631 653 672 689 702 711 720 738 767 797 810 802 787 779 774 758 734 718 718 722 718 716 729 752
2572 752 764 760 753 756 760 755 749 758 782 800 799 784 768 759 757 763 780 801 816 816 801 782 766 754 743 730 720 714 709 705 710 733 767 790 782 753 735 745 772 785 771 739 705
2567 705 676 658 654 665 682 689 686 686 697 708 706 694 680 674 677 690 717 753 786 804 805 795 781 766 755 754 763 771 765 752 750 769 799 818 815 800 785 780 789 807 824 827 815
2562 815 801 792 789 790 795 806 819 834 842 831 793 740 702 693 703 707 700 689 684 685 697 720 750 772 778 769 752 739 737 737 718 672 615 571 551 559 595 650 687 683 659 661 695
2556 695 722 719 710 722 747 760 766 782 812 840 864 890 910 903 873 846 834 821 800 787 795 812 815 806 803 810 812 802 791 788 786 780 775 782 805 830 839 823 785 739 697 672 666
2551 666 674 682 689 699 716 732 737 730 721 717 722 734 753 769 768 749 731 731 749 769 773 754 723 697 689 698 709 707 696 694 711 740 765 777 778 775 768 758 750 758 783 816 839 850 860
2546 860 876 895 911 922 925 907 869 826 800 792 788 778 771 778 804 839 868 875 858 827 796 768 746 732 731 741 753 764 780 802 813 799 766 732 708 693 686 696 731
2541 731 781 826 855 877 900 918 916 888 850 819 794 764 726 693 680 690 716 743 757 753 741 736 739 735 712 682 670 689 724 745 740 717 699 708 746 796 835 846
2536 846 835 819 812 817 825 828 827 825 828 832 835 845 870 906 937 949 940 916 883 847 817 796 782 767 752 745 747 754 759 767 783 807 827 833 822 799 780 775 778 771 744 710 691 692 702
2531 702 716 740 777 813 828 811 771 725 688 668 674 702 737 761 767 764 766 780 798 809 806 794 780 770 771 784 800 805 796 785 783 789 787 769 739 711 698 702 722 745 760
2526 760 761 751 740 737 747 764 774 766 752 752 769 787 791 790 800 819 832 831 828 834 840 834 818 800 783 762 731 698 675 669 681 702 725 743 759 778 808 845 877 885 867
2521 867 841 825 819 805 774 745 736 746 752 740 721 708 701 691 678 669 667 665 658 648 646 657 681 712 736 743 729 704 687 689 710 741 768 779 770 749 735 737 745 746 738 732 732 730
2515 730 723 716 717 723 726 724 723 734 758 788 808 807 788 762 740 727 725 731 743 754 758 757 757 765 782 805 819 813 789 767 762 767 768 758 746 743 747 754 764 772 773 760 732 696 664 650
2510 650 655 670 680 685 704 748 804 847 861 845 815 789 777 774 769 754 740 740 751 758 753 747 751 768 789 804 804 786 759 741 743 752 754 750 762 796 833 851 847 841 843 845 842 846 861
2504 861 869 852 813 787 797 831 860 861 835 800 777 775 781 772 745 726 742 783 813 809 784 760 747 738 726 712 701 700 713 741 775 801 811 810 815 834 859 872 868 861 863
2499 863 862 842 805 778 778 791 792 776 761 759 767 771 764 746 730 726 736 747 746 738 737 756 784 806 812 808 800 788 767 746 739 750 764 768 760 749 738 730 729 742 759 761 746 728 719
2494 719 717 720 727 739 749 755 762 768 763 746 736 742 747 734 709 698 708 724 742 769 802 823 819 803 795 798 805 811 807 786 753 732 738 762 784 795 797 792 780 765 751 737 720 705
2488 705 702 708 714 720 732 757 791 828 859 874 868 852 838 828 816 802 795 793 788 779 770 766 755 730 689 648 620 615 627 647 670 692 712 724 725 726 736 745 736 711 689 680 672 653
2483 653 637 644 675 716 757 793 814 810 787 768 769 780 779 754 714 681 673 687 706 719 727 734 735 722 701 689 693 704 712 719 728 730 720 709 711 725 733 717 682 651 651 689 744
2478 744 776 766 734 721 741 776 804 823 841 862 875 873 858 838 818 806 802 801 800 803 815 823 814 791 774 779 794 793 764 720 682 663 661 665 673 688 710 728 725 699 672
2473 672 667 686 710 724 733 749 772 787 786 780 785 802 816 814 804 800 803 802 794 783 775 771 770 772 773 767 754 746 754 770 784 797 809 813 801 788 794 818 842 855 862 869 871 871 881 902 912
2467 912 897 873 865 874 879 864 829 787 757 751 767 781 772 745 723 718 722 727 733 739 743 745 749 753 752 749 763 801 845 877 891 895 890 877 857 840 837 849 865 865 835 792 772 790 824
2461 824 837 820 788 760 740 726 720 724 729 727 717 708 706 711 716 720 723 730 744 760 768 763 747 732 724 724 727 729 730 731 732 733 739 750 758 753 737 721 711 702 700 714 748 788 818 835 846 849
2456 849 838 820 812 821 834 836 826 811 797 781 766 759 761 767 771 776 783 790 788 776 758 740 726 715 710 712 717 713 697 685 692 716 734 735 727 726 731 732 723 712 707 706 700 687 682 701 750 812
2450 812 862 886 892 892 893 892 886 876 865 850 824 789 762 761 790 834 872 894 901 896 882 866 856 852 853 863 880 891 876 836 797 775 767 768 786 818 842 830 789 748 722
2445 722 709 710 730 759 776 776 775 779 773 750 731 734 747 745 721 690 664 646 635 632 632 634 650 692 745 781 787 776 764 759 763 782 810 828 823 805 786 769 753 743 739 732 712
2439 712 690 684 697 715 728 736 744 753 761 774 792 804 799 783 774 781 797 812 826 846 870 884 878 860 843 837 838 840 842 844 846 841 827 805 785 777 780 782 774 760 756 764 767 747 715 694
2434 694 699 724 754 782 804 815 816 816 826 843 854 844 818 793 781 782 784 782 779 774 764 752 750 762 779 788 780 757 734 727 749 789 824 835 830 827 829 825 809 784 759 742 742
2429 742 754 762 754 737 732 747 772 800 833 867 894 907 913 917 913 896 879 874 877 870 849 830 829 845 860 860 841 814 795 789 790 787 779 771 761 745 726 716 726 751 778 802 831
2423 831 867 897 901 874 831 790 764 755 763 786 808 806 778 744 730 740 758 768 767 767 773 785 796 801 796 783 768 755 739 717 696 687 694 706 712 715 728 752 775 783 785 791 802
2418 802 806 808 825 861 898 906 880 837 800 784 788 803 816 820 814 802 789 786 799 823 838 834 820 814 820 824 818 812 817 835 861 882 882 852 805 772 770 790 808 815 823 849 887 919
2413 919 928 916 894 869 841 815 807 826 864 902 919 909 876 835 804 791 793 798 805 811 808 794 778 772 773 772 770 777 795 815 828 835 837 827 804 779 765 769 786 809 834 858
2407 858 881 898 895 867 835 822 830 841 847 853 857 845 814 784 770 761 743 720 709 708 709 713 727 743 748 743 742 749 754 757 767 788 816 848 882 910 922 924 929 933 923 899 881 882
2402 882 889 884 867 851 842 837 836 839 849 867 887 894 874 834 805 804 821 827 818 815 832 857 873 878 878 878 879 883 889 888 872 844 820 807 798 785 777 787 814 840 857 874 890 895 881
2397 881 858 841 823 797 770 757 751 735 711 698 707 721 726 728 740 753 755 743 730 723 723 733 754 778 796 809 819 822 815 805 798 790 777 765 767 782 794 791 780 771 771 777 786
2391 786 798 816 846 880 898 890 870 866 880 891 884 871 871 883 889 877 855 839 834 834 835 834 834 836 841 850 864 875 876 871 871 879 883 869 845 828 831 849 870 879 869 841 815 810 825
2386 825 840 840 829 819 815 811 800 776 739 695 656 638 651 699 766 820 841 837 831 832 830 818 807 804 800 789 779 786 807 829 842 841 825 790 750 725 730 763 807 837 829
2381 829 786 740 724 740 765 783 799 820 838 844 841 836 827 812 795 786 782 772 755 750 768 798 817 822 829 844 852 840 820 818 838 857 852 823 784 752 734 735 752 772 786
2376 786 798 815 837 854 861 859 848 830 812 801 797 794 785 769 745 720 705 711 738 774 808 836 861 878 887 892 900 913 919 900 857 806 769 751 746 748 760 772 773 761 752 760
2371 760 776 788 795 804 808 794 766 744 740 752 767 779 783 775 754 725 690 662 653 667 692 713 732 760 796 823 835 843 852 854 843 827 817 814 809 800 791 785 785 792 802 806 797 777
2365 777 751 723 697 680 677 690 712 734 745 740 720 694 667 649 649 676 719 759 782 788 781 766 750 746 755 762 751 729 714 722 757 806 847 868 878 894 914 914 884 845
2360 845 821 817 823 839 862 872 850 812 794 808 833 851 865 878 882 874 866 865 857 830 793 769 765 766 763 763 779 808 828 819 788 762 756 755 730 687 658 669 709 755 804 860
2355 860 913 948 964 971 975 968 946 915 884 857 842 845 866 892 907 909 903 900 902 906 907 903 892 879 873 888 920 952 968 973 976 973 954 930 920 928 936 938 942 952 953 941 932 938 941 921
2350 921 890 877 889 905 909 909 907 892 855 809 774 755 743 727 706 687 682 692 708 718 726 739 754 752 727 698 686 694 718 757 808 854 878 882 885 897 913 921 918 900
2345 900 870 841 831 848 876 895 896 887 877 864 841 813 791 784 791 812 850 897 931 934 920 917 934 954 959 954 949 940 919 896 886 884 870 837 798 761 723 683 659 670
2340 670 711 754 783 799 815 834 852 859 856 846 839 838 840 839 832 824 823 837 866 895 908 893 859 827 812 810 808 797 786 789 808 825 821 791 750 724 727 749 764 755 736 736 763
2335 763 796 812 814 824 841 849 834 800 755 701 647 612 607 621 633 638 645 657 670 681 695 712 726 732 729 726 731 749 777 805 820 818 805 790 782 783 786 787 783 778 777 778 777 773 770
2329 770 773 787 817 860 900 918 912 893 871 854 843 840 841 841 840 845 862 884 899 900 892 882 876 875 874 864 845 829 824 825 824 824 833 851 869 882 897 914 927 931 936 946 958 965 966
2324 966 967 966 961 948 930 905 879 865 867 869 851 810 762 728 715 723 751 789 812 802 765 726 701 692 690 693 706 729 752 761 757 755 768 797 830 858 880 888 871 835 804
2319 804 803 824 843 847 843 836 819 783 737 696 669 656 664 694 732 759 770 776 791 816 849 885 917 935 938 929 905 865 818 784 773 777 778 770 750 720 686 668 683 722
2314 722 761 786 805 824 842 850 851 852 851 838 812 785 773 780 792 789 770 750 749 763 773 773 777 796 818 826 818 806 799 791 781 779 798 829 852 854 839 825 824 826 814 789 772
2308 772 777 795 807 815 838 876 908 914 897 872 844 811 783 769 766 759 741 723 712 707 702 692 678 661 648 645 652 660 667 675 691 712 731 745 748 744 739 747 769 793 814 828 836
2303 836 835 827 819 815 807 792 781 786 803 822 834 844 847 834 805 779 771 780 789 781 761 744 746 760 766 752 730 721 724 724 719 721 734 742 733 720 721 728 724 712 718 752 794 819 829 835 840 834
2297 834 817 808 821 851 883 903 907 895 876 865 869 886 903 908 892 854 802 755 731 741 778 821 851 861 855 841 823 802 785 778 779 782 787 801 827 851 855 839 825 828
2292 828 842 851 852 859 877 891 890 881 881 894 907 903 879 844 807 778 756 736 714 693 689 714 759 805 839 860 873 881 879 868 855 848 848 854 867 882 893 894 888 885 886 882 867 847
2287 847 834 828 825 825 830 831 810 771 739 733 749 771 787 796 794 778 759 755 767 782 791 798 810 831 852 864 863 849 827 808 805 818 836 841 832 823 838 874 902 902 882 869 876 891
2282 891 908 926 942 946 937 925 911 883 838 793 774 776 781 775 759 739 726 735 769 811 833 832 824 823 829 837 847 856 856 847 843 847 852 854 864 889 919 941 952 950 928 886 842 816
2276 816 810 808 805 813 835 852 853 846 848 856 854 838 817 806 803 801 793 783 780 784 788 778 752 725 716 734 766 797 815 820 818 809 794 776 761 759 777 813 850 871 875 869 860 847 833 827 832
2271 832 839 841 843 855 873 891 910 931 940 924 896 887 910 943 957 946 924 903 890 892 902 897 862 820 807 832 871 893 891 876 865 868 878 880 864 843 838 852 872 882
2266 882 880 869 857 857 869 873 848 808 791 816 860 895 913 925 932 930 928 937 955 966 960 941 922 907 898 893 888 884 886 893 898 890 866 835 808 793 790 795 801 806 811 815 821 835 863 893
2260 893 905 890 865 850 844 835 815 792 772 755 744 739 738 736 738 752 778 806 821 819 804 788 776 766 755 746 753 775 791 786 768 758 763 770 776 791 818 847 866 870 857 825
2255 825 788 768 777 801 823 837 842 838 826 812 800 788 779 783 805 829 834 819 801 794 798 807 818 830 839 838 823 799 783 785 802 816 813 789 755 727 717 726 737 737 734 744 772
2250 772 800 818 832 846 848 829 803 789 790 792 793 795 801 808 818 836 854 865 873 886 896 882 845 809 796 806 829 854 867 854 821 790 779 779 777 775 781 790 788 772 757 757
2244 757 776 798 815 823 832 844 853 852 835 810 782 755 736 731 741 756 765 765 753 727 693 664 652 658 673 695 719 744 767 792 816 829 824 809 804 818 839 850 841 820
2240 820 799 790 799 820 845 862 867 864 864 873 886 893 889 875 855 831 810 800 807 828 855 877 884 877 866 864 866 861 842 817 795 777 769 789 838 891 920 929 939 956 960 936 896
2234 896 857 829 819 832 860 878 873 856 848 847 839 824 820 836 866 893 910 916 913 905 894 886 885 896 912 914 894 860 830 812 800 791 787 790 796 800 794 776 749 732 737 763 793 814
2229 814 824 829 833 837 842 847 850 847 837 823 814 819 839 867 890 899 895 883 866 847 830 820 823 838 855 863 856 840 822 804 786 772 766 768 770 765 749 729 717 724 751 787 817 833
2224 833 836 837 839 837 818 779 741 733 757 785 794 794 805 828 841 834 826 838 864 881 879 868 862 866 868 860 836 806 781 767 765 765 763 756 749 746 744 733 713 705 726 770 810 833 844 846
2218 846 833 807 786 782 788 788 787 802 830 852 858 852 843 831 819 816 820 825 821 813 808 803 789 762 737 738 773 820 849 846 830 819 814 801 780 766 768 781 797 818 840 854 855 847 836
2212 836 833 844 873 906 926 927 916 901 882 861 842 829 821 827 853 892 921 932 932 922 892 846 808 792 781 748 705 684 692 705 709 715 736 759 772 774 772 764 749 739
2208 739 751 782 816 834 832 815 795 787 792 801 800 787 768 758 764 779 785 768 735 708 701 708 719 729 741 759 783 810 829 829 815 808 816 832 848 865 886 899 887 851 812
2203 812 788 780 776 766 754 753 770 797 819 831 844 861 872 864 844 830 828 830 830 830 830 825 810 789 772 770 781 798 816 832 848 862 871 880 896 916 923 910 886 870 870 883
2197 883 901 917 921 905 880 866 873 889 897 891 877 856 825 791 764 755 763 782 803 822 843 865 886 894 885 865 848 844 853 865 870 867 866 875 896 918 929 920 893 861 838 834 843
2192 843 855 862 862 855 844 838 841 853 862 862 856 845 832 828 840 866 893 911 918 922 924 924 929 943 963 981 987 977 950 912 874 842 811 778 747 728 720 713 701 689 686 692 701 709 716 725
2187 725 746 783 825 855 858 836 809 799 811 835 858 872 875 867 852 844 850 868 888 907 920 927 925 925 931 935 923 894 864 841 825 818 826 842 844 817 777 748 737 739 752 776
2181 776 798 798 782 772 777 782 776 767 765 771 779 784 780 763 740 732 753 793 828 845 845 835 819 801 788 786 801 833 867 890 899 909 921 924 912 897 889 881 860 833 812 801 796 801
2176 801 818 829 819 798 790 798 802 788 769 757 748 735 731 747 777 807 833 861 888 905 915 923 924 908 878 848 825 806 793 797 814 827 825 819 821 832 839 835 829 833 853 881
2171 881 902 905 894 884 886 892 892 889 892 906 920 926 923 921 922 925 922 915 913 921 935 943 940 929 915 902 895 899 911 918 912 898 882 862 843 842 867 891 884 852 831 844 877 905 927 946
2165 946 950 924 881 849 839 836 825 811 809 820 839 865 897 930 959 980 992 990 974 953 942 953 981 1005 1007 988 969 964 969 970 967 960 943 908 867 846 853 874 889 892 892
2160 892 889 882 866 845 828 828 841 850 844 836 847 876 894 889 877 871 862 833 799 786 803 828 841 838 827 814 811 823 842 851 852 856 864 869 870 880 906 929 931 912 886 866 857 862 873
2155 873 876 862 838 817 808 808 810 807 792 769 752 756 775 789 785 763 740 729 740 770 806 835 853 865 878 891 899 894 875 852 837 833 832 828 822 825 842 873 908 932 932 908
2150 908 882 869 869 866 851 829 803 776 755 750 760 771 770 765 776 807 846 874 887 886 874 855 844 855 887 919 928 913 893 885 898 928 963 986 985 963 932 901 871
2145 871 847 833 827 826 829 845 873 896 900 882 859 846 850 872 901 921 921 904 882 867 866 878 891 895 884 865 848 834 820 815 825 844 855 847 826 809 806 821 845 864
2140 864 865 854 843 837 835 835 842 855 870 884 904 928 940 934 919 910 910 914 914 910 905 901 906 918 934 953 978 1007 1028 1024 993 947 897 851 813 783 772 783 813 838 837 814 796
2135 796 799 814 831 854 892 937 965 961 932 899 882 890 910 915 893 859 842 844 848 845 843 849 849 835 819 822 846 881 920 960 990 993 965 921 879 846 821 806 801 802 806 820
2130 820 845 872 882 864 831 805 799 803 797 779 761 757 770 795 825 853 863 843 807 790 806 835 847 838 824 820 823 831 848 877 904 917 924 938 957 966 957 939 920 899
2125 899 881 880 896 911 906 886 873 876 884 886 882 875 863 841 815 793 778 771 778 803 837 863 871 865 857 851 839 811 768 732 729 765 821 875 911 927 926 921 925 945 964 962 935 897
2119 897 866 851 853 873 909 951 982 989 970 940 914 899 885 869 859 860 865 860 844 830 823 820 815 811 809 806 801 803 816 830 836 840 855 886 920 947 966 982 993 998 1005 1016 1022 1015
2114 1015 990 956 919 883 855 844 852 866 870 859 842 828 820 819 820 817 812 815 839 879 918 938 937 927 913 898 887 889 903 916 913 895 874 861 858 868 889 919 951 976
2109 976 982 962 926 893 879 880 878 862 838 819 814 826 851 873 873 848 818 811 830 853 863 865 867 869 860 840 816 790 767 758 773 805 829 835 839 855 871 865 832 800 790 797
2104 797 807 813 821 834 847 852 843 825 815 831 867 897 899 879 857 842 831 832 856 894 918 906 868 828 805 810 847 901 944 956 941 917 897 883 878 883 891 893 892 898 906 906
2099 906 901 906 928 956 977 998 1024 1047 1049 1025 985 948 926 919 916 899 864 833 829 855 892 922 934 930 918 909 912 925 940 950 949 937 919 909 913 926 939 958 991 1023
2094 1023 1027 997 964 952 948 930 902 887 889 888 872 850 833 823 817 819 825 824 807 787 782 795 817 837 856 876 895 906 906 892 873 865 876 904 937 965 978 964 927 885
2089 885 859 859 877 898 914 912 897 885 897 934 972 990 985 962 929 894 873 875 893 915 930 930 914 894 885 887 882 856 827 819 834 845 835 819 817 835 859 877 894 917
2084 917 943 962 969 967 962 956 945 928 912 906 914 931 953 975 994 1008 1020 1032 1038 1031 1009 982 962 952 949 948 944 937 933 941 958 973 972 954 926 896 868 852 851 864 880 887 889 897
2079 897 919 948 961 952 937 932 933 927 913 904 898 882 860 860 893 929 935 916 904 908 913 911 920 948 979 988 976 959 945 930 905 874 847 839 857 895 936 969 991 995 977 954
2074 954 951 973 991 983 964 967 997 1025 1031 1021 1017 1025 1036 1035 1013 973 923 873 831 802 793 799 810 818 830 855 884 894 877 851 841 854 879 907 933 951 953 937 915 900
2069 900 893 887 882 887 902 914 910 897 900 929 963 974 956 925 894 869 855 860 882 909 929 938 931 909 885 878 897 931 965 993 1010 1006 983 959 954 969 985 985 977 973 976 975 964
2063 964 952 953 972 999 1024 1042 1052 1049 1033 1013 997 983 969 963 975 990 991 981 983 1007 1035 1046 1043 1031 1003 958 912 885 874 868 873 902 944 974 984 984 977 957 938 952
2059 952 1006 1059 1070 1045 1019 1006 999 995 1001 1013 1014 1004 997 999 997 981 957 936 919 905 904 922 946 962 970 987 1021 1054 1070 1069 1059 1046 1028 1004 976 947 917 893 882 882
2054 882 880 866 845 831 834 852 875 897 909 910 903 897 892 878 854 836 845 885 928 947 937 922 923 934 937 920 894 879 885 902 911 902 885 875 881 892 899 907 929 964 991 990 964
2048 964 934 917 916 924 937 953 968 978 985 994 1003 1004 996 982 970 956 938 917 899 889 886 888 897 912 932 958 987 1012 1026 1026 1019 1007 983 944 910 901 920 945 950 933 907 887
2043 887 878 879 889 902 913 915 915 920 943 988 1044 1089 1108 1104 1087 1064 1035 1008 996 1003 1014 1015 1005 997 1003 1019 1033 1035 1025 1014 1016 1037 1066 1085 1083 1064 1039 1020 1012 1011 1012 1011 1009 1016
2038 1016 1033 1048 1045 1025 1010 1016 1038 1057 1058 1040 1008 974 952 954 975 998 1004 991 970 955 956 970 988 1000 1011 1027 1043 1044 1027 1007 997 988 965 932 914 922 949 979 1006
2033 1006 1029 1046 1053 1050 1040 1032 1034 1052 1077 1101 1118 1123 1110 1079 1050 1038 1040 1038 1027 1022 1025 1027 1017 1000 985 976 977 992 1021 1046 1052 1042 1024 1005 990 992 1015 1048 1069 1069 1058 1044
2028 1044 1025 1002 977 952 925 900 889 898 921 945 964 977 989 1003 1017 1030 1041 1055 1073 1091 1102 1101 1088 1072 1065 1071 1080 1075 1060 1051 1061 1081 1095 1105 1118 1137 1154 1166
2023 1166 1169 1160 1141 1127 1124 1116 1091 1060 1042 1036 1020 996 987 1003 1024 1030 1035 1053 1078 1091 1086 1070 1049 1029 1018 1017 1013 998 985 991 1014 1034 1046 1056 1062 1056 1038 1027 1031 1041 1044 1041 1041
2018 1041 1046 1055 1063 1071 1082 1103 1133 1160 1171 1171 1173 1185 1198 1209 1216 1216 1199 1168 1137 1121 1120 1125 1137 1157 1183 1205 1219 1226 1227 1221 1205 1183 1161 1141 1128 1122 1123 1121 1111 1094 1084 1093 1118
2013 1118 1143 1152 1147 1140 1136 1132 1131 1154 1208 1275 1323 1335 1326 1313 1298 1271 1230 1186 1156 1147 1154 1161 1160 1155 1159 1174 1195 1215 1232 1248 1258 1261 1261 1263 1265 1265 1267 1275 1283 1282 1268 1249 1238 1234 1230 1219
2007 1219 1201 1181 1162 1146 1134 1136 1159 1195 1227 1245 1259 1281 1305 1311 1300 1297 1318 1346 1355 1344 1332 1328 1326 1318 1311 1311 1321 1337 1354 1358 1332 1284 1240 1221 1218 1215 1212 1217 1233 1248 1250 1241
2002 1241 1224 1210 1210 1232 1264 1288 1301 1310 1315 1308 1297 1298 1316 1329 1318 1292 1277 1275 1275 1270 1271 1282 1297 1307 1318 1346 1388 1424 1440 1440 1437 1436 1430 1418 1410 1411 1422 1437 1460 1490 1518 1533
1997 1533 1537 1539 1547 1554 1556 1557 1566 1579 1589 1590 1583 1569 1557 1560 1582 1608 1613 1597 1582 1591 1621 1656 1685 1709 1737 1766 1785 1785 1763 1733 1715 1724 1751 1772 1771 1759 1759 1781 1807 1826 1843 1872
1992 1872 1904 1925 1936 1945 1948 1926 1883 1849 1845 1856 1853 1830 1805 1797 1809 1837 1879 1924 1954 1970 1990 2032 2094 2155 2189 2188 2160 2131 2122 2136 2158 2178 2199 2223 2250 2277 2309 2344
1987 2344 2376 2404 2438 2474 2495 2489 2474 2474 2485 2487 2476 2479 2515 2570 2622 2668 2718 2766 2793 2798 2803 2827 2862 2891 2911 2933 2961 2987 3004 3021 3050 3095 3148 3197 3234 3264 3305
1983 3305 3365 3435 3495 3534 3563 3598 3645 3696 3735 3757 3765 3771 3789 3822 3863 3904 3947 4001 4076 4173 4280 4383 4467 4530 4584 4638 4699 4764 4832 4903 4984 5081 5191 5301
1978 5301 5396 5482 5575 5686 5813 5950 6095 6245 6397 6550 6709 6879 7063 7265 7495 7749 8016 8285 8563 8857 9165 9484 9823 10199
1976 10199 10620 11083 11582 12111 12663 13237 13841 14484 15169 15897 16679 17520 18409 19333 20298 21316 22394 23530 24747 26080 27552
1973 27552 29164 30911 32791 34806 36956 39246 41669 44195 46796 49484 52304 55285 58433 61775 65376 69313 73650
1971 73650 78449 83786 89730 96338 103683 111863 120979 131118 142400 155006 169138 184976 202697 222515 244668
1969 244668 269393 296962 327699 361916 399760 441028 484799 528850 569222 600596 617700 617129 598552 564731
1967 564731 520474 471137 421318 374163 331329 293365 260173 231362 206475 185107 166898 151478 138430 127322
1966 127322 117760 109421 102063 95512 89642 84352 79559 75195 71198 67515 64108 60966 58080 55407 52891 50490 48198
1964 48198 46023 43963 42017 40189 38478 36864 35317 33812 32335 30878 29439 28028 26664 25371 24162 23041 22003
1961 22003 21047 20174 19379 18642 17939 17262 16610 15980 15376 14809 14287 13798 13323 12870 12462 12112 11801 11503 11213 10933 10656 10373 10090
1959 10090 9822 9570 9328 9094 8876 8672 8475 8287 8126 8002 7899 7780 7623 7435 7242 7063 6902 6757 6629 6521 6422 6317 6197
1956 6197 6077 5972 5884 5796 5696 5587 5475 5365 5258 5158 5066 4983 4907 4832 4748 4648 4536 4428 4337 4266 4209 4155 4092 4019 3947 3883 3827 3770 3717
1952 3717 3675 3642 3604 3559 3521 3497 3472 3429 3376 3338 3325 3321 3308 3284 3250 3206 3157 3114 3081 3049 3012 2979 2965 2960 2945 2913 2880 2858 2843 2826 2805 2778 2737 2685 2635
1948 2635 2603 2583 2557 2520 2481 2454 2444 2446 2447 2430 2388 2336 2298 2282 2271 2246 2210 2173 2135 2091 2047 2020 2022 2041 2053 2045 2026 2008 1990 1963 1927 1896 1884 1887 1891 1881 1854
1943 1854 1816 1783 1770 1780 1800 1812 1811 1807 1806 1799 1782 1760 1746 1742 1737 1727 1714 1698 1672 1632 1584 1545 1525 1519 1518 1516 1510 1495 1471 1449 1445 1463 1483 1491 1497 1520 1558 1579 1563 1527 1502
1938 1502 1500 1509 1518 1530 1540 1539 1520 1496 1485 1489 1496 1503 1519 1549 1576 1581 1559 1529 1509 1502 1499 1499 1498 1488 1464 1433 1412 1405 1403 1396 1385 1377 1373 1372 1377 1389 1400 1397 1382 1366 1359 1357 1352 1336 1313 1291
1933 1291 1277 1269 1261 1255 1257 1257 1246 1224 1212 1220 1228 1218 1198 1189 1193 1185 1159 1136 1132 1138 1129 1099 1066 1049 1056 1087 1131 1173 1202 1219 1223 1211 1184 1157 1149 1159 1167 1157 1131 1107 1101 1119 1147
1928 1147 1167 1163 1139 1112 1098 1100 1112 1123 1132 1144 1162 1177 1170 1137 1091 1050 1017 987 969 978 1015 1059 1087 1092 1081 1067 1056 1055 1063 1077 1092 1105 1110 1102 1088 1078 1073 1070 1064 1060 1064 1073
1922 1073 1080 1084 1087 1088 1085 1073 1051 1022 996 983 982 978 960 928 895 876 881 905 930 938 930 925 936 964 999 1039 1080 1113 1126 1116 1096 1079 1067 1057 1044 1027 1006 985 969 960
1918 960 961 973 991 1008 1020 1025 1025 1018 1004 986 972 966 965 967 974 987 999 1006 1003 989 960 920 881 852 831 815 815 839 881 923 952 964 962 940 898 853 825 822 839 865 895
1913 895 920 933 934 932 936 942 946 949 960 979 999 1008 1001 977 938 888 837 795 770 763 769 781 790 799 820 857 901 933 946 939 918 887 853 822 802 789 781 776 776 785 798 813 823
1907 823 830 833 831 823 816 829 862 897 913 915 920 931 938 937 934 939 945 949 950 950 945 939 937 936 922 895 873 874 892 912 931 950 958 940 902 873 868 879 888 893 894 893 890 890 897 905 904 890 862 828
1901 828 804 810 845 885 900 880 841 808 799 817 853 886 900 894 876 860 857 874 901 914 897 864 844 860 902 944 959 944 921 920 942 967 977 976 979 981 971 945 915
1896 915 894 885 882 876 856 826 807 819 854 883 883 858 827 806 801 816 846 871 877 863 842 827 826 837 849 846 824 795 774 763 761 771 793 812 815 812 827 861 892 904
1892 904 904 902 891 866 838 832 851 873 881 876 873 879 890 898 902 902 893 875 850 831 822 818 818 830 865 913 946 946 923 901 892 890 890 897 913 932 942 936 917 892 870 859 854 850 848 857 884
1886 884 918 943 953 952 951 952 954 956 960 974 1004 1043 1074 1084 1075 1059 1039 1013 982 956 946 950 957 962 969 984 1011 1044 1070 1074 1049 1006 971 959 963 961 942 913 894 892 900 910 918
1881 918 923 922 912 894 871 853 847 855 867 873 874 879 894 907 908 899 889 884 885 891 901 909 910 904 899 892 882 875 883 905 922 914 882 849 834 840 857 871 871 859 849 855 881 922 960 975
1875 975 957 919 892 894 913 927 932 938 942 925 885 849 850 885 919 928 913 892 875 868 876 904 945 982 1002 1005 1001 993 976 941 895 855 837 843 851 839 806 775 771 796 828 845
1870 845 848 850 861 877 888 888 881 874 874 887 907 922 921 899 861 824 798 787 788 794 805 818 827 830 833 846 867 882 882 873 871 877 876 852 813 784 781 794 811 827 847 871 890 905
1864 905 928 961 991 1000 984 955 921 893 878 876 875 860 840 835 852 867 861 842 834 846 862 867 862 858 855 849 842 848 866 883 891 894 905 924 933 923 901 883 876 881 890 897 895 884 869
1859 869 858 854 855 860 873 892 920 950 969 958 915 861 823 805 792 784 795 835 883 913 919 911 897 874 843 815 801 801 808 817 823 823 817 809 809 816 822 819 803 789 790 805 821 831
1853 831 839 848 855 860 869 881 885 869 841 818 811 819 840 873 904 913 902 888 886 890 890 889 899 918 935 939 928 909 889 883 898 929 956 967 961 943 914 878 844 828 837 861 884
1848 884 893 890 887 884 869 834 794 775 785 802 798 772 751 754 774 784 773 752 742 748 766 794 828 865 898 911 899 877 867 879 892 882 857 849 877 921 952 964 970
1843 970 970 954 922 889 867 859 867 891 918 926 913 894 876 853 826 817 840 881 913 931 942 940 917 885 868 871 872 853 829 816 814 809 802 803 818 839 856 866 873 878 880 877 871
1838 871 869 875 887 894 889 870 849 837 833 832 831 835 851 877 903 917 917 906 886 861 833 806 784 773 779 799 817 823 822 822 827 832 832 829 829 838 855 873 882 876 860 844 832 826 830 842
1833 842 855 860 861 864 868 869 872 886 907 919 914 904 901 907 913 913 904 890 885 895 910 908 885 866 872 894 908 906 898 890 878 862 853 862 879 890 889 881 875 874 874 875 878 883 885 884 888 907 932 935 899
1826 899 843 802 792 806 829 855 880 898 905 904 902 898 890 878 865 856 857 867 882 898 914 931 942 943 940 942 952 958 947 923 897 876 857 843 840 851 859 852 834 831 861 910
1821 910 948 952 928 889 846 805 776 772 787 802 807 811 828 854 873 883 893 905 909 904 904 924 955 967 947 914 893 887 883 872 858 849 854 868 874 855 816 788 791 813 822 806
1816 806 788 785 796 809 821 835 844 841 834 833 837 837 834 838 858 892 933 963 964 931 882 841 813 791 775 776 792 809 820 830 837 831 811 797 808 841 882 920 943 942 923 907
1811 907 914 936 952 960 970 980 974 954 940 947 958 947 913 876 855 845 844 857 890 931 956 955 942 935 940 947 952 959 972 988 1002 1010 1012 1003 989 977 971 963 950 938 944 974 1014
1806 1014 1043 1046 1034 1031 1051 1083 1100 1091 1065 1042 1030 1029 1040 1060 1082 1108 1140 1173 1191 1193 1192 1197 1196 1168 1117 1069 1045 1040 1040 1035 1027 1019 1017 1024 1037 1049 1058 1069 1082 1091 1088 1070 1045
1800 1045 1020 1002 990 980 969 962 963 966 962 957 971 1010 1056 1090 1113 1131 1142 1143 1137 1132 1125 1109 1081 1048 1023 1016 1033 1065 1098 1125 1148 1173 1189 1190 1187 1203 1239 1271 1275 1255 1232
1795 1232 1219 1207 1189 1167 1152 1148 1147 1134 1107 1074 1048 1039 1045 1060 1076 1087 1094 1095 1089 1079 1080 1105 1139 1152 1133 1101 1079 1064 1042 1020 1020 1050 1089 1111 1110 1099 1091 1089 1086 1075 1058
1790 1058 1047 1051 1058 1054 1039 1034 1047 1062 1053 1024 997 989 992 994 991 989 985 971 948 931 931 940 942 935 934 939 929 890 839 815 826 851 865 866 866 868 874 888 914 946 971 985 988 983 981 994
1785 994 1020 1039 1040 1032 1033 1034 1012 966 921 901 904 914 925 936 951 968 983 996 1001 993 968 933 903 895 912 941 967 986 1000 1006 1004 1003 1015 1032 1029 998 962 945 946 946 935 919
1780 919 914 925 946 968 985 1003 1028 1058 1078 1079 1073 1071 1071 1057 1024 989 970 973 995 1024 1044 1042 1018 985 962 963 987 1019 1036 1032 1019 1013 1015 1014 1009 1013 1032 1060 1084 1103 1118 1129
1775 1129 1132 1124 1105 1084 1071 1078 1097 1107 1094 1062 1030 1010 1001 998 999 1000 992 972 947 928 917 909 902 898 897 896 895 904 929 966 997 1008 1006 1010 1033 1066 1085 1076 1052 1037 1042 1055 1063 1066 1074
1769 1074 1082 1076 1049 1018 997 986 975 964 959 965 980 1003 1031 1051 1051 1033 1019 1023 1041 1057 1060 1046 1018 980 941 910 897 903 921 932 931 939 978 1037 1081 1086 1067 1044 1014 972
1764 972 934 927 952 987 1014 1031 1035 1020 993 978 984 997 1006 1012 1024 1032 1025 1011 1009 1026 1052 1069 1073 1075 1084 1099 1106 1098 1077 1057 1043 1036 1035 1045 1060 1070 1073 1081 1103 1130 1142 1136 1124 1118
1759 1118 1116 1112 1103 1091 1080 1079 1091 1108 1125 1138 1150 1161 1170 1177 1185 1195 1211 1233 1255 1266 1269 1278 1304 1339 1360 1363 1359 1358 1353 1337 1314 1301 1313 1346 1380 1393 1380 1357 1346 1351 1358 1357
1754 1357 1350 1340 1327 1317 1315 1317 1307 1282 1265 1278 1317 1361 1401 1442 1489 1531 1554 1552 1527 1492 1460 1441 1426 1403 1377 1369 1388 1415 1428 1424 1421 1426 1435 1436 1429 1420 1412 1402 1390 1379 1376
1749 1376 1387 1413 1446 1478 1505 1529 1548 1560 1561 1553 1543 1544 1566 1607 1654 1693 1717 1735 1761 1804 1857 1909 1954 1998 2050 2120 2206 2300 2389 2464 2522 2564 2595 2614 2619 2608
1744 2608 2588 2571 2569 2578 2584 2577 2566 2576 2622 2695 2767 2818 2848 2874 2915 2981 3070 3168 3264 3353 3444 3545 3658 3774 3892 4021 4169 4332 4492 4642 4790
1740 4790 4959 5161 5399 5666 5964 6296 6659 7043 7452 7903 8417 8994 9621 10285 10997 11776 12624 13522 14449 15392 16340 17268 18131
1738 18131 18866 19402 19675 19660 19372 18859 18183 17398 16554 15692 14846 14045 13317 12676 12131 11678 11311 11015 10768 10560 10396 10285 10227
1735 10227 10211 10234 10292 10385 10512 10683 10904 11166 11454 11769 12126 12531 12980 13478 14047 14703 15438 16240 17121 18105 19205 20421 21769
1732 21769 23272 24941 26767 28749 30912 33279 35842 38562 41391 44269 47097 49720 51941 53561 54420 54415 53538 51878
1730 51878 49604 46918 44011 41040 38134 35384 32845 30537 28455 26590 24936 23488 22236 21164 20251 19477 18816 18244
1728 18244 17744 17318 16973 16711 16522 16396 16334 16337 16401 16524 16710 16962 17274 17643 18084 18614 19235 19939 20741 21674 22753 23961 25281
1725 25281 26729 28338 30127 32097 34253 36603 39139 41821 44591 47360 49994 52299 54057 55077 55234 54489 52902 50622
1723 50622 47857 44821 41700 38632 35702 32955 30425 28137 26095 24275 22643 21177 19869 18707 17669 16743 15934 15239
1720 15239 14638 14098 13603 13159 12774 12442 12151 11896 11685 11519 11388 11281 11197 11146 11135 11161 11219 11311 11439 11605 11818 12093 12438 12850 13322
1717 13322 13851 14441 15092 15799 16547 17321 18092 18819 19447 19914 20169 20176 19925 19427 18718 17855 16904 15920 14931 13951 12994 12084 11252
1714 11252 10512 9858 9270 8731 8233 7773 7354 6981 6656 6370 6106 5853 5609 5381 5175 4996 4842 4705 4573 4437 4304 4180 4060
1712 4060 3942 3830 3730 3631 3515 3386 3271 3185 3120 3061 2999 2932 2860 2793 2743 2704 2655 2586 2511 2447 2390 2332 2285 2264 2259 2246 2220 2201 2200 2200 2181 2142 2095
1708 2095 2046 1998 1960 1939 1935 1934 1923 1902 1880 1864 1851 1831 1803 1780 1775 1783 1786 1768 1732 1692 1662 1650 1653 1658 1647 1616 1574 1539 1523 1524 1530 1526 1509 1485 1467 1456 1455 1463 1475 1480 1477
1703 1477 1477 1495 1522 1536 1528 1506 1484 1465 1450 1443 1445 1450 1452 1457 1464 1472 1479 1485 1488 1484 1480 1485 1493 1485 1455 1422 1402 1387 1357 1316 1289 1292 1313 1333 1343 1344 1340 1335 1336 1344 1358 1373 1384 1390 1392 1396 1403 1414
1697 1414 1428 1447 1469 1486 1492 1490 1488 1495 1520 1566 1627 1682 1712 1714 1693 1658 1617 1581 1556 1537 1514 1484 1451 1420 1397 1387 1387 1383 1363 1342 1341 1356 1361 1345 1326 1318 1312 1290 1256 1233
1692 1233 1231 1239 1242 1240 1244 1262 1288 1318 1343 1356 1352 1336 1324 1332 1358 1392 1428 1464 1495 1512 1511 1509 1529 1577 1644 1724 1810 1890 1945 1971 1983 1998 2013 2012 1982 1927 1862 1800 1744
1687 1744 1697 1660 1636 1618 1587 1535 1470 1410 1367 1338 1320 1314 1312 1304 1289 1277 1273 1267 1244 1208 1174 1160 1175 1216 1266 1302 1313 1305 1293 1284 1276 1270 1270 1276 1280 1275 1269 1278 1316 1376 1438 1484
1682 1484 1522 1571 1645 1730 1804 1857 1899 1940 1982 2014 2017 1980 1907 1814 1724 1648 1591 1553 1527 1502 1468 1424 1379 1339 1310 1299 1307 1322 1326 1310 1285 1262 1250 1248 1252 1259 1260 1251
1677 1251 1231 1206 1190 1193 1212 1225 1217 1193 1172 1161 1154 1147 1142 1143 1139 1125 1113 1121 1151 1181 1190 1178 1164 1164 1184 1216 1252 1288 1314 1318 1293 1255 1220 1196 1172 1146 1128 1126 1138 1150
1672 1150 1157 1161 1161 1155 1143 1129 1116 1105 1099 1096 1092 1080 1067 1065 1068 1065 1050 1039 1047 1063 1069 1058 1041 1026 1016 1013 1021 1033 1028 998 955 917 893 878 872 878 890 897 900 912 942 980 1006 1015
1667 1015 1020 1037 1064 1083 1090 1094 1110 1130 1137 1121 1098 1085 1081 1076 1067 1057 1042 1017 988 975 984 1001 1009 1005 994 976 957 950 967 1003 1037 1056 1064 1069 1077 1088 1101 1119 1143 1172 1201
1662 1201 1215 1204 1169 1122 1075 1033 996 963 934 913 912 931 953 961 950 932 918 915 926 949 970 979 979 984 993 994 977 955 943 947 965 998 1048 1104 1151 1177 1181 1166 1140
1657 1140 1117 1107 1114 1132 1152 1163 1161 1147 1128 1109 1091 1082 1096 1137 1189 1223 1229 1219 1211 1213 1216 1212 1197 1176 1163 1170 1192 1211 1204 1161 1095 1036 1011 1026 1064 1101 1127 1148 1164
1652 1164 1174 1175 1171 1164 1155 1140 1118 1091 1065 1047 1041 1049 1058 1055 1034 1007 996 1009 1035 1054 1056 1052 1053 1057 1055 1056 1075 1122 1179 1219 1230 1224 1226 1245 1270 1280 1269 1249 1234 1226 1224 1230 1242 1252
1647 1252 1250 1232 1201 1159 1113 1082 1076 1087 1095 1093 1088 1084 1071 1042 1008 985 974 968 959 949 938 926 914 909 912 926 952 987 1016 1021 1003 979 971 980 999 1026 1061 1093 1103 1085 1059
1642 1059 1046 1044 1034 1005 965 918 867 822 804 823 859 887 901 907 906 896 887 894 912 922 921 922 923 911 884 862 853 843 824 812 824 845 846 828 819 833 855 868 874 885
1637 885 901 916 923 923 924 936 957 979 990 992 993 993 986 971 950 928 907 888 874 866 859 859 871 896 928 957 972 965 937 909 902 918 942 961 975 987 998 1011 1023 1028 1017
1632 1017 994 969 949 930 916 918 937 956 957 946 941 948 958 964 965 959 946 934 934 948 962 965 960 962 979 1009 1040 1058 1055 1034 1010 996 990 978 951 918 903 912 924 918 901 893
1627 893 900 907 907 918 945 970 971 953 933 916 900 889 892 900 898 878 854 832 814 805 816 843 867 882 900 930 954 954 936 923 924 926 913 888 860 839 827 825 830 838 851 874
1622 874 900 917 917 905 893 891 895 896 888 873 857 851 864 897 941 972 975 958 945 948 955 949 932 909 883 851 822 807 803 802 804 821 861 910 943 948 939 936 941 936 902 850 813 814
1617 814 838 857 862 872 893 911 919 932 963 999 1011 992 962 939 925 908 889 876 874 881 895 916 941 957 950 920 884 863 863 869 862 839 818 817 838 870 897 916 935
1612 935 957 974 975 966 964 972 973 958 938 926 919 911 907 917 936 950 953 955 959 957 941 921 906 901 905 918 936 946 942 937 943 955 956 942 924 912 913 931 965 1001 1024 1030 1024 1005 966
1606 966 922 897 904 919 914 885 847 809 768 731 717 734 768 797 815 831 852 876 902 933 966 993 1001 989 973 965 972 985 990 982 963 943 927 918 917 925 941 963 983 995
1601 995 1000 994 975 947 918 898 892 895 904 915 927 937 942 941 932 916 897 881 873 876 889 910 933 951 955 944 922 900 882 866 849 835 836 858 894 929 950 949 931 910 900
1596 900 900 901 896 890 889 887 875 858 847 842 834 824 822 829 833 826 821 827 837 837 832 840 870 911 942 954 949 936 924 913 901 888 885 898 918 933 936 931 921 909 897 887 875 859 837
1591 837 818 804 793 786 789 807 834 857 862 844 811 773 743 726 721 729 747 768 788 808 834 871 917 964 1005 1024 1013 980 952 939 929 905 869 842 836 842 844 842 843 851
1586 851 868 902 951 995 1007 982 950 937 942 938 917 893 881 874 864 855 861 879 897 913 932 946 939 912 883 867 858 845 840 855 883 902 900 889 880 885 906 935 951 941
1581 941 913 893 891 894 885 872 864 864 861 853 843 832 820 814 831 870 913 938 942 942 946 952 951 944 939 941 944 939 923 903 883 866 849 834 827 836 863 891 905 904 901 897 886 872 874 902 934
1575 934 939 913 886 884 900 909 898 878 864 859 856 853 854 863 876 880 871 860 862 879 900 914 921 927 931 927 912 888 867 856 855 854 854 867 900 939 960 957 950 952 954 939 911 886 870 854
1570 854 834 821 831 859 888 905 912 917 921 923 926 941 971 1006 1025 1019 999 982 977 979 978 965 934 892 853 832 824 816 804 800 815 843 866 875 882 901 928 945 942 932 931 943 956
1564 956 961 958 952 947 942 931 910 890 892 922 958 968 949 931 933 943 938 920 906 900 898 904 930 966 988 984 965 953 952 960 972 983 986 983 977 964 942 923 930 967 1003 1009 988 962
1559 962 945 934 925 919 918 919 924 929 922 892 854 830 830 840 846 847 847 850 856 864 873 881 891 906 917 914 895 875 867 869 872 875 877 873 860 850 857 883 914 936 947 949 939 917 883 846 812
1553 812 790 785 795 812 824 831 846 881 931 978 1010 1029 1034 1020 984 942 916 905 893 872 858 865 886 903 914 923 932 934 931 930 938 953 969 978 972 946 910 879 857 842 834
1548 834 837 847 852 846 834 822 815 820 846 886 918 927 919 912 918 937 966 1002 1035 1051 1049 1035 1017 995 965 926 882 846 837 855 887 909 911 901 888 882 885 894 898 889 877 877 889 900
1543 900 897 890 893 909 928 935 925 903 879 866 866 864 849 822 796 779 769 759 750 744 748 763 782 790 786 784 800 833 866 890 913 939 958 958 946 933 916 881 837 815 835
1538 835 887 940 973 983 975 956 937 929 931 937 940 941 942 947 963 987 1002 989 957 934 926 910 868 819 803 832 883 924 942 941 929 920 931 960 987 992 976 955 938 923 914
1533 914 917 933 955 971 984 996 1003 995 973 948 930 916 897 875 866 879 904 921 922 920 923 930 935 937 938 930 905 872 861 887 933 962 954 926 910 914 916 899 874 866 880 903 926
1528 926 950 973 980 963 939 931 943 962 977 982 970 940 903 875 863 857 854 864 894 939 980 1002 995 969 944 936 947 963 972 972 962 940 916 907 917 934 945 956 973 983
1523 983 967 932 904 902 913 917 909 899 896 895 889 881 881 898 921 935 931 915 894 871 846 823 809 813 830 851 861 856 838 820 809 807 816 835 857 876 888 898 910 918 915 908 904
1517 904 900 891 881 881 893 898 883 862 857 876 905 924 928 926 929 942 956 962 958 955 961 972 972 955 930 910 901 897 888 877 878 901 943 986 1016 1030 1031 1021 1000 971 949 945 956 967
1512 967 967 966 978 1002 1019 1015 996 978 972 976 981 974 949 917 894 887 886 879 873 878 891 899 898 899 909 921 927 927 922 909 888 871 867 865 852 826 801 789 782 769 755 763 800 844 866 861
1506 861 854 861 868 858 841 842 868 900 922 931 923 893 855 836 845 861 859 843 834 840 853 864 865 856 842 840 852 857 836 799 774 775 796 829 867 897 898 871 844 840 859 878 886 886
1501 886 882 876 872 877 888 897 892 869 838 816 815 836 864 886 893 889 882 884 892 893 882 870 874 893 910 915 917 927 947 972 1001 1029 1048 1057 1066 1082 1100 1113 1117 1116 1107 1088 1066 1049 1042 1046
1495 1046 1059 1067 1056 1030 1006 995 994 996 998 994 972 934 902 902 932 964 975 962 938 913 893 879 874 886 915 951 977 987 987 986 977 958 944 955 986 1007 1003 986 979 999
1491 999 1039 1081 1100 1084 1039 983 925 873 839 836 860 892 918 942 972 1007 1040 1069 1091 1101 1100 1098 1100 1093 1065 1028 1005 1000 999 989 980 983 993 997 988 973 960 948 928 903
1486 903 882 870 861 848 833 827 839 868 904 936 955 963 970 982 990 976 944 914 906 922 946 962 962 951 943 950 961 965 962 969 987 1004 1006 999 992 983 973 972 985 1003 1004 988 974 973
1480 973 983 991 989 978 969 978 1005 1030 1040 1045 1058 1072 1072 1066 1075 1095 1096 1065 1034 1037 1074 1118 1148 1163 1168 1165 1159 1160 1172 1192 1206 1205 1185 1157 1143 1152 1175 1195 1203 1195 1172 1141 1113 1098
1475 1098 1093 1096 1110 1139 1171 1190 1189 1180 1174 1176 1188 1210 1232 1244 1239 1225 1207 1185 1162 1146 1143 1149 1158 1165 1167 1164 1163 1171 1181 1178 1153 1119 1092 1073 1059 1051 1060 1087 1111 1112 1087 1052 1030 1036
1470 1036 1066 1098 1105 1081 1042 1007 986 977 980 994 1012 1023 1023 1022 1028 1036 1041 1055 1094 1149 1191 1201 1194 1200 1228 1256 1262 1247 1225 1209 1204 1209 1222 1242 1263 1280 1293 1313 1347 1384 1396
1465 1396 1370 1319 1270 1232 1195 1159 1138 1137 1144 1140 1122 1102 1089 1088 1098 1113 1121 1124 1136 1165 1192 1195 1175 1155 1147 1145 1146 1158 1180 1190 1173 1148 1144 1166 1189 1193 1182 1175 1181 1199 1227
1460 1227 1260 1292 1319 1345 1383 1439 1512 1597 1695 1804 1918 2021 2105 2174 2234 2278 2285 2242 2156 2039 1908 1780 1677 1612 1575 1539 1486 1420 1352 1294 1253
1456 1253 1227 1211 1197 1183 1177 1183 1200 1223 1243 1247 1235 1220 1226 1253 1283 1297 1298 1303 1316 1328 1331 1328 1326 1332 1353 1388 1423 1445 1451 1460 1491 1545 1610 1677 1738 1796 1859 1941 2040 2140
1451 2140 2221 2277 2306 2297 2236 2131 2009 1896 1793 1691 1591 1506 1442 1395 1355 1315 1278 1248 1228 1220 1220 1218 1210 1194 1178 1167 1163 1164 1166 1167 1169 1171 1174 1174 1176 1188 1214 1241
1446 1241 1254 1246 1226 1206 1190 1176 1166 1164 1173 1194 1222 1251 1277 1303 1342 1394 1443 1471 1482 1502 1546 1599 1634 1639 1620 1584 1531 1457 1371 1290 1226 1188 1174 1177 1182 1177 1164 1152
1442 1152 1143 1128 1101 1069 1048 1050 1075 1112 1146 1167 1176 1179 1181 1178 1163 1140 1118 1102 1093 1085 1079 1070 1056 1036 1009 975 939 915 914 928 936 936 950 989 1036 1062 1063 1053 1042 1031 1023 1031
1436 1031 1057 1085 1097 1086 1061 1037 1027 1030 1028 1009 979 962 962 962 949 934 936 956 976 979 964 939 918 913 925 943 959 969 974 971 958 939 922 910 904 904 908 904 888 872 870
1431 870 887 914 937 950 953 955 964 980 986 971 947 940 953 964 951 920 893 884 889 895 895 894 901 922 952 978 997 1010 1020 1022 1020 1023 1033 1040 1033 1012 984 953 924 907 914 940 964
1426 964 970 959 938 909 871 836 821 837 877 917 939 942 941 949 971 995 1003 986 964 961 981 997 985 959 952 974 999 1008 1006 1005 1006 1008 1019 1041 1056 1049 1032 1028 1032 1020 989 962
1421 962 958 973 996 1028 1073 1113 1131 1128 1121 1118 1116 1121 1145 1196 1262 1324 1365 1383 1392 1417 1471 1541 1605 1646 1664 1663 1642 1602 1545 1477 1406 1346 1305 1280 1256 1229 1206 1196 1194
1416 1194 1191 1187 1188 1188 1181 1168 1157 1147 1132 1107 1088 1089 1113 1142 1158 1158 1153 1157 1170 1190 1216 1247 1284 1322 1359 1395 1428 1458 1489 1529 1579 1632 1689 1759 1848 1949 2052 2162
1412 2162 2287 2422 2552 2665 2755 2809 2804 2731 2609 2471 2346 2239 2144 2054 1964 1884 1823 1783 1755 1727 1699 1678 1663 1645 1621 1593 1563 1537 1519 1513 1517 1532
1408 1532 1558 1590 1618 1638 1656 1686 1727 1767 1793 1814 1840 1875 1915 1960 2012 2074 2143 2213 2278 2335 2392 2460 2549 2656 2777 2912 3058 3202 3325 3414 3466
1404 3466 3479 3448 3374 3262 3121 2959 2790 2635 2512 2416 2333 2251 2172 2099 2027 1952 1880 1825 1789 1757 1722 1691 1673 1657 1622 1562 1489 1423 1375 1355 1366
1400 1366 1396 1425 1438 1435 1421 1396 1365 1343 1338 1340 1335 1330 1339 1367 1406 1446 1484 1520 1555 1590 1625 1651 1661 1661 1657 1647 1626 1600 1584 1573 1548 1497 1427 1357 1305 1280 1280 1279 1255
1395 1255 1219 1206 1223 1242 1239 1227 1230 1247 1262 1269 1273 1267 1243 1212 1194 1191 1183 1157 1131 1128 1152 1188 1215 1218 1195 1160 1135 1122 1104 1073 1046 1039 1044 1043 1035 1030 1030 1018 990 962 954 967
1390 967 990 1015 1037 1056 1065 1067 1067 1072 1078 1085 1092 1103 1109 1103 1091 1089 1105 1125 1125 1099 1061 1032 1024 1035 1055 1073 1083 1078 1057 1021 986 971 981 998 1004 998 995 998 997 985 974 979 1004 1039
1385 1039 1068 1084 1089 1088 1079 1055 1025 1012 1030 1064 1080 1065 1041 1032 1034 1032 1023 1017 1020 1027 1027 1017 999 982 975 977 979 976 971 966 958 943 927 918 920 933 959 1000 1040 1067 1083 1096 1110 1118 1118
1379 1118 1115 1102 1076 1042 1018 1011 1020 1039 1065 1090 1107 1120 1140 1161 1168 1157 1143 1138 1131 1107 1069 1035 1019 1019 1030 1043 1052 1049 1034 1014 998 997 1012 1035 1053 1066 1081 1095 1094 1077
1374 1077 1061 1062 1073 1079 1081 1095 1119 1136 1141 1141 1145 1146 1136 1130 1147 1192 1248 1293 1312 1305 1280 1248 1220 1202 1194 1186 1169 1135 1093 1058 1045 1053 1061 1054 1029 1000 987 995 1016 1034 1046 1059
1369 1059 1083 1116 1145 1158 1163 1170 1180 1182 1170 1154 1145 1140 1127 1112 1115 1145 1182 1202 1201 1189 1176 1164 1160 1170 1186 1192 1182 1157 1126 1097 1091 1123 1182 1232 1250 1244 1238 1238 1232 1214 1192
1364 1192 1179 1180 1198 1221 1236 1236 1233 1238 1251 1259 1256 1249 1250 1268 1307 1362 1410 1424 1403 1375 1371 1391 1405 1395 1371 1363 1381 1412 1434 1444 1451 1459 1466 1474 1488 1508 1521 1519 1521 1547 1593 1638
1359 1638 1672 1710 1757 1803 1833 1855 1889 1936 1986 2029 2073 2125 2189 2277 2404 2566 2739 2902 3063 3238 3421 3575 3664 3675 3607 3472 3288 3091 2908
1356 2908 2751 2615 2499 2410 2347 2294 2234 2165 2102 2059 2048 2070 2115 2157 2174 2164 2138 2107 2068 2030 2010 2016 2031 2038 2042 2060 2089 2109 2114 2123 2150 2189 2224 2258 2294
1351 2294 2321 2322 2305 2297 2320 2363 2404 2433 2454 2470 2473 2461 2438 2420 2421 2443 2471 2485 2478 2471 2486 2529 2581 2627 2664 2702 2739 2770 2791 2813 2841 2874 2908 2945 2994 3055 3114
1347 3114 3160 3198 3254 3346 3466 3591 3705 3815 3936 4071 4212 4356 4516 4703 4906 5107 5298 5486 5678 5872 6071 6287 6535 6820
1344 6820 7138 7479 7833 8184 8519 8832 9127 9409 9692 9992 10327 10707 11137 11627 12182 12793 13445 14149 14936 15825 16796 17818 18891
1341 18891 20039 21288 22657 24171 25858 27739 29830 32160 34773 37711 40993 44641 48701 53228 58251 63740 69592
1339 69592 75599 81411 86579 90721 93735 95876 97655 99636 102288 105936 110769 116842 124047 132037 140132 147355 152717
1337 152717 155650 156307 155472 154202 153471 154002 156240 160371 166321 173699 181668 188886 193757 195022 192327 186359 178463 170101
1335 170101 162470 156365 152184 149976 149505 150258 151415 151902 150673 147121 141330 133975 125980 118191 111222 105423 100906 97578
1333 97578 95193 93377 91634 89411 86253 81986 76778 71029 65183 59580 54417 49771 45643 41995 38772 35925 33411
1330 33411 31195 29237 27494 25930 24516 23235 22075 21022 20056 19158 18316 17521 16767 16047 15357 14707 14104 13549 13031 12542
1328 12542 12080 11644 11225 10818 10427 10061 9722 9411 9135 8895 8675 8441 8179 7901 7635 7392 7165 6946 6731 6525 6334 6161 6008
1325 6008 5871 5741 5614 5486 5355 5221 5091 4975 4876 4788 4699 4601 4495 4387 4282 4183 4096 4030 3986 3951 3908 3859 3820 3792 3759 3702 3624 3543 3473
1322 3473 3413 3361 3318 3275 3221 3158 3097 3050 3018 3002 3000 3002 2985 2940 2884 2842 2820 2799 2765 2723 2685 2651 2612 2564 2518 2488 2478 2474 2463 2442 2414 2383 2346 2304 2269 2252
1317 2252 2255 2271 2290 2304 2303 2283 2247 2207 2167 2125 2084 2055 2046 2050 2054 2055 2052 2040 2010 1972 1952 1962 1978 1970 1938 1910 1903 1899 1875 1828 1776 1734 1708 1701 1712 1736 1762 1776 1766 1727
1312 1727 1673 1623 1588 1560 1530 1506 1504 1526 1559 1590 1615 1631 1627 1602 1575 1566 1578 1597 1605 1591 1555 1506 1457 1419 1395 1388 1398 1416 1424 1418 1413 1422 1442 1463 1479 1486 1479 1459 1441 1434
1307 1434 1431 1420 1406 1403 1415 1429 1440 1454 1470 1479 1475 1468 1463 1451 1424 1390 1359 1325 1278 1226 1201 1216 1253 1284 1298 1302 1304 1304 1302 1306 1318 1333 1341 1343 1343 1342 1336 1327 1324 1335 1352 1356 1338 1312
1302 1312 1304 1325 1358 1380 1382 1377 1376 1376 1367 1355 1354 1371 1391 1403 1404 1396 1375 1340 1303 1284 1283 1293 1302 1303 1289 1256 1215 1183 1168 1157 1142 1131 1132 1142 1145 1135 1122 1110 1101 1092 1085 1082 1084 1091
1297 1091 1106 1129 1153 1172 1188 1201 1206 1198 1176 1151 1135 1133 1145 1167 1193 1217 1233 1241 1248 1260 1278 1290 1287 1267 1243 1234 1248 1279 1313 1336 1347 1349 1342 1325 1297 1264 1235 1219 1219
1292 1219 1227 1230 1217 1193 1173 1160 1146 1123 1103 1097 1098 1089 1070 1059 1066 1073 1066 1055 1070 1115 1162 1179 1165 1140 1115 1091 1071 1059 1047 1024 1001 1001 1033 1073 1087 1071 1050 1045 1060
1287 1060 1080 1095 1100 1104 1116 1137 1151 1142 1117 1096 1091 1092 1084 1064 1038 1014 1006 1020 1041 1047 1034 1029 1049 1078 1086 1075 1064 1056 1040 1019 1016 1038 1062 1060 1030 991 956 935 937 961 988
1282 988 994 983 978 992 1024 1060 1089 1101 1092 1070 1050 1038 1027 1011 992 972 943 906 878 872 882 886 874 859 855 861 869 881 907 941 964 969 967 974 993 1015 1032 1041 1040 1032 1031 1043
1277 1043 1055 1048 1021 987 959 935 912 899 900 907 914 921 927 928 919 909 915 939 968 988 993 995 1008 1035 1059 1056 1022 979 947 930 928 945 981 1015 1024 1012 1008 1030 1070 1115 1149 1159
1272 1159 1138 1100 1070 1057 1047 1027 1010 1017 1040 1059 1060 1053 1049 1051 1054 1052 1047 1037 1027 1019 1015 1017 1031 1058 1092 1123 1143 1154 1164 1183 1210 1235 1247 1251 1263 1287 1309 1323 1339 1369
1267 1369 1399 1413 1417 1437 1484 1543 1589 1614 1624 1622 1613 1602 1593 1585 1578 1576 1586 1611 1647 1681 1702 1703 1690 1671 1647 1614 1576 1547 1537 1542 1553 1556 1540 1503 1457 1422 1407 1399 1385 1371
1262 1371 1367 1371 1367 1351 1337 1335 1338 1332 1319 1305 1292 1266 1219 1162 1117 1090 1068 1039 1007 988 992 1017 1049 1079 1096 1093 1081 1078 1095 1120 1127 1104 1059 1018 999 1000 1008 1011 1012 1020 1028 1025 1009
1257 1009 991 979 967 948 927 916 921 940 963 982 995 1011 1039 1067 1071 1037 981 936 920 933 957 975 977 966 957 963 980 1002 1025 1052 1079 1101 1115 1118 1102 1062 1017
1252 1017 990 985 990 989 977 952 920 895 887 888 880 865 861 873 883 885 895 919 934 924 902 892 889 880 870 884 925 965 980 977 976 985 996 1002 1004 1002 996 985 967 949 943 956 973
1247 973 978 969 959 959 965 964 947 915 878 849 835 830 825 823 830 848 863 866 864 872 896 928 956 971 977 979 976 968 961 967 983 994 988 971 957 949 943 939 937 931 917 904 898 891 877 870 884 911
1241 911 933 949 977 1016 1041 1040 1024 1005 971 920 879 875 904 939 966 987 1003 1007 997 976 951 931 928 942 957 961 958 958 957 949 942 954 985 1015 1027 1025 1016 1006 1001 999 985 949
1236 949 911 898 911 920 912 908 928 962 979 965 931 895 867 852 850 857 864 864 855 845 845 858 875 890 905 924 936 934 931 942 965 981 984 982 984 982 978 983 999 1007 995 975 963 952
1231 952 926 891 871 876 898 922 941 950 949 944 941 940 940 945 955 963 963 966 983 1006 1016 1006 985 962 942 933 942 960 963 939 899 866 849 849 861 883 907 931 951 960 952 931 907
1225 907 889 877 873 873 872 866 862 869 888 906 919 928 929 915 893 880 883 891 894 900 919 943 956 951 933 908 879 853 832 814 799 794 805 822 837 850 868 887 904 921 945 973
1220 973 994 1006 1006 993 965 935 919 916 915 914 923 943 960 961 948 934 930 942 967 993 1001 994 986 988 992 987 971 952 938 936 947 955 937 891 852 853 892 934 955 956 950 949 954 960 960 957
1215 957 958 965 967 960 952 951 953 949 943 941 939 921 888 862 859 873 892 911 928 939 944 955 981 1012 1026 1015 994 971 948 923 903 894 894 898 909 930 953 970 978 985 997 1010 1014 1010 1006
1209 1006 1015 1035 1059 1079 1094 1101 1090 1059 1024 1004 1002 1001 987 961 932 911 902 904 914 925 931 933 935 939 942 940 932 920 912 917 934 950 954 948 944 945 939 923 909 913 932 947 951 952 958 962 957
1203 957 947 938 925 901 874 862 871 887 899 906 906 894 867 835 811 801 805 822 853 890 923 949 974 1001 1029 1051 1060 1053 1037 1025 1024 1024 1012 998 998 1010 1011 984 952 944 963
1198 963 985 988 975 960 952 948 946 939 928 918 910 898 878 856 847 853 860 862 866 883 904 918 922 927 937 948 956 966 979 988 987 978 965 950 937 936 952 974 982 968 944 926 910 885
1193 885 859 856 885 921 932 912 890 888 902 917 928 944 964 979 978 963 943 930 925 919 913 919 951 994 1014 986 927 874 852 859 883 909 927 931 931 942 962 973 965 952
1188 952 952 966 978 977 956 919 876 844 833 842 858 874 889 900 905 905 903 898 892 892 897 890 863 833 836 878 933 964 966 963 976 1006 1035 1043 1027 1005 995 994 986 962 933 912 901
1183 901 897 903 925 952 969 976 985 1003 1022 1031 1026 1012 998 991 990 982 957 926 909 914 928 936 940 951 971 994 1007 1002 978 946 916 892 869 846 834 839 849 848 834 819 817 831 864
1178 864 916 980 1029 1034 990 926 882 878 906 944 984 1020 1043 1036 1004 971 959 956 944 923 913 924 945 966 984 998 999 984 967 965 982 1007 1033 1053 1054 1028 985 950
1173 950 939 941 944 945 950 965 984 994 984 961 941 939 944 935 909 885 880 891 902 906 906 903 898 897 910 938 961 966 958 953 955 953 942 928 922 923 920 909 897 885 865 832 801 789 797 808
1167 808 811 810 812 815 819 833 864 902 928 933 920 895 857 816 793 799 823 841 839 833 847 891 946 984 991 975 953 933 914 902 910 936 963 975 971 967 973 982 983 969 942 910 886
1162 886 881 896 923 950 966 967 948 913 871 839 824 822 821 818 817 825 848 881 919 956 984 1002 1006 996 978 962 952 940 917 897 899 927 958 968 962 959 962 953 925 893 877
1157 877 883 902 922 932 929 922 927 946 959 948 924 910 914 924 929 931 930 922 902 876 852 833 822 830 863 913 955 968 952 923 901 893 897 912 936 962 980 983 978 965 938 897
1152 897 855 832 827 831 842 868 906 935 942 934 925 915 900 877 844 806 773 762 775 797 811 819 831 850 869 888 904 908 898 884 884 902 929 952 966 969 967 972 990 1013
1147 1013 1028 1032 1033 1027 1011 995 1001 1023 1032 1010 975 951 946 952 961 968 964 942 913 887 866 853 860 890 922 931 918 901 887 867 839 815 801 797 810 848 902 945 961 958 951 940
1142 940 919 895 876 864 860 866 878 884 879 871 871 871 861 846 841 849 857 855 845 838 840 856 885 913 927 929 932 942 952 952 945 937 931 924 915 907 901 895 886 868 846 827 817 815 816 818 825 832 831 818
1136 818 807 811 829 846 855 866 895 934 964 974 974 971 959 936 917 924 953 972 964 939 920 914 912 903 881 844 802 778 789 822 852 870 892 928 959 963 942 920 912 910 905
1131 905 896 893 900 913 926 941 955 965 965 961 964 977 986 972 934 890 856 829 800 769 745 734 741 766 809 855 886 894 885 874 870 874 877 870 855 844 854 886 923 944 948 950 963
1126 963 978 976 954 925 902 892 890 899 925 968 1010 1039 1048 1036 1002 950 895 850 814 782 762 769 804 848 884 913 939 959 963 956 955 964 973 969 962 960 961 948 922 903 908 933
1120 933 959 976 981 971 948 919 893 866 832 798 780 787 810 835 856 870 876 879 887 905 929 949 968 989 1015 1039 1059 1068 1067 1056 1041 1022 996 968 954 962 982 987 970
1116 970 946 935 945 966 991 1011 1022 1024 1019 1010 996 979 965 963 970 979 984 990 1003 1021 1031 1029 1019 1014 1016 1019 1015 1005 993 984 977 970 964 954 940 921 899 880 871 873 875 867 853 852 865 879
1110 879 887 901 931 965 986 996 1007 1013 997 958 922 907 911 925 947 975 998 1005 995 974 953 938 938 948 960 976 1000 1022 1027 1009 982 960 950 953 968 982 976 952 935
1105 935 938 948 950 953 968 981 969 937 902 870 834 804 797 816 835 835 822 813 813 831 871 931 987 1017 1022 1017 1007 992 972 953 939 926 920 928 944 955 945 919 902 910 940
1100 940 975 1002 1021 1034 1039 1035 1026 1009 980 940 909 901 903 895 876 866 873 889 900 910 929 954 978 993 996 988 969 947 926 913 914 930 948 956 952 945 934 913 880 845 824
1095 824 820 830 848 867 880 891 905 922 927 913 894 884 885 890 898 904 898 875 848 843 865 896 911 903 887 883 895 909 910 900 894 898 904 909 918 927 924 908 898 912 935 945 945 952 966
1090 966 967 953 944 959 985 1005 1022 1047 1078 1096 1088 1063 1039 1023 1009 990 968 950 936 918 897 883 889 911 937 958 979 998 1001 978 942 921 931 960 979 968 933
1085 933 901 892 902 915 923 934 952 969 977 979 983 990 994 992 991 1001 1019 1031 1022 995 969 964 978 991 989 976 966 965 961 943 920 918 949 992 1006 976 924 885 869 866 861 853 847 848 860
1080 860 878 890 893 896 911 934 954 963 962 956 949 946 949 948 935 923 932 960 988 1007 1020 1026 1019 1002 987 981 977 967 953 935 912 900 911 932 934 918 919 958 1003 1013 991 969 965
1074 965 964 951 929 909 896 893 904 920 928 925 916 901 882 869 871 881 887 891 901 907 893 868 861 879 899 903 909 933 965 982 981 979 980 980 979 988 1011 1041 1063 1067 1058 1055 1071 1095 1100 1072
1069 1072 1024 980 950 939 949 975 999 1007 999 986 978 971 961 946 922 889 856 838 841 860 883 900 902 890 872 854 838 824 814 811 816 832 856 878 891 895 897 893 872 836
1064 836 805 799 815 842 874 908 927 913 872 827 795 775 771 789 819 838 835 822 816 819 820 812 800 793 795 804 812 817 823 834 844 845 847 863 894 924 940 947 952 952 946 934 913 874
1059 874 824 786 780 794 804 800 789 777 771 780 811 852 885 900 906 910 913 919 935 960 978 977 963 951 945 940 933 927 925 924 926 928 922 904 883 878 896 924 944 952 952 943 920 893 879 882
1053 882 888 884 877 881 899 921 942 961 978 986 983 973 960 946 934 924 912 897 888 890 898 896 882 875 890 923 957 978 981 971 954 943 940 931 908 880 866 876 895 906 896 866
1048 866 832 818 842 890 930 944 947 959 980 993 986 964 939 915 898 892 899 909 913 906 891 876 867 869 887 911 927 928 923 928 944 955 945 919 890 867 843 820 806 808 825
1043 825 845 861 871 877 888 912 939 947 923 878 839 827 839 858 871 877 884 892 897 893 886 887 896 900 891 881 881 887 888 884 891 911 931 930 909 883 866 865 871 873 866 856 853 858 859 848 838
1037 838 841 855 870 886 908 933 943 931 908 891 878 863 849 846 860 885 914 944 969 973 955 922 887 851 822 818 854 917 978 1017 1035 1035 1015 981 948 928 920 921
1032 921 935 952 953 928 896 880 881 880 874 878 903 938 971 999 1020 1027 1020 1011 998 968 921 884 879 896 909 912 924 952 976 975 958 944 934 918 890 865 855 857 860 857 853 850 846
1027 846 837 824 813 807 804 804 810 819 827 831 836 846 858 870 886 906 918 914 900 897 910 927 940 954 974 993 1000 993 984 980 984 992 999 1004 1011 1017 1008 978 942 925 925 921 902 883 881 895 914
1021 914 939 976 1015 1036 1034 1015 988 958 934 927 932 932 927 927 938 953 961 961 953 935 910 890 880 884 902 938 982 1018 1036 1045 1058 1073 1078 1068 1046 1018 987 963 954 967 995
1016 995 1032 1065 1081 1070 1027 964 905 875 883 904 905 879 850 844 865 903 949 993 1018 1015 995 978 962 933 889 856 852 875 909 944 975 995 998 986 969 956 951 952 953
1012 953 950 939 921 899 880 868 863 855 844 835 839 847 847 834 823 827 841 847 837 819 809 814 828 840 846 851 859 873 896 928 962 983 987 988 998 1010 1006 979 944 922 920 933 944
1006 944 938 909 869 839 833 846 863 874 875 869 864 868 883 901 915 921 916 904 888 874 864 860 865 884 912 932 937 935 939 958 990 1027 1053 1055 1036 1014 1003 1001 996 984 968 952 938
1001 938 930 934 948 966 985 1002 1012 1014 1008 1000 997 998 1005 1015 1017 1008 993 985 991 999 993 966 931 909 904 898 870 831 813 835 882 918 929 922 911 906 910 920 934 948 963 978 983 966 935
996 935 909 898 896 893 889 892 905 918 915 889 855 841 855 877 878 857 834 825 824 826 833 847 866 889 916 938 942 931 919 911 894 857 817 799 812 843 872 881 858 810 766 755
990 755 781 819 850 870 881 887 892 901 912 917 912 898 876 850 828 818 817 823 837 871 928 988 1030 1042 1033 1011 986 961 945 943 956 976 995 1006 1013 1022 1033 1044 1050 1051 1052 1063
985 1063 1090 1124 1148 1147 1123 1087 1052 1023 1003 989 976 968 976 1000 1019 1010 976 941 925 923 926 930 935 933 917 888 859 839 838 855 883 910 934 963 1003 1044 1073 1082 1075 1059 1042
980 1042 1035 1038 1035 1012 978 954 943 930 908 892 902 934 973 1008 1034 1042 1027 998 975 971 979 981 971 956 946 945 947 943 931 919 918 931 950 963 968 969 969 965 961 969 991 1009 1007 991
975 991 982 985 984 964 937 926 932 941 938 929 921 913 906 904 912 924 931 930 927 932 950 981 1016 1040 1042 1028 1011 999 992 986 977 965 951 943 952 974 992 995 994 1002 1018 1028 1027 1018 1004 985 967 966 982
969 982 997 991 972 962 960 947 918 892 883 877 855 827 818 838 866 884 896 916 950 986 1003 982 924 855 807 795 807 823 836 852 872 896 920 944 963 975 978 971 953
964 953 931 919 929 961 995 1006 986 949 921 915 921 924 926 938 956 966 960 947 938 935 933 934 936 929 910 893 893 910 932 955 980 1001 1011 1014 1024 1044 1061 1067 1063 1053 1040 1028 1023
959 1023 1012 981 932 897 897 918 931 924 908 897 897 911 938 966 983 989 987 971 940 904 878 862 846 836 841 859 866 854 839 839 849 857 864 873 878 870 856 848 844 837 835 853 887
954 887 917 936 954 976 985 965 929 902 895 904 920 943 965 980 986 987 984 975 964 961 968 975 976 977 983 989 989 988 997 1013 1024 1024 1020 1014 1003 981 952 922 894 870 857 856 854 846 840 854 886
948 886 917 932 939 946 949 938 917 900 892 885 874 861 850 848 863 906 965 1011 1019 994 964 949 943 938 933 939 963 999 1035 1059 1067 1062 1058 1059 1063 1062 1053 1037 1012 977 941 915 902 896 887
942 887 877 873 874 882 898 925 953 969 971 973 987 1011 1030 1036 1034 1027 1016 1000 990 997 1016 1022 1004 974 959 966 974 966 950 942 951 975 1011 1048 1066 1052 1021 1001 1006 1025 1048 1072 1088
937 1088 1083 1058 1033 1027 1029 1025 1013 1003 993 975 954 948 963 986 1005 1017 1020 1013 998 989 987 982 971 962 968 982 991 995 1000 1013 1032 1060 1101 1141 1161 1159 1158 1187 1243 1300 1341 1375 1420
932 1420 1473 1520 1560 1606 1653 1677 1665 1634 1607 1580 1539 1491 1456 1436 1406 1348 1280 1229 1202 1179 1147 1108 1069 1038 1017 1003 985 962 951 968 1005 1034 1044 1047 1056 1063
927 1063 1049 1019 1000 1011 1040 1062 1070 1069 1062 1040 1007 980 970 970 967 966 978 995 1001 995 984 974 958 935 915 899 874 834 794 777 793 840 898 935 923 865 798 762 764
923 764 788 827 878 935 978 997 992 971 940 911 896 902 918 933 940 945 950 954 948 923 886 859 855 866 877 884 893 907 923 938 948 947 933 918 917 929 943 953 965 974 970 952
918 952 939 942 960 986 1016 1042 1052 1043 1030 1022 1014 999 986 983 985 983 984 993 997 981 948 921 913 913 908 894 881 882 900 931 960 976 976 968 960 952 947 948 959 977 995 1005 1004 991 969 938
912 938 900 862 834 826 841 874 906 926 931 939 959 983 994 990 985 989 995 999 1010 1030 1042 1032 1009 992 985 979 971 965 964 961 948 923 883 842 822 840 882 922 942 944 931 898 858
907 858 833 832 845 858 867 875 884 901 932 966 976 950 910 889 894 910 920 920 908 885 860 849 857 877 895 904 908 915 931 952 964 959 945 930 921 918 921 930 939 942 938 927 912 901
901 901 906 927 950 965 976 982 976 951 922 907 913 934 958 976 978 964 951 955 967 964 940 916 911 914 911 902 897 899 901 901 907 920 934 945 956 972 988 997 995 988 991 1008 1029 1037 1025 1000
896 1000 973 951 935 931 942 962 984 1006 1024 1037 1045 1055 1066 1070 1055 1025 1002 999 1006 1001 975 941 921 924 934 931 908 874 841 820 823 854 893 915 909 887 871 865 867 877 889
891 889 893 880 866 866 878 885 885 893 914 936 949 960 979 999 1003 992 984 988 1002 1016 1025 1029 1025 1014 1000 989 979 960 932 906 904 935 982 1014 1015 999 986 981 975 966 956 948 935 919
885 919 909 911 914 915 923 941 961 967 958 944 932 917 894 870 853 846 847 852 861 873 893 922 953 977 990 992 983 965 946 933 930 932 939 951 958 948 920 890 871 866 869 882 907 935
880 935 952 957 964 974 974 952 916 886 872 868 866 872 890 907 909 896 887 898 919 928 922 916 925 940 949 952 950 937 911 882 864 859 859 859 857 858 864 883 916 940 934 904 883 891 911 916 902
874 902 888 888 897 905 910 908 901 893 889 887 882 874 877 892 908 903 877 849 835 832 822 802 786 789 803 813 813 812 811 798 773 754 765 801 838 858 863 862 860 859 863 878 898 915 924 928 935 947
868 947 958 957 941 921 909 912 928 950 971 986 994 994 987 978 977 989 1004 1003 983 963 960 973 987 993 990 973 936 889 850 825 807 794 799 828 867 890 885 861 837 828 833 840 834 816
863 816 799 794 802 822 852 882 891 876 858 861 885 909 915 911 908 914 921 919 904 882 870 874 882 885 887 897 913 919 911 901 895 888 875 863 862 871 879 879 862 827 782 746 735 744 760 782 816
857 816 860 901 923 923 903 871 838 812 798 795 802 818 838 856 874 894 912 918 914 907 905 911 928 960 996 1013 1001 976 962 962 961 952 946 951 953 936 904 885 901 948 1000 1029
852 1029 1024 996 965 947 947 955 952 934 915 910 920 931 932 932 944 969 997 1021 1040 1053 1057 1051 1041 1033 1028 1024 1015 990 950 912 895 898 905 902 896 900 911 915 907 896 899 920 943 951 940 922
846 922 911 908 907 912 931 960 981 975 947 908 864 827 815 839 890 942 981 1009 1026 1024 1007 999 1012 1030 1025 999 979 981 996 1003 996 977 950 918 892 882 889 900 898 879 848
841 848 825 825 843 863 873 882 901 923 930 919 905 900 901 910 933 971 999 994 964 943 950 976 995 992 969 936 911 903 906 908 902 890 875 860 856 874 905 928 926 911 901 903 910 918
836 918 930 947 967 985 997 1003 1012 1033 1065 1083 1064 1014 966 945 949 955 944 914 875 840 823 825 836 843 840 832 833 848 875 903 925 945 959 967 972 982 994 997 988 981 985 990 991 995
831 995 1015 1041 1052 1039 1017 997 984 985 1007 1034 1037 1013 986 973 966 950 933 922 910 891 880 894 918 920 894 863 846 846 858 875 884 874 860 866 899 940 976 1008 1034
826 1034 1039 1019 989 964 941 915 897 907 948 1002 1050 1077 1075 1045 1001 961 933 915 908 907 908 906 906 907 901 880 850 829 831 858 903 947 969 964 948 945 958 975 987 996 1001 1004
821 1004 1011 1027 1041 1037 1017 1005 1009 1013 1005 994 990 993 993 991 991 987 973 957 954 960 961 957 958 964 956 932 916 929 953 956 931 901 886 881 882 892 907 915 910 904 909 917 914 905 910 931 950 956 958 964 966
814 966 952 924 897 884 888 910 945 980 997 993 979 968 965 968 982 1008 1033 1037 1018 996 988 990 986 974 966 968 967 950 921 894 881 882 891 903 916 934 955 974 981 971 949 925
809 925 908 908 938 995 1057 1098 1116 1129 1155 1189 1217 1228 1220 1201 1181 1165 1149 1126 1100 1079 1063 1042 1021 1016 1038 1066 1075 1062 1046 1042 1047 1050 1046 1037 1028 1025 1033 1051 1068 1074 1068 1056
804 1056 1048 1046 1045 1042 1036 1030 1020 1001 977 957 946 938 928 923 929 946 970 1001 1034 1054 1049 1025 1002 992 991 992 993 995 991 981 969 963 958 946 923 898 887 891 900 909 923 948 969 971 960
799 960 960 977 991 988 975 968 964 956 952 966 990 1009 1024 1044 1061 1058 1040 1035 1054 1073 1066 1039 1017 1005 988 960 937 934 946 955 951 935 920 913 908 896 884 881 891 899 890 868 844 833
793 833 839 865 902 933 946 944 934 922 909 898 891 886 878 870 868 870 865 849 829 819 826 847 872 892 903 901 884 860 841 837 845 859 884 930 989 1031 1036 1013 989 978 976 976 980 989
788 989 992 979 949 914 887 874 869 869 875 890 904 899 875 854 856 878 901 914 922 929 937 945 944 928 900 881 893 935 985 1023 1041 1033 1002 962 937 936 943 941 925 904 892 896 912
783 912 929 941 948 955 961 963 963 961 948 917 885 876 890 908 916 924 938 950 948 942 947 967 992 1007 1008 998 990 991 991 970 927 885 869 882 912 950 985 1002 999 989 981 968 941 911
777 911 901 910 913 900 886 886 894 897 891 876 852 824 805 802 808 817 826 835 840 844 862 903 955 993 1010 1014 1020 1027 1030 1023 1009 988 964 937 908 878 848 825 822 840 871 898 917 937 962
772 962 982 985 974 961 948 934 926 937 960 975 972 964 968 976 972 960 963 992 1031 1061 1084 1107 1128 1135 1125 1107 1087 1062 1025 984 951 932 923 918 913 903 886 865 852 857 881 908
767 908 925 926 923 926 939 952 958 956 953 951 949 950 959 972 974 954 930 928 956 991 1010 1008 997 985 973 963 956 956 961 965 958 937 908 886 879 877 867 844 821 813 824 849 879 908 935 952
761 952 949 924 889 860 850 852 859 869 881 890 889 885 890 912 942 966 972 960 933 903 886 893 915 934 934 918 894 869 847 834 842 871 903 915 901 880 873 885 898 897 884 871
756 871 868 875 888 902 910 915 920 929 937 936 929 930 947 964 958 922 877 847 840 847 855 865 882 908 935 955 966 975 988 1004 1017 1017 1008 998 997 1003 1007 1003 993 986 981 973 952 923 899 890 895 904 914
750 914 924 936 949 962 972 979 983 989 993 988 979 978 997 1022 1032 1022 1006 992 977 955 934 924 923 917 901 884 879 890 908 924 932 936 942 953 958 944 908 860 815 781 763 760 768
745 768 782 802 831 866 898 916 916 900 874 849 843 862 895 919 921 910 903 909 919 914 886 851 838 863 907 934 929 910 903 913 926 934 943 955 971 990 1014 1035 1035 1012 989
740 989 993 1016 1031 1020 998 983 981 981 975 963 943 917 895 884 884 886 883 879 881 887 892 891 885 875 864 861 870 884 884 859 825 806 809 822 834 852 879 899 896 879 867 861 844 819 812
734 812 843 895 937 957 965 972 976 975 971 967 957 937 909 879 854 837 830 830 840 855 869 876 883 893 899 886 855 825 814 817 822 830 850 882 914 934 942 939 927 909 893 878 861
729 861 841 827 833 861 902 939 958 959 959 974 997 1004 977 925 880 866 884 908 911 890 865 856 856 846 824 807 813 840 871 895 907 911 907 905 911 929 953 975 991 1004 1012 1011
724 1011 997 977 972 993 1027 1047 1041 1017 998 998 1014 1037 1054 1057 1049 1035 1015 991 975 979 1002 1028 1042 1042 1033 1018 1003 999 1015 1042 1065 1069 1054 1027 1000 980 966 947 921 898
719 898 893 907 927 940 943 937 922 905 886 864 842 832 843 863 873 865 853 852 863 877 885 884 875 870 878 901 927 947 959 966 967 958 948 946 953 958 952 947 963 1002 1039 1047 1025 994 975
713 975 968 963 958 956 961 967 969 968 969 973 982 994 1002 996 973 941 913 904 915 943 973 994 1000 995 982 968 960 967 981 989 982 967 954 939 915 886 869 873 889 903 912 922 942 972 1011 1048
708 1048 1070 1065 1041 1011 986 968 952 938 925 910 894 881 877 889 919 956 977 966 933 905 898 902 900 891 884 884 888 895 910 933 953 963 964 957 940 915 892 877 875 887 909
703 909 938 969 1003 1040 1071 1087 1088 1081 1062 1027 990 975 987 1003 1005 998 987 968 939 919 928 959 984 991 985 972 961 962 983 1010 1020 1013 1002 992 978 969 981 999 989 941
698 941 890 867 868 870 871 880 891 893 892 905 936 971 1001 1027 1043 1037 1011 982 963 944 920 907 923 962 994 997 977 959 949 934 903 867 845 844 852 859 865 873 885 902 919 931
693 931 931 927 939 973 1007 1020 1009 989 974 974 1002 1056 1112 1138 1132 1115 1101 1083 1059 1044 1047 1056 1056 1051 1052 1056 1053 1045 1041 1048 1055 1058 1062 1073 1089 1102 1106 1105 1096 1073 1039 1014 1016 1033 1038 1015
687 1015 981 959 947 929 909 902 916 929 925 907 891 887 890 903 932 972 1002 1004 981 951 932 933 958 1006 1064 1099 1086 1038 1006 1017 1052 1067 1054 1037 1032 1024 998 968 953
682 953 955 964 980 1004 1027 1041 1045 1045 1034 1005 972 956 952 940 910 878 860 852 848 845 850 864 889 922 953 965 957 943 930 911 885 865 866 886 917 955 999 1035 1044 1020 980
677 980 943 923 927 946 962 956 929 899 881 878 884 897 918 948 978 998 999 985 972 968 962 941 912 896 902 910 903 890 893 914 938 949 949 943 935 932 938 954 977 999 1009 998 967
672 967 934 915 907 900 896 911 948 988 1005 1002 999 1009 1019 1013 986 946 910 890 888 894 893 886 885 906 943 981 1013 1033 1035 1011 971 942 945 973 1004 1021 1028 1025 1011 987 972 979 995
667 995 995 976 962 969 987 995 986 966 944 925 916 919 926 931 939 959 985 999 989 964 938 918 907 908 922 942 957 963 968 979 989 987 973 958 951 952 956 962 976 997 1014 1026 1041 1062
661 1062 1076 1073 1061 1053 1040 1007 959 923 917 930 946 959 971 970 948 916 896 901 924 952 978 995 1001 1002 1011 1033 1055 1062 1057 1057 1076 1103 1119 1113 1099 1091 1088 1078 1061 1048 1046 1048 1050
656 1050 1053 1057 1055 1041 1024 1019 1029 1040 1037 1017 986 957 949 963 982 985 976 973 979 981 969 950 941 943 948 953 966 989 1018 1045 1069 1088 1095 1081 1050 1020 1007 1008 1010 1006 1007 1014 1020 1019 1020 1032 1045
650 1045 1036 1002 961 937 937 955 978 994 1003 1010 1016 1015 1003 996 1011 1045 1076 1087 1082 1073 1070 1078 1101 1136 1161 1163 1144 1120 1100 1084 1070 1058 1052 1051 1055 1062 1063 1051 1024 988 962 961 986 1021
645 1021 1045 1053 1053 1053 1050 1045 1044 1049 1052 1045 1035 1032 1036 1040 1041 1045 1055 1066 1072 1070 1065 1057 1040 1012 984 978 994 1016 1024 1022 1016 1001 967 923 888 867 849 834 835 854 870 867 856 854 858 855 852 861 880
639 880 893 897 903 914 919 911 901 896 894 891 893 909 932 950 959 967 980 993 996 988 977 969 966 963 962 967 977 987 994 1006 1021 1034 1039 1040 1033 1015 993 990 1017 1051 1063 1056 1056 1074 1098 1120 1143
633 1143 1170 1189 1185 1160 1125 1086 1048 1024 1019 1024 1029 1030 1032 1031 1023 1007 986 966 955 957 965 964 953 947 953 961 961 965 985 1013 1029 1031 1035 1047 1053 1046 1037 1042 1054 1053 1029 998 979 979 989 998 996 983
627 983 967 956 949 944 940 942 954 961 950 925 900 886 878 875 881 898 915 921 925 944 981 1021 1055 1075 1078 1065 1049 1038 1029 1013 1001 1013 1045 1071 1076 1064 1045 1018 990 978 990 1008
622 1008 1017 1029 1060 1097 1112 1102 1084 1067 1047 1024 1015 1027 1046 1050 1033 1003 973 949 934 928 931 946 971 995 1005 996 981 969 967 970 971 963 949 940 935 919 894 880 891 906 899
617 899 875 863 870 884 903 935 974 998 996 992 1007 1034 1049 1046 1031 1011 988 971 969 981 999 1019 1032 1026 1004 983 975 976 972 969 972 976 971 962 965 985 1009 1031 1050 1062 1060 1043 1022
612 1022 1011 1015 1032 1048 1046 1023 998 990 996 1000 992 976 964 955 947 940 933 929 936 963 1003 1041 1063 1068 1054 1019 974 940 935 955 987 1020 1053 1085 1111 1125 1125 1112 1097 1090 1090 1088 1077 1061
607 1061 1043 1028 1019 1017 1014 1000 981 978 1000 1030 1038 1015 980 968 994 1054 1120 1169 1195 1209 1221 1230 1233 1235 1246 1264 1281 1295 1311 1329 1339 1342 1352 1377 1402 1404 1382 1361 1356 1360 1355
602 1355 1335 1305 1266 1217 1164 1123 1106 1107 1118 1136 1156 1170 1168 1148 1116 1079 1045 1029 1036 1059 1091 1132 1181 1219 1231 1228 1234 1252 1255 1229 1194 1177 1184 1201 1222 1250 1277 1292
597 1292 1300 1316 1348 1392 1442 1498 1552 1592 1616 1640 1671 1697 1700 1682 1657 1632 1603 1564 1514 1464 1427 1415 1425 1440 1443 1426 1395 1358 1325 1306 1300 1295 1271 1224 1168 1127 1116
592 1116 1129 1144 1141 1123 1110 1121 1148 1166 1166 1162 1175 1203 1226 1230 1221 1211 1211 1222 1240 1260 1279 1296 1317 1348 1381 1403 1409 1414 1437 1478 1513 1517 1485 1438 1402 1386 1380 1363 1331 1292
588 1292 1260 1236 1209 1176 1147 1134 1134 1133 1125 1116 1112 1113 1116 1123 1134 1144 1147 1146 1146 1143 1132 1120 1120 1130 1140 1146 1155 1164 1164 1146 1117 1093 1077 1066 1060 1065 1080 1097 1113 1126 1134 1135 1129 1120 1109 1095
582 1095 1088 1100 1126 1150 1162 1175 1201 1237 1265 1273 1264 1239 1203 1168 1150 1153 1168 1177 1174 1164 1156 1157 1160 1156 1141 1121 1107 1098 1094 1097 1108 1118 1115 1101 1088 1078 1063 1042 1035 1055 1085 1096
577 1096 1085 1084 1117 1172 1213 1216 1188 1151 1119 1096 1076 1061 1053 1055 1064 1081 1109 1145 1175 1184 1175 1173 1196 1243 1293 1334 1363 1379 1373 1349 1324 1313 1313 1308 1299 1299 1314 1326 1315 1283 1254
572 1254 1245 1252 1263 1278 1303 1332 1353 1358 1354 1347 1344 1347 1356 1367 1369 1362 1358 1366 1385 1407 1425 1432 1418 1383 1344 1322 1323 1332 1339 1342 1345 1342 1326 1304 1290 1294 1308 1323 1333 1334 1320 1291 1255 1224 1208
566 1208 1212 1231 1256 1276 1290 1302 1313 1315 1309 1310 1332 1374 1417 1446 1462 1476 1495 1515 1529 1539 1548 1560 1581 1615 1658 1704 1751 1803 1861 1917 1961 1987 1995 1981 1943 1882 1810 1739
562 1739 1684 1652 1643 1641 1629 1603 1578 1563 1558 1551 1540 1533 1534 1543 1554 1566 1578 1591 1599 1593 1567 1533 1510 1511 1529 1550 1576 1616 1666 1707 1731 1751 1780 1809 1823 1827 1848 1904 1982 2059
557 2059 2127 2193 2261 2330 2402 2487 2592 2706 2806 2874 2904 2901 2877 2842 2797 2729 2629 2505 2382 2275 2189 2122 2078 2059 2057 2063 2076 2099 2124 2141 2146 2147 2146 2135
553 2135 2109 2070 2024 1980 1949 1945 1969 2006 2037 2057 2069 2078 2078 2066 2051 2048 2073 2127 2198 2267 2319 2361 2408 2469 2544 2623 2695 2752 2793 2830 2875 2929 2983 3030 3069 3108 3151
548 3151 3186 3195 3175 3153 3169 3231 3310 3372 3412 3449 3498 3559 3625 3684 3726 3753 3796 3887 4017 4147 4256 4357 4472 4605 4748 4907 5094 5306 5530 5763
544 5763 6016 6294 6591 6902 7233 7590 7970 8368 8785 9225 9685 10170 10695 11283 11945 12678 13474 14339 15291 16340 17479 18708
542 18708 20050 21549 23244 25157 27293 29662 32271 35130 38239 41574 45065 48576 51922 54875 57177 58580 58923 58197
539 58197 56536 54152 51275 48128 44919 41810 38898 36223 33798 31624 29696 28010 26561 25346 24348 23547 22919 22440
537 22440 22090 21849 21712 21677 21732 21856 22040 22296 22645 23089 23612 24207 24897 25711 26660 27737 28946 30313 31865 33609 35545 37697
535 37697 40111 42833 45895 49328 53177 57490 62307 67651 73534 79946 86811 93934 100962 107383 112579 115943 117041
533 117041 115744 112258 107044 100666 93664 86487 79473 72847 66731 61177 56189 51747 47817 44368 41372 38789 36563
530 36563 34643 32994 31587 30383 29337 28416 27601 26879 26247 25705 25255 24886 24588 24374 24262 24261 24356 24530 24777 25100 25512 26041
528 26041 26712 27538 28511 29627 30894 32331 33963 35825 37936 40288 42857 45636 48612 51701 54721 57433 59589 60958
526 60958 61356 60708 59078 56635 53587 50155 46569 43025 39641 36464 33523 30845 28440 26287 24365 22663 21166 19844
523 19844 18671 17628 16698 15864 15114 14443 13837 13276 12749 12254 11785 11330 10899 10512 10167 9839 9521 9233 8985 8757 8531 8320
521 8320 8145 7994 7848 7709 7595 7507 7430 7367 7332 7319 7304 7278 7253 7230 7181 7079 6920 6716 6487 6251 6027 5816 5609 5403 5218 5073 4955
517 4955 4839 4714 4591 4489 4412 4350 4284 4196 4088 3976 3879 3802 3741 3689 3641 3591 3538 3485 3431 3375 3315 3257 3213 3187 3177 3174 3166 3145 3116 3104 3120 3152 3171
513 3171 3169 3160 3156 3158 3165 3183 3212 3240 3260 3282 3317 3362 3393 3391 3353 3295 3230 3161 3089 3013 2931 2841 2749 2670 2611 2571 2539 2510 2481 2450 2416 2382 2358 2343 2326 2300 2269 2239
509 2239 2208 2174 2147 2135 2130 2123 2113 2105 2098 2084 2067 2062 2072 2079 2067 2038 2009 1981 1951 1923 1902 1885 1862 1831 1809 1814 1839 1859 1862 1863 1876 1897 1907 1898 1883 1872 1852 1809 1757 1722
504 1722 1713 1709 1694 1677 1674 1685 1701 1715 1729 1737 1727 1700 1668 1647 1637 1634 1638 1654 1677 1694 1694 1683 1678 1688 1703 1705 1689 1671 1661 1657 1645 1623 1604 1598 1600 1601 1591 1569 1543 1527 1532 1552
499 1552 1572 1581 1580 1577 1573 1565 1559 1565 1586 1606 1599 1563 1520 1501 1507 1519 1518 1513 1517 1530 1540 1540 1542 1556 1581 1607 1625 1630 1628 1630 1642 1655 1658 1651 1644 1643 1640 1634 1632 1639 1645 1640 1629 1625 1631 1643 1655 1666 1679
493 1679 1697 1718 1736 1743 1743 1755 1794 1854 1915 1967 2023 2099 2194 2301 2413 2531 2645 2747 2840 2949 3095 3277 3481 3689 3895 4091 4255 4360 4391
489 4391 4353 4257 4116 3942 3747 3536 3313 3091 2893 2737 2618 2518 2430 2358 2310 2281 2265 2257 2254 2249 2237 2219 2202 2194 2200 2220 2240 2248 2242 2239 2247 2263 2281 2312
485 2312 2370 2451 2532 2604 2684 2787 2909 3035 3172 3338 3542 3769 4008 4270 4573 4923 5308 5721 6155 6585 6964 7241 7391 7414 7316 7099
482 7099 6776 6373 5924 5462 5015 4604 4243 3933 3669 3441 3245 3081 2951 2846 2754 2667 2588 2522 2469 2428 2398 2378 2362 2343 2318 2286 2255 2230
478 2230 2220 2218 2215 2207 2205 2221 2255 2296 2338 2383 2429 2475 2529 2602 2690 2782 2886 3025 3212 3430 3655 3879 4098 4295 4443 4525 4544 4507 4425 4302 4137
475 4137 3927 3686 3443 3218 3009 2803 2608 2444 2320 2228 2155 2091 2029 1970 1926 1900 1880 1851 1814 1781 1758 1745 1751 1786 1831 1849 1823 1774 1733 1711 1702
471 1702 1695 1686 1673 1665 1676 1710 1746 1763 1763 1763 1775 1794 1816 1843 1878 1926 1985 2039 2068 2057 2017 1972 1935 1905 1873 1836 1795 1751 1711 1677 1651 1635 1630 1631 1623 1596 1555 1513 1484
466 1484 1471 1476 1493 1508 1507 1489 1466 1445 1428 1411 1395 1384 1388 1409 1440 1462 1460 1435 1398 1361 1334 1325 1334 1354 1380 1414 1453 1485 1502 1512 1527 1543 1544 1531 1525 1537 1556 1564 1558 1544
461 1544 1532 1528 1540 1568 1596 1609 1598 1570 1534 1499 1472 1453 1428 1385 1327 1273 1240 1232 1239 1248 1258 1275 1301 1322 1325 1310 1293 1285 1280 1269 1254 1243 1239 1240 1248 1261 1271 1269 1254 1235
456 1235 1222 1213 1204 1188 1161 1119 1067 1021 1002 1016 1049 1080 1102 1118 1130 1126 1098 1057 1023 1010 1008 1006 1006 1017 1031 1034 1029 1038 1070 1107 1124 1117 1106 1108 1121 1139 1158 1176 1181 1167 1141
451 1141 1119 1109 1107 1107 1110 1119 1126 1121 1104 1086 1081 1093 1115 1137 1145 1134 1106 1071 1034 999 978 983 1011 1046 1072 1090 1101 1103 1093 1085 1089 1095 1086 1063 1042 1034 1036 1038 1036 1029 1021 1017 1023 1038 1049 1055
446 1055 1059 1063 1065 1062 1061 1061 1056 1045 1040 1046 1059 1071 1081 1092 1099 1098 1091 1088 1088 1079 1057 1031 1009 993 978 970 973 987 1002 1013 1018 1024 1040 1071 1111 1144 1154 1139 1110 1077 1043 1012 991 986 1000
440 1000 1026 1060 1094 1120 1133 1133 1127 1121 1118 1114 1103 1079 1048 1023 1016 1026 1035 1030 1015 1005 1007 1017 1029 1046 1069 1091 1099 1092 1079 1067 1051 1027 1009 1012 1034 1056 1067 1075 1090 1105 1108 1096
435 1096 1077 1057 1037 1020 1008 998 990 991 1012 1048 1079 1094 1100 1113 1132 1144 1136 1111 1080 1057 1041 1028 1010 992 982 981 979 973 971 982 1003 1028 1049 1062 1062 1052 1046 1055 1063 1048 1012
430 1012 982 977 990 1002 1011 1021 1028 1022 1002 982 973 974 974 970 970 979 996 1011 1019 1025 1040 1063 1082 1085 1074 1060 1056 1068 1089 1109 1118 1118 1113 1100 1077 1054 1044 1043 1037 1025 1026 1047 1076 1097 1108
424 1108 1111 1097 1060 1017 992 989 1000 1024 1064 1104 1111 1080 1039 1018 1012 1003 993 997 1018 1039 1052 1066 1089 1112 1117 1101 1074 1053 1051 1073 1107 1135 1146 1145 1141 1133 1113 1077 1037 1004
420 1004 982 972 975 994 1017 1031 1039 1051 1071 1084 1074 1048 1029 1031 1050 1069 1075 1061 1029 992 963 947 939 937 943 956 966 967 960 951 946 947 953 963 973 981 989 1000 1012 1024 1033 1039 1041 1038
414 1038 1036 1038 1049 1066 1088 1106 1115 1112 1104 1091 1077 1068 1077 1107 1142 1155 1138 1105 1078 1065 1061 1058 1056 1061 1077 1093 1094 1075 1049 1040 1054 1076 1082 1067 1046 1036 1035 1032 1021 1006 993 985 985 990
409 990 996 994 983 969 955 945 941 945 950 951 949 959 983 1005 1013 1012 1014 1013 998 974 963 979 1010 1037 1053 1056 1050 1045 1049 1058 1061 1056 1056 1063 1068 1065 1064 1070 1070 1052 1026 1009 998 985 974 981 1004 1024
403 1024 1031 1030 1029 1028 1025 1023 1019 1011 1005 1009 1021 1031 1042 1063 1097 1132 1158 1177 1188 1185 1171 1161 1167 1183 1201 1218 1233 1239 1230 1209 1186 1163 1142 1131 1137 1154 1172 1187 1199 1203 1189 1159 1125
398 1125 1098 1080 1071 1071 1074 1071 1063 1052 1043 1036 1031 1032 1038 1045 1052 1064 1085 1114 1144 1160 1149 1112 1064 1028 1016 1024 1036 1040 1029 1008 990 982 981 981 980 983 990 997 1005 1016 1030 1042 1045 1043 1033 1008 966
392 966 924 897 891 894 900 908 920 928 927 922 919 926 947 983 1026 1052 1048 1025 1013 1026 1052 1071 1076 1074 1071 1069 1069 1071 1063 1035 991 951 925 907 893 899 932 976 1003 1009 1011 1022 1028 1016 998 1002
386 1002 1032 1066 1081 1074 1055 1033 1012 996 988 984 976 960 947 945 951 962 979 1009 1045 1074 1083 1069 1040 1011 995 991 985 969 954 953 964 973 971 972 989 1021 1053 1073 1077 1067 1053 1050
381 1050 1067 1096 1118 1114 1086 1049 1022 1012 1016 1026 1038 1054 1074 1097 1123 1145 1153 1146 1141 1154 1177 1184 1163 1135 1117 1107 1093 1078 1075 1089 1106 1113 1107 1092 1081 1088 1110 1130 1132 1126 1130
376 1130 1147 1167 1181 1192 1206 1226 1257 1289 1302 1288 1266 1262 1271 1267 1244 1220 1206 1190 1164 1138 1127 1126 1124 1122 1124 1131 1143 1164 1186 1194 1186 1178 1180 1184 1186 1199 1231 1264 1273 1263 1255 1259 1272
371 1272 1300 1346 1388 1396 1363 1318 1280 1250 1223 1207 1212 1233 1261 1296 1340 1385 1423 1454 1483 1506 1516 1507 1476 1432 1394 1374 1362 1345 1330 1329 1340 1341 1326 1319 1331 1341 1326 1294
366 1294 1273 1269 1266 1259 1266 1294 1320 1319 1293 1267 1263 1277 1289 1286 1272 1261 1263 1277 1302 1339 1378 1400 1387 1345 1298 1266 1249 1244 1249 1257 1253 1230 1202 1191 1207 1239 1272 1295 1300 1283 1255
361 1255 1238 1246 1273 1297 1303 1293 1283 1278 1276 1271 1266 1261 1256 1249 1242 1238 1238 1237 1231 1222 1212 1202 1196 1195 1194 1185 1158 1122 1096 1093 1109 1126 1132 1128 1126 1132 1144 1145 1123 1090 1071 1083 1111 1128 1123 1111 1109 1117 1127
355 1127 1140 1163 1197 1230 1251 1255 1235 1195 1148 1109 1090 1094 1120 1158 1193 1212 1219 1226 1232 1229 1220 1214 1212 1201 1176 1147 1128 1120 1117 1123 1139 1160 1177 1183 1182 1178 1180 1195 1215 1224 1210 1181 1156
350 1156 1138 1125 1115 1115 1124 1128 1118 1090 1052 1018 998 999 1013 1028 1040 1051 1068 1085 1095 1088 1060 1021 989 977 980 986 985 983 993 1023 1071 1122 1156 1165 1158 1153 1158 1170 1179 1174 1147 1098
345 1098 1043 999 978 983 1012 1056 1097 1116 1115 1112 1119 1133 1143 1143 1131 1105 1077 1062 1072 1101 1128 1132 1103 1049 992 955 952 976 1010 1033 1038 1034 1034 1041 1048 1055 1072 1107 1142 1157 1149 1137
340 1137 1130 1125 1117 1110 1098 1067 1016 970 956 970 982 975 959 951 956 968 980 992 1006 1014 1010 995 982 977 972 953 924 907 910 924 932 933 932 933 934 932 928 926 931 945 961 967 960 950 943 933 913
334 913 897 893 897 900 910 939 973 986 971 955 957 973 982 979 972 964 959 956 951 939 931 945 986 1028 1044 1036 1030 1044 1073 1099 1110 1100 1075 1048 1031 1027 1024 1019 1022 1041 1071 1089 1082 1057 1032
328 1032 1021 1028 1041 1046 1029 995 963 949 956 976 997 1004 994 969 941 919 903 888 876 876 888 905 921 933 941 945 952 967 985 984 956 912 873 854 859 884 917 931 911 873
324 873 846 843 853 865 876 887 889 882 876 882 894 902 903 899 883 849 803 771 769 793 818 824 821 832 865 896 898 876 857 859 875 890 900 901 893 880 871 865 853 838 839 865 899 914
318 914 903 883 866 850 832 818 811 809 811 817 823 826 829 838 853 873 900 935 966 978 971 963 969 978 974 959 950 957 974 987 991 988 982 975 973 979 991 999 995 984 978 975 964 944 930 936 947 933
312 933 891 844 819 817 826 839 856 871 875 867 859 857 854 847 839 839 854 878 902 913 906 891 879 880 892 910 933 958 973 964 928 885 860 856 854 839 818 815 838 874 902 921 935
307 935 943 936 917 902 905 922 940 944 935 921 911 904 890 856 808 766 745 742 744 747 763 800 846 883 900 899 891 889 901 923 938 939 935 940 956 973 984 987 984 971 950 936 937 946 952
302 952 957 971 998 1022 1029 1013 980 946 927 929 936 930 913 902 909 923 931 936 948 965 976 976 972 975 986 1000 1012 1016 1006 980 945 912 887 870 859 855 861 876 894 910 925 938
296 938 944 940 928 918 917 924 932 937 934 931 932 933 918 882 845 840 875 925 964 991 1008 1009 980 926 872 840 831 842 864 890 908 917 921 927 930 929 928 932 935 934 932 932 937 940 939 934 922 905 888
290 888 880 883 898 924 960 995 1014 1008 988 969 961 959 956 950 945 945 942 935 930 937 953 957 939 911 900 914 937 952 957 964 979 996 1003 998 986 973 956 934 909 888 880 885 900 913 920 916
285 916 908 906 915 933 948 952 951 955 967 977 976 970 974 995 1025 1048 1057 1057 1056 1054 1044 1016 979 952 946 951 948 930 911 905 911 922 930 932 928 923 928 939 941 925 908 919 953 979 972 943 918 906
279 906 897 891 901 930 960 975 976 978 989 1001 1008 1008 1002 988 967 948 936 925 903 871 845 838 846 860 873 888 903 917 930 947 963 965 953 944 951 963 959 935 911 906 916 924 924
274 924 929 958 1009 1054 1064 1037 1002 985 981 967 939 916 911 915 916 922 945 979 999 990 964 943 932 925 914 904 901 905 914 925 937 944 941 926 905 885 867 848 832 827 834 848 862
268 862 878 900 926 949 965 973 962 926 873 820 780 755 744 747 759 771 783 809 856 910 947 953 938 920 914 924 934 930 910 890 882 880 874 869 876 885 883 867 858 869 895 925
263 925 953 974 975 951 915 889 888 906 933 955 969 977 983 979 960 934 914 903 892 882 895 939 990 1014 1004 981 965 961 973 1004 1047 1083 1095 1081 1052 1019 991 973
259 973 964 959 955 952 941 921 904 909 933 951 946 920 881 836 793 769 775 797 815 820 821 833 859 896 927 937 926 913 912 918 914 900 887 878 865 849 840 853 888 936 983 1015
254 1015 1029 1038 1050 1062 1059 1043 1035 1042 1053 1049 1028 1001 974 946 919 903 900 908 912 904 885 861 838 820 810 815 831 845 848 850 868 896 908 890 855 833 834 850 866 875 877 875 873
248 873 873 873 877 888 902 907 891 860 831 824 844 884 924 947 950 940 920 883 831 787 770 774 776 771 772 788 801 795 773 755 753 761 772 783 794 807 819 827 826 817 809 806 813 830 854
243 854 873 874 851 814 781 758 748 750 763 770 756 729 716 734 776 819 853 879 903 927 948 958 954 943 935 929 915 890 866 858 863 872 878 881 876 860 844 840 844 841 830 827 846
237 846 876 901 915 922 924 918 906 894 884 876 876 886 899 903 893 881 877 881 891 900 905 906 903 899 894 887 879 873 866 855 842 835 843 861 874 877 881 902 939 971 978 963 947 941 939 939 947 968 989
232 989 998 995 987 974 953 936 938 956 972 979 981 983 979 963 938 911 881 851 833 836 857 886 914 938 955 960 954 941 930 929 938 949 945 916 871 831 817 838 882 927 956 972
226 972 988 1004 1015 1018 1014 995 948 885 838 827 837 852 876 921 980 1024 1044 1052 1059 1059 1046 1028 1018 1021 1025 1022 1012 1008 1013 1017 1006 979 955 943 933 917 911 933 973 1000 1005 1006
221 1006 1018 1035 1038 1025 1008 992 976 963 955 957 965 978 994 1004 1003 995 986 979 966 943 914 893 892 914 946 970 974 960 940 926 927 940 952 949 935 922 914 909 905 900 894 883 874 876
216 876 885 887 879 871 866 858 848 848 863 875 864 835 807 792 790 799 813 820 812 799 797 808 825 848 878 912 944 971 993 996 965 911 874 876 901 920 920 908 890 873 867 877 893
211 893 906 912 920 927 925 910 888 870 857 847 837 830 829 832 834 836 844 865 891 914 928 938 942 937 926 921 921 917 902 889 889 894 880 840 788 748 736 750 777 802 818 826 828 818 798
205 798 788 801 831 854 863 869 879 884 881 880 892 909 915 914 918 926 922 907 902 919 947 964 969 975 983 978 953 921 899 887 880 883 908 946 970 965 944 935 948 962 955 928 895 871 855
200 855 846 848 864 887 910 929 944 949 935 907 885 884 897 904 894 872 853 842 839 837 840 855 890 937 978 994 978 933 870 810 777 780 805 826 830 822 816 817 824 834 837 833 826 827
194 827 836 842 833 815 802 802 813 828 843 854 855 845 824 806 798 794 779 755 740 748 770 790 813 851 893 911 894 863 846 840 835 828 830 844 863 880 892 895 882 852 814 779
189 779 753 744 755 779 803 822 846 882 921 940 928 895 866 858 866 879 890 899 902 888 864 846 843 840 823 800 793 809 836 860 876 880 868 845 825 818 820 823 821 808 787 768
184 768 764 780 810 847 883 908 917 915 917 924 924 914 909 921 939 940 924 910 919 950 985 1011 1020 1016 1008 1007 1015 1020 1011 989 962 938 922 908 897 887 876 853 812 767 738 739 762 792
179 792 818 837 855 875 899 919 931 936 938 933 915 886 856 835 826 828 840 855 862 866 876 896 919 938 954 967 970 957 935 911 889 867 849 832 807 774 744 730 731 748
174 748 789 853 912 936 920 882 839 793 758 757 796 850 891 908 905 884 851 822 798 771 739 724 749 806 863 901 920 927 927 922 910 883 841 797 773 769 764 745 719
169 719 709 723 755 792 823 846 864 883 900 909 906 898 898 906 919 933 943 935 896 839 798 795 812 809 774 736 736 777 827 855 859 861 881 914 941 938 910 881 872 878 885 891 906
164 906 931 946 940 917 893 869 843 821 814 824 833 831 819 808 805 809 811 807 800 807 831 858 864 846 817 792 777 778 797 828 861 888 913 932 937 926 914 911 904 877 833 796 776
158 776 769 772 792 830 865 879 883 902 935 958 951 924 900 893 893 889 880 881 904 942 974 979 958 926 897 877 870 876 887 890 882 872 865 861 861 867 876 877 871 873 893 920 939 950 960 965 955
153 955 933 917 909 897 873 849 839 839 842 846 857 873 886 887 874 847 818 804 809 819 825 833 850 857 836 799 781 800 839 872 885 880 862 839 828 838 866 900 927 938
148 938 932 918 907 899 885 864 855 863 871 862 840 822 809 790 767 756 767 789 805 815 830 848 859 851 827 803 794 811 848 884 904 908 909 917 929 939 947 949 937 903 851 796
143 796 754 737 746 772 802 825 838 840 833 827 842 891 956 1000 1003 977 951 940 941 949 963 974 962 924 882 857 853 856 850 829 799 774 769 793 835 872 887 877 854 827 802
138 802 778 757 742 743 766 798 818 809 777 741 719 710 712 726 755 794 827 843 844 838 830 819 815 826 846 857 858 864 893 939 988 1032 1072 1092 1070 1007 932 878 850 833
133 833 811 783 758 742 741 750 763 773 778 778 775 779 794 815 831 838 841 847 852 852 849 848 849 847 851 875 924 982 1026 1043 1039 1024 1002 971 937 912 906 917 934 949 954 951 941 929 922 921
127 921 921 911 890 868 859 866 880 887 883 873 861 845 828 824 843 871 889 889 885 884 878 854 819 793 788 806 839 870 877 853 816 793 791 796 799 803 810 812 811 821 850 881 893 886 881 885
121 885 893 892 881 865 851 839 830 821 816 822 843 867 874 855 825 804 803 814 825 829 826 817 807 800 800 807 808 798 786 798 844 902 935 930 910 896 892 886 880 878 873 856 839 844 876 909
116 909 918 906 891 887 890 897 911 929 943 946 938 918 892 864 843 835 841 862 892 924 951 969 978 980 980 979 977 969 949 919 887 860 841 831 830 836 844 852 862 880 905 933 950 948 926
110 926 899 881 873 863 845 826 817 818 822 825 828 829 820 803 790 790 795 794 788 789 808 843 878 901 903 890 873 859 846 830 817 818 840 878 914 931 921 890 856 831 815 798 773
105 773 753 750 765 792 829 873 912 931 933 938 951 957 938 904 885 895 920 936 931 907 873 840 818 812 820 835 851 866 877 877 868 858 856 861 865 864 861 863 870 879 890 900 901 890
100 890 876 875 891 909 909 892 873 863 855 839 820 806 801 810 830 851 857 845 832 835 853 873 883 887 886 881 876 878 884 882 866 846 837 842 847 848 851 862 875 883 893 919 956 982 981 954
94 954 920 890 870 864 875 893 898 883 858 841 837 840 842 837 823 802 782 770 767 773 789 818 851 874 885 892 899 897 879 851 822 794 769 757 768 792 808 802 788 784 798 816
89 816 823 816 803 791 776 753 729 718 728 754 782 799 792 763 732 722 746 792 841 887 928 960 976 973 960 940 913 884 865 864 873 878 873 861 848 837 834 838 844 844 839 842 864
84 864 895 914 915 916 938 978 1012 1022 1008 984 960 943 939 951 970 987 989 972 942 921 920 930 928 912 901 907 917 909 885 865 861 869 880 887 883 869 854 842 825 799 779 789
79 789 830 875 906 919 915 897 879 883 910 932 923 894 874 873 884 897 907 913 913 919 937 952 944 911 877 859 847 826 795 769 760 768 787 807 822 829 829 829 831 832 829 823 820 825 833 841
73 841 853 870 879 867 840 819 816 819 813 802 803 822 849 874 897 918 933 940 947 962 978 979 958 930 913 917 930 934 925 916 916 924 924 910 880 838 796 773 788 840 903 947 959
68 959 941 909 884 880 894 911 922 926 923 913 895 877 869 870 868 851 825 807 812 837 861 870 866 865 869 867 849 824 805 806 833 878 920 937 933 923 916 904 884 867 864 871 875 875 874 876
62 876 880 891 902 905 896 889 898 917 931 933 923 905 882 869 880 907 926 925 917 919 935 956 976 985 975 944 907 886 883 883 873 857 847 845 845 839 836 847 865 872 854 821 792 777
57 777 774 780 793 808 818 820 814 805 799 808 837 873 893 890 877 869 865 861 860 871 894 916 923 908 880 852 839 843 856 874 895 915 924 918 908 905 903 888 860 833 815 807 804 803 797 784 767
51 767 757 758 769 791 824 858 874 858 817 776 760 779 823 870 900 912 916 917 911 894 877 868 866 866 869 882 900 912 910 898 886 875 856 826 793 776 792 833 874 895
46 895 900 902 907 900 876 855 863 902 941 956 947 933 916 889 852 828 828 838 838 827 823 836 858 882 903 912 899 869 843 835 841 846 848 848 845 835 825 822 825 827 832 848 871 888 889 882 880
40 880 891 915 942 951 931 892 855 837 833 839 851 860 855 830 799 782 782 791 799 810 829 858 891 910 897 853 802 773 772 786 793 789 782 789 815 845 856 840 818 814 828 843 847
35 847 852 866 880 879 866 858 866 876 869 840 807 790 796 808 811 805 801 810 824 829 815 784 754 744 758 785 807 818 826 834 841 840 833 827 827 833 840 842 832 810 786 768 759 760 772 794 817
29 817 827 823 812 803 799 795 783 760 733 724 740 767 784 790 798 810 815 810 811 829 856 871 873 871 870 865 854 847 845 841 830 819 812 808 801 788 778 776 784 798 807 803 786 770 770 783 790 780 766
23 766 770 802 849 886 901 895 878 856 838 831 837 847 847 833 808 790 795 824 855 866 854 839 842 861 881 889 883 867 846 826 818 830 861 901 930 938 929 918 917 920 912 892 871
18 871 865 876 892 898 887 861 835 818 812 809 808 815 835 860 878 882 871 849 821 795 782 786 802 816 821 817 813 816 823 835 857 889 922 943 944 932 914 894 871 845 810 770 735
13 735 721 734 761 786 802 802 783 755 747 776 833 888 917 920 909 892 877 870 874 882 883 872 854 835 822 815 809 810 824 850 874 883 874 860 850 848 848 844 834 824 826 842 861 880
7 880 909 951 987 990 964 936 916 889 850 823 830 860 880 875 861 854 853 851 850 856 875 905 940 969 982 975 946 900 848 810 798 806 821 844 879 923 959 974 971 953 924 894
2 894 883 900 924 930 913 895 888 881 856 816 790 798 831 862 874 876 883 900 917 923 916 903 889 879 875 869 855 834 822 821 819 806 790 789 807 829 841 838 824 806 793 791 799 803 796
-3 796 783 773 769 776 789 800 796 780 767 767 773 782 806 851 898 912 886 855 850 868 888 898 904 916 931 945 957 960 947 915 876 842 819 809 810 821 838 855 869 884 904
-8 904 925 937 934 922 906 893 887 893 914 936 946 940 928 918 909 898 888 877 858 831 809 807 818 819 799 773 769 799 853 901 920 912 898 897 900 886 850 811 791 796 815 836
-13 836 846 841 829 832 855 888 911 915 902 871 829 790 767 757 753 750 749 745 730 705 687 688 714 760 813 855 878 889 900 911 916 913 905 887 853 819 807 822 841 845 838 835
-19 835 837 833 823 815 813 810 799 787 788 808 837 858 863 866 884 914 933 928 906 887 877 865 847 832 825 819 809 801 803 809 807 795 785 790 808 833 862 894 921 928 908 869 829 795
-24 795 761 730 710 707 711 707 692 674 661 661 682 723 769 800 807 804 802 800 796 792 796 809 827 847 869 887 895 888 865 830 796 777 783 808 837 862 883 899 904 893 875 858 848
-29 848 841 837 837 838 838 838 837 834 828 826 837 853 858 847 835 831 834 839 853 877 901 909 912 922 934 923 884 846 832 837 841 835 825 811 796 793 809 833 844 835 819 807 796 783 773 767
-35 767 761 753 745 742 741 737 733 735 744 753 761 771 789 819 854 879 887 880 865 850 842 854 885 915 922 913 911 924 936 934 920 901 876 850 838 844 853 850 843 849 860 854 824 787 764 759 765 776
-41 776 791 807 817 820 817 810 801 789 776 766 764 769 780 795 822 857 889 903 902 901 909 923 939 948 942 917 886 863 847 830 809 794 791 798 809 823 833 831 819 811 815 822 820 813 818
-46 818 840 867 886 893 893 888 880 869 857 843 828 814 807 810 818 819 808 789 777 777 783 789 795 800 804 801 800 809 830 854 865 863 860 868 882 887 878 866 864 860 834 784 735 705 691 679 672 681
-52 681 711 751 782 793 782 764 758 774 797 810 809 803 793 774 751 732 719 705 694 703 734 772 808 842 875 900 914 924 935 935 914 880 851 826 799 773 766 783
-57 783 809 834 853 865 862 844 826 824 841 865 890 911 923 916 895 875 861 844 813 777 759 767 784 789 785 790 808 819 815 814 836 873 895 887 855 812 766 730 716 730
-62 730 760 790 819 846 859 850 831 819 819 820 824 835 849 845 814 777 762 772 785 779 757 739 750 798 862 907 909 882 856 841 828 804 779 767 767 764 756 754 762 767 761 755 762
-67 762 777 784 773 755 749 755 767 782 802 823 832 820 791 762 744 737 732 720 703 688 690 710 742 771 788 789 773 747 726 724 743 769 792 814 839 859 866 860 853 845 831 810
-72 810 789 774 763 759 765 782 797 802 805 818 835 842 832 819 819 836 854 859 849 832 824 831 844 850 840 820 801 792 790 787 774 758 756 779 816 846 856 854 851 850 855 866 882 893
-77 893 893 887 884 883 883 880 871 855 837 830 835 839 827 806 793 790 786 770 752 750 773 809 836 842 834 834 850 865 857 825 790 768 759 752 749 755 765 768 761 757 769 796 820 821 799 773 762 767
-83 767 776 776 762 741 723 723 747 784 811 818 811 804 798 793 789 784 773 757 745 743 750 767 799 838 862 859 847 848 858 855 835 815 805 796 777 760 759 767 768 759 748 735 713 685 665
-89 665 662 670 675 672 662 657 672 714 768 801 801 781 769 772 781 793 810 829 835 827 816 816 825 832 831 829 823 805 775 750 750 771 791 796 796 806 832 860 874 866 841 803 759 718 690
-94 690 687 713 759 806 836 846 847 850 855 857 853 844 833 822 812 809 814 822 829 841 863 887 900 894 877 859 847 844 852 864 869 862 850 842 836 826 814 813 822 830 834 837 846 857 860 849 827 803
-100 803 789 789 797 804 807 807 802 787 769 758 757 758 757 754 751 744 736 742 766 793 806 806 807 815 823 831 844 864 887 908 924 932 925 910 898 890 872 838 804 787 786 785 773 754 734 714 695
$$ [...]
-1604F80
##END=	
##END=	
