##TITLE=	8Y1wn2RoTxil7YurHE8Osw.21.ser
TM-VI-199, CD3OD cosy

##JCAMP-DX=	6.0	$$ MestReNova 14.3.0-30573
##DATA TYPE=	LINK
##BLOCK_ID=	1
##BLOCKS=	2    
##ORIGIN=	Mestrelab Research S.L.
##OWNER=	hrzepa
##$MNOVA/LINK_BLOCK_TYPE=	ITEM	$$ NMR Spectrum
##$MNOVA/ITEM/POLYGON=	(XY..XY)
5321,5835
8722,5835
8722,8208
5321,8208
5321,5835
##$MNOVA/ITEM/Z=	0
##$MNOVA/ITEM/ANGLE=	0
##TITLE=	8Y1wn2RoTxil7YurHE8Osw.21.ser
##JCAMP-DX=	6.0	$$ MestReNova 14.3.0-30573
##BLOCK_ID=	2
##DATA TYPE=	MNOVA NMR VIEW DATA
##DATA CLASS=	MNOVA VIEW DATA
##$MNOVA/2D/THRESHOLD=	44.423748016357421875
##$MNOVA/ITEM/ZOOM/X=	-0.98001264966690615488,	11.003459999979801509
##$MNOVA/ITEM/ZOOM/Y=	-0.98001264966690615488,	11.003459999979801509
##END=	
##TITLE=	8Y1wn2RoTxil7YurHE8Osw.21.ser
##JCAMP-DX=	6.0	$$ MestReNova 14.3.0-30573
##BLOCK_ID=	3
##DATA TYPE=	nD NMR SPECTRUM
##DATA CLASS=	NTUPLES
##NUMDIM=	2
##ORIGIN=	Bruker BioSpin GmbH
##OWNER=	nmr
##.OBSERVE FREQUENCY=	400.41200205000001233
##.OBSERVE NUCLEUS=	^1H
##.SOLVENT NAME=	MeOD
##.PULSE SEQUENCE=	cosygpqf
##LONGDATE=	2021/12/04 15:38:51.000
##.ACQUISITIONMODE=	SIMULTANEOUS (DQD)
##$ORIGINAL FORMAT=	Bruker XWIN-NMR
##$MNOVA/SCALES_VERSION=	9
##$PARAMETER FILE=	(acqu2s, ASCII, /private/var/folders/f6/rjf_tdyn2v98c5c0wvkgn4s80000gn/T/8Y1wn2RoTxil7YurHE8Osw/21/acqu2s, 0)
$$ ##TITLE= Parameter file, TOPSPIN		Version 3.2
$$ ##JCAMPDX= 5.0
$$ ##DATATYPE= Parameter Values
$$ ##NPOINTS= 121	$$ modification sequence number
$$ ##ORIGIN= Bruker BioSpin GmbH
$$ ##OWNER= nmr
$$ $$ 2021-12-04 15:47:46.698 +0000  nmr@CZC10666PP
$$ $$ /opt/topspin/data/agmb/nmr/Dec04-2021/21/acqu2s
$$ $$ process /opt/topspin3.2/prog/mod/go
$$ ##$ACQT0= 0
$$ ##$BF1= 400.41
$$ ##$FnMODE= 1
$$ ##$NUC1= <1H>
$$ ##$NusJSP= 0
$$ ##$NusT2= 1
$$ ##$NusTD= 120
$$ ##$O1= 2002.04999998732
$$ ##$SFO1= 400.41200205
$$ ##$SW= 12.0068636381483
$$ ##$SW_h= 4807.69230769231
$$ ##$TD= 120
$$ ##END=
$$ 
##$PARAMETER FILE=	(acqus, ASCII, /private/var/folders/f6/rjf_tdyn2v98c5c0wvkgn4s80000gn/T/8Y1wn2RoTxil7YurHE8Osw/21/acqus, 0)
$$ ##TITLE= Parameter file, TOPSPIN		Version 3.2
$$ ##JCAMPDX= 5.0
$$ ##DATATYPE= Parameter Values
$$ ##NPOINTS= 12	$$ modification sequence number
$$ ##ORIGIN= Bruker BioSpin GmbH
$$ ##OWNER= nmr
$$ $$ 2021-12-04 15:47:51.278 +0000  nmr@CZC10666PP
$$ $$ /opt/topspin/data/agmb/nmr/Dec04-2021/21/acqus
$$ $$ process /opt/topspin3.2/prog/mod/shimcntl
$$ ##$ACQT0= 1000000
$$ ##$AMP= (0..31)
$$ 100 100 100 100 100 100 100 100 100 100 100 100 100 100 100 100 100 100
$$ 100 100 100 100 100 100 100 100 100 100 100 100 100 100
$$ ##$AMPCOIL= (0..19)
$$ 0 0 0 0 0 0 0 0 0 0 0 0 0 0 0 0 0 0 0 0
$$ ##$ANAVPT= -1
$$ ##$AQSEQ= 0
$$ ##$AQ_mod= 3
$$ ##$AUNM= <au_zg>
$$ ##$AUTOPOS= <31 >
$$ ##$BF1= 400.41
$$ ##$BF2= 400.41
$$ ##$BF3= 400.41
$$ ##$BF4= 400.41
$$ ##$BF5= 400.41
$$ ##$BF6= 400.41
$$ ##$BF7= 400.41
$$ ##$BF8= 400.41
$$ ##$BYTORDA= 0
$$ ##$CAGPARS= (0..11)
$$ 0 0 0 0 0 0 0 0 0 0 0 0
$$ ##$CFDGTYP= 0
$$ ##$CFRGTYP= 9
$$ ##$CHEMSTR= <none>
$$ ##$CNST= (0..63)
$$ [...]
$$ 0 0 0 0 0 0 0 0 0 0 0 0 0 0 0 0 0 0 0 0 0 0 0 0 0 0 0 0 0 0 0 0 0 0 0 0
$$ 0 0 0 0
$$ ##$ShimPowMaxUC= (0..63)
$$ 130000 130000 130000 130000 130000 130000 130000 130000 130000 130000 130000
$$ 130000 130000 130000 130000 130000 130000 130000 130000 130000 0 0 0 0
$$ 0 0 0 0 0 0 0 0 0 0 0 0 0 0 0 0 0 0 0 0 0 0 0 0 0 0 0 0 0 0 0 0 0 0 0 0
$$ 0 0 0 0
$$ ##$ShimPowMaxUG= (0..63)
$$ 524287 524287 524287 524287 524287 524287 524287 524287 524287 524287 524287
$$ 524287 524287 524287 524287 524287 524287 524287 524287 524287 0 0 0 0
$$ 0 0 0 0 0 0 0 0 0 0 0 0 0 0 0 0 0 0 0 0 0 0 0 0 0 0 0 0 0 0 0 0 0 0 0 0
$$ 0 0 0 0
$$ ##$ShimPowRcbType= 3
$$ ##$ShimPowRes= (0..63)
$$ 1e-20 1e-20 1e-20 1e-20 1e-20 1e-20 1e-20 1e-20 1e-20 1e-20 1e-20 1e-20
$$ 1e-20 1e-20 1e-20 1e-20 1e-20 1e-20 1e-20 1e-20 0 0 0 0 0 0 0 0 0 0 0 0
$$ 0 0 0 0 0 0 0 0 0 0 0 0 0 0 0 0 0 0 0 0 0 0 0 0 0 0 0 0 0 0 0 0
$$ ##$ShimPowRng0= (0..63)
$$ 1 1 1 1 1 1 1 1 1 1 1 1 1 1 1 1 1 1 1 1 0 0 0 0 0 0 0 0 0 0 0 0 0 0 0 0
$$ 0 0 0 0 0 0 0 0 0 0 0 0 0 0 0 0 0 0 0 0 0 0 0 0 0 0 0 0
$$ ##$ShimPowRng1= (0..63)
$$ 1 1 1 1 1 1 1 1 1 1 1 1 1 1 1 1 1 1 1 1 0 0 0 0 0 0 0 0 0 0 0 0 0 0 0 0
$$ 0 0 0 0 0 0 0 0 0 0 0 0 0 0 0 0 0 0 0 0 0 0 0 0 0 0 0 0
$$ ##$ShimPowRng2= (0..63)
$$ 1 1 1 1 1 1 1 1 1 1 1 1 1 1 1 1 1 1 1 1 0 0 0 0 0 0 0 0 0 0 0 0 0 0 0 0
$$ 0 0 0 0 0 0 0 0 0 0 0 0 0 0 0 0 0 0 0 0 0 0 0 0 0 0 0 0
$$ ##$ShimPowRng3= (0..63)
$$ 1 1 1 1 1 1 1 1 1 1 1 1 1 1 1 1 1 1 1 1 0 0 0 0 0 0 0 0 0 0 0 0 0 0 0 0
$$ 0 0 0 0 0 0 0 0 0 0 0 0 0 0 0 0 0 0 0 0 0 0 0 0 0 0 0 0
$$ ##$ShimSysFunc= (0..63)
$$ 1 2 3 4 5 7 9 11 15 16 8 10 12 14 6 17 13 18 19 20 0 0 0 0 0 0 0 0 0 0
$$ 0 0 0 0 0 0 0 0 0 0 0 0 0 0 0 0 0 0 0 0 0 0 0 0 0 0 0 0 0 0 0 0 0 0
$$ ##$ShimSysMatrix= 0
$$ ##$ShimSysType= 1
$$ ##$TFXNUM= 0
$$ ##$TRIPLO2= 0
$$ ##$VTU= 2
$$ ##$VTUETH= <149.236.99.20>
$$ ##$VTUTY= <no>
$$ ##$WBREFAM= (0..15)
$$ 135 116 100 100 100 100 100 100 100 100 100 100 100 100 100 100
$$ ##$WBREFLM= (0..15)
$$ 0 0 0 0 0 0 0 0 0 0 0 0 0 0 0 0
$$ ##$WBREFPH= (0..15)
$$ 71.66 -68.25 0 0 0 0 0 0 0 0 0 0 0 0 0 0
$$ ##$WBSGU= (0..15)
$$ 0 0 0 0 0 0 0 0 0 0 0 0 0 0 0 0
$$ ##$XFAC= 2
$$ ##END=
$$ 
##$DECIM=	4160
##$DSPFVS=	20
##.ACQUISITIONSCHEME=	NOT PHASESENSITIVE
##NTUPLES=	nD NMR SPECTRUM
##VAR_NAME=	FREQUENCY1,	FREQUENCY2,	SPECTRUM
##SYMBOL=	F1,	F2,	Y
##.NUCLEUS=	1H,	1H
##.OBSERVE FREQUENCY=	400.41200205000001233,	400.41200205000001233
##VAR_TYPE=	INDEPENDENT,	INDEPENDENT,	DEPENDENT
##VAR_FORM=	AFFN,	AFFN,	ASDF
##VAR_DIM=	512,	512,	262144
##UNITS=	HZ,	HZ,	ARBITRARY UNITS
##FIRST=	4405.895418600002813,	4405.895418600002813,	0.37190446257591247559
##LAST=	-392.40686505384644533,	-392.40686505384644533,	0.48377618193626403809
##MIN=	-392.40686505384644533,	-392.40686505384644533,	0.0016711190110072493553
##MAX=	4405.895418600002813,	4405.895418600002813,	2448.123046875
##FACTOR=	1,	1,	0.0041749099255074147152
##PAGE=	F1=4405.9
##FIRST=	4405.895418600002813,	4405.895418600002813,	0.37190446257591247559
##DATA TABLE=	(F2++(Y..Y)), PROFILE
$$ [...]
##PAGE=	F1=-2955.88
##FIRST=	4405.895418600002813,	4405.895418600002813,	0
##DATA TABLE=	(F2++(Y..Y)), PROFILE
$$ plain form
1833 159 62 40 44 66 171 101 132 77 120 205 653 652 649 273 50 80 239 79 164 63 86 179 150 206 220 223 110 32 69 62 96 176 111
1523 111 220 237 84 74 112 161 162 212 86 44 58 188 74 236 164 178 92 186 215 821 470 146 90 131 111 87 100 61 89 104 77
1232 77 171 123 73 158 87 147 185 97 109 127 166 154 213 170 35 59 98 88 180 55 68 97 79 131 60 20 91 9 112 73 101 171 131 184
913 184 169 135 188 278 114 67 134 229 112 14 31 132 231 158 50 167 81 197 292 405 346 346 395 476 70 314 128 109 182 120 188
622 188 99 202 164 42 82 173 257 449 802 1529 1328 321 314 69 144 49 45 50 7 134 127 95 99 117 61 24 232 94 199 48 70
331 70 235 196 247 273 115 163 79 46 69 89 88 165 39 132 94 98 67 71 78 128 116 100 65 130 313 152 132 221 247 201 97 79 106 71 36
2 36 79 118 110 131 119 8 52 119 163 146 178 181 119 57 167 129 80 107 54 78 61 94 282 188 183 137 114 134 194 71 90 55 98 189 88 80
-336 80 52 44 97 88 70 82
$$ packed form
1833A59r7k2MK2J05p0L1n5M3Q5M48jll76k23L0J59j60Q5j01K3R3k9N6J4Lj13p8L7pL4Q0o5
1523A11J09J7j53j0L8M9JN0j26m2J4J30j14J62p2J4q6R4K9O06l51l24n6M1k0k4J3l9K8J5k7
1232G7R4m8n0Q5p1O0L8q8J2J8L9j2N9m3j35K4L9j0R2j25J3K9j8N2p1m0P1q2J03l9K8P0m0N3
913A84j5l4N3R0j64m7O7R5j17r8J7J01R9p3j08J17q6J16R5J13n9%M9Q1m06K44j86j9P3o2O8
622A88q9J03l8j22M0R1Q4J92L53P27k01j007pk45P5r5mNm3J27pl2MJ8n6l7K08j38J05j51K2
331G0J65l9N1K6j58M8q4l3K3K0jP7j26R3l8Ml1MPN0j2j6l5O5J83j61k0Q9K6m6j04j8K7l5l5
2C6M3L9qK1j2j11M4O7M4j7L2Lo2o2J10l8m9K7n3K4j7L3J88r4nm6k3K0O0j23J9l5M3R1j01q
-336H0k8qN3rj8J2
-392H2
##PAGE=	F1=-2974.66
##FIRST=	4405.895418600002813,	4405.895418600002813,	0
##DATA TABLE=	(F2++(Y..Y)), PROFILE
$$ plain form
4406 66 66 71 74 32 150 187 73 90 121 58 125 146 5 128 11 49 193 164 63 98 84 105 13 88 95 99 39 61 73 90 68 56 203 74
4087 74 82 23 27 155 134 81 87 97 38 227 303 107 44 66 149 194 143 48 92 98 148 35 258 226 163 124 42 78 195 163 109 28 94 113
3767 113 116 97 190 212 87 217 65 92 153 62 62 18 92 223 236 36 90 64 107 66 91 124 112 68 139 125 89 111 116 81 131 132 129 5
3448 5 105 172 101 72 99 175 150 179 161 147 163 46 98 69 101 159 212 125 112 68 97 65 152 171 151 202 232 235 190 209 194 119 122 99 105 64
3110 64 139 147 123 210 79 101 100 164 105 37 55 101 205 10 78 107 281 226 151 156 115 54 118 67 47 59 121 195 199 42 51 60 122 163 104 45
2772 45 54 74 182 226 196 129 167 95 219 178 194 55 83 101 151 79 43 79 135 188 85 9 119 222 169 82 152 227 189 146 38 49
2472 49 72 33 86 100 94 40 52 70 69 50 34 99 124 122 158 142 69 58 41 156 209 156 147 163 46 105 195 106 105 258 186 122 81 93 94 65 26
2124 26 40 73 67 55 136 57 94 5 64 65 38 211 163 48 21 598 984 291 226 86 147 41 90 88 136 68 112 87 81 237 127 77 59
$$ packed form
4406F6%NLm2J18L7j14J7L1o3O7K1j41J23j17L8J44k9j01L5j4K1r2P5PMo0K2J2J7k2j2J47j29
4087G4Qn9MJ28k1n3OJ0n9J89P6j96o3K2Q3M5n1r5M4ON0j13K23l2o3l9q2L6J17l2n4q1O6J9
3767A13Lj9R3K2j25J30j52K7O1r1%m4P4J31J3k00N4k6M3m1K5L3j2m4P1j4l6K2Nl5N0Jlj24
3448EJ00O7p1k9K7P6k5K9j8j4J6j17N2k9L2N8N3q7j3m4K9l2Q7J9k0N1L0Lm5J9j5p5Lk3Om1
3110F4P5Qk4Q7j31K2jO4n9o8J8M6J04j95O8K9J74n5p5Nm1o1O4n1k0J2O2P4Mj57RRO2M1n9n9
2772D5RK0J08M4l0o7L8p2J24m1J6j39K8J8N0p2l6L6N6N3j03p6J10J03n3q7P0P5l8m3j08J1
2472D9K3l9N3J4on4J2J8jj9j6O5K5kL6j6p3j1j7J15N3n3rJ6j17N9R0q9jJ53p2o4m1J2Jk9l9
2124B6J4L3oj2Q1p9L7q9N9Jk7J73m8j15k7N77L86o93o5j40O1j06M9kM8o8M4k5oJ56j10n0j8
$$ plain form
1814 59 48 117 182 95 151 57 249 479 1079 903 795 250 54 84 234 91 166 64 79 121 112 234 220 232 111 42 95 68 84 157
1533 157 77 178 203 41 98 137 184 147 189 79 95 93 169 83 220 156 163 67 177 271 754 360 164 88 138 98 106 152 45 124 118 86
1232 86 163 153 80 165 105 134 170 128 109 134 171 201 203 122 18 72 101 43 166 34 53 81 71 147 76 20 94 15 111 113 115 174 144 153 134 179
894 179 210 283 120 92 175 208 79 50 29 163 253 167 75 158 48 147 274 400 360 447 474 575 118 343 120 150 141 107 194 111 196
603 196 162 28 98 241 158 235 498 731 776 202 299 60 146 52 30 56 18 166 103 68 108 125 49 66 257 97 213 90 131 279
321 279 187 215 271 72 136 33 57 37 58 53 186 76 120 77 125 102 65 70 155 134 101 45 174 341 153 124 204 261 211 95 87 91 50
11 50 46 59 103 105 127 96 8 42 118 151 145 212 141 128 58 156 154 70 94 60 58 101 112 262 182 172 155 166 160 230 58 110 99 50 188 136 87 49
-345 49 51 78 77 84 98
$$ packed form
1814E9j1O9O5q7N6r4J92K30O00j76j08n45j96L0J50j43P5j02J5M2rJ22j4J2j21o9N3k7J6P3
1533A57q0J01K5j62N7L9M7l7M2j10J6kP6q6J37o4Pr6J10R4M83l94j96p6N0m0QM6j07P9ol2
1232H6P7j0p3Q5o0K9L6m2j9K5L7L0Kq1j04N4K9n8J23j32J9K8j0P6p1n6P4p9R6KKN9l0Rj9M5
894A79L1P3j63k8Q3L3j29k9k1J34R0q6r2Q3j10R9J27J26m0Q7K7J01m57K25k23L0rl4Q7q3Q5
603A96l4j34P0J43q3P7K63K33M5n74R7k39Q6r4k2K6l8J48o3l5M0J7p6J7J91j60J16j23M1J48
321B79r2K8N6j99O4j03K4k0K1nJ33j10M4m3M8k3l7NQ5k1l3n6J29J67j88k9Q0N7n0j16qMm1
11E0mJ3M4KK2l1q8L4P6L3oO7p1j3p0R8kq4K4l4kM3J1J50q0j0j7J1oP0j72N2j1m9J38n2m9l8
-345D9KK7jPJ4
-392I8
##PAGE=	F1=-2993.44
##FIRST=	4405.895418600002813,	4405.895418600002813,	0
##DATA TABLE=	(F2++(Y..Y)), PROFILE
$$ plain form
4406 89 74 69 76 60 161 186 68 51 131 87 152 140 22 138 26 59 229 170 53 94 74 100 48 79 121 127 36 39 106 110 86 74 195 96
4087 96 91 59 72 160 124 63 84 114 32 231 295 59 75 35 152 176 137 59 104 115 135 47 246 218 156 97 71 43 187 129 72 75 90 134
3767 134 138 132 182 176 96 199 56 82 167 42 70 46 118 207 229 62 137 92 118 35 117 95 75 60 168 155 103 76 123 79 114 154 127 9
3448 9 96 156 94 70 89 158 144 186 171 167 227 95 55 47 106 119 200 119 120 109 80 65 172 192 178 205 209 229 188 217 173 58 81 120 161 92
3110 92 128 154 109 193 125 153 115 149 95 57 38 146 192 31 68 96 302 207 153 153 107 25 111 47 35 31 90 196 214 50 56 71 123 133
2791 133 84 36 93 87 220 269 248 137 163 61 172 167 194 96 78 99 173 73 34 94 117 166 70 15 164 195 143 85 161 249 200 165 62
2481 62 83 94 65 49 90 76 50 43 94 94 100 65 90 111 121 174 110 52 78 58 198 237 159 142 138 30 117 198 94 98 237 209 139 55 82 109
2143 109 41 22 59 76 72 73 134 41 99 44 40 47 34 213 171 121 48 613 742 216 168 125 117 74 103 131 168 85 175 103 114 243 83 98
$$ packed form
4406H9j5nPj6J01K5j18j7Q0m4O5j2j18J16j12L3J70n9j17M1k0K6n2L1M2Or1LO7Mk4j2J21r9
4087I6nl2J3Q8l6o1K1L0q2J99O4k36J6m0J17K4l9p8M5J1K0q8J99k8o2n9k6k8J44n8n7LJ5M4
3767A34MoN0oq0J03j43K6Q5j25K8k4P2Q9K2j67P5m5K6q3Q2k2k0j5J08j3n2k7M7m4L5M0k7j18
3448IQ7O0o2k4J9O9j4M2j5mO0j32m0qN9J3Q1q1Jj1k9j5J07K0j4K7MK0m1K9m4j15K3L9M1o9
3110I2L6K6m5Q4o8K8l8L4n4l8j9J08M6j61L7K8K06r5n4%m6q2Q6o4j2mN9J06J8j64OJ5N2J0
2791A33m9m8N7oJ33M9k1j11K6j02J11nK7r8j8K1P4j00l9O0K3M9r6n5J49L1n2n8P6Q8m9l5j03
2481F2K1J1k9j6M1j4k6pN1%Ol5K5K1J0N3o4n8K6k0J40L9p8j7mj08Q7Q1j04MJ39k8p0q4K7K7
2143A09o8j9L7J7mJO1r3N8n5mPj3J79m2n0p3N65J29n26m8m3qm3K9K8L7q3R0p2J1J29j60J5
$$ plain form
1824 98 60 67 161 173 104 167 50 377 714 1353 1025 822 213 40 74 205 114 161 68 86 57 89 247 212 226 103 65 111 71 72 127
1533 127 46 144 158 37 124 147 196 132 150 89 151 135 148 83 206 145 142 59 160 307 634 202 180 80 139 88 147 186 38 142 111
1241 111 83 148 172 82 151 109 118 156 146 111 141 171 240 187 65 13 85 100 5 148 16 85 66 93 167 97 25 89 35 103 142 119 165 143
922 143 120 102 211 230 266 114 106 216 205 71 84 62 180 259 162 95 144 42 104 233 355 367 519 528 650 224 387 180 226 81
640 81 146 201 109 178 141 24 161 304 208 1071 1970 1417 598 114 237 66 144 59 81 78 41 190 71 69 100 121 96 112 251 73
359 73 226 128 183 294 156 177 252 54 114 19 96 70 37 12 187 97 97 57 146 139 60 60 166 151 103 21 209 334 128 118 169 263 205
49 205 90 74 75 55 48 44 75 102 125 72 20 36 108 129 145 252 86 134 56 136 168 68 96 64 36 125 144 237 178 149 161 193 176 249 54
-280 54 119 165 32 177 161 90 28 86 66 72 92 104
$$ packed form
1824I8l8PR4J2o9O3j17L27L37O39l28k03o09j73L4J31r1M7r3J8k9L2J58l5J4j23l8M6m0JN5
1533A27q1R8J4j21Q7K3M9o4J8o1O2j6J3o5J23o1lq3J01J47L27m32k2j00N9n1N9L9j48J04l1
1241A11k8O5K4r0O9m2RL8j0l5L0L0O9n3j22n2P2J5r5J43j32O9j9K7P4p0p2O4n4O8L9k3M6k2
922A43k3j8J09J9L6j52qJ10j1j34J3k2J18P9r7o7M9j02O2J29J22J2J52RJ22m26J63k07M6j45
640H1O5N5r2O9l7j17J37J43r6Q63Q99n53q19m84J23j71P8q5K2ll7J49j19kL1K1k5J6J39j78
359G3J53r8N5J11j38K1P5j98O0r5P7k6l3k5J75r0%m0Q9pp9%J06j5m8q2J88J25k06j0N1R4n8
49B05j15j6Jk0pmL1K7K3n3n2J6P2K1J6J07j66M8p8Q0L2j00K8l2k8Q9J9R3n9k9J2L2j7P3j95
-280E4O5M6j33J45j6p1o2N8k0OK0J2
-392A04
##PAGE=	F1=-3012.22
##FIRST=	4405.895418600002813,	4405.895418600002813,	0
##DATA TABLE=	(F2++(Y..Y)), PROFILE
$$ plain form
4406 100 89 64 76 80 158 181 73 12 136 122 152 116 37 139 53 90 248 167 40 81 60 93 89 87 146 146 34 59 141 126 91 90 181 113
4087 113 97 135 145 157 108 38 71 119 36 222 271 19 140 27 137 151 132 88 112 112 99 56 211 186 142 88 97 12 165 102 66 121
3786 121 74 160 150 147 153 125 107 180 53 61 170 45 83 92 132 187 228 98 181 117 119 22 135 85 81 62 195 192 113 37 141 102 82 159 127
3458 127 8 87 134 91 56 79 133 132 165 166 165 257 151 46 66 113 88 181 121 108 143 90 79 180 189 185 191 168 204 174 203 131 29 43 140
3129 140 211 139 102 133 75 138 159 190 126 124 66 88 75 183 167 56 78 71 288 189 159 145 95 17 113 32 40 16 63 185 214 59 54 83
2810 83 114 95 69 39 132 97 247 287 271 133 141 27 107 163 178 117 62 83 178 84 40 97 97 144 61 27 189 153 100 64 151 245 188 159
2490 159 82 107 122 104 6 82 68 58 98 147 110 140 100 71 89 116 182 91 64 91 68 211 253 166 117 105 27 129 190 69 79 191 223
2180 223 147 28 74 116 27 30 74 67 83 89 127 37 103 85 18 44 48 200 168 198 79 737 688 178 147 159 87 109 148 168 184 93 215 123
$$ packed form
4406A00j1k5J2MP8K3j08o1J24j4L0l6p9J02q6L7J58q1j27M1k1L3mkN9%j12K5Q2j5l5jR1o8
4087A13j6L8J0J2m9p0L3M8q3J86M9k52J21j13J10J4j9m4K4%j3m3J55k5m4n4Rq5J53o3l6N5
3786A21m7Q6j0lOk8j8P3j27QJ09j25L8RM0N5M1j30Q3o4Kr7J13n0mj9J33lp9p6J04l9k0P7l2
3458A27j19P9M7m3l5K3N4jL3JjR2j06j05K0M7k5R3o0j3L5n3j1J01RmOk3L6l0K9p2j02J4R7
3129A40P1p2l7L1n8O3K1L1o4kn8K2j3J08j6j11K2pK17r9l0j4n0p8R6q1Qk4M7J22K9j55nK9
2810H3L1j9k6l0R3l5J50M0j6j38Qj14Q0N6J5o1n5K1R5r4m4N7%M7q3l4J62l6n3l6Q7R4n7k9
2490A59p7K5J5j8r8P6j4j0M0M9l7L0m0k9J8K7O6r1k7K7k3J43M2q7m9j2p8J02O1j21J0J12L2
2180B23p6j19M6M2q9LM4pJ6OL8r0O6j8o7K6MJ52l2L0j19O58m9n10l1J2p2K2L9K0J6r1J22r2
$$ plain form
1861 123 150 233 38 99 40 91 186 142 122 171 50 449 795 1346 922 683 179 21 53 153 126 145 75 107 8 84 242 190 204
1589 204 76 85 115 69 64 91 36 139 114 85 142 139 191 126 104 115 201 172 126 75 195 127 122 66 138 295 427 14 200 73 137 80 183
1279 183 191 78 143 89 69 150 178 71 120 95 101 143 149 116 148 161 260 165 10 34 100 100 50 130 11 127 61 119 190 117 31 79 66 90
960 90 150 116 145 132 95 81 222 234 226 99 104 245 216 70 101 87 180 246 145 105 123 61 80 179 284 359 542 548 687 333 455 319
659 319 317 39 200 197 81 151 104 59 233 317 343 1751 3137 2506 1227 218 185 100 145 70 121 90 62 205 58 114 75 104 149
387 149 152 217 46 239 160 216 274 110 143 225 94 107 71 127 103 27 31 172 105 63 44 158 168 64 49 155 163 106 15 233 295 80
86 80 120 123 251 184 97 50 62 75 47 53 43 103 124 65 39 36 96 103 142 280 24 142 53 111 159 79 112 62 18 132 168 205 170 116 150 189
-252 189 182 244 54 118 220 94 155 159 100 14 134 64 74 90 100
$$ packed form
1861A23K7Q3j95O1n9N1R5m4k0M9j21L99L46N51m24k39n04j58L2J00k7J9p0L2r9P6J58n2J4
1589B04j28RL0m6nK7n5J03k5k9N7lN2o5k2J1Q6k9m6n1J20o8nn6P2J57J32m13J86j27O4n7J03
1279A83Qj13O5n4k0Q1K8j07M9k5OM2Ol3L2J3R9r5j55K4O6%n0Q0j19J16o6N8P1p3q6M8j3K4
960I0O0l4K9j3l7j4J41J2qj27NJ41k9j46L1j4R3O6j01m0J8o2J9R9J05P5J83OJ39l54J22j36
659C19kk78J61lj16P0m7m5J74Q4K6J408J386o31j279j009l3q5M5p5N1l1k8J43j47N6l9K9M5
387A49LO5j71J93p9N6N8j64L3Q2j31J3l6N6k4p6MJ41o7m2j9J14J0j04j5J06Qn7r1K18O2k15
86H0M0LJ28o7q7m7J2J3k8Oj0O0K1n9k6lO0PL9J38k56J18q9N8M8q0L3n0m4J14L6L7l5n4L4L9
-252A89pO2j90O4J02j26O1Mn9q6J20p0J0J6J0
-392A00
##PAGE=	F1=-3031
##FIRST=	4405.895418600002813,	4405.895418600002813,	0
##DATA TABLE=	(F2++(Y..Y)), PROFILE
$$ plain form
4406 94 102 58 80 86 141 169 86 18 136 139 127 79 45 130 80 118 249 158 43 62 41 92 119 110 162 146 24 96 168 133 83 102 159 131 106
4077 106 195 202 157 91 16 56 113 45 201 238 21 194 69 109 122 126 116 112 94 54 64 164 132 114 96 116 47 146 76 91 155 52 185
3767 185 157 139 113 75 117 161 57 44 163 39 110 139 133 165 224 129 210 136 120 25 148 104 110 64 217 227 116 6 167 141 46 154
3467 154 123 6 79 109 87 31 64 100 119 120 150 140 250 202 77 94 120 65 160 137 80 163 117 102 181 164 172 162 112 166 152 170 85 62
3148 62 44 156 249 186 66 96 30 95 180 205 129 94 35 122 118 196 128 72 104 40 244 183 169 132 84 28 126 39 58 48 50 167 199 68
2828 68 43 91 100 58 76 59 165 105 256 273 261 118 103 48 35 161 150 118 61 56 168 105 55 89 95 120 69 28 192 108 55 40 123 218
2509 218 156 131 98 118 144 141 57 85 67 65 155 191 114 159 129 49 63 112 179 87 86 89 81 197 255 177 96 72 39 139 173 39 56 130 225 155
2171 155 4 68 113 37 49 85 50 100 102 118 49 112 118 31 53 51 173 153 265 107 821 735 182 157 182 60 142 197 196 184 91 221 139
$$ packed form
4406I4Qm4K2ON5K8q3o8J18Lj2m8l4Q5n0L8J31r1j15J9k1N1K7rN2j6j22P2P2l5n0J9N7k8k5
4077A06Q9Pm5o6p5M0N7o8J56L7k17J73j25M0J3Mj0mj8m0J0J00l2j8j8K0o9R9p0J5O4j03J33
3767A85k8j8k6l8M2M4j04j3J19j24P1K9oL2N9r5Q1p4j6r5J23m4Om6J53J0j11j10J61k6r5J08
3467A54l1j17P3L0k2n6L3L6J9JL0j0J10m8j25J7K6n5R5k3n7Q3m6j5P9j7Qj0n0N4j4J8q5k3
3148F2j8J12R3o3j20L0o6O5Q5K5p6l5n9Q7mP8o8n6L2o4K04o1j4l7m8n6R8q7J9j0KJ17L2j31
2828F8k5M8Rm2J8j7J06o0J51J7j2j43j5n5j3J26j1l2n7nJ12o3n0L4OK5n1m1J64q4n3j5Q3R5
2509B18o2k5l3K0K6lq4K8j8kR0L6p7M5l0q0J4M9O7r2jLqJ16N8p8q1k4l3J00L4j34J7P4R5p0
2171A55j51O4M5p6J2L6l5N0KJ6o9O3Oq7K2kJ22k0J12j58P14q6n53k5K5j22Q2N5jj2r3J30q2
$$ plain form
1861 139 182 211 5 69 25 120 189 98 142 157 70 419 664 1002 612 366 191 17 30 84 126 116 82 131 53 86 217 151 170 38
1579 38 96 109 63 62 58 48 155 88 126 145 118 164 123 67 147 235 195 102 63 186 101 107 73 121 266 251 224 225 76 136 74 199 163 134 131
1251 131 60 48 178 176 48 81 69 81 124 135 119 150 140 256 141 35 59 120 104 84 115 18 158 63 136 212 134 36 73 104 75 132
950 132 106 125 119 79 72 206 218 172 84 88 252 223 57 101 100 162 213 123 102 98 84 76 124 206 331 509 530 677 418 537 495 418 143 248
631 248 166 26 148 50 89 274 248 394 1790 3138 2455 1284 266 162 166 133 76 133 84 76 211 80 163 38 76 184 180 163
368 163 87 252 184 226 220 66 120 195 142 110 111 140 120 21 75 150 103 24 47 157 185 78 38 123 164 112 46 241 233 27 127 75 225
58 225 149 114 20 57 93 45 81 25 103 123 77 59 39 90 79 139 287 33 153 51 92 127 103 125 56 8 124 176 163 155 78 121 158 176
-261 176 214 53 108 247 152 120 134 114 68 182 73 80 77 92
$$ packed form
1861A39M3K9k06O4m4R5O9r1M4J5q7L49K45L38l90k46j75j74J3N4M2j0l4M9p8L3J31o6J9j32
1579C8N8J3m6jmj0J07o7L8J9k7M6m1n6Q0Q8m0r3l9J23q5Ol4M8J45j5k7Jj49O0o2J25l6k9l
1251A31p1j2J30kj28L3j2J2M3J1j6L1j0J16j15j06K4O1j6k0L1r7J40r5P3P6p8r8L7L1k9N7
950A32k6J9om0pJ34J2m6q8MJ64k9j66M4jO2N1r0k1mj4qM8Q2J25J78K1J47k59J19m2p7k75J05
631B48q2j40J22r8L9J85k6J46J396J348o83j171j018j04Ml3n7N7m9qJ35j31Q3j25L8J08mj7
368A63p6J65o8M2oj54N4P5n3l2JK9k0r9N4P5m7p9K3J10K8j07m0Q5M1n2o6J95qk06J00n2J50
58B25p6l5r4L7L6m8L6n6P8K0m6j8k0N1j1O0J48k54J20j02M1L5k4K2o9m8J16N2j3qp7M3L7J8
-261A76L8j61N5J39r5l2J4k0m6J14j09PlJ5
-392I2
##PAGE=	F1=-3049.78
##FIRST=	4405.895418600002813,	4405.895418600002813,	0
##DATA TABLE=	(F2++(Y..Y)), PROFILE
$$ plain form
4406 74 103 56 92 79 115 148 104 34 128 138 85 37 46 113 108 135 234 143 63 38 20 95 138 135 168 121 14 130 184 133 61 111 129 149 122 232
4068 232 233 172 81 18 48 106 57 167 205 25 224 116 75 97 116 130 103 70 40 69 113 65 72 110 124 80 142 58 111 171 35 206 161
3758 161 113 82 68 126 141 69 75 158 17 151 182 120 142 206 144 219 149 133 33 158 138 133 61 230 249 110 43 195 180 33 151
3467 151 117 5 70 94 77 11 44 69 113 67 125 101 212 245 115 116 126 49 138 161 48 168 144 123 176 126 140 117 55 125 135 123 79
3157 79 85 68 170 271 218 31 62 63 137 187 193 126 73 49 147 148 180 81 78 133 43 179 189 179 119 79 40 143 61 67 76 46 151 173 73
2828 73 28 94 93 31 103 86 187 115 242 227 219 93 57 87 40 152 118 104 96 38 144 128 70 75 118 95 93 24 179 73 50 64 83 171
2509 171 114 96 106 112 153 170 106 96 67 72 200 210 108 153 149 32 36 121 164 89 100 70 102 166 242 198 111 50 60 145 150 26 36 69 217
2180 217 168 18 64 97 53 73 94 31 119 115 109 72 122 138 55 66 42 133 126 309 144 786 718 198 163 191 37 165 236 213 172 80 195
$$ packed form
4406G4K9m7L6j3L6L3m4p0R4J0n3m8RO7nK7R9r1q0k5j8P5M3lL3m7j07J16N4n1p2N0J8K0k7J10
4068B32Jo1r1o3L0N8m9J10L8j80J99j08m1K2J9J4k7l3l0K9M4m8PL8J4m4O2q4N3O0j36J71m5
3758A61m8l1j4N8J5p2OQ3j41J34L1o2K2O4o2P5p0j6j00J25k0np2J69J9j39o7J52j5j47J18
3467A51l4j12O5K4j7o6L3K5M4m6N8k4J11L3j30JJ0p7Q9K3j13J20k4k1N3n0J4k3o2P0J0j2m4
3157G9Oj7J02J01n3j87L1JP4N0Oo7n3k4R8JL2r9lN5r0J36J0j0o0m0l9J03q2ORl0J05K2j00
2828G3m5O6jo2P2j7J01p2J27j5qj26l6L0m7J12l4j4qn8J06j6n8NM3k3ko9J55j06k3J4J9Q8
2509A71n7j8J0OM1J7o4j0k9NJ28J0j02M5mj17MQ5M3p5J1l0L2O4P6m4q7o1J0Q5Nj24J0L3J48
2180B17m9j50M6L3m4K0K1o3Q8mol7N0J6q3J1k4R1pJ83j65O42o8n20l5K8j54J28P1k3m1r2J15
$$ plain form
1871 195 145 203 186 27 16 70 153 174 72 161 124 124 275 465 576 661 250 271 39 14 8 123 80 85 149 84 92 177 108 132 48 97 92
1561 92 61 66 53 63 163 92 152 133 104 119 117 64 176 247 201 81 55 179 65 97 72 117 307 562 470 252 82 136 67 185 109
1270 109 185 112 34 24 218 177 31 55 42 60 89 105 118 144 111 230 116 71 77 143 112 105 103 27 169 61 140 228 143 43 79 143 63
960 63 93 91 123 118 67 74 163 182 121 79 65 234 212 30 90 105 125 164 103 86 74 103 71 78 138 282 426 480 617 465 605 672 531 273
640 273 295 105 53 200 14 71 263 110 325 1127 1930 1346 606 187 122 276 95 73 112 73 86 209 117 193 34 48 193
387 193 194 103 157 263 203 212 142 64 108 164 174 112 134 135 127 19 116 144 97 14 59 144 187 94 42 78 153 123 75 236 158 69 135 34 189
58 189 105 128 19 62 97 49 113 32 92 123 90 72 47 94 66 143 270 76 167 52 91 83 128 124 51 25 103 171 114 136 49 77 108 164 167
-270 167 53 90 237 189 70 94 121 129 218 88 84 54 86
$$ packed form
1871A95n0N8j7j59j1N4Q3K1j02Q9l7%J51J90J11Q5m11K1k32k5oJ15m3NO4o5QQ5o9K4q4M9n
1561I2l1Nj3J0J00p1O0j9k9J5kn3J12P1m6j20k6J24j14L2k5M5J90K55r2k18j70N4o9J18p6
1270A09P6p3p8j0J94m1j46K4j3J8K9J6J3K6l3J19j14m5OO6l1pkp6J42j08P9Q8q5j00L6O4q0
960F3L0kL2nn1PQ9J9o1m2j4J69k2j82O0J5K0L9o1j7j2K9l2PO0J44J44N4J37j52J40O7j41k58
640B73K2j90n2J47j86N7J92j53K15Q02Q03n84p40m19o5J54j81k2L9l9J3J23r2P6j59J4J45
387A93Jr1N4J06o0Rp0p8M4N6J0o2K2Jqj08R7K8m7q3M5Q5M3r3n2L6P5l0m8J61p8q9O6j01J55
58A89q4K3j09M3L5m8O4q1O0L1l3j8k5M7k8P7J27j94R1j15L9qM5mp3k6P8O8n7K2q7K8L1N6L
-270A67j14L7J47m8j19K4K7QQ9j30ml0L2
-392H6
##PAGE=	F1=-3068.56
##FIRST=	4405.895418600002813,	4405.895418600002813,	0
##DATA TABLE=	(F2++(Y..Y)), PROFILE
$$ plain form
4406 48 89 61 108 66 87 121 118 54 115 121 40 16 41 91 134 135 204 122 77 27 3 91 148 151 162 74 42 156 189 134 34 114 90 161 142 246
4068 246 239 206 80 32 47 99 69 126 177 11 223 155 46 88 102 122 86 57 74 75 70 21 24 124 125 98 144 61 114 167 45 215 161 80
3749 80 84 114 133 118 85 131 161 17 195 214 94 121 174 142 202 155 163 54 162 168 148 54 234 253 95 81 218 212 47 160 109 4
3448 4 58 99 66 44 28 57 109 67 99 62 158 279 151 126 124 37 119 181 47 162 164 131 159 88 95 66 84 89 131 72 124 88 81 183 272 224
3110 224 24 46 132 208 181 157 119 73 82 152 154 137 34 81 155 79 113 198 189 114 85 45 152 83 60 89 37 145 147 73 15 93 96 22 132
2781 132 113 193 129 204 153 154 61 16 112 91 134 107 86 145 66 113 147 82 58 146 74 127 25 158 61 84 110 41 118 83 94 106 92 147
2462 147 183 142 103 70 78 226 199 97 123 157 27 15 149 144 89 97 45 128 144 219 230 151 47 86 144 126 54 26 21 202 179 33 62
2152 62 71 62 98 98 22 138 128 103 100 130 145 73 75 37 82 91 319 195 635 595 197 148 188 21 175 258 218 155 61 145 145 206 172 44 69
$$ packed form
4406D8M1k8M7m2K1L4lo4O1Oq1k4K5N0M3JO9q2m5n0k4Q8N7LJ1q8l2J14L3n5j00Q0k4P1j9J04
4068B46pl3j26m8J5N2l0N7N1j66K12o8j09M2J4K0l6k9J7Jnm9LJ00Jk7M6q3N3N3j22J70n4q1
3749H0ML0J9j5l3M6L0j44J78J9j20K7N3l2O0m7Qj09J08Ok0r4J80J9j58j4J37oj65J13n1j05
3448DN4M1l3k2j6K9N2m2L2l7R6J21j28k5kq7Q2O2j34J15Kl3K8p1Pk9J8NM2n9N2l6pJ02Q9m8
3110B24k00K2Q6P6k7k4l8m6RP0Kj7j03M7P4p6L4Q5rp5k9m0J07o9k3K9n2J08Kp4n8P8Lp4J10
2781A32j9Q0o4P5n1Jr3m5R6k1M3k7k1N9p9M7L4o5k4Q8p2N3j02J33r7K3K6o9P7l5J1J2j4N5
2462A47L6m1l9l3QJ48k7j02K6L4j30j2J34nn5Qn2Q3J6P5J1p9j04L9N8j8p2k8nJ81k3j46K9
2152F2RrL6%p6J16j0k5lL0J5p2Kl8M5RK28j24M40m0l98m9M0j67J54Q3m0o3r4Q4%O1l4j28K5
$$ plain form
1824 69 123 184 153 96 179 80 196 118 700 994 1324 754 371 93 38 65 123 50 79 158 97 100 130 100 92 103 89 67 68 72 79 69 149 107
1504 107 161 113 126 70 101 88 198 237 189 69 54 173 24 92 65 120 401 951 671 271 80 134 59 142 60 223 91 21 5
1232 5 250 190 57 66 37 61 36 63 114 127 78 190 96 97 83 169 118 112 94 34 163 47 132 236 142 55 90 175 55 42 70 130 130 55
913 55 83 103 132 107 81 55 195 184 23 78 104 76 111 84 61 61 110 55 48 87 216 312 403 515 469 635 813 644 400 367 111 149
612 149 253 62 17 204 99 206 1263 2490 3024 1599 240 126 416 69 113 78 93 97 203 162 196 79 33 181 195 67
368 67 221 271 217 179 72 103 96 130 188 101 137 125 138 26 149 169 96 45 71 117 173 108 66 50 136 143 93 219 87 133 139 8 148
58 148 61 130 53 73 85 59 141 53 75 124 89 70 60 107 70 159 235 100 177 60 97 63 143 105 49 56 73 159 79 117 45 37 60 149 131 66
-280 66 74 194 194 26 52 115 186 237 102 79 44 84
$$ packed form
1824F9N4O1l1n7Q3r9J16p8N82K94L30n70l83k78n5K7N8p3K9P9o1LL0l0qJ1j4k2JMPj0Q0m2
1504A07N4m8J3n6L1j3J10L9m8j20j5J19j49O8k7N5K81N50k80m00j91N4p5Q3q2J63j32p0j6
1232EK45o0j33Rk9K4k5K7N1J3m9J12r4Jj4Q6n1oj8o0J29j16Q5J04r4q7L5Q5j20j3K8O0%p5
913E5K8K0K9k5k6k6J40j1j61N5K6k8L5k7k3%M9n5pL9J29R6R1J12m6J66J78j69k44l3k56L8
612A49J04j91m5J87j05J07J057J227N34j425j359j14K90l47M4l5J5MJ06m1L4j17m6J48J4j28
368F7J54N0n4l8j07L1pL4N8q7L6j2J3j12J23K0p3n1K6M6N6o5m2j6Q6Pn0J26j32M6Oj31J40
58A48q7O9p7K0J2k6Q2q8K2M9l5j9j0M7l7Q9P6j35P7j17L7l4Q0l8n6PJ7Q6q0L8p2qK3Q9j8o5
-280F6QJ20%j68K6O3P1N1j35k3l5M0
-392H4
##PAGE=	F1=-3087.34
##FIRST=	4405.895418600002813,	4405.895418600002813,	0
##DATA TABLE=	(F2++(Y..Y)), PROFILE
$$ plain form
4406 32 69 70 123 64 62 92 123 96 102 93 12 35 33 70 151 124 167 101 77 46 28 74 148 156 148 38 84 173 185 141 16 108 51 162 158 245 226 246
4049 246 90 42 44 91 75 82 156 15 190 179 39 107 84 95 64 62 107 82 49 82 53 136 123 98 135 75 101 145 68 213 156 52 107
3739 107 163 141 90 97 184 168 52 230 230 63 104 141 133 163 156 201 88 157 182 158 61 227 239 71 117 234 233 57 184 102 5 43 120
3429 120 56 79 43 68 98 125 80 47 110 303 181 122 110 31 107 187 76 153 174 118 125 66 48 68 168 63 143 38 169 72 81 198
3129 198 252 201 43 41 185 263 161 103 114 81 98 134 134 77 38 87 166 110 82 199 199 127 101 37 145 101 34 82 22 153 136 64 13
2819 13 92 98 35 155 133 183 147 147 68 78 32 46 119 119 107 132 84 189 105 84 156 88 40 164 77 162 30 134 67 113 148 24 76 84
2500 84 132 96 58 129 179 163 101 78 84 228 158 84 75 159 37 8 185 136 81 77 42 152 150 192 266 182 62 112 137 102 85 29 10 185
2180 185 181 46 61 46 61 122 99 17 156 141 104 128 135 142 85 76 57 28 55 294 254 446 433 163 109 174 31 173 263 210 137 33 85
$$ packed form
4406C2L7JN3n9kL0L1k7Orq1K3kL7Q1k7M3o6k4l1j8M6P4Qqj10M6Q9J2m4j25R2n7J11mQ7j9K0
4049B46j56m8KM7j6PP4j41J75j1j40O8k3J1l1kM5k5l3L3k9Q3j3k5L7o0K6M4p7J45n7j04N5
3739A07N6k2n1PQ7j6j16J78%j67M1L7qL0pM5j13O9K5k4r7J66J2j68M6J17jj76J27q2r7L8P7
3429A20o4K3l6K5L0K7m5l3O3J93j22n9j2p9P6Q0j11P7K1n6Pn9j8K0J00j05Q0j05J31r7RJ17
3129A98N4n1j58kJ44P8j02n8J1l3J7L6%n7l9M9P9n6k8J17%p2k6o4J08m4o7M8o0J31j7p2n1
2819A3P9Oo3J20k2N0l6%p9J0m6J4P3%j2K5m8J05q4k1P2o8m8J24q7Q5j32J04o7M6L5j24N2Q
2500H4M8l6l8P1N0j6o2k3OJ44p0p4rQ4j22k9J77m9n5ml5J10kM2P4q4j20N0K5l5j7n6j9J75
2180A85mj35J5j5J5O1k3q2J39j5l7K4PPn7rj9k9K7K39m0J92j3k70n4O5j43J42R0n3p3j04N2
$$ plain form
1871 85 149 191 175 59 146 164 203 143 134 194 44 256 331 1140 1670 1922 1186 432 169 86 115 126 58 62 158 97 102 86 142 54 151 81
1570 81 42 77 77 108 67 107 114 157 105 177 67 81 114 210 209 164 68 52 165 32 91 51 115 455 1152 761 278 64 126 54 75 105 242
1260 242 71 21 23 264 210 96 97 49 94 35 34 118 99 52 146 84 117 75 192 114 108 82 38 145 27 117 233 133 72 99 196 50
960 50 13 47 128 141 44 94 58 82 137 75 73 141 151 52 68 95 38 76 63 33 65 105 35 34 47 142 196 312 387 435 610 887 734 505
640 505 483 257 265 230 121 167 121 213 204 2520 4895 5799 3287 509 253 532 100 192 101 134 113 191 208 177 113 34 160 188 89
368 89 265 273 225 133 86 142 79 91 186 78 124 130 160 40 169 211 104 63 75 81 144 115 99 88 121 170 96 194 38 178 134 16 108
58 108 25 114 89 89 59 67 160 89 75 133 72 49 70 128 89 179 192 107 179 75 93 88 141 78 51 93 40 148 96 97 62 53 58 138 138 90 76 136
-299 136 165 71 24 93 223 237 109 62 67 84
$$ packed form
1871H5O4M2j6j16Q7J8L9o0rO0j50K12P5Q09N30K52p36p54k63q3K9J1o8MR6o1Nj6N6q8R7p0
1570H1l9L5%L1m1M0PM3n2P2j10J4L3R6jm5r6j6J13j33N9m0O4L40O97l91m83k14O2p2K1L0J37
1260B42j71n0KK41n4j14Jm8M5n9jQ4j9m7R4o2L3m2J17p8ok6m4J07j18R0J16j00o1K7R7j46
960E0l7L4Q1J3r7N0l6K4N5o2kO8J0r9J6K7n7L8j3l0L2M0p0jJ3R5N4J16P5M8J75K77j53k29
640E05k2k26Ql5j09M6m6R2rK316K375R04k512k778k56K79m32R2r1L3k1P8J7l1o4p9J26K8r9
368H9J76Qm8r2m7N6o3J2R5j08M6OL0j20J29M2j07m1J2OO3k9j6j1L3M9p4R8j56J40m4j18R2
58A08q3Q9k5%l0QR3p1j4N8o1k3K1N8l9R0J3q5P2j04J8nN3o3k7M2n3J08n2Jl5rNQ0%m8j4O0
-299A36K9r4m7O9J30J4j28m7NJ7
-392H4
##PAGE=	F1=-3106.12
##FIRST=	4405.895418600002813,	4405.895418600002813,	0
##DATA TABLE=	(F2++(Y..Y)), PROFILE
$$ plain form
4406 33 52 73 126 74 40 62 114 150 100 63 25 49 29 57 151 105 133 82 63 70 55 43 132 148 140 86 126 179 177 151 22 92 29 150 164 237
4068 237 203 276 110 46 32 70 71 45 140 45 134 183 54 142 74 58 36 70 126 91 54 140 107 146 118 81 118 85 79 116 84 199 147 38
3749 38 127 198 152 56 98 219 169 79 250 226 34 92 124 135 106 154 238 125 141 177 173 89 210 211 44 148 239 241 58 217 97 21
3448 21 25 143 54 110 70 79 78 178 70 60 92 319 199 105 83 48 104 175 102 148 176 83 74 65 39 135 246 50 164 68 192 45 80
3138 80 218 214 156 53 32 207 292 130 41 116 85 90 99 90 21 77 96 163 119 107 195 211 161 125 14 119 109 10 56 10 167 138 43 16
2819 16 92 93 65 165 142 159 162 90 58 5 34 83 107 119 78 173 109 216 131 56 149 87 19 165 112 188 30 112 81 128 170 49 70 103
2500 103 175 79 20 102 162 170 90 87 95 206 98 77 22 158 60 16 214 150 65 59 71 167 178 166 297 190 85 133 123 80 105 44 13
2190 13 172 170 59 60 48 58 147 101 20 174 151 110 149 139 136 93 63 84 42 56 236 310 374 379 94 54 154 52 159 256 193 123 7
$$ packed form
4406C3J9K1N3n2l4K2N2L6n0l7l8K4k0K8R4m6K8n1j9Pj5j2Q9J6qn4M0N3kk6j29P0o3J21J4P3
4068B37l4P3j66o4j4L8Jk6R5r5Q9M9j29Q8o8j6k2L4N6l5l7Q6l3L9k8l7L7l3oL7l2J15n2j09
3749C8Q9P1m6r6M2J21n0r0J71k4j92N8L2J1k9M8Q4j13J6L6mq4J21Jj67J04R1Kj83J59j20p6
3448B1MJ18q9N6m0RjJ00j08j0L2K27j20r4k2l5N6P1p3M6K8r3rrk6R6J11j96J14r6J24j47L5
3138H0J38mn8j03k1J75Q5j62q9P5l1NRro9N6J9O7m4j2Q8J6n0l6j11J05j0r9M6m6J57k9r5k7
2819A6P6Jk8J00k3J7Lp2l2n3K9M9K4J2m1R5o4J07q5p5R3o2o8J46n3P6j58Q2l1M7M2j21K1L3
2500A03P2r6n9Q2O0Qq0lQJ11j08k1n5J36r8m4J98o4q5oJ2R6J1j2J31j07j05M8j0m3K5o1l1
2190A3J59kj11Jj2J0Q9m6q1J54k3m1L9j0lm3l0K1m2J4J80P4O4Nk85m0J00j02J07R7o3p0j16
$$ plain form
1880 7 34 164 161 181 80 204 186 198 149 158 197 37 268 612 1410 2049 2159 1375 416 249 149 134 122 88 39 148 92 91 54 193
1598 193 42 176 78 45 84 83 126 57 42 107 153 126 225 118 72 135 212 169 132 69 43 149 74 98 27 91 419 1074 703 273 33
1307 33 113 51 13 187 245 55 31 41 257 228 129 126 56 138 111 71 135 63 56 107 79 138 57 207 97 100 63 40 129 51 103 218 118
997 118 91 100 203 49 51 22 107 138 35 101 86 66 172 56 106 81 127 71 54 74 53 78 33 20 67 87 45 18 9 67 122 220 255 377
678 377 529 874 772 569 632 440 404 72 308 359 105 203 213 2978 5800 6850 4033 675 352 558 117 249 163 163 132
443 132 170 244 148 114 30 140 176 131 282 266 217 84 131 167 53 45 178 49 99 157 182 57 173 246 118 66 66 44 104 114 129 142
143 142 113 198 88 163 54 195 116 23 75 24 83 123 107 26 65 164 137 115 153 42 28 70 149 114 191 148 102 173 93 78 109 120 62
-167 62 58 126 43 147 144 68 77 87 95 127 168 117 95 92 106 122 52 62 231 218 98 33 90 83
$$ packed form
1880GK7J30lK0j01J24j8J2m9RL9j60K31L44P98O39J10p84r59j67j00j5j2l4m9J09n6jl7J39
1598A93j51J34r8l3L9jM3o9j5O5M6k7R9j07m6O3P7m3l7o3k6J06p5K4p1O4L28O55l71m30k40
1307C3Q0o2l8J74N8j90k4J0K16k9r9lp0Q2k7m0O4p2pN1k8N9q1J50j10Ll7k3Q9p8N2J15j00
997A18k7RJ03j54Kk9Q5L1j03O6j5k0J06j16N0k5M6n6j7K0k1K5m5j3M7K0m2k7rN8N5R8L5J22
678C77J52L45j02k03O3j92l6l32K36N1k54R8J0K765K822J050k817l358l23K06m41J32q6%l1
443A32L8P4r6l4q4J10L6m5J51j6m9j33M7L6j14qJ33j29N0N8K5j25J16P3j28n2%k2O0J0J5J3
143A42k9Q5j10P5j09J41p9r3N2n1N9M0j6q1L9R9k7k2L8j11j4M2P9l5P7m3m6P1q0j5L1J1n8
-167F2mO8q3J04lp6RJ0QL2M1n1k2lJ4J6p0J0J69j3j20o5N7p
-392H3
##PAGE=	F1=-3124.9
##FIRST=	4405.895418600002813,	4405.895418600002813,	0
##DATA TABLE=	(F2++(Y..Y)), PROFILE
$$ plain form
4406 43 43 69 113 80 29 33 95 197 114 57 42 66 46 63 129 87 113 69 51 84 81 17 97 131 153 148 158 172 166 154 23 72 39 131 158 235 181
4058 181 285 137 47 18 36 57 18 126 69 69 163 85 175 80 43 18 69 131 103 65 183 148 157 107 56 110 95 61 93 89 179 134 42 135
3739 135 212 164 18 84 229 162 88 251 202 16 86 129 153 45 155 264 156 113 159 198 130 185 176 29 170 234 238 50 247 96
3458 96 42 9 157 55 134 89 76 67 208 64 74 109 328 203 82 59 90 109 149 116 149 171 37 14 72 76 206 301 48 183 114
3166 114 186 14 93 242 167 104 49 16 191 295 91 28 127 86 67 72 32 61 106 100 149 104 138 190 224 209 150 25 75 105 56 21 14
2857 14 177 144 14 28 94 83 106 163 140 126 170 81 130 52 64 105 80 95 54 209 146 222 135 22 124 82 13 150 156 202 24 96
2556 96 98 127 178 73 82 118 204 61 38 75 139 165 74 92 119 168 35 79 36 161 91 26 222 178 41 85 104 174 207 150 312 173
2256 173 106 144 102 62 109 63 11 163 154 76 59 71 64 177 112 54 191 155 120 158 141 131 100 37 103 94 104 157 351 485 497 43 9
$$ packed form
4406D3%K6M4l3n1MO2J02q3n7j5K4k0J7O6m2K6m4j8L3lo4Q0L4K2nJ0J4oj2j31M9l3R2K7P7n4
4058A81J04j48r0k9J8K1l9J08n7%R4p8R0r5l7k5N1O2k8l8J18l5Rn0n1N4j5l4L2mR0m5r2R3
3739A35P7m8j46O6J45o7p4J63m9j86P0M3K4j08J10J09j08m3M6L9o8N5rj47J41O4Mj88J97j51
3458I6n4l3J48j02P9m5j3rJ41j44J0L5K19j25j21k3L1J9M0l3L3K2j34k3N8MJ30R5k53J35o9
3166A14P2j72P9J49p5o3n5l3J75J04k04o3R9m1j9Nm0K9M5oM9m5L4N2L4j5n9j25N0L0m9l5p
2857A4J63l3j30J4O6j1K3N7k3j4M4q9M9p8J2M1k5J5m1J55o3P6q7j13J02m2o9J37OM6j78P2
2556I6KK9N1j05RL6Q6j43k3L7O4K6r1J8K7M9j33M4m3J25p0o5J96m4j37M4J9P0L3n7J62j39
2256A73o7L8m2m0M7m6n2J52rp8j7J2pJ13o5n8J37l6l5L8j7j0l1o3O6rJ0N3J94J34J2m54l4
$$ plain form
1946 9 133 71 137 250 170 112 33 19 188 125 174 109 227 189 164 164 168 180 61 213 851 1516 2281 2162 1374 317 309 219 118 102
1664 102 111 37 128 90 69 39 225 82 172 81 79 89 95 126 47 39 94 162 160 249 171 83 152 207 122 98 62 22 122 106 118 10 51 302 742
1335 742 515 261 9 93 45 89 262 234 41 51 54 234 235 152 150 57 175 181 121 155 25 91 82 79 161 38 209 66 92 37 52 132
1035 132 99 102 188 100 106 95 194 47 70 22 72 119 29 99 131 97 190 51 139 21 119 68 44 47 72 85 9 29 55 62 73 21 29 26 115 141
697 141 140 308 405 772 735 579 785 614 559 242 679 557 229 32 74 1795 3706 4714 2974 567 333 445 108 240
471 240 204 168 149 137 257 132 77 9 121 161 163 269 248 186 43 142 173 32 19 170 32 73 193 193 74 160 254 137 56 48 34
180 34 62 110 150 188 110 216 91 131 85 185 87 31 48 44 43 149 129 14 53 154 184 172 182 11 68 54 162 142 188 111 92 164 108
-129 108 64 104 91 70 70 145 86 160 185 29 86 99 127 110 181 141 113 89 33 150 98 30 204 184 64 25 90 79
$$ packed form
1946IJ24o2O6J13q0n8p9j4J69o3M9o5J18l8k5%MJ2j19J52O38O65P65j19p88j057qr0j01j6
1664A02Rp4R1l8k1l0J86j43R0r1kJ0OL1p9qN5O8kQ9p8q8O9N5q5k4l6m0J00j6J2j08M1K51M40
1335G42k27k54k52Q4m8M4J73k8j93J0LJ80Jq3kr3J18Oo0L4j30O6rlQ2j23J71j43K6n5J5Q0
1035A32l3LQ6q8Oj1R9j47K3m8N0M7r0P0L2l4R3j39Q8j18R8n1k4LK5J3p6K0K6PJ1n2QlQ9K6
697A41jJ68R7L67l7j56K06j71n5l17M37j22l28j97M2J721J911J008j740k407k34J12l37J32
471B40l6l6j9j2J20j25n5o8J12M0KJ06k1o2j43R9L1j41j3J51j38M1J20%j19Q6R4j17q1qj4
180C4K8M8M0L8p8J06j25M0m6J00r8n6J7mjJ06k0j15L9J01L0j2J0j71N7j4J08k0M6p7j9P2n6
-129A08m4M0j3k1%P5n9P4K5j56N7J3K8j7P1m0k8k4n6J17n2o8J74k0j20l9O5j1
-392G9
##PAGE=	F1=-3143.68
##FIRST=	4405.895418600002813,	4405.895418600002813,	0
##DATA TABLE=	(F2++(Y..Y)), PROFILE
$$ plain form
4406 78 34 66 85 69 49 42 89 220 141 95 76 97 87 89 90 72 112 58 59 85 110 56 44 107 182 194 174 154 148 149 10 63 52 117 141 242 163
4058 163 264 166 45 18 29 33 4 114 86 62 121 132 190 102 75 38 59 125 114 74 212 169 169 91 35 129 113 52 87 84 157 124 60 131
3739 131 202 174 22 57 215 159 78 236 165 15 81 138 167 36 164 277 173 79 143 224 171 154 145 36 178 219 225 41 264 100
3458 100 63 10 155 52 148 92 64 97 211 56 83 141 329 194 78 82 145 116 123 116 154 160 39 44 77 112 259 323 50 191 156 152
3157 152 12 114 267 128 74 31 14 141 274 48 82 140 91 72 94 49 108 120 95 132 68 148 183 239 260 172 72 32 84 100 40
2866 40 21 177 140 36 52 95 87 149 152 127 91 165 128 188 89 93 113 49 58 43 227 174 205 119 23 81 77 38 123 195 199 19 91 118 114 176 89
2519 89 84 125 217 46 83 51 118 155 63 91 152 129 46 92 77 165 122 42 200 201 13 140 129 172 224 141 309 137 115 141 76 48 95
2209 95 75 36 158 153 97 68 86 81 211 133 101 208 151 133 154 140 130 104 6 109 134 165 69 373 641 672 145 58 124 84 109 249
$$ packed form
4406G8m4L2J9j6k0pM7J31p9m6j9K1j0KJj8M0n4JK6K5n4j2O3P5J2k0k0oJj39N3j1O5K4J01p9
4058A63J01r8j21k7J1Mk9J10k8k4N9J1N8q8k7l7K1O6j1m0J38m3%p8n6R4j6o1L5lP3l3o4P1
3739A31P1k8j52L5J58n6q1J58p1j50O6N7K9j31J28J13j04r4O4Q1n3j7rj09J42M1Oj84K23j64
3458A00l7n3J45j03R6n6k8L3J14j55K7N8J88j35j16MO3k9PpL8Oj21NL3L5J47O4k73J41l5m
3157A52j40J02J53j39n4m3j7J27J33k26L4N8m9j9K2m5N9J2k5L7o4Q0L5N6K1q8j00m0N2J6o0
2866D0j9J56l7j04J6M3qO2Lk5l6P4l7O0r9MK0o4Rj5J84n3L1q6r6N8ml9Q5P2Mj80P2K7mO2q7
2519H9nM1R2j71L7l2O7L7r2K8O1k3q3M6j5Q8m3q0J58Jj88J27j1M3N2q3J68j72k2K6o5k8M7
2209I5k0l9J22nn6k9J8nJ30p8l2J07n7j8K1j4j0k6r8J03K5L1r6L04K68L1n27q7O6m0K5J40
$$ plain form
1908 249 147 104 61 31 211 96 146 143 209 186 103 178 178 146 118 92 1025 1800 2961 2557 1539 212 334 281 90 62 118 64 107
1636 107 97 45 43 231 140 141 81 111 97 119 111 49 122 91 186 186 242 207 101 170 199 68 66 44 14 86 120 155 50 44 145 283 272 246 49
1307 49 64 31 163 318 218 29 82 61 204 228 162 168 66 197 230 159 164 24 134 71 85 186 30 199 29 89 39 80 162 145
1025 145 115 148 86 114 86 171 46 66 51 43 93 32 88 153 129 186 101 166 34 118 46 69 34 68 77 60 32 26 39 91 70 60 76 126 91
697 91 58 235 262 603 623 529 903 745 717 686 1211 740 385 286 339 1108 1488 932 467 229 291 193 201 191 209 153 155 94 246 148
415 148 53 25 96 141 174 227 219 134 42 109 161 49 62 166 44 55 222 188 82 134 230 156 41 61 58 41 104 157 217 109 219 124
115 124 100 108 158 49 48 23 66 4 165 150 33 54 131 221 225 208 42 131 24 159 168 164 83 87 161 115 64 77 76 85 90 147 133 185 202 30
-223 30 94 86 143 85 159 157 119 106 67 148 146 7 149 141 19 66 62 75
$$ packed form
1908B49j02m3m3l0J80j15N0lO6k3q3P5%l2k8k6R33P75J161m04j018j327J22n3j91k8N6n4M3
1636A07j0n2kJ88r1Jo0L0j4K2qo2P3l1R5%N6l5j06O9K9j31kk2l0P2L4L5j05oJ01J38j1k6j97
1307D9J5l3J32J55j00j89N3k1J43K4o6Oj02J31L3p1Nj40J10o3J4J01j56J69j70O0n0M1Q2j7
1025A45l0L3o2K8k8Q5j25K0j5qN0o1N6O5k4N7q5O5j32Q4p2K3l5L4Rj7k8oJ3N2k1j0J6N0l5
697I1l3J77K7L41K0r4L74j58k8l1N25m71l55r9N3P69L80n56m65k38O2r8Qj0J8n6Ko1J52r8
415A48r5k8P1M5L3N3qq5r2O7N2j12J3J04j22J1J67l4j06N2R6p4j15K0lj7O3N3O0j08J10r5
115A24k4QN0j09jk5M3o2J61j5j17K1P7R0Mj7j66Q9j07J35Rmq1MP4m6n1J3jRNN7j4N2J7j72
-223C0O4qN7n8P4kl8j3l9Q1kj39J42qj22M7mJ3
-392G5
##PAGE=	F1=-3162.46
##FIRST=	4405.895418600002813,	4405.895418600002813,	0
##DATA TABLE=	(F2++(Y..Y)), PROFILE
$$ plain form
4406 132 22 76 67 40 78 85 112 212 169 142 123 133 142 122 44 64 131 47 75 78 143 102 31 81 208 219 172 137 122 137 16 76 56 120 118
4077 118 251 148 220 187 39 25 80 6 29 106 97 122 76 185 181 131 115 61 52 116 122 84 230 170 178 81 27 157 140 45 100 75 137 125
3758 125 83 116 169 175 58 25 183 168 52 210 125 28 79 138 161 84 178 274 169 42 139 238 203 126 125 45 169 193 201 38 264 107
3458 107 79 23 136 40 149 79 56 148 192 58 94 174 324 176 112 139 198 118 117 105 157 148 86 89 76 140 283 311 51 182 187 98 34
3148 34 128 285 114 80 16 30 73 231 18 124 147 105 118 147 111 139 116 82 127 32 130 169 251 300 186 120 69 47 130 80 39 164
2847 164 127 80 80 91 109 183 136 108 60 145 176 221 103 115 110 38 30 49 223 180 170 97 80 29 77 64 89 218 184 19 99 137 94 164
2528 164 98 75 132 220 37 122 35 100 144 61 88 181 111 87 109 103 164 148 58 147 207 18 191 143 165 227 135 288 95 106 127 53 42
2218 42 69 71 66 155 179 117 92 85 100 245 156 146 221 138 147 138 135 130 102 28 103 157 227 20 377 774 832 255 96 134 86 77 250 130 93
$$ packed form
4406A32j10N4rk7L8PK7J00m3k7j9J0Rk0p8K0O7q4K8LO5m1p1N0J27J1m7l5j5J5j21O0k0O4k
4077A18J33j03P2l3j48j4N5p4K3P7rK5m6J09mn0j6n4rO4Ol8J46o0Qr7n4J30j7r5N5k5O2j2
3758A25m2L3N3Oj17l3J58j5j16J58q5r7N1N9K3p7R4R6j05j27R7R9l5p7jq0J24K4Qj63K26j57
3458A07k8n6J13r6J09p0k3R2M4j34L6Q0J50j48o4K7N9q0jj2N2ro2Lj3O4J43K8k60J31Nq9o4
3148C4R4J57j71l4o4J4M3J58k13J06K3m2J3K9l6K8k3l4M5r5R8L9Q2M9j14o6n1k2Q3n0m1J25
2847A64l7m7%J1J8P4m7k8m8Q5L1M5j18J2np2qJ9J74m3j0p3j7n1M8j3K5J29l4j65Q0L8m3P0
2528A64o6k3N7Q8j83Q5q7O5M4q3K7R3p0k4K2oO1j6r0Q9O0j89J73m8K2O2r2J53j93J1K1p4j1
2218D2K7KnQ9K4o2k5pJ5J45q9j0P5q3Rrlnk8p4P5N4P0k07L57L97N8n77j59L8m8rJ73j20l7
$$ plain form
1889 93 77 32 219 79 104 173 155 185 26 180 197 110 193 72 1089 2336 3984 3393 1978 272 313 321 101 24 108 85 102
1636 102 114 35 55 216 196 91 78 126 104 154 93 78 195 114 210 191 204 218 115 186 188 16 35 29 45 53 114 205 94 88 22 145 167
1326 167 229 82 26 18 222 350 200 37 126 60 172 211 160 178 89 198 249 174 154 55 175 72 93 205 30 183 24 90 84
1054 84 116 204 178 130 103 81 113 78 137 46 47 74 55 77 43 74 143 139 165 163 185 83 114 46 109 53 42 55 115 26 25 31 99 123 74 120 119 77
697 77 21 166 144 408 458 424 955 808 849 1174 1821 929 487 593 746 4679 8065 7870 4193 654 513 142 361 246
471 246 196 139 153 56 222 179 134 62 66 112 160 162 181 81 66 42 137 82 106 163 65 55 235 168 74 105 176 171 35 116 82 51 98 149 225
143 225 109 207 164 77 124 135 19 70 9 90 27 169 166 41 92 104 238 261 223 81 189 43 139 187 126 73 92 171 111 72 63 81
-158 81 99 115 134 170 212 193 77 109 60 142 56 106 160 110 117 138 127 183 16 79 101 63 101 15 75
$$ packed form
1889I3j6m5J87j40K5O9j8L0j59J54J7q7Q3j21J017J247J648n91j415j706M1Qk20p7Q4k3J7
1636A02J2p9K0J61k0j05j3M8k2N0o1j5J17q1R6j9J3J4j03P1Kj72J9oJ6QO1R1j11oo6J23K2
1326A67O2j47n6qK04J28j50j63Q9o6J12L9n1J8q9J09N1p5k0r9J20j03K1J12j75J53j59O6o
1054H4L2Q8k6m8k7k2L2l5N9r1JK7j9K2l4L1O9mK6kK2j02L1o8O3n6j1J3O0q9jOO8K4m9M6jm2
697G7n6J45k2K64N0l4N31j47M1L25O47q92m42J06J53L933L386j95l677l539j41l71K19j15
471B46n0n7J4r7J66m3m5p2MM6M8KJ9j00j5k4R5n5K4N7r8j0J80o7r4L1P1nj36Q1l4l1M7N1P6
143B25j16R8m3q7M7J1j16N1o1Q1o3J42lj25N1J2J34K3l8j42J08j46R6M8o1n3J9P9o0l9rJ8
-158H1J8J6J9L6M2j9j16L2m9Q2q6N0N4n0PK1j1N6j67O3K2l8L8q6O0
-392G5
##PAGE=	F1=-3181.24
##FIRST=	4405.895418600002813,	4405.895418600002813,	0
##DATA TABLE=	(F2++(Y..Y)), PROFILE
$$ plain form
4406 178 12 87 85 12 91 118 135 178 185 170 163 163 199 146 8 62 160 41 76 72 175 141 89 62 212 225 154 137 98 123 41 95 53 134 96
4077 96 248 130 166 192 27 25 126 28 59 103 103 176 98 228 146 161 148 70 66 112 126 98 237 156 180 91 20 172 164 35 119 67 118
3767 118 138 98 96 118 164 86 8 148 183 28 173 94 48 82 137 135 118 191 261 145 16 138 229 216 108 121 43 141 160 161 47 249
3467 249 111 85 37 104 16 132 57 72 193 162 83 109 202 312 154 163 199 237 114 135 90 153 138 119 115 74 161 276 271 46 153 207
3166 207 38 51 126 287 129 89 42 55 10 173 40 147 147 123 169 200 159 154 95 62 135 46 91 137 258 320 189 160 137 15 136
2875 136 107 76 138 109 119 104 81 132 203 118 83 35 113 205 235 97 125 106 57 56 66 201 159 127 97 141 51 83 84 55 219 160 19 113
2556 113 151 71 142 104 75 148 221 34 146 27 79 137 66 89 192 120 107 121 115 153 163 72 68 193 43 220 146 155 218 122 255 65
2256 65 83 111 50 49 54 47 91 152 217 127 124 70 112 268 172 174 231 120 162 117 127 129 93 48 87 159 281 91 371 882 943 330 117 152
$$ packed form
4406A78j66P5kp3P9K7J7M3Pj5p%L6n3j38N4R8j19L5mJ03l4n2k7J50J3p1j7l9K5q2N4m2Q1l8
4077I6J52j18L6K6j65kJ01r8L1M4%P3p8J30q2J5j3p8mM6J4k8J39q1K4q9p1J52qj29Q4n2N1
3767A18K0m0kK2M6p8p8J40L5j55J45p9m6L4N5kj7P3P0j16j29J22R1j3j08J3p8R8J9Jj14K02
3467B49j38k6m8O7q8J16p5J5J21l1p9K6R3J10j58RL6L8j23K1m5O3j5j9mm1Q7J15nk25J07N4
3166B07j69J3P5J61j58m0m7J3m5J63j33J07%k4M6L1m1nn9l3P3q9M5M6J21O2j31k9k3j22J21
2875A36k9l1O2k9J0j5k3N1P1q5l5m8P8R2L0j38K8j9m9jJ0J35m2l2l0M4r0L2Jk9J64n9j41R4
2556A13L8q0P1l8k9P3P3j87J12j19N2N8p1K3J03p2j3J4oL8J0r1mJ25j50J77p4RO3r6J33j90
2256F5J8K8o1jNpM4O1O5r0ln4M2J56r6KN7j11M2m5J0Kl6m5L9P2J22j90K80N11O1o13k13L5
$$ plain form
1936 152 80 43 249 120 70 77 34 198 65 67 186 88 182 69 160 211 87 257 235 957 2674 4503 3824 2238 388 232
1692 232 330 144 77 82 74 115 146 40 58 190 236 38 76 112 105 196 93 126 246 158 220 168 151 206 124 196 174 38 14 38 73 42 96
1382 96 252 136 121 105 390 270 214 104 22 40 261 357 182 74 181 53 140 191 149 177 117 180 237 160 129 84 202 79 101
1110 101 213 30 173 49 94 134 151 238 191 133 63 85 104 72 98 46 32 79 84 78 55 71 105 119 139 206 200 120 106 92 136 73 36 39 159
781 159 19 69 34 110 158 69 137 103 78 38 114 135 241 287 287 917 792 928 1582 2375 1178 450 718 943 7057 12603 12960
528 12960 7322 1238 785 405 446 374 184 139 149 55 199 190 215 83 55 72 118 86 132 68 74 41 120 105 136 153 80 58 231 134
246 134 43 98 106 171 31 170 102 56 87 132 214 107 188 184 72 141 133 40 88 17 112 41 163 173 40 148 76 231 271 219 116 231
-54 231 99 108 190 92 88 107 186 97 65 90 75 115 140 117 190 230 167 117 130 67 123 40 35 143 94 117 177 108 192 36 19 77 120 112 31 74
$$ packed form
1936A52p2l7K06j29n0Pm3J64j33KJ19r8R4j13R1N1j24J70k2P22J717J829o79j586j850j56
1692B32R8j86o7NqM1L1j06J8J32M6j98L8L6pR1j03L3J20q8O2n2j7N5q2P2k2j36k4K4L5l1N4
1382I6J56j16j5j6K85j20n6j10q2J8K21R6j75j08J07j28Q7N1m2K8o0O3N7p7l1m5J18j23K2
1110A01J12j83J43j24M5M0J7Q7m7n8p0K2J9l2K6n2j4M7Nok3J6L4J4K0O7oq0j4j4M4o3l7LJ20
781A59j40N0l5P6M8q9O8l4k5m0P6K1J06M6%O30j25J36O54P93j197p28K68K25O114N546L57
528A2960n638o084m53l80M1p2j90m5J0r4J44rK5j32k8J7M6l2M6o4Ol3P9j5L1J7p3k2J73r7
246A34r1N5QO5j40J39o8m6L1M5Q2j07Q1mj12O9qr3M8p1R5p1J22J0j33J08p2J55M0n2j03J15
-54B31j32RQ2r8mJ9P9q9l2K5j5M0K5k3P3M0o3n0J3o3N6q3nJ08m9K3O0o9Q4j56j7N8M3qq1M3
-392G4
##PAGE=	F1=-3200.02
##FIRST=	4405.895418600002813,	4405.895418600002813,	0
##DATA TABLE=	(F2++(Y..Y)), PROFILE
$$ plain form
4406 186 38 69 103 55 69 112 122 147 176 161 173 178 244 142 13 75 182 57 55 66 194 172 127 71 182 214 121 153 103 109 54 104 43
4096 43 147 81 222 98 125 174 25 18 150 62 80 109 100 207 184 243 94 191 170 58 99 112 126 120 231 137 168 116 16 163 177
3805 177 27 136 67 100 159 92 77 59 141 101 26 124 195 45 128 77 68 95 155 109 130 194 240 108 38 126 194 203 109 133 31 95 124
3495 124 103 63 231 109 79 52 66 15 93 38 98 219 134 120 128 216 292 134 205 253 250 105 157 74 142 132 129 122 76 177 241 214 32
3185 32 109 215 20 67 105 266 153 75 74 92 45 108 63 150 143 139 205 246 183 156 68 39 143 78 53 88 253 310 180 183 206 58 116
2875 116 115 125 101 95 146 118 62 140 203 97 55 27 74 209 237 79 121 112 78 96 88 169 114 97 120 197 113 101 95 23 196 137 13 125
2556 125 159 54 104 106 100 173 224 35 152 27 47 139 71 90 175 136 103 120 116 130 166 79 26 165 55 216 138 141 202 99 217 64
2256 64 78 108 73 64 75 8 108 149 246 125 152 47 114 268 178 179 237 102 176 99 116 126 82 55 65 143 321 148 362 966 979 353
$$ packed form
4406A86j48L1L4m8J4M3J0K5K9j5J2NO6j02j29O2J07j25kJ1J28k2m5n6J11L2r3L2n0On5N0o1
4096D3J04o6J41j24K7M9j49pJ32q8J8K9rJ07k3N9j49R7k1j12M1J3J4oJ11r4L1n2j00J47J4
3805A77j50J09o9L3N9o7j5j8Q2m0p5R8P1j50Q3n1rK7O0m6K1O4M6j32p0Q8O8Rr4K4j02O4K9
3495A24k1m0J68j22l0k7J4n1P8n5O0J21q5j4QQ8P6j58P1M8lj45N2q3O8j0lpm6J01O4k7j82
3185C2P7J06j95M7L8J61j13p8jJ8m7O3m5Q7pmO6M1o3k7q8k9J04o5k5L5J65N7j30LK3j48N8
2875A16jJ0k4oN1k8n6P8O3j06m2k8M7J35K8j58M2rl4J8qQ1n5j7K3P7q4j2op2J73n9j24J12
2556A25L4j05N0KoP3N1j89J17j25K0R2o8J9Q5l9l3J7mJ4L6q7n3J39j10J61p8LO1j03J18j53
2256F4J4L0l5rJ1o7J00M1R7j21K7j05O7J54r0JN8j35P4p7J7J0m4k7J0P8J78j73K14O04J3o26
$$ plain form
1955 353 126 160 68 23 237 121 38 60 53 142 48 53 168 87 161 169 110 201 55 286 409 823 2996 4688 3901 2398 458 90
1692 90 327 182 145 49 25 124 194 69 38 168 244 46 81 65 100 234 114 181 268 210 206 117 106 173 131 192 152 73 42 53 88 43
1392 43 85 282 177 122 184 415 314 204 127 63 70 283 344 162 119 237 41 106 175 133 166 139 150 200 114 100 111 211 83 107
1110 107 204 33 172 61 102 173 177 247 183 115 43 96 90 66 66 42 43 51 111 79 57 80 56 63 125 208 212 139 93 141 137 82 81 30 173 19 107
763 107 26 136 147 70 120 99 78 71 107 200 139 166 173 782 705 937 1776 2719 1551 443 598 682 5808 10762 11518 6926 1339
509 1339 773 452 328 388 137 144 146 64 177 142 236 73 71 27 52 42 71 66 47 103 146 112 144 134 73 57 208 83 12 127 37 144
209 144 11 194 126 44 65 114 185 95 174 166 81 164 145 65 93 9 118 50 148 166 45 203 45 198 249 192 150 247 151 76 172 91
-92 91 116 127 194 73 37 112 36 128 162 109 189 226 145 151 142 112 90 47 30 100 90 101 166 101 157 75 22 56 147 90 50 66
$$ packed form
1955C53k27L4r2m5K14j16q3K2pQ9r4NJ15q1P4Qn9R1j46K31J23M14K173J692p87j503j940l68
1692I0K37j45l7r6k4R9P0j25l1J30P6j98L5j6L5J34j20O7Q7n8mq9j1O7m2O1m0p9l1J1L5m5
1392D3M2J97j05n5O2K31j01j10p7o4PK13O1j82m3J18j96O5O9m2L3k7J1N0q6j4J1J00j28K4
1110A07R7j71J39j11M1P1MP0o4o8p2N3ok4%k4JQO0l2k2K3k4PO2Q3Mp3m6M8mn5jn1J43j54Q8
763A07q1J10J1p7N0k1k1pL6R3o1K7PO09p7K32Q39R43j168j108J55Q4N126M954P56m592n587
509A339n66l21j24O0k51PKq2J13l5R4j63km4K5j0K9nj9N6M3l4L2j0o1j6J51j25p1J15r0J07
209A44j33J83o8q2K1M9P1r0P9qq5Q3j9q0K8q4J09o8R8J8j21J58j58J53N1n7m2R7r6p5R6q1
-92I1K5J1O7j21l6P5p6R2L4n3Q0L7q1Orl0k2m3j7P0j0J1O5o5N6q2n3L4R1n7m0J6
-392F6
##PAGE=	F1=-3218.8
##FIRST=	4405.895418600002813,	4405.895418600002813,	0
##DATA TABLE=	(F2++(Y..Y)), PROFILE
$$ plain form
4406 134 113 8 84 117 35 50 69 179 131 107 135 188 266 108 58 122 183 105 54 49 188 206 126 116 125 189 77 165 153 106 49 115 51
4096 51 149 87 165 45 114 139 70 35 146 97 79 126 90 208 283 216 47 221 180 32 143 102 126 149 214 120 137 143 59 128 181 33
3796 33 144 91 80 185 59 75 22 108 104 36 116 198 81 79 67 76 126 199 117 120 187 215 82 69 104 139 161 124 151 38 37 91 55 81 219
3467 219 99 67 69 48 47 32 35 118 223 125 156 149 207 265 116 223 296 233 96 166 66 120 125 121 121 86 188 191 158 14 85 215 59 88
3148 88 71 219 173 40 97 141 71 47 69 134 144 152 218 280 182 153 72 17 138 101 69 29 234 272 162 189 268 96 84 106 173 62
2847 62 98 157 119 48 125 184 72 46 43 41 188 238 61 104 134 98 132 111 137 64 100 140 240 168 145 98 15 153 120 13 131 162 53
2537 53 57 106 137 201 226 34 141 36 14 148 75 87 126 146 81 103 111 101 157 81 120 133 53 175 119 121 182 63 184 70 122 122 105
2227 105 80 111 56 121 145 253 116 165 25 111 237 174 165 240 91 185 85 101 121 79 75 40 113 339 188 353 1022 928 323 133
$$ packed form
4406A34k1j05P6L3q2J5J9J10m8k4K8N3P8j58n0O4O1p8n1nJ39J8q0j0RO4j12Q8j2m7n7O6o4
4096E1R8o2P8j20O9K5o9l5J11m9j8M7l6J18P5o7j69J74m1j48J11m1K4K3O5r4J7Oq4O9N3j48
3796C3J11n3j1J05j26J6n3Q6mo8Q0Q2j17kj2RN0P3q2LO7K8j33j3L5L5K2l7K7j13jN4l6K6J38
3467B19j20l2Kk1jj5LQ3J05r8L1pN8N8j49J07P3o3j37P0j00N4Nm%l5J02Ll3j44P1J30j56K9
3148H8j7J48m6j33N7M4p0k4K2O5J0QO6O2r8k9q1n5J21l7l2m0K05L8j10K7P9j72j2K2O7j11
2847F2L6N9l8p1P7N9j12k6lkJ47N0j77M3L0l6L4k1K6p3L6M0J00p2k3m7q3J38l3j07J18L1j09
2537E3MM9L1O4K5j92J07j05k2J34p3J2L9K0o5K2Qj0N6p6L9J3q0J22n6KO1j19J21j14N2%j7
2227A05k5L1n5O5K4J08j37M9j40Q6J26o3rP5j49R4j00J6K0m2ml5P3K26j51J65O69r4o05j90
$$ plain form
1946 133 146 56 61 213 143 74 34 89 50 51 45 127 175 110 291 34 165 35 324 692 1739 5435 8226 7057 4446 679 249
1692 249 390 257 220 84 112 112 260 135 28 161 209 109 91 13 110 256 134 235 264 265 165 47 90 130 132 178 125 96 88 55
1410 55 83 28 100 282 220 88 273 268 262 193 171 94 88 293 315 133 155 284 44 80 171 117 152 149 131 155 42 86 142 197 79 115 171
1101 171 46 178 62 118 191 190 219 158 68 45 116 72 60 63 32 71 29 141 62 45 91 48 25 136 157 226 137 73 173 135 84 136 34
791 34 146 28 126 21 164 70 149 99 129 79 114 155 272 104 166 227 559 568 882 1651 2742 2092 1125 1050 935 1540 3006 2593
528 2593 1557 628 308 332 200 186 71 175 145 58 186 45 160 93 100 57 41 104 74 29 32 120 215 109 125 109 31 91 166 30
246 30 89 173 12 82 44 164 166 44 32 109 141 62 175 111 82 201 147 75 83 39 97 96 128 142 64 247 38 145 196 144 186 239 187
-64 187 60 127 125 150 153 190 44 31 97 49 127 186 127 173 195 144 203 127 165 79 76 67 31 122 63 92 102 65 145 31 6 129 90 35 103
$$ packed form
1946A33J3r0NJ52p0o9m0N5l9JoQ2M8o5J81k57J31j30K89L68J047L696K791j169k611l767m30
1692B49J41j33l7j36K8%J48j25j07J33M8j00j8p8R7J46j22J01K9Jj00j18M3M0KM6n3k9ql3
1410E5K8n5P2J82o2j32J85noo9k2p7oK05K2j82K2J29k40L6R1n4L5lj8K4j13M4N6N5j18L6N6
1101A71j25J32j16N6P3jK9o1r0k3P1m4j2Ll1L9m2J12p9j7M6m3k3J11K1O9q9o4J00l8n1N2j02
791C4J12j18R8j05J43r4P9n0L0n0L5M1J17j68O2O1L32RL14P69J091o50r67p5j15O05J466m13
528B593j036r29l20K4j32j4j15J04l0q7J28j41J15o7Pm3j6O3l0m5LQ8R5j06J6j6p8O0P5j36
246C0N9Q4j61P0l8J20Kj22j2P7L2p9J13o4k9J19n4p2Qm4N8jL2J4p8J83k09J07N1n2M2N3n2
-64A87j27O7kK5LL7j46j3O6m8P8N9n9M6K2n1N9p6L8q6lrl6R1n9K9J0l7Q0j14k5J23l9n5O8
-392A03
##PAGE=	F1=-3237.58
##FIRST=	4405.895418600002813,	4405.895418600002813,	0
##DATA TABLE=	(F2++(Y..Y)), PROFILE
$$ plain form
4406 91 244 131 65 214 151 109 144 285 95 80 59 221 268 129 151 210 156 188 121 63 156 260 88 185 118 157 52 155 222 149
4124 149 64 160 111 137 118 79 59 120 112 146 79 117 132 45 156 101 180 377 149 53 252 183 70 200 75 135 182 192 112 89 166 126
3824 126 82 190 37 137 147 53 217 30 101 53 83 103 55 117 199 119 53 61 67 176 254 149 104 176 188 107 97 103 103 99 143 165 77 29
3504 29 65 112 99 216 79 62 95 67 71 47 46 126 212 141 181 177 173 230 105 207 327 187 92 157 74 93 112 108 129 99 191 151 115 30 130
3176 130 211 79 113 33 156 190 44 104 193 80 11 55 100 160 164 210 302 159 148 124 10 114 121 114 27 199 210 139 186 318 110
2885 110 90 87 208 52 119 152 114 71 89 150 51 78 73 40 148 242 60 75 165 123 162 129 118 64 120 142 267 208 216 93 47 98 112
2575 112 29 134 166 68 54 109 168 226 224 25 124 52 59 157 74 77 58 152 58 78 107 75 138 81 202 102 43 111 91 95 159 19 160 58
2256 58 190 140 135 90 138 118 133 142 234 116 159 19 106 173 165 155 240 87 186 73 89 121 91 133 21 76 330 211 338 1036 808
$$ packed form
4406I1J53j13o6J49o3m2L5J41j90j5k1J62M7j39K2N9n4L2o7n8R3J04j72R7o7L9j05J03O7p3
4124A49q5R6m9K6j9l9k0O1qL4o7L8J5q7J11n5P9J97k28r6J99o9j13J30j25O0M7J0q0k3P7m0
3824A26m4J08j53J00J0r4J64j87P1m8L0K0m8O2Q2q0o6QOJ09P8j05m5P2J2q1j0O%mM4K2q8m8
3504B9L6M7j3J17j37j7L3k8Mk4jQ0Q6p1M0mmN7j25J02J20j40r5O5q3J9J9mK1l0R2m0l6q5J00
3176A30Q1j32L4q0J23L4j46O0Q9j13o9M4M5O0MM6R2j43j1k4j14J04Ppq7J72J1p1M7J32k08
2885A10k0lJ21j56O7L3l8m3J8O1r9K7nl3J08R4j82J5R0m2L9l3j1n4N6K2J25n9Qj23m6N1J4
2575A12q3J05L2r8j4N5N9N8kj99R9p2PR8q3Lj9R4r4K0K9l2O3n7J21j00n9O8k0MO4j40J41j02
2256E8J32n0nm5M8k0J5RR2j18M3j40Q7O7qj0Q5j53R9j13J6L2l0M2j12N5K54j19J27O98k28
$$ plain form
1964 808 256 146 114 41 121 176 195 169 47 135 69 97 63 134 284 35 445 87 174 189 501 1196 3682 10931 16943 14916
1720 14916 9251 1297 675 588 451 327 194 287 108 341 228 123 184 141 194 110 111 154 252 145 281 260 320 106 81 80 98
1467 98 132 179 119 122 145 41 60 12 137 248 271 36 364 109 159 169 246 112 88 298 282 93 168 313 91 97 185 109 152 146 156
1176 156 134 52 101 184 166 67 134 115 75 191 80 146 179 190 151 130 9 83 153 50 52 88 47 125 138 175 41 29 97 94 141 177 61
866 61 244 119 44 183 193 109 208 120 79 65 117 85 185 92 296 184 206 97 158 256 376 249 327 417 271 417 809 1179 2451
594 2451 2823 2380 2534 2939 15333 26736 26582 13715 1734 1230 1033 984 494 380 284 142 128 328 256 78 248 163
387 163 135 148 177 209 130 162 74 301 110 81 102 74 185 106 125 175 214 27 22 128 69 229 101 19 122 87 48 196 99 61 248
96 248 127 69 71 120 55 188 113 106 82 277 118 86 142 83 226 217 198 73 67 177 196 194 192 16 101 36 166 113 230 175 160 146 155 295
$$ packed form
1964H08n52j10l2p3Q0N5J9k6j22Q8o6K8l4P1J50k49M10l58Q7J5L12O95K486P249O012k027
1720A4916n665p954o22q7j37j24j33R3j79K33j13j05O1m3N3q4JM3R8j07J36k1O0k14k5jJ8
1467I8L4M7o0LK3j04J9m8J25J11K3k35L28k55N0J0P7j34k4K10j6j89P5J45k22OQ8p6M3oJ0
1176A56k2q2M9Q3j8r9O7j9m0J16j11O6L3J1l9k1j21P4P0j03KL6m1P8J3L7j34j2O8lM7L6j16
866F1J83j25p5J39J0q4R9q8m1j4N2l2J00r3K04j12K2j09O1R8J20j27P8R0j46J46L92L70J272
594B451L72m43J54M05J2394J1403j54j2867j1981n04j97m9m90j14r6j42j4K00p2j78J70q5
387A63k8J3K9L2p9L2q8K27j91k9K1k8J11p9J9N0L9j87nJ06n9J60j28q2J03l5l9J48r7l8J87
96B48j21n8KM9o5J33p5pk4J95j59l2N6n9J43rj9j25oJ10J9kkj76Q5o5J30n3J17n5j5j4RJ40
$$ plain form
-223 295 72 229 151 141 59 87 193 66 47 146 89 252 103 102 112 210 124 230
$$ packed form
-223B95k23J57p8j0q2K8J06j27j9R9n7J63j49jJ0R8q6J06
-392B30
##PAGE=	F1=-3256.36
##FIRST=	4405.895418600002813,	4405.895418600002813,	0
##DATA TABLE=	(F2++(Y..Y)), PROFILE
$$ plain form
4406 270 428 318 190 359 326 313 351 437 203 212 133 297 279 275 282 336 122 305 211 156 144 339 101 269 228 145 113 120 293 243 145
4115 145 246 209 115 169 64 165 140 139 245 140 100 167 41 201 161 139 457 96 79 279 189 157 268 51 158 216 185 111 72
3842 72 193 202 78 216 31 114 224 18 256 96 148 75 102 109 102 130 211 168 86 77 40 240 302 177 126 174 161 165 116 153 141 77 163
3533 163 169 129 92 52 212 115 222 60 74 130 93 83 136 70 130 200 179 191 218 117 193 107 158 349 126 97 134 102 83 94 112 159
3232 159 107 188 155 91 65 205 208 83 137 20 120 204 107 94 241 91 51 24 51 190 182 188 312 121 147 188 15 72 149 147 70 155
2932 155 133 119 191 351 90 149 67 221 84 158 135 113 122 47 107 51 124 111 62 103 251 78 38 195 160 187 140 127 103 138 134 282
2631 282 228 300 86 87 47 110 48 142 178 88 119 117 184 243 217 8 133 72 114 157 68 62 67 162 58 77 105 61 107 84 262 71 50 96
2312 96 57 61 136 33 150 28 260 148 159 90 151 172 149 145 197 136 133 33 108 91 154 177 239 85 173 60 100 141 110 214 28 42
$$ packed form
4406B70J58j10j28J69l3j3L8Q6k34Rp9J64j8mPN4k14J83r4n5j2J95k38J68m1q3l2PJ73n0r8
4115A45J01l7r4N4j05J01k5jJ06j05m0O7j26J60m0k2L18l61j7K00r0l2J11k17J07N8l1p4l9
3842G2J21Rj24J38j85Q3J10k06K38j60N2p3K7PpK8Q1m3q2rl7K00O2j25n1M8j3Mm9L7j2o4Q6
3533A63Om0l7m0J60r7J07j62J4N6l7j0N3o6O0P0k1J2K7j01P6q6N1J91k23k9L7l2j9J1J8M7
3232A59n2Q1l3o4k6J40Lj25N4j17J00Q4r7j3J47j50m0k7K7J39qOJ24j91K6M1j73N7P7kp7Q5
2932A55k2j4P2J60k61N9q2J54j37P4k3k2Rp5O0n6P3j3m9M1J48j73m0J57l5K7m7j3k4L5mJ48
2631B82n4P2k14Jm0O3o2R4L6r0L1kO7N9k6k09J25o1M2M3q9oNR5j04J9K8m4M6k3J78j91k1M6
2312I6l9MP5j03J17j22K32j12J1o9O1K1k3mN2o1lj00P5j7O3K3O2j54Q8j13M0M1l1J04j86J4
$$ plain form
2011 42 294 217 316 1004 671 182 163 95 29 193 126 267 283 93 185 200 164 162 248 403 80 629 205 296 418 846 1923 6257
1749 6257 18705 29383 26132 16089 2248 1247 892 765 493 342 502 183 432 329 254 248 148 310 144 218 219 213
1542 213 163 317 298 372 84 190 47 105 159 222 164 179 213 37 45 74 183 193 323 76 421 187 69 128 341 131 86 301
1279 301 264 44 148 328 171 159 216 118 172 137 221 165 148 152 237 124 60 170 52 126 229 133 183 138 183 60 134 105 163 211 25
988 25 44 115 106 214 287 216 86 63 109 148 271 250 119 275 115 42 182 313 182 312 265 86 132 82 183 211 314 492 357
716 357 326 130 197 417 551 547 614 662 77 287 804 505 2118 3727 3997 4596 5829 35550 62870 64056 34608 4968
509 4968 3271 2425 2139 1363 889 469 143 297 599 596 361 490 276 226 271 243 395 329 342 50 386 131 41 148 225 318
265 318 86 270 258 241 15 142 237 85 311 183 61 143 43 135 245 220 9 301 87 64 96 233 87 307 122 91 99
$$ packed form
2011D2K52p7R9O88l33m89j9o8o6J64o7J41J6j90R2J5l6kQ6J55l23N49m24R1J22M28J077M334
1749F257J2448J0678l251j0043j3841j001l55j27k72j51J60l19K49j03p5oj00J62j66P4Jo
1542B13n0J54j9P4k88J06j43N8N4O3n8J5L4j76QK9J09J0J30k47L45k34j18N9K13k10m5K15
1279C01l7k20J04J80j57j2N7r8N4l5Q4n6j7MQ5j13o4J10j18P4J03r6N0m5M5j23P4k9N8M8j86
988B5J9P1rJ08P3p1j30k3M6L9J23k1j31J56j60p3J40J31j31J30m7j79M6n0J01K8J03J78j35
716C57l1j96O7K20J34mO7M8n85K10N17k99J613J609K70N99J233K9721K7320J186k9448k9640
509D968j697q46k86p76m74m20l26J54L02lk35J29k14n0M5k8J52o6J3k92L36k55r0J07P7R3
265C18k32J84j2j7k26J27R5j52K26j28j22Q2j00R2J10k5k11K92k14k3L2J37j46K20j85l1Q
$$ plain form
11 99 293 231 74 185 85 267 207 191 119 87 251 262 256 228 29 185 84 303 136 308 250 177 121 166 417 25 319 273 242
-261 242 33 217 294 180 240 266 287 390 246 260 229 395 310 423
$$ packed form
11I9J94o2j57J11j00J82o0j6p2l2J64J1ok8j99J56j01K19j67J72n8p3n6M5K51l92K94m6l1
-261B42k09J84P7j14O0K6K1J03j44J4l1J66q5J13
-392D23
##PAGE=	F1=-3275.14
##FIRST=	4405.895418600002813,	4405.895418600002813,	0
##DATA TABLE=	(F2++(Y..Y)), PROFILE
$$ plain form
4406 526 642 537 385 545 522 560 600 612 393 390 305 402 334 477 427 482 158 443 297 288 223 435 220 360 371 189 208 88 359
4134 359 362 264 349 329 104 227 183 285 190 201 357 211 140 199 142 255 249 131 516 183 86 299 212 255 342 106 191 253 202 115
3852 115 144 230 277 145 255 32 78 303 52 301 178 206 77 156 131 165 165 236 228 129 122 29 310 332 189 198 185 138 224 124 223
3561 223 213 152 182 162 183 147 51 308 129 239 69 97 171 107 83 222 111 137 201 228 186 272 47 164 129 82 361 73 115 104
3279 104 144 107 85 133 209 108 184 197 72 104 273 211 87 150 53 157 220 170 69 278 117 86 39 14 222 205 167 310 77
3007 77 148 248 22 16 184 160 96 116 52 108 214 366 35 212 59 208 117 205 118 126 181 56 60 74 165 153 83 80 262 106 12
2716 12 217 205 208 143 161 127 150 133 289 226 382 80 134 41 112 67 158 195 105 189 131 184 253 209 32 179 91 162 144 55 57 154 181
2406 181 81 114 104 57 64 90 299 46 83 177 36 34 114 79 154 49 318 136 176 78 152 208 171 156 161 161 92 53 120 93 146 222 233
$$ packed form
4406E26J16j05j52J60k3L8M0J2k19lq5R7o8J43n0N5l24K85j46ro5K12k15J40J1j82J9j20K71
4134C59Lr8Q5k0k25J23m4J02r5J1J56j46p1N9n7J13oj18L85l33r7K13q7M3Q7k36Q5O2n1q7
3852A15K9Q6M7j32J10k23M6K25k51K49j23K8j29P9k5L4%P1qr9pr3K81K2j43Rj3m7Q6j00R9
3561B23j0o1L0k0K1l6r6K57j79J10j70K8P4o4k4J39j11K6O4K7m2Q6k25J17l5m7K79k88M2j1
3279A04M0l7k2M8P6j01P6J3j25L2J69o2j24O3r7J04O3n0j01K09j61l1m7k5K08j7l8J43k33
3007G7P1J00k26oJ68k4o4K0o4N6J06J52l31J77j53J49r1Q8q7QN5j25MJ4R1j2p0lJ82j56r4
2716A2K05j2Lo5J8l4K3j7J56o3J56l02N4r3P1m5R1L7r0Q4n8N3O9m4j77J47q8P1j8q9KR7K7
2406A81j00L3j0m7PK6K09k53L7R4j41kQ0l5P5j05K69j82M0r8P4N6l7j5N%o9l9O7k7N3P6J1
$$ plain form
2096 233 80 141 51 136 187 127 296 47 38 234 206 290 945 625 133 175 120 66 272 90 343 395 142 230 322 235 308 401 525
1824 525 181 823 317 475 694 1284 2779 9103 27637 43692 39077 24001 3370 1915 1236 1146 712 513 726 319
1636 319 524 423 401 349 298 451 194 317 283 143 209 348 388 420 149 300 27 140 248 293 240 266 292 76 98 143 239 169
1373 169 369 157 423 235 56 110 440 179 116 301 283 45 102 343 265 236 258 145 200 133 299 235 238 236 294 91 77 217 78
1101 78 201 300 199 227 75 171 107 192 212 275 282 22 33 134 190 329 454 258 170 128 146 207 400 348 283 326 162 91 199 454
819 454 291 445 444 220 220 28 302 277 575 711 560 473 168 229 624 790 928 981 937 374 211 930 836 2311 4723 5742
575 5742 6870 9135 59466 105949 109101 60089 9090 5830 4208 3505 2413 1520 690 165 524 934 991 734 778
396 778 423 322 396 305 603 568 549 206 455 165 105 227 420 461 181 432 322 250 63 274 355 280 404 267 104 159 92
$$ packed form
2096B33j53O1r0Q5N1o0J69k49rJ96k8Q4O55l20m92M2n5n4K06j82K53N2k53Q8R2q7P3R3J24
1824E25l44O42n06J58K19N90J495O324J8534J6055m615j5076k0631j455o79r0m34j99K13m07
1636C19K05j01k2n2n1J53k57J23l4j40O6J39M0L2k71J51k73J13J08M5n3K6K6k16K2M5R6p0
1373A69K00k12K66j88j79N4L30k61o3J85j8k38N7K41p8k9K2j13N5o7J66o4LkN8k03j4J40j39
1101G8J23R9j01K8j52R6o4Q5K0O3Pk60J1J01N6J39J25j96q8m2J8O1J93n2o5M3j64p1J08K55
819D54j63J54jk24%j92K74k5K98J36j51q7l05O1L95J66J38N3m4n63j63P19r4J475K412J019
575E742J128K265N0331M6483L152m9012n0999l260j622p03j092q93q30n25L59M10N7k57M4
396G78l55j01P4r1K98l5j9l43K49k90o0J22J93M1k80K51j10p2j87K11Q1p5J24j37j63N5o7
$$ plain form
143 92 251 327 373 75 348 36 90 160 361 194 432 162 143 124 301 356 138 325 180 306 229 185 187 190 345 346 335 304 64 269
-139 269 218 435 233 417 338 228 169 199 542 160 433 413 363 118 359 412 331 461 437 509 542 430 453 434 603 546 651
$$ packed form
143I2J59P6M6k98K73l12N4P0K01j67K38k70j9j9J77N5k18J87j45J26p7m4KLJ55Jj1l1k40K05
-139B69n1K17k02J84p9j10n9L0L43l82K73k0n0k45K41N3q1J30k4P2L3j12K3j9J69n7J05
-392F51
##PAGE=	F1=-3293.92
##FIRST=	4405.895418600002813,	4405.895418600002813,	0
##DATA TABLE=	(F2++(Y..Y)), PROFILE
$$ plain form
4406 785 852 752 598 741 705 805 843 782 600 560 478 509 431 686 556 626 267 580 365 431 355 527 359 449 500 270 307 127
4143 127 417 475 394 441 449 130 281 302 396 270 255 468 285 210 225 260 304 337 184 549 321 72 308 252 347 408 194 226 291
3871 291 231 120 239 271 338 230 290 68 50 368 115 344 245 267 63 214 162 231 215 270 292 154 182 73 373 343 196 285
3608 285 201 128 271 122 283 273 244 205 150 232 186 59 384 140 272 109 118 208 109 84 291 161 152 211 279 169 326 28 153
3335 153 165 22 363 66 144 77 186 143 111 151 266 101 184 240 40 142 319 221 112 145 94 224 237 218 41 302 160 119
3073 119 92 82 243 227 161 298 39 154 290 46 59 216 154 112 94 35 111 246 362 47 252 62 170 134 252 115 145
2819 145 232 103 14 97 191 195 101 106 268 138 38 227 245 226 140 206 122 161 151 291 206 446 81 187 66 115 84 177 210 117 242
2528 242 146 172 258 203 75 239 107 191 117 37 73 231 201 110 155 101 52 23 93 313 64 119 273 62 50 103 114 165 116 359
$$ packed form
4406G85O7j00j54J43l6J00L8o1j82m0q2L1p8K55j30P0l59L13k15O6p6J72j68R0N1k30L7j80
4143A27K90N8q1M7Ql19J51K1R4j26j5K13j83p5J5L5M4L3j53L65k28k49K36n6R5O1k14L2O5
3871B91o0j11J19L2O7j08O0k22j8L18k53K29r9K2k04J51n2O9j6N5K2j38K8j09L00l0j47Q9
3608B85q4p3J43j49J61j0k9l9n5Q2m6j27L25k44J32j63RR0r9k5K07j30rN9O8j10J57k98J25
3335A53J2j43L41k97P8o7J09m3l2M0J15j65Q3N6k00J02J77r8j09L3n1J30J3j9j77K61j42m1
3073A19k7j0J61j6o6J37k59J15J36k44J3J57o2m2j8n9P6J35J16l15K05j90J08l6J18j37L0
2819A45Q7j29q9Q3R4Mr4NJ62j30j00J89J8j9q6O6q4L9j0J40q5K40l65J06j21M9l1R3L3r3J25
2528B42r6K6Q6n5j28J64j32Q4p4q0L6J58l0r1M5n4m9k9P0K20k49N5J54k11j2N3J1N1m9K43
$$ plain form
2246 359 105 184 58 154 219 196 171 151 169 47 75 138 199 142 261 222 70 90 55 177 243 140 361 61 69 161 181 270 898 751
1964 751 112 174 163 139 344 122 405 487 186 258 415 304 470 548 634 262 996 407 653 972 1723 3618 11774 36283
1739 36283 57552 51680 31733 4468 2594 1557 1528 951 682 922 467 606 498 541 463 484 599 250 395 325 75
1542 75 280 382 496 461 231 392 113 178 382 355 315 360 380 133 190 202 301 224 401 224 373 187 59 175 524 260 176
1288 176 292 335 106 89 373 357 308 298 178 218 138 368 319 307 337 344 88 112 266 158 293 391 257 267 44 153 229 279 310
1016 310 399 355 54 18 142 285 450 614 293 258 199 204 274 507 453 439 397 241 144 247 579 412 585 627 363 315 38 423
753 423 392 831 920 753 620 201 258 845 1048 1318 1355 1209 643 190 1139 1799 3133 5667 7321 8939 12279 83062 148759
537 148759 154217 85960 13419 8484 6113 4891 3413 2157 902 213 768 1267 1376 1115 1063 570 413 509 369 799
$$ packed form
2246C59k54P9j26R6O5k3k5k0J8j22K8O3O1n7J19l9j52K0l5J22O6j03K21l00QR2K0Q9O28j47
1964G51o39O2j1k4K05k22K83Q2l01P2J57j11J66P8Q6l72P34n89K46L19P51J895Q156K4509
1739C6283K1269n872j9947k7265j874j037k9n77k69K40m55J39j08M3p8K1J15l49J45p0k50
1542G5K05J02J14l5k30J61k79O5K04k7m0M5K0k47N7J2R9p7J77j77J49j86j28J16L49k64q4
1288A76J16M3k29j7K84j6m9j0j20M0q0K30m9j2L0Pk56K4J54j08J35R8j34J0k23J09P6N0L1
1016C10Q9m4l01l6J24J43J65J64l21l5n9NP0K33n4j4m2j56r7J03L32j67J73M2k64m8k77L85
753D23l1M39Q9j67j33m19N7N87K03K70L7j46n66m53R49O60J334K534J654J618L340P0783O5697
537A48759N458o8257p2541m935k371j222j478j256j255o89N55M99J09k61n2m93j57R6j40M30
$$ plain form
349 799 799 751 384 500 200 195 310 628 584 315 583 356 244 139 391 464 481 496 338 140 165 176 362 430 510 184 380 19
86 19 144 233 480 311 541 215 227 168 301 467 215 483 291 337 276 205 266 299 445 433 414 393 99 340 352 539 363 535
-176 535 420 293 245 277 639 315 549 548 478 241 495 525 484 673 620 721 681 624 644 659 794 792 879
$$ packed form
349G99%m8l67J16l00nJ15L18m4k69K68k27j12j05K52P3J7J5j58j98K5J1J86O8Q0l26J96l61
86A9J25Q9K47j69K30l26J2n9J33J66k52K68j92M6o1p1O1L3J46j2j9k1k94K41J2J87j76J72
-176E35j15j27m8L2L62l24K34jp0k37K54L0m1J89n3J01m0n7K0J5J35kQ7
-392H79
##PAGE=	F1=-3312.7
##FIRST=	4405.895418600002813,	4405.895418600002813,	0
##DATA TABLE=	(F2++(Y..Y)), PROFILE
$$ plain form
4406 993 1016 920 787 910 840 1005 1030 915 784 692 614 592 532 860 638 739 387 690 403 557 483 594 474 523 587 352 390
4152 390 206 462 554 507 499 548 182 320 393 478 356 281 561 348 272 241 368 337 403 257 551 445 45 305 293 416 453 276
3889 276 252 332 251 124 323 307 374 310 309 114 75 402 174 376 281 324 48 259 189 287 263 302 344 153 242 117 415 333 207
3617 207 360 211 132 300 119 319 301 319 230 137 269 204 78 429 151 313 158 133 232 100 107 333 205 167 218 318 146
3364 146 366 89 160 202 93 353 84 182 60 220 167 164 151 318 92 193 263 19 177 335 229 156 118 140 275 254 241 30
3101 30 309 215 149 139 154 243 241 169 279 26 163 305 82 131 234 134 128 78 117 135 270 341 145 257 73 115 128 291 129
2828 129 156 266 145 32 109 197 227 119 149 261 169 63 222 269 240 135 247 94 174 172 284 176 479 90 239 75 122
2575 122 102 191 211 124 270 156 150 259 200 120 287 115 198 81 28 99 279 214 138 179 92 39 65 91 312 113 144 346 103 84
$$ packed form
4406I93K3r6j33J23p0J65K5j15j31r2p8k2o0L28k22J01l52L03k87J54p4J11j20M9O4k35L8
4152C90j84K56R2m7qM9l66J38P3Q5j22p5K80k13p6l1J27l1O6j46K94j06m00K60j2J23L7j77
3889B76k4Q0q1j27J99j6O7o4jj95l9L27k28K02r5M3k76K11p0R8k4L9M2j91Q9j25K98q2j26
3617B07J53j49p9J68j81K00j8J8q9r3J32o5j26L51k78J62j55k5R9j32PK26j28l8N1J00j72
3364A46K20k77P1M2j09K60k69R8j22J60n3lj3J67k26J01P0k44J58J58j06p3l8K2J35k1j3k11
3101C0K79r4o6j0J5Q9kp2J10k53J37J42k23M9J03j00on0L9J8J35P1j96J12j84M2J3J63j62
2828A29K7J10j21j13P7Q8L0j08L0J12r2j06J59M7k9j05J12j53Q0kJ12j08L03l89J49j64M7
2575A22k0Q9K0q7J46j14oJ09n9q0J67j72Q3j17n3P1J80o5p6M1q7n3K6K6K21j99L1K02k43j9
$$ plain form
2293 84 112 133 177 180 381 62 183 39 169 205 215 186 174 150 13 94 154 303 140 276 203 63 31 66 202 290 150 396 70
2021 70 100 94 145 266 888 957 97 156 193 227 397 199 437 541 226 263 463 364 615 660 711 306 1116 463 790 1203 2077 4276
1758 4276 13803 43090 68483 61704 37915 5343 3177 1792 1839 1159 823 1055 591 663 549 647 564 648 730 300 442
1561 442 336 121 352 423 579 487 294 452 207 202 530 384 365 437 470 201 305 231 362 316 418 263 298 153 57 272 579
1307 579 354 235 271 396 167 161 420 424 363 325 206 215 143 415 403 347 435 374 109 148 309 227 384 475 291 296 115 126 332 368
1025 368 385 510 413 91 19 137 374 551 742 312 334 262 263 338 577 542 553 473 322 182 309 665 520 701 777 479 396 98
763 98 526 528 1031 1080 899 737 219 284 1032 1269 1640 1651 1429 837 195 1340 2630 4076 6372 8437 10398 14647 101795
547 101795 183087 190772 107304 17140 10722 7824 6100 4112 2651 1065 263 980 1527 1676 1430 1291 681 484
$$ packed form
2293H4K8K1M4LK01l19J21j44J30L6J0k9j2k4j37Q1O0J49j63J36p3j40l2L5J36Q8j40K46l26
2021G0L0oN1J21O22O9q60N9L7L4J70j98K38J04l15L7K00r9K51M5N1m05Q10o53L27M13Q74K199
1758D276R527K9287K5393o779k3789l2572k166j385M7o80l36K32m64P2j14R8q3Q4Q2m30J42
1561D42j06k15K31P1J56r2j93J58k45nL28j46j9P2L3k69J04p4J31m6J02j55L5j45r6K15L07
1307E79k25j19L6J25k29oK59Mo1l8j19Rp2K72j2n6Q8o1k65L9J61q2J57R1j84Nj81J1K06L6
1025C68J7J25r7l22p2J18K37J77J91m30K2p2JP5K39l5J1q0j51j40J27L56j45J81P6k98q3k98
763I8M28KN03M9j81j62n18O5P48K37L71J1k22n92o42J145J290J446K296K065J961M249Q7148
547A01795Q1292P685q3468r0164o418k898j724j988j461j586q02P17N47J49k46j39o10j97
$$ plain form
378 484 588 431 946 972 913 541 513 232 275 374 812 661 447 697 354 226 213 471 545 651 572 382 167 156 257 440 531
124 531 600 305 387 57 200 295 565 409 611 263 311 222 294 542 281 618 390 354 322 251 336 388 531 505 474 469 130 388 458
-148 458 594 485 637 475 352 305 386 681 466 634 654 562 362 602 607 610 836 777 887 778 792 794 854 932 999 1062
-392 1062
$$ packed form
378D84J04j57N15K6n9l72k8k81M3R9M38j51k14K50l43j28j3K58P4J06p9j90k15j1J01J83R1
124E31O9k95Q2l30J43R5K70j56K02l48M8q9P2K48k61L37k28l6l2p1Q5N2J43k6l1nl39K58P0
-148D58J36j09J52j62j23m7Q1K95k15J68K0r2k00K40NLK26n9J10j09J4KO0P8O7O3
-392A062
##PAGE=	F1=-3331.48
##FIRST=	4405.895418600002813,	4405.895418600002813,	0
##DATA TABLE=	(F2++(Y..Y)), PROFILE
$$ plain form
4406 1107 1097 1006 914 1011 901 1117 1122 978 908 764 685 629 601 967 652 797 480 747 406 640 571 623 533 571 615 408 440 275
4143 275 488 577 580 507 607 234 337 441 516 422 269 621 386 309 245 443 343 432 315 518 530 19 289 316 448 465 328
3889 328 262 370 248 121 376 326 378 372 304 152 127 397 212 389 276 371 47 284 201 323 290 327 370 127 289 145 426
3636 426 305 222 404 212 139 313 122 326 292 363 250 126 290 202 107 436 162 344 200 144 233 88 146 344 234 170 216
3382 216 333 120 376 129 170 231 149 331 90 224 55 240 169 223 129 352 87 206 257 80 204 319 226 203 73 185
3138 185 292 266 237 38 300 274 175 165 219 217 241 178 252 39 175 288 118 191 231 107 150 59 204 176 273 309 240 228 92 57
2857 57 98 312 148 152 276 170 70 102 186 241 133 182 233 193 78 199 268 247 133 273 67 185 175 264 148 476 110 284
2594 284 61 135 116 190 191 129 269 159 122 257 195 157 309 114 184 54 47 123 291 212 166 179 74 21 127 94 303 159 150 383
$$ packed form
4406A107j0r1r2R7j10K16Nj44p0j44p9n6k8L66l15J45l17K67l41K34o9N2r0L8M4k07L2j65
4143B75K13Q9Lp3J00l73J03J04P5r4j53L52k35p7o4J98j00Q9j17K03J2n11K70K7J32J7j37
3889C28o6J08j22j27K55n0N2oo8j52k5K70j85J77j13R5l24K37q3J22l3L7M3k43J62j44K81
3636D26j21q3J82j92p3J74j91K04l4P1j13j24J64q8r5L29k74J82j44n6Q9j45N8J98j10o4M6
3382B16J17k13K56k47M1O1q2J82k41J34j69J85p1N4r4K23k65J19N1j77J24J15r3k3j30J12
3138A85J07k6k9j99K62k6r9j0N4kK4o3P4k13J36J13j70P3M0j24M3r1J45k8R7L6o9j2j36l5
2857E7M1K14j64MJ24j06j00L2Q4N5j08M9N1m0j15J21O9k1j14J40k06J18j0Q9j16L28l66J74
2594B84k23P4j9P4Jo2J40j10l7J35o2l8J52j95P0j30pP6J68p9m6J3j05n3J06l3K09j44rK33
$$ plain form
2312 383 141 111 135 132 185 226 381 43 175 41 198 166 221 193 208 103 37 102 161 380 137 262 178 71 70 71 198 312 158
2040 158 396 81 119 67 110 276 878 1101 74 125 198 313 417 273 430 549 264 240 463 405 711 719 736 303 1161 483
1795 483 858 1341 2276 4616 14814 46753 74397 67242 41365 5828 3556 1896 2019 1288 909 1102 665 684 573
1617 573 700 626 756 822 331 458 312 215 401 461 608 493 325 471 286 201 661 372 372 476 556 289 436 218 408 392
1373 392 423 266 229 219 91 354 593 434 271 237 440 214 246 465 449 394 331 221 190 138 428 471 354 505 375 128 174
1119 174 339 270 454 531 293 308 192 85 394 437 424 587 445 124 53 118 443 611 818 302 383 305 306 379 599 593 606 532 386
847 386 196 358 699 586 765 862 544 447 142 589 647 1137 1158 970 797 218 302 1143 1399 1828 1800 1550 935 211 1460
612 1460 3138 4729 6668 8863 10944 15743 111791 201838 211219 119734 19495 12073 9047 6983 4303 2863
$$ packed form
2312C83k42l0K4lN3M1J55l38J32j34J57l2N5k8J5j05o6O5N9K19k43J25q4j07jJJ27J14j54
2040A58K38l15L8n2M3J66O02K23j027N1P3J15J04j44J57J19k85k4K23n8L06QJ7m33Q58o78
1795D83L75M83R35K340J0198L1939K7644p155k5877l5537k272j660J23p31l79J93m37J9j11
1617E73J27p4J30O6m91J27j46r7J86O0J47j15j68J46j85q5M60k89%J04Q0k67J47k18J90j6
1373C92L1j57l7j0j28K63K39j59j63l4K03k26L2K19j6n5o3j10l1n2K90M3j17J51j30k47M6
1119A74J65o9J84P7k38J5j16j07L09M3j3J63j42l21p1O5L25J68K07n16Q1p8JP3K20oJ3p4j46
847C86j90J62L41j13J79R7l18r7l05M47N8M90K1j88j73n79Q4Q41K56M29k8k50o15p24J249
612A460J678J591J939K195K081M799R6048R0047R381r1485j00239p422l026k064k680j440
$$ plain form
462 2863 1150 286 1115 1657 1830 1618 1416 727 522 616 477 1016 1047 1001 645 495 262 329 405 935 672 551 752 320 203
227 203 265 496 586 757 616 391 183 134 321 467 606 627 420 365 77 241 333 597 469 628 291 374 269 277 564 325 702
-26 702 458 355 347 296 379 440 581 545 496 509 150 407 515 591 568 699 488 392 330 490 659 587 659 713 594 452 665 636 684
-299 684 919 872 978 807 903 866 980 989 1125 1164
-392 1164
$$ packed form
462B863j713q64Q29N42J73k12k02o89k05R4j39N39L1m6l56j50k33O7P6N30k63j21K01m32j17
227B03O2K31R0J71j41k25k08m9J87J46J39K1k07n5k88J64R2K64j28J59l37Q3j05QK87k39L77
-26G02k44j03qn1Q3O1J41l6m9J3l59K57J08P6k3J31k11r6o2J60J69p2P2N4j19j42K13k9M8
-299F84K35m7J06j71R6l7J14RJ36L9
-392A164
##PAGE=	F1=-3350.26
##FIRST=	4405.895418600002813,	4405.895418600002813,	0
##DATA TABLE=	(F2++(Y..Y)), PROFILE
$$ plain form
4406 1106 1075 991 954 1020 879 1122 1099 952 945 765 677 608 617 985 593 787 526 737 377 664 598 606 519 587 577 425 444 312 486
4134 486 536 595 461 612 268 329 438 505 448 225 636 387 316 233 468 318 416 342 453 563 10 263 307 439 441 337 254 396
3871 396 221 107 385 323 350 404 278 169 176 353 219 380 232 402 52 284 193 333 285 340 360 80 316 147 401 263
3627 263 231 409 210 139 309 131 306 248 374 255 115 289 183 138 406 174 346 227 149 207 80 182 325 238 157 203
3382 203 318 95 345 143 171 244 170 295 82 263 72 249 150 270 92 359 92 215 227 143 220 278 202 242 38 221 275
3129 275 268 210 35 279 323 190 163 272 167 224 179 220 53 193 238 145 227 208 82 176 85 290 224 252 271 316 177 114 38 58
2847 58 315 160 129 262 179 100 79 172 235 135 199 181 207 81 162 242 240 132 275 87 185 151 232 132 440 137 313 36 153
2575 153 125 171 153 135 239 151 87 245 184 179 300 102 157 53 74 138 267 191 190 158 52 30 176 119 291 185 137 379 168 123
$$ packed form
4406A106l1q4l7O6j41K43k3j47pj80q8o9RL68l92J94k61K11l60K87o6Qq7O8j0j52J9j32J74
4134D86N0N9j34J51l44O1J09O7n7k23M11k49p1q3K35j50R8p4J11J10n53K53M4J32Kj04q3J42
3871C96j75j14K78o2K7N4j26j09PJ77j34J61j48J70l50K32r1J40m8N5K0k80K36j69K54j38
3627B63l2J78j99p1J70j78J75n8J26j19j40J74j06m5K68k32J72j19p8N8j27J02J43q7q1M6
3382B03J15k23K50k02K8P3p4J25k13J81j91J77r9J20j78K67k67J23J2q4P7N8p6M0k04J83N4
3129B75pn8j75K44M4j33k7J09j05N7m5M1j67J40M5r3Q2j9j26R4r1K05o6K8J9M5j39o3p6K0
2847E8K57j55l1J33q3p9k1R3O3j00O4j8K6j26Q1Q0kj08J43j88R8l4Q1j00L08l03J76k77J17
2575A53k8M6j8j8J04q8o4J58o1nJ21j98N5j04K1O4J29p6jl2j06k2J46n7J72j06m8K42k11m5
$$ plain form
2293 123 157 114 185 240 357 73 164 55 230 108 210 190 231 57 66 97 154 416 132 228 151 95 146 64 164 301 161 365 105
2021 105 122 87 94 286 802 1090 48 88 180 379 397 325 382 512 295 192 417 421 737 720 701 257 1121 475 845 1357 2283
1767 2283 4561 14611 46539 74118 67197 41392 5829 3657 1846 2030 1305 922 1057 673 660 564 693 631 787
1589 787 855 340 443 259 286 412 483 568 473 321 446 332 170 747 342 331 465 629 409 576 169 427 429 421 237 192 269
1335 269 135 398 564 480 271 194 451 241 303 491 422 397 311 219 147 116 404 512 328 529 345 133 187 349 282 485 544
1082 544 263 300 252 31 405 472 423 613 443 149 94 90 480 616 832 258 398 322 321 383 572 592 589 552 420 186 376 683
819 683 592 762 863 549 454 161 602 717 1125 1135 952 790 197 305 1152 1406 1841 1764 1542 932 231 1459 3240 4888
594 4888 6450 8503 10466 15328 110900 200978 211157 120586 19982 12229 9576 7477 3906 2703 1154 258
$$ packed form
2293A23L4m3P1N5J17k84R1j09J75j22J02k0M1j74RL1N7K62k84R6p7n6N1q2J00J37j40K04k60
2021A05J7l5PJ92N16K88j042M0R2J99J8p2N7J30k17j03K25ML16j7j9m44Q64o46L70N12R26
1767B283K278J0050L1928K7579o921k5805l5563k172j811J84p25l83J35l84j3r6J29o2J56
1589G87O8n15J03j84K7J26P1Q5r5j52J25j14j62N77m05j1J34J64k20J67m07K58Kqj84m5P7
1335B69j34K63J66q4k09p7K57k10O2J88o9k5q6r2p2l1K88J08j84K01j84k12N4J62o7K03N9
1082E44k81L7m8k21L74O7m9J90j70k94n5mL90J36K16n74J40p6jO2J89K0ll7j32k34J90L07
819F83r1J70J01l14r5k93M41J15M08J0j83j62n93J08Q47K54M35p7k22o10p01J228J781J648
594D888J562K053J963M862R5572R0078J0179r0571j00604p753k653k099l571j203j549q96
$$ plain form
443 258 1139 1629 1803 1639 1413 695 519 584 488 995 1008 998 672 454 290 348 396 967 615 604 741 262 177 282 463 581
199 581 779 619 363 188 102 356 434 637 590 508 317 82 257 342 568 479 588 295 408 293 251 529 343 717 483 342
-45 342 342 318 383 445 583 543 473 503 152 395 516 530 592 706 452 407 314 558 575 655 611 712 565 495 671 602 695 901 886 979
-327 979 757 938 841 1013 951 1142 1162
-392 1162
$$ packed form
443B58Q81M90J74j64k26p18j76O5r6N07J3j0l26k18j64N8M8N71l52j1J37m79q5J05J81J18
199E81J98j60k56j75q6K54P8K03m7q2j91k35J75Q5K26q9J09k93J13j15m2K78j86L74k34j41
-45C42%k4O5O2J38m0p0L0l51K43J21J4O2J14k54m5r3K44J7Q0m4J01j47p0J76o9R3K06j5R3
-327I79k22J81r7J72o2J91K0
-392A162
##PAGE=	F1=-3369.04
##FIRST=	4405.895418600002813,	4405.895418600002813,	0
##DATA TABLE=	(F2++(Y..Y)), PROFILE
$$ plain form
4406 995 950 875 903 927 781 1018 965 838 886 703 594 528 576 912 476 708 518 658 321 625 558 550 431 566 481 400 399 310 450
4134 450 440 549 370 562 276 298 390 449 427 168 604 347 297 204 437 265 359 334 363 544 25 234 263 390 385 301 226 401
3871 401 176 80 347 302 293 399 240 159 209 281 194 356 163 413 49 261 164 318 245 338 314 26 321 121 345 211 227 378
3608 378 210 133 292 135 270 187 353 235 106 268 157 164 348 186 309 237 149 159 82 199 285 215 131 187 274 67 274 136
3345 136 157 240 153 244 75 293 113 252 127 295 49 333 104 215 182 192 220 221 159 265 76 238 230 257 174 29 247 351
3082 351 190 134 304 105 195 165 184 78 216 161 156 231 170 74 198 167 368 266 211 231 364 127 131 70 59 300 160 89 230
2810 230 174 118 48 175 208 123 197 112 209 79 115 193 217 132 254 132 170 101 190 127 378 165 319 44 172 122 136 104 139 190
2528 190 135 48 220 165 181 264 79 129 67 96 142 215 155 206 132 52 60 202 159 279 186 110 339 181 115 171 80 177 221 309 102 153
$$ packed form
4406I95m5p5K8K4j46K37n3j27M8j83j09o6M8L36m36K32j90J40l37L04o7qj19J35q5q1jq9J40
4134D50j0J09j79J92k86K2R2N9k2k59M36k57n0r3K33j72R4k5K9J81n19K09K9J27nq4p5J75
3871D01k25r6K67m5rJ06j59q1N0P2q7J62j93K50l64K12r7J54p3R3k4k88K95k00K24j34J6J51
3608C78j68p7J59j57J35q3J66j18j29J62j11PJ84j62J23p2q8J0p7J17Q6p0q4N6Q7k07K07j38
3345A36K1Q3q7R1j69K18j80J39j25J68k46K84k29J11l3J0K8Jo2J06j89J62qK7q3j45K18J04
3082C51j61n6J70j99R0l0J9j06J38n5nP5o1r6J24l1K01j02n5K0J33k37Mo1j1K41j40p1J41
2810B30n6n6p0J27L3q5P4q5R7j30L6P8K4q5J22j22L8o9Q9o3K51k13J54k75J28n0J4l2L5N1
2528A90n5q7J72n5J6Q3j85N0o2K9M6P3o0N1p4q0QJ42m3J20r3p6K29j58o6N6r1R7M4Q8k07N1
$$ plain form
2227 153 66 256 39 181 175 236 97 90 83 135 409 124 193 128 122 211 46 110 257 157 315 139 112 104 109 282 621 896 18 53
1946 53 149 411 338 345 302 439 316 125 337 404 688 668 611 179 1006 448 753 1248 2102 4114 13235 42479 67696 61573
1720 61573 37974 5349 3454 1650 1870 1203 857 932 612 591 519 626 573 739 824 328 403 188 314 378 476 463 428 287
1495 287 385 339 111 774 348 256 406 681 558 713 137 412 419 415 183 200 271 167 398 495 482 235 148 421 246 313 489 345
1232 345 376 267 196 101 78 346 517 274 499 285 121 187 338 265 468 510 213 275 286 32 368 464 388 581 407 163 137
979 137 72 478 563 782 183 378 309 303 342 504 539 510 525 420 163 358 629 534 692 780 496 416 154 564 720 1001 1014 849
716 849 717 155 290 1053 1282 1675 1549 1405 838 245 1330 2947 4513 5717 7418 9065 13482 99312 180673 190576
528 190576 109664 18501 11140 9354 7611 3044 2182 1104 167 1040 1452 1602 1493 1282 590 474 499 448 887 867 902
$$ packed form
2227A53q7J90k17J42oO1j39ppN2K74k85O9o5oQ9j65O4J47j00J58j76k7qNJ73L39K75q78L5
1946E3R6K62p3Pm3J37j23j91K12O7K84k0n7m32Q27n58L05M95Q54K012R121K9244K5217o123
1720F1573k3599l2625j895j804K20o67l46P5l20k1p2J07n3J66Q5m96P5k15J26O4R8j3l5j41
1495B87R8m6k28O63m26r2J50K75j23J55n76K75Pmk32J7P1j04K31R7j3k47q7K73j75O7J76j44
1232C45L1j09p1r5k3K68J71k43K25k14j64O6J51p3K03M2k97O2J1k54L36R6p6J93j74k44k6
979A37o5M06Q5K19n99J95o9oL9J62L5k9J5j05k57J95K71r5J58Q8k84q0k62M10J56K81J3j65
716H49j32n62J35P63K29L93j26j44n67n93J085J617J566J204J701J647M417Q5830Q1361R903
528A90576q0912r1163p361j786j743m567q62j078r37Q73M12J50j09k11o92j16K5n1M39k0L5
$$ plain form
331 902 621 400 307 331 352 899 505 595 666 195 150 259 382 533 720 579 303 181 63 356 347 616 501 554 257 85 246
77 246 323 483 439 499 276 408 286 219 447 330 660 464 317 305 305 345 403 537 499 406 452 133 358 466 423 554 654 371
-186 371 398 263 572 454 659 493 653 479 485 618 506 647 785 815 893 630 892 720 950 824 1049 1055
-392 1055
$$ packed form
331I02k81k21r3K4K1N47l94R0P1m71m5J09J23J51J87j41k76j22j18K93rK69j15N3k97j72J61
77B46P7J60m4O0k23J32j22o7K28j17L30j96j47j2%M0N8J34l8r3M6l19K25J08m3J31J00k83
-186C71K7j35L09j18K05j66J60j74OJ33j12J41J38L0P8k63K62j72K30j26K25O
-392A055
##PAGE=	F1=-3387.82
##FIRST=	4405.895418600002813,	4405.895418600002813,	0
##DATA TABLE=	(F2++(Y..Y)), PROFILE
$$ plain form
4406 803 744 683 774 749 633 828 748 658 744 592 457 400 490 765 332 575 461 524 248 536 463 466 286 513 345 344 315 272 383
4134 383 311 454 254 467 258 253 312 361 364 131 530 271 264 159 356 198 274 295 264 482 58 207 190 309 306 230 182 376 126
3861 126 42 268 267 218 357 198 124 223 194 144 324 104 404 40 221 116 283 181 319 239 28 304 73 271 156 216 323
3608 323 210 133 262 127 225 142 309 187 109 227 136 181 275 199 236 228 145 96 93 192 234 172 104 168 208 36 174 127 130 219 106 180
3307 180 81 310 166 252 123 295 22 278 116 206 143 212 205 160 113 272 129 234 174 233 156 64 209 351 174 88 314 69
3044 69 160 136 150 125 241 72 150 208 123 88 215 263 425 292 159 195 378 107 135 93 105 272 147 41 195 162 121 51 199
2772 199 171 96 180 40 198 75 66 132 177 131 213 171 140 40 147 124 305 187 298 86 186 108 94 65 136 133 116 20 178 142
2490 142 165 213 47 113 75 106 134 144 110 207 120 83 92 195 194 266 162 78 271 181 91 173 40 164 175 240 111 145 71 268 37
$$ packed form
4406H03n9o1R1k5j16J95q0r0Q6j52j35n7R0K75m33K43j14O3k76K88p3Lj80K27j68jk9m3J11
4134C83p2J43k00K13k09nN9M9Lk33L99k59pj05J97j58P6K1l1K18m24J49j7J19lp6m8J94k50
3861A26q4K26jm9J39j59p4R9k9n0J80k20L00l64J81j05J67j02J38q0k11K76k31J98j15O0J07
3608C23j13p7J29j35R8q3J67j22p8J18r1M5R4p6L7qq3m9lR9M2o2o8O4M0j72J38m7LQ9j13P4
3307A80r9K29j44Q6j29J72k73K56j62R0o3O9pm5m7J59j43J05o0N9p7r2J45J42j77q6K26k45
3044F9R1k4J4k5J16j69P8N8q5l5J27M8J62j33j33L6J83k71K8m2J2J67j25j06J54l3m1p0J48
2772A99k8p5Q4j40J58j23rO6M5m6Q2m2l1j00J07k3J81j18J11k12J00p8j4k9P1lj7r6J58l6
2490A42K3M8j66O6l8L1K8J0l4R7q7l7RJ03jP2j04q4J93r0r0Q2j33J24J1O5j29L4p4J97k31
$$ plain form
2199 37 139 149 222 170 109 70 107 364 118 172 116 146 251 24 67 190 145 257 172 102 102 139 256 353 559 26 31 116 404 248
1918 248 329 206 345 319 56 240 356 575 576 481 89 837 411 601 1037 1774 3360 10945 35360 56391 51476 31774
1711 31774 4488 2980 1347 1572 1002 722 755 496 489 436 514 461 627 734 301 346 123 293 306 434 312 359 236 300 309
1476 309 52 743 423 186 312 704 716 829 207 367 367 401 117 236 273 185 361 399 438 172 107 353 231 271 459 235 340
1223 340 207 156 72 31 266 485 203 422 207 94 175 305 226 403 435 161 240 292 93 295 417 334 499 346 165 174 94
969 94 443 464 683 93 329 273 255 262 415 444 388 451 388 150 310 557 423 570 631 402 342 128 489 656 789 821 684 596
706 596 102 259 865 1053 1362 1204 1167 674 241 1092 2358 3705 4578 5816 7034 10587 79499 145247 153861 89297
518 89297 15377 9032 8478 7471 2197 1471 1062 30 830 1166 1272 1213 1052 436 397 383 358 718 659 732 504 346 304
$$ packed form
2199C7J02J0P3n2o1l9L7K57k46N4n6L0J05k27M3J23m5J12q5p0%L7J17R7K06n33NQ5K88j56
1918B48Q1j23J39k6k63J84J16K19Jr5l92P48m26J90M36P37J586P585K4415K1031m915j9702
1711C1774k7286j508j633K25n70k80L3k59pn3P8n3J66J07m33M5k23J70J3J28j22M7j23O4R
1476C09k57O91l20k37J26L92J2J13o22J60%L4k84J19L7q8J76L8L9k66o5K46j22M0J88k24J05
1223C40j33n1q4m1K35K19k82K19k15j13Q1J30p9J77L2k74P9N2j99K02J22q3J65j53j81Rq0
969I4L49K1K19n90K36n6j8PJ53K9n6O3o3k38J60K47j34J47O1k29o0k14L61J67J33L2j37q8
706E96m94J57O06J88L09j58l7m93m33Q51J266J347Q73J238J218L553O8912O5748Q614o4564
518H9297p3920o345n54j007n274p26m09j032Q00L36J06n9j61o16l9j4k5L60n9P3k28j58m2
$$ plain form
302 304 283 284 741 372 524 547 129 122 204 274 452 599 502 222 162 24 322 228 550 387 552 204 104 214 282 361 362 378 240
30 240 378 252 186 340 291 542 407 281 241 258 272 323 454 422 312 366 94 308 382 291 466 551 261 367 188 531 331 598
-233 598 331 548 353 431 516 367 559 593 678 742 450 780 526 805 632 867 863
$$ packed form
302C04k1JM57l69J52K3m18pQ2P0J78J47r7k80o0j38K98r4L22j63J65l48j00J10O8P9JJ6j38
30B40J38j26o6J54m9K51j35j26m0J7J4N1J31l2j10N4k72K14P4r1J75Q5k90J06j79L43k00K67
-233E98k67K17j95P8Q5j49J92L4Q5O4k92L30k54K79j73K35m
-392H63
##PAGE=	F1=-3406.6
##FIRST=	4405.895418600002813,	4405.895418600002813,	0
##DATA TABLE=	(F2++(Y..Y)), PROFILE
$$ plain form
4406 575 495 454 598 516 469 590 494 448 546 458 294 244 379 575 204 415 375 359 172 417 344 373 117 439 196 273 212 213 294
4134 294 179 332 140 344 222 205 228 258 277 136 427 180 232 106 242 132 187 238 176 391 102 186 105 214 218 147 128 322
3871 322 84 7 166 225 140 285 159 79 216 111 90 292 112 379 53 172 57 237 106 283 149 65 272 20 199
3636 199 112 213 260 203 146 222 105 182 146 252 116 122 173 128 185 201 209 139 207 140 35 110 160 184 122 88 145 139 16 65 139 100 186
3326 186 45 105 87 312 218 246 142 269 27 202 122 191 126 199 179 107 116 266 167 209 124 202 170 122 169 326 148 47 299 104
3044 104 129 97 129 184 264 27 133 170 73 106 223 343 453 297 107 166 362 110 122 96 143 237 124 15 172 150 111 91 230
2772 230 139 63 157 40 172 72 33 70 127 130 157 191 105 47 116 115 231 196 249 123 190 85 64 61 118 84 98 36 122 118 136 163 8
2462 8 108 74 103 113 68 72 192 129 120 121 153 207 246 124 54 189 169 56 165 25 151 118 158 95 139 74 267 108 95 116 189 226
$$ packed form
4406E75q0m1J44q2m7J21r6m6R8q8j64n0J35J96l71K11m0j6j87K45p3K9k56L22k43P7o1JQ1
4134B94j15J53j92K04j22j7K3L0J9j41K91k47N2j26J36j10N5N1o2K15k89Q4q1J09Mp1j9J94
3871C22k38p7J59N9q5J45j26q0J37j05k1K02j80K67l26J19j15J80j31J77j34q4K07k52J79
3636A99q7J01M7n7n7P6j17P7l6J06j36ON1m5N7J6Qp0O8o7j05P5N0K4o2l4N7oj23M9P4l9Q6
3326A86j41O0j8K25r4K8j04J27k42J75q0O9o5P3k0p2RJ50r9M2q5P8l2m8M7J57j78j01K52j95
3044A04K5l2L2N5Q0k37J06L7r7L3J17J20J10j56j90N9J96k52J2k6M7R4j13j09J57k2l9k0J39
2772B30r1p6R4j17J32j00l9L7N7LK7L4q6n8O9jJ16l5N3j26O7j05k1lN7l4J4o2Q6mJ8K7j55
2462HJ00l4K9J0m5MJ20o3rJL2N4L9j22p0J35k0j13J09j40J26l3M0o3M4o5J93j59j3K1P3L7
$$ plain form
2162 226 121 70 81 293 118 167 117 160 259 9 74 118 126 202 191 107 86 165 205 98 181 82 19 88 361 143 285 116 249 301
1880 301 46 141 282 422 459 334 14 640 368 418 764 1366 2442 8161 26523 42346 38825 23966 3417 2319
1692 2319 996 1190 745 539 560 351 371 323 379 314 481 602 267 280 104 232 208 360 144 275 181 207 256 105 671 531
1448 531 196 209 694 853 910 324 301 287 374 59 267 320 193 301 293 358 102 77 257 203 186 413 123 296 143 107 77 29
1185 29 179 426 131 314 125 61 157 257 175 303 334 126 199 272 140 206 339 277 382 274 157 200 140 382 337 553 56
932 56 264 222 189 165 327 327 248 344 334 156 246 480 290 424 447 291 248 100 395 537 537 597 486 451 55 221 627 767 959
659 959 802 877 474 213 791 1620 2660 3225 3995 4771 7221 55524 101973 108570 63691 11273 6349 7177 7131 2260
471 2260 1126 1092 186 544 831 886 860 767 267 309 272 234 520 434 519 350 296 275 222 210 525 256 403 408 70 94 130 165 351
$$ packed form
2162B26j05n1J1K12j75M9n0M3R9k50O5M4QP6j1q4k1P9M0j07Q3r9o3O9K73k18J42j69J33N2
1880C01k55R5J41J40L7j25l20O26k72N0L46O02J076N719J8362J5823l521j4859k0549j098
1692B319j323J94m45k06K1k09K0m8N6o5J67J21l35J3j76J28k4J52k16J31r4K6M9j51N66j40
1448E31l35J3M85J59N7n86k3j4Q7l15K08N3j27J08qO5k56k5J80n4j7K27k90J73j53l6l0m8
1185B9J50K47k95J83j89o4R6J00q2J28L1k08P3P3j32O6J33o2J05j08j17M3o0K42m5K16m97
932E6K08m2l3k4J62%p9R6j0j78R0K34j90J34K3j56m3j48K95J42%O0j11l5l96J66M06J40J92
659I59j57P5m03k61N78Q29J040N65P70P76K450M8303M6449O597m4879n2418m924Q28m6m871
471B260j134l4r06L58K87N5k6r3n00M2l7l8K86q6Q5j69n4k1n3j2L15k69J47Nl38K4L6L5J86
$$ plain form
199 351 450 405 131 133 18 264 121 454 284 503 179 138 179 233 231 264 248 195 325 202 154 244 233 386 325 237 162 190 179 223 354
-92 354 328 213 264 53 259 289 168 353 414 148 322 109 454 254 484 161 416 213 351 382 210 457 362 503 561 248
-336 248 625 299 613 410 633 624
$$ packed form
199C51R9m5k74Kj15K46j43L33j70K19l24m1M1N4kL3j6n3J30j23m8R0j1J53o1q8p5K8j1M4J31
-92C54k6j15N1k11K06L0j21J85O1k66J74k13L45k00K30l23K55k03J38L1j72K47r5J41N8l13
-336B48L77l26L14k03K23r
-392F24
##PAGE=	F1=-3425.38
##FIRST=	4405.895418600002813,	4405.895418600002813,	0
##DATA TABLE=	(F2++(Y..Y)), PROFILE
$$ plain form
4406 356 247 232 411 270 320 353 253 255 338 324 137 88 269 383 143 262 282 195 111 294 244 286 79 357 73 212 131 150
4143 150 199 77 211 69 217 182 164 164 158 194 153 310 115 214 67 120 95 144 180 124 288 142 172 61 121 135 88 71 246 59
3861 59 48 82 182 70 198 123 64 188 54 66 263 164 340 85 124 14 191 41 233 61 80 233 56 153 94 225 204
3608 204 182 161 175 78 144 174 193 33 135 112 129 178 142 214 45 179 145 37 129 113 139 91 84 112 96 55 62 167 81 149 30 32 79
3298 79 301 256 226 157 222 27 120 115 175 127 159 146 69 176 251 187 173 92 169 201 181 134 285 120 53 263 155 109 54 128 240 278
2997 278 93 107 135 26 113 218 387 450 283 63 141 325 108 96 82 156 199 95 52 163 140 87 128 252 129 44 141 88 131
2725 131 67 41 22 74 132 95 193 85 101 104 100 165 187 180 142 180 61 66 81 80 61 89 50 62 98 100 122 38 102 68 88 84 2 65 164 142 151 144
2368 144 89 187 217 86 47 111 148 18 152 58 142 69 76 59 131 80 255 173 67 85 143 250 120 76 73 213 122 164 120 163 234 13
$$ packed form
4406C56j09j5J79j41N0L3j00KQ3j4j87m9J81J14k40J19K0q7q4J83n0M2k07K78k84J39q1J9
4143A50M9j22J34j42J48l5j8%oL6m1J57j95R9j47N3k5M9L6n6J64j46L0j11O0J4m7j7J75j87
3861E9j1L4J00j12J28p5n9J24j34J2J97r9J76k55L9j10J77j50J92j72J9J53j77R7n9J31k1
3608B04k2k1J4r7O6L0J9j60J02k3J7M9l6P2j69J34l4j08R2j6K6m8pK8j6m1PJ05q6O8j19KM7
3298G9K22m5l0o9O5j95R3nO0m8L2j3p7J07P5o4j4q1P7L2k0m7J51j65o7K10j08m6n5P4J12L8
2997B78j85J4K8j09Q7J05J69O3j67k20P8J84k17j2j4P4M3j04m3J11k3n3M1J24j23q5R7n3M3
2725A31o4k6j9N2N8l7R8j08J6LmO5K2pl8L8j19NJ5jj9K8l9J2L6KK2q4O4l4K0mq2O3R9k2Rp
2368A44n5R8L0j31l9O4L7j30J34r4Q4p3Pj7P2n1J75q2j06J8N8J07j30m4lJ40r1M2m4M3P1k21
$$ plain form
2068 13 93 60 103 150 187 128 69 180 138 236 157 136 8 65 294 56 225 65 165 264 95 56 195 260 331 193 58 441 316
1795 316 242 482 951 1528 5355 17523 28051 25874 15945 2334 1587 663 795 488 338 380 205 259 198 245 169 336
1589 336 451 231 214 139 150 101 266 17 185 138 121 205 195 583 621 269 142 648 942 940 424 231 203 333 46 269 399
1335 399 212 232 196 260 56 60 148 168 96 364 95 252 93 59 95 70 102 352 93 197 62 36 135 199 124 193 222 105 155 227
1054 227 164 120 248 232 251 206 139 209 182 311 210 415 121 197 169 127 94 260 213 117 226 267 169 191 406 188 281 263 187 161
772 161 95 305 389 301 388 291 310 65 187 388 486 540 429 590 273 166 479 892 1606 1883 2272 2677 3999 31939 59090
537 59090 63363 37771 7011 3653 5739 6614 3111 1631 1199 401 231 509 525 510 479 118 233 201 119 326 243 303
331 303 189 246 221 172 149 295 196 255 275 24 71 63 81 244 317 309 45 96 49 194 128 348 221 420 180 172 162 188 136 168 127 147
$$ packed form
2068A3Q0l3M3M7L7n9n9J11m2R8p9k1j28N7K29k38J69j60J00R9j69l9J39O5P1j38j35L83j25
1795C16p4K40M69N77L827J2168J0528k177r929j3611p47r24J32l07j50M2j75N4o1M7p6J67
1589C36J15k20j7p5J1m9J65k49J68m7j7Q4j0L88L8l52j27N06K94kn16j93k8J30k87K23J30
1335C99j87K0l6O4k04MQ8K0p2K68k69J57j59l4L6k5L2K50k59J04j35k6R9O4p5O9K9j17N0P2
1054B27o3m4J28j6J9m5o7P0k7J29j01K05k94P6k8m2l3J66m7r6J09M1r8K2K15k18R3j8p6k6
772A61o6K10Q4q8Q7r7J9k45J22K01R8N4j11J61l17j07L13M13P14K77L89M05J322K7940K7151
537E9090M273k5592l0760l358K086Q75l503j480m32p98j70K78J6j5l1l61J15l2q2K07q3O0
331C03j14N7k5m9k3J46r9N9K0k51M7qJ8J63P3qk64N1m7J45o6K20j27J99k40qj0K6n2L2m1K0
$$ plain form
30 147 258 152 121 194 169 223 232 188 80 125 86 124 255 236 143 168 67 223 210 122 245 266 84 273 62 375 245 342 63 281
-252 281 90 267 237 68 362 138 330 387 73 459 89 411 199 394 383
$$ packed form
30A47J11j06l1P3k5N4Rm4j08M5l9L8J31j9r3K5j01J56j3q8J23K1j82J89k11L13j30R7k79K18
-252B81j91J77l0j69K94k24J92N7l14L86l70L22k12J95j1
-392C83
##PAGE=	F1=-3444.16
##FIRST=	4405.895418600002813,	4405.895418600002813,	0
##DATA TABLE=	(F2++(Y..Y)), PROFILE
$$ plain form
4406 185 40 68 251 58 211 166 80 134 176 208 15 42 183 228 136 166 206 66 88 187 201 217 207 280 99 178 126 104 114 35 111
4115 111 85 105 150 141 133 74 152 150 198 125 212 85 24 105 168 140 114 186 164 159 107 51 68 90 23 161 49 86 113 144 18 111 87 94 144
3786 144 46 74 231 207 294 115 82 71 155 19 177 10 74 197 107 139 105 244 159 148 163 126 68 112 185 138 45 138 54 125 166
3495 166 105 211 71 152 166 78 145 65 100 101 82 65 109 108 142 192 78 112 78 71 56 279 272 189 152 163 12 55 93 157 126 105 115 52
3176 52 248 234 198 143 77 141 225 225 107 240 101 75 211 188 102 33 143 277 276 136 77 116 14 105 197 386 418 262 28 120
2894 120 278 89 72 57 144 157 65 77 155 136 57 147 255 138 51 140 118 75 52 58 22 29 139 33 178 93 140 104 86 111 161 101
2594 101 141 155 45 86 96 25 69 92 45 24 83 64 85 86 93 59 65 55 55 74 127 144 169 162 72 132 176 67 53 70 125 22 140 89 139
2265 139 48 17 32 121 87 234 223 82 75 89 237 105 75 92 151 126 155 117 156 183 9 88 34 85 99 161 150 65 183 92 370 315
$$ packed form
4406A85j45K8J83j93J53m5q6N4M2L2j93K7J41M5r2L0M0j40K2R9J4J6j0P3j81P9n2k2J0p9P6
4115A11k6K0M5rqn9P8kM8p3Q7j27o1Q1O3k8k6P2k2nn2n6J7K2o7J38j12L7K7L1j26R3k4PN0
3786A44r8K8J57k4Q7j79l3j1Q4j36J58j67O4J23r0L2l4J39q5j1J5l7n8M4P3m7r3R3q4P1M1
3495A66o1J06j40Q1J4q8O7q0L5Jj9j7M4jL4N0j14L4l4pj5K23pq3l7J1j51M3L8O4l1k1J0o3
3176E2J96j4l6n5o6O4Q4%j18J33j39k6J36k3q6o9J10J34jj40n9L9j02R1R2J89L2j56k34R2
2894A20J58j89j7j5Q7J3r2J2P8j9p9R0J08j17q7Q9k2m3k3Ol6PJ10j06J45q5M7l6j8K5N0o0
2594A01M0J4j10M1J0p1M4K3m7k1N9j9K1JPl4Oj0%J9N3J7K5pr0O0M4j09j4J7N5j03J18n1N0
2265A39r1l1J5Q9l4J47j1j41pJ4J48j32l0J7N9k5K9l8L9K7j74P9n4N1J4O2j1q5J18r1K78n5
$$ plain form
1964 315 171 35 44 224 85 163 75 104 216 127 37 111 122 206 75 87 263 255 116 250 587 777 2958 9798 15794 14705
1720 14705 9019 1418 901 409 454 281 148 237 85 175 97 136 99 225 307 193 158 185 79 6 168 121 99 117 61 178 268
1467 268 505 661 329 148 569 961 914 476 171 140 280 67 243 484 260 166 124 169 56 53 45 131 124 327 159 208 76 29
1204 29 103 100 49 280 111 98 61 38 113 141 76 105 114 79 108 162 160 60 159 207 127 158 116 200 204 241 121 291 173 145 125 101 106 221
885 221 122 14 127 198 169 161 335 171 165 112 103 122 118 233 240 160 231 128 197 111 161 204 275 181 187 353 102 114 210 305 749 752 917 1062
565 1062 1424 12668 23725 25784 15906 3375 1597 4428 5901 3869 2302 1321 600 82 252 257 243 234 11 188 163
368 163 98 165 124 119 51 194 150 153 111 119 183 107 172 38 56 62 37 143 237 244 34 58 73 125 201 250 198 320 186 193 170 152 122 90 38
40 38 97 187 117 90 197 111 80 141 138 7 100 50 64 175 163 129 100 120 200 164 173 172 132 119 229 89 329 266 202 117 163 58 196 104
$$ packed form
1964C15j44j36RJ80j39P8q8K9J12q9r0P4J1Q4j31J2J76qj39J34L37J90K181O840N996j089
1720A4705n686p601n17m92M5j73j33Q9j52R0p8L9l7J26Q2j14l5K7j06p3J62m7k2J8n6J17R0
1467B68K37J56l32j81M21L92m7m38l05l1J40k13J76K41k24r4m2M5j13lqQ6pK03j68M9j32m7
1204B9P4ln1K31j69j3l7k3P5K8o5K9Rl5K9N4kj00R9M8q0L1m2Q4ML7j20J70j18k8k0k4NJ15
885B21r9j08J13P1k9qJ74j64on3rJ9mJ15Pq0P1j03O9q6N0M3P1r4OJ66k51J2R6R5M44LJ65J45
565A062L62J1244J1057K059r878j2531j778K831J473k032j567r81p21n18J70Nj4rk23J77k5
368A63o5O7m1no8J43m4Lm2QO4p6O5j34J8Ok5J06R4Pk10K4J5N2P6M9n2J22j34Pk3j8l0l2n2
40C8N9R0p0k7J07q6l1O1lj31R3n0J4J11j2l4k9K0Q0l6Rjm0j3J10j40K40o3o4q5M6j05J38r2
$$ plain form
-280 104 57 285 80 197 252 108 308 106 235 37 188 181
$$ packed form
-280A04m7K28k05J17N5j44K00k02J29j98J51p
-392A81
##PAGE=	F1=-3462.94
##FIRST=	4405.895418600002813,	4405.895418600002813,	0
##DATA TABLE=	(F2++(Y..Y)), PROFILE
$$ plain form
4406 80 105 98 148 118 146 105 101 122 135 122 75 125 133 142 117 166 161 71 99 112 194 169 292 219 172 171 160 91 55 27 45 113 34 132 133 119 30 157
4049 157 121 108 159 218 133 77 140 208 129 118 95 159 144 153 32 26 108 30 83 49 110 179 114 14 41 54 121 88 54 77 192 229 247 135
3730 135 56 121 131 32 123 58 51 169 143 146 127 254 118 109 142 81 81 83 166 97 103 128 10 111 153 90 198 128 129 198 110 152 39 65 126
3401 126 81 14 146 165 192 196 82 85 112 141 43 248 263 135 128 101 19 52 58 138 117 70 99 59 303 221 209 134 63 119 228 244 90
3091 90 199 94 82 154 197 106 68 158 283 258 147 46 106 44 85 159 341 368 248 14 101 229 60 76 33 118 115 36 82 134 136
2800 136 38 143 236 151 58 149 138 41 28 72 42 18 149 29 153 115 160 110 78 67 125 31 120 116 44 107 107 43 91 104 28 43 72 39
2481 39 42 131 95 44 44 45 90 72 87 135 174 174 152 52 125 69 70 97 106 49 131 109 140 54 54 67 110 92 211 256 128 96 31 194 81 62
2143 62 123 138 126 139 106 141 118 11 68 25 75 49 126 161 69 181 133 369 307 175 79 31 173 146 111 92 75 169 133 77 57 60 101
$$ packed form
4406H0K5pN0l0K8m1mK1J3j3m7N0QRk5M9nr0K8J3Q2k5J23p3m7jj1o9l6k8J8O8p9R8Jj4q9J27
4049A57l6j3N1N9q5n6O3O8p9j1k3O4j5Rj21oQ2p8N3l4O1O9o5j00K7J3O7l3l4K3J15L7J8j12
3730A35p9O5J0r9R1o5pJ18k6Lj9J27j36rL3o1%KQ3o9OK5j18J01M2o3J08p0JO9q8M2j13K6O1
3401A26m5o7J32J9K7Mj14LK7K9r8K05J5j28pk7q2L3OQ0k1m7K9m0K44q2j2p5p1N6J09J6j54
3091I0J09j05j2P2M3r1l8R0J25k5j11j01O0o2M1P4J82K7j20k34Q7J28j69J6m3Q5lp9M6N2K
2800A36r8J05R3q5r3R1j1r7j3M4l0k4J31j20J24l8M5n0l2j1N8r4Q9mp2O3%o4M8J3p6J5K9l3
2481C9LQ9l6n1%JM5j8J5M8L9%k2j00P3n6JK7Rn7Q2k2L1q6%J3M3j8J19M5j28l2o5J63j13j9
2143F2O1J5j2J3l3L5k3j07N7m3N0k6P7L5r2J12m8K36o2j32r6m8J42k7l5j9j7R4l6n6k0LM1
$$ plain form
1833 101 11 83 121 189 102 158 307 354 1330 4514 7396 6968 4241 793 358 260 247 158 27 136 30 130 91 86 146 166 192
1579 192 152 117 219 61 80 86 180 38 121 60 177 310 442 637 344 179 462 906 833 471 133 116 221 76 208 557 321
1326 321 109 80 119 56 49 42 96 221 309 208 163 87 42 98 116 35 219 137 60 87 49 91 92 43 83 23 38 56 84 132 51 86 196 30
1007 30 136 90 174 197 183 114 194 193 118 102 110 136 196 68 52 91 139 148 153 264 200 88 42 39 139 147 181 114 182 134 47 127 152 138 150 182
669 182 165 193 197 53 78 40 117 272 41 319 188 243 2426 3295 2607 1277 1127 1227 3385 4984 4143 2708 1384 751
443 751 305 140 115 149 95 56 181 121 130 63 79 22 43 139 85 161 95 139 173 48 129 81 51 106 39 80 218 224 87 32 91 67 251
133 251 172 182 228 181 196 180 125 146 44 61 50 125 100 72 212 76 53 71 94 48 113 96 76 121 116 141 75 164 181 160 226 146 59 166
-186 166 195 132 314 276 109 145 73 106 148 11 124 229 195 139 171 191 194 212 107 88 41 46
$$ packed form
1833A01r0P2L8O8q7N6J49M7R76L184K882m28k727l448m35r8j3q9j31J09j06J00l9nO0K0K6
1579A92m0l5J02j58J9OR4j42Q3o1J17J33J32J95k93j65K83M44p3l62l38j7J05j45J32L49k36
1326C21k12k9L9o3ppN4J25Q8j01m5p6m5N6J8q1J84q2p7K7l8M2Jm9M0o0J5J8K8M8q1L5J10j66
1007C0J06m6Q4K3j4o9Q0jp5j6QK6O0j28j6L9M8RNJ11o4j12m6lJ00QL4o7O8m8q7Q0K5j4J2L2
669A82j7K8Mj44K5l8P7J55k31K78j31N5K183Q69o88j330j50J00K158J599q41j435j324o33
443G51m46j65k5L4n4l9J25o0Ro7J6n7K1R6n4P6o6M4L4j25Q1m8l0N5o7M1J38Oj37n5N9k4J84
133B51p9J0M6m7J5j6n5K1j02J7j1P5k5k8J40j36k3J8K3m6O5j7k0M5nK5o6Q9J7k1O6q0q7J07
-186A66K9o3J82l8j67L6p2L3M2j37J13J05l4n6L2K0LJ8j05j9m7N
-392D6
##PAGE=	F1=-3481.72
##FIRST=	4405.895418600002813,	4405.895418600002813,	0
##DATA TABLE=	(F2++(Y..Y)), PROFILE
$$ plain form
4406 44 175 150 122 211 119 139 149 131 153 72 119 153 110 113 65 200 143 115 104 72 173 140 323 176 215 172 172 99 41 44 45 124 42 124 136
4077 136 102 53 168 87 61 168 220 176 118 175 227 135 119 21 125 128 174 37 26 105 52 26 51 118 217 94 32 19 45 125 34 49 68
3767 68 148 232 204 146 51 154 119 29 82 80 28 153 159 169 147 247 75 75 100 50 97 55 121 79 128 111 34 85 144 92 176 153 114 230
3448 230 139 147 43 36 140 94 69 177 221 208 173 79 74 131 191 73 209 231 82 101 45 44 82 16 115 111 86 104 80 331 212 222 147
3138 147 43 102 212 234 75 166 94 77 106 183 117 114 162 255 231 135 37 102 63 65 109 263 309 245 43 83 184 38 102 33 115 79
2838 79 8 70 97 138 59 117 199 159 62 153 153 105 38 93 66 36 161 84 119 136 167 119 78 35 91 55 86 74 56 133 116 114 118 119 39 60 69
2490 69 55 10 168 122 21 34 65 104 48 47 123 169 180 238 51 73 84 96 140 99 64 125 117 144 72 77 109 102 94 188 268 182 125 27 133 57
2152 57 46 157 172 127 121 90 121 58 35 82 21 74 22 108 160 69 182 211 256 245 151 125 41 155 181 79 96 72 132 117 101 58 96 65
$$ packed form
4406D4J31k5k8Q9r2K0J0j8K2q1M7L4m3Lm8J35n7k8j1l2J01l3J83j47L9m3%p3n8LJP9q2Q2J2
4077A36l4m9J15q1k6J07N2m4n8N7N2r2j6r8J04LM6j37j1P9n3k6K5O7R9j23o2j3K6Q0r1J5J9
3767F8Q0Q4k8n8r5J03l5r0N3kn2J25OJ0k2J00j72%K5n0M7m2O6m2M9j7p7N1N9n2Q4k3l9J16
3448B30r1Qj04pJ04m6k5J08M4j3l5r4nN7O0j18J36K2j49J9n6jL8o6R9mk5J8k4K51j19J0p5
3138A47j04N9J10K2j59R1p2j7K9P7o6lM8R3k4r6r8O5l9KM4J54M6o4k02M0J01j46O4o9Q2l6
2838G9p1O2K7M1p9N8Q2m0r7R1%m8o7N5k7l0J25p7L5J7L1m8m1m3N6l6L1j2j8P7j7kMJq0K1R
2490F9j4m5J58m6j01J3L1L9n6jP6M6J1N8j87K2J1J2M4m1l5O1qK7p2NL2pqR4Q0q6n7r8J06p6
2152E7j1J11J5m5ol1L1o3k3M7o1N3n2Q6N2r1J13K9M5j1r4k6q4J14K6j02J7k4O0j5j6m3L8l1
$$ plain form
1833 65 60 53 57 121 127 198 115 342 828 2698 4305 3940 2446 481 109 183 225 108 122 65 55 110 128 100 185 152 125 109 99 239
1551 239 68 138 59 187 62 146 89 177 315 385 557 308 191 339 787 708 412 118 114 166 67 185 590 361 59 55 122 35
1288 35 50 99 66 296 309 220 118 101 67 85 122 49 168 141 86 102 49 69 64 53 95 52 31 36 17 88 66 40 193 67 140 67 134 160
969 160 147 147 130 180 110 104 119 132 171 52 82 109 97 110 148 194 208 46 83 42 167 169 146 25 226 68 88 100 178 110 183 158 323
659 323 245 141 123 72 101 273 254 459 554 417 957 6951 12148 12424 6815 1173 1643 2591 3909 3870 2731 1346 831 453
434 453 234 117 149 142 113 198 87 120 68 60 82 88 91 69 169 88 206 148 130 151 114 55 140 81 108 227 236 122 37 102 28 263 117
124 117 153 161 161 181 171 103 150 33 109 40 103 94 74 213 83 114 72 72 82 123 133 98 95 93 140 72 188 158 188 249 146 99 191 171 166 300
-214 300 265 115 122 19 130 119 58 155 196 249 131 132 220 131 256 31 131 45 37
$$ packed form
1833F5npMO4OP1q3K27M86J870J607l65j494j965l72P4M2j17J4n7j0N5J8k8Q5l3k7j6j0J40
1551B39j71P0p9J28j25Q4n7Q8J38P0J72k49j17J48M48p9k96k94mN2r9J18M05k29l02mO7q7
1288C5J5M9l3K30J3q9j02j7l4J8L7p3J19k7n5J6n3K0nj1M2m3k1Nj9P1k2k6J53j26P3p3O7K6
969A60j3%j7N0p0oJ5J3L9j19L0K7j2J3L8M6J4j62L7m1J25Kk3j21K01j58K0J2P8o8P3k5J65
659C23p8j04j8n1K9J72j9K05R5j37N40N994N197K76n609n642M70R48J318l9j139j385n15l78
434D53k19j17L2pk9Q5j11L3n2qK2OLk2J00q1J18n8j8K1l7n9Q5n9K7J19Rj14q5O5p4K35j46
124A17L6Q%K0j0o8M7j17P6o9O3rk0J39j30L1m2%J0M1J0l5lkM7o8J16l0L0O1j03m7R2k0nJ34
-214C00l5j50Pj03J11j1o1R7M1N3j18JQ8q9J25k25J00q6q
-392C7
##PAGE=	F1=-3500.5
##FIRST=	4405.895418600002813,	4405.895418600002813,	0
##DATA TABLE=	(F2++(Y..Y)), PROFILE
$$ plain form
4406 52 180 156 138 242 112 147 153 113 132 51 133 129 95 94 18 213 139 125 90 67 117 126 306 148 227 170 150 106 63 112 105 128 55 120 145
4077 145 86 82 163 95 66 142 213 206 128 199 217 139 119 31 72 120 169 30 36 79 56 2 47 115 217 83 44 36 64 105 55 39 66 104 222
3749 222 172 156 62 169 113 34 59 81 43 146 160 208 160 222 31 52 64 39 101 35 75 94 117 104 53 52 141 108 146 143 107 258 168 124
3429 124 44 33 139 125 138 194 270 195 125 69 88 141 214 111 164 186 67 102 25 58 99 28 90 122 118 123 104 328 204 226 165 24 86
3119 86 184 200 48 136 90 70 89 155 132 156 152 202 208 124 79 112 74 60 54 171 253 243 71 67 145 33 124 53 150 65 22 58 48 140 97
2791 97 79 150 161 94 142 166 183 87 128 104 48 173 131 82 154 171 133 80 33 75 96 54 61 81 172 127 179 145 132 78 72 77 94 64 194 163
2453 163 9 40 92 99 22 9 123 162 182 297 138 26 101 128 173 108 70 120 113 148 100 76 135 104 96 169 261 230 144 77 88 47 52 188
2134 188 218 139 107 76 98 35 56 134 65 77 61 125 151 64 190 282 160 370 127 162 61 157 187 66 91 75 111 87 109 71 128 106
$$ packed form
4406E2J28k4j8J04j30L5Om0J9q1Q2ml4jp6J95p4j4l5k3N0RJ80j58P9n7k0m4m3M9pK3p3O5K5
4077A45n9mQ1o8k9P6P1pp8P1J8p8k0q8M1M8M9j39OM3k3n4M5O8J02j34l9qK8M1n0j6K7L8J18
3749B22n0j6r4J07n6p9K5K2l8J03J4M8m8O2j91K1J2k5O2o6M0J9K3j3n1jQ9l3L8ll6J51r0m4
3429A24q0j1J06j4J3N6P6p5p0n6J9N3P3j03N3K2j19L5p7L3M1p1O2L2mNj9K24j24K2o1j41O2
3119H6R8J6j52Q8m6k0J9O6k3K4mN0Oq4m5L3l8j4oJ17Q2j0j72mP8j12R1p1R7q5m3L6j0R2m3
2791I7j8P1J1o7M8K4J7r6M1k4n6J25m2m9P2J7l8n3m7M2K1m2PK0R1m5N2l4j3n4oNJ7l0J30l1
2453A63j54L1N2Pp7j3J14L9K0J15j59j12P5K7M5o5l8N0pL5m8k4N9l1qP3R2l1q6o7J1m1NJ36
2134A88L0p9l2l1K2o3K1P8o9J2j6O4K6q7J26R2j22K10k43L5j01R6L0j21K5j6L6k4K2l8N7k2
$$ plain form
1833 106 82 19 99 57 119 218 42 358 900 2767 4199 3760 2349 341 233 140 253 104 183 13 60 92 135 120 180 162 105
1579 105 68 113 245 49 172 81 156 108 183 111 162 288 319 436 230 180 216 629 557 320 113 106 119 55 176 561 354 17 33
1307 33 137 19 54 126 46 333 319 200 75 108 94 81 121 79 119 116 108 104 38 47 64 86 84 107 88 88 90 44 71 38 191 127 166 52 90
979 90 99 138 170 94 146 108 118 108 92 142 65 89 123 81 68 132 131 183 32 124 110 181 181 131 23 227 32 116 101 189 72 194 119 388
659 388 246 156 160 73 128 276 214 566 560 392 948 7404 13267 13858 8014 1294 1590 1934 2779 3166 2396 1199 830 512 362
425 362 229 98 216 182 216 124 68 92 65 97 87 63 99 164 79 216 127 182 190 130 64 160 141 165 241 253 139 55 108 27 243 81
124 81 117 127 132 151 137 89 126 31 139 87 131 93 83 197 120 143 122 81 97 114 146 100 91 86 120 64 187 130 227 240 154 143 197 149 186 264
-214 264 236 151 83 23 127 103 75 159 193 243 113 118 205 112 249 19 122 71 45
$$ packed form
1833A06k4o3Q0m2O2R9j76L16N42J867J432m39j411k008j08r3J13j49P9j70M7L2M3j5O0j8n7
1579A05l7M5J32j96J23r1P5m8P5p2N1J26L1J17k06n0L6M13p2k37k07pJ3o4J21L85k07l37J6
1307C3J04j18L5P2q0K87j4j19j25L3j4j3M0m2M0lqmo6RJ7K2kK3j9%Km6K7l3J53o4L9j14L8
979I0RL9L2p6N2l8J0j0j6N0p7K4L4m2j3O4jN2j51R2j4P1%n0j08K04j95Q4j5Q8j17J22p5K69
659C88j42r0Mq7N5J48o2L52oj68N56O456N863N91n844o720K96L44Q45L87p70j197l69l18j50
425C62j33j31J18l4L4r2n6K4k7L2j0k4L6O5q5J37q9N5Qo0o6R6j9K4P6J2j14q4N3q1K16j62
124H1L6J0NJ9j4m8L7r5J08n2M4l8j0J14p7K3k1m1J6J7L2m6rnL4n6J23n7R7J3q6j1N4m8L7P8
-214B64k8q5o8o0J04k4k8Q4L4N0j30NQ7r3J37k30J03n1k6
-392D5
##PAGE=	F1=-3519.28
##FIRST=	4405.895418600002813,	4405.895418600002813,	0
##DATA TABLE=	(F2++(Y..Y)), PROFILE
$$ plain form
4406 72 141 135 158 227 109 121 133 83 63 54 133 75 88 80 85 200 143 110 57 78 36 120 260 126 216 162 100 105 92 190 174 133 56 119 161 93
4068 93 104 139 143 76 91 194 219 123 203 178 133 125 65 34 126 149 48 43 40 41 6 34 105 184 75 50 39 81 64 118 62 83 71 204 154 174
3730 174 74 166 112 64 53 70 70 145 151 255 165 183 7 30 91 39 94 49 81 128 82 110 58 25 141 128 113 111 106 279 196 85 32 47
3411 47 131 159 198 197 305 165 62 57 118 148 206 133 113 142 93 127 50 55 103 66 69 145 138 144 126 294 191 210 176 36 77 153 150 5 107
3082 107 68 71 106 123 148 189 127 151 204 143 143 140 79 65 4 82 207 230 90 53 110 26 131 73 194 76 48 74 8 142 133 56 99 161
2763 161 163 115 164 247 141 174 151 54 183 167 49 174 177 152 80 57 78 113 45 98 119 225 141 228 164 138 115 102 96 131 109 207 201 45
2443 45 53 118 76 74 32 142 158 176 317 204 6 117 158 194 131 70 112 100 152 129 55 139 115 97 153 237 260 144 115 104 53 84 214
2134 214 257 162 100 67 77 49 62 179 120 78 98 149 142 66 203 329 289 581 139 184 77 161 171 71 84 73 108 58 111 67 149 140
$$ packed form
4406G2O9oK3O9j18J2J2n0k0rP9n8J3qNJ15n7l3n3K1m2Q4J40j34R0n4o2Nj3R8j6m1p7O3M2o8
4068I3J1L5Mo7J5J03K5r6Q0k5m5qo0l1R2K3j01nlJl5K8P1P9j09k5j1M2j7N4n6K1j2J33n0K0
3730A74j00R2n4m8j1J7%P5OJ04r0J8j76K3O1n2N5m5L2M7m6K8n2l3J16j3j5knJ73q3j11n3J5
3411D7Q4K8L9jJ08j40j03nO1L0N8p3k0K9m9L4p7NM8l7LP6pOj8J68j03J9l4j40M1P6lj45J02
3082A07l9LL5J7K5M1o2K4N3o1%lo1j4o1P8J25K3j40l7N7q4J05n8J21j18k8K6o6J34rp7M3O2
2763A61Km8M9Q3j06L3k3r7J29j6j18J25Lk5p2k3K1L5o8N3K1J06q4Q7o4k6k3j3oL5k2R8oj56
2443D5QO5m2km2J10J6J8J41j13j98J11M1L6o3o1M2j2N2k3p4Q4k4j8N6Q4K3j16k9j1n1L1J30
2134B14M3r5o2l3J0k8J3J17n9m2K0N1pp6J37J26m0K92m42M5j07Q4J0j00J3j1L5n0N3m4Q2r
$$ plain form
1833 140 83 53 140 13 77 188 102 277 779 2344 3438 3113 1879 238 268 162 240 154 209 46 52 72 110 127 136 183 106 35
1570 35 150 242 15 185 92 109 144 221 121 130 242 240 297 132 162 107 462 402 222 111 83 83 58 168 477 303 24 27 135 53
1288 53 63 127 39 330 327 162 44 107 122 107 119 117 78 75 117 102 21 25 78 111 46 144 137 144 159 22 64 61 190 171 206 55 67 37 152
960 152 181 86 104 106 128 78 29 118 99 96 121 89 49 106 84 138 42 168 181 179 184 136 41 195 93 119 111 187 38 168 73 372 221 179
640 179 170 60 104 186 68 477 357 181 548 4720 8471 8850 5305 818 1123 1337 1733 2243 1816 971 753 495 471 383
415 383 83 296 257 213 164 17 88 102 79 54 51 122 146 65 174 131 197 214 120 75 170 199 206 257 258 143 75 108 46 204 60 97 114
105 114 101 111 82 87 83 26 151 137 171 98 85 173 168 146 167 102 98 90 141 90 98 94 84 52 165 101 256 207 165 164 191 125 196 204 194 170 96 40
-252 40 108 99 59 153 214 200 68 121 166 116 215 46 81 61 32
$$ packed form
1833A40n7l0Q7j27O4J11q6J75N02J565J094l25j234j641L0j06P8q6N5j63OK0L8J7RM7p7p1
1570C5J15R2k27J70r3J7L5P7j00RJ12kN7j65L0n5L55o0j80j11k8%k5J10L09j74k79LJ08q2
1288E3J0O4q8K91lj65j18O3J5j5J2kl9lM2j5q1MN3L3o5R8pPJ5j37M2lJ29j9L5j51J2l0J15
960A52K9r5J8KK2n0m9Q9j9lK5l2m0N7k2N4r6J26J3kNm8r5J54j02K6qP6j49J30r5K99j51m2
640A79rj10M4Q2j18M09j20j76L67M172L751L79l545m487L05K14L96N10m27q45k18k58k4q8
415C83l00K13l9m4m9j47P1J4k3k5lP1K4q1J09m3O6J7r4m5R5K9PN1Jj15o8L3o2J58j44L7J7
105A14j3J0k9Nmn7J25j4L4p3j3Q8nk2K1o5mqN1n1Qmj0l2J13o4J55m9m2jK7o6P1Qj0k4p4n6
-252D0O8rm0R4O1j4j32N3M5n0R9j69L5k0k9
-392C2
##PAGE=	F1=-3538.06
##FIRST=	4405.895418600002813,	4405.895418600002813,	0
##DATA TABLE=	(F2++(Y..Y)), PROFILE
$$ plain form
4406 89 82 111 171 188 96 85 105 66 47 79 132 65 103 97 135 167 153 86 19 90 59 123 201 104 189 147 55 97 117 254 232 133 65 123 183 114
4068 114 123 103 190 74 30 166 219 131 180 120 116 140 82 66 142 122 99 53 21 21 28 43 95 128 68 46 38 81 11 178 112 99 50 182 150
3739 150 198 79 149 112 93 53 62 87 146 143 290 159 141 38 2 144 38 79 79 120 166 69 117 54 37 143 143 83 70 108 296 216 34
3429 34 25 55 137 183 242 187 321 133 19 55 153 155 168 132 61 109 112 147 67 33 97 94 59 165 141 159 143 236 171 169 178 62 77 129 94 62
3091 62 84 35 73 129 98 162 207 93 144 217 182 213 176 84 66 35 26 168 194 95 41 83 23 122 88 220 88 68 107 53 148 163 74 54
2772 54 167 244 79 138 283 187 216 195 57 193 191 31 198 186 169 78 82 82 106 58 144 164 281 158 254 169 136 138 152 123 155 131 206
2462 206 224 78 73 140 41 143 72 174 161 162 294 241 17 125 177 203 160 66 97 83 155 147 26 126 128 98 138 201 265 124 137 150
2162 150 58 118 230 286 186 96 61 57 50 45 194 166 77 121 153 139 87 209 349 460 721 171 186 85 160 144 84 76 69 125 56 114 47
$$ packed form
4406H9pK9O0J7r2j1K0l9j9L2N3o7L8oL8L2j4o7o7P1l1O4P8r7Q5m2r2M2K0J37k2r9o8N8O0o9
4068A14Rk0Q7j16m4J36N3q8M9o0mK4n8j6P6k0k3m6l2%PJ5N2L3o0k2qM3p0J67o6j3m9J32l2
3739A50M8j19P0l7j9m0RK5N9lJ47j31j8j03l6J42j06M1%M1M6r7M8o3j7J06%o0j3L8J88q0j82
3429C4rL0Q2M6N9n5J34j88j14L6R8KJ3l6p1M8LL5q0l4O4ll5J06k4J8j6R3o5kRj16J5N2l5l2
3091F2K2m9L8N6l1O4M5j14N1P3l5L1l7r2j8l1rJ42K6r9n4M2o0R9l4J32j32k0L9n4R5J5q9k0
2772E4J13P7j65N9J45r6K9k1j38J36kj60J67j2j7r1M%K4m8Q6K0J17j23R6q5l3KJ4k9L2k4P5
2462B06J8j46nO7r9J02p1J02j3JJ32n3k24J08N2K6m3r4L1j4P2qj21J00Kl0M0O3O4j41J3J3
2162A50r2O0J12N6j00r0l5mpnJ49k8q9M4L2j4n2J22J40J11K61n50J5j01P5j6o0qpN6o9N8o7
$$ plain form
1852 47 167 152 72 92 164 57 18 131 132 154 493 1500 2076 1995 1092 213 228 242 184 223 216 82 53 55 71 126 69 201 108 23 189
1561 189 229 76 183 84 72 171 249 119 89 189 161 165 60 154 30 311 265 146 109 56 58 72 165 380 229 53 46 116 83 73 109
1270 109 41 296 323 125 39 98 145 151 113 152 77 56 122 100 7 16 94 121 26 168 162 185 205 26 50 84 185 199 247 75 86 75 170
960 170 184 98 66 102 125 42 49 106 145 120 109 105 57 78 65 93 55 217 241 165 179 150 47 156 155 109 123 179 71 125 104 306 195 183
640 183 165 34 62 82 125 321 98 173 274 1412 2391 2443 1530 165 518 807 903 1330 1145 715 619 424 543 524 220 408
396 408 327 192 127 38 59 131 49 29 31 126 119 41 103 148 185 208 84 85 175 237 218 267 245 142 104 102 63 162 47 101 114 76 71 26 95 34
58 34 24 145 178 198 111 80 152 214 137 195 120 97 61 127 76 112 112 43 48 129 76 260 158 174 167 180 98 195 144 146 178 141 54 86 102 38 151
-289 151 236 151 20 131 125 124 173 75 43 35 46
$$ packed form
1852D7J20j5q0K0P2j07l9J13JK2L39J007N76q1r03q79J5J4n8L9pj34k9KJ6N5n7J32r3q5J66
1561A89M0j53J07r9j2R9P8j30l0J00k8Mj05R4j24K81m6j19l7n3KJ4R3K15j51j76pP0l3j0L6
1270A09o8K55K7j98q6N9M7Ol8L9p5k1O6k2r3RP8K7r5J42oK3K0j79K4L4J01J4M8j72J1j1R5
960A70J4q6l2L6K3q3PN7L9k5j1mm8K1j3K8l8J62K4p6J4k9j03J09jm6J4N6j08N4k1K02j11j2
640A83j8j31K8K0M3J96k23P5J01J138R79N2r13j365L53K89R6M27j85m30r6j95J19j9l04J88
396D08q1j35o5q9K1P2q2k0KR5pp8O2M5L7K3j24JR0O2j9M9k2j03l8kl9R9j15N4J3l8nm5O9o1
58C4j0J21L3K0q7l1P2O2p7N8p5k3l6O6n1L6%o9NQ1n3J84j02J6pJ3q2R7n1KL2l7q7L2J6o4J13
-289A51Q5q5j31J11ojM9r8l2qJ1
-392D6
##PAGE=	F1=-3556.84
##FIRST=	4405.895418600002813,	4405.895418600002813,	0
##DATA TABLE=	(F2++(Y..Y)), PROFILE
$$ plain form
4406 90 24 94 173 146 70 66 72 60 142 118 139 128 139 128 154 122 161 72 39 94 139 136 145 79 151 130 86 91 129 288 262 122 88 136 208 125 139
4058 139 64 219 66 24 133 208 159 131 53 98 158 87 96 155 92 157 72 58 47 66 84 84 66 64 32 47 62 47 230 168 100 36 158 152
3739 152 215 73 124 109 111 51 67 89 145 137 299 143 105 59 35 181 31 64 104 148 198 116 112 53 64 144 143 59 35 109 308 222 20
3429 20 40 50 162 188 263 165 315 107 74 68 184 163 110 107 22 91 108 146 65 19 82 113 63 175 131 168 156 162 145 113 171 83 82 120 42
3101 42 136 78 70 65 142 82 174 209 59 175 229 212 274 212 91 62 59 65 129 139 85 33 68 51 105 96 218 91 79 135 89 159 184 102 33
2772 33 178 317 62 88 285 215 247 225 60 204 203 41 224 194 177 75 98 78 85 68 182 209 332 178 256 155 126 144 203 154
2490 154 160 123 194 229 103 98 156 13 207 110 211 169 140 236 251 7 116 182 202 190 60 75 67 157 148 13 102 137 98 121 160 246 95
2180 95 139 185 57 143 233 304 202 92 59 41 30 11 171 190 74 125 129 142 116 199 344 570 746 187 168 84 154 120 94 72 82
$$ packed form
4406I0o6P0P9k7p6mOj2Q2k4K1j1J1j1K6l2L9q9l3N5M5lRo6P2k1m4NL8J59k6j40l4M8P2q3J4
4058A39p5J55j53m2J09P5m9k8p8M5O0p1RN9o3O5q5j4j1J9J8%j8kl2J5J5j5J83o2o8o4J22o
3739A52O3j42N1j5Ko0J6K2N6qJ62j56l8m6k4J46j50L3M0M4N0q2mn9J1Q0jq4k4P4J99q6k02
3429B0K0J0J12K6P5r8J50k08l3oJ16k1n3lq5O9J7L8q1m6O3L1n0J12m4L7j2Oj7l2N8q8jL8p8
3101D2R4n8qnP7o0R2L5j50J16N4j7O2o2j21k9lOO4J0n4n2L5j7N4rJ22j27j2N6m6P0K5q2o9
2772C3J45J39k55K6J97p0L2k2j65J44jj62J83l0j7j02K3k0Pj7J14K7J23j54P8j01k9J8N9m9
2490A54Ol7P1L5j26nN8j43J94r7J01m2k9R6J5k44J09O6K0j2j30J5qR0rj35Q9L5l9K3L9Q6j51
2180I5M4M6j28Q6R0P1j02j10l3j8j1j9J60J9j16N1MJ3k6Q3J45K26J76n59j9q4P0l4k6k2J0
$$ plain form
1889 82 158 85 121 23 184 149 55 113 177 98 53 119 123 63 239 919 1340 1500 835 274 169 316 108 271 220 97 69 48 49 123
1608 123 25 203 105 35 214 209 145 172 72 65 190 259 112 53 140 101 62 98 161 35 193 161 108 110 44 51 81 170 315 169 71 64 90
1298 90 92 81 79 51 245 298 114 59 81 157 196 100 173 119 91 126 101 16 38 105 113 82 181 159 203 218 20 34 104 173 210 278 107 122 136
969 136 178 185 119 42 98 106 44 108 106 194 157 98 120 61 57 66 65 60 258 278 142 167 157 62 138 194 96 129 171 131 112 167 220 164 155 151 29 29 70
603 70 232 197 96 279 515 1669 3249 3917 2185 538 140 411 419 609 533 488 454 326 567 609 361 551 394 244 68
368 68 115 49 130 21 71 9 115 91 11 30 157 159 169 32 92 176 245 200 262 215 141 139 96 73 133 43 108 128 64 44 62 96 22 37 127
40 127 203 208 129 88 144 249 126 205 131 100 41 114 63 131 132 14 59 90 56 233 103 172 157 165 85 184 118 106 185 164 68 73 106 65 160
-289 160 243 137 75 131 96 129 140 98 57 10 66
$$ packed form
1889H2P6p3L6r8J61l5r4N8O4p9m5O6Mo0J76O80M21J60o65n61j05J47k08J63n1j23k8k1JP4
1608A23r8J78r8p0J79no4K7j00pJ25O9j47n9Q7l9l9L6O3j26J58l2n3Ko6PL0Q9J45j46r8pK6
1298I0Kj1kk8J94N3j84n5K2P6L9r6P3n4k8L5k5q5K2O7Ql1R9k2M4J5j98J4P0O9L7O8j71J5J4
969A36M2Po6p7N6Qo2O4kQ8l7n9K2n9mRjnJ98K0j36K5j0r5P6N6r8L3M2m0j9N5N3n6rmj22%M1
603G0J62l5j01J83K36J154J580O68j732j647l98K71QJ90p6m5l4j28K41M2k48J90j57j50j76
368F8M7o6Q1j09N0o2J06k4q0J9J27KJ0j37O0Q4O9m5O2m7p4km3k3O0r0O5K0o4k0J8L4p4J5R0
40A27P6Np9m1N6J05j23P9p4l1n9P3n1O8Jj18M5L1l4J77j30O9j5Qq0R9o6j2P9k1r6NL3m1R5
-289A60Q3j06o2N6l5L3J1m2m1m7N6
-392F6
##PAGE=	F1=-3575.63
##FIRST=	4405.895418600002813,	4405.895418600002813,	0
##DATA TABLE=	(F2++(Y..Y)), PROFILE
$$ plain form
4406 72 24 85 159 108 36 69 30 44 215 154 154 182 175 144 142 75 159 73 73 91 193 157 100 52 109 122 149 103 119 286 253 98 113 157 230
4077 230 115 149 29 228 59 60 101 189 190 65 13 100 178 87 98 152 62 209 100 91 88 105 131 71 31 65 38 62 31 101 267 217 87
3767 87 38 132 148 214 56 96 100 112 49 83 80 138 132 273 118 84 73 70 190 28 51 115 153 217 169 91 65 86 146 128 43 27 104 311
3448 311 212 67 56 32 195 171 261 136 287 90 120 86 207 169 47 65 34 75 81 122 48 59 58 123 74 175 114 175 170 89 121 71
3148 71 162 92 80 127 10 206 93 142 46 140 72 181 196 43 203 223 216 315 242 100 65 70 105 87 80 69 38 71 86 93 96 188 86 76
2828 76 146 111 173 194 122 52 193 366 88 30 253 218 258 235 64 214 207 55 246 198 173 76 102 67 64 69 206 244 367 196 234
2537 234 123 114 138 242 182 147 90 174 220 116 123 162 53 256 140 241 177 113 164 251 27 92 172 192 213 50 49 54 157 130 23
2246 23 79 142 108 97 121 211 82 119 198 55 153 220 312 201 81 71 34 16 61 119 185 70 113 79 145 142 172 319 598 676 170 132
$$ packed form
4406G2m8O1P4n1p2L3l9J4J71o1%K8pl1ko7Q4q6%J8J02l6n7m8N7J3K7m6J6J67l3j55J5M4P3
4077B30j15L4j20J99j69JM1Q8Jj25n2Q7P8r1J1N4r0J47j09rlJ7K6o0m0L4k7K4l1P0J66n0j30
3767H7m9R4J6O6j58M0MJ2o3L4lN8oJ41j55l4j1lJ20j62K3O4L8O4m8p8k6K1O0j8q5j6P7K07
3448C11r9j45j1k4J63k4R0j25J51j97L0l4J21l8j22J8l1M1OM1p4J1jO5m9J01o1O1nq1L2n0
3148G1R1p0j2M7j17J96j13M9r6R4o8J09J5j53J60K0pR9p3j42l5NL5j8pj1l1L3J5PLR2j02j0
2828G6P0l5O2K1p2p0J41J73k78n8K23l5M0k3j71J50pj52J91m8k5r7K6l5lNJ37L8J23j71L8
2537B34j11rK4J04o0l5n7Q4M6j04PL9j09K03j16J01o4o4N1Q7k24O5Q0K0K1j63jNJ03k7j07
2246B3N6O3l4j1K4R0j29L7P9j43R8O7R2j11j20j0l7j8M5N8O6j15M3l4O6lL0J47K79P8n06l8
$$ plain form
1946 132 76 145 109 91 85 118 196 128 124 33 196 143 39 113 177 125 111 188 86 56 212 929 1663 1780 1154 330 129 352 44 278
1664 278 223 90 85 45 63 127 83 185 97 53 215 181 196 160 87 73 199 248 109 42 101 76 39 149 173 58 121 92 93 113 60 70
1364 70 83 177 297 149 73 69 77 88 86 45 69 190 252 136 91 57 151 226 79 175 163 130 126 108 34 66 111 94 134 184 130 197 196 25 25
1035 25 119 151 201 291 143 154 172 170 182 140 54 96 74 82 145 113 240 196 95 130 47 48 66 61 55 281 287 114 146 151 87 156 203 85 125 163
697 163 189 159 206 139 124 97 127 64 9 106 247 128 171 247 646 2336 4643 5615 3373 816 315 236 355 202 89 340 288
443 288 224 542 621 463 697 472 442 361 325 153 88 36 113 58 102 70 32 27 150 128 104 56 94 172 223 156 233 170 142 173 97 73 126
133 126 45 100 150 65 45 119 81 56 68 102 211 203 152 117 150 262 118 201 132 107 47 110 45 149 146 34 77 55 40 179 54 154
-167 154 142 144 105 164 129 96 192 151 82 73 110 108 179 230 162 137 119 83 127 119 107 84 5 67
$$ packed form
1946A32n6O9l6j8oL3P8o8mr1J63n3j04P4O4n2j4P7j02l0J56P17P34J17o26q24k01K23l08K34
1664B78n5j33nm0J8O4m4J02q8m4J62l4J5l6p3j4J26M9j39o7N9k5l7J10K4j15O3k9JK0n3J0
1364G0J3R4J20j48p6mQJ1km1K4J21O2j16m5l4R4P5j47R6j2l3mj8p4L2M5j7M0N0n4O7jj71%
1035B5R4L2N0R0j48J1J8kJ2m2q6M2k2QO3l2J27m4j01L5q3JJ8noK26Oj73L2No4O9M7j18M0L8
697A63K6l0M7o7j5k7L0o3n5R7J41j19M3P6L99J690K307R72k242k557n01p9J19j53j13K51n2
443B88o4L18P9j58K34k25l0q1l6j72o5n2P7n5M4l2l8nJ23k2k4m8L8P8N1o7P7o3k8L1p6k4N3
133A26q1N5N0q5k0P4l8k5J2L4J09qn1l5L3J12j44Q3o9k5o0O3o5J04lj12M3k2j5J39j25J00
-167A54j2Kl9N9l5l3R6m1o9rL7kP1N1o8k5j8l6M4qj2k3p9O2
-392F7
##PAGE=	F1=-3594.41
##FIRST=	4405.895418600002813,	4405.895418600002813,	0
##DATA TABLE=	(F2++(Y..Y)), PROFILE
$$ plain form
4406 41 50 84 134 74 22 73 23 24 249 174 171 207 192 136 109 46 144 81 94 86 212 180 70 35 69 130 206 139 88 251 206 66 130 182 244
4077 244 86 153 28 220 61 74 72 164 205 16 70 130 199 86 72 131 36 248 134 110 122 136 166 55 58 66 75 74 32 144 286 250
3777 250 72 58 103 131 192 27 71 87 101 47 103 65 122 122 215 86 72 82 93 173 50 40 111 138 219 201 57 82 103 146 101 39 53
3467 53 94 302 188 97 60 14 219 138 238 110 242 76 145 100 218 170 51 24 57 55 38 85 32 103 30 129 89 171 105 184 189 64
3166 64 110 91 155 88 67 145 45 255 111 203 22 127 69 180 174 58 205 196 193 330 263 109 87 71 132 61 69 62 58 81 112 91 87 138
2847 138 84 61 136 119 185 195 137 89 203 379 127 73 198 196 249 224 65 222 206 65 259 200 155 84 95 56 53 59 215 262 381
2556 381 203 194 79 104 126 258 206 128 49 152 205 117 140 154 97 282 159 255 181 92 131 258 68 59 149 177 224 34 36 42 154 99
2256 99 24 67 145 138 71 93 177 106 81 191 60 148 190 314 184 67 103 39 54 127 75 152 68 91 17 145 159 135 279 547 560 123
$$ packed form
4406D1RL4N0o0n2N1n0JK25p5lL6j5n6k7o3R8o3J3qJ26l2j10l5L4O1P6o7n1J63m5j40O4N2O2
4077B44j58O7j25J92j59J3kR2M1j89N4O0O9j13j4N9r5K12j14k4J2J4L0j11LQRjm2J12J42l6
3777B50j78j4M5K8O1j65M4J6J4n4N6l8N7%R3j29j4J0J1Q0j23j0P1K7Q1j8j44K5K1M3m5o2J4
3467E3M1K08j14r1l7m6K05q1J00j28J32j66O9m5J18m8j19k7L3kj7M7n3P1p3R9m0Q2o6P9Nj25
3166F4M6j9O4o7k1P8j00K10j44R2j81J05n8J11oj16J47rlJ37o7j54k2j6O1p1QpmK3L1k1mN1
2847A38n4k3P5j7O6J0n8m8J14J76k52n4J25kN3k5j59J57j6j41J94n9m5p1J1l9lOJ56M7J19
2556C81j78rj15K5K2J32n2p8p9J03N3q8K3J4n7J85j23R6p4q9L9J27j90rR0K8M7j90KOJ12n5
2256I9p5M3P8po7K2Q4p1k5J10j31Q8M2J24j30j17L6o4J5P3n2P7q4K3p4J28J4k4J44K68J3m37
$$ plain form
1955 123 86 63 134 107 69 114 166 228 177 128 64 199 141 31 102 161 134 159 264 63 79 254 973 1887 1917 1285 350 117 342
1683 342 66 243 222 68 95 39 80 140 132 153 83 75 194 146 220 156 125 78 198 217 116 49 79 78 63 170 178 78 131 58 81 118 82
1373 82 104 91 173 321 168 58 59 89 94 88 15 95 147 193 172 128 39 131 234 53 159 188 150 118 120 54 95 109 79 169 177 85 171 147 59
1044 59 27 129 116 175 284 177 175 174 142 178 156 95 98 43 116 155 120 280 227 101 137 18 48 57 73 44 280 269 86 114 139 113 193
734 193 191 78 107 156 234 224 212 79 106 24 97 99 13 115 189 106 137 116 585 1481 3197 4269 2774 761 321 230 380 178
471 178 159 263 143 139 478 566 508 813 569 727 785 660 334 44 87 131 109 96 59 67 54 136 103 45 123 90 161 181 105 178 115 143
171 143 195 107 62 132 49 76 165 74 59 167 46 79 108 79 202 189 180 152 161 251 110 193 126 112 75 118 25 158 152 54 97 32 27 111 39
-158 39 123 128 119 144 141 142 108 188 109 96 79 117 141 200 202 197 180 103 88 117 108 101 97 13 44
$$ packed form
1955A23l7k3P1k7l8M5N2O2n1m9o4J35n8j10P1N9k7K5J05k01J6J75P19R14L0o32r35k33K25
1683C42k76J77k1j54K7n6M1O0qK1p0qJ19m8P4o4l1m7J20J9j01o7L0jj5J07Qj00N3p3K3L7l6
1373H2K2j3Q2J48j53j10JL0Nop3Q0N2M6k1m4q9R2J03j81J06K9l8l2Ko6M1J4l0R0Qr2Q6k4q8
1044E9l2J02j3N9J09j07kjl2L6k2o1Ln5P3L9l5J60n3j26L6j19L0RJ6k9K36j1j83K8K5k6Q0
734A93kj13K9M9P8j0j2j33K7q2P3Kq6J02P4q3L1k1M69Q96J716J072j495k013m40r1J50k02
471A78j9J04j20mL39Q8n8L05k44J58N8j25l26k90M3M4k2j3l7Qj3Q2l3n8P8l3P1K0p6P3o3K8
171A43N2q8m5P0q3K7Q9r1j5J08j21L3K9k9J23j3rk8RR0j41Q3o7j4l7M3r3J33or8M3o5nQ4p2
-158C9Q4NrK5lJl4Q0p9j3j7L8K4N9Knj7p7j5K9rpmq4L1
-392D4
##PAGE=	F1=-3613.19
##FIRST=	4405.895418600002813,	4405.895418600002813,	0
##DATA TABLE=	(F2++(Y..Y)), PROFILE
$$ plain form
4406 22 61 98 105 46 31 66 69 53 239 170 182 199 181 105 72 70 116 87 100 84 199 198 55 51 46 153 247 186 41 198 132 34 137 205 242
4077 242 65 155 62 199 69 68 48 135 196 66 112 166 218 84 32 94 36 268 170 109 140 153 178 51 81 63 112 79 71 170 282 261
3777 261 73 79 76 101 151 14 55 76 82 46 122 54 99 103 137 53 57 88 97 146 91 39 98 112 202 203 18 93 115 145 74 50 90 83 276 155
3439 155 104 57 24 221 96 200 94 188 62 146 105 216 162 106 41 69 37 9 59 56 136 12 132 104 174 115 193 211 112 116 131 154
3138 154 74 43 165 79 271 119 232 1 109 77 171 156 82 179 152 155 320 273 117 118 69 144 87 116 70 85 89 121 95 69 81 93
2838 93 34 108 117 191 188 155 136 204 355 154 139 136 153 222 195 60 227 205 73 259 202 131 96 78 53 47 42 211 256 371 195 145 33
2528 33 103 120 251 220 122 58 135 192 108 142 128 134 284 164 246 173 97 175 278 110 37 123 157 222 13 56 31 147 67 18 62 154
2227 154 182 53 79 158 146 40 171 70 128 148 311 163 66 145 54 95 184 102 106 71 76 49 141 166 121 231 435 440 68 34 49 124
$$ packed form
4406B2L9L7Pn9j5L5Lj6J86o9J2J7j8p6l3kM6k9J3j6J15jj43mnJ07R4o1j45J57o6r8J03O8L7
4077B42j77R0r3J37j30jk0Q7O1j30M6N4N2j34n2O2n8K32r8o1L1J3K5j27L0j8M9l3qR9J12k1
3777B61j88OlK5N0j37M1K1Ol6P6o8M5ML4q4ML1RM9n5n2N9J4R0Jj85P5K2L0p1k4M0pJ93j21
3439A55n1m7l3J97j25J04j06R4j26Q4m1J11n4n6o5K8l2k8N0lQ0j24J20k8P0n9P8J8r9MJ5K3
3138A54q0l1J22q6J92j52J13k31J08l2R4j5p4R7k7LJ65m7j56Jm9P5n7K9m6J5ML2k6k6J2J2
2838I3n9P4RP4ll3j9O8J51k01j5lJ7O9k7j35J67k2j32J86n7p1l5j8k5onJ69M5J15j76n0j12
2528C3P0J7J31l1r8o4P7N7q4L4j4OJ50j20Q2p3p6P8J03j68p3Q6L4O5k09M3k5J16q0m9M4R2
2227A54K8j29K6P9j2j06J31j01N8K0J63j48r7P9r1M1Q9q2Ml5Nk7R2K5m5J10K04Nl72l4J5P5
$$ plain form
1927 124 105 28 144 210 244 221 144 95 193 147 35 96 124 126 195 311 94 129 243 907 1832 1772 1166 342 143 296 104 181 208
1655 208 49 97 30 88 159 161 116 72 100 167 111 214 165 158 76 185 171 131 51 77 85 60 163 172 112 199 66 71 119 101 143 114 149 373
1335 373 208 33 35 113 127 90 7 122 133 138 206 163 45 101 217 28 129 189 148 99 132 73 121 99 87 184 163 36 130 86 94 26
1035 26 134 72 142 259 202 185 143 102 173 167 146 107 51 139 144 125 310 245 113 139 17 48 41 90 34 258 230 67 77 136 132 233 172
725 172 72 78 143 262 274 191 47 148 66 67 124 43 107 131 150 64 153 423 165 355 1425 1160 490 161 205 327 207 213 204 35
443 35 92 390 472 494 870 671 1030 1265 1078 580 170 155 120 148 101 63 91 53 134 86 78 178 81 140 133 86 106 60 139 197 116 45
143 45 140 49 45 163 84 72 205 5 87 150 63 179 171 208 176 166 217 100 191 117 111 112 137 49 152 150 64 120 37 17 50 63 94 123 93
-186 93 185 126 138 110 165 63 112 85 127 160 208 166 218 197 99 109 98 102 84 97 27 7
$$ packed form
1927A24j9p7J16O6L4k3p7m9R8m6j12O1K8KO9J16k17L5J14O64R25o0o06q24j99J53j92P7K7
1655B08j59M8o7N8P1Km5m4K8O7n6J03m9pq2J09j4m0q0K6Qk5J03Ro0Q7j33NM8j8M2k9L5K24
1335C73j65j75KP8J4l7q3J15J1NO8m3j18N6J16j89J01O0m1m9L3n9M8k2j2R7k1j27R4m4Qo8
1035B6J08o2P0J17n7j7m2m1P1ok1l9n6Q8Nj9J85o5j32K6j22L1pM9n6K24k8j63J0N9mJ01o1
725A72j00OO5J19J2q3j44J01q2JN7q1O4K4J9q6Q9K70k58J90J070k65o70l29M4J22j20Orj69
443C5N7K98Q2K2L76j99L59K35j87m98m10j5l5K8m7l8K8l8Q1m8qJ00r7N9pm7K0m6P9N8q1p1
143D5R5r1mJ18p9j2J33k00Q2O3q7J16qL7l2j0N1j17R1p4oJK5q8J03kq6N6q3k0L3J3L1K9l0
-186I3R2n9J2k8N5j02M9k7M2L3M8m2N2k1r8J0j1Mj8J3p0k0
-392G
##PAGE=	F1=-3631.97
##FIRST=	4405.895418600002813,	4405.895418600002813,	0
##DATA TABLE=	(F2++(Y..Y)), PROFILE
$$ plain form
4406 55 63 125 83 45 31 50 100 101 195 144 183 163 139 65 51 118 86 85 94 83 162 208 50 84 54 174 271 230 15 142 51 10 134 218 224
4077 224 95 162 98 170 77 53 42 110 164 104 138 193 231 77 43 59 55 269 203 84 141 161 167 69 87 54 136 75 104 175 256 248 84 88
3758 88 56 60 104 51 50 69 66 48 137 61 74 80 66 24 31 88 83 138 139 60 86 86 170 177 18 96 122 141 57 68 132 79 237 118 91 67 41 199
3401 199 58 155 91 131 49 126 99 204 140 150 69 73 41 51 74 95 152 32 129 117 191 144 200 231 162 129 154 158 59 22 179 108 251
3091 251 117 222 16 95 96 154 148 99 135 104 125 293 269 122 146 68 141 133 159 80 112 93 114 94 45 29 105 8 67 108 191 176 176 185 192
2763 192 299 163 184 88 99 185 158 49 229 202 81 247 206 114 110 64 65 42 21 198 228 341 171 103 34 113 124 225 224 141 100
2472 100 129 178 92 126 88 159 264 158 212 154 129 240 300 143 49 101 137 206 18 87 22 139 41 34 60 168 225 61 73 155 183
2180 183 60 144 82 100 101 307 152 94 186 71 126 214 154 81 85 80 96 136 165 156 184 291 326 64 36 42 118 97 25 162 240 241 251 179
$$ packed form
4406E5QO2m2l8j4J9N0JR4n1L9k0k4p4j4O7l2jRj1P9M6j58L4l0J20R7m1k15J27r1m1J24Q4O
4077B24j29O7o4P2r3k4j1O8N4o0L4N5L8j54l4J6mK14o6j19N7K0Or8J8l3Q2o1K9P1Q1qj64M
3758H8l2MM4n3jJ9lj8Q9p6J3Oj4m2PN7nN5Jp9K6%Q4Pj59P8K6J9q4J1O4n3J58j19k7k4k6J58
3401A99j41R7o4M0q2P7k7J05o4J0q1Ml2J0K3K1N7j20R7j2P4m7N6L1o9l3K5Mr9l7J57p1J43
3091B51j34J05k06P9JN8om9L6l1K1J68k4j47K4p8P3qK6p9L2j9K1k0m9j6P6r7N9M1Q3j5%RP
2763A92J07j36K1r6J1Q6k7j09J80k7j21J66m1r2mm6Jk3k1J77L0J13j70o8o9P9J1J01jq3m1
2472A00K9M9q6L4l8P1J05j06N4n8k5J11O0j57r4N2L6O9j88O9o5J17r8pK6J08N7j64J2Q2K8
2180A83j23Q4o2J8JK06j55n8R2j15N5Q8o0p3MnJ6M0K9rK8J07L5k62k8OP6k1p2J37P8JJ0p2
$$ plain form
1861 179 123 182 156 42 109 70 105 223 315 129 188 225 891 1704 1540 947 310 197 233 118 117 179 58 95 30 90 179 170 90 69
1579 69 125 150 82 187 183 171 65 161 121 147 45 88 94 37 136 156 158 274 103 63 112 118 180 142 108 409 252 23 4 132 172 96 15
1270 15 142 154 117 232 191 63 74 179 15 97 165 128 78 139 83 143 81 116 184 143 22 87 50 114 18 131 38 113 222 215 182 87
969 87 68 169 177 193 118 82 151 126 122 329 247 128 137 50 45 23 102 25 221 177 75 69 159 142 266 164 65 48 124 270 294 153 31
659 31 206 133 46 135 70 100 148 207 102 294 275 1669 2551 2068 762 200 75 134 231 222 153 128 32 95 292 370 433 856 748
387 748 1290 1717 1504 868 359 232 80 165 113 76 98 28 151 79 128 208 72 111 94 117 43 20 132 176 113 30 140 41 22 141
105 141 92 82 234 60 81 185 57 144 153 230 180 160 170 90 201 113 103 145 161 96 136 144 64 149 70 11 26 83 85 125 72 215 132 122
-214 122 86 124 74 129 85 136 167 195 129 220 187 112 142 73 94 63 93 52 33
$$ packed form
1861A79n6N9k6j14O7l9L5J18R2j86N9L7O66Q13j64n93o37j13L6j15jO2j21L7o5O0Q9rq0k1
1579F9N6K5o8J05mj2j06R6m0K6j02M3On7R9K0KJ16j71m0M9OO2l8l4L01j57k29j9J28M0p6q1
1270A5J27J2l7J15m1j28J1J05j64Q2O8l7n0O1n6O0o2L5O8m1j21O5l7O4r6J13r3P5J09pl3r5
969H7j9J01QJ6p5l6O9k5mK07q2j19Rq7nk2P9p7J96m4j02oR0j7J24j02r9j7P6J46K4j41j22
659C1J75p3q7Q9o5L0M8N9j05J92j9J394Q82m83j306n62j25N9R7ro9k5r6O3J97P8O3M23j08
387G48N42M27k13o36n09j27j52Q5n2l7K2p0J23p2M9Q0j36L9j7K3p4k3J12M4o3q3J10r9j9J19
105A41m9j0J52j74K1J04j28Q7RP7n0k0J0q0J11q8j0M2J6o5M0Qq0Q5p9n9J5N7KM0n3J43q3j0
-214A22l6L8n0N5m4N1L1K8o6R1l3p5L0o9K1l1L0m1j9
-392C3
##PAGE=	F1=-3650.75
##FIRST=	4405.895418600002813,	4405.895418600002813,	0
##DATA TABLE=	(F2++(Y..Y)), PROFILE
$$ plain form
4406 95 62 157 74 75 45 28 107 144 143 117 174 114 75 49 56 168 75 74 82 76 118 215 51 119 75 184 278 259 60 106 32 5 127 216 192 149
4068 149 176 130 140 84 45 63 101 119 122 147 200 231 66 91 59 66 250 226 42 128 163 147 95 82 44 139 61 120 159 215 213 86 78 50 15
3739 15 80 85 54 62 70 55 146 82 62 62 76 6 28 87 59 165 185 90 82 71 130 137 40 90 123 134 63 85 167 85 188 84 66 95 53 156
3401 156 36 110 93 81 43 96 81 185 111 177 78 73 57 81 104 127 150 50 120 126 218 182 199 242 195 133 153 164 59 43 182 129 199
3091 199 108 181 29 93 118 133 146 108 85 69 113 256 249 121 165 71 123 168 181 82 136 91 98 86 26 7 107 39 22 98 187 161 191 225
2772 225 167 225 152 199 77 49 146 128 33 229 196 90 227 211 116 122 69 94 57 4 178 181 296 135 88 72 128 137 188 217 171 131 134
2462 134 158 75 93 42 170 233 150 155 128 172 288 310 160 65 90 118 181 44 119 15 133 20 62 60 185 255 83 68 160 214 111
2171 111 115 98 84 61 302 161 135 218 84 145 210 181 108 109 94 120 130 162 215 148 156 206 100 93 47 115 89 83 167 251 222 260 224 150 168
$$ packed form
4406I5l3R5q3Jl0j7P9L7jk6N7o0l9k6PJ12r3jQoM2R7j64O8m4J09R4j9j99M6p4k7J22Q9k4m3
4068A49K7m6J0n6l9J8L8J8LK5N3L1j65K5l2PJ84k4j84Q6L5j6n2j3l8R5p8N9L9N6kj27qk8l5
3739A5O5Nl1QQj5R1o4k0%J4p0K2N9k8J06K0r5qj1N9Pr7N0L3J1p1K2Q2q2J03j04j8K9m2J03
3401A56j20P4j7j2l8N3j5J04p4O6r9nj6K4K3K3K3j00P0OR2l6J7M3m7o2K0J1j05j6J39n3P0
3091A99r1P3j52O4K5J5J3l8k3j6M4J43pj28M4r4N2M5J3r9N4m5Pj2o0j9J00o8j7P6Q9k6L0L4
2772B25n8N8p3M7j22k8R7j8r5J96l3j06J37j6r5On3K5l7n3J74LJ15j61m7j6N6RN1K9m6m0L
2462A34K4q3J8n1J28O3q3Nk7M4J16K2j50r5K5K8O3j37P5j04J18j13M2kJ25P0j72j5R2N4j03
2171A11Mj7j4k3K41j41k6Q3j34O1O5k9p3Jj5K6J0L2N3o7QN0j06pm6O8k6oQ4Q4k9L8l6p4J8
$$ plain form
1842 168 161 45 131 38 83 240 278 140 222 217 894 1529 1299 728 251 251 171 106 83 139 79 100 44 89 192 162 82 69 145 145 66 154
1542 154 201 161 45 131 89 157 35 101 104 34 103 136 205 332 146 53 93 132 211 162 69 393 289 53 25 141 208 106 12 151
1260 151 187 133 246 205 77 54 133 20 71 124 97 70 136 79 156 55 149 178 122 50 50 74 112 22 119 72 97 184 217 170 21 80 165
950 165 184 225 124 106 156 118 109 332 233 141 130 71 39 10 98 12 177 118 106 120 200 143 285 173 54 49 98 259 280 108 18 242
650 242 177 33 132 85 99 177 225 158 353 192 2376 3885 3486 1612 171 221 62 148 242 101 48 61 120 196 286 342 776 775
387 775 1454 2053 1858 1157 571 310 47 161 128 94 88 17 174 80 151 208 65 78 72 152 67 40 129 135 93 27 125 28 31 106 100 91 249
77 249 112 73 205 60 103 136 245 163 142 121 81 219 121 88 165 180 143 126 139 57 183 114 12 30 92 94 132 65 233 155 108 40
-223 40 90 127 143 79 137 169 158 92 197 155 134 179 49 86 44 91 81 62
$$ packed form
1842A68pj16Q6r3M5J57L8j38Q2nO77O35k30n71m77%q0o5k3N6o0K1n6M5J03l0q0j3P6%p9Q8
1542A54M7m0j16Q6m2O8j22O6Lp0O9L3O9J27j86r3M0L9P9m9r3L24j04k36k8J16O7j02r4J39
1260A51L6n4J13m1j28k3P9j13N1N3k7k7O6n7P7j01R4K9n6p2%K4L8r0R7m7K5Q7L3m7j49N9Q5
950A65J9M1j01j8N0l8rK23r9r2j1n9l2k9Q8q6J65n9j2J4Q0n7J42j12j19nM9J61K1j72r0K24
650B42o5j44R9m7J4P8M8o7J95j61K184J509l99j874j441N0j59Q6R4j41n3J3N9P6R0N6M34j
387G75O79N99j95p01n86k61k63J14l3l4op1J57r4P1N7j43J3oQ0q5k7Q9Om2o6R8r7LP5orJ58
77B49j37l9J32j45M3L3J09q2k1k1m0J38r8l3P7J5l7j7J3q2J26o9j02J8O2KL8o7J68p8m7o8
-223D0N0L7J6o4N8L2j1o6J05m2k1M5j30L7m2M7j0j9
-392F2
##PAGE=	F1=-3669.53
##FIRST=	4405.895418600002813,	4405.895418600002813,	0
##DATA TABLE=	(F2++(Y..Y)), PROFILE
$$ plain form
4406 132 62 183 76 109 91 1 90 173 130 119 163 72 44 72 72 212 95 67 67 60 92 226 56 151 95 177 268 270 91 103 78 19 122
4096 122 201 153 197 189 155 111 90 48 92 117 86 134 143 187 216 57 128 85 65 215 237 39 113 164 140 116 82 48 128 38 116 133 169 164 73
3767 73 50 52 24 101 111 58 52 104 69 146 104 71 65 129 7 72 95 41 204 219 118 83 77 94 104 46 84 114 122 81 96 187 92 137 56 51 127
3420 127 60 97 46 70 95 51 47 81 57 164 93 189 65 73 67 95 127 142 129 59 103 129 247 224 190 241 204 121 128 166 76 78 178 140 129
3091 129 100 127 46 100 139 113 140 106 38 61 103 207 213 114 173 78 95 178 181 77 152 81 82 71 42 32 92 76 25 96 187 145 189 243 135
2763 135 147 125 183 89 44 114 117 18 227 184 97 203 214 131 131 96 132 94 26 153 123 243 97 99 103 142 153 150 202 194 145 139 126 66 51 44
2425 44 167 204 150 85 113 211 307 304 158 70 87 103 147 66 146 6 133 9 88 66 198 264 105 59 170 239 155 85 129 106 47 291
2124 291 179 173 233 91 150 173 171 147 136 99 119 127 159 267 133 102 94 114 148 63 110 87 130 163 240 192 246 260 174 154 162 36 147 83
$$ packed form
4406A32p0J21j07L3j8r0Q9Q3m3j1M4r1k8K8%J40j17k8%pL2J34j70R5n6Q2R1Kj79J2k5n9J03
4096A22P9m8M4ql4m4k1m2M4K5l1M8RM4K9j59P1m3k0J50K2j98P4N1k4k4l4l4Q0r0P8J7L6nr1
3767G3k3Kk8P7J0n3oN2l5P7m2l3oO4j22O5K3n4J63J5j01l5oJ7J0n8L8L0Qm1J5R1r5M5q1nP6
3420A27o7L7n1K4K5m4mL4k4J07p1R6j24QoK8L2J5j3p0M4K6J18k3l4N1l7q3PL8r0KJ00l8j1
3091A29k9K7q1N4L9k6K7l4o8K3M2J04Or9N9r5J7Q3Lj04P5p1Jj1k9j0O0j6n1P1R1m2M4N4j08
2763A35J2k2N8r4m5P0Lr9K09m3q7J06J1q3%l5L6l8o8J27l0J20j46KML9J1lN2qm9oj3o0j5p
2425D4J23L7n4o5K8R8R6lj46q8J7J6M4q1Q0j40J27j24P9k2J32O6j59m6J11O9q4p0M4k3n9K44
2124B91j12oO0j42N9K3kk4j1l7K0QL2J08j34l1qK0L4q5M7k3M3L3P7m8N4J4q6k0Qj26J11o4
$$ plain form
1805 83 72 240 210 130 213 181 758 1184 975 504 168 282 123 80 84 94 90 120 64 85 196 142 92 62 157 135 63 133 210 135 17
1514 17 107 103 157 35 112 107 62 75 127 242 358 183 45 62 146 231 163 99 363 324 83 48 139 225 114 21 145 207 153 243 203 86
1213 86 40 98 40 57 76 67 83 123 59 159 26 179 174 106 69 33 98 88 48 100 123 96 154 213 151 39 123 161 186 233 117 116 156 123
894 123 83 318 202 147 116 76 30 14 76 8 133 59 141 197 245 133 288 192 38 85 71 236 236 65 30 242 194 19 117 86 105
603 105 171 192 170 318 142 2124 3491 3156 1506 221 266 85 141 223 147 52 64 141 125 224 237 650 736 1487 2203 2068 1398
349 1398 772 380 109 148 149 117 74 57 188 87 144 183 60 59 72 168 114 67 132 87 65 34 96 17 46 71 108 99 246 150 77 206
49 206 62 66 117 254 130 121 83 73 240 140 71 165 185 179 138 140 48 220 162 18 20 97 101 135 82 236 178 108 56 118 176 153 67 128 170
-280 170 102 55 153 112 157 212 43 82 32 93 105 74
$$ packed form
1805H3j1J68l0q0Q3l2N77M26k09m71l36J14j59m3MJ0mL0n6K1J11n4n0l0R5k2p2P0P7p5j18
1514A7R0mN4j22P7nm5J3N2J15J16j75j38J7Q4Q5o8o4K64l9k41l5R1Q6j11r3J24O2n4R0m0j17
1213H6m6N8n8J7J9rJ6M0o4J00j33J53no8l7l6O5j0m0N2K3k7N8N9o2j12Q4L8K5M7j16jM0l3
894A23m0K35j16n5l1m0m6j6O2o8J25p4Q2N6M8j12J55r6j54M7j4J65%j71l5K12m8j75R8l1J9
603A05O6K1k2J48j76J982J367l35j650j285M5j81N6Q2p6r5J2P7j6R9J3M13Q6P51P16j35o70
349A398o26l92k71L9Jl2m3j7J31j01N7L9j23jJ3R6n4m7O5m5k2l1O2p9K9K5L7rJ47r6p3J29
49B06j44MN1J37j24rl8j0J67j00o9R4K0om1Kr2J72n8j44KP7ML4n3J54n8p0n2O2N8k3q6O1M2
-280A70o8m7R8m1M5N5j69L9n0O1J2l1
-392G4
##PAGE=	F1=-3688.31
##FIRST=	4405.895418600002813,	4405.895418600002813,	0
##DATA TABLE=	(F2++(Y..Y)), PROFILE
$$ plain form
4406 157 62 196 80 136 143 28 59 187 168 150 155 64 102 95 90 244 126 84 54 35 106 242 69 178 113 155 241 261 104 113 99 39
4105 39 121 180 128 229 192 169 83 99 52 118 148 98 157 132 157 184 61 147 99 61 167 233 92 115 165 155 123 103 72 117 11 96 119
3796 119 127 109 50 16 48 57 137 124 55 42 157 90 134 117 84 86 165 12 118 115 39 233 236 135 79 97 79 97 44 83 94 105 100 101 188 93
3458 93 93 35 62 149 66 36 69 35 94 55 55 101 41 147 102 188 36 73 63 95 139 138 92 66 81 126 267 264 172 223 188 92 88 158 96 108
3119 108 175 143 56 99 81 66 107 154 96 121 96 2 77 80 143 166 102 173 90 67 161 167 71 156 61 71 50 79 54 60 110 59 108 191 134 164
2781 164 231 104 85 91 146 96 78 95 122 20 225 167 97 179 212 143 136 127 170 132 49 124 62 190 65 112 123 149 162 120 180 207 147 136
2462 136 83 69 39 85 153 192 159 23 125 238 297 289 145 66 84 92 108 82 169 15 141 37 101 77 201 251 120 51 188 259 182
2171 182 60 178 154 50 271 191 199 230 88 145 114 127 174 160 88 101 126 159 297 139 143 131 94 194 87 97 86 158 159 207 160 211
$$ packed form
4406A57r5J34j16N6Pj15L1J28j9j8Nr1L8pnJ54j18m2l0j9P1J36j73J09o5M2Q6K0j57Rj4o0
4105C9Q2N9n2J01l7k3q6J6m7O6L0n0N9k5K5K7j23Q6m8l8J06O6j41K3N0j0l2k0l1M5j06Q5K3
3796A19Qj8n9l4L2RQ0j3o9j3J15o7M4j7l3KP9j53J06lp6J94Lj01n6J8j8J8n3L9J1J1nJQ7r5
3458I3%n8K7Q7q3l0L3l4N9l9%M6o0J06m5Q6j52L7j0L2M4jm6k6J5M5J41lr2N1l5r6mP0o2J2
3119A08O7l2q7M3j8j5M1M7n8K5k5r4P5LO3K3o4P1q3k3R4Or6Q5r5J0k1K9k5ON0n1M9Q3n7L0
2781A64O7j27j9ON5n0j8J7K7j02K05n8p0Q2L3o9prM3l8q3P5o2J28j25M7J1K6J3m2O0K7o0j1
2462A36n3j4l0M6O8L9l3j36J02J13N9qj44p9J8QJ6k6Q7j54J26j04O4k4J24N0j31o9J37P1p7
2171A82j22J18k4j04K21q0QL1j42N7l1J3M7j4p2J3K5L3J38j58Mj2l7J00j07J0j1P2JM8m7N1
$$ plain form
1871 211 272 189 138 159 17 152 127 78 215 128 117 162 100 443 679 581 309 87 282 88 63 87 54 88 150 81 79 193 114 116 53
1579 53 158 107 76 131 205 115 13 102 144 148 53 124 95 81 59 137 264 350 211 58 21 156 239 145 170 419 370 106 58 125 219 115
1279 115 53 124 202 154 219 185 94 31 95 74 52 43 47 97 108 34 151 16 200 177 99 80 35 97 59 79 80 162 101 144 214 131 79 161 152
950 152 180 213 92 112 152 131 49 285 159 144 96 65 22 14 45 34 93 8 167 274 278 113 275 206 19 122 50 206 175 30 61
659 61 207 187 5 95 83 115 143 125 152 227 107 1250 2024 1662 722 188 205 153 191 152 179 92 56 150 117 177 134 510 637 1381
378 1381 2136 2094 1543 923 433 198 150 178 141 81 96 184 98 118 146 52 66 89 162 137 81 138 63 65 38 53 13 53 60 115 105 223 169
68 169 94 186 59 74 97 260 91 106 58 62 260 166 53 145 173 197 164 147 48 252 204 26 44 112 98 133 113 228 190 117 127 186
-233 186 212 155 56 111 173 48 36 90 81 178 236 59 84 32 92 115 68
$$ packed form
1871B11O1q3n1K1j42J35k5m9J37q7j1M5o2L43K36r8k72k22J95j94k5K4l3L4O2o9kJ14p9Ko3
1579E3J05n1l1N5P4r0j02Q9M2Mr5P1k9j4k2P8J27Q6j39j53l7J35Q3r4K5K49m9k64m8O7R4j04
1279A15o2P1P8m8O5l4r1o3O4k1k2rMN0J1p4J17j35J84k3p8j9m5O2l8K0JQ2o1M3P0q3n2Q2r
950A52K8L3j21K0M0k1q2K36j26j5m8l1m3qL1j1N9q5J59J07Mj65J62o9j87J03p2J56l1j45L1
659F1J46k0j82R0j2L2K8j8K7P5j20J143P74l62r40n34J7n2L8l9K7q7l6R4l3O0m3L76J27P44
378A381P55m2n51o20m90k35m8K8l7o0J5Q8q6K0K8r4J4K3P3k5n6N7p5Kk7J5m0M0PN5j0J18n4
68A69p5R2j27J5K3J63j69J5m8MJ98r4j13R2K8K4l3j7r9K04m8j78J8O8j4L5k0J15l8p3J0N9
-233A86K6n7r9N5O2j25j2N4rR7N8j77K5n2O0K3m7
-392F8
##PAGE=	F1=-3707.09
##FIRST=	4405.895418600002813,	4405.895418600002813,	0
##DATA TABLE=	(F2++(Y..Y)), PROFILE
$$ plain form
4406 164 58 191 83 153 185 57 27 185 214 175 154 82 158 106 105 259 154 119 48 5 138 253 83 193 128 124 198 239 97 119
4124 119 95 64 125 161 132 238 177 170 56 112 45 138 180 133 189 118 120 139 79 147 90 75 116 212 136 137 168 173 113 141 101 118 16 77 134
3796 134 97 57 26 53 32 80 165 126 40 46 212 115 109 117 89 111 176 33 152 141 41 246 230 139 65 115 84 104 54 90 62 82 110 104
3476 104 170 81 60 21 78 155 74 32 92 17 90 74 63 138 52 139 123 180 26 75 48 83 141 121 44 80 64 121 271 297 147 186 149
3166 149 59 41 136 108 131 175 140 15 103 51 84 107 159 80 90 83 36 104 61 66 116 84 168 109 51 120 155 75 149 32 67 30 125 88 16
2838 16 137 81 131 196 130 121 188 83 58 64 100 92 110 89 127 30 220 149 90 154 201 144 139 153 198 156 69 91 17 142 45 112 131 145 157
2509 157 103 155 212 147 120 44 78 77 116 128 194 164 48 156 251 264 273 134 67 75 81 66 88 189 44 156 70 99 83 193 222 126 60
2199 60 210 272 189 59 239 202 47 237 189 208 211 78 134 63 65 183 176 60 75 127 159 299 153 189 250 54 223 116 78 80 162
$$ packed form
4406A64j06J33j08P0L2j28l0J58K9l9k1p2P6n2jJ54j05l5p1m3J33J15j70J10o5mP4M1j42K2
4124A19k4l1O1L6k9J06o1pj14N6o7R3M2m7N6p1KJ9o0O8n7j5M1R6p6JL1No0K8m0J7j02O1N7
3796A34l7m0l1K7k1M8Q5l9q6OJ66r7oQk8K2O5j43J19j1j00K05j6r1p4N0l1K0n0L6k8K0K8o
3476A04O6q9k1l9N7P7q1m2O0p5P3j6j1P5q6Q7j6N7j54M9k7L5N8k0p7L6j6N7J50K6j50L9l7
3166A49r0j8R5k8K3M4l5j25Q8n2L3K3N2p9J0pm7O8m3NN0l2Q4n9n8O9L5q0P4j17L5l7R5l7p2
2838A6J21n6N0O5o6rO7j05k5OL6qJ8k1L8r7J90p1n9O4M7n7nJ4M5m2q7K2p4J25r7O7J9J4J2
2509A57n4N2N7o5k7p6L4jL9J2O6l0j16J08R5J3Rj39o7QOj5K2J01j45J12q6K9j6J10K9r6o6
2199F0J50O2q3j30J80l7j55J90m8J9Lj33N6p1KJ18pj16J5N2L2J40j46L6O1j96J69j07l8KQ2
$$ plain form
1908 162 159 157 135 164 253 192 119 159 28 145 145 95 164 47 114 89 73 139 418 429 336 77 258 65 76 77 28 78 178 94 71 190
1608 190 81 150 68 149 60 104 136 189 118 41 117 183 131 83 138 68 80 49 155 268 310 228 85 26 162 235 116 226 541 422
1326 422 116 58 104 193 106 89 93 168 131 173 152 108 45 107 117 51 47 47 97 102 36 132 51 212 186 102 85 40 77 63 104 70 179 108 156
997 156 224 120 91 182 139 166 170 49 97 146 131 15 233 109 133 71 45 17 6 43 58 58 42 176 339 291 86 251 202 8 145
706 145 46 177 114 26 90 148 160 32 72 86 121 126 65 131 152 108 655 1470 1428 825 188 89 210 235 56 156 102 50 145 150 142 42
406 42 386 495 1156 1870 1939 1561 993 461 276 180 219 164 109 128 164 109 92 122 42 81 115 145 132 83 135 79 104 38 3 11 55 81
105 81 118 109 180 167 111 149 46 126 73 263 60 107 46 53 273 193 38 110 143 196 180 157 57 273 232 37 94 143 87 123 149 214 185
-205 185 125 191 250 230 149 56 96 176 59 70 27 91 191 245 76 88 45 83 104 53
$$ packed form
1908A62lkk2K9Q9o1p3M0j31J17%n0O9j17O7k5j6O6K79J1r3k59J81j93J1Jm9N0J00q4k3J19
1608A90j09O9q2Q1q9M4L2N3p1p7P6O6n2m8N5p0J2l1J06J13M2q2j43n9J36P3j19J10L15j19
1326D22l06n8M6Q9q7j7MP5l7M2k1m4o3O2J0o6m%N0No6R6q1J61k6q4j7m5L7j4M1l4J09p1M8
997A56O8j04k9R1m3K7Mj21M8M9j5j16K18j24K4o2k6k8j1L7J5%j6J34J63m8k05J65m9j94J37
706A45r9J31o3q8O4N8J2j28M0J4L5No1O6K1m4N47Q15m2o03o37r9J21K5j79J00n4n2R5Nqj00
406D2L44J09O61P14O9l78n68n32j85r6L9n5n5J9L6n5j7L0q0L9L4L0j3m9N2n6K5o6l5QM4K6
105H1L7rP1j3n6L8j03Q0n3J90k03M7o1PK20q0j55P2L3N3j6k3j00K16m1j95N7M9n6L6K6O5k9
-205A85o0O6N9k0q1r3M0Q0j17J1m3O4J00N4j69J2m3L8K1n1
-392E3
##PAGE=	F1=-3725.87
##FIRST=	4405.895418600002813,	4405.895418600002813,	0
##DATA TABLE=	(F2++(Y..Y)), PROFILE
$$ plain form
4406 151 49 165 91 160 204 79 10 170 240 178 160 95 189 103 111 254 172 151 55 28 165 247 94 193 140 97 144 214 75 115 80
4115 80 92 134 156 154 225 138 157 32 128 28 151 204 163 219 107 92 88 95 133 61 109 76 180 155 166 172 176 88 182 123 124 34 80 159 74 17
3777 17 15 107 12 98 178 125 24 63 258 139 74 98 82 135 161 64 167 167 50 245 203 129 42 123 92 100 86 96 18 62 103 107 139 58
3458 58 40 23 84 143 85 73 108 41 82 93 68 167 73 141 134 166 61 77 26 64 136 99 29 101 62 119 257 314 118 134 92 62 11 98
3138 98 111 143 172 130 49 107 37 90 98 152 64 52 70 65 136 87 18 84 59 159 135 47 71 158 89 130 22 71 34 179 131 30 153 89
2819 89 156 196 134 94 122 77 65 67 70 83 138 95 121 33 209 130 75 124 178 131 139 169 209 157 83 62 54 103 35 98 129 130 133 100 128 215 155 92
2462 92 50 81 109 126 97 197 157 80 184 247 221 267 136 78 65 68 49 83 204 80 172 98 83 80 170 183 124 89 226 272 180 86 301
2152 301 236 37 188 171 202 182 61 118 75 45 180 179 23 52 127 160 274 163 235 346 66 227 143 77 69 144 157 98 119 113 206
$$ packed form
4406A51j02J16p4O9M4j25o9J60P0o2j8o5R4q6QJ43q2k1r6k7J37Q2j53R9n3m3M7P0j39M0l5
4115H0J2M2K2kP1q7J9j25R6j00J23N3m1N6j12j5mPL8p2M8l3J04k5J1OMq8R4n9Jr0M6P9q5n7
3777A7kR2r5Q6Q0n3j01L9J95j19o5K4j6N3K6r7J03%j17J95m2p4q7Q1l1Qj4J0p8M4M1ML2q1
3458E8j8j7O1N9n8j2L5o7M1J1k5R9r4O8pL2j05J6n1L8P2l7p0P2l9N7J38N7j96J6m2l0n1Q7
3138I8J3L2K9m2q1N8p0N3QN4q8j2J8nP1m9o9O6k5J00k4q8K4Q7o9M1j08M9l7J45m8j01J23o4
2819H9O7M0o2m0K8m5j2KLJ3N5m3K6q8J76p9n5M9N4m7QL0M0n2p4k1qM9o8O3L1JLl3K8Q7o0o3
2462I2m2L1K8J7k9J00m0p7J04O3k6M6j31n8j3Lj9L4J21j24R2p4j5lR0J3n9l5J37M6r2r4K15
2152C01o5j99J51j7L1k0j21N7m3l0J35jj56K9P5L3J14j11P2J11k80J61q4o6qP5J3n9K1oR3
$$ plain form
1861 206 177 95 162 70 131 136 119 90 19 117 31 190 427 751 654 484 104 221 61 103 63 24 70 191 102 63 195 48 186 106
1579 106 134 18 141 139 165 133 62 135 209 112 114 150 30 64 36 166 250 249 230 106 71 164 218 92 245 617 453 109 49 76 159
1288 159 90 120 73 113 88 108 113 126 76 110 156 51 62 59 79 104 58 103 91 216 192 107 87 43 50 95 117 75 172 115 178 237 123 75 183
960 183 121 145 116 25 81 139 124 37 166 63 116 45 35 23 22 80 75 31 76 165 380 280 58 218 175 31 152 55 155 72 48 113
659 113 80 119 55 56 92 114 124 58 111 154 148 1039 2383 2615 1554 244 53 238 245 27 92 89 49 127 178 127 45 298 337 853 1462
368 1462 1644 1448 965 458 329 226 270 182 135 152 135 120 84 132 50 91 142 133 104 70 119 99 143 45 49 21 57 113 113 111 129 150 115 105
49 105 30 187 49 260 47 122 55 61 277 212 28 70 103 177 171 162 65 276 240 48 137 176 80 112 182 197 163 126 234 294 226 137 68
-261 68 93 179 105 122 75 129 191 237 87 85 67 62 70 39
$$ packed form
1861B06k9q2O7r2O1Nj7k9p1R8q6J59K37L24r7j70l80J17j60M2m0l9M6J21q9l9J32j47J38q0
1579A06K8j16J23kK6l2p1P3P4r7KL6j20L4k8J30Q4jj9j24l5R3N4j26J53L72j64l44o0K7Q3
1288A59o9L0m7M0k5K0NJ3n0L4M6j05J1lK0K5m6M5j2J25k4q5k0m4PM5K2m2R7n7O3N9j14m8J08
960A83o2K4k9r1N6N8j5q7J29j03N3p1j0j2jN8nm4M5Q9K15j00k22J60m3j44J21r7J00q3k4O5
659A13l3L9o4JL6K2J0o6N3M3oQ91J344K32j061j310j91J85Pk18O5lm0P8N1n1q2K53L9N16O09
368A462J82j96m83n07j29j03M4q8m7J7j7j5l6M8q2M1N1rk9l4M9k0M4r8Mk8L6N6%kJ8K1l5j0
49A05p5J57j38K11k13P5o7OK16o5j84M2L3P4orr7K11l6j92Q9L9r6L2P0J5l4l7J08O0o8q9o9
-261F8K5Q6p4J7m7N4O2M6j50kj8nQl1
-392C9
##PAGE=	F1=-3744.65
##FIRST=	4405.895418600002813,	4405.895418600002813,	0
##DATA TABLE=	(F2++(Y..Y)), PROFILE
$$ plain form
4406 119 41 122 108 157 196 91 12 148 239 152 170 93 195 92 104 231 176 165 70 63 177 220 96 176 143 85 87 194 44 107 72
4115 72 118 147 168 170 192 80 128 17 145 27 158 214 179 232 101 84 42 99 108 31 146 73 147 144 187 178 157 54 217 133 118 40 101
3805 101 167 59 25 21 155 28 116 179 127 46 78 285 158 42 64 69 153 127 96 161 188 78 240 157 112 31 118 90 79 123 95 32
3504 32 70 74 114 108 28 34 42 77 118 93 101 112 64 70 108 71 182 91 151 128 148 93 82 10 45 129 80 84 125 74 122 226 311 90 77 27 101
3157 101 46 48 105 144 155 113 67 103 59 79 81 131 48 16 57 87 167 131 86 95 47 144 170 39 50 173 107 101 57 83 64 235 175 70 157
2828 157 88 177 185 138 122 67 76 77 93 75 75 159 107 100 30 190 110 59 86 146 107 135 168 199 132 88 63 100 74 36 73 121 105 93 105 101 222
2481 222 171 59 82 74 121 117 61 188 134 86 197 230 182 270 150 90 62 48 83 67 216 117 185 115 63 67 134 142 118 122 227 254 161 116
2162 116 350 247 49 133 143 186 151 44 101 110 96 171 174 23 35 121 160 230 161 303 407 123 202 161 114 82 115 147 51 108 68 139
$$ packed form
4406A19p8Q1j4M9L9j05p9J36R1q7J8p7J02j03J2J27n5j1r5pJ14M3j24Q0l3n8KJ07j50O3l5
4115G2M6K9K1KK2j12M8j11J28j18J31N6l5N3j31j7m2N7Rp7J15p3P4lM3rk1j03J63q4j5p8O1
3805A01O6j08l4mJ34j27Q8O3n2q1L2K07j27j16K2NQ4k6l1O5K7j10J62q3m5q1Q7k8j1M4k8o3
3504C2L8MM0oq0OQL5M1k5QJ1m8OL8l7J11r1O0k3K0n5j1p2L5Q4m9MM1n1M8J04Q5k21j3n0P4
3157A01n5KN7L9J1m2m6L6m4K0KN0q3l2M1L0Q0l6m5Rm8R7K6j31J1J23o6om4K6j9J71o0j05Q7
2828A57o9Q9Qm7j6n5RJJ6j8%Q4n2pp0J60q0n1K7O0l9K8L3L1o7m4k5L7k6l8L7M8j6j2J2mJ21
2481B22n1j12K3qM7mn6J27n4m8J11L3m8Q8j20o0k8j4L5j6J49r9O8p0n2MO7Qk4MJ05K7r3m5
2162A16K34j03j98Q4J0M3l5j07N7Rj4P5Lj51J2Q6L9P0o9J42J04k84P9m1m7l2L3L2r6N7m0P1
$$ plain form
1861 139 145 72 164 109 118 105 148 7 64 118 53 296 673 995 802 543 97 185 78 131 65 43 70 184 108 56 209 39 216 143
1579 143 117 54 176 133 138 138 75 145 219 95 138 154 19 60 20 161 212 178 214 106 110 165 193 91 226 586 440 82 38 48 134
1288 134 74 138 91 69 46 35 88 144 103 96 181 54 68 70 50 103 69 67 134 218 192 110 83 43 40 119 118 86 147 124 198 239 135 40 169 101
950 101 117 79 83 79 132 113 74 93 49 97 30 51 40 54 113 82 12 96 136 388 247 54 180 133 56 142 65 143 61 68 126 24 73 68 58
622 58 90 92 113 68 79 176 238 1165 2630 2927 1721 260 119 227 216 58 24 87 50 100 183 127 107 244 193 527 1001 1280 1225
349 1225 847 422 348 269 321 190 145 170 105 132 89 162 81 97 162 130 63 45 86 99 162 64 93 46 61 150 104 111 84 125 105 78 44 240
30 240 33 249 47 144 91 96 274 219 22 36 65 146 137 160 63 259 226 60 161 197 92 114 210 181 130 123 254 309 201 122 84 103
-270 103 179 141 173 149 169 175 211 93 74 93 29 24 41
$$ packed form
1861A39Op3R2n5Rj3M3j41N7N4o5K43L77L22j93k59m46Q8j07N3o6k2K7J14p6n2J53j70J77p3
1579A43k6o3J22m3N%o3P0P4j24M3J6j35M1m0J41N1l4L6j08MN5K8j02J35L60j46l58m4J0Q6
1288A34o0O4m7k2k3j1N3N6m1pQ5j27J4Kk0N3l4kO7Q4k6q2k7m0lP9jl2O1k3P4M1j04r5J29o8
950A01J6l8MmN3j9l9J9m4M8o7K1j1J4N9l1p0Q4M0K52j41j93J26m7p7Q6p7P8q2PN8j02M9nj0
622E8L2KK1m5J1R7O2R27J465K97j206j461j41J08j1j58l4O3l7N0Q3n6k0J37n1L34M74K79n5
349A225l78m25p4p9N2j31m5K5o5K7m3P3q1J6O5l2o7j8M1J3O3r8K9m7J5Q9m6Pk7M1k0k7l4J96
30B40k07K16k02R7n3NJ78n5j97J4K9Q1rK3r7J96l3j66J01L6j05K2R6k9n1pJ31N5j08p9l8J9
-270A03P6l8L2k4K0OL6j18j9J9o4nJ7
-392D1
##PAGE=	F1=-3763.43
##FIRST=	4405.895418600002813,	4405.895418600002813,	0
##DATA TABLE=	(F2++(Y..Y)), PROFILE
$$ plain form
4406 77 48 75 133 149 168 87 19 123 213 104 179 75 183 80 85 200 166 154 85 100 172 171 96 147 135 85 44 184 13 100 80 141
4105 141 161 192 171 145 13 82 17 159 65 161 212 183 224 99 88 34 83 76 61 178 99 133 114 193 183 118 38 241 131 96 37 118
3805 118 150 68 52 32 188 52 138 173 137 87 84 289 168 42 25 62 160 79 122 137 202 116 235 100 91 65 108 78 47 155 82 85
3504 85 112 26 124 92 13 44 68 62 88 98 117 103 73 54 119 72 181 100 167 112 132 107 86 24 37 121 67 137 142 82 128 183 283 76 36
3176 36 46 140 76 10 92 135 118 87 70 87 107 57 58 101 35 13 45 100 187 161 132 128 85 118 208 20 81 185 123 66 90 95 100 288 211 96
2838 96 146 87 194 164 136 176 100 71 84 119 94 71 168 115 65 32 160 86 60 39 109 78 125 151 170 86 82 96 141 58 48 45 109 77 53
2509 53 116 72 228 196 31 105 60 108 92 23 163 106 70 194 206 158 273 162 90 74 22 128 43 222 144 188 120 65 53 88 103
2218 103 119 152 210 220 138 138 376 232 85 93 114 167 123 34 81 127 135 160 163 55 21 107 160 178 147 397 448 162 151 162 165 135 95 128
$$ packed form
4406G7k9K7N8J6J9q1o8J04R0j09P5j04J08j03NJ15l4j2o9J5P2jp5N1j2n0m1J40j71Q7k0O1
4105A41K0L1k1k6j32O9o5J42r4R6N1k9M1j25j1n4M9pj5J17p9L4j9P9j0o5q0K03j10l5n9Q1
3805A18L2q2j6k0J56j36Q6L5l6n0lK05j21j26j7L7R8q1M3J5O5q6J19j35rk6M3l0l1J08p3L
3504H5K7q6R8l2p9L1K4oK6J0J9j4l0j9O5m7J09q1O7n5K0k5k1o2J3Q4n4P0No0M6N5J00k07m0
3176C6J0R4o4o6Q2M3j7l1j7J7K0n0JM3o6k2L2N5Q7k6k9mm3L3R0j88O1J04o2n7K4NNJ88p7j15
2838I6N0n9J07l0k8M0p6k9J3L5k5k3R7n3n0l3J28p4k6k1P0l1M7K6J9q4mJ4M5q3j0lO4l2k4
2509E3O3m4J56l2j65P4m5M8j6o9J40n7l6J24J2m8J15j11p2j6n2J06q5J79p8M4o8n5j2L5J5
2218A03J6L3N8J0q2%K38j44j47QK1N3m4q9M7M6QK5Lj08l4Q6N3J8l1K50N1k86j1J1Ll0m0L3
$$ plain form
1899 128 51 99 36 69 102 62 158 133 107 73 174 73 88 122 72 355 733 977 754 476 56 160 102 152 88 78 72 158 111 49 223
1608 223 68 234 162 104 86 202 122 110 127 82 141 213 80 148 145 59 97 29 143 156 112 178 84 137 165 165 104 189 462 384 37 25
1307 25 40 136 68 141 125 89 73 53 109 158 117 70 181 59 67 71 32 87 66 46 179 225 184 111 73 39 48 121 110 92 114 134 209 222 145
979 145 39 149 80 83 89 141 96 126 108 108 31 78 79 29 73 65 91 132 77 19 100 100 364 201 80 142 105 75 118 74 142 72 81 131 54 28
640 28 68 74 77 54 90 77 30 171 361 841 1977 2236 1295 221 142 177 159 38 49 114 50 73 168 125 154 207 82 233 587 920
359 920 937 664 358 332 295 357 186 134 185 87 143 91 187 114 106 172 125 22 18 41 78 153 89 122 75 66 190 103 109 65 98 88 100 79 274
30 274 33 229 46 163 138 144 266 212 23 21 46 110 90 153 46 222 191 71 160 197 118 138 231 163 93 118 255 293 157 106 93
-261 93 118 176 163 216 210 206 152 172 97 58 116 11 51 49
$$ packed form
1899A28p7M8o3L3L3m0R6k5k6l4J01j01J5L4n0K83L78K44k23k78m20J04n8N0o4j0oQ6m7o2J74
1608B23j55J66p2n8j8J16q0j2J7m5N9P2j33O8lq6L8o8J14J3m4O6r4N3K8%o1Q5K73p8l47j2
1307B5J5R6o8P3j6l6j6k0N6M9m1m7J11j22QMl9N5k1k0J33M6m1p3l8l4RP3j1j8K2K0P5J3p7
979A45j06J10o9LON2m5L0j8%p7M7Jn0M4qK6M1n5n8Q1%K64j63j21O2l7l0M3m4O8p0RN0p7k6
640B8M0OLk3L6j3m7J41J90M80J136K59r41j074p9L5j8j21J1O5o4K3R5m3K9N3j25J51L54L33
359I20J7k73l06k6l7O2j71n2N1r8N6n2R6p3qO6m7j03mK3L7P5o4L3m7rJ24q7Om4L3j0J2k1J95
30B74k41J96j83J17k5OJ22n4j89kK5O4k0O3j07J76l1j20Q9L7p9K0R3o8p0K5J37L8j36n1j3
-261I3K5N8j3N3omn4K0p5l9N8j05M0k
-392D9
##PAGE=	F1=-3782.21
##FIRST=	4405.895418600002813,	4405.895418600002813,	0
##DATA TABLE=	(F2++(Y..Y)), PROFILE
$$ plain form
4406 39 68 55 160 141 131 70 42 101 171 46 182 46 162 71 64 173 143 119 99 139 152 109 103 119 113 88 51 179 28 96 96 161 176
4096 176 216 155 94 71 27 20 165 113 160 198 180 196 98 85 64 47 43 111 198 124 151 94 185 183 73 66 251 124 74 39 122 110 96 78 54
3767 54 201 67 161 162 149 127 82 269 164 63 46 71 152 26 133 106 203 149 227 46 71 113 111 66 33 173 60 133 166 45 138
3476 138 104 35 66 92 46 63 101 128 83 65 41 125 72 168 102 182 101 128 103 89 38 53 114 59 176 147 79 130 138 233 82 48 103 163
3157 163 93 67 71 117 66 54 70 65 160 54 35 80 28 28 44 103 192 167 147 156 150 80 238 21 114 184 134 29 108 98 130 329 235 107
2838 107 125 94 203 137 123 217 166 58 84 138 104 67 160 114 20 52 122 59 84 38 71 50 109 117 127 33 66 132 175 65 64 35 97 57
2519 57 67 127 48 228 223 29 115 47 69 67 21 126 98 41 182 184 147 269 160 74 93 23 160 14 221 154 182 116 94 57 62 72 142
2209 142 177 179 174 116 146 371 195 122 99 95 149 102 32 60 124 144 147 155 72 23 87 156 130 119 492 498 161 86 143 207 202 98 110 73 88 30
$$ packed form
4406C9K9j3J05j9j0o1k8N9P0j25J36j36J16r1pJ09l0k4k0M0J3m3oJ6ok5l7J28j51O8%O5J5
4096A76M0o1o1k3m4pJ45n2M7L8j8J6r8j3k1j7mO8Q7p4K7n7R1kj10pJ85j27n0l5Q3j2j4j8k4
3767E4J47j34R4Jj3k2m5J87j05j01j7K5Q1j26J07k7R7n4P8j81K5M2km5l3J40j13P3L3j21R3
3476A38l4o9L1K6m6J7L8K7m5j8k4Q4n3R6o6Q0q1K7k5j4n1J5O1n5J17k9o8N1QR5j51l4N5O0
3157A63p0k6MM6n1j2J6nR5j06j9M5n2%J6N9Q9k5k0Rop0J58k17R3P0n0j05P9j0L2J99r4j28
2838A07J8l1J09o6j4R4n1j08K6N4l4l7R3m6r4L2P0o3K5m6L3k1N9QJ0r4L3O6M3j10jk9O2m0
2519E7J0O0p9J80nj94Q6o8K2km6J05k8n7J41Kl7J22j09q6J9p0J37j46K07o7K8o6k2l7NJ0P0
2209A42L5Knn8L0K25j76p3k3mN4m7p0K8O4K0LQq3m9O4O9k6j1L73Ol37p5N7O4nj04J2l7J5n8
$$ plain form
1871 30 27 59 74 143 134 97 68 189 133 95 137 71 358 620 752 567 329 40 148 119 162 114 117 71 118 114 48 228 105 237 155 91
1570 91 94 213 109 81 105 85 128 191 64 141 123 95 149 61 121 94 68 127 42 151 162 137 110 165 320 312 38 6 76 165 68 127 147
1260 147 128 132 117 155 168 113 52 154 70 64 59 48 54 63 74 223 240 167 112 62 29 52 103 100 89 86 143 210 184 142 76 129 65 44 117 179 124
913 124 122 110 133 53 110 67 28 86 93 128 133 63 39 88 77 315 150 111 105 115 84 90 80 149 95 88 132 97 7 57 99 71 29 93 109 27 142
565 142 467 502 963 1045 590 200 130 102 94 26 73 150 53 55 135 107 184 176 19 86 343 622 635 456 280 289 294 367 170 103 197 83
265 83 149 83 197 135 125 172 104 26 38 10 44 120 110 131 99 74 228 116 105 66 77 77 142 115 280 36 202 39 174 181 189 258 193
-45 193 34 27 46 76 65 150 13 171 141 77 139 175 146 176 243 143 57 114 245 254 101 93 92 131 169 172 246 250 237 134 129 101 42 131 56
-374 56 108 54
$$ packed form
1871C0lL2J5O9rl7k9J21n6l8M2o6K87K62J32j85k38k89J08k9M3m8Lm6M7mo6J80j23J32q2o4
1570I1LJ19j04k8K4k0M3O3j27P7j8k8N4q8O0k7k6N9q5J09J1k5k7N5J55qk74l2P0Q9r7N9K0
1260A47j9Mj5L8J3n5o1J02q4onj1ORJ1J49J7p3n5n0l3K3N1lj1lN7O7k6m2o6N3o4k1P3O2n5
913A24kj2K3q0N7m3l9N8PL5Np0k4M9j1K38j65l9oJ0l1Oj0O9n4pM4l5r0N0M2k8m2O4J6q2J15
565A42L25L5M61Q2m55l90p0k8qo8M7P7r7KQ0k8P7qj57O7K57K79J3j79j76RNP3j97o7R4j14
265H3O6o6J14o2j0M7o8p8J2k8L4P6j0K1l2k5J54j12j1l9J1%O5k7J65k44J66j63J35PQO9o5
-45A93j59pJ9L0j1Q5j37J58l0o4O2L6k9L0O7j00q6N7J31Rj53qjL9L8LP4Mj3j03nk8n9Q9p5
-374E6N2n4
-392E4
##PAGE=	F1=-3800.99
##FIRST=	4405.895418600002813,	4405.895418600002813,	0
##DATA TABLE=	(F2++(Y..Y)), PROFILE
$$ plain form
4406 36 89 78 181 137 106 53 71 87 126 18 176 11 141 69 60 158 116 64 114 178 123 48 118 106 79 85 72 169 56 92 115 179 189
4096 189 231 128 69 140 36 25 161 156 161 178 178 156 96 65 96 11 34 152 207 137 186 120 174 175 43 102 249 123 88 59 114 63 122
3786 122 103 85 192 77 182 147 154 153 75 232 149 76 89 92 128 29 128 86 190 164 206 55 52 160 135 67 56 173 44 170 216 112
3486 112 160 135 54 94 112 34 53 103 138 58 43 37 126 73 149 101 193 101 145 90 89 44 78 113 65 195 140 60 126 100 170 95 63 142 168
3157 168 97 114 46 98 31 19 77 61 213 95 30 94 29 36 61 98 186 151 134 175 217 34 249 49 131 166 138 22 104 93 149 351
2857 351 243 104 100 104 204 112 102 232 214 38 75 145 101 61 131 100 38 82 85 35 117 94 39 33 87 68 78 44 46 156 201 89 78 56
2537 56 88 55 114 140 46 215 247 39 113 40 12 66 59 89 120 17 172 175 139 250 139 51 111 61 174 26 211 144 169 110 133 79
2237 79 93 63 183 197 143 124 97 142 333 142 152 136 97 133 87 32 40 107 124 131 150 71 51 64 145 100 81 562 580 114 62 109 223
$$ packed form
4406C6N3j1J03m4l1n3J8J6L9j08J58j65J30p2rR8m2n2N0O4n5p5P0j2k7Oj3R7j13L6K3O4J0
4096A89M2j03n9P1j04j1J36nNJ7%k2o0l1L1q5K3J18N5p0M9o6N4Jj32N9J47j26l5k9N5n1N9
3786A22j9j8J07j15J05l5Pjp8J57q3p3J3LL6r9R9m2J04k6M2j51lJ08k5o8j1J17j29J26M6j04
3486A12M8k5q1M0J8p8J9N0L5q0j5oQ9n3P6m8R2r2M4n5jm5L4L5m8J30n5q0O6k6P0p5l2P9K6
3157A68p1J7o8N2o7j2N8j6J52j18o5O4o5PK5L7Q8l5j7M1M2j83K15k00Q2L5k8j16Q2j1N6K02
2857C51j08j39mMJ00r2j0J30j8j76L7P0m4m0P0l1o2M4Ln0Q2k3n5oN4j9J0l4KJ10M5j12j1k2
2537E6L2l3N9K6r4J69L2k08P4p3k8N4pL0L1j03J55Ll6J11j11q8O0n0J13j48J85o7K5n9K3n4
2237G9J4l0J20J4n4j9k7M5J91j91J0j6l9L6m6n5QO7J7PJ9p9k0J3Q1m5j9M81J8m66n2M7J14
$$ plain form
1927 223 264 116 104 79 76 39 46 44 93 122 113 85 89 184 161 89 161 75 311 398 457 353 175 85 149 120 158 132 149 67 75 113 58 221 135
1598 135 225 121 77 83 205 102 51 84 84 119 158 52 117 93 125 199 96 108 48 64 70 19 152 154 114 105 151 234 253 107 23 126 201
1288 201 66 104 144 146 182 162 197 175 93 66 101 90 62 38 66 9 83 121 260 258 144 118 70 17 43 71 94 77 71 151 204 127 124 101 112
$$ packed form
1927B23M1j48j2k5ll7PkM9K9rk8MR5k3p2P2q6K36Q7N9j04j78r0O4k9L8k6J7q2QL8n5J63q6
1598A35R0j04m4OJ22j03n1L3%L5L9j06O5k4L2P4j03J2o0J6On1J33Km0rM6Q3J9j46q4J03P5
1288B01j35L8M0KL6k0L5k2q2k7L5j1k8k4K8n7P4L8J39kj14k6m8n3K6K8K3j7oQ0N3p7lk3J1
$$ [...]
-392A15
##END NTUPLES=	nD NMR SPECTRUM
##END=	
##END=	
