##TITLE=	ek83I9nCTp6UzBb$wLHDaQ.23.ser
TM-VI-199, CD3OD hmbc

##JCAMP-DX=	6.0	$$ MestReNova 14.3.0-30573
##DATA TYPE=	LINK
##BLOCK_ID=	1
##BLOCKS=	2    
##ORIGIN=	Mestrelab Research S.L.
##OWNER=	hrzepa
##$MNOVA/LINK_BLOCK_TYPE=	ITEM	$$ NMR Spectrum
##$MNOVA/ITEM/POLYGON=	(XY..XY)
5321,5835
8722,5835
8722,8208
5321,8208
5321,5835
##$MNOVA/ITEM/Z=	0
##$MNOVA/ITEM/ANGLE=	0
##TITLE=	ek83I9nCTp6UzBb$wLHDaQ.23.ser
##JCAMP-DX=	6.0	$$ MestReNova 14.3.0-30573
##BLOCK_ID=	2
##DATA TYPE=	MNOVA NMR VIEW DATA
##DATA CLASS=	MNOVA VIEW DATA
##$MNOVA/2D/THRESHOLD=	2.0400438308715820313
##$MNOVA/ITEM/ZOOM/X=	-0.47501081208716700033,	14.504330000039219684
##$MNOVA/ITEM/ZOOM/Y=	-9.5107036222489718114,	249.98529999918474687
##END=	
##TITLE=	ek83I9nCTp6UzBb$wLHDaQ.23.ser
##JCAMP-DX=	6.0	$$ MestReNova 14.3.0-30573
##BLOCK_ID=	3
##DATA TYPE=	nD NMR SPECTRUM
##DATA CLASS=	NTUPLES
##NUMDIM=	2
##ORIGIN=	Bruker BioSpin GmbH
##OWNER=	nmr
##.OBSERVE FREQUENCY=	400.41280287000000726
##.OBSERVE NUCLEUS=	^1H
##.SOLVENT NAME=	MeOD
##.PULSE SEQUENCE=	hmbcgplpndqf
##LONGDATE=	2021/12/04 16:22:53.000
##.ACQUISITIONMODE=	SIMULTANEOUS (DQD)
##$ORIGINAL FORMAT=	Bruker XWIN-NMR
##$MNOVA/SCALES_VERSION=	9
##$PARAMETER FILE=	(acqu2s, ASCII, /private/var/folders/f6/rjf_tdyn2v98c5c0wvkgn4s80000gn/T/ek83I9nCTp6UzBb$wLHDaQ/23/acqu2s, 0)
$$ ##TITLE= Parameter file, TOPSPIN		Version 3.2
$$ ##JCAMPDX= 5.0
$$ ##DATATYPE= Parameter Values
$$ ##NPOINTS= 129	$$ modification sequence number
$$ ##ORIGIN= Bruker BioSpin GmbH
$$ ##OWNER= nmr
$$ $$ 2021-12-04 16:42:29.504 +0000  nmr@CZC10666PP
$$ $$ /opt/topspin/data/agmb/nmr/Dec04-2021/23/acqu2s
$$ $$ process /opt/topspin3.2/prog/mod/go
$$ ##$ACQT0= 0
$$ ##$BF1= 100.683175
$$ ##$FnMODE= 1
$$ ##$NUC1= <13C>
$$ ##$NusJSP= 0
$$ ##$NusT2= 1
$$ ##$NusTD= 128
$$ ##$O1= 12080.308799824
$$ ##$SFO1= 100.6952553088
$$ ##$SW= 259.972631192251
$$ ##$SW_h= 26178.0104712042
$$ ##$TD= 128
$$ ##END=
$$ 
##$PARAMETER FILE=	(acqus, ASCII, /private/var/folders/f6/rjf_tdyn2v98c5c0wvkgn4s80000gn/T/ek83I9nCTp6UzBb$wLHDaQ/23/acqus, 0)
$$ ##TITLE= Parameter file, TOPSPIN		Version 3.2
$$ ##JCAMPDX= 5.0
$$ ##DATATYPE= Parameter Values
$$ ##NPOINTS= 12	$$ modification sequence number
$$ ##ORIGIN= Bruker BioSpin GmbH
$$ ##OWNER= nmr
$$ $$ 2021-12-04 16:42:33.168 +0000  nmr@CZC10666PP
$$ $$ /opt/topspin/data/agmb/nmr/Dec04-2021/23/acqus
$$ $$ process /opt/topspin3.2/prog/mod/shimcntl
$$ ##$ACQT0= 1000000
$$ ##$AMP= (0..31)
$$ 100 100 100 100 100 100 100 100 100 100 100 100 100 100 100 100 100 100
$$ 100 100 100 100 100 100 100 100 100 100 100 100 100 100
$$ ##$AMPCOIL= (0..19)
$$ 0 0 0 0 0 0 0 0 0 0 0 0 0 0 0 0 0 0 0 0
$$ ##$ANAVPT= -1
$$ ##$AQSEQ= 0
$$ ##$AQ_mod= 3
$$ ##$AUNM= <au_zg>
$$ ##$AUTOPOS= <31 >
$$ ##$BF1= 400.41
$$ ##$BF2= 100.683175
$$ ##$BF3= 400.41
$$ ##$BF4= 400.41
$$ ##$BF5= 400.41
$$ ##$BF6= 400.41
$$ ##$BF7= 400.41
$$ ##$BF8= 400.41
$$ ##$BYTORDA= 0
$$ ##$CAGPARS= (0..11)
$$ 0 0 0 0 0 0 0 0 0 0 0 0
$$ ##$CFDGTYP= 0
$$ ##$CFRGTYP= 9
$$ ##$CHEMSTR= <none>
$$ [...]
$$ 0 0 0 0
$$ ##$ShimPowMaxUC= (0..63)
$$ 130000 130000 130000 130000 130000 130000 130000 130000 130000 130000 130000
$$ 130000 130000 130000 130000 130000 130000 130000 130000 130000 0 0 0 0
$$ 0 0 0 0 0 0 0 0 0 0 0 0 0 0 0 0 0 0 0 0 0 0 0 0 0 0 0 0 0 0 0 0 0 0 0 0
$$ 0 0 0 0
$$ ##$ShimPowMaxUG= (0..63)
$$ 524287 524287 524287 524287 524287 524287 524287 524287 524287 524287 524287
$$ 524287 524287 524287 524287 524287 524287 524287 524287 524287 0 0 0 0
$$ 0 0 0 0 0 0 0 0 0 0 0 0 0 0 0 0 0 0 0 0 0 0 0 0 0 0 0 0 0 0 0 0 0 0 0 0
$$ 0 0 0 0
$$ ##$ShimPowRcbType= 3
$$ ##$ShimPowRes= (0..63)
$$ 1e-20 1e-20 1e-20 1e-20 1e-20 1e-20 1e-20 1e-20 1e-20 1e-20 1e-20 1e-20
$$ 1e-20 1e-20 1e-20 1e-20 1e-20 1e-20 1e-20 1e-20 0 0 0 0 0 0 0 0 0 0 0 0
$$ 0 0 0 0 0 0 0 0 0 0 0 0 0 0 0 0 0 0 0 0 0 0 0 0 0 0 0 0 0 0 0 0
$$ ##$ShimPowRng0= (0..63)
$$ 1 1 1 1 1 1 1 1 1 1 1 1 1 1 1 1 1 1 1 1 0 0 0 0 0 0 0 0 0 0 0 0 0 0 0 0
$$ 0 0 0 0 0 0 0 0 0 0 0 0 0 0 0 0 0 0 0 0 0 0 0 0 0 0 0 0
$$ ##$ShimPowRng1= (0..63)
$$ 1 1 1 1 1 1 1 1 1 1 1 1 1 1 1 1 1 1 1 1 0 0 0 0 0 0 0 0 0 0 0 0 0 0 0 0
$$ 0 0 0 0 0 0 0 0 0 0 0 0 0 0 0 0 0 0 0 0 0 0 0 0 0 0 0 0
$$ ##$ShimPowRng2= (0..63)
$$ 1 1 1 1 1 1 1 1 1 1 1 1 1 1 1 1 1 1 1 1 0 0 0 0 0 0 0 0 0 0 0 0 0 0 0 0
$$ 0 0 0 0 0 0 0 0 0 0 0 0 0 0 0 0 0 0 0 0 0 0 0 0 0 0 0 0
$$ ##$ShimPowRng3= (0..63)
$$ 1 1 1 1 1 1 1 1 1 1 1 1 1 1 1 1 1 1 1 1 0 0 0 0 0 0 0 0 0 0 0 0 0 0 0 0
$$ 0 0 0 0 0 0 0 0 0 0 0 0 0 0 0 0 0 0 0 0 0 0 0 0 0 0 0 0
$$ ##$ShimSysFunc= (0..63)
$$ 1 2 3 4 5 7 9 11 15 16 8 10 12 14 6 17 13 18 19 20 0 0 0 0 0 0 0 0 0 0
$$ 0 0 0 0 0 0 0 0 0 0 0 0 0 0 0 0 0 0 0 0 0 0 0 0 0 0 0 0 0 0 0 0 0 0
$$ ##$ShimSysMatrix= 0
$$ ##$ShimSysType= 1
$$ ##$TFXNUM= 0
$$ ##$TRIPLO2= 0
$$ ##$VTU= 2
$$ ##$VTUETH= <149.236.99.20>
$$ ##$VTUTY= <no>
$$ ##$WBREFAM= (0..15)
$$ 135 116 100 100 100 100 100 100 100 100 100 100 100 100 100 100
$$ ##$WBREFLM= (0..15)
$$ 0 0 0 0 0 0 0 0 0 0 0 0 0 0 0 0
$$ ##$WBREFPH= (0..15)
$$ 71.66 -68.25 0 0 0 0 0 0 0 0 0 0 0 0 0 0
$$ ##$WBSGU= (0..15)
$$ 0 0 0 0 0 0 0 0 0 0 0 0 0 0 0 0
$$ ##$XFAC= 2
$$ ##END=
$$ 
##$DECIM=	3328
##$DSPFVS=	20
##.ACQUISITIONSCHEME=	NOT PHASESENSITIVE
##NTUPLES=	nD NMR SPECTRUM
##VAR_NAME=	FREQUENCY1,	FREQUENCY2,	SPECTRUM
##SYMBOL=	F1,	F2,	Y
##.NUCLEUS=	13C,	1H
##.OBSERVE FREQUENCY=	100.69525530880000019,	400.41280287000000726
##VAR_TYPE=	INDEPENDENT,	INDEPENDENT,	DEPENDENT
##VAR_FORM=	AFFN,	AFFN,	ASDF
##VAR_DIM=	512,	512,	262144
##UNITS=	HZ,	HZ,	ARBITRARY UNITS
##FIRST=	25169.313707327481097,	5807.6787752999953227,	0.37067118287086486816
##LAST=	-957.56783717514929322,	-190.19907926730809322,	0.29058131575584411621
##MIN=	-957.56783717514929322,	-190.19907926730809322,	0.0011477128136903047562
##MAX=	25169.313707327481097,	5807.6787752999953227,	8.5140438079833984375
##FACTOR=	1,	1,	0.0029841969949861925533
##PAGE=	F1=25169.3
##FIRST=	25169.313707327481097,	5807.6787752999953227,	0.37067118287086486816
##DATA TABLE=	(F2++(Y..Y)), PROFILE
$$ [...]
##PAGE=	F1=3286.13
##FIRST=	25169.313707327481097,	5807.6787752999953227,	0.013330098241567611694
##DATA TABLE=	(F2++(Y..Y)), PROFILE
2322E2R5N9k3j33J74o0r4l9J21r0J21o7j03J16q3J56L4n7j28J00j30O8L4O5N9j16k8k1N3m4
$$ 52 147 206 183 50 224 164 70 31 152 62 183 116 13 129 46 202 236 179 51 151 21 89 123 188 247 131 103 82 135 91
1970I1l1J8M8q1J06J26j32K6j0O3q7n3J72j82Q5j5Pp4K8l4L0m4J67J25j71j39J03m5n0j1K7
$$ 91 60 78 126 45 151 277 145 171 161 224 137 84 256 74 159 144 151 77 105 71 101 57 224 349 178 39 142 97 47 36 63
1606F3J1k1J02l2kNJ19q1o3J63m7j02O4m1J0K0q4n8P2O9j0N5j2j12K8l4j4m4P4j0k7J54j9
$$ 63 74 53 155 123 121 126 245 164 101 264 217 115 179 138 148 168 84 26 98 167 157 212 200 88 116 82 68 24 98 88 61 215 196
1218A96r8oQ2JR4j19m3rPJ48KJq2o7K1m0Q1J6j28J8k9N2Kl2M2J51J4j35j05N6R0j23L7j7M0
$$ 196 98 92 174 175 269 150 107 98 105 253 255 256 174 107 128 88 169 185 57 75 46 98 100 68 110 261 275 140 35 91 181 58 95 78 118
807A18jr0J08M2n2J13q7j32K15j7j17K9J23j10K3n8l4l6L5J50m6J0j08J89p8j15m3J75m0q5
$$ 118 117 27 135 177 125 238 151 19 234 217 100 129 252 142 165 107 73 37 72 222 176 186 78 267 189 74 31 206 166 81
455H1pJ08q3n7kJ61j45K08k12K04L5k53K0J60j38qQ2j43R1j1lO5j8k9J01m3p5K0k1M1L6p7
$$ 81 74 182 99 42 40 201 56 264 52 256 291 38 58 218 80 72 154 11 102 91 88 153 135 106 207 164 89 109 88 129 165 88
80H8kJ22j77J71Mj91J13K0p7JJ02K3j30P6O1P4j74p3Q9L1j03O2K4
$$ 88 86 208 31 202 206 15 128 148 71 72 174 197 67 143 204 278 104 31 120 151 48 110 134
-190A34
##PAGE=	F1=3183.88
##FIRST=	25169.313707327481097,	5807.6787752999953227,	0.10620419681072235107
##DATA TABLE=	(F2++(Y..Y)), PROFILE
5808D2P4jk2L9Q4%j83qN8j4R2K8p0J8n7R2NJ3J6q2j09J5R1j03P2K9O9K1q0r8J47n8l7J45j66
$$ 42 116 115 93 132 216 216 33 25 83 69 161 189 119 137 80 172 177 190 206 124 15 30 121 18 90 119 188 209 129 31 178 120 83 228 62
5397F2Q0l0k3nk6J13p2O8l0m8N9J76j15j12M3n0K9nK5O4Nj76L0Q7J6r0K3P9o8q5J21J9N1J12
$$ 62 142 112 89 84 58 171 99 167 137 89 148 324 209 97 140 90 119 114 139 203 208 32 62 149 165 75 98 177 109 24 145 164 215 327
4998C27m5q6k9j31k1P7nQ6J14j15k7j17J9J2mQ9O9l0q8p6N8K2LK4n7k4J12n3R1J06k14K4l
$$ 327 282 196 167 36 15 92 87 173 287 172 145 28 47 59 55 144 213 183 95 19 77 99 102 126 69 45 157 104 195 301 87 111 108
4610A08MO2n9k9Q6L7J3lj44Q2r2O9j07J25J7n4R7q5Q4n8j03J25J6m9mkn4M7k1lM1N0j23Q7
$$ 108 112 174 115 86 172 209 222 219 75 157 65 134 27 152 169 115 212 127 211 153 50 175 191 142 138 136 82 129 108 105 146 196 73 160
4211A60j23J50P1k5j61P1l6k0rM9n3K5L8P7O8r5o9n3L0p2J45Q3j68L0kN0r9JO1J33q9n8%J19
$$ 160 37 187 258 233 72 143 107 87 78 127 74 99 137 214 282 187 118 65 95 23 168 251 83 113 111 161 62 63 124 257 168 110 110 229
3812B29j17l0R2j30J82k1j31mj0l1Q0k8j4J12n0r8J29j07J47j02R4j60P6r6L5N2N0N5o0n1
$$ 229 112 82 174 44 226 205 74 70 60 29 109 81 67 179 129 31 160 53 200 98 192 32 108 12 47 99 149 204 144 93
3460I3l0J3J24j31k3J77jo7j18K11j81l1J96j9J12k59J53o7k1j8O1r5n4K02j7j34N4K9jJ93
$$ 93 63 76 200 69 46 223 222 155 37 248 67 36 232 213 325 66 219 152 131 113 174 79 25 227 210 76 130 159 158 351
3108C51J1k77J4k8NK7P1Jj5J35P9r5k6l6q4L5Qp6k8k5NM6L3l6M2j16P5k7j4J7qJ45j0j73J71
$$ 351 362 85 99 71 76 103 174 175 160 295 374 279 253 217 133 168 176 100 72 47 52 98 131 95 137 21 96 69 55 72 64 209 199 26 197
2697A97j84K8J27K1J0qn8M3j3p4M0ok4P2j1N8km2j30K75K9j51m4j06L0k3Q8pL7o4o5J9Q1N9
$$ 197 13 41 168 189 199 191 133 176 163 89 129 123 99 171 160 218 216 174 44 319 348 197 153 47 77 54 142 135 172 108 43 62 143 202
2298B02qj62K16m5j67RR9m8J00j00p0R3m0J25J8k0j32Q8r1MRQ1P9q7r2M9N2k4l7p6M7l9O2
$$ 202 194 32 248 203 36 45 144 96 196 96 26 119 79 204 222 202 70 158 67 71 80 161 240 153 61 110 162 138 101 25 72 33 95
1911I5J35j11L1K0M5j16J1J22j36R9l3m7m4N2n9L6p8K27J06j85j35R9l6m7L1k6mJ4J12j7p
$$ 95 230 119 150 170 215 99 110 232 96 195 162 115 71 123 64 100 22 249 355 170 35 134 98 51 82 56 52 66 178 161 154
1547A54k8J33p8p0J92q7j42Q0k8N0L1j56j2M2J07m6R8o2j05L6j0l0n6O7M8l2J05N4j85J4P7
$$ 154 126 259 181 111 303 216 74 154 126 176 207 51 39 81 188 142 240 178 73 109 99 69 13 80 128 96 201 255 70 84 161
1183A61l2P3p0mk4L6J20%mj14m4Kj1J3M5j04K7j1K8Lo7J42J47Nj45j03jJ41j37L4o8J34m6
$$ 161 129 202 132 128 104 140 260 260 256 142 98 100 89 102 147 43 70 59 87 90 23 165 312 317 172 69 68 209 72 106 38 172 126
796A26r5J48ql0J16j22j20K18k1r2l6J63j04J8o1l2j3J5J88n7j6m0O8l0j30mJ57n4p4M4J18
$$ 126 31 179 171 141 257 135 15 233 212 120 84 247 143 161 100 68 55 70 258 201 185 145 213 183 53 49 206 152 78 122 240
432B40q9q8k0J26j12K26k08J41M8k10%J54j09k3O9r3M0j5rQ8l3n0J20k7o1on1N7M5o9l1J01
$$ 240 151 63 43 169 57 283 75 216 264 54 54 208 99 76 145 52 92 77 68 156 123 73 193 166 105 99 48 105 150 81 50 151
56A51q1J51l9j52R8K2q6J6J11M8j48O1K5O9j27n1P2L0j51N6N2
$$ 151 70 221 182 30 128 150 64 80 191 239 91 152 177 246 119 68 140 170 19 75 127
-190A27
##PAGE=	F1=3081.62
##FIRST=	25169.313707327481097,	5807.6787752999953227,	0.24150174856185913086
##DATA TABLE=	(F2++(Y..Y)), PROFILE
5808C5L7JLP3J08k9j91J4O0M0L9K3m8k1j08J47L2K6qq8j14N0O7q6M4O6k7P7p3p4R7n8k1K10
$$ 35 72 73 76 149 257 228 37 51 111 151 190 213 165 144 36 183 215 241 233 145 31 81 148 62 106 172 145 222 149 75 172 114 93 303
5409C03j71ono3Qj3J00p7J00k9j7rK03j13j40N1m7K0j5Q4J9%j66M3P6L2n2K0Q9j44m2O9K3
$$ 303 132 126 121 58 66 53 153 76 176 147 130 121 324 211 71 122 75 95 80 164 183 183 17 60 136 168 116 136 225 81 39 108 131
5021A31P1R3o3p1Lj41RP3kN9R8j21l9n1K0QJ2P5K6m6q4l2M9N7LK4p7m5J42l0RJ56k26Pm3P0
$$ 131 202 295 232 161 164 23 32 105 103 162 260 139 100 49 69 77 89 164 190 144 60 28 77 134 137 161 84 39 181 151 160 316 90 97 54 124
4599A24L7j8m8Q5L1J2kj82J15r9L5NO7K9q2O2m7P7p3j9Q2l1K7q8j0j3k7N2j5P5O4j21N1j13
$$ 124 161 143 95 180 211 223 221 39 154 55 90 95 162 191 109 171 124 201 128 109 191 160 187 99 89 76 49 101 86 161 225 104 155 42
4200D2J58J04n2k15J39o0l9k5K1l0K9O5J14P3j21j02n7O7p7Q5L4j25J09J3M4p9r5J21J20j38
$$ 42 200 304 252 37 176 116 77 52 73 43 72 137 251 324 203 101 44 111 34 119 153 28 137 150 194 115 20 141 261 123
3848A23p4K9J66j24oO3j36K19m0j15j2jq7J31n0QP6l5p0J07j07J41q2L7j04N2m8j8O5O9jj10
$$ 123 49 78 244 120 114 177 41 260 220 105 93 92 5 136 86 94 170 135 65 172 65 206 124 161 57 109 61 43 108 177 176 66
3472F6l7N3nJ01j03m4J92lp7r7J87j39o3J50K95J02n24K09q0l2j0K1j12OJ76Lj88O2P7p9M03
$$ 66 29 82 77 178 75 31 223 220 143 46 233 94 31 181 476 578 54 263 183 151 141 162 50 56 232 235 47 109 186 107 510
3108E10J01n00Lo4J6L2P5j7K1J31J1j10rQl1Oj2n7Nl9QK3RkK1q8N1j0j5m9K8J25kj57J70j56
$$ 510 611 111 114 50 66 98 173 156 177 308 319 209 200 208 177 183 171 114 119 80 88 111 120 118 139 51 102 92 77 28 56 181 179 22 192 36
2685C6M5J07k2J1k0l5m1M4n9N2j5QL5RQ1K4m3j69K40K2q8j03j06P8M6j2lN9o5l7%N3M8J7j59
$$ 36 81 188 166 177 157 122 81 125 66 118 103 111 146 155 236 260 217 48 288 310 222 119 13 91 137 125 122 181 116 79 79 132 180 197 38
2275C8K20j6k04K6O2kQ6j32l2N7RR8nKp9L3l6q5jQ2R4o3j25J10M5rj1p7m8J0j0J29r7N1L4
$$ 38 258 242 38 64 126 124 210 78 46 103 112 210 205 207 128 161 125 40 39 121 215 152 27 137 182 173 162 85 37 47 37 166 69 120 154
1864A54L6j21O8N2p3J11m2j00l3Q1m8M1j16K47P7j90q4P3l3J8Qo2k5M0J17j4qm9J42p8q5K04
$$ 154 190 69 137 189 116 227 185 85 52 133 85 126 10 257 334 144 60 133 100 118 126 64 39 79 196 182 174 125 267 189 104 308
1488C08j16j71R4k0R8L5j93M7j5J35r8J42j01r8M1K3o0l8N6J04m0M7J33k33j7P8n1M6k1J7
$$ 308 192 21 115 95 193 228 35 82 67 202 104 246 145 47 88 111 51 13 69 173 133 180 313 80 63 141 90 136 115 132
1136A32j4O0Q6lk7j31j8k7K4k9N2p9L7n%J4m2J64J27J7j33p4m2J33j36L2k9J39r6m3J36n8
$$ 132 118 178 264 261 234 103 85 58 82 53 105 26 63 58 58 72 30 194 321 338 205 131 89 222 86 118 89 228 132 89 225 167
761A67j5J10j43o9J84l7n1j11J91p3Qo1m2JN9J50p1l1K5n6K7r2M1R5p9n7Q0J14n8o8q2O9n8
$$ 167 152 262 119 50 234 197 146 35 226 153 161 100 58 59 118 268 197 166 191 135 162 70 111 206 127 70 150 264 206 138 56 125 67
373F7K11j85O5P9j46m2J25n3m2N1l1l1j6oJ08l2q2J32J5q9J8j12J01M5o8l9M5J9J19o9r1M8
$$ 67 278 93 158 237 91 49 174 121 79 130 99 68 52 46 154 122 40 172 187 98 116 4 105 150 82 43 88 107 226 157 66 114
-2A14K7n7jJ10N0j41N5k0O8p8l4O8K3j32j8P8
$$ 114 141 84 83 193 243 102 157 137 205 127 93 161 184 52 34 112
-190A12
##PAGE=	F1=2979.36
##FIRST=	25169.313707327481097,	5807.6787752999953227,	0.2704741060733795166
##DATA TABLE=	(F2++(Y..Y)), PROFILE
5808D2qJ4J9R1J27o4j81L8M1J01J7j7l0n4j20J57O9L7l5q7r2P7M6o4kR1o0Q1o5m4L1m9J9K40
$$ 42 34 48 67 158 285 221 40 78 119 220 237 220 190 136 16 173 242 279 244 157 65 142 188 124 122 213 153 234 169 125 156 107 126 366
5409C66j66r6L4q1Lj3Q7p4J24m8K3p5K25j03j55M3l9O9p1J18l5K0j18L7M3M3j2J6R2k01jM
$$ 366 200 104 138 57 60 47 134 60 184 136 159 84 309 206 51 94 55 124 53 171 136 156 38 75 118 161 149 165 257 56 55 59
5033E9K7P5O7o5l3L8j38L1N8qJ0R2j01oJ3l0JK5O8l5n8q7L7L5P1J5J7r2n4J59Nq5J80k02k
$$ 59 86 161 228 163 130 168 30 61 119 111 121 213 112 106 119 89 90 115 183 148 90 3 40 75 146 161 178 86 32 191 196 111 291 89 87
4622H7mO4lRn3O1L3J3jj78J19n9l1J10P0l8r8K0j3O9q6P1L0p9J05j10m6K8m3N3l0J11P6j18
$$ 87 83 147 144 153 100 161 194 207 206 28 147 88 57 167 237 199 101 121 108 177 91 162 192 113 218 108 62 90 47 100 70 181 257 139
4223A39mq4J59J23p5k29J70p1o0No3J0L4O9J39Q7j41j19l9O6p2M7m1K0J04K3J7o1j32J38J14
$$ 139 135 51 210 333 258 29 199 128 68 73 10 20 54 123 262 349 208 89 50 116 44 91 50 70 174 197 214 153 21 159 273
3859B73j57r6K5J89j18L0L6q9J78m8j10K3j5r8J32o0QM9j3m6Q4q7J11k9n4j6l0M4q6Q7P6n2
$$ 273 116 20 45 234 116 146 182 93 271 223 113 136 121 23 155 95 103 152 139 93 177 90 201 172 118 102 72 116 30 117 193 141
3484A41r0oN2l2P1o2k0J62j4q0p5J67r0o9P4O10R9p97K43q5j9k3k6j12Q2J26J9k10O0J34j71
$$ 141 51 45 97 65 136 74 54 216 202 122 47 214 124 55 129 739 838 41 284 199 180 157 131 19 101 227 246 36 96 230 59
3120E9N90K08p37Pj10L5L6O9l6P1N0j08j15J03R2j2Jl9m2K7l4pK4j8RK6o0L8k8Mo1L1P2K8
$$ 59 649 857 120 127 17 52 88 157 121 192 242 134 19 122 214 202 203 164 122 149 115 108 132 114 123 149 89 127 99 103 42 73 145 173
2721A73r9R2j17O3Q8o4J9k3j6r4N4m6O5k1M2jK1J06M9m4j81J74Mlj38q3J01R4p7k1P7q1kj2
$$ 173 74 166 49 112 200 136 155 132 116 22 76 30 95 74 116 115 136 242 291 247 66 240 244 241 103 20 121 215 138 117 194 113 111 99
2322I9J6K7N0j43K06J0j95ML0L3Q2j50jJ6N1R0l9Qj2k3L5j62M5%R9m5r7J20L6qN2p7j29L3
$$ 99 115 142 192 49 255 265 70 74 104 137 219 69 68 84 135 225 186 194 182 159 194 32 77 77 176 131 34 154 190 182 234 157 28 61
1923F1k6N0p1Q5L0L0j06J03j9pJ17n3j34l2J17k7M4j28K15M2j84k2N7l3O1j9o0n6M2J36l3
$$ 61 35 85 14 99 129 159 53 156 137 130 247 194 60 28 145 118 162 34 249 291 107 85 142 109 170 151 91 35 77 213 180
1559A80qm9J41p9q8J91j27j35M4j4J37L1j69O0o3J46j45J79j11p1L4L7q4jM2J31m5qK03k36
$$ 180 172 123 264 185 97 288 161 26 70 56 193 224 55 115 52 198 53 232 121 50 84 121 37 36 78 209 164 156 359 123
1207A23p4P1n6J5K0J8J4P3N9j0n8j33On7O4L7k2q5N5j6JM0qJ14J00L5q7m8q5J10j21L5L0R9
$$ 123 49 120 64 79 99 117 131 204 263 253 195 62 68 11 75 112 90 5 60 44 45 85 77 191 291 326 239 191 106 216 95 130 160 259
807B59j26jJ25j00mJ03j44k4J58o4j7j46J79k9nn7o8J1J24Q4q7l4O8j60Q5l4O0M3r9l8R1J02
$$ 259 133 132 257 157 153 256 112 88 246 182 165 19 198 169 164 107 39 50 174 258 171 137 205 45 130 96 156 199 100 62 153 255
432B55kk9j50OmJ79j51j0J17q5r1Q5K7n8K2K4r6j4J4J13k7r5J15O1j24L9o0R5J1p7l3k7J01
$$ 255 253 224 74 80 76 255 104 94 211 126 35 120 147 89 111 135 39 25 39 152 125 30 145 206 82 121 61 156 167 90 57 30 131
45A31Q7q0m9JM3m9J1P7L9j01N1o4P4l7k9O2J6r9l9N8
$$ 131 218 138 89 90 133 84 95 172 211 110 161 97 171 134 105 167 183 84 45 103
-190A03
##PAGE=	F1=2877.1
##FIRST=	25169.313707327481097,	5807.6787752999953227,	0.26733165979385375977
##DATA TABLE=	(F2++(Y..Y)), PROFILE
5808E5m3M3QR5J35j02j37M8nJ67K6q2j5p6r2J15J17M2o5p0l8O8L1n7l2J02m6M0m6j4l5l8O9
$$ 55 12 55 63 158 293 191 54 102 97 264 290 208 193 117 25 140 257 299 234 164 126 194 225 168 136 238 192 232 186 172 137 99 168
5420A68K41j60j74P9n7l6LO3n9J19q7Q3j39K39q6j29Lj9R7j12J29r7O5o1J7J0M8J7J7Q8k15
$$ 168 409 249 75 154 97 61 64 127 68 187 100 183 44 283 197 68 71 52 149 37 166 69 134 73 90 100 148 165 182 270 55
5056E5J5l7K3M6M0m6K5N3j17M8L1j9n4Q7n3O1L0q6lJ7P9j01j2ok2J2O8L7Qr3n3J51L6j66J83
$$ 55 70 33 56 102 142 96 121 174 57 105 136 117 63 150 97 158 188 102 99 116 195 94 82 76 54 66 134 171 179 86 33 184 220 54 237
4646B37j54J1O6J1l5Rm6J4M0J6Jj18Q4j8p8J82R5j23o5o1K1N4r7J46%q3J23r8n1L8Nl3j5J26
$$ 237 83 94 160 171 136 145 99 113 153 169 170 52 136 118 40 222 317 194 129 68 89 143 46 192 192 109 232 134 83 121 126 93 78 204
4247B04P3j10o6l8J56J22r3k13J63n8q2O0m8l3L2L4J39J03j46j22j1M0n7N1n3Q2P2L4j5n0
$$ 204 277 167 101 63 219 341 248 35 198 140 58 118 70 37 69 103 242 345 199 77 66 106 49 100 47 129 201 235 220 170
3894A70j24J41J03j54n9n7J77q7N2L2n6J24m3j30P0l8q2J21n6j2L5J5l0O5p4R1J8j44Q4j26
$$ 170 46 187 290 136 77 20 197 110 162 194 138 262 219 89 159 121 39 160 104 92 127 142 112 177 103 194 212 68 152 26
3542B6J37j46J14O5q8J6j3Lp3N6l3K3J14l7p0n3J59m9n7j2Q62J05r74J98p6J7n6o5q3J30P3
$$ 26 163 17 131 196 108 124 111 114 41 97 64 87 201 164 94 41 200 151 94 82 944 1049 75 273 197 214 158 93 10 140 213
3178B13L4k04M7J76j71O37L07r24N3j42L9K2O0p1J29j18K07M7k59J53l0J0o6k1L0j6l5K5k3
$$ 213 247 43 90 266 95 732 1039 115 168 26 65 87 147 76 205 87 294 341 82 235 205 215 149 128 158 142 107 132 109
2838A09K2L4m5L2o4N1l5rJ6Q9o9nq1Q2P9p9MJ2k8j1p9PM0k8O8k8K2J35P0n1j78J05k2Q5j26
$$ 109 131 165 120 152 88 139 104 95 111 200 131 126 45 127 206 127 131 143 115 104 25 32 72 44 112 84 106 241 311 260 82 187 165 250 124
2427A24o9R8J17p5m5N1j05L8j8k1lQ5j31J95K2j78j2J5M3Q7j47J4j6O9J03p7PM6o1J09j82
$$ 124 55 153 270 195 150 201 96 134 116 95 92 177 46 241 263 85 73 88 131 218 71 85 69 138 241 164 171 217 156 265 83
2063H3N9r4Q2k6m1R9K9k6J34r1j78L5K5q0M6O5j0K5r1J18p6N1J14p9j40MJ29j6L6j36J79%
$$ 83 142 48 130 104 63 162 191 165 299 208 30 65 90 10 56 121 111 136 45 163 87 138 252 173 33 37 166 150 186 50 229 229
1688B29j63L1O2l5Q4n0k6r7K5J65p1qk6J26p4n7J45j23q1j9OJ34J8j12N3j00J34j35J72p7
$$ 229 66 97 159 124 208 158 132 35 60 225 154 146 120 246 172 115 260 137 56 37 43 177 195 83 136 36 170 35 207 130
1336A30l0J4J4p2lM9J26m7n0K50k08j16M3m8j0M1PN0P3M0j9q0j28J9nL5J03o9q3L5j9N7K8
$$ 130 100 114 128 56 53 102 228 181 131 381 173 57 100 52 42 83 90 140 213 253 234 154 26 45 40 75 178 109 26 61 42 99 127
948A27k0N5O9N1j4l2j36R4j02M4P6L8j23J9J16j24NR9j23RJ43r9pj18J36Lk0m3r1jJ84J9r0
$$ 127 107 162 231 282 268 236 100 194 92 136 212 250 127 146 262 138 143 242 119 128 271 172 165 47 183 186 166 123 32 31 215 234 144
561A44l8Q1j47N7J4O7Lj02k0P6R0N9J0k02l0J3J53j12q0J48l1j27L4J12o5j4N7j08j3K9J00
$$ 144 106 187 40 97 111 178 181 79 59 135 225 284 294 92 62 75 228 116 36 184 153 26 60 172 107 93 150 42 29 58 158
197A58k6p6N6R7j16RK8J03m2r1l8l6J05O6o9m1k5P6q2P1OK5l0L9j00Q6om7N2J3o4j7K4
$$ 158 132 56 112 209 93 102 130 233 191 100 62 26 131 197 128 87 62 138 56 127 133 158 128 167 67 153 147 100 152 165 101 84 108
-190A08
##PAGE=	F1=2774.84
##FIRST=	25169.313707327481097,	5807.6787752999953227,	0.43658238649368286133
##DATA TABLE=	(F2++(Y..Y)), PROFILE
5808F8o6O4qR1J29j33p6N2o8K24O1j56kq4n8N2J67M3r6k9K8K7J1n3m3J04k4j8qQq1l7J19K21
$$ 68 2 66 58 149 278 145 69 121 53 277 338 182 180 96 38 90 257 300 204 175 203 230 241 188 145 249 225 207 199 207 126 89 208 429
5409D29j57k31J18j3o8K9L7m9Q3j15J54j55J87o2r0l1OP5j04J12j40J11j4j5j3N2K5K8Q7j56
$$ 429 272 41 159 146 78 107 144 95 178 63 217 62 249 187 97 66 72 147 43 155 15 126 112 97 84 136 161 189 276 120
5056A20pm2%onJ0P6L0q4O8jl8q7N1kJ33L0j37rj4J10j58J07Lp8j9M9O8mp7l7J16N0k04J61
$$ 120 113 71 71 65 60 70 146 176 92 160 159 121 34 85 83 216 246 109 100 86 196 38 145 148 70 51 100 168 164 87 50 166 216 12 173
4646A73j02N2R9l2m9k0j5n4L7K0J1m6M6Oq7K08J17j83Kj40N0J1q7J76J6l3O0r2k8L9K1j02
$$ 173 71 123 222 190 141 121 106 52 89 109 120 74 120 126 39 247 364 181 183 43 93 104 17 193 209 176 236 144 116 155 176 74
4270G4L7J20M5r4j23L5J33J01r6k07J47k3j05J08j1o3K8j3J06J13j38j11J9jl1P5j5N6M2M6
$$ 74 111 231 276 182 59 94 227 328 232 25 172 149 44 152 141 78 106 93 199 312 174 63 82 81 50 125 110 166 208 254
3918B54m2m3q8J49P3j55k3r9J18k7M2N2m5P1l0j63J22n9j7N7m0m4L9M0j8N1p3Q5L8j94J61
$$ 254 212 169 81 230 303 148 125 26 144 117 159 211 166 237 207 44 166 107 90 147 107 63 102 142 124 175 102 187 225 31 192
3554A92j19J20j55J13M0j10J07k9k4j18Q7m8N6O4p1l7l7J62k1l6r1J000J21j032R8n2O7j01
$$ 192 73 193 38 151 191 81 188 159 135 17 104 56 112 176 105 68 31 193 172 136 45 1045 1166 134 232 180 247 146
3225A46m7o8J31L2M4j92L6J96j12N71L68r73J21j76K3mO4r3J50p3O58Ro13O7p3K6q9LJ7Oo7
$$ 146 99 31 162 194 238 46 82 278 166 737 1105 132 253 77 100 96 160 67 217 144 802 811 198 265 192 218 129 132 149 155 88
2862H8J7lM9L0m0K8j05J12j8n1k1J62n9r4n9Q3Q7o5l5P6o7M4j26L8j1l3P3m4K0J65Q0o3j70
$$ 88 105 102 151 181 141 169 64 176 158 107 86 248 189 95 36 119 206 141 106 182 115 159 33 71 60 27 100 56 76 241 321 258 88
2474H8M9m6J56q7p0Q4J18k3o5oj34P6k1m4l8J21j31J91J3j58j2K2K5R9j26J4l6O2J24j14J8
$$ 88 137 91 247 160 90 174 292 269 204 198 64 140 119 75 37 158 27 218 231 73 61 83 108 207 81 95 59 121 245 131 149
2110A49P4o4J69j87N2j47M4J8j8P7K6n9K08j14j81J8P1l7%P2n5K1r0J10j09R0J03j21r1M4
$$ 149 223 159 328 141 193 46 90 108 90 167 193 134 342 228 47 65 136 99 99 171 116 137 47 157 48 138 241 120 29 73
1758G3J21k0J1j27J51n5j15M8R2l9R4q0K4j44PJ89j17j5K0R6o0nQ7j18n3k4K9P8lm4M3j22
$$ 73 194 174 185 58 209 154 39 87 179 140 234 154 178 34 41 230 113 98 118 214 154 149 236 118 65 41 70 148 145 101 144 22
1383B2R8l0R1j4pj2j6m7k8P2J01m8p2K61j56j43J3m0lL1%P2O0K7l2p1q2j2M6nJ37q2p1J0K
$$ 22 120 90 181 167 160 148 132 85 57 129 230 182 110 371 215 72 85 45 42 73 73 145 205 232 200 129 47 35 81 76 213 131 60 70 72
972G2R3Nn6MM4N3O6k3j91R9q9M8J05k6q4QJ08j22QR5q9M1J35j32l4q4J33J0l2k1p1m3K03k8
$$ 72 165 170 114 118 162 215 281 258 67 166 77 125 230 204 120 128 236 114 122 217 128 169 304 172 138 54 187 197 165 144 73 30 233 205
573B05n9o5Q2n3k3K1O7j6q9jM0Q3J02L4k24k1k5J51p6j09J31J9j25PJ31o3n0O8p0j0K8P9k0
$$ 205 146 81 163 110 87 108 175 159 70 69 109 192 294 328 104 83 58 209 133 24 155 174 49 56 187 124 74 142 72 62 90 169 149
185A49o6OJ00n6n7J25J10j01j06m7kN1O3m2o8k2J15j18J36q0J9M3K1j17R1J7q3M4J6l6MN
$$ 149 83 89 189 133 76 201 311 210 104 57 55 106 169 127 59 37 152 34 170 90 109 152 173 56 147 164 81 125 141 105 109 114
-190A14
##PAGE=	F1=2672.59
##FIRST=	25169.313707327481097,	5807.6787752999953227,	0.56427878141403198242
##DATA TABLE=	(F2++(Y..Y)), PROFILE
5808H6o1L8j1Q5J09j42l4O2j04K35J05k13Rq8k1k2K10L8j28L7R1l1k2m2l6R5lp5M2K2j03n0
$$ 86 25 63 52 137 246 104 70 132 28 263 368 155 164 76 55 33 243 281 153 190 281 250 228 186 150 245 242 167 209 231 128 78
5432G8J61J85j57k61J41L7p0M2K3n8L1n2J67j50R4l5o0m2J8K6m9P0o4N5K1n3k4N4J3M3J06
$$ 78 239 424 267 6 147 184 114 156 179 121 152 100 267 117 211 176 116 74 92 118 69 139 75 130 151 98 74 128 141 184 290
5068B90q2l5o6j1Lm2L7Q7rm0Q1k9o4l0m7J6K08J9j76j3o0J54j69J89oj16n0RJ04j1n6j4P2
$$ 290 208 173 107 96 99 57 94 181 172 132 213 184 120 90 43 59 267 286 110 97 37 191 22 211 205 89 39 48 152 141 85 71 143
4681A43M3j24O6p2J04R5n4n0o8M8n5n6J7K8K6J0J1o1J87J26j99O6j50M6n2l3J24P4J8k1j03
$$ 143 186 62 128 56 160 255 201 151 83 131 76 20 37 65 91 101 112 51 238 364 165 231 81 127 75 42 166 240 258 237 134
4317A34RL4Rj25Q7J09j0o8j33R7R2O5p5k16J18K7j23J34L7q1K2m3M8J05j16q7M6m9J2Q5oL4
$$ 134 143 177 186 61 148 257 247 179 46 143 235 300 225 9 127 154 31 165 202 121 143 100 148 253 137 50 96 47 59 144 138 172
3941A72J9N6n2l7k9J52J7j61J9j13M7M5NR0n2K7j6j34J16m6L9m5k1p5O6M9jM0q1Q2K6j39J41
$$ 172 191 247 195 158 129 281 298 137 156 43 90 135 140 230 178 205 189 55 171 125 164 119 98 23 89 138 137 177 96 178 204 65 206
3554B06p9P6j33J07J2j28J66m6k3j25J20p6M8J9j17L0l2J66pj4j47R95J47r77j6j9J24j56
$$ 206 127 203 70 177 189 61 227 181 158 33 153 77 125 144 27 57 25 191 184 170 23 1018 1165 188 172 153 277 121
3225A21M8j01R1J4N2j73J3J94l8M36L72q34J63k31kk0Q4p6J10J94R54m7r72o1j12L6j02K1
$$ 121 169 68 159 173 225 52 65 259 221 657 1029 195 358 127 125 105 189 113 223 417 1371 1324 352 291 179 215 113 134
2897A34JJ9q7qL0Q6J5m1K7j38J62pq8k7K18n5j43m5L8J07m5p3J43j08O0j09L5l6l0N0n1K5
$$ 134 135 154 67 59 89 175 190 149 176 38 200 193 105 78 296 241 98 53 91 198 153 80 223 115 175 66 101 65 35 85 34 59
2521E9J91P3p8j64J4n5J94n0o0N1J06M7p9o1j64J02k0m2k2R5j26J75j1j34NM1j0J11r6Om0
$$ 59 250 323 245 81 95 40 234 184 124 175 281 328 249 188 24 126 106 64 42 137 11 186 175 41 46 87 77 188 92 98 58
2157E8L2J35j38N4O0k9K00j82K9j71J7P8l4O4K4r1K45j33j45%Q7J6n7R5o9K1r5P3j21J11Q3
$$ 58 90 225 87 141 201 172 372 190 219 48 65 143 109 173 197 106 351 218 73 73 160 176 119 214 145 166 71 144 23 134 217
1793B17j75L7L0J06k8k7r6J36j20l7J3J40m6J00j06P2j89K9J65j36m7P8N8l7L5M2j25k4mL3
$$ 217 42 79 109 215 187 160 64 200 80 43 56 196 150 250 144 216 27 56 221 85 38 116 174 137 172 214 89 65 61 94
1441I4K7l5K1L4j15K6R1J7N0Mn0l7k3m8R3O5n0p0K36q7j56j2m3K8K0NO6L7J1m5k4l2k8M2m2
$$ 94 121 86 107 141 26 52 143 160 210 214 164 127 104 56 149 214 164 94 330 243 87 75 32 60 80 85 151 188 199 154 130 98 70 112 70
1031G0J38p1m5JJ6J10k2r7k2K2M1J32k2k36J29q8M0J14p7j9l1R9r2LQ7n6P7J32j51r9m0J45
$$ 70 208 137 92 93 109 219 197 100 78 100 141 273 251 15 144 56 96 210 133 114 83 182 90 93 180 124 201 333 182 83 43 188
655A88Rl5Kl6p1J70n2lr6J00k0m7j8O1%p6J6lQ7J08L0k07Jq0J72m9j01P5O3j03K2Q0n7p5O4
$$ 188 197 162 164 128 57 227 175 172 76 176 156 109 91 152 152 76 92 89 176 284 314 107 108 28 200 151 50 125 188 85 107 187 130 55 119
244A19k4LL6M5j2o8qN9J8r4J86J13j58j15l8Qj3Q6j4j03pJ44p9J25j37J3Q3J5j18Q0L8j31
$$ 119 95 98 134 179 167 99 91 150 168 74 260 373 215 100 62 70 57 143 129 26 19 163 84 209 72 85 168 183 65 145 183 52
-132E2M1L1j5Pp
$$ 52 93 124 109 116 109
-190A09
##PAGE=	F1=2570.33
##FIRST=	25169.313707327481097,	5807.6787752999953227,	0.44178935885429382324
##DATA TABLE=	(F2++(Y..Y)), PROFILE
5808A19n2j8nQ0P9r1o1Q3o5J63J39k33J8r8J4n0J98K5j63J16J44q9o0k2k5Q5J1j13Q5L5j07
$$ 119 67 49 44 124 203 112 51 134 69 232 371 138 156 58 72 22 220 245 82 198 342 253 193 171 146 231 242 129 214 249 142
5444A42p5J85J46j60k12R2Q3m0L9J3q0j9O1J46j58Pom7l4J8k8K5J9MJ0N4q1l4N5j0N2J48k6
$$ 142 67 252 398 238 26 118 201 161 200 213 133 114 175 321 163 170 164 117 83 101 73 98 117 121 131 185 104 70 125 115 167 315 289
5056B89o6r8j9L4m0J2Q7l6J3P5m9r2L3q6l3K82Jk01ll2J23j43K07j5j38n7l3J09lm3QM1J6
$$ 289 223 125 106 140 100 112 199 163 176 251 202 110 143 57 24 306 307 106 103 71 194 51 258 243 105 48 15 124 121 78 86 127 143
4669A43l5Ro0J36N8m6m7j16J26j8o6j9m7Q6j8lj2J28J18j64R9j28N1r8k1O3J45N8q1j30N2
$$ 143 108 117 57 193 251 205 158 42 168 150 84 65 18 104 86 83 71 199 317 153 252 124 175 77 56 119 264 322 241 111 163
4305A63J9k5o6Q3J02q1l9p9J20M4K7k9j98M1P4j01J03Q9q6Mm9nP0q5n3O7q3O0O4k2J8LO5m4
$$ 163 182 157 91 174 276 195 156 77 197 241 268 239 41 82 156 55 158 247 161 165 116 111 181 96 43 110 27 87 151 129 147 150 215 171
3906A71k6M0J39n7j60O3j17%R5k9J28o2rj1n0P1%N0j54j2k8N4L1K9K5q2O5j3l7P0l3M1r4J09
$$ 171 145 185 324 267 107 170 53 53 148 119 247 185 176 165 115 186 186 236 82 70 42 96 127 156 181 99 164 151 114 184 151 192 98 207
3507B07qj54J92o3Lj13J38q3Qj6m9Qm9J62Mjj63Q45J80q28r5%J76k11J64j30MK4N7j29l8J71
$$ 207 199 45 237 174 177 64 202 119 127 111 62 70 21 183 187 186 23 868 1048 220 125 125 301 90 254 124 128 152 209 80 42 213
3132B13L1K65L17n56J77k77m0j8J08o3O4M61J202j10j283j91j17L0j07K5kJ1o1o8N7J21km5
$$ 213 244 509 826 270 447 170 130 112 220 157 221 682 1884 1774 491 300 183 213 106 131 129 140 79 11 68 189 187 142
2803A42L7j47J69J3j21j2K53n8j59l1l7J31l4r1J96j32L1o7K9l5k2K0m5K5K15M8r1j63Kl0
$$ 142 179 32 201 214 93 81 334 276 117 86 49 180 146 55 251 119 150 83 112 77 55 75 30 55 270 318 227 64 66 36
2451C6J75k0l6JQ6J12r0q4j62P8k0%L5Qq0J04l7p1J1M6k4J00p0Jk9LJ04j37J12PL3J96j67
$$ 36 211 191 155 156 242 354 264 180 18 96 76 76 111 119 39 143 106 35 46 92 68 168 98 99 70 73 177 40 152 159 192 388 221
2063B21nj80K3J15o2O9J5j00K30j40r5MN9P1j09J15m6J8j06L4j14J11O3j42Q6MQ4l2p1l8J20
$$ 221 216 36 59 174 112 181 196 96 326 186 91 95 154 225 116 231 185 203 97 131 17 128 191 49 135 139 223 191 120 82 202
1700B02j35j4m0J92n4J07j25J00k21Q6R8r5o3P5K4j6M6J5j37M1jJ8J2p5N9K6p3j5J42l6J01
$$ 202 67 53 13 205 151 258 133 233 12 98 196 101 38 113 137 121 167 182 45 86 85 103 115 40 99 125 52 37 179 143 244
1336B44Lr3m2nm9R6K6m8m9J80j0j44l9n7O4K1J7M5J2j5m9L5Rk9J3p7J12m8j0J4J2J12m9j34
$$ 244 247 154 112 107 58 154 180 132 83 263 253 109 70 13 77 98 115 160 172 157 108 143 152 123 136 59 171 123 113 127 139 251 202 68
937F8j4KK5J60k8j69R3r5J1J02r6N5q7R0m6rP2l8J20J30j43j80M1J07J6k4J3jq7J12n2M4j02
$$ 68 54 56 81 241 213 44 137 42 53 155 59 114 27 117 71 62 134 96 216 346 203 23 64 171 187 163 176 175 88 200 148 192 90
549I0J40n4l6o5M4N1p3K5l5R8P5nj58K5j11J83l6r9L9J00q0L3K0m9q1O0%K6N7Kj7o8J2qP3
$$ 90 230 176 140 75 119 170 97 122 87 185 260 255 97 122 11 194 158 59 98 198 118 151 171 122 41 101 101 127 184 186 169 101 113 105 178
138A78q8J99J20k06j16%po5J15Ln9o5J58k9R3j42oQ2L3j06N0N3j72M0N6Nj2k1
$$ 178 90 289 409 203 87 87 80 15 130 133 74 9 167 138 231 89 83 165 198 92 142 195 23 63 119 124 112 91
-190I1
##PAGE=	F1=2468.07
##FIRST=	25169.313707327481097,	5807.6787752999953227,	0.10655329376459121704
##DATA TABLE=	(F2++(Y..Y)), PROFILE
5808A64m7o1j9Q2L9Lj27R0k1R7J43k19K8j08M1k1J31jj90J83J88j35q5jk4P9K0j15R7N2j07
$$ 164 117 56 37 119 158 161 34 124 103 200 343 124 152 44 85 64 195 194 4 187 375 240 155 154 130 209 229 114 211 263 156
5444A56r4J79J12j60j43K5J19J0L1mj07m1J54J23j75o2K6m5j6J3p0Q9k7M5k3Q9q1n3N7k6L7
$$ 156 62 241 353 193 50 75 194 204 235 231 124 83 237 360 185 123 149 104 88 101 31 120 93 138 115 204 123 70 127 101 138
5080A38J97Kr2j17k9N4l3j2Q2l6O8L8n5j12Q3j00n5L12k8k07K1L0O9j51K14j7j49m2J0MK8
$$ 138 335 337 245 128 99 153 120 108 190 154 222 260 205 93 176 76 21 333 305 98 119 149 218 67 281 264 115 73 83 87 115
4716A15m2J9L0j8L4k4k6J25Jqm6j34J74Pn0j6j30J05k9k7L4M6R7r0R0q9P1j09o3J8J99R1j13
$$ 115 73 92 122 104 138 114 88 213 214 206 160 26 200 207 157 141 11 116 87 60 94 140 237 147 237 148 219 110 47 65 264 355 242
4329B42j57R0qn5K9M4R7j56qj0J34%nL0j92j6R5m6L6J30q2k7l7l1J4m6j9P8p2P3K3n2OqP1
$$ 242 85 175 167 112 141 185 282 126 118 108 242 242 237 267 75 59 154 108 144 274 192 165 128 97 111 65 46 124 52 125 148 96 102 94 165
3918A65k5qJ02J11j35j26Q9j16j5J01k4J41o1l9k7K8M2N1K6k27l1P9J0kP1Mp4M1o8P1k3PK7
$$ 165 140 132 234 345 210 84 173 57 42 143 119 260 199 160 133 161 203 254 280 53 22 101 111 109 180 184 110 151 83 154 131 138 165
3531A65n2J18j0j85J88q0M3r1J37p8l5l3O4m7r5J54J7jj41N92K16o22r5k8K16k50K59j41j11
$$ 165 113 231 221 36 224 144 187 96 233 155 120 87 151 104 9 163 180 179 38 630 846 224 129 101 317 67 326 185 74
3190G4N7O4p0q7J11Q1R6K16k23J71k93q0QJ22p3L3O81J342j68j474l03q5J8j10J1J2j5%q0
$$ 74 131 195 125 38 149 230 326 542 319 490 197 117 125 247 174 207 888 2230 2062 588 285 200 218 108 119 131 116 116 36
2850C6NJ51k1m9O0j35J36N1j56NK71o9j63rj04J44l3q9K25j26l7rJ9j6m%l9RK36K0j01j65
$$ 36 41 192 171 122 182 47 183 234 78 83 354 285 122 113 9 153 120 31 256 130 93 84 103 87 83 83 44 53 289 309 208 43
2474D3PnJ37Kmn6O6J47r4o0j28J5l6P3P7q2l9K6m9L7rK3kO5n8J0qpJ7n4J21n6Q7J66j42m2
$$ 43 50 45 182 184 180 124 190 337 243 183 55 70 34 107 184 102 63 89 40 77 68 91 89 154 96 106 98 91 108 54 175 119 206 372 230 188
2052A88j76M6J25q7R4oq8J77j28n8L3mJ20j35J17%J0j22J6q7Q8N3m6N1k2O2l3j08L7Q5p6p7
$$ 188 12 58 183 96 190 184 96 273 145 87 120 116 236 101 218 218 228 106 122 35 123 176 130 181 159 221 188 80 117 202 126 49
1676D9jJ52n8J14j32R5j89J14Rj3m4J2LqK8Mj17J10j8j3L3o5J5K0j6K6Q7p0J32qj26l6Ml1
$$ 49 48 200 142 256 124 219 30 144 153 140 96 108 111 103 131 135 18 128 110 97 130 65 80 100 84 110 197 127 259 251 125 89 93 62
1277F2P6j0k8k8J12O1j06p0l3N2K6L0L0on5j1N1N3l3j5r6N3j7J7M2%J04p1j61J5k0K8J38l4
$$ 62 138 128 100 72 184 245 139 69 36 88 114 144 174 168 113 102 153 206 173 158 62 115 98 115 157 157 261 190 29 44 24 52 190 156
878A56n6M1r7kL9o4J03r2M3j1k0N4m7J62J29j06j38L3J2L1jJ3J8r0N1l4O1p7J72j11oq4PJ06
$$ 156 100 141 44 42 81 17 120 28 71 60 40 94 47 209 338 232 94 127 139 170 169 182 200 110 161 127 188 111 283 172 166 82 89 195
479A95o5K5m4J04J3o3q8M5q4J42l4r2L1J17n8L3l1m6n7P1k6N7Q7m1m7m1K9n7Q4o8J88J33k39
$$ 195 130 155 111 215 228 165 77 122 38 180 146 54 85 202 144 177 146 100 43 114 88 145 232 191 144 103 132 75 159 91 279 412 173
92A73r5M0k5k3O7%Kj37J63QN7j22l0O0P8q9J5N4j75J4Q0K8l5k6
$$ 173 78 118 93 70 137 137 139 2 165 173 230 108 78 138 216 127 142 196 21 35 115 143 108 82
-190H2
##PAGE=	F1=2365.81
##FIRST=	25169.313707327481097,	5807.6787752999953227,	0.28468647599220275879
##DATA TABLE=	(F2++(Y..Y)), PROFILE
5808B07m3o5p2R5mR2j35L0NP3J05j85L5r4N1pQ5l7m8O6K17j62p3Ml1P2K6q6P8P0j07r6J38
$$ 207 164 99 27 122 118 210 75 105 110 183 288 103 138 44 95 88 173 136 88 154 371 209 136 140 109 181 207 121 199 269 162 66 204
5420B04R2j51q1l3J35O8K3l2j32JJ73J03j93j05O2m6JJ5n9Q6n8N4m6J23n2p5N4j9j1K33Kj07
$$ 204 296 145 64 31 166 234 257 225 93 94 267 370 177 72 134 88 89 104 45 131 73 127 81 204 152 77 131 112 101 334 336 229
5045B29j09m1N8j8l2O6OJ09l0n2j12J13j07k4K91o3k00N1P8L6j77K12rj62j6N1r4P1m2RL7
$$ 229 120 79 137 119 87 153 159 268 238 186 74 187 80 56 347 284 84 135 213 249 72 284 275 113 97 148 54 125 83 92 129
4681A29m9O7m4L4P8o3N8m8j04J59J7k7qj70R6k0l2M3l7O8mN2m5R9r5j38J8K02J19j23j68J08
$$ 129 80 147 103 137 215 152 210 162 58 217 234 207 199 29 125 105 73 116 79 147 143 195 150 249 154 16 34 236 355 232 64 172
4305A72l8l9Q6lQ9k11K7M3J43l1k7P8j89l9Q7J9k3J37o8p1qm3l6NqQ1n8Q9k8n9pl5P2%LJ55
$$ 172 134 95 181 178 267 56 83 126 269 238 211 289 100 61 148 167 144 281 213 142 134 91 55 60 52 133 75 164 136 77 70 35 107 107 110 265
3883B65O9j92l0O2j16j3P4K2J24l9o6o5Q0L2R7k2k28rJ15m0l3J18k4o2K9q3J10r7J9L5k1J30
$$ 265 334 142 112 174 58 45 119 141 265 226 160 95 175 207 304 282 54 45 160 120 87 205 181 119 148 65 175 78 97 132 111 241
3507B41Pk03J56r8Q1n4J12p3o4k5J50p2j44J17L3j4r2K99K49m05l6q1K37k46K92j34k11Q8
$$ 241 248 45 201 103 184 130 242 169 105 80 230 158 14 131 164 150 58 357 606 201 165 84 321 75 367 233 22 110
3178A10Q1k6j03J4J07l6J00P7J45k63j00M5J18j14K7Q14J342k13j498l83k9J4j10k3L9m8O0
$$ 110 191 165 62 76 183 147 247 324 469 206 106 151 269 155 182 996 2338 2125 627 244 215 229 119 96 135 87 147
2862A47q6m4J70l9n7R1j24R9J09j94RK71r0j59K3q1P8l9p0K23r3j23N9nJ6K9j6m0OK25Kj10
$$ 147 61 17 187 148 91 182 58 157 266 72 81 352 262 103 126 45 123 84 14 237 144 21 80 75 91 120 104 64 70 295 297 187
2486A87j55J8qJ05K0K9j03N2J35q4kj11Jo9J27J05j61j5m3jQ6j7j8L3L3n6L6J4k0r0Q5Q6q0
$$ 187 32 50 42 147 167 196 93 145 280 196 194 83 84 15 142 247 86 71 28 27 113 96 78 111 144 88 124 138 118 28 113 199 119
2099A19R0J16j05p2j14K1J12j03J30l6o8J16r5n2P7q5J57j22R1N4pj39L9n9N2O3J4J6m1N4
$$ 119 209 325 220 148 34 55 167 64 194 158 90 206 111 59 136 51 208 86 177 231 224 85 124 65 117 180 194 210 169 223
1746B23m0j16R1K7pj50O8Q5n3J16j28N8r5J08q8P2l1l8pj5PoqR4l5n0P3m5n7J5N3N5K2p8J33
$$ 223 183 67 158 185 178 28 96 181 128 244 116 174 79 187 99 171 140 102 95 80 87 81 73 167 132 82 155 110 53 68 121 176 198 120 253
1336B53l0j26k5ppM4m1M2m7N1J16n6j00PJ7L1M3K2rj03P4J0R5m4k8r1k3QJ8P8j0R4q6j58K0
$$ 253 223 97 72 65 58 102 61 103 56 107 223 167 67 74 91 122 165 187 178 75 149 159 254 210 182 91 68 76 94 172 162 256 170 12 32
925C2k1L3Q9l8M8Rj03L5o0J1R6o9J5k0j7M3n4J54J28m4q5J2r0N4J9OJ2p1knM3l4J76j58M5
$$ 32 11 44 133 95 143 152 49 84 24 35 131 62 77 57 40 83 29 183 311 267 182 194 104 158 177 183 195 124 122 117 160 126 302 144 189
514A89p9l7J39l9Rk5J00o7j24j3N9o0J04m3p3N5J08m3K9o6n3j4Q8q3Q6J19o8j08M1No7N0n4
$$ 189 110 73 212 173 182 157 257 190 66 53 112 52 156 113 40 95 203 160 189 123 70 56 144 61 147 266 198 90 131 136 69 119 65
127F5J64J54k54m7N7k8NL8j1M9j85J61J2K6r4m4K6J37p2j2L6j42k9Q7N4l9j0
$$ 65 229 383 129 82 139 111 116 154 143 192 7 168 180 206 112 68 94 231 159 147 183 41 12 99 153 114 104
-190A04
##PAGE=	F1=2263.55
##FIRST=	25169.313707327481097,	5807.6787752999953227,	0.35963681340217590332
##DATA TABLE=	(F2++(Y..Y)), PROFILE
5808B36l5m7j36J12m4J53j07n3J2Q7M6j49L2m3M7k0O4p4Q4o1K26j67j9j7k0M6K7m8M6Q0j00
$$ 236 201 154 18 130 86 239 132 79 91 178 224 75 107 64 111 91 155 81 165 104 330 163 144 127 107 153 180 132 178 258 158
5444A58q1O7R1j29l8l8R2J22K1p0j40P4J29Q8k00j16R1m1LL5l7M7o1L0n4J40lq9M7%o9K32
$$ 158 77 144 235 106 68 30 122 244 265 195 55 129 258 346 146 30 121 80 83 118 81 128 67 97 43 183 180 91 138 138 69 301
5068C01j8j03o9n6N0On2L5R5J18j11n1q3J17j07OK66j00j74O8J12J5j88J96Oj79J5Q6j52R2
$$ 301 283 180 111 55 105 111 59 94 189 307 196 145 62 179 72 78 344 244 70 138 250 265 77 273 279 100 115 201 49 141
4716A41l2j5M5p4O7k7Q2J2j20J43n5p5J32J2j3Mj78Q0lk1K7r4L5O1J4oJ16n8j74M8J16J33
$$ 141 109 94 139 65 132 105 187 199 79 222 167 92 224 236 223 227 49 129 126 105 132 38 73 134 148 142 258 200 26 74 190 323
4340C23j19j59J07n8K6P6l6P0j85N1L6J41m6l7R7j71n9Q0Q5m8R5m7j22L1n1n9M8j8Q4n5J13
$$ 323 204 45 152 94 120 196 160 230 45 96 132 273 227 190 287 116 57 137 222 174 269 222 100 131 80 21 69 51 135 80 193
3977A93p0mk1o4K2K4lJ95K2j85O3J3j25J1J4Q1R2Mr1j16J02L3J35q3j71N7Q3r9l7J48n2n0
$$ 193 123 119 98 34 56 80 77 272 294 109 172 185 60 71 85 166 258 262 171 55 157 190 325 242 71 128 211 112 75 223 171 121
3601A21L8l7N2o4m6M0rJ34L8j99J15j16R9JP2q0p7kK04o5j75N3M2l3l0L5K68k19L4j23K44
$$ 121 159 122 174 110 64 104 95 229 267 68 183 67 166 167 239 159 82 80 284 219 44 97 139 106 76 111 379 160 194 71 315
3237C15k11K63j14j80J6J08j1j02o8R8p3N8J95R0j89p3O1J01j78M6Q40J198k39j348m18L0
$$ 315 104 367 253 73 89 197 186 84 16 114 41 99 294 384 195 122 183 284 106 152 992 2190 1951 603 185 215
2932B15K9j04q0P2p3J02r6m5J64n6p0J13j14P8J68k22jK47j20j44N7m1J8m0l5J75m5r6K7m0
$$ 215 244 140 60 132 59 161 65 20 184 128 58 171 57 135 303 81 80 327 207 63 120 79 97 57 22 197 152 56 83 43
2580D3O0O0l4m1K9J65Jj16j21J7k9P7L1N6j25N2P3m9N9j07K5p5J19J20k22lk5J3P5pp0O9J4
$$ 43 103 163 129 88 117 282 283 167 46 63 34 111 142 198 73 125 198 149 208 101 126 51 170 290 68 65 40 53 128 121 51 120 134
2193A34n5P4K6n0p4J13N0n5L2O0n9q9l5j6P9j10J65o7m8O9n2o0J07j09J23p8M5R4k5j44R0
$$ 134 79 153 179 129 55 168 218 163 195 255 196 107 72 56 135 25 190 123 75 144 92 32 139 30 153 75 120 214 189 45 135
1829A35l8J0R2L3j3n0P7o5j01J09m1N4j84J11K1m1J14j14%L0Q6j75J35j9o6j9k5L7m1O7O7
$$ 135 97 107 199 232 219 169 246 181 80 189 148 202 18 129 150 109 223 109 109 139 225 50 185 166 100 81 56 93 52 119 186
1465A86m5q0J18l2j14LJ23O5l2n7R3n6p1j7n3RJ0k5J17j07K5J35j5j20M3k1L9N6J9%j46J55
$$ 186 141 61 179 147 33 36 159 224 192 135 228 172 101 84 31 40 50 25 142 35 60 195 180 60 103 82 121 177 196 196 50 205
1089B05l3J18n9k5p9o5J4j8J06mQ6r9j09k4K9j0N1l2J17lj13O7m1m6J09o3K1l6lM0j3N8J25
$$ 205 172 290 231 206 127 62 76 58 164 160 246 147 38 14 43 33 84 52 169 166 53 120 79 33 142 79 100 64 61 101 88 146 271
702B71L0m6j3j69Q5K6%k6k6m0K5KJ1J47j81J23p9p0J47jj8J1Q6j46j14KO1m6P2o0l1Q8P7l3
$$ 271 301 255 242 73 158 184 184 158 132 92 117 119 130 277 96 219 140 70 217 216 198 209 295 149 35 37 98 52 124 64 33 121 198 165
303A65L1q0p7K9R5j25R7J43o5j70J48o4o2J4l0R8J80k44QN1k1J4L4j9P1k03J63j3ko5l7%J70
$$ 165 196 116 39 68 163 38 135 278 213 43 191 127 65 79 49 147 327 83 91 142 121 135 169 150 221 18 181 168 166 101 64 64 234
-85B34n7k0J1j06m1N5O7j9J2
$$ 234 177 157 168 62 21 76 143 124 136
-190A36
##PAGE=	F1=2161.3
##FIRST=	25169.313707327481097,	5807.6787752999953227,	0.20133791863918304443
##DATA TABLE=	(F2++(Y..Y)), PROFILE
5808B42k0j6j80J10p2J78o6j24QJ14Pj17jL2M6o7O5q4J65j63K04j49M5m7K3kJ9j1J4P0p3o4
$$ 242 222 206 26 136 64 242 176 52 60 174 181 64 63 95 141 74 139 55 220 57 261 112 157 110 133 131 150 139 153 223 150 86
5432H6j3J04r0k2pRJ65K4j06r8J01O1Q4j94o8Q0k5j1O0k7Km8JmQ5N0r1M0J3q7J63m8p5j1o7
$$ 86 73 177 87 65 58 67 232 256 150 52 153 214 298 104 36 116 91 80 140 113 115 67 68 64 149 199 108 148 161 74 237 189 114 103 36
5021C6M3L2p5lK05R4j65p5l2J01j00K3K38j30j23N4J30mj55J63K1j98M4J13j67Q4j4l0L5j04
$$ 36 79 111 36 33 238 332 167 92 60 161 61 84 322 192 69 123 253 249 94 257 278 80 124 237 70 154 140 110 145 41
4669D1N2M8Q4n5j51K21o4n6J10jk2J4j46M8J5nRj13L7N4J4K4Q7nj68N4K1J21j11j26Q7o0Q1
$$ 41 93 141 225 170 19 240 176 120 230 229 207 221 75 123 138 133 142 29 66 120 134 158 245 240 72 126 147 268 157 31 118 58 139
4282A39L9m2L8q7N9j5J22m3l5Q4j28r2Q7J41m3J6k3j68P0n4n9O1l3R4o4J46q7O3l9p2m4M9
$$ 139 178 136 174 87 146 131 253 210 175 259 131 39 126 267 224 240 217 49 119 65 6 67 34 128 64 210 123 186 147 75 31 80
3906H0m6K23k4r1Q6k4j37N0m0J00O1N7j15j54R6L5J59j43r2J34L3j62%J43p0m1N0Jj6K7q5
$$ 80 34 257 233 142 228 204 67 117 77 177 238 295 180 26 122 157 316 173 81 215 248 86 86 229 159 118 168 169 153 180 95
3542I5jk3J23P0j72Q5j14P3O7M4j08r0K3K35l4j96pL6m9K6J3J14r8R1j41K37j68J97r1j01
$$ 95 94 71 194 264 92 177 63 136 203 247 139 49 72 307 273 77 70 106 57 83 96 210 112 203 62 299 131 328 237 136
3190A36o6J44l3q7j2l3O0J12M1oq6j5N1P8k37P8P60R47k47j059m05P7N6q9j46J03q2J11j01
$$ 136 70 214 181 94 82 49 109 221 262 256 170 155 206 284 47 125 885 1832 1585 526 121 198 254 165 19 122 40 151 50
2850E0k3J63o6q9J12j04Q0K05k29oJ90j47j19Q1Lj8l1j4J05Ll9j6l2P9O6n6l5O4P7Rj14p8
$$ 50 27 190 124 35 147 43 123 328 99 93 283 136 17 98 101 83 52 38 143 146 107 91 59 138 204 148 113 177 254 263 149 71
2474G1J7o0M9L0P6j18O1j0K1Q0j07N5r0J08J21k50jM6m6O9J9j31J13%m4J10K4r9J2Q3K0j7
$$ 71 88 28 77 107 183 65 126 116 137 217 110 165 75 183 304 54 53 99 53 122 141 10 123 123 79 189 213 114 126 209 229 212
2099B12m3Qj4q7K6l7L5r0J66q3l5N0k6rO1k3kn1MJ02k8n3O4k3l3J24K7k8n1J26j03r0J01j00
$$ 212 169 177 163 76 102 65 100 10 176 93 58 108 82 73 134 111 109 58 62 164 136 83 147 124 91 215 242 214 163 289 186 96 197 97
1700I7R5j43R3k5l5J13r3m8J46N6k00J25op2l7rR0p1P1L0m8r3J67l0j34k5J83N4o6j8L2p6
$$ 97 192 49 142 117 82 195 102 54 200 256 56 181 175 103 66 57 147 76 147 177 129 36 203 173 39 14 197 251 185 167 199 123
1324A23Qj9q9lrQ5R1j62N2R3Nj30O8n7O1O3J3K0j81K09m4J12p2j2p2q0K1m2Q6K0Q3j16p2k0
$$ 123 131 112 23 20 11 96 187 25 77 170 175 45 113 56 117 180 193 213 32 241 197 309 237 225 153 73 94 52 138 158 241 125 53 33
925C3M1m9L2j2J39jj16O7Kj26J40o3K6l1NL2J7l0J24R9k5m6k22J38J7oq6M2o9N3m3L9R2j59
$$ 33 74 25 57 45 184 183 67 134 136 10 150 87 113 82 87 119 136 106 230 329 304 258 36 174 191 185 99 141 72 125 82 121 213 54
526E4K08j03q7J42L7m9M9O0k05k0m8M8l0L4p5K5J09L8k6M2p6j12N8Q2j11P1J51l5j44J74j35
$$ 54 262 159 72 214 251 202 251 311 106 86 38 86 56 90 15 40 149 187 161 203 127 15 73 155 44 115 266 231 87 261 126
162A26q0L8K1m4J97j98L1L5j0MN4k0P1j95J69m0m1l5j6K2J34m6rnp5m9L3M1J6K6
$$ 126 46 84 105 61 258 60 91 126 116 120 174 154 225 30 199 159 118 83 67 89 223 177 168 163 88 39 72 113 129 155
-190A55
##PAGE=	F1=2059.04
##FIRST=	25169.313707327481097,	5807.6787752999953227,	0.10371840745210647583
##DATA TABLE=	(F2++(Y..Y)), PROFILE
5808B22NJ9j95Q5q3J66k0j65L1R4K7r6p0J11N5j45Q1n2J74j85J19j07Q8p0P5m2MJ7j8M6k9
$$ 222 227 246 51 136 53 219 199 34 65 159 186 90 20 131 186 41 122 70 244 59 178 71 159 89 164 122 126 143 125 171 142
5444A42n4o5J09m2k4J2o0J88K3j25j6O6MQ5j70k1O6Lk0N8k4m0l0KM9oJ03r0L7J7o1L5p3k2
$$ 142 88 23 132 90 66 78 18 206 229 104 88 154 158 243 73 52 118 121 101 159 135 95 65 67 116 110 213 123 160 177 116 151 78 56
5045E6M1o7L7N1r8L4K34M8j56j19QP6q5K5J94j45m3NJ28k3q1J22L0k06N9J23j64P7Ol0Kj29
$$ 56 97 30 67 118 20 54 288 336 180 61 69 145 60 85 279 134 91 96 224 201 120 242 272 66 125 248 84 161 167 137 139 10
4669A0L9J38N2j07p7K00o6m6J00ro1J0q5RK9J1%j10O8RM3N4QM5j56O7n2P9j08n4M8m2R1pj7
$$ 10 49 187 239 132 55 255 189 143 243 234 173 183 98 107 136 147 147 37 105 114 157 211 219 264 108 175 123 202 94 40 88 46 137 130 113
4258A13mMP7o5Q9k6j5L7n9j18Q4J80j9p5oj94R5m9m0M1m5J16p1J67p3J08o6q7o7P0q0K04o3
$$ 113 109 113 190 125 214 188 173 210 151 33 117 297 278 203 197 3 98 49 9 50 5 121 50 217 144 252 186 99 32 102 22 226 163
3871A63K6P1m3j39Q9n7O1L1J10j36j29N1K5J60j78k4K16l0k21O4J12o3l9M0K2o3J11r0l2n6
$$ 163 189 260 217 78 167 110 171 202 312 176 47 98 123 283 105 81 297 267 46 110 222 159 120 160 182 119 230 140 108 52
3519E2R9Q0j25P0q7J4J28M8j39j14K1K48J0k02m4Mk5L7J15m8p7J28j35K16j20J12p4pj31J79
$$ 52 151 231 106 176 89 103 231 279 140 26 47 295 305 103 59 63 38 75 190 142 65 193 58 274 154 266 192 185 54 233
3167B33p8n4N1r9R7J29j9j42K1L6L1N7k13N7N98O43k38o96l41R6Q3p1j61Q2n1O8r6KJ81o8
$$ 233 155 101 152 53 150 279 260 118 139 175 206 263 50 107 705 1348 1110 414 73 169 252 181 20 102 51 119 23 25 206 138
2815A38r9P7j00R7K10k06lJ14j52k7K2M2l0k2mK9L5Lk7J0Q7M2p9k3R4oRr2m3K3r5L1J5Q2r2
$$ 138 39 116 16 113 323 117 114 228 76 49 71 113 83 61 57 86 121 124 97 107 194 236 157 134 228 222 231 139 96 119 24 55 70 152 60
2404F0O6n0P6O8j09P8j06R3J09k27JR3j29P7N6j17R9k3k8J34Rj56J09M9mJ7j09j6Qo8O0m0
$$ 60 126 76 152 220 111 189 83 176 285 58 59 152 23 100 156 39 138 115 87 221 230 74 183 232 228 245 136 120 128 60 120 80
2028H0ql3J15o5l3M8l1N6RL9m6j04j0P3K3O0k0j3o9J45Qk6m1J79j42r0P2j23J03q1O0m4m6
$$ 80 72 39 154 89 56 104 73 129 138 177 131 27 17 90 113 173 153 140 71 216 224 198 157 336 194 104 176 53 156 75 135 91 45
1641D5J18o5k3J75K8j78O7No3m6L0J02r4N2j2m6q5K14l5j34l4K08K7p6J7j0p0L9k4o9j3J6
$$ 45 163 98 75 250 278 100 167 172 109 63 93 195 101 153 141 95 10 224 189 55 21 229 256 180 197 187 117 156 132 63 50 66
1265F6R4N9j73P4L3Lj29P5r0J08N2OM6j93K16j9Q1p7Mp0j00M5j0%N8Q8j46m8K4J7n3J5J1J31
$$ 66 160 219 46 120 153 156 27 102 12 120 172 178 224 31 247 228 309 232 236 166 66 111 101 101 159 247 101 53 77 94 41 56 67 198
866A98Lj00L0M9j63J32n6K4j5OJ3M1q8J21J48j7q7k20J82pqj43J08q5P2p7M0K6l9K19j43r3
$$ 198 201 101 131 180 17 149 93 117 102 108 121 162 74 195 343 326 239 19 201 194 186 43 151 66 138 61 101 127 88 307 164 71
491G1J37O2p7P5K4k27L8n9M0%ok8lJ24jk1N8o1j43O4N2n7L8J35J2j04J75j61j43J13N6j16
$$ 71 208 270 193 268 292 65 103 44 84 84 78 50 47 171 170 149 207 146 3 67 119 62 100 235 247 143 318 157 14 127 183 67
115F7J21j14JK8jk3Q9k0N7j62J72m2r1j3MN9O6l6J3Lo2n7M5l2O0K1
$$ 67 188 74 75 103 102 79 168 148 205 43 215 173 82 69 73 132 198 162 175 178 116 59 104 72 132 153
-190A53
##PAGE=	F1=1956.78
##FIRST=	25169.313707327481097,	5807.6787752999953227,	0.13928522169589996338
##DATA TABLE=	(F2++(Y..Y)), PROFILE
5808A83L4N1j91N3p8J24K2j67Q6J3Q5r2p8J20O9k29J04k0J45j45J1m9R6p7J09n2pL3n5J4K0
$$ 183 217 268 77 130 52 176 198 31 117 130 215 123 45 165 234 5 109 89 234 89 100 51 147 70 179 127 120 153 98 112 132
5444A32n4k2N0Nl1K0l0J09J3j06L3J4mP3j37j6P4M3j4Rj3p1j5K1P0p8J55j00M5J2j7j10j5
$$ 132 78 56 106 111 80 100 70 179 192 86 119 133 129 202 65 49 123 166 152 161 148 77 62 83 153 75 230 130 175 187 170 60 45
5056D5pN5m9J4O3j02R0K12nj00j18j3M9o3K2J28j41M3n8J09m6K2Q0K7j84N4J07j54Q2J9k2
$$ 45 38 93 44 58 121 19 109 321 316 216 98 85 134 71 93 221 80 123 65 174 128 150 230 257 73 127 234 80 162 181 159
4693A59m0p6M2J32Oj31mJ68n1m5R7mj05k2j7l0M5K4%q1P7j5N1R5q2P2j35Q3j01L0j18M2K7
$$ 159 119 43 85 217 223 92 88 256 205 160 257 253 148 126 109 79 124 148 148 67 144 129 180 275 193 265 130 213 112 142 24 66 93
4305I3l5P5p0L3m6O3R5r4N1kK0k6J4j07M6K01J3j50j1j33M0l8koL2P6m3J29l7J27r8j07p9
$$ 93 58 133 63 96 50 113 208 114 165 163 183 157 171 64 110 311 324 174 163 30 70 32 30 24 56 132 89 218 181 308 210 103 24
3918B4R9o5J29r1J15N0m9j25J22n6lNJ48j50o6K0JJ27j60%K83r2k35R7P4k1n1lK6o6J55p8
$$ 24 123 58 187 96 211 261 212 87 209 153 150 155 303 153 87 107 108 235 75 75 358 266 31 128 202 181 130 127 153 87 242 164
3542A64l0q7P6M9o6O2m9m2J64P5j48j06k4K15N2j83p0l9O1k1J55m8j38J52j14J84o8L7p5P6
$$ 164 134 47 123 172 106 168 119 77 241 316 168 62 38 253 305 122 52 13 74 53 208 160 22 174 60 244 176 213 138 214
3190B14j77K12j29oR6j26P2R6J8k51R3N5J2L6j26NL97L55k18l38k22O7R9n4j33K3J5j5n7J1
$$ 214 37 249 120 114 210 84 156 252 270 19 112 167 179 215 89 94 491 846 628 290 68 135 234 180 47 70 85 70 13 24
2838B4K04o9j08M1o7P2J84j57KM6r6J6m0P3l3j5Km3N1J2nN6J03Mr9j6J12n3po1j4L1j33M1
$$ 24 228 159 51 92 25 97 281 124 126 172 76 92 52 125 92 77 79 36 87 99 94 150 253 257 158 142 254 201 194 133 119 150 17 58
2439E8J1M1n4N9k6O8O4j11Q8j15O8Q9j52kJ12j69M3R5q1Q2n0k3J42j4k05K03J6k6M0j50J7
$$ 58 69 110 56 115 89 157 221 110 198 83 151 240 88 86 198 29 72 167 86 168 118 95 237 223 18 221 237 211 251 101 118
2075A18k2l1N7k5m8J4P2k5m8N3m5J01oM8k5j71jj2J46J08j12mp9J35j3nk6K16j70r1J8o7O1
$$ 118 96 65 122 97 49 63 135 110 62 115 70 171 165 213 188 17 16 4 150 258 146 142 63 198 185 180 154 370 200 109 127 60 121
1688A21l8K9k6n6R6k9K3J59Pj44J5Pn2l2N3Q4j06L1n5m1j6K09m6j30l0K17pp6M5on8J5k9l0
$$ 121 83 112 86 30 126 97 120 279 286 142 157 164 112 80 133 217 111 142 87 46 30 239 193 63 33 250 243 167 212 206 148 163 134 104
1289A04j2J6R4K9j59Q9j2k0r3L8k5Q9J3MP0j59J58K8L9o9J4o7j24P3L3q3R6R4j79l8Q7k4l2
$$ 104 92 108 202 231 72 161 149 129 36 74 49 138 151 155 225 66 224 252 291 222 236 169 45 118 151 68 164 258 79 41 128 104 72
901G2KL8J08op4j0Q2j79J02m2K3JloN4j07J15J71j7j34j00J41m5%j09Q2q1P1j00K4j9R4J88
$$ 72 74 112 220 214 140 130 212 33 135 93 116 117 114 108 162 55 170 341 324 190 90 231 186 186 77 159 78 149 49 73 54 148 336
514C36j83q8J34P1r3P5j7k04N3m2N3K7k6jn3J39l8j5P6m3j34L2LJ4K4R4N9q4J78j37j82J42
$$ 336 153 65 199 270 177 252 235 31 84 42 95 122 96 95 42 181 143 128 204 161 27 59 62 76 100 194 253 169 347 210 28 170
138A70Q2j23Jl5n1N6Np5J21k0L8j15J69k1j26j5K5P6Ok5L4K2n9m6M9j06J05l
$$ 170 252 129 130 95 44 100 105 30 151 131 169 54 223 202 76 61 86 162 168 143 177 199 140 94 143 37 142 139
-190A39
##PAGE=	F1=1854.52
##FIRST=	25169.313707327481097,	5807.6787752999953227,	0.20385320484638214111
##DATA TABLE=	(F2++(Y..Y)), PROFILE
5808A42N5P1j73K4o7P0N7j41J35q2J41q9o1J08Q4k21M6kR9q9o3%Q4n8R9l3LL4j02nM5n6J8
$$ 142 197 268 95 119 52 122 179 38 173 91 232 143 82 190 274 53 99 97 196 107 44 44 128 70 169 136 139 173 71 66 111 55 73
5420G3K4M9l7K2NK9mm7K0l5N0L2j17k0P9R3lp4Qp0j3K5P1j08K04j27O0RL4j83P3p5M9j5j9
$$ 73 97 146 109 131 136 165 161 114 134 99 149 181 64 44 123 216 213 139 147 77 64 89 160 52 256 129 189 198 232 49 122 47 96 81 62
5010F2N1p0J07J76m9l8r2m5K3l5J4N7j20J08r7O3o5J24M8J3j41M3N9j39J02J8j7p5LP6N9m6
$$ 62 113 43 150 326 277 239 147 102 125 90 104 161 41 149 52 115 50 174 222 235 94 137 196 57 159 177 160 85 88 164 223 177
4634A77j24M4J40j9m4Q5J0j14q3L1o0P3K3Ol4O6k3K9J38j42O2j02R6j40J0o0M4L0l3P8j52
$$ 177 53 97 237 218 174 259 269 155 72 103 43 116 139 145 111 177 154 183 321 179 241 139 235 95 105 45 89 119 86 164 12
4270A2P2o0O4J03r6K1J9O3q2O5q0OK01M7j80n3q3Pl5M3lP3M5j2O1LJ31j30j30q1J14m5O8j06
$$ 12 84 24 88 191 95 116 135 198 116 181 101 107 308 355 175 122 39 46 11 54 51 124 169 157 218 221 352 222 92 11 125 80 148 42
3871D2J58K9m5r4J45m9n9k5J65j58K0mj8P4j05pL17j39j75O0M2M8p5p4J6j2J41n9mj00O2j5
$$ 42 200 229 184 90 235 186 127 102 267 109 129 125 107 181 76 69 386 247 72 132 174 222 147 73 89 77 218 159 155 55 117 102
3495A02rO0j4p5J63J03j35p8k0R5Q4j40j02J0O9p6J34K3j65J23q6J46pjr1J12k13K43j63M1
$$ 102 93 153 139 64 227 330 195 117 97 192 276 136 34 44 113 37 171 194 29 152 66 212 205 204 113 225 12 255 92 133
3143A33J14j56N6K4Q2j85L1L2lJ7m3k4K06J63j77r6q3J1R8m0j04k6R4j10K9oK08o6j22L1j5
$$ 133 247 91 147 171 253 68 99 131 128 145 102 78 284 447 270 174 91 102 200 160 56 30 124 14 43 37 245 179 57 88 73
2779G3KJ31r3KOj9J7p2J02m3nLr4Q0m1L0R5J28l0j07l2J10n3k2l8PM0j65O8K8l8j2L5PL6Q6
$$ 73 75 206 113 115 121 102 119 47 149 106 101 104 10 90 49 79 174 302 272 165 133 243 190 168 130 137 177 12 80 108 70 58 93 100 136 222
2357B22j09Q3j06K8O9n5j6J24j42m8J24n3P7o7l5J34l6j50J96j3m9M6j55Q5p3RK2%q9O8L7
$$ 222 113 196 90 118 187 132 116 240 98 50 174 121 198 131 96 230 194 44 240 227 178 224 69 154 81 90 112 112 23 91 128
1993A28Lp0O5l7J04J3J1J3j65l1M3J20J22j92Km6P9k9K9oK20j79q4n1K5L8n0QJ4j4JQN5J37
$$ 128 131 61 126 89 193 206 217 230 65 34 77 197 319 127 129 83 162 133 162 156 376 197 113 62 87 125 75 83 97 83 84 92 147 284
1594B84pj04j5%m9oO2M6j02J5q6j9M7J74n5j20k2K12l6q2P2K9n9l1l6K5j0NQ8Nj35J04l9n2
$$ 284 277 173 158 158 109 103 165 211 109 124 38 19 66 240 185 65 43 255 219 137 209 238 179 148 112 137 127 132 220 225 90 194 155 103
1195A03l8k4P7M9n1J7Q2j03O9P7Lm7J0n3j04M5P2j36J22R7j98m7J59p8LJO5P0k5m6j9P7k01
$$ 103 65 41 118 167 116 133 215 112 181 258 261 214 224 171 67 112 184 48 170 267 69 22 181 103 106 107 172 242 217 171 152 229 28
807B8Q0l1L1J2k0j6N8q7J01J66j9j80L8R4r5K9m9J5n1M8j12KL6J09J46k05p8J37O4r0M4n7
$$ 28 108 77 108 120 100 84 142 55 156 322 303 123 161 255 160 189 140 155 104 152 40 42 78 187 333 128 50 187 251 161 205 148
432A48j27K5j2P7M3l2Qj08J54p1oR0j6j06lk4M7K3M1R6q9J83p8k03J43R5j33p4K0p2R2Oj07
$$ 148 21 46 34 111 154 122 130 22 176 105 99 189 173 67 64 40 87 110 151 247 158 341 263 60 203 298 165 91 111 39 131 137 30
45C0R7j9J5o2J55Qj35l3N5N7k1j4M1L9o1j2L0j33J25l1
$$ 30 127 108 123 61 216 224 89 56 111 168 147 133 174 213 152 140 170 37 162 131
-190A31
##PAGE=	F1=1752.27
##FIRST=	25169.313707327481097,	5807.6787752999953227,	0.28065729141235351563
##DATA TABLE=	(F2++(Y..Y)), PROFILE
5808A27L9P9j46ln3K1R0j03J68j65J67p5l8R1R3j91j3QM7l6p9K2N6j6M8JL2L2j54PJ4m2K8
$$ 127 166 245 99 96 43 64 154 51 219 54 221 146 108 199 292 101 88 96 143 107 28 50 106 90 138 139 171 203 49 56 70 28 56
5420E6M4Q2l8K5K3k9j2J3k6p1J11j7j03J7L7J49Pj76M1l0k9LN1n1K10j64Q0J1Q3j73M2j00
$$ 56 100 182 144 169 192 163 151 164 138 67 178 161 58 75 112 261 268 92 133 103 74 77 128 77 287 123 203 214 297 124 166 66
5045F6L6L1k9qj8R7J27p4J1n8o5oLqJ4r3J38r1j4l3J60K9j1r2M5j8j12J28kk3q5P9J16k8j04
$$ 66 102 133 104 96 78 175 302 228 239 181 116 110 113 105 119 26 164 73 59 26 186 215 204 112 157 139 27 155 153 130 45 124 240 212 108
4634A08r1P0J10K9l9N4K3q4j12J7p9J12J5kK1M5k3rJ69j62K7o2J02j74K7J0jL2pR8j40qm0
$$ 108 17 87 197 226 187 241 264 180 68 85 6 118 133 131 152 197 174 165 334 172 199 137 239 65 92 102 101 133 126 224 84 76 36
4247C6J2R5p6J3K5J00j08P8m8k2J85P7j64j16o0K9k1L9L4Q7J9QkL7J27j58j56j5N0j8K4j02
$$ 36 48 143 67 80 105 205 97 175 127 105 290 367 203 87 27 56 35 74 108 195 214 222 220 257 384 226 70 55 105 87 111 9
3871IJ49J4l7m9J57l6q6o3J54j55J13m0k7K5o9J4L04j62j06J3K6J20j04j38j9Q2Q2l1K3r2
$$ 9 158 172 135 86 243 207 121 58 212 57 170 130 103 128 59 73 377 215 109 122 148 268 164 26 7 89 171 140 163 71
3519G1M0m1PN5J3p8J18J18j03l1Om6J02p9j38Q5M2q2O4R7j48O1n9J06O4j5r4Q6k01K26j64
$$ 71 111 70 77 132 145 67 185 303 200 169 175 129 231 152 14 99 141 59 123 220 72 133 74 180 244 229 135 221 20 246 82
3155H2O1J14j85O1n6J16j09K2k9j6jK0k2O4J89l1j83J5l7Q3l2p6j1J22j03Rj5K01o4j30L2
$$ 82 143 257 72 133 77 193 84 106 77 61 60 80 58 122 311 280 97 112 75 158 126 50 39 161 58 67 52 253 189 59 91
2791I1L3o7N4l4JjL0K2q7J40o3OOr8J08o8k1J23J56m1r8r0R4j8mm2J6M6j63Q4L0r9K3lL1J
$$ 91 124 57 111 77 78 77 107 129 42 182 119 125 131 33 141 73 52 175 331 290 192 102 196 178 174 132 148 194 31 115 145 46 69 66 97 98
2369I8J25r9O3p8j2O5J6l6J40j09j23J26l8P5o9n8J15m9n6J46l0q1L5j22J48r4K1k7L2j14
$$ 98 223 124 187 109 97 162 178 142 282 173 50 176 138 213 144 86 201 152 96 242 212 131 166 44 192 98 119 92 124 10
2016A0J09J2Qr2Q2nP0M7m8N0j37n6R2P4J33k50NQMl0O1J2J89j70n7q5O4O1r8pO0K8j07M0P8
$$ 10 119 131 139 47 129 124 194 241 193 243 106 50 142 216 349 99 104 112 116 86 147 159 348 178 121 36 100 161 63 56 116 144 37 77 155
1606A55J13k2n8k2rn9K3O0Kp9Mm5QL0J21n8q7k5J93n4r3R5O5o7p3m5Q5j2qP6rj09J13m3q3
$$ 155 268 246 188 166 157 98 121 181 183 104 108 63 71 101 222 164 77 52 245 191 98 193 258 191 118 73 158 146 138 214 205 96 209 166 83
1195H3Oo6J59J2j21N0P4m5j6J08k1j6nk7m8l2J02j55J28R4j86o8K19j33M4NQ1K4m6k0PL7k24
$$ 83 89 23 182 194 73 123 197 152 136 244 223 207 202 175 127 95 197 42 170 264 78 10 229 96 140 145 226 250 204 184 191 228 4
807DO3k3M4J7l8rN6n1Q7J38j6k22J66M8j47Q1lo3mJ6r6k5R9P0J03j96o7J39N1p2j3r0J0oj9
$$ 4 67 44 88 105 67 58 114 63 150 288 272 50 216 264 117 198 195 132 128 144 48 23 122 192 295 99 32 171 222 150 137 47 57 51 32
397C2R0N1l4J8j49J50j04QJ04J9p0k7NPJ8pJ17j09J83nk19J48Q7j46r8N8l6Q4Kj25N1oj8j8
$$ 32 122 173 139 157 8 158 54 62 166 185 115 88 93 100 118 111 228 119 302 297 78 226 313 167 69 127 91 175 177 52 103 97 79 61
-2F1J32L2j28m2Q9Qj1pL5M4o4L4nj27J35l9
$$ 61 193 225 97 55 144 152 141 134 169 213 149 183 178 51 186 147
-190A47
##PAGE=	F1=1650.01
##FIRST=	25169.313707327481097,	5807.6787752999953227,	0.36019045114517211914
##DATA TABLE=	(F2++(Y..Y)), PROFILE
5808A44j8P5j17k8l7kJ20o4J77j92J24m8j1O4R5j42n3PKOp1N4QK2k1L7O6L6j91K8n6J5NQ2
$$ 144 126 201 84 56 19 17 137 73 250 58 182 134 123 187 282 140 87 94 96 102 31 85 93 115 94 131 197 233 42 70 14 29 34 116
5409A16R4l6K6K6o6mN7p2r3J34n5p0O4l0K00J2k48N4L3n2k6KP8J67j97J01J8J26j69j3o6o
$$ 116 210 174 200 226 160 156 213 141 48 182 127 57 121 91 291 303 55 109 142 90 64 66 144 311 114 215 233 359 190 177 111 105
5033A05Q4k7q5L6P2P2p5L9l0o8l5M5m5K4q2J39o1o9K8J15K6l9n2O0j03k5J02l7m5m5J26J44
$$ 105 189 162 77 113 185 257 182 221 191 123 88 133 88 112 30 169 108 39 67 182 208 169 117 177 74 49 151 114 69 24 150 294
4657B94r6j64j8M9P8Q4k8ML2m0r3l9l7R5L0m7O9K6k0m6J78j58Mk8J04j91L6O3m0K2M9J09j38
$$ 294 198 34 16 65 143 227 199 203 235 195 102 63 26 121 151 104 173 199 179 133 311 153 157 129 233 42 78 141 101 123 172 281 143
4270A43p3l2k2N9m2M1KJ22j10O4j8l3J61R6j23j59n3O4j0PQ5Q9j1K0m3N7J21j70j85O7m6K0
$$ 143 70 38 16 75 33 74 76 198 88 152 134 101 262 358 235 76 23 87 77 84 169 258 247 267 224 281 402 232 47 114 68 88
3894H8j4n5Q5J0l3jJ56j6q2q9J04q9J42q3m0Mm6N5K34j53m9j7K7J66j30j00J8RK2J9Rn3j6
$$ 88 74 19 104 114 81 80 236 220 138 49 153 64 206 123 83 87 41 96 330 177 128 111 138 304 174 74 92 101 123 142 151 98 82
3507H2J6k6L9K8n8L8J14n8L7L9j56R5j8j20R3J3p1J6J30j29J2k5N7J40l6q5M2j55J67j26L8
$$ 82 98 72 111 139 81 119 233 175 212 251 95 190 172 52 145 158 87 103 233 104 116 91 148 288 252 167 209 54 221 95 133
3143A33J03j93P4q2P0k8M5q3l0J7OJ5K9K92M0l16K9o7O4l0m2M5R6o8l5k8J90n6j26J9Q6j16
$$ 133 236 43 117 35 105 77 122 39 9 26 32 47 76 368 408 92 121 54 118 88 46 91 187 119 84 56 246 190 64 83 169 53
2768E3l9MPL9K1M1r9J86q4QJ9j04J42m4j20J25J83k5q0j77O7K9N0n9RM8j44J02Mj16M6n0N5
$$ 53 14 18 25 64 85 126 27 213 129 137 156 52 194 150 30 155 338 313 233 56 123 152 202 143 152 200 56 158 162 46 92 42 97
2380I7k0J42p8L1m1l1Q7L3n8J59p6j73R8l4P1n8q4R1m3J5R9k9j23J1n9J95q9Qp4O5r6J04o
$$ 97 77 219 141 172 131 100 187 220 162 321 245 72 170 136 207 149 65 156 113 128 227 198 75 86 27 222 133 141 67 132 36 140 134
1993A34lr8R0L5K1P7r8O9r9o0J13K6J42k77PN1n6oO7K4J24j37j7m0J1R2j29j6R1N6j68K4J01
$$ 134 131 33 123 158 179 256 158 227 128 68 181 207 349 72 79 130 74 68 135 159 283 146 129 89 100 192 63 47 138 194 26 50 151
1606A51R0l9j7j6qp7M6N2l5m2mPJ2ON7n2l1m7J71n6o7P6P0o4j02n0J36j6k1O0j4q5J10k6j01
$$ 151 241 202 185 169 161 84 130 182 147 105 101 108 120 126 183 131 100 53 224 168 101 177 247 183 81 31 167 151 130 190 176 91 201 175 74
1195G4K5p9K05j9j63P9N1lo5J07l5K0k2nJ4j12J21j42J10P9j46n7K30j80P9QP7j9n7jM8j6
$$ 74 99 20 225 206 43 122 173 170 105 212 177 197 175 170 184 72 193 51 161 240 94 37 267 87 166 174 251 232 175 174 222 206
819B06j66j2J5RK0n0J8M3k0Q2J00j0k18K21J4j80J39K5j45M9j7n0m2J06L2O2j43n1J19L8n1
$$ 206 40 28 43 52 72 22 40 83 63 145 245 235 17 238 252 72 211 236 91 140 123 73 31 137 169 231 88 37 156 194 143
455A43p4j5N2lo1Q1N3l4L5j33Q6j11L3R9N2m2m4J8k2J0m8J23j25J65O5k26J63N5j55q3Q9P
$$ 143 69 54 106 103 42 123 176 142 177 44 130 19 52 151 203 161 117 135 113 123 75 198 73 238 303 77 240 295 140 57 146 153
80A53O0j1j56N7J0o7J0J00M7j08l9J18n1J8j1L3L5o7P7l8j16J49l3
$$ 153 213 202 46 103 113 46 56 156 203 95 56 174 123 141 130 163 198 131 208 170 54 203 170
-190A70
##PAGE=	F1=1547.75
##FIRST=	25169.313707327481097,	5807.6787752999953227,	0.41086077690124511719
##DATA TABLE=	(F2++(Y..Y)), PROFILE
5808A67r1O6q9m2J2J1R8l3J68j65K1j0K0K3Q7p9m9j4k2L0o8R3m0M0q5O2R5M6j92K3l1J1K6
$$ 167 76 142 53 11 23 34 132 99 267 102 123 113 133 156 243 164 115 101 79 109 41 134 94 134 49 111 206 252 60 83 52 63 89
5420H9N2P9k9K5J7q9J1R3r7r7J01p9j0R2r4K34J6k11j6R1n9k9l7J70R2k07J15K4J58j64p2
$$ 89 141 220 191 216 233 144 155 248 151 54 155 76 66 158 64 298 314 103 87 178 119 90 53 223 315 108 223 247 405 241 169
5056A69lo9J39k3j51P7M4K3n3N1k6n7n9Q5p6N6o8J11k8o6PP9L7o4l2Q1j71Q4N1p4o3L7J17
$$ 169 166 97 236 213 62 139 183 206 153 204 178 121 62 147 71 127 59 170 142 76 83 162 199 135 103 184 13 97 148 74 11 48 165
4669A65J52j30j40kKM9J24j2m9K9Kn9q6JO9Q6j19Q6J4np9J65j50K5k6J14j59k4J13o8OJ18
$$ 165 317 187 47 45 47 96 220 208 159 188 190 131 45 46 115 201 82 168 182 177 98 263 113 138 112 226 67 43 156 88 94 212
4294B12J04j28j23l6J5l4oR3m5J23j01L9Ok7J40R8p9j70k8O6Ll5J36P9m4K3n4O5J11j62k10
$$ 212 316 188 65 29 44 10 4 97 52 175 74 113 119 92 232 330 251 81 53 119 122 87 223 302 258 281 227 292 403 241 31
3930C1J45j16L8o5oM9L3m3J1J44J0o6r8M4J6J04j15o2K0K2M0J25j23j2oK8J70j48l6M2p6J
$$ 31 176 60 98 33 27 76 109 66 77 221 231 165 67 111 127 231 116 54 74 96 136 261 138 126 120 148 318 170 134 176 100 101
3554A01Q5o4Nr2Q8l9QL6k4n8R2j2J15P4k07O5J5q6P0jp3J2J20j18oJ0LK11p4o8Qj15J02n7
$$ 101 186 122 127 35 123 84 92 128 104 46 138 126 241 315 108 173 188 102 172 171 98 110 230 112 106 116 119 330 256 188 196 81 183 126
3155A26k6R0j54N6j2n4O7M5p9KM0p0K3N1K55O8l08op9N3l0kP5O9l1p4m9J85m7j06k0J43j44
$$ 126 100 190 36 92 80 26 93 138 59 61 101 31 54 105 360 428 120 114 35 88 58 56 131 200 169 95 46 231 184 78 58 201 57
2768E7J3j2jM7n6O9r4K06r2qM6j04J49j5j49P8J93No1k66L7P0J16o8j1M3j15J23m4j00O6r4
$$ 57 70 58 57 104 48 117 23 229 137 129 175 71 220 205 56 134 327 332 271 5 42 112 228 160 149 192 77 200 156 56 122 28
2392B8Q3lR9n0rjl2J20J6p4J75m6k07N2l4O5m1j03P2j8M6O1rj52Qk4K23q0j3j16J00q1R1j8
$$ 28 111 108 207 157 148 147 115 235 251 177 352 306 99 151 117 182 141 38 110 92 138 199 190 38 46 22 245 165 152 36 136 55 146 128
1993A28j5o2N3P4k3R0j02N2o8l5J01rJ43k75L7L6o1LN9K7L7p3K2ml4R8j28oR5O5j45l7J01
$$ 128 113 51 104 178 155 245 143 195 127 92 193 184 327 52 89 125 64 67 126 153 190 117 139 135 101 199 71 65 160 225 80 43 144
1606A44P3m7joMr6N5M6n8Lj6L9J4j6j0m1L4p9J61n0J3KL2m3j09j1J27k1k6L9j4n8Q1Or3K2
$$ 144 217 170 169 163 167 71 126 172 114 117 101 140 154 138 128 87 121 42 203 153 166 168 200 157 48 37 164 143 117 156 142 84 165 171 78 100
1183A00r6K33m2j33N4L3Ro0P5n0N6l0kP0j65J27j02O8M6q5l6K22k04R2NN2m9n8J4Q5o5p8k6
$$ 100 4 237 195 62 116 149 158 98 173 123 179 149 147 217 52 179 77 145 191 106 70 292 88 180 185 237 188 130 144 229 164 86 60
796F0L8p7NmJ2J5pR7O0kj24J53oj48J48M3k05P7m2Nn9Q3K6J7n9m6Q2L4l9q4Q0K2mj00O4N2
$$ 60 98 21 26 22 34 49 42 139 199 197 73 226 220 72 220 263 58 135 93 98 39 122 148 165 106 60 142 176 137 53 133 155 151 51 115 167
373A67l5N7j08K1l4L2N9O5l2n1Kk3Rq0J16j13J12J13k18J86Lj53n2J19N3K4l2j92J23Mj07
$$ 167 132 189 81 102 68 100 159 224 192 141 143 120 129 49 165 52 164 277 59 245 248 95 43 162 215 239 207 15 138 142 35
9C5J3P3M3p7l0J36r8L8k3M7J1o6J02n0j02J54k4
$$ 35 48 121 164 87 57 193 95 133 110 157 168 102 204 154 52 206 182
-190A82
##PAGE=	F1=1445.49
##FIRST=	25169.313707327481097,	5807.6787752999953227,	0.34686142206192016602
##DATA TABLE=	(F2++(Y..Y)), PROFILE
5808A76j52N2o4O0kj2P4rJ49j19r6K9N3k5O8rmn6k4M1o4J10p5M2j36P4J15N6j64JK1qO0QM0
$$ 176 24 76 12 72 70 58 132 123 272 153 57 86 139 114 182 173 169 113 89 130 66 176 101 143 7 81 196 252 88 89 110 102 162 170 210
5397B10j9K3Jj00K6J19r4q7K9n6K7R3j33K41K0j32q3J19m4j5lJ53jj92J24K6J71j49j07L9
$$ 210 191 214 215 115 141 260 166 79 108 52 79 172 39 280 300 168 85 204 160 145 142 295 294 102 226 252 423 274 167 206
5045B06j31J89k0j88R1L0j3j8O0n5m0o8J10o1N0l4O7qn0m3N9N3p4m1J01j39J06Mo4J4k6J06
$$ 206 75 264 244 56 147 177 164 146 206 151 111 43 153 92 142 108 175 167 117 74 133 186 112 71 172 33 139 143 79 93 67 173
4669A73J36j36p3k8k2M5J07J0r1J7L2j8j15J1N3J67j60K9J4L0j11J36j47Q9o2J39j16q6J25
$$ 173 309 173 100 72 50 95 202 212 121 138 170 152 37 48 101 268 108 137 151 181 70 206 59 148 86 225 109 23 148
4329A48q1QJ61R1j10j54l3L9pk6R2q2R7r1J3J7nJ30Q2m6j65NO5J6p2J70N9p2J2l1O4R0j32
$$ 148 67 75 236 327 217 63 30 69 62 36 128 46 143 52 65 82 77 207 289 243 78 83 148 164 92 262 321 249 261 230 294 384 252
3941B52k19J98j15Kr4OQ2N1o4j6J21L9n6j06J3Q9O0j30p3N8P3J6J3r4JM3J8J38j60L8N4j50
$$ 252 33 231 116 118 24 30 112 163 99 83 204 243 187 81 94 183 243 113 40 98 171 187 200 106 107 150 168 306 146 184 238 88
3566H8K1J39j49M7j00P8k6k4M4J5p2j4J9J90J01k22M0J7m5L0J5r8K1R6j20K6K6m7K67j16m7
$$ 88 109 248 99 146 46 124 98 74 118 133 61 47 66 256 357 135 175 192 147 177 192 94 115 211 91 117 143 96 363 247 200
3202B00rr8N2J6j08P5p8MO7j11J20K5p8J3O7o1l2K5J28J08j98m2p0N1j9J6Q0N4Nr7q0J93l6
$$ 200 191 93 145 161 53 128 50 54 121 10 130 155 77 90 157 96 64 89 217 325 127 85 15 66 47 63 143 197 202 105 25 218 182
2815A82q4o7J83j50O8Pk2M5j25P4n3J64p8m6Q7r4J11J3j15M0J65K8m5k43jK3J67o1l1K9q2
$$ 182 98 31 214 64 132 139 117 162 37 111 58 222 144 98 185 91 202 215 100 140 305 333 288 45 44 67 234 173 142 171 89
2451H9J40r8o4Q1j21R7L0L3k3m9M1l5J54qq1J85k0k32jk9N8k5r3O0JL9L4K1j11N2q6K19p6
$$ 89 229 131 67 148 27 124 154 187 164 115 156 121 275 267 186 371 351 119 118 89 147 122 29 89 90 129 163 184 73 125 39 258 182
2063A82k9j49J29p1P4k1k1qj4J03n0Q5n0Ko0K1N6nJ18k50R9m3nl6O2K3n9L7L0J6n0O4j08K9
$$ 182 153 4 133 62 136 115 94 86 72 175 125 210 160 162 102 123 179 174 292 42 141 98 93 57 119 142 83 120 150 166 116 180 72 101
1664A01P5N9j01m4M9O3j7k7jJ2j09M8M5o2M7l3M9J7l7n5m2R1j01J67m6R3p6m3np2K2Q7k7k3
$$ 101 176 235 134 90 139 202 185 158 157 169 60 108 153 91 138 105 154 171 134 79 37 128 27 194 148 241 165 122 117 45 67 154 127 104
1265A04J3j1k2K4M1o4K2p3J83n4p0KL4j1mK6n9O8j8k5J12j78J20m9J3Jj6oJ97j97Q0j1J1n6
$$ 104 117 106 84 108 149 85 107 34 217 163 93 95 129 118 114 140 81 149 131 106 218 40 160 111 124 125 109 103 300 103 183 172 183 127
866A27m8K4J03q9J1j9M2q5l2K2j6l1J0J23QJ0m5P5j4o5J04N8j82K6n8N6p8N0Q0l1mn6M7N1
$$ 127 79 103 206 117 128 109 151 66 34 56 40 9 19 142 150 160 115 190 176 111 215 273 91 117 59 115 37 87 167 136 132 76 123 174
467A74m9l2R5Oj1j37N9M6l2P0p8k2K0N0K5N7m1m6l7QJ6r8R6p9L8J26j91K04n7j24k2J36J02
$$ 174 125 93 188 194 183 46 105 151 119 189 111 89 109 159 184 241 200 154 117 125 141 43 139 60 98 224 33 237 180 56 34 170 272
80B72j9n7j61J53l1j14mP7Om4k6J51j19K8l1P2k9n8J05l3p6J32k4
$$ 272 253 196 35 188 157 43 39 116 122 78 52 203 84 112 81 153 124 66 171 138 62 194 170
-190A70
##PAGE=	F1=1343.23
##FIRST=	25169.313707327481097,	5807.6787752999953227,	0.15018363296985626221
##DATA TABLE=	(F2++(Y..Y)), PROFILE
5808A66j31j1J4J01k4n2O1J6J29o6j69K1Q9n7K2O4N0j02k4N2n8J10j01M2j12J5J29N8j17l3
$$ 166 35 24 38 139 115 63 124 140 269 203 34 55 144 87 109 173 223 121 97 149 91 201 100 142 30 45 174 232 115 82
5456H2P1j1P6k7oj2K8k0j03L8J30p2o9k8L4j2O1j30K09K9o1j09J16j1lK4J18r4j55J29K9J54
$$ 82 153 142 218 191 185 173 201 181 78 116 246 174 105 77 111 99 160 30 239 268 207 98 214 203 200 224 342 248 93 222 251 405
5080D05j17j04L4j72K26j6j98P4N1m1J8O7j07k4o1J19j7J9RK0j0k7r4M9P1o9p6J06p9J08l1
$$ 405 288 184 218 46 272 256 58 132 183 142 160 227 120 96 35 154 137 156 165 185 175 148 54 103 174 105 29 135 56 164 133
4716A33j1L6q7J05J01j28k1l2j8N9L9K8j13J1N3K1j42jN9K37j57q0K7P6j33J03j06J11j19
$$ 133 122 158 71 176 277 149 128 96 78 137 176 204 91 102 155 176 34 33 92 329 172 92 119 195 62 165 59 170 51
4376E1J71p9n3L3p4N9J30Q3q6j58l7L7K7m4J00j04O3r0j5K0K7J29N2k9j57M8O8K6r4J76L4
$$ 51 222 143 90 123 49 108 238 321 235 77 40 77 104 60 160 56 119 29 14 34 61 190 242 213 56 104 172 198 104 280 314
4012C14q0k2J8O0N4q6k14K28r0m3o3m3J28N7r0l2R5O4n7j12mJ35K4j36n3Q2R7On0j00qJ04
$$ 314 234 212 230 290 344 258 44 272 182 139 76 33 161 218 128 96 191 255 198 86 82 217 241 105 52 134 231 237 187 87 79 183
3636A83JQ6j63J22M3k01N0J79j80K4m5Okm7N0N7l0p7m0K45J15k27K4Nmj2O8j30K1O1j35J05
$$ 183 184 270 107 229 272 71 121 300 120 144 99 105 103 56 106 163 133 56 16 261 376 149 173 178 174 162 230 100 121 182 47 152
3261A52J5q2L00j48k4j8j05L7N8j53L7j4n1J57j35J38K0j13J8J01l6q7k0J8R0n7n6k6K9J6
$$ 152 167 85 385 237 213 195 90 127 185 32 69 55 4 161 26 164 184 71 89 190 154 67 47 65 155 98 42 16 45 61
2909F1rO7O0L4r4j00J96k3p2o8J55j32R3M2n6N9j45M2rR2m2r8J32p5L2L0l7M5R8K8l5j95J8
$$ 61 52 119 179 213 119 19 215 192 120 52 207 75 168 210 154 213 68 110 101 193 151 53 185 110 142 172 135 180 278 306 271 76 94
2521I4n0J69m3l2%n0J46j36k1Q6j26Q6O6k7jq0P9m8J86l4p5J86Lk50n6j3N3j5m4O1k4L1OM9
$$ 94 44 213 170 138 138 88 234 98 77 163 37 123 189 162 161 81 160 112 298 264 189 375 378 128 72 59 112 97 53 114 90 121 127 176
2122A76n4P6j30J89p6l0j01O9o2O1j2k4L2q4J21n7O7K9n1p9J01j5M1O4k09J61j22N2r1P0K2
$$ 176 122 198 68 257 181 151 50 119 57 118 106 82 114 30 151 94 161 190 139 60 161 146 187 251 42 203 81 133 42 112 134
1758A34o2Q3PL0n2Jp8Q3L1N4n0l0j5N8L1n2q%j21L9M6n4R1o1M8J5m6l3p5J03o6J47n3J50j32
$$ 134 72 155 162 192 140 141 63 146 177 231 181 151 136 194 225 173 165 165 44 83 129 75 166 105 153 168 122 89 14 117 51 198 145 295 163
1347A63j24L5mJ2O1l3j4j5j4L2k8L7k6M6m2R2m9j9n4N7m9Q0j8j2nJ6n5J16j45R1J1l7m9M6
$$ 163 39 74 70 82 143 110 96 81 67 99 71 108 82 128 86 178 129 110 56 113 64 144 126 114 109 125 70 186 41 132 143 106 57 103
948A03L0J59j65O3m9l5l9l8L0R6n6O5k1L9o4l2j4j9j2L7Q5o4K6J8J4k3QM7P4j12n4p0R7q9
$$ 103 133 292 127 190 141 106 67 29 59 155 99 164 143 182 118 86 72 53 41 78 163 99 125 143 157 134 142 189 263 151 97 27 124 35
549C5K0J57o4%p0J7R1p9K3Q9lk1j72P7L9k7O6m6l2K3Q0OL8o2l0q6P1J7r8P3o4lQ6j35K02j06
$$ 35 55 212 148 148 78 95 186 107 130 219 216 195 23 100 139 112 178 132 100 123 203 209 247 185 155 69 140 157 59 132 68 65 151 16 218 112
127A12l9j0J12J44o1p7j01J51q4q8l5J22n3k5k7J67j18jpO7p6l7Q3Ml6Q0l0
$$ 112 73 63 175 319 258 181 80 231 147 59 24 146 93 68 41 208 90 89 82 149 73 36 119 123 87 167 137
-190A37
##PAGE=	F1=1240.98
##FIRST=	25169.313707327481097,	5807.6787752999953227,	0.17941667139530181885
##DATA TABLE=	(F2++(Y..Y)), PROFILE
5808A40o7k8L4J11m0j05N9M7J10j2j59o6J20m3n4J28Q4j44j9N8n2J01j20N9p4k9J11M9o2p8
$$ 140 73 45 79 190 150 45 104 151 261 249 90 24 144 101 47 175 259 115 96 154 102 203 83 142 68 39 150 199 137 59
5456E9J19MN9m5m3j0M6l7j06M7J13l9n2j0P8n4lq8J43M3k0j02J03K8LM0Q1j72j12J35M6R6
$$ 59 178 182 241 196 153 143 189 152 46 93 206 167 115 105 183 129 126 38 181 224 204 102 205 233 236 276 357 185 73 208 254 350
5080C50o9p2pj85K48j2j86L9J08p9N4O8j56k5l3J10J7jM7k4k6mj23M0Q7n7n3K2k4J12m9M5
$$ 350 281 209 202 17 265 253 67 106 214 135 189 257 101 76 43 153 170 169 216 192 166 162 39 79 166 109 56 78 54 166 117 162
4704A62L0j32J13O1j13Qj2LO7m6M1j22K2P6N0j78k6R0K71j29j88M7J14j26O7k3O2j71J90m4
$$ 162 192 60 173 234 121 129 117 120 187 141 182 60 82 158 208 30 4 94 365 236 48 95 209 83 150 127 189 18 208 164
4352A64oo7l3J08N3Q7o3j32o6K6N2n1J14j16N3r1PLJ0J21K6l2j39R5O4L2j01J54J3n2q7Q0
$$ 164 158 91 58 166 219 306 243 111 45 71 123 72 186 70 123 32 39 42 52 173 199 167 28 123 187 219 118 272 285 233 146 226
3977B26N9%l5j97K40o0q3j7r2J56N3j14k1P3P7o8j08l1J65Pj47k7J12R5J3n7j36k3J44j5L1
$$ 226 285 285 250 53 293 233 150 133 41 197 250 136 115 188 265 197 89 58 223 230 83 56 168 263 276 219 83 60 204 189 220
3613B20j53K04Rk17N9K03j55n3J2m7J3n6M8J03Kr7m4K11J10k28J4j1L1l3J34j40kJ0j10J62
$$ 220 67 271 280 63 122 325 170 117 129 82 95 39 87 190 192 95 51 262 372 144 158 147 178 145 279 139 137 147 37 199
3261A99j4r7L04j60%k6j14M8N0j21j5%NJ47j04Q9M0j66KJ39oj25Q7L06j55k79RKqN5m3J3Q6
$$ 199 185 88 392 232 232 206 92 140 190 69 54 54 59 206 102 191 231 65 67 206 200 75 162 468 313 34 43 45 37 92 49 62 148
2873A48N6p3q4J75j5p0m6R4r4Q9Q2j02Q5j53K1K9NJ2j29J43m9p1L1O8P0K5Ol1j36K7n1J06
$$ 148 204 131 47 222 207 137 91 185 91 180 262 160 245 92 113 142 147 159 30 173 124 53 84 152 222 247 253 222 86 113 62 168
2498A68j7j6m0j9J33j39J6P4j00M6R8o9J5q1R4p5K17o3n7J82K1k63r7ON8k1J2Q2p8M6l4O6
$$ 168 151 135 95 76 209 70 86 160 60 106 204 135 150 69 163 88 305 242 185 367 388 125 28 34 92 71 83 165 87 133 99 165
2122A65oP9j37J37p8on3pn0O2Kl5N3j02R5n6N0R6q6r8J74r6J00Kj58K10j29M0r5L2L3L7J7
$$ 165 159 238 101 238 160 154 101 94 44 106 108 73 126 24 119 63 113 209 123 25 199 103 203 205 47 257 128 168 73 105 138 175 192
1735A92j9M4o0o4l3J33l4O4qj2o9N0O5m5j6l8j28O0J8l7J30r6M8Kl0K3q1L6KJ09o7J77j56
$$ 192 173 217 157 93 60 193 159 223 215 203 134 184 249 204 188 150 22 82 100 63 193 97 145 147 117 140 59 95 97 206 139 316 160
1347A60q3l4N5j6N5m0nl7k6R4Jm9j5R1j3J5l5qr8R3m9J22m9O7j16M7m1M6q2M5P4p9l5L6O4
$$ 160 77 43 98 82 137 97 92 55 29 123 124 75 60 151 138 153 118 110 12 105 56 178 129 196 80 127 86 132 50 95 169 90 55 91 155
937A55J16j23O5j12o1mk3LO9M4O9m5L0l0k6n9mL1N9M8j58M5P1km2L6j1R2l3j09p8J17q0J2
$$ 155 271 148 213 101 40 36 13 16 85 129 198 153 183 153 127 68 64 95 154 202 44 89 160 158 116 152 141 233 200 91 13 130 50 62
538F2J81q3j4p0rJ38j18O6Q0j7k7j71Q2M0k6M7j7k6j4J15%J6p8rq5J09lq8O4n1k3Ml2J49r9
$$ 62 243 160 146 76 67 205 87 153 233 216 189 18 100 140 114 161 144 118 104 219 219 235 157 148 63 172 169 81 145 94 71 75 43 192 93
127I3L6qP0J59r0q9o2J44j48k1n3J51r7l2k8J84j09j0M2J0r0KJ8L5J3J1l8
$$ 93 129 121 191 350 260 171 109 253 105 84 31 182 85 53 25 209 100 90 132 142 52 54 72 107 120 131 93
-190I3
##PAGE=	F1=1138.72
##FIRST=	25169.313707327481097,	5807.6787752999953227,	0.46355277299880981445
##DATA TABLE=	(F2++(Y..Y)), PROFILE
5808A05j2j9L3J08m1j57O3P5R6L7j41j22J12mr2J45P6j68oN5m9R2j32J04n2j9N0K9j7j24J69
$$ 105 93 74 107 215 174 17 80 155 251 288 147 25 137 133 41 186 262 94 88 143 94 186 54 158 106 87 137 166 149 25 194
5444A94K6Rm8n3j8Q0m8j16N5O9j1m2N3R1q1p8l3P3N4j7p3R7N6OM6M9k19q1J41Q4Lj6k7m8j66
$$ 194 220 229 181 128 110 190 142 26 81 150 139 97 150 241 160 82 49 122 176 159 86 183 239 245 291 340 121 40 181 265 268 252 225 177 11
5033A1K42j5j58L0J58j32Q1O9j81n1J6Q5K3mP4n7m8J9j19J8J04n0Rr8JJ15n1R2Qj48J18K9
$$ 11 253 238 80 110 268 136 217 286 105 54 70 155 178 174 248 191 143 162 43 61 165 115 124 26 27 142 91 183 191 43 161 190
4657A90q6KK5L4O1j24M8j14M1R2P0k15J0O1K70q6k39L9J32r4L3M2J2j77J51oL9j37K1J23l2
$$ 190 104 106 131 165 226 102 150 36 77 169 239 24 34 95 365 279 40 79 211 117 150 192 204 27 178 172 211 74 95 218 186
4294A86J04m9q6j16J7P2n5J32j28P6r6J9Rk7R5J7n2n4R1L1L5j01J20MNj71J38O4o3Qj62K30
$$ 186 290 241 155 39 56 128 73 205 77 153 57 76 85 58 153 170 118 64 155 186 221 120 240 244 249 78 216 280 217 225 63 293
3918B93l3j10L5j30J58L8j27J5N3P3p7r4o7J78Pj53k0J55P1K9m1j58l0J39k3j5j00K45m0j97
$$ 293 260 150 185 55 213 251 124 139 192 265 188 94 27 205 212 59 39 194 265 294 253 95 65 204 181 166 66 311 271 74
3566G4L7K01r5j38N0o0Ql5J4J55K1j36JJ68Q3k28Rk2N0j0J76j31l2n1j8J55m4r5K71j53L0
$$ 74 111 312 217 79 129 69 77 42 56 211 232 96 97 265 348 120 129 107 157 147 323 192 160 109 91 246 202 107 378 225 255
3202B55l5r7M7Np7j4k6P1J15n7J5Q7j87m0J51J9j25K43O02k57o04Ok3nN9j5n0M6P2m9n4J48
$$ 255 220 123 170 175 98 84 58 129 244 187 202 289 102 62 213 232 107 350 952 695 91 97 74 69 128 113 63 109 181 132 78 226
2826B26j6o8k6L8m5O2J19j53J14j56K4N7p2O5j02Q5k1n8k5R8R9l2j8m3p7K4j7K5J8Nq0NJ04
$$ 226 210 142 116 154 109 171 290 137 251 95 119 176 104 169 67 152 131 73 48 146 245 213 195 152 75 99 82 107 125 130 50 55 159
2439A59j04L5O1n8j3J17q8K6m3P3j08K47j01k9J74L6k71n7l3O9m7O0J15j33P9q5P2K5O1j10
$$ 159 55 90 151 93 80 197 109 135 92 165 57 304 203 174 348 384 113 56 23 92 45 105 220 87 166 81 153 178 239 129
2087A29P5p6M0k1q8l2Q5Qo7O6m8M0p6M8J25j01n3J71j62J42m6j10K40q7j0o3k2M7J09n1l2
$$ 129 204 128 168 147 59 27 112 120 53 119 71 111 35 83 208 107 54 225 63 205 159 49 289 202 192 129 107 154 263 212 180
1723A80N9p8j08J4J61j09J01J3Nj12L6P1rj7q3j09J11n5j8J60j33N5j9J0N8r1j6O5O4p8J76
$$ 180 239 161 53 67 228 119 220 233 238 126 162 233 224 207 124 15 126 71 53 213 80 135 116 126 184 93 77 142 206 128 304
1359C04j48j9r6P8m5O5m7ml1l0J21N7r0r5J41J4j1l1l8o0O7JR7o0J36j72K3Jm5k0%J27j13
$$ 304 156 137 41 119 74 139 92 88 57 27 148 205 115 20 161 175 164 133 95 35 102 103 200 140 276 104 127 128 83 63 63 190 77
972G7K3k4R1P7q7Q8j80ok5J5j8k2J60O0r0J9Qj7r9J5Q1P9J5k27L5J20K1o1J6o6J08M0j27q1
$$ 77 100 76 167 244 157 245 65 59 34 49 31 9 169 229 139 158 166 149 50 65 146 225 240 13 48 168 189 128 144 78 186 226 99 18
573A8J19n8J1J48r2j8l4k6J50j49R7P1l9l4r3K9M6k3K2Kk0o0J30J0%p9Oj3Q8m1o6O0j2o7l9
$$ 18 137 79 90 238 146 128 94 68 218 69 166 237 198 164 71 100 146 123 145 147 127 67 197 207 207 128 134 121 209 168 102 162 150 83 44
162D4L7Q8k8M9oL9J28r1q6n4J28k08P3l5J24j11m4l9J98r8QP5o0l7mk2J8O5n8k5
$$ 44 81 169 141 190 184 223 351 260 174 120 248 40 113 78 202 91 47 8 206 108 116 191 131 94 90 68 86 151 93 68
-190F8
##PAGE=	F1=1036.46
##FIRST=	25169.313707327481097,	5807.6787752999953227,	0.59417986869812011719
##DATA TABLE=	(F2++(Y..Y)), PROFILE
5808F9K1oL4R2k0j27J9P4Q6P6j22j43O5L7q6J33L0j66K1L3m9Q9j16J55o1NlJJ1j28J80M9o1
$$ 69 90 84 118 210 190 63 82 156 242 318 196 53 118 155 69 202 232 66 87 120 71 160 44 199 138 143 140 141 152 24 204 253 192
5420A92m2k7k8J07n4j35P2OLm5J33R5j04j34K5K4M2m9k7J08N7J2M1K8k09q5J34J39j00K5J6
$$ 192 150 123 95 202 148 13 85 91 94 49 182 277 173 39 64 88 130 81 54 162 219 231 272 300 91 6 140 279 179 204 220
5056B20n1j49K24l2j16P0J67j95R3P7j84p8O1M9MJR6p9o0M1r7j5J24n0O8j17n5P8l8J26k2
$$ 220 169 20 244 212 96 166 333 138 231 308 124 46 107 156 160 161 257 178 118 159 62 47 171 121 189 72 17 95 57 183 161
4693A61j31J09J2m5m0O8O9M6j85N2m1J8P7Q5k35M9J3K48l7k29MJ35n7KR1k2j64Q3L1P0j48
$$ 161 30 139 151 106 66 134 203 249 64 116 75 93 170 255 20 69 82 330 293 64 68 203 146 148 239 217 53 136 167 237 89
4329H9N1J10j01J24m4l5j67J7Q8o3J41j32J07j02J0J5l1N2K9q2M7P6l5L7r7Q0J7O1k31J66
$$ 89 140 250 149 273 229 194 27 44 132 69 210 78 185 83 93 108 77 129 158 76 123 199 164 201 104 184 201 262 31 197
3977A97P8j20L2j09J97j1j18Q0j55J42J0j27P1K9N3o8q2o2J32J7j19n7K02L8L8k2j47l4R8
$$ 197 275 155 187 78 275 264 146 226 71 213 223 96 167 196 249 181 99 37 169 186 67 10 212 250 288 266 119 85 183
3636A83k2m2j8K43q9j65%J70j8j66L1l2j8J9n7K06K6j85P6J33K9k16Ol0N3N3J76j13n6j07
$$ 183 161 119 101 344 255 90 90 260 242 76 107 75 57 76 19 225 251 66 142 275 304 88 94 64 117 170 346 233 177 70
3284G0O1J48n7q6K04j34O9m5n8L4n5m6Nm4J34N5l9m7J75j84n5J16L0r4L98Q98l49q78q8m2
$$ 70 131 279 222 136 340 206 275 230 172 206 151 105 110 66 200 255 216 169 344 160 105 221 251 157 555 1453 1104 226 138 96
2932I6K3L8M9m3r5Q5l8rJ11l4n6j0RKJ5J56j93J25j52M6P4j02Q4q2K5ML7ol6J14n8qp8m2R
$$ 96 119 157 206 163 68 153 115 106 217 183 127 117 126 128 143 299 106 231 79 125 199 97 181 99 124 128 165 159 123 237 179 171 93 51 60
2521F0K7l0N5Lj06K1O7m1L4P1l1o8J07q6L7OL6j36K78j49MJ65M5k70%p9Q5q3R6J47j73J09
$$ 60 87 57 112 115 9 30 97 56 90 161 130 62 169 83 120 126 162 26 304 155 159 324 369 99 99 20 105 22 118 265 92 201
2146B01j30P2L3K7n5J3o6R4j0j60pJ21J0j27P7K0L0j33O4J12r9JJ42j87J47p4p3K51l1o4k0
$$ 201 71 143 176 203 148 161 95 189 179 19 12 133 143 16 93 113 143 10 74 186 87 88 230 43 190 116 43 294 263 199 179
1782A79n2M8J42j12k6O8r7r6J4J73j77J57J0J6j31J2M6L9nj15m8J39j30nJ71j62O9m3N3P0
$$ 179 127 175 317 205 179 247 150 54 68 241 64 221 231 247 116 128 174 213 208 93 45 184 54 49 220 58 127 84 137 207
1430B07r5l6R8J9p2J49j23Oj20R7n4P1m9j8Lj5R8J07p9j61J16L6Km5o6j5M0L7N9m7J86j75
$$ 207 112 76 174 193 121 270 147 153 33 130 76 147 98 80 83 68 166 273 194 33 149 185 187 142 76 61 101 138 197 150 336 161
1054A61l9L2o9pnJ34j34N3o5J06N7p2J17k23L4n9O8jk5J27O0j43J1L4jj07J0J33Q7j4j89o0
$$ 161 122 154 85 78 73 207 73 126 61 167 224 152 269 46 80 21 89 88 63 190 250 107 118 152 151 44 54 187 274 260 71 11
678A1J60N0p1k2r1R4R4j13r5J27l4lQ9q7nL1l6J18j62J15O5o8m1%l1M6qlJ6k4m1N6L6on6J1
$$ 11 171 221 150 128 37 131 225 112 17 144 110 107 196 109 104 135 99 217 55 170 235 167 126 126 95 141 133 130 146 122 81 137 173 167 111 122
256A22N0O0q8l0N4N0j33ML3L4M1M9j1K2N6n8o2o5Q8j78J03kO4j07j7n9J76p9K1J01j24K6k6
$$ 122 172 232 144 114 168 218 85 89 122 156 197 246 235 257 313 255 193 128 216 38 141 139 203 96 79 20 196 117 138 239 115 141 115
-132A15k2l3J19j16K4
$$ 115 93 60 179 63 87
-190H7
##PAGE=	F1=934.202
##FIRST=	25169.313707327481097,	5807.6787752999953227,	0.46757274866104125977
##DATA TABLE=	(F2++(Y..Y)), PROFILE
5808D0K8J4K9P0K4p1j6L6P7J02j00j55J0P0o9J26m0j20M3Jm8Q2o2J79r9L8l0k8J5q6J49O5
$$ 40 68 82 111 181 205 134 118 154 231 333 233 78 88 158 89 215 175 55 98 99 51 133 71 250 151 189 159 131 146 60 209 274
5432B74j22l7K9k7R7o3j33Q1m9pj4J66R5j38j40P8LLp5K9J06K1L0K6J6j28o4L1J95j62K3M4
$$ 274 152 115 144 117 214 151 18 99 50 43 29 195 290 152 12 90 93 96 21 50 156 177 207 233 249 121 57 88 283 121 144 188
5056A88qj61K14o1o1J22J59k51Q5R2j70q4Q0J4k9jJ14q7m5N6p5l5J22n2J11j10o4k2j8J43
$$ 188 180 19 233 172 111 233 392 141 226 318 148 64 144 158 129 128 242 155 110 166 91 56 178 126 237 127 63 41 23 166
4704A66m8r3Q3Rnr1J01J02K6k02M1M6rK5R8k21O3j5K01Jj96kJ22m4j3J17l5j53J9N8Q3j09
$$ 166 118 25 108 117 112 21 122 224 250 48 89 135 126 151 249 28 91 76 277 278 82 80 202 158 145 262 227 74 93 151 234 125
4329A25N9P1j36J32m5J1k00K4J03p2J28j27J33j02j6K0j0RN6j14J23O5j15M0r2M3N2Q7k10
$$ 125 184 255 119 251 206 217 17 41 144 72 200 73 206 104 88 108 98 107 163 49 172 237 122 162 70 113 165 252 42
3988D2J26R6j44K3m7J53Oj10J04j65J22l0j14J31lK4k9q6k8N4K7n5m3J69J6K2qj04m3M1j3
$$ 42 168 264 120 143 96 249 255 145 249 84 206 176 62 193 190 214 185 99 71 125 152 97 54 223 239 261 253 149 106 147 134
3624A34m6N1K30j25j50k7J08O6j23l0J1m1O4j04K13K3k18J48J04m6j55k0l7M2J23J43q8o9
$$ 134 88 139 369 244 94 67 175 241 118 88 99 58 122 18 231 254 36 184 288 242 87 67 30 72 195 338 250 181
3296A81j45J04J54m5q2J09j06J18n2k4L1j12l9L5o7K00m3o5l0K63j81m3P2K9n7N36J149m27
$$ 181 36 140 294 249 167 276 170 288 236 212 243 131 92 127 60 260 217 152 122 385 204 161 233 262 205 741 1890 1463
2967A463j094k19m0O1MJ23l4k26R3n6N2O1o7l2%K6L8n5J98j89Q4j42Q1Q3q7O6p9k0K6J08K0
$$ 1463 369 150 110 171 175 298 264 38 131 75 127 188 121 89 89 115 153 98 296 107 191 49 130 213 126 192 113 93 119 227 247
2603B47j48J00n1M7r7o6qN3JM2l2o6kK2K7K3J14m1j09P0o3M6M4mj43L02j96L3J52M9k60L8
$$ 247 99 199 148 195 98 32 24 77 78 120 88 22 20 42 69 92 206 165 56 126 63 109 153 149 6 308 112 145 297 346 86 124
2228A24j12J09j13J17J64j96J27j54O4K3%Kl8m0J33k2j56j9J50J6j30NQ9M1j60M4Q2o8K3J06
$$ 124 12 121 8 125 289 93 220 66 130 153 153 155 117 77 210 188 32 13 163 179 49 54 143 184 24 68 150 82 105 211
1876B11j54J07q0m4K29K6j07K4n3L1J39j55mO2j06m7j8J64j80J70oK5j24j2kP7K0j26PJ58
$$ 211 57 164 84 40 269 295 188 212 159 190 329 174 170 232 126 79 61 225 45 215 209 234 110 98 96 173 193 67 74 232
1523B32j74lJ60j72Q1o9P5P5r1l6J11k1l4R9j06j0r5J06l0N6m3m4M4nO7J39m7j80L8M0K5n9
$$ 232 58 55 215 43 124 55 130 205 114 78 189 168 134 233 127 117 22 128 98 154 111 67 111 106 173 312 265 85 123 163 188 129
1148A29o8JK6N5K3j6K16j48j07M4l0l3J5J10j23L2p5J08O1q2J33k30K1oQ6J5l8O4P0j77RL1
$$ 129 61 62 88 143 166 150 366 218 111 155 125 92 107 217 94 126 51 159 220 138 271 41 62 56 142 157 119 183 253 76 85 116
772A16K2o8k4J67P9l7j27p1J12O6p0m2l6qJ25p6j27J45rk7J7o6K9Q5m6P1j53J17O4r7n0R0
$$ 116 138 70 46 213 292 255 128 57 169 235 165 123 87 79 204 128 1 146 137 110 127 61 90 175 129 200 47 164 228 131 81 171
397A71q4K3L3l5L2l8M8r7P1mj1J4P3L5j35J6M5J20j95M7K9j0R0N3l0J6m3Nj4p3J4n8N3L8j4
$$ 171 87 110 143 108 140 102 150 53 124 120 109 123 196 231 96 112 157 277 82 129 158 148 238 291 261 277 234 239 225 152 166 108 161 199 185
-14A85q9L6p9J24n1J5J25j66O9n0rp7J65j44N9
$$ 185 96 132 53 177 126 141 266 100 169 119 110 33 198 54 113
-190A13
##PAGE=	F1=831.945
##FIRST=	25169.313707327481097,	5807.6787752999953227,	0.19570915400981903076
##DATA TABLE=	(F2++(Y..Y)), PROFILE
5808C3LM4J3M9P3j1m2j0O4J13p3j57m8R3l5J11j14k9L9j9l0M7j7J98j58P7k5m6nm9J11P7j48
$$ 33 36 80 93 142 215 204 162 152 216 329 256 99 51 144 109 220 106 77 116 97 67 114 97 295 137 214 189 143 138 89 200 277 129
5420A29l4Q7j9N1p2j00P1n6n1R1R9R1j94n9R3k1j5Qj2P1l4O9MKl4n8p3K36j42l2L4N2j72K02
$$ 129 95 182 163 214 142 42 113 57 6 97 196 287 93 34 127 106 91 99 87 158 124 193 197 199 165 107 34 270 128 96 130 182 10 212
5021B12r2JJ59J49k85N9J09j39q5Q1pn3l1J29q0LN4o0l4Q7m5J28r7n9m5l5J18o4o0N6J2K4
$$ 212 120 121 280 429 144 203 312 173 88 169 162 109 78 207 127 130 184 124 90 177 132 260 163 104 59 24 142 78 18 74 86 110
4646A10p3N4J28J0j66J3J09k9m3J06j75N3J5J32jj57L4J05q1JJ13k9j40k5O5P8m3N4J2j27
$$ 110 37 91 219 229 63 76 185 156 113 219 44 97 112 244 243 86 120 225 144 145 258 229 89 64 129 207 164 218 230 103
4294A03J18m5M2j88J6J16p3Q5j08J40q6n0K6J7k2R3j47J60N1j80M7r1K0R3P3j43O7J08j25
$$ 103 221 176 218 30 46 162 89 174 66 206 120 70 96 113 91 184 37 197 248 68 115 24 44 137 210 67 134 242 117
3953A17j5OJ19K4j02J00j57J07p7r3J80l8oL4j05Oj8L1JrJ22J6k2lm3n3j5lj6Q6K12j43j62
$$ 117 102 108 227 251 149 249 92 199 122 29 209 171 165 199 94 100 82 113 114 105 227 243 221 218 175 122 107 104 88 174 386 243 81
3566H1oOJ39o3o3M0m6P9j25J84J7j84J59P8j30l0p4k6K4J45R3n8o7j51R6J70j2q3lp1J73n3
$$ 81 75 81 220 157 94 134 88 167 42 226 243 59 218 296 166 136 62 36 60 205 298 240 173 22 118 288 276 193 190 119 292 239
3190B39j3N1j49o4Q4j14K69j85J07P7J08j93oL4K8m0O37J309m76j213l63oR5l2J84l1l03R3
$$ 239 226 277 128 64 148 34 303 118 225 302 410 217 211 245 273 233 870 2179 1703 490 127 121 216 184 368 337 34 127
2862A27r1J01Nj09oJ3Q4O0j44K46j46Jj19J09Q5o6M4q3m5M3J36M3j94M9k1J06q8r3K0j0O8
$$ 127 36 137 142 33 27 40 124 184 40 286 140 141 22 131 216 150 194 111 66 109 245 288 94 143 122 228 140 47 67 57 125
2498A25Op5j4jj2N9OJ72p5j41K9k5N0O2m7r9K92k15L7J33N0k40M7j13J25j11J08J49j99J35
$$ 125 131 56 42 41 29 88 94 266 191 50 79 54 104 166 119 20 312 97 134 267 317 77 124 11 136 25 133 282 83 218
2146B18j49M1LJ9J9p4J1J32m8j03m7J72L3j06r2J30N2j58KN7qoP8r6N8p2pJ62P3j32O1l9O
$$ 218 69 110 113 132 151 77 88 220 172 69 22 194 227 121 29 159 211 53 55 112 104 98 176 80 138 66 59 221 294 162 223 184 190
1758A90J08j73K7M1r5Nk6J10q7R2k6L8q7j3pK4O4j22L4J63j93NJ30j54P9j06P4Q5p8l2J20
$$ 190 298 125 152 193 98 103 77 187 100 192 166 204 117 104 97 121 185 63 97 260 67 72 202 48 127 21 95 180 102 70 190
1394A90n3L2M2j15n8M8K5K2K5l3p6Q0ML4J46oj79k0PM5o7l2k0J4O1OJ7K28j03j65L5K3n6K9
$$ 190 137 169 211 96 38 86 111 133 158 125 49 129 133 167 313 307 128 108 115 160 93 61 41 55 116 122 139 367 264 99 134 157 101 130
995A30Q7q9j9o1R6Q3j08J25k07j4J07P7K2p4pQ5j58J4j9N4k4l7J61N4n5m3o8N1O4n8l4Qj03
$$ 130 217 128 109 48 144 227 119 244 37 23 130 207 229 155 148 233 75 89 70 124 100 63 224 278 223 180 112 163 227 169 135 143 40
608D0J37k7j24J13K1n3n8k8P7J04n5K5j25J03O5j21m4J48j12l3J01q0N7n7J40j48KRL9K7M4
$$ 40 177 150 26 139 160 107 49 21 98 202 147 172 47 150 215 94 50 198 86 53 154 74 131 74 214 66 68 77 116 143 187
244A87J6j77O7L7J83k28O2L6m4J14O1o1K4j48P9N0p2p6M8J4P3q8p1J01r1N6k0j5J54j79P9
$$ 187 203 26 93 130 313 85 147 183 139 253 314 253 277 129 208 258 186 110 158 172 245 157 86 187 96 152 132 117 271 92 171
-120A71p1J3q5J81j51O4
$$ 171 100 113 28 209 58 122
-190A22
##PAGE=	F1=729.687
##FIRST=	25169.313707327481097,	5807.6787752999953227,	0.18901331722736358643
##DATA TABLE=	(F2++(Y..Y)), PROFILE
5808D8k8O3j4L7J09M2o2m7M7J12m4j47r0R6J0Q1j69O2K7j9j0mKK18k26J15J6n0m1k8O5Q6j41
$$ 48 20 83 69 106 215 257 195 148 195 307 263 116 26 122 132 213 44 106 133 114 104 100 102 320 94 209 225 175 134 106 171 257 116
5420A16j4J23j1j6q0n3N3l0o7J26M8Q0k41L0J04o7K0L8m3L6q2J26j6k6L8m7j20K14q3m4o1
$$ 116 102 225 214 198 118 65 118 88 21 147 195 275 34 64 168 101 121 159 116 152 70 196 180 154 192 145 25 239 156 112 51
5056E1J04j52J79j16N7J70J38k87K9J20r8r1P7po3p6J28o2O4L7n0k1L4k8J13p2m7j4o9P5p6
$$ 51 155 3 182 66 123 293 431 144 173 293 195 104 181 174 111 35 163 101 165 202 152 131 165 137 250 178 131 117 48 123 47
4693D7m0L5K1L6k4k9J42Nj10lJ28m0r5R8j13L1Q2Q0n2j20Q7R3j55M8P8j1j22l9N2N4L2L9n2
$$ 47 7 42 63 99 75 46 188 193 83 80 208 168 73 171 58 89 171 251 199 79 166 259 104 152 230 219 97 58 110 164 196 235 183
4305A83p7P7l6N5j43lJ23o8K2p0J18m8o7K9K2l5J27j62J47L5j77K6n0M0N0K4m6OJ04q2o1M3
$$ 183 106 183 147 202 59 56 179 111 133 63 181 133 66 95 117 82 209 47 194 229 52 78 28 68 118 142 96 102 206 124 63 106
3930A06J15M3j08O9j33J04j07o5J85o8j7R9j33L5q1L8K3L7Q6K7p5rK1o1m9mL7R2J90j48j98
$$ 106 221 264 156 225 92 196 89 24 209 141 124 223 90 125 44 82 105 142 228 255 180 171 192 131 82 78 115 207 397 249 51
3566E1P2n1J21j8o9O2l9P3j52J60J3j32J41N6j96J10j31qK4J08L8k1n2j28M6J87L1q7j11l3
$$ 51 123 72 193 175 106 168 129 202 50 210 223 91 232 288 92 202 71 63 87 195 233 212 160 32 78 265 296 209 98 65
3214F5K21m7l3R0j51j08J41j39K86k83N68L8k28k26N6NL6o0O82J346m85j212m81N6J06n3K10
$$ 65 286 239 206 296 145 37 178 39 325 42 610 648 420 194 250 255 291 231 913 2259 1774 562 81 137 243 190 400
2897D00l5l29J16o5M5l7kl7%Q8P4j92K41r5q3m8Q4Q3n9L6q0n8O0J14N6j74j7J9J34p0r4M5
$$ 400 365 36 152 87 132 95 93 56 56 144 218 26 267 172 89 41 125 208 149 185 105 47 107 221 277 103 86 105 239 169 75 120
2521A20q2J16k6p7MNk0O4j4K20j08j64MJ7M8N9r5l5K72j94RJ10M8k09L5o4J06j05J02R9j86
$$ 120 38 154 128 51 55 60 40 104 90 310 202 38 42 59 107 166 71 36 308 114 123 233 281 72 107 43 149 44 146 245 59
2157E9J35j10pj7J02k3r8P2R6p6l6o9J96N1q1j33J04M9j36l8N4M2o2O3l8K1n6K7P0J07j37
$$ 59 194 84 77 60 162 139 41 113 209 133 97 28 224 275 194 61 165 214 78 40 94 136 74 137 99 120 64 91 161 268 131
1793A31Q6k9j9O3j62N7Pn8M4J0K0Ojm5N6l3RL3p1J01j27L5J53j97L1Q9j27P4j10J4J00o0k7
$$ 131 217 188 169 232 70 127 134 76 120 130 150 156 155 110 166 133 142 175 104 205 78 113 266 69 100 189 62 136 26 40 140 80 53
1406E3J36q0J02qj46K0R9r6R4j9k2j03J00J1RJ26L2j49l1p1O4p1K9j9l3M5L3J7K24n0j99O
$$ 53 189 109 211 203 57 77 176 80 174 155 133 30 130 141 150 276 308 159 128 57 121 50 79 60 27 72 105 122 346 296 97 103
1031A03O5o3K5Q0n3p0l8P8J03j27R0j62M0J39O7J4j20q0J03q7J1q7Q3Jk2J31J4p0N3o1j0M9
$$ 103 168 105 130 210 157 87 49 127 230 103 193 31 71 210 277 291 171 91 194 107 118 31 114 115 93 224 238 168 221 160 150 199
655A99l4rK3j54J29K7j16N8N4n6j03J4Q8R0o1nq8O9O9j35OJ41j02n8J19j33Q5o9K05r6j34
$$ 199 165 156 179 25 154 181 65 123 177 121 18 32 120 210 149 144 56 125 194 59 65 206 104 46 165 32 117 48 253 157 23
291B3K2Q3M1j5Rj05LL1K33k27M7M3o4J16P0j00N8j71O8J14o5j48J13lQ9j40o3J69r1j5K0p5
$$ 23 45 128 169 154 163 58 61 92 325 98 145 188 124 240 310 210 268 97 165 279 214 66 179 176 265 125 62 231 140 125 145 70
-85G0J86j61N6q7M2n6J56j50N0
$$ 70 256 95 151 64 106 50 206 56 106
-190A06
##PAGE=	F1=627.429
##FIRST=	25169.313707327481097,	5807.6787752999953227,	0.16701722145080566406
##DATA TABLE=	(F2++(Y..Y)), PROFILE
5808F3k4N0m2L3J18Q4p3o5L3R1j2j28q6O2M7M4j74J02K3rPn4oK34k64J25P5m4o9k8RR0j17
$$ 63 39 89 47 80 198 282 209 144 177 268 256 128 42 104 151 195 21 123 146 137 144 90 84 318 54 179 254 210 141 113 122 212 95
5420I5K6J38%r1q6jK5J1q3J24L6O9j51j6J08j30Q8K5p1J7j10J76j7o3P2k7j05J37l2Mj24N3
$$ 95 121 259 259 168 82 81 106 117 34 158 194 263 112 96 204 74 162 187 116 133 23 199 182 119 191 164 59 196 164 168 44 97
5045I7r0J45j29R7J52J21k58J6J13m9j07P7Rp5o7P1l9J16J0m1nk1KO3k1m2J4q9M9r3OmL2K7
$$ 97 7 152 23 120 272 393 135 151 264 215 108 185 194 119 52 123 84 200 210 169 164 143 145 208 187 145 159 70 119 26 32 28 60 87
4646H7Ro4J03J8n7OR6m2q2M3m7J5J36M8j18q8J34Q4k32J10K7J2j02l5M4J7R3J5r7qJ3j3N6
$$ 87 96 32 135 153 96 102 198 156 74 117 70 85 221 269 151 63 197 281 49 159 186 198 96 61 105 122 215 230 133 125 138 125 181
4258A81q5k3J16o2m2j7O9J0o2K3jk5J45j57J00K7r0l8MO1l1k2N3m3O7l7r2N6J40N9j25K0r1
$$ 181 96 73 189 127 85 68 137 147 85 108 107 82 227 70 170 197 107 69 73 134 103 81 134 91 158 121 29 85 225 284 159 179 88
3871H8J03q4n3J31p3PJ33j55N1j28O0nQ4O7L5j13k7P4o2m6k6Q3R3J62j44k19J49m5L4Lp6Q8
$$ 88 191 107 54 185 112 119 252 97 148 20 80 75 159 226 261 148 121 195 133 87 61 144 237 399 255 36 185 140 174 177 101 189
3495A89k1N1j76J41J1r0J18L2j71J77j78NK4N5rJ9k8j03J5J71O9r0j49k8K34l3q2J37j13j37
$$ 189 168 219 43 184 195 105 223 255 84 261 83 88 112 167 158 177 149 46 61 232 301 211 62 34 268 235 153 290 177 40
3143D0J69j06K26r1Q73n5o36k73J30j7N3j15O66J246m48j094n34J17R2m4J93n1l15J74l6n0
$$ 40 209 103 329 238 1111 1056 420 147 277 260 313 198 864 2110 1662 568 34 151 243 199 392 341 26 200 164 114
2838A14l2J23n8j4K5R0j62J50n3j43L3L6Q0p1N6o2p2P1N6N3j13m9L6J22m2p5O2j26J22n0k4
$$ 114 82 205 147 133 158 248 86 236 183 40 73 109 189 118 174 112 40 111 167 220 107 58 94 216 174 99 161 35 157 107 83
2474H3j6Jl0P7m0K47j23j73J0L5M2M2j36L5K34j50k9Q7L8j66K4qP9r5R4K7j66J34m6p4j8J85
$$ 83 67 68 38 115 75 322 199 26 36 71 113 155 19 54 288 138 109 196 234 68 92 84 163 68 162 189 23 157 111 37 19 204
2099B04q6q6J05L6r0L1q2K14O3n9j52O7K8r9o3P9N1j07N9mKl7M4j5J27j25R4l2m4L4j14N5
$$ 204 118 32 137 173 83 114 32 246 309 250 98 165 193 94 31 110 161 54 113 109 111 74 118 103 230 105 199 167 123 157 43 98
1723I8l2PO0N5l1L7q4n9P7J5L0O3j01J04j46L2J29j93P2M9j07P3o5k7L8m2jJ45j10J57m6j68
$$ 98 66 73 133 188 157 194 110 51 128 143 173 236 135 239 93 125 254 61 133 182 75 148 83 56 94 52 51 196 86 243 197 29
1347B9J53Q1k25J74o7j3j11R0J9lQ2O7r5k1j21P4p4P4J7l1k1O6l1J98Ok09l1Q1n2LR5l6r3
$$ 29 182 263 38 212 145 132 21 111 130 127 209 276 181 160 39 113 39 113 130 99 78 144 113 311 317 108 77 158 106 109 204 168 75
960G5k3N8J07j21L5j06J13J40N9pj58j43J28j0nj08P7rJ5R9l5q0J49n6o9K9LJ9J6j55J05P5
$$ 75 52 110 217 96 131 25 138 278 337 330 172 29 157 147 142 34 111 102 117 216 181 101 250 194 125 154 157 176 192 37 142 217
584B17j07j0Q8l3r1j3R5O0o6rn4J4P2j34O1J06n9qM6j41O9p1K28l2j99NJ09M0o3J8Kj06J8
$$ 217 110 100 188 155 64 51 146 206 140 131 77 91 163 29 90 196 137 129 175 34 103 32 260 228 29 34 143 183 120 138 140 34 52
197E2K64j96J2M0o6R5P6j34J21o7q0J63n6j75J24JQ0j60p1K32q0p4P6j62K11j21J4r7O6j5
$$ 52 316 120 132 172 106 201 277 143 264 197 117 280 224 49 173 174 254 94 23 255 175 101 177 15 226 105 119 22 88 73
-155G3J13j49L6
$$ 73 186 37 73
-190G3
##PAGE=	F1=525.171
##FIRST=	25169.313707327481097,	5807.6787752999953227,	0.12339250743389129639
##DATA TABLE=	(F2++(Y..Y)), PROFILE
5808G2j8L7n9K8J03J09o4p0L6M6J8j07p2L5O0J3j27Q8K9kK7r7l0K38j82L4J18l7p0l9n3Q2
$$ 72 54 91 32 60 163 272 208 138 174 220 238 131 59 94 154 167 40 128 157 155 182 85 55 293 111 145 263 226 156 117 64 146
5432A46p9O8J37J5j54r1M3pO2o4N1O1N9m9p2R9j92J62j2j00M1j03J62Pr0O3nq5Q5j6P3q9j07
$$ 146 67 135 272 287 133 42 85 78 140 76 127 188 247 198 126 225 33 195 183 83 124 21 183 190 100 163 158 73 158 142 215 126 19
5045A9j0J34j23R4J18Q5k05L3Q4jj23Q9K3j02l5K1k0J47k4l1Pn8L4j6O9n0J9q0L2r3L1k4M4
$$ 19 9 143 20 114 232 317 112 145 229 228 105 194 217 115 80 101 81 228 204 173 180 122 156 140 209 159 178 98 130 37 68 44 88
4657H8lJ2j0j3N0k1K8K9l0j0n4J3K9J36J6j61n5J57P2k32J20rK3r0k6O1j9J15j0q1K9o6K4
$$ 88 85 97 87 74 124 103 131 160 130 120 66 79 108 244 260 99 44 201 273 41 161 152 175 85 59 120 101 216 206 125 154 88 112
4270A12O2m2l6R2o1p8L4PP7o4Pk8RJ33j30N3N1l6q8M0P3r2KQ2p5J2lq5J8J85O5j41l6k7Q5
$$ 112 174 132 96 188 127 49 83 90 167 103 110 82 91 224 94 147 198 162 74 114 187 95 97 179 104 116 113 28 46 231 296 155 119 92 177
3859A77k6n7M3l2L9J43j63M1j37P1m6J01O8K9j25m5J04n9j7n1J01R5J35j40j82J74o0k0J7
$$ 177 151 94 137 105 144 287 124 165 28 99 53 154 222 251 126 81 185 126 109 58 159 254 389 249 67 241 181 161 178
3519A78q7R6J2J9j89J24J0o1Q7Pn5J61k06J1J5Qm0N3Jq0K5J08R2r1q0o0J81j6j46J74l7j51
$$ 178 91 187 199 218 29 153 163 102 189 196 141 302 96 107 122 130 90 143 144 64 89 197 289 198 118 58 239 223 77 251 214 63
3143F3J64o1J57J16J174j75j031l01J83k8P0j91N97J029l71q93m55J07N8lJ47q4k59K41k4
$$ 63 227 166 323 439 1613 1438 407 106 289 261 331 140 737 1766 1395 502 47 154 212 209 356 272 13 254 230
2850B30j39K3J83o5l2m1J09j35O3k7j47P6j2P5r8J18m5r7P9j1L2m2l0J7Q2qm6P3j38Q9o0M0
$$ 230 91 114 297 232 200 159 268 133 196 169 22 98 86 161 63 181 136 39 118 107 139 97 67 84 166 158 112 185 47 136 76 116
2474A16l6k0j1O9p3K50j13j56K1L8K9K7p0jJ76r3o2P0J7j21M2L0M9p2O7l7j18J06J9r9K0J65
$$ 116 80 60 49 118 45 295 182 26 47 85 114 141 71 70 246 153 91 161 178 57 99 129 178 106 173 136 18 124 143 44 64 229
2099B29j42j8Q4l5q1Q6q4K15N8l3j54L6no1o9J16L5j00K9J%j6L7o4J26j02Q9n3o0P3n1k0n8
$$ 229 87 69 153 118 37 123 39 254 312 279 125 161 156 95 26 142 177 77 106 107 107 91 128 64 190 88 177 124 64 137 86 66 8
1711HQ0N4Q8k8Nj30o2P3N1L9P8r0R2j56L2R8j86J16J5q9P3k4j1p5k4M6J33j37J84p2j42K19
$$ 8 88 142 230 202 207 77 15 88 139 178 256 166 258 102 134 232 46 162 177 88 161 137 126 51 27 73 206 69 253 181 39 258
1336B58O7l10K24j09rr3M6K5LK7J09l7k5j06P2q4R6N4j7m2M5o7J47N4k06n2O2k8k8J31n2q0
$$ 258 325 15 239 130 121 28 74 99 102 129 238 201 176 70 142 58 154 208 191 149 194 127 274 328 122 70 132 104 76 207 155 75
960G5j8L6R0q6k6n1J67J29N8l7j72j14R4L5k8j08P5n9O7P6q2q9K31n5j20J4M6M1oj18P0J14
$$ 75 57 93 183 97 71 20 187 316 374 337 165 51 145 180 152 44 119 60 127 203 121 32 263 208 88 102 148 189 183 65 135 249
584B49r3q0J17Jj14j7J09K8p2Ok3n7O7j02P8P9qL2j7j14K6p4K20K2k15nJ14J4m7K7N5j55k9
$$ 249 156 76 193 194 80 63 172 200 128 134 111 54 121 19 97 176 168 200 183 69 95 21 241 263 48 43 157 171 124 151 206 51 22
197B2K70j51j7J1m5N4Q1j59K05K0k05J75m6j58R4J0N2j50l6K26o2j11J43j58J21p2k7p7M6
$$ 22 292 141 124 135 90 144 225 66 271 291 86 261 215 57 151 161 213 63 27 253 191 80 223 65 186 114 87 10 56
-143E6L3O0j42N5
$$ 56 89 149 7 62
-190F2
##PAGE=	F1=422.913
##FIRST=	25169.313707327481097,	5807.6787752999953227,	0.19651758670806884766
##DATA TABLE=	(F2++(Y..Y)), PROFILE
5808G4j5L0o8J7Q3J07l0o7N9j4L8r4o2L0M6kq0P0N0nN0j28k6J91n5n9J05l6l5n1r7N3qP1J19
$$ 74 59 89 21 38 121 228 198 131 190 176 214 120 58 88 134 132 52 122 172 167 217 89 63 254 199 140 245 209 174 123 26 79 71 142 261
5397B61L0j87n8L6l7J05qo0Q8N1K9j02P7k07J92n5j17J17j03Q9O0r1NJ3o6Q1m4J34m6j29m5
$$ 261 291 104 46 82 45 150 142 82 170 221 250 148 225 18 210 155 38 155 52 141 201 110 115 128 62 143 99 233 187 58 13
5033A3J44j25P7R4J3j41P9M0L9j34J14K3j39j2J1nJ52m9k4Po0N4j11J92o1j2l7Qq2L8m3P4
$$ 13 157 32 109 203 216 75 154 194 233 99 213 236 97 85 96 91 243 194 170 177 117 171 60 252 191 179 142 150 68 106 63 137
4657A37m5j4O5j01O6MM6n4PN7j45O2O6Q7k9j66kJ37O1j44O1J1Kj00j5Q9l2Q6k4JJ1j49N9Q7
$$ 137 92 78 143 42 108 112 158 104 111 168 23 85 151 238 209 43 41 178 239 95 156 167 169 69 54 143 111 197 173 174 185 36 95 182
4258A82k7l2N0o6m3M2j9J05r0j5m0N7R3r2M7J00n3j26Q5N9j23N7O4r2pNn8m7K12O3j46r1O0
$$ 182 155 123 173 107 64 106 87 192 102 87 47 104 197 105 152 252 199 73 158 217 94 151 215 123 116 121 63 16 228 291 145 54 114
3871A14L8L8n1n7M4L8J58j59Jj19P4m0N7Q1Qj12m5R8m9J5o4Q3J02J12j40j28J77r6l2M5q0
$$ 114 152 190 139 82 126 164 322 163 164 45 119 79 136 217 225 113 68 166 117 132 68 151 253 365 225 97 274 178 146 191 111
3507A11N0N6j7j71R7Lm2N1j8O9J31k03Kjk4m1O0L3n5K6M7J02r3pq4J15Mj91J73O0j65J42j3
$$ 111 161 217 200 29 126 129 87 138 120 189 320 117 119 118 94 53 113 146 91 117 164 266 173 166 82 197 201 10 183 243 78 220 207
3120B07J03K95J399k93j334k62J63k4P6k37M74P39k72o55k79N7nO6J03j40j44K54k0j94P2
$$ 207 310 605 2004 1711 377 115 278 254 330 93 567 1306 1034 379 100 157 152 218 321 181 37 291 271 77 149
2826A49K03n6n9r2J28j12ok0o4M5m7O1r0J73m9j19Q0o1LJ1Jj0L4K8j6P9j32L7l8P4m5n0M8
$$ 149 352 296 237 145 273 161 155 135 71 116 69 130 40 213 164 45 125 64 67 78 79 69 103 131 115 194 62 99 61 135 90 40 88
2439H8L1j11K24p6j27K5M1QK8Kn5J03k5q0O9k1q6P5N7K1l6K0m6p2M8O7p3J7J09j77O4M9j03
$$ 88 119 8 232 156 29 54 95 103 131 133 78 181 156 76 145 124 38 113 170 191 155 175 129 57 105 172 99 116 225 48 112 161 58
2052E8k8R7p8J95L5oj34J7m3l2o5J58J6o9j9pPQNn7R4p4Q6r1rJ35n3j12K2N5L9R1Lm4j31j9
$$ 58 30 127 49 244 279 273 139 156 113 81 16 174 190 121 102 95 102 110 115 58 152 78 164 73 64 199 146 34 56 111 150 241 244 200 69 50
1629E0mP6L4Q1o5P3j38L1P0j73J45j5o1O9jLj58pQ1J14j51J78p9j01K36N8k77J76j35ro2j2
$$ 50 46 122 156 237 172 245 107 138 208 35 180 165 104 173 172 175 17 10 91 205 54 232 153 52 288 346 69 245 110 101 39 27
1254B7L1K4RJ47j7n7q6Q4r9J30P9Ln3Jp4R2Q8k01n0K0Mo2J80r6m8qQN7k7o5k5J93J12N8o9
$$ 27 58 82 91 238 221 164 78 162 63 193 272 275 222 223 149 241 329 128 78 98 102 40 220 124 76 68 76 133 106 41 16 209 321 379 310
843C10j54o0N8M2m9j13J23j46J19O0j24l1K26o1j58PQ6O1m0n4K4J45p3j43J38K8j50lJ29N
$$ 310 156 96 154 196 147 34 157 11 130 190 66 35 261 200 42 49 135 196 156 102 126 271 198 55 193 221 71 68 197 202
491B02q4L1Lj11L0m0N1O8L1N4m8j01J1q2J90N4k01PJ01l4L5J4O2j65n5K36j04k3m4j0J0P9
$$ 202 118 149 152 41 71 31 82 150 181 235 187 86 97 15 205 259 58 65 166 132 167 181 243 78 23 259 155 132 88 78 88 167
115A67j14K25O1k49J38l5j25O1NJ7j13M6J38l7j21K01j37J5k7n2m2j1Q5Jm3N0
$$ 167 53 278 339 90 228 193 68 129 134 151 38 84 222 185 64 265 128 143 116 64 22 11 96 97 54 104
-190A04
##PAGE=	F1=320.655
##FIRST=	25169.313707327481097,	5807.6787752999953227,	0.13566887378692626953
##DATA TABLE=	(F2++(Y..Y)), PROFILE
5808F9j2K7p4RP2O9K6o1Q9o3M1r9n7M2K8j1l2N0Q0j8P0j43NJ09N3j01L3m3K9n0q3J6M0M1P7
$$ 69 57 84 10 19 91 160 186 125 214 151 192 93 36 78 106 95 63 113 193 175 245 102 107 216 269 168 201 158 187 137 54 70 110 151 228
5397B28M2j76Pk0m5J09O1r6K9M0P8j01M6j51J47q2l4J27j37QJ34p4p2J3n1J19r0J61or5r4
$$ 228 270 94 101 81 36 145 206 110 139 179 257 156 202 51 198 116 82 209 72 80 214 140 68 81 30 149 59 220 214 119 25
5033B5J48j37O8J01q5q9J39j2P1j36J42Qj73nK7J8J32n2j5j5l0N8j39K52n6o4J5j9q5M8p1
$$ 25 173 36 104 205 120 31 170 158 229 93 235 243 70 65 92 110 242 190 175 160 130 188 49 301 245 181 196 177 92 140 69
4669F9J20q9n5J39j06J9L2M4j14M9R7j79O4J05J5p5p7J2P0N9o4J1P7l1j34mJ06k7K8j6R1k2
$$ 69 189 100 45 184 78 97 129 173 59 108 205 26 90 195 210 135 58 70 140 199 135 146 223 192 58 54 160 133 161 145 236 214
4294B14j98M7J25l1j2Jp6L0L3KP9j34k3l4R1L3m9Q2J34j04j42J37K0j29Q6M9j02L5rn8l2J51
$$ 214 16 63 188 157 145 146 70 100 133 135 214 80 57 23 114 147 98 180 314 210 68 205 225 96 182 231 129 164 155 97 65 216
3918B16N1j32j13J28k6Q4k2r9O9J0J79j41o7p9P9k2OQ7j8q4l1O9k3L6p2L3J15R5j45p8J66
$$ 216 267 135 22 150 124 208 186 87 156 166 345 204 137 58 137 115 121 208 190 106 75 144 121 157 85 118 233 328 183 105 271
3554B71j36j1Q4m5m7J05n0j24O3j5k7J1j0J36J08j67k1k0l4k3L6O9l1MJ1J03r9M2r2N3K1q1
$$ 271 135 124 208 163 116 221 171 47 110 95 68 79 69 205 313 146 125 105 71 48 84 153 122 126 137 240 141 183 91 144 165 84
3178H4K3J42j74J11L1P3M09J492l83j481j73Q7nO8j80K72M33j70m35n5K2j09J44R1k00n4K35
$$ 84 107 249 75 186 217 290 699 2191 1808 327 154 241 236 304 124 396 829 659 224 169 191 82 226 317 117 63 298
2862B98j9k03R2J93l6q9j19J45r2m7l3L9jm3K0jJ50o5j28P8p2mmK2l2%N1RQ2j14k0J7O4m8
$$ 298 279 76 168 361 325 236 117 262 170 123 90 129 128 85 105 104 254 189 61 139 67 63 59 81 49 49 100 109 191 77 57 74 138 90
2462I0n4J02j6p7J05k2j05L1M5k1N0M3r1J7N7n9P1n6o4O5R1lNl9Np8KR4l2PL2j85J37J8j48
$$ 90 36 138 122 45 150 128 23 54 99 78 128 171 80 97 154 95 166 110 46 111 202 199 204 165 170 92 94 188 156 163 195 10 147 165 17
2052A7K7Q2p0J57lK7r0%p2j6m0J82Om9o6KML5n3j0M9l5Q9j35Q9J48p3j78P2M2K0O3L7p7j09
$$ 17 44 126 56 213 210 237 147 147 75 59 19 201 207 158 92 94 98 133 80 70 119 84 173 38 127 275 202 24 96 138 158 221 258 181 72
1641G2Nl3O2J2P6l9M8r3K7M9j41J36m4j0N4nJ1j83QP6R3j39J37o5o3K16N4j93R6j35j2l0j7
$$ 72 77 44 106 118 194 155 203 110 137 186 45 181 137 127 181 176 187 4 12 88 181 42 179 114 51 267 321 128 224 89 77 47 30
1254C0jL9P3J40m6j07p7J01j00J69Q7K3n6n4o2N7R9j96k7j9L0r8K29j42j7Qj6J5M2n7n1J92
$$ 30 29 68 141 281 235 128 51 152 52 221 308 331 275 221 159 216 315 119 92 73 103 5 234 92 75 83 67 82 124 67 16 208
878B08Q5N6r2j11k9M4K8n6j10J98j37N2M3j55O3J61p7j60LJ00Q2p7J8j9J59m9j88J54L6j83
$$ 208 293 349 257 146 117 161 189 133 23 221 84 136 179 24 87 248 171 11 14 114 196 119 137 118 277 228 40 194 230 47
526D7K1J49Jj07N9K1j21m3J4K3N9M4N7l9j05K5p6J37N5j52K5P8j00J45j5M3j56n7J88o1j1
$$ 47 68 217 218 111 170 191 70 27 41 64 123 167 224 185 80 105 29 166 221 69 94 172 72 217 202 245 89 32 220 159 148
162A48j07L5oN5mJ57N8k27Q2k2q9M2l4mn6J08K9nj12K35j08p4Ro3j5J4M9m8O6M4
$$ 148 41 76 70 125 121 278 336 109 191 169 80 122 88 84 28 136 165 160 48 283 175 101 110 47 32 46 95 47 113 157
-190A57
##PAGE=	F1=218.397
##FIRST=	25169.313707327481097,	5807.6787752999953227,	0.1679375767707824707
##DATA TABLE=	(F2++(Y..Y)), PROFILE
5808F1kJ7p5K9O5j4R4n4J11q1L2j26l9M9M2l2KK7J13l7Q2j43K9L7J17j07n5m6R4k9q5L4L0
$$ 61 59 76 1 30 95 81 175 121 232 151 183 57 18 67 109 77 79 106 219 182 264 121 150 187 304 197 142 96 190 161 76 110 140
5420A40K8J4M5j28O1p3l1O8J19o2p9J9J01p6J6r7R3q3Q0R7j74n6K04n3j13k8j6J42q7J08K3
$$ 140 168 182 227 99 160 87 56 124 243 181 102 121 222 146 162 65 158 75 155 252 78 22 226 173 60 32 16 158 71 179 202
5056B02n1j08J29j31N7J23j32p8J74o1R5j36J64j3j92pM1N5R8l7Jm7%N4r0K29l0j05M5m3j08
$$ 202 151 43 172 41 98 221 89 11 185 124 219 83 247 234 42 35 76 131 229 192 193 146 146 200 110 339 309 204 249 206 98
4693I8O9j10J69j24o4J69r0l8P4K1j03L5J20j62L1J31m5p6K8j7KO8l8rJ48n7j62jR5j2l4J9
$$ 98 167 57 226 102 38 207 117 79 153 174 71 106 226 64 95 226 181 105 133 116 118 186 148 139 287 230 68 67 162 150 116 135
4317A35J49m9j74m3J56l9K0m3n8P6K9K7M0j71L7l7O0l0j5J37J40j54j22J80l5j18Q0M2j01
$$ 135 284 235 61 18 174 135 155 112 54 130 159 186 226 55 92 55 115 85 70 207 347 193 71 251 216 98 178 220 119
3977A19R9k0o9j9Q5L6j02o8J27q2R4K6p1K6l3J94j05j56oQ3j9j5O6l1n4k7M8K5L4q3l7J35
$$ 119 218 198 129 110 195 231 129 61 188 106 200 226 155 181 148 342 237 81 75 158 139 124 190 159 105 78 126 151 185 102 65 200
3601B00Q4j56l7J38j60L7J06Kj54J50p3p0L8l3k2k5Q8Q0Q9j04n3l6k3k6J6J05j3k9lJ05j12
$$ 200 284 128 91 229 69 106 212 214 60 210 137 67 105 72 50 25 113 193 282 178 125 89 66 40 56 161 148 119 116 221 109
3237A09O5q7KK6K4o5J50j72R1N2O1M43J423m22j438p9%K1M9o2O8J68q4k66J57J1j78J66J04
$$ 109 174 87 89 115 139 74 224 52 143 195 256 699 2122 1700 262 183 183 204 253 191 259 427 343 77 234 245 67 233 337
2897C37k01o0J89j1j78Q9J64j0j17j19J55p2o4m9J32m2j5k9O6J22q1j22Q1n4j3m8K4k7kK9
$$ 337 136 76 265 254 76 165 329 319 202 83 238 166 102 53 185 143 128 99 165 287 206 84 165 111 98 50 74 47 45 74
2545G4K9Q0q7p2O9L5m9j6J23n5m0k3L5q6L8L8m8Q1N1q4q5J45NN5n4o6oJ30j9M0q9P2r8m9J12
$$ 74 103 183 96 24 93 128 79 63 186 131 91 68 103 17 55 93 45 126 177 93 8 153 158 213 159 93 87 217 198 238 149 221 123 74 186
2134A86J7jn4j10J31%j30QP1o1J06m3O4k9k0q4j0PJ72Pn0r5M5k2N4j20M3K0PR6j61J33J49
$$ 186 203 202 148 38 169 169 39 47 118 57 163 120 184 155 135 51 41 48 220 227 177 82 127 105 159 39 82 102 109 205 44 177 326
1746C26p9j98P3M9JNO3p8r7L4Qkj1N3j7J5k9J7L3r8J02p5N4L2k9Pj43KM5O9q8N8k5k6J63M3
$$ 326 247 49 122 171 172 177 240 162 65 99 107 105 94 147 130 145 116 133 166 68 170 95 149 181 152 159 16 18 63 132 44 102 77 51 214 257
1324B57o9j0j04k0%J2j2J1J39J27r3j51p3J03o8J84P5L6m7j06m6N3Q7j90J1l7L3p2K08j50
$$ 257 188 178 74 54 54 66 54 65 204 331 238 87 14 117 49 233 308 344 297 191 145 198 285 95 106 69 102 30 238 88
972H8rJ9k4lP6m3q3J72N3M4r9o0j9M2Ml9o3K32j32mJ8j59J15J05j06o8j4N2R8j13Q0m3J50
$$ 88 79 98 74 71 147 104 21 193 246 290 191 131 112 154 158 119 56 288 156 152 170 11 126 231 125 57 43 95 193 80 160 117 267
584B67k6k10J67K5j93K8J69J8j39Q6K7j17m2j0M2OL4L5Oj06M0n7Q3K8p5L4N4j55K34n0J1j36
$$ 267 241 31 198 223 30 58 227 245 106 192 219 102 60 50 92 98 132 167 173 67 107 50 133 161 86 120 174 19 253 203 214 78
209G8m4J46k8Rj38O5NK4P3Q8J8j74L7po4M4j03K0j0J34p8L6j00K38o8j35K7n2L5K4j3k7J09
$$ 78 34 180 152 161 23 88 93 117 190 278 296 122 159 152 88 132 29 49 39 173 95 131 31 269 201 66 93 41 76 100 87 60 169
-178A69K5
$$ 169 194
-190A94
##PAGE=	F1=116.14
##FIRST=	25169.313707327481097,	5807.6787752999953227,	0.25086316466331481934
##DATA TABLE=	(F2++(Y..Y)), PROFILE
5808E3J4mn4M2O8j11J51m2J16p2L4j59L2oR6o3jRJ42n2P6j23L1j0J32r1j06MP5Qj12N4J1N0
$$ 53 67 63 9 51 119 8 159 117 233 161 195 36 68 62 158 95 94 103 245 193 269 146 177 167 299 208 102 106 181 189 77 131 142 192
5409A92n9L8o8J07j09k7K0J45rj60pR7m2Lo8M1n6J73N5j91k1J74k9j18n2L4R1m7J7L0Jq9Q3
$$ 192 133 171 103 210 101 74 94 239 230 70 63 160 118 121 53 94 38 211 266 75 54 228 199 81 29 63 154 107 124 154 155 66 149
5021A49j01M4J32j02p9J45r4J17j45J76l4j86J6J0R9O3k2K6n7jM3n4K10Pj23M9n4j49J01j62
$$ 149 48 92 224 122 43 188 94 211 66 242 208 22 38 48 147 210 188 214 157 156 199 145 355 362 239 288 234 85 186 24
4669B4K09j41j3J30p2p8J18po4j4J46j32%J29o8j2N1l9l3P5p0OJ91p7j69kN6J1p9N9J75o0
$$ 24 233 92 79 209 137 59 177 170 106 92 238 106 106 235 167 155 206 167 134 209 139 145 336 259 90 88 144 155 76 135 310 250
4294B50j53m0P7m1N1n3J5L9L3M2jj58J00o1Pp7nJ91J21j81p2K04r5r8M5M2q8J63l0o9k0L5
$$ 250 97 57 134 93 144 91 106 145 178 220 219 61 161 100 107 30 25 216 337 156 84 288 193 95 140 182 94 257 227 158 138 173
3918A73J9o3m3J31j09N6Q7l1k7p7J84m8k38R0Q3l2j2K0k5l0l6M4Q2J4j01j03J58P4j70J4P1
$$ 173 192 129 86 217 108 164 251 220 193 116 300 252 14 104 187 155 143 163 138 108 72 116 198 212 111 8 166 240 70 84 155
3554A55j44R7R0M6k37J80q1k5K3l0l7j3J52lO3l1q3m7Qo7J7J33on5kJ07j26P2p1m2J2J09o7
$$ 155 11 108 198 244 7 187 106 81 104 74 37 24 176 173 236 205 122 75 83 16 33 166 160 105 103 210 84 156 85 43 55 164 97
3167I7O7j36J11J6M9L99J200m01j213Np4L9L5M6o6j8J7q4J71Nj51J23J10j64j06J21Pj41Q0
$$ 97 164 28 139 155 204 603 1803 1402 189 194 120 159 194 240 174 156 173 89 260 265 114 237 347 183 77 198 205 64 144
2826A44J24K1j25j07J51m9p6l6J84o4J2p1R2J01q6j13R7k0n6o8MK1nj8M6P6n2j02P3J4n3L0
$$ 144 268 289 164 57 208 159 83 47 231 167 179 108 200 301 215 102 199 179 123 55 59 80 75 57 103 179 127 25 98 112 59 89
2451H9J34p4j4q4L4m6J9K2n8R4L0j2n4Q1Q1J9l7q2r6J64k8O5j16J30j07j01J13O8nj31l7J14
$$ 89 223 149 135 51 85 39 58 80 22 116 146 134 80 161 242 261 224 142 46 210 182 247 131 261 154 53 166 234 229 98 61 175
2075A75Oj13j8N1n1N6m6P8L1m7q3PL3J50Qo1q9R2m5N2j39M4K5K5R9j81J34J50o9j99O3P2k1
$$ 175 181 68 50 101 50 106 60 138 169 122 39 46 79 229 237 176 87 179 134 186 47 91 116 141 240 59 193 343 274 75 138 210 189
1688A89o6P7m8j01O9N6n4j8J3kk3L4JJ6n3O4j02J13Nm2l0p7JJM5ok1L3lR7KP4j12o0l9L0J9
$$ 189 123 200 152 51 120 176 122 104 117 115 92 126 127 143 90 154 52 165 170 128 98 21 22 23 68 62 41 74 71 168 170 244 132 72 33 63 82
1254H2Mj0J71J07j19j49mK1k9J54M6L8k5j45l3O5O5j71M9l9J7l1J66j18j8J6j8J7O1l4j10
$$ 82 86 76 247 354 235 86 82 103 74 228 274 312 287 142 109 174 239 68 117 78 95 64 230 112 94 110 92 109 170 136 26
890B6J53J7K1q9k0k2N6l5J4k3K39j31l3nj30J11O3j43K7k8K8R1j42J22m2J17rk07J80Kj63
$$ 26 179 196 217 128 108 86 142 107 121 98 337 206 173 168 38 149 212 69 96 68 96 187 45 167 125 242 233 26 206 208 45
526D5oJ84M9j70J05K2j10qm4Q4n7Ok2P4o6J3l6M7j6NL7L4r7J93q0k7j04k2J12j0K5j18P0O
$$ 45 39 223 272 102 207 229 119 111 67 151 94 100 78 152 86 99 63 110 94 99 136 170 73 266 186 159 55 33 145 135 160 42 112 118
127A18K4J12L6m1j23OJ5o0O6j16L8j9J31j33O7j03K09k5j60K7mP5Lo6K8J05m
$$ 118 142 254 290 249 126 132 147 87 153 37 75 56 187 54 121 18 227 202 42 69 65 140 143 77 105 210 206
-190B06
##PAGE=	F1=13.8818
##FIRST=	25169.313707327481097,	5807.6787752999953227,	0.3662191927433013916
##DATA TABLE=	(F2++(Y..Y)), PROFILE
5808D8L1l0l4N0P6q2P4k4J06n0N7j68P2o0J48r2j8%J59n3M7q2J3m1J13n6p6N3k4N8j54N8p
$$ 48 79 49 15 65 141 59 133 109 215 165 222 54 126 66 214 122 104 104 263 210 257 175 188 147 260 204 128 181 157 215 61 119 112
5420A12J02j17J6j7J45j23l6pJ19M0j85J3K9j1J4o2nj2K20Rj53KJ21mj20l4M3L6pn0PN6m7
$$ 112 214 97 113 96 241 118 82 75 194 234 49 62 91 80 94 32 27 15 235 244 91 93 214 210 90 56 99 135 128 78 85 141 94
5033I4J4n2L5J09o5p2J10r8J37j62J69n0j45M6m9J32M3k5N0k4l1J3l9K06M3j24L8m9j86J32
$$ 94 108 56 91 200 135 63 173 75 212 50 219 169 24 70 21 153 196 171 221 197 166 179 140 346 389 265 303 254 68 200
4681B00j73J78j38N7P1n9q2J42k2m1m9J63r7k8R9n6L4O2m6m6O6j13M6J92r9j53JlL9r1P5J83
$$ 200 27 205 67 124 195 136 54 196 174 133 84 247 150 122 221 165 199 261 215 169 235 122 168 360 261 108 109 106 145 54 129 312
4305C12n2j41On1l2O7LO2l0L8N3m3j04J30p3n4n6qJ81Q0j78j2K09j42p7oM6o6K07l8m8l9J0
$$ 312 260 119 125 74 42 109 112 174 144 182 235 192 88 218 145 91 35 27 208 288 110 98 307 165 88 82 128 62 269 231 183 144 154
3918A54Jk1m7J43j08j3J42Oo7j08J35L1j63N7P6m1j3m1Mk1m5N4J28j5j18m6P4O0j75R3m7k9
$$ 154 155 134 87 230 122 109 251 257 190 82 217 248 85 142 218 177 164 123 127 106 61 115 243 228 110 64 138 198 23 116 69 40
3542D0Q1N2P3k03J11p0KJ3nm9OJ65m2J0M1j02n2M5r9PJ41j2o3PR9j23P9n1o1j6J34o1k6JJ14
$$ 40 121 173 246 43 154 84 86 99 94 45 51 216 174 184 225 123 71 116 17 24 165 153 90 97 196 73 152 101 40 24 158 97 71 72 186
3132A86o3J3K94Q62l25q43O8j05K8M4R1j12j09J69k6L9J8q4Q8Q6j12j29L1L6j00O9Q5O7r6
$$ 186 123 136 430 1292 967 124 192 87 115 159 250 138 29 198 172 211 229 145 233 319 207 78 109 145 45 114 199 266 170
2791A70j12J21k2r4nJ99n8K8j11Q5R3p8j09J22K4j15p0l8R2j5n7O0P3j3j15L5Mn7O1J44o9
$$ 170 58 179 157 63 58 257 199 227 116 201 294 216 107 229 253 138 68 30 122 107 50 110 183 170 55 90 94 37 98 242 173
2427A73Jp5k5pj%l7O4j0J05m2K9J50l1k2r9j65J73l4P7j02J65j02j10O0J11lj66j1J03L2q6
$$ 173 174 99 74 67 66 66 29 93 83 188 146 175 325 294 272 173 8 181 147 224 122 287 185 75 135 246 243 77 66 169 201 115
2052A15n0J0l6L2M6KO7p6p1K0M5J22%o3n7J20n4L5j19PN0K0R5j84R7J52m3j90N7J04m8j26
$$ 115 65 75 39 71 117 119 186 110 39 59 104 226 226 163 106 226 172 207 88 95 145 165 260 76 173 325 282 92 149 253 205 79
1676G9Q0rj12J01R3q9j4j4Mo0Q6k3j4mM1p9J02k1jj07k0J1j3KP1K3Jj2O9r1K14j46o1p7O7
$$ 79 159 150 38 139 232 143 129 115 119 59 145 122 108 104 145 66 168 147 146 39 19 30 17 19 90 113 114 102 171 80 294 148 87 10 77
1265G7oL2nJ63Q2j07j09K5pm2J08PK5Qj62j7O5M6j24O4l3j6J4J28q2j6joL7M1k7j35J46rj4
$$ 77 71 103 98 261 343 236 127 152 145 103 211 218 243 251 89 72 137 183 59 123 90 74 88 216 134 118 117 111 148 189 162 27 173 164 150
854A50o7nk0Q1q9Q7rK24j28l4j7j03Q7L2j74J08m1L8N9j52J32k1P1mj81J89j7j30l7J76Q4
$$ 150 83 78 58 139 50 137 128 352 224 190 173 70 157 189 15 123 82 120 179 27 159 138 209 205 24 213 196 66 29 205 289
491B89j91J11J1j05L5n8J15q9qp2Q6On1j9K9m2N2L6J8k9J30r6o4m1j6Q8j5L3q8Q0lN5J25M
$$ 289 98 209 220 115 150 92 207 118 110 38 124 130 79 60 89 47 99 135 153 124 254 158 94 53 37 125 110 143 55 135 132 187 312 316
92C16q9j01j9M4q1J05p6Jk7J01p6L7j06J40J3j54J4N9R9l3q8N7R5m1
$$ 316 227 126 107 151 70 175 99 100 73 174 98 135 29 169 182 28 42 101 200 167 79 136 231 190
-190A90
##PAGE=	F1=-88.3761
##FIRST=	25169.313707327481097,	5807.6787752999953227,	0.47166585922241210938
##DATA TABLE=	(F2++(Y..Y)), PROFILE
5808D9M1m5k6N3Q6m8j1lQ1k2J00j81J00j02J76j15k2lJ60m1Kk2k1o3Q4j1pO0j29J13j96M1
$$ 49 90 45 19 72 158 110 99 96 177 155 255 74 174 72 248 133 111 108 268 227 229 207 186 123 207 196 189 249 120 233 37 78
5432G8j6J65j49rLJ73j08n1NL6O7j61Q0p8K4K4k0K3m6J84l0n9k3P1K3j27j1M5rK2n0l4Q2%
$$ 78 62 227 78 69 72 245 137 86 91 127 194 33 113 35 59 83 63 86 40 224 194 135 112 183 206 79 68 113 104 126 76 42 124 124
5033A24n1nK6O2m6l0N9o5J46j53J16n9q1N3o2J11M6m8O2M4n9n1m6K23O6j18K9l2j88J35j17
$$ 124 73 68 94 156 110 80 139 74 220 67 183 124 43 96 34 145 191 143 205 249 190 139 93 316 382 264 293 261 73 208 91
4669I1N6j16J31Qn6m3J34j2m0l2J41p2n7N0k4L8Q8l2n6L9j16Q0J57j26j16Qp4P1p2O3J85k9
$$ 91 147 31 162 170 114 71 205 193 153 121 262 190 133 183 159 197 285 253 197 236 120 200 357 231 115 123 49 120 48 111 296 267
4294B67j37N7j80OM2J06P0j04L9O4q2l9J36o3j11j1J3J16L1j43L1J98j70n9l1K9m3K21m6j2
$$ 267 130 187 7 13 55 161 231 127 166 230 148 109 245 182 71 60 73 189 220 77 108 306 136 77 46 75 32 253 207 195
3941A95o4J0j5J6p7J58q8q1J70L1q4q8J6J31o7J5O8l8l0j03M0k2m4P4J48m8j18J7mM4j33J37
$$ 195 131 141 126 142 65 223 135 54 224 255 171 83 99 230 163 178 246 208 178 75 115 93 49 123 271 223 105 122 118 162 29 166
3566A66j11j0Q2L3N9j44M1m2MJ0K4m2nJ60k8n8R7j02n0P3j08j3J23l5m7J7P5r1Q7l1p0K1M0
$$ 166 55 45 127 160 219 75 116 74 78 88 112 70 65 225 197 139 236 134 84 157 49 36 159 124 77 94 169 78 165 134 64 85 125
3178A25p0pQ9J01j26m8J64M65k19l91J02r2J6O9L9r1r4K33n1n1J11j09N3K9m2j08p8O9l9L7
$$ 125 55 48 137 238 112 64 228 693 474 83 185 93 109 178 217 126 32 265 214 163 274 165 218 247 205 97 19 88 49 86
2826H6N8J26n6j44Q9Mj12QJ97k7L7j51N1J00o1j11J48P2j66o5o4J37j0r6O4Q0K3j21k0jn6
$$ 86 144 270 214 70 159 163 51 59 256 229 266 115 166 266 205 94 242 314 148 83 19 156 146 50 114 194 217 96 76 75 19
2462A9P3J44l9J1p3p2K2j1k0k4K5n1K30n4J3J98q6j5j14j42J03m6Q4m6J72q8q8j8J32Lj34
$$ 19 92 236 197 208 135 63 85 74 54 30 55 4 234 180 193 391 305 290 176 34 137 91 175 129 301 213 125 107 239 242 108
2099A08m8R5P1m6r4l1k8N6R4o1Q7j00m5ON3Q8j3l5l4J29n0J0r2k1P0jR0j50J7J58j5j72O2
$$ 108 60 155 226 180 86 55 27 83 177 116 203 103 58 64 117 205 192 157 123 252 202 212 120 99 169 168 258 108 125 283 268 96 158
1711A58J32p5j49P0J0j15J20J12j01j6lqq0J20n6n9N1L7l1L8l9P6j18o4L4kJ3O7P5l0l9P1
$$ 158 290 215 66 136 146 31 151 263 162 146 143 135 55 175 119 60 111 148 117 155 116 192 74 10 44 42 55 122 197 167 128 199
1336A99j75L06r9j21q2P0o4O6K5J24N5m9q6K9mp6P5l0kM1j56L1J0L9n3M7j6o6N9J06o5Nk5
$$ 199 24 330 231 110 28 98 34 100 125 249 304 255 169 198 194 118 193 163 161 202 46 77 87 126 73 120 104 38 97 203 138 143 118
948A18OM9K6j7j53J42j3m5n1lj7J03j41J46j4J93j18qj9q0N1Kj09R0n6O1K4j27J06QK1rj44
$$ 118 124 173 199 182 29 171 158 113 62 59 42 145 4 150 136 329 211 203 184 104 155 157 48 138 82 143 167 40 146 154 175 166 22
561B2J93k2j12l4J33J05j92J01J0j15Q0n3J25r1pj9k2O7j18rK2mK6K9QL2O7r1r0N1m6P2l6
$$ 22 215 193 81 47 180 285 93 194 204 89 169 116 241 150 143 124 102 169 51 42 64 60 86 115 123 155 222 131 41 92 46 118 82
174H2L5n5Q4pJ04J15j9j09j10l9P4j20J52m2m5mM1J3Rj08N9M0j30jJ11J07o5o9M0Q3p5
$$ 82 117 62 146 139 243 358 339 230 120 81 155 35 187 145 100 96 137 150 159 51 110 150 20 19 130 237 172 103 143 226 151
-190A51
##PAGE=	F1=-190.634
##FIRST=	25169.313707327481097,	5807.6787752999953227,	0.45879536867141723633
##DATA TABLE=	(F2++(Y..Y)), PROFILE
5808E7L8m4k5N0R1j5q4J3M6OJ51k04J19j26J72j21mqJ48k5m4M3n2q8O5M1M3M4k13J69k13L
$$ 57 95 51 26 76 167 152 68 81 127 133 284 80 199 73 245 124 120 112 260 235 191 234 182 94 159 200 243 287 74 243 30 33
5432C3MJ86j50k0j8J85o1o8M0m4M0j17J48j42P2j9N4M4r3J09n5N7o8K3M7j31J2L3k9L2MpJ5
$$ 33 37 223 73 53 35 220 159 91 131 87 127 10 158 16 88 69 123 167 74 183 128 185 117 140 187 56 68 101 72 104 108 101 116
5045A16L3o2kJ1J8o0N2j2mJ39j21M0n7l0N3n3O0O9p2M8J28o6j37p5K58O4j06L2j3j60J18n4
$$ 116 149 87 85 96 114 54 106 94 90 229 108 148 91 61 114 61 121 190 118 166 294 228 91 16 274 338 232 264 251 91 209 155
4669A55o7n7J61n2o2J2J19Qm9J2J00n7r0lJ3NJ27no1mo5Q8J04j59o6J8j00N8m6M7J84Kj32
$$ 155 88 31 192 140 78 90 209 217 168 180 280 223 133 130 143 148 275 270 209 205 140 228 332 173 107 125 25 83 37 84 268 270 138
4282A38R6j76j3k0J86N5j69K9Q3j13K3J17l3j52K5K6O5oq2L2J76j71m9J8l1l2J92n2K4q2K9
$$ 138 234 58 45 25 211 266 97 126 209 96 119 236 203 51 76 102 167 161 79 111 287 116 67 85 54 22 214 162 186 104 133
3918A33k3M4j22J67n9q7J21M1p7j2q5J75Mk0O4k7n7j53O7k3l1J04J30q0q7O4o7K7p2J44r5
$$ 133 110 154 32 199 140 53 174 215 138 126 41 216 220 200 264 237 180 27 94 71 40 144 274 194 107 171 104 131 59 203 108
3554A08q6J02M8jq1rqj7J4M9k6k2J32Rj06J29q1m3Q9j28oQ2p0JRL5k7P7nq1N2o2J0R4J5O7
$$ 108 22 124 172 171 90 81 73 56 70 119 93 71 203 212 106 235 154 111 200 72 66 148 78 79 88 123 96 173 168 87 139 77 87 181 196 263
3132B63j59l7J15J14j59o3R4o4N9O5p1m7q5L06j11J67J68l31k8n0M2n9p7jL4j3M5J71m2j66
$$ 263 104 67 182 296 137 74 168 104 163 228 157 110 25 331 220 387 555 224 196 146 188 129 52 51 85 72 117 288 246 80
2779H0O9K5j23mJ81J5N1j83j1J20l8j15J67J08j95n0k8J05Rj23N0R6N0j15p4j5l7O8J27NK1
$$ 80 149 174 51 47 228 243 294 111 100 220 182 67 234 342 147 97 69 174 183 60 110 206 256 141 67 52 15 83 210 215 236
2416B36q1j10M3j1l5l1J6O5J64p9L5K13j31j8j26r0M0q0R7L4J54p3o5p8J29J2p6q7P2J09m
$$ 236 155 45 88 77 42 11 27 92 256 177 212 425 294 276 150 60 100 20 117 151 305 232 167 89 218 230 154 67 139 248 244
2052B44j42l4l7P6R3r4J12j17j1l2N9N1k2L0m6J24m3j5n9l4P6k8Q4q2q8J65Qj49P6J47r6j39
$$ 244 102 68 31 107 200 106 218 101 90 58 117 168 146 176 130 254 211 196 137 103 179 151 235 153 65 230 238 89 165 312 216 77
1676G7M8Qj17J42J05q9k3L8l6p2J32r3j06J04M1%l6m4J47j04j02M6k2L4P6J05m3o9O7j42K75
$$ 77 125 133 16 158 263 174 151 189 153 81 213 120 14 118 159 159 123 79 226 122 20 66 44 78 154 259 216 147 214 72 347
1312C47j9j95n4M2j00O0P2O4M0K5r1J8Lr6O9m5l3M6j31R2p0L0MK9J2j11Q8J01p6L9n0K1M8
$$ 347 328 133 79 121 21 81 153 217 257 282 191 209 212 116 185 140 107 153 22 114 44 74 78 107 119 8 96 197 121 160 110 131 179
925A79J9lj56J28jn5n8K1l9J13j06J05k5J52r6L5j5o4J3l5k0N1p4P7Nq7P6L3k9j4j06J81j1
$$ 179 198 195 39 167 166 111 53 74 35 148 42 147 122 274 178 213 198 134 147 112 92 143 69 146 151 64 140 173 144 130 24 205 194
538A94j05j8R2R3j63P3K6j42J16m1J19p7oK9q5Q2j67JK1N1j8MPP6J8o4p8J00q4O0n3L3k5P0
$$ 194 89 71 163 256 93 166 192 50 166 125 244 167 161 190 105 187 20 21 42 93 75 79 86 162 180 116 38 138 54 114 61 94 69 139
138A39jJ58Q9m1j17j25n0R7j30J63j1r6N1l4R0pj04j5O5j06NJ21R5p4k8pP4r9
$$ 139 138 296 385 344 227 102 52 149 19 182 171 75 126 92 182 175 71 56 121 15 20 141 236 162 134 127 201 102
-190A02
##PAGE=	F1=-292.892
##FIRST=	25169.313707327481097,	5807.6787752999953227,	0.36604148149490356445
##DATA TABLE=	(F2++(Y..Y)), PROFILE
5808F7K6m0j6M4Q8J9j30J3%L8J90k18J12j22J32r3K2j9J27j2q2J01o5j19P4Q7N1J7k71K26
$$ 67 93 53 37 81 169 188 58 71 71 109 299 81 193 71 203 110 132 113 240 228 146 247 182 63 137 224 275 292 21 247
5456B47j93mL2J20j32j3k5J41J1q0P0o6l8n0J67j58R8p7J30N2j26K5o6J56j02k7O6j27M1n
$$ 247 54 50 82 202 70 57 32 173 184 104 174 108 70 20 187 29 127 50 180 232 106 131 65 221 119 92 158 31 72 67
5103F7j5K5O5K4n2M7l3k7j5K2r5J22p2N1J16q2j2m4k1O4n0%R4n8lK06n7j93JJ56L4q2M3mj26
$$ 67 52 77 142 166 114 161 128 101 86 108 13 135 63 114 230 148 136 92 71 135 85 85 179 121 118 324 267 74 75 231 265 183 226 222 96
4693I6J03Pj17j2J40j06o6N6J11J8n0M7O4m6j24m6M5m1J52K8n3n5J1Q2N3j82k7L2k7m8l2M5
$$ 96 199 206 89 77 217 111 45 101 212 230 180 227 291 245 121 75 120 79 231 259 206 151 162 244 297 115 88 120 93 45 13 58
4317E8J85K6j17J09j58l9J8J61L1k07KJ05j03N5O7Nj55N2J6L3j1l4J1J43j40m9O3o4j2J13
$$ 58 243 269 152 261 103 64 82 243 274 67 69 174 71 126 193 198 43 95 111 144 133 99 110 253 113 64 127 63 51 164
3965A64n6N0q1M7j3N7j07J07l2m6K7L0n3Q1lN3K2m7P1k1q4j31K5j7pJ44P2j08j7Q5j19J6k6
$$ 164 108 158 77 124 111 168 61 168 136 90 117 147 94 175 172 225 247 200 271 250 166 35 60 43 36 180 252 144 127 212 93 109 83
3578H3J34q5p7O8P5q9k1k3Rn0K5O1ll2Q1L9j11J36m4l5R7j58K7K8r8P7l9j0N6L9L3q3O1j32
$$ 83 217 132 55 123 198 109 88 65 74 24 49 110 107 75 156 195 84 220 176 141 238 80 107 135 37 114 75 65 121 160 193 110 171 39
3178C9J74R5p4J8j73N7K30K83j74l86M3j2J19L4j34p0k2L71k12N44K04o16j64j17J12j5o2
$$ 39 213 308 234 252 79 136 366 649 475 89 132 120 239 273 139 69 47 418 206 750 954 338 174 57 169 154 92
2862I2m9Q1n2M5J71n0j46N5L5j37j6J48N6P6j90j05J43j1j10J70J21j98k6J7N7K7j26K0J13
$$ 92 43 124 72 117 288 238 92 147 182 45 29 177 233 309 119 14 157 146 36 206 327 129 103 120 177 204 78 98 211
2521B11O7r8j10l0j8P0Q0N0L1q8j48N7nm4ML7J10P0j05R1J89j54l1j31j2J5l5K4Q2J25o5m9
$$ 211 278 180 70 40 22 92 172 222 253 165 17 74 69 25 29 66 176 246 141 232 421 267 236 105 93 108 73 97 179 304 239 190
2146A90j10J08K7k5r2K9J29K8j67j2n0O5N9q2J34j27K5q6O4RKJ03r6J16m5l8j5l6O7n5Q3o
$$ 190 80 188 215 190 98 127 256 284 117 105 55 120 179 97 231 104 129 43 107 116 118 221 125 241 196 158 143 107 174 119 202 196
1770A96j85J68J8j25R5J43j01j25K0Nq8J58N9o3k9Q7p1m1J25j25p6Q8M1Nj06l0J82q6r0M1
$$ 196 11 179 197 72 167 310 209 84 104 109 21 179 238 175 146 233 162 121 246 121 45 133 174 179 73 43 225 139 49 90
1418I0o2M4J09J09l5q3L8r5K29P0k65rLn8j4J08oM5Q0j09qOq0Q7m4m4J0j01J27q2k7K9K2M2
$$ 90 28 72 181 290 255 172 210 115 344 414 149 140 143 85 71 179 173 218 298 189 181 187 107 194 150 106 116 15 142 60 33 62 84 126
1019A26p1N8Q6j11P4o8L7L6K4Pj49J07J5n5o5N4q8J25p6O4m1J15n8P7j3n9j0q1N9K3r6P7Q
$$ 126 55 113 199 88 162 94 131 167 191 198 49 156 171 116 51 105 17 142 66 130 89 204 146 223 210 151 141 60 119 142 46 123 131
631A31m6O3M6p7jq0J50Mj00kQ0M1j03L1M8j59J16l1J07n5j1P3r1M7j67L0J0O3l2m8K2R0mk4
$$ 131 85 148 194 117 116 36 186 190 90 88 168 209 106 137 185 26 142 111 218 163 152 225 134 181 14 44 54 117 85 37 59 149 145 121
232A21o2J15j19N1n3L3pL4J5K02N6o2j23j29l2Q8n5Q2K0j38J26q8J17j1r8p5J09j02K8R1O3
$$ 121 59 174 55 106 53 86 79 113 128 330 386 324 201 72 40 128 73 155 175 37 163 75 192 181 83 8 117 15 43 134 197
-132A97n5J5o4O9j07
$$ 197 142 157 93 162 55
-190E5
##PAGE=	F1=-395.15
##FIRST=	25169.313707327481097,	5807.6787752999953227,	0.28752723336219787598
##DATA TABLE=	(F2++(Y..Y)), PROFILE
5808G8Lm0QL9P2O0j54Nn2Q3J96j96N3p7N1NJ6m1J08j8r7J38n7j52J13J23J8j5k37K12j62l
$$ 78 81 41 49 88 160 220 66 71 19 102 298 102 155 78 129 134 150 109 217 199 102 240 183 31 144 267 285 270 33 245 83 80
5432H0M4M6j06kK1L1R7q3Q4q5n8j8J48j65J15q9J62N2j42k7o1J88j10p4Q3j16P6o5K8J3J02
$$ 80 124 170 64 62 83 114 211 128 212 127 69 51 199 34 149 60 222 274 132 105 44 232 122 48 131 15 91 26 54 67 169
5068A69M1j05N3Jn1m8O8n8Q6q8P2P8m3j9l7m9R8n2o4R6Jn9K40m3j77M5L7j7k7M8j8j04J06
$$ 169 210 105 158 159 108 60 128 70 156 68 140 218 175 156 119 70 168 116 52 148 149 90 330 287 110 155 192 175 148 196 178 74 180
4681A80N4j05qJ19j50l3M4J15Om0O1M2l3j49o3N8j9Q5N5l2q7P1P5K2j57m5N4L9j13j2KK01
$$ 180 234 129 121 240 90 57 101 216 222 182 243 285 252 103 40 98 79 164 219 187 100 171 246 268 111 66 120 159 46 34 36 237
4305B37L1r3R4j46n5O2J18J1j84l8R1k1L0j2M0j11P3k5J4J5j4j0J06q4o0P6q1L9J6n1O2n8
$$ 237 268 175 269 123 68 130 248 259 75 37 128 107 137 125 165 54 127 102 116 131 117 107 213 129 69 145 64 103 119 68 130 72
3930G2L9J3N8m6J2k4pk0k2l1J65P0k7j0o4R0k8j06o7n0JK7J80j1j29P6Q5j59RNJ05r1OJ6P9
$$ 72 111 124 182 136 148 124 117 97 75 44 209 279 252 242 178 268 240 134 67 17 18 45 225 214 85 161 246 87 96 101 206 115 121 137 216
3519B16j73L3Oqn8J5N3K3k0ON2q1J22Rk4R3j85P3k2o2J03j12k4J09k3Q4o9M0j13K79O3j62
$$ 216 43 76 82 74 16 31 84 107 87 93 145 64 186 195 171 264 79 152 130 68 171 59 35 144 121 205 136 176 63 342 405 243
3143B43l1j77J59L54N01k73o61l9R2J42j4q3j99J12M04l38R30K31q83l14o3O2No7m2J03p5
$$ 243 212 35 194 548 1049 776 115 76 168 310 296 213 14 126 530 192 1122 1353 470 156 93 155 160 93 51 154 79
2826G9N5J22o9o7K7K8j47mQ8R0J09j65o9PJ9p6J37J05j74ON7J7K0r8rJ17P3p8j17pm7Q3K6
$$ 79 134 256 187 120 147 175 28 24 112 202 311 146 77 84 103 27 164 269 95 101 158 175 195 97 88 205 278 200 83 76 29 112 138
2439A38P9L9q6j47K8%l2N3M5J21l1j23J69J35j54n0j22P6OJ6k8O8J01o5m3j09P0N2Jp6rJ18
$$ 138 217 256 170 23 51 51 19 72 117 238 207 84 253 388 234 184 62 138 144 160 132 200 301 236 193 84 154 206 207 131 122 240
2063B40M9j40ln9L3KMJ16j32N5j25N2l3P8J36j56J11n5o3L4l8N1o7Q2N4k04J16J6j02J07J21
$$ 240 289 149 146 87 120 122 126 242 110 165 40 92 59 137 273 117 228 173 110 144 106 157 90 172 226 22 138 154 52 159 280
1700B80q7j15kNj0J51j8m5k6J25j05MJ08j48m8Q2M0j8j45MJ56o2m7L3p1LJ52R1ro3po4J76
$$ 280 193 78 76 81 71 222 204 159 133 258 153 157 265 117 69 151 191 173 28 32 188 126 79 112 41 44 196 287 278 215 208 144 320
1312C20J53l19M5m1j2m0R4p4O7R2j21m3kJR4n5m5j9q1J31n3q2J4M5M7k3O6M7j58R7p5N4J7
$$ 320 473 154 199 158 146 106 200 126 193 285 164 121 119 120 214 159 114 95 14 145 92 10 24 69 116 93 159 206 48 145 70 124 141
925A41L9Qj38Q7K7m7n4O4j02J14o2L6o2Q3lJ01j7o5j3r6Q4J4j17N2L5j0O3M8j21L8p5J18J
$$ 141 180 188 50 137 164 117 63 127 25 139 77 113 51 134 131 232 215 150 137 41 125 139 22 74 109 99 162 210 89 127 52 170 171
538A71q3PR4l2k8KL8j13N1l7J03l7qJ05o5j4j19M4J1M3k6q0M0N1J7Rp6J27j45M0l6L4kj5L4
$$ 171 88 95 189 157 129 131 169 56 107 70 173 136 128 233 168 154 35 79 90 133 107 27 67 118 135 144 68 195 50 90 54 88 86 71 105
127A05K31K3p5j35r4J1L1K9j2M4j03J46r8Q2or3l4Q8j20N6M6J1j2M2j13P7j06
$$ 105 336 359 284 149 55 66 97 126 114 158 55 201 103 185 179 86 52 140 20 76 122 133 121 163 50 127 21
-190B1
##PAGE=	F1=-497.407
##FIRST=	25169.313707327481097,	5807.6787752999953227,	0.21883262693881988525
##DATA TABLE=	(F2++(Y..Y)), PROFILE
5808H6k6m1L8L6M7J06j76J5m8Q0J63j31n9J3n0J45k6p1R8m6q8J47l3j68J56J54m0n0j49J53
$$ 86 60 19 57 93 140 246 70 85 37 117 280 149 90 103 53 198 172 101 199 153 65 212 179 11 167 321 281 231 82 235
5456B35j28k4O8j7p1J1N7o8J71p7Q3j24k1k3J27j70J14l6J36M7j44j9n5J46r3r8R4r1Q5p4
$$ 235 107 83 151 134 63 74 131 63 234 157 240 116 95 72 199 29 143 107 243 290 146 127 72 218 125 27 121 30 115 41
5103D1K7J5J02M1j41O3J9o6p1J11l8N5p2P6L0rQm2q8J52n7q4L1P9q0K11l6j35O2m7p0O7K7
$$ 41 68 83 185 226 85 148 167 101 30 141 103 158 86 162 192 183 191 149 61 213 156 72 103 182 102 313 277 142 204 157 87 154 181
4716A81n5p6J09P0q4QJ09j81QOJ23k7k0N1L5j2j50n3L9O0n1O2%o2P3P2K2j02r7Q3P2j30ko3
$$ 181 126 50 159 229 145 153 262 81 89 95 218 191 171 222 257 245 95 42 81 141 90 152 152 90 163 235 257 155 58 141 213 83 81 18
4317A8K39J0o8O1j42n5R0O3J4j08k8j2P7pj09O3k4Q4p4nM4kl0Q1k2p9N7p4J08p0l3P5m7lM8
$$ 18 257 267 199 260 118 63 153 216 230 122 94 82 159 152 43 106 82 166 92 87 131 129 99 180 158 79 136 62 170 100 67 142 95 92 140
3906A40N4K2n7n4L1lm7p4K07J26o7o9o5J12m2j29om5k9N5K05q5j33J49Q2j82pJ9P0j10J07
$$ 140 194 216 159 105 136 133 86 12 219 345 278 209 144 256 214 85 79 34 5 60 265 180 47 196 278 96 89 108 178 68 175
3542A75j9N9j90M1M7l9k9j1J6M7J2q3O1m5R3P2rP4j96J14m6k6J08j67L2O7r4J38m3km7L27
$$ 175 156 215 25 66 113 74 45 34 50 97 109 26 87 42 135 207 198 272 76 190 144 118 226 59 91 158 64 202 159 157 110 437
3167D37J3k27o0j28J89M47O29l49q04j31K21J23o7J5k20J48M07m55J221K41j079m34J6krq1
$$ 437 450 223 163 35 224 671 1300 951 147 16 237 360 293 308 88 236 643 188 1409 1650 571 137 153 151 142 61
2862F1OJ05q2P0L4q3N8k5Kj03j0QJ20J43j21k4j26L6k5P9N9j31M1Q5jk6m0j8R5O8o0r4L2r6
$$ 61 67 172 90 160 194 111 169 144 146 43 33 41 161 304 183 159 33 69 44 123 182 51 92 177 176 150 110 92 187 255 195 101 133 37
2462C7Q8pQ0M7p1j15l4MJ1O5N1J11j07j03K15O9j37o7r1J37j5O6o4L6R0o8m8p3J3Q6jn4k3
$$ 37 125 118 198 245 174 59 25 29 40 105 156 267 160 57 272 341 204 137 46 183 168 234 170 206 296 228 180 107 120 206 205 151 128
2075A28P0O3n4k6o2mo6J38O2j30P5j28J5m2J36J42k06J21o5q4O3n1L8n1P1Q1j94P0J1q9J10
$$ 128 198 261 207 181 119 115 49 187 249 119 194 66 81 39 175 317 111 232 167 83 146 95 133 82 153 234 40 110 121 32 142
1711A42Q2n4j13L2k6O6J45r1n7oJ33j29N0R1j65l8R8M5o7n2k1N8k2JK4m3o6J75O4K6j2l9p3
$$ 142 224 170 57 89 63 129 274 183 126 120 253 124 174 265 100 62 160 205 138 86 65 123 101 102 126 83 17 192 256 282 270 231 158
1324A58J21K22l57R9q3L4k5M9j34Q8O4j17o6k7J39P1r1m7j2p3J13j7o7%M9nK9R1Kj86Q9p0
$$ 158 279 501 144 243 160 194 169 218 84 172 236 119 53 26 165 236 145 98 86 13 126 109 42 42 91 86 115 206 208 22 111 41
948D1P0oO4pj19P1L1k5l7M7o4Q2o3K5o1L2M6J08k1q4%m9L0K2j05k1R8JO4M1j51Q8q2J08m0
$$ 41 111 105 169 162 43 114 145 120 83 130 66 148 85 110 49 81 127 235 214 130 130 81 111 133 28 7 105 106 170 211 60 148 66 174 134
538A34n1RJ17q3K5J0k4n5j0o1J17k8J2J09l0p8o2N6J6K1k7n3L0j7P4K3j07J32j54K3j2L0%
$$ 134 83 92 209 126 151 161 137 82 72 11 128 100 112 221 191 113 51 107 123 144 117 64 94 77 151 174 67 199 45 68 56 86 86
150H6o4N0K40Kq0j49QPk3R0r8N6rJ18j02M2Lr5K7N8j41R2Ol5J1M9j37J04j05
$$ 86 22 72 312 314 234 85 93 100 77 167 69 125 116 234 132 174 177 82 109 167 26 118 124 89 100 149 12 116 11
-190A1
##PAGE=	F1=-599.665
##FIRST=	25169.313707327481097,	5807.6787752999953227,	0.11184349656105041504
##DATA TABLE=	(F2++(Y..Y)), PROFILE
5808I0n0j1K7L3K3J53k02M7l2O2J13m9j91J26m1J72p4j02J02r3o7J30nj23J51J84r2r3o8Q9
$$ 90 40 29 56 89 112 265 63 110 78 140 253 204 13 139 98 270 196 94 196 103 36 166 161 38 189 373 281 188 120 209
5456B09q8o4J08o2k1K0O2j11J94o5P1j51K2m8J15j77R8M3Q6M6j38Po6R8o3p1Q0p0O9n7J2J6
$$ 209 121 57 165 103 82 102 164 53 247 182 253 102 124 76 191 14 112 155 241 287 149 156 90 188 125 54 134 64 133 76 88 104
5080A04Q7K2j59R3Np1l2R1l1L3n0P9j7J8M8m8j24K09n6o9n5J29q6J53m0r1O5r0p4J35mr5J5
$$ 104 191 213 54 147 152 81 49 140 109 142 92 171 154 172 220 172 48 257 201 132 77 206 120 273 233 142 207 117 43 178 174 79 94
4693I4N9L8o7M7J05j94K5j9J24p0NK5L9J7j22o5K4J14j32K4L4PL1P2M2o7j22J11P3j35Qj22
$$ 94 153 191 124 171 276 82 107 88 212 142 147 172 211 228 106 41 65 179 47 71 105 112 143 215 257 190 68 179 252 117 125 3
4317CK83k2n0K2j41l5R2kM3k4j7p7J25l7j23pQ7Q5j09l1O0J5n1Q4J2r7J9j0J43j36j9J04o3
$$ 3 286 264 214 236 95 60 152 150 193 169 152 75 200 163 40 33 120 205 96 65 125 140 89 173 185 88 107 97 240 104 85 189 126
3930A26n6Q6M5Q8r7j12P8K1k6j05J59J58p6j32m3J20m7j63M2J3p0N9K18j20r6J54Q0j85l3
$$ 126 70 156 201 289 192 80 158 179 153 48 207 365 289 157 114 234 187 24 66 79 9 68 286 166 70 224 304 119 86
3589H6J5L9j24J86l6K3j08j2O9n9j4Jj6M0M7r6O0p9N6J35PL6j77J36m3k1J13j79O5Qj28J59
$$ 86 101 140 16 202 166 189 81 69 138 79 65 66 50 90 137 41 101 22 78 213 220 256 79 215 172 151 264 85 150 158 30 189
3214A89j9m9L1L24m7k49n4m1J38M98O65l86q28j02K26Q3j14J08k10J79L75n31J350K34j162
$$ 189 170 121 152 476 429 180 126 85 223 721 1386 1000 172 70 296 379 265 373 163 342 717 186 1536 1770 608
2920F08m97P7k7n8r3P8R0p4Q0o1m4J45r0m0km6j7J07J55p5Kj25l2%L3rp5P0R5J4j14L4jN7
$$ 608 111 188 161 103 10 88 178 104 184 123 79 224 134 94 92 46 29 136 291 216 218 93 61 61 94 85 10 80 175 189 75 109 108 165
2521A65N3n8l9O9j44P6k0O8N2m9q8p7J6L4N8O3Q1j28k4J73J6j17p1n5J56m7J21j04J1R9p4
$$ 165 218 160 121 190 46 122 102 170 222 173 85 8 24 58 116 179 260 132 108 281 297 180 109 54 210 163 284 180 191 290 216
2157B16o1j4n2J24k6l3onP5O1p0o2l7n9J97lj16Q3j10k3OJ18J36k30J39n7q7M2p5L5j9N7P2
$$ 216 155 141 89 213 187 154 148 143 218 279 209 147 110 51 248 245 129 212 102 79 85 203 339 109 248 191 104 146 71 106 87 144 216
1770B16j52L1J1q8J14K9k1j08J14p9J12J34j27r6L1R9j41Q6Q1j75m7J28N7j26Q5o2m4L7J3
$$ 216 64 95 106 18 132 161 140 32 146 67 179 313 186 90 121 220 79 165 246 71 24 152 209 83 168 106 62 99 112
1430A12J9j3p9J28L6O4N2n6j07O9K69l71J38j14P6QJj70Q7J3r6j5K5J47L1j45m4J9p9R3K3
$$ 112 131 118 39 167 203 267 319 263 156 225 494 123 261 147 223 231 232 62 149 162 66 51 76 223 254 109 65 84 5 98 121
1066A21l9K0L7r6Q3J01l0j57K7l6N8k2R1l4q0M8L1J1l4J2j1O0o5J5j2l7N6J12k2j14K5kl3
$$ 121 82 102 139 43 126 227 197 40 67 31 89 67 158 124 44 92 123 134 100 112 101 161 96 111 99 62 118 230 208 94 119 117 84
678H4L9p6K0Q2l8N0K7j51J34r8J24j14qJ0J35q4K3M9r9k1l1J0L8l3M0Q4kj27kN8K1Qm6qK3
$$ 84 123 47 67 149 111 161 188 37 171 73 197 83 75 85 220 136 159 208 109 88 57 67 105 72 112 196 194 67 65 123 144 152 106 98 121
268A21p8J34K6j38J24j37rJ1J6Ll6%K31op1j57J15k5l1R7j45L8R0Q2j13K3J3j04Q0K8j47J24
$$ 121 43 177 203 65 189 52 43 54 70 73 37 37 268 262 191 34 149 124 93 190 45 83 173 255 142 165 178 74 154 182 35 159
-108A59j7k1m0M0q5R5j11
$$ 159 142 121 81 121 36 131 20
-190B0
##PAGE=	F1=-701.923
##FIRST=	25169.313707327481097,	5807.6787752999953227,	0.06185305863618850708
##DATA TABLE=	(F2++(Y..Y)), PROFILE
5808H9m2J4j4K9J0J85k22Q9k5M1P9J9j87J10QJ42j10j18J07j23o4R7J2n6J26K11j11j47qK5
$$ 89 47 61 47 76 86 271 49 138 113 154 233 252 65 175 183 325 215 97 204 81 17 114 126 70 196 407 296 149 141 166
5456A66m5j08J58r2M1K0L6j07J75m8N1j10L2j06J14j58N2J18L1N2j28J9q0P5l7l2O9n7M2m4
$$ 166 121 13 171 79 120 140 176 69 244 196 247 137 169 63 177 19 71 189 220 272 144 163 83 158 121 89 158 101 143 99
5103I9J5OP1j7j53J38l4p4M2L8l5J9l2P9n5M3Q1m2j49K49n1m3p7R8r7R6n4n6O0r8PJ14k3r8
$$ 99 114 120 191 174 21 159 125 51 93 131 96 115 83 162 107 150 231 189 40 289 238 195 118 216 119 215 161 105 165 67 74 188 165 67
4704F7J05jm8m9J08R3j84Rj2J04j11L1nM9N5q0r9K4J21r5n0L0O6kO3O1n8j14J47N2j38J8j36
$$ 67 172 171 123 74 182 275 91 100 88 192 81 112 107 156 211 131 32 56 177 82 32 62 128 126 189 250 192 78 225 277 139 157 21
4317B1K76m5l9j2j36NO4p4R2M4j1o5R6n3n1p0J23P4j29n6O3L2p1J10J0j10k1R2J41j93rJ36
$$ 21 297 252 213 201 65 70 134 60 152 196 185 120 216 163 112 42 165 239 110 54 117 149 78 188 198 88 67 159 300 107 98 234
3941B34q3r7J17L2J38j16j71J37J8mj34J11J64o6j83RR7k9j20j5P2q7M6K05j05o9J39Q1j79
$$ 234 151 54 171 203 341 225 54 191 209 205 71 182 346 280 97 106 203 174 54 39 111 24 70 275 170 101 240 321 142
3601A42n6rJ9l7J39l9j6j5m6O7o3j0L4j5MO5p3P5j55L2J73J8k0j30J39k8l5J15j56P7m9p2
$$ 142 86 77 96 59 198 159 143 128 82 149 86 76 110 95 99 164 91 166 11 43 216 234 214 84 223 195 160 275 119 196 147 75
3225G5R4lp9R9K65j06k18j7OP7N03O24l82p59n6J97M0j42J68j81J95L19n43J291K14j118m88
$$ 75 169 166 87 186 451 345 127 110 116 193 696 1320 938 179 123 320 360 218 386 205 400 719 176 1467 1681 563 75
2909G5J35k6j29mO0O5o2Q0j26O3J41j56q8J09o7K2N1J33l7Nq6q7NRn7j0N1Q8M9j53M0K8K7
$$ 75 210 184 55 51 111 176 114 194 68 131 272 116 28 137 70 92 143 276 239 244 158 71 76 85 28 18 69 157 206 53 93 121 148
2521A48K7p4L6R9j80N3l3N8O1l0p0n6MJ8L8R0L2q8L3J09j6j02o0j5J26q0J73j45KJ23q1q5
$$ 148 175 101 137 236 56 109 76 134 195 165 95 39 43 61 99 189 221 133 166 275 259 157 97 82 208 128 301 156 158 281 200 115
2146A15N6j12J62o1j8L7p1Q4J53j19n7o1jJ87o4r0P7p8m7L7P8J27k32J61l7q5nr5M1J1M4M3
$$ 115 171 59 221 160 142 179 108 192 345 226 169 108 107 294 230 140 217 139 92 129 207 334 102 263 226 141 136 41 82 93 137 180
1770A80p4j9K1r5J40j9k7o7J61j23J30J13j23j07M7L5j17Q1P8j67NP3P1j39J87j01o1M6k0
$$ 180 106 87 108 13 153 134 107 40 201 78 208 321 198 91 138 173 56 137 215 48 53 126 197 58 245 144 83 129 109
1430A09J7Rp3O2J4R8J08o5j42K6K94l54J43j24J09M1k9j63M6k2l9L4O3J07%j91k3K5o1P7M9
$$ 109 126 135 62 124 138 236 344 279 137 163 457 103 246 122 231 272 243 80 126 104 65 99 162 269 269 78 55 80 19 96 145
1066A45k4L0L3j42J02O4l8j16lJ5nk3J08n2k1LL4M5m8k8M0M3n0j8O4p9J6J23k0j35M7J9o6
$$ 145 121 151 184 42 144 208 170 54 51 66 61 38 146 94 73 76 110 155 107 79 119 162 112 94 158 79 95 218 198 63 110 129 63
678F3M3n0Q4R1j08NJ2r9J55j26J48j86L2J5J45m7k8J00j08o4qO3k3m0L8N0K0j51N4M6K8Mq1
$$ 63 106 56 140 231 123 128 140 41 196 70 218 32 64 79 224 177 149 249 141 77 69 132 109 69 107 157 177 26 80 126 154 158 77
291G7M9J8q1J34K8j55R9r8m2J9nPK8n8J95Mn5j22J52o3lO4j30k2J73M5j24K7K2j15J10Jj35
$$ 77 126 144 63 197 225 70 169 71 29 48 43 50 78 20 215 219 164 42 194 131 128 192 62 40 213 258 134 161 183 68 178 179 44
-96D4J45k9J6j12K5k4Q7j14
$$ 44 189 160 176 64 89 65 152 38
-190C8
##PAGE=	F1=-804.181
##FIRST=	25169.313707327481097,	5807.6787752999953227,	0.050616621971130371094
##DATA TABLE=	(F2++(Y..Y)), PROFILE
5808H4pPm9K2J5J91k30J27j7J1P6N3j59P7M6J05j30j14J03j11q8N9J0K0P6K31q6k00K3l6k
$$ 84 77 84 35 57 72 263 33 160 143 154 230 283 124 201 247 352 222 108 211 100 12 71 81 101 177 408 322 122 145 109 107
5444A07o7J29j12J04J7j0r6J55l2K5j9K4j81J14j03qJ55j7O9j16Lr1R2k4%N7m4J5k8K7j6O5
$$ 107 40 169 57 161 178 168 72 227 195 220 201 225 44 158 55 47 202 185 254 138 141 50 142 118 118 175 131 146 118 145 129 194
5068A94p0r7J47p0o9R2%m4Mk5P2p6P0R4k1j58K58m4qo3K5j14M6n6m6M6o5P1Q3k8n7J50l7j66
$$ 194 124 27 174 104 35 127 127 83 87 62 134 58 128 222 201 43 301 257 249 186 211 97 143 87 41 87 22 93 176 148 91 241 204 38
4669C8J8J41N9j53l2L6N6j38M8j8M9R8l6j11J5O8j7l0k6O4nL1P3o3q4J88K0j40K2j34K35m4
$$ 38 56 197 256 103 71 107 163 25 73 55 104 202 166 55 70 138 121 91 65 129 124 155 228 165 81 269 289 149 171 37 272 228
4294B28l2l2j11L8K0m7N0P7kj4L0n8J3o0J09O2j51p4O5M0q1J35j8j09m9J92J14k39OJ53r4
$$ 228 196 164 53 91 111 64 114 191 189 175 205 147 160 100 209 271 120 46 111 151 70 205 187 78 29 221 335 96 102 255 161
3930A61j11J33J6J67j22k03J86j0Oj50Q1J52m7k19P4N2Qn4o7P1p3L0J47n4n8J27P9j73o0m6
$$ 161 50 183 199 366 244 41 227 217 223 73 154 306 259 40 114 166 174 120 53 124 51 81 228 174 116 243 322 149 89 43
3578D3RM8O9l1l8O3p3N0n3lP4j5k4O2n8R1k00N5J47J7q5o3J30j6m8J06j11P9r4j6L2Jo9J27
$$ 43 52 100 169 138 100 163 90 140 87 84 158 143 119 181 123 214 14 69 216 233 148 85 215 199 151 257 146 225 131 115 147 148 79 206
3178B06J68j51j47L1J2K6M63N28l41o33j4J47J0j43J83j45J82K54m79J060J85r60m06J97k9
$$ 206 374 223 76 107 119 145 608 1136 795 162 148 295 305 162 345 200 382 636 157 1217 1402 442 36 233 204
2885B04j80P5L1L7n2O5j38J33J27k09n1J19m9L3J6J00j5j4l2j21J3nqn4M2O6Q4p6p7N5K3j0
$$ 204 24 99 130 167 115 180 42 175 302 93 42 161 112 145 161 261 246 232 200 79 92 87 79 25 67 133 217 141 64 119 142 132
2509A32j01J10J23j95K7o0O0P4k0n7pj7j1MJ31k2l6P1N0l8q8m0M3M5r3K01j80J1J54r0j22
$$ 132 31 141 264 69 96 36 96 170 150 93 86 69 58 62 193 171 135 206 256 218 130 90 133 178 85 286 106 117 271 181 59
2146E9J27j52J88r0nQ3q3P0J91j56m9p7K9J85j09n9N6l4n3L4L2J14k18J81j7q2n2q9L9L6K2
$$ 59 186 34 222 132 127 210 127 197 388 232 183 106 135 320 211 152 208 174 121 155 187 301 83 264 247 165 113 24 63 99 121
1782A21J9J3p0L1r0J77l1q2j4J55j50J28R0r6o9K4j8n2J6P6j15O7m0Q6m5J77j35l1J8o7K6
$$ 121 140 153 83 114 24 201 170 88 74 229 79 207 297 201 132 156 138 86 102 178 63 130 90 176 131 308 173 142 160 93 119
1418A19J4o0NnJ25J37p4j54nK94k95R9j11J33O0l3j31jJ8%pQ6P7j3j80j2j4j7P4M9k7K6L4
$$ 119 133 73 78 73 198 335 261 107 102 396 101 200 89 222 282 249 118 117 135 135 128 214 291 278 98 86 72 55 129 178 151 177 211
1031B11j23Q9k7j9p9L5K7o5kQ3l2J6m5M2O3p0n5O8K8rq6J56r9l6J27j5r9L1Jm2Ok6J52J21
$$ 211 88 177 150 131 52 87 114 49 47 130 98 114 69 111 174 104 49 117 145 136 50 206 107 71 198 183 84 115 116 74 80 54 206 327
631C27j81p3Qk2J63j63J60j71KL4J43lr9J44n6j40J6Q3n7m1J1L2L8r9M1K1M3Kj20J09J3o0
$$ 327 146 73 81 59 222 59 219 48 50 84 227 224 125 269 213 73 89 172 115 74 85 117 155 56 97 118 161 163 43 152 165 105
256A05J00L2j53N8n0m4rk2jR2o5J19L2l3j03J60r2K9K4q9o9K09J1j16K9L6j24J16j7j16J47
$$ 105 205 237 84 142 92 48 39 17 16 108 43 162 194 161 58 218 126 155 179 90 21 230 241 125 154 190 66 182 165 49 196
-108A96l3M9j61J9J2Q2j03
$$ 196 163 212 51 70 82 164 61
-190F1
##PAGE=	F1=-906.439
##FIRST=	25169.313707327481097,	5807.6787752999953227,	0.19412845373153686523
##DATA TABLE=	(F2++(Y..Y)), PROFILE
5808G4L2j5n2J7J7J70k25J55mk7R9N2j38N2P2P1j37r4Q8q4r7K1rR1MK39l2k32K2q2L4mP4j18
$$ 74 106 91 39 56 73 243 18 173 169 142 241 293 155 207 279 350 213 119 207 123 26 47 38 129 133 372 340 108 130 48 82 78 152 34
5409C4J61Qo1r2J52k1pP6J6k23R1m5l7J42n0R3r6m1r4J35k1J7M0l4LNL0m6O5j03m7J24o8l8
$$ 34 195 203 142 50 202 181 174 250 266 43 134 89 52 194 144 237 141 100 6 141 120 137 177 143 146 151 181 135 200 97 50 174 106 68
5010F8P5j6m5j8j9M8n4Q2P3J5j51K32l9L1l8n1j28JK1l6l8O1PP4k1k3J75n3j81O3J07lj03
$$ 68 143 127 82 64 45 93 39 121 194 209 58 290 251 282 244 193 65 66 87 51 13 74 81 155 134 111 286 233 52 115 222 219 116
4622A16q5J07Nq8k0K2RJ39Jj09%j6O4ql9J9J6j8P8o8m9K30j3j46J8j16J58j8k2l5o5N1k5P0
$$ 116 31 138 143 55 35 57 66 205 206 97 97 81 145 137 98 117 133 115 193 125 76 306 293 147 165 49 207 189 167 132 67 118 93 163
4223A63o4N4J4N7n4n4N9m1J14N5j81r2P8L4p2J37n8r2l4K38P6k69L0J49r3r9J37kJ73j19j92
$$ 163 99 153 167 224 170 116 175 134 248 303 122 30 108 142 70 207 149 57 23 261 337 68 98 247 154 55 192 190 363 244 52
3859E2K04n3Mj47O8J35k9k10R9KM5Lo6Ql5L2L7J6n1J21O9j72m0o4%Q9J1j5j1Q3j01L1m0K1
$$ 52 256 203 207 60 128 263 234 24 123 125 170 173 107 115 80 112 149 165 114 235 304 132 92 28 28 117 128 113 102 185 84 115 75 96
3460I6J06k5m2M8m9R3j99P6J11nj47K1J08j6m3Q7o0P8j17J2qkk1J05O3j44q6P6k1%L85M01
$$ 96 202 177 135 183 134 227 28 104 215 210 63 84 192 176 133 220 160 238 121 133 125 123 102 207 270 126 40 116 95 95 480 881
3085H81k73m85K2Q2%j15J48j06J36J89l36P00J55p27k70K56m9j63P9K1J0n5M3j14J51J26k37
$$ 881 608 123 145 227 227 112 260 154 290 479 143 843 998 271 1 257 208 45 124 145 155 100 143 29 180 306 69
2768F9K4O1PK5j9Q1j1n2K2j25K9k0K1r6O5L3J02Lj90O7M7n3k9O8J45j86Mq0M5R1j5l1L6l5
$$ 69 93 154 161 186 167 248 237 185 207 82 111 91 112 16 81 114 216 219 29 96 143 90 61 129 274 88 92 12 57 148 133 102 138 103
2369A03k9l7J57n3k8J06J4o7o9j6J07m5n3J56k00L2J80r4j24J49j54J78j06J0J09o0M6J85
$$ 103 74 37 194 141 113 219 233 166 97 81 188 143 90 246 46 78 258 164 40 189 35 213 107 117 226 166 212 397
2040C97j69m4p9K6J99j24m1K3J9m6lpR5j92J93mp1r6l6J9O1k5M0N5j15M3p9K10k5j19mJ18
$$ 397 228 184 105 131 330 206 165 188 207 161 158 151 246 54 247 243 172 76 40 59 120 95 135 190 75 118 39 249 224 105 101 219
1664B19j57J15P0o1j7rl5rl7O6m6J03j45J14N1J29j59mj1j04M1Om6ol0J23J31q3j26l3K71
$$ 219 62 177 247 186 169 160 125 116 79 145 99 202 57 171 222 351 192 188 177 73 114 120 74 68 38 161 292 209 83 50 321
1300C21j97Rp6J44N4qr0l5P9J4p9Q9N5nj31k9n4L4O9L7l7J0L6q8R4j47K7o2R5L3q6JL3J2L1
$$ 321 124 133 57 201 255 247 157 122 201 215 136 225 280 275 144 115 61 95 164 201 164 174 210 122 216 69 96 34 129 162 76 77 110 122 153
890A53p8M3O7r2l5M6J0N1j21J86j01n2R6j1k2qn2K0n5NK09J55k41j40L4LJ73j95J49j05n6
$$ 153 75 118 185 93 58 104 114 165 44 230 129 77 173 162 140 132 80 100 45 50 259 414 173 33 67 70 243 48 197 92 36
526C6O6J31L0j59J55J6j75RO8p2l5j4M9M5l5%j3O8jj26J37On0O2L8j30Lol2m4Pj2J06m8L5
$$ 36 102 233 263 104 259 275 100 109 177 105 70 56 105 150 115 115 102 170 169 43 180 186 136 198 236 106 109 103 71 27 34 22 128 80 115
115A15P3nj32J68j03M5mm5o9J78j5q0J4O1j35J13k6j10J34l0P7j83L8RP2p9
$$ 115 188 183 51 219 116 161 157 112 43 221 206 126 140 201 66 179 153 43 177 147 224 41 79 88 160 81
-190H1
##PAGE=	F1=-1008.7
##FIRST=	25169.313707327481097,	5807.6787752999953227,	0
##DATA TABLE=	(F2++(Y..Y)), PROFILE
5808F5O0m4k1K6pJ39j94J58Ro7J29K9j27L6R0M3j35o8O0n7p3orJ13o5K16L6k30mr8M6M8J9
$$ 65 125 81 60 86 79 218 24 182 191 124 253 282 155 191 281 324 189 121 181 124 51 45 36 149 84 300 336 106 102 4 50 98 117
5420A17q5J79Kj08r3J63j9l7J47Mk11M9No0J17o7J15o8p3mP2k4K0K2l0RN6L1r1O4q1o3R1k7
$$ 117 32 211 213 105 12 175 156 119 266 270 59 108 113 53 170 103 218 150 77 73 145 121 141 163 133 142 198 229 138 202 121 58 149 122
5021A22oK1k0l4l8QJK2N3K6N7j30J74l9P1pj18j11m3J43k7k6M5j00J04j7k0J88n5j14M0P8
$$ 122 116 137 117 83 45 53 54 76 129 155 212 82 256 217 288 281 163 52 9 152 125 99 144 44 148 131 111 299 244 130 170 248
4646B48p8m4q8J32j0n4r1O2l3J68K8j09j6q1J23Om5k0M1o7R2n7l6K61m3j51Lp2M3L1rk1k7
$$ 248 170 126 38 170 160 106 15 77 44 212 240 131 115 34 157 163 118 98 139 72 164 107 71 332 289 138 141 69 112 143 134 113 86
4258H6N7n5J57j14m6M9J28j38n1Q2j6J36N6k06j12R4J1l8J08j02n3J4K21L7k76N6J29q3p1
$$ 86 143 88 245 131 85 134 262 124 73 155 139 275 331 125 13 107 118 80 188 86 33 47 268 305 29 85 214 131 60
3918F0J33j4J58j08j53J94r6j0j12M7J27j8j47O2l7O7N0m2p6J9M6r5Q4l7J17M9j77kl1qO3
$$ 60 193 179 337 229 76 270 174 164 52 99 226 208 61 123 86 153 203 161 85 104 150 55 139 102 219 268 91 89 58 50 113
3554A13j9JN1M9j28K4m2O4J19m2n1K9m0P6j56P9Q6m8j35O2O7k9pN3j3P4j17Rk5lL2N1qj1j39
$$ 113 94 95 146 195 67 91 49 113 232 190 139 168 128 204 48 127 213 165 30 92 159 130 123 176 163 237 120 129 104 101 133 184 176 165 26
3143B6J14q8J4K68K71j88l45M8J2J1n3P1o7N6J36j33K79J26m73o2K45q3j29O6L9k1p2K8m5
$$ 26 140 52 66 334 605 417 72 120 132 143 90 161 94 150 286 153 432 558 85 23 268 185 56 122 161 140 68 96 51
2803E1R9J36k40P1JQ6Qn7P9k1j00O4q7L7l3K3q8P8nR8O6k34J8R5j01Q5l0J72j57k5l2k5R5
$$ 51 150 286 46 117 118 204 212 155 234 213 113 177 90 127 94 117 29 107 102 200 266 32 50 145 44 129 99 271 114 89 57 32 127
2416A27kJ2M8m6l0m6J25m1q4J40J4j05n1RJ57q1JM7j44LJ90q4m6P5j28J31j03L0J01l3L0J52
$$ 127 125 137 185 139 109 63 188 147 63 203 217 112 61 70 227 146 147 194 50 53 243 159 113 188 60 191 88 118 219 186 216 368
2040C68j48n1o9PK21j09m0j6P4l2o7l2P5j38J72jn0j22K0K4O8q5J10K8j43N2o3K23j3j14l6
$$ 368 220 169 100 107 328 219 179 163 237 205 138 106 181 43 215 214 164 42 62 86 154 69 179 207 64 116 53 276 263 149 113
1676A13O4j48R8O4l0J7l4k7Lm5M4J1J24k10J55J01P2j71J3l5j17N3ol7L0l7P0R3r1n6l9J98
$$ 113 177 29 127 191 161 178 144 117 120 75 119 130 254 44 199 300 372 201 214 179 62 115 109 72 102 65 135 228 137 81 42 240
1300B40q3r2k6J35K2L9m7o1J19M1j49N8M6J1p5m8p4P0N2J9m2j4M0m9J10k02M8n0J23M0q3j6
$$ 240 157 65 39 174 196 235 188 127 246 287 138 196 242 253 178 130 56 126 178 197 155 141 181 132 242 40 88 38 161 201 118 102
925A02j3M6M4q9L3O4j06QNj5J17o8R6q7k2K7qO3n1j15Q3j00M7K35J78k83r4K4m9J75k02J17
$$ 102 89 135 179 90 123 187 81 89 94 79 196 128 224 137 115 142 134 197 146 31 114 14 61 296 474 191 97 121 72 247 45 162
549A62m0r7J00J16M5j84J19Q2j60j6J6o8k2J8O7K8Nm1n0R6kj00J40qn8K8M8r6n6K6j7p0N0
$$ 162 122 25 125 241 286 102 221 303 143 127 143 75 53 71 138 166 171 130 80 176 174 74 214 206 148 176 224 128 72 98 81 11 61
162F1%Q4k2l7J06K7j93J77r1K9j4po4J33k8k8qR1j50J22k9j36J12k2J07j90P1k0O3n0
$$ 61 61 145 123 86 192 219 26 203 112 141 127 120 56 189 161 133 125 216 66 188 159 23 135 113 220 30 101 81 144 94
-190I4
##PAGE=	F1=-1110.95
##FIRST=	25169.313707327481097,	5807.6787752999953227,	0
##DATA TABLE=	(F2++(Y..Y)), PROFILE
5808F1O9p1K6M2m5J14j38J43Qj01J51mj28K5J08K4j28m8K4l3j7j6j2R8p8J31J01j96m1m0j3
$$ 61 130 59 85 127 82 196 58 201 209 108 259 255 127 152 260 284 156 108 132 99 82 66 54 152 74 205 306 110 69 29 16
5444A6Q3l3lJ45Oj48lR2l3n5J83j7j61J2L8r1J06o6J20l7m6L0Qk9J6Rl0J7J12M5j49N5l4j07
$$ 16 99 66 63 208 214 66 63 155 122 67 250 233 72 84 122 31 137 71 191 154 108 138 146 117 133 142 112 129 241 286 137 192 158 51
5045E1N5K6K8m7k2j0n4N7k8N9K6k8R4j01J01m4J02K6j62n7MJ32k9j3L8j88J43k1n0J91m5n1
$$ 51 106 132 160 113 91 81 27 84 56 115 141 113 207 106 207 163 265 291 129 72 76 208 179 166 204 16 159 138 88 279 234 183
4669A83J3O2j45J2n5J22J4o0r4K8m2J71M2j09l0o4J16J2n8m9O8q7J12l4n9K73o4j55j8Lp6
$$ 183 196 258 113 125 70 192 206 146 52 80 38 209 251 142 112 48 164 176 118 69 137 50 162 128 69 342 278 123 105 108 32
4305C2O7NOj1O4n5J87j10j75J01J75j98m3O2J5J67N7k09j00O8k2J3O6j28J2K3J72J1k33M0
$$ 32 99 104 110 99 163 108 295 185 10 111 286 88 45 107 122 289 346 137 37 105 83 96 162 34 46 69 241 252 19 59
3953E9J10p1l4J18j8J34r0j04J61j25k6l9j1J26pr6K8n9P0Q0pj58P7N6j31N8j3J11J9j85M2
$$ 59 169 98 64 182 164 298 208 104 265 140 114 75 64 190 183 87 115 56 126 206 199 41 118 174 43 101 88 199 218 33 75
3589G5J4j9K4j3LJ00J1j45M3p8J14J14o6m7J2l2M7q9P3O9j07J1KLl7M1J7J5O8r7j2l3MP1j1
$$ 75 89 70 94 81 84 184 195 50 93 15 129 243 177 130 142 110 157 68 141 210 103 114 116 119 82 123 140 155 223 126 114 81 85 156 145
3178A45j7J19k20J38j53O2J19J61j00k32O5n1M6J8Ol2l1N5P8n6M9q8l7K14j21r6N7Q0n5r8
$$ 145 128 247 27 165 12 74 193 354 254 22 87 36 82 100 106 74 43 98 176 120 169 81 44 258 137 41 98 178 123 25
2826B5M1L3JJ47k21Q3m8J71j0r2Q6l9j47Q4oL1m4J1m1O5l4P6J05k02o2J35j41J72j20K03j17
$$ 25 66 99 100 247 26 109 61 232 222 130 216 177 30 114 108 139 95 106 65 130 96 172 277 75 13 148 7 179 59 262 145
2462A45o7J4m9N9K4N2L3m6k8n1Q2oj55J52M9j20n5L4J64m2J3n0n3n2J82n4J2Nj08P6q9N3O3
$$ 145 78 92 43 102 126 178 211 165 137 86 168 162 7 159 208 88 33 67 231 189 202 152 99 47 229 175 187 192 84 160 71 124 187
2075A87pK9R7r1p8n1QK15p5m2m5J15k0j44l5N8m6R8pk3q7K8N1N2j15J70m1j47N4m5K07Qq2
$$ 187 180 209 306 215 137 86 94 309 234 192 147 262 242 98 63 121 75 173 166 143 56 84 135 187 72 242 201 54 108 63 270 278 196
1688A96q8Rr8N6P8mLm1j4Lj4J4N5J27k33J93J08K0j66K0n0j00M6j3l8O6l9K5L6q8K6k4R3K3
$$ 196 108 117 19 75 153 149 152 111 97 100 86 100 155 282 49 242 350 370 204 224 174 74 120 107 69 135 96 121 157 69 95 71 164 187
1289A87j37lJ00k6J00j5q3J33Q6j90j2M5K2j9n0p6P7K5%l8m0M2j5J35j47%j4R3M3p3l6m3N5
$$ 187 50 47 147 121 221 206 123 256 342 152 140 185 207 188 138 62 139 164 164 126 86 128 113 248 101 101 87 180 223 150 114 71 126
901A26O4p8J1O1j11M3k5m2J76j4k3o1L1n1nJ42j00j25R1p5M9K29J80k98l1Pr9J53j75Q3Kj08
$$ 126 190 112 123 184 73 116 91 49 225 211 188 127 158 107 102 244 144 19 110 35 84 313 493 195 164 171 72 225 50 133 135 27
526B7J13J04M2j73N2J26j10m3o1m8KQ4N9QL1p6p5J14jp0J46k7q3%O6o3j09M6qn3O2J1P4%p7
$$ 27 140 244 286 113 165 291 181 138 77 29 31 115 174 182 213 137 62 176 175 105 251 224 141 141 207 144 35 81 73 20 82 93 167 167 90
115I0J04O1k49J78o0k1j3K0n2Q1k5J4j1J17j67J45k7j60N8j0J40j93J00n5N6k4
$$ 90 194 255 6 184 124 103 90 110 58 139 114 128 117 234 67 212 185 25 83 73 213 20 120 65 121 97
-190I7
##PAGE=	F1=-1213.21
##FIRST=	25169.313707327481097,	5807.6787752999953227,	0
##DATA TABLE=	(F2++(Y..Y)), PROFILE
5808F1O0p7O2N5q5R9p1J31j3j26J67m3j39J7J27J4j16m4j7oO4j5n1Q0k2lJ46j44n5l2jO9q3
$$ 61 121 44 106 161 76 175 104 235 222 96 263 220 81 98 225 239 123 79 62 56 120 105 54 134 112 109 255 111 56 24 23 92 9
5420IQ5J03K7j90J02Po0l9J72n5q3j0N1q9P2m3R2qJ1L2m4l6J2Lj5MJ49P9k06L1J4j26J9O2
$$ 9 94 197 224 34 136 143 83 44 216 161 78 68 119 30 102 59 151 143 154 186 142 106 118 121 106 110 259 338 132 163 177 51 70 132
5021A32N9j11k8L3n3R0l6N6Lp1J13o5L4m0J08N4j78mL1J10l3kM3j76R9k7q9J83k8mj7N3j85
$$ 132 191 80 52 85 32 122 86 142 145 74 187 122 156 116 224 278 100 96 127 237 204 202 245 69 168 141 52 235 207 203 186 239 54
4634E4N2k5J16N5q0p4k6l2J49L8r9m2j0R1J8p7q1J00n7J14k6q4K55p5j52l9R8n9l6J8L4j0
$$ 54 106 81 197 252 172 98 72 40 189 227 128 86 76 167 185 108 27 127 70 184 158 74 329 254 102 63 161 102 66 84 118 108
4258A08O4k1J59p9j44K6J83k16Jk4L7J98N0j89q5L8o3P1L5n3nmR9J4j52k4J01o0MQ5qJ10o2
$$ 108 172 151 310 231 87 113 296 80 81 57 94 292 342 153 68 106 43 114 149 96 91 87 186 200 48 24 125 65 69 154 146 256 194
3871A94o3J12j31k2J8q4J19J2n8Oo6O7Q0L0k05J15M8n9n3K3R9j8j37K7N1l1oJ4j0J22qj33
$$ 194 131 243 112 90 108 24 143 155 97 103 37 104 184 214 9 124 172 113 60 83 182 164 27 54 105 74 68 82 72 194 186 53
3495E3O4r6J20R3r1k6Ol6K1k6O5N6j49J25k9p0rN3lK0N7o9k0m7J7Q4n3K0J66k62J41j38O1
$$ 53 117 21 141 234 143 117 123 87 108 82 147 203 54 179 150 80 71 124 121 141 198 129 109 62 79 163 110 130 296 34 175 37 98
3108I8k6Q3j4j23M9mJ4L6K3l7L1p4J30P1j39Q3j31J63j49o8N2J21q2p8N0O0q5J51j79N0o5
$$ 98 72 155 141 18 67 63 77 113 136 99 130 56 186 257 118 201 70 233 84 16 68 189 107 29 79 139 54 205 26 76 11
2744A1K29k7j08Q5n7q9j0R9J5n4jMM4n0N0J17j38l2P0j00J45j83K35p7j26O2m4KN5P6Ml9k6
$$ 11 240 213 105 190 133 44 34 133 148 94 93 97 141 91 141 258 120 88 158 58 203 20 255 178 52 114 70 72 127 203 207 168 142
2357A42o0N0K7p8J2J05q9p0L8J19M3lr5rp3J57j2L6m5r8K8o2O4QJ3N4K2j1j12l9N4J49l6l0
$$ 142 82 132 159 81 93 198 109 39 77 196 239 236 141 132 59 216 204 240 195 97 125 63 127 135 148 202 224 213 101 62 116 265 229 199
1958A99m7J25j4k12k2N5L0J1j3%j9J4P7K0r8J90j18j26M2k9J64M4m1j40k3nnR5J7p3l1KJ8
$$ 199 152 277 263 51 29 84 114 125 112 112 93 107 184 204 106 296 178 52 94 65 229 273 232 92 69 64 59 154 171 98 67 69 87
1570H7J6j9R0J12k28K16Q9j5j45K1n6p1K8j2m6Q5l9%j6m5N3ojJ10j26qN4o5J52mj06J30J39
$$ 87 103 84 174 286 58 274 363 348 203 224 168 97 125 113 67 152 113 113 97 52 105 99 98 208 82 74 128 63 215 211 105 235 374
1183C74j98r7M6J7L3k5p8N5Jj3l2o2M3RJ61r6k7L9L9L7o6n0n0M0Q8n3j4O2j16O3n0n5K21K8
$$ 374 176 79 125 142 175 150 72 127 128 115 83 21 64 73 234 138 111 150 189 226 160 110 60 100 188 135 121 183 67 130 80 25 246 274
784B74j38l6R2j22jK03j41p2K9k7M6J98J60k83K6j6j16J01j22O5J2r2R8J00K6j48qJ37m4o6
$$ 274 136 100 192 70 69 272 131 59 88 61 107 305 465 182 208 192 76 177 55 120 132 40 138 238 264 116 108 245 201 135
432A35j03joJ25L8j1N5r6p0J07nl7J53m9j08l2R7m5j38O7k8LM6J5P8J0q6O9R6k44J39j9q0
$$ 135 32 31 25 150 188 177 232 136 66 173 168 131 284 235 127 95 192 147 9 76 48 51 97 112 190 200 114 183 279 35 174 155 75
45G5l3M0k2K0mK9J9J23j78J68j9j47k0j5J77j84R7q5O2j1
$$ 75 42 82 60 80 76 105 124 247 69 237 218 71 51 36 213 29 126 41 103 92
-190I2
##PAGE=	F1=-1315.47
##FIRST=	25169.313707327481097,	5807.6787752999953227,	0
##DATA TABLE=	(F2++(Y..Y)), PROFILE
5808E9M3m7O6N9j20Q6RJ15m0j47J87q7j45RJ37J0r9o0j3PJ32j2j14O1N2q3J26q4k6p0M8L1
$$ 59 102 55 121 180 60 146 155 270 230 83 270 183 38 47 184 194 95 35 22 29 161 149 35 96 148 65 191 107 81 11 59 90
5432I0m9P4P8O4k43J93o6r5J1J25j07Qk2N6k4k4%L1J6P2J8p3m1J0NL4m1J38J25k44jN3r7J5
$$ 90 41 115 193 257 14 207 141 46 57 182 75 83 61 117 93 69 69 100 116 188 206 133 92 102 107 141 100 238 363 119 118 171 74 89
5033H9M0P8j51k4P4m7J04n1M0j5r4J08k8mlO4O5j56K2M9Q1m0QN1j45M3k1q7J28nJ6m4M5j84
$$ 89 129 207 56 32 106 59 163 112 152 137 43 151 123 119 116 180 245 89 111 160 241 201 209 260 115 158 137 50 178 173 189 145 190 6
4634FO3lJ21R4r7l8p5k3J01J7p1l6M5O1K3q0o2P3k0J10l3r5K09p5j36n5J89m9j18K5O8k3N5
$$ 6 69 66 187 281 184 146 71 48 149 166 95 59 104 165 188 108 46 119 99 209 176 81 290 215 79 24 213 164 46 71 139 116 171
4247A71K7R6m0r7k5J61k04M4n9oK19K8j58o4J9j07J21K7J2k5m3K0N7j09k5N0m5L8K9QR8k4
$$ 171 198 294 254 157 132 293 89 133 74 68 287 315 157 93 112 5 126 153 165 140 97 117 174 65 40 90 45 83 112 120 218 194
3871A94m1N6j05PK0r8N7L4k8po8P7M5O1j55P8J4Pj18N8Q7m9m9m5P0m1j8M3l0J15%j03P1r6
$$ 194 153 209 104 111 131 33 90 124 96 89 21 98 143 204 49 127 141 148 30 88 175 126 77 32 102 61 43 86 56 171 171 68 139 43
3472D3J02O6j09J1J6o2J8NN4M3j02J29k9j24L6J9lJ1L8m2Np2K9P0l6K6J62k59J17j06O6n2
$$ 43 145 211 102 113 129 67 85 90 144 187 85 214 185 61 97 116 113 124 162 120 125 53 82 152 116 142 304 45 162 56 122 70
3096G0m3O1m7M4L6k6J4O5o5Q0m0J9K21j22Jj64J07j32j8LJ20q9k7L2N4j12J30j30rK5J67l6
$$ 70 27 88 41 85 121 95 109 174 109 189 149 168 389 267 268 104 211 79 61 64 184 95 68 100 154 42 172 42 33 58 225 189
2721A89r8O1o6J0m9J17qo5oL2J4m2K7J07o2KJ6p5R8j73K20m0j95J11l3n4P9Q4k8k9k5n5K3
$$ 189 91 152 86 96 47 164 156 91 85 117 131 89 116 223 161 163 179 104 202 29 249 209 14 125 92 38 117 201 173 144 119 64 87
2333H7M6J6j29J55m3p3L4L7J45l1r3mo6J24K8L2p9r3Kk0M4m2K3J01o1P1j12o3J12M8mLk1J00
$$ 87 133 149 20 175 132 59 93 130 275 244 151 147 81 205 233 265 186 93 95 75 119 77 100 201 140 211 99 36 148 196 192 195 174 274
1934B74j5k17l3Q1N3o8J1j9N2J0Q9k0n7J88j82r1J5j3J04R4rj72mL1j9R9L8j50n4M8N3Jn1
$$ 274 259 42 9 90 143 75 86 67 119 129 218 198 141 329 147 56 71 58 162 256 247 75 71 102 83 182 220 70 16 64 117 118 67
1547F7J22Q0j98K11N8l0j10J9n7m3Oln5Q6l7pn2K2K5K2q2J71j20J7Pm7J46j5j26J20J86j84
$$ 67 189 269 71 282 340 310 200 219 162 119 125 122 67 153 116 109 57 79 104 126 44 215 95 112 119 72 218 203 77 197 383 199
1171A99j46K5j1P7K3q8J4Nj6m5K1lJ6J46p3l4J02k0J8o9m9l3K1R8k4l6P1j28O8p2k7K23M9
$$ 199 53 78 67 144 167 79 93 98 82 37 58 55 71 217 144 110 212 192 210 141 92 59 80 178 154 118 189 61 129 57 30 253 302
784C02k15k3J51j64qK32j52m3k1J7M3J47J28k36N8l6j00L0n3N5Nn8N8J06lj19k4J06J8q3r
$$ 302 87 64 215 51 43 275 123 80 59 76 119 266 394 158 216 180 80 110 57 112 117 59 117 223 220 101 77 183 201 118 109
420A09k1m5J21Pk6Q2r8l8Q6k5jJ51o4j17p5J38m8r5O5q2O0K5NR3Qp9J6J29k31J27K2r5q3L6
$$ 109 88 43 164 171 145 227 129 91 177 152 151 302 238 121 46 184 136 41 106 24 84 109 114 207 215 136 152 281 50 177 199 104 21 57
21E7J5m7L3J1P1J05j67J74pj23n9l9J98j63O0q9O5j7
$$ 57 72 25 58 69 140 245 78 252 245 122 63 24 222 59 119 30 95 78
-190G8
##PAGE=	F1=-1417.73
##FIRST=	25169.313707327481097,	5807.6787752999953227,	0
##DATA TABLE=	(F2++(Y..Y)), PROFILE
5808D9K8%N1N4j51O9R9Q7n5j68K21j34j02nJ02J3q8n3Q9m3J37j7j70L4J26o3J6l2K1m9K9l
$$ 49 77 77 128 182 31 100 199 286 231 63 284 150 48 43 145 158 70 17 106 63 200 183 13 47 173 110 126 94 115 66 95 92
$$ [...]
-190I7
##END NTUPLES=	nD NMR SPECTRUM
##END=	
##END=	
