##TITLE=	KG1o8F7gTuyJAewVnLgLTA.24.ser
TM-VI-199, CD3OD hmqc

##JCAMP-DX=	6.0	$$ MestReNova 14.3.0-30573
##DATA TYPE=	LINK
##BLOCK_ID=	1
##BLOCKS=	2    
##ORIGIN=	Mestrelab Research S.L.
##OWNER=	hrzepa
##$MNOVA/LINK_BLOCK_TYPE=	ITEM	$$ NMR Spectrum
##$MNOVA/ITEM/POLYGON=	(XY..XY)
5321,5835
8722,5835
8722,8208
5321,8208
5321,5835
##$MNOVA/ITEM/Z=	0
##$MNOVA/ITEM/ANGLE=	0
##TITLE=	KG1o8F7gTuyJAewVnLgLTA.24.ser
##JCAMP-DX=	6.0	$$ MestReNova 14.3.0-30573
##BLOCK_ID=	2
##DATA TYPE=	MNOVA NMR VIEW DATA
##DATA CLASS=	MNOVA VIEW DATA
##$MNOVA/2D/THRESHOLD=	1.853937983512878418
##$MNOVA/ITEM/ZOOM/X=	-0.98001264966690615488,	11.003459999979801509
##$MNOVA/ITEM/ZOOM/Y=	-9.7479769829748601495,	190.10579999390242278
##END=	
##TITLE=	KG1o8F7gTuyJAewVnLgLTA.24.ser
##JCAMP-DX=	6.0	$$ MestReNova 14.3.0-30573
##BLOCK_ID=	3
##DATA TYPE=	nD NMR SPECTRUM
##DATA CLASS=	NTUPLES
##NUMDIM=	2
##ORIGIN=	Bruker BioSpin GmbH
##OWNER=	nmr
##.OBSERVE FREQUENCY=	400.41200205000001233
##.OBSERVE NUCLEUS=	^1H
##.SOLVENT NAME=	MeOD
##.PULSE SEQUENCE=	hmqcgpqf
##LONGDATE=	2021/12/04 16:43:04.000
##.ACQUISITIONMODE=	SIMULTANEOUS (DQD)
##$ORIGINAL FORMAT=	Bruker XWIN-NMR
##$MNOVA/SCALES_VERSION=	9
##$PARAMETER FILE=	(acqu2s, ASCII, /private/var/folders/f6/rjf_tdyn2v98c5c0wvkgn4s80000gn/T/KG1o8F7gTuyJAewVnLgLTA/24/acqu2s, 0)
$$ ##TITLE= Parameter file, TOPSPIN		Version 3.2
$$ ##JCAMPDX= 5.0
$$ ##DATATYPE= Parameter Values
$$ ##NPOINTS= 129	$$ modification sequence number
$$ ##ORIGIN= Bruker BioSpin GmbH
$$ ##OWNER= nmr
$$ $$ 2021-12-04 16:52:34.859 +0000  nmr@CZC10666PP
$$ $$ /opt/topspin/data/agmb/nmr/Dec04-2021/24/acqu2s
$$ $$ process /opt/topspin3.2/prog/mod/go
$$ ##$ACQT0= 0
$$ ##$BF1= 100.683175
$$ ##$FnMODE= 1
$$ ##$NUC1= <13C>
$$ ##$NusJSP= 0
$$ ##$NusT2= 1
$$ ##$NusTD= 128
$$ ##$O1= 9059.81359838393
$$ ##$SFO1= 100.692234813598
$$ ##$SW= 200.226863172749
$$ ##$SW_h= 20161.2903225806
$$ ##$TD= 128
$$ ##END=
$$ 
##$PARAMETER FILE=	(acqus, ASCII, /private/var/folders/f6/rjf_tdyn2v98c5c0wvkgn4s80000gn/T/KG1o8F7gTuyJAewVnLgLTA/24/acqus, 0)
$$ ##TITLE= Parameter file, TOPSPIN		Version 3.2
$$ ##JCAMPDX= 5.0
$$ ##DATATYPE= Parameter Values
$$ ##NPOINTS= 12	$$ modification sequence number
$$ ##ORIGIN= Bruker BioSpin GmbH
$$ ##OWNER= nmr
$$ $$ 2021-12-04 16:52:38.860 +0000  nmr@CZC10666PP
$$ $$ /opt/topspin/data/agmb/nmr/Dec04-2021/24/acqus
$$ $$ process /opt/topspin3.2/prog/mod/shimcntl
$$ ##$ACQT0= 1000000
$$ ##$AMP= (0..31)
$$ 100 100 100 100 100 100 100 100 100 100 100 100 100 100 100 100 100 100
$$ 100 100 100 100 100 100 100 100 100 100 100 100 100 100
$$ ##$AMPCOIL= (0..19)
$$ 0 0 0 0 0 0 0 0 0 0 0 0 0 0 0 0 0 0 0 0
$$ ##$ANAVPT= -1
$$ ##$AQSEQ= 0
$$ ##$AQ_mod= 3
$$ ##$AUNM= <au_zg>
$$ ##$AUTOPOS= <31 >
$$ ##$BF1= 400.41
$$ ##$BF2= 100.683175
$$ ##$BF3= 400.41
$$ ##$BF4= 400.41
$$ ##$BF5= 400.41
$$ ##$BF6= 400.41
$$ ##$BF7= 400.41
$$ ##$BF8= 400.41
$$ ##$BYTORDA= 0
$$ ##$CAGPARS= (0..11)
$$ 0 0 0 0 0 0 0 0 0 0 0 0
$$ ##$CFDGTYP= 0
$$ ##$CFRGTYP= 9
$$ ##$CHEMSTR= <none>
$$ [...]
$$ 0 0 0 0
$$ ##$ShimPowMaxUC= (0..63)
$$ 130000 130000 130000 130000 130000 130000 130000 130000 130000 130000 130000
$$ 130000 130000 130000 130000 130000 130000 130000 130000 130000 0 0 0 0
$$ 0 0 0 0 0 0 0 0 0 0 0 0 0 0 0 0 0 0 0 0 0 0 0 0 0 0 0 0 0 0 0 0 0 0 0 0
$$ 0 0 0 0
$$ ##$ShimPowMaxUG= (0..63)
$$ 524287 524287 524287 524287 524287 524287 524287 524287 524287 524287 524287
$$ 524287 524287 524287 524287 524287 524287 524287 524287 524287 0 0 0 0
$$ 0 0 0 0 0 0 0 0 0 0 0 0 0 0 0 0 0 0 0 0 0 0 0 0 0 0 0 0 0 0 0 0 0 0 0 0
$$ 0 0 0 0
$$ ##$ShimPowRcbType= 3
$$ ##$ShimPowRes= (0..63)
$$ 1e-20 1e-20 1e-20 1e-20 1e-20 1e-20 1e-20 1e-20 1e-20 1e-20 1e-20 1e-20
$$ 1e-20 1e-20 1e-20 1e-20 1e-20 1e-20 1e-20 1e-20 0 0 0 0 0 0 0 0 0 0 0 0
$$ 0 0 0 0 0 0 0 0 0 0 0 0 0 0 0 0 0 0 0 0 0 0 0 0 0 0 0 0 0 0 0 0
$$ ##$ShimPowRng0= (0..63)
$$ 1 1 1 1 1 1 1 1 1 1 1 1 1 1 1 1 1 1 1 1 0 0 0 0 0 0 0 0 0 0 0 0 0 0 0 0
$$ 0 0 0 0 0 0 0 0 0 0 0 0 0 0 0 0 0 0 0 0 0 0 0 0 0 0 0 0
$$ ##$ShimPowRng1= (0..63)
$$ 1 1 1 1 1 1 1 1 1 1 1 1 1 1 1 1 1 1 1 1 0 0 0 0 0 0 0 0 0 0 0 0 0 0 0 0
$$ 0 0 0 0 0 0 0 0 0 0 0 0 0 0 0 0 0 0 0 0 0 0 0 0 0 0 0 0
$$ ##$ShimPowRng2= (0..63)
$$ 1 1 1 1 1 1 1 1 1 1 1 1 1 1 1 1 1 1 1 1 0 0 0 0 0 0 0 0 0 0 0 0 0 0 0 0
$$ 0 0 0 0 0 0 0 0 0 0 0 0 0 0 0 0 0 0 0 0 0 0 0 0 0 0 0 0
$$ ##$ShimPowRng3= (0..63)
$$ 1 1 1 1 1 1 1 1 1 1 1 1 1 1 1 1 1 1 1 1 0 0 0 0 0 0 0 0 0 0 0 0 0 0 0 0
$$ 0 0 0 0 0 0 0 0 0 0 0 0 0 0 0 0 0 0 0 0 0 0 0 0 0 0 0 0
$$ ##$ShimSysFunc= (0..63)
$$ 1 2 3 4 5 7 9 11 15 16 8 10 12 14 6 17 13 18 19 20 0 0 0 0 0 0 0 0 0 0
$$ 0 0 0 0 0 0 0 0 0 0 0 0 0 0 0 0 0 0 0 0 0 0 0 0 0 0 0 0 0 0 0 0 0 0
$$ ##$ShimSysMatrix= 0
$$ ##$ShimSysType= 1
$$ ##$TFXNUM= 0
$$ ##$TRIPLO2= 0
$$ ##$VTU= 2
$$ ##$VTUETH= <149.236.99.20>
$$ ##$VTUTY= <no>
$$ ##$WBREFAM= (0..15)
$$ 135 116 100 100 100 100 100 100 100 100 100 100 100 100 100 100
$$ ##$WBREFLM= (0..15)
$$ 0 0 0 0 0 0 0 0 0 0 0 0 0 0 0 0
$$ ##$WBREFPH= (0..15)
$$ 71.66 -68.25 0 0 0 0 0 0 0 0 0 0 0 0 0 0
$$ ##$WBSGU= (0..15)
$$ 0 0 0 0 0 0 0 0 0 0 0 0 0 0 0 0
$$ ##$XFAC= 2
$$ ##END=
$$ 
##$DECIM=	4160
##$DSPFVS=	20
##.ACQUISITIONSCHEME=	NOT PHASESENSITIVE
##NTUPLES=	nD NMR SPECTRUM
##VAR_NAME=	FREQUENCY1,	FREQUENCY2,	SPECTRUM
##SYMBOL=	F1,	F2,	Y
##.NUCLEUS=	13C,	1H
##.OBSERVE FREQUENCY=	100.69223481359800587,	400.41200205000001233
##VAR_TYPE=	INDEPENDENT,	INDEPENDENT,	DEPENDENT
##VAR_FORM=	AFFN,	AFFN,	ASDF
##VAR_DIM=	512,	512,	262144
##UNITS=	HZ,	HZ,	ARBITRARY UNITS
##FIRST=	19140.455529915001534,	4405.895418600002813,	0.088376611471176147461
##LAST=	-981.45727250430979893,	-392.40686505384644533,	0.22459265589714050293
##MIN=	-981.45727250430979893,	-392.40686505384644533,	0.0005351472063921391964
##MAX=	19140.455529915001534,	4405.895418600002813,	11.498362541198730469
##FACTOR=	1,	1,	0.0027797468417314718896
##PAGE=	F1=19140.5
##FIRST=	19140.455529915001534,	4405.895418600002813,	0.088376611471176147461
##DATA TABLE=	(F2++(Y..Y)), PROFILE
$$ [...]
##PAGE=	F1=10556.2
##FIRST=	19140.455529915001534,	4405.895418600002813,	0.13498675823211669922
##DATA TABLE=	(F2++(Y..Y)), PROFILE
1683A46j19R4p2L5j5P0o0Pk5jL5%J02J0O7m8j76J6j1M1N4J26R4k10R9n4K1j41l1RjN2j7Q1
1364A78r4J08j6j67M0j3Q9j12K53N4r0%q6jl4P8%o9N4k0k8m3m4J27K5q5J20j12O2j20J40n4
1063A40j29J12L1m3K0L4j4L3n6KO5r1m8M6Q7p7P4L8j14N1K1l9r5M7n9O2Q4j25Rk1J04J27j29
753A47o9J44OO2lj81m0R9j45J62n2q2K06j18j3m1J17j62K24p7J03j7r6j11N5M0j5m9o3%j0
462B1J34O6q2l2J2m0J7J50L0o8p4j10J4nJ23p6O2n8KO8Mp6Q9j4J4j05K44j13j03J08l7p4J14
152B05K8p5m6L3J54K4j39j4J26M9q2k24J70%o9q4lLQ5n1O6Q8j01r0j6j6M7l3R3QQJ1J9O9k5
-176B18n8o7p4J50n8M4j2J5k4p1M8ok5J47nj98O4oJ6M5No8n
$$ y = [146, 27, 121, 49, 84, 69, 139, 79, 86, 61, 60, 95, 95, 197, 207, 274, 226, 50, 66, 55, 96, 150, 276, 370, 160, 259, 205, 226, 85, 54, 63, 62, 114, 97, 178, 84, 192, 176, 9, 49, 36, 125, 13, 266, 320, 230, 230, 144, 143, 109, 187, 187, 118, 172, 152, 124, 81, 37, 164, 189, 104, 224, 112, 174, 54, 194, 140, 11, 123, 154, 111, 131, 165, 151, 184, 128, 130, 195, 104, 56, 102, 189, 112, 186, 224, 110, 161, 182, 143, 48, 95, 36, 98, 182, 57, 66, 45, 149, 276, 147, 78, 222, 228, 290, 287, 106, 66, 165, 20, 182, 130, 48, 254, 136, 123, 82, 199, 37, 261, 184, 287, 270, 174, 63, 118, 158, 143, 94, 31, 31, 21, 155, 221, 139, 107, 119, 79, 96, 246, 276, 208, 134, 24, 38, 33, 156, 80, 142, 84, 86, 154, 158, 82, 171, 157, 171, 66, 310, 197, 94, 202, 165, 91, 205, 233, 158, 112, 145, 299, 323, 184, 170, 296, 345, 263, 39, 209, 209, 140, 56, 53, 56, 141, 90, 156, 244, 143, 53, 37, 21, 68, 35, 128, 136, 144, 155, 174, 243, 218, 160, 93, 19, 169, 111, 155, 143, 158, 134, 63, 111, 105, 80, 227, 222, 24, 88, 82, 98, 143, 148, 80, 75]
-392G5
##PAGE=	F1=10477.4
##FIRST=	19140.455529915001534,	4405.895418600002813,	0.30996903777122497559
##DATA TABLE=	(F2++(Y..Y)), PROFILE
4406F4jnL1JJ6l0L1J85m5k09OP0P2K4q3r9K0M2J37j87P6M9J8q0kP3k0k2L9j06K3J27j05p6
4087C4R4l6P6m4j0l9P7M2K6r4l3J22m0j52N9J00l8KM9q6K9N7N1j92k9O4K07r9Kn8o6j5O3K6
3767A49R9k4q3J32l2p5j28OPP8r1Q4MJ1onM0k3M7j37pM1lm7J27j9p1O9j12K6j7J59J65Rj48
3439B25L8j25p9Q5ro3R5OL4L9j20PrM7O1j33J3J62k9k15N2o0K49K2j6l8j07Q5j00J21j22K4
3138A40j5mQk4J44j3j30N8J03K1q7j00m3j4k2J49j52K20j09K13q5j82m7J79p5n3Q2O0j05O1
2857A78lq5K5K52o1J6j16p3J0j2n6L2m4m6R0J03m6j8K0KJ3n7j3k5Q7j27M9l6O2P6M7p1o3K
2537A12n1J66o0j2j7K3j8m6J14m9L5j14L2l0J10j10K3l6N3L2m9J4n1QQ1n7K9Q0j25J06N8q7
2237A64Jm7p3R9N1m8j40P5M2p2R4L6k8p5m8J9l5N8M5l3N0k0L6j27jK16r3j9j19J10M8j5q5
$$ y = [64, 63, 58, 89, 90, 106, 76, 107, 292, 247, 38, 44, 114, 186, 210, 127, 28, 48, 90, 227, 40, 116, 165, 183, 103, 101, 174, 154, 132, 171, 65, 88, 215, 110, 34, 128, 92, 168, 124, 114, 75, 152, 194, 220, 126, 93, 215, 175, 23, 82, 182, 144, 146, 195, 109, 138, 195, 246, 54, 25, 89, 296, 197, 199, 141, 75, 60, 123, 149, 248, 224, 141, 273, 241, 166, 38, 44, 51, 129, 38, 122, 126, 137, 131, 126, 166, 143, 190, 53, 46, 87, 84, 37, 164, 145, 74, 143, 31, 57, 40, 199, 364, 373, 225, 263, 138, 59, 144, 135, 72, 167, 173, 207, 246, 126, 133, 124, 171, 232, 99, 112, 274, 245, 30, 82, 22, 271, 293, 277, 239, 132, 217, 117, 238, 116, 140, 125, 121, 129, 105, 249, 236, 106, 164, 267, 288, 201, 101, 58, 44, 22, 171, 19, 239, 130, 343, 258, 76, 29, 208, 133, 80, 162, 222, 117, 178, 175, 90, 115, 367, 306, 322, 206, 133, 143, 131, 75, 107, 63, 17, 107, 210, 164, 146, 166, 168, 181, 124, 111, 86, 173, 46, 95, 59, 121, 197, 244, 173, 110, 112, 61, 227, 167, 155, 138, 161, 143, 97, 211, 162, 197, 83, 115, 85, 195, 85, 108, 72, 125, 157, 108, 122, 71, 79, 160, 103, 132, 212, 87, 193, 251, 164, 165, 118, 45, 144, 195, 147, 7, 82, 124, 52, 146, 182, 154, 79, 31, 50, 15, 73, 118, 85, 135, 115, 151, 24, 23, 239, 146, 127, 8, 118, 166, 151, 66]
1927F6pl9P8J41k07K08K0k16J14j13K3N4n4KN0n3P9M9j02M4j6J8Oq6O8nr8J08n6j1j6N6j4
1617I1L0j3j5L7ON7L2Q6r5j70Pj2L3R7R9M6j99J11q4L5r1qJk6L0oN0m8R1K3j78M4J4Q1j00
1288E6K05P6q4m6o3J5m7Q1J2q5N9k5k2l8n8R8N3m3P9j17N7j12J74q2r6M3M8m4O3M9J9Lp4l1
969A23M6o1MK6N0q0P7J3r2K4L6nj50P9p1J19N2j02p2N6J00J04j57n1J73K6Jj9j28j02J35j07
669D7J20k8p6J92r6l1n3J22j01K02n4N9Mj32q9P2jj4n3n5K0MP8M4l7%Mm9L3J37ko1o8q2%m
331E2J08p0K3m6J8P0J1j07Q7QJ1q9J77q6p5R7l5m2P2Rn9m2M6J67K4j40n4J09N8l9k00J53J5
21B31l9j29jk8J19m7K7J01j51J1n3j0O7r7J30K9Plj7R6k1o9q4QJ53p8K5o0J7N3n6j01J09l6
-299A03J30Kk01O8j9k1Q8J5r2J9
$$ y = [66, 59, 20, 98, 239, 32, 240, 260, 44, 158, 45, 68, 122, 68, 70, 120, 67, 146, 195, 93, 137, 121, 139, 145, 59, 127, 122, 24, 132, 76, 65, 49, 105, 91, 121, 108, 93, 130, 136, 193, 225, 311, 216, 46, 53, 41, 74, 171, 270, 316, 117, 228, 144, 179, 88, 80, 81, 55, 85, 79, 129, 81, 172, 195, 17, 61, 75, 156, 56, 261, 337, 253, 207, 144, 159, 112, 193, 205, 120, 179, 154, 132, 94, 36, 134, 187, 144, 223, 106, 163, 51, 225, 143, 47, 90, 138, 94, 157, 206, 225, 228, 154, 123, 169, 108, 112, 138, 188, 108, 185, 198, 106, 130, 166, 161, 11, 90, 19, 138, 190, 88, 16, 72, 172, 276, 119, 68, 241, 267, 268, 249, 121, 19, 154, 47, 167, 139, 63, 255, 159, 128, 75, 197, 96, 298, 244, 303, 307, 175, 86, 158, 157, 143, 90, 35, 55, 59, 137, 181, 144, 144, 148, 99, 132, 269, 267, 206, 138, 56, 56, 52, 160, 90, 113, 67, 85, 155, 166, 59, 146, 154, 165, 76, 253, 167, 92, 189, 154, 112, 184, 193, 134, 92, 138, 305, 329, 189, 135, 244, 302, 263, 63, 216, 231, 192, 63, 62, 34, 153, 106, 133, 234, 83, 94, 41, 31, 98, 1, 131, 160, 167, 164, 147, 243, 222, 153, 69, 77, 230, 152, 177, 117, 134, 187, 131, 30, 139, 103, 233, 235, 34, 102, 83, 62, 150, 165, 73, 92]
-392I2
##PAGE=	F1=10398.6
##FIRST=	19140.455529915001534,	4405.895418600002813,	0.4826672673225402832
##DATA TABLE=	(F2++(Y..Y)), PROFILE
4406C3J8K2K4j5j3%jJ92k3j67l6N4J03Jp8l8o2P1J33j39L8Q3jj21M6Q6m1l5L1j28N3J03m1
4096A52r7J04m9M2m5Qn4J69L7j2q0l8K4l0j01M7P8m7L0P9r1kM2M3j58MO0K01j51J32r9j08
3796I0m2P3J9P5J1o9J60l5j27j29lN4J8r0J36p1L9j2M6M3n0N2j62J9O6l5k3J30j3j00J28j65
3495C3NjJ47J86k4j28N2j43o8O9O0j54R4J6L0L8j09J9L8K6N3j50N6J24l2k08O6n4J81O2%o8
3195B16p4Q4j15J07j31Q4n7n2P3K4O3k7r5M5J31J1q2o9k1m5n8J46j09J88j15J65o1j18p1J49
2913A86p2P3MP1j50pM1m3K4K47p7L5j43m6L4m1m1J1l9j5M6J17m3Qj2%k7K7n5l0O5m3j5L7r
2584A18M1R9k0p3m9rJ19p5l5J3K6j3m0R9plj04L6rR7j26M0k8K6L2n0L3p4L2N4n0K0R9p7P3
2256B15j5m3K5r5l6O2M0m6j00R9L9p4M3O8K3j54L3po2N1K8p1R4L7J6j50K6J79j24L5j09O3
$$ y = [33, 51, 73, 97, 82, 69, 69, 68, 260, 237, 70, 34, 88, 191, 192, 114, 76, 14, 85, 218, 79, 117, 200, 199, 78, 124, 210, 169, 134, 165, 37, 90, 193, 152, 55, 159, 110, 152, 107, 115, 61, 230, 267, 255, 175, 137, 161, 131, 30, 77, 155, 108, 138, 217, 126, 124, 166, 209, 51, 55, 115, 316, 165, 297, 198, 90, 48, 121, 140, 215, 226, 157, 317, 282, 155, 26, 23, 77, 95, 5, 141, 70, 109, 97, 143, 186, 136, 188, 26, 45, 111, 76, 53, 183, 170, 70, 198, 33, 38, 37, 184, 370, 346, 218, 270, 127, 59, 128, 188, 34, 128, 144, 174, 212, 103, 122, 160, 186, 239, 89, 145, 269, 237, 29, 95, 41, 222, 284, 284, 216, 142, 226, 111, 218, 87, 171, 114, 62, 135, 159, 222, 195, 100, 145, 276, 287, 205, 136, 115, 70, 12, 158, 49, 237, 122, 287, 226, 108, 37, 186, 114, 187, 191, 262, 112, 105, 146, 103, 127, 374, 297, 332, 189, 143, 177, 136, 95, 106, 67, 52, 98, 215, 172, 180, 168, 168, 141, 168, 113, 83, 148, 105, 90, 127, 118, 159, 258, 238, 165, 116, 107, 226, 151, 116, 129, 155, 142, 102, 201, 194, 191, 87, 123, 114, 211, 85, 125, 97, 123, 155, 105, 138, 64, 96, 150, 100, 120, 219, 142, 215, 200, 157, 182, 87, 51, 113, 153, 107, 7, 106, 145, 71, 114, 182, 205, 51, 84, 77, 15, 66, 94, 23, 117, 154, 170, 20, 46, 225, 101, 136, 27, 90]
1955I0N5%m4o0k8N8J26j70K14K2k16J32p6j3Nk8M4J2p9Q5P2j30O6k9P6J5p6Kj3p0R0n2k2l3
1636B5M8L6N0k3j1M2J4%N4J00j32j45j0mK0J28M3Kj76J15j11O0m5J2Jn1J0K1QkP0M7j69M3
1317G0M5O6p2J10J02o6p9l0L1o1R4Oj17N5j0Nl9o7L2J10lK8j18N9q7J73j06m8NM5o2J29O9
1007B69J9k0q7n3J9j1L0NJn0N4j9p4rO6K0j32O0j2J03op2n9N1J02O9j72rJ67M4o1m0n5r5Q7
678A30n2N1jn3J93q1m6p5J11l2J67l7K7Nj44j7M3n3rm2j5J4J8L0L9k4L3Jo8M7J08m3l9m5l6
349A05k5J8O9p5jj1L2M3Lj04M5K3L5q5J11m8o3Q6k7kM1j5m2m7P1J71J9j43r9Q1Q3J1j57R5
30A98L9Qj71Mn0J27j8j6J06j68O9p4j8R9r8R3M0Jnl7J21rj04q3R1J40r5nj01K3J19m3j19J10
-289A74o3J12K6j99N5pp3J28L5j21M8
$$ y = [90, 145, 145, 101, 41, 13, 71, 197, 27, 241, 263, 47, 179, 103, 90, 95, 67, 111, 123, 44, 129, 201, 71, 137, 108, 184, 199, 123, 125, 112, 42, 132, 80, 58, 25, 73, 109, 159, 136, 125, 167, 181, 181, 235, 335, 203, 58, 48, 44, 64, 192, 235, 237, 61, 176, 65, 125, 80, 92, 93, 42, 52, 73, 81, 79, 149, 196, 27, 70, 115, 181, 109, 219, 321, 255, 176, 146, 177, 116, 210, 216, 99, 154, 144, 149, 110, 43, 75, 185, 182, 210, 92, 151, 64, 237, 131, 83, 88, 133, 71, 200, 269, 288, 268, 181, 128, 147, 136, 166, 171, 172, 122, 176, 157, 83, 74, 140, 160, 28, 88, 76, 179, 173, 101, 42, 93, 195, 264, 92, 83, 250, 294, 233, 193, 138, 43, 130, 78, 129, 128, 75, 268, 187, 141, 66, 177, 145, 312, 275, 302, 307, 163, 146, 189, 136, 127, 85, 70, 84, 102, 132, 171, 147, 180, 181, 113, 160, 268, 225, 186, 141, 105, 80, 98, 167, 92, 91, 80, 112, 155, 158, 54, 99, 122, 157, 72, 183, 135, 72, 158, 131, 129, 170, 155, 113, 66, 137, 308, 327, 184, 85, 166, 249, 260, 103, 198, 237, 245, 74, 78, 28, 155, 137, 121, 227, 59, 128, 54, 36, 135, 37, 130, 170, 171, 166, 129, 250, 241, 137, 54, 145, 285, 190, 185, 84, 107, 226, 183, 64, 174, 111, 223, 249, 50, 105, 98, 25, 153, 188, 67, 115]
-392A15
##PAGE=	F1=10319.9
##FIRST=	19140.455529915001534,	4405.895418600002813,	0.48937076330184936523
##DATA TABLE=	(F2++(Y..Y)), PROFILE
4406G5J5OJ5m5k2M5q1K00Oj09p8M5J19j7o4Or0O6J32j09nJ30rj80J06J04o8n2J9j27N1O1L0
4096A75q2R4n5om4L7n0K23L4n5o5n1m6l3k5K9P4j06Q8Q8q5l0K1K4r3L3M2J78j91K52j37j33
3796A05n0Q6L6J2K8o0J77l0j72j07KO6m4k4J28j17O3k8Q3M6r5O8r7l3Q7n7M9Q0j8p2J27j56
3495H3o5J0J39J94p1q6N6j58m2O7J15k40J07pK8K9q3M0P8kN2j60R9Q3n1j58N4l6P7R1L3p0
3195B06m5P4j25R0j17R3q1n1J29L8k8o5k6J0J52Mo6l9Rp1o3Q6mJ15j14J03m3n0p0R2k1J44
2894B66o4O3j43n6M4nJ4K31q4L8j54j9O5m0l8j1l6J6PJ18l5Rm0K3o7R5q6l7N3L2q0J10o1p
2575A21J28L1q0q5K6Q1q4o0L3L4j0l4P3N5n2q5K7J1P0j32O8m1K2L8o6N5o2K3M2n3NJ39J5l3
2256B20q4QM7j54J5N0Njq0J04L1p9J0J02L9k15J09k5r1K6N2qL0P7qj30QJ31j36P4q6L2O3J3
$$ y = [75, 90, 96, 111, 66, 44, 89, 8, 208, 214, 105, 27, 72, 191, 174, 110, 116, 26, 92, 224, 115, 110, 240, 231, 51, 157, 261, 193, 141, 160, 33, 84, 145, 175, 93, 187, 132, 126, 82, 119, 69, 292, 326, 271, 206, 155, 109, 76, 51, 80, 154, 48, 136, 224, 139, 109, 130, 154, 61, 94, 136, 314, 123, 375, 238, 105, 55, 141, 177, 189, 217, 157, 334, 304, 132, 25, 27, 93, 49, 25, 153, 36, 99, 71, 154, 200, 105, 173, 76, 43, 130, 73, 122, 202, 184, 112, 239, 83, 18, 28, 167, 361, 290, 204, 260, 102, 60, 127, 242, 2, 109, 102, 130, 159, 76, 116, 194, 192, 244, 84, 183, 266, 215, 57, 111, 75, 152, 243, 276, 206, 161, 235, 110, 200, 83, 176, 95, 44, 173, 211, 183, 118, 92, 102, 254, 258, 192, 153, 162, 91, 28, 114, 110, 225, 111, 214, 171, 121, 51, 143, 122, 266, 202, 265, 122, 66, 110, 105, 119, 350, 266, 304, 150, 131, 196, 156, 118, 107, 71, 87, 94, 212, 177, 186, 146, 169, 102, 197, 111, 74, 127, 159, 79, 189, 128, 121, 249, 280, 200, 115, 141, 222, 138, 78, 111, 145, 135, 101, 174, 229, 177, 92, 119, 130, 200, 68, 136, 95, 117, 155, 89, 144, 82, 105, 147, 94, 99, 238, 253, 220, 136, 144, 191, 37, 52, 102, 107, 106, 26, 130, 161, 82, 92, 194, 233, 18, 127, 102, 11, 37, 89, 81, 111, 188, 180, 50, 58, 189, 53, 127, 41, 73, 136, 149]
1936A49jj28J0K8R7j11J79L0k03J46m6n1j6l2Q2j5p6P1J09j51O1l5J22K0l8m1m3l7M1o1J1
1645G1o2N0O5O6m5KN6K4n5P4J07j65j14roL9J12l6j3j33J05j16N4oK5Kp1jO9l6J3O1N1j47
1326C1M5O8N6l6rJ22l8r8PM0p2J15j4j53L6K4M2m1p6JJ42J0k5j10O8n8J47j19LOK3q3J91R0
1007C35ol7r3o6KK6M1j5m2NJ1m4o8l7R1L8q2L8L0Q3p8l0k8K5J12L3j73L4J39N7j06o9L2m7
687A11K1j8l8L2l5K06o4n7j04R1K7J28k3Orj21N9oj03Mk7K7RL1kM7m5O2nq9O5O6r2j2%J5n6
340A01O1M0j09rK3L8J1k1n6l7K6O9o9N1j1o6O7jL2L5m2l3o0J00J68Qj43j39M6J25M6j04J2
30A59O2O9k01Pn1J13L0n6Q7j44P3j07l2J63j06N8L9j1Jl4J28Oj40l1J26J09j06l1j13J9J63
-261B49l3j01P3q9R7O1j90K7L1q0J00O5j42O6
$$ y = [149, 148, 20, 30, 58, 155, 44, 223, 253, 50, 196, 150, 99, 83, 51, 133, 118, 42, 113, 222, 71, 132, 97, 219, 239, 201, 160, 117, 80, 121, 60, 71, 9, 59, 124, 190, 145, 147, 203, 227, 172, 246, 353, 188, 74, 65, 59, 98, 210, 174, 161, 28, 133, 17, 71, 65, 90, 92, 21, 20, 89, 53, 66, 127, 178, 31, 76, 144, 200, 164, 155, 277, 239, 141, 148, 188, 116, 231, 217, 64, 100, 124, 166, 125, 49, 50, 192, 202, 177, 67, 135, 77, 224, 105, 108, 114, 137, 54, 245, 335, 329, 292, 199, 133, 135, 161, 202, 187, 145, 150, 161, 117, 49, 12, 103, 141, 59, 97, 127, 210, 132, 102, 74, 99, 211, 244, 71, 105, 244, 301, 195, 126, 158, 111, 132, 114, 76, 108, 73, 279, 215, 158, 54, 145, 172, 300, 277, 283, 274, 153, 212, 206, 103, 107, 80, 107, 116, 147, 145, 192, 147, 209, 204, 115, 180, 246, 154, 142, 142, 157, 101, 162, 202, 93, 84, 107, 145, 156, 135, 79, 42, 68, 137, 68, 119, 108, 42, 109, 108, 140, 175, 133, 100, 40, 140, 308, 316, 173, 34, 80, 205, 251, 147, 159, 221, 290, 89, 96, 45, 158, 188, 132, 219, 75, 148, 41, 9, 172, 66, 124, 163, 152, 153, 119, 247, 253, 113, 82, 208, 317, 211, 180, 67, 86, 249, 216, 115, 188, 99, 196, 257, 67, 94, 125, 45, 145, 210, 68, 134]
-392A34
##PAGE=	F1=10241.1
##FIRST=	19140.455529915001534,	4405.895418600002813,	0.45053246617317199707
##DATA TABLE=	(F2++(Y..Y)), PROFILE
4406A12J6j2J3q0J7O0n5P4M2m4j16L6J28k7n5L2q6N7J29j06m3J83lk52J77J11r5o4J0q7KJ8
4105I2R1n8R2o1o2m4P2l9K46K7r0m8p4p7k7M2K4Q6j66J16P1p0m9J4j9j2N4K9J45k19L34j66
3805B54j34m9Q9O0o1K6m6J86k2k05o8j0Q6r1L1J11j26O8m1R7N1j49J11l7r1R9n9R6L8k6k7
3514A61R4j29p7l6J31J96j24k2M3j69nP9J41k55Q5m7K6Mm9P0J04l1N6j64J25M8q0p5L3k1l5
3223G7J01O3k8l0N7j25O4p9N8n9k8J41L8j04j19P0m7J54km0qL8r1n3KJ10M8j16M6l8J3n7K8
2913H4O8J49j10M3r2k6l5J1JK04p8L1j50%R4j2m0l7l3L9j7J02j6j1o4O8r8J36j02n3O0Q0j28
2603F8J63q7o2J35P4q2r8N0N0q3p5L9L6lk7L6J16r1o5J3K7K7j22R4o5M4N9j03P3l7pO7q1n
2284G8J86R3j48j28M9N9j18k0N7l3O8r6R4K2q0rJ22L9j92J10l4r7kR9K6l5R7l2q5k6Q9j37
$$ y = [112, 128, 116, 129, 49, 66, 126, 71, 145, 187, 143, 27, 63, 191, 164, 109, 141, 55, 112, 241, 135, 92, 275, 272, 20, 197, 308, 213, 149, 159, 72, 74, 92, 183, 125, 217, 156, 94, 50, 122, 83, 329, 356, 266, 218, 144, 67, 40, 82, 106, 192, 26, 142, 213, 143, 94, 108, 89, 77, 131, 160, 305, 86, 420, 254, 120, 71, 160, 220, 159, 185, 139, 325, 303, 98, 30, 20, 106, 15, 46, 157, 31, 99, 58, 155, 206, 57, 168, 131, 40, 139, 80, 176, 214, 188, 161, 255, 126, 49, 13, 144, 340, 216, 194, 237, 68, 63, 142, 283, 28, 113, 66, 92, 96, 47, 117, 221, 190, 246, 82, 207, 255, 175, 100, 133, 112, 77, 178, 241, 213, 183, 240, 115, 179, 100, 158, 99, 71, 212, 250, 146, 27, 97, 50, 204, 202, 162, 154, 192, 101, 48, 50, 160, 208, 92, 138, 100, 113, 56, 84, 152, 301, 191, 234, 142, 116, 81, 92, 93, 297, 219, 250, 100, 100, 194, 182, 142, 105, 72, 111, 94, 196, 180, 169, 105, 173, 75, 211, 109, 56, 116, 196, 68, 231, 144, 82, 217, 291, 209, 111, 161, 211, 128, 53, 92, 128, 125, 98, 134, 250, 159, 94, 107, 134, 161, 39, 133, 68, 112, 171, 68, 141, 104, 97, 164, 83, 78, 264, 357, 209, 81, 130, 189, 71, 51, 108, 75, 143, 47, 141, 163, 83, 74, 196, 235, 43, 153, 119, 22, 20, 119, 145, 110, 207, 175, 90, 64, 153, 16]
1983A6Q8n8K4M8K0M6j76O3nN6o8J38M1j76J39k3p3qo3J08k5n1L8J47j45K3l4J45J4J2p7o2
1683A22Nj2q7O2n4M1N5P4o8J6P8L5r6Q5J06j91q5jk1Q1P1j12L9p2P4n8n5J1L1Lp3MJ07l4k8
1354E3N5L8j20M7Q3N9lj00J06Lj09L5L8p5J39l7j53l3P2P7l8q7O0R5oo7j01Q1l3J02j16N2
1054A17K2Pj03K31J08m3m5r2p2QL2L7k8n9N6k9m9p9N1oM4k4L7M7N6j47L8j1j5J30Jj61O7J01
734B27O1j21j06J20Jjl4j29P2k8K17m1o8j28O7O7Q5ook9n6J04o3j32K8j9N1J6L9j7M5p7Q6
425B25j9j04R3J2j31LO4O2q9J16K8j62oM3L1j2n4J7r7mQ9k2j2J7p6L8O3L3M9o4l9n6J08J55
105B99j0j30j25KJ50M4n0o4O7J33k11Rn9J15P9q7M1j13O6j52M7J54j24L2K7k5J2j6J16J7j63
-186H1M1J30O6j10m4o3k0J74k4r1M0j08Q3J01j75oP7o5L9J00j51O7
$$ y = [16, 104, 46, 70, 118, 138, 184, 8, 71, 66, 122, 54, 192, 233, 57, 196, 173, 100, 92, 29, 137, 112, 61, 99, 246, 101, 124, 90, 235, 249, 261, 184, 122, 127, 115, 28, 90, 36, 77, 132, 206, 138, 154, 232, 267, 171, 256, 362, 171, 86, 85, 64, 145, 216, 104, 143, 71, 145, 87, 32, 43, 74, 77, 4, 8, 115, 81, 53, 108, 146, 26, 73, 156, 215, 212, 112, 218, 221, 112, 147, 185, 110, 249, 212, 59, 26, 98, 175, 137, 50, 110, 205, 199, 132, 31, 112, 79, 181, 65, 117, 139, 146, 43, 274, 382, 339, 294, 202, 130, 138, 170, 207, 179, 120, 176, 147, 98, 19, 70, 64, 108, 84, 121, 168, 224, 77, 115, 104, 89, 219, 220, 59, 126, 227, 288, 167, 61, 181, 182, 181, 147, 18, 90, 62, 279, 238, 170, 42, 109, 176, 261, 255, 249, 220, 164, 268, 205, 73, 101, 82, 133, 149, 188, 171, 216, 139, 225, 206, 102, 195, 207, 76, 79, 143, 205, 116, 232, 260, 98, 92, 135, 166, 154, 100, 117, 20, 16, 105, 83, 71, 88, 12, 50, 113, 146, 195, 131, 92, 36, 144, 299, 289, 159, 34, 36, 186, 230, 180, 116, 183, 316, 105, 114, 55, 170, 249, 162, 203, 90, 156, 4, 51, 205, 81, 113, 140, 115, 127, 111, 227, 244, 81, 122, 252, 318, 208, 164, 101, 81, 255, 231, 140, 180, 72, 155, 256, 81, 75, 152, 87, 126, 226, 75, 142]
-392A42
##PAGE=	F1=10162.4
##FIRST=	19140.455529915001534,	4405.895418600002813,	0.39067247509956359863
##DATA TABLE=	(F2++(Y..Y)), PROFILE
4406A30K1k4J5j08O3O8ro4P2J8j40K5J34l0o1L9p4O1J15j14p5K34J2k93K26R7j22o7J0m6n2
4115F1L6R2m1J00o9j22k1Q8l4K49J3j12k3j04p6M7L2L0R9j41M7L2n2n5M5r2O4O5K2J11k22
3824F9L54j81j08n0Q0P8j19Pk1J85j1k21k0l6J17o4lR9j32Q2m7R0N7j83J73k0j35R4m4J12
3542B02J0l1K0M0q9o7p5J13J82j70N6K0j75L2R0J38k52P4n9K1j2k7Q5J17n8N9j62J30J9j06
3260A25K3J2j5j01O6P2N0k4L6j17K3l6J7Nl9J36L5j41n6M8r1J07oj1K4O1j03l6l7J70qj27
2960F2Nl7N8l9j3J43J08j31K3j8K0j01j7pJ67n9K4j28JJ12K6l2o8l3N5k8Q0J0n0p7J25j05
2659G6J36j02p7Q1R6j51J88q1j25J26J01p8p8N7K4p5p2L2K7J6k4pJ56j02n4kL9k4o9Q2p7P5
2359A14Q6j46P4j3m6J33j28j0K19J45k46r2K6O1k7p1M0n2J20j17O1J6p4j2J15L7j29P4l2p6
$$ y = [130, 151, 127, 142, 34, 97, 165, 156, 92, 164, 182, 42, 67, 201, 171, 110, 149, 75, 136, 251, 137, 62, 296, 308, 15, 241, 338, 216, 149, 159, 113, 61, 97, 189, 148, 248, 179, 57, 36, 124, 90, 339, 352, 240, 217, 113, 37, 84, 116, 146, 245, 104, 151, 183, 131, 76, 121, 29, 93, 158, 180, 291, 69, 423, 242, 134, 84, 164, 242, 123, 130, 109, 294, 283, 62, 42, 6, 123, 59, 56, 155, 23, 105, 58, 148, 205, 22, 195, 175, 40, 134, 90, 202, 212, 181, 201, 241, 152, 85, 10, 123, 305, 135, 191, 211, 36, 68, 158, 296, 44, 118, 59, 80, 68, 41, 126, 243, 185, 244, 82, 212, 231, 125, 148, 160, 145, 44, 110, 182, 232, 208, 244, 127, 150, 114, 131, 136, 97, 233, 268, 127, 71, 119, 28, 135, 129, 118, 142, 203, 100, 64, 27, 197, 189, 62, 67, 30, 88, 49, 36, 179, 287, 156, 179, 161, 181, 80, 63, 56, 223, 164, 188, 60, 61, 173, 199, 167, 99, 66, 121, 93, 173, 183, 133, 56, 181, 76, 212, 110, 33, 114, 210, 59, 247, 166, 41, 167, 268, 190, 112, 169, 193, 118, 46, 78, 105, 121, 97, 90, 246, 144, 90, 88, 127, 103, 34, 116, 39, 114, 200, 54, 128, 115, 69, 202, 74, 64, 283, 428, 182, 90, 116, 177, 150, 79, 119, 67, 187, 70, 131, 147, 73, 61, 176, 213, 84, 158, 126, 50]
2077E0JR8L4p7R9n4l1n1Q3j40P2l8L3RK3R1j62Q6k7jm1R7N1j36J06kp8Pr1J18k1k3KJ72j23
1749A36j9k9J42lO5j13o0N7n1j05Q0l8M5K7P3q9L3R7M4j23Q7J04k09n6Mm9J27K8j32J23q8
1457A08Q0n4r6j0L2rj7oJ07j6n3K5J4r5M9R0P1K4j03K8M9j09L4K9q0J67n2r2m2J1Q7k6r9J18
1138A64N2m3o5q8O6j8N0r3Q4L9Qj28K52J23q2n1q4p1L5MK2l1l9P8m4m6q0J13q6K4L9N5M0K0
819B19j60R7k0o4J46k2j45R2O5N5j02j46J90L9no8j33M8m3K23j7p9j34M2Q3L7J9j4l4L0J11
528C10j23j21N4j6L4L9M5k2J9r9J04l9r9J28n1r8n4J33R9j18J67L0k15MN4Ml1o9Q6q5LLL7
218A13q5O0p3L9J00%O1o9o6k0Q7J25k9j00p4J3J10Lqq7L1J83j99J1p4J35J13j04k3q0N8j11
-83D0P9J09j49J8J0k5K8qR1K4j72J06J16J9j09l3J9p3J60k1r1K0j17Q0J23j57l5J16m9j8J28
$$ y = [50, 51, 149, 183, 106, 205, 151, 120, 69, 152, 12, 84, 46, 79, 88, 111, 202, 40, 126, 99, 98, 57, 154, 205, 69, 175, 173, 95, 102, 11, 129, 108, 85, 87, 259, 136, 117, 88, 230, 227, 292, 179, 119, 176, 125, 20, 100, 62, 107, 134, 207, 118, 151, 248, 292, 169, 256, 360, 151, 95, 99, 50, 177, 205, 73, 196, 108, 188, 134, 38, 28, 60, 51, 34, 28, 135, 119, 66, 91, 105, 10, 59, 149, 220, 244, 141, 169, 218, 109, 143, 172, 92, 259, 207, 115, 73, 84, 171, 145, 46, 164, 216, 173, 108, 20, 86, 68, 118, 25, 109, 148, 156, 28, 280, 403, 321, 270, 186, 115, 150, 154, 176, 145, 106, 184, 140, 94, 14, 127, 41, 65, 104, 159, 199, 219, 59, 156, 136, 72, 218, 196, 51, 143, 208, 263, 161, 15, 205, 244, 239, 171, 38, 86, 43, 266, 249, 170, 36, 78, 161, 198, 217, 203, 169, 199, 310, 187, 66, 120, 104, 138, 177, 222, 200, 219, 120, 224, 185, 86, 214, 163, 65, 11, 144, 243, 125, 292, 322, 107, 111, 165, 169, 138, 69, 155, 70, 73, 76, 113, 28, 88, 15, 54, 154, 154, 215, 146, 80, 60, 147, 272, 243, 143, 69, 82, 192, 195, 187, 100, 131, 314, 115, 126, 52, 187, 300, 196, 173, 93, 151, 40, 119, 228, 79, 97, 107, 82, 110, 102, 193, 217, 45, 151, 267, 286, 177, 144, 163, 90, 250, 229, 138, 158, 41, 121, 244, 87, 52, 168, 119, 101, 229]
-374B29j48N8
$$ y = [229, 81, 139]
-392A39
##PAGE=	F1=10083.6
##FIRST=	19140.455529915001534,	4405.895418600002813,	0.24224197864532470703
##DATA TABLE=	(F2++(Y..Y)), PROFILE
4406A27K6k7K2j21Q5R0L1j46O1P3j58K5J43l3p5K1n6O5Q9j20j02K78K8k71K31O1j51o6K3n
4124A48j00J03N7m7J15p7j82N9M9m3K47pj25J4j35n3J17OL5J06j14k0j3l6n0R9j40R4O2K1
3842A90P7j98L23j87n8n4O0Q5j40l2J5J72jk15J9m4J27l9m1R1j35J04n0O7N9j45J88l9j49
3570E0O9k5J04mk8N8j5n4m3q5R7J35k02J38qj58M2Q7J18k30O0l9K0L1m1O6J17q0N5j55J19
3279A99kj10J05qj6q2j7O1J31l0J8j07k4mkO9o1J11L0j29OOq6RJ7nM5P8j10j3J1J36n4j44
2960B8j7N7j2k3L8J13M8j21jO3N6j28p7J3J08l5J9q2j0J06N6j0r6l6O5l1O4K8r7m1J46r6J07
2650B02q9r5R6Q7j49J88m6j66P8J06o5k6N0Jo6n0J6ON0k8l7J53p5o1rL9m4RJ9l7P2R7j74N1
2331A03Rp8K14j55l5K22J67l07%l5N2N9r3Po3J57j31OJ2n2RO8L8n5K3j6m2j5Q1M2r2Q0p3K6
$$ y = [127, 153, 126, 148, 27, 112, 202, 233, 87, 148, 221, 63, 88, 231, 198, 123, 144, 88, 153, 242, 122, 20, 298, 326, 55, 286, 347, 196, 130, 153, 148, 48, 151, 208, 161, 276, 199, 17, 76, 125, 82, 329, 322, 197, 211, 76, 23, 140, 146, 181, 287, 173, 153, 140, 104, 54, 153, 13, 107, 169, 190, 267, 69, 392, 205, 147, 93, 153, 238, 98, 66, 81, 253, 252, 37, 56, 12, 139, 100, 59, 150, 15, 119, 69, 136, 195, 50, 238, 199, 50, 119, 94, 198, 194, 166, 224, 209, 155, 112, 27, 124, 259, 57, 195, 187, 29, 71, 158, 276, 46, 106, 67, 87, 118, 77, 143, 260, 180, 235, 80, 199, 197, 87, 192, 184, 168, 86, 69, 130, 261, 231, 249, 142, 118, 114, 112, 181, 120, 231, 261, 132, 138, 144, 58, 67, 84, 79, 124, 202, 92, 79, 90, 226, 172, 28, 11, 68, 56, 33, 71, 184, 232, 111, 110, 173, 229, 101, 24, 37, 145, 110, 129, 47, 37, 143, 199, 189, 93, 57, 122, 91, 155, 183, 86, 45, 191, 95, 202, 113, 18, 114, 201, 52, 240, 194, 28, 106, 212, 147, 121, 171, 172, 106, 56, 72, 78, 128, 100, 63, 216, 141, 80, 71, 110, 66, 75, 94, 57, 129, 226, 52, 103, 112, 34, 248, 93, 58, 280, 447, 140, 140, 105, 157, 216, 123, 130, 67, 224, 93, 99, 111, 59, 68, 136, 174, 119, 142, 126, 84, 69, 150, 192, 100, 180, 107, 133]
2011A33n7J11j45O9o3N5j3KJ09j26J09l6o8k4N8N4q4N3K3p4J7q5R9j0kk7J77r1n1k2J22l8
1711A75J19j42m1J08p5j00N5k0N1J5N2j02O5R1M6j41Q1J04k10k8Qr3J64oo1J42j35R2o3q9
1429F2rJ9n2M6j9R2lm3j0k0m2J3R2Q6M4o3m2P9j01PJ9r4K00n5k4j7o1M8nj04J49K4q2Jp3P
1091F9k4J2pL4O3K0j45K44J36j15o4o9o0O4l9%j7nP7k7o6o0J42j03l9R8Q6J5k2q3R4m1j10
781E8J52l8j34J18L9N1p2j49K01O0j4q9r1Qp3K15Mr1j15J3Q2j2M9j0nQ2R2j73p4O1mk2P5M6
462B40j8k6j07J18n4n7J42j14km6O8J17j33K05L3k54K1N8m1m9j4R8p1K6n8N9j13R3r8J01Q5
171B09l4N1n9j00J8N9Q0m2n6k8K0R3n2Lm0m3K01j62J3r2J55J34j06r7l9M6n4J05N1j68J2q
-129G0J5M5l4N6L0j63J39R1k5r9KJ01j31J41k4r9K1j05R3J01j41n2J35l4n1J35j35M7
$$ y = [133, 76, 187, 42, 111, 48, 103, 90, 92, 201, 75, 184, 148, 80, 56, 114, 168, 84, 137, 160, 86, 103, 18, 117, 107, 105, 78, 255, 164, 113, 91, 213, 175, 294, 152, 111, 219, 144, 44, 99, 79, 130, 145, 197, 95, 160, 251, 297, 156, 237, 341, 131, 103, 111, 18, 182, 176, 115, 257, 122, 214, 151, 62, 53, 72, 20, 66, 47, 139, 136, 93, 83, 63, 21, 34, 126, 212, 256, 193, 151, 230, 129, 136, 155, 61, 261, 206, 182, 165, 104, 152, 147, 43, 192, 216, 134, 135, 62, 69, 45, 57, 50, 84, 147, 167, 22, 266, 402, 287, 223, 154, 94, 158, 119, 119, 102, 97, 174, 147, 81, 21, 163, 60, 21, 119, 205, 220, 198, 115, 209, 168, 58, 210, 172, 38, 156, 195, 246, 174, 25, 226, 286, 272, 183, 92, 100, 27, 242, 246, 155, 40, 53, 135, 123, 172, 162, 157, 239, 331, 158, 84, 145, 141, 119, 194, 240, 222, 196, 89, 207, 153, 96, 238, 124, 122, 76, 144, 261, 128, 333, 366, 112, 133, 191, 150, 101, 87, 185, 114, 140, 82, 141, 28, 121, 23, 124, 209, 175, 226, 167, 67, 85, 144, 224, 182, 126, 98, 118, 211, 159, 162, 122, 79, 280, 118, 131, 39, 194, 328, 222, 125, 86, 132, 78, 183, 234, 66, 78, 70, 85, 130, 96, 152, 182, 19, 158, 249, 224, 125, 127, 228, 97, 238, 214, 115, 136, 31, 124, 225, 84, 32, 167, 133, 82, 217, 82, 129]
-392A29
##PAGE=	F1=10004.9
##FIRST=	19140.455529915001534,	4405.895418600002813,	0.11554349958896636963
##DATA TABLE=	(F2++(Y..Y)), PROFILE
4406A09K8k3L2j13Q0J24N2j71J9J17j72L3J61l7r0j7l4O3N2j14o8K54L7k33K42Rj84o6N1L4
4124A75j22J45L7o9J29q4j77R0Jo6K52k5j40O0j44l8J58j8L7J04q0q0n5k4l4J45j47Q6N4J3
3842A83M5j46K65j96J8o8L3Q1j04n3K1J31Rj85L6n2J27k1o8Q7q6R2o7L9N6j09K03p1j33L6
3561A03j2Q1qj5Q2n5l6j0q3J05O0j73J59l0j13J7O4Q7j85L4j0K6Q6n2M6J04r9M7j48J00j5
3270A57o7J35k4k5n6n0O9J57m7J0j04o4J0J7R7p1P0J9q8K4j2p9m0Q4l7L0Q7j06KM1J19r6j36
2960B6L6P5r0k2J00L5J5o3p1J32P7j25j01L7M0l9J9l5J3O4N9K3j12k3N5l0N5K6j32N6J01q9
2659A12P2p3q2Q2O2j26J75Mj53k8Q7l5L9K9j0o0j6pj3Q0l6k3Q3j3q6NJ8K7kl0PN9R0j68LL0
2321A03m4K30j50q2J93J56l20R7q7L3J25r3j8q1J90j35o1J3j3L3KL6J8l9K4j4n8N8O4q6M6
$$ y = [109, 137, 114, 146, 33, 113, 237, 289, 118, 137, 254, 82, 115, 276, 239, 149, 132, 98, 161, 213, 99, 31, 285, 322, 89, 331, 340, 156, 90, 141, 175, 53, 198, 235, 166, 295, 211, 34, 124, 125, 59, 311, 286, 146, 206, 62, 24, 182, 164, 201, 305, 225, 145, 90, 66, 32, 177, 30, 116, 170, 183, 228, 82, 347, 151, 169, 101, 134, 215, 111, 58, 79, 210, 219, 34, 70, 18, 145, 124, 56, 143, 57, 149, 82, 121, 177, 68, 271, 200, 67, 103, 91, 172, 164, 149, 231, 176, 140, 130, 47, 152, 212, 39, 198, 168, 55, 72, 136, 223, 38, 72, 62, 88, 174, 122, 168, 272, 173, 220, 72, 172, 157, 90, 225, 201, 176, 120, 70, 139, 296, 249, 259, 155, 91, 101, 118, 215, 144, 214, 233, 145, 169, 157, 78, 38, 122, 85, 115, 202, 96, 98, 139, 258, 162, 26, 62, 137, 47, 25, 125, 160, 175, 112, 41, 173, 250, 125, 24, 61, 101, 62, 81, 46, 59, 123, 182, 205, 93, 70, 125, 95, 150, 176, 44, 100, 201, 112, 184, 111, 29, 111, 173, 47, 222, 226, 73, 45, 132, 97, 136, 165, 155, 95, 79, 72, 59, 139, 103, 80, 163, 150, 64, 69, 87, 114, 112, 82, 89, 148, 238, 70, 73, 103, 59, 289, 139, 57, 250, 406, 86, 183, 96, 129, 254, 161, 143, 62, 252, 117, 56, 69, 56, 89, 91, 127, 145, 106, 130, 116, 58, 116, 180, 94, 140]
2030A40q6O9l9J36j28Q7j20P4Ml1Q4q0J25l3j27k2L4M6l4ON1p8J7o2P7mRl8J58n4o5j6R7r0
1711A07J65j46k0J42r5j00L4qN6L4J3r5J12N5K9j53O7J06j87qK0q8J22k9K5J38j76Q5o1o4
1429H0K5J0j04Q6l1O0jj6j3o6L5l6O7R2N9k6o8Q5q7j9J3j18K29m7K8Nr4k8K6q4J30Rj10R0
1110A81q3l2m3N6K0m7R4L0j12J81J48j38r5m7l6O9n6MJj5P7J3j22k3J51q4m8Q4J23k2o2PQ1
800B55o3j25J31m9j30J46K5N5n9j56K06O3l4q4l7j8r0J76J4r8p4k1O9n2Q2J2M7P8O2k06j6
509A09N5J9j00J13M4qq5r1J21m1MJ21j63P3k3pJ16j29K22L2k74M1O0r5p2J08N4n8N0p8L9n7
209A00P6j60J70P1n1J9m0j25M0L2K4l8oJ0LJ02p6m4M5r2J59j03J3q1J34J44r1j72RK9nJ32
-92B28lj61Ok4O4O6p2J1L9j36J23N9n7p9O0J57j84J23k9j12N0q2J16M3j33n2J27j6n4J13j13
$$ y = [140, 54, 123, 84, 220, 92, 179, 59, 133, 137, 106, 190, 110, 235, 202, 75, 53, 87, 133, 99, 105, 156, 78, 95, 33, 110, 106, 115, 77, 235, 181, 116, 100, 197, 107, 272, 126, 106, 248, 153, 53, 87, 79, 135, 169, 182, 87, 199, 254, 283, 130, 197, 303, 116, 108, 128, 40, 162, 133, 158, 296, 120, 205, 144, 80, 105, 115, 11, 97, 66, 126, 125, 109, 96, 30, 65, 29, 96, 188, 247, 221, 153, 238, 151, 132, 145, 27, 256, 209, 237, 242, 148, 120, 146, 62, 192, 201, 91, 181, 98, 66, 23, 79, 99, 52, 146, 176, 64, 245, 393, 255, 160, 113, 77, 146, 90, 94, 95, 80, 157, 170, 48, 25, 176, 92, 44, 128, 251, 229, 167, 174, 255, 192, 67, 198, 149, 19, 165, 190, 245, 186, 30, 236, 299, 265, 181, 144, 126, 36, 212, 226, 128, 54, 33, 102, 50, 132, 144, 191, 269, 331, 125, 109, 164, 183, 83, 196, 240, 232, 147, 56, 177, 136, 140, 261, 98, 171, 148, 141, 257, 128, 350, 382, 108, 149, 209, 114, 42, 150, 204, 146, 196, 118, 157, 100, 176, 16, 186, 257, 206, 225, 185, 60, 100, 132, 156, 118, 112, 122, 125, 227, 151, 107, 152, 60, 219, 116, 129, 48, 182, 326, 235, 63, 72, 101, 96, 228, 225, 64, 70, 46, 110, 176, 104, 115, 154, 18, 141, 200, 143, 64, 124, 281, 97, 220, 191, 79, 129, 47, 163, 206, 73, 21, 148, 132, 78, 191, 78]
-383G8L7
$$ y = [78, 115]
-392A15
##PAGE=	F1=9926.12
##FIRST=	19140.455529915001534,	4405.895418600002813,	0.16969048976898193359
##DATA TABLE=	(F2++(Y..Y)), PROFILE
4406H5K3j1M5q7O3J48M5j72j8J52j81M4J81l8j03n5j6N6Qq5MJ80K9j80K54m5k23o9R9O5j07
4115I1J29L4r2J32q6j23P8m1r0K68l3j69J08j24n5J74l5M0Q9m1j30o8k1LJ42j57R9M8lJ2o7
3824A12K03k25J15q3MO6m4l8j4P7J8j56M8n7J06np7Q8k1P5r8J2N7j06K19r4r5J4j5N2mlR8
3514B29o2n2K8p1J16qq4R6m0o9j0J9N3j06j8K0L5J34m7L2Q2j13L5j38P2j5mJ22l2l5l7n6J16
3204A92J40q1K1j13p8KN6R1o4K8ml7J1j2p1k5J25n6jR7q9rM9J25j30j11O8O8j26k4J22n6Q9
2894A97k1j30J14Q2r9q3K3L6r3J6JM8M4K5N0j11PL7l8M7Lq5Q9N1r3M4n9o0O3L1r4J62N0j32
2575A22q8J2M8N5Jqn6K2l2j3Q3m4J2j4O7j18M0k5J18m9m9K1O0O3j20n4N2J0J97j22j31J36
2274A96J14k81J76j17QJ62p9k5r6K11j31j04J7J8M4l5OP6j01Q9qj10M3R6o8No9O0oJ39p9J08
$$ y = [85, 108, 97, 142, 55, 118, 266, 311, 139, 121, 273, 92, 136, 317, 279, 176, 121, 105, 161, 169, 84, 88, 268, 297, 117, 371, 326, 103, 34, 133, 198, 91, 220, 254, 162, 294, 208, 85, 163, 122, 32, 300, 267, 98, 206, 82, 27, 201, 166, 206, 295, 254, 124, 56, 35, 38, 180, 23, 122, 170, 167, 179, 112, 315, 90, 205, 122, 126, 192, 148, 110, 96, 173, 191, 35, 83, 26, 132, 127, 50, 138, 117, 192, 94, 106, 163, 57, 276, 182, 87, 101, 86, 138, 134, 131, 229, 167, 115, 143, 72, 188, 180, 96, 192, 152, 83, 73, 92, 145, 39, 21, 41, 76, 210, 163, 195, 277, 164, 199, 61, 133, 118, 114, 236, 204, 169, 132, 76, 192, 332, 251, 272, 159, 81, 83, 139, 230, 166, 194, 190, 153, 164, 152, 81, 56, 181, 125, 124, 221, 132, 123, 172, 297, 167, 56, 124, 192, 66, 42, 164, 108, 197, 176, 46, 160, 242, 143, 60, 83, 119, 26, 42, 43, 91, 135, 160, 210, 99, 106, 143, 105, 152, 155, 70, 159, 210, 117, 161, 102, 42, 105, 136, 42, 204, 254, 122, 34, 46, 94, 149, 150, 142, 86, 108, 76, 63, 146, 102, 114, 100, 167, 49, 89, 64, 182, 133, 84, 105, 165, 228, 108, 54, 106, 116, 313, 191, 60, 196, 310, 29, 205, 88, 96, 258, 179, 154, 58, 269, 138, 34, 51, 69, 113, 78, 84, 160, 59, 148, 140, 30, 73, 169, 101, 106, 37, 97, 91, 230, 151, 259]
1974B59j74P1K9n9N1l6J31k6j53m4M8K2nMO5j06Ol2O3j3J1k5J14j2o1j0O3j21J73j04k3J54
1673B60j12j04K5kN0Q0k8o7J48K1qj49K7J07j44OM1n9L1l5Q9J31j88M8m0l7P6jj24Q3l5J3
1373A03j3J9K1j00Q9n2%Q7O8j0o8Q1o6k4J1j02K05l8N5K3r4j18O8m5P9qj16J58r6n3j9R9l
1063A41j11J21L2o6J12J56j48j43j7oL7J0M0k1r1J11M6j86K0J38n6k7L9J58o5q7P5P0p6j12
781I4Q8n6j07J49J8O5p1j63K10N0o3m6K0l8q4J16J1r9j6n6M1n6R8M7Q1M6L1k12L8M0M4j73
481D7J36L9Nj42l8Q8J7M1Q0j84J16Mp5R4j00K19K2k76O0O0j46l2J86j4m1O8p5JJ5N7k16K07
180B23O4m9k7k2j21L4Rl2J3K0L5m2J24m7j50J39q2N9l5J2m0N9J56o3k13L0K1J9J54l7j13j9
-120G9k3O7R2r3k9M8j26Q9L2p8k0R8J76k21J03l2j28J16r5J50rj37m4J01Kk7O5q5L1
$$ y = [259, 85, 156, 185, 126, 177, 141, 272, 246, 93, 49, 97, 119, 114, 118, 183, 77, 83, 51, 114, 101, 112, 87, 201, 189, 128, 118, 181, 60, 233, 129, 106, 260, 148, 44, 69, 67, 117, 197, 169, 102, 250, 271, 263, 114, 141, 248, 104, 110, 151, 92, 123, 88, 177, 308, 120, 168, 128, 91, 167, 166, 42, 125, 90, 103, 90, 109, 130, 30, 119, 67, 67, 154, 222, 212, 144, 225, 159, 135, 146, 44, 249, 211, 266, 289, 195, 77, 145, 100, 179, 171, 55, 213, 117, 64, 45, 144, 141, 30, 151, 183, 117, 229, 385, 237, 94, 77, 71, 108, 118, 158, 137, 46, 157, 203, 17, 37, 175, 119, 92, 131, 289, 224, 137, 212, 282, 206, 94, 182, 126, 19, 168, 186, 251, 180, 17, 227, 277, 214, 168, 188, 150, 66, 182, 193, 94, 78, 22, 63, 7, 105, 152, 233, 279, 310, 98, 136, 176, 220, 47, 183, 222, 227, 85, 47, 135, 152, 193, 273, 89, 205, 209, 134, 228, 128, 347, 369, 93, 153, 213, 67, 35, 221, 207, 166, 234, 159, 160, 175, 232, 16, 223, 287, 238, 211, 189, 68, 102, 111, 79, 92, 112, 147, 105, 229, 182, 32, 171, 89, 148, 113, 125, 85, 144, 300, 237, 24, 54, 75, 94, 248, 211, 98, 79, 56, 123, 215, 122, 93, 141, 15, 104, 136, 58, 38, 136, 312, 91, 194, 162, 34, 150, 55, 205, 196, 59, 15, 116, 118, 91, 156, 71, 102]
-392A02
##PAGE=	F1=9847.36
##FIRST=	19140.455529915001534,	4405.895418600002813,	0.18984842300415039063
##DATA TABLE=	(F2++(Y..Y)), PROFILE
4406F7PPN7m8N7J39J1j63l6J75j83N5J90l4j14q1pO0m1j1L6J14nj08K56r3k51j4R7P8p1P8
4105B24L0j05J20q2n2N4p6o3K51l3k04J41r8p6J73m5M4N9kj63k2k5J7R4j45J04O1k4j7J2J59
3814C11k78K20r6j1M5j3k7m3L8K6j32N5m2M6Ro4R2M7N8j38j3Q2j37K17j03m4J2l2K8LKJ08
3514B26m2r1O5n8J16m2k8K8l8l0k2l1J4qj8lJ6J66k5K2N3j22K6j23L7qM7R7l3m3k3n5J72J21
3195C63j31M9j25o7k2R2P2n3jl6J1j1ko7j0J56n6j9J18p4l9M5J47j44j14R6M8j44j7J18j42
2903D1K47l9j50L4P8n6p5NP2j33oL4O2N9k2N0r4L9K8n5K8k5NP9J2j08K9n5k9M4jo2J54P7j06
2575A61q6j2Q6Nl2J0m7N1n2pO8n0M7q5J24j42Q0o5J79j02m2J1P1L0m7q2N7L5J51q2j60N6N2
2265A81j31J58j26k3J71n8j3r4K10j23r6J2J8M9j5m3Q5j33J46k4r7M5Q0n3k0k0k0K8J17pJ29
$$ y = [67, 74, 81, 138, 90, 147, 286, 297, 134, 98, 273, 90, 145, 335, 301, 187, 106, 99, 159, 118, 107, 143, 257, 252, 144, 400, 307, 56, 42, 139, 217, 146, 224, 254, 149, 269, 187, 135, 189, 113, 50, 301, 268, 64, 205, 107, 31, 204, 159, 203, 262, 260, 97, 75, 50, 67, 161, 16, 120, 181, 157, 140, 152, 311, 33, 253, 157, 146, 191, 178, 151, 108, 146, 172, 40, 95, 53, 99, 108, 44, 136, 183, 241, 103, 90, 172, 35, 252, 149, 105, 117, 85, 113, 116, 118, 226, 184, 93, 158, 100, 216, 174, 146, 174, 136, 106, 84, 53, 67, 59, 41, 38, 54, 220, 195, 217, 270, 148, 174, 51, 88, 80, 127, 224, 191, 148, 125, 70, 242, 363, 232, 281, 156, 89, 67, 159, 231, 178, 177, 141, 152, 141, 139, 72, 62, 218, 162, 143, 261, 187, 148, 193, 340, 196, 82, 178, 226, 82, 65, 183, 41, 288, 249, 99, 133, 211, 155, 80, 85, 157, 24, 18, 52, 114, 173, 151, 201, 107, 146, 174, 119, 147, 122, 127, 206, 218, 110, 139, 84, 55, 99, 98, 36, 190, 267, 161, 75, 63, 149, 154, 122, 132, 85, 136, 84, 77, 145, 95, 142, 57, 181, 39, 119, 54, 233, 131, 89, 100, 171, 201, 154, 72, 129, 164, 315, 233, 73, 129, 181, 50, 208, 82, 59, 230, 172, 159, 65, 275, 152, 56, 68, 86, 135, 120, 77, 162, 29, 175, 151, 54, 99, 179, 126, 106, 86, 66, 94, 211, 204, 333]
1974C33k11L8M9q9M6JJ24k3j47p6Q5KlM1O2j48qkN5l3OMN3L2m4kJ3n8Q1k7m7J50j17j16K9
1645E3J3J1J36n3m3J70J8m9j13n4R9r4J4O3l3n4l4J17J30j63Mj4k6J31j6j38P1k8l8l7N2Q0
1345A75j17J17o5o0O6P6j9o0P3l5lQo3J53l5N4L2o8j97J16kK3l5j04J93j06o7L5J15k4j38
1054C8J17K9k0N4J55j47j83K1Rj5J26N0n7j74J81N3j74rJ16l2nmJ83j05r1J06O4p5q8M0o3
763A00n3J17J3O4r3j41J89K7r2K0O7n5o6N9Jr5M8p3j2J3N8O8R3J2Jj85P5K4O3j85R6L1J7j50
443E6J7J2R6N2L2j56J23J8j31N7m7K03%k63P2N7j73R5J63q8k4Q2n5m3Q5M0k29J78O4l2p0j8
143A73q7Mpp8J25RL5j14J49J0j67J20m9j6MK3rm0J79l1j38o2N8MJ51l9n8n5j5L5J17q9n1N7
-176A48j19L0J9n2M7Q6J60k29P3k9j20J79j46J88m0j49k6O4J5QJ3n3K5
$$ y = [333, 122, 160, 209, 120, 166, 167, 291, 268, 121, 45, 130, 132, 129, 170, 232, 84, 76, 74, 129, 96, 102, 106, 159, 191, 147, 145, 158, 100, 181, 154, 107, 257, 140, 24, 53, 66, 77, 213, 160, 117, 287, 305, 256, 143, 89, 188, 94, 108, 171, 138, 84, 50, 167, 297, 134, 138, 124, 98, 229, 213, 75, 146, 118, 80, 43, 95, 175, 58, 175, 110, 50, 116, 192, 173, 113, 186, 151, 148, 156, 93, 246, 211, 265, 297, 229, 32, 148, 146, 169, 134, 30, 223, 117, 50, 85, 200, 176, 38, 155, 184, 164, 218, 373, 226, 43, 64, 73, 58, 184, 234, 177, 3, 184, 237, 63, 54, 170, 138, 133, 129, 312, 207, 116, 222, 286, 211, 123, 163, 100, 47, 164, 177, 241, 148, 7, 196, 223, 131, 151, 218, 163, 97, 156, 157, 62, 110, 37, 25, 38, 96, 164, 257, 269, 270, 85, 160, 184, 247, 62, 158, 189, 206, 56, 73, 85, 181, 233, 265, 109, 232, 250, 119, 176, 129, 332, 332, 69, 141, 198, 25, 120, 283, 195, 171, 253, 198, 155, 240, 280, 51, 229, 293, 261, 191, 173, 86, 90, 83, 5, 130, 139, 174, 60, 209, 219, 52, 172, 123, 107, 111, 134, 125, 85, 264, 233, 95, 33, 91, 95, 246, 207, 149, 94, 79, 114, 231, 142, 91, 148, 29, 59, 78, 26, 73, 159, 319, 90, 163, 134, 14, 193, 47, 235, 195, 46, 20, 84, 99, 107, 120, 67, 92]
-392I2
##PAGE=	F1=9768.61
##FIRST=	19140.455529915001534,	4405.895418600002813,	0.14435006678104400635
##DATA TABLE=	(F2++(Y..Y)), PROFILE
4406F3k0K4O7lO1J00l8j49l4J78j61N7J73k2j26q7j1Q4q5Q9K7O3n5rK22j33k26N4N6O9k8K8
4105B28Qj06R2p4L0K4j02JK07m0k25J53p2p2J57n7M9J7K8j75M4l4J5K9p9O5Q6l0m0O0J37k95
3805B9K72j06j1L3l0k2o2K2L1r8M6j0l2J3l4J01J07M0j76l1J28j36J30r3RK5n5J8O%J16k2
3504B08j20R1n0R8l9j2l3k8Pj8j7j8J4J3k4l7J75J1OK4j26K5j02%lP6O8k6m2j4m6K08J15j96
3185A88Q9j31m0n0J14N6m6j3o9M9rMq5rJ75m2k3J49o5p5L9J68j34j33J05K4j55%J00j38L32
2894C75p5j64l5P0lr2j3J17j43j2M6N3Q9m3J3p1O7K8p3pl8Q7N8j1j29L1o6K0K2l6l8J45Q5
2584B57p2q2K8P8n8o3L7l3O7o4j0N6n4P0p2J02j53J16r7K03j48k0pQ5%K9q8N1L5R8l6j52m2
2274F1J0L7Q9j18n8J61l4Np5J93j11r1PK4N9J9o3L3p9J25m8l8N8M4m6k7qo6K8P8O8J51k23
$$ y = [63, 43, 67, 134, 131, 192, 292, 254, 105, 71, 249, 88, 145, 318, 296, 170, 83, 72, 156, 71, 160, 187, 250, 195, 186, 408, 275, 49, 103, 159, 228, 200, 228, 236, 130, 222, 148, 178, 202, 100, 101, 308, 268, 43, 196, 124, 52, 209, 152, 201, 218, 246, 71, 115, 81, 96, 125, 46, 111, 197, 167, 127, 187, 324, 29, 301, 195, 184, 217, 187, 165, 103, 125, 156, 58, 104, 94, 62, 75, 41, 142, 249, 289, 113, 82, 210, 74, 204, 111, 120, 145, 90, 108, 114, 114, 230, 208, 88, 179, 129, 227, 188, 176, 143, 115, 122, 104, 87, 69, 83, 96, 72, 35, 210, 221, 227, 251, 125, 150, 48, 48, 45, 121, 189, 163, 121, 107, 61, 269, 384, 188, 277, 146, 106, 56, 170, 226, 180, 167, 98, 147, 138, 142, 57, 48, 223, 181, 158, 307, 242, 167, 206, 374, 240, 107, 212, 236, 81, 81, 181, 43, 375, 300, 136, 101, 171, 168, 76, 63, 180, 37, 25, 71, 124, 213, 170, 183, 112, 179, 207, 134, 127, 89, 176, 234, 223, 94, 125, 59, 79, 101, 65, 27, 172, 257, 185, 103, 131, 209, 151, 88, 125, 92, 159, 95, 85, 141, 87, 157, 85, 187, 34, 150, 53, 256, 108, 88, 81, 166, 166, 195, 107, 158, 193, 291, 255, 103, 61, 71, 108, 197, 79, 21, 182, 148, 153, 78, 271, 160, 69, 76, 100, 159, 178, 115, 148, 69, 194, 146, 108, 166, 210, 164, 137, 129, 63, 91, 169, 237, 388, 165]
1964A65k3O2j22P3L0J13l0j26j01J16qrQ4N8j88j8K0N4n4JK9rP0k3J0n5M2l5M9p5J46r4j16
1655C6K3M6q5J86n2m0J78N1p3o8j21O1o2K9P4j6j06l3J08J35j14Pk3l6J79l6j40M7pp7o3O5
1354G3J45j31J37p8r2L1Q4m9n3P2qL4Pl1J08m5L2L2k5k33J47L3j4o8r2K01j12q2J03J13l7
1063B02j50R8L1J2OJ48j36j68L3Nj9J84L6r3j28J56M2j53m0R9j8Pk9J92j36p3R5O7n7p0lo0
763H0oP9NM9j12o2J09Qj17J02Q7o7l5J8or5J08q8j6J2M2O7R2pk8j36R5J7O8j57K1K0K8p2L
434A06p3J63N3j4q2R8J5j67J0K1J82k8k42P5N0j16J50J25j50j4R1j6r0J42K6k22J20O0jr6
152A76l1l5m6qmJ32PJ2j82J47O8j18M0j5j4j7N0oj28K05ln6j52J13rJ06j5k2r5j0jJ31o5n5
-167A00O7r5l4K6J2K2Q9J16k02K9j9n4J90k21K22n2j58lL9OL4k1k5K1
$$ y = [165, 142, 204, 82, 155, 185, 298, 268, 142, 41, 157, 149, 140, 224, 282, 94, 76, 96, 150, 96, 97, 126, 117, 187, 164, 174, 119, 161, 126, 175, 100, 246, 152, 36, 59, 105, 20, 206, 154, 114, 292, 343, 270, 202, 81, 142, 80, 109, 183, 167, 61, 28, 136, 271, 157, 164, 141, 105, 284, 248, 108, 155, 148, 71, 8, 73, 218, 87, 224, 146, 54, 85, 169, 120, 67, 139, 131, 165, 172, 141, 249, 204, 236, 268, 243, 10, 157, 190, 176, 108, 16, 217, 105, 23, 126, 239, 202, 52, 150, 181, 193, 199, 347, 211, 43, 76, 81, 62, 246, 282, 189, 61, 217, 259, 106, 66, 165, 147, 154, 125, 317, 181, 108, 203, 270, 213, 143, 140, 80, 74, 153, 158, 207, 95, 33, 142, 150, 33, 135, 222, 155, 120, 138, 132, 37, 145, 57, 41, 53, 95, 162, 254, 247, 219, 83, 178, 195, 263, 106, 127, 147, 175, 103, 106, 33, 196, 249, 235, 153, 251, 266, 99, 109, 130, 312, 284, 42, 117, 167, 51, 201, 326, 176, 162, 253, 237, 147, 289, 315, 93, 213, 273, 272, 176, 145, 110, 64, 56, 52, 184, 191, 203, 21, 168, 236, 118, 158, 143, 129, 112, 162, 156, 28, 233, 230, 174, 22, 135, 126, 232, 217, 195, 100, 90, 89, 220, 155, 100, 167, 72, 38, 64, 76, 98, 187, 303, 101, 130, 111, 57, 247, 26, 248, 196, 38, 35, 74, 80, 114, 93, 68, 89]
-392H9
##PAGE=	F1=9689.85
##FIRST=	19140.455529915001534,	4405.895418600002813,	0.13725085556507110596
##DATA TABLE=	(F2++(Y..Y)), PROFILE
4406F4m2L0P5L8O8M9q6j37rJ55j01M8J14rj31p9k1J22p3J41mK5q5R2J43j68j45P3K9N0J5L
4105B44l3r5M6o1J08lj20P0J56o3k16J39m4m0J48q3N2k8L8j58R0m5J7l2rJ6J09j3o1P9J27
3814C35k69K65j11oL2p4k2p1K9L3o4K8K9o7j1j4J15J53J6k01l6J71j17Lo5N4M1q0L2%nJ18
3514B41j9j23J05m8O5j8k3q0j3M2lK7j8l8M4l6p5J64M6k2Jj22L3p7Ll8Q2M3j7l1ok7K06J07
3195C75k58J35j20lp6J21N1m3j6r6P1K6Nj25j9J72k5j6J77n9j01L6J80j08j40P4J0j63K3P4
2913A62o0L21j07j63o7O2L8j34l1J61j39mM7L2J25l8m1n2Q8L3q4o0j0J26L4j4j49M5r2Q3L
2622A15p0k0J10Q9l4q1O5P4j05p4N6j9P3p0k7N7n8P4k3N1j53J49j31J98j75J0k2R2j9Q3q0
2331A35M3K0M9Rj09j24R0M2K6j03n3J03rJ8n0J69r3r8oN4P1M4o2m3j3Q6p0K3O4L3m1l3j6m9
$$ y = [64, 22, 52, 127, 165, 233, 282, 196, 59, 50, 205, 104, 152, 266, 257, 126, 47, 26, 148, 75, 216, 212, 237, 152, 244, 387, 219, 74, 147, 176, 226, 241, 244, 211, 116, 162, 101, 209, 206, 86, 156, 312, 249, 33, 172, 128, 88, 236, 153, 205, 177, 215, 57, 147, 102, 119, 87, 78, 94, 203, 190, 129, 208, 335, 66, 331, 220, 214, 246, 172, 150, 79, 108, 141, 77, 105, 134, 67, 56, 42, 157, 310, 326, 125, 89, 260, 143, 146, 81, 135, 176, 96, 128, 128, 123, 241, 222, 99, 204, 156, 221, 203, 180, 100, 87, 129, 126, 153, 135, 97, 141, 105, 30, 194, 240, 218, 219, 97, 130, 53, 56, 18, 100, 143, 126, 95, 89, 62, 268, 375, 117, 252, 132, 129, 53, 174, 225, 182, 166, 70, 141, 167, 172, 47, 28, 200, 175, 159, 336, 277, 176, 212, 392, 284, 144, 218, 228, 65, 88, 162, 102, 423, 316, 153, 86, 148, 186, 52, 21, 182, 43, 39, 86, 118, 243, 205, 164, 112, 200, 233, 149, 89, 79, 205, 239, 225, 76, 121, 29, 112, 115, 45, 25, 135, 224, 190, 109, 174, 248, 143, 69, 125, 106, 179, 109, 82, 139, 81, 155, 132, 183, 30, 179, 48, 246, 71, 81, 59, 151, 132, 215, 135, 178, 198, 247, 256, 147, 23, 113, 155, 181, 78, 25, 128, 119, 137, 87, 256, 163, 65, 59, 113, 184, 228, 166, 123, 110, 196, 126, 149, 213, 246, 205, 172, 156, 107]
2011A07k7M5J21J74k16j00P7j49J06N7J00m5j01j09J28j9lJ17N2k17j6L0N7o7J0L0m8Q0kK6
1730A98j34J39j14Q9r2J47n1j10J5P5j17J33l5n2J74J02p5l2j41J1o8N6O8qj21m3Q1J42o2
1457A75N2o5m4K05n8j32K1K4r1n1RK02j39J50q8r0j1R3p5l4P4j5P1J3j1O6n8lK5J8k00J37
1157A70N8l6q7p2J74j11p2J37R6m2j44O4L9K7l9J32j13j21L2LK1J69Lj23m9J17K8j39n4Q3
875A51nJk6J81j52m3N6P5l0o3l3l8K0M4nK4j11PK1J2k8O8P1p2OJoj02J48j06J5j3K2N0Q9m
537B25n2r3J08J8O4j28m6PL5J7k3q5J40N0m9J7N3lj75m6R8J58m6k17N7M8l3J68P9j89j2R5
237B40K9j27J82J3k00N9L8M2r5n0Oj02J4L7J36L6k6j56N0J04p1k5J4J8n1Q1k6q8J28J9K2k04
-64D7J28%M5J1oj32j3jJ13l2m8P9o7n7J5J6KJ12O3j52j9pj1K11k75K20n5j57K1M1k8M7l2n
$$ y = [107, 80, 125, 246, 420, 204, 104, 181, 32, 138, 195, 295, 250, 149, 40, 168, 149, 146, 263, 315, 98, 82, 112, 169, 102, 112, 142, 94, 174, 172, 198, 64, 203, 89, 178, 86, 233, 182, 72, 87, 162, 45, 178, 143, 91, 265, 367, 292, 260, 119, 130, 62, 118, 186, 178, 57, 14, 95, 237, 175, 227, 162, 118, 323, 265, 133, 154, 178, 87, 36, 45, 247, 108, 258, 170, 80, 69, 162, 87, 53, 127, 112, 183, 196, 185, 251, 193, 190, 215, 233, 33, 170, 228, 192, 105, 33, 207, 96, 24, 161, 257, 215, 71, 135, 174, 201, 162, 294, 181, 60, 92, 95, 116, 285, 288, 165, 116, 233, 261, 122, 68, 151, 146, 147, 121, 302, 150, 107, 163, 238, 208, 145, 112, 74, 94, 138, 133, 157, 46, 53, 74, 86, 58, 126, 197, 125, 131, 132, 126, 24, 172, 66, 81, 68, 90, 140, 229, 225, 173, 80, 188, 206, 270, 142, 96, 103, 138, 155, 132, 47, 187, 237, 188, 205, 258, 255, 80, 34, 132, 290, 244, 27, 84, 132, 99, 267, 346, 157, 145, 240, 269, 142, 324, 337, 137, 196, 234, 276, 181, 131, 137, 35, 49, 86, 222, 258, 232, 76, 126, 230, 159, 134, 148, 166, 115, 196, 170, 82, 210, 229, 251, 47, 175, 175, 220, 231, 225, 93, 80, 79, 192, 160, 112, 191, 124, 67, 82, 98, 100, 212, 275, 123, 104, 97, 86, 297, 22, 242, 187, 30, 51, 92, 64, 111, 79, 74]
-383G4J6
$$ y = [74, 90]
-392I0
##PAGE=	F1=9611.1
##FIRST=	19140.455529915001534,	4405.895418600002813,	0.13730227947235107422
##DATA TABLE=	(F2++(Y..Y)), PROFILE
4406E9m4J7Q3O8P0Kj08j07KJ08j1L7J3Lj16p0L8Q4J0J19m6km1J36L0j98l8O6J7K5N5Lp2p2
4087A20qm5J57k2j24J31R4r7j64R3j3LJ51j21N3o3K6j17J08n0K2o8L3k5J12J9q0Q8J18k42
3805H9K42j06mL4j22k1o0M0L9m4J5O5n1l4l6J34J78j0k09l0J90r2j14j0O9N6j06O7j6j2J11
3514B52k7j15J24n9K3Qm8j13RP8J0O9j7r9P3m4r3J49P4o2j3j10M5m9L5o7M6L1k0j3KRJ46Q6
3195C20k91J69p9L6r1J12N3l4j2j19O9O2J2j58j3J21j2lJ89m6j11L2J77p0j21%K5j58K8M2
2913A29J1K81j22j50m3N3N3j70rJ37j29J5L9%J56j5p9n4J08L5q9j21O5J05J9%j55M7j13J43
2631A47rq8lL0R8Oq7Q9P6j23m4M3j5P7p2m9P0o6N8K7Kj41J83j70J70j56K7k6P5k4J04o3L9
2321A85kQN2m6j29J14Lj6r3j5K3J7J5l0J47p0r4m8J05P6N8m5j13L2M4q5P0N7N0k9l9l5kj00
$$ y = [59, 15, 32, 115, 183, 253, 255, 147, 40, 42, 150, 139, 176, 189, 192, 76, 6, 44, 128, 138, 257, 211, 209, 168, 304, 334, 136, 98, 164, 181, 206, 261, 264, 192, 120, 112, 67, 224, 202, 78, 209, 303, 206, 42, 135, 122, 125, 276, 155, 208, 145, 171, 54, 162, 112, 134, 66, 99, 74, 186, 205, 125, 213, 331, 89, 331, 225, 221, 255, 133, 112, 52, 92, 131, 87, 102, 167, 116, 82, 46, 180, 358, 348, 139, 109, 299, 207, 93, 83, 152, 208, 102, 169, 153, 141, 252, 225, 110, 234, 175, 198, 206, 158, 45, 54, 132, 142, 211, 194, 95, 168, 124, 31, 180, 254, 192, 179, 69, 114, 65, 100, 33, 79, 110, 90, 77, 79, 88, 234, 320, 29, 198, 119, 155, 64, 176, 229, 195, 183, 64, 133, 195, 207, 49, 36, 157, 145, 142, 331, 285, 174, 206, 383, 313, 192, 192, 217, 59, 87, 129, 140, 421, 299, 149, 106, 159, 212, 42, 33, 170, 41, 56, 95, 95, 251, 236, 157, 103, 211, 246, 157, 36, 101, 206, 225, 225, 70, 117, 4, 147, 138, 50, 47, 77, 175, 181, 94, 183, 259, 136, 92, 135, 120, 197, 125, 76, 146, 80, 138, 165, 167, 26, 209, 39, 209, 53, 80, 54, 129, 105, 209, 146, 185, 183, 191, 243, 197, 68, 182, 185, 169, 76, 61, 84, 101, 116, 86, 233, 163, 69, 21, 126, 202, 260, 215, 102, 134, 178, 93, 163, 220, 270, 241, 202, 167, 165, 65]
2002F5M3J30J89j96j72J00r4M8Q2R3o4p9j02J20l3J5J34M1k30jL0O3p6L2J2l5L8J1M5j97K05
1711B17j17O9r6J43nj04J2R4j07L0j1m7J43J45o5oj37j2j02Q7N1nj23m7N3J39j8J02j12l6
1429A35K05p8j18jN9q1n5l8K28j39J55r3o2n0J04o8rP5o1Q8K9lJ8n7l7J3M3j58J40P1n7q4
1129A14m8J38j01m3J26O8m1j10J7M2L2q9J09p8p5M0J6M1J36m0j41M3O5J8j31m6N9J4k7J4J48
838B70j50j3J2Q1ro2m8PJ8J5j1J4n2j1m1O3L9%K3o9N1J2j1r2J47j24M8j9j3L7Q9Pn0q7J16
509A87K6N3j06r4mM4P9l9m1M7N1o6J10kk4j48l4R3J31m1j87K0O5K1J69L5k04j4R0O8j45K08
209C48jj71K6j6Q9p1n3Qj17K5K9J42Q9o6j23j5R7n1o4L3M4o2J01n1j4L2M0Q7k29J09K0JK0
-101B36lj59k3O7N2qm2Q7l5p7mlJJ42J8j00n6JKK38k73J58n7j30L1N7o6M7k4NJ1
$$ y = [65, 108, 238, 427, 231, 59, 159, 65, 113, 195, 288, 224, 145, 43, 163, 130, 145, 279, 320, 90, 89, 119, 182, 106, 138, 150, 115, 153, 164, 209, 12, 217, 100, 169, 73, 216, 211, 107, 119, 213, 106, 136, 125, 78, 221, 366, 301, 295, 158, 146, 44, 131, 182, 177, 54, 7, 60, 199, 181, 283, 171, 135, 340, 262, 144, 143, 202, 121, 66, 28, 256, 117, 272, 179, 117, 67, 171, 103, 94, 169, 108, 196, 225, 222, 240, 183, 146, 159, 202, 44, 184, 255, 198, 114, 66, 204, 103, 60, 186, 254, 213, 103, 120, 162, 194, 105, 214, 136, 61, 101, 117, 158, 294, 254, 113, 156, 221, 239, 108, 62, 121, 135, 108, 122, 270, 120, 107, 119, 200, 191, 129, 81, 88, 106, 121, 110, 124, 72, 61, 20, 83, 122, 122, 145, 76, 127, 139, 128, 36, 183, 59, 107, 88, 75, 112, 201, 208, 158, 71, 187, 213, 266, 160, 66, 62, 106, 185, 146, 105, 152, 203, 137, 247, 245, 221, 73, 39, 132, 263, 222, 35, 55, 120, 141, 310, 345, 141, 127, 217, 285, 140, 348, 347, 176, 202, 186, 275, 204, 151, 159, 42, 67, 96, 238, 327, 261, 138, 123, 220, 169, 105, 138, 182, 120, 221, 170, 156, 188, 228, 315, 86, 195, 215, 216, 236, 233, 74, 51, 118, 170, 162, 120, 207, 172, 95, 91, 88, 89, 231, 249, 149, 93, 94, 96, 334, 61, 219, 162, 32, 63, 120, 54, 101, 77, 82, 93]
-392I3
##PAGE=	F1=9532.34
##FIRST=	19140.455529915001534,	4405.895418600002813,	0.076092839241027832031
##DATA TABLE=	(F2++(Y..Y)), PROFILE
4406D3j7j7Q7P8O9k8r3l7m2N2Q2L0r3Nl2n0O6rJ17N9q1j8N9J17r2k20Q2M0J4lR0J2q5m0m7
4077I8k7J53l0j15J73K8j31q4K4J7M5J53j61N4q0jo3J01l9K8o5K9m2P7N8q8R5J04k18K04r1
3786B06qL1j51j3qK1N2m9L4P4k2m4o9J49J85l5k03k2J88o4j84N2N1O6j25J10m1k4R9l1j14
3495A11J53p9k0L0q2r0J1J02PJ08j1j60J01m9r1J27R1j05j6q4M0j2N9p7OM7l9j0J5N5L3P0
3195B41j52K9j2P4q4Q8M8j6Lj39M2P0K6j58lN4j1J2J78k3j02K0J61l1p6r7P4j26mJO3K21j16
2885B55j24QM6N3j55MO4j10L8K9n2J78J6q5q1J26L4r2j25J05M8K0K7j34J0o5J37j4q3Lp2J23
2584A32L5r6Q9Q0j04JJ4k1Q0p3n5Q0p9K6P1l4j06J99j87J06o1Ok4K8k1R0l8M2k2k1Q7J7j20
2274A21Q8j4l1r1K3k5L4qk0J30m7o3o4J03O7O4j2j48K9J6j00R6L8R1qm4n9N4j71O9J13J85
$$ y = [43, 26, 9, 96, 174, 243, 215, 122, 85, 43, 95, 177, 207, 114, 119, 87, 37, 103, 94, 211, 270, 189, 171, 230, 347, 255, 35, 117, 157, 171, 168, 258, 270, 185, 145, 98, 71, 224, 194, 79, 252, 280, 149, 65, 89, 106, 151, 304, 143, 197, 117, 116, 53, 154, 115, 143, 78, 107, 65, 142, 200, 112, 207, 311, 93, 297, 206, 198, 229, 78, 65, 57, 78, 130, 81, 115, 189, 167, 123, 54, 203, 388, 353, 150, 128, 316, 252, 68, 120, 171, 237, 112, 222, 181, 157, 256, 225, 111, 264, 185, 165, 195, 113, 23, 34, 136, 143, 251, 240, 80, 181, 132, 41, 168, 259, 154, 138, 54, 94, 82, 141, 64, 70, 117, 78, 68, 83, 138, 171, 241, 89, 118, 106, 180, 96, 184, 232, 216, 219, 80, 122, 192, 218, 60, 57, 111, 100, 112, 290, 267, 165, 185, 346, 315, 239, 142, 216, 90, 86, 87, 150, 371, 255, 131, 139, 185, 238, 83, 87, 151, 41, 79, 108, 56, 234, 250, 165, 84, 210, 244, 152, 27, 132, 180, 200, 227, 93, 103, 38, 175, 161, 78, 81, 9, 132, 167, 71, 160, 240, 136, 137, 151, 130, 210, 137, 82, 162, 83, 109, 180, 146, 40, 239, 52, 158, 97, 103, 79, 107, 86, 176, 138, 180, 158, 137, 224, 241, 121, 209, 195, 164, 73, 96, 71, 105, 97, 77, 207, 160, 97, 33, 136, 203, 267, 255, 107, 136, 152, 52, 148, 186, 277, 269, 225, 166, 220, 49, 118, 231, 416]
1974D16j73k12J15k9l2R7R2p4o3q9J01m7L2J38K2k26K9K1O9q3N3rJ5l2J0O3j43J38o3K7r0
1683G3J16L3q8J3R9r3o1J4J8O6J50n4J3j14k3j33J10L9jj30j6J6J16J6J34j50j1J81r1j06
1401A36qR1n1o2m8J84j28J51r0k4p8J16n0oQ9j05Q8M5jm0l2n4kL7j03J42P4q5p3j2J05q5l1
1091I0J06L3l3m7k7K4L7j46P7l8l2N7L8L4J01p7j46J22J1J3j23j4J8L6p3R7Q9j27Oj2P2rn5
781A02n5O1KprN1k5o0PM9L4l1m3n6R5M0l3n7J07j27O4qm8N0R7roj27J24K8L9r2j20j0O3R9
443A89l9Nn4N5n6J68n5m1q8J9K4R9qj73mJ03K8J57kk05j3P4R0j35K19j5j36J9q6J28l8m4j5
133A70r2J1kJ42J61j02r9k2O7q0p9M4N2m7J03o8N8o5O4J40k29O6L6j7J6mj65k3J44mj0m1Q7
-176B12nr6k1l7L9J51oo6p7Rk1K67k44P6n8n7RP2r7M7j7RM
$$ y = [416, 243, 31, 146, 117, 85, 182, 274, 200, 137, 48, 149, 102, 134, 272, 294, 68, 97, 118, 187, 104, 157, 148, 163, 131, 141, 204, 61, 199, 136, 163, 73, 189, 222, 134, 147, 246, 153, 92, 106, 124, 190, 340, 286, 299, 185, 162, 29, 139, 178, 177, 47, 31, 47, 163, 179, 313, 163, 152, 333, 242, 136, 128, 219, 168, 106, 58, 242, 114, 265, 175, 151, 73, 189, 139, 133, 222, 117, 205, 250, 249, 209, 177, 123, 121, 158, 55, 197, 271, 186, 113, 101, 206, 121, 90, 196, 229, 196, 149, 122, 146, 183, 37, 114, 76, 44, 101, 139, 173, 274, 197, 51, 173, 184, 197, 74, 60, 78, 114, 41, 138, 227, 100, 106, 94, 166, 157, 102, 47, 108, 110, 103, 94, 145, 120, 60, 67, 116, 150, 119, 76, 20, 115, 155, 122, 65, 172, 45, 109, 101, 53, 103, 200, 191, 185, 58, 182, 210, 249, 157, 37, 27, 90, 189, 150, 155, 101, 156, 100, 268, 213, 172, 84, 103, 127, 226, 218, 45, 41, 144, 172, 329, 327, 122, 109, 183, 273, 138, 357, 342, 206, 225, 139, 267, 229, 185, 170, 78, 89, 87, 229, 390, 288, 189, 167, 234, 154, 75, 119, 171, 124, 227, 159, 217, 152, 216, 356, 127, 193, 229, 212, 228, 224, 59, 36, 180, 176, 166, 125, 212, 207, 111, 90, 53, 92, 243, 237, 171, 94, 103, 82, 349, 105, 181, 123, 66, 75, 147, 50, 97, 80, 89, 93]
-392I3
##PAGE=	F1=9453.59
##FIRST=	19140.455529915001534,	4405.895418600002813,	0.27167069911956787109
##DATA TABLE=	(F2++(Y..Y)), PROFILE
4406B3K2k5N1O4O8l3n8K2q5NJ47K5j27j6O7q0P8j00K29k5r6k0J56O9j97r2O5lJ8l3J17J5o7
4096A84mp1j6J21l0r9J94l6j49qm6M3P5J38j89N6q0l0rQ1pL5m9jl1QQ9n8R0P7j99J53o8j5
3777A49J6j41J8M5j7P0p7J02M2Jn1q9J53J72n2j88j2J64l1j91Q7J6P1j25J43p1m5R2k1j31
3495I9J88j02n8M5j19M5l8Q3j4J41Pk19J27m7p0Q0J08j39j5l8lM2O6p4k4P6m6l9M0J00p3J33
3195B62o8j68O4J08n4N5K5J0K8j50lM7M0j29LRk5K1J55J1q9kJ34jj6j86J39q6l4n2Q9J54r2
2885A99r3N5L9N4j25JLq7N8L1j00J56M9n9j26J43K9r8l6O2k3M2O2r8o2%J16j5o7Ol8M7L2q6
2565G1M4Q2m9L4j7l3P7o7l8P8r3rJ01n0n2J85j75L1M3j8k6k8k0N2rN4l0l5J02O7j01L4j8k5
2246A62q8N6l7L4m4k1J20l1k3n3O0N1O2L2j45j6J9j17R1J1J42K2m9q0R9k23Q6J17J55j51j93
$$ y = [23, 45, 20, 71, 135, 203, 170, 112, 134, 49, 54, 201, 226, 99, 83, 150, 70, 148, 48, 277, 252, 156, 136, 292, 361, 164, 72, 137, 134, 152, 119, 236, 251, 184, 180, 109, 93, 214, 184, 85, 279, 243, 94, 86, 40, 83, 158, 296, 107, 163, 83, 53, 44, 125, 118, 153, 104, 103, 72, 80, 169, 111, 201, 278, 79, 232, 164, 149, 165, 24, 42, 87, 70, 140, 63, 165, 207, 208, 157, 68, 221, 393, 341, 153, 141, 305, 274, 83, 170, 186, 257, 132, 275, 204, 159, 251, 230, 99, 287, 185, 127, 172, 53, 98, 60, 143, 129, 270, 277, 58, 185, 138, 68, 148, 256, 117, 102, 64, 61, 103, 169, 95, 71, 147, 101, 62, 102, 202, 129, 262, 194, 26, 90, 198, 144, 199, 224, 234, 262, 112, 109, 156, 196, 67, 70, 79, 54, 75, 230, 241, 152, 150, 284, 283, 267, 81, 220, 134, 100, 48, 137, 291, 199, 106, 161, 200, 254, 129, 130, 133, 46, 104, 135, 35, 191, 240, 181, 55, 198, 227, 129, 93, 155, 132, 174, 236, 138, 76, 76, 192, 177, 110, 116, 78, 125, 157, 71, 115, 197, 148, 182, 165, 132, 209, 142, 104, 182, 89, 80, 181, 131, 79, 264, 89, 120, 163, 145, 119, 91, 71, 123, 114, 168, 138, 103, 205, 272, 171, 205, 187, 162, 74, 130, 93, 127, 83, 62, 182, 151, 128, 75, 135, 186, 248, 280, 135, 119, 138, 21, 112, 123, 265, 287, 238, 158, 257, 34, 120, 237, 392, 241, 48]
1955D8Q7Oq2R7R3p2m5p6P8m8L1J25kk03O8PP1q7O5k3P3r1j1P5p7M6J0J2r7O8O9o2J6Q7p5j26
1617E5M7R2%J02n2K8p7l3j41J15L7J1j34PoQ4L6J45j76K1J44r2j03OJ12ro9n3J17j08J31q0
1317A57J6r0J24l4k1J06j27P6N4Mj11K3n9r%k9J22P3j17n9L3P7p4k9Q5oj2K5n5j6N3j35j6
1007B9j9KP9O2RP0r3j13J40l5J7p1Jm5N3l0J14J0q1N%M1m0j5p8J10j3k2kJ01l9r1N3K0J6l0
669A15j13K7P8O7o9pM2q2L3Lp1J06J05p1O3j68J22J9K0q4j28JR2O9k4M3j47O9k6J82r6m9j8
359A03M7l3O1L6j65mJ36J2J35l0k02mM7R2j02K16l0r0J4j40J49j1k8m4n5ol1J28K34j24q7
68B24oN4j43q0M8M3j5Q7o4J10j53Q2J77k02OM4j6J8pj40J0J64m0k6m8P8K0j10j9o0Q7J27r
-242B41n3r6L5p9K93j97rn0L2j8P0j17N5k3J2j1
$$ y = [48, 135, 141, 59, 156, 249, 177, 132, 56, 134, 86, 117, 242, 240, 37, 105, 112, 183, 96, 161, 138, 211, 120, 109, 184, 107, 153, 163, 175, 78, 146, 215, 153, 169, 256, 181, 55, 102, 194, 194, 296, 244, 272, 195, 162, 21, 136, 173, 184, 50, 57, 51, 135, 171, 316, 140, 161, 305, 213, 110, 116, 228, 219, 150, 97, 214, 106, 237, 157, 173, 83, 207, 173, 152, 258, 131, 207, 261, 265, 154, 177, 118, 109, 109, 80, 202, 275, 158, 99, 132, 209, 135, 106, 191, 185, 173, 198, 143, 127, 180, 45, 29, 10, 12, 91, 153, 162, 232, 139, 26, 166, 131, 148, 77, 78, 33, 86, 56, 170, 180, 99, 104, 104, 145, 105, 90, 12, 122, 109, 87, 85, 186, 147, 56, 109, 129, 145, 115, 2, 29, 107, 174, 105, 98, 140, 58, 91, 94, 23, 129, 234, 163, 226, 58, 180, 199, 219, 135, 7, 8, 100, 169, 145, 188, 41, 110, 84, 266, 170, 121, 103, 150, 117, 178, 214, 49, 45, 181, 193, 328, 298, 96, 92, 139, 231, 129, 345, 315, 225, 239, 99, 248, 237, 209, 165, 110, 104, 73, 201, 435, 311, 224, 218, 272, 129, 49, 97, 140, 125, 212, 148, 258, 105, 187, 364, 162, 168, 212, 196, 214, 207, 67, 77, 241, 201, 175, 127, 205, 225, 115, 96, 36, 123, 250, 241, 188, 92, 127, 48, 341, 144, 135, 85, 117, 99, 169, 52, 107, 84, 96, 85]
-392H5
##PAGE=	F1=9374.83
##FIRST=	19140.455529915001534,	4405.895418600002813,	0.50881034135818481445
##DATA TABLE=	(F2++(Y..Y)), PROFILE
4406B4M1k3JL1O5j1l5P7r5m0J63K0p5j9Q3j16P8j48L01j12p5j2K07J5k48P2j3m5K2o2J30M
4105B05k3L1j00qR3k4q4J98r3j41M0q4M3R3J00k00O2o3k5J0M8N0L8l7m1rn3R3J5O5L7j83R8
3796A51m7j9j3mJ0L0m0Q7j09J96qNo1q9J41J42n6j67kJ24Kj65J08k2O7j00J57j02p4R2J2j69
3495G7K18j18q8N2j19J51o9M6m9J67L4k62J43l3m6J2J30j51j6J3p4J06O1n9o3J09k9q8O8J39
3213B62p0K23j36k07lJ31lJ8rL1N5j44m9K8K4q7PLk6mJ54K9r5k4J00J3M2k41J93m4l6p6N9
2903A18R4o4o4P7L3N5r2ml1o5O7M1q3M6Q0j6j56J37K3j03O6Or0P9J04o6j47P1Q8j4n5QjNR
2575A56n4l9P5L0N0m9m4O1n0oP2j04l4J10l3j3J48j50J0R2l6l4p4k7KK0P3j9l8R1R8p6j3l0
2256A65rp1P5l3K8p9k8J12k5Kl9K4L6N0P6j24o7N8j00J7j7J87N4n8r3J29k46P2J52J14j32
$$ y = [24, 65, 42, 43, 74, 139, 128, 93, 170, 75, 35, 198, 218, 143, 124, 207, 91, 169, 21, 322, 210, 135, 123, 330, 345, 97, 169, 156, 111, 133, 71, 201, 205, 182, 213, 113, 105, 198, 174, 90, 288, 195, 54, 94, 10, 53, 146, 246, 46, 108, 45, 20, 30, 78, 128, 166, 129, 88, 79, 26, 119, 134, 199, 236, 53, 151, 104, 85, 72, 68, 78, 108, 68, 155, 46, 242, 234, 239, 178, 89, 230, 372, 316, 149, 147, 271, 273, 108, 216, 194, 261, 161, 318, 216, 142, 234, 246, 77, 295, 177, 89, 141, 22, 173, 104, 150, 101, 268, 302, 40, 183, 150, 104, 116, 246, 95, 79, 92, 18, 124, 185, 126, 63, 172, 143, 55, 123, 262, 192, 415, 279, 72, 69, 200, 197, 215, 206, 237, 292, 148, 99, 127, 151, 64, 71, 74, 48, 44, 198, 227, 132, 108, 208, 221, 263, 22, 215, 171, 135, 59, 118, 212, 148, 84, 161, 194, 249, 157, 153, 122, 57, 124, 165, 82, 128, 208, 192, 36, 173, 196, 93, 159, 165, 75, 154, 258, 192, 45, 116, 204, 190, 135, 143, 142, 147, 156, 102, 63, 138, 168, 218, 169, 125, 186, 136, 130, 202, 98, 64, 174, 141, 128, 276, 126, 136, 228, 192, 158, 84, 57, 59, 79, 152, 133, 95, 186, 284, 208, 195, 165, 156, 85, 160, 127, 155, 76, 48, 160, 135, 137, 98, 122, 158, 208, 284, 160, 93, 151, 51, 68, 51, 238, 292, 234, 141, 270, 24, 96, 248, 362, 230]
1964B30j57N8Mr8Q3R2n9k3o4O1k7mR6k6j40R2j6P3q8O0k5J25j14m4O6j8m6P7L0j23K1J02l6
1655A62K5N6n5j53R4J26m1K7n4L5l1m9j22J01M2K8j24J3k4O3M0J42j90M7J03p2j16L8J19L4
1373B64p9o5O4q5R3o3M6q4J26k0m4J16j24N8M8J4j84R9o0om8M5Q3P4j36n0P1N6o8l7O9m4K7
1063A56Q3p0n9P6p8j2l1l1M8P1k1M5p5m5Q5n9L4J7k3p3J7R3O1p8j9qK5Mr0P5r6J04k0l2LJ36
725B13o6q7O4j0J4j9n0%N9O9j05M6l3Pk9Jo1J53J12j59J40j86J14Kj1p6p9LR7OJ2N8j74N8
406H3qJ72j19n0M2N4p2K3P4j43oJ56mJ15n6j92MJ4P9n8K03m5l5lj61J50Nqp0j7j8l5Q6K93
86D53j28q0RN3j98q1M8L1J4N8l4J34k16P6J97j45o6M4rM1j3j04L9J65o5m2n4O2L9j14Ml5P6
-223A59R7pm9j21Q2j57L08j42q0k3R8l1N5j30O5l6J2l0
$$ y = [230, 73, 131, 135, 37, 120, 212, 153, 130, 66, 127, 100, 96, 192, 166, 26, 118, 102, 175, 87, 147, 122, 247, 133, 89, 155, 137, 91, 168, 198, 75, 96, 198, 162, 187, 243, 188, 35, 129, 255, 214, 241, 187, 222, 191, 142, 20, 121, 163, 191, 67, 80, 56, 119, 159, 301, 111, 158, 261, 189, 73, 111, 230, 264, 185, 120, 184, 99, 192, 129, 175, 91, 217, 197, 153, 269, 145, 203, 251, 265, 81, 180, 120, 114, 66, 111, 194, 268, 132, 82, 153, 209, 141, 104, 173, 129, 156, 239, 169, 110, 186, 108, 96, 65, 34, 82, 153, 132, 177, 102, 57, 142, 83, 117, 134, 111, 38, 55, 148, 209, 131, 112, 104, 129, 133, 43, 118, 22, 126, 106, 74, 77, 213, 147, 60, 124, 114, 128, 109, 59, 59, 118, 187, 82, 128, 95, 102, 73, 74, 13, 166, 278, 119, 259, 73, 187, 189, 178, 102, 23, 26, 123, 129, 141, 199, 25, 83, 75, 247, 128, 78, 120, 174, 102, 125, 199, 56, 50, 206, 202, 317, 261, 69, 73, 87, 166, 108, 311, 266, 231, 228, 67, 217, 222, 214, 144, 127, 109, 74, 160, 453, 325, 245, 254, 307, 109, 28, 76, 107, 121, 179, 145, 279, 63, 139, 336, 191, 125, 169, 160, 201, 188, 84, 123, 288, 223, 181, 127, 189, 228, 114, 118, 83, 159, 256, 249, 200, 79, 161, 4, 312, 170, 90, 67, 165, 134, 189, 59, 124, 88, 100, 70]
-392G0
##PAGE=	F1=9296.08
##FIRST=	19140.455529915001534,	4405.895418600002813,	0.63989865779876708984
##DATA TABLE=	(F2++(Y..Y)), PROFILE
4406D4L3j7m8L2J8L2l7J32p5q5J34J2J1nN8j38O5j01K77j82j8j1K06l1j89J27p5p0K6q4J23
4115A64k4M1N9j39QP3j5q0J93j36j13N3k9k4R0M6j33NJ8L0p1J0J19L2l4p6Rj4kJ06L1qj64
3805B5P1o5j4J9R7j3j2m0R9j09K61m6j3p4p3J20R4m5j45J3P0L5j30J22n6N5n3J45j23j09J01
3514B07O1k10K28j22j06N4l9J64r0J0r3J83O3k70J32j1k7o2J63j43k2N1o1Q0O0m1j22J44J1
3242A92j48Q4J73LK97k67j88j02J32O4j6m4M5P3j21q3O8k9p5LJ8ql5J95Lj28l1O8JQ3k04J61
2941A84Pj0o9RO5o3n0O8L1M8n9ol6m7O6M7m6q2J01L4j25P6J5q1J40n3j39J20J45m3k03J10
2641A54O5j2n3KK4j5qk6q2L3J08M9p8m9K8k0L0P0j14l4R1J2MR0j18L4R0m7m6j04k8m4L6R3
2321A35Ol8O2J12n7k1o7J1m2Q5l1K6j08l4J01k1kk2QL2K3J07r8q2R3r3n5JJ70Q0p1r6J45k21
$$ y = [44, 77, 60, 12, 44, 62, 94, 57, 189, 114, 29, 163, 175, 186, 181, 239, 101, 166, 65, 342, 160, 142, 131, 337, 306, 117, 244, 169, 99, 125, 41, 164, 140, 181, 240, 101, 109, 182, 167, 87, 280, 144, 31, 84, 55, 31, 121, 167, 34, 39, 57, 87, 16, 26, 145, 177, 143, 67, 76, 62, 60, 166, 197, 189, 25, 96, 31, 17, 36, 133, 120, 108, 68, 167, 58, 319, 273, 260, 186, 113, 233, 327, 282, 137, 150, 220, 255, 125, 247, 191, 246, 193, 338, 215, 106, 207, 268, 58, 286, 164, 58, 112, 73, 237, 147, 157, 64, 247, 310, 40, 172, 161, 134, 72, 235, 92, 70, 121, 60, 140, 200, 159, 37, 181, 192, 44, 128, 301, 304, 601, 334, 146, 44, 176, 240, 224, 180, 225, 298, 177, 94, 162, 133, 58, 61, 79, 71, 36, 231, 234, 106, 75, 143, 144, 227, 23, 184, 191, 181, 112, 121, 186, 123, 73, 141, 172, 220, 161, 155, 119, 72, 138, 185, 139, 57, 158, 192, 67, 143, 158, 77, 217, 164, 25, 145, 290, 247, 44, 154, 219, 207, 154, 156, 180, 165, 157, 131, 49, 82, 190, 239, 161, 112, 140, 120, 150, 220, 106, 72, 163, 175, 179, 269, 151, 185, 275, 228, 182, 78, 50, 6, 42, 135, 141, 103, 165, 277, 220, 199, 132, 143, 101, 186, 155, 181, 73, 39, 140, 119, 117, 95, 103, 135, 158, 265, 167, 85, 178, 85, 30, 31, 201, 281, 210, 114, 259, 38]
2002C8J3J93Q2j06j22N7l3j06O2Q5m0Nm6N6kn9N6m9j6O8m9Q2q2L4j5J61j06o3K5K9j11J10
1702A51O4j58J9J09k1L7J4l6j31J27J15o0m0o1L5J1o7q4P4M4M4r7J6m4N5L5J29j97O0O8k9
1410A82j45P8J13O8r5q2M5p1M4m2N9n8J15lo5J16j05M0K5L1k44J72n6Rr4R6L6Q1j15m6P5M4
1110B08o4o2O8p2P6J09p4q4R1m3J0k8n1jN4l7J5k9j3M6m3M6O8m6p0n0K04J2j55M0j9M2k5q1
791D2J26j13O6j8l8%J50q4o2M1k8M4k6Jl9Q2M3j11P3r4R0m9j3k4J36J09k41K10j84J13j1n6
490A35n9k4nR6o6O5N1j06Jk9J63j28l9P5M5r1j2J02r7k3J54mJ07r4j49j2k1O2j7J96p8K9l5
180A92j56J42OJ7q3Ok1j3L2L17j18o8J7M9k24q0M8L0K0K0J8J31k18J4K02o5j45N8j9Q1k5p3
-120I2N9J64q3n2n7M5N0j09L5qM4P8ql9j53J41j58K25r1j13PJ29l1L6j35O8m7J2n3
$$ y = [38, 51, 244, 326, 220, 98, 155, 122, 16, 78, 163, 123, 128, 82, 138, 136, 77, 133, 84, 68, 136, 87, 169, 87, 121, 106, 267, 161, 98, 123, 152, 41, 151, 215, 57, 76, 185, 164, 201, 215, 179, 48, 175, 290, 230, 190, 129, 164, 175, 108, 24, 98, 142, 186, 89, 105, 61, 116, 151, 280, 83, 143, 211, 182, 37, 115, 228, 296, 201, 119, 164, 93, 137, 95, 154, 96, 211, 208, 143, 259, 154, 194, 219, 250, 6, 178, 122, 131, 37, 133, 169, 250, 135, 89, 164, 208, 144, 82, 150, 78, 154, 263, 189, 105, 196, 153, 163, 135, 84, 83, 137, 100, 115, 86, 73, 119, 76, 122, 190, 144, 74, 24, 228, 240, 85, 125, 106, 148, 123, 42, 168, 55, 121, 103, 65, 65, 215, 131, 69, 110, 82, 126, 100, 101, 62, 144, 187, 76, 149, 55, 145, 96, 83, 59, 195, 304, 63, 273, 89, 202, 191, 135, 76, 52, 47, 143, 77, 142, 193, 87, 88, 59, 222, 94, 55, 130, 175, 84, 72, 174, 77, 54, 208, 204, 311, 217, 68, 56, 35, 97, 80, 276, 198, 227, 192, 36, 178, 184, 201, 118, 124, 103, 90, 122, 439, 321, 253, 270, 319, 95, 15, 63, 93, 113, 133, 151, 282, 64, 78, 280, 215, 70, 128, 109, 190, 165, 92, 151, 315, 232, 180, 123, 168, 218, 109, 144, 136, 180, 258, 250, 211, 58, 199, 41, 266, 175, 62, 69, 198, 167, 203, 68, 136, 89, 101, 48]
-392D8
##PAGE=	F1=9217.32
##FIRST=	19140.455529915001534,	4405.895418600002813,	0.63833004236221313477
##DATA TABLE=	(F2++(Y..Y)), PROFILE
4406E9J9mn5R6j00O2o7J83l7j17O4%J09J1K2j43M3l3K26k16M4k8J76n5p9J12j24p0L3q5Q6
4115A32o2J13P6j70K4N8rq4J85j60q5M1L9m1L6JJ4p9Q5L2j38L5J19J7l5j02J5M4p3J56Pm3
3814A48j23J03q3lR8M4l5n9k8J09q2K86o2m5q4m7R7K9k1j19K7J2O2r6J30p9L2PJ14j28j47
3523E7J12J16k20J95j10j16O1J7J69r8j8j35J82Q7k46R2J1qj12J87j30j7O7j0J3Q0l0j86J71
3251A81O1j91N1K13J10M00m25j98j69Q8J41l9o5M2P8r1r8J38n2j05k6L4Ml0K41m8j70lN5m9
2969G8R4j20P5O6L2n9j4P3q8o3M6L5J4k7jk1k9N8M2rj50P1P9o6KMpJ46j08j30J20J81k8k20
2650G6J09N1mo5j4L2j9j1j4n4nJ26L2j00m5j8J9O1P8j29j1N6O4MK5q2O7O5n2o3j14rJ5n3R9
2321A17L1l7L0J14n1Nj15L1j2R1l4K5j15m2Q2lm2jK2L6j9J09p2m3R2r2r9O0R3R1p9r7J54j62
$$ y = [59, 78, 74, 19, 115, 15, 77, 10, 193, 156, 39, 103, 103, 212, 223, 245, 102, 145, 112, 338, 122, 166, 138, 314, 259, 180, 292, 168, 98, 131, 46, 132, 70, 183, 259, 89, 113, 171, 162, 78, 263, 103, 18, 59, 98, 57, 93, 94, 108, 29, 114, 146, 8, 43, 162, 179, 144, 42, 57, 101, 28, 184, 191, 148, 25, 128, 45, 42, 140, 184, 149, 90, 62, 171, 89, 375, 313, 268, 184, 137, 234, 263, 242, 123, 150, 162, 224, 128, 258, 179, 211, 218, 332, 204, 57, 169, 285, 65, 260, 150, 34, 95, 112, 281, 183, 165, 30, 212, 299, 53, 145, 156, 148, 36, 223, 93, 76, 143, 133, 146, 226, 196, 10, 181, 242, 51, 102, 315, 425, 825, 400, 202, 33, 121, 262, 223, 158, 200, 278, 187, 89, 227, 175, 70, 44, 78, 82, 52, 293, 245, 75, 72, 127, 78, 172, 52, 127, 193, 225, 166, 152, 225, 137, 74, 120, 155, 169, 142, 141, 120, 91, 149, 191, 182, 32, 103, 182, 116, 118, 122, 115, 261, 153, 23, 143, 324, 296, 76, 185, 236, 232, 167, 153, 185, 166, 155, 141, 87, 82, 208, 240, 140, 95, 77, 96, 157, 235, 106, 95, 151, 215, 219, 244, 162, 229, 294, 242, 179, 65, 56, 71, 18, 117, 148, 111, 141, 255, 204, 209, 94, 125, 113, 204, 170, 195, 80, 38, 120, 117, 75, 74, 96, 132, 113, 222, 150, 107, 199, 107, 8, 68, 161, 252, 173, 76, 230, 68]
2002F8kJ47O7o6q8Q0n8j40L2P0j6L0k5O4J3j10J3m6Q4L9r2J10o8j8LJ79q6o1k6O0r0N2R3j86
1683B6R0O5k2N0l3j8p9J43P6o3p5p4L8K8p5m8M0M0N2n3K9o6M9L7J10k01N8M4L0j72R7R8Q7
1373C08j09r7N3p2jk5N7j8R0J7o8J07q8K8j2N1j46R4m0K6j31J13rR7o3m7N3M2n9j07R0o3R2
1063A63J06o9p9Q2l0K4ko4l5Rk0l6L2kM4j6L4Q2n8o6q0K60k4k12Q3j6M6n2kJ14j30K5j4l7
744F0j3J50p1n7Kj7Q2n5L6p6J30Kp1N6j02J17l0qk3R7R3k98K61j73J29j4r5k7j0pQ3j28J25
434A48L0k9l6p9J69j37oP0K8q7m5J32m9l7J12K2J10j47p5n5j8L8RK03j38Q4o9j37J27pM8p7
133A02%j2J7lK88r9m4K1L3k24p0N2M0jj7Q2J05j82m8J80J8k09J17p0J00m5n0P4J64q9o3n2
-167A15K1N9r7O7J4JP1j3j7j66J78j54J31n5j02J9J36k2K3j31N8m6Qo8
$$ y = [68, 66, 213, 280, 214, 126, 206, 148, 8, 40, 110, 94, 124, 99, 163, 176, 66, 79, 33, 117, 156, 64, 174, 106, 88, 91, 270, 184, 123, 97, 157, 67, 119, 212, 26, 116, 181, 159, 209, 176, 158, 79, 222, 298, 235, 160, 86, 124, 152, 77, 29, 69, 109, 161, 108, 137, 71, 120, 157, 267, 66, 124, 168, 198, 26, 123, 221, 308, 199, 102, 155, 83, 82, 57, 114, 96, 186, 203, 135, 242, 154, 182, 170, 221, 75, 169, 129, 155, 24, 137, 128, 225, 162, 115, 168, 210, 151, 44, 134, 71, 163, 269, 200, 121, 203, 173, 197, 195, 131, 96, 105, 85, 49, 81, 79, 123, 107, 141, 223, 165, 99, 19, 279, 255, 43, 126, 110, 156, 104, 102, 216, 86, 111, 97, 60, 47, 197, 126, 69, 71, 54, 136, 81, 117, 41, 171, 173, 102, 158, 56, 173, 143, 135, 112, 209, 302, 4, 265, 92, 221, 207, 112, 85, 75, 68, 151, 23, 148, 178, 149, 113, 34, 203, 66, 60, 130, 158, 71, 26, 158, 109, 72, 184, 206, 316, 169, 94, 39, 21, 59, 68, 271, 133, 217, 148, 11, 138, 131, 179, 102, 102, 90, 107, 104, 392, 293, 249, 270, 303, 79, 9, 61, 101, 100, 83, 165, 270, 88, 40, 220, 238, 29, 146, 76, 176, 131, 81, 155, 319, 230, 167, 115, 136, 195, 98, 165, 179, 180, 251, 238, 221, 55, 233, 79, 210, 155, 53, 72, 208, 186, 209, 78, 136, 90, 98, 30]
-392C0
##PAGE=	F1=9138.57
##FIRST=	19140.455529915001534,	4405.895418600002813,	0.51630568504333496094
##DATA TABLE=	(F2++(Y..Y)), PROFILE
4406F6LJ4l5J41j09Jm2J45Oj23j4RJ62J8j6j30K3L3J61k05Q2n8J38n0J1Q3j61m5L9q9N3p4
4105C7J53P9j71K7M0rr2J77j60m0j2J06l3k8K7O5q1Q5J9j76P5Q4pl7j09PQ7m8J19nn7q1J54
3796A95p6l4J38j3n0r3j7J16m7K76n6q0q6k2Q5n1J3q9L7m3Q3o8J33q4mO7P0j15j68J05J67
3504B89k01J36q5j24Q4L2J67r2l1j36J29J02k00K6L6J1r1J59j24OO4N1p0J25k6j67J16J01
3242B87j88m7K70K51O03o14k95k08j9K16m0o5J5P3o3r7J90l6j27q0M4LPK60j01j91N4N7r3
2969F6O3o0rJ13Q4m6k0Q9j08q7M0M5o4NJ2lj2N5K4K1j19k9J10rm9j1O9J15j49j08J20K03j7
2659C34k26R6M0J2p9m1K4ppj9kNQ7Oj14l1n4M1Q6R2j50L1J4J07nl3m5Q7L0n1p9j02K4O6q7
2331E0M4N2l5NJ16n8M0j61N3PR7m2K3q8n3M8M0p7MN3K8n3O5m0K2O4r1j04P5M0Q5o9j07J54
$$ y = [66, 69, 83, 48, 189, 80, 81, 39, 184, 190, 67, 53, 62, 224, 242, 226, 96, 119, 152, 313, 108, 190, 132, 270, 220, 231, 314, 153, 108, 147, 58, 111, 37, 190, 269, 98, 125, 165, 156, 64, 241, 81, 41, 29, 135, 102, 74, 101, 166, 85, 170, 189, 13, 88, 172, 165, 128, 19, 26, 113, 65, 184, 179, 122, 41, 195, 119, 85, 223, 210, 160, 67, 50, 166, 119, 395, 339, 259, 173, 151, 236, 185, 198, 109, 146, 103, 186, 118, 251, 167, 163, 230, 300, 185, 17, 122, 289, 88, 224, 139, 15, 99, 131, 298, 206, 175, 39, 168, 270, 70, 96, 132, 143, 52, 211, 87, 93, 157, 208, 138, 263, 237, 70, 186, 287, 99, 52, 322, 573, 1176, 562, 267, 59, 40, 256, 216, 151, 166, 239, 176, 79, 269, 233, 106, 26, 70, 73, 80, 340, 239, 48, 102, 159, 66, 129, 69, 60, 173, 257, 211, 191, 280, 172, 85, 125, 170, 106, 111, 123, 120, 108, 163, 187, 208, 89, 60, 170, 161, 112, 101, 170, 285, 136, 28, 148, 351, 334, 108, 204, 244, 256, 177, 136, 160, 153, 146, 127, 125, 130, 217, 223, 109, 78, 24, 65, 151, 243, 93, 124, 138, 245, 240, 207, 162, 249, 279, 228, 149, 47, 71, 137, 50, 94, 146, 111, 116, 232, 174, 214, 53, 106, 113, 210, 168, 191, 103, 50, 98, 138, 61, 65, 118, 146, 93, 158, 118, 140, 204, 113, 9, 84, 124, 209, 140, 33, 187]
2011A87q7M1J5O9j5n8J09n6j70%L4NM7nP3K0j48mK5Q2J3j42J58n3q5K3J81o4n0o2O8m4j8R9
1692A88j76J55J0k4N3p5kk0J49K5m7p3j02N5J2o1l4NL1M8LN2q7M3N5Q4k06M8L0Q4j87R5Q0
1382B11Q6j04r0M3o9k2l5M5L2M9L5m5R7r2K7n9P3m8J9j5L7j44R6l5J06j5m6L3M7m5j38J00
1082A34k8O5Q9o0n0N3l6L0L9p0n7m4L6q5P1QN9j2PP4n4n5o7K46m2k42J02LM2q2P6R9j37j4
763I8j4k9k9J48k4j01l5M0Q0q5O2q6J61k9j2Po3R0NOk2M2O2k24J90j58J53j0j03jk9oN8r3
443D9J07QM4o6j37J83j46L7M3J4o7n8J59k7l2K8P4J19k10Jj04L4K5J0K17j85Q9q4r1P2k9P8
143A55m8l4PL2%K08p8j0L1Rk18m5N7M6k3m0J34O5j50k1J07P6j86J47r8K9p3j7P4J69q1p7l5
-167A12k2O8q3J05L0m8P0j9J7j39J66j49M2m0o4K6J27j6K1j12L1l5km9
$$ y = [187, 100, 141, 156, 225, 210, 152, 261, 205, 35, 35, 69, 74, 121, 116, 189, 209, 61, 57, 82, 164, 177, 35, 193, 140, 55, 78, 259, 195, 145, 83, 151, 107, 89, 188, 12, 167, 177, 153, 206, 131, 129, 109, 258, 283, 236, 163, 61, 116, 128, 67, 33, 38, 69, 117, 120, 172, 85, 128, 183, 267, 61, 109, 139, 223, 36, 131, 211, 297, 193, 103, 146, 77, 55, 20, 65, 97, 146, 181, 136, 233, 141, 168, 109, 182, 134, 153, 138, 175, 31, 127, 92, 198, 183, 137, 170, 217, 172, 34, 134, 106, 171, 260, 200, 150, 203, 167, 197, 236, 166, 109, 65, 101, 16, 87, 95, 154, 142, 149, 223, 169, 114, 47, 293, 251, 9, 111, 114, 156, 74, 150, 249, 112, 98, 84, 55, 26, 174, 150, 49, 14, 54, 134, 49, 111, 25, 186, 157, 145, 152, 89, 179, 184, 190, 168, 210, 272, 48, 238, 80, 233, 223, 120, 119, 90, 84, 142, 49, 156, 164, 208, 142, 5, 188, 42, 79, 122, 136, 69, 11, 170, 143, 111, 139, 213, 332, 122, 123, 19, 53, 78, 88, 305, 120, 209, 125, 34, 106, 77, 155, 107, 73, 80, 112, 112, 320, 242, 232, 263, 272, 54, 9, 66, 112, 89, 49, 183, 248, 98, 77, 184, 260, 74, 221, 123, 152, 79, 62, 136, 305, 224, 147, 112, 90, 158, 75, 180, 210, 162, 232, 213, 230, 91, 257, 108, 150, 110, 46, 72, 199, 183, 204, 92, 123, 88, 86, 37]
-392C7
##PAGE=	F1=9059.81
##FIRST=	19140.455529915001534,	4405.895418600002813,	0.35179269313812255859
##DATA TABLE=	(F2++(Y..Y)), PROFILE
4406F6j3L1j0J68j14k2k2Q6M2j12PL6Q7Om8j10K5Q0R2j66R6r5J03j4O0N3j88PL4j04L3j3J13
4096A94P8j44J2K5k4q9J65j40Mn2J34k1p1Q1M3p6R1lj79R1N5l8l7q1oQ9JO8pn3n2J93p2p2
3777A07J64o6n7p9k5J11j4K34l7j02q1mQ4j26M3n0L0p3R0n3J36p3m4J08K7r0j10J8K06j67
3495A07Q4n7j22J06J1J55p2k3j17N1J10j44o1Q7J2m3J14j27M1N5J10j65J87k1j42O9J13j45
3232A73q1K69M10R22q51m72k56m2J58k5l8l9O5l4r1K03kj19j40N6mN8K33j42j62R6N9j21M3
2960A26m4lN6J33l0j7R2j02j12N4N8j46K4K6kPN9PK9p4r0J16K8o9k8J15P5j73j05J47K02l
2659C56k25P4K6L4q4o6LK0ol2N3K1M0k4j19rLl8J14J04j80Q6k7J30k0o3j5Q4j0m1r3m7L9J14
2340B02j05l0O6l3mJ31n2M4j90O1RJ03m4J2l2o7LR4n7k5O5J5o0k4J0P2L1q7q8O3J6O0l1r7
$$ y = [66, 53, 84, 74, 242, 128, 106, 84, 170, 212, 100, 107, 143, 230, 236, 188, 78, 103, 183, 275, 109, 205, 110, 213, 199, 259, 312, 124, 131, 165, 61, 94, 81, 194, 272, 128, 140, 165, 141, 52, 217, 77, 81, 29, 163, 142, 71, 152, 195, 119, 210, 207, 28, 119, 174, 136, 99, 18, 12, 101, 102, 170, 163, 110, 58, 251, 179, 107, 271, 205, 148, 69, 44, 155, 141, 375, 338, 236, 155, 151, 235, 109, 152, 102, 132, 59, 149, 96, 232, 159, 115, 223, 250, 160, 50, 68, 274, 107, 191, 134, 12, 118, 129, 284, 212, 189, 72, 123, 233, 89, 28, 115, 127, 84, 198, 71, 112, 167, 277, 112, 299, 278, 136, 205, 318, 173, 92, 361, 771, 1693, 842, 370, 114, 72, 230, 205, 167, 128, 193, 159, 68, 271, 269, 150, 10, 66, 62, 120, 353, 211, 49, 145, 204, 83, 126, 82, 79, 135, 268, 238, 221, 313, 211, 99, 153, 211, 65, 89, 115, 113, 120, 179, 186, 215, 141, 51, 167, 195, 126, 98, 213, 288, 115, 10, 157, 359, 356, 131, 205, 231, 265, 181, 115, 118, 138, 132, 100, 153, 174, 214, 190, 71, 62, 65, 27, 141, 245, 65, 151, 124, 254, 234, 171, 156, 240, 230, 189, 96, 49, 88, 202, 97, 67, 133, 100, 96, 227, 175, 219, 29, 90, 99, 202, 158, 170, 138, 71, 74, 168, 111, 86, 151, 166, 106, 82, 92, 164, 195, 108, 20, 83, 99, 159, 128, 31]
2021C1J03j3Q8j25Q5L0k9J25l7j95kMPM6J1P1K5j68J0O4P3j3j67J93l3j32J2J74m2l6p3M6
1720A33lm7O6r8J49l7j5L8j03J1L5J45j9j9n5j43Q1ql8m3%J2K1O1P8j05M3P7N7k09L8J9J23
1410B45k09J01N9P2p4n5j1l7ko6K7N7oM9j0R4j22M3j11R3L2l8J1L9j27O2k1P8Nl7L3N8k6j19
1091H7N9oL2O7m5j1J4n8L1Q4p4o6q3J03n8L4J4O7k1l2N5m0l4m5J97l6k17O3L8L2j15J41Q6
781B63j36m6k0j4m0J55K4j75M8J4L6j00Q5l0J18j8K5n7j2M2M5K3qj8K4j43J08j37J75mq7R
481A49m8qK8j7N8pJ02q7j50J54j52P0J6J6m7l7J67m0qp5J42J20k65O5j38O8K6J1K30j78M2
190B07o7q1K9n5R6j0n5K7J2K6J05n9K8N2rk17j9O3L9k2k1J29J8j30K9O2R9j45J77j03q3r5
-111B7M6L3J72o2r3Jr2P7o8J56L6r4O2k4N8r4J25j37k1n5k4N4R8k3L1q1nk3j3q
$$ y = [31, 134, 121, 209, 84, 169, 199, 170, 295, 258, 63, 61, 65, 72, 118, 129, 200, 225, 57, 67, 131, 204, 191, 24, 217, 184, 52, 64, 238, 196, 160, 87, 133, 130, 83, 149, 51, 200, 163, 148, 186, 83, 94, 129, 274, 255, 236, 181, 38, 119, 111, 73, 30, 30, 42, 63, 124, 202, 97, 140, 217, 274, 65, 103, 122, 245, 36, 137, 196, 268, 194, 139, 128, 91, 89, 23, 50, 107, 101, 150, 140, 234, 112, 155, 44, 137, 169, 131, 142, 181, 54, 116, 95, 173, 178, 141, 174, 232, 206, 87, 146, 140, 172, 239, 194, 183, 197, 139, 170, 254, 180, 114, 31, 134, 76, 110, 124, 191, 170, 138, 193, 153, 119, 74, 271, 235, 18, 81, 119, 151, 36, 177, 263, 127, 81, 61, 47, 7, 162, 186, 11, 59, 73, 109, 9, 94, 64, 182, 164, 189, 132, 120, 162, 207, 230, 222, 204, 228, 85, 193, 56, 231, 227, 140, 149, 101, 93, 121, 104, 162, 155, 257, 170, 20, 174, 22, 92, 108, 124, 77, 40, 207, 167, 159, 84, 226, 346, 81, 146, 8, 76, 102, 113, 343, 165, 207, 140, 59, 88, 33, 129, 119, 64, 91, 103, 129, 234, 175, 203, 255, 246, 29, 10, 73, 112, 90, 69, 198, 216, 86, 115, 177, 276, 131, 308, 205, 122, 27, 73, 106, 278, 216, 123, 124, 32, 109, 41, 197, 233, 139, 201, 177, 235, 141, 266, 129, 108, 53, 29, 83, 181, 158, 189, 108, 103, 80, 67, 59]
-392E9
##PAGE=	F1=8981.06
##FIRST=	19140.455529915001534,	4405.895418600002813,	0.24284827709197998047
##DATA TABLE=	(F2++(Y..Y)), PROFILE
4406F2k6L9J9J72j10j3k3L6O6r5N7N1mj7o9r7O2R5K5j17R4j30P5M4O7K4j98P5J5j24K1M3P1
4096A90Q3j14pJ6n5n9J34j12L9o7J31j0r3J07Ro3R8k6j47Q3K9o7l5k2J1J8N8K9j2m1k5K06
3796B86o5j14J73j14n0k4k7P5J5J68j4j06p3NR1j46K8mMm9O2n3J43n3p1J17no7m6l9J93j33
3495A07O4l7j00J06k4J29m5Nj01j1J05r1n2R8l4j4Q4j36P4N7J52k69K52oj17L6R5p2n1K39
3213D43N62J290j118o74l15nK3j0Rr8M9Qr4J69L6q7j79O8OQ3J67j67r5J17O4j60N2n0O8p8
2932H4J74j5j0Q5p5j34O5Q0j53nK3k3K7P2lJ7k4j23J13L8o7m2J27L7j79n1J31J76J5k17M6
2641A89JO2p8p0k8N2j2k2Q6K5mm9j15J2N7r1J21J06k10J37n8J28l8n4KO0n0k2j04M6K6J53
2340B58j12r7O6l6OJ60j3Pj85L0qJ07l4j4M4q0m7J39k8n4O8J1n1j26Q1Q3Np5o9N3LK1J7n7
$$ y = [62, 36, 75, 94, 266, 156, 143, 120, 156, 222, 127, 184, 235, 231, 214, 145, 48, 110, 205, 230, 113, 207, 77, 152, 196, 263, 287, 89, 164, 179, 55, 76, 119, 190, 273, 159, 152, 168, 113, 54, 188, 76, 115, 48, 179, 169, 76, 183, 192, 129, 227, 201, 54, 137, 166, 99, 64, 42, 53, 71, 129, 158, 146, 105, 80, 286, 221, 107, 280, 166, 116, 92, 65, 140, 155, 323, 309, 203, 130, 135, 226, 80, 108, 104, 108, 59, 121, 68, 211, 158, 87, 204, 199, 132, 86, 47, 240, 107, 171, 134, 34, 140, 116, 245, 200, 205, 104, 93, 198, 107, 55, 153, 119, 105, 189, 53, 127, 184, 336, 67, 319, 313, 196, 232, 327, 255, 204, 443, 1005, 2295, 1177, 503, 188, 183, 206, 196, 205, 107, 156, 164, 70, 239, 275, 188, 9, 77, 83, 166, 333, 166, 71, 188, 252, 92, 144, 94, 162, 84, 258, 243, 233, 318, 243, 109, 174, 254, 101, 96, 119, 96, 123, 195, 192, 209, 185, 62, 175, 213, 146, 104, 231, 268, 89, 38, 169, 345, 360, 143, 189, 190, 252, 174, 104, 76, 128, 116, 94, 180, 205, 201, 152, 37, 49, 106, 15, 136, 242, 32, 169, 111, 239, 201, 147, 149, 209, 159, 137, 33, 79, 105, 258, 146, 49, 115, 79, 85, 245, 232, 239, 54, 84, 76, 183, 149, 135, 179, 99, 52, 191, 163, 109, 177, 188, 137, 11, 92, 175, 180, 105, 36, 89, 92, 113, 130, 73]
2021G3NM8J26k29J09M5%J21j1k00nNrL7K1N3L2j63J9Q5P1l6j54J94j0j29n4J69j4k4o9nL3
1711A34k8%k5J26p4J2Mj04J1Q0J32m3Ml9j86J09j0l0m8L6kl9J01R3j09M5R1L6k06K5J3J47
1410B56k29J18L2M8k7k4p4K5J4q5L6M3o9O5J2Q9j61P9j25P3Q6p1L5L4r9L4J4K5rk1N7P1mj06
1091A42J1OOM7k7K7k8q5L5J14p6o5p0J29m3J5J0P3k9p6K7k2oj9J25oj80J1P6K0j40J78P4j25
772A29p2k9Ok0J54M5j50O9l6%m3K7K6N2M6K1j29M9j3P6M3J5p2j0q4L5r1J66%o2J4m9k0PM8
443A48J9k2J43r8j48J18j45P4QL3m2k5J80p1L1j63J97J12l00J18j23M6K1QK34j39lm3r5J3
162H6p4Q5K4l5M0m5O0J1m6O1Q0j0j95k9O6K2J0%Q9k2j18O4N1J03j05K10j01j81j5L7m0J57
-139B40m2r8M4j15L1k8J89L1j26M4l3R7m5P0j14l0n4m2Q4O0m6M7m1m3k1k0L7
$$ y = [73, 78, 126, 252, 23, 132, 177, 177, 298, 287, 87, 82, 87, 78, 115, 136, 189, 221, 58, 77, 162, 233, 197, 43, 237, 227, 98, 44, 213, 199, 175, 106, 101, 134, 106, 106, 81, 207, 133, 145, 149, 45, 56, 136, 268, 225, 229, 190, 4, 113, 103, 73, 25, 61, 59, 20, 121, 214, 105, 150, 241, 277, 71, 96, 109, 256, 27, 145, 177, 225, 198, 174, 100, 125, 139, 54, 90, 133, 64, 129, 141, 230, 69, 148, 23, 96, 182, 111, 146, 180, 81, 115, 129, 154, 145, 124, 181, 252, 248, 142, 153, 159, 165, 212, 185, 212, 184, 99, 134, 248, 172, 107, 37, 166, 123, 138, 148, 221, 192, 116, 143, 121, 115, 96, 221, 215, 35, 46, 122, 142, 2, 180, 254, 129, 57, 28, 34, 14, 168, 213, 63, 132, 96, 96, 53, 80, 106, 158, 204, 225, 96, 145, 132, 208, 251, 266, 194, 184, 100, 135, 44, 210, 210, 148, 162, 113, 93, 100, 148, 167, 145, 288, 190, 42, 160, 15, 89, 97, 130, 88, 63, 243, 172, 203, 40, 237, 349, 49, 167, 44, 90, 111, 119, 353, 214, 211, 168, 73, 86, 12, 97, 121, 86, 126, 81, 141, 152, 106, 167, 247, 237, 42, 13, 79, 101, 111, 111, 200, 178, 60, 124, 175, 278, 173, 383, 282, 101, 86, 123, 83, 240, 198, 100, 144, 29, 60, 32, 221, 252, 126, 170, 137, 234, 189, 259, 145, 115, 61, 19, 103, 163, 117, 164, 123, 80, 59, 39, 76]
-392G6
##PAGE=	F1=8902.3
##FIRST=	19140.455529915001534,	4405.895418600002813,	0.31007826328277587891
##DATA TABLE=	(F2++(Y..Y)), PROFILE
4406E9l7L1N2J53r3J9l4oP9p8R4O2p6l9o3r9J07Q4k6p1P4j51N1J11M8rj85J40j2j43QQ5L6
4096A71J05r4k2J4j05J2P3p9N7p8J30pr9J08k4l8R3m6q6O8Kr0l1L4K3n8J20J0k9l6RJ94n8
3786B43j55J64j53l6M6j2K9M7Q9Kr2p1OJ03p8n8M0l3NJ8o0J50l9o5R7j8o9J2j4R4j05Q0k8
3476A39p8R2m4Q1j9M9q9m3P9m8J4R2r2k1P9j44Q8Q0J67l73L02K4r6J1O3J6j7K24O87J615j353
3185A485q56l57J1o7l0P0j20MO3j13R8O9m5j83P0K7P9Q3j71k6J31P8j85M1n5J36j81J71%K
2903B29P0l6j53N8J11j19l6jn4N0R4roK3j53J20K8n5n2J11J1j71K9R1J28M0k06K2l3Q3o1m6
2603A07n3O8k4L5Q6Rm6o3q0KQ2o3Q7R7j94J21p1J01n4j4PK9q8J6o0P6MJ78j12j11K8l5K0J86
2284B71L5l4j83jl2J04j2n1J21r0q9J56%q2P6K2m1j01L6O8jn3o6O1j1j0L1j8m8N5J52k16Q7
$$ y = [59, 22, 53, 105, 258, 165, 184, 150, 144, 223, 145, 239, 301, 225, 186, 123, 24, 131, 215, 189, 118, 192, 41, 92, 203, 251, 242, 57, 197, 185, 42, 50, 135, 171, 276, 182, 160, 174, 69, 81, 154, 75, 132, 54, 184, 177, 78, 186, 162, 124, 217, 171, 85, 153, 155, 65, 34, 68, 91, 33, 153, 163, 134, 98, 107, 301, 243, 88, 252, 99, 63, 109, 97, 126, 173, 262, 264, 172, 101, 107, 210, 132, 74, 114, 81, 86, 104, 44, 194, 155, 90, 187, 169, 100, 112, 98, 192, 87, 167, 139, 61, 153, 109, 190, 171, 220, 131, 88, 167, 119, 133, 225, 133, 112, 191, 47, 135, 215, 382, 9, 311, 335, 239, 250, 313, 329, 312, 536, 1223, 2838, 1485, 629, 272, 283, 216, 186, 256, 136, 140, 203, 90, 188, 257, 212, 29, 99, 126, 205, 288, 117, 91, 222, 300, 115, 156, 101, 237, 56, 227, 227, 229, 299, 263, 110, 168, 279, 160, 124, 123, 69, 119, 213, 204, 198, 221, 68, 188, 216, 161, 109, 220, 231, 60, 89, 180, 308, 348, 142, 164, 131, 214, 153, 107, 54, 122, 98, 133, 219, 228, 182, 119, 39, 41, 123, 60, 147, 244, 50, 171, 100, 201, 147, 133, 140, 169, 81, 97, 37, 113, 117, 295, 183, 72, 100, 65, 85, 271, 306, 272, 89, 88, 56, 160, 148, 97, 218, 128, 39, 195, 195, 113, 189, 211, 170, 69, 105, 173, 172, 119, 53, 114, 103, 93, 124, 106, 58, 113, 265, 49, 136]
1974A36OL1J00J2j82j4J7k4K7K7K9M3j36K0Q8P2n4j42J88J5j03j39J76K3j8o4o7N6J7n5J5
1683A00Q8j00N4m7m3l1J10J12m5J1l4j37O0Jm4j9N8qm1O9Q7r7M9R2K3j88%J6J56k15J24mJ8
1373A75J2oj14R1K5r8M4L9j27R1JP7j78J17p7jJ05p1N6K5p9QL9j5m6KR5P8K0j08l6J6j2L0
1054A78jN4o2j03M1J19q2n3l7J34l6NJQ1l0j13j2KK1LN0L6j49j7R2J2r9J26O5j10q5k1J5J
734B6J61L1p6N7p3K5m3k0M3oJ31j0j91J06n2Q7O3L9j18k8n8j9qJ02Ml5J7k9m0OQ0km1J66r7
406A98j36R1j28L7L2M6m3k0J87j09P6j80J88R6l09J62j08J8J3j1K25q5k6k8j08J8p3M2M2M
124A11N7j10R2o3l0P4J07%j69n2O3RN4KL7m1r3N6N2J08o7K36r0k37O0J4r9J13l2q3P3p1k5
-186E6J8J72J7j43L5n4J34pPq0mk8p9P2L0p7O4Jp5l3j5P4
$$ y = [136, 142, 173, 273, 285, 103, 89, 106, 82, 109, 136, 165, 208, 72, 92, 180, 252, 198, 56, 244, 259, 156, 17, 193, 216, 198, 134, 67, 123, 140, 85, 100, 188, 88, 142, 95, 52, 21, 131, 243, 198, 209, 175, 38, 98, 99, 55, 36, 94, 86, 45, 114, 201, 104, 153, 245, 268, 80, 80, 96, 252, 37, 161, 157, 175, 187, 181, 67, 158, 183, 85, 129, 168, 41, 132, 133, 210, 32, 149, 72, 71, 176, 105, 161, 186, 107, 115, 154, 139, 93, 95, 190, 268, 288, 180, 144, 160, 148, 178, 177, 231, 169, 66, 107, 226, 144, 91, 54, 188, 152, 157, 158, 239, 209, 96, 84, 86, 107, 110, 160, 196, 47, 30, 122, 134, 35, 161, 226, 116, 31, 10, 25, 26, 187, 218, 142, 199, 126, 151, 108, 88, 131, 125, 256, 246, 55, 161, 109, 196, 259, 298, 180, 152, 94, 75, 67, 169, 173, 138, 155, 126, 86, 92, 172, 170, 129, 295, 198, 62, 153, 25, 62, 94, 140, 97, 77, 264, 155, 231, 51, 239, 335, 26, 188, 80, 98, 111, 100, 325, 240, 214, 186, 78, 96, 23, 65, 107, 111, 168, 58, 150, 87, 57, 131, 238, 238, 69, 17, 80, 89, 143, 145, 182, 141, 48, 104, 156, 264, 197, 433, 343, 106, 166, 180, 81, 194, 162, 79, 152, 81, 56, 74, 246, 263, 120, 155, 101, 235, 228, 235, 155, 151, 123, 44, 116, 146, 69, 133, 134, 59, 26, 11, 85]
-392H5
##PAGE=	F1=8823.55
##FIRST=	19140.455529915001534,	4405.895418600002813,	0.51541870832443237305
##DATA TABLE=	(F2++(Y..Y)), PROFILE
4406F0m5PQ4J19o4O0m3m5Q3o0J06O7j22l9k6q1R4N7n3l4L1j46L2J69K4n6j32J72l8j49j3J10
4105A29QJ49r0l0J3j59J09pm8N3p5J26j2r4R7m8nO7n7j1O5l2r8k2O7L2j03J52Mn4l8L9J66
3796B93m3j91J42j88kR6K0qQ5K4Jp3q3PJ16Jj23N2n8L7j5n7J45l3m4Q1rj05O5K5k2q5J18k3
3476A46o2O9l7J4KR7p8n2L7j2O9R6j33n1R8j38P1J18J57l47K12O1p7j3K9J06MK13P63J815
3195C177j488r82l61Qj00q3J31j04n8J12j34J7Q6mj60O2M3O3Nj48J9J37J05j78ko2J86j92
2932I5Q9J1K5N1lj69L2J50p0n8l7p3O4J24j2l3O4j84J28J5m4m9O8jj54J03N5O7O9j94J3n2
2631I0O7l7lp0O8l6J09Q4j4r8o0l8k2P2qO4R5j69O0o5N6o6M2RQj12P5j6N1j5J84j08q0j6j4
2303H7J4J82P4n5j90j8l8Q9Oq4J85r7j06J31K7j10Q8M4l5p2j5O3Ql2q2Q2j6j1j6J9k0j5J66
$$ y = [60, 15, 22, 106, 225, 161, 221, 178, 133, 216, 156, 262, 329, 207, 168, 142, 61, 155, 212, 159, 125, 156, 10, 42, 211, 235, 179, 47, 219, 181, 32, 19, 129, 137, 286, 196, 166, 179, 20, 129, 122, 74, 127, 52, 178, 166, 72, 169, 121, 116, 183, 126, 115, 180, 148, 50, 28, 95, 127, 24, 176, 180, 126, 88, 127, 293, 250, 59, 201, 13, 11, 107, 127, 119, 204, 228, 229, 156, 73, 80, 196, 197, 74, 126, 68, 105, 90, 33, 178, 145, 101, 182, 173, 68, 133, 158, 136, 51, 169, 146, 84, 153, 116, 130, 132, 229, 151, 99, 136, 124, 193, 289, 156, 105, 203, 65, 136, 254, 411, 64, 276, 337, 260, 247, 276, 382, 386, 599, 1362, 3177, 1689, 707, 346, 354, 254, 171, 302, 198, 140, 252, 118, 135, 221, 217, 57, 119, 162, 225, 230, 82, 101, 238, 343, 165, 163, 101, 287, 95, 184, 195, 220, 271, 268, 99, 131, 281, 211, 153, 116, 43, 107, 231, 219, 186, 250, 66, 194, 209, 165, 116, 184, 183, 29, 132, 187, 254, 323, 129, 142, 90, 157, 120, 117, 47, 115, 79, 188, 272, 258, 160, 100, 62, 40, 112, 104, 168, 263, 94, 154, 89, 145, 79, 121, 130, 138, 26, 101, 85, 136, 121, 305, 197, 117, 101, 87, 101, 283, 357, 302, 112, 94, 56, 145, 151, 67, 252, 155, 49, 180, 207, 97, 185, 229, 194, 122, 107, 170, 178, 146, 64, 146, 130, 119, 103, 122, 102, 87, 253]
1993B53j66P8o1N9O7K9j53k5L5l3J5L1K1N3j05K5P1P1o4j44J83L3o9j78J59O0j6o6j00M4O3
1702A70o7LM0j14J04j04M8n6R3Q9k9ml4n9J3Mp5M2N5j8l0L6N5o9N4Q2J8j51m3L0J51j62J16
1392A88n0j5K7Nj09J29L9j01L6N5j80J20k6N1r7Q4m8l7Q7m0P4J5p5l2N3k4o3RJ23P3M2j20
1091A93p4L0k4RL8O9q5r2L5R9r4l9rJ36k9jpR2k7j30n6L5L2K0j5P2j25nO8Rp0O7O3r2n4Pm
744D2oJ72rK1K8q8P4q4l0J4k3J89n0k06J23n3O6Q5M8j52l0o1LK7J3RqJ5Rn9J7P7no2J71q7
406A90j06P3r7m8Q3M6m1k2J84j46J18j56J50P8k96J97j00mQn0K03k4l2k1j02K9o7PK8L8Q2
115B02j47J02j09PM5J26Nj40o6N0J4Q2rj8l2l3j2O0J09l5K55p5k47J00rj42O0m1m4P9k5j2
-186A00J7J43Lj55M7p7J62J8o1m3K1pj04M4J3r9P7L7r4k6J4N5
$$ y = [253, 87, 165, 104, 163, 230, 259, 106, 81, 116, 83, 98, 129, 150, 203, 98, 123, 194, 265, 201, 57, 240, 273, 204, 26, 185, 245, 229, 163, 63, 107, 170, 103, 106, 146, 32, 136, 32, 80, 24, 117, 206, 177, 173, 139, 80, 93, 97, 22, 64, 119, 101, 71, 107, 162, 93, 147, 229, 247, 96, 53, 83, 234, 72, 188, 138, 123, 150, 155, 46, 175, 214, 113, 149, 204, 24, 144, 118, 169, 72, 156, 108, 71, 158, 118, 192, 207, 132, 100, 153, 129, 66, 75, 198, 271, 313, 193, 119, 149, 125, 134, 172, 241, 156, 64, 99, 198, 104, 65, 56, 192, 163, 162, 155, 247, 220, 90, 34, 69, 101, 121, 106, 178, 53, 48, 116, 125, 55, 122, 185, 93, 39, 46, 42, 36, 208, 199, 220, 248, 160, 234, 150, 120, 134, 111, 300, 250, 44, 167, 114, 180, 265, 313, 161, 131, 70, 73, 100, 113, 122, 114, 129, 138, 79, 96, 173, 168, 106, 277, 190, 84, 157, 60, 12, 95, 141, 100, 78, 262, 116, 234, 78, 228, 306, 10, 207, 107, 103, 111, 61, 264, 240, 208, 187, 85, 114, 47, 54, 82, 120, 202, 55, 157, 48, 55, 100, 226, 231, 91, 25, 75, 89, 171, 162, 144, 112, 79, 67, 127, 236, 201, 456, 381, 134, 234, 225, 83, 143, 102, 58, 137, 112, 100, 117, 260, 263, 108, 155, 78, 240, 258, 197, 154, 175, 168, 64, 108, 121, 22, 99, 136, 42, 16, 30, 85]
-392H5
##PAGE=	F1=8744.79
##FIRST=	19140.455529915001534,	4405.895418600002813,	0.58223742246627807617
##DATA TABLE=	(F2++(Y..Y)), PROFILE
4406F5l7qP8P6k7R5m2q1Q1l5Q6O9j46j6K0o8O3K6n1j9l0p9QJ82J6j12m2J58n8j22k0P7j9K11
4087B99r6k9Pj19J24p9l7L9l6R3k6q3Q3m7K2J3n0O1Q0p0r2j0P5L8j00J38op1m3N0J36j8k14
3777C2J07o1J2%N5j8J21rj4o9r5RJ24N0j35K4n2K8m0l4J19l0k4Q5J0j44J01N2j22m7J34j6
3476A53n2L7j1n2J7J38o7m8oJ3J06R4j54p9J24j20M2J52J29k88R4R7n9m1NJ79NJ98P73J838
3195C217j475j029l22or6j42J81p0j21J46j37o6R3L1j10L4N0L8m5r5K7J31J33j51l7q6K08
2941C01j59oK3O4K8Nj81oJ92j8o5q4m5M1J54pn8Q9k05J24J4m4k5Opj07J29L5RR8j90K7j1k6
2622I5j5M2p4O1m8J72R5l5j55m5j7l2L6O1M9J09j71om7No8R2J6J4q4Q3j9K4k5J75j06k0m1
2312A21J3%J37R7n6j94k2k9P6Pr5K24j01r8P6N4j36R7O5l2n3n9Q7J4k0j08J06mKr4M2L0q5
$$ y = [65, 28, 20, 98, 174, 147, 242, 200, 119, 200, 165, 251, 320, 174, 158, 178, 110, 173, 199, 148, 129, 99, 20, 28, 210, 226, 114, 72, 230, 172, 50, 30, 107, 88, 299, 203, 174, 181, 62, 186, 107, 70, 109, 73, 166, 140, 57, 140, 93, 115, 128, 78, 139, 219, 149, 57, 47, 122, 160, 60, 198, 192, 121, 78, 128, 264, 246, 32, 139, 78, 90, 90, 145, 127, 248, 239, 225, 156, 61, 70, 194, 244, 109, 133, 81, 109, 69, 35, 154, 124, 100, 185, 195, 51, 152, 204, 82, 35, 169, 153, 101, 138, 127, 75, 92, 230, 163, 115, 109, 122, 228, 322, 168, 89, 213, 93, 135, 287, 416, 128, 222, 319, 260, 219, 224, 403, 408, 606, 1379, 3217, 1742, 713, 391, 385, 289, 147, 328, 258, 137, 283, 146, 80, 173, 204, 94, 128, 178, 216, 171, 76, 103, 234, 367, 216, 179, 93, 301, 142, 136, 159, 223, 251, 256, 75, 69, 261, 243, 178, 94, 49, 90, 244, 237, 179, 268, 63, 187, 201, 157, 132, 138, 131, 24, 153, 188, 197, 295, 105, 132, 121, 95, 80, 122, 48, 109, 61, 233, 328, 293, 138, 93, 76, 44, 80, 141, 190, 299, 128, 122, 75, 80, 12, 104, 120, 134, 50, 133, 114, 138, 113, 288, 182, 162, 121, 134, 134, 271, 368, 312, 118, 96, 67, 143, 150, 55, 279, 178, 80, 156, 210, 74, 171, 236, 204, 151, 92, 179, 193, 173, 65, 171, 167, 169, 75, 117, 147, 62]
2002F2J68j10P6j02N4L5L9j21m1N8l1NK6M2N5r1L4M8O9n8j66J77L2l4j55J20P7j0p3r1KR5
1702A91n0m2Lo4Q6q9O3n3N1P3ql4l4K1Kj3p1O5L7l4k0K1%l0O4O5J9r6r3M1J34r6J10r8n5K6
1364I2K1o3J18O2r1RQ6k24J37m6K0J3L0m0m1N0PQ4Qp3r6O1%j7k4J22M8O4j41r2M9l0k5Q8P4
1035B40r8o6J8P7j07l1QJ40j8prR9k4j29n7M6K9K2n4Q1j03J0L6J2n4J2O8o9NnNk9J74n9J19
706B82j1q2J12j30om6K4J81q8j59Q4j9K9R5M2j73k1p7J03qp1PK1MN1o2J7N3Mp4J54p2o0O4
387A68n1o1L9L4l2l7J81j76J45j25J24O7k67K05r4j7J2r8J70L0k6j6o5K5n4pj3M8J09j45R0
96A63j28L6RJ28Jj07o6K8L4Q2j8o4NK0o2N1R3j1K61o0k29J10l1j74L2p6J4N6K1K5KJ09rj67
-223G8P4q2J76L2j29qL2Oj14J2J2n7L2P0r8K2jK4
$$ y = [62, 230, 120, 196, 94, 148, 183, 222, 101, 60, 118, 87, 92, 118, 160, 215, 124, 158, 206, 275, 217, 51, 228, 260, 226, 71, 191, 268, 258, 185, 94, 96, 191, 141, 99, 102, 38, 124, 35, 98, 45, 96, 169, 161, 127, 93, 114, 116, 103, 32, 97, 134, 100, 80, 101, 101, 71, 135, 200, 219, 123, 30, 71, 205, 109, 219, 121, 66, 92, 113, 50, 168, 230, 139, 148, 234, 10, 147, 101, 121, 134, 164, 124, 83, 133, 140, 224, 232, 159, 63, 124, 124, 107, 83, 205, 253, 317, 176, 84, 133, 103, 78, 166, 240, 142, 76, 94, 171, 64, 33, 41, 181, 163, 156, 147, 246, 222, 93, 36, 82, 111, 133, 79, 160, 57, 67, 103, 115, 61, 73, 141, 72, 77, 72, 77, 48, 222, 163, 282, 271, 189, 301, 171, 165, 119, 143, 324, 236, 77, 161, 142, 171, 266, 308, 135, 114, 37, 140, 132, 61, 68, 89, 93, 144, 82, 99, 152, 156, 82, 236, 164, 104, 168, 117, 56, 95, 129, 97, 60, 241, 65, 210, 85, 209, 276, 9, 214, 120, 103, 115, 17, 187, 217, 191, 175, 110, 135, 81, 74, 61, 109, 218, 73, 163, 35, 71, 80, 208, 209, 102, 36, 64, 98, 180, 162, 98, 103, 123, 61, 112, 205, 194, 455, 395, 166, 276, 245, 71, 103, 27, 41, 97, 118, 143, 145, 254, 245, 78, 152, 70, 246, 278, 149, 141, 173, 179, 65, 77, 89, 32, 64, 134, 36, 58, 57, 81]
-392H1
##PAGE=	F1=8666.04
##FIRST=	19140.455529915001534,	4405.895418600002813,	0.42120724916458129883
##DATA TABLE=	(F2++(Y..Y)), PROFILE
4406G5k6OK8L7PJ12k9j12P6%M4O2j48J1N7n1L0jl1k1r7J0J2J41K8j36K2J29o9q1j6Rm3K74
4087C09j06k1jn6J17j32m7M1J9K9m8o8O9KRn7j4J08J07j06p8NP2M1r5J16k5p0n4L9J10J8j94
3777C9M3Q3J5j02O9MJ38k3k0p9r1jJ29O4j17k0k6on5pQ0j4j7R1L7j58J11O6j95M2Q1Kn5jK0
3448A27r5L2J55n7l0l2K1J17P9j57r3J46r0J2J61R4k13j7J24m0p3oK27j9J78P16J677j310
3185A634r90k50k1p0j89K07k6j76J61j13j51J05O1m5rM2On0l3PJ10J52j23l9j22K00j09p2
2922I7L9J10oj4j81m2K23K9o0j38K6nJ63J2p6R8k11J03L3o2J9l7l9l3R9M4l8J17j95N9M1j32
2622D3JP4m4M2o6K05J14m8k07k0k1k6j1J29L9J34j98m9l4l1J9L9L0L5p5Q4m0kk6J59j08N1
2321A92m0K7oO8R9m3j93j5k2P7%q7K39j04p6K3P2j44R9O8l8l9q3J31Jj9j31J26K1J5j50K8
$$ y = [75, 49, 55, 83, 120, 127, 239, 210, 98, 174, 174, 218, 280, 132, 143, 200, 149, 179, 178, 147, 126, 29, 39, 51, 192, 220, 84, 106, 235, 166, 85, 69, 78, 35, 309, 203, 182, 181, 125, 242, 110, 63, 104, 123, 152, 104, 36, 105, 107, 116, 59, 45, 153, 260, 154, 76, 81, 153, 194, 99, 215, 190, 120, 66, 105, 215, 233, 39, 82, 165, 180, 78, 147, 151, 289, 266, 246, 167, 76, 75, 204, 268, 151, 131, 105, 99, 44, 37, 117, 103, 86, 177, 214, 56, 167, 233, 38, 80, 161, 163, 108, 107, 127, 32, 64, 219, 162, 132, 100, 121, 238, 317, 160, 67, 213, 123, 135, 296, 390, 177, 160, 284, 244, 171, 165, 392, 373, 551, 1267, 2944, 1634, 644, 394, 373, 303, 114, 321, 295, 119, 280, 167, 16, 121, 182, 137, 128, 170, 176, 126, 93, 100, 210, 362, 239, 200, 78, 278, 169, 97, 136, 246, 240, 226, 45, 3, 226, 255, 195, 57, 83, 78, 241, 253, 177, 275, 64, 167, 200, 138, 157, 120, 81, 48, 147, 191, 153, 270, 75, 134, 175, 43, 44, 118, 74, 116, 50, 255, 369, 321, 114, 94, 73, 47, 36, 165, 204, 338, 140, 91, 57, 26, 45, 84, 114, 149, 74, 158, 118, 116, 90, 249, 141, 192, 152, 179, 173, 241, 340, 297, 104, 89, 67, 144, 144, 57, 296, 192, 116, 139, 211, 67, 166, 234, 196, 157, 74, 205, 206, 187, 56, 182, 203, 218, 68, 96]
2021I6P0j15J55m5N6q3JOM9r6o5Q7k2K0rP4N1q9L9L1P5m4j87J57M%r8Q4O9Kq0p1k6J05k1r8
1683H2K7qMj1Km0J1P7Qp0k3P3J6k4m3M7J4n3rJ8p2J2Q8M2K7m3j17K7J08l3J07j34r6M6L9l6
1345F3P6R1o6l5J23k12R5m9J9Q2j8n2k8J7N5P8On5j53M4M2L6n6J11LQ3j63q0O0j5q4J38P0
1035B26j01m8JP2j07k2RJ31jj2jR2k8j20k9M1L1J5p5P2q6K3KJ7m7l1Q1l2M4l5L4n0J57j06
716A17J99n0o2J27j62M3j11R5J32j15j07L9K9KQ1K8j80qr3K06m7r8l8N4j6P8n0LK5J4p3J15
415A77n4qN7Qn0m3J9j7o3J81j66J23r7J26O4k30J78q3k3K1q2P8O3j4lj3Pl9j7l4J9J25j24
105H6P8j24L9qJ12qp3n4jN0O5j2q0M0N4n5J5N6MK53n2j96R7n0j94N0l4oLM5P5j8O7j5j75R4
-233A28n9J75M1j85K3L1kj00k4N6rm1J04q7M0j5L
$$ y = [96, 166, 51, 206, 161, 217, 134, 135, 141, 190, 94, 29, 116, 94, 114, 105, 179, 230, 141, 180, 211, 286, 242, 55, 212, 216, 216, 118, 202, 271, 273, 193, 122, 96, 201, 180, 82, 109, 101, 105, 94, 96, 56, 67, 144, 152, 82, 59, 132, 148, 124, 81, 128, 142, 89, 80, 98, 26, 38, 126, 168, 195, 152, 35, 62, 170, 137, 244, 110, 14, 60, 99, 63, 139, 230, 164, 129, 252, 40, 135, 86, 105, 187, 169, 117, 89, 106, 161, 239, 245, 190, 37, 81, 123, 159, 103, 214, 217, 300, 137, 57, 117, 102, 18, 156, 226, 125, 77, 78, 150, 43, 21, 30, 161, 160, 148, 147, 239, 211, 91, 62, 103, 134, 149, 74, 146, 60, 83, 85, 102, 55, 24, 105, 73, 117, 82, 116, 66, 223, 117, 316, 266, 204, 331, 169, 212, 101, 196, 328, 213, 106, 145, 174, 176, 257, 285, 105, 97, 4, 210, 163, 65, 27, 81, 65, 143, 93, 96, 121, 135, 62, 177, 123, 115, 172, 180, 130, 87, 106, 89, 26, 207, 41, 164, 67, 193, 257, 27, 205, 122, 99, 120, 38, 116, 179, 165, 162, 149, 156, 117, 100, 66, 85, 210, 86, 164, 40, 79, 71, 183, 175, 102, 48, 47, 97, 162, 150, 70, 110, 164, 109, 124, 180, 184, 437, 385, 189, 286, 236, 42, 92, 58, 52, 55, 100, 175, 157, 224, 209, 34, 128, 69, 244, 285, 100, 123, 154, 152, 52, 28, 84, 75, 34, 138, 51, 91, 76, 79]
-392G9
##PAGE=	F1=8587.28
##FIRST=	19140.455529915001534,	4405.895418600002813,	0.17380833625793457031
##DATA TABLE=	(F2++(Y..Y)), PROFILE
4406H8k0J2j4J6K2J04nj32O9M1lM7j31J8Q1k5Kj6rk9o8MJ8Q8N0j01K8J03o8m8j7m9l0K77j10
4077A93mj2lJ11j71m6P0M2k9q5l4M2P4l8r5M1J01J34j35n5K8O3L6r7R8n9m5p3QR6N4j45k3
3767D2J99K7j71L5N2J27l9nq6p2k7J37M9q0o6Km5m5NM5K4l0O8P2j52J11P1k25J06J4L4p0m1
3458F6M5j08O2J30m8Kk5JJ11N4j55r2J62n4j4J36N8j31r8J38k0j06nK43n4J46O10J372j027
3185A399q73j75k5l5k10J98K2k16J57o7j18L2P5K1o2J7k3j3J1j8P5J54r8j9j40J58n4r5N3
2913A31J41m9m1j50L8J12O5m6j87R9k8J31M3p6R2k08P4O5q9O6k8j23L5N2Q7o9J13k08R6P2
2631B10j86MP7K0J6q7J95J33n5k38J4n1ol5J64L2J59k41l1n2QL4j5M2N8q7Q6p3j7k7J50j16
2331H5J19k3K9mLP9k3j91Kk8Q6%p2K37j04m6KO3j31J09L8n7k7n8J51l0k6j45J39N1K5j64j3
$$ y = [88, 68, 80, 66, 82, 104, 208, 203, 71, 140, 181, 178, 225, 94, 112, 193, 168, 170, 154, 145, 116, 48, 52, 70, 158, 208, 107, 135, 238, 170, 122, 105, 56, 26, 303, 193, 189, 177, 174, 285, 114, 68, 138, 180, 151, 66, 32, 74, 148, 110, 15, 56, 157, 291, 156, 101, 129, 192, 228, 131, 229, 170, 125, 52, 60, 156, 210, 65, 42, 241, 268, 97, 132, 184, 311, 272, 267, 181, 109, 82, 219, 268, 188, 122, 124, 79, 34, 39, 84, 108, 78, 146, 218, 66, 177, 248, 23, 129, 143, 177, 107, 66, 111, 3, 65, 195, 147, 149, 124, 125, 236, 290, 135, 43, 205, 151, 137, 273, 331, 200, 102, 240, 220, 114, 109, 352, 298, 444, 1054, 2426, 1399, 526, 351, 326, 291, 81, 279, 301, 85, 242, 175, 57, 89, 164, 185, 123, 140, 117, 104, 115, 97, 172, 326, 228, 209, 69, 227, 173, 78, 131, 272, 223, 182, 32, 70, 182, 247, 201, 14, 113, 85, 216, 259, 183, 275, 67, 141, 206, 117, 183, 155, 32, 67, 119, 206, 137, 250, 42, 138, 210, 24, 28, 105, 125, 141, 54, 249, 382, 327, 89, 103, 52, 46, 11, 175, 207, 366, 125, 94, 42, 50, 84, 69, 111, 169, 82, 168, 95, 78, 51, 201, 85, 204, 181, 210, 206, 209, 288, 265, 74, 76, 48, 134, 134, 62, 299, 195, 149, 151, 214, 83, 192, 230, 173, 146, 88, 239, 209, 183, 38, 177, 228, 253, 89, 76]
2021G6P8j04J34K3K2l9n8j9O1p8r2J07mN9p1Q8M4q5M1K5Q8l0j92J22m9K9j9N5L2K3q3n4l0
1711A00R5J4j43J05j0p5N3o3j6l0J08J1j02OQ4L5k0k5K7np7J7Qm2j8R2J4M2j0j29K7O3J6J04
1392B56j40l5L5K0o7K8J20l1q6J57j83M4m0O2Q0n0p9j0JQ9N7Pj8j28k6O0O9p7J14o0J02j78
1091I3m4N5K7o8P4O2r9l0j3Q1q3J1pQ3J2j4J9O6l9j05pM0M2J6j08P6p2L5l6K0l9j3M8J4N8
763A55q1P7o2J21j39K46q1l4J15j67J01j49J36P4j26o0%P0jL9J8j67%o0K37p0q5p3O1l4P7
471A38l8jqJ6n5N9l9L8N3P0l9j25J4Jo3J52q6L0r0J59P0k08J30n6k4K6o0OO4JK7K5j3k7k9
143A18k6k1J12j00P3r5K2j5Q0j0m9l2k7M4M2K0n2L6P5l6k1K6J0K31n5j54O7o2j85Q7K5m3k
-167H3j5J27m1J8qj24M1j4J60N3k24O2L7m9m4k5R6j5r5J35p9L5k6o
$$ y = [76, 154, 50, 184, 207, 229, 190, 132, 113, 174, 96, 4, 111, 107, 166, 95, 183, 227, 142, 183, 208, 296, 266, 74, 196, 147, 176, 157, 212, 244, 267, 184, 130, 100, 195, 209, 66, 171, 161, 86, 139, 76, 60, 30, 138, 149, 47, 53, 137, 172, 152, 127, 154, 149, 72, 89, 97, 55, 37, 129, 143, 185, 175, 46, 73, 136, 152, 256, 116, 81, 116, 136, 69, 97, 217, 186, 100, 257, 74, 118, 78, 140, 220, 170, 91, 81, 82, 171, 228, 235, 217, 89, 63, 123, 192, 115, 229, 169, 271, 93, 49, 104, 131, 63, 137, 199, 100, 70, 57, 138, 55, 66, 59, 142, 154, 140, 159, 225, 186, 81, 74, 114, 156, 172, 64, 140, 68, 103, 67, 87, 48, 35, 83, 97, 155, 74, 151, 89, 210, 71, 317, 236, 202, 317, 150, 251, 102, 238, 312, 186, 126, 126, 196, 195, 234, 252, 85, 85, 25, 262, 192, 107, 34, 95, 61, 138, 100, 99, 91, 107, 52, 111, 72, 110, 163, 233, 194, 69, 83, 84, 21, 173, 87, 117, 27, 186, 256, 48, 178, 122, 98, 124, 64, 70, 134, 135, 162, 187, 174, 147, 118, 92, 71, 183, 83, 156, 61, 83, 68, 148, 138, 89, 57, 30, 74, 116, 136, 84, 120, 195, 159, 138, 164, 174, 405, 350, 196, 263, 201, 16, 103, 128, 85, 83, 68, 195, 154, 172, 164, 40, 81, 67, 227, 280, 56, 118, 155, 106, 62, 37, 133, 118, 23, 158, 79, 114, 88, 82]
-392H2
##PAGE=	F1=8508.53
##FIRST=	19140.455529915001534,	4405.895418600002813,	0.16687339544296264648
##DATA TABLE=	(F2++(Y..Y)), PROFILE
4406A01j9Rl8K2NP0L0j38O3P5l0J9q7rQ5Pk0j7Rl5Rn2K2L2O7m7J5Q9n5l2k0q5K0K11j03J7
4068A90j8K7J08j94k0R8L5n5j33J9K0J16r7moO5J53j56j8N4N5J9j09Q6r9%j01j7Q9P0q5n2
3767D0K63L7k05l3J14Q7n6K2p6m5n6J40J9l5j07K3p7lpN5N1m6j4J16j39J16P3k16J23m6P5
3476A93r3p7P0o6N5P7m3M9nk9J09K8j58q3J67k1l6Q0K3m3j44J42%j29lK31p7R1M86J003o97
3185A100o96j31j5Oj89J32O7k13J15j2m1j2M5P6j09k5k2L4K1l5K6J50p0nj17R7j0p7L8J50
2903B78q8o2o3N3J4Q7k5j46P7k0O1P7n4Q0k01N0R3j07R6J0j75M0K1J39r6Q7k15J28P6j84P
2612C8M5J00j3j01J48J44n8k32M7r8J8J2J22K8J72k83M5q0L2J2k8L7Q1j03P7j12K2n5J40j26
2331C1J68MJ9Jk5M0mj92K2n1R3J9o1K22j04j2J5K9j08J39j2r6o%J37o8l9j40J40P1L2j48j9
$$ y = [101, 82, 91, 53, 75, 80, 150, 180, 42, 105, 180, 150, 169, 82, 73, 158, 165, 145, 128, 137, 102, 111, 59, 81, 113, 180, 133, 148, 237, 182, 150, 130, 45, 65, 276, 173, 190, 172, 199, 307, 113, 93, 191, 226, 171, 38, 57, 77, 193, 96, 92, 86, 151, 304, 148, 130, 184, 239, 258, 149, 235, 136, 136, 35, 18, 107, 177, 92, 40, 303, 340, 135, 102, 216, 303, 247, 269, 193, 148, 92, 232, 251, 216, 109, 132, 55, 52, 45, 100, 151, 105, 91, 207, 68, 184, 257, 41, 164, 118, 193, 100, 23, 93, 27, 82, 159, 116, 165, 160, 131, 240, 268, 110, 27, 194, 173, 137, 217, 240, 197, 53, 195, 195, 66, 63, 294, 217, 308, 794, 1797, 1100, 404, 273, 258, 264, 75, 207, 274, 61, 176, 164, 123, 111, 156, 232, 123, 98, 76, 110, 131, 96, 122, 272, 202, 197, 80, 177, 167, 90, 128, 278, 190, 128, 65, 118, 132, 219, 194, 48, 125, 105, 166, 243, 189, 269, 68, 118, 211, 104, 200, 210, 35, 75, 96, 235, 139, 226, 11, 139, 215, 31, 38, 83, 183, 170, 69, 217, 361, 303, 71, 118, 20, 38, 50, 172, 200, 372, 89, 134, 54, 86, 98, 70, 107, 188, 85, 162, 50, 72, 17, 157, 31, 199, 203, 222, 223, 198, 238, 234, 42, 64, 13, 106, 125, 64, 286, 182, 170, 185, 214, 106, 245, 233, 137, 131, 131, 268, 200, 161, 21, 161, 232, 264, 116, 97]
2021I7K5p5J09Q8j4Mr2k7O4p1p5P2K0J06j46Q0L5p2N0K0J00k1j82Q9j23N7O1L4k4N3q1m7j7
1711I7P7M8j50J69k8j37Q7j19J6m7J30Pj21K1Q4M4%j7J1j5j01O0j5K7l9O2k5O1oj30O5lL9
1401A52J01j07J6K2nj12qJ39Mj31J78j51J8l9J04M5o2j07LNJ02K4J0L0q0m9J5Q3q7J33j11
1110A35J10j69k8N2P7n0j9N5r1J2j8O9o1M3j7K9RrN1K5n7q3NM5N3K7j47R2n7M5o9J4j8J4k
781F7O3O3j39J26o7P5j53K55r6oQ0j39J47j50J29K6j18j6l1Q9J7j3J4j27j2m0K42o6q0r1O5
490A14l4M6k9K4m8Lk4kl4P0N3J19k3j92K7J5j6Q3j5k9p1J46P7j94P4rk8J7n1j3L2K2O6L4k5
162A85k2l5ql1O5q2O8n0nk1M2Ln0Nm0PK9O6k2K1R1k3n9J3J5J95o7j04K9o8r9N8O7n1K2r4J49
-186A99o0l5L2m5m0RJ37O7k34J02O8j02J7j8J04m4j15J52q3K6l3j5
$$ y = [97, 122, 47, 156, 244, 230, 234, 142, 115, 179, 108, 33, 105, 125, 231, 85, 165, 200, 128, 178, 198, 298, 277, 95, 184, 61, 118, 179, 213, 189, 242, 161, 114, 97, 174, 222, 72, 241, 213, 76, 163, 44, 60, 13, 143, 150, 29, 50, 134, 178, 178, 161, 172, 157, 56, 116, 101, 128, 89, 151, 126, 187, 181, 51, 116, 113, 152, 253, 146, 162, 184, 179, 67, 59, 198, 202, 71, 249, 98, 116, 77, 181, 226, 164, 57, 60, 65, 167, 191, 201, 231, 151, 102, 117, 200, 113, 246, 135, 245, 76, 48, 100, 177, 127, 108, 163, 72, 84, 66, 135, 74, 117, 100, 129, 138, 129, 180, 205, 148, 65, 70, 115, 168, 195, 48, 140, 83, 128, 59, 73, 55, 69, 67, 130, 193, 54, 180, 113, 188, 35, 290, 194, 188, 268, 129, 276, 126, 255, 281, 163, 147, 116, 205, 222, 209, 223, 96, 84, 44, 286, 220, 140, 49, 114, 80, 126, 97, 121, 73, 76, 52, 50, 16, 86, 139, 258, 235, 43, 70, 85, 69, 152, 137, 108, 37, 183, 260, 66, 140, 131, 103, 120, 69, 56, 88, 110, 176, 210, 185, 163, 128, 120, 89, 154, 72, 140, 90, 85, 64, 106, 109, 59, 64, 24, 31, 60, 126, 104, 125, 216, 193, 134, 147, 162, 357, 290, 186, 215, 147, 48, 106, 173, 122, 144, 50, 199, 139, 104, 136, 91, 51, 60, 197, 264, 30, 132, 200, 98, 115, 97, 201, 157, 42, 194, 111, 137, 104, 89]
-392H9
##PAGE=	F1=8429.77
##FIRST=	19140.455529915001534,	4405.895418600002813,	0.16021917760372161865
##DATA TABLE=	(F2++(Y..Y)), PROFILE
4406A11k2%m0L5j9J8O5j10M5Q4l1j7j4m2M6K9l3qK5l4O6r2K8k0O9lNQ5k9l3k1r8M8J34q5L9
4068A81j2K9J08j94J0J20J2n0j53L6L0J10j54R1n1K7J59j68K7P7M8nj31Q4j39N6j32M3L2M9
3786A40k6l7K71L7k19j03J76K4o6N2m9j5p2J32k0Oj35L4j00L9j4J00N5n4j14J41j22J34P3
3514B68k07J21r4J18j11o4O5m8M8K2m7J04J1n6J25K2j64q5J57Jn5J2j5M3j57J44J7j29j9K07
3232B34m3k2L82O66m07m79j49PM2j32K6J02j28mL4L5mj4J23j33q1N6K2Jm0k3J65j9l9p2O8
2941A74mm6j0J38j09o2K5L6o5R5Kp3J3Qk2R9j3P1j92M2R4j01J02N3j64j8L7J52j22N2j72J18
2641A38N6j67L1%J78m5j08Q8J40n9j85O9j21PN5Q2K8J65k94J26r1Rj3%J4R9j15O0j32J26p2
2349F9N3j10J71L0LOqKQj77J2lOO1o3J95j02K2M8j2q1J73n7j53L6M8J05j02n0r7J03P2M4j15
$$ y = [111, 89, 89, 49, 84, 65, 83, 148, 38, 83, 167, 136, 119, 105, 63, 109, 138, 105, 97, 122, 88, 154, 62, 90, 70, 139, 136, 141, 226, 197, 164, 143, 45, 93, 227, 142, 181, 169, 198, 306, 112, 122, 242, 254, 204, 51, 87, 117, 227, 73, 164, 113, 140, 299, 131, 158, 235, 283, 278, 147, 231, 92, 148, 16, 59, 91, 140, 114, 77, 348, 385, 166, 63, 239, 263, 197, 249, 200, 185, 113, 245, 225, 231, 96, 130, 30, 69, 55, 155, 210, 156, 42, 183, 61, 195, 268, 61, 182, 88, 206, 95, 31, 96, 48, 96, 118, 71, 175, 186, 130, 255, 277, 113, 28, 185, 186, 131, 143, 128, 171, 14, 158, 175, 46, 27, 234, 191, 169, 551, 1217, 810, 331, 182, 189, 231, 99, 125, 227, 99, 95, 129, 164, 160, 146, 269, 136, 55, 111, 133, 134, 94, 71, 236, 217, 178, 106, 174, 170, 124, 114, 252, 143, 81, 106, 142, 77, 172, 174, 101, 114, 122, 100, 199, 186, 257, 65, 107, 201, 100, 202, 255, 91, 73, 110, 262, 140, 192, 20, 138, 194, 27, 58, 58, 236, 191, 83, 171, 311, 252, 67, 136, 15, 22, 77, 159, 187, 352, 58, 184, 93, 102, 89, 89, 103, 202, 87, 147, 15, 141, 69, 122, 12, 183, 213, 216, 222, 214, 216, 224, 47, 59, 56, 62, 123, 60, 255, 153, 175, 223, 211, 130, 303, 246, 93, 129, 177, 282, 180, 130, 33, 136, 208, 252, 137]
2030A37Rm1o3P5J40l9L9r7j8N9p8o8M2N2J39k18O0K5m6Q6nR6k1j57O6j48M8J03K8r0Q8o6n7
1720H0LN7P5j14J88l9j72Q9j38L5j1R8kj06j3R8M3K0j4Kj9j15J01m0Q0l8M2p1P1k6r1J01o6
1410A08L3R5m8M8jk7j48NJ18K9j56J75j28K9o0J29Nn7j10nK2R4j3K0O5k4m6m4P9q9J62j27
1110A33R8j35n6O9J13m5r9M9p4P3k3L2n0P9l0j4j3NR4k3p6n8MN9N5M8j58Q2m0M9q5J1NQl8
781D9J15O5j97J68o4K9j46K26r1J9L0q1J58j29R1jr3L4n8P5M5m6J2q1l3l6K20l9q4j07Q1k5
481A06Kl0P5q1l1J3j2jON7J40jk31N7K0J7M8J9l5l8P6P9j78K0M6l1ql9%j7M6R2K5k5k1l3J1
133A43j8K1p6M9%l3k9KL5q0O1l6K1K9L4j5J4J02j8r7J2K2J46q2l7j0o9j0OR9l7M1j18J12o9
-195A15p4J19l1k0n8J11P6k05J17J14j09J9k7J19p8j23J68r0L0m0l6
$$ y = [137, 146, 105, 42, 117, 257, 218, 257, 160, 142, 201, 123, 55, 97, 149, 288, 70, 130, 155, 109, 195, 190, 286, 265, 108, 174, 26, 74, 177, 205, 115, 203, 137, 80, 83, 140, 215, 101, 289, 250, 78, 167, 29, 64, 53, 151, 149, 43, 30, 128, 171, 191, 177, 179, 160, 45, 146, 106, 186, 148, 190, 119, 190, 164, 73, 174, 108, 141, 236, 188, 236, 235, 208, 60, 65, 183, 212, 56, 231, 103, 132, 72, 201, 206, 149, 39, 34, 56, 150, 137, 157, 222, 198, 152, 108, 187, 98, 260, 133, 231, 96, 40, 109, 222, 177, 78, 127, 53, 126, 103, 135, 85, 164, 134, 120, 107, 112, 206, 183, 107, 49, 53, 112, 167, 215, 57, 139, 99, 148, 63, 74, 79, 87, 49, 164, 229, 32, 200, 136, 165, 19, 245, 154, 173, 203, 122, 280, 151, 242, 241, 148, 182, 124, 199, 244, 198, 210, 129, 96, 60, 280, 241, 157, 50, 131, 106, 108, 78, 153, 72, 41, 54, 42, 41, 47, 104, 244, 243, 12, 69, 89, 106, 154, 173, 138, 100, 176, 255, 77, 97, 143, 112, 104, 65, 65, 48, 94, 186, 211, 186, 165, 132, 143, 125, 146, 70, 119, 119, 86, 57, 59, 94, 14, 75, 39, 60, 89, 123, 108, 122, 224, 206, 109, 121, 143, 289, 207, 170, 160, 91, 81, 87, 186, 149, 190, 72, 184, 115, 41, 160, 129, 109, 51, 162, 238, 33, 150, 264, 155, 174, 147, 266, 188, 65, 233, 143, 173, 133, 97]
-392I7
##PAGE=	F1=8351.02
##FIRST=	19140.455529915001534,	4405.895418600002813,	0.036918703466653823853
##DATA TABLE=	(F2++(Y..Y)), PROFILE
4406A15k2j3k7L4j4KM5m9J8N7j4n6O4m5j2J1m0J0M1k9R5j10L7n6N9J8mQ6Qm4k4r2O0N9o4O1
4068A65OJJ14j64J8J41k2k7j46K6M9Q1j94J79r4rJ54j64P0Q7M0k8j59R0j71J15j56J00mJ2
3786A10J6LK47J8k15j48K15n0m3N8j4J7p3J13n9L7j44K9q5M8j6J41O0n7j18O3r9J55P1j99
3504H1J02j25J52j14l3N5o0M2qp2J54J8p3J55L5j61j10J39Qo6k0p2J07r9R2L3j15l6J78N3
3223B40j76L06M55k38k73k09M0N5p7m7R9j2j35M9R6L1q5J68j29j31J41nm0l5k8J92L9j07n6
2950A28Q6l1j8p4J03q2l0O3lj26R4M0%o5M0r8J05L4O5j70M4O7p6R1R0j31q1P8J29j45J6r2
2650E1Q7K1j43O9n1K38p4j08M3J12o2j07P6j04l4Q0M5L1J40k26J45q7m7l3O0k5J10j23M4n1
2368G7J54r9l5p7J44M5rJ3K7k3J7j58j0N4j05J13q1J67j00M9Q7l8n6J93q5k20J00O9O2j20
$$ y = [115, 93, 80, 53, 87, 73, 75, 120, 71, 89, 146, 132, 76, 140, 95, 83, 94, 54, 64, 105, 76, 171, 61, 98, 42, 101, 119, 115, 201, 209, 165, 141, 49, 109, 168, 104, 165, 171, 172, 286, 122, 140, 281, 259, 232, 86, 112, 161, 242, 48, 227, 133, 124, 278, 114, 184, 271, 311, 283, 124, 214, 43, 158, 2, 102, 98, 110, 126, 129, 376, 394, 179, 31, 246, 196, 153, 211, 197, 214, 141, 254, 195, 232, 88, 117, 32, 80, 64, 205, 265, 208, 90, 153, 54, 209, 280, 81, 183, 58, 210, 96, 63, 118, 58, 100, 92, 20, 174, 192, 119, 274, 309, 148, 38, 177, 185, 119, 99, 27, 134, 35, 127, 160, 45, 9, 187, 240, 64, 370, 825, 587, 314, 105, 145, 200, 123, 76, 175, 163, 28, 77, 173, 204, 119, 287, 158, 27, 168, 163, 123, 88, 60, 252, 291, 184, 128, 214, 183, 165, 91, 194, 112, 82, 145, 142, 16, 110, 150, 150, 85, 125, 27, 132, 166, 231, 61, 105, 172, 96, 187, 277, 146, 65, 143, 272, 127, 143, 51, 138, 159, 16, 85, 34, 272, 198, 90, 133, 245, 183, 76, 152, 48, 14, 94, 139, 170, 310, 84, 229, 142, 95, 62, 122, 97, 207, 84, 128, 77, 231, 132, 97, 20, 164, 209, 200, 213, 240, 217, 234, 76, 66, 120, 15, 128, 47, 214, 114, 163, 250, 212, 156, 349, 264, 44, 144, 213, 275, 155]
2087A55m7n3N3N3O5p1L9o1r1L7J64m6O0p6qN7j00o2J9Q8J47k77N7J3j8J46n5O8l0j22N2o4
1786I2j5P0M1j51J25l1r2K2L9Q7o0J75l5j78O4q1NJ1O9j4o5n7J03L3L1j5Nk3j10J20o0J14
1486B19k2L8j12O3o2OR7j11PQ6J4O6k5m0j68N4O8L4j48J44j20O1r0J31k6m1o7j9K1O8m6M7
1185A27O3L2k9q5N3q5J86j11P3j05r5J08J26n3j30L5n5J17l4rm5J14m4m6m7L1J42p2p5m8r
894C0Q2M8O6j29M1k8M3q1K9Oj3o3J66O0k25J78n2j1j25J75p1M0j7k4J40j03M3j1n4Q8q3L3
594A78P2m8Nm4m3l6J62Nq7j22J03qn0m2J36r2q2M7L1Mp8N2J24K6j88M5K3L2M2K6k8qNP1j51
265H2k1Q5l1m3J6Op1O9Q7J0j1j8l0L2j%p3QM6o2l1pN1m3M4l6Q0L4m9l1K0J10k4j29J6K9Q4
-83A98q7N4m9o3N6n2J10pM8j00M1o4KJ38q1L8j39R0P1j58J11J56r5Jm1J34j03j22J75r1N2
$$ y = [155, 108, 55, 108, 161, 226, 155, 194, 133, 42, 79, 243, 197, 257, 181, 173, 230, 130, 68, 87, 175, 322, 45, 102, 115, 97, 243, 188, 256, 226, 104, 156, 92, 77, 147, 188, 37, 162, 131, 39, 61, 100, 187, 127, 302, 267, 89, 153, 72, 77, 88, 157, 143, 78, 21, 124, 157, 188, 173, 178, 155, 45, 165, 105, 219, 197, 235, 123, 186, 124, 130, 227, 116, 123, 209, 223, 289, 264, 224, 56, 110, 178, 212, 64, 208, 88, 149, 59, 190, 164, 123, 56, 37, 58, 126, 80, 127, 190, 222, 193, 108, 161, 76, 262, 151, 224, 119, 24, 132, 258, 205, 75, 110, 55, 172, 138, 129, 84, 198, 154, 108, 61, 92, 234, 162, 87, 39, 30, 112, 160, 226, 97, 138, 110, 153, 72, 101, 107, 94, 31, 197, 257, 32, 210, 158, 147, 22, 197, 126, 166, 149, 125, 265, 162, 205, 194, 140, 228, 145, 178, 250, 202, 207, 163, 120, 84, 246, 251, 164, 42, 145, 137, 87, 45, 181, 89, 7, 54, 85, 89, 11, 63, 187, 213, 25, 70, 93, 125, 167, 193, 165, 157, 162, 233, 82, 61, 146, 115, 72, 88, 94, 23, 92, 179, 189, 178, 160, 130, 162, 161, 161, 88, 96, 142, 80, 49, 42, 93, 50, 94, 58, 138, 172, 123, 92, 112, 222, 198, 69, 85, 114, 198, 111, 165, 116, 53, 109, 57, 167, 160, 208, 108, 149, 85, 87, 225, 144, 182, 43, 133, 204, 46, 157, 313, 218, 219, 178, 312, 209, 87, 262, 171, 223]
-374B23n2o8
$$ y = [223, 171, 103]
-392A03
##PAGE=	F1=8272.26
##FIRST=	19140.455529915001534,	4405.895418600002813,	0.056572925299406051636
##DATA TABLE=	(F2++(Y..Y)), PROFILE
4406A15j5k1k0J8K1L6k9KQRJ1r9J36m9j8n5m9M5M5j9R1j04M8p2O9Ml0R0M6n6k8p3O1On7Q5
4068A52L2n4J23j17QJ61o1rj17J2O1M1k00K44j32l6J40j40J01P6K9m4j86R9j68J48j47J13
3805A29l2pK9O3K04k0j94j34J96j18M0J0J8M6o5R0r5N7j34J7l1K4k6J62P6n6r0l1p2J60O8
3514B84j83P1j42J70r8k1N7q7M0J2n7J16J6p5J84N5j50j30R6J2o3M1l2k0k0K4N1j07lJ21J48
3223C10k12J65L87k03j32k49P5K7l6k5M0P2j49k6J18P3j63K08j03j60J92j4r5k5K9K01P3j51
2960B27r2J18o6J6j17L0J1%M8m7p7LQ1N4j16M1p0K4O1N7j26M4K9m5P3J15q7j29J03R4j56j5
2659H6lO0j3j10J00r5K62r2j06L6N5o8k6P3q8l0O2J0L7J04j19J29p1j25l0J20o7J09j30M2
2378A12K0J81j28j01q0J44M2nK3N1m1L2j52j7R3j35R8j03J42r9O0J25m3l8J91q9k72J56O5
$$ y = [115, 100, 79, 59, 77, 98, 134, 105, 107, 115, 124, 135, 36, 172, 123, 105, 50, 1, 46, 91, 72, 163, 59, 107, 35, 104, 108, 78, 168, 214, 158, 130, 57, 118, 124, 67, 152, 184, 130, 253, 136, 144, 305, 244, 235, 118, 130, 191, 232, 32, 276, 144, 108, 248, 108, 209, 285, 314, 270, 84, 183, 15, 163, 16, 129, 97, 90, 119, 182, 386, 366, 172, 38, 234, 116, 156, 166, 184, 230, 165, 255, 160, 217, 83, 100, 69, 93, 67, 229, 305, 249, 159, 128, 56, 216, 284, 101, 172, 30, 200, 102, 81, 138, 51, 91, 103, 46, 162, 178, 103, 287, 342, 192, 62, 158, 170, 107, 148, 116, 96, 76, 100, 151, 44, 41, 162, 310, 98, 263, 650, 447, 315, 66, 141, 168, 132, 107, 147, 219, 70, 44, 162, 235, 72, 280, 177, 17, 209, 195, 100, 75, 104, 305, 378, 227, 135, 253, 187, 203, 86, 116, 127, 127, 175, 128, 51, 54, 135, 189, 73, 114, 44, 68, 129, 186, 60, 104, 133, 88, 161, 276, 189, 60, 163, 257, 101, 86, 83, 143, 130, 20, 120, 25, 287, 195, 89, 125, 180, 112, 86, 159, 71, 41, 103, 113, 150, 254, 135, 264, 193, 68, 38, 158, 91, 200, 70, 112, 132, 313, 185, 84, 4, 148, 190, 185, 208, 259, 218, 250, 98, 81, 174, 39, 137, 34, 176, 77, 137, 262, 219, 181, 372, 283, 11, 167, 232]
2105B32J9j20k0m3QL2R7l2N5n4j33K9J41l4O4l1j7O4j30n1jJ22J29l18J03nkJ93j06J4m4q2
1805G9M0Ql5JP1j25Q6K6j11jK5P9pJ39j3j57K3lk5J7M5l0j3n1N3K8K1k0K1l4p2J02p7J34O
1476B30M1j38L9j03J33O1j38k1O8O5P5l8m1j77J03K1K3j21J02j28J00j12J07l6k6j4rlM0o8
1195C5R9J1Q2kr2Lq1J91q8N4q0j22J47J23p2j01J4n5J39n1m1l7J39n7o4q6P0J78j07m8o4j6
894B1R6L6O9q4%k6K8o5O6j2l3n6J88L6k09J52k7m1j08J20m4O4m3kJ08q3J0j3qJ32j07k2R0
584B33l2pql8l5Q2M9p5j35J20J7p9p2J72p0p7NO9Oo8l3P4N3q7KL1K2N7K3l2K9m1M2j13k5P7
246A36k7q4J17kj22Q6M7%J3rl3N4J4j2p1k9P9r2k1M0K0RLl8J35L5j24o2L2J15l4j46J8L2J2
-83I1k9J17q5l3P6o7N5K9M3n8m4k6J04J22j62J04j89O0N6j05Q9J85p5k0n6J50j17j09J68q2
$$ y = [232, 251, 131, 111, 68, 76, 108, 205, 173, 228, 174, 41, 70, 211, 177, 241, 210, 193, 257, 127, 76, 75, 197, 326, 8, 111, 106, 104, 297, 191, 205, 161, 79, 119, 127, 92, 93, 164, 39, 125, 151, 40, 39, 64, 143, 136, 275, 262, 105, 128, 125, 100, 117, 162, 132, 119, 68, 121, 149, 170, 150, 171, 137, 65, 167, 90, 224, 230, 271, 133, 172, 69, 202, 263, 125, 104, 172, 237, 312, 274, 233, 56, 159, 180, 203, 82, 184, 56, 156, 44, 151, 115, 89, 75, 66, 63, 103, 35, 134, 145, 227, 225, 133, 136, 55, 246, 158, 212, 132, 10, 157, 280, 208, 107, 121, 66, 205, 154, 113, 76, 215, 158, 94, 8, 78, 256, 149, 101, 37, 21, 117, 153, 222, 138, 138, 112, 140, 75, 141, 129, 96, 40, 228, 264, 55, 207, 180, 139, 31, 151, 107, 171, 128, 126, 234, 151, 161, 148, 140, 272, 165, 143, 233, 201, 194, 186, 148, 113, 195, 244, 169, 34, 154, 171, 92, 20, 192, 122, 45, 50, 119, 125, 57, 24, 98, 151, 64, 66, 97, 119, 176, 199, 167, 196, 155, 197, 84, 59, 136, 109, 25, 142, 140, 18, 104, 151, 151, 164, 155, 122, 176, 190, 178, 107, 78, 157, 65, 44, 84, 104, 113, 116, 78, 213, 248, 124, 62, 94, 209, 175, 29, 47, 79, 91, 62, 179, 94, 61, 137, 70, 125, 154, 197, 139, 95, 69, 173, 295, 133, 237, 48, 108, 164, 59, 148, 333, 258, 238, 182, 332, 215, 106, 274, 192]
-364A92Q3o7j01
$$ y = [192, 275, 208, 107]
-392A07
##PAGE=	F1=8193.5
##FIRST=	19140.455529915001534,	4405.895418600002813,	0.046275079250335693359
##DATA TABLE=	(F2++(Y..Y)), PROFILE
4406A10jj8k8pO7O1q9L9J0k6K9j25J71o5Qq3KJ5J4JN4q6O4p3R9j4p8Q3P6n7l4m8O0lq7J09
4068A50N6j25J33o9jJ71j00j0o6KN8%j44K52j58n3J18r7J16M8Qm7k06J07r0J10j38J18o5r
3786F9J7J37J51o8j59r3J49j64J57o6L4O6n5O8j23O4j06J0K4Pn7J60R9m8o4r2n4J40P0j56
3504A17L6j46J70p1k6O3j18M6O4l9M5Rn3J98P3j40j25K0J9m1J21j1j43M3l8P2j01L8P3K14
3223C69j96M4L66k23n3k56J05k4j0K8OJ01j34l5P7Q7k11K11o9j73K20mj44k3R0K04Q5j52j61
2950A25J43j03O6j14p8J21J8J7q1%m4P1P4j03okj2oL7n6L6J4l2N1J21m7j48R8O6j55l3P3M3
2641A54l4q9J28j24K46q5j17O2qp9L6O3p3mL4l0M4P2k5J13m5k03K4J28j08J00j35N5O7K02
2359C69j49j27o3J06K3K0L6M8o0N7j49j2J05j32P6j04J09q9M0J52l5k0J71p5k40J27M9k0r9
$$ y = [110, 109, 91, 63, 56, 123, 184, 95, 134, 144, 118, 147, 22, 193, 128, 136, 53, 55, 70, 84, 85, 139, 53, 117, 44, 143, 129, 51, 134, 210, 153, 119, 71, 131, 128, 41, 150, 206, 81, 214, 145, 144, 315, 215, 205, 139, 141, 199, 199, 55, 307, 149, 96, 214, 117, 233, 281, 289, 242, 36, 143, 53, 163, 25, 143, 78, 69, 86, 223, 374, 306, 147, 54, 203, 39, 196, 130, 164, 230, 175, 243, 120, 184, 78, 88, 112, 119, 62, 222, 321, 273, 209, 117, 63, 203, 273, 117, 153, 7, 177, 106, 80, 143, 25, 71, 135, 96, 141, 150, 97, 295, 368, 228, 103, 123, 142, 101, 222, 211, 68, 111, 73, 145, 44, 82, 155, 369, 173, 217, 583, 360, 307, 51, 156, 132, 122, 150, 156, 257, 123, 88, 165, 252, 41, 252, 183, 10, 230, 226, 82, 59, 149, 353, 438, 286, 125, 268, 165, 231, 117, 39, 160, 178, 195, 114, 114, 70, 141, 215, 112, 106, 104, 92, 86, 123, 67, 103, 117, 85, 136, 257, 210, 62, 160, 226, 71, 38, 111, 154, 120, 31, 159, 35, 281, 196, 79, 141, 133, 54, 90, 153, 80, 76, 110, 80, 124, 196, 171, 284, 239, 36, 60, 188, 80, 180, 45, 100, 167, 369, 220, 93, 30, 136, 159, 179, 215, 263, 203, 260, 111, 99, 204, 72, 148, 44, 153, 64, 104, 256, 221, 201, 372, 297, 57, 184, 233, 213, 114]
2087A14J8o8k3N4J04j1N1l5j73O2Q2mM6L2m9P6j62k8k2J42R1k58J06k5KK12j42n5o1m4K6O8
1786A26m1o2J16m3%Q1r6n2J1N5K9R1K4j12l1P6m3J3K6n0M0l9%L6j1k4M3n8rN7r4J45L7M8j53
1457A36J4j19K39Lj43m3L7J03P7l8l1j75J41k1Mq3O0j32J19r2M1pk5J8Pk3J8n2J25n6J18K7
1157B47p1n6p3J62o9M5n1j29J72J07r7m1lo8J46p3o0k2J46o6o4l9L1J92j20k1q5qQ9L1N1l8
856A65k7k9Qm8J09l6l9l6J83oj59J06J1n5j00O1k1R3n4%P4p9J3k2L9J51j23q2R3pk4L1k0k8
537A42MP7m7j44J23M8o9p4J24k7o7m6R0J6m7r0J4M7K9m2M7j3P2K8n4O9l9rp6JL5j9o7J65j1
209A90j67R9j2mM0Pm8P9K7l1o5m3R0j20%Q7rM9l9l5J76K7j75r3M2J14m2j35J0L2k9J12O2j13
-111H3RQ4n4m9N9L7j0j27O9J49R9k48J64j97J4L6m9N3K00n4l6p6J64j12q7J45o5J13p9j27
$$ y = [114, 132, 64, 41, 95, 199, 188, 239, 204, 31, 93, 175, 171, 217, 249, 200, 276, 114, 86, 64, 206, 297, 39, 145, 120, 122, 334, 192, 137, 76, 32, 58, 126, 85, 23, 139, 96, 96, 177, 81, 29, 40, 95, 124, 215, 239, 127, 96, 172, 129, 142, 168, 118, 158, 119, 119, 155, 144, 120, 163, 105, 96, 153, 59, 204, 241, 289, 136, 150, 31, 270, 273, 130, 87, 124, 227, 304, 266, 235, 60, 201, 180, 184, 101, 161, 29, 148, 56, 97, 90, 65, 83, 90, 67, 85, 33, 158, 102, 220, 247, 176, 120, 47, 209, 140, 185, 134, 5, 177, 284, 187, 146, 143, 75, 221, 148, 88, 66, 212, 146, 82, 43, 74, 266, 146, 125, 40, 32, 121, 152, 203, 165, 138, 109, 117, 69, 178, 142, 103, 67, 250, 244, 85, 191, 202, 147, 47, 108, 87, 180, 126, 126, 200, 121, 134, 112, 151, 302, 179, 97, 190, 183, 159, 190, 170, 142, 146, 223, 176, 32, 155, 203, 134, 60, 184, 157, 90, 44, 134, 150, 103, 13, 27, 74, 103, 61, 108, 95, 167, 195, 141, 210, 171, 162, 86, 87, 122, 103, 36, 201, 190, 23, 122, 110, 106, 146, 153, 105, 184, 211, 180, 115, 72, 162, 42, 42, 129, 120, 169, 130, 95, 271, 298, 123, 30, 72, 186, 144, 9, 19, 51, 22, 134, 196, 83, 92, 176, 122, 73, 132, 169, 159, 32, 101, 250, 349, 101, 265, 68, 82, 118, 69, 122, 322, 268, 232, 156, 320, 208, 121, 266, 201, 314, 235, 108]
-392A08
##PAGE=	F1=8114.75
##FIRST=	19140.455529915001534,	4405.895418600002813,	0.23873513936996459961
##DATA TABLE=	(F2++(Y..Y)), PROFILE
4406A03Rom0l5J07O7j25O4K2l5L6j08J41r3M2o1J2J0k6L1oo7Q4o0J18j6j08M6R2m2l6k7O0
4096A53J1j23J21O6j92J39l5J1J58j29l6MjL7l1n9K23j68o2R5n2J26J3k5m2j88Q6k0P7j24
3814C3J21j03j4oK10R8j14j06o0R7j13J89j19L0P3m2M8j39N6p0J8O3Kj00J40J21l3m7j15n3
3533F5J01P9j15Jj19J35m4m2O9j10K7J16l1j6%%J89Q3j37r6q2L4kJ69Kk28Q2q1Q7q7P6K9K52
3223D06j78%L11k48Jk58J27o9NP7PR5j18k0O4N0j74J37m4j51K21J1j64l7J23K02P7j18k25
2950A10J59j47J30r3j10J24M6j6r8O0m0L3O7o2m6L0J0q4k3L3J9M8n4K9J08l1j35P2O9j45j9
2659D4Q6L7l6r6J60j52K16n4j39R1m3p5M6M6n4L2J3q1N2N7K9J08j2k21M3J06j39Q6j37P8Q7
2368A78K12j61j10m8N4oO0M7K6q2R1j39j4R1j11P0r0P4o9%J60k2MJ42n4k05R0K9m9o3M8j05
$$ y = [103, 112, 106, 66, 31, 138, 205, 80, 144, 166, 131, 167, 59, 200, 107, 149, 88, 100, 110, 84, 115, 109, 42, 126, 66, 184, 168, 60, 106, 198, 156, 120, 93, 153, 164, 41, 162, 228, 36, 175, 140, 151, 309, 180, 144, 148, 147, 184, 153, 94, 317, 149, 87, 182, 130, 256, 269, 244, 202, 14, 100, 80, 157, 33, 154, 51, 37, 31, 241, 339, 225, 119, 59, 156, 43, 232, 113, 143, 216, 174, 222, 83, 139, 69, 87, 150, 152, 52, 192, 313, 280, 233, 118, 65, 166, 245, 130, 131, 12, 147, 103, 61, 130, 20, 47, 163, 132, 116, 116, 116, 305, 388, 251, 155, 73, 107, 105, 274, 276, 48, 130, 49, 136, 49, 125, 154, 406, 228, 228, 539, 291, 292, 34, 161, 92, 97, 174, 181, 276, 158, 138, 202, 252, 78, 215, 171, 20, 241, 252, 88, 51, 174, 376, 453, 335, 110, 269, 122, 252, 159, 49, 173, 219, 203, 105, 165, 125, 158, 225, 163, 117, 147, 157, 73, 50, 83, 102, 150, 96, 125, 233, 202, 67, 139, 208, 63, 44, 130, 167, 131, 35, 195, 43, 259, 205, 66, 157, 114, 39, 85, 131, 77, 109, 122, 41, 93, 150, 179, 287, 275, 54, 97, 203, 64, 150, 13, 91, 178, 390, 229, 119, 71, 125, 119, 179, 226, 252, 170, 261, 122, 108, 199, 88, 158, 68, 142, 73, 73, 233, 211, 215, 357, 303, 98, 188, 217, 168, 105, 153, 48]
2068D8l1J19O6j0L8j4k00R3L9L1QJ01q6Q1j87Lm2J44L9j52R1n3J3K02j52j26m2J3PN5m1oP1
1758A20J4o3J23p0p7j8N4K1M1O0n0q8J35m4J1Lo6Q2k7m3N6n2j8N2r4O9Jj08J44O4N0j59On9
1439G0K50o1j32n4nJ37O7k9k2j52J59n7j1m4K4q5P3m0k3M9l1LJ4l3Lj6J13r7J37N2m3j07n1
1129E8R8n8M7j5j14J71Q2j23K7j5q1J47r5o9PJ25p0m3OrJ83j11rr5pQ5L4J7jl8k6ln1J45n7
800A42l1k1J68o2p7M2N9n3r8%nJ19o8K4L6r2N6m7Q1J40j28j39Q5K6n5P4Pj7m5P4j4j46J13
490A48P6l7q3N5K2n4r2R2L9k6j04Q3p5R3p2O7o2O8M6q8J05Po2o1K9Loj4J50j7k01J07o3j0
171F3P0J5p0J08L6n7n2k9P3j34J3J23l0P9p9j7J96Qj98r6L1R9m3r4lM5O1R1qj32N7R7n3j38
-148C2P1M8J6j28J15J49P2l13K03j67l4NOJ3J99l4m8j03J74q7o0J17n0J37q7j40
$$ y = [48, 17, 136, 202, 192, 230, 216, 16, 109, 148, 179, 187, 288, 202, 283, 96, 99, 57, 201, 240, 88, 179, 126, 139, 341, 189, 63, 21, 34, 41, 96, 55, 49, 120, 134, 71, 194, 124, 47, 29, 83, 104, 145, 205, 155, 67, 202, 158, 169, 172, 106, 188, 161, 118, 174, 122, 104, 156, 62, 131, 132, 24, 168, 232, 282, 123, 129, 70, 320, 259, 127, 73, 68, 205, 272, 243, 221, 69, 228, 171, 160, 116, 140, 55, 128, 88, 65, 114, 83, 86, 100, 67, 70, 54, 167, 70, 207, 259, 216, 109, 58, 156, 98, 145, 130, 16, 187, 269, 146, 173, 158, 77, 224, 129, 60, 67, 192, 122, 79, 85, 76, 259, 148, 139, 44, 37, 122, 156, 173, 172, 134, 108, 105, 54, 199, 142, 111, 90, 258, 196, 119, 161, 220, 167, 69, 69, 64, 183, 115, 139, 175, 83, 139, 92, 173, 313, 185, 46, 131, 157, 102, 176, 183, 166, 121, 195, 181, 35, 148, 224, 187, 104, 159, 181, 127, 35, 127, 166, 140, 36, 119, 44, 137, 65, 132, 70, 138, 184, 96, 201, 208, 146, 85, 114, 117, 111, 97, 247, 230, 29, 136, 73, 63, 133, 148, 78, 186, 222, 165, 113, 84, 157, 23, 36, 159, 129, 208, 129, 112, 308, 316, 118, 22, 53, 152, 109, 15, 12, 57, 118, 209, 201, 69, 126, 223, 170, 32, 103, 151, 167, 39, 154, 303, 375, 62, 265, 98, 64, 69, 75, 88, 287, 253, 205, 102, 276, 189, 129, 246, 196, 333, 246, 106]
-392A06
##PAGE=	F1=8035.99
##FIRST=	19140.455529915001534,	4405.895418600002813,	0.35531070828437805176
##DATA TABLE=	(F2++(Y..Y)), PROFILE
4406I8PPm4l3J05O0j38P6L9k5K9q5R5j28P6k8K1J2n7O2o5n8J06m0J20j2j16KR9j8k7k2O4J2
4087A94j42J24O7k30J23j5M1J18j30p3P3K%m5K4J75j57o8P3j6J39j1p3l9j05J5K4N9j02J20
3805A65j32k2K9J91N0j45k4n1M0qJ49j36K2O5k4L4j32K1l5L7P9Pj36J21J20j2m4j08o4M9R6
3514B02o5k5q6R1k6o4P6l3k8J36k5o1%N5J71Q7j45n7j82O3K8J78J7k79J01r9Q6p1J20j2K61
3223D14j58J9K42k95N9k30R4r0J6J05K0Q3r8j5Q2j2j27P5l8r5K02J6j59m6J08K01N4o5k49
2950A13J66j75J71q7r9O9Q3m0r6R1l3ON0k1n8K7L2r2o8O0jJ01q5J6Q1m1r6N3J08j46j5O9L4
2641A77k6j19J90j77J86j4j56J06m9n6OK6k7O9Kj13L7O4K8J16K9j96K0P7j56P3r7O4Q4K02
2359C70j62o1m4Ol3J01N1Lj08J33j18m1O1o6P5q0L9m8k3J43j7M1J19m7j68N3No3j9O3j30Q
$$ y = [98, 105, 112, 68, 35, 140, 200, 62, 138, 177, 152, 181, 96, 191, 63, 139, 111, 132, 144, 87, 149, 84, 26, 132, 92, 212, 200, 84, 86, 185, 167, 140, 118, 182, 194, 52, 176, 243, 13, 136, 121, 162, 280, 150, 77, 150, 152, 152, 107, 131, 306, 149, 81, 154, 138, 277, 266, 193, 154, 49, 64, 88, 147, 45, 165, 33, 11, 40, 231, 281, 136, 112, 61, 101, 93, 242, 106, 128, 193, 169, 203, 71, 92, 57, 94, 173, 180, 44, 165, 285, 273, 229, 121, 57, 106, 202, 137, 112, 26, 117, 91, 27, 103, 70, 42, 178, 153, 92, 92, 147, 318, 405, 260, 203, 21, 84, 112, 290, 307, 28, 129, 30, 116, 45, 165, 153, 414, 256, 275, 517, 222, 281, 51, 145, 55, 71, 176, 196, 279, 181, 166, 248, 236, 109, 184, 146, 51, 253, 269, 110, 64, 172, 373, 427, 362, 113, 279, 104, 275, 188, 89, 158, 241, 201, 105, 196, 163, 169, 219, 198, 140, 167, 199, 107, 39, 99, 98, 199, 114, 130, 211, 170, 74, 127, 235, 89, 74, 143, 177, 151, 32, 222, 45, 231, 217, 61, 167, 118, 62, 68, 94, 67, 136, 138, 25, 62, 126, 154, 270, 299, 103, 123, 200, 44, 117, 20, 84, 168, 370, 208, 147, 103, 109, 76, 177, 228, 231, 123, 256, 138, 97, 158, 92, 167, 87, 126, 78, 55, 198, 181, 222, 341, 294, 126, 179, 184, 121, 102, 165, 35, 43]
2058D3J37J5j8K4J5j65N2K7O0l7J58j08P5k01L4n7J30j7l7P3q9L2J67j32j33O1KK6n8m0P4
1767A13jM3j06J45k7q1m4P9j4mP0J7j41J59l2K0k5o8J03j5p7Q4q4nL5j29J46m7p9R1Q3M5j64
1457I0L3j1K30j15j10n2j8J52L5k8k0j02J51q6j4j1%k7jJ9rN0k8k8lk9rJ2P5j07J50O7j6j43
1138I7j8J9n2N5K2q2J47M9j44R1k3q7J48j07q3M4Q6p3pL4l6J62r2j4q5j8Q7M1j8K3m4mlp8
819C7J60o6k3lJ41j17K2l0J07m1r7l5rJ30r3R2j0j11J02o7J12J05j21j65O5P4j22J10M2nn8
528A26M6Qj43R6J00or1qO1m1j24P9P2qj12J47j03O5q0Q0r3K5P0j02J10P4r7p6N0nJ0K0J23
218B73k4k12J03q6j7R6%q4J30M0p2l3j0L8j02k2J51m6J00j14J9J97j8k02o6J5N1l0o7JQ2R4
-83A85O6o4j25R4J09o7j57M5P6Kp4J07J23M9l19J92j11n2m4L9k3J86k0n1j31J74m5l7R7m4
$$ y = [43, 180, 195, 177, 201, 216, 51, 103, 130, 190, 153, 311, 203, 278, 77, 111, 54, 184, 167, 130, 203, 114, 146, 313, 181, 48, 109, 111, 137, 79, 39, 113, 112, 155, 49, 194, 167, 86, 42, 121, 107, 103, 173, 190, 49, 208, 176, 196, 171, 103, 206, 191, 114, 198, 114, 109, 144, 15, 161, 114, 35, 126, 209, 254, 90, 123, 112, 342, 227, 117, 65, 47, 199, 234, 206, 186, 84, 235, 149, 135, 124, 124, 97, 96, 115, 106, 156, 128, 100, 97, 68, 59, 71, 146, 39, 189, 256, 240, 97, 79, 98, 46, 101, 123, 41, 188, 237, 93, 184, 161, 74, 222, 115, 32, 76, 162, 89, 82, 116, 80, 242, 150, 136, 51, 33, 120, 161, 143, 166, 122, 118, 115, 37, 197, 131, 108, 105, 246, 129, 151, 121, 228, 187, 90, 55, 46, 176, 83, 175, 165, 54, 156, 89, 201, 306, 185, 20, 85, 159, 37, 147, 189, 184, 126, 172, 180, 37, 133, 233, 227, 136, 128, 189, 148, 24, 103, 175, 167, 55, 202, 99, 164, 84, 164, 71, 96, 166, 64, 174, 248, 151, 75, 125, 120, 130, 150, 273, 249, 37, 140, 54, 37, 133, 133, 49, 179, 219, 147, 114, 104, 142, 40, 18, 169, 123, 223, 109, 128, 325, 307, 105, 39, 54, 105, 75, 8, 9, 91, 185, 251, 187, 62, 156, 265, 198, 41, 86, 162, 164, 90, 197, 320, 369, 50, 242, 131, 79, 35, 74, 51, 237, 217, 166, 35, 209, 164, 127, 224, 180]
-364A80J51r1j39
$$ y = [180, 331, 240, 101]
-392A01
##PAGE=	F1=7957.24
##FIRST=	19140.455529915001534,	4405.895418600002813,	0.3215439915657043457
##DATA TABLE=	(F2++(Y..Y)), PROFILE
4406A01j7K1l4mO7M7j22O0N7oJ1n7M4j50R7JL7J5p8Q4j06n9J26k1J08pj16k5J08mql1P1j1
4087A99j43J29O1k17O9nO9O6r6k2M1Pm5l1P5J23j30o9M9OJ54j2j18n5l0k9K9O0p1J05j42L5
3786F2M8Q7J0j51P9n5k5P2J00j32L1M3kL0j08l5rN4P9J3j43J17Q5J2n8q8p4%J09rm2o2N5k5
3467F8l6L7M9m5J14k1r5J8Q4J50R0j56k0j88M3K2J51L8k86R5q8O2o4J76m5K38j38O5J96l63
3185A51J17j71Rq0L2J05K7Q0p5l3J18o6j06N6l6m5J85J1j50m2O8K10K4k3k30J74j55J52j10
2913A97r7K4J18n2p2Q6k9j2L6Rn0LM5o1l8Jk1J46j08J2N6p0l9O4J40j67l1O2K7qj33J98j87
2603D9J59J2j40R1m3m8m1MJ1J00jq4j7O9k1J32P5j60j5M9j56O7m7K9P0J69j51Pn3k9n2J28
2303A63M8qj33J80r1r7M2oP1p7Kk7j2J00j9Q9J10o6j28J9k2o2K6O3j09J7J28k9l2J8N3j09
$$ y = [101, 84, 105, 71, 67, 134, 181, 59, 119, 176, 170, 181, 124, 168, 18, 115, 116, 153, 168, 90, 174, 68, 9, 135, 114, 222, 215, 99, 74, 182, 178, 170, 139, 210, 199, 56, 185, 246, 29, 98, 93, 162, 228, 132, 110, 151, 158, 113, 82, 157, 280, 150, 81, 130, 136, 290, 278, 160, 105, 75, 46, 75, 135, 64, 169, 27, 62, 110, 197, 207, 56, 135, 80, 55, 127, 227, 95, 126, 169, 167, 197, 89, 54, 45, 99, 178, 191, 48, 165, 250, 262, 204, 116, 42, 42, 151, 142, 100, 38, 93, 68, 32, 69, 118, 73, 187, 166, 71, 89, 173, 323, 413, 257, 237, 49, 92, 114, 265, 303, 17, 112, 24, 86, 22, 198, 153, 391, 253, 318, 514, 151, 268, 97, 106, 26, 58, 163, 190, 270, 195, 162, 280, 214, 108, 164, 128, 83, 268, 279, 129, 87, 155, 365, 389, 366, 136, 310, 155, 307, 197, 100, 124, 242, 190, 118, 204, 175, 163, 199, 208, 158, 161, 206, 145, 107, 108, 87, 233, 125, 137, 193, 123, 84, 148, 288, 121, 90, 152, 179, 171, 38, 236, 49, 208, 220, 80, 171, 128, 80, 39, 43, 54, 154, 153, 69, 52, 121, 100, 232, 307, 147, 132, 181, 25, 92, 45, 74, 144, 313, 162, 169, 116, 87, 35, 163, 211, 203, 70, 250, 159, 62, 104, 98, 169, 92, 94, 67, 55, 155, 136, 225, 335, 269, 141, 160, 138, 76, 102, 165, 56, 73, 201, 172, 140, 158, 211, 102]
2002A02k4L4Q7q6J91j03O1k03N8o2J04o4O5N1j25N8J16r2n5O7OM6j14m0P9m7N2j31J47K6p3
1711A31n5Q8l0k3M6P5j81J41j5L9n2n3J01lj05J16j00mOr4J53q1l3K1R0L3j66R7oJ98j46q5
1410A03l0L8J18k2m9k7k9J18j02lJ0rJ7q0P4M1K6k2l9m2j1j4K1Rr3J62P2Mj55J4m2nJ6M5m2
1082G2J11Qj57J44k5q7J50r9j03P5M5q1L4N0m6J30p4k5o0l2R2M3l4K9n2K5Kr8J30n2k6K4J00
772B13j36R9j01J48k9r0k5m5J22j13J81o4j05J11p1J31O0j04j21M2R8j59P0Q2Ro2J9J0j31
500C9P5J15J3r4m2Q0l6j29M7J11J0j19J85j19M3o5Q2j05l1Q3o1N9J34j14j08N9KK6M5R1l5
209B41k02Q9q0QR6m5o5J21L5n6pj5km5n7J45o2J18j40O6J83m6k00k3K6l6%k5J7R3Q0M1r5q8
-111G0J04J18q6j34K5R3l6l1R2Q2M0k55J26m5m8o7K3m9J63j7m6p4Q7Ok5R5n6J60r5j25
$$ y = [102, 78, 112, 199, 113, 304, 201, 262, 59, 117, 55, 159, 95, 160, 211, 86, 144, 260, 168, 113, 180, 186, 232, 118, 78, 157, 110, 162, 31, 178, 204, 131, 76, 164, 134, 111, 157, 232, 51, 192, 177, 216, 164, 111, 212, 209, 104, 220, 120, 116, 122, 28, 181, 100, 67, 88, 178, 211, 45, 142, 136, 334, 188, 103, 73, 111, 229, 207, 158, 131, 102, 220, 118, 115, 125, 116, 133, 53, 127, 168, 194, 172, 133, 91, 80, 66, 87, 96, 3, 165, 237, 241, 86, 100, 58, 53, 69, 114, 72, 183, 191, 34, 178, 153, 66, 216, 117, 14, 89, 134, 53, 87, 137, 91, 221, 147, 122, 62, 30, 122, 165, 131, 160, 108, 133, 135, 37, 167, 115, 89, 113, 213, 77, 176, 75, 223, 194, 104, 79, 34, 156, 43, 224, 160, 55, 166, 95, 226, 286, 182, 61, 103, 201, 42, 112, 194, 203, 141, 160, 170, 39, 114, 229, 242, 148, 106, 186, 150, 21, 68, 179, 189, 70, 255, 136, 179, 114, 196, 91, 60, 143, 82, 141, 275, 161, 53, 112, 114, 140, 185, 276, 241, 39, 128, 48, 56, 152, 107, 42, 163, 198, 142, 135, 120, 118, 73, 16, 161, 99, 217, 77, 143, 326, 280, 80, 57, 83, 47, 47, 22, 39, 132, 212, 253, 158, 70, 174, 292, 206, 72, 97, 190, 154, 123, 215, 297, 337, 82, 208, 163, 115, 48, 71, 22, 185, 168, 122, 48, 135, 141, 116, 211, 155, 315, 220, 95]
-392I5
##PAGE=	F1=7878.48
##FIRST=	19140.455529915001534,	4405.895418600002813,	0.2947101593017578125
##DATA TABLE=	(F2++(Y..Y)), PROFILE
4406A17o3L2j5K6L1M1r1K3O1J9j6k3Mq1L1J1O0J5r0R3j27m2J17oR1pj08l2J19j0K0n7Q1m5
4087A79j30J39N0k01K5JP9J2k4P4m8Pq4J1Q2P7j01n9K1J8J67Kj37r6L1l8j0P8m3P5j45R6N6
3777A64j1k4q1J22o1n3Q9N1j24O7J5J1L3r7o5MN9O6J9j18J18M1K9q4p0o4L0L4M3m1n4L2m4
3467C6M6m3J17m1R5k9j28M8Q3J23R1j51Jj56K9j4J01O1k26O0p0K6l6J97o6J83j18J09J69m19
3185G8J64j05q4m9N8P9K2Q7m5p7J61q0j29O0mk8J69Pj43l5M9K30Lk7k01J82j23J21j54j01
2903H5PJ27m4l2M9l3k3L3K5k7l7M7j1%n5m8J76j16J1L8q3OR6J41j87n4P2RJ2j25J73j63J25
2594A94J2q8N6m1m8p1MK5J20km8l4M3r3J46J23j24m7K9j41O4k0JN7J13j27P6p3l8n7J23M4
2293A78jj56K21o3j56P7J7M2p7l5oK6M1k4J35J21j02r1j3n0n3O9N6o5JR8n4m8J7R9n5r2M6
$$ y = [117, 54, 86, 71, 97, 128, 169, 78, 101, 162, 181, 165, 142, 146, 65, 96, 107, 167, 182, 92, 185, 58, 16, 133, 127, 218, 211, 103, 71, 190, 180, 200, 143, 224, 179, 49, 188, 238, 37, 62, 63, 142, 154, 130, 204, 156, 163, 79, 90, 172, 249, 148, 89, 110, 128, 295, 297, 160, 64, 95, 57, 47, 125, 82, 157, 12, 108, 164, 153, 129, 48, 170, 109, 56, 145, 196, 72, 139, 154, 165, 198, 101, 36, 40, 99, 165, 184, 66, 184, 225, 254, 170, 100, 36, 66, 100, 143, 102, 48, 80, 36, 82, 39, 156, 115, 210, 181, 53, 101, 184, 307, 398, 247, 248, 92, 121, 107, 208, 269, 43, 103, 33, 59, 23, 220, 154, 337, 219, 328, 497, 78, 242, 137, 53, 4, 62, 141, 163, 250, 205, 128, 289, 209, 80, 140, 136, 108, 277, 284, 141, 106, 155, 385, 388, 361, 160, 342, 219, 340, 186, 85, 92, 219, 175, 143, 192, 159, 136, 169, 194, 167, 130, 177, 166, 166, 111, 63, 239, 123, 134, 172, 89, 95, 191, 332, 145, 91, 163, 172, 184, 59, 232, 69, 194, 206, 118, 174, 133, 85, 14, 18, 43, 163, 161, 113, 79, 122, 29, 175, 298, 174, 127, 156, 15, 79, 59, 60, 117, 230, 103, 179, 106, 68, 11, 134, 178, 177, 21, 242, 179, 23, 100, 117, 159, 82, 47, 41, 67, 108, 84, 219, 340, 238, 147, 134, 84, 31, 100, 156, 91, 92, 190, 136, 88, 105, 204, 149, 57, 103]
1983A03J07j34J87p7N1j92P1n8P4p3J17K7j47Q0O0m3J5N4K3N8j32n3N5p3N5j37J35P5n8n4
1702A16P0l2l4M4J14k19J08pO4p0k1P7Pj30J49j09j9k4k5J27j04Ql0Q5J4j12J33m0J59j49
1420A50o5RR4Q7p7r0m3N1P1j03K0J6LL5j39J05R6Kj8l0p9OpJ2p8L3P7O7K0j31K8n9M4l5L2
1091A04mP2l5j11J36k3p9J38p3j03P8J9j01P4N8m4R3o5k9k7l1Q3L9k9K0n9M2Jq3N4qn1O1M8
772A65p0R2j53J72k2p5Jr2J05n4K01j28o4Q5n9J39J6q3p9N6J00j62j0J19K4o7oQj10M3J22
481B14J4r0k8P5m8r5MJ30L3j26J92j35M3l8O9j13m2N8lJJ69j23j36N2PM2O9O6n1j83P4n3N1
171I9Q4j11jP2J7pJ6m5l6J7n7R8q1J34j39R6J60o5k06L3M4j05K9J1L2Q3K5J7q8m7Q9J31r7
-139B02r9K4Q4o7j1P0L7N2j74N8J5n0p3Oo2J25j7l7K4l1N3k7J04p2J59j03r9
$$ y = [103, 210, 76, 263, 186, 237, 45, 116, 58, 132, 59, 176, 203, 56, 136, 196, 153, 168, 222, 245, 303, 171, 118, 173, 100, 155, 18, 153, 228, 170, 116, 186, 154, 120, 164, 278, 59, 167, 160, 224, 154, 133, 210, 217, 87, 236, 127, 108, 84, 59, 186, 82, 90, 60, 145, 159, 47, 180, 140, 299, 150, 85, 94, 188, 275, 198, 108, 65, 116, 187, 84, 104, 120, 123, 158, 19, 124, 220, 222, 204, 174, 95, 101, 94, 106, 28, 61, 138, 205, 225, 94, 122, 63, 107, 72, 104, 100, 172, 137, 26, 162, 139, 60, 198, 125, 22, 100, 119, 18, 92, 150, 106, 199, 134, 105, 78, 47, 130, 169, 140, 160, 101, 143, 144, 61, 115, 107, 56, 117, 165, 95, 187, 34, 206, 184, 109, 110, 18, 123, 69, 270, 142, 78, 163, 104, 243, 259, 176, 97, 153, 253, 91, 81, 200, 224, 157, 151, 159, 49, 92, 214, 228, 138, 110, 185, 137, 42, 46, 176, 209, 83, 275, 140, 183, 145, 214, 101, 59, 117, 114, 115, 284, 161, 25, 77, 84, 126, 195, 261, 210, 27, 101, 48, 99, 183, 72, 71, 143, 160, 153, 169, 124, 88, 105, 48, 146, 65, 199, 60, 156, 316, 251, 45, 78, 122, 17, 46, 57, 89, 172, 197, 214, 126, 79, 168, 299, 202, 103, 127, 211, 144, 133, 203, 240, 292, 118, 176, 191, 141, 68, 74, 12, 137, 120, 83, 107, 76, 129, 102, 206, 134, 293, 190, 91]
-392I1
##PAGE=	F1=7799.73
##FIRST=	19140.455529915001534,	4405.895418600002813,	0.32819855213165283203
##DATA TABLE=	(F2++(Y..Y)), PROFILE
4406A41j08K4RN1J1M6p3%L5M6m6J3qj9k5JP5J6r4R0j31j9R2MP3j0r5k7J21k8N9j00R3p6j09
4077C2J52M1j85j1J3O4k8O3J48j27Kr3M5O6M9r2l5j4K8J70J8j27j21N6l1o9J05k7L3j07J22
3786A40M8p4m9L5J01o4m9N9J4j23J26j4RL2j03m7ON3L8K1o9J04K4L3j12o2k0P6o9P2j9n6K1
3476H2n6J07q7J37k3R7n3j67P2O8Q7Q8j20Lj20L4n8L7Q9j44N2p6J8J1J53p7J07j00J37J51
3195D49m11J58m1j30mM3N5NR5pj39K01m2j48J0O3l2J49J4j31m3P5K50Nq1j91J77r5J04j98
2913A60j06K7R6j9J3mm3k9M1L6Lq6L2M5M2q9r4J93j04OK5m8PJ25J17j87p8R4j9K8j06J35j09
2603A04P8lj4J1m8n2k3K6m7J34j0j5k2Kp1N7J62r0o3J6j10M8j0j7M8M5p9J20j01om5P1M8J1
2284A55j39K16m2j12P8j6j2p0n0J1O1j7j8J55J50j28p1m9n5l2P9M8k0k6N4l6p4J9J29j2r9
$$ y = [141, 33, 57, 66, 117, 128, 174, 101, 101, 136, 182, 136, 149, 141, 122, 97, 98, 173, 189, 95, 185, 54, 35, 127, 131, 204, 194, 99, 72, 193, 165, 224, 124, 217, 141, 32, 184, 225, 40, 29, 42, 106, 78, 141, 289, 162, 164, 71, 116, 182, 231, 139, 104, 90, 118, 288, 306, 179, 58, 114, 83, 14, 119, 92, 125, 18, 140, 188, 114, 65, 100, 201, 137, 88, 147, 161, 38, 164, 150, 159, 191, 88, 41, 47, 100, 138, 159, 90, 194, 218, 251, 139, 77, 57, 133, 64, 136, 117, 61, 82, 26, 133, 46, 183, 160, 257, 204, 37, 109, 177, 264, 352, 232, 235, 115, 149, 91, 128, 217, 73, 125, 49, 67, 78, 231, 154, 261, 161, 298, 449, 38, 196, 155, 25, 21, 64, 119, 124, 219, 212, 73, 274, 232, 84, 94, 157, 125, 274, 288, 157, 114, 189, 439, 444, 363, 172, 349, 254, 358, 160, 54, 81, 177, 158, 171, 167, 124, 95, 136, 172, 175, 89, 121, 166, 208, 119, 25, 218, 114, 120, 145, 97, 104, 229, 346, 159, 81, 175, 156, 184, 78, 213, 104, 182, 179, 165, 176, 128, 76, 53, 79, 32, 166, 156, 141, 119, 121, 50, 107, 269, 179, 116, 132, 22, 70, 60, 43, 91, 136, 57, 177, 76, 70, 25, 96, 144, 155, 16, 232, 190, 78, 156, 140, 128, 58, 8, 19, 80, 63, 45, 200, 350, 222, 151, 102, 47, 15, 94, 142, 122, 96, 150, 114, 40, 59, 188, 176, 77]
1993G7M7J08j62J28m4N2j69P5n2M3j3R2Lj28P1J9j2O5L1M9N6j31o6K2q8O3j28J16J05m3l9
1702A47L0l0n1Q5J37k57R8k9Q2o5J8M3J1j49J70j05n0m9L7J03j22N2o1O9j1MJ18r7J17j29
1420A16n0N3J38N5j16j19n9R9K6q7M1J2L2K8r8M5J39j3k4oj03J5JOq7Q2qM9L7q2J9n8O8m8
1101A03qK4L9p6kO3j7n7R2l8q5P1Qj03Q2N6l7N6n9j6Kj7N8L0j6Qo3M2lm7l2N8q0P9pL6M0j50
744C4J54k2o0L2j04M6O1J59j97MM5l6J41j9p3m4P0J00j65o3J40M2o3m4J9q9JJ20Jp9K0O5p1
434A25n1pR6O0j33J80j60O8j0M1j16j6J9L2k6J73j27j16J8k0N5R3N4o8j59N9%P9O9j73O6K0
133A25j5N5L7q5o3P6n1N1q4J39r5P5J32o5k05P9N5q2pK3N0O1n7pm6j8N5J53r2o2K8N0p1j6
-186A23M5%Q0j06J6N3o5p5K0p4Q6Qj8N5j01Q5m0J09p6J41j10o0
$$ y = [77, 124, 232, 70, 198, 154, 206, 37, 112, 60, 103, 90, 182, 185, 57, 128, 147, 135, 200, 231, 280, 336, 205, 139, 161, 73, 136, 8, 124, 229, 186, 147, 177, 147, 96, 181, 318, 61, 159, 130, 212, 147, 165, 208, 219, 70, 240, 135, 85, 36, 73, 176, 54, 106, 45, 114, 103, 107, 225, 128, 245, 116, 66, 119, 257, 312, 196, 77, 18, 117, 143, 56, 97, 109, 141, 169, 71, 116, 255, 242, 218, 212, 109, 124, 125, 131, 44, 126, 118, 167, 204, 122, 141, 83, 151, 103, 95, 119, 158, 82, 80, 143, 126, 69, 161, 123, 38, 109, 117, 14, 96, 152, 115, 171, 112, 96, 98, 81, 139, 169, 153, 161, 98, 140, 137, 90, 58, 116, 36, 115, 108, 144, 184, 34, 188, 166, 106, 138, 34, 80, 141, 300, 103, 107, 152, 116, 257, 238, 165, 121, 191, 291, 126, 63, 203, 245, 182, 138, 157, 68, 69, 189, 190, 111, 131, 196, 125, 74, 67, 163, 223, 90, 270, 110, 178, 168, 209, 93, 77, 96, 128, 102, 275, 148, 32, 50, 30, 85, 178, 232, 164, 5, 64, 64, 143, 212, 39, 105, 125, 110, 165, 202, 117, 54, 130, 79, 130, 46, 185, 90, 165, 297, 232, 27, 106, 161, 79, 72, 95, 145, 206, 149, 142, 96, 78, 133, 286, 194, 132, 160, 210, 139, 123, 168, 168, 248, 142, 158, 211, 146, 71, 91, 17, 103, 111, 93, 148, 47, 132, 92, 201, 125, 266, 156, 96]
-392I6
##PAGE=	F1=7720.97
##FIRST=	19140.455529915001534,	4405.895418600002813,	0.23287037014961242676
##DATA TABLE=	(F2++(Y..Y)), PROFILE
4406A65j11k5K4O7J3N2o5pj1P0p0M6MJ2n5rO9J9q6P4j14rO2J4N6j5p4k8J11m9J11j47R1q4
4087A01r1J65L5j63m3L7M8j1Q1J92j86qo6N6N0L6j13mn1M6J60K4j02j06M7k8q9R8k4j3k2R6
3786A52L0r1n2J01Q5o9m3K3mj26J88l9lJ5j17J3LM6qK1j1O5M5K3j30o3L5J01j25N4J8n7J5
3476I5k8J06r3J20LJ14q6k08Q2M7M7P6o2rr4N3r3k8J15o5P3r7L1L3R8p7K7p8J34J43k88N0
3176A41Qq1j9OM5j4R5L1j71J97K4j13j21J37l2J22L6j08p0J17K69K0j39k11J46o9R9k19j06
2903B0N9N1J0N0n5n2l0N6N3L1j06l0Q9Q5q8j16J50o5j2J2J5j9J41P2j58r1J08m8L3q0R7l9
2603A43K1rN7l8o0n8M3L8j17J53l5RJ0l5lo8J70n7n5Mo8K1j7k3L8j8K8R0j32O2o4N2M8Qr8
2274D0J76k1m8N9n0p8m7J4oN2o6L5J06J94j27p6r4K9l6K4M5J9n7ML2o3MR4J8n9N4R2j60L0
$$ y = [165, 54, 29, 53, 120, 133, 185, 120, 113, 102, 172, 102, 148, 152, 164, 109, 100, 169, 188, 102, 176, 62, 53, 115, 129, 185, 170, 96, 68, 179, 130, 241, 94, 185, 101, 10, 175, 210, 47, 4, 41, 89, 78, 159, 351, 165, 157, 91, 147, 197, 233, 120, 116, 65, 111, 271, 295, 193, 87, 134, 106, 17, 115, 91, 78, 56, 152, 182, 91, 39, 140, 225, 156, 113, 136, 132, 6, 194, 155, 152, 167, 50, 63, 66, 112, 104, 125, 114, 179, 224, 247, 117, 54, 89, 190, 65, 119, 137, 80, 95, 67, 173, 80, 200, 203, 317, 231, 23, 105, 152, 199, 275, 213, 204, 110, 163, 70, 42, 157, 92, 165, 68, 99, 132, 230, 153, 180, 102, 236, 379, 91, 141, 149, 68, 49, 55, 100, 86, 181, 212, 41, 238, 262, 149, 28, 165, 133, 255, 291, 183, 113, 230, 499, 519, 380, 169, 315, 246, 345, 126, 20, 79, 130, 140, 190, 135, 83, 53, 109, 162, 193, 87, 57, 146, 231, 143, 27, 177, 112, 100, 112, 127, 108, 249, 321, 163, 72, 180, 132, 165, 85, 182, 143, 164, 155, 212, 174, 114, 56, 99, 137, 20, 173, 138, 147, 157, 122, 119, 51, 221, 164, 109, 113, 45, 66, 49, 26, 64, 46, 74, 164, 32, 94, 30, 82, 130, 138, 40, 216, 195, 147, 206, 156, 78, 31, 45, 39, 91, 25, 60, 166, 360, 233, 157, 63, 92, 56, 80, 125, 144, 87, 91, 123, 60, 64, 158, 176, 117, 171, 263, 103, 133]
1955A33k2O4j32O9n5J7O0N3k1q0M2Qk0R1MP7L8j17p1j1r9P4r9R9J03l1j5j9k9o9J54J41k87
1645E0J29q2Q1k5N1MJ0j57J70q6q2l2L7Q1j36J11p8L9l8J22R7j56P2r8l7R4J68J2j35r7l6
1354E3M8ln9M8J0O6Nl4j4J52j4m2K0j14K0NJ4n5Q1p3J9N9l9Oo5Q4m1m7M0J5j12R4Jrk5J0L
1007A07n7O5Jp8N7M5l0K0m6J5K1jK7J5olo3L6noo2P9o8L6m0J21oj09J18k4o1P0q3l3J66R2
669C10k63R2klJ40m1q4k0Q0J00j61q5J40O2m4r4M9q8l9J09j9o4P4O1q2k2oL9R0j39J63j91
368F2J08PJj04PPK8j3J52j29n3L1m6j6R6N6p9p4pO0Q4N0k08J13k0n5J07N5j13p8J18m3J0n5
49E9J25m8L0J03m6j53O6N7o2l3L0O6L5j39l6J4J1qJ88p1l2L2ln1l3L3k0J03o1JO2q8p1N7r5
-280B2O5O8mK2j25J02o1R8n8J02j12q
$$ y = [133, 111, 175, 43, 112, 57, 74, 134, 187, 166, 86, 128, 136, 116, 207, 211, 288, 326, 209, 138, 127, 28, 102, 3, 102, 205, 174, 159, 140, 111, 42, 196, 337, 50, 179, 97, 178, 153, 204, 208, 218, 61, 231, 145, 63, 31, 68, 149, 13, 124, 46, 85, 47, 169, 266, 110, 182, 84, 47, 141, 309, 321, 186, 89, 53, 101, 98, 39, 87, 97, 163, 168, 134, 120, 272, 258, 216, 236, 122, 142, 147, 161, 106, 187, 114, 133, 192, 153, 159, 94, 178, 137, 90, 130, 145, 33, 127, 128, 119, 94, 104, 107, 50, 115, 116, 38, 95, 140, 110, 130, 84, 99, 120, 119, 146, 161, 155, 152, 89, 125, 120, 114, 52, 131, 63, 99, 59, 180, 174, 65, 183, 159, 98, 168, 85, 52, 218, 310, 47, 139, 137, 134, 274, 233, 149, 129, 209, 309, 148, 63, 203, 265, 221, 127, 176, 88, 49, 158, 139, 75, 149, 210, 128, 106, 100, 139, 229, 90, 253, 62, 170, 177, 178, 74, 81, 88, 116, 103, 255, 126, 73, 104, 58, 42, 138, 194, 115, 41, 34, 94, 178, 228, 20, 133, 113, 58, 165, 220, 107, 29, 147, 104, 114, 59, 184, 136, 166, 269, 223, 70, 136, 193, 131, 98, 128, 194, 229, 90, 54, 68, 79, 71, 259, 188, 156, 188, 185, 134, 101, 134, 114, 217, 156, 157, 219, 131, 60, 117, 22, 87, 155, 151, 173, 48, 150, 89, 187, 129, 231, 119, 111]
-392A11
##PAGE=	F1=7642.22
##FIRST=	19140.455529915001534,	4405.895418600002813,	0.1150528639554977417
##DATA TABLE=	(F2++(Y..Y)), PROFILE
4406A82r4n6JP3L3M8n0j4o1Q7q1P2K4J9o8nM0K9o9N5q5j1K8K1M8k3m3m8R1o6J73j50M0n5o1
4077B4J35L1j35l9L7O7K7L1K07k26k1k1N8M3K4j49K6q8P6J36K0p1p5L6l5q0O9k8n4O1O0Op2
3767H0l9J20Q1p4m4j1Jo2J69o2qj9j09P4lM3o4K1M2MQ8Kj29n5P7J06j38%O3m9RmQ2q1R8L0
3429B39J28j17k31O7L0K1M3Mj6r0Q1j06j6O9qR7j07L5M8M6o5k9k4N5J56j69m9L0j9l0l1M8
3129I0l1Q4N5j07R4R0n9j41P7j6R1O3p3r8J29K85L7j62k41P2m0R8k07o0M1L8J2P0r0n3kM7
2828I3Q0M4p8q9O4J21n6j03N1pl7jO0l9J41K1j07q2J01p6K5n4P4L2m4J5J03q8o7o3J04M4j68
2519A4J74o9J1O0o1M1q5P6k3l7rj4Nn6pQMQ0L3j29J03r8R8K0j8o7J40M%K4o5j38J7K9oL7q6
2171A0R1K8K36j07r5j43J40p3k8M4N4q4m0J08m3ORL4LO9P4j50l1m3Q1q7N8p8PJ21K5m1m3L0
$$ y = [182, 88, 32, 33, 106, 139, 187, 137, 123, 62, 149, 68, 140, 164, 183, 115, 110, 150, 179, 110, 165, 80, 69, 97, 118, 166, 143, 100, 52, 143, 77, 250, 100, 140, 85, 24, 159, 190, 55, 16, 53, 120, 147, 178, 385, 159, 138, 117, 175, 218, 242, 93, 119, 31, 107, 243, 263, 192, 117, 153, 118, 38, 107, 79, 25, 86, 146, 152, 80, 41, 161, 242, 168, 124, 113, 114, 52, 221, 159, 151, 132, 23, 97, 94, 137, 73, 94, 136, 140, 228, 230, 101, 46, 123, 229, 91, 91, 154, 105, 114, 110, 192, 111, 209, 239, 367, 250, 19, 86, 116, 137, 180, 184, 168, 78, 159, 53, 37, 106, 98, 195, 88, 123, 171, 217, 152, 123, 99, 154, 310, 141, 92, 122, 103, 73, 42, 90, 59, 143, 198, 91, 185, 275, 216, 75, 152, 136, 227, 290, 217, 119, 248, 533, 570, 408, 167, 239, 199, 297, 90, 30, 71, 109, 121, 191, 101, 48, 46, 93, 173, 217, 139, 50, 114, 235, 179, 76, 127, 120, 83, 82, 142, 103, 244, 265, 158, 76, 177, 101, 126, 72, 146, 178, 134, 149, 252, 164, 97, 34, 138, 182, 14, 188, 119, 130, 190, 129, 170, 85, 161, 138, 101, 92, 78, 83, 27, 20, 28, 32, 112, 145, 16, 119, 21, 119, 139, 121, 54, 194, 198, 198, 222, 157, 19, 36, 65, 59, 96, 10, 101, 129, 365, 258, 163, 20, 160, 87, 59, 103, 157, 73, 33, 141, 98, 104, 113, 147, 150, 219, 293, 143, 112, 69, 150, 63, 121, 43, 50, 171, 196, 155, 112, 142]
1852A42Pn5R7k2J05Or4o5l3n7K5m1Q4O8l3J2n8j5k3J45J30k96J77j30M5N5O5k8Lj56J47m6
1551A61r7J3k4N9p8J14r0Mj7J78P0j99K6o1k7J19J85l8j37m2m4pok3L6J1R2k3L5n1J32ko9
1241B00M3j19L6lL3m2R0j15j6Q0j5Kp4Q7j9p3M8mj26J50m3oQq1M7l2O1j2n4L8K2j5rk2M1L6
903A42J5rnlj0o3M2QRl3M6m9k5j4J42k7p5J04k3q3J13o0n8K01J6k70J34m3L4J40m8j16pQ4
584B09J04j49q3J22Q0j6j30P1j02o4Q2l7m4J10O0o9j2pj8J14j36J48j81J07Pm2m6j5L2j4L4
293A15J13j23RO7m2o5J2O3p2Ql7P1P7L0k01J27m4q5J26P1j12p4J23l2l1k2J14j2j5P7j9j01
-7A16M5N6n1n5L9P5J3j63pk4N9q6K08m6qL9p1j6m6N0j4Q5l3%M8j01p0R7j06N4J21Ok1j18R9
-336A74q4P3k7M8r9M4
$$ y = [142, 149, 94, 191, 169, 274, 280, 186, 121, 88, 31, 56, 15, 99, 167, 134, 146, 88, 73, 50, 195, 325, 29, 206, 76, 121, 176, 241, 213, 216, 60, 207, 161, 64, 77, 53, 112, 34, 148, 58, 62, 45, 223, 293, 94, 120, 59, 32, 151, 336, 298, 161, 119, 75, 68, 62, 39, 75, 86, 178, 155, 190, 139, 271, 269, 200, 243, 124, 160, 157, 190, 148, 238, 123, 107, 187, 172, 174, 100, 187, 168, 95, 143, 139, 13, 163, 120, 114, 122, 41, 88, 56, 117, 105, 51, 89, 111, 96, 87, 65, 106, 142, 157, 148, 143, 140, 130, 67, 109, 117, 126, 93, 139, 90, 65, 51, 193, 166, 91, 195, 172, 89, 202, 142, 84, 285, 301, 31, 165, 122, 156, 296, 248, 132, 125, 209, 313, 164, 81, 203, 283, 267, 137, 208, 106, 42, 124, 87, 43, 153, 213, 144, 132, 125, 107, 221, 85, 233, 52, 159, 166, 124, 78, 63, 95, 81, 115, 228, 105, 114, 181, 139, 74, 86, 149, 77, 85, 48, 119, 196, 226, 25, 152, 108, 23, 149, 220, 108, 34, 157, 125, 94, 72, 186, 174, 159, 236, 217, 116, 161, 217, 166, 111, 150, 225, 238, 75, 68, 44, 103, 17, 225, 179, 171, 210, 139, 123, 77, 127, 113, 198, 165, 165, 213, 112, 42, 139, 33, 87, 208, 214, 193, 75, 174, 90, 163, 136, 184, 85, 129]
-392A29
##PAGE=	F1=7563.46
##FIRST=	19140.455529915001534,	4405.895418600002813,	0.24546341598033905029
##DATA TABLE=	(F2++(Y..Y)), PROFILE
4406A88p3n6l9N7O5L2j8l4j02R2p1R1L1J2p0J1lM8m8L8n5j5mJ8N3l1np9O6p6K30r8m5j4m5
4077E1R0K0j05l0M0J02L6qK00k52l6L2N2M2Mj77M6r7R8R5Ol7l7L2n1o3M0k9m1P0L7rm2l9J21
3749A61Q8p5n4l6K6j4J40p9Ln9j9N0oL6j07K4P4o2J35l0j11k3R1R6j35n8J07l0kRM5n8Q1N1
3429B59J31j36k23K2L5L9k2M5mj19J08p9M1k1J6J08r4K6N3Ol7l7K9p3J97r8j11K4L3l3l2L7
3129I0m8P8M6k5j5J32%r1k8%N6Q5l2r9Q7K98N5j43k56n3j0R7j64J0QN3k6P2j09l7L8J5J09
2819A93M1l8j02nJ32or7l9M6n1j3O8l8J22k4m3n7P7j02Ok6P1Q9j13O8J19j29o7n8J38M4j73
2519C3J75q6k6J18p0N5m6l6Ll5k2N0J2j07J7j4N8N4j1n9P0j07J46k0n4k7J01L7J2k3n7q3J1
2209F9j1OL1o9J14k5K46q9j10j32J84j16o1M2Q0r3k8J04k7K2p8L4P3R0N6j36l6r9R3m5M4j16
$$ y = [188, 115, 59, 20, 77, 142, 174, 156, 122, 20, 112, 41, 132, 163, 175, 105, 116, 113, 161, 113, 151, 96, 81, 77, 95, 148, 117, 112, 33, 99, 23, 253, 155, 110, 96, 51, 141, 161, 56, 26, 66, 168, 204, 196, 396, 144, 108, 140, 192, 234, 238, 61, 107, 10, 108, 203, 209, 172, 135, 167, 116, 53, 93, 64, 23, 93, 130, 121, 79, 40, 161, 249, 174, 120, 84, 110, 96, 236, 157, 160, 101, 82, 132, 126, 162, 55, 79, 153, 91, 226, 196, 85, 62, 153, 249, 114, 56, 163, 133, 131, 140, 185, 127, 208, 259, 390, 254, 31, 53, 88, 127, 105, 150, 146, 27, 135, 56, 97, 76, 92, 200, 106, 132, 185, 191, 154, 117, 146, 73, 270, 172, 61, 85, 118, 85, 53, 90, 42, 120, 166, 141, 126, 258, 258, 167, 139, 139, 195, 280, 248, 149, 236, 534, 589, 446, 190, 137, 127, 224, 60, 70, 78, 131, 105, 177, 68, 31, 69, 84, 193, 234, 196, 94, 89, 221, 215, 118, 79, 125, 74, 61, 129, 91, 213, 189, 146, 89, 166, 64, 70, 44, 115, 204, 91, 159, 278, 149, 82, 24, 162, 206, 33, 208, 122, 96, 214, 144, 199, 153, 117, 120, 85, 63, 113, 125, 18, 35, 21, 79, 133, 122, 63, 133, 26, 172, 152, 98, 71, 172, 209, 221, 198, 141, 58, 69, 58, 64, 95, 26, 140, 115, 361, 272, 162, 30, 214, 98, 37, 79, 159, 66, 38, 142, 115, 137, 59, 93, 166, 256, 312, 176, 140, 41, 134, 89, 133, 17]
1908A7L5J46Qn5l0N1j9q7R7m5J30l2p2m2k1J2o6MR0K7o8L1n1L8K9M9J01k60K01j44k7J67N7
1598B71m9rj49J04Rj00L1o0K6QR3j07j7M9J62L7k12j7j3k4J15J86q3j26J6o9l8J5MJ2J1J07
1298A83m8R7o9R1J7r6N9j15O3j8N0m3J06j42m6Q7pJ8p8P3Qq1N6k1j09J55o9j6L9r4M1l6O0
988A15l1l3K6oK5Lk8L6N3K9m6k8Lqo7O6L9k5nJ4l5q1O1J09k0n9J07k1j12J50m2n0J97o1j81
659I4Q1o5P2J36m7j52qQ5J17j34o6R8R4Kj37O6j15p3M4m4k0J13N7l8j3j0o3J26j18J33j13
368A02M4qp3N3q9P6p5J03P0j08N2J01m0q0q4N6m3O6m2M3P2J1j72J27n6o7Q5Q5q6p0J16j9p2
58G8rJ07J9n1N9Jn9K9O0m9p6N1P0jj09L0j15J08m7R3k9J3N0j41J8k8P2mN1j3j1K5q0q3J19
-270A48r7L7J52J5l6r5P0j08M7Jj0n9P8
$$ y = [17, 52, 198, 206, 151, 121, 172, 153, 66, 163, 118, 248, 216, 144, 102, 81, 93, 27, 31, 121, 148, 80, 111, 60, 98, 127, 176, 277, 17, 218, 74, 47, 214, 271, 222, 213, 64, 168, 177, 77, 108, 48, 74, 82, 175, 68, 51, 100, 262, 299, 87, 70, 57, 33, 148, 334, 251, 125, 141, 72, 34, 49, 53, 65, 76, 183, 135, 232, 163, 254, 271, 175, 234, 119, 182, 164, 214, 171, 277, 135, 89, 176, 169, 187, 109, 182, 190, 109, 165, 144, 35, 190, 121, 105, 144, 50, 91, 55, 115, 84, 51, 77, 71, 96, 99, 71, 107, 160, 189, 143, 115, 118, 110, 43, 109, 148, 123, 118, 132, 97, 16, 77, 186, 166, 107, 214, 193, 81, 231, 189, 139, 336, 275, 94, 175, 110, 182, 318, 271, 119, 111, 196, 313, 179, 113, 211, 305, 307, 170, 236, 121, 48, 92, 48, 28, 141, 198, 160, 147, 137, 74, 200, 82, 215, 102, 146, 138, 65, 118, 29, 105, 30, 133, 203, 95, 147, 248, 208, 128, 44, 100, 57, 123, 81, 124, 196, 207, 35, 162, 106, 39, 124, 209, 123, 53, 169, 150, 78, 69, 176, 195, 144, 203, 204, 145, 174, 234, 185, 109, 160, 230, 229, 120, 150, 35, 143, 96, 189, 160, 173, 223, 82, 100, 72, 144, 140, 191, 178, 167, 192, 112, 29, 148, 51, 88, 240, 255, 219, 124, 194, 86, 133, 134, 124, 65, 143]
-392A43
##PAGE=	F1=7484.71
##FIRST=	19140.455529915001534,	4405.895418600002813,	0.29071131348609924316
##DATA TABLE=	(F2++(Y..Y)), PROFILE
4406A79m8m7l7nJ03LK5o1q7M2j5Q7J1j0o2L0m4P2k9K6l2j6j3qO2l6M0r1M4k4J89m0r0rl9N9
4068A29j0p8kL7J29K9k5J75k63n2Q7L8L6k1j67M0k7N5L8rkJL9p2l7Nj9LJ0M4Kj9m4R5R3o6
3730A72o9m0N4J2J06r1K2p6N1J6kK1j19J9Q6j06J61o8q5K3R0P5j29r0J29oj5QLk6O7O3J20
3420C76j35j96k8Q2Q4n5OK0j08N1k3N9n8NR6n6MM9j6jj3M8j23K09q4j44%O8l5MQp2R9LM7q2
3082H9J30M5k2p1k3J3R9J2p5K5L01P5r9k51j93jQ8j01P5OM0o8N8j11oM7nJ26K9Mj14l0J01
2772A93M5r2j05P2m7j0K8j0R0n7J8k8O0j10j2K1M3J19j74J23J19j57n6m1J35M0j43J59o7r2
2490F4J64o4M4Pq3qp1k6J14L6j21J1J3K1L3l1kL2p4J56o6q1K9N9P3j5o6l6Mj5o4J9K9m8J31
2162A68k8K02p9j18q2J78j55m7J6R7q3j0N3pM4j22%J40J09L5j15k9j29Q9j3K2j06M3J44qo6
$$ y = [179, 131, 84, 47, 42, 145, 148, 173, 112, 25, 67, 52, 139, 150, 140, 78, 108, 64, 136, 107, 133, 101, 85, 72, 64, 126, 90, 130, 39, 83, 59, 248, 208, 118, 109, 70, 129, 119, 41, 39, 76, 205, 234, 209, 384, 121, 69, 156, 194, 230, 209, 42, 82, 55, 110, 148, 139, 137, 138, 177, 105, 68, 73, 54, 57, 67, 111, 113, 94, 50, 145, 238, 172, 103, 63, 117, 129, 235, 144, 166, 90, 141, 157, 155, 176, 57, 76, 162, 56, 217, 149, 64, 87, 177, 252, 123, 33, 162, 156, 141, 149, 152, 126, 193, 256, 376, 241, 45, 17, 99, 183, 128, 134, 154, 46, 97, 74, 133, 75, 80, 176, 120, 124, 173, 157, 156, 143, 191, 68, 277, 193, 49, 49, 117, 82, 86, 94, 22, 121, 124, 171, 89, 219, 264, 242, 171, 148, 161, 260, 272, 197, 222, 523, 598, 499, 248, 55, 54, 142, 41, 116, 122, 162, 94, 152, 41, 35, 82, 77, 203, 232, 236, 122, 92, 193, 238, 146, 41, 113, 66, 56, 84, 74, 164, 107, 125, 97, 157, 47, 35, 56, 99, 218, 44, 167, 286, 129, 73, 32, 167, 207, 64, 223, 156, 64, 228, 164, 208, 215, 132, 124, 53, 27, 141, 177, 56, 67, 80, 101, 134, 103, 101, 133, 59, 215, 149, 68, 97, 156, 229, 214, 148, 112, 116, 101, 37, 56, 85, 37, 168, 140, 342, 263, 145, 63, 241, 86, 39, 55, 152, 69, 59, 112, 105, 149, 27, 27, 167, 276, 311, 196, 167, 38, 127, 114, 136, 30, 73, 217, 209, 143]
1871A43l0R6p2j02J02o3J49o8o1kK8K9p2k8J08J9j17J2J7O7L3m5N3j53J63j30k5K07L1o0j7
1579B12j37M4O2j02L9n7j1P3P2j25rQ6J33Lj94n2M0l0Q4J76j10j10O1j00QNJ3rKJ07n8J38
1279B54p1L9L6j15P2r9R0k9N2m9J26j60p2P3JM7p0L9L6p2O7l8j10J60p6m6P8o2J4o4N9m0l2
969C8K7l5J01L9p1kP3L6p1n5K8J3n8O7O6q0Nj1l1l9N8O3J1o1J17j8j41J74k8l1J80j21r2J4
650A65n6R6J23l9j75k1Q4J35j18m2P7J02lj21M0j12q4J6l6QP6N4mj6j4q4J21p6R9m8j6l3k8
340G0R4j33P8q1J27K9r0O7J23l5r3j05jKR7m1kP3Jj31J15n9m5M5R3n9p4J25nr2l7Q8N1p3N0
11A72Qk9K2P3n1j01O1N6j0l6M7j64J30qj4k8L5O2k04N1J7P3NL0jm1Kk5j02J08o7J3J58K2j7
-317B47p0K5j30L0J8o3J7P1
$$ y = [143, 113, 209, 137, 35, 137, 74, 223, 155, 94, 92, 120, 149, 77, 49, 157, 176, 59, 71, 88, 155, 188, 143, 196, 43, 206, 76, 51, 258, 289, 229, 212, 75, 119, 181, 79, 118, 61, 50, 123, 195, 70, 61, 147, 280, 283, 89, 37, 77, 47, 131, 307, 197, 87, 148, 48, 56, 61, 74, 65, 67, 174, 116, 254, 183, 222, 258, 143, 215, 116, 206, 177, 229, 180, 306, 146, 74, 147, 148, 195, 125, 164, 200, 128, 195, 157, 47, 207, 131, 85, 163, 101, 115, 51, 110, 70, 38, 65, 30, 131, 170, 99, 97, 170, 206, 135, 80, 108, 121, 63, 130, 196, 116, 121, 110, 79, 40, 98, 161, 172, 111, 228, 210, 69, 243, 215, 184, 364, 243, 151, 165, 109, 205, 328, 289, 114, 93, 177, 312, 194, 152, 229, 331, 328, 207, 247, 135, 51, 67, 31, 39, 115, 169, 165, 149, 135, 51, 172, 96, 195, 147, 131, 98, 70, 164, 31, 109, 28, 155, 184, 94, 161, 284, 249, 156, 51, 50, 52, 149, 108, 106, 179, 180, 49, 164, 105, 60, 105, 198, 139, 65, 190, 185, 93, 56, 144, 195, 122, 172, 180, 151, 173, 246, 195, 94, 155, 211, 201, 165, 212, 48, 178, 170, 156, 128, 163, 225, 21, 72, 89, 162, 167, 197, 196, 155, 157, 132, 30, 138, 71, 84, 242, 264, 247, 177, 202, 72, 102, 120, 57, 74, 145]
-392A45
##PAGE=	F1=7405.95
##FIRST=	19140.455529915001534,	4405.895418600002813,	0.35057610273361206055
##DATA TABLE=	(F2++(Y..Y)), PROFILE
4406A57j9l6k0n4J18l2O9p2n1j6O0O6l3n2m7M8m3P0j6J8k3j5J7l1L6l0Q3r2M4OJ26pr2k8l1
4077G8M9o0n3M8J7J43J2j7J36k60o8J41J3K4m6r8pM5J4k9k2L5L4N3q5j2l3JK7n3P9K1j1m5
3758G1M9Q5n2p8qO0J7P4r6L7o5Q8j8J1pq4mQ0j00J47j06o3P4Q4M4j23p2J07J4l1kl4J1N0P0
3429B30R9j15j56l3J20J12n5k9J1p3m8L1N0n2k3O0Kk0L3k0L3J5M3p8J88j08j70k7Q3l4M8k3
3129I4q3J28m8R6q4P4O2M4m1p3m4J09N5m9J1K70R6n7k39k00r4M1l7J30J9lq9L6q9J7K9pJ17
2819A91J8M4j26oL6Q6q2j52P0k2J9o5N2M8q3O9mO1p0J2K6k0J15j98J38J16j65m6k3J15L1q9
2519I6J28k7j27J59m4J9O0p8m6j13QJ20P0j19OK9m2J8k2L5ql0J44j06r7R3K9R9o8p6l0P6l3
2209A23p2LJ5k9J42oJ32p7j20l3J54j82J0k4J01o4k0MJ3O6p9j0J10J20J0q8k7j11O9lmn0J6
$$ y = [157, 138, 102, 82, 28, 146, 114, 183, 111, 60, 44, 104, 170, 137, 85, 38, 86, 43, 113, 97, 115, 92, 77, 94, 63, 99, 69, 152, 60, 104, 110, 236, 229, 137, 109, 78, 127, 67, 14, 62, 79, 222, 234, 217, 353, 93, 25, 166, 179, 203, 157, 59, 52, 97, 111, 82, 60, 95, 129, 182, 97, 85, 52, 53, 80, 27, 106, 127, 116, 71, 120, 205, 153, 75, 67, 127, 144, 218, 122, 159, 94, 182, 164, 175, 168, 84, 80, 160, 60, 207, 101, 38, 112, 196, 240, 117, 45, 152, 166, 135, 133, 99, 110, 160, 230, 329, 214, 58, 25, 145, 257, 202, 173, 184, 111, 63, 94, 144, 92, 69, 129, 131, 111, 144, 124, 157, 172, 215, 137, 325, 217, 47, 20, 103, 69, 117, 94, 11, 139, 91, 187, 103, 177, 239, 283, 242, 169, 125, 234, 289, 240, 251, 521, 617, 560, 321, 121, 27, 68, 31, 161, 180, 177, 88, 124, 35, 52, 81, 74, 191, 209, 253, 127, 121, 157, 243, 161, 9, 79, 57, 76, 11, 63, 111, 28, 97, 93, 154, 84, 96, 122, 102, 217, 19, 157, 273, 108, 62, 39, 154, 185, 96, 224, 197, 70, 229, 185, 204, 264, 186, 140, 27, 35, 155, 225, 106, 112, 141, 99, 117, 95, 130, 122, 92, 236, 130, 33, 126, 155, 254, 186, 110, 80, 156, 123, 51, 54, 69, 40, 182, 176, 308, 231, 111, 78, 232, 50, 60, 36, 137, 73, 53, 57, 70, 136, 57, 47, 157, 277, 287, 199, 172, 61, 130, 127, 123, 73, 89]
1899H9J37l0p0k9J49j33r5J14p5J51r3p2N0P3K2n7o3J22M1j34l7O0P7K3j12qk9J02j04O3J66
1608B98lo3k0j13l0J01j01L8l4k3J02N3j40J7R1J03k6j57o0O3l3M0J62j04j05Q5j27R1j9J0
1326I6k4j1R3n2J54o1j5N1j25Q7p2J06l0L7n0J37j68q5L6J9P6n7lO1n2P5n3j22J65o9q9J34
1025A89n2jq4N6j7p7M6l1J56O7j16n9R1L8p9q3P8L7n3N1Q1j13j3l6k4M2J3J7N3p3J30j3j70
716E1J80j6nJ56j55j3n9j1R2J00k7j81l5Q0J54j03j6N2J07k7r4Oq5j12J3j0K8J8N4J3j9j8
415A18p4J02j9M4kn3n9O6P2j17K5k1R5pq0O2J30k8j04p5n9L1J12l2n5P5J0q6Q8n5k9K4J01
105B00n2p8J48Nq6p6L2Q1p5L7Qj2K8R4m4j36O2L8j7L3N2j82J38K8q8n1N6P3j74L1M1O2K6J3
-214B15oq6j1M4j06O2k5pJ37K3K5m8k6j47L2K3o3O3L4
$$ y = [89, 226, 196, 126, 97, 246, 113, 18, 132, 57, 208, 115, 43, 93, 166, 188, 131, 68, 190, 231, 97, 60, 120, 197, 220, 108, 100, 71, 173, 69, 132, 298, 295, 232, 212, 99, 69, 170, 69, 107, 73, 50, 152, 205, 65, 82, 173, 276, 250, 93, 33, 96, 63, 103, 265, 161, 56, 141, 14, 105, 86, 96, 72, 61, 154, 102, 256, 195, 180, 231, 106, 193, 121, 227, 197, 234, 184, 321, 153, 68, 104, 123, 199, 142, 139, 200, 148, 223, 170, 48, 213, 144, 55, 189, 137, 136, 52, 108, 91, 14, 60, 29, 185, 252, 136, 77, 168, 206, 127, 44, 122, 159, 106, 157, 238, 125, 112, 76, 52, 94, 107, 124, 177, 104, 234, 221, 51, 231, 215, 210, 366, 211, 198, 139, 128, 220, 320, 293, 112, 77, 157, 311, 208, 192, 244, 351, 324, 230, 236, 151, 39, 52, 42, 70, 88, 142, 155, 136, 118, 44, 146, 127, 171, 169, 116, 57, 123, 195, 78, 103, 82, 177, 170, 90, 152, 282, 254, 150, 75, 16, 47, 159, 127, 72, 147, 157, 71, 159, 104, 75, 99, 200, 148, 70, 218, 223, 137, 61, 93, 174, 99, 136, 144, 132, 160, 254, 210, 74, 136, 174, 157, 190, 242, 60, 198, 226, 138, 87, 143, 216, 42, 73, 114, 176, 202, 215, 209, 123, 112, 156, 50, 112, 87, 80, 217, 240, 265, 217, 191, 44, 76, 99, 36, 99, 133]
-392A33
##PAGE=	F1=7327.2
##FIRST=	19140.455529915001534,	4405.895418600002813,	0.49325636029243469238
##DATA TABLE=	(F2++(Y..Y)), PROFILE
4406A25J6k7%p0R8o7J07n1m5lQ3M4p2j06k4N0L5J3qJ0l5j5O5j4l6KR8j01M9K4P7j7p0l4k6
4077G5N6j08K4M5k1J49j3RQ6k40k7J43k6No3j0m3Q4j7p6J7QN3P5q4ko4K2M3j2L7J8j2n0J4
3749I5N6l8p1M1M2J6M6r2M2m3J09n4L8m9j1k8M5o3J23j37n7J24P5J0j17l9P3J8m7ro2M8K9
3439A13O9P8q1j09j9J48J29o3j5l1n7r6M2K4j6n5J3O4l1PnM5M1K4k1J79j38j87m3P1rO1m7
3129H5m6J17o6J19p6L0L2Q7K9j05j22J22J02m1O2J99J07l4k18j66j39n5RJ65L0n8q1J0n3K9
2847G4lJ4P0J1Q0j29L5l0J11o4j45LL6N4l6qJ8n0K3J1Q0k3L4K9q1R0j62Q4J12j47m6mQ2K5
2528A48k7Q7K2j27J13j4rJ07o4q5p9PP5J06j02NL0j14J3J0N0m5NJ24j33q2J24K1J12j21k5
2237A32p4J12l7k9k6l0rJ40K2O3p6j18KJ15j78O6m4Q6m4k9jj4P0j8K1M4J13j9n7l1n3M2j9
$$ y = [125, 141, 114, 114, 44, 142, 75, 182, 131, 86, 83, 166, 210, 138, 32, 8, 58, 93, 106, 98, 108, 73, 58, 123, 109, 73, 75, 173, 72, 121, 145, 222, 205, 135, 101, 75, 131, 23, 47, 92, 71, 220, 207, 216, 302, 62, 35, 178, 152, 157, 94, 84, 41, 125, 108, 32, 49, 57, 110, 185, 101, 99, 35, 57, 100, 88, 125, 143, 131, 81, 95, 151, 113, 42, 83, 125, 141, 187, 95, 137, 94, 203, 149, 187, 138, 127, 99, 144, 81, 204, 67, 10, 134, 209, 219, 102, 63, 136, 154, 107, 98, 36, 84, 113, 182, 260, 179, 70, 51, 199, 328, 265, 250, 219, 162, 66, 108, 132, 116, 61, 74, 138, 107, 114, 109, 154, 195, 219, 198, 377, 239, 52, 9, 80, 71, 132, 85, 39, 156, 90, 209, 133, 163, 195, 282, 311, 206, 84, 206, 308, 267, 329, 528, 635, 601, 383, 217, 78, 23, 32, 197, 227, 169, 88, 98, 45, 74, 71, 85, 155, 166, 246, 117, 152, 122, 233, 169, 24, 27, 63, 117, 81, 73, 91, 41, 64, 75, 155, 132, 166, 195, 114, 204, 42, 126, 238, 91, 45, 41, 123, 148, 121, 208, 230, 103, 216, 202, 193, 300, 236, 151, 72, 79, 154, 260, 158, 163, 193, 79, 92, 102, 152, 107, 112, 236, 103, 21, 145, 166, 278, 157, 132, 58, 170, 133, 104, 78, 48, 39, 179, 201, 264, 188, 70, 72, 187, 9, 75, 31, 117, 73, 44, 43, 29, 99, 81, 102, 146, 259, 240, 183, 152, 99, 141, 122]
1927A22k8J9k3J35n7n9j3J77j65p1J17q8J39j06r2J03R1%l1q6J29O8j44m9M2Q2J0j30o0N9
1645I1M4q4J44J29l3n8k1q2r9J16q9K8j6j2J07L7j37M2O6P7l5j16m2N1l2%J56p9j15Q3j02
1354A9J29l5ll2j9O9l4J48m3n4N3j28R7m3J12j9J5m5J30j71p0lM6P7m7m1Q3k8P9o3j40J68
1054B07n1j23J94o6k0p5M4K8j24N2j8J86R1j50j21R8M0o9j07J29N0n3L2Q3r5m2q3K6P3l1j5
763I0Q8q6J44pk02J71nK2J31j55M8j29M6O6P0j4j74l9P5J68q8PJ7J08o2o0k1l9j59L6K7M1
462A15l8N5Kk1k2n4R7L2k3K5o0q0J36L8q8k6L7O9l2q6M0J25j0j20k8m6MJ17j5q0M3L4m3N2
143A49m9j3J1J15o6p5J73Pp2r1m9R7o1J0OjN0J16k2j77M9K8l1R3M6j83J46N4j15r6P3P6j05
-167I3K1K2O0N1j2k4j34j4J07q9LJ3nR2J1P0l3p0j55M9K0J0L7j4
$$ y = [122, 94, 113, 90, 225, 168, 109, 96, 273, 108, 37, 154, 66, 205, 99, 7, 110, 201, 201, 170, 84, 213, 281, 137, 88, 130, 212, 222, 92, 32, 91, 135, 51, 195, 324, 291, 233, 212, 130, 31, 147, 58, 86, 70, 58, 165, 202, 65, 107, 173, 250, 215, 99, 57, 108, 76, 76, 232, 153, 38, 121, 19, 148, 113, 110, 78, 59, 128, 94, 242, 199, 145, 198, 70, 167, 124, 236, 217, 232, 187, 317, 146, 76, 73, 119, 196, 149, 108, 191, 163, 242, 179, 39, 207, 156, 33, 227, 161, 141, 66, 110, 138, 14, 66, 48, 234, 325, 175, 54, 152, 192, 123, 16, 145, 195, 142, 174, 257, 162, 120, 37, 63, 136, 105, 90, 178, 92, 236, 229, 27, 198, 193, 215, 346, 191, 239, 110, 156, 222, 292, 278, 104, 65, 140, 308, 220, 227, 244, 352, 290, 230, 209, 170, 11, 47, 74, 115, 77, 132, 134, 113, 91, 37, 134, 166, 143, 168, 108, 28, 164, 202, 114, 88, 125, 194, 162, 76, 116, 241, 231, 111, 83, 37, 41, 158, 143, 63, 106, 140, 97, 149, 100, 87, 98, 213, 147, 72, 245, 252, 180, 89, 40, 137, 76, 86, 92, 91, 141, 257, 235, 58, 107, 135, 104, 197, 243, 60, 206, 260, 145, 49, 122, 198, 93, 114, 136, 196, 247, 235, 211, 77, 63, 170, 81, 84, 97, 92, 184, 195, 265, 232, 162, 7, 56, 76, 86, 123, 109]
-392A09
##PAGE=	F1=7248.44
##FIRST=	19140.455529915001534,	4405.895418600002813,	0.59381639957427978516
##DATA TABLE=	(F2++(Y..Y)), PROFILE
4406H7N8k4J4q3P7q6J26ro1L5Q9J9q8r0j3RQ8k5ojo0k5J08J9p7L0P4j19M8M6N3p3l8ml1O7
4068A34p9N0J7p3J55m2M4K9k01N6J04p3mn4L2l2P1k6j7L6q8M5J02p1j0p7L7O0N0j4j2j3o4
3758G2LJ7l5k8O0J9J9K4p8L9k9J29r8P7j00Q3l6j8j9J06j58l4J36O8k4j04j9M5Ko2Pl7L2K
3439F1O3N9m2n8j7J78J39q2K4p7o0r4J9j0M1q3mQ2j5j9J8K6O1jK5J66j59j82m3L5N2K3n4j3
3119E9J05o8J49r4L5l7R2J11r8k01J36J55n8J66J30Q7m7j94j15j65p8j7J59L8j06n2pl1M0
2847I4l3M5nJ3J06j03N1o4J09k4j20l5O3P1Qp5K4k4o3J0J03J6N1L6j30N5j26L1J03j03o3J7
2547C8M8L2J5M5O8j17N9K1l1J49n8j22k0qK2J36p2LJ8j74K2M3N4p6J7J08j34m7J10L3J15j47
2246A50K8j27J05k3K9m9q5QJ23M9J1o6p9j3N4o1K2m1O3k8J9K6n4j7L6N6LQ4m5k8l5K4J8o2
$$ y = [87, 145, 121, 135, 52, 129, 43, 169, 160, 99, 134, 223, 242, 154, 64, 51, 60, 148, 123, 117, 116, 56, 31, 139, 158, 81, 111, 185, 66, 114, 160, 213, 140, 102, 98, 67, 134, 55, 105, 122, 49, 204, 162, 206, 235, 34, 90, 194, 121, 117, 63, 95, 63, 134, 108, 91, 127, 39, 84, 186, 115, 105, 28, 65, 125, 175, 161, 149, 136, 72, 75, 92, 57, 29, 89, 108, 127, 151, 73, 112, 83, 212, 114, 191, 91, 174, 138, 120, 101, 207, 49, 15, 151, 219, 195, 91, 72, 117, 119, 57, 64, 27, 59, 61, 124, 183, 141, 83, 66, 244, 383, 301, 325, 248, 188, 94, 113, 103, 144, 61, 57, 139, 124, 105, 123, 149, 210, 209, 234, 400, 241, 59, 16, 51, 103, 126, 72, 59, 164, 96, 245, 151, 186, 149, 241, 352, 254, 53, 189, 344, 286, 452, 582, 669, 622, 428, 313, 148, 70, 53, 212, 250, 144, 92, 85, 54, 94, 61, 106, 101, 114, 220, 117, 168, 104, 213, 189, 69, 34, 97, 168, 176, 101, 125, 101, 38, 48, 151, 167, 218, 254, 124, 179, 53, 84, 187, 84, 21, 38, 86, 118, 133, 178, 246, 129, 188, 209, 178, 327, 269, 147, 127, 119, 141, 277, 205, 208, 226, 52, 74, 117, 171, 95, 112, 220, 86, 39, 149, 182, 297, 150, 178, 51, 156, 133, 162, 113, 28, 36, 159, 208, 219, 153, 74, 61, 115, 54, 76, 35, 98, 70, 89, 115, 61, 44, 80, 136, 139, 223, 178, 150, 115, 139, 157, 95]
1927I5l0P8o7J39q7j4NJ64j49q7J45j17J34j19l0Q9O8l3jq9J24R3j52m2jQ6Nj17KPJ2p9J97
1617B29J01m9m8k4n2j15Q1n5Jj9J2J02K1j00M4K2O1j6q9j1K3l5j1J54p3j18N8n0J31l9k5l1
1317H0k0L8rJ29k3n1L3j22P7j9J19kjm3J06j71k5mN0M7m8o3J01qP8o7j63J67k6j02K10q4n5
1007A29l8K5O9j46M0k3K09J18j70j67P7M7m7j20J55N1n2K3O5l6n7j35R5M8o6JP8r2J54nk20
716A0J45MM8J03j21Q6j80Q5K8L6kj59k3P8J61o6K2l3J02r5k2k6Qj49J4O4M8p7M6l2k3j4m1
406B5J15O4q7L1l9q7J57Kn2o1Q2N3m6j05J4J07K5j31Jj1k0J15Rn4m8O5mJ5m4NmJ34q2o8J82
77B58Ln8q7o7M8m0l4MPQ7J30J0k10K0L8n8J39L3j76J65O4j09j38P9P0m7L0rP2O9m9m6j61k
-242C5J34n5l5K1K4M6k0R7k8q7p4j2J4O4J2n5
$$ y = [95, 65, 143, 76, 215, 128, 114, 119, 283, 134, 47, 192, 75, 209, 90, 60, 149, 217, 184, 183, 94, 218, 311, 159, 117, 116, 202, 207, 90, 92, 99, 111, 32, 229, 330, 281, 233, 209, 157, 42, 123, 68, 69, 50, 62, 164, 185, 85, 129, 151, 212, 196, 107, 96, 119, 84, 73, 227, 154, 36, 94, 44, 175, 136, 111, 80, 60, 98, 89, 218, 195, 144, 177, 55, 132, 113, 232, 230, 229, 186, 292, 121, 96, 92, 142, 189, 141, 78, 179, 171, 249, 182, 19, 186, 160, 58, 268, 184, 129, 91, 116, 185, 39, 79, 56, 265, 383, 213, 46, 123, 170, 123, 3, 158, 209, 157, 180, 245, 209, 152, 17, 112, 160, 94, 95, 173, 81, 235, 230, 10, 155, 159, 207, 310, 189, 275, 95, 180, 208, 244, 242, 83, 60, 138, 299, 233, 255, 222, 324, 229, 207, 181, 189, 40, 54, 118, 166, 89, 135, 103, 80, 66, 25, 140, 204, 117, 148, 109, 22, 179, 181, 129, 68, 150, 203, 157, 52, 66, 173, 198, 67, 68, 57, 37, 152, 161, 107, 59, 124, 120, 135, 91, 96, 92, 226, 144, 76, 258, 261, 203, 116, 49, 97, 57, 23, 27, 34, 121, 251, 261, 51, 71, 109, 51, 190, 223, 47, 212, 276, 167, 29, 108, 178, 131, 161, 152, 224, 293, 244, 198, 37, 35, 169, 114, 79, 100, 124, 170, 150, 247, 219, 132, 58, 46, 60, 124, 136, 81]
-392H1
##PAGE=	F1=7169.69
##FIRST=	19140.455529915001534,	4405.895418600002813,	0.63892030715942382813
##DATA TABLE=	(F2++(Y..Y)), PROFILE
4406E4R8l2K4j02O0n1R4L8q5P8Q6j4q1n3l1J5Q8l5rj1o9m6J14N9o4K9L0j40M1P3N9j52pM9
4087A07l9P0m3P1k3j28J66p3P7k4j39J25O9j20J7k1j2QL1JM0L3j48J4J27n5k9o9M4P4R6n3
3786A94n2Jp2j2J1n0L2K6J0K9mm3L2m1J57j49J21j35J56k9q4J5J02j83NJ25O9n3p7k1K1l8
3486F3l2M1Pk9l8N4M7nj2k3J97J43j07O9j13p4p7ll9J05j05K5M4J8l3K5%O5k3N4J37j68j55
3176E8m0LJ23l9k8j5J00q7K10j15O3j06M4J86m8k14J23J92o5L07J58L1j30k23o9j79j04n7
2913G9J24M4j30j6Ll8M7n6O5p0K4J04l9K3n0Q0L4j04l5N5O9M7j25L6j8r7l3J12M4O1M7j60
2612A27K3j02K1O0l6p9J9L9M5J3J5J04j12J4N5m7J84o1j51L6j7k8J54l6mnk02M6N9N9j01M
2312I6J08j14m7R4O2J05j37L8j58P1J2Q6p1j31K4R1O9j7l6j7n6l9O3l1k6M3j5Q3L0o5q6K8
$$ y = [54, 152, 120, 144, 42, 102, 51, 145, 183, 98, 176, 262, 248, 167, 114, 83, 98, 186, 151, 142, 131, 62, 16, 130, 189, 125, 154, 184, 44, 85, 158, 217, 65, 58, 107, 68, 138, 95, 166, 143, 15, 181, 108, 185, 161, 22, 147, 216, 96, 113, 92, 80, 88, 119, 120, 160, 193, 45, 59, 186, 131, 102, 33, 77, 151, 247, 194, 142, 143, 71, 59, 70, 20, 52, 78, 88, 117, 113, 70, 102, 61, 218, 69, 190, 55, 211, 182, 98, 113, 215, 32, 37, 162, 231, 178, 101, 80, 101, 63, 31, 72, 79, 50, 12, 66, 113, 108, 96, 73, 270, 413, 306, 375, 262, 188, 111, 108, 69, 174, 69, 94, 138, 156, 123, 148, 148, 213, 190, 244, 381, 213, 58, 18, 21, 144, 105, 77, 62, 162, 75, 285, 170, 233, 127, 171, 357, 309, 95, 218, 410, 345, 652, 810, 841, 711, 488, 419, 240, 136, 79, 203, 247, 117, 101, 104, 66, 113, 57, 122, 52, 76, 180, 141, 164, 114, 194, 228, 124, 89, 144, 213, 260, 135, 171, 153, 56, 23, 135, 179, 240, 287, 127, 150, 48, 69, 129, 93, 14, 33, 72, 117, 130, 145, 249, 137, 151, 206, 159, 343, 282, 131, 167, 150, 122, 276, 240, 236, 231, 29, 75, 134, 193, 92, 96, 204, 90, 43, 137, 199, 304, 167, 205, 47, 118, 130, 216, 145, 14, 38, 129, 198, 181, 145, 128, 72, 33, 96, 65, 39, 82, 67, 150, 180, 115, 29, 57]
2011E7R1rL5o2ol6R9Oj18K2Q5j08J41j10N9JJ25j10j29K00j63J48j42L5R1Qp3L6p0J07J05
1720C15j49l2n2R8J9j16O3m9J8p0J90Q3n4l0l5k9j03M6k3k3m7M9P9Ql7K7k7N8J5p6K1%n1J9
1401A05J34r8r4J9rJ24l4m7k5j2OJ4J08oj0Jj05J3jJ36J6ln3P1j69L8J2L9J3o4o7J17%P2o4
1072A77j68J44%n8J99p9j05QOR3j62M3k9K03J50j80j83L7N4k6j13J43M1m7L3K2M1n8j38J15
791A63Mq4N5K9r5J57j2j90Q3J6P2P0o2R6k11R8j0JRj36J1R1J28l5K6r4Q4j12J6jL6j09k5R5
471A64M7j03K7o5k7L2l7J23P2j29K0j1r1J51l4k0p1J06M8m9j29K4M6Q8q7n8L0l1J10L5k3j30
171B8P4L5j8l8K0j4J44q0o6J68pm8o9m6ql9L5j7k5P6J30M5k28j9P0o5J38K1j68J99N3r6j57
-139B8P5O3j0L9l2Q6P4q7o1j16jR6j9l1lN9K6o1R3l3n0j4p4PQ2Jo2
$$ y = [57, 148, 139, 174, 112, 106, 70, 169, 175, 57, 79, 164, 56, 197, 87, 146, 147, 272, 162, 33, 233, 70, 218, 76, 111, 202, 210, 137, 173, 103, 210, 315, 166, 134, 82, 180, 199, 83, 146, 97, 115, 45, 235, 318, 264, 234, 199, 170, 67, 113, 90, 67, 20, 69, 148, 156, 119, 146, 119, 177, 192, 116, 137, 137, 86, 105, 239, 141, 47, 66, 57, 181, 147, 100, 75, 63, 69, 83, 191, 185, 175, 176, 71, 84, 83, 219, 235, 232, 179, 250, 81, 119, 131, 170, 183, 119, 52, 169, 169, 241, 177, 9, 153, 153, 95, 294, 215, 110, 118, 124, 217, 55, 98, 69, 272, 422, 242, 59, 96, 150, 124, 11, 154, 195, 148, 181, 203, 244, 186, 48, 163, 167, 83, 138, 167, 72, 229, 217, 27, 110, 126, 198, 268, 206, 302, 91, 189, 179, 180, 189, 53, 64, 155, 283, 248, 274, 180, 264, 152, 168, 167, 203, 94, 69, 164, 211, 108, 135, 70, 43, 75, 38, 161, 233, 104, 124, 113, 22, 173, 139, 119, 48, 154, 202, 153, 24, 48, 94, 182, 95, 37, 67, 36, 146, 181, 158, 28, 102, 137, 119, 81, 101, 87, 231, 151, 85, 253, 246, 198, 129, 83, 75, 36, 71, 54, 29, 105, 235, 280, 52, 33, 103, 38, 176, 197, 29, 228, 281, 185, 28, 103, 166, 156, 195, 163, 249, 323, 236, 175, 59, 58, 154, 135, 104, 101, 160, 186, 125, 218, 185, 135, 121, 47, 54, 136, 137, 75]
-392G5
##PAGE=	F1=7090.93
##FIRST=	19140.455529915001534,	4405.895418600002813,	0.61266690492630004883
##DATA TABLE=	(F2++(Y..Y)), PROFILE
4406D7J09m5K9j12L8K8K9O8j06J15P4n0o0k2m3L8O6k7j4k1n6l2M2J04k7J4j6j52L5Q9Q8j33
4105I7MK5m5P4l6J04o8j26J30j01R4o1o1J71M0j60N7j5q2O4k1O4O0K1j74mJ36m1n6m4M2P8
3805A66J20p5r0M4m8p4O0l1Mk4N1J5m3J1L1q4J95j58J11r8J43j1j15J3J08j91K6J11P8p5m2
3514A28k8j0q1J01kJ2n1m6kL8K2K4k7J96J38j29J04j28r2n9j4l5J43j21N4NN5m4J4j2N2m5
3213A60P5Q7j66j08l9J6J53r4L1o6J21j45K95r7O4j32m3K22L2j84J21K01k8M76L03rk66l69
2950F11p0k03j37j13R0N1j18RK8n8M4o8N7n3K2L9M8m3J1L8R8r9n4N8N8P7j58L8mr3q7Q8O1
2641A68N9N8j58Mq6O9k3K7p9j1P8L4k5QJ20j19mP7o4K12o5j67O7qp4J62lj9l0j89O7O2P3j22
2321I9qJ11r0q9R9R4Q2j09J2j55J9O1J33r0j59L8M8Q1k6RK2q0n8P3p2pL4pJ30K2n8n9p2J14
$$ y = [47, 156, 111, 140, 28, 66, 94, 123, 191, 85, 200, 274, 224, 164, 142, 99, 137, 203, 176, 162, 141, 85, 53, 95, 199, 172, 186, 170, 18, 53, 142, 230, 97, 101, 126, 81, 155, 119, 223, 155, 29, 159, 58, 152, 91, 30, 201, 241, 81, 138, 123, 41, 105, 84, 148, 208, 229, 55, 51, 187, 146, 90, 46, 88, 166, 286, 211, 121, 165, 117, 43, 103, 72, 76, 52, 103, 118, 75, 86, 117, 33, 228, 70, 181, 83, 226, 215, 100, 113, 221, 30, 56, 167, 245, 170, 128, 100, 90, 9, 110, 108, 120, 69, 23, 21, 59, 81, 105, 78, 274, 412, 283, 387, 259, 167, 108, 94, 59, 202, 81, 135, 140, 195, 151, 165, 153, 205, 160, 235, 322, 156, 48, 9, 25, 178, 84, 115, 49, 170, 25, 320, 223, 287, 155, 112, 334, 366, 182, 303, 504, 476, 952, 1255, 1246, 980, 611, 541, 338, 201, 88, 178, 229, 111, 120, 148, 90, 134, 66, 123, 70, 92, 131, 179, 136, 147, 185, 283, 184, 130, 188, 246, 323, 165, 203, 199, 106, 19, 107, 168, 227, 285, 127, 131, 45, 114, 91, 118, 39, 28, 106, 140, 115, 123, 243, 124, 120, 197, 133, 345, 280, 113, 180, 172, 98, 260, 257, 238, 208, 19, 86, 148, 221, 99, 91, 202, 112, 23, 122, 216, 298, 189, 201, 46, 65, 126, 259, 169, 10, 48, 96, 177, 151, 160, 182, 102, 44, 117, 45, 38, 72, 65, 195, 217, 159, 100, 28, 142]
2002A42kk0n4nl3J52J0j28P0N0j31J23j14J26k0P5p1j53K53k19J77j73J02R6o8j14P8k5O8
1730A92J05j33k3r9J15N4j49J15r1M9n2J45O9n7qn5j2q1L4rl3o0O9L4NL3mn9N6L7o8N1pq0
1410H3O3R6j38l8j7J4J03k9n7j4Jk1L3Q8KL5k5q7p2K5J53L3Op2L9j51Q8J8K9lq8o6J29mO4
1082B20n2j22O6K4j4J70m7j48M3qR3j68O8j6J46J84j83j84K1M1j6r0J04K1l4O3m0J12n0j23
800H1J23m6q1J10j9r9J43k4j43K4K9J03K6NP9k27R6m1l5J9q4L2J15P1PJ8j54N2q4L9L6L7o2
490A46o1J17L7j17Op9m0J08l6J04O2j34%lr8J54o5j0n7J04N1l6j34O9o4J66k4j36M4l9J04
199A39N6Jj36J5P5m5k5J6RJ21n8p7J38j9m3m1k7j4p2J38j4m3jJ15P6k18l9P7k8Q0J9j36K10
-111B49L3r4j66Q0O7JM1l9Q6P1j17o2n3qL8J0nk6P6L0r8P3m7L6Lj29%P2Mj6
$$ y = [142, 140, 120, 66, 61, 28, 180, 190, 62, 132, 182, 51, 174, 60, 186, 166, 241, 170, 17, 270, 51, 228, 55, 157, 253, 185, 71, 149, 124, 192, 297, 164, 141, 42, 157, 211, 62, 177, 86, 135, 83, 228, 297, 240, 232, 177, 165, 84, 118, 109, 76, 16, 85, 119, 124, 157, 153, 94, 150, 187, 119, 170, 163, 83, 146, 242, 104, 66, 49, 63, 166, 137, 80, 66, 67, 46, 79, 167, 169, 204, 179, 92, 20, 45, 198, 231, 237, 165, 204, 53, 141, 159, 188, 185, 97, 31, 160, 156, 220, 168, 46, 112, 136, 122, 292, 245, 97, 140, 132, 225, 57, 125, 109, 255, 439, 256, 72, 93, 134, 118, 28, 132, 153, 119, 182, 142, 254, 204, 81, 204, 158, 77, 187, 168, 69, 212, 188, 45, 69, 98, 201, 227, 232, 311, 84, 180, 139, 104, 123, 39, 71, 186, 257, 264, 282, 128, 180, 96, 135, 171, 208, 146, 85, 202, 239, 122, 128, 49, 9, 117, 81, 185, 247, 113, 113, 110, 12, 166, 101, 91, 34, 138, 189, 153, 19, 88, 24, 190, 166, 30, 74, 35, 139, 195, 196, 60, 75, 150, 105, 80, 96, 105, 226, 168, 91, 229, 210, 167, 126, 99, 85, 13, 151, 137, 94, 93, 208, 284, 66, 27, 104, 76, 156, 175, 39, 249, 282, 188, 22, 102, 169, 170, 211, 172, 258, 329, 212, 150, 97, 89, 127, 137, 132, 106, 182, 212, 114, 187, 140, 176, 179, 50, 50, 122, 126, 110]
-392A10
##PAGE=	F1=7012.18
##FIRST=	19140.455529915001534,	4405.895418600002813,	0.48336821794509887695
##DATA TABLE=	(F2++(Y..Y)), PROFILE
4406F6Q5n9L7p2pR5j3N2j17J35N5q4l0%m7O3L7nk2k8l0rn8J52Rj1m6j28K8O8J28o2J7m3o4
4077I2R5n9J47j14q7P0j17Q3o8pK09K0j94Q6k3j11R0o5J39M2Jj68NJ29l3r0j2L4O6J26p6j21
3777H9J07j3j49J01k0k4n6J23l8o7N4L0r0J91j01K9l0P5J4j02k8J23j50OR3Q9q3j6k6m3k1
3486F7J25n7J9n2o0l0NM0M8k0J71J25j41J21j19j02n0j2J6J29j33P5rQ1o0j7ML5q2J01J8j50
3185H6l0l6L2J48j13P7j27J74j38K83l9J5j21q2J80J12j43J34J96M7O67M99j8m13o04j30k41
2932D15j64j88J00N2p6J4M3p2L6o8J3J2J9n7J34j22J00nJ50j00q6O9M7R8j72K0K7p7j27L3
2650F8P5M0P0j19Mo9R8o2M9r6k8J25Lo5K7J14j38K9O4r2K32o3j57N5K3j21J67K1m0m6j55Q2
2349I5O3R5j38J0R2p0j09Q2J14M6q0l3j07j7P4J67j02j68M8RQ0l0N7L7r4k7J9r1J3K7nJ48
$$ y = [66, 151, 92, 129, 57, 50, 145, 132, 184, 67, 202, 257, 173, 143, 143, 96, 159, 196, 191, 169, 141, 111, 102, 44, 196, 205, 194, 148, 20, 48, 116, 244, 182, 199, 156, 92, 187, 128, 275, 161, 74, 144, 27, 110, 42, 35, 244, 264, 70, 156, 133, 22, 112, 47, 186, 228, 229, 61, 66, 195, 162, 72, 60, 94, 160, 286, 210, 89, 196, 183, 34, 135, 115, 91, 35, 158, 120, 53, 107, 137, 47, 238, 137, 166, 136, 211, 225, 123, 95, 218, 68, 74, 167, 256, 173, 157, 131, 88, 67, 192, 135, 154, 102, 42, 12, 17, 57, 105, 85, 256, 381, 240, 361, 242, 140, 90, 78, 94, 223, 90, 165, 156, 237, 177, 160, 164, 199, 117, 218, 236, 86, 56, 20, 52, 200, 87, 164, 37, 211, 73, 356, 317, 332, 211, 129, 309, 421, 278, 412, 608, 655, 1322, 1821, 1803, 1390, 786, 656, 415, 251, 63, 163, 215, 139, 153, 196, 124, 160, 92, 105, 117, 136, 79, 213, 91, 191, 186, 336, 236, 150, 219, 266, 364, 192, 212, 239, 162, 35, 68, 143, 183, 253, 134, 138, 69, 167, 105, 154, 58, 30, 155, 158, 93, 120, 234, 96, 125, 189, 97, 329, 266, 109, 164, 187, 66, 233, 254, 214, 168, 13, 95, 158, 253, 115, 125, 217, 147, 38, 120, 234, 280, 200, 167, 60, 43, 117, 284, 182, 14, 62, 71, 151, 121, 178, 215, 121, 94, 113, 22, 35, 62, 57, 205]
2049B05J6l8j6j27Q6J0o1ol2k3J57K8p9P1J3j40Q8j00J68m7K5m3p6K18k75K14j98J52R5j31
1767A54q4O8K8PR4j08j6j04J05R1j77J40j25Q4l5J07M3o4J8q4Ln4L9pl9l7O1k7L1P6l8o6M5
1457A29L3n1P6%j12J05M1j70L3l3K1O3l1l9j2K1k2K5P3%N8m3o1m7j3J27M3J8r3K5q4Q0RK4
1138A93Oj01p7J32j8N4l2p0oL4J4J28%j61N6j1O5j60J11OO4K05j82j76M0%j0m7M4nj9J07r0
828I4J40l5r2J27r7n3J37l7j01J08l3r9j5L6J36k6O6M0k30R0n5o9K8PNJ42J0N1Mk03J1M0J2
518A39M3K0j6r1J29K0j17j2n8k1J29l5P5L8j06k0k0r6J75o2l4m4P3N7rj19Q1q7J69K7j54Q
218H2n1R8P0J8j13n6J13o7%j2O3P3l5r4J04k5m5nj7Oq8J94jn8o7Q9R7j79k7L9NK1L0r1J89
-111B60K4j10j50P8Q5j3L5l3O7P3j36n0j2rqK6K1k8N9M5j29O5o6J30oj75OM0J9N3
$$ y = [205, 221, 183, 167, 40, 126, 136, 75, 69, 37, 14, 171, 199, 120, 191, 204, 64, 152, 52, 220, 173, 198, 155, 79, 297, 22, 236, 38, 190, 285, 154, 70, 138, 166, 173, 267, 159, 143, 39, 144, 235, 58, 198, 73, 157, 122, 229, 272, 208, 226, 142, 145, 91, 130, 123, 84, 47, 108, 81, 112, 188, 150, 84, 129, 162, 111, 187, 187, 75, 180, 221, 51, 84, 51, 72, 135, 104, 65, 53, 74, 52, 77, 150, 150, 208, 165, 104, 57, 44, 171, 214, 232, 139, 164, 80, 160, 169, 193, 199, 98, 21, 153, 135, 189, 157, 87, 81, 115, 129, 257, 257, 96, 152, 141, 206, 46, 157, 163, 227, 432, 250, 74, 114, 114, 104, 57, 101, 96, 77, 184, 94, 234, 199, 107, 234, 137, 84, 221, 184, 83, 191, 158, 59, 44, 80, 216, 190, 256, 296, 66, 156, 101, 32, 60, 67, 72, 214, 224, 275, 279, 76, 87, 127, 139, 182, 202, 186, 95, 224, 244, 127, 115, 57, 36, 165, 130, 205, 243, 137, 117, 97, 1, 176, 114, 80, 36, 109, 166, 157, 38, 119, 32, 201, 228, 74, 82, 31, 129, 199, 217, 104, 48, 161, 94, 94, 82, 145, 218, 183, 89, 193, 168, 123, 118, 101, 107, 19, 213, 212, 154, 87, 176, 273, 94, 67, 106, 111, 132, 162, 71, 260, 284, 174, 24, 102, 187, 174, 209, 176, 243, 316, 180, 130, 118, 109, 101, 127, 148, 120, 179, 224, 95, 160, 94, 224, 218, 43, 49, 89, 108, 161]
-392A61
##PAGE=	F1=6933.42
##FIRST=	19140.455529915001534,	4405.895418600002813,	0.3813647925853729248
##DATA TABLE=	(F2++(Y..Y)), PROFILE
4406H8M5o9N5j6j7J05j4qj13J26L3j08jJ4m3P8J5K1l1k9PJ3j03J48J7l7n2r3L3J7J69mN2j00
$$ y = [88, 133, 64, 119, 103, 86, 191, 177, 169, 56, 182, 215, 107, 106, 120, 77, 155, 170, 191, 160, 131, 138, 151, 48, 196, 213, 176, 124, 31, 64, 81, 250, 246, 298, 198]
$$ [...]
-392H0
##END NTUPLES=	nD NMR SPECTRUM
##END=	
##END=	
