##TITLE=	Jul23-2022.31.fid
TM-VI-152, Ph-pyr, CD3OD 13C

##JCAMP-DX=	6.0	$$ MestReNova 14.3.1-31739
##DATA TYPE=	LINK
##BLOCK_ID=	1
##BLOCKS=	2    
##ORIGIN=	Mestrelab Research S.L.
##OWNER=	hrzepa
##$MNOVA/LINK_BLOCK_TYPE=	ITEM	$$ NMR Spectrum
##$MNOVA/ITEM/POLYGON=	(XY..XY)
5321,5835
8722,5835
8722,8208
5321,8208
5321,5835
##$MNOVA/ITEM/Z=	0
##$MNOVA/ITEM/ANGLE=	0
##TITLE=	Jul23-2022.31.fid
##JCAMP-DX=	6.0	$$ MestReNova 14.3.1-31739
##BLOCK_ID=	2
##DATA TYPE=	MNOVA NMR VIEW DATA
##DATA CLASS=	MNOVA VIEW DATA
##$MNOVA/ITEM/ZOOM/X=	-20.698776542268014111,	240.66949999422217843
##$MNOVA/ITEM/ZOOM/Y=	-438.54699897766113281,	4606.489013671875
##END=	
##TITLE=	Jul23-2022.31.fid
##JCAMP-DX=	6.0	$$ MestReNova 14.3.1-31739
##BLOCK_ID=	3
##DATA TYPE=	NMR SPECTRUM
##DATA CLASS=	XYDATA
##NUMDIM=	1
##ORIGIN=	Bruker BioSpin GmbH
##OWNER=	nmr
##.OBSERVE FREQUENCY=	100.69424847706599735
##.OBSERVE NUCLEUS=	^13C
##.SOLVENT NAME=	MeOD
##.PULSE SEQUENCE=	zgpg30
##LONGDATE=	2022/07/23 17:14:00.000
##.ACQUISITIONMODE=	SIMULTANEOUS (DQD)
##$ORIGINAL FORMAT=	Bruker XWIN-NMR
##$MNOVA/SCALES_VERSION=	9
##$PARAMETER FILE=	(acqus, ASCII, /private/var/folders/f6/rjf_tdyn2v98c5c0wvkgn4s80000gn/T/l0sL5ZJvQeK0RvfGXWorJg/31/acqus, 0)
$$ ##TITLE= Parameter file, TOPSPIN		Version 3.2
$$ ##JCAMPDX= 5.0
$$ ##DATATYPE= Parameter Values
$$ ##NPOINTS= 11	$$ modification sequence number
$$ ##ORIGIN= Bruker BioSpin GmbH
$$ ##OWNER= nmr
$$ $$ 2022-07-23 17:14:13.430 +0100  nmr@CZC10666PP
$$ $$ /opt/topspin/data/agmb/nmr/Jul23-2022/31/acqus
$$ $$ process /opt/topspin3.2/prog/mod/shimcntl
$$ ##$ACQT0= -2.01680680282977
$$ ##$AMP= (0..31)
$$ 100 100 100 100 100 100 100 100 100 100 100 100 100 100 100 100 100 100
$$ 100 100 100 100 100 100 100 100 100 100 100 100 100 100
$$ ##$AMPCOIL= (0..19)
$$ 0 0 0 0 0 0 0 0 0 0 0 0 0 0 0 0 0 0 0 0
$$ ##$ANAVPT= -1
$$ ##$AQSEQ= 0
$$ ##$AQ_mod= 3
$$ ##$AUNM= <au_zgonly>
$$ ##$AUTOPOS= <12 >
$$ ##$BF1= 100.683175
$$ ##$BF2= 400.41
$$ ##$BF3= 100.683175
$$ ##$BF4= 100.683175
$$ ##$BF5= 100.683175
$$ ##$BF6= 100.683175
$$ ##$BF7= 100.683175
$$ ##$BF8= 100.683175
$$ ##$BYTORDA= 0
$$ ##$CAGPARS= (0..11)
$$ 0 0 0 0 0 0 0 0 0 0 0 0
$$ ##$CFDGTYP= 0
$$ ##$CFRGTYP= 9
$$ ##$CHEMSTR= <none>
$$ ##$CNST= (0..63)
$$ 1 1 145 1 1 1 1 1 1 1 1 1 1 1 1 1 1 1 1 1 1 1 1 1 1 1 1 1 1 1 1 1 1 1 1
$$ 1 1 1 1 1 1 1 1 1 1 1 1 1 1 1 1 1 1 1 1 1 1 1 1 1 1 1 1 1
$$ ##$CPDPRG= (0..8)
$$ <waltz16> <> <waltz16> <> <mlev> <mlev> <mlev> <mlev> <mlev>
$$ ##$D= (0..63)
$$ 0 1 0.00345 0 0 0 0 0 0 0.06 0 0.03 2e-05 3e-06 0 0 0.0002 0 0 0 0 0 0
$$ 0 0 0 0 0 0 0 0 0 0 0 0 0 0 0 0 0 0 0 0 0 0 0 0 0 0 0 0 0 0 0 0 0 0 0 0
$$ 0 0 0 0 0
$$ ##$DATE= 1658592852
$$ ##$DE= 6.5
$$ ##$DECBNUC= <off>
$$ ##$DECIM= 760
$$ ##$DECNUC= <off>
$$ ##$DECSTAT= 4
$$ ##$DIGMOD= 1
$$ ##$DIGTYP= 12
$$ ##$DQDMODE= 0
$$ ##$DR= 21
$$ ##$DS= 4
$$ ##$DSPFIRM= 0
$$ ##$DSPFVS= 20
$$ ##$DTYPA= 0
$$ ##$EXP= <c13>
$$ ##$F1LIST= <111111111111111>
$$ ##$F2LIST= <222222222222222>
$$ ##$F3LIST= <333333333333333>
$$ [...]
$$ ##$Sgu3PowerLevels= (0..7)
$$ 0 0 0 0 0 0 0 0
$$ ##$Sgu4PowerLevels= (0..7)
$$ 0 0 0 0 0 0 0 0
$$ ##$Sgu5PowerLevels= (0..7)
$$ 0 0 0 0 0 0 0 0
$$ ##$Sgu6PowerLevels= (0..7)
$$ 0 0 0 0 0 0 0 0
$$ ##$Sgu7PowerLevels= (0..7)
$$ 0 0 0 0 0 0 0 0
$$ ##$Sgu8PowerLevels= (0..7)
$$ 0 0 0 0 0 0 0 0
$$ ##$SguType= 3
$$ ##$ShimPowMaxUA= (0..63)
$$ 130000 130000 130000 130000 130000 130000 130000 130000 130000 130000 130000
$$ 130000 130000 130000 130000 130000 130000 130000 130000 130000 0 0 0 0
$$ 0 0 0 0 0 0 0 0 0 0 0 0 0 0 0 0 0 0 0 0 0 0 0 0 0 0 0 0 0 0 0 0 0 0 0 0
$$ 0 0 0 0
$$ ##$ShimPowMaxUC= (0..63)
$$ 130000 130000 130000 130000 130000 130000 130000 130000 130000 130000 130000
$$ 130000 130000 130000 130000 130000 130000 130000 130000 130000 0 0 0 0
$$ 0 0 0 0 0 0 0 0 0 0 0 0 0 0 0 0 0 0 0 0 0 0 0 0 0 0 0 0 0 0 0 0 0 0 0 0
$$ 0 0 0 0
$$ ##$ShimPowMaxUG= (0..63)
$$ 524287 524287 524287 524287 524287 524287 524287 524287 524287 524287 524287
$$ 524287 524287 524287 524287 524287 524287 524287 524287 524287 0 0 0 0
$$ 0 0 0 0 0 0 0 0 0 0 0 0 0 0 0 0 0 0 0 0 0 0 0 0 0 0 0 0 0 0 0 0 0 0 0 0
$$ 0 0 0 0
$$ ##$ShimPowRcbType= 3
$$ ##$ShimPowRes= (0..63)
$$ 1e-20 1e-20 1e-20 1e-20 1e-20 1e-20 1e-20 1e-20 1e-20 1e-20 1e-20 1e-20
$$ 1e-20 1e-20 1e-20 1e-20 1e-20 1e-20 1e-20 1e-20 0 0 0 0 0 0 0 0 0 0 0 0
$$ 0 0 0 0 0 0 0 0 0 0 0 0 0 0 0 0 0 0 0 0 0 0 0 0 0 0 0 0 0 0 0 0
$$ ##$ShimPowRng0= (0..63)
$$ 1 1 1 1 1 1 1 1 1 1 1 1 1 1 1 1 1 1 1 1 0 0 0 0 0 0 0 0 0 0 0 0 0 0 0 0
$$ 0 0 0 0 0 0 0 0 0 0 0 0 0 0 0 0 0 0 0 0 0 0 0 0 0 0 0 0
$$ ##$ShimPowRng1= (0..63)
$$ 1 1 1 1 1 1 1 1 1 1 1 1 1 1 1 1 1 1 1 1 0 0 0 0 0 0 0 0 0 0 0 0 0 0 0 0
$$ 0 0 0 0 0 0 0 0 0 0 0 0 0 0 0 0 0 0 0 0 0 0 0 0 0 0 0 0
$$ ##$ShimPowRng2= (0..63)
$$ 1 1 1 1 1 1 1 1 1 1 1 1 1 1 1 1 1 1 1 1 0 0 0 0 0 0 0 0 0 0 0 0 0 0 0 0
$$ 0 0 0 0 0 0 0 0 0 0 0 0 0 0 0 0 0 0 0 0 0 0 0 0 0 0 0 0
$$ ##$ShimPowRng3= (0..63)
$$ 1 1 1 1 1 1 1 1 1 1 1 1 1 1 1 1 1 1 1 1 0 0 0 0 0 0 0 0 0 0 0 0 0 0 0 0
$$ 0 0 0 0 0 0 0 0 0 0 0 0 0 0 0 0 0 0 0 0 0 0 0 0 0 0 0 0
$$ ##$ShimSysFunc= (0..63)
$$ 1 2 3 4 5 7 9 11 15 16 8 10 12 14 6 17 13 18 19 20 0 0 0 0 0 0 0 0 0 0
$$ 0 0 0 0 0 0 0 0 0 0 0 0 0 0 0 0 0 0 0 0 0 0 0 0 0 0 0 0 0 0 0 0 0 0
$$ ##$ShimSysMatrix= 0
$$ ##$ShimSysType= 1
$$ ##$TFXNUM= 0
$$ ##$TRIPLO2= 0
$$ ##$VTU= 2
$$ ##$VTUETH= <149.236.99.20>
$$ ##$VTUTY= <no>
$$ ##$WBREFAM= (0..15)
$$ 135 116 100 100 100 100 100 100 100 100 100 100 100 100 100 100
$$ ##$WBREFLM= (0..15)
$$ 0 0 0 0 0 0 0 0 0 0 0 0 0 0 0 0
$$ ##$WBREFPH= (0..15)
$$ 71.66 -68.25 0 0 0 0 0 0 0 0 0 0 0 0 0 0
$$ ##$WBSGU= (0..15)
$$ 0 0 0 0 0 0 0 0 0 0 0 0 0 0 0 0
$$ ##$XFAC= 2
$$ ##END=
$$ 
##$DECIM=	760
##$DSPFVS=	20
##XUNITS=	HZ
##YUNITS=	ARBITRARY UNITS
##FIRSTX=	24231.369385662510467
##LASTX=	-2084.0185409410978536
##DELTAX=	-0.40154708059210514337
##XFACTOR=	1
##YFACTOR=	0.070891297308680073508
##FIRSTY=	-1.2347849607467651367
##MINY=	-19.775270462036132813
##MAXY=	4187.71728515625
##NPOINTS=	65536
##XYDATA=	(X++(Y..Y))
$$ [...]
10093B35j2k4l2k9j4KPKmlLPO%nj0j1nJ4L6M2K5mk2k1j7j8k6k5j4%J3K2K7K8K1J3PJpj6k7
10076A65k9k1oNJrj2lRJ2Lnpl%J%lj1j8k2j9j2n%OJ0J4Rmk1l0k6j3jLJ%MJ5K5L1K7J7J2J8
10058A08L1M1L6K3Pqj7k2j2PK1J4j0k9l2k0omrj6j8j2jMK%MJ3J7J3QPJ2J6J8J3Mqk0k8k6j4
10041A07RL1L8K9J4Lkknpj2j0nLJnj2j4j6j8j4LK0K1Nj1j1jLoj5j1KJ7K3K0J4Nqk0k8k6j9
10024I0pKJ1J9K3J8Oj0k5l1k2oJ0K0J9J5Olo%J9L4L8K7J4Nok2l8m1l0j2MJ6K6L1K9K2J3Lo
10007B55j4j5rnkKPJ0MnojPJ0J0J2J2Qkj5k5k9k4j4qlJJ0J5J2OQJ5J1kj4qQJ4QJKLmj7k8k9
9988A72k3j4pjJ0K8M1L7J4j2k5k8k7k5k1j7j7j7j1%J1J5J2M%KQJ0QJ0K3L8M1K8Oj3k7l3k7
9973A73j0QJ7J3OklJNLpj7j6mQJ4J6K1K9L1K1%j9k8k4j4nKOJpj6j5rqj4j9j5rnnorj4j9j2
$$ y = [235, 223, 199, 167, 138, 124, 126, 133, 135, 131, 128, 131, 138, 144, 144, 139, 129, 118, 113, 127, 163, 205, 230, 226, 204, 183, 166, 148, 122, 97, 83, 83, 96, 118, 145, 173, 194, 207, 214, 215, 208, 192, 165, 136, 115, 109, 114, 115, 106, 94, 91, 100, 112, 115, 110, 103, 100, 100, 101, 101, 98, 87, 69, 47, 28, 16, 11, 11, 17, 27, 41, 50, 46, 25, -5, -31, -44, -45, -42, -41, -41, -37, -22, 3, 34, 61, 78, 90, 108, 139, 180, 216, 239, 246, 238, 221, 199, 187, 194, 215, 229, 219, 190, 158, 138, 132, 128, 119, 103, 85, 73, 72, 76, 78, 78, 82, 95, 112, 125, 133, 140, 152, 168, 186, 199, 203, 195, 175, 147, 121, 107, 116, 147, 185, 214, 228, 231, 229, 227, 222, 215, 203, 193, 188, 191, 192, 187, 175, 161, 145, 127, 113, 116, 136, 157, 162, 151, 140, 139, 142, 136, 121, 110, 112, 129, 152, 172, 186, 191, 183, 163, 135, 109, 90, 83, 85, 96, 115, 138, 156, 162, 152, 127, 96, 74, 68, 78, 98, 117, 132, 138, 135, 129, 129, 148, 182, 220, 247, 261, 266, 260, 238, 200, 159, 129, 117, 121, 137, 163, 194, 223, 245, 258, 261, 255, 241, 226, 217, 212, 210, 212, 219, 229, 233, 228, 222, 221, 228, 238, 248, 260, 272, 280, 278, 263, 238, 209, 185, 171, 163, 160, 161, 171, 186, 198, 204, 212, 227, 238, 236, 222, 214, 222, 236, 244, 245, 247, 250, 246, 229, 201, 172, 149, 135, 128, 127, 137, 165, 206, 243, 257, 245, 220, 192, 165, 140, 119, 102, 85, 68, 57, 57, 68, 83, 95, 99, 99, 101, 109, 119, 127, 137, 160, 198, 239, 267, 273, 260, 233, 200, 173, 163, 171, 188, 201, 207, 205, 202, 203, 208, 211, 204, 187, 171, 167, 175, 189, 205, 226, 255, 286, 307, 307, 288, 260, 236, 222, 217, 219, 225, 226, 219, 203, 188, 179, 171, 157, 138, 123, 114, 109, 104, 98, 89, 75, 56, 44]
9954D4NK6L8L2J9J0J2K2K8K5J5N%nj1j5j6j3j0nQK2K4J1mmJ2K8L1K0Nrj7k1j8j1lPJ7J9Nk2
9937C06m1m2k1KJ2QKMRPkj1j3qlLOPMJKPMlj5j7j4qmkMJ3K1K5J9Pj0k2k7k5k3k4k8l4l3k2
9919B1oJ1K1K6K1J2NPJ8K6K1OnqpokNRNmj2j7j9k3k4j9j0jQRP%klmjMJ1J1%j0j2mLMLMOJ0
9899I5J1J1QNMNPQNkmm%%%jLJ0J8K4K4J7Mj2k8m2m7l9k1lJ4K8L9L5J8K%PRQJ2K1K1Qj0k2l0
9880B16l9m5m2k3kJ5K0J7OlnKJ2J8K1K3J9Pj1k5k8j9nJ2K2K1Rj0k7l3k6j2JRJ4J6J7J7J3N
9864A77nj8k7k9k0q%kqj2j2oMQNkpkOJ5K0J8J3QRJ1PkoKJ2J2KnJJ1J5J1RO%j0j6j5j3j0qp
9845A32j1j1oOJ6K1K0J4Onj3j3mNQjj2j2jJ6K9L1K7J8%j6k4j5nlqj1rkOJ2J1NJNJ4J7J1MJ
9827B54NRJ2Oqk1l0l3l4l2k4j4lMPQQPOLJLRJ1Nlolnj3k0j9j2nJN%rj5j1nlljLKkJKjj3k1
$$ y = [44, 49, 75, 113, 145, 164, 174, 186, 208, 236, 261, 276, 281, 281, 276, 265, 250, 234, 221, 211, 206, 214, 236, 260, 271, 267, 263, 275, 303, 334, 354, 359, 350, 333, 312, 294, 283, 280, 287, 304, 323, 328, 306, 265, 223, 202, 204, 216, 224, 226, 230, 239, 246, 244, 233, 220, 212, 209, 212, 218, 225, 229, 230, 232, 239, 243, 240, 225, 208, 194, 186, 182, 180, 184, 197, 218, 243, 262, 269, 259, 237, 210, 185, 162, 138, 110, 76, 43, 21, 15, 26, 47, 73, 94, 106, 111, 118, 136, 162, 183, 189, 184, 176, 169, 163, 161, 166, 175, 180, 176, 164, 147, 128, 105, 81, 62, 52, 51, 59, 68, 75, 75, 73, 70, 66, 65, 69, 80, 91, 91, 81, 69, 65, 68, 72, 75, 79, 85, 95, 106, 117, 125, 130, 134, 139, 146, 154, 159, 157, 153, 149, 149, 149, 149, 148, 151, 161, 179, 203, 227, 244, 248, 236, 208, 166, 119, 80, 59, 56, 70, 98, 137, 172, 190, 192, 192, 199, 208, 216, 228, 249, 270, 278, 268, 246, 216, 177, 132, 90, 67, 65, 80, 100, 117, 123, 120, 115, 117, 129, 147, 168, 191, 210, 217, 206, 181, 153, 134, 129, 141, 163, 184, 193, 183, 156, 123, 97, 85, 86, 95, 109, 125, 142, 159, 172, 177, 172, 154, 127, 98, 78, 70, 70, 68, 60, 48, 36, 30, 34, 42, 47, 45, 38, 36, 42, 57, 77, 95, 108, 116, 125, 136, 143, 141, 135, 137, 149, 161, 163, 158, 159, 170, 185, 196, 205, 211, 211, 201, 185, 170, 157, 147, 139, 132, 121, 110, 104, 110, 126, 147, 167, 181, 187, 182, 169, 156, 152, 157, 165, 164, 152, 140, 139, 155, 184, 215, 242, 260, 260, 244, 220, 205, 200, 197, 189, 178, 169, 167, 173, 185, 196, 201, 202, 207, 221, 238, 249, 253, 254, 259, 268, 280, 286, 278, 257, 227, 194, 160, 128, 104, 90, 87, 91, 98, 106, 114, 121, 127, 130, 131, 134, 143, 154, 159, 156, 150, 147, 142, 129, 109, 90, 78, 73, 74, 79, 79, 70, 55, 44, 39, 36, 33, 32, 35, 37, 35, 36, 38, 37, 24, 3]
9806Cj5lPJ3J8K2J8J1QJ4K5K8J9kj7j9j2kMOMJ%KOQPRPMjJPRnk5m0m3l6k2oJ0K2L0K6J3kp
9787A05jJ4K4K7K6K1J4J0Nnj9l3l8l4k4rNJ8K3J8Plrj1j0plKKkkJQJ0J0J0OJmlMJ0RMNPMl
9767A90roJRP%j0j2nJjpnPK4L5L2J4rk9l9l7k6j0MJ4J7J8J9J9J2Llnlkmj3k1k6k5k2k2k4k3
9749B8j6pJQJ0OLNJ4K2K9L3K8J8Loj1j5j8j6roj2j3r%NPJ2K0K0J2J%RJ6J3jj4j6j0%J0J5R
9731A78%rrlMRJ2Onj4j6j2j2j2mJ3K5K6K1J6J1J0J0J1Qmj8k5k0oQQJjOJ5J3Jnoqj5j9j7j7
9713A55j7oJ7L9M1K5Mj2j6q%Kj0j9j8j2qlLMKOJ6K5K0J2RQjj4j4qmmlLKoj3j4rojJMJ1K2K8
9694B33J4pk1k4k6l0k6j1LJ1K1L1L6K9J3pk4k7j1OJ3RPJ1J4J1QKj2k0pJ9L0L0L7N0N3M1L5
9678E14M2N0N7P9J13J38J61K15L01M01N33P43R41Q86M23k64p85r18p72n77m32l15k15j60j46
$$ y = [3, -12, -15, -8, 5, 23, 45, 63, 74, 82, 96, 121, 149, 168, 166, 149, 130, 118, 116, 120, 126, 130, 131, 131, 133, 139, 147, 154, 163, 170, 174, 173, 174, 181, 190, 185, 160, 120, 77, 41, 19, 13, 23, 45, 75, 101, 114, 112, 105, 104, 118, 142, 169, 195, 216, 230, 240, 245, 240, 221, 188, 150, 116, 92, 83, 88, 106, 129, 147, 154, 151, 142, 131, 121, 114, 111, 113, 115, 113, 111, 112, 120, 130, 140, 150, 156, 157, 153, 150, 154, 164, 173, 177, 182, 189, 193, 190, 181, 175, 176, 185, 192, 192, 182, 170, 165, 166, 165, 158, 153, 160, 184, 219, 251, 265, 256, 227, 188, 151, 125, 115, 119, 133, 150, 168, 187, 206, 218, 221, 218, 213, 210, 208, 204, 191, 170, 144, 119, 97, 75, 51, 28, 12, 5, 6, 14, 24, 30, 33, 38, 52, 74, 103, 136, 164, 182, 185, 179, 168, 153, 135, 119, 110, 104, 92, 79, 70, 70, 75, 82, 94, 114, 134, 146, 147, 147, 156, 172, 185, 184, 170, 154, 144, 144, 154, 169, 178, 178, 169, 160, 157, 161, 170, 182, 188, 183, 169, 153, 141, 129, 117, 113, 126, 151, 177, 198, 214, 225, 235, 245, 256, 264, 260, 242, 217, 197, 191, 199, 207, 208, 207, 213, 228, 241, 242, 237, 231, 223, 208, 189, 172, 155, 138, 132, 149, 188, 229, 254, 258, 246, 230, 222, 222, 224, 214, 195, 177, 165, 157, 154, 157, 161, 163, 169, 185, 210, 230, 242, 251, 259, 258, 244, 230, 222, 218, 214, 211, 214, 216, 210, 197, 183, 174, 168, 167, 168, 172, 183, 205, 233, 247, 240, 219, 195, 169, 139, 113, 102, 105, 116, 137, 168, 204, 233, 246, 239, 215, 188, 177, 183, 196, 205, 212, 223, 237, 248, 256, 258, 246, 226, 219, 238, 268, 298, 335, 385, 438, 479, 514, 556, 606, 663, 742, 855, 993, 1154, 1369, 1670, 2071, 2604, 3347, 4288, 5174, 5597, 5333, 4548, 3630, 2858, 2281, 1849, 1534, 1319, 1159, 1013]
9668A013j32j05q7q6q0o2m7m3l5j6%L%mrj5j1KNj0l1m4m1k8j0NJ1J3J4J1NkjNNJMJ7K1J4l
9652B47j6k6l0k6j8j3j5j0LK0K8K3J3KlJPJ0RJ7L1M4M3K7Nj2k4k4j7j1j1j1qnqj3j4qnoqq
9635A80mKMJnj2j7j8j5pj%kKJ0J9K0K0J9J5Nqj9k4k1j3lOOLJLLLOJ1J5J8J7J5NprkQJ2RPL
9615B61mj3k2k6k3j3lPJ5J5RMLPJ0OKKJ0J4Rkj1j5k0k5k8k7k1j1lnj1j5nJ4K8K5QkMJ7K4K3
9597B12J7Qjqq%QRLkmpj1j5j6j6j4pKJ2J6J5J1P%j0j3kJ5K6K1Lj3k4k8l0k7j8qjJMRJ6J9J6
9579A67QkolPK1L1L1K0Moqqj3j9k0j2mMRJ1J1J3J6K0K0J8J5J4J2Ojnpqj5k2k2k1j8j7j4oM
9561B05J2J4RKrj7k2j4kJ1J4R%ppKRJ0Llqj5k6l5l2j4QK6L5L5K5Orj4pMQRQLlmKJ0J1Mnpn
9542B29nrj4j8j9j8j4rkMO%pj1oLPONJ1J7J5QLJJMJ1K0K1J1lj0rqj2j7k0j4LK5M1M4L8K8J7
$$ y = [1013, 881, 776, 689, 603, 523, 461, 414, 371, 336, 320, 320, 323, 323, 319, 310, 295, 284, 286, 291, 281, 250, 206, 165, 137, 127, 132, 143, 156, 170, 181, 186, 184, 183, 188, 193, 194, 198, 215, 236, 250, 247, 231, 205, 175, 149, 131, 118, 103, 93, 96, 116, 144, 167, 180, 182, 179, 180, 187, 197, 206, 223, 254, 298, 341, 368, 373, 361, 337, 313, 296, 285, 274, 263, 255, 250, 242, 229, 215, 207, 202, 196, 188, 180, 176, 178, 182, 183, 178, 166, 149, 131, 116, 109, 108, 108, 106, 108, 118, 137, 157, 177, 196, 211, 216, 208, 189, 165, 144, 131, 128, 134, 140, 143, 144, 147, 150, 153, 159, 170, 185, 203, 220, 235, 240, 233, 224, 222, 230, 242, 251, 258, 261, 257, 244, 222, 196, 173, 160, 157, 164, 179, 194, 203, 207, 210, 217, 227, 233, 235, 237, 247, 261, 270, 268, 257, 242, 222, 197, 169, 142, 121, 110, 107, 102, 91, 76, 71, 85, 113, 138, 146, 144, 148, 165, 189, 212, 229, 237, 236, 228, 220, 220, 228, 237, 240, 238, 234, 227, 216, 201, 185, 169, 155, 148, 150, 162, 178, 193, 204, 211, 211, 201, 188, 186, 201, 227, 248, 251, 238, 214, 186, 156, 129, 111, 103, 102, 103, 107, 116, 132, 151, 167, 175, 173, 167, 164, 171, 192, 223, 254, 274, 278, 272, 264, 256, 243, 224, 204, 192, 188, 192, 201, 212, 223, 236, 252, 272, 292, 310, 325, 339, 351, 357, 356, 351, 344, 336, 321, 299, 277, 256, 238, 221, 207, 201, 205, 217, 231, 240, 242, 233, 216, 194, 180, 178, 189, 203, 212, 212, 205, 198, 200, 209, 219, 222, 219, 211, 196, 170, 135, 103, 89, 97, 123, 158, 193, 218, 224, 215, 201, 194, 198, 206, 215, 223, 226, 223, 219, 221, 231, 242, 246, 241, 234, 229, 224, 215, 201, 183, 164, 146, 132, 123, 121, 125, 131, 131, 124, 113, 107, 110, 117, 123, 128, 139, 156, 171, 179, 182, 183, 184, 188, 199, 219, 240, 251, 248, 238, 229, 221, 209, 192, 172, 158, 161, 186, 227, 271, 309, 337, 354]
9523C54Nj0k0k0j5rpj1j7k3k7k7k5k0j2lRJ9K6K3J1jkNJ1QLJNLnj3j4j2j4k0k6k8k1nJ0J7
9506A03J5J2J6J9J9J1Njpj5k0j9j3mNQJ0J9K9L4K8J5Olj2k1k2j6j0omknj3j8j1LROoj5j6j0
9489A03%QJ1RKpj2j0JRJ5K2L0L1K3J2RJ2J3PJlrj6k1j6j1j4k0k2j5pnmlJKQJ3J9J9J4J0ON
9471B20PJ0R%j4j7j1mknnqj6k5k0%K1K8K5J8J3Mqj4qKNmj2j1lkj1k1k2j6rkRJ9K8L3L9M3M4
9453C07L3J1j3k9l1j8kLnj4j3jJ1J1%j7k7k5j6lOROmj7k5k3j5j2j6k3k0mJ7L1L4K6J5Mkpj0
9436A32j4j4oJ5L5L9K6Pmnoj3k1k2j3opj3j8j4pjPJ4K0J7NoqJJ1J4Ooj5j6j0jOJ4J8J6J1Q
9418A76J1J7K0J8J2%j2j8j6q%LN%qj4j3nkpj3j0kK%mmKJ0J2O%lmmnnJJ2K1K3J5%j3k0k0j7
9399A39rk%kppl%NJ2K2K6K0RJoj2j2j2j2j3qNK1K9K3J0jj0j7k1k1j6j0qrj3j2oLMjqj0qmj
$$ y = [354, 359, 349, 329, 309, 294, 285, 278, 267, 250, 227, 200, 173, 148, 128, 116, 113, 122, 141, 167, 190, 201, 200, 198, 203, 214, 222, 225, 226, 231, 234, 229, 216, 202, 190, 176, 156, 130, 102, 81, 76, 86, 103, 118, 130, 146, 165, 184, 195, 200, 199, 192, 177, 157, 138, 125, 121, 126, 134, 144, 163, 192, 226, 254, 269, 275, 272, 260, 239, 217, 201, 191, 185, 181, 179, 174, 161, 143, 132, 135, 144, 150, 144, 129, 113, 103, 103, 111, 122, 131, 133, 126, 114, 104, 105, 114, 129, 151, 181, 212, 235, 247, 256, 268, 281, 288, 289, 286, 277, 261, 240, 224, 213, 199, 179, 157, 142, 135, 130, 126, 123, 124, 126, 134, 147, 166, 185, 199, 209, 215, 220, 227, 237, 246, 246, 232, 215, 204, 200, 198, 193, 188, 180, 164, 139, 119, 119, 140, 168, 193, 211, 224, 228, 220, 206, 198, 200, 205, 201, 189, 178, 175, 173, 162, 141, 119, 103, 94, 92, 101, 120, 148, 181, 220, 263, 307, 340, 351, 338, 309, 278, 260, 258, 261, 256, 242, 229, 228, 239, 250, 250, 233, 206, 181, 165, 162, 168, 177, 183, 179, 162, 137, 114, 99, 87, 71, 48, 28, 24, 41, 72, 106, 132, 147, 151, 149, 142, 132, 118, 104, 98, 113, 148, 187, 213, 220, 216, 211, 205, 192, 171, 149, 136, 130, 123, 110, 92, 78, 71, 70, 77, 91, 111, 128, 133, 127, 119, 120, 131, 145, 151, 145, 130, 114, 104, 103, 109, 123, 141, 157, 168, 176, 187, 204, 224, 242, 254, 254, 242, 224, 208, 200, 200, 203, 208, 208, 200, 186, 173, 168, 166, 159, 146, 136, 134, 136, 136, 132, 128, 130, 140, 152, 158, 158, 155, 151, 147, 142, 137, 138, 150, 171, 194, 209, 209, 196, 176, 156, 139, 130, 128, 128, 126, 119, 112, 109, 109, 114, 126, 148, 174, 194, 203, 204, 198, 186, 174, 162, 150, 137, 129, 134, 155, 184, 207, 217, 216, 206, 189, 168, 147, 131, 121, 113, 104, 91, 79, 73, 76, 80, 79, 71, 61, 53, 49, 48]
9381D8JOQJ0PKJJlrj4qLRQOJ0J3J1Lpj2pJ0L0L6K6Qmoqj1j6j4oNJ2J4QKMQJ0QJnj5j6pJ3L2
9360B06M0L7K7J4JjRJ8J0j4l6m4l6k2pKKoj4j6j0ponlLJ0J4J2Jj0rOK3K9J8Lj1j9k6l1k9j6
9343A07KK3L6L8L1K4K2J6Nrj4j0nkjJJmrj4j8j6j0lmj0j5j5j1j0j0kJ4K8L0K0OmnkKK%JKj
9324B07qj2r%QJ5K2K6K3J5Mj1k4l2l1k3j5j0olJLPRQMj%NJ1J5J9K0J1nk0k4j1OJ8K1J6RJn
9306B54qpmmloj1j6j5j2pm%LLKJNPQRPkk0l2l1j7mMRJ1J4J5J2Jj1k0j8j3oLJ5K1J7PLPR%j4
9286A62k2k2k2k6k8k1JK6L9K9J2JKJ1K0K7L2K7Rj2k2k2j3lKmj9l5l4j8QL0M2M3L1Rj5l2l3
9271A60j6RK8K8J3lqlLLkj0j3rLJ6K1J8J0Lmj0j6j9j7rjMML%mpJJ5K0Qj2k3k1j3j7l0l7k8
9252C8kK1L2L1K8K7K4J7Noj4j9j6nMLrk0k5j9mJ5K7K0jj7j7kJ3K2K0PnoKPJj0j5j3j2o%PO
$$ y = [48, 49, 55, 63, 73, 80, 82, 83, 84, 81, 72, 58, 50, 53, 62, 70, 76, 86, 99, 110, 113, 106, 94, 87, 97, 127, 163, 189, 197, 193, 187, 179, 168, 152, 138, 132, 137, 149, 163, 171, 173, 177, 185, 195, 203, 204, 199, 184, 168, 161, 174, 206, 246, 283, 310, 324, 325, 324, 333, 351, 361, 347, 311, 267, 231, 209, 202, 204, 206, 200, 186, 170, 160, 153, 147, 142, 139, 142, 152, 166, 178, 179, 169, 160, 166, 189, 218, 236, 239, 228, 209, 183, 152, 123, 107, 109, 132, 168, 206, 237, 261, 283, 299, 304, 295, 281, 271, 266, 264, 263, 264, 265, 261, 252, 238, 220, 204, 194, 191, 187, 177, 162, 147, 136, 126, 116, 114, 128, 156, 186, 206, 212, 208, 203, 201, 203, 205, 205, 206, 208, 207, 199, 187, 178, 178, 186, 201, 223, 249, 272, 287, 291, 280, 256, 224, 193, 170, 155, 145, 139, 136, 137, 140, 147, 156, 164, 168, 167, 167, 172, 183, 198, 217, 237, 248, 243, 223, 199, 188, 194, 212, 233, 249, 258, 259, 254, 246, 239, 235, 231, 228, 222, 211, 195, 180, 168, 161, 157, 157, 160, 163, 165, 166, 171, 178, 186, 195, 202, 200, 180, 148, 117, 100, 96, 100, 109, 120, 134, 149, 161, 162, 151, 131, 113, 100, 94, 97, 112, 133, 150, 157, 160, 167, 176, 176, 162, 140, 118, 96, 70, 42, 21, 22, 48, 87, 116, 128, 129, 131, 142, 162, 189, 221, 248, 257, 245, 223, 201, 188, 185, 187, 183, 164, 129, 95, 77, 85, 115, 157, 200, 231, 240, 225, 193, 160, 144, 153, 181, 209, 222, 219, 211, 208, 211, 214, 212, 202, 189, 180, 183, 199, 220, 238, 248, 251, 247, 237, 221, 202, 185, 176, 175, 179, 183, 186, 186, 182, 175, 176, 191, 211, 219, 207, 184, 163, 150, 133, 103, 66, 38, 36, 57, 89, 120, 148, 175, 199, 216, 221, 215, 201, 182, 166, 161, 165, 168, 159, 139, 114, 95, 91, 106, 133, 153, 152, 135, 118, 116, 129, 151, 171, 178, 173, 167, 169, 176, 177, 167, 152, 139, 127, 121, 121, 128, 134]
9234A34LPJ3Rnj5j4pKNNLknllmnnqj4j7j0NJ7J9J5J2RNjqj3j4j3j2j7k0j7j3j2j3j5j2j0n
9216d9%QRKl%J0K0K4K7K8L2M0M9M7K9%k4l4l1k2rQK1K0Jk3l4k2kJ2J6K2K9L1K1QLMMkj2j8
9199B40k3k4k1j4oLMKmqj0oLJ2J7J3NJLLmj0j1m%mj1j5j3pjKKMJ1K2K4J7NlpomKQJ6K1K5K4
9179B73J6Lqj7j9j5j2j1j0qpqp%J1J6J3Njj0k0k4k0j0nkJONLMMkj3j6qKKnj4j8j8j0jK%OK0
9160G3K7K1PKPOpk1k5j9j2rpljLPJ4K2K4K2J4PPJ2J7J7J2PKMQJ2J2Mqk2l0l4l5k9j3PK3K8
9142A53K4J7J1Jj1j9j8rKJ4K2K5K1J2N%mj2j9k4l1l3k6j2j%j%MKoj0nOJ7K1J8J4J7K8L8M0
9125B71L1K0Qnj8k3j9j2okLQJ3J1Mrj8k1j5j2j1rmNPQOL%jLJ2J6J6J5J2Kqj1kPKj1k0j7j4
9106B15j3j4j6j8k0j6mMJlkKNPJ0J4J2NJMPLkmjjllPK2L1K3Kj2j0JNmj3j5j2rmjkprnjmj4
$$ y = [134, 137, 144, 157, 166, 161, 146, 132, 125, 127, 132, 137, 140, 138, 133, 130, 127, 123, 118, 113, 105, 91, 74, 64, 69, 86, 105, 120, 132, 141, 146, 145, 137, 124, 110, 97, 85, 68, 48, 31, 18, 6, -7, -22, -34, -44, -49, -49, -41, -32, -30, -33, -33, -23, -3, 21, 48, 76, 108, 148, 197, 244, 273, 273, 249, 215, 184, 162, 153, 161, 182, 202, 203, 180, 146, 124, 122, 134, 150, 172, 201, 232, 253, 261, 264, 268, 272, 270, 258, 240, 217, 193, 172, 158, 152, 155, 159, 161, 157, 149, 139, 133, 136, 148, 165, 178, 183, 184, 187, 190, 186, 176, 165, 161, 161, 157, 146, 131, 118, 111, 110, 112, 114, 118, 129, 151, 175, 192, 197, 194, 187, 181, 177, 179, 187, 203, 224, 249, 273, 289, 292, 284, 267, 248, 233, 221, 210, 200, 192, 185, 177, 170, 170, 181, 197, 210, 215, 214, 204, 184, 160, 140, 130, 125, 123, 124, 130, 135, 138, 142, 146, 144, 131, 115, 107, 109, 111, 106, 92, 74, 56, 46, 45, 47, 47, 53, 73, 100, 121, 128, 130, 137, 143, 136, 115, 90, 71, 59, 50, 43, 40, 39, 42, 49, 63, 85, 109, 131, 145, 152, 159, 171, 188, 205, 217, 224, 226, 230, 238, 250, 262, 266, 258, 236, 206, 172, 137, 108, 95, 102, 125, 153, 177, 194, 205, 206, 195, 176, 158, 149, 151, 165, 187, 212, 233, 245, 250, 250, 246, 234, 215, 191, 160, 127, 101, 89, 88, 88, 87, 87, 91, 93, 87, 77, 72, 78, 95, 116, 134, 148, 165, 193, 231, 271, 302, 322, 330, 325, 307, 284, 265, 253, 247, 245, 248, 256, 269, 280, 284, 275, 257, 236, 221, 209, 198, 189, 185, 190, 197, 205, 211, 214, 214, 213, 216, 228, 244, 260, 275, 287, 289, 281, 270, 268, 275, 277, 266, 246, 229, 215, 202, 188, 172, 154, 134, 118, 114, 118, 119, 116, 114, 116, 121, 128, 138, 152, 164, 169, 170, 174, 181, 184, 182, 178, 177, 176, 173, 170, 177, 199, 230, 253, 255, 243, 233, 234, 239, 235, 222, 207, 195, 186, 182, 181, 179, 172, 163, 158, 157, 153, 139]
9086A39k1j9j3j4j7j5qLQJ4K1K6K1J0kpmmnqnJJ0J9K5K2J2lj4j9k2k4k4j9j7j9j9j1KJ7K3
9069D0J9J4J3R%j3k0j5nkrj6j8j4oOJ9L3L7L0J8J0QONQJ7L0L1J5j1k8k5j0KJpj1j1qpml%%
9051A28%LPJ6K3K4J8Plj1j6j8j5rj0j4j5pLMmj5j8rPK1K6K1J1MNMmj7k1j0OJ0Ml%NLmolkj0
9032A16j9k2j7qJRJ2RNRJ8J8Opj1JJ2Rlj1qOJ6K0K3K7K9K6J5PJlpj4k3l6m2l5j6jJ%KLlj0
9014A05qLJ3Ooj3j3j3k0k7k6j5lMRJ7L0L4K5J1J%KNPJ0J3Rpk2k7j4OJ9J7Nmqj0qpmloj1j5
8995F1j1LK3L1K2OjQK1K7K3J3PKMOLoj1rpj2j8j4lRQ%opnmoqqpoomLQQPJ1J4J4Ojklj0k0k2
8974A31j8j1qrj0j1rkJ4L0L3K3J4J0J1Nj1l1l8k8pQJ5J5J7J8K0J6RKnrqjNN%mjMJrk1k3k1
8956A11j8j3nQK3L4M0M0L2J6nk2k8k8k4k1k0j9k2k3j7q%JjjLMkj0j4rkJJMJ1J6J9J8K1K5K7
$$ y = [139, 118, 99, 86, 72, 55, 40, 32, 35, 43, 57, 78, 104, 125, 135, 133, 126, 122, 118, 113, 105, 100, 101, 111, 130, 155, 177, 189, 186, 172, 153, 131, 107, 83, 64, 47, 28, 9, -2, 0, 17, 40, 59, 73, 86, 95, 95, 82, 62, 47, 42, 40, 31, 15, -3, -17, -23, -17, 2, 35, 72, 102, 120, 130, 138, 144, 149, 157, 174, 204, 235, 250, 239, 211, 186, 176, 178, 179, 172, 161, 150, 142, 135, 131, 128, 128, 128, 128, 131, 138, 154, 177, 201, 219, 226, 223, 212, 196, 178, 163, 154, 144, 130, 115, 108, 111, 115, 111, 96, 78, 69, 76, 97, 123, 144, 155, 159, 164, 168, 164, 147, 126, 116, 122, 132, 136, 133, 133, 138, 141, 137, 131, 128, 126, 116, 97, 75, 58, 50, 51, 60, 72, 81, 86, 95, 113, 131, 137, 130, 119, 120, 132, 141, 138, 127, 119, 125, 141, 161, 184, 211, 240, 266, 281, 288, 289, 286, 279, 265, 242, 206, 164, 129, 113, 112, 113, 113, 115, 118, 115, 105, 97, 100, 113, 119, 113, 100, 87, 74, 54, 27, 1, -14, -17, -13, -4, 13, 43, 77, 102, 113, 114, 114, 116, 121, 128, 138, 151, 160, 153, 131, 104, 90, 96, 115, 132, 137, 133, 125, 115, 107, 100, 96, 93, 87, 76, 61, 50, 53, 76, 107, 129, 135, 134, 142, 163, 190, 213, 226, 233, 235, 239, 245, 248, 242, 231, 222, 215, 203, 185, 171, 168, 177, 185, 185, 179, 172, 167, 163, 157, 149, 141, 134, 128, 122, 118, 121, 129, 137, 144, 155, 169, 183, 189, 188, 186, 183, 173, 153, 131, 113, 102, 94, 85, 75, 64, 55, 53, 67, 97, 130, 153, 167, 177, 188, 193, 182, 151, 113, 85, 78, 86, 101, 116, 133, 151, 171, 187, 196, 198, 193, 184, 176, 175, 180, 185, 185, 181, 180, 184, 185, 176, 155, 132, 111, 93, 80, 75, 83, 106, 140, 180, 220, 252, 268, 263, 241, 213, 185, 161, 140, 120, 101, 79, 56, 39, 31, 31, 32, 31, 30, 33, 37, 35, 25, 11, 2, 0, 1, 2, 6, 17, 33, 52, 70, 91, 116, 143]
8938A43J8QLNNjmjL%qj2mJ2L0L7L3K3J6J0Noj8k5k0r%NOKrj9k6k5k3k6l0l0k2rKOLj0j9j8
8920AlJ6L1L7L5K8J8Lrj6j7j1kMLkkQJ9K1J5J2J2J1MKJ1J9J5JokNJj2k4k4j2PJ9K0J1Jrj8
8902B21k1j5JJ5J7J2QPKqj1rkMPJ3J9J9J8J0nj8j8nPjj7k8k4j5pjLJqj0lRJ6J4J0Ojj0j4j0
8883A78nqj4j6j0nnrj0kJ1K4L5L9L3J5oj8j8j0j0j8l1l6l3k3j3nLJ3K2K1J4ONPJ1J2J5J7J0
8867A86nj9k0j2jJnplLLnj2j2pJON%oo%MOOJ0J4J5J3Pkj4k3k2j1jPQRRJ3J6J2%j1j2pkMQJ0
8846A51Jrr%Nnj9k1j0kkmmmmkNJ0J1OlqnJPONQJ2J1PJ5K9L9L1J1mj0j3j5j7j5j2pjRJ1P%M
8826A97J4K4K2Pj2k9l4k5qRJ8J7Lj9l8m2k8pML%JMMK%loj1j1oJNJk%J1K8M0M1L1J6Lnrj1k0
8808A80l1l6k8oJ9L5L4K3J2QOKm%J0J8J3ok1k7k3j5mJ0K1K5K2J4Lnrolmj1k2l1l1k3q%MMM
$$ y = [143, 161, 169, 172, 177, 182, 181, 177, 176, 179, 179, 171, 159, 155, 167, 197, 234, 267, 290, 306, 316, 321, 315, 297, 272, 252, 243, 243, 248, 254, 256, 247, 228, 202, 177, 154, 128, 98, 68, 46, 37, 39, 45, 48, 38, 19, 1, -2, 14, 45, 82, 117, 145, 163, 166, 157, 141, 124, 113, 111, 115, 118, 116, 114, 122, 141, 162, 177, 189, 201, 212, 216, 218, 229, 248, 263, 264, 258, 256, 261, 262, 250, 226, 202, 190, 197, 216, 236, 247, 248, 239, 221, 200, 185, 186, 201, 218, 230, 238, 245, 247, 239, 228, 219, 217, 221, 228, 241, 260, 279, 297, 307, 302, 284, 266, 261, 268, 267, 250, 222, 198, 183, 176, 175, 178, 179, 171, 161, 158, 167, 183, 197, 207, 213, 212, 202, 188, 178, 173, 165, 151, 135, 125, 120, 115, 106, 96, 94, 105, 129, 164, 203, 236, 251, 245, 227, 209, 199, 189, 171, 140, 104, 71, 48, 35, 30, 33, 46, 68, 89, 103, 109, 114, 121, 132, 144, 159, 176, 186, 181, 162, 142, 130, 129, 130, 125, 118, 115, 118, 121, 116, 104, 92, 85, 86, 92, 97, 97, 91, 85, 85, 89, 95, 101, 111, 125, 140, 153, 160, 158, 144, 121, 99, 88, 87, 94, 102, 111, 120, 133, 149, 161, 161, 150, 138, 131, 129, 133, 141, 151, 152, 143, 134, 134, 139, 134, 115, 94, 84, 82, 80, 76, 72, 68, 64, 62, 67, 77, 88, 94, 91, 83, 78, 79, 86, 92, 97, 105, 117, 128, 135, 150, 179, 218, 249, 260, 256, 246, 233, 218, 201, 186, 174, 167, 166, 175, 186, 193, 193, 197, 211, 235, 257, 264, 252, 223, 189, 164, 156, 165, 183, 200, 203, 184, 146, 104, 76, 69, 73, 76, 76, 77, 81, 85, 87, 87, 84, 78, 67, 56, 50, 51, 56, 57, 55, 55, 66, 94, 134, 175, 206, 222, 225, 220, 211, 200, 180, 149, 113, 85, 79, 98, 133, 167, 190, 202, 210, 216, 218, 214, 214, 224, 242, 255, 249, 228, 201, 178, 163, 159, 169, 190, 215, 237, 251, 254, 249, 240, 234, 231, 227, 216, 194, 163, 132, 109, 101, 101, 105, 109, 113]
8790A13MJlpj4k0k4j9j1lKNJ1J8K6K6K2J3J0J0Olj3j3mNRQKmj3k2l1l2k7j8j0ojOQOjjOJ4
8771C1K0K1J9J0%mJRJ1J0J3K2L1L2K6J8J2Plj4j7j0JPKrj7j8j1JJ2J6J0nj7k1k1k1k4k7k5
8755G8j8jJ6K0J0lmRK5L0K4J4QPKkorqolJJKLPQJ1J4J6J3N%mpj2j8k1k3k5k7l1k7j8lNMkJ
8735E6J6L5M2L3K2J5Rjj1j3nMMJkloj2j7j3nKMKjpnPK1K4J5Jrj7k7l1k3p%LNJ5K7L3L6L3K5
8716B75J6RJ1J3J3J0Jj3k8l1j8ljqj0jJ0J3P%mJJ0J4NolJ0J3lk0j9pmj0j5j1qj3j7j3JJ2J5
8699A93J2Loj1o%Jmqolmqj0j2j5j3qmjJPJ4J5RJljJMNJ0J6J7J1M%KMKnj7k7l1k5j5nk%j%%
8678H1LNNLLQJ1QMPJ6K0J1nj6j5rJJ1J7K3K1J2pk9m6m8l3j0J3K3K1J2PQPLmrj0pnj0j3qOJ8
8659A04J6Kj0j1j0j0q%J0J0kj5j9j4lOJ0PJjjlrj3j0lMRJ3J4J3Olj0j4j4nQK2K8K4J9Rmj4
$$ y = [113, 117, 118, 115, 108, 94, 74, 50, 31, 20, 17, 19, 24, 35, 53, 79, 105, 127, 140, 150, 160, 166, 163, 150, 137, 133, 138, 147, 155, 157, 153, 140, 118, 87, 55, 28, 10, 0, -6, -7, -1, 7, 13, 12, 11, 17, 31, 51, 72, 91, 101, 101, 97, 98, 107, 118, 128, 141, 163, 194, 226, 252, 270, 282, 289, 286, 272, 255, 245, 246, 253, 255, 246, 229, 211, 200, 201, 213, 229, 239, 234, 217, 196, 175, 154, 130, 103, 78, 60, 59, 75, 95, 105, 102, 98, 107, 132, 162, 186, 200, 208, 215, 217, 215, 209, 200, 192, 186, 183, 184, 185, 187, 190, 197, 205, 216, 230, 246, 259, 264, 264, 260, 253, 241, 223, 202, 179, 154, 127, 96, 69, 51, 48, 53, 57, 55, 56, 72, 107, 149, 182, 204, 219, 228, 227, 216, 203, 198, 202, 206, 207, 205, 202, 196, 184, 167, 154, 149, 151, 155, 157, 156, 149, 144, 151, 172, 196, 211, 212, 203, 186, 159, 128, 105, 98, 98, 101, 106, 121, 148, 181, 217, 250, 275, 291, 300, 311, 324, 337, 347, 348, 335, 307, 276, 258, 255, 254, 246, 236, 235, 245, 258, 265, 265, 261, 262, 272, 286, 291, 285, 282, 292, 305, 302, 282, 263, 256, 252, 242, 227, 216, 208, 195, 178, 165, 166, 178, 193, 205, 208, 202, 191, 185, 185, 186, 182, 174, 168, 165, 161, 153, 143, 131, 116, 103, 95, 91, 90, 91, 98, 112, 127, 136, 137, 134, 133, 134, 138, 143, 153, 169, 186, 197, 201, 201, 203, 207, 209, 204, 187, 160, 129, 104, 89, 84, 82, 82, 81, 81, 81, 84, 89, 94, 97, 100, 108, 119, 127, 131, 138, 154, 174, 185, 180, 164, 149, 140, 141, 152, 169, 192, 213, 225, 218, 189, 143, 95, 62, 52, 65, 88, 109, 121, 128, 136, 143, 146, 142, 133, 123, 116, 111, 101, 88, 80, 86, 104, 120, 122, 112, 101, 91, 81, 73, 73, 83, 93, 91, 76, 57, 43, 40, 46, 56, 63, 64, 63, 62, 59, 50, 37, 27, 24, 28, 37, 50, 64, 77, 83, 80, 70, 56, 42, 37, 45, 67, 95, 119, 138, 147, 143, 129]
8641A29j7pMQJqj2j0qmJJ1K4K7J7rl2l9l2k3k1k2j1PJ8K1K5L0L4L0K0J3PNOQPLoj5k0j6mR
8623A49J7J6J1RO%pqjNNJqj3j1lJjj2k2k3j8pMJ1J0NKKKjkKRJ2Mj0k1k2j9j7j7j0MJ4J6J7
8604H1K1K7K6J7J6K4K9K3R%nj0j9k4k1j5rqqlNJ1J3J4J3Rjj3k4k7k6k1j4nKOQPjj2j3lJ0J3
8587A02RNNJqj9k6k7k1oJ0K2K3K0J8J6J1KmmNJ3J5J0RJ6K8L4K6Pj7m3o1o0l7rRJ4J7K0K2J6
8570A63QLmpoJLlj3j9j8j0LJ6K2J6KlKQPJ%%%KPRKpnJ0K1J8RLMKlpm%Kkoj1j4j5j2o%mj3j6
8548A36j1JJ1J7K3K4J4nk3l1l2l5l2j7LJ8J8J2Pjj0j4j1omJJ7L7M6M1K9K2K0J8J2N%mlnj3
8532B75k3k7k0j0jPJ1J1O%JLL%nqj0j1oKOMMMRJ3K0K4K0OoqLRMj1j8j6j0rj7k5k6j4PJ7Rq
8512A89j4kJ6K1J3QJ0J9K0J5J0Jrk2l0k7j9j1rrrpkKOPNLNLkrj2nKJpj5j9j4kJ2K2K6K5K8
$$ y = [129, 112, 105, 109, 117, 118, 110, 98, 88, 80, 76, 77, 88, 112, 139, 156, 147, 115, 76, 44, 21, 0, -22, -33, -26, -8, 13, 38, 68, 102, 132, 152, 165, 172, 177, 183, 191, 198, 201, 195, 180, 160, 144, 140, 149, 166, 182, 193, 202, 208, 208, 201, 193, 192, 197, 202, 203, 195, 182, 171, 168, 169, 168, 156, 134, 111, 93, 86, 90, 101, 111, 116, 118, 120, 122, 121, 119, 121, 130, 142, 146, 136, 115, 93, 74, 57, 40, 30, 34, 48, 64, 81, 102, 129, 155, 172, 188, 212, 241, 264, 273, 273, 268, 258, 239, 215, 194, 179, 170, 162, 154, 151, 156, 167, 180, 194, 207, 216, 215, 202, 178, 151, 125, 104, 90, 85, 87, 93, 101, 108, 107, 95, 82, 79, 89, 102, 111, 116, 121, 122, 114, 95, 69, 42, 21, 15, 25, 47, 70, 90, 108, 124, 135, 137, 133, 129, 134, 147, 162, 172, 181, 197, 225, 259, 285, 292, 275, 232, 171, 111, 74, 65, 74, 88, 105, 125, 147, 163, 171, 174, 170, 163, 157, 158, 161, 158, 145, 126, 108, 98, 101, 117, 139, 155, 157, 154, 156, 164, 171, 172, 172, 172, 172, 174, 181, 190, 192, 185, 180, 190, 211, 229, 238, 241, 245, 247, 244, 237, 233, 233, 235, 233, 227, 216, 202, 187, 175, 169, 169, 165, 152, 136, 125, 126, 137, 154, 177, 201, 215, 210, 187, 156, 124, 89, 57, 40, 43, 61, 79, 91, 98, 97, 87, 73, 62, 56, 52, 53, 70, 107, 153, 194, 223, 245, 265, 283, 295, 300, 300, 296, 293, 288, 275, 252, 225, 205, 195, 194, 201, 212, 223, 229, 229, 230, 233, 236, 236, 231, 223, 213, 202, 196, 198, 204, 208, 212, 216, 225, 238, 258, 282, 302, 308, 302, 294, 297, 306, 310, 299, 281, 265, 255, 246, 229, 204, 178, 164, 171, 188, 197, 189, 175, 173, 189, 210, 223, 231, 241, 260, 280, 295, 305, 306, 297, 275, 245, 218, 199, 188, 179, 170, 161, 154, 152, 154, 160, 167, 172, 175, 180, 183, 181, 172, 160, 155, 157, 158, 151, 136, 117, 103, 101, 113, 135, 161, 186, 214]
8494B14L0K5Qoj3j4j6j8j1KJ1Pnj2j1j0j0j3j3j2pOJ8K5K8K9L4L1J5lj0mNQNJnj6k6k4j5n
8477B23nqrlMPN%oj0j3j6j8j7j2mKORJ0Onj3j1JJ4K2K4K0Qrj9j5lJJMRJ0MkJNPLjkpj4k2l0
8457A32l7l7k7pJ5K9K8J6NNJ4K1J5Krj5j7k0j9j2%J2K4K8K4J2%rqlQJ8K4K2J7J1Mmj5k2k2
8440B03j4lRJ3J1Koqqqj3j7j3kLmj4j4JK0L2K9J5nk1k3j6kJ1K2K5J5Koljj0k2k5j4KJ3J5J1
8422A82NKjk%MNjj4k1k1j5j3j4qLJ6K1K3J9J0%%J0J5Mj4j9rOJ3J4J3J0Loqlkoj4k0k3k8k6
8404I0j1J1K5K7K2J8J1Lnj0j3j4j0jNKopLJ0RKkjMQJ0PL%%mj4k6l0k5j9j4r%PJ1J2J2J4J4
8386A19J8K3K6K1RlplMPRRP%rj6j7j7k1k9l5l2k0kJ3K1K1J8J8J9J3KnlPJ8K4K6K0J2%j2k3
8369B30l3l6k7j2JROlj7k5k4j8p%MLkqoJJ4K4K7K4J2mj9k9k6j5JJ8K8K9K2J0JkKRJ3J2RKl
$$ y = [214, 244, 269, 277, 271, 258, 244, 228, 210, 199, 201, 212, 219, 214, 202, 191, 181, 171, 158, 145, 133, 126, 132, 150, 175, 203, 232, 266, 297, 312, 309, 299, 295, 300, 308, 313, 314, 309, 293, 267, 243, 228, 223, 218, 210, 201, 198, 202, 209, 214, 214, 208, 198, 185, 169, 151, 134, 122, 118, 120, 126, 135, 145, 151, 146, 133, 122, 123, 137, 159, 183, 203, 211, 202, 183, 168, 165, 166, 167, 171, 180, 190, 194, 192, 193, 198, 205, 208, 207, 205, 198, 184, 162, 132, 95, 58, 31, 24, 39, 68, 96, 112, 117, 122, 136, 157, 172, 174, 165, 150, 133, 113, 94, 82, 82, 94, 118, 146, 170, 182, 182, 173, 165, 162, 170, 188, 212, 234, 251, 262, 266, 262, 247, 225, 203, 189, 186, 195, 208, 219, 221, 215, 207, 199, 191, 178, 161, 148, 146, 149, 145, 131, 117, 118, 138, 170, 199, 214, 209, 188, 165, 149, 147, 158, 180, 205, 220, 222, 216, 213, 212, 202, 180, 155, 141, 143, 156, 171, 182, 187, 189, 188, 186, 186, 190, 195, 194, 180, 159, 138, 123, 110, 96, 88, 91, 107, 128, 151, 170, 180, 180, 180, 190, 205, 209, 195, 176, 167, 173, 186, 200, 213, 223, 226, 220, 212, 209, 207, 201, 187, 167, 144, 116, 90, 79, 90, 115, 142, 164, 182, 193, 196, 191, 181, 168, 154, 144, 143, 148, 150, 144, 137, 140, 150, 159, 161, 159, 158, 162, 170, 180, 187, 190, 190, 190, 186, 172, 146, 116, 91, 72, 58, 49, 49, 56, 67, 79, 91, 105, 119, 137, 160, 186, 207, 216, 213, 206, 203, 207, 214, 223, 232, 239, 239, 230, 214, 197, 180, 159, 130, 95, 63, 43, 41, 54, 75, 96, 114, 132, 151, 164, 166, 161, 158, 165, 183, 207, 233, 253, 265, 265, 253, 230, 197, 161, 134, 122, 123, 132, 138, 135, 118, 93, 69, 51, 44, 44, 48, 51, 49, 41, 35, 36, 50, 74, 101, 125, 137, 133, 114, 85, 59, 44, 45, 63, 91, 120, 142, 152, 153, 151, 153, 162, 175, 187, 196, 198, 195]
8351A95moj3k3k4qJ6L0K4Qqj5j3nKMJknrj5j9j5romljjJ%oj4j6j2oJRJ8K0J0%%OPLQK4L5K9
8331A89J3NONJkjK%pj4j9k6l1l3k8j4%J0J2QNOQJ3J8K0J4Lmpqj1j4qKJ4K2K4J9Rlj5k6l3l7
8312H7l4k6j8j2j0qjPJ4J2Lrj3j4rlQK1K6K0Qmrj4j5pJ3L1L7K7J6J5K0K2J8J1OOPMpk3l4l4
8294A35k1pNJ1J0NKNJ3K3K9K7K0Qoj4pQK0J9Rmj4k4l0l2k9k1j9j9k0j1PK4L2K8J6JqrjOOk
8277A71qrnnn%QJ8K5K3J8J5J6J5Ppj8j7qjJlnmlmrj5k1k2j7mPJ7J8J2KoqnjLNNJnj2j5rLJ4
8256A53J1jj4j7j0lmqroNK0L7M5L9J8pk2k2mJ7K6J4mj2lN%j2j7mJ4J9J2OJ1K2K1Mk2m0m3l9
8239A76l3k6j5kOONRJ6K1K5K3J9J1Lmj0qjJ0J6J1Jpj1j5k2k4j9oORQQJ0J0O%KJ2K1K0J0lo
8221B68l%lj1j7j9j7j3rlJJLNPPNlj4k4k2j3nmrj1j0nJJ1J5J0%jQJ7J8J2MJmrj3j7k2k2rQ
$$ y = [195, 191, 185, 172, 149, 125, 117, 133, 163, 187, 195, 187, 172, 159, 154, 156, 160, 161, 159, 154, 145, 130, 111, 96, 87, 81, 77, 74, 73, 72, 73, 73, 67, 53, 37, 25, 19, 20, 29, 47, 67, 77, 77, 77, 83, 90, 93, 101, 125, 160, 189, 202, 207, 213, 218, 219, 217, 216, 218, 218, 211, 197, 178, 152, 121, 88, 60, 46, 46, 56, 68, 76, 81, 87, 95, 108, 126, 146, 160, 163, 159, 152, 144, 133, 119, 111, 113, 127, 149, 173, 192, 201, 198, 183, 157, 124, 87, 53, 27, 9, -3, -13, -21, -22, -15, -1, 11, 14, 5, -8, -22, -31, -34, -26, -5, 21, 41, 49, 45, 36, 22, 7, 0, 13, 44, 81, 108, 124, 139, 159, 181, 199, 210, 216, 222, 229, 233, 226, 203, 169, 135, 114, 107, 112, 123, 133, 138, 140, 145, 158, 181, 210, 237, 257, 265, 259, 245, 238, 246, 266, 285, 294, 290, 276, 252, 222, 190, 161, 140, 121, 102, 82, 71, 78, 102, 134, 162, 178, 179, 171, 162, 161, 167, 173, 171, 163, 154, 149, 144, 139, 139, 147, 165, 190, 213, 231, 246, 262, 277, 284, 277, 259, 242, 234, 233, 234, 231, 226, 222, 219, 215, 206, 191, 170, 148, 131, 127, 134, 151, 169, 181, 183, 177, 169, 164, 163, 166, 171, 176, 177, 172, 160, 145, 136, 139, 153, 164, 163, 149, 132, 122, 119, 115, 107, 98, 92, 97, 117, 154, 199, 238, 256, 249, 227, 205, 201, 218, 244, 258, 254, 242, 239, 244, 244, 232, 215, 211, 225, 244, 256, 262, 273, 295, 316, 320, 298, 258, 215, 176, 143, 117, 102, 100, 106, 112, 117, 126, 142, 163, 188, 211, 230, 241, 244, 240, 230, 222, 221, 231, 247, 258, 259, 252, 241, 226, 204, 180, 161, 155, 161, 170, 178, 186, 196, 206, 212, 212, 214, 226, 247, 267, 277, 274, 268, 265, 265, 262, 251, 234, 215, 198, 185, 176, 173, 174, 175, 178, 183, 190, 197, 202, 199, 185, 161, 139, 126, 121, 117, 108, 97, 87, 82, 83, 94, 109, 119, 119, 118, 126, 143, 161, 173, 177, 178, 174, 165, 152, 135, 113, 91, 82, 90]
8202I0K1K4J5Nmrrqom%PJ3J6J7J8J5RPJ1K2L0K6J4lj2j7j3rllqj5j9j5oPK2L2L5L0J9Mj5k9
8184C02k8j6mmqj2j3k0k5k0nQJ0%j1j9j9j3mJKLMKNJ5K9K8Pj9l2k5j1kJjjKOOLMJ1K0J9Nj1
8165A70k0j7pJLmj7k3k0j1jJKOJ6K5K5J6NkmjPJ8J9Rlqmkoj2j6j5j2pproLRMmmMR%j1j3p%
8144G9%kqrkPPjqrkLJ2K1K4J8RMjornLQJ0J3J3QLknplQJ9J9Q%mqj7k4k7l0l0k1mJ2K0J6Nr
8123I6k0j7%K0K4J5RJ8L3M1L2J2oj4j2j0pljnj7l1l7l1j5JJ1PloLJ7K4K0J2NMNKjjPJ2Lj4
8105A82k3j6okpj2j5j8j8j6j4j7j8j5mRJ8K6K9K8K3J8J2OPJ5K6K5J1nrjRJ3Oqk5l7m0l3k2
8089H2j2pj5k3k2j1lmnjOMLRK6L4K9J2lj0j0qpoqn%PJ3J2OlrpNK1K9K9K2J5J0Jj2k3k4k0j5
8070A02j5j6j6j2kQJ4J1LorqnkNQOLJMRJ5K0K5K7K3J8Qj0k4l0k2qMJ3K1K7L1L0K3Oj5l3l9
$$ y = [90, 111, 135, 150, 155, 151, 142, 133, 125, 119, 115, 115, 122, 135, 151, 168, 186, 201, 210, 217, 228, 250, 280, 306, 320, 317, 305, 288, 275, 266, 263, 260, 252, 237, 218, 203, 197, 204, 226, 258, 293, 323, 342, 346, 331, 302, 274, 258, 254, 250, 242, 230, 217, 197, 172, 152, 147, 155, 165, 165, 154, 135, 116, 103, 99, 100, 102, 105, 109, 111, 116, 131, 160, 188, 195, 176, 144, 119, 108, 106, 107, 106, 105, 107, 113, 119, 122, 126, 137, 157, 176, 181, 170, 150, 133, 126, 127, 130, 126, 109, 86, 66, 55, 54, 55, 57, 63, 79, 104, 129, 145, 150, 148, 144, 143, 150, 168, 187, 196, 193, 185, 181, 179, 173, 161, 145, 130, 118, 111, 104, 95, 89, 92, 101, 105, 101, 97, 101, 110, 110, 99, 86, 79, 79, 79, 77, 69, 60, 58, 65, 72, 71, 63, 54, 52, 55, 67, 88, 112, 130, 139, 143, 142, 136, 127, 122, 125, 133, 143, 156, 169, 177, 180, 178, 173, 166, 163, 171, 190, 209, 217, 217, 213, 205, 188, 164, 137, 107, 77, 56, 52, 64, 84, 100, 105, 96, 76, 59, 59, 79, 103, 118, 127, 145, 178, 219, 251, 263, 257, 243, 231, 221, 214, 211, 210, 205, 188, 157, 120, 89, 74, 75, 86, 93, 90, 84, 87, 104, 128, 148, 160, 165, 169, 174, 176, 175, 174, 181, 193, 196, 182, 159, 143, 137, 135, 128, 116, 101, 83, 65, 49, 35, 18, 0, -15, -19, -10, 8, 34, 63, 91, 114, 132, 144, 150, 157, 172, 198, 223, 234, 229, 220, 219, 228, 241, 247, 239, 214, 177, 137, 104, 82, 70, 63, 48, 25, 3, -8, -11, -15, -20, -21, -15, -11, -8, 1, 27, 61, 90, 102, 99, 89, 79, 71, 64, 58, 50, 45, 45, 52, 65, 77, 83, 80, 71, 64, 69, 90, 119, 148, 170, 185, 195, 196, 184, 161, 137, 117, 102, 87, 71, 55, 43, 41, 49, 63, 74, 77, 71, 62, 54, 49, 47, 52, 60, 66, 69, 70, 74, 83, 98, 118, 143, 170, 193, 211, 219, 209, 185, 155, 133, 125, 129, 142, 163, 190, 221, 251, 274, 280, 265, 232, 193]
8052A93l8l0k1j2opj0nPK3L1K3Mj3j7rkjnpplNJ3K2K7K7K2J7J3J3J3PLOJ3J6Qmn%Jpj7j7j4
8034B50j5j8j8j1mjj%klljKJlj0j5j5j2plnrj2j4j6j3qjKLQJ8K5K7K4K4K7K4J0mj3j3j1j1
8016A73j3j8k4l4m0l3j1J5L5L8L4L0L0K6K1J4Ork4l4l4l1k8k1pQJ9K6L7M4M0K4J1QQKj2k5
8000B51k6j9qkMRJ5J7J6J4J2RLloqrj1j4j4j3j1j0olJL%mrj0qnkjloojQJ5K4K8K5J1j1k3k2
7981A91qLNJpj8k9l0j6NK0J9J0jj0j6j9j6qkkoj0nQJ7J9J9K0K4K2J2oj9j8mJ3J7Qlrqn%LN
7963A66PJ0J2Rlj4j2kRJ3J5J4J0Joomj0j4j4nJNLJoj8k6k7j8rJNOKJJLPJ3K0K1J8J5J2Mnq
7943A98jLjj1j7j4pJ%pj7j8kJ2J6RNRJ3J6J4J2NlpooqqJRRJmlNJ2J3J0MJJJkoj2j8k5l0k9
7923A18k6k0j5pKJ4K4K5J3lj0jJ6K9K7J2j0k6k5j0QJ8K1K3K4J9J1QRP%nkLQQQO%qj8k7l2k9
$$ y = [193, 155, 125, 104, 92, 86, 79, 69, 64, 71, 94, 125, 148, 152, 139, 122, 113, 111, 110, 105, 98, 91, 88, 93, 106, 128, 155, 182, 204, 221, 234, 247, 260, 267, 270, 276, 289, 305, 313, 309, 304, 304, 305, 298, 281, 264, 250, 235, 217, 199, 188, 184, 183, 182, 182, 180, 177, 174, 173, 175, 176, 173, 163, 148, 133, 121, 114, 111, 106, 97, 85, 71, 55, 42, 34, 33, 35, 38, 46, 64, 89, 116, 140, 164, 191, 215, 225, 221, 208, 195, 184, 173, 160, 142, 118, 84, 44, 11, 0, 15, 50, 88, 122, 152, 182, 208, 229, 243, 249, 240, 216, 182, 148, 117, 89, 68, 61, 69, 88, 114, 151, 195, 235, 259, 270, 278, 286, 288, 276, 251, 225, 206, 198, 196, 200, 209, 224, 241, 257, 271, 283, 292, 295, 292, 286, 278, 269, 258, 244, 230, 217, 206, 196, 190, 187, 188, 191, 191, 187, 178, 168, 160, 155, 153, 152, 149, 143, 137, 136, 144, 159, 183, 211, 236, 247, 236, 213, 191, 183, 186, 191, 192, 185, 167, 138, 108, 92, 97, 117, 136, 146, 145, 135, 119, 100, 84, 76, 74, 72, 66, 56, 51, 59, 76, 95, 114, 134, 158, 180, 192, 186, 167, 149, 145, 158, 175, 183, 180, 171, 163, 158, 158, 161, 166, 173, 183, 195, 204, 201, 187, 175, 173, 182, 195, 210, 224, 234, 235, 229, 223, 219, 209, 195, 181, 176, 177, 182, 185, 186, 180, 162, 136, 109, 91, 82, 83, 88, 94, 96, 97, 98, 101, 108, 121, 141, 162, 180, 195, 207, 211, 206, 198, 197, 200, 199, 188, 171, 157, 150, 151, 151, 144, 127, 109, 107, 119, 135, 144, 149, 158, 171, 187, 201, 213, 218, 215, 208, 202, 196, 188, 180, 181, 190, 199, 200, 196, 193, 198, 210, 223, 233, 237, 238, 239, 240, 238, 232, 220, 202, 177, 147, 118, 92, 72, 57, 50, 52, 66, 90, 115, 128, 125, 115, 114, 130, 159, 186, 198, 188, 162, 137, 127, 135, 153, 174, 197, 221, 240, 251, 259, 268, 275, 275, 270, 268, 271, 279, 287, 295, 301, 301, 293, 275, 248, 216, 187]
7906A87j6%J4J7J5PKlqk2l5m0l2k3j5j2njKOJ6K9L6L5K8J9RJ%NJ1J4J5J6J3J1J1J4J4Ooj5
7889C20k1k3j7oLMkommqj5j9j9j9j7j6j4r%J4K5K6J7QNQQPNKlrj4j3n%L%npol%QJ7K3J8Lj4
7869B26k5k4j5jQJ1PLJ%JKJnj3j8j7j3j0nJJ2J4Pnj4j2jJ1K1J9J0pj9j9oJ3K6K7J6jj3j5q
7851A71LQQJ0J5J7J0nj1pMPLoj4j8j7rMJ7J9J3OL%rj6j4lRJ4J4J1QLJNQOpj8k1j4m%nj3j2
7832A74%J5K0J3NNJ0J1O%qj8k8k9k0oK%qj2rn%MPMjpnJJ0J6K0K5K5J4mk2k9k3j1jKKNRJ1R
7813A79Lmj0j9k4k2j2JOPQRJ2Olj3j6j3oLJ1J7K0J7J1JoromlJJ1K0J8Nj1j7j4nOJ8L0L8M0
7794B81L6K9K0PlqmJNL%noj3k1l0l1k1qjok1l9m8m2k4nOOKj%%J%JNJ1J6J6J3RRQNjqj1j2j4
7774A07k1k7k6j3JMlj3j3pOK0L4L8K9J7PJ0J7J8J4J0QRQlj8k4j4LJ3J0Jmnj1j8j7jK0L1K4
$$ y = [187, 171, 171, 185, 202, 217, 224, 226, 223, 215, 193, 158, 118, 86, 63, 48, 36, 31, 30, 32, 38, 54, 83, 119, 154, 182, 201, 210, 211, 211, 216, 227, 241, 256, 272, 285, 296, 307, 321, 335, 341, 335, 320, 299, 276, 259, 253, 256, 260, 258, 252, 248, 244, 236, 221, 202, 183, 164, 147, 131, 117, 108, 108, 122, 147, 173, 190, 198, 203, 211, 219, 226, 231, 233, 230, 221, 207, 194, 189, 189, 192, 192, 187, 180, 174, 171, 171, 179, 196, 219, 237, 240, 226, 201, 177, 162, 161, 169, 180, 187, 190, 191, 191, 192, 194, 195, 190, 177, 159, 142, 129, 119, 114, 115, 127, 141, 148, 143, 129, 117, 116, 127, 148, 167, 177, 170, 151, 132, 126, 139, 165, 192, 208, 207, 194, 179, 171, 174, 182, 190, 200, 215, 232, 242, 237, 226, 219, 223, 230, 233, 227, 213, 195, 178, 169, 173, 190, 209, 222, 228, 231, 231, 222, 206, 192, 189, 198, 212, 226, 237, 245, 248, 249, 254, 262, 268, 261, 243, 222, 208, 204, 204, 199, 186, 174, 174, 189, 209, 222, 227, 232, 242, 253, 259, 259, 251, 233, 205, 176, 156, 150, 152, 152, 144, 132, 123, 118, 118, 122, 129, 133, 132, 125, 120, 121, 131, 147, 167, 192, 217, 231, 227, 205, 176, 153, 142, 141, 143, 145, 150, 159, 170, 179, 182, 178, 168, 149, 125, 103, 91, 92, 98, 105, 113, 122, 134, 140, 137, 124, 108, 95, 89, 92, 103, 120, 140, 157, 168, 169, 163, 154, 148, 144, 141, 142, 153, 173, 191, 196, 185, 168, 154, 149, 155, 173, 203, 241, 281, 317, 346, 366, 373, 370, 362, 358, 359, 364, 367, 367, 362, 356, 343, 322, 292, 261, 240, 232, 231, 225, 204, 165, 117, 75, 51, 46, 52, 58, 60, 59, 59, 59, 60, 60, 61, 66, 77, 93, 109, 122, 131, 140, 148, 153, 152, 144, 133, 121, 107, 86, 59, 33, 20, 21, 25, 22, 9, -4, -11, -5, 15, 49, 87, 116, 133, 140, 150, 167, 185, 199, 209, 217, 226, 234, 231, 213, 189, 175, 178, 191, 201, 202, 198, 193, 182, 164, 147, 146, 166, 197, 221]
7757B21Nj1j5oNJ1J6K1J9Nj3k4k1j5j0oj%qj7j4lOKpq%OLkjRJ3Mj4k2j7mKnj7k2j5%J5K3K0
7739A08J5RKj2k6l1k3j2kjjkKJ4K3K2J0J%PQNKLjj2k2j8JK1L0K8K0J1Lpj4j2kJ1J3QLRJ6J3
7720B20ql1m3l8k7j4kJ0K1L0L6K9J3mj0rprrkMJmonj0j7j8qJ2L0M0L6K4J0Jloj0j1mLOKkj
7702B10LOMLOQOjppkMOMjlKOPMJ%rk3l2l2k5j9j3qoj0j6j0RL1L9L3J6Kkklj2j6j4ojkkkkK
7680A24J0K1L0K9K3J6Q%mopj1j8k2k1j2kNPMLNNLnj3j4r%PQJ0Onk0k8j8KJ0Jj5k4k3j6qJO
7662D3NknmJKjomJOJ3J9K9L8L6K2Kj4j9j3mKJnlKOMlj5k4l1l6l4l2k8j7KK0K9K7K5K3J7J4
7643H9J5J7J3LkLJ3J8J1nj9k0%K8M3L1Kk3l4l2k4k1k1k1j2JJ4J8J5J3J0MoqlRJ9K5K6K0Lj7
7626A95k5j5OK1K0Ppj7j5p%KJ%LOONOQJ3J6J8J0ok0k6k6k5k1j2kMONMlj3k1k0j3lKjpr%J4
$$ y = [221, 226, 215, 200, 194, 199, 210, 226, 247, 266, 271, 258, 234, 213, 198, 188, 182, 181, 181, 173, 156, 142, 139, 145, 147, 140, 132, 132, 138, 141, 139, 138, 147, 160, 164, 150, 128, 111, 107, 109, 104, 87, 65, 50, 50, 65, 88, 108, 123, 132, 134, 122, 96, 65, 42, 30, 28, 27, 26, 24, 26, 40, 63, 85, 95, 96, 96, 103, 111, 116, 118, 121, 120, 108, 86, 68, 69, 90, 120, 148, 168, 179, 182, 175, 161, 149, 147, 158, 171, 179, 182, 191, 207, 220, 212, 181, 138, 100, 73, 59, 57, 67, 88, 118, 154, 183, 196, 192, 182, 173, 166, 157, 148, 146, 150, 151, 147, 141, 136, 126, 109, 91, 83, 95, 125, 165, 201, 225, 235, 236, 233, 227, 217, 206, 202, 205, 211, 213, 211, 210, 213, 219, 223, 226, 232, 240, 246, 245, 238, 231, 229, 233, 239, 243, 242, 239, 241, 247, 254, 258, 259, 259, 250, 227, 195, 163, 138, 119, 106, 98, 92, 82, 66, 56, 65, 96, 135, 168, 184, 186, 184, 182, 179, 167, 151, 137, 131, 130, 128, 126, 124, 122, 124, 134, 155, 185, 214, 237, 253, 261, 261, 257, 251, 244, 233, 215, 193, 172, 160, 158, 163, 170, 174, 177, 182, 187, 190, 185, 172, 158, 149, 149, 156, 164, 174, 180, 175, 155, 127, 109, 111, 121, 122, 107, 83, 60, 44, 36, 37, 43, 48, 46, 41, 37, 38, 40, 39, 33, 29, 30, 36, 49, 68, 97, 135, 171, 193, 195, 181, 162, 149, 145, 147, 148, 143, 140, 142, 148, 152, 149, 134, 110, 79, 43, 9, -23, -51, -68, -66, -46, -17, 10, 35, 58, 75, 89, 104, 121, 134, 137, 135, 138, 151, 169, 180, 175, 156, 136, 136, 164, 207, 238, 240, 217, 183, 151, 127, 106, 85, 64, 52, 53, 67, 85, 100, 113, 123, 127, 121, 113, 110, 119, 138, 163, 189, 209, 212, 195, 170, 155, 161, 182, 202, 209, 202, 185, 170, 163, 163, 165, 166, 166, 169, 175, 181, 186, 192, 200, 213, 229, 247, 257, 251, 231, 205, 179, 154, 133, 121, 119, 123, 129, 134, 138, 135, 122, 101, 81, 68, 65, 67, 66, 59, 50, 50, 64]
7607F4K2K2K0J8J6J0%j1k1k7k5j8j1onnljKRJ4J4J5J7K1K3K2J7Qmj6j9j6j4j2j1okJLM%qj6
7589H5k0j2KJ6K4K2J5RQJ3K0K6K4J1mj7j9j2%J1J1NJKQRO%nj1j6j7k0k2k5k3j3%J0J0PM%l
7572A20prj0j2j6k1k3j9j0jORJ1J0J1J4J4J2J0J2K0K1J6Nj%NRJ1J0OJkloqrqnlJMN%j2k0k1
7553A17j8j4j1j0oLJ7K8K8J9QOO%j3k7l1k5j4lNPNKknnMJ6K8K9K4J6RPNJoj2j3j0oonoj0j7
7534A15j7j3qpnOJ8K3J9Plj3j5j0OK2L0K2Mj6k4k3j8j5nOJ1Okm%NQJ3J2NppKRRLnj2k2k6k2
7515F2j1%PJ4K0K1K0J6RONKkoqj5k8l5l0j4lMQJ6J4MnjJ0J8K2K3J8Noqj1j5j8qJ3K8K9K4J6
7497B10Mpj6j7j5j3rqj0j2p%MJqj1pQK0K2Rnrm%KNQQ%lmqk0k7k2j2j0j5j8j3mMJ1J9K0J9J5
7478G5J4J1Qjj4k7l3l2k1j0KPLorjRJ1OMNPNJjkkloj2j3r%RJ5J8K6K9K4J3Jqrql%LOJ2J6J6
$$ y = [64, 86, 108, 128, 146, 162, 172, 172, 161, 140, 113, 88, 70, 59, 53, 48, 43, 40, 39, 41, 50, 64, 78, 93, 110, 131, 154, 176, 193, 201, 197, 181, 162, 146, 132, 120, 109, 103, 101, 102, 105, 109, 109, 101, 85, 65, 53, 55, 71, 95, 117, 132, 141, 149, 162, 182, 208, 232, 243, 239, 222, 203, 191, 191, 202, 213, 218, 219, 221, 229, 238, 244, 244, 239, 228, 212, 195, 175, 153, 128, 105, 92, 92, 102, 112, 119, 123, 123, 120, 113, 104, 94, 82, 66, 45, 22, 3, -7, -8, -2, 7, 18, 28, 39, 53, 67, 79, 89, 101, 121, 142, 158, 163, 162, 162, 167, 176, 187, 197, 203, 204, 202, 199, 193, 185, 176, 168, 163, 160, 161, 165, 170, 170, 158, 138, 117, 99, 85, 74, 64, 58, 61, 78, 106, 134, 153, 161, 167, 173, 173, 160, 133, 102, 77, 63, 60, 65, 72, 77, 79, 77, 72, 67, 71, 87, 115, 144, 168, 184, 193, 200, 205, 206, 200, 188, 175, 165, 159, 153, 148, 142, 132, 115, 98, 85, 77, 70, 65, 71, 89, 112, 131, 138, 135, 122, 107, 97, 103, 125, 155, 177, 181, 165, 141, 118, 100, 85, 80, 86, 97, 103, 101, 97, 97, 102, 110, 123, 135, 140, 133, 126, 128, 137, 146, 149, 144, 132, 110, 84, 62, 51, 51, 58, 72, 92, 113, 133, 149, 158, 164, 169, 171, 169, 163, 155, 140, 112, 77, 47, 33, 30, 34, 42, 58, 72, 76, 71, 70, 80, 98, 120, 143, 161, 166, 160, 152, 141, 126, 108, 100, 113, 141, 170, 194, 210, 214, 207, 191, 174, 159, 146, 137, 129, 119, 107, 100, 100, 104, 105, 97, 86, 79, 87, 107, 129, 138, 133, 124, 120, 120, 122, 127, 135, 143, 143, 140, 136, 128, 108, 81, 59, 47, 37, 22, 4, -9, -13, -9, 2, 21, 41, 60, 75, 89, 100, 108, 107, 93, 66, 33, 1, -20, -30, -28, -21, -18, -24, -33, -34, -25, -14, -8, -4, 1, 8, 13, 14, 13, 11, 9, 6, 0, -12, -25, -34, -34, -25, -10, 8, 34, 63, 87, 100, 101, 93, 84, 76, 73, 73, 76, 82, 94, 110, 126]
7457A26J3J0RO%qj0qmjPJ1Rlj8k5k2j5pNJ6K5K4J7J2J2J8K2K1J6J0POMJkl%MPPQJ1J1Nj1k5
7438B98k6j6lNQPLkoj0j4j6j4pnpmPJ8J5mk3k7j9oKOO%pj0j1pJJ4L0L5K1kj8j9j2j1j1j1n
7420A43loj5j9j5lRJ1OLOJ2K0K6K7K0Plnoj6k4k0nKmj7k1k0k0k1j6kJ2K5L5M2M1L4J9Jj6l0
7403A94l7m2m4l8k4mJ1K0L0L6L2K0Mqj7k3k2j2%NMNJ0J6J8J5RJomMJ7K5K5J6Kj4k8l2k4j4
7386A26j3k6m2m9m4l3k0oRK2K8K5J8J1RJ0J5K2K9L2K8K0J4J2J1QNQJ6K1J8Ooj1qpj0j7k0j7
7370A94j1lOJ4J7J1Koj0j3j3qjMjj2k0k2j9j3qmKMJmjJ6L4L4J8JlKONJ%LORRQN%j5k9l9m0
7350A17l9l6k7j5%J2K1K7K3J1jlNJ6K1J5Omn%Kkj0j4j3j0nMROkpmKLjnkPJ6J3Krj0lJknqo
7330I1ojJjrj3j5j1rnJPQOPQQLJ%JJNPQQJ3J9K0J1%njKPJ1J4J0Kj0j5j6j3mNJ0PKMJ1J1Kn
$$ y = [126, 139, 149, 158, 164, 164, 156, 146, 138, 134, 133, 140, 151, 160, 157, 139, 114, 92, 77, 70, 75, 91, 116, 140, 157, 169, 181, 199, 221, 242, 258, 268, 275, 281, 285, 286, 284, 281, 281, 285, 292, 299, 307, 318, 329, 334, 323, 298, 272, 256, 253, 258, 266, 273, 276, 274, 268, 258, 244, 228, 214, 207, 202, 195, 191, 198, 216, 231, 227, 204, 177, 158, 152, 154, 160, 166, 166, 159, 149, 138, 131, 132, 146, 176, 211, 232, 230, 212, 193, 181, 170, 159, 148, 143, 140, 134, 119, 100, 85, 82, 91, 102, 108, 111, 117, 129, 149, 175, 202, 222, 229, 226, 221, 215, 199, 175, 155, 150, 152, 148, 131, 110, 90, 70, 49, 33, 31, 43, 68, 103, 145, 186, 220, 239, 240, 224, 194, 157, 115, 71, 33, 9, 5, 16, 36, 66, 102, 134, 154, 158, 150, 133, 110, 88, 76, 76, 81, 85, 90, 100, 116, 134, 149, 158, 159, 153, 149, 153, 170, 195, 220, 236, 238, 224, 196, 164, 140, 126, 113, 87, 45, -4, -48, -81, -101, -107, -98, -76, -48, -23, -5, 6, 15, 25, 40, 62, 91, 123, 151, 171, 185, 197, 208, 216, 221, 229, 245, 266, 284, 290, 284, 273, 265, 258, 248, 231, 211, 194, 183, 180, 186, 200, 217, 228, 230, 224, 214, 201, 188, 180, 179, 183, 182, 170, 150, 128, 109, 96, 88, 84, 86, 90, 91, 87, 86, 102, 136, 170, 188, 189, 186, 188, 194, 199, 200, 200, 203, 209, 218, 227, 235, 240, 240, 225, 196, 157, 117, 78, 42, 15, 0, 0, 12, 33, 60, 83, 94, 93, 90, 95, 111, 132, 147, 153, 149, 144, 144, 146, 144, 134, 120, 107, 97, 92, 96, 105, 111, 109, 102, 98, 100, 103, 102, 97, 95, 102, 118, 131, 133, 124, 114, 111, 112, 110, 105, 97, 91, 85, 84, 85, 84, 75, 62, 47, 36, 27, 22, 23, 30, 38, 44, 51, 59, 67, 70, 71, 71, 72, 73, 78, 85, 93, 101, 114, 133, 153, 164, 164, 159, 158, 160, 167, 178, 192, 202, 204, 194, 179, 163, 150, 146, 151, 161, 168, 170, 174, 185, 196, 198, 193]
7309A93kQJ3Qoj5j4lNJ0J0QRQOjrk1k8k7k2j4qn%NRJ1J0NkqpjMPOKkJJ5K9L5K6J2%j2k0k5
7289B03k3j6j2j2j3j1pnqrmQJ6RlqlPJ2J1RP%nojQJ6K4K6K1J1kj6l1l6k5nPRRJ2J2Lj4k6k8
7270A11k1rNJ4J5RMNJ0J1Jj3k6k2pOLj2j8qPJ4J0PJ0J5J6J3Qkj3j7j0MJ6K1K1J8J6K1K9L2
7254B94J6rk4k5k3k5k4rJ6L5L6K6Qpj8j7rmj2k5l4k8j5LJ5K4K8K5J7Oknlmrj9k6l0k7k0nJ4
7237A05K6K8K2J4J1J1J1J3J7J9J6Nj0k2k8k4j5jJ2J7Pj1k5k2j2orj3j2qmkLRPMOJ3J5Mj2k4
7220A35k4j7pJQJ3J9K3K6K4K0J2kj6k7k9k5k0j9k1k1j5%J7K6K2J0ln%NQOlj6k5j9nPJ3J3J3
7203A02J2Pjqqon%NQLlmLJ1J1OMJ4K6L5L4K6J3nl0m7m5k6kQMKRK3K7J6Kqj2j5j8j4%J2J3L
7184A82oolnj1k0k7k9k9k4j6pKJ1J2OmmLJ1J6J2OJJNRRJ1J7K2K3J7J6K0K5J8Mj1k1k6k0r%
$$ y = [193, 191, 199, 212, 220, 214, 199, 185, 182, 187, 197, 207, 215, 224, 232, 238, 237, 228, 207, 179, 152, 130, 116, 108, 103, 103, 108, 117, 128, 138, 143, 141, 133, 126, 125, 129, 136, 142, 144, 142, 143, 158, 187, 222, 248, 260, 260, 248, 228, 203, 180, 164, 152, 140, 127, 116, 109, 104, 96, 87, 83, 91, 107, 116, 113, 105, 102, 109, 121, 132, 141, 148, 148, 143, 137, 136, 144, 160, 184, 210, 231, 242, 240, 224, 193, 157, 132, 127, 134, 143, 152, 164, 176, 179, 165, 139, 111, 90, 81, 86, 100, 115, 124, 128, 133, 143, 154, 155, 142, 116, 94, 87, 93, 96, 84, 66, 58, 65, 79, 89, 96, 106, 121, 137, 150, 158, 156, 143, 126, 116, 120, 136, 157, 178, 196, 212, 233, 262, 294, 310, 301, 277, 252, 229, 204, 180, 171, 187, 222, 258, 284, 292, 285, 267, 250, 241, 237, 225, 200, 166, 138, 123, 126, 141, 165, 193, 218, 235, 241, 239, 234, 231, 227, 218, 199, 173, 143, 116, 96, 91, 105, 131, 159, 181, 195, 206, 217, 228, 241, 258, 277, 293, 298, 288, 266, 238, 214, 199, 198, 210, 227, 234, 223, 198, 176, 164, 158, 149, 136, 124, 116, 112, 110, 113, 122, 129, 133, 139, 152, 167, 171, 159, 135, 111, 94, 87, 88, 96, 109, 128, 151, 177, 201, 221, 233, 231, 215, 188, 159, 134, 114, 95, 74, 53, 38, 38, 55, 81, 103, 113, 110, 105, 105, 110, 118, 124, 121, 105, 80, 61, 56, 63, 76, 89, 102, 114, 121, 120, 112, 104, 98, 93, 93, 98, 106, 109, 106, 102, 105, 116, 127, 133, 137, 151, 177, 212, 246, 272, 285, 280, 250, 203, 158, 132, 130, 138, 142, 144, 153, 176, 203, 219, 221, 213, 201, 186, 168, 154, 154, 166, 179, 182, 176, 170, 167, 162, 151, 131, 104, 75, 46, 22, 6, -1, 1, 12, 24, 30, 26, 22, 25, 36, 52, 64, 70, 71, 72, 77, 86, 95, 106, 123, 145, 168, 185, 201, 221, 246, 264, 268, 257, 236, 210, 190, 181, 181]
7166A81jrj7j4oKKmj1j1kQJ4J0Llj1j5j5mPJ3J2OJpj5k0k2j8j2kOJ3K1L1L7L0Pj6k4j6lMM
7148A34NQRPOLoj7k3j3NK4L3L3K7J8Oj1k4k8k3j7j6j5j4j0kRK1L1L1K5J6J1NLQJ2R%oqrj2
7131B45j3okj1k7l3k6j9j4pMJ1Lj0j7j6j2pLJ9L0L0K6K1J6Ppj7j9j2qplOJ3J2Lmqj4k2k0r
7113G9jkpnLQJ0J7K5K9K5J7Pqk1k4j3NJ8K8L5L4J9kj4j2jLkj0j4j0JRJ2Plj4k4k8k2nJ1J9
7096A79J7J1OKnj5j8j4j1j3k0k4k3j9j7j6j4jJ8L2L2J7OPJ7K7K8K5K1J3Mmrj0j0rj0j5k2k7
7080A36k6k1j3jJ0J6J1jp%J2J6J1LjJKKMM%rk0k7k5j6lRJ6K1K8L0K9K1J2Kj2k2k2j1JOLLK
7062A74%%QJ4J2MMJ7K8K5J2mj3j8j7rJKqj6j3KJ1QkrppokJ3K8K8J2pj7j8j4qjQJ4J6J1%rr
7043B38jPNnj7k6k8k5k0j9k0j7j0mjJRK1K6K0Opj6j4qqj6k6k7j6OK6M1M5M0L2K1R%KJ1J5R
$$ y = [181, 180, 171, 154, 140, 134, 136, 138, 134, 123, 112, 110, 118, 132, 142, 145, 142, 131, 116, 101, 97, 104, 117, 129, 135, 136, 129, 114, 94, 72, 54, 42, 40, 46, 59, 80, 111, 148, 178, 185, 169, 145, 129, 126, 130, 134, 139, 147, 156, 163, 169, 172, 166, 149, 126, 113, 118, 142, 175, 208, 235, 253, 259, 248, 224, 196, 173, 156, 140, 125, 111, 101, 99, 108, 129, 160, 191, 216, 232, 243, 248, 251, 259, 271, 280, 280, 274, 266, 257, 245, 232, 226, 224, 213, 186, 153, 127, 108, 94, 87, 91, 102, 105, 95, 78, 62, 50, 43, 46, 65, 95, 125, 151, 172, 188, 195, 188, 171, 152, 140, 132, 125, 122, 128, 141, 153, 156, 152, 144, 130, 108, 88, 79, 78, 76, 69, 64, 67, 75, 85, 102, 127, 156, 181, 198, 205, 197, 176, 152, 139, 144, 162, 190, 225, 259, 278, 276, 262, 250, 249, 252, 250, 240, 226, 216, 217, 226, 238, 245, 242, 228, 204, 176, 154, 149, 160, 179, 196, 207, 213, 215, 210, 195, 177, 163, 152, 139, 119, 95, 72, 53, 36, 20, 6, 5, 23, 55, 87, 104, 110, 117, 134, 161, 189, 214, 235, 248, 252, 248, 239, 229, 219, 210, 200, 185, 163, 136, 110, 89, 76, 75, 85, 101, 112, 111, 104, 104, 116, 132, 143, 146, 145, 146, 148, 150, 154, 158, 158, 149, 129, 102, 77, 61, 58, 67, 83, 104, 132, 162, 191, 212, 224, 226, 214, 192, 170, 159, 160, 166, 169, 172, 174, 174, 174, 182, 196, 208, 212, 216, 233, 261, 286, 298, 294, 281, 263, 246, 237, 238, 240, 232, 216, 203, 205, 216, 224, 222, 213, 206, 199, 193, 191, 204, 232, 260, 272, 265, 248, 230, 216, 208, 207, 215, 229, 245, 256, 256, 247, 238, 237, 244, 249, 244, 227, 201, 173, 148, 128, 109, 89, 72, 62, 58, 57, 58, 67, 88, 114, 134, 140, 133, 117, 103, 95, 87, 71, 45, 18, 2, 8, 34, 75, 120, 160, 192, 213, 222, 222, 224, 235, 250, 259]
7025B59lprj6k4k6k0j1mLJ2J7J6Pjopm%LOPJj2k3k6k2j9k1k0j5ppj1j2rKJ7L3L8L3K6K1J8
7008A77J1Kqj5j9j6mRK0K8L1K9K6K2J6Nrj8j3JJ1RKlkLMMKlj0k0l1l7l4k2nJ2K1K0J2QONN
6990B32PQ%j5k1j8j5j7k1j7mKKMRJ7K5K8K7K2J5J0Okj2j8k0k0j5lJ3K2K1J4QMnj1r%RQlk0
6972B47l4l4k2q%JknlKJ2J7J1JjMJ2J5J5J2Pjj0j9k1j8pLQNjmpppjMPMkoqqj3j9j8pJ0J7J2
6952A33MPJ8K7K7J6Mj2k5k7j7MJ9J8Lj6k4k1rJPJ3J8J6RMNJ3J8J3Jj6l2l9l9l2k2rOJ6J5O
6935A01LOMkj0qJJ1J3Rok5l2k0LJ4Oqj0%J4K5L0L1K5J7RNKMQJ0NorlNQMnj3k4l0l2l3l1k6
6916D0j5kJ1K0K1J9J1MOJ2J3QjokLRJ4J8J8J3Mmj1j3j5j5j5j5j6j7j6j4j2pjOJ1J0J1J3J6
6899A14J3Mmmnpj1nOJ7J9J2OLMPQQJ0J5J5Qoj9k1j2jRJ1Nj1k1k0qkqk0k9k7j5KJ9K6K5J9J0
$$ y = [259, 256, 249, 240, 224, 200, 174, 154, 143, 139, 142, 154, 171, 187, 194, 193, 187, 180, 176, 176, 179, 185, 192, 193, 181, 158, 132, 110, 91, 70, 50, 35, 28, 21, 10, -2, -11, -9, 8, 41, 79, 112, 138, 159, 177, 188, 190, 182, 167, 148, 132, 128, 137, 157, 185, 216, 245, 271, 293, 309, 314, 305, 287, 274, 275, 286, 295, 297, 294, 292, 295, 299, 303, 305, 302, 292, 272, 241, 204, 170, 148, 143, 155, 176, 196, 208, 216, 222, 227, 232, 239, 247, 247, 232, 211, 193, 178, 161, 140, 123, 119, 121, 123, 127, 136, 153, 178, 206, 233, 255, 270, 280, 286, 284, 272, 254, 234, 214, 199, 196, 209, 231, 252, 266, 274, 278, 273, 262, 253, 253, 262, 270, 267, 247, 213, 179, 157, 149, 149, 150, 148, 143, 140, 142, 154, 171, 182, 183, 182, 186, 198, 213, 228, 240, 247, 246, 236, 217, 196, 178, 171, 174, 182, 187, 186, 182, 175, 168, 161, 160, 164, 171, 175, 173, 167, 159, 151, 138, 119, 101, 94, 104, 121, 133, 137, 144, 162, 189, 216, 232, 236, 224, 199, 172, 155, 159, 178, 196, 199, 183, 159, 138, 129, 130, 137, 150, 168, 184, 193, 197, 202, 215, 233, 246, 247, 231, 199, 160, 121, 89, 67, 58, 64, 80, 95, 101, 104, 110, 114, 112, 102, 94, 95, 106, 119, 128, 122, 97, 65, 45, 48, 62, 68, 60, 50, 50, 64, 89, 119, 150, 175, 192, 201, 206, 208, 212, 220, 230, 235, 229, 220, 217, 222, 230, 234, 229, 216, 192, 162, 130, 97, 66, 40, 25, 23, 34, 54, 75, 94, 105, 109, 115, 127, 140, 148, 147, 141, 139, 142, 151, 165, 183, 201, 214, 218, 214, 203, 190, 175, 160, 145, 130, 114, 97, 81, 67, 55, 48, 47, 53, 64, 74, 85, 98, 114, 127, 131, 127, 123, 118, 111, 100, 95, 101, 118, 137, 149, 155, 158, 162, 169, 177, 185, 195, 210, 225, 233, 227, 208, 187, 175, 174, 183, 194, 199, 188, 167, 147, 139, 137, 129, 109, 80, 53, 38, 40, 59, 85, 110, 129, 139]
6881A39jj3j8j1kMLNMJmm%JJLPQlj9k9k6j4jJ1K3L3L6K9J6Mmj0j6k1k3j9k0k0j7kJ4J7Mj3
6863E3j9j2%OJ0J5K2K4K1J5Plj6k5k4j6j2j3j7j8k2k4k3j4jRJ1J0J2J5J4QklMJ2J8J8J7J5
6847G2J3J4J5J9J8RjjJ1K5K4Qj0j7j3j1j4j9j4jRJ4J1O%lJRJ8J5NorkQJ0Noj7k2k3j6oLNP
6828A43J0J3J9K3K7K4J5kk2l8m7m3k5jJ8K7K6K5K0J0jrqJNLpj4j4roj1k0j8pNRJorqolLPN
6810A05kpkQJ8J8J4RNK%lnj0j5j5rLRNpj3oNJ6K4K5J5JqjJ4J9Roj3j1rj1j4j9k0j5kJ0J5J4
6791A40QKkMK1M1N0L7Pk6m5m4l0j7nJKkqj0oknpo%OPPMJkJNQJ1J3J4J0MKRJ2Ooj1nORPMRJ5
6770B44J8J5Mqj9j7nPRKoj0j0j2j1nJM%nj3k3k9k2j0nopjQP%pj2j0kJ2J8J1%lQK0K4J8Ooj2
6750A60j0ppj2j3rljkKJ3K3L1L3K7J4MjjkkMOJj3k5k5j5lMONPJ3K1K2J4KonKO%j7l3m2l4j8
$$ y = [139, 138, 125, 107, 96, 94, 98, 101, 106, 110, 111, 107, 103, 103, 104, 105, 108, 115, 123, 120, 101, 72, 46, 32, 31, 42, 65, 98, 134, 163, 179, 183, 179, 169, 153, 132, 109, 90, 70, 50, 33, 31, 45, 62, 66, 53, 34, 22, 22, 28, 38, 53, 75, 99, 120, 135, 142, 139, 123, 98, 74, 58, 46, 33, 16, -2, -24, -48, -71, -85, -86, -77, -66, -56, -44, -29, -15, -7, -9, -12, -8, 4, 22, 40, 57, 72, 85, 99, 114, 133, 151, 160, 159, 158, 169, 194, 218, 226, 216, 199, 186, 175, 161, 142, 128, 127, 136, 150, 161, 167, 167, 164, 165, 174, 192, 207, 212, 206, 197, 195, 203, 213, 218, 212, 195, 173, 150, 134, 128, 131, 136, 143, 153, 166, 185, 208, 235, 259, 274, 272, 250, 212, 165, 122, 97, 96, 114, 141, 167, 192, 212, 222, 221, 212, 204, 205, 210, 213, 206, 192, 178, 169, 163, 152, 132, 114, 107, 112, 121, 122, 116, 107, 99, 93, 90, 93, 100, 105, 103, 96, 94, 102, 120, 138, 152, 161, 166, 168, 168, 165, 160, 150, 135, 120, 111, 114, 123, 128, 121, 108, 102, 107, 123, 147, 172, 187, 188, 180, 179, 193, 212, 221, 215, 202, 191, 182, 171, 157, 138, 118, 103, 101, 111, 126, 140, 148, 150, 148, 152, 173, 214, 264, 301, 308, 282, 237, 193, 163, 146, 141, 142, 144, 142, 134, 124, 118, 116, 111, 104, 98, 98, 104, 111, 118, 122, 123, 121, 122, 127, 135, 146, 159, 173, 183, 187, 189, 198, 210, 216, 210, 199, 194, 200, 209, 216, 220, 229, 244, 262, 277, 281, 273, 254, 237, 232, 239, 248, 250, 244, 234, 224, 212, 201, 196, 197, 201, 201, 196, 183, 160, 131, 109, 99, 94, 88, 81, 80, 88, 95, 95, 88, 76, 66, 64, 76, 94, 105, 105, 102, 110, 130, 154, 172, 178, 172, 160, 150, 143, 136, 124, 111, 102, 99, 98, 96, 98, 111, 134, 165, 198, 225, 239, 243, 242, 241, 239, 237, 241, 247, 248, 235, 210, 185, 170, 167, 171, 177, 182, 189, 202, 223, 245, 259, 261, 255, 250, 252, 258, 258, 241, 208, 166, 132, 114]
6731A14n%mpjOP%prplllJOQOkopopqmNJ4J6J7K1K0J2kpkNOK%llljmj5k5k6j9lJ3K8L2K4J1
6709A72Klpj5k0k0k0j7rLJ4J5Rkj0qLJ6J9J2NPJ0NnplK%kMJ4J7QlrmNJ4J8J1%pmJ2L2M1L3
6690C28J3mj2j1j1j0njKKkpj6k1j2J0K8K6Rnj1j0j1rMJ9K2J2jj2k0k6k6j9oJJ%mrj6k3k6k4
6673A07j5kJ1J7J3Lj1j8j9j3lOJ5K3K9L1K9K2J3NJ%%%knj0j5j9j6j0KJ2J9J9Oj1j9j6porj2
6655A45j1j0j3j4j1okLPJ0J2J4J8J3kj9k3j4mlmlMJ1J8K3K3J9J5J4Qkj2j2kQJ3J3RJnnjlj1
6637B09j6j5j2j5j7rQK1J4pk8l0j5KJ2J5J9K4K2J7J3RLmmLOmj4j5qpj1rKJ1J1PONJ%MJ3K2
6619B39K7K8K1Qmo%Jj0k8m2m0k7j2nqj2j4j5j6j2lPJ2J3J5J1MljJ3K9L9L8K9J5OJLMLKQJ7
6601C35K0J4Kj0j8j7j3mLPMlqj0rqj0j1j2j4j0n%jorqonjPJ6J7Oj5l5m4m0l0j9nPJ3J4J3J3
$$ y = [114, 109, 109, 105, 98, 97, 103, 110, 110, 103, 94, 87, 84, 81, 78, 79, 85, 93, 99, 97, 91, 84, 78, 71, 63, 59, 64, 78, 94, 111, 132, 152, 164, 162, 155, 153, 158, 164, 166, 166, 163, 160, 157, 156, 152, 137, 112, 86, 67, 64, 77, 105, 137, 161, 172, 174, 171, 164, 149, 129, 109, 89, 72, 63, 66, 80, 95, 104, 102, 92, 84, 87, 103, 122, 134, 139, 146, 156, 161, 156, 149, 146, 148, 148, 146, 150, 164, 181, 189, 186, 177, 173, 178, 192, 210, 221, 221, 214, 210, 222, 254, 295, 328, 341, 337, 325, 314, 303, 293, 288, 287, 289, 291, 289, 282, 266, 245, 233, 243, 271, 297, 306, 301, 290, 280, 269, 260, 264, 283, 305, 317, 316, 304, 284, 258, 232, 213, 207, 208, 209, 209, 205, 196, 180, 157, 131, 107, 92, 90, 101, 118, 131, 134, 123, 105, 86, 73, 70, 76, 91, 114, 143, 174, 203, 225, 238, 243, 244, 244, 244, 244, 242, 237, 227, 212, 193, 177, 167, 169, 181, 200, 219, 225, 214, 195, 179, 172, 166, 157, 145, 134, 124, 111, 97, 86, 80, 78, 81, 88, 98, 110, 124, 142, 155, 153, 134, 111, 97, 93, 90, 86, 83, 87, 98, 116, 139, 162, 181, 196, 210, 218, 216, 204, 192, 190, 198, 211, 224, 233, 234, 229, 224, 223, 220, 209, 193, 178, 166, 151, 134, 125, 133, 154, 168, 161, 133, 103, 88, 90, 102, 117, 136, 160, 182, 199, 212, 221, 224, 220, 216, 219, 225, 221, 207, 192, 184, 177, 166, 157, 159, 170, 181, 188, 194, 199, 200, 200, 204, 217, 239, 266, 294, 315, 323, 319, 313, 313, 314, 304, 276, 234, 194, 167, 155, 150, 142, 130, 116, 101, 85, 73, 70, 77, 89, 102, 117, 128, 132, 129, 128, 141, 170, 209, 247, 276, 291, 297, 298, 301, 305, 308, 310, 318, 335, 355, 369, 371, 361, 343, 326, 313, 309, 312, 319, 323, 320, 312, 302, 293, 285, 275, 264, 252, 238, 228, 223, 223, 222, 216, 207, 199, 193, 188, 187, 194, 210, 227, 233, 218, 183, 139, 99, 69, 50, 45, 52, 65, 79, 92, 105]
6583A05J5R%rj3j1n%jpj3oJ1K6K9K3J5Qjlk%LOJ6J9J2nj6j6j0rj4k4l0k5j3MJ2J1Mloljjk
6564G9m%MPMKMRJ3J8K1K1K0K1K2K0J1lj9k2j4JJ0PkojPP%mkjpj6k1k2k3k6k5j6mJ1K2L0L3
6546A66L2L0K2Qj5l1l1k1j4j5j4p%kpqmKNJ1J7J8Oj2k4k6k0j0%J1K0K3K2J7J0Jj4k7k9j7%
6529G3Ojj2j2lMNJLJ2K4K5J2rk5k3j0MNmj3j5j3j4j8j8j5%J6K5K9K6K6K7K7K4K0J9J8J3Jj4
6512B26k1j7rjNJ3K0K2J9J1Krk4l5l6k5j3mNJ4K3K5K1J3Lpj6j6j1mknnJJ4K2K0Ppj5j4j0q
6495A72kPK2L0K7J5Knj2k2k9k7j2MRLKRJ4J3Pjpj5j8j2kLKjnpj0kJ1K0J8OkljKjoj5k2k6k4
6476A09j4jJ4K2K1J3NjnqqjJ4K7L4K9J3lj0o%%oj5j6j3j2j4k0j9j2jQJ1RKnokMJ3K0K2J3l
6458B02j4j8k1l0m0l9k6j3j4k5k5j0PJ3J2J4K2L0L4L4L3K7J7PJjj%oj8l2l2j3J2K9L5L7L7
$$ y = [105, 120, 129, 129, 120, 107, 96, 91, 91, 90, 83, 70, 64, 75, 101, 130, 153, 168, 176, 175, 172, 170, 170, 173, 179, 195, 214, 226, 221, 205, 189, 179, 170, 156, 132, 102, 77, 64, 68, 80, 91, 95, 92, 86, 83, 82, 81, 79, 75, 75, 79, 86, 90, 92, 96, 105, 118, 136, 157, 178, 198, 219, 241, 261, 272, 269, 250, 228, 214, 215, 225, 232, 230, 224, 223, 230, 237, 237, 233, 231, 230, 223, 207, 186, 164, 141, 115, 90, 74, 70, 81, 103, 133, 166, 198, 228, 250, 258, 243, 212, 181, 160, 146, 131, 117, 110, 110, 108, 101, 93, 89, 91, 96, 107, 124, 142, 148, 136, 112, 86, 66, 56, 56, 67, 87, 110, 132, 149, 159, 160, 146, 119, 90, 73, 73, 79, 78, 66, 54, 51, 55, 60, 61, 64, 76, 100, 125, 137, 128, 103, 80, 70, 74, 79, 75, 62, 47, 34, 20, 2, -16, -31, -31, -15, 10, 39, 65, 91, 118, 145, 169, 189, 208, 226, 239, 240, 226, 205, 188, 179, 178, 183, 196, 216, 238, 257, 268, 270, 261, 237, 202, 166, 141, 128, 124, 129, 143, 166, 191, 212, 225, 228, 221, 205, 189, 178, 174, 172, 167, 162, 163, 177, 199, 219, 226, 219, 204, 190, 180, 172, 170, 177, 199, 229, 256, 271, 273, 268, 256, 234, 205, 178, 166, 170, 179, 182, 184, 193, 207, 220, 227, 226, 219, 204, 186, 174, 172, 175, 177, 176, 171, 164, 154, 152, 163, 183, 201, 207, 205, 202, 201, 203, 202, 196, 181, 159, 133, 109, 95, 94, 108, 130, 151, 164, 169, 168, 163, 155, 147, 146, 160, 187, 221, 250, 263, 260, 250, 244, 244, 244, 238, 223, 207, 194, 182, 168, 148, 129, 117, 116, 124, 135, 144, 146, 141, 135, 133, 137, 150, 170, 192, 205, 202, 188, 170, 149, 119, 79, 40, 14, 1, -13, -38, -63, -73, -66, -53, -41, -27, -5, 25, 59, 93, 126, 153, 170, 177, 178, 177, 176, 176, 170, 152, 120, 88, 75, 87, 116, 151, 188, 225]
6442B25L0J5mj9l0l4k7j0NJ5J9J8Rpj8j5JK3L6L3J6oj7j7j4j4j4pMJ4J6J2Lpj4j4j4j4j6j5
6426A47qLJ6K4K2Qj0k1k5k6k6k2j1jPPPJ1K2L0K6J2MRJ7J3mj7k0j2mORLorkNOKOJ1J0N%MJ1
6407B39J2Nnj5k1k6k8k4j6nLJpj6k2k3j9oQK0K4J9RNJ0J8J6O%LJ0Ork3k5j3PK4L1K6J4jrj0
6390A93rppppj2k3k9k3j4j4k5l2k3kK2L7M3L5J8LlLJ1J1N%mjJJmj2k0k5k6k4j8j1lNJ7K8L4
6372H2L5L6L9L6K3Mj0j4j1j3j4j1kLJpj8k0j1OK1K0Mj4k0j6oMJ8K6K7J6Jj0j8j9j3kRJ5J4
6356A91QLjjKLKjmrj3j2mPQ%qj2j6k1j8pPJ5J4J2RJ0J3K0K4J8kk3l6l5k5j2MJ7K2J7J2RMl
6337A88j0qlpj9l0l3k5j5oJNRJ4K0K6K6K1J4Kpj0oKLJOJ4J9J1ok4l2k8k1j6j5j3pQK7M1M2
6320A59L0J2MPJ0OLQJ9K8L1K8K1Oqj5j1oqj8k6k4j6qqrpMJ2Rlj1j7k2l1l3j8OK7L5K9J8No
$$ y = [225, 255, 270, 266, 247, 217, 183, 156, 146, 151, 166, 185, 203, 212, 205, 187, 172, 173, 196, 232, 265, 281, 275, 258, 241, 227, 213, 199, 192, 196, 210, 226, 238, 241, 234, 220, 206, 192, 178, 162, 147, 139, 142, 158, 182, 204, 212, 202, 181, 156, 130, 104, 82, 71, 70, 77, 84, 91, 102, 124, 154, 180, 192, 196, 205, 222, 235, 231, 214, 194, 182, 178, 184, 193, 196, 190, 181, 179, 184, 190, 192, 198, 209, 219, 224, 224, 228, 239, 251, 256, 251, 236, 215, 189, 161, 137, 121, 116, 119, 120, 113, 97, 75, 52, 33, 27, 35, 55, 79, 98, 107, 112, 122, 140, 156, 162, 162, 165, 175, 181, 172, 149, 124, 111, 118, 142, 173, 199, 213, 212, 203, 193, 184, 177, 170, 163, 156, 144, 121, 92, 69, 55, 41, 16, -16, -39, -41, -19, 18, 61, 96, 114, 117, 114, 117, 128, 139, 144, 144, 140, 139, 140, 141, 137, 125, 105, 80, 54, 30, 12, 1, -2, 3, 20, 48, 82, 117, 153, 192, 228, 251, 255, 245, 231, 220, 207, 193, 182, 180, 183, 184, 177, 159, 139, 128, 134, 155, 175, 179, 165, 145, 129, 123, 127, 145, 171, 198, 214, 215, 205, 187, 168, 155, 153, 162, 177, 191, 199, 202, 201, 200, 202, 205, 207, 206, 202, 193, 180, 168, 164, 171, 179, 179, 171, 159, 143, 122, 104, 97, 104, 119, 133, 145, 154, 164, 177, 197, 221, 239, 237, 214, 178, 143, 118, 106, 110, 127, 149, 166, 178, 187, 191, 188, 178, 170, 167, 160, 141, 111, 78, 53, 38, 32, 33, 38, 47, 61, 81, 107, 133, 154, 168, 170, 163, 153, 147, 149, 152, 153, 159, 173, 192, 203, 197, 173, 141, 113, 92, 76, 61, 48, 41, 49, 76, 117, 159, 189, 201, 205, 212, 222, 228, 231, 239, 258, 286, 317, 345, 366, 372, 364, 349, 338, 332, 324, 306, 280, 256, 240, 232, 224, 215, 208, 212, 224, 233, 230, 219, 202, 180, 149, 116, 98, 104, 131, 166, 195, 213, 218, 212]
6302B12j1pnpj5j8pPJ0QQJ5J8PopLNkj0p%%pj3j1okjjLJ5K4K2J1mj4k1k3j6mMK%PJ8K3K0J4
6283B31Onj5j0NJ8J5Lj5k7k8j8lLmj4j5j0ppolkkjOJ2J5J4J0%j7l5m3k7KK3K6J6PMNNMLKJ
6264A22JJJkpj2j6j2qnnpnnlnkRK4M2N0L9J2j7l5l6k3rJLjmnm%NJ7L1L5K4%j6j7mJ1J8J6P
6244B04kqqkNJ1J0Kj1k5l4l4k6j4kJ6L2M0L3J8QOPMJjkpj3j4j1nm%MOJnqnNJ1J3QKmm%Kkj1
6224A87j9k0j3mJKknj0j6j8j1%J0J2J0LjmkMPMmj1j0mOJ3J4J1KprnOJ3J3QJnj1j5j4oNJ3J6
6205A35J6J0jj1j2nRK0K9L3K7J4lj5k1k1j7j0lLJ0J4J8J7J1LjLRPkj3j7j4qoj%lpn%NQJ4J8
6186B37Rj2l0k5oJ3K4K8K2Orj4p%J%nj3k4k9k6k1j7j2nNJ2J5J4RM%%nrkJ5K9K8J6Jj1j8j7
6169A71pPJ3Qkj2j4mJ3K5K0Kj5k1j5njj1k6l8l4j9kJ0J2NJ%QJ8K8L3L1K4J6J1J1J2J5J4Rn
$$ y = [212, 201, 194, 189, 182, 167, 149, 142, 149, 159, 167, 175, 190, 208, 215, 209, 202, 205, 210, 208, 198, 191, 191, 191, 184, 171, 160, 154, 152, 151, 150, 153, 168, 192, 214, 225, 221, 207, 186, 163, 147, 143, 147, 149, 149, 156, 174, 197, 217, 231, 237, 232, 217, 207, 212, 230, 245, 248, 233, 206, 178, 160, 157, 160, 156, 142, 127, 117, 110, 103, 97, 94, 92, 90, 89, 95, 107, 122, 136, 146, 146, 129, 94, 51, 24, 26, 49, 75, 91, 98, 102, 107, 112, 116, 119, 121, 122, 123, 124, 125, 123, 116, 104, 88, 76, 68, 63, 58, 51, 46, 41, 38, 33, 31, 40, 64, 106, 156, 195, 207, 190, 155, 119, 96, 87, 88, 91, 90, 86, 81, 77, 77, 82, 99, 130, 165, 189, 189, 173, 156, 152, 163, 181, 197, 204, 202, 194, 186, 184, 189, 200, 210, 212, 201, 176, 142, 108, 82, 68, 66, 82, 114, 154, 187, 205, 213, 219, 226, 230, 231, 230, 228, 221, 208, 194, 183, 178, 174, 174, 178, 184, 185, 180, 172, 167, 172, 183, 196, 204, 206, 202, 198, 198, 200, 198, 187, 168, 148, 135, 131, 132, 134, 132, 127, 117, 101, 83, 72, 72, 82, 94, 104, 107, 106, 102, 100, 104, 111, 115, 111, 100, 90, 86, 92, 105, 119, 130, 132, 125, 116, 111, 117, 130, 143, 151, 152, 147, 136, 121, 107, 101, 106, 119, 135, 151, 161, 160, 149, 137, 132, 141, 161, 190, 223, 250, 264, 261, 246, 225, 204, 187, 177, 174, 177, 187, 201, 219, 236, 247, 250, 249, 252, 261, 268, 266, 253, 236, 222, 214, 208, 207, 207, 204, 197, 192, 192, 197, 205, 219, 237, 246, 234, 204, 179, 173, 186, 210, 238, 260, 266, 257, 243, 236, 236, 237, 237, 232, 219, 195, 166, 140, 119, 102, 90, 85, 90, 102, 117, 131, 140, 144, 144, 144, 139, 130, 128, 143, 172, 200, 216, 217, 206, 188, 171, 164, 171, 184, 192, 190, 178, 164, 160, 173, 198, 218, 220, 205, 184, 169, 164, 163, 152, 126, 88, 54, 35, 33, 43, 55, 60, 61, 61, 69, 87, 115, 148, 179, 203, 219, 230, 241, 253, 268, 282, 291, 286]
6152B86k2l0k6j7j0rj1j4k2k7k3qRK0K7K9K9K5J9J2J4K2K8J9Kj0rnrk0k3j6q%%lj3j8j4%J0
6135A84J0PLjkKRJ1kj8k7k3j2mnj0j2pJMMKKLMJ0K1K7K3J0nj2j7j9j6pMPjj5k1j8j5j6j4p
6117D2LPMkj1j3j0kNQJ1J5J6J3PLMPJ1J4J3J0PKlj1j4j6j8j7nJ7L6L7K4Pqj8j9j2%QOLkmm
6098A51kMORJ0Pmk2l4l3k3pMLnj1lQJ5J8K5L1L3K5J3kj1pJ2K8K5Qj0j7j7j6j0ppj1oOJ3J4
6080B03J1QKnkJ0J8J2JKPOok1l2l2k5j8k2l0k7j1QJ9K6K8K4J7J1P%j3j5lPKmlQJ3J1J1Q%j2
6062A99j6j1rj5k1k4k1j8j3kJ6M4O9P7O3L4Kk3l7l5k0o%KQJ3J2OKjpqmjjJPJ0Jn%J1Nrj7j0
6044B48oojJ0J8J5O%%LL%nmLQQORQLJJ1K5L1L0K1Prj3mNPQJ3J4NJJ4K3J8J0K4M9O5P2P9P2
6024I05N0L1M0N7O2O5R0J21J36J53J98K55L00L56M56N81P17R32J302J808K428L215M037M282
$$ y = [286, 264, 234, 208, 191, 181, 172, 161, 147, 125, 98, 75, 67, 76, 96, 123, 152, 181, 206, 225, 237, 251, 273, 301, 320, 322, 312, 303, 298, 289, 269, 246, 230, 222, 222, 222, 219, 206, 188, 174, 174, 184, 194, 201, 204, 203, 201, 203, 212, 223, 221, 203, 176, 153, 141, 137, 132, 122, 110, 103, 104, 108, 112, 114, 116, 119, 123, 133, 154, 181, 204, 214, 209, 197, 180, 161, 145, 138, 142, 149, 148, 133, 112, 94, 79, 63, 49, 42, 45, 52, 56, 54, 43, 30, 20, 18, 23, 31, 42, 57, 73, 86, 93, 96, 100, 107, 118, 132, 145, 155, 162, 164, 161, 150, 136, 120, 102, 85, 80, 97, 133, 170, 194, 201, 193, 175, 156, 144, 144, 152, 158, 161, 159, 155, 151, 149, 153, 159, 168, 178, 185, 181, 159, 125, 92, 69, 62, 66, 69, 64, 53, 50, 58, 73, 91, 116, 147, 180, 205, 218, 216, 205, 198, 210, 238, 263, 271, 261, 244, 227, 211, 201, 194, 187, 176, 170, 176, 189, 203, 214, 222, 224, 219, 217, 227, 245, 257, 258, 260, 267, 273, 267, 246, 214, 182, 157, 139, 117, 87, 60, 49, 57, 76, 102, 130, 154, 171, 182, 189, 189, 176, 161, 158, 165, 167, 163, 160, 168, 181, 192, 203, 211, 211, 199, 183, 172, 163, 148, 127, 103, 82, 64, 51, 49, 65, 109, 178, 255, 318, 352, 354, 331, 294, 259, 239, 233, 233, 235, 243, 256, 268, 274, 276, 275, 268, 260, 256, 255, 254, 255, 262, 272, 273, 268, 268, 279, 284, 275, 258, 248, 242, 236, 235, 245, 263, 278, 284, 284, 284, 287, 290, 290, 285, 281, 284, 292, 300, 306, 315, 323, 326, 327, 338, 363, 394, 424, 445, 452, 443, 430, 426, 431, 438, 446, 459, 473, 478, 479, 493, 516, 534, 544, 568, 617, 682, 754, 833, 905, 955, 986, 1026, 1083, 1145, 1210, 1300, 1421, 1557, 1710, 1908, 2163, 2463, 2819, 3275, 3856, 4573, 5505, 6807, 8615, 11043, 14258, 18295, 22577]
6015B2577L181O95k124l936m248l593k752k072j534j113q39o74n35m10l30k81k23j60j25j08
6007A396q0n6o0p9p6n4m6n8o9p5p7o9m3k2l2n3n4l1j0jRJ7RorLOmj4k3l4m2l5j0RJ3PlqpO
5990B35J5Qpj5j1%J0K2K4J4jplnrqkj0k3k6j5nkKRPlrlMM%KNNQJ0Jj5k0j2k%lk%KNJ4J4Kj0
5969A94j4j2j2j2nLNlpokKQJ5K2K3K0J0krqmk%OJ3J5P%pqqnpj1j7j6j1pkJ%lnlJOJ1J3J1L
5949A81mqj0j0lQJ6J2M%OJ5K0J5N%%PR%j6k7k8k0j1moj6k4k3qJ4K8L1K4J7J5J3J0RJ2J5Nj0
5931B63j5j0oo%J5L0K9J7JmkLKj1k9l4k0%RRNmj7k5j8mJk%RK0J9J6J2RMkqj3j5j4j1j3j5j9
5913A56k0j8qJ3K7K5Qj0j9k2k4k2j8j4rKJ9L4L7L1K3J1Kk%kpj0qrj8k6k2qOJ6K3K3J8J5J3
5896B06Oj3l1l0j5knj0oJKJPJ5J6PkjNQMKNQRPJj0j9k2j9j3j1j3j2pjNPQJ0J2J2Lj1k3k2j2
$$ y = [22577, 25758, 26453, 24329, 20393, 16145, 12552, 9800, 7728, 6194, 5081, 4242, 3568, 3033, 2623, 2293, 2012, 1789, 1629, 1504, 1396, 1316, 1260, 1200, 1121, 1045, 991, 945, 887, 818, 743, 666, 597, 554, 532, 500, 447, 393, 362, 352, 351, 360, 377, 386, 380, 371, 374, 380, 376, 362, 339, 305, 263, 228, 218, 227, 240, 247, 244, 236, 229, 235, 250, 258, 251, 236, 225, 225, 235, 257, 281, 295, 294, 287, 284, 279, 270, 262, 260, 250, 227, 201, 186, 181, 179, 181, 190, 197, 194, 185, 182, 186, 190, 190, 192, 197, 202, 210, 220, 221, 206, 186, 174, 172, 172, 169, 167, 167, 169, 174, 188, 202, 204, 194, 180, 168, 156, 144, 139, 142, 147, 144, 137, 131, 129, 131, 139, 154, 176, 199, 219, 229, 227, 218, 210, 206, 204, 204, 210, 223, 238, 245, 245, 238, 230, 222, 217, 210, 199, 182, 166, 155, 148, 146, 147, 147, 144, 139, 136, 137, 143, 154, 167, 178, 181, 177, 169, 159, 149, 146, 154, 170, 182, 186, 186, 192, 207, 227, 242, 247, 247, 247, 254, 263, 263, 247, 220, 192, 172, 161, 157, 151, 135, 111, 88, 80, 94, 122, 153, 177, 194, 209, 222, 232, 241, 253, 268, 273, 263, 248, 238, 232, 226, 226, 241, 271, 300, 317, 318, 314, 312, 315, 317, 306, 277, 243, 223, 223, 232, 241, 246, 242, 225, 200, 182, 178, 179, 177, 177, 186, 206, 225, 241, 253, 262, 266, 264, 256, 243, 228, 214, 203, 190, 175, 156, 136, 118, 110, 123, 150, 175, 183, 173, 154, 132, 108, 86, 68, 54, 45, 47, 66, 100, 137, 168, 191, 202, 204, 202, 202, 200, 193, 183, 175, 166, 148, 122, 100, 92, 98, 114, 137, 160, 178, 193, 206, 212, 199, 168, 138, 123, 121, 116, 106, 100, 101, 103, 104, 111, 126, 142, 149, 147, 146, 151, 159, 163, 165, 170, 178, 187, 194, 195, 185, 166, 144, 125, 112, 101, 88, 76, 69, 68, 73, 80, 88, 98, 110, 122, 125, 114, 91, 69, 57]
5877E7pj1j3oQK1K7K7K4J7J2QOJjKQO%kQJ8K0J4Lpj1j2j0j0j4k0k1j4%J4K3K2Oj4k9l2k9k7
5859F2k2pK0M2M9L8K1Olonk%%LMKoj1pNJ1J0POLmoJJ2J0lj4j4rmk%LPJ0J8K3J6lk5l4l0k1
5840A51j1j1j6k4k5j8pMJ3J5J2LprkMOKoj1j1nNJ0QNOJ1R%j0rMJ8K0Pj4k6k4j2kPK1L8M9M0
5821B08J4j2k2j5lNLJjJ%J%JknqlLMkrmJ3K4K0Qjlkpj2j9k4k5j9oJlj2j4nQJ8K6L1L3K4Oj5
5801B00k6k5j5n%OJ5K3K3J4QQJ0Mrj9j8j0KJ2J4Poj5j5j0oqrkJ2K2J8Ok%OQPQJ5K2K4K3J7
5783C34Poj5j8k0k3j8nPJ0Kj0j9k8l4l6k9j8rnqj4k0j5lQJ0Joj1j0j0qpoplLQJ6K3L1K8J8
5765H5Npj3j6j2LJ6K0J1jpm%LKLRJ5J6J0KmnjNJ1J2RKllJQJ5J9K0J3%j3k0j8j2rj0oQK5K7
5746B11J4qk4k7k1oMNmj4k6l3k9j1J7L0K4NpqjPJ4J5Opj5rOK4L5L8K7Rj0k2k5k4j9j1j2j7
$$ y = [57, 50, 39, 26, 20, 28, 49, 76, 103, 127, 144, 156, 164, 170, 171, 170, 172, 180, 186, 186, 184, 192, 210, 230, 244, 247, 240, 229, 217, 207, 197, 183, 163, 142, 128, 128, 142, 165, 187, 193, 179, 150, 118, 89, 62, 40, 33, 53, 95, 144, 182, 203, 209, 206, 200, 195, 193, 193, 193, 196, 200, 202, 196, 185, 178, 183, 194, 204, 211, 217, 220, 216, 210, 211, 223, 233, 230, 216, 202, 193, 189, 187, 187, 190, 197, 207, 225, 248, 264, 261, 236, 202, 172, 151, 140, 129, 113, 89, 64, 46, 39, 43, 56, 71, 83, 86, 79, 70, 68, 72, 78, 80, 74, 63, 52, 47, 52, 62, 70, 75, 81, 92, 101, 101, 91, 82, 86, 104, 124, 131, 117, 91, 67, 55, 53, 60, 81, 119, 168, 208, 222, 210, 188, 173, 170, 175, 178, 179, 178, 179, 179, 180, 180, 181, 179, 174, 166, 163, 166, 170, 168, 159, 155, 168, 192, 212, 220, 219, 216, 214, 207, 195, 176, 152, 127, 108, 102, 103, 100, 88, 74, 69, 77, 95, 121, 152, 185, 209, 215, 200, 174, 149, 134, 129, 129, 135, 150, 173, 196, 210, 218, 226, 236, 240, 231, 212, 194, 184, 186, 198, 212, 219, 213, 198, 183, 173, 167, 159, 150, 148, 160, 182, 200, 206, 204, 204, 210, 218, 225, 233, 248, 270, 294, 317, 334, 341, 335, 320, 302, 282, 259, 241, 236, 243, 253, 255, 245, 226, 198, 164, 128, 99, 81, 72, 67, 59, 45, 25, 10, 7, 15, 25, 26, 20, 9, -1, -11, -19, -26, -32, -39, -42, -39, -31, -15, 8, 39, 67, 85, 90, 83, 70, 54, 42, 45, 61, 81, 92, 91, 84, 80, 80, 83, 85, 88, 97, 112, 128, 138, 140, 136, 131, 130, 135, 146, 158, 167, 169, 166, 163, 164, 172, 187, 206, 226, 239, 239, 226, 206, 188, 176, 167, 157, 151, 159, 184, 211, 225, 217, 193, 166, 145, 139, 143, 148, 144, 130, 104, 71, 42, 31, 48, 78, 102, 107, 100, 92, 91, 98, 112, 127, 133, 126, 111, 102, 108, 132, 167, 205, 232, 241, 231, 209, 184, 160, 141, 130, 118, 101]
5729A01k4j6LJ9J6jk0k8k1rjMQJ8K7L3K8J5LkmlnlKJ1J6Roj7j4JJ9L0K6J3nj5j2kKlqrllo
5710A64j0qljLPJ2J0%rj2rorj2j0jRJ4J7K0K4K0J1lj2j4j5j9k2j9j1nkpj3j8j3KK5L8L3J4
5693A60lj0qlNJ2J2NllNJ3J6J6J6J3PJ%LOMjrj8k2k3j7rjLORJ5J7J5Onj4j5rjKJmj1j9k3j6
5673A21kJ1J5J6K0K0J0kkJ3K8K6J0mpooqpmkoj1j6j4j0rj0rnkmpoJRJ7J6Qoj9k5k4k1j9j5
5655E3rrj1j4j1p%LNJ0J6K3K5J9J2Mlqj1j4j7j9j6j1lRK1K9L1K5J8J4J0NLKL%pj3j8j5mJ1
5637A31K0K0J6J0Jj4k6k3qPPrk5l1j9jJ2J3J0J5K0J1j1l1l9l5k4j2KJ3J3J3J6K4L1K6K0J6
5622A59J7J2kk0k6j7JJ7K1J4N%NJ5J7J0KJPJ2J1J2J1%j8l3l3k3j5qmlpj6k2k7l0l0k2j1MJ4
5605@K0J8J5J1J0Lrj8k2k1j5JK5M6M5K6Nj1k3l1l0j8oJRK0K6K3J6J4J4Rjqj2j3j2p%KkonK
$$ y = [101, 77, 61, 64, 83, 99, 98, 78, 50, 29, 20, 19, 23, 31, 49, 76, 109, 137, 152, 155, 153, 149, 146, 141, 138, 140, 151, 167, 176, 170, 153, 139, 140, 159, 189, 215, 228, 223, 208, 196, 194, 196, 193, 185, 176, 173, 170, 164, 154, 146, 143, 142, 145, 152, 164, 174, 174, 165, 153, 144, 138, 129, 117, 107, 106, 115, 129, 146, 166, 190, 210, 221, 218, 206, 192, 177, 158, 136, 117, 106, 101, 99, 92, 79, 61, 48, 50, 75, 113, 146, 160, 157, 147, 139, 136, 141, 153, 165, 170, 167, 164, 169, 182, 198, 214, 230, 243, 250, 251, 251, 254, 260, 264, 263, 254, 236, 214, 191, 174, 165, 164, 167, 173, 182, 197, 214, 229, 235, 230, 216, 201, 192, 191, 193, 194, 190, 179, 160, 137, 121, 119, 130, 145, 161, 181, 201, 211, 209, 207, 220, 248, 274, 284, 280, 273, 267, 261, 253, 246, 242, 240, 234, 223, 207, 193, 183, 174, 164, 155, 150, 148, 144, 137, 131, 132, 141, 158, 174, 182, 176, 157, 132, 108, 87, 68, 53, 44, 35, 24, 10, -1, -8, -8, -5, 0, 10, 26, 49, 74, 93, 105, 109, 106, 98, 87, 73, 56, 37, 21, 10, 7, 16, 37, 66, 97, 122, 140, 154, 164, 169, 172, 174, 177, 177, 170, 157, 139, 124, 120, 131, 151, 171, 187, 197, 198, 184, 158, 135, 127, 134, 141, 132, 107, 76, 57, 56, 68, 81, 91, 106, 126, 137, 126, 95, 56, 21, -3, -15, -13, 0, 13, 26, 42, 66, 97, 123, 143, 159, 176, 188, 186, 166, 140, 123, 124, 141, 162, 176, 181, 181, 186, 201, 218, 228, 230, 231, 238, 250, 261, 273, 284, 284, 266, 233, 200, 177, 162, 154, 150, 147, 140, 124, 102, 75, 45, 15, -7, -18, -14, 0, 20, 38, 53, 64, 74, 77, 68, 50, 28, 7, -8, -7, 18, 64, 109, 135, 140, 129, 106, 75, 45, 27, 21, 22, 31, 51, 77, 100, 116, 130, 144, 153, 152, 144, 132, 119, 107, 100, 100, 102, 100, 94, 89, 91]
5588I1J1K2K9K6J6Moj2j4j1lMPQJ2J3J1OOJ2J7J8J3QOOJnrrrj0j0oOJ5J7Qnj0okpj7j7rJM
5568B21jrj6k4k5k2j7j0lOQMmnjjkLJ3K1K0J3LllJOKqj4j3ojjlrj1oJOJjKJ1J3QLJKMMLKM
5547A67NKnpkPJ1Plj1j3qmjkmlmj1j5j5pLJ3J8J7J0K%MJ0J6J9J7J3J2J7K0J3lj3j2j0j2j7
5529B21j2%J1J2Pjrj7k0k2k5l0l5m0l8l3k1lK0L7M7M3K8Rrk1k3j9j4j2j1mJ0K3K7J9RKkkk
5512A00mj3k0j6jJ0QMJ0J9K6K6J9Kk5m3l8j3RJ8J2QNOQPlj9k7j7LJ5J1lj1rKJ5K2K1J1nj6
5495A14j6j0mmlMJ0RknMJ6J9J1LKkoj1j0qprj4j4rJJ0J7J9K0K0J8J0%ojJ0K4K9K8K6K3J5k
5477C19k1l6m4m6m4l5k2pPK1K8K9K3J6PkrrmknolNRJ1PknkPPjnkNJpj4j1n%OJ0Rkj5j9j2%
5457A30Njj4k2j8qKPJ1J5J5J4J1Olj0mJ2K3K3J3Joq%J1K0J8R%mmjKLjoj0j2j2q%MM%kKONn
$$ y = [91, 102, 124, 153, 179, 195, 199, 193, 181, 167, 156, 153, 157, 164, 172, 184, 197, 208, 214, 220, 232, 249, 267, 280, 288, 294, 300, 301, 296, 287, 278, 269, 259, 249, 243, 249, 264, 281, 289, 284, 274, 268, 266, 259, 242, 225, 216, 217, 221, 220, 211, 195, 171, 146, 124, 107, 97, 94, 100, 108, 112, 108, 103, 102, 101, 99, 102, 115, 136, 156, 169, 172, 169, 166, 167, 173, 175, 167, 153, 140, 134, 133, 132, 129, 120, 109, 103, 104, 110, 111, 110, 112, 123, 136, 144, 147, 148, 150, 154, 158, 161, 163, 167, 172, 174, 169, 162, 160, 167, 178, 185, 182, 171, 158, 150, 146, 145, 143, 139, 136, 132, 121, 106, 91, 84, 87, 100, 118, 135, 145, 147, 147, 151, 161, 177, 196, 213, 226, 238, 255, 275, 288, 285, 272, 260, 250, 238, 221, 209, 209, 220, 232, 239, 238, 229, 212, 192, 170, 145, 115, 80, 40, 2, -31, -52, -55, -35, 2, 49, 92, 120, 129, 120, 99, 76, 57, 43, 31, 20, 16, 26, 49, 76, 95, 104, 106, 104, 102, 100, 96, 83, 63, 47, 46, 56, 64, 68, 78, 97, 123, 149, 168, 170, 145, 102, 64, 51, 60, 78, 90, 98, 103, 109, 117, 124, 121, 102, 75, 58, 61, 76, 87, 84, 73, 64, 66, 81, 103, 124, 135, 130, 114, 98, 88, 84, 80, 77, 81, 91, 100, 98, 93, 97, 113, 132, 143, 146, 148, 146, 140, 129, 119, 111, 104, 95, 81, 67, 58, 59, 69, 86, 105, 125, 145, 163, 173, 173, 167, 166, 176, 200, 229, 257, 283, 306, 321, 319, 298, 262, 218, 172, 128, 93, 71, 64, 71, 92, 120, 149, 172, 188, 195, 193, 184, 175, 171, 169, 164, 158, 155, 160, 169, 180, 187, 185, 180, 178, 185, 192, 191, 186, 184, 189, 190, 183, 169, 158, 153, 153, 159, 169, 178, 176, 161, 142, 130, 130, 135, 134, 120, 98, 80, 72, 74, 81, 92, 107, 122, 136, 147, 153, 150, 140, 136, 148, 171, 194, 207, 208, 202, 194, 194, 205, 225, 243, 252, 252, 248, 244, 243, 245, 248, 247, 241, 231, 219, 207, 199, 199, 203, 207, 207, 205, 207, 213, 218, 213]
5437B13j8l1l7l2j4J1L5M2L1Rpj0%J3K3K5K1Prj4j0%Joj3j6j8j8j5j0rj1j4qMJ4K0K0J7Lj5
5420A74k4j5MJ3J0%rj7k3k1qNRKml%MM%rj8k0j6j0polOJ2J0NjjJJjj%PJ5J6J2KmkQJ9K1J2
5400A49KJRJ6K1K3K4K1Qoj7j9j6j7k0k2j7rjNMNMJmrj0pnmljjnoJJ4K5K9K4J7J1RP%rqjLj0
5380B06k9m0l9l4k9j8JJ4J6Pjrj6k1j3JJ5J8Rkn%J1J6J7J7K1K5K5J9J5J9K5K4Rj7l8m4l4j1
5364A30J3L0L4K6Qpj3j2j4j7j9k0k1k0j2kONMMM%opjRJ5J6J3J2J2J3Mrk0k3j6rnnn%J1K4K7
5346A57J7Kpj3j6j4rkMRJ2J7K5K9K5J0oj6j7j7j9j8j3j0j5k2j9q%jpj5j7j6j0jRJ9K6K8K6
5329A07K2J4Jj7l2l5k2nPRJppKJ0RJJJ2K6K9K0R%llMJ1J5J1NlpmOJ4J6J6J3J2Qjj7l4m2l7
5311A35k4j9k3k7j7kOPRJ4J4MplNQ%mKJ2J8J6J5Rmj9k3rJ5L3L6L0J8OJNJ2J2Krj2qmJKjj1
$$ y = [213, 195, 164, 127, 95, 81, 92, 127, 169, 200, 209, 202, 192, 192, 205, 228, 253, 274, 281, 272, 258, 248, 248, 249, 243, 230, 214, 196, 178, 163, 153, 144, 133, 119, 111, 115, 129, 149, 169, 186, 189, 174, 150, 135, 139, 152, 162, 162, 153, 136, 113, 92, 84, 89, 98, 100, 96, 93, 93, 97, 101, 101, 92, 74, 54, 38, 28, 21, 15, 12, 18, 30, 40, 45, 44, 43, 44, 45, 44, 43, 43, 50, 65, 81, 93, 95, 91, 89, 97, 116, 137, 149, 151, 152, 161, 177, 198, 221, 245, 266, 274, 268, 251, 232, 216, 199, 179, 157, 140, 131, 130, 135, 139, 144, 148, 149, 145, 136, 126, 119, 114, 110, 107, 106, 105, 100, 94, 95, 109, 134, 163, 187, 204, 215, 224, 231, 231, 222, 214, 213, 216, 206, 177, 137, 98, 64, 35, 17, 18, 32, 48, 55, 54, 45, 29, 8, -5, -4, 11, 29, 38, 36, 31, 31, 42, 58, 75, 92, 113, 138, 163, 182, 197, 216, 241, 265, 274, 257, 219, 175, 141, 130, 143, 173, 207, 233, 241, 234, 221, 209, 195, 178, 159, 139, 118, 98, 86, 84, 90, 95, 99, 103, 107, 107, 101, 94, 93, 102, 117, 133, 146, 158, 170, 183, 187, 178, 158, 135, 119, 110, 105, 100, 95, 95, 106, 130, 157, 174, 176, 169, 156, 140, 126, 117, 115, 119, 128, 140, 157, 182, 211, 236, 246, 240, 224, 207, 190, 171, 153, 140, 130, 115, 93, 74, 66, 66, 65, 58, 43, 26, 10, 0, -1, 8, 27, 53, 81, 107, 129, 143, 144, 127, 95, 60, 38, 33, 40, 49, 50, 43, 36, 38, 48, 57, 58, 59, 71, 97, 126, 146, 155, 155, 152, 149, 153, 164, 179, 190, 195, 192, 185, 181, 187, 201, 217, 233, 246, 258, 266, 265, 248, 214, 172, 135, 111, 92, 69, 42, 25, 23, 29, 36, 45, 59, 73, 77, 70, 67, 72, 80, 80, 76, 78, 90, 108, 124, 139, 148, 144, 125, 102, 93, 108, 141, 177, 207, 225, 231, 232, 237, 249, 261, 263, 254, 242, 234, 230, 231, 233, 232, 221]
5292B21k3k8k2j1MJ5K1J8J4J6K3K5J2nk1k8l1l1k7j6lPJ1PKKMMmj7l0l4k6mK4M3L9K0KJJ3
5276A87K2K4K2J9J5Lpj0o%JJkljOJ3Rok2l0k6j5nlqj2j0l%krj0oMQMlplMKpj3j0onmmmmm%
5254G4jnoOK4L1K8J9J5J4J4J6J7Prk3k9l1l1k9j9nMQJ2J5J0kj8k7k2oJ7L3L9L1J6qk8l3j7
5238A01J0K4J5rk4k0lJ1J1Kj0j1mPJ0NjkNJ5K0J9J6J0jj4k5l2l1j9lJ5K5K3J2kj1j1JJ2J7
5221A53J4J0QRRJ1J2J3J0OOLnk2m0n0m8k9j0knrqol%PJ1Moj1nPJ6K0K0J7J4J5J3Onj7k6k7
5203H0j8KJ7J5Lj0j6j6j6j5j4j3j0jJ0J2J1J4K1K1J3LnpnkJkmLJ3J8J1LLMKk%QJ6K1L0L5L2
5185B66J5oj9j8qJJkpj0j3j8k3l0l1k6j5lPJ2J4Qlj4j5mQJ4J1Lj1k5k9k7j9j6qMJ2J5J5J8
5168B4J8J3PRJ6J9K1J7Pj0k5k7k2j5pMJ2J1OQJ2J2J0J1Rjj1j4qoj2j7j1kOJ5J5Nj4k9l2k8
$$ y = [221, 198, 170, 148, 137, 141, 156, 177, 195, 209, 225, 248, 273, 285, 280, 259, 231, 200, 169, 142, 126, 123, 130, 141, 148, 150, 152, 156, 160, 156, 139, 109, 75, 49, 45, 69, 112, 151, 171, 173, 174, 187, 209, 233, 255, 274, 289, 292, 285, 275, 269, 269, 270, 271, 269, 266, 265, 271, 284, 293, 287, 265, 235, 209, 194, 189, 186, 178, 166, 156, 153, 153, 151, 142, 132, 126, 130, 138, 142, 139, 132, 129, 133, 135, 128, 115, 105, 99, 94, 90, 86, 82, 78, 74, 74, 73, 68, 62, 68, 92, 123, 151, 170, 185, 199, 213, 229, 246, 253, 244, 221, 192, 161, 130, 101, 82, 77, 81, 89, 101, 116, 126, 124, 106, 79, 57, 51, 68, 101, 140, 171, 187, 179, 151, 118, 101, 111, 135, 150, 141, 117, 97, 94, 105, 116, 118, 108, 97, 93, 100, 110, 115, 114, 112, 117, 132, 152, 171, 187, 197, 196, 182, 157, 125, 94, 75, 72, 87, 112, 135, 147, 145, 134, 123, 124, 136, 153, 167, 177, 185, 194, 203, 214, 226, 239, 249, 255, 261, 264, 259, 237, 197, 147, 99, 70, 60, 58, 53, 44, 36, 30, 27, 27, 34, 45, 49, 43, 32, 27, 34, 50, 70, 90, 107, 121, 136, 149, 155, 150, 133, 107, 80, 62, 64, 81, 96, 99, 89, 73, 57, 41, 26, 12, -1, -11, -12, -2, 10, 21, 35, 56, 77, 90, 93, 88, 81, 76, 74, 75, 73, 69, 72, 85, 103, 114, 117, 120, 124, 126, 124, 124, 132, 148, 169, 199, 234, 266, 281, 275, 256, 238, 230, 231, 232, 230, 223, 213, 200, 182, 159, 129, 98, 72, 57, 54, 61, 73, 87, 95, 92, 78, 63, 59, 67, 81, 92, 95, 84, 59, 30, 3, -16, -32, -40, -36, -24, -9, 6, 24, 42, 55, 62, 71, 87, 106, 127, 144, 151, 141, 116, 89, 67, 52, 45, 49, 61, 72, 78, 86, 98, 110, 120, 131, 140, 139, 128, 114, 106, 100, 88, 71, 60, 58, 64, 79, 94, 99, 85, 56, 24, -4]
5151dk2j0NJ8K3K4K2J7PLKJk%RJ7J6J0PNnj9l0l2l0j9JK1L0K8K5K2J5PLJqk1k4j6prj3rKJ5
5133G6J8K0J7J3QKmrlJ3K9L3K3J0OJ1J9J9J0qj9k1j4j2j7k4k0mPLj2j8qOPmrjJ6K3J8Omj1
5115A91j6k0j8j3qj2j9k1j1JNlj3j7j5j1rj0pKJ7K7K9K2J9K0K5K7K7K4J4jpkQQ%nporj8k5
5098A63k7k4j7rqpnKRJ4J5J9J9J8J2OJLPJ0J0O%qj5j8j6j6j9k5k7k2j1kNJ3K0K6K9K6J7QJ
5081A83%KNMjnrqooonnnorj3j2mKmk2l6l3j5MJ7K3K3K2K6L5M1L8K9J8RLKJkj0j7j5qkJJjn
5061B19ppj0j8k5k2j5j1j0mJ1K3K2J3Lpk0k8k1%K1K8K0Onrj3j4rOK3K8J3oj8j2%QOjprj0r
5043A23qjRJ5J5RKmkOJ7J6Lj3j7j2qj1j0mJ%nmLOOMkj2k3k6k1rLJ3J6Opj5rOJ4J7J9K4K7K9
5024A86K6J8Lj6k6k1nJ0J8K0J7J1kj3j9j5j1rqkRJ3Nj2k5k7k3j7j5j1lQJ5K1K4K9K7K1Qnj5
$$ y = [-4, -26, -36, -31, -13, 10, 34, 56, 73, 80, 83, 85, 86, 84, 84, 93, 110, 126, 136, 143, 148, 143, 124, 94, 62, 32, 13, 14, 35, 65, 93, 118, 140, 155, 162, 165, 166, 158, 137, 113, 97, 90, 81, 68, 59, 61, 76, 94, 114, 131, 144, 152, 154, 150, 141, 138, 151, 180, 213, 236, 246, 252, 263, 282, 301, 311, 303, 284, 263, 249, 237, 220, 196, 176, 172, 179, 182, 170, 152, 144, 150, 157, 153, 144, 143, 159, 182, 200, 206, 202, 191, 175, 155, 137, 124, 116, 104, 85, 64, 53, 54, 59, 56, 43, 26, 11, 0, -9, -19, -26, -24, -7, 20, 49, 71, 90, 110, 135, 162, 189, 213, 227, 226, 219, 217, 225, 233, 233, 228, 221, 215, 206, 188, 163, 136, 112, 95, 86, 78, 71, 66, 68, 77, 91, 106, 125, 144, 162, 174, 180, 181, 184, 191, 201, 211, 217, 217, 209, 194, 176, 160, 144, 125, 100, 73, 51, 40, 38, 43, 56, 76, 102, 131, 157, 174, 182, 183, 183, 185, 190, 194, 193, 188, 179, 171, 165, 159, 153, 148, 143, 138, 132, 123, 110, 98, 94, 96, 92, 70, 34, 1, -14, -10, 7, 30, 53, 75, 101, 136, 177, 215, 244, 262, 271, 274, 276, 277, 275, 265, 248, 233, 225, 223, 224, 225, 224, 219, 212, 205, 195, 177, 152, 130, 115, 104, 94, 90, 101, 124, 146, 159, 162, 155, 135, 107, 86, 86, 107, 135, 155, 161, 156, 147, 134, 120, 111, 117, 140, 168, 181, 175, 157, 145, 145, 153, 159, 158, 151, 142, 132, 123, 115, 114, 123, 138, 153, 162, 164, 160, 158, 164, 181, 197, 200, 187, 170, 158, 150, 139, 129, 125, 126, 126, 121, 117, 120, 126, 132, 136, 134, 122, 99, 73, 52, 43, 46, 59, 75, 81, 74, 59, 50, 56, 70, 87, 106, 130, 157, 186, 212, 230, 233, 217, 191, 170, 165, 175, 193, 213, 230, 241, 239, 226, 207, 192, 181, 172, 164, 162, 171, 184, 189, 177, 152, 125, 102, 85, 70, 59, 56, 64, 79, 100, 124, 153, 180, 201, 209, 204, 189]
5007A89j9k1j7j0jQJ7K0J2lj3j2mlj0j8j5p%OJ0J4J3J1J4J4Pqj7j2OK1K5J6OjnoookMJ0QJ
4989B16kjLMjmqj1j6j7j5j1j1j4j5j2kRK2K7J8Lj2k1k8l1k4nRQpk2k7k3j7rLRQLjKJ1J6J4
4971A8KrpQK3K4Rqj9j6mJ1K0K3J7Nrj5j3lOJ0J2J0OLMNMnqmLMJ%J0J9K4K5K3J7Onj1j4j4r
4952A79l%kkKJ0J2J0RJ2J4RJqj1nOJ1Nrj6j4rqj3j5j5j7k2k4k0j3qj0j4j1NK2L1K4J0Jlnm
4934I2lLRJ7K3K6K8L0K9K3J1jqj3j7k5l4m0l8k5jK1L2L2L1K9K1Mj3k1j8j4j4j5j1ooj4l1m9
4918D4n5m6k6j2nlOJ8K5K7L0L6L5K1Jj1j3j4j7j9j4mMQJ0J4J9J9J6J1Q%orlOO%kMJ4J6RMN
4900A57J1J5K0K3K2J1rk4k6j7pLJ0R%j6k3j8plmoj1j9k3k0pKOQRJ1J2J9L1L8L6K6J6J2J1J0
4883B88J2J0PL%oj7k5k6k0j2kRJ3J3J6K4K8K0Plqj2j4j0qmOK2L8M3M5N0M8M0L7M4M3K9K1L4
$$ y = [189, 170, 149, 132, 122, 121, 129, 146, 166, 178, 175, 162, 150, 146, 143, 133, 115, 100, 93, 93, 99, 109, 123, 136, 147, 161, 175, 182, 174, 157, 145, 151, 172, 197, 213, 219, 218, 213, 207, 201, 195, 193, 197, 207, 215, 216, 214, 213, 216, 220, 219, 215, 207, 196, 180, 163, 148, 137, 126, 112, 97, 85, 83, 92, 114, 141, 159, 162, 150, 129, 101, 70, 46, 41, 50, 58, 51, 29, 2, -21, -38, -47, -44, -35, -27, -24, -25, -23, -12, 4, 18, 20, 11, 4, 12, 35, 59, 68, 60, 41, 25, 21, 32, 52, 75, 92, 97, 88, 73, 60, 57, 63, 73, 85, 95, 101, 104, 108, 113, 117, 112, 104, 100, 103, 107, 108, 108, 118, 137, 161, 186, 209, 226, 232, 227, 216, 202, 188, 179, 176, 176, 174, 172, 174, 184, 196, 206, 215, 227, 241, 250, 251, 243, 232, 227, 233, 244, 249, 240, 224, 210, 201, 193, 180, 165, 150, 133, 111, 87, 67, 54, 46, 36, 22, 11, 16, 38, 69, 93, 103, 104, 101, 96, 92, 89, 92, 101, 118, 141, 167, 195, 225, 254, 277, 288, 287, 279, 266, 249, 224, 190, 150, 112, 87, 86, 107, 139, 171, 202, 231, 252, 256, 243, 222, 204, 190, 176, 161, 150, 144, 138, 124, 93, 44, -11, -57, -83, -95, -100, -103, -97, -79, -54, -27, 3, 39, 74, 95, 96, 85, 72, 58, 41, 22, 8, 4, 8, 16, 26, 40, 59, 78, 94, 105, 113, 113, 107, 98, 95, 101, 107, 107, 105, 109, 123, 139, 148, 152, 157, 168, 183, 203, 226, 248, 259, 250, 226, 200, 183, 176, 179, 189, 198, 198, 182, 159, 141, 134, 131, 127, 121, 110, 91, 68, 48, 41, 43, 49, 57, 66, 77, 89, 108, 139, 177, 213, 239, 255, 267, 278, 288, 300, 310, 317, 320, 320, 314, 297, 272, 246, 226, 214, 212, 221, 234, 247, 263, 287, 315, 335, 342, 339, 331, 319, 305, 295, 287, 283, 289, 311, 349, 392, 437, 487, 535, 575, 612, 656, 699, 728, 749, 783]
4866G83N0N8P6J18J64K08K90M24N79P71J078J439J506R33j38j098j452j264r41p14n48l84
4858A938k65k15j80j31j03j01q0l7j9l1k7OK6K0J4J7QkJ9N6N5L0L7P6R2Q8R8J07P4M0P4J50
4845A834J94K39L62N17O25P72J103J581K133K950M089M779L767Q48k455m263m161l211k413
4837I290j875j368r50p48o40m70l17k78k60j66q2r2j10n9j6m6o9k7Mk5l5K1N3K5M1J38K01
4826B140J76J64K00J86J24J59L02L92M23N90R01J152J389J932K827L844N193P302R293Q706
4818D7395M057k712p636q652p088n284m081l084k175j631j389j108p77o23n98m75k98k58l05
4811C278k46j27j13j50q8Lk0q3l7L7J2k9N4J56J40J01J73K44J91J67L17M81N16O11R26J260
4800G774J490J945K873M023N381P532J0176J0867P011n54p488j0190r030o793n172l986k857
$$ y = [783, 833, 891, 967, 1085, 1249, 1457, 1747, 2171, 2750, 3521, 4599, 6038, 7544, 8477, 8339, 7241, 5789, 4525, 3584, 2870, 2322, 1938, 1673, 1458, 1278, 1147, 1044, 943, 863, 826, 807, 776, 749, 755, 781, 801, 815, 832, 840, 838, 857, 913, 968, 998, 1035, 1111, 1203, 1291, 1389, 1496, 1570, 1610, 1684, 1834, 2028, 2267, 2629, 3146, 3771, 4543, 5646, 7227, 9360, 12310, 16399, 21178, 24945, 25793, 23338, 19075, 14914, 11703, 9290, 7415, 6047, 5097, 4349, 3709, 3239, 2922, 2644, 2384, 2218, 2136, 2044, 1934, 1875, 1859, 1813, 1744, 1717, 1721, 1696, 1661, 1682, 1735, 1760, 1801, 1939, 2140, 2316, 2480, 2680, 2866, 2990, 3149, 3451, 3843, 4266, 4856, 5757, 6909, 8298, 10230, 13057, 16901, 22094, 29396, 38689, 47395, 51452, 48740, 41104, 32452, 25364, 20080, 15999, 12915, 10740, 9109, 7720, 6612, 5835, 5212, 4614, 4139, 3841, 3583, 3278, 3032, 2905, 2792, 2642, 2554, 2557, 2537, 2454, 2417, 2454, 2466, 2437, 2491, 2647, 2787, 2888, 3061, 3305, 3496, 3663, 3980, 4461, 4977, 5588, 6514, 7774, 9264, 11209, 14082, 18105, 23486, 31018, 41194, 52061, 59072, 58518, 51030, 40840, 31810, 25017, 19845, 15859, 13002]
4793A3002k041j670j386j000p32o68n80l90k90l21k91j63j18j84j81q8o7j24r9LK3k4J6J24
4784B751J36Q0J22K20K12J53K32L87M32M54O73R97J218J507K182L127M159N703P962R386P422
4775D9515J626m947q548q357o446m811l722k751j946j518j273r57o69n67n24l91k66k60k68
4768B920j93j34j68j92j23n4o4p0j5J2l6n5JM2K5L9J14J40R1Q5J63K19K25L06M75N94O83R46
4756E976J420J948K618L664M644M283J850j607m052m491l640k682k043j538j101q36p01n49
4749C163l84l04k87k31j49j16j23r9n8n1o7o1m8o0p4n4k5k8m0k7j1j7j6K2N6N3L8N0O4O2Q1
4737A259J43K04K42L14M51O07P81J079J454J529R31j87j180j545j354j006p48n60l88k57j94
4728A575j63j34j15j10j03q7p0o0m4l0l3m4m8l4j8j0prk0l2l0j4MJ4J4Qlj3j6j2j4k0k6k5
$$ y = [13002, 10961, 9291, 7905, 6905, 6173, 5505, 4925, 4535, 4245, 3924, 3633, 3470, 3352, 3168, 2987, 2899, 2832, 2708, 2609, 2612, 2635, 2611, 2627, 2751, 2887, 2967, 3089, 3309, 3521, 3674, 3906, 4293, 4725, 5179, 5852, 6849, 8067, 9574, 11756, 14883, 19042, 24745, 32707, 42093, 49515, 51141, 46194, 37646, 29289, 22843, 18032, 14310, 11559, 9613, 8095, 6822, 5865, 5196, 4629, 4105, 3714, 3448, 3188, 2920, 2727, 2593, 2425, 2233, 2110, 2056, 1992, 1922, 1907, 1919, 1883, 1828, 1829, 1871, 1896, 1935, 2049, 2189, 2280, 2365, 2528, 2747, 2972, 3278, 3753, 4347, 5030, 5976, 7396, 9344, 11962, 15626, 20270, 24553, 26403, 24796, 20744, 16253, 12613, 9931, 7888, 6350, 5249, 4413, 3712, 3163, 2779, 2475, 2188, 1957, 1808, 1692, 1569, 1470, 1412, 1361, 1294, 1233, 1185, 1125, 1051, 997, 972, 944, 904, 877, 866, 849, 833, 855, 911, 964, 1002, 1052, 1116, 1178, 1259, 1402, 1606, 1848, 2162, 2613, 3220, 4001, 5080, 6534, 8063, 8994, 8807, 7627, 6082, 4728, 3722, 2974, 2414, 2026, 1769, 1575, 1412, 1278, 1163, 1053, 950, 863, 793, 733, 689, 659, 626, 582, 534, 500, 482, 472, 465, 456, 436, 404, 374, 360, 364, 378, 392, 400, 397, 384, 368, 356, 342, 322, 296, 271]
4715B71j7lJ4K5K7K1J3PRJ4K0J7Ooj6j9k0j5kJ0J4J1O%jJNkj9k7k0kJ0J2J1Plj6k0j5j4j8
4698B76j5nNPMLMJnj0rpj0j8k4k1j4qnjPJ4J4J4J9L1L5K6Rnj2j3j3qjMQJ0J4J5J4J0NORJ1
4679C71Kj6l5m1l3j6lMMMJoj3j6j5q%RJ9K6K5J8RKlpj2j2j1o%K%l%OPjj0j4j4j8k5k7k5j6
4661A03pJPJ3J9K3K0R%kLMKKORRPKqj9k1j4jMNPJ3J5J0Mjoj0j2j4k1k8k5rJ2K3K2J0jpm%K
4641A56kpokklorj3j9k2k0j0NJ5J4QJ0K4L7L9K7J0kpqj0rlLPLoj1j1olnqokLJlp%J1K0K1J5
4621B01PJnj0qKJ3J6J4Pjrj4j4j0lJkoj2j0KJ8L3L5K6J0kj0j5j8j4mPJ1Okj1j5j5pPJ8J9J0
4603B47MQJ6J1nk2k5j5poj2j9k0j7j4j3j6j7j0LJ8K5J8Lj4k2k1j5qopmPK2L4L4K6K0K0K3J9
4586B43Lj1j2jRJ6J5J1PLKM%j2k6l6l4k1lJ7L2M1L9L1K1Ppk0k8k9l2l5k9j6jOM%knqmNJ0M
$$ y = [271, 254, 251, 265, 290, 317, 338, 351, 358, 367, 381, 401, 418, 424, 418, 402, 383, 363, 348, 346, 356, 370, 381, 387, 387, 386, 387, 392, 390, 371, 344, 324, 322, 332, 344, 355, 362, 359, 343, 323, 308, 294, 276, 261, 256, 261, 268, 272, 275, 279, 280, 275, 265, 256, 249, 239, 221, 197, 176, 162, 154, 149, 148, 155, 169, 183, 197, 216, 247, 282, 308, 317, 312, 300, 287, 274, 266, 265, 269, 277, 287, 301, 316, 330, 340, 345, 351, 360, 371, 373, 357, 322, 281, 248, 232, 229, 233, 237, 241, 242, 236, 223, 207, 192, 184, 184, 193, 212, 238, 263, 281, 290, 292, 289, 282, 270, 258, 247, 241, 241, 243, 243, 240, 240, 246, 253, 252, 242, 228, 214, 196, 171, 144, 119, 103, 96, 97, 104, 117, 136, 159, 179, 188, 188, 186, 189, 193, 195, 197, 203, 212, 221, 228, 230, 222, 203, 182, 168, 167, 171, 176, 183, 196, 211, 221, 225, 224, 218, 208, 196, 182, 161, 133, 108, 99, 111, 134, 156, 166, 165, 158, 154, 154, 156, 154, 147, 141, 139, 137, 134, 128, 119, 106, 87, 65, 45, 35, 40, 55, 69, 77, 87, 111, 148, 187, 214, 224, 222, 215, 207, 197, 188, 185, 188, 195, 198, 192, 181, 170, 164, 161, 156, 148, 142, 140, 143, 144, 141, 134, 134, 145, 165, 186, 201, 208, 209, 204, 194, 186, 188, 201, 217, 231, 238, 237, 228, 214, 200, 190, 187, 188, 186, 180, 168, 158, 160, 178, 211, 246, 272, 282, 280, 270, 255, 237, 223, 219, 226, 237, 243, 241, 230, 215, 200, 193, 200, 218, 237, 247, 251, 259, 275, 286, 281, 259, 234, 219, 212, 206, 194, 175, 155, 138, 124, 111, 95, 78, 68, 71, 89, 114, 132, 135, 121, 99, 78, 63, 55, 49, 42, 38, 45, 67, 101, 135, 161, 181, 201, 224, 243, 246, 235, 223, 222, 231, 247, 262, 273, 280, 283, 285, 289, 289, 277, 251, 215, 181, 160, 157, 174, 206, 247, 286, 317, 338, 345, 338, 318, 290, 261, 229, 194, 165, 149, 148, 154, 158, 158, 156, 151, 143, 139, 144, 154, 158]
4568A58pj4j1nllljKMRJ4K0J7PkpnkPK1L8M2L1J3%nnj0j7k1j9rNJ3J3OmqpJJ0J2Pjppnmoj0
4548B42j8k3k1j6j3j2j0npj0j3j3j0oMJ6K7L2L6L4K4RjkNRP%qj2j5j8k4k9k5j2LNnj4j1l%
4531I7pj6j9j2rqj0nKNMPJ8K8L1K6J8J2O%%LPROjjQK6L4K3jk0k6k1j1%RJ4J1QLJmopmnj1j7
4511A95j8j1%J3K3L0K9K3K0K3K5J5nk7l6l6l2k9k8k7k1rOK0K6K7K2J1ok0k1j4qnllqj6k1j7
4495H7rm%OJ5K4K9K4J2kq%J2J7J5Qjqj3j2oJLKLQJ0Onj4j1k%j3k9l1j3J2K9L2K4J0pj4oJ0
4476A91K7L2K8J7Qkj3j8j7r%Mmj1j7j3pKJ1J8J5Nj0j8j4j2j7k6k6qJ2K0J4NNMnj6j9j0MJ3
4459A43J8J9J3OJLQJ0Mnj2j2kPROjnmkKLKjJRJ5J3Nmrj3j1rnnn%RJ4J4J0RJ0J0RLnj3j5j3
4439B34j2k0k8k8j8mKjqj3j2j0om%NJ1J7K1J9J2JkLPMoj4j2qlLOOKoj2j6j5oPJ8K2J9J4PL
$$ y = [158, 151, 137, 126, 121, 118, 115, 112, 111, 113, 117, 126, 140, 160, 177, 184, 182, 175, 170, 168, 175, 196, 234, 276, 307, 320, 320, 315, 310, 300, 283, 262, 243, 234, 239, 252, 265, 271, 267, 259, 252, 253, 263, 275, 282, 281, 274, 267, 262, 258, 252, 242, 224, 201, 180, 164, 151, 139, 129, 124, 117, 107, 94, 81, 71, 65, 69, 85, 112, 144, 180, 214, 238, 247, 246, 244, 249, 258, 265, 265, 257, 245, 230, 212, 188, 159, 134, 122, 125, 130, 125, 111, 100, 97, 97, 90, 74, 55, 43, 34, 26, 16, 11, 13, 18, 22, 29, 47, 75, 106, 132, 150, 162, 168, 168, 168, 171, 178, 187, 193, 192, 191, 199, 225, 259, 282, 281, 261, 235, 214, 203, 203, 212, 226, 237, 245, 248, 249, 245, 239, 232, 228, 223, 212, 195, 177, 166, 166, 179, 202, 232, 261, 284, 304, 327, 352, 367, 362, 335, 299, 263, 231, 202, 174, 147, 126, 117, 123, 143, 169, 196, 218, 229, 223, 203, 182, 168, 160, 155, 152, 149, 141, 125, 104, 87, 78, 74, 74, 80, 95, 119, 148, 172, 184, 182, 174, 174, 186, 203, 218, 226, 225, 217, 204, 192, 186, 187, 190, 192, 195, 203, 213, 219, 214, 200, 189, 187, 187, 174, 145, 114, 101, 113, 142, 174, 198, 208, 201, 187, 181, 191, 218, 250, 278, 295, 303, 301, 288, 270, 253, 244, 244, 248, 244, 233, 216, 203, 196, 198, 209, 227, 242, 247, 237, 219, 205, 193, 176, 150, 124, 116, 128, 148, 162, 167, 172, 176, 171, 155, 136, 126, 130, 143, 161, 180, 193, 199, 200, 203, 211, 221, 225, 220, 208, 196, 194, 201, 210, 216, 215, 210, 206, 204, 206, 209, 211, 210, 211, 220, 235, 248, 253, 249, 240, 227, 216, 207, 202, 197, 192, 192, 201, 215, 229, 239, 248, 258, 268, 277, 280, 275, 262, 247, 234, 222, 202, 174, 146, 128, 124, 126, 125, 117, 104, 92, 82, 76, 72, 72, 77, 88, 105, 126, 145, 157, 158, 156, 159, 166, 170, 164, 150, 138, 130, 127, 130, 136, 142, 144, 138, 126, 110, 95, 89, 96, 114, 136, 155, 169, 176, 179]
4420A79MJ1J7J2NKORNoj8k2j7lJ2K2K2J3Jj0j8k8l6m3m0k8j0LRQMjnj0j1qjPJ1J4J4RJrj1
4402F5pKQJ2K2L3L8L2K2J1jmJJ0J1Llmkpj7k3k0rOJ8K6K8K8K7K1Oj1k3k2j0KQKj4k9l7l1k0
4384A48oRK2L1L3K9K0J4J1RMpj3j4j5k5l3l0j4PJ6J4QMK%nj3j7j6qJJ0J4J4RLjmj1k2k7k0
4367A31pPJ4J5J0kj3j2jRJ1Okorrj0j0j3j5j4kJ1K1K0J6J8K5K6J9QPJ5K3K4J5%j4k1k0j8j8
4350B35j8j2oqj3j4oLOMLRK3L0K5Oj3j6oM%j3k3k8l0k9k1qOJ3J1Kon%LKJMQQJnomJK%lkNJ1
4329A31J6J6J5J3J1QRJ0J2RPJoqkQOmj0nNLj0k1j9j1npqmNJ5J8J4J3J2Oj1l2m1l4j8lOJ2J6
4311A38J5J0OLLOQJ1J2J3J5J1Mrk3l5m2l9k8j5j2j6k0j6mOJ7K2K5K6K7K5K0J3M%mnrj0n%O
4293A54QOJj0k0k5k5k3k0j5o%ORJ2J0MKRJ8J9J5J5J8J8Qrj9j5lRJ3J6J6J3P%%NPPNJ0J9K3
$$ y = [179, 183, 194, 211, 223, 228, 230, 236, 245, 250, 244, 226, 204, 187, 184, 196, 218, 240, 253, 254, 244, 226, 198, 162, 119, 79, 51, 41, 44, 53, 61, 65, 64, 59, 49, 38, 30, 29, 36, 47, 61, 75, 84, 85, 76, 65, 58, 60, 68, 80, 102, 135, 173, 205, 227, 238, 237, 233, 234, 244, 255, 258, 255, 251, 249, 242, 225, 202, 182, 173, 179, 197, 223, 251, 279, 306, 327, 333, 322, 299, 277, 267, 269, 277, 279, 265, 236, 199, 168, 148, 142, 151, 173, 204, 237, 266, 286, 300, 311, 320, 324, 317, 304, 290, 275, 250, 217, 187, 173, 180, 196, 210, 218, 222, 224, 224, 219, 206, 189, 173, 165, 166, 176, 190, 204, 213, 216, 215, 211, 200, 178, 151, 131, 124, 131, 145, 160, 170, 168, 155, 143, 142, 151, 162, 168, 166, 160, 151, 142, 132, 122, 109, 94, 80, 78, 89, 110, 130, 146, 164, 189, 215, 234, 242, 249, 264, 287, 311, 326, 326, 312, 291, 271, 253, 235, 217, 205, 199, 191, 178, 164, 158, 161, 167, 171, 174, 183, 206, 236, 261, 267, 254, 238, 232, 236, 236, 223, 200, 172, 142, 113, 92, 84, 90, 103, 114, 116, 110, 105, 105, 108, 110, 111, 115, 123, 131, 132, 127, 121, 117, 118, 120, 120, 117, 115, 120, 131, 147, 163, 178, 191, 202, 210, 219, 229, 241, 250, 257, 258, 252, 244, 242, 250, 256, 252, 242, 237, 242, 245, 235, 214, 195, 184, 179, 172, 164, 160, 165, 180, 198, 212, 225, 237, 243, 232, 200, 159, 125, 107, 104, 110, 122, 138, 153, 163, 169, 172, 175, 181, 189, 200, 212, 225, 240, 251, 255, 246, 223, 188, 146, 107, 79, 64, 52, 36, 16, 0, -4, 2, 19, 41, 66, 92, 119, 144, 164, 177, 181, 181, 177, 172, 163, 153, 148, 148, 154, 162, 168, 169, 159, 139, 114, 89, 66, 46, 31, 25, 25, 31, 40, 52, 62, 66, 68, 77, 95, 114, 129, 144, 162, 180, 188, 179, 160, 145, 142, 151, 164, 180, 196, 209, 216, 216, 216, 221, 228, 235, 240, 250, 269, 292]
4275B92J8J1Lmj0j1pJJj1k4k9k2j0lj%JOJ1R%j1k0k6k4j6nPJ5J4J2RPRRLrk2k5j6lKLMJ5K6
4256A79K9J9Noj3k0k9l0j8%J3J8J6J2OmrlJ0J8J6J1O%j0k0k4k1j4%J8L0K7J4Kkklpj3k1l2
4240A48l6l0j2J0K6K9J8kk0k7k0mJ2J5OlnJNM%lqj5j7qPJ7J7J3J0RRJ3K2K8K5J4%j0j2qMJ5
4222B37J8Rj1k9l8l5k4j5oQJ7J6Mn%J3J9J7Poj7k3k1j3nMJ2J6J5ROJ1J8J8J0NRJ8K2J7J2R
4205C28Plj9k8k4j2npj1o%LklNJ1J1L%%%jMJ1J3Nmolj0k1k6j5LJ0Jj6k7k4j1LJ3J6J4J3J4
4187B04J3Noj2qKQOjnml%KOPQNlj6k8l1k3j6j7k0j9rLJ3J3QK%LPQMlookJNJ0J6K3K2J3nj5
4166A59j7rnoj0qJRJ5J6J5J5R%j5k6k6j5kPJ4K0J9J3LJLOMJJmj3k1k1j1jKlooKRJ3J3J0NJ
4147A61oqj1j2j5j5nQJ4J2PMML%jkpj0j0lNJ5J8J7J4J3J6K1K4K4K1Qj0k9l5k7j3lMPRNmro
$$ y = [292, 310, 321, 324, 320, 310, 299, 292, 293, 294, 283, 259, 230, 208, 198, 195, 194, 194, 195, 201, 212, 221, 221, 210, 190, 164, 140, 124, 119, 126, 141, 155, 167, 176, 183, 192, 201, 204, 195, 173, 148, 132, 129, 131, 134, 138, 153, 179, 208, 227, 232, 226, 213, 193, 164, 134, 116, 116, 129, 147, 163, 175, 181, 177, 168, 165, 175, 193, 209, 220, 226, 226, 216, 196, 172, 151, 137, 137, 155, 185, 212, 226, 228, 226, 224, 221, 214, 201, 180, 148, 112, 82, 70, 80, 106, 135, 153, 151, 131, 104, 84, 80, 92, 107, 113, 110, 105, 106, 111, 115, 115, 112, 104, 89, 72, 64, 71, 88, 105, 118, 128, 137, 146, 159, 181, 209, 234, 248, 248, 238, 226, 218, 222, 237, 255, 264, 253, 224, 186, 151, 127, 112, 106, 114, 131, 147, 151, 146, 146, 159, 178, 195, 202, 196, 179, 156, 135, 122, 117, 121, 133, 149, 164, 173, 179, 190, 208, 226, 236, 241, 250, 268, 290, 307, 319, 328, 335, 332, 313, 285, 261, 249, 244, 237, 226, 220, 220, 223, 221, 218, 223, 234, 245, 248, 248, 248, 248, 247, 251, 262, 275, 280, 276, 270, 267, 257, 236, 210, 195, 198, 208, 209, 193, 166, 142, 131, 134, 147, 163, 177, 190, 204, 217, 222, 216, 204, 196, 198, 206, 212, 211, 206, 202, 199, 199, 201, 207, 214, 222, 227, 224, 208, 180, 149, 126, 110, 93, 73, 54, 45, 48, 61, 74, 82, 84, 84, 87, 94, 102, 106, 103, 97, 91, 89, 90, 95, 105, 121, 144, 166, 179, 174, 159, 142, 133, 128, 122, 112, 104, 105, 114, 129, 145, 160, 175, 184, 184, 169, 143, 117, 102, 100, 107, 121, 141, 160, 173, 176, 177, 180, 186, 190, 191, 192, 188, 175, 154, 133, 122, 121, 123, 120, 114, 108, 110, 119, 132, 145, 155, 160, 161, 155, 147, 136, 124, 109, 94, 89, 97, 111, 123, 130, 134, 138, 141, 141, 140, 138, 131, 121, 111, 108, 113, 128, 146, 163, 177, 190, 206, 227, 251, 275, 296, 304, 294, 265, 230, 203, 190, 187, 191, 198, 207, 212, 208, 199, 193]
4128A93KPLpk0l2l5k4lJ1J3OOJ1J6J6J1KnkJ4L3L8K4Jj5k2l1m0m5m1k7oK1M3N1L8J9%j7k6
4112A81j8%J7J7Plk%jkKJ1J5J0kj6k8l6l7l1j7kPJ0PjqpkMLj%%mroRK3K7K5K1K1J8J3J0Pj
4093B31j2k1k5k7k5j6JJ5J8J2Nlj0j0jJ2K0K1J9K1K4K1J2Jpj3k0k4k4j4%J0J1QONM%npnkM
4075B10J0J2Nrk0k2j5rpomKPJ3J6J5Poj2j1rqj1j2qkLLmrnNJ6K3K7K4Rrk1k0j7k2k9k7j2R
4057G0K1K3K1K0K1J4nk7l9l2j9j1rjJ4K6K7K1J2O%lLJ3K5L4L5K2KpkNLmlOJ2Ooj7k5k8l2l7
4039A55l8l1rK0M3M6L4K1J4ROMPJ1J0Kj0j7j5j2j6k4k8k5j6pJJ0J2J0OPQQNMPQLqj7k4k7k4
4022A23j5mOJ2J5J8J9K0J8J4Rnk5m2m5l4j5MJ9K6K0JrkK0K9K1Mnlmj1k0j8pOJ0Mmj1j6j7j3
4004I3%RRMOJ6K3K3J2Jpqolmopqq%J1K1K5K7K7J9Lj5j9j2kKNPOjqj4j6j9j7nRJ9K5K7K1Nj2
$$ y = [193, 195, 202, 205, 198, 178, 146, 111, 87, 84, 95, 108, 114, 120, 131, 147, 163, 174, 176, 171, 169, 183, 216, 254, 278, 279, 264, 242, 211, 171, 126, 85, 58, 52, 73, 116, 167, 205, 224, 224, 207, 181, 163, 163, 180, 197, 204, 201, 199, 199, 198, 196, 198, 209, 224, 234, 232, 216, 188, 152, 115, 84, 67, 65, 72, 82, 89, 88, 80, 73, 71, 75, 78, 77, 77, 77, 73, 64, 58, 67, 90, 117, 142, 163, 184, 202, 215, 225, 232, 231, 219, 198, 173, 146, 121, 105, 106, 121, 139, 151, 156, 153, 143, 133, 132, 144, 164, 185, 204, 225, 249, 270, 282, 283, 276, 263, 243, 219, 195, 181, 181, 191, 202, 210, 216, 221, 225, 225, 220, 213, 208, 206, 210, 220, 232, 237, 228, 208, 186, 171, 162, 155, 149, 145, 147, 154, 167, 183, 198, 205, 199, 187, 176, 167, 159, 148, 136, 128, 126, 129, 132, 128, 119, 114, 119, 135, 158, 185, 209, 218, 209, 188, 168, 151, 129, 100, 73, 61, 70, 91, 114, 135, 155, 176, 190, 185, 158, 119, 87, 68, 57, 48, 47, 61, 87, 114, 135, 147, 153, 153, 150, 153, 166, 191, 225, 260, 282, 284, 277, 275, 280, 283, 279, 276, 282, 294, 300, 294, 277, 252, 224, 192, 155, 117, 86, 77, 97, 140, 186, 220, 241, 255, 264, 270, 274, 281, 292, 302, 304, 294, 277, 262, 250, 234, 210, 182, 157, 141, 134, 135, 145, 157, 167, 173, 180, 188, 196, 201, 205, 212, 220, 223, 215, 198, 174, 147, 123, 108, 104, 110, 122, 137, 155, 174, 194, 212, 226, 235, 230, 205, 163, 118, 84, 69, 73, 92, 118, 138, 139, 130, 128, 148, 177, 198, 202, 197, 194, 190, 179, 159, 141, 134, 140, 150, 154, 150, 139, 123, 106, 93, 93, 102, 111, 115, 121, 137, 160, 183, 195, 196, 189, 181, 175, 172, 168, 162, 155, 147, 139, 139, 150, 171, 196, 223, 250, 269, 272, 257, 238, 226, 224, 226, 231, 238, 244, 243, 235, 221, 205, 186, 169, 164, 173, 192, 217, 244, 265, 270, 258]
3985B58k4k7k8k6k2j5mRK2L3L3K6J4Kj0j9j9j4j0rj1j6k3k9l1k3j0NJ6K2J9J4J4J9K1J7J1
3970A85Llj1j5j2jJ2J9J7Q%ljjj1k2k4j4kOMJJKMMNJ1J9K4J8Kj9l7m2l7k6j5lJ1K4K9K4J0
3952A44oj5j6oRJ6Roj5qQK2J9Kj5k3k3j7rJJ5K1J6%j7k6k3rQK3L4L9L2Rk0m1m5l7k5j2NJ9
3935C7K4K3J7J2J0J4K1K0Oj4k3k0j4j3j3rKJ2J4J2J0J2J6J6Rjj3k2k7k7k0j0%MQJ2J9K0J7
3920A41J1J2J6J2mj9j4RL0L3J7nj7k0j6qmjj%%jmojRK0K4J8NjJMNOJ2J8J4Kpqorj2j3r%OM
3900B43pj4j2%RJ3J2Opj6j2MJ2Ojmnj4k4k1mJ3K4K5J8Mj2j6nJ3K6L1K1%k0l2l5l0k2j0%%l
3883A54kLQOLJjnqrpkOJ3J5J0LNJ2J9K0J6PLKjrk3l1k9k0j0kOJ0Moj2qMJ8K7L0K5J6Jj5k4
3863B23k7k8l6m2l4j2J1K3K6K3J6Nnj4j9k2k0j4oLJ7L0L2K1Kqrpj0j1j0lPJ6K2K0J4Q%qj5
$$ y = [258, 234, 207, 179, 153, 131, 116, 112, 121, 143, 176, 209, 235, 249, 251, 241, 222, 203, 189, 179, 170, 159, 143, 120, 91, 60, 37, 27, 32, 48, 70, 89, 103, 117, 136, 157, 174, 185, 188, 185, 174, 159, 147, 146, 158, 177, 194, 202, 202, 199, 198, 197, 186, 164, 140, 126, 124, 130, 134, 135, 136, 138, 142, 146, 151, 162, 181, 205, 223, 225, 206, 169, 127, 90, 64, 49, 46, 57, 81, 110, 134, 144, 138, 123, 107, 101, 110, 126, 135, 129, 114, 106, 114, 136, 155, 157, 142, 119, 96, 79, 70, 71, 86, 107, 123, 123, 106, 80, 57, 48, 56, 79, 113, 152, 184, 193, 173, 132, 87, 50, 25, 13, 18, 37, 61, 84, 101, 113, 123, 137, 158, 178, 184, 170, 147, 127, 113, 100, 87, 78, 80, 92, 106, 118, 128, 140, 156, 172, 181, 180, 167, 145, 118, 91, 71, 61, 61, 65, 73, 85, 104, 124, 141, 152, 164, 180, 192, 188, 169, 155, 164, 194, 227, 244, 239, 222, 202, 186, 178, 174, 173, 172, 172, 172, 171, 167, 161, 160, 169, 189, 213, 231, 236, 235, 236, 240, 245, 251, 263, 281, 295, 297, 290, 282, 276, 267, 255, 242, 233, 233, 239, 243, 236, 222, 210, 210, 219, 232, 244, 250, 243, 227, 215, 219, 231, 237, 236, 232, 227, 213, 189, 168, 164, 177, 201, 226, 244, 248, 236, 220, 215, 228, 254, 285, 306, 306, 286, 254, 219, 189, 167, 157, 157, 157, 154, 152, 155, 163, 169, 172, 173, 172, 167, 159, 150, 143, 141, 147, 160, 175, 185, 188, 193, 205, 224, 244, 260, 267, 270, 272, 271, 262, 239, 208, 179, 159, 149, 147, 153, 163, 167, 161, 149, 141, 145, 163, 190, 220, 245, 261, 262, 247, 223, 196, 168, 132, 90, 56, 44, 55, 78, 104, 127, 143, 148, 143, 129, 110, 88, 68, 54, 48, 51, 68, 98, 130, 151, 153, 145, 136, 129, 119, 108, 98, 95, 102, 118, 140, 160, 174, 182, 182, 174, 159]
3847A59k0k1k2j7qLPKmkMJ3K0K0J5Krj5j5j4j3rooqj1qkOROMMON%koj0j3pPJ9K3J9J0M%%K
3827A21kqpOK0J9J0NJ1K3L2L2K8K2J6Rok4l9m1k9j6j0j0j2ro%MM%klmoqj2j3j2kJ0J4Ol%J4
3808A22K6K8J8Oqj6j5kJ4J9Rj0k0j6kRJ1PNRJ5J6J6J2Omj2j4j1rj0qkNQLj%QJ8K1J5Lj1j7
3790B41j5rjLQJ3J7J7J2N%%knqpJMlj4j9j4kOJ1J3J2Pok2l7m4l9k0lRJ5K1K7K0%j8k2j5mL
3772A36J1J9K0J1%oqqqlOJ6K1J9J5J0QOQMlj6j8oJ1J7QmjJ2K3K4J8Rlj2j8k2k8l5l8l4k7j7
3754A17%K1K9J9MkKRJ8K8L5K7Prj7j6j5j2j3j8k1j8oOJ2J6K3K9K4J3JkJJ1K3L0L0K1Rlj5k3
3737C75k4k2j9j7j7j6j7j7j4oNJ1J3J0NJKMJqj5qPJ9K1J2JopKJ5K1J8Plqj2j6k0k1k2k0j5
3720B00qqj5k7l5k6oJ3J8Lj8l2l3k7j9nJ0J8K0J0lj6k0j3JJ7K6L4M1M6M7M6M2L2J3j0k4k4
$$ y = [159, 139, 118, 96, 79, 71, 74, 81, 83, 79, 77, 81, 94, 114, 134, 149, 151, 142, 127, 112, 98, 85, 76, 70, 64, 56, 45, 37, 35, 41, 50, 56, 60, 64, 70, 75, 75, 73, 67, 57, 44, 37, 44, 63, 86, 105, 115, 119, 119, 119, 121, 119, 111, 104, 110, 130, 149, 159, 164, 175, 198, 230, 262, 290, 312, 328, 337, 331, 307, 268, 227, 198, 182, 172, 162, 150, 141, 135, 135, 139, 143, 143, 141, 138, 134, 128, 120, 108, 95, 83, 81, 91, 105, 111, 108, 108, 122, 148, 176, 194, 200, 192, 176, 161, 159, 173, 192, 201, 191, 171, 155, 153, 162, 173, 180, 185, 194, 209, 225, 241, 253, 259, 255, 243, 229, 218, 209, 199, 191, 189, 194, 202, 205, 204, 204, 212, 230, 251, 266, 269, 258, 241, 226, 217, 216, 219, 227, 240, 257, 274, 286, 291, 291, 291, 289, 284, 276, 269, 270, 274, 271, 257, 238, 224, 222, 228, 239, 252, 264, 271, 265, 243, 206, 162, 123, 103, 100, 109, 124, 145, 172, 192, 192, 174, 152, 137, 133, 136, 147, 166, 186, 197, 197, 191, 183, 175, 167, 164, 170, 186, 207, 226, 241, 251, 259, 265, 273, 277, 274, 258, 240, 234, 245, 262, 270, 266, 265, 277, 300, 324, 342, 351, 348, 336, 318, 296, 268, 233, 195, 161, 134, 117, 117, 138, 167, 186, 190, 188, 190, 199, 217, 245, 280, 307, 314, 305, 288, 272, 257, 245, 232, 214, 193, 175, 169, 175, 187, 203, 226, 255, 279, 292, 293, 291, 292, 303, 326, 356, 386, 407, 416, 413, 398, 375, 351, 329, 310, 293, 276, 260, 243, 226, 212, 206, 211, 222, 235, 245, 250, 251, 253, 257, 258, 250, 235, 227, 234, 253, 274, 286, 287, 281, 274, 276, 291, 312, 330, 337, 334, 326, 314, 298, 278, 257, 235, 215, 200, 192, 184, 169, 142, 107, 81, 75, 88, 106, 109, 91, 59, 26, -1, -20, -25, -15, 3, 23, 33, 30, 14, -6, -19, -18, -1, 25, 59, 100, 146, 193, 239, 281, 313, 326, 316, 292, 268]
3705B68j6q%OJ0J4J9K0J7QJrk2l3l3j6KJ0Lj0j7k1j7j0kMPJ1J7K1K4K3J8J1jj2k1k3j9j1m
3688B09%MPROkooqj0j0lMJ0J3J6K1K4K6K1J1mk3l8m7m2k3KK0K3K1J5Rkj7l2l9l3j8lL%mnn
3670I4pqnkoj7k2j4MJ8K0J3PPRRKj0k3k8k3mJ7L3M2M8M7M0K5RKklnnqj2j8k0j6j0rpokLMm
3651A57j8k9k9j6%J6K5K8J9O%JNjj1j5rLNkj3k2k4k0j0LJ2J8J9K1K2J2pj9j3MJ5J4PM%rk0
3634A29k6j9nJ1K2K5K2K0J6J0lj3j8j6oOJ8K2J5jj6k0j3%POjorj3j8k0j0NJ9L1M1M3K7mk8
3617B30l6k6j5j3j4j5j1qpnjRJ5J4QRJ6K3J9Nj0j5j1lOJ1J1ROJkljLRJ1J0QJ0J7K2J4kj7k1
3599B60k1k3k4k5k1k0k5k6j3J0K7L0K1J3RNqk3l0k2j0jPK2L7L6J7kj1j1j3j5j3mOP%rj5rK
3583A15J1Oqj6qNJ0Mnj1j2oKJ2J4QJLJ4K3K5J8Qjj0j6j8j6j4j8k4k5j9rnlKNMKMJ4J8J7J3
$$ y = [268, 252, 244, 244, 250, 260, 274, 293, 313, 330, 338, 339, 330, 308, 275, 242, 226, 228, 238, 241, 231, 214, 193, 176, 166, 164, 168, 175, 186, 203, 224, 248, 271, 289, 300, 299, 287, 266, 243, 224, 213, 209, 209, 213, 220, 229, 235, 233, 227, 221, 213, 203, 193, 190, 194, 204, 217, 233, 254, 278, 304, 325, 336, 332, 309, 271, 224, 182, 159, 161, 181, 204, 225, 240, 249, 247, 230, 198, 159, 126, 108, 105, 108, 108, 104, 99, 94, 87, 79, 74, 72, 66, 49, 27, 13, 17, 35, 55, 68, 75, 82, 91, 100, 102, 92, 69, 41, 18, 14, 31, 64, 106, 154, 201, 241, 266, 275, 277, 275, 272, 267, 262, 254, 242, 224, 204, 188, 178, 169, 162, 156, 154, 157, 161, 157, 139, 110, 81, 65, 65, 81, 106, 134, 153, 159, 159, 160, 165, 164, 153, 138, 129, 132, 137, 135, 122, 100, 76, 56, 46, 49, 61, 79, 98, 119, 141, 153, 146, 127, 114, 118, 133, 147, 154, 158, 158, 149, 129, 103, 84, 79, 90, 112, 137, 159, 179, 195, 205, 202, 189, 171, 155, 149, 155, 173, 195, 210, 209, 193, 173, 160, 160, 167, 173, 172, 166, 157, 144, 126, 106, 96, 101, 120, 151, 192, 235, 262, 258, 230, 194, 168, 153, 140, 126, 111, 100, 92, 85, 80, 79, 88, 103, 117, 125, 134, 150, 173, 192, 197, 187, 172, 161, 158, 164, 175, 186, 195, 201, 202, 200, 197, 196, 199, 208, 219, 229, 237, 247, 264, 286, 300, 298, 281, 260, 239, 216, 192, 167, 146, 126, 101, 75, 62, 72, 99, 129, 150, 163, 172, 177, 169, 146, 116, 94, 84, 83, 90, 112, 149, 185, 202, 200, 189, 178, 165, 150, 137, 133, 139, 146, 146, 137, 122, 113, 115, 126, 132, 124, 108, 100, 105, 115, 119, 114, 103, 91, 85, 87, 99, 113, 121, 122, 125, 139, 162, 187, 205, 213, 212, 202, 186, 168, 152, 138, 120, 96, 71, 52, 43, 38, 35, 37, 42, 46, 48, 52, 66, 84, 101, 114]
3565A14J2J2NmlOJ3J0MMJ0J4J2QMKnj7k8l2k3oRJ9K0J3QJ2K2K6K0Oorj0j4j9k3k2j5p%NLk
3546A48onKJ1J3QJjKONLMPN%onKJ1K0K7K4Qj3k4j4JJ1OKJKJkj%mj3j8j8j0mlrj3j2oljklk
3525A33%NJ1J4J2Okj0j5j5j0pj1j9j5%J9L2L8M1L9L1J7J1J4K0K2J7Plrj2j5j8k2k0j6j2j1
3510B47j1q%O%j1j9j5mM%qj0j1j5j8j3JJ4K0J6Opk0k8k7j6mQJ8K2K0J0oj8j9j1%KnpkRJ4J4
3491A18Pjoqonj0j7j8j1nklmkKOQKorjRJ7K0K1J9J9K2K8K1Kj9k0JK5L4K4Prj7k1j9j8j6rM
3473A54J5J9J6J1QPQJ0J1J2J1J1J0Nlj3k1k6l0k8k2j6j2j1oJQJ1J0Npk0k7k2j1%ORP%j2k0
3456E8j8qLRRJ3K3L1K9J8LnpkNJ3J5Oqj3j0mnmjKjj0j7j3kJ1J8J7J0NQJ5J8J2MJKnj9l0k7
3437A49j5lRK2L2K8J6OQRMnqonrj1rrj1j2qoj0j9k5k6k4k1j0KJ1OjlKJ1J7K3K6K2J5J1J3J2
$$ y = [114, 126, 138, 143, 139, 136, 142, 155, 165, 169, 173, 183, 197, 209, 217, 221, 223, 218, 201, 173, 141, 118, 112, 121, 140, 160, 173, 181, 193, 215, 241, 261, 267, 261, 252, 242, 228, 209, 186, 164, 149, 142, 142, 147, 150, 148, 142, 137, 139, 150, 163, 171, 172, 171, 173, 179, 184, 187, 191, 198, 203, 203, 197, 192, 194, 205, 225, 252, 276, 284, 271, 247, 233, 234, 245, 251, 253, 254, 256, 257, 255, 254, 254, 250, 237, 219, 201, 191, 187, 184, 175, 162, 150, 144, 141, 140, 138, 135, 133, 133, 138, 149, 163, 175, 181, 179, 169, 154, 139, 129, 122, 111, 92, 77, 77, 96, 128, 166, 207, 246, 277, 294, 305, 319, 339, 361, 378, 385, 382, 373, 361, 346, 328, 306, 286, 270, 258, 247, 236, 228, 228, 234, 234, 223, 204, 189, 185, 189, 189, 181, 171, 160, 145, 127, 114, 115, 129, 149, 165, 171, 164, 144, 116, 89, 73, 69, 77, 95, 117, 137, 147, 141, 123, 104, 93, 93, 95, 90, 83, 81, 90, 104, 118, 125, 124, 118, 110, 104, 99, 89, 72, 54, 43, 38, 36, 33, 29, 27, 29, 35, 43, 45, 39, 30, 29, 38, 55, 75, 96, 115, 134, 156, 184, 205, 207, 188, 168, 169, 194, 228, 252, 259, 250, 233, 212, 193, 175, 159, 150, 154, 169, 188, 204, 215, 223, 230, 238, 248, 259, 271, 282, 293, 303, 308, 305, 292, 271, 245, 215, 187, 165, 149, 137, 126, 120, 121, 129, 140, 150, 155, 148, 128, 101, 79, 68, 68, 74, 83, 90, 90, 78, 58, 40, 32, 35, 44, 53, 66, 89, 120, 149, 167, 170, 165, 158, 156, 161, 174, 189, 195, 187, 174, 164, 160, 155, 151, 150, 152, 151, 141, 124, 111, 109, 120, 138, 155, 165, 170, 178, 193, 211, 223, 227, 228, 230, 225, 206, 176, 149, 134, 131, 140, 162, 194, 222, 238, 244, 252, 261, 265, 260, 252, 246, 241, 232, 221, 212, 203, 192, 180, 172, 166, 156, 137, 112, 86, 62, 41, 31, 33, 44, 50, 49, 46, 48, 59, 76, 99, 125, 147, 162, 173, 186, 198]
3419A98RKmj0j7j9j2kkmlLMoj2pNJ0J2J4J3Mrj2%J9L2L5K9J1rk0k1j8j6j1ljrj8j6kPRMlo
3400A48nKMjrj3j0n%OJ1J0OLNOOQJ7K6L3L1K5J5QPLj1l2m3l4j3MJ2J1OMNROmj6j9j6j3j3p
3381A73JRRNkj2k2k5k0j0ljJJ0K5L7M1L5K6J6J0Lnj1j6j6j1j1j7k8l5l8l6k8j5JJ3J6J3J0
3365I2%qj2rmqj7j8pJ3K8L4K9K0Pnj3j5oJ0J7J0oj1mOOkj0j3mQJ5Rnj0kJ4J9J2jj3j7qJ1L4
3347A66M5M6L5J9Krj1nJOJ1J1Nnj2j2qnoqommmkJJnqj0j3j7j8rNJ4J1Krj1pRK4K7J5Jpj4l0
3327A98m5m5l0j1jMPPRJ2J5J8J9K1J9Qrj6j2qj3k2j6lOKnqmOJ8L3M2M0K5Nj2j7nJ6K9K4Nj7
3309B89l3m1l8k8j5qmlJLJ%%KMJ0K0K7K1RLJkooKRJj7l4l9k9j3%Lkn%J3K5L4L1J9Jj0q%%o
3289A82pkQQNkopplmnkQK1K7K1Rkomkklkj%KOJ4K0J7Qmj3k1k1j4njlnnpj7l0l7l7l3k9j7j
$$ y = [198, 207, 209, 205, 195, 178, 159, 147, 145, 143, 139, 136, 139, 143, 137, 125, 118, 123, 133, 145, 159, 172, 176, 167, 155, 155, 174, 206, 241, 270, 281, 272, 252, 231, 213, 197, 186, 183, 182, 173, 155, 139, 137, 144, 153, 157, 154, 148, 143, 145, 149, 148, 139, 126, 116, 111, 111, 117, 128, 138, 144, 147, 152, 158, 164, 172, 189, 215, 248, 279, 304, 319, 327, 334, 337, 326, 294, 251, 217, 204, 208, 220, 231, 237, 241, 246, 255, 261, 257, 241, 222, 206, 193, 180, 173, 174, 183, 192, 197, 195, 183, 161, 136, 116, 106, 103, 102, 103, 113, 138, 175, 216, 251, 277, 293, 303, 306, 301, 290, 274, 258, 247, 236, 219, 191, 156, 118, 82, 54, 39, 40, 53, 69, 82, 92, 92, 84, 72, 63, 59, 51, 34, 16, 9, 22, 50, 84, 113, 133, 140, 135, 122, 107, 101, 111, 128, 138, 132, 121, 117, 123, 129, 127, 117, 104, 100, 108, 123, 132, 127, 117, 115, 129, 148, 160, 159, 146, 129, 121, 132, 166, 211, 257, 292, 311, 313, 304, 293, 288, 289, 295, 306, 317, 322, 317, 305, 293, 285, 280, 274, 266, 260, 256, 252, 248, 246, 247, 248, 243, 235, 225, 212, 195, 177, 168, 173, 187, 198, 200, 191, 180, 173, 182, 206, 233, 248, 249, 242, 228, 198, 153, 108, 78, 67, 66, 70, 77, 84, 93, 105, 120, 138, 157, 178, 197, 205, 196, 180, 168, 160, 147, 125, 109, 106, 112, 114, 109, 101, 97, 103, 121, 154, 196, 236, 261, 266, 254, 237, 232, 248, 277, 301, 306, 289, 256, 215, 177, 149, 134, 126, 122, 119, 120, 123, 124, 124, 124, 126, 130, 140, 160, 187, 208, 217, 220, 221, 219, 213, 207, 209, 218, 219, 202, 168, 129, 100, 87, 87, 90, 88, 83, 83, 96, 121, 155, 186, 205, 206, 196, 188, 188, 188, 182, 175, 173, 181, 189, 194, 192, 186, 179, 172, 169, 165, 160, 158, 166, 187, 214, 235, 244, 242, 236, 232, 230, 228, 225, 223, 222, 222, 224, 230, 244, 264, 281, 289, 285, 272, 251, 230, 216, 211, 210, 207, 202, 197, 190, 173, 143, 106, 69, 36, 7, -10, -11]
3269a1J7L5M5M4L3J8Nkpj0j1j1j5j8j6rmmnKQMlmOJ8J5Kqj1mRK7M0L8K2mk2k8k7k1j6rLJ4
3251A25J6J0OOQJ0RJ3J8J6J1NLkj3k5l0k9k4k0k0k0j8j1mkmkRK5L8M7M4L1J4OPPmk2l3l1j9
3233A51lJ3J6Nj1j6rJMPJ1J2ROOOKjLN%pqkNQNjj5k4k1mJ2J9J7J3Pmj8k8k9k1rPJ9K8L0K6
3214B22J6Noj9l0l2k4j2jJKJjkJNNOJ2K1L0L1K8K4J4jj5j9j1kkrj8k4k3j6pljKJ1K1L1L6L5
3196B82K8J6Npk0l4l8k9j3KQKj0j7j2OK3K6K2J7J4Qqk5l3l2k6j8j3j3j0jJ3K2K0J0Kmj3k1
3180A29j6ML0M1K9Pj3j9j8j8j9j7j0KJ1J6J6J2NkjRJ9K4K1J6QJoj2j4j3j0jRJ4J0PNjj4k4
3163B17k0mJ5K1K3K3K5K3J4Mkpj3j6j9k2k2j4jJ0J4Ork3l1l1k2j2rpjRK0K4K1J4MkJRJ4J2
3146B36OMLLJKlj2j9j4jJ1J3J2J3J5J1jj6k4k4j5%J0Pknmoj6k3j2J0K7K8K0J1%j2k1j7lNO
$$ y = [-11, 6, 41, 86, 130, 163, 181, 186, 184, 177, 167, 156, 145, 130, 112, 96, 87, 83, 79, 74, 76, 84, 88, 85, 81, 87, 105, 120, 122, 114, 103, 99, 108, 135, 175, 213, 235, 231, 209, 181, 154, 133, 117, 108, 111, 125, 141, 151, 157, 163, 171, 181, 190, 203, 221, 237, 248, 253, 256, 254, 241, 216, 186, 157, 133, 113, 93, 73, 55, 44, 40, 38, 34, 32, 41, 66, 104, 151, 195, 226, 240, 246, 253, 260, 256, 234, 201, 170, 151, 148, 161, 177, 182, 171, 155, 146, 147, 151, 158, 169, 181, 190, 196, 202, 208, 210, 209, 212, 217, 217, 210, 202, 200, 205, 213, 218, 217, 202, 178, 157, 153, 165, 184, 201, 214, 221, 217, 199, 171, 142, 121, 112, 119, 138, 166, 196, 222, 238, 243, 237, 218, 188, 156, 132, 120, 119, 120, 122, 123, 122, 120, 121, 126, 131, 137, 149, 170, 200, 231, 259, 283, 297, 296, 281, 262, 251, 249, 247, 238, 220, 196, 173, 157, 150, 147, 146, 148, 159, 180, 211, 247, 282, 310, 326, 331, 324, 304, 270, 232, 203, 190, 192, 200, 202, 192, 175, 163, 169, 192, 218, 240, 257, 271, 279, 271, 246, 213, 181, 155, 137, 124, 111, 101, 100, 113, 135, 155, 165, 167, 163, 150, 129, 113, 117, 147, 188, 217, 224, 211, 192, 174, 156, 137, 120, 110, 112, 123, 139, 155, 167, 172, 170, 169, 178, 197, 221, 242, 258, 266, 267, 261, 249, 235, 222, 212, 211, 220, 234, 244, 251, 256, 255, 241, 217, 197, 193, 208, 229, 252, 275, 300, 323, 337, 341, 339, 332, 319, 303, 284, 262, 240, 226, 225, 235, 249, 255, 246, 223, 192, 161, 139, 127, 118, 111, 110, 119, 139, 163, 184, 198, 202, 200, 201, 210, 224, 236, 242, 246, 249, 252, 253, 255, 252, 240, 221, 207, 206, 217, 230, 242, 255, 270, 281, 280, 264, 240, 216, 201, 201, 211, 218, 216, 211, 207, 201, 185, 162, 150, 160, 187, 215, 235, 246, 246, 234, 213, 196, 193, 198, 204]
3128B04LMJmp%J0J2jk0l3l7l3k1pMNMJ0K4L6M0L6K5J3KlkJlj5l0m3m7l9k0jJ0J4J7K2K7K8
3111A86K1J2OLOJ0QPQJ2Nj1k5k5j9j3j2j6j7j4qMJ4K1K4K4J9PjkKJkoj0j6k2k2j3lMJ0K0K7
3094B04K8K3J3kj8k6j7jJ0Onj5k0k1j5p%Jnj4k1k1j0NJ6J7J2NKKPJ3J4Nmj1j1okMPJ0OLjk
3075A58JRJ7K4K8K3J7Omj7l0l7k9j3%Loj5k3k9k4j0QJ8K0K0K4K6J6LlMJ4K0J8J1Joj0j1j0
3059B12rolnj2j5j2mloj0j2j3j4j0jRJ1Lj0k3k5j6JJ6K5K1Rj0k1k0j1mlkRK6L6L9L4K8K0J5
3041B34J2J1QN%%jJJMONkj0j1okmj0rNK0K5J9J2RPNPPKrk1k7k9k9k1mJ7L1L2K2Oj5l8n2n0
3022A63l6j5LJ6K2J8Oj2k5k7j7rrj3j4j2oJQJ7K1K4K2J9J4Omj4k2k1j5qmlnnm%NMJ%PJ0Pk
3004I2mKMlrmRK3L3L3K3R%KPJ1J4J9J4%j8k9k5j6nLKnj6j9j8j8k1k1j3mJLNJ0J7K5K9K6J4
$$ y = [204, 207, 211, 212, 208, 201, 201, 211, 223, 222, 202, 169, 132, 99, 78, 71, 75, 80, 84, 94, 118, 154, 194, 230, 255, 268, 270, 267, 265, 266, 263, 248, 218, 175, 128, 89, 69, 68, 78, 92, 109, 131, 158, 186, 207, 219, 225, 228, 234, 244, 252, 259, 267, 279, 284, 273, 248, 223, 204, 191, 179, 163, 146, 132, 124, 128, 142, 163, 187, 211, 230, 237, 236, 234, 236, 237, 235, 229, 219, 203, 181, 159, 146, 143, 147, 157, 177, 204, 232, 255, 268, 266, 248, 222, 205, 204, 214, 220, 215, 200, 180, 159, 144, 137, 137, 138, 133, 119, 98, 77, 67, 72, 88, 105, 117, 122, 124, 126, 133, 146, 160, 165, 161, 150, 139, 133, 131, 135, 142, 152, 158, 161, 160, 158, 159, 168, 185, 209, 237, 260, 277, 283, 279, 262, 232, 195, 166, 153, 153, 156, 150, 135, 112, 83, 59, 49, 57, 75, 95, 115, 139, 165, 181, 184, 181, 185, 199, 219, 237, 248, 249, 243, 233, 222, 212, 203, 197, 194, 189, 177, 162, 150, 146, 143, 137, 127, 115, 102, 88, 78, 77, 86, 97, 100, 90, 67, 42, 26, 27, 43, 68, 89, 98, 88, 67, 47, 36, 32, 29, 27, 36, 62, 98, 137, 171, 199, 219, 234, 246, 257, 265, 270, 270, 270, 269, 270, 271, 275, 281, 286, 284, 274, 263, 257, 255, 251, 241, 232, 237, 257, 282, 301, 313, 322, 329, 334, 341, 348, 350, 341, 320, 293, 264, 235, 214, 210, 227, 258, 290, 312, 318, 303, 265, 213, 163, 127, 112, 115, 131, 153, 171, 177, 165, 140, 113, 96, 87, 78, 65, 51, 39, 33, 34, 42, 59, 80, 104, 126, 145, 159, 165, 161, 147, 125, 104, 89, 81, 77, 74, 69, 64, 60, 60, 65, 69, 70, 70, 77, 87, 94, 92, 88, 90, 94, 91, 82, 78, 87, 110, 143, 176, 199, 208, 208, 210, 217, 228, 242, 261, 275, 275, 257, 228, 203, 187, 182, 185, 187, 182, 166, 147, 129, 111, 90, 69, 56, 52, 53, 56, 61, 71, 88, 113, 142, 168, 182]
2986A82MKKmj1j2mL%rj4j7k1k5k3j3lLQJ4K1K4K4J7Qoj9k0j3KJ2J5Oqj9k0j2nqj4j9j7j1j
2968aNJ0J0QNOJ2J4J1PPJ6K8L5L8M0M0L0J2rk8m3n1m4k5jJ7K3J9J0KJMLjonlnpqj1j6j8j5
2950A16j3j3j1kJ0J7J7K1K3J6LppkjJNJ1J4J6J3QJjLN%qqkPJ5J7J1%nkM%nkJ0J2Kj3j6pJN
2931B59PNjomRJ9J3lj8k1rQJ8J4Krj2j2j2j1nLMmj0qjJpj1j2j0j0j0nJML%j%LQRLoj3j7k2
2910A23k2j6kJ0J6J7J2LnpMJ8K2J5JqpJNOLkj3k6k9j7LJ9K6K5J6Lj4k7l1k5j5nJKMJ0J8K1
2893A33J9J1%j3k2k2k0j9k4k5j8%K4M9O0N4L7K6K2J9J1Lklmrj4j6j4poj5k6k7j5jNNJpj2j3
2876A25mPJ1J1J1RLljRJ8J9J6J3J0Loj6j6lJ7K8K0jk2l3l6l5l3k7j6JJ7K6K5J7Q%nnMJ4J5
2859A95J0LLPPjqoMJ1Lj3k1j1PJ6J7K1K7K3Prj1jRJ2Mj1k3k7k2j7j8k3k5k3j8j5j6j4pQK2
$$ y = [182, 186, 188, 190, 186, 175, 163, 159, 162, 162, 153, 139, 122, 101, 76, 53, 40, 37, 40, 48, 62, 83, 107, 131, 148, 156, 150, 131, 111, 98, 100, 112, 127, 133, 125, 106, 86, 74, 69, 61, 47, 28, 11, 0, -1, 4, 14, 24, 32, 37, 43, 55, 69, 80, 87, 94, 110, 138, 173, 211, 251, 291, 321, 333, 324, 296, 253, 202, 158, 133, 132, 149, 172, 191, 201, 203, 204, 208, 211, 210, 204, 199, 196, 191, 184, 176, 165, 149, 131, 116, 103, 90, 79, 77, 87, 104, 121, 142, 165, 181, 184, 177, 170, 168, 167, 168, 173, 184, 198, 214, 227, 235, 236, 235, 238, 243, 243, 235, 227, 225, 232, 247, 264, 275, 275, 270, 268, 272, 272, 267, 265, 275, 287, 289, 276, 260, 253, 254, 259, 266, 271, 270, 264, 260, 269, 288, 301, 298, 280, 259, 250, 258, 276, 290, 292, 283, 271, 259, 247, 236, 231, 234, 238, 234, 224, 216, 215, 216, 209, 198, 186, 176, 166, 156, 151, 152, 156, 159, 159, 158, 158, 161, 169, 178, 181, 175, 162, 145, 123, 101, 85, 83, 93, 109, 126, 138, 141, 136, 129, 133, 151, 173, 188, 189, 181, 174, 175, 180, 186, 189, 187, 174, 148, 119, 102, 105, 124, 150, 175, 191, 194, 180, 153, 122, 97, 82, 77, 78, 80, 84, 94, 112, 133, 152, 163, 163, 150, 128, 106, 86, 67, 43, 18, 0, 0, 24, 73, 133, 187, 224, 250, 272, 291, 302, 305, 303, 300, 296, 287, 273, 257, 243, 236, 230, 215, 189, 162, 147, 146, 151, 156, 157, 150, 138, 125, 121, 128, 139, 150, 161, 170, 173, 170, 169, 178, 196, 215, 231, 244, 254, 257, 251, 235, 219, 216, 233, 261, 281, 280, 258, 225, 189, 154, 121, 94, 78, 79, 96, 122, 147, 164, 172, 172, 167, 162, 166, 180, 195, 205, 208, 211, 218, 225, 224, 216, 210, 214, 225, 228, 215, 194, 183, 190, 206, 223, 244, 271, 294, 301, 292, 281, 280, 289, 301, 305, 294, 271, 244, 222, 205, 187, 164, 139, 116, 98, 83, 67, 53, 46, 54, 76]
2841G6K5J6OLKoj6k2k1j2okk%%knoqj3k2k3pK0L8M6M3L3J5loMJ9K5K5K4K0Oj1k1k0j6j2mL
2823A83RJ0RMok2l2l1k2j3j0rq%J0K2K9K8J9PlpnloplMJ1J6J6QkrpjKKNRPmj4j2mOJ2J3OK
2803B09PJ7K5K0RkpqlOJ2Lj2k2k4j9j0%NKjKRJ2NmnmjMRO%po%LPJ1J6J3RPJ1J3QJpj0j1qm
2782B86mnkKLqk0k3j4lMOQJ0J0RPKj0k1k5k4k1k2j9j5j0rj1qopk0l0k8j2RJ9J5Pkmn%QJ6J4
2763D7J1J3J9K1J4Loj2j3rMK0K6K0J1JljOROkplJ0K6L5L0J2pj6j9k5l3l2j9NK1K3J3MLOMj1
2745B05k4k4oJ0Oj3k6k3pJ0J5Qoj4j1mJKRJ9K7K0J0MQJ5J8K2K6K4J3kj2k1k9l8l9k8rPJ7J9
2729A79K0J5ROON%qj5j9j7j4j1mPJ9K0Nj9l3l0j5%QPNQK0L2L0J2kj0j6k5l3k4kJ5K3K7K7K4
2711B32J2lj7k7k8j5LJ0%j6k7k9k8j9%K3L6L1J5jj1j5j2pnjLJ2K0K6L0L1K7J3lj5j8j6j2o
$$ y = [76, 101, 117, 123, 126, 128, 122, 106, 84, 63, 51, 45, 43, 41, 41, 41, 39, 34, 28, 20, 7, -15, -38, -45, -25, 13, 59, 102, 135, 150, 147, 141, 145, 164, 189, 214, 238, 258, 264, 253, 232, 212, 196, 184, 180, 183, 192, 202, 211, 215, 209, 187, 155, 124, 102, 89, 79, 70, 62, 62, 72, 94, 123, 151, 170, 177, 174, 167, 162, 159, 153, 146, 143, 147, 158, 174, 190, 198, 196, 187, 180, 179, 181, 183, 188, 197, 204, 200, 186, 174, 170, 176, 188, 201, 207, 209, 216, 233, 258, 278, 287, 285, 278, 270, 267, 273, 285, 288, 276, 254, 230, 211, 201, 201, 206, 208, 207, 209, 218, 230, 235, 231, 226, 222, 221, 225, 234, 240, 240, 233, 227, 227, 230, 237, 248, 264, 277, 286, 293, 304, 317, 325, 326, 319, 309, 298, 290, 286, 282, 277, 275, 277, 280, 272, 252, 229, 215, 212, 216, 222, 230, 240, 250, 259, 266, 268, 258, 237, 212, 188, 167, 145, 126, 111, 101, 92, 81, 73, 67, 60, 40, 10, -18, -30, -21, -2, 13, 20, 18, 14, 9, 9, 17, 33, 47, 58, 71, 90, 111, 125, 128, 122, 110, 97, 88, 92, 112, 138, 158, 169, 170, 167, 166, 172, 181, 187, 185, 178, 175, 185, 211, 246, 276, 288, 281, 265, 246, 221, 188, 156, 137, 142, 163, 186, 199, 203, 206, 212, 216, 205, 181, 157, 151, 161, 167, 154, 128, 105, 98, 108, 123, 131, 125, 111, 100, 96, 97, 99, 108, 127, 154, 174, 184, 188, 196, 211, 229, 251, 277, 301, 314, 312, 300, 279, 250, 212, 173, 145, 136, 143, 160, 179, 199, 214, 223, 229, 235, 240, 240, 232, 217, 198, 181, 167, 156, 152, 159, 178, 198, 203, 184, 151, 121, 106, 106, 114, 121, 126, 134, 154, 186, 216, 228, 226, 216, 200, 175, 142, 118, 116, 131, 154, 181, 208, 232, 244, 241, 224, 197, 169, 154, 157, 167, 167, 151, 124, 95, 67, 48, 48, 71, 107, 138, 153, 152, 141, 126, 114, 107, 102, 101, 104, 116, 136, 162, 192, 223, 250, 263, 260, 245, 227, 211, 199, 193]
2695A93%Jmj1j1oMRJ0Mkj2j7j6mJ0K0K3K0J1ok3l5l4j9LK5L5K8J2lqlJKJlnpqnkjkmj2k3l4
2676I2l3k1oPJ6K2J9Pqj9k4k3k1j1%PJ5K4M1N2M9L3J6Ojqj3j6j9k3j8kJ9L2K9J6Nmj0j8k4
2659A85k3j2NK0K4J3pk3k3j1LQOLLLlj3j1JJ6J9J0kj2j9k7k7j6%J4K6L6M2L9K7J1jj1k3l5
2643B15l6k7j0RK5K9K1Kj6k5k5j6oMQPPRJ1Mqj4j3j1j0rpnjLMMJjkj%kj1j9k1j5qprqjPPP
2623D0J5K3K8K7K0J0lj2j4j0rqlJ1K1J9Nrj7j8j5pKJ4K5L7M1L6K6J3Nmrj4k1k9l4l1k5k2k1
2606H3j4%J6K4K2J6J0PNJjnorrkNJ0ROJnqmOJ3Qnj5j8j7j5j1omlPK4L4K6Qno%MPOJoj4j6q
2586A47PK1L2L7L8L5K2Kj6j9j3omorj1j0nLPOlj6k5k7j5%Npk4l5l0j7kNJ1J7K2K3J5Kj2j7
2568A28j9j4rlJMQJ1Nnj4j6j1oKJ0J0kk2l3k1KJ7J7OkjQQJp%K1M2M8L9K5J2Lknopj1j5j3n
$$ y = [193, 193, 194, 190, 179, 168, 162, 166, 175, 185, 189, 187, 175, 158, 142, 138, 148, 168, 191, 211, 222, 216, 193, 158, 124, 105, 108, 133, 168, 196, 208, 205, 197, 194, 195, 197, 198, 195, 190, 183, 175, 170, 168, 167, 165, 161, 149, 126, 92, 59, 38, 32, 39, 55, 77, 96, 103, 95, 76, 52, 29, 8, -3, -3, 4, 19, 43, 84, 136, 185, 218, 234, 240, 239, 231, 218, 202, 183, 160, 142, 140, 159, 191, 220, 236, 241, 237, 227, 209, 185, 162, 150, 155, 175, 199, 212, 205, 182, 159, 148, 151, 159, 165, 168, 171, 174, 171, 158, 147, 148, 164, 183, 193, 191, 179, 160, 133, 106, 90, 90, 104, 130, 166, 208, 247, 274, 285, 284, 273, 250, 215, 179, 152, 142, 151, 176, 205, 226, 228, 212, 187, 162, 146, 140, 144, 152, 159, 166, 175, 186, 190, 182, 168, 155, 144, 134, 125, 118, 113, 112, 115, 119, 123, 124, 123, 121, 120, 120, 118, 107, 88, 67, 52, 44, 37, 28, 20, 19, 26, 33, 40, 55, 78, 106, 133, 153, 163, 160, 148, 134, 124, 115, 107, 104, 115, 136, 155, 160, 151, 134, 116, 101, 94, 96, 110, 135, 172, 213, 249, 275, 288, 293, 289, 280, 266, 245, 216, 182, 151, 126, 104, 83, 69, 69, 85, 109, 131, 147, 157, 164, 169, 170, 169, 164, 158, 149, 140, 138, 143, 153, 162, 168, 169, 164, 156, 152, 158, 171, 179, 174, 159, 141, 124, 109, 98, 92, 88, 85, 92, 116, 150, 176, 184, 179, 173, 173, 177, 184, 190, 191, 185, 171, 155, 147, 154, 175, 207, 244, 282, 317, 339, 341, 325, 306, 293, 287, 283, 277, 268, 257, 247, 242, 245, 252, 258, 255, 239, 214, 187, 172, 172, 177, 170, 146, 111, 81, 64, 62, 67, 78, 95, 117, 140, 155, 157, 145, 128, 109, 95, 86, 83, 84, 88, 96, 107, 112, 107, 93, 77, 66, 60, 62, 72, 82, 80, 58, 25, 4, 6, 23, 40, 46, 44, 43, 51, 59, 60, 53, 53, 74, 116, 164, 203, 228, 240, 243, 241, 236, 230, 223, 212, 197, 184, 179]
2549A79LJj5l7m8m6k8qPJ5K1K5K5J5kj6k2j8j2kRJ7J8J2RJ1J5J7J7J4Mj0k0j3JJ2J5J6J7J5
2533B13OmmjJjkjmpnJQJ1J0OKmj2k1k5k5j7o%%LJ3K4K8J8Krj3nOJ8K0J6J3J9K3J8mk7l9l6
2514B07k7j8j4j5j8k0j4nMMMPJ4J6Ppk1k7k7k1j5j1mOK3L0K9K5K7K8J9kk4l6l2j6MK2K6J8
2498A46QKmj2j7j9k1k2k0j3jNRQMjpqkOJ5K3K4J9J0KjkJKlj5k3j9qJNJ1K1K8K8K4K2K1K0J6
2480B63Onj4j6j4j2j4j8j2mkrj6j5nKNMORRQQOJnkNJ1J0RJ5J9J3lj6j5pk%KJ%JQJ1Ojoj3k3
2459A89k8j8KK0K4K1J6J1PORJ0OKoj9l0k9qJ8L7L8L2J8Kj1j5j7k4l3l4k2jK2L8M1K7Nj2j6
2443B78j0omj0j7k1j2JJ0J2J5K6L3L2K6K0J3OJJ%qj6j4qqj4j2ppj4j8oPRMMNKrj9j9j3rpr
2425B08k0l5m2l5k1j3j7j3J1M3N9M8J9oj9k5k5k0kJ8L5L8K8J2kj1j2qLJ5K1J3kj0mNNlpmL
$$ y = [179, 182, 183, 168, 131, 83, 37, 9, 1, 8, 23, 44, 69, 94, 109, 107, 91, 69, 51, 39, 37, 46, 63, 81, 93, 102, 113, 128, 145, 162, 176, 180, 170, 150, 137, 138, 150, 165, 181, 198, 213, 219, 215, 211, 210, 211, 210, 208, 207, 203, 196, 191, 192, 200, 211, 221, 227, 229, 225, 213, 192, 167, 142, 125, 119, 119, 119, 122, 135, 159, 187, 205, 207, 198, 185, 180, 186, 204, 224, 240, 253, 272, 295, 313, 309, 282, 243, 207, 180, 162, 148, 133, 115, 95, 81, 76, 80, 84, 88, 95, 109, 125, 132, 125, 104, 77, 50, 29, 14, 3, -1, 5, 28, 58, 87, 112, 139, 167, 186, 184, 160, 124, 92, 76, 80, 102, 128, 146, 154, 156, 152, 140, 123, 104, 83, 61, 41, 28, 27, 32, 41, 49, 53, 52, 45, 37, 35, 41, 56, 79, 103, 122, 132, 134, 133, 131, 132, 134, 131, 116, 93, 74, 66, 67, 72, 83, 104, 132, 160, 184, 206, 227, 247, 263, 269, 264, 250, 234, 220, 208, 194, 176, 164, 160, 158, 149, 133, 118, 113, 115, 120, 124, 130, 139, 148, 156, 164, 170, 171, 166, 164, 169, 180, 190, 199, 214, 233, 246, 243, 227, 212, 205, 203, 203, 205, 206, 206, 207, 215, 226, 232, 231, 225, 212, 189, 161, 143, 145, 165, 189, 210, 226, 237, 244, 250, 259, 269, 275, 277, 271, 252, 222, 193, 185, 203, 240, 278, 310, 328, 330, 319, 304, 287, 263, 230, 196, 174, 173, 195, 233, 274, 301, 306, 294, 278, 268, 262, 258, 248, 231, 210, 198, 199, 209, 221, 236, 262, 295, 327, 353, 373, 386, 392, 393, 394, 394, 386, 370, 356, 348, 340, 326, 314, 307, 300, 286, 268, 262, 269, 278, 282, 286, 291, 293, 284, 265, 246, 233, 224, 217, 208, 188, 153, 111, 76, 55, 42, 25, 12, 23, 66, 125, 173, 192, 186, 167, 142, 117, 97, 95, 113, 148, 186, 214, 226, 224, 213, 201, 193, 196, 211, 232, 245, 243, 233, 229, 234, 239, 236, 229, 225, 228]
2408B28LkpqkPJ7K2K1J5Qlj3k4l2l6l3k2pNJ3K0J6kk4l0j5LJ0NLMKknoprmNJ2J4J4J1LlkL
2389A66LmqlQJ5J7J3PJ%MMmj8k4j9lJ3K2K3K0J3Lj2k4k4j0OJ8K0J8Oqj6nJ0J9J0mj7k4k6k5
2372A61k4k1j2LJ7K0Qnj5j5oNROLPJ5J7J2POMpj5j5qJRK1K4J3j1k9l2j8JJ8K7K3J1LMPOKl
2353B34qj3j4rkLPRNoj6j1NK0J9Ppj3pOJ6J4Lqrk%nqmNQRJ0J0jj8l3l1j9j3j7k2k2j6qmkJ
2333D3MNMPJ2J9K0J7RLLQJ4J1kj8k1j0J2K6K9K4J6Npk0l0l3k7k0j4j3q%J1J4QJ%jkkLQQLJ
2315A20RK0K9L4L7L3K2R%oj1j8k1k2k3k1j5p%K%npqrj1q%J4K6K9K3J2lj6k4k7k6k1j1jPMj
2297A08oqj4j6j1jPQJ0J1J1LjJNMJMJ1J6J4QJj2k0j8pJlqqJJ0J6J5PkqlPJ2J2PKoj9k6k3n
2277H8J5K7K9K4J4NkJQJ4J5J5J5J3Omj3k1k2j7ojrk1j9mJ1J5RM%lmLJ3K0J9J4RLknppnnnq
$$ y = [228, 231, 229, 222, 214, 212, 219, 236, 258, 279, 294, 302, 299, 286, 262, 230, 194, 161, 139, 132, 137, 150, 170, 186, 184, 160, 130, 115, 118, 128, 133, 136, 140, 142, 140, 135, 129, 122, 113, 109, 114, 126, 140, 154, 165, 168, 165, 163, 166, 169, 165, 157, 154, 162, 177, 194, 207, 214, 215, 215, 219, 223, 219, 201, 177, 158, 155, 168, 190, 213, 233, 246, 249, 237, 213, 189, 179, 185, 203, 223, 241, 247, 239, 223, 218, 228, 247, 257, 253, 236, 212, 186, 161, 137, 116, 104, 107, 124, 144, 152, 147, 132, 117, 111, 116, 125, 131, 134, 141, 156, 173, 185, 192, 198, 202, 195, 180, 165, 157, 158, 167, 188, 212, 225, 214, 185, 153, 135, 136, 154, 181, 204, 215, 218, 222, 229, 235, 237, 234, 226, 213, 199, 190, 188, 191, 198, 207, 212, 206, 190, 179, 184, 204, 223, 230, 223, 210, 203, 209, 225, 239, 242, 234, 225, 223, 223, 218, 210, 206, 211, 219, 228, 238, 248, 247, 229, 196, 165, 146, 133, 116, 94, 72, 56, 48, 44, 42, 43, 47, 52, 56, 63, 75, 94, 114, 131, 140, 143, 146, 154, 168, 179, 177, 159, 138, 128, 140, 166, 195, 219, 235, 240, 233, 213, 183, 150, 123, 103, 89, 76, 68, 68, 79, 93, 101, 102, 102, 101, 99, 97, 100, 108, 116, 119, 120, 129, 149, 178, 212, 249, 282, 304, 313, 313, 307, 296, 278, 257, 235, 212, 191, 176, 169, 169, 171, 171, 166, 159, 151, 142, 131, 123, 123, 137, 163, 192, 215, 227, 224, 208, 184, 157, 131, 110, 99, 98, 105, 109, 108, 102, 94, 80, 64, 53, 52, 59, 67, 77, 88, 99, 102, 101, 102, 107, 111, 112, 116, 127, 143, 157, 165, 166, 154, 134, 116, 109, 110, 107, 99, 91, 92, 102, 118, 133, 140, 138, 130, 127, 134, 146, 158, 165, 167, 161, 142, 116, 93, 88, 103, 130, 159, 183, 197, 202, 200, 201, 209, 223, 238, 253, 268, 281, 287, 283, 270, 249, 227, 210, 204, 203, 194, 173, 154, 150, 161, 176, 185, 189, 189, 186, 182, 185, 198, 218, 237, 251, 260, 263, 261, 256, 249, 242, 237, 232, 227, 219]
2258B19j4k2k7k4j3LJ8K4K5K4J5Jj5k3j9qLPJj3k0j1J2L2L8L7L4K6J3jj2k0k9l6l5k8j8rk
2242A33kj0k1k7k8k4j7lJ3K3K7K5J9J2Lno%J1K2K8K1QkkOJ3Qlj1rmpj6k3j6kPPLKJ%ljJKL
2223A56RJ8K7L2L1K4J3Knrj5k0k2j8j9k3k3j8j2j0pKJ1J6J0Llj0j3rkKjkjNPPM%mjJ1K3K2
2205A88J2%mqj6k6l1k3oQJ7J7J6J6J3PKLNMj%MMmj2j3ronlJNMPJ1J5J8K0K0J6PkomlJPJ4J7
2185B97J5J3Pqk9m5l8j3PRlj1rkJjJPRjj7k9l2k6j7pKRRPLK%nqpJJ1J6J2OPJ6K6L1K7K2Qj5
2165B58l9n2m3k1mJKNJ2J5J4J0OKjmqrj4j7j8j0JRJ3J3J2J3J6K3K3J6OKNJ0J0Lmnkkqk1l0
2147A88k8j2NJ6J8J5Qmj5k6l1k7j2J2K7J7j4l9l4mK7L2J7JlJLJLJ2K5K9K6K1J7J3Nrk7m2m3
2131A69k7oNLKJ1K2K7K7K3J7Ooj2j2j1j3j4j2j3j6j9j6p%JKORJ2QOPJ0J3J5J6J4Plj5k1k1
$$ y = [219, 205, 183, 156, 132, 119, 122, 140, 164, 189, 213, 228, 229, 214, 191, 172, 164, 167, 174, 175, 162, 142, 131, 143, 175, 213, 250, 284, 310, 323, 322, 310, 290, 261, 225, 190, 162, 144, 135, 133, 131, 121, 100, 73, 45, 21, 4, 1, 14, 37, 64, 89, 108, 120, 123, 118, 112, 112, 123, 145, 173, 194, 202, 200, 198, 204, 217, 225, 222, 211, 202, 198, 191, 175, 152, 136, 134, 141, 148, 151, 153, 154, 154, 151, 150, 151, 153, 156, 165, 183, 210, 242, 273, 297, 310, 312, 307, 298, 283, 263, 241, 223, 204, 181, 158, 140, 128, 118, 111, 113, 124, 140, 150, 153, 150, 140, 127, 118, 116, 118, 117, 115, 114, 119, 126, 133, 137, 137, 133, 132, 143, 166, 188, 200, 200, 196, 188, 172, 146, 115, 92, 86, 94, 111, 128, 144, 160, 173, 180, 182, 185, 190, 194, 193, 193, 197, 201, 197, 185, 172, 163, 157, 152, 149, 150, 155, 159, 166, 177, 192, 210, 230, 250, 266, 273, 271, 265, 261, 258, 259, 266, 280, 297, 312, 325, 332, 324, 295, 250, 212, 199, 206, 215, 212, 201, 192, 190, 191, 190, 191, 198, 207, 206, 189, 160, 128, 102, 85, 78, 80, 89, 98, 105, 108, 110, 110, 105, 97, 90, 91, 102, 118, 130, 136, 143, 159, 185, 216, 243, 265, 273, 258, 219, 167, 124, 103, 99, 100, 102, 107, 119, 134, 148, 158, 164, 166, 165, 161, 153, 144, 130, 113, 95, 85, 86, 95, 108, 121, 133, 146, 162, 185, 208, 224, 230, 232, 237, 247, 257, 260, 256, 251, 249, 247, 239, 218, 188, 160, 148, 153, 169, 187, 202, 210, 206, 191, 165, 134, 107, 95, 107, 134, 151, 137, 98, 64, 60, 87, 119, 136, 137, 134, 135, 138, 139, 142, 154, 179, 208, 234, 255, 272, 285, 290, 281, 254, 212, 169, 142, 136, 141, 144, 146, 157, 179, 206, 233, 256, 273, 279, 273, 261, 249, 238, 225, 211, 199, 186, 170, 151, 135, 128, 128, 129, 131, 137, 146, 158, 166, 172, 179, 189, 202, 217, 233, 247, 254, 251, 236, 215, 194]
2113A94j7j7j6j4rJJ2J3Mrj5j3j0j0q%ORJ2K0K3J9RMMLnj4j8rMJ4J5J2NJKLPJ3J5Rkqj1j2
2095B16j7j4oL%j2k2j9pNJ4J8K1J5Mnqpqj4k1j8mJ2K5K8J9Nrj3lJ1K1J8Opj7j9j1JROJJOJ1
2076B15J3J7K0J4Kj0j4j2oljlqj1j1qmNJ5J9J4OM%rk0k0oJ4K7K3J0pj8k1j8j5rkJoj2qNPl
2058A66j4j9j8j6r%RJ0J1J9K7K4J3LnojRJ9J7Lj3k6l2k5pJ2K0K2J9J4ROJ5K0J2oj7j3j0j2
2041B30j0lMkj1j1JJ4J7J1kj8k7k2nJ5K5K4J5Ll%Mlj8l0k8k0j3oNJ8L0L6L6K8J9J3J4J7J7
2025C64J0jj0j8k2j9j6j2rppj4k3k3j2KLjKK1M0M0K0ok5l5l4k2qkllQJ8J7OjLQNpj2lJ5L0
2007B57L1J6ok0k3k2k4k6k4j6j1j1j0mjkjOJ5J4Ml%PNmomLORJ5K2K6K6K1J1jj1j4j2pmlmm
1988B16JJ4K7L5L4K6J5Mpj9k8l1k3r%MJlqj0qkKkrj0nKNRJ2RLj%LJmj2j6j5mRJ5Qnj2j5k1
$$ y = [194, 177, 160, 144, 130, 121, 122, 134, 147, 151, 142, 127, 114, 104, 94, 86, 86, 92, 101, 113, 133, 156, 175, 184, 188, 192, 195, 190, 176, 158, 149, 153, 167, 182, 194, 199, 200, 202, 205, 212, 225, 240, 249, 247, 239, 228, 216, 199, 185, 179, 182, 182, 170, 148, 129, 122, 127, 141, 159, 180, 195, 199, 194, 186, 179, 171, 157, 136, 118, 114, 126, 151, 179, 198, 203, 194, 181, 178, 189, 210, 228, 234, 227, 210, 191, 180, 181, 190, 196, 197, 198, 204, 215, 228, 245, 265, 279, 281, 271, 257, 245, 239, 236, 235, 232, 224, 213, 202, 194, 190, 195, 210, 229, 243, 249, 253, 253, 244, 224, 204, 198, 212, 239, 262, 272, 265, 247, 226, 208, 193, 184, 182, 183, 177, 165, 157, 162, 169, 166, 152, 133, 115, 99, 90, 90, 99, 109, 120, 139, 166, 190, 203, 206, 201, 195, 194, 203, 222, 239, 242, 229, 203, 171, 146, 139, 151, 171, 193, 212, 226, 235, 241, 256, 276, 288, 282, 265, 252, 242, 230, 220, 217, 221, 219, 208, 197, 198, 212, 229, 240, 238, 220, 193, 171, 166, 181, 206, 230, 245, 248, 245, 245, 249, 246, 228, 198, 170, 150, 137, 131, 136, 154, 184, 220, 256, 284, 303, 316, 330, 347, 364, 374, 373, 363, 345, 323, 304, 288, 276, 267, 260, 253, 239, 216, 193, 181, 183, 186, 185, 187, 208, 248, 288, 308, 302, 277, 242, 208, 186, 178, 176, 173, 170, 178, 196, 213, 219, 218, 221, 229, 234, 227, 215, 212, 227, 257, 288, 304, 298, 278, 255, 233, 209, 183, 159, 143, 132, 121, 111, 107, 106, 104, 103, 109, 124, 138, 142, 139, 139, 146, 151, 147, 141, 137, 140, 146, 155, 170, 192, 218, 244, 265, 276, 275, 264, 250, 238, 231, 227, 224, 220, 216, 217, 231, 258, 293, 327, 353, 368, 372, 365, 346, 318, 287, 264, 255, 255, 259, 260, 257, 249, 239, 231, 229, 231, 229, 220, 210, 205, 207, 212, 221, 233, 242, 245, 244, 244, 247, 248, 244, 232, 216, 201, 197, 206, 221, 229, 224, 212, 197, 176]
1969A76l0l5k5rLRJ4J8J7Qjpj0j2j0jJ3K4K3J3K%MJ1J4J5Rkj1j0KJ8K2J4Kkjmj6k9l2j9JJ2
1951A78Pok0k7k2qJ3K9L0J4loMJ6J7J2OQJ3J6J1Moj5k2k5k4k2k1j7oNJ0KnkJ1K6L7L8K6Nj5
1934B66k5k4j8j7j6j7j8k1j9j0OK3L5L3J6JlMJ4J4RKpj6j9j6j4j4qKJ1J3J0ROjl%PNqj8j7
1917A57oMOkj1j3jJ7K6K3J3K%MJ6K4K5J6RKmj0j5j7j1jJ6K7K2Opj0kMRRPKlmlnj4k2k7k8k2
1898B08j4j0j0j0jJ0J5Nrj7j4lQJ3Qjj0j7k2k4k2j4jJ3K1K3K5K4J6Kj3j9j5qkJ%jkKJ1J6J5
1880A77Lrj5j5j4j1rnklkKJ2K2K8K4J6QLMJ0J5J4J1Omj5k2k2k1k2k3j7pKQJ6K2K0J0%lkjl
1862A86qj0j1oMOMjklk%JkqnRK7L7L6K5Roj0mnk2m3m8l4j4KJ4J6J2PMMjrj2j1j3j6j2%NJn
1843H6JJ1J5J3Q%onNJ3Poj2roj0j5pQJ9K4K9L7M1L3J9RM%prj0j3k5l3l2j8lPJ2J5J9K1J5L
$$ y = [176, 146, 111, 86, 77, 80, 89, 103, 121, 138, 146, 145, 138, 128, 116, 106, 105, 118, 142, 165, 178, 180, 180, 184, 195, 209, 224, 233, 231, 220, 210, 212, 230, 252, 266, 268, 266, 265, 261, 245, 216, 184, 165, 166, 178, 185, 179, 159, 132, 110, 102, 115, 144, 174, 188, 185, 179, 183, 199, 216, 228, 234, 242, 255, 271, 282, 286, 280, 265, 243, 218, 194, 172, 151, 134, 128, 133, 143, 145, 140, 138, 149, 175, 212, 250, 276, 281, 266, 241, 217, 199, 182, 166, 149, 131, 110, 91, 81, 87, 110, 145, 178, 194, 195, 192, 196, 210, 224, 233, 235, 228, 212, 193, 177, 163, 149, 141, 143, 154, 167, 177, 186, 192, 191, 188, 188, 195, 200, 192, 174, 157, 151, 155, 161, 159, 148, 135, 134, 151, 177, 200, 213, 215, 215, 219, 235, 259, 284, 300, 309, 311, 307, 297, 282, 265, 254, 253, 269, 296, 318, 324, 317, 307, 305, 309, 318, 327, 334, 336, 333, 329, 326, 321, 307, 285, 258, 230, 208, 194, 184, 174, 164, 163, 173, 188, 193, 184, 167, 153, 150, 158, 171, 179, 178, 168, 151, 129, 105, 83, 69, 68, 81, 102, 125, 150, 174, 190, 192, 179, 160, 145, 137, 135, 136, 136, 135, 133, 135, 146, 162, 177, 180, 171, 156, 141, 127, 116, 107, 102, 100, 97, 95, 97, 109, 131, 159, 183, 199, 207, 210, 214, 224, 239, 253, 264, 270, 266, 251, 229, 207, 186, 164, 141, 124, 117, 119, 127, 143, 165, 185, 195, 195, 192, 190, 189, 186, 178, 168, 157, 151, 155, 161, 165, 164, 162, 159, 157, 157, 158, 156, 148, 143, 152, 179, 216, 252, 277, 286, 280, 270, 266, 261, 239, 196, 148, 114, 100, 102, 116, 132, 144, 151, 155, 159, 158, 149, 137, 126, 113, 97, 85, 85, 90, 91, 86, 87, 98, 113, 126, 134, 134, 128, 123, 128, 141, 148, 142, 130, 121, 115, 105, 90, 83, 91, 110, 134, 163, 200, 241, 274, 293, 302, 306, 306, 299, 290, 280, 267, 242, 209, 177, 159, 156, 163, 175, 190, 209, 230, 245, 248]
1825B48qoJ1K4K1Kj2rMP%j2j5j2onj2j9k3k2j3KJ1J3OJKNNOJ2J6J3Kj0j9k2j4JJ4J3NJjqj2
1806A85pLNoj9k2j8rOK5L4K4RMOMmrpmlmknrj3oQK2K5J8QMNN%pj3k2k6j7PK5K2Pnj0j3j6j2
1786A73lKJKOMlj1j1j0j0j2j0%RJ5RJ%J1K4K4J5Njmqollqp%Llj3j4qjLJ1K0K2J7Pkrj5j8k0
1766A71k3j6mJ1J2Moj2j3j6j5pQK0K8L1K5J1pk0k2j7j1%J4K4K4J6P%qj5j2PK5K5Mk0l6m1l5
1750A11k0%J5J7Qmj3j5lJ4J9Qnj0nkJMRJ6K0K5K7K5J9Qnk1k8k5j5pjNRPMJlorplmnkLLpj3
1729A40pQJ9K0J1%mjMQPLlj1j4j1ql%OJ0OkpnMJ6K7L1K5J2lj2j7j6j0mJNJ4K2L0K9K0Qqj9
1711C21j9rjjj3k8l8m0k8j2OJ9L2M1M2K8Nj4j7oQJ4J2P%nj5k4k9k7k4j8j1lMRJ3J3J0Lnqo
1693A86JRJ0Mqj3rkLK%kmlLRJ1O%lKJ0K1L1L6L5L1K8K6J9Mj5k9l8l7l2k5k1k6l9n0n0m0k5
$$ y = [248, 240, 234, 245, 269, 290, 292, 280, 271, 275, 282, 282, 270, 255, 243, 237, 232, 220, 201, 178, 156, 143, 145, 156, 169, 175, 176, 178, 183, 188, 194, 206, 222, 235, 237, 227, 208, 186, 172, 173, 187, 200, 205, 206, 205, 197, 185, 178, 181, 186, 180, 161, 139, 121, 112, 118, 143, 177, 201, 210, 214, 220, 224, 220, 211, 204, 200, 197, 193, 191, 186, 177, 164, 158, 166, 188, 213, 231, 239, 243, 248, 253, 253, 246, 233, 211, 185, 168, 175, 200, 222, 229, 224, 214, 201, 185, 173, 170, 172, 173, 175, 181, 185, 182, 171, 160, 150, 140, 128, 118, 118, 127, 142, 151, 152, 152, 163, 187, 211, 226, 231, 230, 226, 218, 212, 209, 206, 198, 191, 191, 194, 191, 178, 164, 156, 155, 158, 169, 189, 211, 228, 235, 233, 224, 209, 191, 171, 148, 132, 128, 139, 151, 155, 149, 137, 124, 108, 93, 86, 94, 114, 142, 173, 198, 209, 202, 182, 160, 143, 132, 132, 146, 170, 194, 210, 217, 217, 209, 194, 182, 189, 214, 239, 243, 223, 187, 146, 111, 91, 91, 106, 123, 131, 127, 114, 99, 96, 110, 129, 137, 132, 122, 117, 115, 116, 120, 129, 145, 165, 190, 217, 242, 261, 269, 264, 243, 215, 190, 175, 168, 167, 172, 181, 188, 192, 193, 190, 184, 175, 168, 165, 161, 156, 154, 157, 160, 153, 140, 133, 141, 160, 180, 191, 191, 187, 186, 190, 198, 205, 208, 205, 194, 180, 169, 161, 158, 158, 164, 174, 180, 178, 171, 166, 170, 186, 213, 244, 269, 281, 278, 266, 249, 233, 223, 219, 220, 225, 239, 261, 291, 320, 340, 348, 340, 321, 302, 293, 292, 291, 278, 250, 212, 172, 144, 132, 138, 157, 189, 230, 272, 300, 305, 291, 274, 268, 276, 290, 302, 309, 309, 304, 289, 265, 236, 209, 185, 167, 156, 153, 157, 166, 179, 192, 202, 205, 200, 192, 186, 187, 196, 206, 210, 202, 189, 180, 178, 181, 183, 183, 181, 177, 174, 177, 186, 197, 203, 203, 200, 202, 212, 233, 264, 300, 335, 366, 394, 420, 439, 443, 428, 399, 361, 324, 292, 267, 246, 220, 181, 131, 81, 41, 16]
1676A6j0LJ1J1J0J0J3J0KmlLJ0J1J0J1J1Qmj5j7mJ2J9J8J6J8J2jj6j9j4mRK4L8L9K4%k0k3
1659B25j4nkqqmLNKmj2j3nLKrj8k1j7j0JJ6K6K6J7R%j4k2k1j1lLQJ5J9K1K6L4L2J9Lol%LP
1640B95ROlj2k0k4k5k5k6k4k2j5nMJ0J5J5Rlj3j7j4j0o%OJ3J5J2J1QN%l%LJlkOJ7J8J0nj9
1622A92k3j9j3j3j8j8j1JJ0J4J7K5L6M7M9L7J2j6l4l8k6pOPkrnMMpk2k9k8j8nJ0K2L0L5L6
1606B33K8J5JkJ%rk1k4k0qLPPMNMnk0l2l2l0k7k3rNJ2J4J7K2J9R%%MNkrj4j7j5p%Klqq%J0
1587H2J7J2NLJ2J7J1LKPNmj4j4qklj2k0k0qMJ0J1J1PjolORPQJ4K0J9J7J5Poj7j7j2j2j7j8
1568A27j3oJJ1K4L6M1L7K9K3J9J6Npj8k5k6k2j2kKJJQJ2J1%j7k7k7j9j0pp%RJ0Jj4k3k8k6
1551H8j4MJ7J4OLJ2J8J7QKJkj0k1k4j7qjMJ5L0L7L2K2J6J1NmrmLJ0J7J8J4Lrj9k4k2j2jOM
$$ y = [16, 6, 9, 20, 31, 41, 51, 64, 74, 76, 72, 69, 72, 82, 93, 103, 114, 125, 133, 129, 114, 97, 93, 105, 124, 142, 158, 176, 188, 187, 171, 152, 138, 134, 143, 167, 205, 244, 268, 268, 248, 225, 211, 206, 204, 196, 188, 184, 187, 192, 194, 190, 178, 165, 160, 163, 165, 156, 138, 117, 100, 90, 91, 107, 133, 159, 176, 185, 185, 171, 149, 128, 117, 114, 117, 125, 140, 159, 180, 206, 240, 272, 291, 294, 288, 285, 285, 288, 295, 304, 310, 307, 295, 275, 251, 226, 201, 175, 151, 129, 114, 109, 113, 123, 138, 153, 162, 159, 146, 129, 115, 105, 99, 99, 105, 118, 133, 145, 156, 164, 169, 169, 166, 166, 169, 170, 167, 165, 171, 188, 206, 216, 211, 192, 169, 150, 137, 124, 106, 88, 77, 78, 88, 102, 119, 144, 180, 227, 276, 313, 325, 309, 275, 237, 211, 204, 210, 217, 215, 206, 201, 205, 209, 202, 180, 151, 123, 105, 100, 110, 132, 162, 197, 233, 261, 276, 277, 275, 276, 276, 267, 246, 222, 202, 194, 197, 204, 211, 215, 220, 224, 219, 199, 167, 135, 105, 78, 55, 46, 51, 63, 77, 94, 116, 135, 144, 144, 144, 148, 153, 151, 142, 128, 111, 96, 89, 89, 91, 88, 80, 72, 72, 82, 99, 111, 116, 119, 131, 148, 159, 162, 164, 171, 176, 172, 158, 144, 136, 134, 131, 119, 99, 79, 71, 75, 85, 96, 107, 114, 113, 107, 104, 110, 119, 126, 134, 148, 168, 187, 204, 219, 226, 220, 203, 186, 174, 162, 145, 127, 114, 108, 109, 120, 144, 180, 221, 258, 287, 310, 329, 345, 350, 343, 325, 300, 274, 252, 240, 238, 240, 241, 242, 250, 262, 273, 273, 256, 229, 202, 183, 173, 166, 159, 159, 168, 178, 179, 165, 142, 114, 88, 74, 78, 95, 109, 115, 118, 130, 148, 165, 173, 175, 176, 174, 164, 143, 119, 102, 94, 93, 97, 112, 142, 179, 211, 233, 249, 260, 265, 261, 252, 248, 251, 261, 278, 296, 310, 313, 304, 285, 261, 239, 227, 226, 232, 236]
1533B36kkNJ3J3Nmmk%%jLRJ3J3RLkpj1j5j6j1pqj0j3j1j2j8j8j2npj8k4j4NK4L0K3QnpJJ2
1514A59J9K2J7QKJKkj3k4k6j7p%jpj3j3j0nNJ6K8L3L3K9J8Jj8l5m3l9k2jJ5J8Rlj5k3k2j2
1497F4MJ6J9J5Olj5k4k7k2j2jOJ4K0K4K1J4J1J3J5J3Mmj1k0k5k0qMJ1J4J7K1K0J8J7K4L1K6
1481B90Rj4k9l2k7j9roj4k7l3k7j6qlPJ5J6J0NLpk3l6k9j1OJ2J3J4K1K8K5J3jj0j3j1mRK1
1465A08K5K0RJkjKOPJ2J7K0J8Rlrj1qmkkllknnl%LJ0K2K9K3Nj4l0m1l9k2lMMKMLnp%J1K2K5
1444A97K0PonLOnj4j4ojKOJ0J0POQRPNOJ1J7J7Oj4k8k9j9oJjj0k2k8l1k8k3rRK5K7K0J1Jn
1426A50qrrnKJ0Pnj4j6j1njJknlMJ0RRJ0J3J0PQJ0J2J2QJj1j5pLNJ%%jkLJ0J4J2Mqk4l2l0
1405A22j8oOJ7K4K4J9J6J0jj0j2j6k5l7l4j5J4L6M2L3K1J5J6J5OmpqqmKLlnPK3K7K1J4J2P
$$ y = [236, 234, 232, 237, 250, 263, 268, 264, 260, 258, 258, 258, 257, 260, 269, 282, 295, 304, 307, 305, 298, 287, 272, 256, 245, 238, 230, 220, 207, 196, 184, 166, 148, 136, 131, 124, 106, 82, 68, 73, 97, 127, 150, 158, 153, 146, 147, 159, 178, 200, 217, 225, 227, 228, 230, 228, 215, 191, 165, 148, 141, 141, 140, 133, 120, 107, 97, 92, 97, 113, 141, 174, 207, 236, 254, 255, 237, 202, 159, 120, 98, 97, 112, 130, 139, 136, 121, 98, 76, 64, 68, 84, 103, 118, 124, 121, 106, 82, 55, 33, 21, 20, 26, 40, 60, 84, 105, 119, 130, 143, 158, 171, 175, 171, 160, 140, 115, 95, 87, 91, 102, 116, 133, 154, 174, 192, 209, 233, 264, 290, 299, 285, 256, 224, 197, 178, 169, 163, 149, 122, 89, 62, 46, 38, 35, 42, 57, 73, 83, 88, 91, 84, 61, 25, -4, -15, -9, 3, 16, 30, 51, 79, 104, 117, 116, 106, 93, 82, 78, 87, 108, 133, 153, 162, 163, 161, 160, 162, 168, 175, 187, 204, 224, 242, 251, 248, 239, 228, 220, 216, 214, 212, 209, 206, 204, 199, 194, 191, 191, 194, 204, 226, 255, 278, 283, 269, 239, 198, 159, 137, 134, 138, 142, 144, 148, 151, 146, 139, 139, 150, 172, 197, 217, 224, 218, 213, 216, 222, 217, 203, 189, 183, 182, 184, 190, 200, 210, 217, 223, 231, 240, 247, 252, 258, 269, 286, 303, 309, 295, 267, 238, 219, 213, 214, 213, 203, 181, 153, 122, 94, 71, 62, 71, 96, 123, 143, 154, 155, 150, 142, 133, 124, 119, 121, 131, 138, 133, 119, 103, 92, 87, 86, 87, 85, 80, 77, 81, 91, 100, 109, 119, 132, 142, 149, 157, 167, 179, 191, 199, 200, 189, 174, 167, 170, 175, 176, 176, 176, 175, 173, 176, 186, 200, 212, 216, 208, 184, 152, 122, 104, 98, 104, 121, 145, 169, 188, 204, 214, 213, 203, 191, 175, 150, 113, 79, 64, 78, 114, 156, 189, 210, 225, 241, 256, 262, 258, 251, 243, 235, 231, 233, 236, 233, 228, 235, 258, 285, 306, 320, 332, 339]
1389C39L%%oj7k9m0m6l7j1J5K4K1J7J4J2RQLqj1OK5K4Kj7k4j9j1kKKKJ1J8J1mj0l%lmLRJ4
1370B92K1L0L6L8L9L6L2L4L8L0%l2m0k9j8j3m%pj1LJ8J5JLJ2J2QJ6K9K6K2M1P4Q8R4J19J44
1355A197J38J24J47J99K39K89L95N37O70Q51J181J661K255L075M135M847M181J731j530l929
1347B2393m589l971l044k299j714j225q92p10n80m56l78l40k83k00j45j28j07p1n2n4m3k4
1338A088l1n8o8n0l7m2m2k8k5l7m4l1k2k1j8pklMJ9K5K3K9M1K9j1m5n4n0m1k8j2j2k6l4k9
1324C50k2k0j1JOoj2%J6K5L0L8L9K4Mnrj2j4j5j8k3k7k2j7j3j1lLNN%qj8j7oOJ4L0N5O6N3
1307D61K1pk5l6m1m1l2k2j3rj0j1kJ4K0J3NRJ7J7J1Nmj6k9k9j6NK1K4J2ok1k8l4l4k3nQJ0
1291A79OORJ2J3J4J4J1RQMlj0j4k0j9rRK0J6MkkKRJ7J8Rkj1j8k5k6j6onpkMPPJ0J2MnjJ1J7
$$ y = [339, 342, 342, 342, 336, 319, 290, 250, 204, 167, 156, 171, 195, 216, 233, 247, 259, 268, 276, 279, 271, 260, 266, 291, 315, 317, 300, 276, 257, 246, 244, 246, 248, 250, 261, 279, 290, 286, 276, 273, 273, 270, 266, 269, 278, 292, 313, 343, 379, 417, 456, 492, 524, 558, 596, 626, 626, 594, 554, 525, 507, 494, 490, 490, 483, 472, 475, 493, 508, 509, 512, 524, 536, 544, 560, 589, 615, 637, 678, 752, 840, 934, 1053, 1197, 1335, 1459, 1606, 1805, 2044, 2333, 2728, 3265, 3935, 4786, 5967, 7628, 9883, 12958, 17093, 21940, 26121, 27852, 26322, 22393, 17804, 13833, 10789, 8490, 6776, 5551, 4659, 3949, 3369, 2913, 2535, 2195, 1912, 1712, 1567, 1439, 1332, 1261, 1209, 1155, 1112, 1088, 1057, 999, 931, 881, 844, 802, 760, 732, 707, 670, 626, 595, 573, 552, 534, 527, 525, 522, 526, 545, 570, 593, 622, 663, 692, 681, 636, 582, 532, 491, 463, 451, 439, 413, 379, 350, 328, 308, 297, 298, 304, 298, 286, 286, 302, 327, 357, 395, 434, 458, 462, 457, 448, 436, 422, 407, 389, 366, 339, 317, 300, 287, 276, 273, 276, 281, 286, 286, 278, 260, 243, 237, 243, 257, 287, 342, 408, 461, 482, 475, 450, 414, 373, 332, 300, 278, 265, 256, 246, 235, 233, 247, 267, 280, 285, 294, 311, 328, 339, 344, 340, 324, 295, 266, 250, 255, 276, 300, 312, 306, 285, 257, 223, 189, 166, 161, 169, 179, 185, 191, 200, 212, 225, 239, 253, 264, 273, 281, 285, 282, 272, 258, 238, 219, 210, 219, 239, 255, 259, 257, 255, 257, 266, 283, 301, 310, 308, 297, 279, 254, 228, 212, 206, 201, 194, 192, 196, 203, 210, 220, 232, 236, 231, 230, 241, 258]
1272B58J4Nnj0r%OLjKJ1J4Pjpj0j3j4j7k8l6k6lJ5J7J1RRRPOM%j0j6j1KJ6K0J2PJ5L2M1L8
1254C73L0J9Qmj2j6k2k7k6k0j6j6j6j3j3j3j1ppqjJ3K0J3jj3j7j4qJNMNPLnqljoj2pRK1K2
1236B10J8J7J9J8J0kj3k1k5l0k8j4LJ2J2QN%pj1oMJ3J6J1lj8k8k7k4k5k3j2JQQMLJKK%ork
1218G1PJ5J7K0K0J6QKkljQJ4J3Nmqj1j4j4j0%NNKJMN%qj2j4j1rnkmj0j1lJ1K4K6K5K6K5J9
1199B38QMQJ2Qjmlnj3j4%K2L4K7J0mj1j9k8l5l0j3NJ6K0K1K1J2oj9k0j4j5j8j4kQPJmrj1p
1181A63%NMPK0L2K9J6RRRRN%j5k9k5qNMlrj2k1k6k0mPQjj0j5j0%MMKNPJqj0mjmj3k2k6k7k4
1161A7j8oJ4L5M3L2Qj2k3k4j6jRRjj0plkJJ3L1L9L1J4Jpj1j5j0lKK%jmpnNJ5J5LoqLJ4K0K0
1142A96K2K8L0K0LnKJ7K2J7Npj7k1j2NJ2Nj1k1j9j6j2j2j3j5j7j6nJ1K5K7J3lj2q%QJ1Opk5
$$ y = [258, 272, 277, 272, 262, 253, 253, 259, 262, 261, 263, 274, 288, 295, 294, 287, 277, 264, 250, 233, 205, 169, 143, 140, 155, 172, 183, 192, 201, 210, 217, 223, 227, 227, 217, 201, 190, 192, 208, 228, 240, 247, 262, 294, 335, 373, 403, 422, 430, 426, 414, 398, 376, 349, 323, 303, 287, 271, 255, 242, 229, 216, 205, 198, 191, 183, 182, 195, 215, 228, 227, 214, 197, 183, 175, 176, 181, 185, 190, 197, 200, 195, 187, 184, 183, 177, 165, 158, 167, 188, 210, 228, 245, 264, 282, 292, 290, 277, 256, 231, 201, 173, 159, 162, 174, 186, 194, 199, 199, 192, 181, 175, 179, 192, 208, 219, 216, 198, 170, 143, 119, 94, 71, 59, 60, 68, 76, 80, 83, 84, 86, 88, 88, 82, 73, 71, 78, 93, 110, 130, 150, 166, 174, 176, 174, 171, 170, 178, 192, 205, 210, 206, 198, 187, 173, 159, 149, 149, 154, 159, 161, 162, 166, 171, 171, 163, 151, 137, 126, 117, 112, 110, 106, 96, 85, 82, 93, 117, 143, 168, 194, 219, 238, 246, 250, 258, 270, 278, 277, 273, 270, 265, 252, 238, 238, 260, 294, 321, 331, 327, 316, 297, 269, 234, 204, 191, 196, 212, 232, 253, 274, 286, 280, 261, 241, 227, 212, 194, 180, 178, 186, 193, 194, 190, 181, 170, 163, 163, 168, 172, 179, 199, 231, 260, 276, 285, 294, 303, 312, 317, 317, 302, 273, 248, 240, 245, 249, 246, 237, 225, 204, 178, 158, 154, 161, 169, 168, 158, 143, 133, 133, 137, 141, 143, 148, 155, 156, 148, 138, 134, 133, 129, 116, 94, 68, 41, 17, -1, -7, 7, 42, 85, 117, 125, 113, 90, 66, 50, 49, 58, 67, 66, 56, 49, 46, 44, 45, 58, 89, 128, 159, 173, 174, 167, 156, 141, 131, 128, 130, 132, 132, 131, 127, 120, 115, 120, 135, 150, 153, 147, 139, 142, 156, 176, 196, 218, 246, 276, 296, 299, 294, 296, 313, 335, 352, 357, 350, 333, 312, 300, 305, 317, 322, 311, 290, 271, 255, 243, 231, 218, 203, 186, 170, 165, 176, 201, 228, 241, 238, 226, 218, 218, 226, 237, 243, 236, 211]
1125B11l8l8k5nJ3K0J7J3J7K5K5J5M%jlqqlMJ5K9M0L9K7J2Jj2k2k6j7mLlj3k2k3j7o%lj2j6
1107B05j0kklllqj7k1j8j2rmPJ4J2KnkKLNRJ2J2LmpnLJ4J9J8Qkrj1q%OQjj1j7j6q%RJ5K1K2
1087B11J6Kj6l2l2j8%O%mjJ0J9K5K9K8J8MonjKOJ1J3Jj8l2l4k5j4m%KQJ8K6K2Mj3k2k1j6j1
1069A56oKQJ2J3J3J1O%mm%Jj5m1n8n1k1J2L4M5M9M5L3J5LLOLpj7j5mJ1J9J5%j1nJ0J7J1oj5
1052B73j7j8k1j9j0NJ9K5K4J6Lrj7j9j9k5k9k5j1NJ3J6K6L3L0J2oj6j4j2rj0j3j5j2mOJ2J2
1036A80J0QNKMQQLjjkoj1rpnnomlJPRPOQJ2J4RNjj2k2k2j1MPlj4j8j5rMJ8K9K7J2lqjNONP
1014B31J1J1Mmpnkjpj4k1k3k0j2mOJ6K5K2J2koqqj0oJKmoQK7L6K8Qj3k5k5k0j8j7j0PK4K6
996B07J5JmJPOlj1j3rj1j6k0j6nKPJ3J7J0mj3rlprkJ2J9J4LljJLOQJ3J5RjqromjJ2K5K8J9
$$ y = [211, 173, 135, 110, 105, 118, 138, 155, 168, 185, 210, 235, 250, 254, 254, 253, 250, 242, 234, 231, 235, 250, 279, 319, 358, 385, 397, 398, 386, 364, 338, 321, 317, 320, 317, 304, 282, 259, 242, 236, 236, 233, 221, 205, 195, 193, 191, 188, 185, 182, 174, 157, 136, 118, 106, 97, 93, 100, 114, 126, 128, 123, 121, 123, 126, 131, 140, 152, 164, 167, 163, 156, 151, 154, 168, 187, 205, 213, 211, 202, 191, 183, 183, 189, 197, 196, 185, 168, 152, 144, 144, 153, 168, 189, 211, 227, 229, 213, 181, 149, 131, 131, 137, 137, 133, 132, 142, 161, 186, 215, 243, 261, 265, 259, 254, 253, 255, 261, 272, 285, 286, 268, 236, 202, 177, 163, 159, 159, 161, 169, 187, 213, 235, 239, 226, 204, 183, 167, 156, 150, 152, 160, 172, 185, 198, 209, 215, 215, 211, 207, 207, 208, 193, 152, 94, 43, 22, 34, 68, 113, 162, 207, 240, 255, 258, 261, 267, 270, 263, 246, 231, 227, 238, 257, 272, 272, 261, 256, 266, 283, 294, 288, 273, 256, 238, 217, 198, 188, 193, 212, 237, 261, 277, 280, 271, 254, 235, 216, 191, 162, 137, 126, 131, 144, 160, 186, 219, 249, 261, 255, 239, 225, 213, 204, 194, 181, 166, 154, 150, 156, 168, 180, 190, 198, 203, 205, 209, 217, 225, 228, 227, 226, 224, 218, 207, 198, 191, 186, 181, 175, 171, 168, 169, 176, 185, 192, 198, 206, 218, 232, 241, 246, 245, 233, 211, 189, 178, 182, 189, 186, 172, 154, 139, 130, 134, 152, 181, 208, 220, 217, 209, 208, 213, 219, 224, 231, 242, 253, 257, 253, 246, 241, 239, 238, 231, 217, 196, 173, 153, 141, 137, 143, 159, 184, 206, 218, 216, 210, 202, 194, 184, 178, 179, 181, 177, 171, 179, 206, 242, 270, 278, 265, 240, 215, 195, 177, 160, 150, 157, 181, 207, 222, 223, 219, 220, 227, 233, 230, 219, 206, 197, 186, 170, 150, 134, 129, 131, 138, 151, 168, 178, 174, 161, 152, 149, 142, 133, 131, 143, 162, 176, 179, 176, 175, 176, 179, 185, 193, 206, 221, 230, 229, 221, 212, 206, 202, 201, 213, 238, 266, 285]
976B85LprkNNok2k8j9lJ1J6J5J3J2QOOOQMjoj0j2j6k3k7k8k7k1j1JRJ2J0NJkMJ0J4QjmkLO
956A99PPOJl%J1J9J5jj4j8j3qkOJ4J5Omj0oKRRMjoj0j2oRJ9K1J3OJjrj6k3k8k9k5k0j7j5j0
937I2lOJ0J2J6K0K2J8Poj6k0j5oNJ0Mj2k5k1jK1K9K7K2J6Pkpmkpj3j0MJ9K2J3QJ2J8J3%qr
919B66j1j7j9j3kRJ8J9J2jqmK%nrrqkOQ%j1j3plpj0mQJ8J8J2Jqp%PPMMOPPPQNnj2j0mkoj5
897B27j5qlj%NJ1Oj4l6m4l4j3OK2L1L3K7J4MKOJ0Lj1k4l1k9k3j3m%klLRJ0QMKlrnMPjj1j2
878A05qlMJ4K1J6NJOJ1QkolJJnj3j8j5j3j8k4k3rMQNQJ6K0J5J5K4L6L6K3QjmnnlloqlJ0K6
859B49L0J6jj1o%lj6k9l3k8j9rk%jnpqrj4j8k0j2NJ7K2J7J1ONPROJlKNO%pj2j5j5j0olkLJ1
838A04J7J5QKJLPQQMkrqNJ6J4%j1rLJ3J4J3J1J2J8K2K2J2lj6k1j8nJ4K8L2K2Mj5k8l2k3rN
$$ y = [285, 288, 281, 272, 270, 275, 280, 274, 252, 224, 205, 202, 213, 229, 244, 257, 269, 277, 283, 289, 295, 303, 307, 306, 300, 290, 278, 262, 239, 212, 184, 157, 136, 125, 126, 135, 147, 157, 162, 163, 161, 165, 175, 189, 197, 196, 192, 190, 193, 199, 206, 213, 219, 220, 217, 217, 228, 247, 262, 261, 247, 229, 216, 208, 206, 212, 226, 241, 247, 243, 233, 227, 229, 238, 247, 251, 250, 244, 234, 222, 216, 225, 244, 265, 278, 284, 285, 284, 275, 259, 236, 208, 179, 154, 134, 117, 102, 92, 89, 95, 105, 117, 133, 153, 175, 193, 200, 194, 178, 158, 143, 137, 142, 152, 156, 144, 119, 98, 97, 118, 147, 174, 196, 212, 219, 217, 210, 206, 204, 197, 184, 174, 178, 197, 219, 232, 240, 252, 270, 283, 283, 275, 266, 255, 238, 219, 206, 204, 213, 231, 250, 262, 261, 253, 249, 251, 251, 246, 237, 228, 220, 218, 224, 232, 232, 221, 208, 201, 198, 191, 181, 177, 185, 203, 221, 233, 234, 226, 219, 219, 226, 233, 237, 241, 247, 254, 261, 268, 276, 281, 276, 264, 254, 250, 248, 242, 227, 212, 204, 201, 200, 200, 205, 216, 222, 208, 172, 128, 94, 81, 87, 109, 140, 173, 200, 214, 218, 220, 226, 236, 239, 228, 204, 173, 144, 121, 108, 104, 104, 102, 99, 102, 111, 121, 129, 133, 135, 132, 123, 118, 122, 129, 128, 117, 105, 97, 94, 98, 112, 133, 149, 154, 155, 161, 172, 180, 178, 172, 169, 170, 171, 166, 153, 135, 120, 107, 89, 65, 42, 33, 37, 45, 50, 58, 74, 94, 109, 124, 148, 184, 220, 243, 251, 250, 246, 241, 236, 233, 230, 224, 216, 213, 223, 249, 279, 295, 294, 283, 277, 277, 274, 258, 229, 196, 168, 149, 140, 138, 138, 137, 132, 125, 117, 108, 94, 76, 56, 44, 49, 66, 88, 105, 116, 122, 127, 134, 143, 149, 150, 147, 149, 154, 160, 160, 153, 141, 126, 111, 101, 95, 92, 90, 93, 104, 121, 136, 144, 146, 147, 150, 157, 165, 173, 177, 175, 166, 158, 163, 179, 193, 193, 182, 173, 176, 189, 203, 216, 227, 239, 257, 279, 301, 313, 310, 294, 273, 255, 250, 264, 292, 324, 346, 350, 335, 307, 275, 252, 243, 248]
820B48J7K1J7NljKlj6k5k8k8k6j9ojlomMPJ0J4K1K3J8Pj0k5k9j9kLlj2j7k0k3k0qJ0K7L7L8
803A72L0J5QQJ3J2jj7l0l3l1k7k0j2lNPNLLJj%JMJlm%QJ0Mnj1j2j6k3k4j2OK2L1L7M1L9L2
784B33K0Opj7j7mJ3K6L2K9J7%j3j5j3j5j7j7j6j7k1j9rNJ3J3OjjLJ0J4J1Kj2k6l4k8j0QJ7
768A49K2K4K8K9K5K0J9J9J7J0Jpj5k0k6k9k3j2%QRQM%nj1j5rKJ2J4PJjKKnj7k3j6kJ3J2Lo
750B18oKRJ5J6J4Qjqj3j7k2k4j6kJ1J5J0LmpqkQJ7K0K0K1K4K0Pj3k8l6l4k6j0RK5K8K2J0k
732B73j4k1j7kJ2J4Moj1j2j1j0rj1qkOQMKNJ2J4J2J1J2QJqj1pmjnojJ1K5K7K1J4Q%j1j3jK1
714C23L2K8J6J0QNok0l3m1m0l5k7j7qKNRJ3J4Rmj4j2nmqj2j1j0j2j6j6j1mMRJ1J4J9K2K0J3
696B20PL%mlNJ6K3K0J1%opooj0j4j8k2j7rJLjkLRJ3J8K2J7Mrrqj3k4k7j6JRPjpj0nJ1K5L3
$$ y = [248, 265, 286, 303, 308, 305, 304, 306, 303, 287, 262, 234, 206, 180, 161, 155, 154, 151, 145, 141, 145, 152, 162, 176, 197, 220, 238, 245, 235, 210, 181, 162, 160, 163, 160, 148, 131, 111, 88, 68, 60, 70, 97, 134, 172, 202, 217, 225, 233, 246, 258, 257, 240, 210, 177, 146, 119, 99, 87, 84, 89, 96, 101, 104, 107, 108, 107, 107, 108, 112, 113, 110, 106, 106, 114, 124, 128, 123, 112, 100, 84, 61, 37, 25, 31, 53, 84, 121, 162, 201, 233, 253, 259, 252, 235, 218, 214, 227, 253, 285, 314, 331, 331, 318, 303, 290, 275, 258, 241, 225, 208, 187, 168, 159, 164, 177, 190, 196, 195, 194, 197, 207, 221, 232, 234, 222, 196, 162, 134, 124, 132, 149, 171, 195, 223, 252, 277, 297, 316, 335, 352, 362, 363, 356, 341, 321, 295, 266, 243, 231, 231, 239, 248, 256, 260, 260, 255, 244, 229, 220, 222, 234, 248, 255, 256, 255, 257, 259, 254, 237, 214, 198, 196, 209, 221, 224, 218, 212, 214, 223, 238, 254, 268, 276, 275, 267, 254, 237, 215, 191, 175, 173, 184, 199, 209, 212, 208, 201, 193, 191, 199, 216, 236, 256, 277, 301, 321, 328, 315, 287, 251, 217, 191, 181, 190, 215, 243, 265, 275, 273, 259, 238, 221, 219, 231, 245, 249, 243, 232, 220, 209, 199, 190, 179, 171, 169, 175, 183, 187, 189, 194, 206, 220, 232, 243, 255, 263, 264, 256, 245, 238, 234, 233, 228, 222, 221, 232, 257, 284, 305, 319, 327, 327, 316, 303, 302, 323, 355, 383, 399, 409, 417, 422, 416, 396, 363, 322, 282, 247, 220, 203, 195, 197, 202, 211, 224, 238, 247, 243, 229, 217, 212, 208, 200, 188, 177, 167, 155, 139, 123, 112, 108, 112, 121, 132, 146, 165, 187, 207, 220, 227, 230, 230, 226, 223, 228, 244, 267, 287, 298, 298, 292, 285, 279, 273, 263, 249, 231, 209, 192, 183, 184, 187, 186, 184, 187, 196, 209, 227, 249, 266, 270, 261, 252, 244, 231, 207, 180, 164, 165, 174, 181, 180, 173, 163, 158, 169, 194, 227]
677B27K8J3kj3j8j2kQJ1Lj3k7l3k7j8qLRPjlLJ0PJjOJ3J4Mj3k8l0j2J3L2M0L9L5J8mj9j5P
659B52K7L3J6ql1l9l2k1pJPOKllKMkj4k0j5KK3L5L6K7J0kpnjKNMlj5j9j4ommJJ1J6J3QRJ4
640B91J3OmpjPJ0Noj4j6rJJ4K1J9Pj1k5l1k9k8k9l5l3j8LJ7K1J7J4J2J1POOJ0J1RNK%NRRP
621B79MJoj5j9k1k2k6k6j8KK0K9K2Orj2olpj8k2j9rLJ2J6J2mk1k5j3QL0M5M8L6K1J1J6K2J6
604C38jj9k8k8k5k1j3o%%%knnjLMjqj2j4j6k1k7k2nJ4K5L1L3L6L3J9%j4j6j2qrj4j3j0moj4
586A36j8j3kJ1K0K3K1J5QKoj2j0mLLnj2rLJ7K5K0Ppj4j5j6j9j7j2olJJ4L0L7K8Oj5k0rPJ6
569B09J7J1Llnoj1j7k0j4jPNJKQJ1RKkllnpj2j6j9j7j2rojPJ8K1J1lj0ojJKJjJNJ2J3PMJ2
548A90K8M1M0K8Nj7l1l2k4j4qommm%QJ2Plj4k1j9qKNkplMO%orj2j3j1lOJ0J1QPMNQJ0J3J9
$$ y = [227, 255, 268, 266, 253, 235, 223, 221, 229, 240, 243, 230, 203, 170, 143, 125, 117, 120, 129, 136, 135, 132, 135, 145, 152, 153, 152, 158, 171, 185, 189, 176, 148, 118, 106, 119, 151, 191, 230, 265, 283, 279, 260, 245, 252, 279, 312, 328, 320, 289, 250, 218, 197, 190, 191, 198, 204, 206, 203, 200, 202, 206, 204, 190, 170, 155, 157, 180, 215, 251, 278, 288, 286, 279, 274, 273, 275, 280, 284, 281, 266, 247, 233, 227, 223, 219, 220, 231, 247, 260, 268, 277, 291, 304, 310, 306, 299, 298, 305, 315, 320, 314, 300, 284, 275, 276, 290, 311, 330, 337, 326, 301, 270, 241, 213, 184, 149, 116, 98, 101, 118, 139, 156, 170, 182, 193, 200, 206, 212, 222, 233, 242, 247, 249, 249, 254, 263, 272, 279, 283, 284, 278, 263, 244, 223, 201, 175, 149, 131, 133, 153, 182, 204, 210, 201, 189, 183, 180, 173, 155, 133, 114, 105, 108, 120, 136, 148, 144, 123, 98, 85, 93, 123, 168, 216, 252, 273, 284, 300, 322, 338, 337, 318, 290, 262, 237, 216, 203, 197, 197, 197, 197, 195, 190, 185, 184, 187, 191, 190, 182, 170, 156, 140, 119, 92, 70, 65, 79, 104, 135, 168, 204, 237, 256, 256, 242, 226, 214, 206, 197, 183, 170, 160, 156, 150, 136, 118, 105, 103, 114, 134, 157, 178, 193, 201, 203, 197, 185, 175, 171, 174, 177, 172, 160, 151, 154, 171, 196, 216, 223, 216, 202, 187, 171, 152, 135, 123, 117, 114, 115, 129, 159, 196, 224, 230, 215, 195, 186, 193, 209, 226, 237, 240, 237, 232, 226, 215, 198, 178, 164, 163, 170, 175, 176, 178, 186, 197, 206, 208, 206, 203, 200, 195, 188, 176, 160, 141, 124, 112, 103, 97, 96, 103, 121, 142, 153, 150, 140, 134, 133, 134, 136, 137, 136, 137, 142, 154, 167, 174, 178, 190, 218, 259, 299, 327, 332, 315, 284, 252, 228, 214, 206, 200, 196, 192, 188, 188, 196, 208, 215, 212, 198, 177, 158, 150, 152, 157, 155, 148, 145, 149, 155, 155, 149, 140, 128, 115, 104, 101, 107, 117, 128, 136, 143, 147, 152, 160, 170, 183, 202]
528B02K6K9K5J8RNKmj4k2k4j7j1qm%NMjKJ2K3K0Oj1k4l1k9k3j6j1j2j3j7j8j4oKNJ0J6K0K0
511A31J5J5J4Ppj6j3n%MJ3K4K5J5LmppnljJ%lpj5k1k4k1rPJ8J8Qpj6j3kOQOJjJLOMkpql%K
490A28PJ9L0L6L1K3J2jj5k4k9l1l1k9k3j4j0pkPJ2Nqj5rLQKjMJ6K6K6J9Q%%J2K5L4L1K0Qk
472C01mklj2k3k7k4k0j8k0k2j8rPK0K1Rnj0o%LMPJ3K1K8L0K6J9Qpk3l0k5rJkj5k8k7rJ0J6
455A46QJJJ1J8J9J0kj3j8j8j9k0j7j3qkMJ3K1K4K7K4J8Pqj7j9j2NK2K9K4J4J0RMqj7j7j8k1
438B02k8k8j8%J3J2kj6k1j6qlKJ1K2L1L0K2J4QKnqlPJ5J5J0Moj7k5k8k8k3j3jJ2K0K0J3OM
420A98J4K6K8J9PNQMkkLOONNNNPPok5l9m3l8l1j7LJ8K5K3K2K0J2Jnnj3k9m5m7l8k2oRJ5J2
402A05KrpPK5L4K8J2nj4j5pJjpoRK7L4K0kj7k4k4j9pJ1K9L8L3K1Nmpnmnpqqmjlrj5j4mRJ7
$$ y = [202, 228, 257, 282, 300, 309, 314, 316, 312, 298, 276, 252, 235, 224, 216, 212, 212, 217, 221, 220, 222, 234, 257, 277, 283, 272, 248, 217, 188, 165, 149, 138, 126, 113, 96, 78, 64, 58, 60, 65, 75, 91, 111, 131, 146, 161, 175, 182, 175, 159, 146, 141, 141, 145, 158, 182, 207, 222, 225, 221, 214, 207, 202, 199, 198, 199, 199, 196, 189, 174, 153, 129, 108, 99, 106, 124, 142, 150, 143, 127, 114, 112, 118, 126, 132, 133, 132, 133, 136, 142, 146, 144, 137, 129, 126, 126, 128, 135, 154, 184, 220, 251, 274, 286, 285, 270, 246, 217, 186, 155, 126, 103, 89, 79, 72, 70, 77, 89, 94, 86, 71, 62, 65, 73, 75, 74, 78, 94, 120, 146, 165, 173, 173, 173, 185, 210, 244, 275, 295, 303, 301, 297, 295, 292, 280, 257, 230, 206, 186, 168, 148, 126, 108, 99, 106, 126, 147, 156, 151, 141, 135, 135, 138, 142, 149, 162, 183, 211, 241, 267, 286, 294, 287, 264, 234, 209, 200, 201, 199, 184, 156, 129, 120, 130, 146, 154, 155, 156, 167, 185, 204, 214, 212, 199, 181, 163, 144, 124, 107, 94, 86, 84, 88, 101, 122, 146, 173, 197, 215, 222, 214, 197, 178, 166, 171, 193, 222, 246, 260, 270, 279, 283, 275, 258, 241, 223, 202, 174, 146, 128, 128, 141, 153, 151, 135, 114, 98, 90, 87, 89, 100, 122, 153, 183, 205, 219, 227, 229, 224, 216, 213, 220, 235, 250, 260, 264, 258, 241, 216, 188, 160, 137, 124, 123, 135, 155, 175, 188, 194, 198, 212, 238, 266, 285, 292, 297, 305, 309, 307, 305, 308, 314, 320, 325, 330, 335, 340, 347, 354, 348, 323, 284, 241, 203, 172, 155, 158, 176, 201, 224, 246, 266, 278, 279, 274, 269, 256, 227, 182, 135, 97, 75, 69, 78, 93, 105, 107, 98, 91, 98, 123, 157, 185, 197, 192, 178, 163, 156, 157, 156, 149, 143, 152, 179, 213, 233, 231, 214, 190, 166, 147, 140, 151, 180, 218, 251, 272, 277, 273, 266, 261, 257, 252, 245, 237, 229, 225, 224, 221, 212, 197, 183, 179, 188, 205]
382B05J9K2K6K5J4JomMRJ5J6J0ok1k3j1J0K4K5J4%njOPjj4k8l3k4qKlj2qNJ3PjkMONJOJ3J4
363C17Opj3j0jOJ0Omj6k2j6nK%mj0j7k1j7pKJ0J6K1K5K5K2Qj2k7l1k5j8j8j8j0MJ4J6J1Lk
346A93JRJ5J7J5J4Rjj4k2k2j4njoj5j8rNJ6K2K5K0Mj9l3l6k8j5nOJ2J7K4L1L5L1K3J3Kj1k4
329B61k9l1l1l1k4mK0L8M5L9K3%k3l7l5k0kOmk6l7k9nJ2J8J9K8L4K4kj8j6nnj3k0j6p%MQJ4
312A23J9J6QkplQJ6K0J9J7J4Mqj7j9j9j7j3kJ4K4K2J4J0J1J3J4J3J2Okolmj3k5k9k9k9l2l0
295A08j5MJ6J5QKKjnpmLJ1J6J7J2NKKKnj1j2pkljOJ7K2K1J6J4J1Mlpoqj1j5j2kOJj0j4mKn
275A75j3qNRnj5j0QK2K6K6K0Mj6k6j9kJ6K9L7L6L0K3K0J4Mj0j3rlJJ%mon%PRJ0RNkj3j8j7
257C32rkkpj2j3ron%PJ2Nqj8k2k3k3j7j1qj1j6k0k0j8rPK1K6K4J9J3JqpJQJ2J6J7J5J5J8K5
$$ y = [205, 224, 246, 272, 297, 311, 312, 306, 302, 306, 315, 330, 346, 356, 350, 329, 306, 295, 305, 329, 354, 368, 368, 363, 362, 368, 375, 374, 360, 332, 299, 275, 267, 269, 266, 254, 246, 251, 264, 271, 270, 268, 272, 278, 283, 284, 290, 303, 317, 323, 316, 303, 293, 292, 298, 308, 314, 310, 294, 272, 256, 251, 253, 253, 249, 239, 222, 201, 184, 177, 179, 189, 205, 226, 251, 276, 298, 306, 294, 267, 236, 211, 193, 175, 157, 147, 151, 165, 181, 192, 195, 193, 194, 203, 218, 235, 250, 264, 273, 272, 258, 236, 214, 200, 195, 194, 188, 173, 155, 146, 151, 167, 189, 214, 234, 238, 219, 186, 150, 122, 107, 102, 108, 120, 137, 161, 192, 227, 258, 281, 294, 296, 285, 261, 232, 201, 170, 139, 115, 111, 131, 169, 214, 253, 276, 276, 253, 216, 181, 161, 159, 165, 161, 135, 98, 69, 64, 76, 94, 113, 141, 175, 199, 197, 179, 163, 158, 153, 140, 120, 104, 97, 97, 101, 109, 123, 142, 158, 166, 164, 157, 154, 162, 178, 198, 217, 234, 248, 252, 244, 227, 208, 189, 172, 159, 157, 171, 195, 217, 231, 241, 252, 265, 279, 292, 304, 310, 308, 302, 299, 295, 282, 257, 228, 199, 170, 138, 108, 93, 97, 113, 128, 136, 138, 140, 139, 134, 127, 123, 126, 137, 153, 170, 182, 187, 189, 191, 193, 188, 177, 165, 158, 156, 153, 152, 158, 175, 197, 218, 234, 248, 259, 263, 260, 253, 247, 239, 228, 213, 201, 199, 205, 206, 196, 182, 178, 180, 175, 162, 154, 159, 168, 163, 148, 138, 146, 168, 194, 220, 240, 244, 228, 202, 183, 181, 197, 226, 263, 299, 329, 352, 372, 386, 390, 380, 367, 358, 355, 356, 357, 357, 353, 347, 342, 342, 349, 358, 368, 377, 382, 380, 367, 349, 332, 323, 321, 319, 312, 300, 287, 278, 272, 267, 267, 274, 286, 291, 283, 265, 243, 220, 197, 180, 169, 161, 150, 134, 114, 94, 76, 67, 74, 95, 121, 145, 164, 177, 178, 170, 163, 164, 172, 184, 200, 217, 232, 247, 265, 290]
239B90L1K9J9Mj2k0j4ljj1j8j1jJqj5j8j3p%MOQJ1J0QQJ4J5Jk0l3k6qQJ5J2%j1j7j8j9k3k5
221A42k4j4kOQPJ1J3Qpj6pJ4K9L7M1M2L3J1j2k4k2j1jRR%j4k1k4k7l2l6k7rQJ5QjlJLloKJ4
202A28K0J5RMKoj1pKJ1J6K0J9J0j1k8k9j5LJ1O%llmnpj1j6j7pQJ8J6OJJMKKKJlnorroMJ5K0
182A58J9J5Qjqp%%l%QRkj6j8oPJ0PMjnoomKJ2K1K5K0J3Mok3l8m9m5l0oJ2J8J4QNKlmJMkj1
161A06j2mOJ0PLJMJ1J7J7RlrnPJ3Oj1k1j7oLRJ2J1OKMJ3K1K4J8OprjJ0J1Kqj2j3j4j4j1lJ
142A90Ljoj2j0lOLoj1o%jpnPJ4RJKJ6K7K2Lj2j7j4j4k3l3l4k2oOJ4K2K8L1K5J5PJjMJ4J6L
123B45j6j9jK8M6M8L5J2j6m4n4m4k3plnqnkLPJ6K0J7RKjnj3k3k9k9k4j5JJ7L1L4K9K0R%j1
106B32k0k9l0k7k2j9j3lORKnkNJ0RQPJ1J6K0J7J0MLLJpj3j4j4j4j7j8j8j4JK3M3M7L8K6J6
$$ y = [290, 321, 350, 369, 373, 361, 341, 327, 324, 323, 312, 294, 283, 282, 283, 275, 260, 242, 229, 222, 222, 226, 232, 240, 251, 261, 269, 277, 291, 306, 307, 287, 254, 228, 220, 228, 243, 255, 255, 244, 227, 209, 190, 167, 142, 118, 104, 102, 108, 116, 123, 134, 147, 155, 148, 132, 125, 139, 168, 205, 246, 288, 321, 332, 320, 296, 274, 263, 262, 271, 280, 280, 266, 245, 221, 194, 162, 126, 99, 90, 98, 113, 121, 120, 117, 118, 121, 118, 112, 114, 128, 148, 163, 172, 176, 178, 172, 161, 154, 156, 167, 183, 203, 222, 232, 221, 193, 164, 149, 152, 163, 169, 169, 166, 163, 159, 154, 147, 136, 120, 103, 96, 104, 122, 138, 144, 145, 146, 150, 152, 154, 156, 157, 154, 149, 143, 134, 125, 119, 123, 138, 158, 177, 192, 200, 199, 191, 184, 184, 184, 181, 181, 189, 198, 196, 180, 162, 156, 163, 173, 180, 184, 183, 178, 172, 166, 162, 164, 176, 197, 222, 242, 255, 259, 253, 230, 192, 143, 98, 68, 62, 74, 92, 106, 114, 119, 121, 118, 114, 115, 119, 117, 106, 94, 90, 96, 106, 113, 116, 117, 121, 132, 149, 166, 175, 172, 163, 158, 165, 178, 184, 173, 152, 135, 129, 132, 141, 153, 164, 170, 172, 176, 189, 210, 234, 252, 258, 251, 242, 241, 251, 262, 264, 256, 244, 231, 217, 203, 192, 189, 190, 193, 192, 186, 174, 164, 161, 167, 170, 164, 153, 147, 147, 146, 139, 134, 141, 155, 164, 165, 167, 183, 210, 232, 235, 223, 206, 192, 178, 155, 122, 88, 66, 60, 66, 80, 102, 130, 161, 186, 201, 208, 209, 208, 212, 226, 242, 245, 229, 210, 209, 237, 283, 331, 366, 378, 362, 318, 264, 220, 197, 190, 187, 182, 174, 169, 167, 170, 177, 193, 213, 230, 239, 241, 240, 235, 222, 199, 170, 141, 117, 102, 103, 120, 151, 185, 214, 234, 243, 243, 232, 212, 183, 153, 126, 104, 85, 72, 69, 75, 84, 86, 81, 79, 84, 94, 103, 111, 118, 129, 145, 165, 182, 192, 196, 199, 202, 203, 196, 183, 169, 155, 141, 124, 106, 88, 74, 75, 98, 141, 188, 226, 252, 268]
89B68QJrk2l5l7k4%J8K0J4J0J4K0K6K4J4ok1k6j9pLJ3J5J0LJOQ%j1j5j0MJ5J4Lj1j9j8j2j1
71B19j0ol%KKMPJ2J7J8J4J7K5K9K0%j7k6k8l2l0j9kJ2J2NkmjMORQJ1J7K4K6K2J2Jj2k3k5q
53C07J9L4K6Mj3j8j9k3k9l2l0k4j6pj%%JNPJ0J2J3J2RJ2J5J4RNQJ5K0J8Rlj5k2k4k3j8rLJ0
36B71RMlj2k4k7k5j8j3qJJ1J3N%KQQMMJ0J8J7Qmj1rmnn%J0J4J3PQJ1J4Pok3l7l8k9k0j3rm
16A30JKMJ2J8J8J7J9K6K6J9J0PLoj9k5k1pQJ2%k4l9l3k0j5k0k0qPJ1OMQJ4J6J2QQJ3J7J3M
-1B16nokJkpn%OMlplPJ8K3K2J6Ppj9k7k4j6rmkjmpj1oLJ0J0PQRLqj2jJ4J9J0loJJ1J8K0J9
-22B75J9J6J4J4J2Pkj2k2k8l0k6j6mMQRJ3J9K6K9L0K4J4%j5k2k2k1k0j8j0JJ2J5J4J3J1Kj3
-38C20k8l3k7j4pppKJ3J5Nqj6j2kJ2K3K2J1lj2j7k0k4k1j5nOJ8L5M7M8L4Pk1m1m5l6j8mKj
$$ y = [268, 276, 277, 268, 246, 211, 174, 150, 150, 168, 188, 202, 212, 226, 246, 272, 296, 310, 304, 283, 257, 238, 231, 234, 247, 262, 272, 275, 276, 282, 290, 290, 279, 264, 254, 258, 273, 287, 290, 279, 260, 242, 230, 219, 209, 203, 200, 200, 202, 204, 208, 215, 227, 244, 262, 276, 293, 318, 347, 367, 367, 350, 324, 296, 264, 234, 215, 213, 225, 237, 242, 240, 236, 235, 239, 245, 254, 262, 273, 290, 314, 340, 362, 374, 375, 363, 340, 315, 307, 326, 360, 386, 390, 377, 359, 340, 317, 288, 256, 226, 202, 186, 179, 178, 178, 178, 179, 184, 191, 201, 213, 226, 238, 247, 259, 274, 288, 297, 302, 310, 325, 345, 363, 372, 369, 354, 332, 308, 285, 267, 258, 261, 271, 280, 284, 281, 269, 245, 218, 193, 175, 162, 154, 155, 166, 179, 184, 184, 186, 194, 202, 206, 210, 220, 238, 255, 263, 259, 248, 239, 235, 230, 225, 225, 235, 249, 262, 269, 277, 288, 302, 309, 303, 280, 243, 205, 176, 156, 143, 134, 130, 131, 133, 137, 149, 167, 185, 202, 221, 247, 273, 292, 302, 309, 312, 306, 287, 262, 241, 234, 242, 254, 254, 230, 191, 158, 138, 123, 103, 83, 75, 82, 93, 99, 103, 111, 125, 141, 153, 161, 169, 182, 199, 212, 216, 211, 205, 203, 204, 202, 195, 190, 190, 196, 200, 197, 190, 187, 194, 212, 235, 257, 273, 280, 273, 254, 227, 203, 187, 178, 174, 172, 171, 167, 160, 149, 143, 146, 156, 166, 173, 181, 190, 193, 185, 173, 172, 186, 205, 215, 212, 206, 207, 218, 236, 256, 275, 294, 310, 324, 338, 350, 357, 355, 343, 321, 293, 263, 237, 221, 217, 221, 229, 238, 251, 270, 296, 325, 355, 379, 393, 393, 378, 356, 334, 313, 293, 275, 265, 266, 278, 293, 307, 320, 331, 333, 320, 292, 259, 232, 218, 211, 204, 197, 199, 212, 227, 232, 224, 208, 196, 194, 206, 229, 251, 262, 259, 247, 230, 210, 186, 165, 150, 145, 151, 169, 204, 251, 299, 333, 340, 319, 278, 233, 197, 179, 175, 177, 176]
-55A76l%PQ%qj0pljNJ3J7J3Mlnl%mj5k6k9k0nNNkrqjOKj%NNJMJ8L3M4M6M0K6Oj0j1lLKjop
-77B93olpj4k2k3j7rKJ3J6Jj9l2l2k2pQJ6J8J1RJ1J8K5K9K6J3jpkPJ2J3J2Lj3l1l6k7j5rr
-94A93j0ql%jqj0oKRJ1PMOJ2J6J5J2J4J5J0jrq%RJ3J5J0kj5k4k7k7k2j2LJ1J1Nmj1j6j6j4
-112A49j2j5j6j3qlJLQQLkorrpKJ2K0J8J1MLLJnqompj1qLJ3J4PMNNMOJ5K3K1J3J0J4K1K5K3
-132C23J3Jj2j8j9k1k4k5k0j2n%NOLmj2j7j8j3kOPKjkKNPNJkrj4j8k0j8j5nJ4K7K0lk1j8j
-151G8J1J1J3J8J7Pnj3j6k2k1qRJ7J1JJQJ8K4K3J2JkOJ3J1NNJ5K3K1J3Nlj0j8j4nLLK%mj6
-169B48k8k8j6kOJ1J1Pjj1j1mKLkrj3j4j3j3j3pJMMJJLMQJ5J9J6J1PQJ1K1L2L4J9mj6j6j2
-187B74j3j3qlnmLJ0J2QON%pj2j0pnk%LMKJ%KQJ0Npj2r%OJ1J1QJmnmqj3j4j3qmLJ0J3RKlq
$$ y = [176, 173, 173, 180, 188, 188, 180, 170, 163, 160, 159, 164, 177, 194, 207, 211, 208, 203, 200, 200, 196, 181, 155, 126, 106, 101, 106, 111, 109, 100, 92, 91, 97, 99, 98, 98, 103, 108, 109, 113, 131, 164, 208, 254, 294, 320, 326, 316, 305, 302, 305, 307, 306, 300, 293, 287, 284, 277, 263, 241, 218, 201, 192, 194, 207, 223, 224, 205, 173, 141, 119, 112, 120, 136, 154, 165, 174, 185, 203, 228, 257, 283, 296, 295, 288, 286, 293, 305, 318, 330, 333, 320, 289, 253, 226, 211, 202, 193, 183, 175, 172, 172, 171, 163, 153, 147, 149, 158, 169, 176, 180, 186, 198, 214, 229, 241, 255, 270, 280, 279, 270, 262, 262, 271, 284, 299, 309, 307, 292, 268, 241, 214, 192, 180, 183, 194, 205, 210, 206, 195, 179, 163, 149, 137, 122, 106, 93, 85, 82, 83, 86, 94, 102, 105, 103, 97, 88, 79, 72, 74, 86, 106, 124, 135, 139, 142, 145, 146, 141, 133, 127, 123, 116, 105, 97, 100, 113, 127, 134, 138, 143, 148, 152, 158, 173, 196, 217, 230, 240, 254, 275, 300, 323, 336, 337, 325, 307, 288, 267, 243, 218, 198, 186, 181, 181, 186, 192, 195, 191, 179, 162, 144, 131, 129, 135, 142, 144, 143, 141, 143, 148, 155, 160, 161, 159, 150, 136, 118, 98, 80, 65, 60, 74, 101, 121, 118, 97, 79, 78, 89, 100, 113, 131, 148, 155, 150, 137, 121, 99, 78, 70, 79, 96, 107, 108, 109, 117, 135, 159, 182, 194, 195, 193, 199, 212, 223, 228, 233, 248, 271, 292, 305, 310, 307, 297, 279, 265, 260, 263, 266, 268, 268, 264, 248, 220, 192, 176, 174, 180, 191, 202, 209, 208, 197, 186, 182, 184, 187, 185, 176, 163, 149, 136, 123, 110, 103, 104, 108, 112, 113, 114, 117, 121, 129, 144, 163, 179, 190, 197, 205, 216, 237, 269, 303, 322, 318, 302, 286, 274, 261, 248, 240, 237, 232, 228, 231, 241, 253, 261, 267, 272, 272, 265, 253, 243, 236, 231, 229, 229, 232, 236, 238, 239, 239, 241, 249, 259, 264, 257, 245, 236, 236, 242, 253, 264, 272, 273, 269, 264, 260, 252, 239, 225, 212, 204, 200, 203, 213, 226, 235, 237, 234, 226]
-208B26j0j3j9k2k1j5rqnMJ6K5K5J6NnqjOOJNJ7K8K5J2LMJ0J5J1Jqj2rnjKKkj0j4j5j9k3k3
-227A88j5l%knjORQJqj4j4j0j0qJJ5K6K9K7K5K2J5Nqj6j7rkjljQJ7J7Pkj4k7l8l8k3lJ2K1
-245A67K4K7K4J7RPO%j0j4qjJpj4j6j1rj0qn%%nqqlMPJ0J0RPPJ4K6L4K9J5Krj3j5j7k4l4l9
-264A68l3j7JJ0J1J1J7K5L0K8K0J2J0J2J5Rpk3k5j1NPqk4l1k6k0j3j2j4j3rjPJ7K6L0K3Po
-280B08j3j6j9j6oLJoqnlmprj0j6j7j4j1j3j6j4oOJ5K1K2K2J9J4PJ%LQJ3J4RKmmKJ1J6J3k
-299A91j8k6k2j2KJ3K3K7J9Jj2j2rj0j4j2LJ9K8K3J0lj0j3j2rmkjNJ6K4K1Qpj8k4k5j8mOM
-316A46konqj0oRK2K6K1J7J3J0Njnpj0j1j0oLQJ0RQRJ4K2K9K5J1pj8j8j3rrj2k1k7k4j3k%
-334A57nj0nNJ6K5L4L8L2K0Ooj0rlknrnPJ7J6OkkJJ%%MLlj3j7k0j9j9j9j8j8j2lPJ2QJppJ
$$ y = [226, 216, 203, 184, 162, 141, 126, 117, 109, 104, 108, 124, 149, 174, 190, 195, 190, 182, 181, 187, 193, 194, 199, 216, 244, 269, 281, 284, 288, 298, 313, 324, 325, 317, 305, 296, 291, 290, 292, 294, 292, 282, 268, 253, 234, 211, 188, 173, 170, 170, 168, 163, 162, 168, 177, 185, 186, 178, 164, 150, 140, 130, 122, 123, 138, 164, 193, 220, 245, 267, 282, 287, 279, 263, 246, 237, 235, 234, 231, 230, 238, 255, 272, 279, 277, 263, 236, 198, 160, 137, 134, 146, 167, 191, 218, 242, 259, 268, 275, 281, 281, 271, 257, 249, 248, 249, 242, 228, 212, 201, 192, 182, 174, 169, 169, 169, 164, 156, 148, 145, 149, 156, 166, 176, 185, 192, 199, 213, 239, 273, 302, 317, 319, 310, 297, 282, 265, 241, 207, 168, 135, 118, 119, 129, 140, 151, 168, 193, 223, 251, 271, 283, 293, 305, 320, 329, 322, 299, 274, 263, 268, 275, 267, 243, 212, 186, 166, 153, 141, 127, 114, 105, 104, 111, 128, 154, 184, 207, 214, 208, 195, 179, 160, 144, 138, 141, 142, 136, 128, 123, 120, 116, 109, 100, 90, 74, 57, 43, 32, 19, 3, -11, -17, -11, 4, 25, 47, 69, 88, 102, 109, 110, 110, 113, 121, 134, 148, 157, 159, 155, 151, 153, 164, 180, 193, 191, 173, 147, 125, 113, 115, 128, 151, 178, 197, 198, 186, 174, 165, 155, 141, 129, 132, 151, 179, 202, 212, 209, 199, 186, 174, 165, 161, 159, 158, 163, 179, 203, 224, 232, 225, 207, 183, 158, 140, 136, 142, 146, 144, 138, 133, 125, 115, 109, 118, 140, 166, 187, 204, 217, 227, 232, 231, 226, 219, 209, 198, 188, 182, 185, 193, 203, 212, 220, 229, 243, 265, 294, 319, 330, 323, 305, 287, 274, 265, 256, 244, 223, 196, 172, 159, 157, 157, 152, 142, 137, 142, 158, 183, 217, 255, 287, 307, 313, 307, 297, 288, 285, 283, 278, 269, 264, 271, 288, 304, 310, 308, 306, 307, 308, 308, 308, 312, 315, 312, 299, 282, 262, 243, 224, 205, 187, 169, 157, 154, 161, 173, 181, 182, 175, 168, 169]
-353A69J7L1L5K4Oj0j5j4j7k3l1l0j9pJ%j1k0k5j8kJ7L0K7J7Nnj1j2nMQ%j6k5k8k5j6kJ4J9
-370C7J5RJ1K0L2M4M5L3J1qj4pjJnj0j1j1j5k6l5l1j4NJ5J3Nj%OJ2J4J1Njj0j7j6nQJ4J5J9
-387A62K6K8J7NjJkj4k5k6j5JJ7K8K9J8jj5j7rjK%mmlloj0j3j4j0nKJ2J3Nj0j9j7mQJ7K7L3
-405B03L2K1QLKlj5k8l4k5qPJ2RMkrj4j7j4j0jJ4K9L7L1J9J0QJ1J9L0L3K4Kj6k0j2JRJ1Om
-422C63j3j4j3j2j7k4k7l1l2k4j1KRJ5K1K4J9QLMNKoj2j7k2k0qOJ5J9J7J6J2RQNJlkMOMlj1
-440B75j8k4k2j0OK0K3J4jj4j9j9j7j4rkNJ2J8J7Nj5k6j8%J2J2Jrk2l3l7k8j1NJ3RLJJMPJ3
-458A08J7J7J3PNjj1k3k9k5j5mOJ0J1J4K0K7K7K2J9J9K0K0K0J9J5QK%%lpnNPjj7k5k2j7j6
-475B37k0k1j1kKlnkJKLPJ2J4J7K6L5L4K1O%lj3k8l0j9lKJlnpj0p%%oj1qNJ8K4K2J3Krj9k7
$$ y = [169, 186, 217, 252, 276, 282, 272, 257, 243, 226, 203, 172, 142, 123, 116, 117, 117, 106, 86, 61, 43, 41, 58, 88, 115, 132, 137, 132, 121, 109, 104, 108, 116, 116, 100, 75, 47, 22, 6, 4, 18, 37, 52, 61, 72, 92, 124, 168, 213, 246, 257, 249, 235, 228, 227, 228, 223, 213, 202, 191, 176, 150, 115, 84, 70, 75, 90, 103, 108, 107, 107, 113, 125, 139, 150, 155, 154, 144, 127, 111, 106, 114, 128, 143, 162, 188, 216, 233, 238, 237, 238, 236, 222, 197, 171, 156, 157, 174, 202, 231, 249, 248, 233, 216, 207, 206, 208, 208, 204, 200, 197, 194, 188, 178, 165, 151, 141, 136, 138, 150, 163, 168, 158, 139, 122, 118, 126, 143, 170, 203, 235, 256, 264, 267, 269, 266, 251, 223, 189, 164, 156, 163, 175, 184, 188, 186, 177, 163, 146, 132, 122, 121, 135, 164, 201, 232, 251, 261, 269, 280, 299, 329, 362, 386, 388, 372, 352, 340, 341, 350, 361, 367, 363, 350, 336, 323, 311, 294, 270, 243, 212, 180, 156, 145, 147, 156, 171, 192, 216, 235, 243, 246, 250, 255, 257, 251, 239, 222, 200, 180, 172, 178, 193, 212, 229, 245, 257, 266, 274, 279, 280, 277, 275, 279, 285, 289, 286, 275, 257, 233, 211, 201, 207, 227, 250, 264, 263, 249, 230, 211, 194, 180, 171, 169, 174, 186, 204, 221, 226, 211, 185, 167, 167, 179, 191, 192, 183, 161, 128, 91, 63, 52, 57, 70, 79, 82, 83, 84, 88, 95, 108, 125, 142, 155, 162, 167, 166, 155, 132, 103, 78, 63, 59, 65, 75, 86, 100, 120, 147, 174, 196, 215, 234, 254, 274, 294, 313, 328, 336, 338, 338, 338, 335, 328, 323, 328, 335, 334, 317, 292, 270, 253, 237, 217, 196, 185, 183, 185, 182, 177, 175, 176, 178, 181, 188, 200, 214, 231, 257, 292, 326, 347, 353, 353, 350, 337, 309, 279, 260, 257, 259, 260, 257, 252, 245, 235, 228, 228, 228, 222, 211, 203, 208, 226, 250, 272, 285, 287, 278, 259, 232]
-494B32l0k9k1j4qmKNMjjMJ3J8J2JlLJ6K2K0J4QLpj3j2mOJ3J3J1QLkorj4k4l6l4k0jO%qnN
-513A36J9L3L6K8J1jrj9k4j7jNrk7k6kK2L0J9%j8j9mJ7K5J5MKLJpqjOJ0RKj2k5l2k2mQRKm
-532A61opj0j1pKN%pp%NLklJQJ1RNMJ0K0K9L2K0Jj1qOJ4J4Nnj2j3qLRJ3J2Plj5j7j2kNJ4K7
-552B89L0J9jj6k5k5k3j7j3j1j0qnpj2j4j1m%LMPJ6K1J9Prj6j7j4rjJ0J8K4K7K6J9J1QJ0P
-569C07nj9k8l1k9k2qJ4K9L1J9Lprj1j6j7j1kNM%mrj6k1k5k3j6nMJ2J9K5K0Nj1j3lPJ1J0J2
$$ y = [232, 202, 173, 152, 138, 130, 126, 128, 133, 137, 136, 135, 139, 152, 170, 182, 183, 180, 183, 199, 221, 241, 255, 263, 266, 259, 246, 234, 230, 236, 249, 262, 273, 281, 284, 282, 276, 267, 253, 229, 193, 159, 139, 138, 144, 144, 136, 131, 136, 155, 188, 224, 252, 263, 262, 253, 234, 210, 193, 192, 197, 188, 161, 135, 133, 155, 185, 204, 204, 186, 167, 163, 180, 205, 220, 224, 226, 229, 230, 223, 215, 214, 220, 230, 239, 241, 229, 204, 172, 150, 146, 154, 163, 165, 161, 155, 148, 138, 127, 120, 122, 127, 127, 120, 113, 113, 118, 121, 119, 116, 117, 125, 136, 145, 150, 154, 164, 184, 213, 245, 265, 266, 255, 247, 253, 267, 281, 286, 281, 269, 256, 248, 251, 260, 273, 285, 292, 289, 274, 257, 245, 243, 248, 262, 289, 319, 338, 337, 321, 296, 271, 248, 231, 218, 207, 197, 189, 184, 177, 165, 151, 140, 136, 136, 139, 143, 150, 166, 187, 206, 213, 204, 188, 171, 157, 148, 147, 157, 175, 199, 226, 252, 271, 282, 290, 300, 307, 302, 283, 255, 224, 195, 173, 165, 179, 208, 239, 258, 261, 254, 245, 234, 218, 201, 190, 188, 193, 197, 197, 193, 184, 168, 147, 122, 99, 83, 78, 82, 94, 113, 138, 158, 163, 152, 139, 136, 143, 154, 164, 176]
$$ [...]
-2084C64
##END=	
##END=	
