##TITLE=	Oct07-2021.33.fid
TM-VI-111 13C

##JCAMP-DX=	6.0	$$ MestReNova 14.3.1-31739
##DATA TYPE=	LINK
##BLOCK_ID=	1
##BLOCKS=	2    
##ORIGIN=	Mestrelab Research S.L.
##OWNER=	hrzepa
##$MNOVA/LINK_BLOCK_TYPE=	ITEM	$$ NMR Spectrum
##$MNOVA/ITEM/POLYGON=	(XY..XY)
5321,5835
8722,5835
8722,8208
5321,8208
5321,5835
##$MNOVA/ITEM/Z=	0
##$MNOVA/ITEM/ANGLE=	0
##TITLE=	Oct07-2021.33.fid
##JCAMP-DX=	6.0	$$ MestReNova 14.3.1-31739
##BLOCK_ID=	2
##DATA TYPE=	MNOVA NMR VIEW DATA
##DATA CLASS=	MNOVA VIEW DATA
##$MNOVA/ITEM/ZOOM/X=	-20.698776542268014111,	240.66949999422217843
##$MNOVA/ITEM/ZOOM/Y=	-75.963147163391113281,	703.03528594970703125
##END=	
##TITLE=	Oct07-2021.33.fid
##JCAMP-DX=	6.0	$$ MestReNova 14.3.1-31739
##BLOCK_ID=	3
##DATA TYPE=	NMR SPECTRUM
##DATA CLASS=	XYDATA
##NUMDIM=	1
##ORIGIN=	Bruker BioSpin GmbH
##OWNER=	nmr
##.OBSERVE FREQUENCY=	100.69424847706599735
##.OBSERVE NUCLEUS=	^13C
##.SOLVENT NAME=	CDCl3
##.PULSE SEQUENCE=	zgpg30
##LONGDATE=	2021/10/07 19:10:00.000
##.ACQUISITIONMODE=	SIMULTANEOUS (DQD)
##$ORIGINAL FORMAT=	Bruker XWIN-NMR
##$MNOVA/SCALES_VERSION=	9
##$PARAMETER FILE=	(acqus, ASCII, /private/var/folders/f6/rjf_tdyn2v98c5c0wvkgn4s80000gn/T/JfwiS3QySl+0lx$JnKe86g/33/acqus, 0)
$$ ##TITLE= Parameter file, TOPSPIN		Version 3.2
$$ ##JCAMPDX= 5.0
$$ ##DATATYPE= Parameter Values
$$ ##NPOINTS= 11	$$ modification sequence number
$$ ##ORIGIN= Bruker BioSpin GmbH
$$ ##OWNER= nmr
$$ $$ 2021-10-07 19:10:58.945 +0100  nmr@CZC10666PP
$$ $$ /opt/topspin/data/agmb/nmr/Oct07-2021/33/acqus
$$ $$ process /opt/topspin3.2/prog/mod/shimcntl
$$ ##$ACQT0= -2.01680680282977
$$ ##$AMP= (0..31)
$$ 100 100 100 100 100 100 100 100 100 100 100 100 100 100 100 100 100 100
$$ 100 100 100 100 100 100 100 100 100 100 100 100 100 100
$$ ##$AMPCOIL= (0..19)
$$ 0 0 0 0 0 0 0 0 0 0 0 0 0 0 0 0 0 0 0 0
$$ ##$ANAVPT= -1
$$ ##$AQSEQ= 0
$$ ##$AQ_mod= 3
$$ ##$AUNM= <au_zgonly>
$$ ##$AUTOPOS= <31 >
$$ ##$BF1= 100.683175
$$ ##$BF2= 400.41
$$ ##$BF3= 100.683175
$$ ##$BF4= 100.683175
$$ ##$BF5= 100.683175
$$ ##$BF6= 100.683175
$$ ##$BF7= 100.683175
$$ ##$BF8= 100.683175
$$ ##$BYTORDA= 0
$$ ##$CAGPARS= (0..11)
$$ 0 0 0 0 0 0 0 0 0 0 0 0
$$ ##$CFDGTYP= 0
$$ ##$CFRGTYP= 9
$$ ##$CHEMSTR= <none>
$$ ##$CNST= (0..63)
$$ 1 1 145 1 1 1 1 1 1 1 1 1 1 1 1 1 1 1 1 1 1 1 1 1 1 1 1 1 1 1 1 1 1 1 1
$$ 1 1 1 1 1 1 1 1 1 1 1 1 1 1 1 1 1 1 1 1 1 1 1 1 1 1 1 1 1
$$ ##$CPDPRG= (0..8)
$$ <waltz16> <> <waltz16> <> <mlev> <mlev> <mlev> <mlev> <mlev>
$$ ##$D= (0..63)
$$ 0 1 0.00345 0 0 0 0 0 0 0.06 0 0.03 2e-05 3e-06 0 0 0.0002 0 0 0 0 0 0
$$ 0 0 0 0 0 0 0 0 0 0 0 0 0 0 0 0 0 0 0 0 0 0 0 0 0 0 0 0 0 0 0 0 0 0 0 0
$$ 0 0 0 0 0
$$ ##$DATE= 1633630258
$$ ##$DE= 6.5
$$ ##$DECBNUC= <off>
$$ ##$DECIM= 760
$$ ##$DECNUC= <off>
$$ ##$DECSTAT= 4
$$ ##$DIGMOD= 1
$$ ##$DIGTYP= 12
$$ ##$DQDMODE= 0
$$ ##$DR= 21
$$ ##$DS= 4
$$ ##$DSPFIRM= 0
$$ ##$DSPFVS= 20
$$ ##$DTYPA= 0
$$ ##$EXP= <c13q>
$$ ##$F1LIST= <111111111111111>
$$ ##$F2LIST= <222222222222222>
$$ ##$F3LIST= <333333333333333>
$$ ##$FCUCHAN= (0..9)
$$ [...]
$$ ##$Sgu3PowerLevels= (0..7)
$$ 0 0 0 0 0 0 0 0
$$ ##$Sgu4PowerLevels= (0..7)
$$ 0 0 0 0 0 0 0 0
$$ ##$Sgu5PowerLevels= (0..7)
$$ 0 0 0 0 0 0 0 0
$$ ##$Sgu6PowerLevels= (0..7)
$$ 0 0 0 0 0 0 0 0
$$ ##$Sgu7PowerLevels= (0..7)
$$ 0 0 0 0 0 0 0 0
$$ ##$Sgu8PowerLevels= (0..7)
$$ 0 0 0 0 0 0 0 0
$$ ##$SguType= 3
$$ ##$ShimPowMaxUA= (0..63)
$$ 130000 130000 130000 130000 130000 130000 130000 130000 130000 130000 130000
$$ 130000 130000 130000 130000 130000 130000 130000 130000 130000 0 0 0 0
$$ 0 0 0 0 0 0 0 0 0 0 0 0 0 0 0 0 0 0 0 0 0 0 0 0 0 0 0 0 0 0 0 0 0 0 0 0
$$ 0 0 0 0
$$ ##$ShimPowMaxUC= (0..63)
$$ 130000 130000 130000 130000 130000 130000 130000 130000 130000 130000 130000
$$ 130000 130000 130000 130000 130000 130000 130000 130000 130000 0 0 0 0
$$ 0 0 0 0 0 0 0 0 0 0 0 0 0 0 0 0 0 0 0 0 0 0 0 0 0 0 0 0 0 0 0 0 0 0 0 0
$$ 0 0 0 0
$$ ##$ShimPowMaxUG= (0..63)
$$ 524287 524287 524287 524287 524287 524287 524287 524287 524287 524287 524287
$$ 524287 524287 524287 524287 524287 524287 524287 524287 524287 0 0 0 0
$$ 0 0 0 0 0 0 0 0 0 0 0 0 0 0 0 0 0 0 0 0 0 0 0 0 0 0 0 0 0 0 0 0 0 0 0 0
$$ 0 0 0 0
$$ ##$ShimPowRcbType= 3
$$ ##$ShimPowRes= (0..63)
$$ 1e-20 1e-20 1e-20 1e-20 1e-20 1e-20 1e-20 1e-20 1e-20 1e-20 1e-20 1e-20
$$ 1e-20 1e-20 1e-20 1e-20 1e-20 1e-20 1e-20 1e-20 0 0 0 0 0 0 0 0 0 0 0 0
$$ 0 0 0 0 0 0 0 0 0 0 0 0 0 0 0 0 0 0 0 0 0 0 0 0 0 0 0 0 0 0 0 0
$$ ##$ShimPowRng0= (0..63)
$$ 1 1 1 1 1 1 1 1 1 1 1 1 1 1 1 1 1 1 1 1 0 0 0 0 0 0 0 0 0 0 0 0 0 0 0 0
$$ 0 0 0 0 0 0 0 0 0 0 0 0 0 0 0 0 0 0 0 0 0 0 0 0 0 0 0 0
$$ ##$ShimPowRng1= (0..63)
$$ 1 1 1 1 1 1 1 1 1 1 1 1 1 1 1 1 1 1 1 1 0 0 0 0 0 0 0 0 0 0 0 0 0 0 0 0
$$ 0 0 0 0 0 0 0 0 0 0 0 0 0 0 0 0 0 0 0 0 0 0 0 0 0 0 0 0
$$ ##$ShimPowRng2= (0..63)
$$ 1 1 1 1 1 1 1 1 1 1 1 1 1 1 1 1 1 1 1 1 0 0 0 0 0 0 0 0 0 0 0 0 0 0 0 0
$$ 0 0 0 0 0 0 0 0 0 0 0 0 0 0 0 0 0 0 0 0 0 0 0 0 0 0 0 0
$$ ##$ShimPowRng3= (0..63)
$$ 1 1 1 1 1 1 1 1 1 1 1 1 1 1 1 1 1 1 1 1 0 0 0 0 0 0 0 0 0 0 0 0 0 0 0 0
$$ 0 0 0 0 0 0 0 0 0 0 0 0 0 0 0 0 0 0 0 0 0 0 0 0 0 0 0 0
$$ ##$ShimSysFunc= (0..63)
$$ 1 2 3 4 5 7 9 11 15 16 8 10 12 14 6 17 13 18 19 20 0 0 0 0 0 0 0 0 0 0
$$ 0 0 0 0 0 0 0 0 0 0 0 0 0 0 0 0 0 0 0 0 0 0 0 0 0 0 0 0 0 0 0 0 0 0
$$ ##$ShimSysMatrix= 0
$$ ##$ShimSysType= 1
$$ ##$TFXNUM= 0
$$ ##$TRIPLO2= 0
$$ ##$VTU= 2
$$ ##$VTUETH= <149.236.99.20>
$$ ##$VTUTY= <no>
$$ ##$WBREFAM= (0..15)
$$ 135 116 100 100 100 100 100 100 100 100 100 100 100 100 100 100
$$ ##$WBREFLM= (0..15)
$$ 0 0 0 0 0 0 0 0 0 0 0 0 0 0 0 0
$$ ##$WBREFPH= (0..15)
$$ 71.66 -68.25 0 0 0 0 0 0 0 0 0 0 0 0 0 0
$$ ##$WBSGU= (0..15)
$$ 0 0 0 0 0 0 0 0 0 0 0 0 0 0 0 0
$$ ##$XFAC= 2
$$ ##END=
$$ 
##$DECIM=	760
##$DSPFVS=	20
##XUNITS=	HZ
##YUNITS=	ARBITRARY UNITS
##FIRSTX=	24231.369385662510467
##LASTX=	-2084.0185409410978536
##DELTAX=	-0.40154708059210514337
##XFACTOR=	1
##YFACTOR=	0.044934070033991913018
##FIRSTY=	11.443268775939941406
##MINY=	-12.050847053527832031
##MAXY=	639.12298583984375
##NPOINTS=	65536
##XYDATA=	(X++(Y..Y))
$$ [...]
13332A01pkkqj8j9j2MK2L7L9K5Pmnklrj2j0%J3K2K1J3Jrj6k0j7qjJKJmj4k4k1qPJ6K0J9J7
$$ 101 94 92 90 82 64 45 33 37 59 96 135 160 167 163 158 156 153 144 132 122 122 135 157 178 191 192 183 167 147 130 122 121 122 124 125 121 107 83 62 54 61 77 97 116 133
13314A33J3J5K0K4K1K0K5L5L0Ok6m5m6l6k4j0J0L2M3L5J4pk1k8k9k1pOMpj8j8rNJ0RMK%KO
$$ 133 146 161 181 205 226 246 271 306 336 342 316 271 225 189 165 155 165 197 240 275 289 282 261 233 204 183 176 182 186 179 161 143 134 139 149 158 162 164 164 166 172
13297A72J6K8K7J2oj6j5j4j8k7k9k3j4mKNJ0J7K4K3J8J2J1J2J2Pnk5m8n6m6k7j0KJ0J6K2K7
$$ 172 188 216 243 255 249 233 218 204 186 159 130 107 93 89 91 96 106 123 147 170 188 200 211 223 235 242 237 212 164 108 62 35 25 27 37 53 75 102
13282A02K6K2J2Koj0j1plmqoNJ9K4J7Kj2j9j3jJ1J9J9J2lk1l3k7qJ2K5K5J1rj8rLOlrnQK5
$$ 102 128 150 162 164 158 148 137 130 127 123 115 109 114 133 157 174 176 164 145 132 131 142 161 180 192 189 168 135 108 100 112 137 162 173 164 146 137 140 146 143 134 129 137 162
13264A62M0M7L6J6JjLkj5k8l7m1l6k2nMJpj0kRJ5J4J1QOlj4k1k0j4nNJ6K5L0L3K8J5jj3j8
$$ 162 202 249 285 301 302 301 304 302 287 259 222 181 145 123 118 122 123 116 106 104 113 128 142 153 161 167 164 150 129 109 95 90 95 111 136 166 199 227 242 241 228 210
13247B10k2k6k6j7j0qj0qjMOPOjj7k8k3rPJ5J9K1K3K3K3J5Kj0j8j7j3rmJNLjj0j4j3oNJ1R
$$ 210 188 162 136 119 109 101 91 83 82 86 92 99 105 104 87 59 36 27 34 49 68 89 112 135 158 173 175 165 147 130 117 108 104 105 110 113 112 102 88 75 69 74 85 94
13230I4OPJ5K0J6J0J3K6L2K4MnmJjj0k0k2j6oKjj4k2j9mPPlj1pNJ3J1L%MNnk1l0k5j0MJ0Q
$$ 94 100 107 122 142 158 168 181 207 239 263 267 262 258 259 258 248 228 206 190 184 186 185 171 149 130 126 133 140 137 126 119 124 137 148 151 151 155 160 155 134 104 79 69 73 83 91
13211I1RJ2J8J9J4QNPONKKLLkk0m0n4m8k7qMOJ2K0K5J5%j3j2jPRN%%LJ1J5J3Kj0j8k0j5j1
$$ 91 100 112 130 149 163 171 176 183 189 194 196 198 201 204 202 182 142 88 40 13 5 9 15 27 47 72 87 87 74 62 61 68 77 82 82 82 85 96 111 124 126 116 98 78 63 52
13193E2mPK1L2L0J6NLPRMJjrj7k3j3MJ6J4LnmPK0K9K8J9PmmOJ9K3J3Korj5k1k2j5olkJQJ4
$$ 52 48 55 76 108 138 154 159 162 169 178 182 183 182 173 156 133 120 124 140 154 157 152 148 155 175 204 232 251 258 254 250 256 275 298 311 313 307 298 283 262 240 225 219 216 214 215 223 237
13174B37J6J1Kj2k7l4l1k3k0k3k3j1OK0K3K2K1J7Oqj1%J9L4L8L0J4Jpj2j7k0j9j6j4j4j2o
$$ 237 253 264 266 254 227 193 162 139 119 96 73 62 68 88 111 133 154 171 177 169 158 158 177 211 249 279 293 294 287 275 258 238 219 203 189 175 163 157
13158A57KKmj0oJ2K9L2J4pj8j7j8k3k4j9j2j0j3j8j9j6j3j0oOJ9K6J7KjQK1K6K6K6K6K0Pn
$$ 157 159 161 157 147 141 153 182 214 228 221 203 186 168 145 121 102 90 80 67 49 30 14 1 -9 -15 -9 10 36 53 55 54 62 83 109 135 161 187 207 214 209
13142B09j0pkjlqo%Jqj5rQJ7J1pj8j4kJ1K4L1L0J8Lnmnj0j4rKQLqj6j7j2mMQQ%j1j9j6plq
$$ 209 199 192 190 189 186 178 172 172 173 165 150 141 149 166 177 170 152 138 136 147 171 202 232 250 253 248 244 239 229 215 206 208 216 219 211 195 178 166 162 166 174 182 182 171 152 136 129 126 118
13123A18j6j3lLmj5j8j3rj1j5j1oNJ5K6L1L1K1%k1k9k2pNJ2J9K3K2J0kj0j3j7j9j0PK2K5J4
$$ 118 102 89 86 89 85 70 52 39 30 19 4 -7 -13 -8 7 33 64 95 116 116 95 66 44 37 42 54 73 96 118 128 126 116 103 86 67 57 64 86 111 125
13107A25%qp%KKJjjJPJ1J0Llnoj2j8j8j3polOK0K6K2J4J2J3Qkj3j3qnlj%NJ4K1J7ol2m6m1
$$ 125 125 117 110 110 112 114 115 114 113 114 121 132 142 145 142 137 131 119 101 83 70 63 57 54 60 80 106 128 142 154 167 175 173 160 147 139 134 131 130 130 135 149 170 187 181 149 103 62
13087F2k6j0RK4L0K1NmmJKkj0j8j5JK0L2L0J8O%%%qk5m2m4k7nPRPJ1J5J3J1J3J9J9Oj2k3k3
$$ 62 36 26 35 59 89 110 115 111 107 108 110 108 98 80 65 66 86 118 148 166 172 172 172 172 164 139 97 53 26 21 28 37 44 55 70 83 94 107 126 145 151 139 116 93
13070I3j1QK4K9K5J7J4J3Ook1l0l2l0j8lPPKorj0mJ0K4L1K6Nj4k6k5k2k2j9qPJ7J7J7J9K4
$$ 93 82 90 114 143 168 185 199 212 218 212 191 161 129 99 81 78 85 92 94 88 79 69 65 75 99 130 156 161 147 121 96 74 52 33 25 32 49 66 83 102 126
13053A26K4J4mj6j9j1%OPJ1J7J5Onj3j3rlLOOPOLjjK%j2k5k6j4OK1K5J4lj4j3pmolMJ1J2J1
$$ 126 150 164 160 144 125 114 114 120 127 138 155 170 176 171 158 145 136 133 136 142 148 155 161 164 163 162 164 164 152 127 101 87 93 114 139 153 150 136 123 116 112 106 103 107 118 130 141
13034A41J1J4K3L2L6K9J6QL%nponqj0rj1rnNJ2J2Mqj7k1k0j4jJ2K0J8J1NMRJ9L0L9M2M0L5
$$ 141 152 166 189 221 257 286 302 310 313 313 308 301 295 290 282 272 263 252 243 238 243 255 267 271 263 246 225 205 191 190 202 222 240 251 256 260 269 288 318 357 399 439 474
13017D74K9K4K4K8L1K7J7J3J6K0J9K1L5N6Q5J19J53J82K09K48L04L68M45N62P27R19J119J309
$$ 474 503 527 551 579 610 637 654 667 683 703 722 743 778 834 919 1038 1191 1373 1582 1830 2134 2502 2947 3509 4236 5155 6274 7583
13006G583J396J193N81k87j043j393j343j113q82o97n49m39l65l05k48k08j91j74j42j10r5
$$ 7583 8979 10172 10753 10466 9423 8030 6687 5574 4692 3995 3446 3007 2642 2337 2089 1881 1690 1516 1374 1264 1169
12997A169q4o6m4l4l6l5l7m4n2n0m6m3l7j4J4K7J9Qjj4l1m2l7k8k1j9j6j3rpqj5k4k8k3j0
$$ 1169 1085 1019 975 941 905 870 833 789 737 687 641 598 561 547 561 588 607 615 614 600 569 527 490 462 441 422 406 393 384 377 369 354 330 302 279 269
12983B69NJ5K0K0K2K8K7J5MNJ7K0Lk2l4k4kJ7K2J1mj6j5j1rrpqj1j7k1j9j4j0rn%NJj1k0k0
$$ 269 274 289 309 329 351 379 406 421 425 430 447 467 470 448 414 390 388 405 427 438 434 418 403 392 383 374 367 359 348 331 310 291 277 267 258 253 253 258 259 248 228 208
12966B08j3lRJ7J6Lrj5j3rpooqj1j2romLJ2J6Qnj1j7k3k2j1MJ0Nlpj2k3l2k8j6LJ9K7L2L2
$$ 208 195 192 201 218 234 237 228 213 200 191 184 178 172 164 153 141 132 126 122 125 137 153 161 156 145 128 105 83 72 76 86 91 88 81 69 46 14 -14 -30 -27 -8 19 51 83
12948H3K9K3J5NNJ1J5Qpj5rKPjqj0rj1j3j5j2j0ojQJ8K4K6K6K9K9K3J3%qj2j3pjK%mlnj2k1
$$ 83 112 135 150 155 160 171 186 194 187 172 163 165 172 171 163 153 144 133 120 105 93 83 77 76 84 102 126 152 178 207 236 259 272 272 264 252 239 232 231 233 233 229 226 221 209 188
12930A88k6k0pJLJKRJ4J1kj4j9j1MJ5J4PMJ0J7K0J5J0J1J2J0%j0j4j0kKMLkpj0j0qlKNOQR
$$ 188 162 142 135 136 139 140 142 151 165 176 174 160 141 130 134 149 163 170 174 184 201 221 236 246 257 269 279 279 269 255 245 243 245 249 252 250 243 233 223 215 212 214 219 225 233 242
12911B42J0J0QJ0Qmk5l7l5k5j2%RJ2KppNJ0MlmjlmkKLKKLlj0j2qm%OJ5J8J0kokOJ1J5J0lj6
$$ 242 252 262 270 280 288 284 259 222 187 162 150 150 159 171 173 166 159 164 174 178 175 171 170 167 163 161 163 166 168 170 173 170 160 148 140 136 136 142 157 175 185 183 177 175 181 192 207 217 214 198
12891A98k0j2jOOJoj1j2j5j8j9j1JOK%QJ5Pj0k1j5KJ6K0J7J2QOJmrj5k3l2l8l1j2MJ2J1J4
$$ 198 178 166 165 171 177 178 172 161 149 134 116 97 86 87 93 95 95 103 118 125 115 94 79 81 97 117 134 146 154 160 161 157 148 133 110 78 40 9 -3 1 13 24 38
12874C8K5M1M7M5L3J7Lqj1p%Jnj5k4k6k0j4ojNJ5K5K8J9Jj2j5nNQLoj2j1pKJ1J8J6QJknj0
$$ 38 63 104 151 196 229 246 249 241 230 223 223 224 219 204 180 154 134 120 114 113 118 133 158 186 205 206 194 179 174 179 187 190 184 172 161 154 156 167 185 201 209 210 208 203 193
12856A93j6j2JJ6K3K2J4LllLNkj6k4k0rkK%koj0j8k7l2k7j4kM%rj7j3KJ9K7K2J6J7K4K7J8
$$ 193 177 165 166 182 205 227 241 244 241 238 241 246 244 228 204 184 175 173 175 175 173 167 157 139 112 80 53 39 37 41 41 32 15 2 4 23 50 72 88 105 129 156 174
12839A74QJjpj8k6k2qQJ2Pmj3j8j7rKJ5K1J6QjnonjNJ4J8J5NjjLMLLPJ1J3Rjqj1j0rpkPJ0
$$ 174 182 183 182 175 157 131 109 101 109 121 128 124 111 93 76 67 69 84 105 121 129 128 123 117 112 111 116 130 148 163 168 167 166 169 173 176 179 186 197 210 219 218 210 199 189 180 173 171 178 188
12819A88%j4j6qOJ0RQJ7L4M9M8L3J4JpqJK1L9M4M1L7M0M6N3O7P8Q7J04J37J82K28K83L65M74
$$ 188 188 174 158 150 156 166 175 183 200 234 283 331 364 378 379 372 364 365 386 425 469 510 547 587 633 686 753 831 918 1022 1159 1341 1569 1852 2217 2691
12804B691N85O83P51P36N47J64l00o53p84p32o11m91l87k96k24j76j43j19j01q8p5n9m8m7
$$ 2691 3276 3959 4710 5446 5993 6157 5857 5204 4420 3688 3077 2586 2199 1903 1679 1503 1360 1241 1140 1052 977 918 870 823
12795H23n2n8o0n9n1l7k2j4j0j3j9l0m0l7k3mJ0J8K5L5L9L7K6Qj2l6n3o0m8k4JJ1PlqlORN
$$ 823 771 713 653 594 543 506 484 470 460 447 428 398 358 321 298 294 304 322 347 382 421 458 484 492 480 444 391 331 283 259 260 271 278 275 267 264 270 279 284
12779B84NJ2K0K2K0K0K0J2j2l6m8m2k5mJ5L2M0L4J6pk8l6l2j8JJ4J3kj7k1j0MRKorj0j2j5
$$ 284 289 301 321 343 363 383 403 415 403 367 319 277 252 248 263 295 335 369 385 378 350 314 282 264 265 279 292 290 273 252 242 246 255 257 251 242 232 220 205
12763B05j4oMPLpj4rOJ9K1J5Nnj2j7j7j3j1rkPJ1QMMjj8l8m4k5PK8K7J2kmMJ1J1MjnqqLK2
$$ 205 191 185 189 196 199 192 178 169 175 194 215 230 235 230 218 201 184 171 160 151 149 156 167 175 179 183 182 164 126 82 57 64 92 119 131 129 125 129 140 151 155 154 149 141 133 136 158
12744A58L8L8K0lk0k5k5k3k3k2j8j2lPK0L1L1J9N%OJ3J6J3Mrj7j6ojlrrmljNJ2J4Kj5k6k2
$$ 158 196 234 254 251 231 206 181 158 135 113 95 83 80 87 107 138 169 188 193 193 199 212 228 241 245 236 219 203 197 196 193 184 175 171 168 167 172 184 198 200 185 159 137
12727A37mJ3J8Rpj8j8j0LJ2J8K0K1K2K4K2J5Nj1k8m6n4m7k5JJ5J2mj7j5JJ9L2L0K2J5J2Rj
$$ 137 133 146 164 173 166 148 130 120 123 135 153 173 194 216 240 262 277 282 271 243 197 143 96 71 72 87 99 95 78 63 64 83 115 145 167 182 194 203 202
12711B02k1m4n1l9j6NJ7K0J4NJPK3L5L5K6J6J1Omj7k9l3k9k0j1kPJ5J8J3PLJjmk%LLLPNkr
$$ 202 181 137 86 47 31 36 53 73 87 92 93 100 123 158 193 219 235 246 252 248 231 202 169 140 120 109 107 114 129 147 160 167 170 171 170 166 164 164 167 170 173 180 185 183 174
12693A74rljjkLJ1J6J7J2PLJmj6l2l8k6nJ3J5Pkl%MRJ8K7L0J4j1l0l1k1j0lLJ3K4K7J9Opj4
$$ 174 165 162 161 160 158 161 172 188 205 217 224 227 228 224 208 176 138 112 107 120 135 142 140 137 137 141 150 168 195 225 239 228 198 167 146 136 133 136 149 173 200 219 225 218 204
12675B04j7j6oNRMqj2mJ0J9J7PKRK2K7J9PMQRjk0l8m5m1k7j1KJ1J8K3J9QmrqpomnqqjJ3K7
$$ 204 187 171 165 170 179 183 175 163 159 169 188 205 212 214 223 245 272 291 298 302 310 319 318 298 260 215 174 147 136 138 149 167 190 209 217 213 204 196 189 183 179 174 166 158 157 170 197
12656A97L0J5j0l5m4l3j2MN%jj%JNJ2J3QLOJ0Poj4j1jNNPJ4J8J7J0Klmk%%oj2j4j2lPJ9K0
$$ 197 227 242 232 197 153 120 108 112 117 117 116 115 115 116 121 133 146 154 157 163 173 180 174 160 149 148 153 158 165 179 197 214 224 226 223 219 217 217 217 211 199 185 173 170 177 196 216
12638B16Oqj1mJkkNQ%j4j9rPJ8K1J7Rlj4k3l0l0k4j0KQOkrj2j4j6k2k2j2LRPPJ3J9K0J3J1
$$ 216 222 214 203 199 200 198 196 201 209 209 195 176 167 174 192 213 230 239 236 222 199 169 139 115 105 107 115 121 119 110 98 84 68 46 24 12 15 24 31 38 51 70 90 103 114
12619A14J1J2J2PKnj0j1j0lPJ6K4K6K8K5J7Kj4k7k7k1j2j0j1rlOMnj6j7oJ0K7M1M5L6K0PJ
$$ 114 125 137 149 156 158 153 143 132 122 119 126 142 166 192 220 245 262 264 250 223 196 175 163 153 142 133 130 136 140 135 119 102 96 106 133 174 219 255 275 282 283
12603B83jqk1k9k6j5plmmoj0j2qLJ1J1Kpj1oLJ2Rok4l0k2pKOPJ4J6J2%qj3j3j2j0mRK4L8M5
$$ 283 282 274 253 224 198 183 176 173 169 165 159 149 137 129 132 143 154 156 149 138 132 135 147 156 150 126 96 74 67 69 75 82 96 112 124 124 116 103 90 78 68 64 73 97 135 180
12584A80M0K3Onj4k4k9k0jJ3J2%j0j4j4qLJ2J8J9K0K0J6Pkrj5j7j1KRPmj8k8k9j7MJ9J9On
$$ 180 220 243 249 244 230 206 177 157 156 169 181 181 171 157 143 135 138 150 168 187 207 227 243 250 248 239 224 207 196 198 207 214 210 192 164 135 118 122 141 160 166 161
12568A61j0j2j2j3j6j7j6j4j6j9j8j0%JkkLLkpqmPK7N3O3N3K9J1NPRPKj1k6l6l2j1J5L3K7
$$ 161 151 139 127 114 98 81 65 51 35 16 -2 -12 -12 -11 -13 -15 -12 -9 -11 -18 -26 -30 -23 4 57 120 173 202 213 218 225 234 241 243 232 206 170 138 127 142 175 202
12551B02Lk5l8l0j6roJJ4K6L1K7J8RMOJ4J8J4%k0l3m1m5m4l2j0J7M2N8O1M8K1nj8j5kJ0J7
$$ 202 205 180 142 112 96 87 81 82 96 122 153 180 198 207 211 217 231 249 263 263 243 210 169 124 80 48 38 55 97 155 216 264 285 280 262 247 245 255 272
12535B72J3Mpj2j6j5j4j2j3j6j9j3oqj4k0j4kNOM%qj1mJ4L0K9J5kmPJ7J9J2N%oj4k0j5%J8
$$ 272 285 289 282 270 254 239 225 213 200 184 165 152 146 138 124 104 90 88 93 99 103 103 95 84 80 94 124 153 168 166 162 169 186 205 217 222 222 216 202 182 167 167 185
12518A85K8K7J2kplNMjlnnmkJjmnmkpj5k2k2j2KJ4J9J7J2RKmmLRPlo%P%j9l5l3j7oqj3rKJ0
$$ 185 213 240 252 250 243 240 245 249 248 245 240 235 231 229 230 229 225 220 216 214 207 192 170 148 136 138 152 171 188 200 209 211 207 203 206 215 222 219 213 213 220 220 201 166 133 116 110 102 89 80 82 92
12497I2Mj0k1j5JJ8K7K4J4jj3j8rQJ9J8J1OLjnlNJ1J6J9J8J1Knpqj0j0j1j1j2qlJK%jKJ1J9
$$ 92 96 86 65 50 51 69 96 120 134 133 120 102 93 101 120 138 149 155 158 157 152 149 154 165 181 200 218 229 231 226 219 211 201 191 180 169 157 149 146 147 149 149 148 150 161 180
12478A80K4K0Rnj6k8l3k6j0MPLKOJ0J4K2L0K7J4%prqqlJJpj8k4k7k6k1rJ2L5M5L7J4lj1j2
$$ 180 204 224 233 228 212 184 151 125 115 119 126 129 131 137 147 161 183 213 240 254 254 247 238 230 222 219 220 221 214 196 172 145 119 98 89 101 136 181 218 232 229 218 206
12461B06j2j1ojjj1k4l2l2k4j1KQPJ%kqj7k1j6pPK5N0N9M3Qk1k3%K2K9K0jk2l7l8k2lMKLJ5
$$ 206 194 183 177 176 175 164 140 108 76 52 41 43 51 58 59 59 57 49 32 11 -5 -12 -5 20 70 129 172 180 159 136 136 158 187 207 206 184 147 109 87 84 88 90 93 108
12444A08L0L2J3j2k5k4k1j9j6nNJ0J0J0J2J2J2RKpj5j7rMJ4J7J5ROPNKj%KOPJj3k4k5j0J1
$$ 108 138 170 183 171 146 122 101 82 66 61 66 76 86 96 108 120 132 141 143 136 121 104 95 99 113 130 145 154 160 167 172 174 173 173 175 181 188 189 176 152 127 117 128
12426A28K1J5kj4j9j7j3j0p%J2K2K8K6J7Pmrm%JlnkJJJJNJ4K4L3K9J2j1k5k9k1j2pj3k3l0
$$ 128 149 164 162 148 129 112 99 89 82 82 94 116 144 170 187 194 190 181 177 177 178 175 170 168 169 170 171 172 177 191 215 248 277 289 278 253 224 203 191 184 171 148 118
12409A18k6j2RK6L7L6K9J8J0LJJLJkon%Ljrj7k4k5k3k0j9j4kMOKKMMK%lmnnll%j%MJ7L4M5
$$ 118 92 80 89 115 152 188 217 235 245 248 249 250 253 254 252 246 241 241 244 243 234 217 193 168 145 125 106 92 90 94 100 102 104 108 112 114 114 111 107 102 97 94 91 91 90 90 94 111 145 190
12389A90M0K6J6J2Nlrj4k3l4l6k6j3njJKkqj0rrj0pkJkmopqnNJ1J3QQQOKJOOnk2l6l8l3k6
$$ 190 230 256 272 284 289 286 277 263 240 206 170 144 131 126 125 126 128 126 118 108 99 90 80 73 71 72 70 66 60 53 45 40 45 56 69 77 85 93 99 101 102 108 114 109 87 51 13 -20 -46
12369d6j3LJ1J0RJ8L2L9K5OmJRJ2Noj4j3rlMJ3J8J3LlLJ4J9J7Plj7k6k9k7k1j4nPJ6K4K6K6
$$ -46 -59 -56 -45 -35 -26 -8 24 63 88 94 90 91 100 112 117 111 97 84 75 72 76 89 107 120 123 120 123 137 156 173 180 177 160 134 105 78 57 43 38 45 61 85 111 137
12352A37K0J1LJLM%llJPJ2J5J3N%KQJ6J9J7J0Lmj0j7k3k8k2pJ2K1J1j0k4k3rOJ6J8J3Jk0m1
$$ 137 157 168 171 172 175 179 179 176 173 174 181 193 208 221 226 226 228 236 252 271 288 298 301 297 287 270 247 219 197 190 202 223 234 224 200 177 168 174 190 208 221 222 202 161
12334A61n3m3j5J5L1L0K1J2O%rk0k8k9j7%J8L0L3K9K0RJrj6j4jJ5K1J3LKjj0k2k7j6JJ2J7
$$ 161 108 65 50 65 96 126 147 159 165 165 156 136 108 79 62 62 80 110 143 172 192 201 202 193 177 163 162 177 198 211 214 216 215 205 183 156 140 141 153 170
12318A70J5RLlrj4j4qLJ4J6RKmj2k1k9k8j7rmnkNPPNPJ0J3J1RNJjmmjjLQJ3J5J2OkqmRJ8J2
$$ 170 185 194 197 194 185 171 157 149 152 166 182 191 193 189 177 156 127 99 82 73 69 64 62 67 74 81 86 93 103 116 127 136 141 142 141 137 133 132 131 134 142 155 170 182 188 186 178 174 183 201 213
12297B13rk0j6j0j2j9j3LJ4J0kpnnmjOJ3J4RLLJ1J7J2kj6k8l5m1l3j5NJ5K2L0L7L7K4QlmO
$$ 213 204 184 168 158 146 127 114 117 131 141 139 132 127 122 118 117 123 136 150 159 162 165 176 193 205 203 187 159 124 83 50 35 40 55 77 107 144 181 205 213 210 206 212
12280B12K2L1K3Kj6k1j6j1pqj2j5j1%J2J4Omj1j4qNJ8K3K0J4Pnk3l8l9k5mPPjqj1j4k0k4k0
$$ 212 234 265 288 290 274 253 237 226 219 211 199 184 173 173 185 199 205 201 190 176 168 173 191 214 234 248 255 250 227 189 150 125 121 128 135 134 126 115 101 81 57 37
12263C7mJ6L0L0K1J2MjnnjLMQJ1J0jqnQJ9J9J0kj0j1mMNjjOJ4J1K%LOL%%JNRJ1P%mlLRPmj8
$$ 37 33 49 79 109 130 142 146 145 140 135 134 137 141 149 160 170 169 161 156 164 183 202 212 210 200 189 185 189 194 193 192 198 212 223 225 225 228 234 237 237 237 238 243 252 263 270 270 266 263 266 275 282 278 260
12242B60k4j7mKjlJJ0J0Jpoloj1rKJ5K2K3K6K6K2J9K7L7M1L6K8K2J5J4K1L0L0K9L8N2N9N5
$$ 260 236 219 215 217 216 213 214 224 234 235 228 222 219 213 202 193 195 210 232 255 281 307 329 348 375 412 453 489 517 539 554 568 589 619 649 678 716 768 827 882
12226H82N2O2Q2J07J37J66J82J92K25K86L62M49N71P32R13J107J307J410J204N65l33j097
$$ 882 934 996 1078 1185 1322 1488 1670 1862 2087 2373 2735 3184 3755 4487 5400 6507 7814 9224 10428 10993 10660 9563
12217I563j435j377j146r17p25n60m37l54k89k26j82j65j58j41j18j02r6q9p8o2m7l9m1m8
$$ 9563 8128 6751 5605 4688 3963 3403 2966 2612 2323 2097 1915 1750 1592 1451 1333 1231 1135 1046 968 906 859 820 779 731
12207G31m9l6j6mjj3k9l9l8l0k0qJ0K3K2Rkpj2j9k0j2qpo%jj6l3m0l4k4j5JK0K6J6KlNJ5J3
$$ 731 682 646 630 626 625 612 583 544 506 476 456 448 458 481 503 512 510 503 491 472 452 440 432 425 419 419 418 402 369 329 295 271 256 257 277 303 319 321 318 323 338 351
12190C51LolJlj2j0QK8L2K1OmojPPok8m8n4m6l5k5k5k5k3j3JJ4J7J2NLJ0J6J5%j7k8k7j6%
$$ 351 354 348 345 346 343 331 321 329 357 389 410 416 412 406 405 412 419 413 385 337 283 237 202 177 152 127 104 91 92 106 123 135 140 143 153 169 184 184 167 139 112 96 96
12173I6J2J2NmrqmNJ8K4K2J6J2Plj0oRK6L1K6J6Lj2k4k3rMOJmKJ1J8J6Rmk1l1k5j2jJkqk1
$$ 96 108 120 125 121 112 104 100 105 123 147 169 185 197 204 201 191 185 194 220 251 277 293 296 284 260 237 228 232 238 239 235 237 248 266 282 291 287 266 235 210 198 197 198 196 188 167
12154A67l1k7nJ8L0K8K2J5PKJMLk%NJ1J2RLoj4j3j1j1j4j1lLNMKnk2l8m2l2j2RL0M3M2L2J8
$$ 167 136 109 104 122 152 180 202 217 224 226 227 231 234 232 232 237 248 260 269 272 266 252 239 228 217 203 192 189 192 197 201 203 198 176 138 96 64 52 61 91 134 176 208 226
12137B26Nkmljnj2j9k5k8k8k0j1kLQJ1J4J2J0J0RKnrpKJ1K0K3K2J4PJlj1k3k9k5j1NJ4K1K4
$$ 226 231 229 225 222 221 216 204 185 160 132 104 84 73 71 74 82 93 107 119 129 139 148 150 145 136 129 131 142 162 185 207 221 228 229 226 215 192 163 138 127 132 146 167 191
12119A91K3J3LJMLJk%Jnj9k8l0k6j9j2ol%LOQONNQMnj6k1j8rkNJ6K5K6J8OJjKKJkrj2j2rj0
$$ 191 214 227 230 231 235 238 239 237 237 238 233 214 186 156 130 111 99 93 90 90 93 99 107 113 118 123 131 135 130 114 93 75 66 64 69 85 110 136 154 160 161 160 162 164 165 163 154 142 130 121 111
12099A11j1pjQJ3K2L3M0L5K0Lj2k1k8l1k8k1j1lNJ0J0PJnolKPPPPOOLoj4j5rl%NJ5K4K2J2
$$ 111 100 93 92 100 113 135 168 208 243 263 266 254 233 205 174 146 125 114 111 116 126 136 143 144 139 133 130 132 139 146 153 160 166 172 175 169 155 140 131 128 128 133 148 172 194 206
12080B06K%koj2j5j2qKJ5K2J9QkqpnjJNJ1J8J9Qpj3j3j7k5l0k2nMLln%QJ7K4K7K8K5J9Pok0
$$ 206 208 208 206 200 188 173 161 153 155 170 192 211 219 217 209 202 197 196 197 202 213 231 250 258 251 238 225 208 183 153 131 126 130 133 130 125 125 133 150 174 201 229 254 273 280 274 254
12061B54k9k8j9j1j1j1qmnj2k1k4k1j5rmjj%%KJ1K4L7L8K8J1qk0j8mPKqj0JJ5J6J1Koj4j7
$$ 254 225 197 178 167 156 145 137 133 128 116 95 71 50 35 26 22 21 20 20 20 22 33 57 94 132 160 171 163 143 125 121 128 130 122 112 113 128 144 155 157 151 137 120
12044A20rQK3L1K5J3kj0rnooonprj1j0mNJ4J8J4J2K0K8K8J3ok3l3l6l0j6kQJ1MmqkNPL%Jl
$$ 120 111 119 142 173 198 211 209 199 190 185 179 173 167 162 155 146 135 125 121 126 140 158 172 184 204 232 260 273 267 244 211 175 145 129 127 135 146 150 146 138 136 141 148 151 151 152 149
12025A49qj4j8k1j6kJ6K6K6J8J0kj1j4oLMJKPMpk2k9k2oJ0K1K8L1K5J1jn%LJpj8k3k2j8j5
$$ 149 141 127 109 88 72 70 86 112 138 156 166 164 153 139 133 136 140 141 143 150 154 147 125 96 74 68 78 99 127 158 183 194 193 188 188 191 192 185 167 144 122 104 89
12008H9j6j1MK6L7L2J8NkprqmJKkj1j7j4n%jLJ3J9J5N%mj1j6j2lNKk%QJ9K2J7QLMOKlkLLo
$$ 89 73 62 66 92 129 161 179 184 182 175 166 158 154 155 157 155 144 127 113 108 108 107 110 123 142 157 162 162 158 147 131 119 116 121 123 121 121 129 148 170 187 195 198 202 208 210 207 205 208 211 205
11987B05j9k9k8j8nPJ3J4J9K3K5K3K1K5K9L3L4K7J5Moj8l6n4n7m6l0j8j1ojOJ1J3Pj%J2K3
$$ 205 186 157 129 111 106 113 126 140 159 182 207 230 251 276 305 338 372 399 414 418 412 394 358 304 247 201 171 153 142 136 135 141 152 165 172 171 171 183 206
11972B06J9Nj0j9k1j5nLNJJLMlj4k5l0k7j4kONJ%KKoj9k9k8j6%J3J7J5LmlJOJ0J7K4K4J1k
$$ 206 225 230 220 201 180 165 160 163 168 169 170 173 177 174 160 135 105 78 64 62 68 73 74 74 76 78 72 53 24 -4 -20 -20 -7 10 25 28 24 21 22 28 38 55 79 103 114 112
11953A12mMJ5K1K2K0J8J5RJj0j7j4p%QJ5J6Rjmoj3k1k5k3j7j1kNO%l%NPON%pj0mK%rj3ok%
$$ 112 108 112 127 148 170 190 208 223 232 233 223 206 192 185 185 193 208 224 233 232 228 222 209 188 163 140 123 112 110 115 121 121 118 118 123 130 136 141 141 134 124 120 122 122 113 100 94 92 92
11934I2LJ0K0K0J1JkJOMJ%NRPJKKpk5l8l5k1rJJ2K3K7J9Lj1j9k1j7j0JO%j3k1j4OK6L4L1K4
$$ 92 95 105 125 145 156 157 155 156 162 166 167 167 172 181 188 189 191 193 186 161 123 88 67 58 59 71 94 121 140 143 132 113 92 75 65 66 72 72 59 38 24 30 56 90 121 145
11915A45J4LmojJKMJ0J5J4RKkm%PJ4J8K3K6K3Rj0k6l6m3m4l8k3mJ2K3K5K2J3Kj1k1k7k6k2
$$ 145 159 162 158 152 151 152 154 158 168 183 197 206 208 206 202 202 209 223 241 264 290 313 322 312 286 250 207 163 125 102 98 110 133 158 180 193 195 184 163 136 110 88
11898H8j5oNJ6K5K7K7K3J1j0k7k6j0PJ1lk0k8k5k1j9j8j0JNJjPK0K6J6kj5j0LJ5J7RNORJ3
$$ 88 73 67 72 88 113 140 167 190 201 191 164 138 128 135 146 143 123 95 70 49 30 12 2 3 8 9 8 15 35 61 77 75 60 50 53 68 85 94 99 105 114 127
11881A27J4J5J2Mlpj1j0lJ0K4K7K2J7J4J0MjJLJoj0j1j3j8k2j6qjJOJ4J8J7J1ONQROkj1j7
$$ 127 141 156 168 172 169 162 151 141 138 148 172 199 221 238 252 262 266 265 266 269 270 264 254 243 230 212 190 174 166 165 166 172 186 204 221 232 238 243 251 260 266 264 253 236
11864B36j5nOJ6K1J6Jk0l4l7k7j6lNP%rj5j6j3j1q%PJ3J4J4J2Olj5k2k0j3mLRRKnjJ3L0L5
$$ 236 221 216 222 238 259 275 276 256 222 185 158 142 139 144 151 151 142 127 111 98 87 79 79 86 99 113 127 139 145 142 127 105 85 72 68 71 80 89 91 86 85 98 128 163
11846A63L5L1K5J1mj1j0rpmJkj3k4k5j8pJRJ6J9J5Rjj0j8k0j7j0kONlj3j5j0lJPRPKMQRkj4
$$ 163 198 229 254 265 261 250 240 231 224 220 221 219 206 182 157 139 132 133 142 158 177 192 201 200 190 172 152 135 125 123 129 134 131 118 103 93 90 91 98 107 114 116 120 128 137 135 121
11827A21j8j1%RJ4J7J8J4QNPJ2Qnj5j5plmnj%mj2j2jJ1J4Nj0k2k5j8nRK3K8K4J1qk3k8k4j3
$$ 121 103 92 92 101 115 132 150 164 172 177 184 196 204 199 184 169 162 159 155 150 149 149 145 133 121 120 131 145 150 140 118 93 75 70 79 102 130 154 165 157 134 106 82 69
11810F9oJJ2K3K8K2Poj2j1pprj3j2oKPPOKlmLPO%kKNLOK3M2M3K5Jj8k7k8j8lJ2J6J1L%KNL
$$ 69 63 64 76 99 127 149 156 150 138 127 120 113 104 91 79 73 75 82 89 95 97 94 90 93 100 106 106 104 106 111 114 120 143 185 228 253 254 236 209 181 163 160 172 188 199 202 202 204 209 212
11789B12qk7m5n4m6k2JJ3J0LLQJ4K2K9L4K8J3oj9k5j8jJ6K5K2J5J0NLNRQ%j1k2k8k9k0lJ2
$$ 212 204 177 132 78 32 10 11 24 34 37 40 48 62 84 113 147 175 188 182 163 138 120 119 135 160 182 197 207 212 215 220 229 237 237 226 204 176 147 127 124 136
11773A36J5QMPJ3K0K0J0mj6k1k3k8l0k6j6nMJ6K4K1J0mj3k1k5k1j2olJQJ0LlkJjj1j2JK3L8
$$ 136 151 159 163 170 183 203 223 233 229 213 192 169 141 111 85 69 64 68 84 108 129 139 135 122 101 76 55 43 37 34 35 43 53 56 53 51 52 51 40 28 29 52 90
11756I0L8K6Rmj2j6j9k3k5k8k8k4j9j6j8k2j8rKJ2J9K8L9M7N5N0L8K8K3K1J8J3Qkk0l2k9j1
$$ 90 128 154 163 159 147 131 112 89 64 36 8 -16 -35 -51 -69 -91 -109 -118 -116 -104 -85 -57 -18 29 84 134 172 200 223 244 262 275 283 281 261 229 200 189
11740A89LNlpjPJ2J0Lpj6k1k0j7j4rprj1j1nJPJ0RLoj2rnlpj0nJRJ6K5L2K4Kj8k7k0j1jQK0
$$ 189 192 197 194 187 186 193 205 215 218 211 195 174 154 137 123 114 107 98 87 76 71 72 79 89 98 101 95 83 74 69 66 59 49 44 45 54 70 95 127 151 153 135 108 88 77 76 84 104
11721A04K7K8K1J2QPPkj3k0j9j7j8j8j4ponjPQJqqlKJoj9l1l2k6j8j7j5qNJ6K0J7J0NQJ8K8
$$ 104 131 159 180 192 200 207 214 212 199 179 160 143 125 107 93 86 80 75 74 81 89 90 82 74 71 73 74 68 49 18 -14 -40 -58 -75 -90 -98 -93 -77 -57 -40 -30 -25 -17 1 29
11703B9K8J9J1KkNK2L2J8qk1j4%NNPJ3J3Olonmnrj0jQJ3J1QQOKJNPJoj0pmnrj8k5k4j3mmo
$$ 29 57 76 87 89 87 92 114 146 164 156 135 121 121 126 131 138 151 164 170 167 161 156 152 147 138 128 127 135 148 159 167 175 181 183 184 189 196 197 191 181 174 170 165 156 138 113 89 76 72 68 62
11683F2%J6K7L1L0K9K0Kj7k7l2l6l8k9j2PJ9J6Ooj0rrj0rojLJ4K9M1L9K8J4%j6k7k6j8oKO
$$ 62 62 78 105 136 166 195 215 217 200 173 141 105 67 38 26 33 52 68 74 68 58 49 40 30 21 15 14 17 31 60 101 140 168 182 182 166 139 113 95 89 91 97
11666I7QPLMKnj4j7j1lJNRJ7K2K5K5K4K0J3Nnj4j8j9j6j0MJ7K3K1J5J2PLJPQmk0k5j3PK3L3
$$ 97 105 112 115 119 121 116 102 85 74 71 72 77 86 103 125 150 175 199 219 232 237 232 218 200 181 165 155 159 176 199 220 235 247 254 257 258 265 273 269 249 224 211 218 241 274
11648B74L4K5Oj3k2k6k6j9nPQ%jNQkk1l8m6l9k0%J3J6J5Rlk6m3m3k6oMNQJ1J4J3J5J5J5J4
$$ 274 308 333 339 326 304 278 252 233 228 235 243 243 242 247 255 253 232 194 148 109 89 89 102 118 133 142 139 113 70 27 1 -5 -1 4 12 23 37 50 65 80 95 109
11631A09J0PPQJ2J4J3Loj1j3j5j6j4pk%LJ4K6L2K7J8J0Mlj5k4l0l3k7j6jRMnj2qmpj4j1LJ8
$$ 109 119 126 133 141 153 167 180 183 177 166 153 138 122 108 101 99 99 102 116 142 174 201 219 229 233 230 215 191 161 128 101 85 84 93 97 92 80 72 68 61 47 36 39 57
11613E7J9OkKJ6K5K3J5LkkNJ0J0NLKMOJ0Q%j0j2mOJ4J6Rmk1k6j9o%lnj0j5j8j4lLjqj4j5j7
$$ 57 76 82 80 82 98 123 146 161 164 162 160 165 175 185 190 193 195 199 205 215 223 223 213 201 197 203 217 233 242 238 217 191 172 166 166 163 158 148 133 115 101 98 101 100 92 78 63 46
11594D6j2KK3L4L3K5J4Pjqj1j1rommqj1j1qmnj2j7j0OK1K0QJLJ1J3O%%MM%mkNJ3J7J9J8J5
$$ 46 34 36 59 93 126 151 165 172 171 163 152 141 132 126 122 118 110 99 88 80 76 71 59 42 32 38 59 79 87 88 91 102 115 121 121 121 125 129 129 125 123 128 141 158 177 195 210
11575B10J5J1Jj4k9l5l4l0k6k1qQK0K1J7J1PL%jMJ3J8J7Qjnmlmoj0j3k0k3j6nNOJ%MPN%mp
$$ 210 225 236 237 223 194 159 125 95 69 48 40 48 68 89 106 117 124 127 127 126 130 143 161 178 186 185 180 176 173 169 163 153 140 120 97 81 76 81 87 88 88 92 99 104 104 100 93
11556I3qnKJ6K8L1K2QmomMRQJqrmLONJj2k5k6j5jmj5j8lJ5J9J2Koj4k1k6k5j5jK0L5L5K6J8
$$ 93 85 80 82 98 126 157 179 187 183 177 173 177 186 194 195 187 178 174 177 183 188 189 177 152 126 111 110 106 91 73 70 85 104 116 118 112 98 77 51 26 11 10 30 65 100 126 144
11537A44J8K0J8J2J0J7K1J7Mj0k2l5m6m4k5KK3K8K3J7J2PKKK%lmorj2qlmj2j6j6j2qlOJ4J1
$$ 144 162 182 200 212 222 239 260 277 281 271 249 214 168 124 99 101 124 152 175 192 204 211 213 215 217 217 214 210 204 195 183 175 172 168 156 140 124 112 104 101 107 121 132
11520A32N%KKlprj1j3j5j0k%%LJ3K4K7K2J4J1J0Lqj9k6k7k6k4j4JJ6K3K2J2kj5k3k2j0JOL
$$ 132 137 137 139 141 138 131 122 111 98 83 73 71 71 71 74 87 111 138 160 174 185 195 198 190 171 145 118 92 68 54 55 71 94 116 128 126 111 88 66 56 57 63 66
11503F6NJ5K1J8P%LQNJKQJ2R%rj2lQJ5J3J1J8L2M2L4Rj7l6m0l6k8k2j8k2k8l3k4nJ8K8K3J3
$$ 66 71 86 107 125 132 132 135 143 148 149 151 159 171 180 180 171 159 156 164 179 192 203 221 253 295 329 338 321 285 245 209 181 159 141 119 91 58 34 29 47 75 98 111
11485A11Jpj1rjOROPOLqj8k3k0j2nLJ1J7J8J3NLNNjrj2qmpj1rkNQJ1J2J0Njmnm%NO%kKJ0J1
$$ 111 112 105 94 85 84 90 99 105 112 118 121 113 95 72 52 40 35 38 49 66 84 97 102 105 110 115 114 105 93 85 81 74 63 54 52 57 65 76 88 98 103 102 98 93 89 89 94 100 100 98 100 110 121
11464A21PKMNK%JNJ2K0K5K2J3MPJ2J1NJKKnj5j9k1k3k5k7k3j7j0olkJLMJkj%konKRRQJ1J6
$$ 121 128 130 134 139 141 141 142 147 159 179 204 226 239 243 250 262 273 278 279 281 283 278 263 244 223 200 175 148 125 108 98 92 89 87 88 91 95 96 94 93 93 91 85 80 82 91 100 108 119 135
11444A35J9J0nj9k4j6lPJ0J1J3J4J3QOM%lkLOlj9l0k9j8mLNMOJ0J1NjjOJ3RLloj1j3j0LJ5
$$ 135 154 164 159 140 116 100 97 104 114 125 138 152 165 173 179 183 183 180 178 181 187 184 165 135 106 88 84 87 92 96 102 112 123 128 127 126 132 145 154 157 154 148 137 124 114 117 132
11425A32J8J0lj3j3oKO%qj4j4j0%J0J2NmmMJ6K5K8K7J7Lrj4j1pononnponnj0k1l2l6l5k9j8
$$ 132 150 160 157 144 131 125 127 133 133 125 111 97 87 87 97 109 114 110 106 110 126 151 179 206 223 226 217 203 192 185 179 174 168 163 158 151 145 140 135 125 104 72 36 1 -28 -46
11407d6JJ9K6J6NjNJ2J1MKMPMlnJORQMlj1j3mL%qpRK3K2PonKMKnqkOJ3J0Njqj3j6r%Joj2q
$$ -46 -45 -26 0 16 21 20 25 37 48 52 54 58 65 69 66 61 62 68 77 85 89 86 75 62 58 61 61 53 46 55 78 100 107 101 96 98 102 104 99 91 89 95 108 118 123 122 114 101 85 76 76 77 71 59 51
11385E1lmrqlMPJ1J5J5Pjmk%Jjnj1j2nQJ3J4RLrk3l2k9k4j8j2KK0L7M3M2L4K2Nj0j2%J2Rp
$$ 51 48 44 35 27 24 28 35 46 61 76 83 82 78 76 76 77 76 71 60 48 43 51 64 78 87 90 81 58 26 -3 -27 -45 -57 -55 -35 2 45 87 121 143 148 138 126 126 138 147 140
11366A40j6j1jkj1j6j2mmpo%NRJ3J6J4QjormJ0K5K5Nj8k7k1j5j6j3LK0K3J1l%J6K5K0Omrr
$$ 140 124 113 112 110 99 83 71 67 63 56 50 50 55 64 77 93 107 115 114 108 99 95 105 130 155 160 142 115 94 79 63 50 53 73 96 107 104 104 120 145 165 171 167 158 149
11348A49rm%Lok2l3l0j6KJ1J3J5K0K5K4K0J6J0Mnj0j2j3j6j8j3qmlkJMJ0J6K1J9J1%rj9k5
$$ 149 140 136 136 139 133 111 78 48 32 34 45 58 73 93 118 142 162 178 188 192 187 177 165 152 136 118 105 97 93 90 88 89 93 103 119 140 159 170 170 161 142 117
11331A17k5k1j6j6j7rQL4N7O4N4K6nl0m0l4j8%J3K1K4K5K3J3jj2j5j3j1j3j7j9j9j4rkKOQ
$$ 117 92 71 55 39 22 13 21 55 112 176 230 256 251 221 181 147 129 129 142 163 187 212 235 248 247 235 220 207 196 183 166 147 128 114 105 103 105 111 119
11315A19J3J1OJMJ5K5K5J6Lpj0j0j0j2j0jOMrj9j8mJ0J9J6Nqj1nJmj5k3k3k0k1k2k1j5qpq
$$ 119 132 143 149 150 154 169 194 219 235 238 231 221 211 201 189 179 178 184 188 179 160 142 138 148 167 183 188 180 169 164 165 161 146 123 100 80 59 37 16 1 -7 -14 -22
11298b2oJQJ3J3K1L4M4M2K4Noolmj0j4j5oOJ9K1J5Njlrj4j6qknj3k2k5k0j4oLJ1J1QNMMLK
$$ -22 -28 -27 -19 -6 7 28 62 106 148 172 177 171 165 162 158 148 134 119 113 119 138 159 174 179 178 175 166 152 136 128 126 121 108 86 61 41 27 21 24 35 46 54 59 63 67 70 72
11279G2jj0k0k0j0OJ5K2L1M0M1K8Oj1k4l1l0j8MJ6J6J0RJ0Lj0j5oLPKknkOJ6K0J5Kj5k8l4
$$ 72 71 61 41 21 11 17 32 54 85 125 166 194 200 189 165 134 104 86 90 106 122 132 141 151 154 144 129 123 126 133 135 133 128 126 132 148 168 183 185 170 142 108
11262A08k8j4%QJ1R%j1j1LJ8J5LlMJ4J5RKnj2j5j1mLJ1J5J5Mqj7j4nKJlnloj5k1j3NK2L1L3
$$ 108 80 66 66 74 85 94 94 83 72 75 93 108 111 108 112 126 141 150 152 147 135 120 109 105 108 119 134 149 153 145 128 114 109 111 112 109 104 101 95 80 59 46 51 73 104 137
11244A37L0K0Pnj5k3k4j1NJ4J4J2J8J6%j7k0mJ2J7J1jj3j6j2rj4j9j4kOLJNJ1J3Pqk4l4l0
$$ 137 167 187 194 189 174 151 127 116 121 135 149 161 179 195 195 178 158 154 166 183 194 193 180 164 152 143 129 110 96 94 100 103 104 109 120 133 140 132 108 74 44
11227D4j5JJ0J2J3J7J8J8J8J7J5J2RQQMmrqmJmj0j5j8k1k8l2k7j3NK1K6K3J9J8K1K5K8K8K2
$$ 44 29 30 40 52 65 82 100 118 136 153 168 180 189 197 205 209 205 196 188 184 185 181 171 156 138 117 89 57 30 17 22 43 69 92 111 129 150 175 203 231 253
11211B53J1JjMRQJj1k4l7m1l4k2j3mNQMnpopj3j7j5oj%kmmljOJ4K4K8K6K2K0J5Pkoonj0k0
$$ 253 264 265 264 268 277 285 286 275 251 214 173 139 117 104 100 105 113 117 112 105 99 92 79 62 47 41 40 40 38 34 30 27 26 32 46 70 98 124 146 166 181 188 186 180 174 169 159 139
11192A39l1l7l4k3pJ0K6M1M5L5J4lj0j0rj2j6j2lRJ8K1K0J7Rlj1j5j8j9j5pJOJnj4k2k4k0
$$ 139 108 71 37 14 7 17 43 84 129 164 178 175 165 155 146 134 118 106 103 112 130 151 171 188 197 194 183 168 150 131 116 109 110 116 117 112 98 76 52 32
11175C2j2okKMNKOJ4K5L0K6J8OJknj1j7j8j4qomjKlj2j6j4ojkmnlK%oj0qJOL%JORQKLPJ1J4
$$ 32 20 14 12 14 18 23 25 31 45 70 100 126 144 150 151 149 144 133 116 98 84 76 70 66 65 67 64 52 36 22 16 15 13 9 4 1 3 3 -3 -13 -21 -20 -14 -11 -11 -10 -4 5 13 15 18 25 36 50
11154E0J6K4L2L2K0lk2k5j6nlrj5j2njnqnQK2K9L0K1J1Jpj0rlKJoj6k1j6qnqj0okLQJ1R%j
$$ 50 66 90 122 154 174 171 149 124 108 103 100 91 76 64 59 58 53 45 40 48 70 99 129 150 161 162 155 145 136 133 135 136 130 114 93 77 69 64 56 46 40 38 41 49 60 69 69 68
11135F8J4L0L0Qj4j7pJMJlj1j5pPJ9K2K1J5Kj3k2k4j9rNJ8J8Pmj0pjJ2K7L5L0K0J7K0J8Lj6
$$ 68 82 112 142 150 136 119 112 113 117 118 115 104 89 82 89 108 130 151 166 168 155 133 109 90 81 86 104 122 129 125 115 108 107 119 146 181 211 231 248 268 286 289 273
11117B73k8l0k2j4pmljpj7k5j9%K2L7M0L4K0Lj0j4j8j9k2k2j9j3mMPPRJ1J1J0J7L0L9L0Rq
$$ 273 245 215 193 179 172 168 165 164 157 140 115 96 96 118 155 195 229 249 252 242 228 210 191 169 147 128 115 111 115 122 129 138 149 160 170 187 217 256 286 295 287
11101B87j3lOQLjjKMkj5k8l3k7j3JONMMKmj1j2p%%qj9k5k0j1kjqj9k4k3j4kQJ2J3J1RRJ1J6
$$ 287 274 271 277 285 288 287 286 288 292 290 275 247 214 187 174 175 181 186 190 194 196 192 181 169 162 162 162 154 135 110 90 79 77 76 68 49 25 2 -12 -14 -6 6 19 30 39 48 59 75
11082G5J5J6K0L1L9L8K5J3MjlJNKj0k2k5k6k5k0pQJ8J9J5Noj2mJ1J4Kj6k2k1k8m1m6l5j1O
$$ 75 90 106 126 157 196 234 259 272 276 275 272 273 278 280 270 248 223 197 172 152 145 153 171 190 205 210 204 192 188 199 213 215 199 177 156 128 87 41 6 -5 1
11065AJ3Mqj2mJ0K3K5K1J4QPRNlj2j1KRJj7k9l2k5j2MJ5J2LlJPJ3J9K1J5Jj2j7j2ro%J3K5
$$ 1 14 18 10 -2 -6 4 27 52 73 87 95 102 111 116 113 101 90 92 101 102 85 56 24 -1 -13 -9 6 18 21 18 19 26 39 58 79 94 95 83 66 54 45 39 39 52 77
11047G7K8K1Rmj4k1k7k3j5nJMJ1J9K5K5J9Rkj0j1nLJ3J9J8Qmj4j7j7j4nNJ2J3J3J3Nj0k7l5
$$ 77 105 126 135 131 117 96 69 46 31 26 27 31 42 61 86 111 130 139 137 127 116 111 114 127 146 164 172 168 154 137 120 106 101 106 118 131 144 157 162 152 125 90
11030I0l9l5k1jJ8K0Nqj2p%OJ4J8J2KLJ4K4K0Mj1j8j7j5j5j2kJ3K7K8J6Jpomqj1j4j7k0k1
$$ 90 51 16 -5 -6 12 32 37 29 17 10 10 16 30 48 60 62 65 79 103 123 127 116 98 81 66 51 39 37 50 77 105 121 122 115 109 105 97 86 72 55 35 14
11013A4j4rprqmKRK0L2M5N1M6L2J0j2k3j7lQMj0j9j6n%knKJ1J2Kj4k3k3j7nPJ6J9J9J6Lj5
$$ 14 0 -9 -16 -25 -33 -37 -35 -26 -6 26 71 122 168 200 210 198 175 158 155 163 167 157 138 122 117 117 115 110 112 123 135 137 123 100 77 60 55 62 78 97 116 132 135 120
10996A20l2l2j8mMONLkjQJ8J5jj7j2PK3K5J8J5J5J0Km%%npmLNKPJ0PlmLOmj7k2k5l3l8l3j8
$$ 120 88 56 38 34 38 44 49 52 50 49 57 75 90 89 72 60 67 90 115 133 148 163 173 175 171 171 171 166 159 155 158 163 165 172 182 189 186 182 185 191 187 170 148 123 90 52 19 1
10976AplKRJ5RJmll%QJ6J8J1MMMN%pj5k3k3j4KJ8L0M1M4L6K1Pjpj4j7j3okJJ1K2K4J1pj8k1
$$ 1 -6 -9 -7 2 17 26 27 23 20 17 17 25 41 59 70 74 78 82 87 87 80 65 42 19 5 7 25 55 96 140 176 197 204 203 196 182 165 152 146 144 145 156 178 202 213 206 188 167
10957A67k1j7oLKoj1mMLj1k7l4k8j9j5j1kJ2K0J5Lm%J3K2K4J7Pmj3j2jJ3J8Q%NK1L0K6J7J4
$$ 167 146 129 123 126 128 122 111 107 111 114 103 76 42 14 -5 -20 -31 -33 -21 -1 14 17 13 13 26 48 72 89 96 92 79 67 66 79 97 105 105 110 131 161 187 204 218
10940B18J3Kj9l7m5l7k1lKqj8j0J2L3L5K6J0nj8k1j8j2j5j7j1KJ3J8K0K0J2ok0k1j4qqj0r
$$ 218 231 233 214 177 132 95 74 71 73 65 47 37 49 82 117 143 153 148 130 109 91 79 64 47 36 38 51 69 89 109 121 115 95 74 60 52 44 34 25
10924B5kLNMPJ7K5K4J3MNJ0J0MJLKkj0j1nLJ2J6J7J1MJLLJrk0k6k5j5jQJ0J0J0RJ0J3J8K2
$$ 25 23 26 31 35 42 59 84 108 121 125 130 140 150 154 155 158 160 158 148 137 132 135 147 163 180 191 195 196 199 202 203 194 174 148 123 108 107 115 125 135 145 154 164 177 195 217
10906B17K0Oj1k4k8j9oLOOJ0J7K1J8QlpJRRJpj1j1nOJ5J4Jj7k9l0k3j7j4rmKMMOJ5K9L6L4
$$ 217 237 243 232 208 180 161 155 158 164 170 180 197 218 236 244 241 234 235 244 253 254 247 236 225 220 226 241 255 256 239 210 180 157 140 126 117 113 115 119 123 129 144 173 209 243
10888B43K6K4K5K1Prj4rLJ7K5K0Kk0l4l6k9j4JJ1J0jj6l0l0j3J1K3J1j3k7k9k8k5j9rnj0k1
$$ 243 269 293 318 339 346 337 323 314 317 334 359 379 381 361 327 291 262 248 249 260 270 269 253 223 193 180 191 214 225 212 185 156 128 103 84 75 70 60 39
10872C9k2rRK6L6L5K7J8K0K5K3Rmrnloj2j7k2k5k4j2NK2K9K6J6Kl%RJ1Onj5k3k4k1j6qlJK
$$ 39 17 8 17 43 79 114 141 159 179 204 227 236 232 223 218 215 209 197 180 158 133 109 97 102 124 153 179 195 197 194 194 203 214 220 215 200 177 153 132 116 108 105 106 108
10854A08JLNPJj1k2j9lJ2K1K0J7J4J2J2J3J0mj9j9kJ5J8Oqj1qnmJPJ1Rmk2l8m2l3k0j1%J0
$$ 108 109 112 117 124 125 114 92 73 70 82 103 123 140 154 166 178 191 201 197 178 159 157 172 190 196 188 177 169 164 160 161 168 179 188 184 162 124 82 49 29 18 18 28
10837B8J8J5RQJ4J9J3%j8l3l6k2KK0K2J2MNRRKmjRK2K9L0K3J5Loj2j3j6k2k2j2NJ9K0J3ML
$$ 28 46 61 70 78 92 111 124 124 106 73 37 15 17 37 59 71 75 80 89 98 100 96 95 104 126 155 185 208 223 226 220 208 195 179 157 135 123 128 147 167 180 184 187
10820A87QJ4J0ok3l2l2k4j6%K0L0K4%k3l0k2pjjjKNQRJ3J5J5ROMKJJORPJmmmpqppj1j6k0k2
$$ 187 195 209 219 213 190 158 126 102 86 86 106 136 160 160 137 107 85 78 77 76 75 77 82 90 99 112 127 142 151 157 161 163 164 165 171 180 187 188 184 180 176 169 161 154 147 136 120 100 78
10800G8k1j6rjJnj2j3mMJ5K1K4K1J3OJklLJ6K5K0Lj3j7j4rnJMMLLPJ2J4Qnj4j3mK%jMJ0Rk
$$ 78 57 41 32 31 32 27 15 2 -2 2 17 38 62 83 96 102 103 101 98 101 117 142 162 165 152 135 121 112 107 108 112 116 119 122 129 141 155 163 158 144 131 127 129 129 128 132 142 151 149
10780A49j4k2k7k2qPJ8K0J7J4J1J1J0Npj7k0j7j8k1j8nRJ5K1L0L9L5K1Mprolnj0rmJkj1j4
$$ 149 135 113 86 64 56 63 81 101 118 132 143 154 164 169 162 145 125 108 90 69 51 46 55 70 91 121 160 195 216 220 213 204 198 195 190 180 171 167 168 166 155 141
10763A41j1j1j5j8j3JJ5J9J7J1QLkj0j1okknkkkJJ4K8L5L0K7L1K9J8%j8l0l7l9l5k8k2j1Q
$$ 141 130 119 104 86 73 74 89 108 125 136 144 147 145 135 124 118 116 114 109 107 105 103 104 118 146 181 211 238 269 298 316 316 298 268 231 192 157 129 107 96 104
10747A04K6L1J8Jj4k0j9j4plJQJ7J7Pqj9k3j8mJ2K3K3J5OlnjQJ2OlqoJOJ0J3J1Lnj0j4k1k5
$$ 104 130 161 179 180 166 146 127 113 106 103 104 112 129 146 153 145 126 103 85 81 93 116 139 154 160 157 152 151 159 171 177 174 166 160 161 167 177 190 201 204 199 189 175 154 129
10729A29k3j6roomk%Jjnj1j2oNJ5K2K6K3J5M%%%lmKJ1J1PQJ4J6Oqk1k5k0qRK3K2J3Kqj9k9
$$ 129 106 90 81 75 69 65 63 63 64 63 58 47 35 29 34 49 71 97 120 135 139 139 139 139 136 132 134 145 156 163 171 185 201 207 199 178 153 133 125 134 157 179 192 194 186 167 138
10710A38l6l6l2k2qPJ8J9J5J1J1J2J3Qkj6k4k3j8j0%QJ0NknmlKQJ7K3K0J0mj3j1jOJ0J0J1
$$ 138 102 66 34 12 4 11 29 48 63 74 85 97 110 118 116 100 76 53 35 25 25 33 43 48 46 41 37 34 36 44 61 84 104 114 110 97 86 85 91 101 111 122
10693A22P%j0j9k9l2k8j7j2oNJ8K3J2j0k3k3j6nKKKMJ1J7J0KkmmqnOJ3J3PJMJ2K3K9K7J8J0
$$ 122 129 129 119 100 71 39 11 -6 -18 -24 -19 -1 22 34 24 1 -22 -38 -43 -41 -39 -37 -33 -22 -5 5 7 5 1 -3 -11 -16 -10 3 16 23 24 28 40 63 92 119 137 147
10676A47Ojj5k2j6NK1K5J7PK%k%QJ5J3Jj5k6l0l5l5k8j5nLQJ0J2J7K3K3J7QQJ4Pj2k7k0JJ5
$$ 147 153 152 137 115 99 104 125 150 167 174 176 176 174 174 182 197 210 211 196 170 140 105 70 42 27 22 25 33 43 55 72 95 118 135 143 151 165 172 160 133 113 114 129
10658A29J8J7J6J4N%KPQLloqj1j4j3oJKmoLJ6J8Lj8k9k7j7j2rnKQO%kMJ1J7K1K2J1pk2k8k6
$$ 129 147 164 180 194 199 199 201 208 216 219 216 210 202 191 177 164 158 159 161 157 151 154 170 188 191 173 144 117 100 88 79 74 76 84 90 90 88 92 103 120 141 163 174 167 145 117 91
10639I1k6k0rQJ8J9J5RKmjPJ1RLjjJOOKor%J4K6L2K6Qj8l6l9l3k5k2k0j8j4j1kJ0K0K3J5Q
$$ 91 65 45 36 44 62 81 96 105 107 103 102 109 120 129 132 131 130 131 137 143 145 139 130 130 144 170 202 228 236 218 182 143 110 85 63 43 25 11 0 -2 8 28 51 66 74
10621G4MMNK%LRJ3R%qj7k5l2l3l0k4j5kOPNQJ9K4J8OoqnLJ0J3ROOJ3K2K8K7K0J0Knj1j3j3
$$ 74 78 82 87 89 89 92 101 114 123 123 115 98 73 41 8 -22 -46 -61 -63 -57 -50 -45 -37 -18 6 24 30 24 16 11 14 24 37 46 52 58 71 93 121 148 168 178 180 175 164 151 138
10602A38j0qprj7k5k9k7k0j4kJ6L0L2K1J4J7K5K2Qoj5j5j4rjNNlrj0nKPQJ1J4J6J7J7J8J5
$$ 138 128 120 113 104 87 62 33 6 -14 -28 -30 -14 16 48 69 83 100 125 147 155 149 134 119 105 96 95 100 105 102 93 83 78 80 87 95 106 120 136 153 170 188 203
10586B03J2QONKjlnj2j8k4k8k3j0OJ5K1K6L2K8J3mj2j2j4j6j9j2mOJ6K4K4J2nj2j2j0j0j1
$$ 203 215 223 229 234 236 235 232 227 215 197 173 145 122 112 118 133 154 180 212 240 253 249 237 225 211 195 176 164 160 166 182 206 230 242 237 225 213 203 193 182
10570A82j1j2j2j4j1rj0j7k6l1k8j9j0JJ7K7L1J9Jj2j0jQJ1Mpj6j7r%MKjKJ1K4L8M3L7K1R
$$ 182 171 159 147 133 122 113 103 86 60 29 1 -18 -28 -27 -10 17 48 67 68 56 46 45 53 64 68 61 45 28 19 19 23 25 24 26 37 61 99 142 179 200 209
10553B09OQNlrj1rrj0j3j7j9j6qmproKPPJ0J5K4K9K6J8Omj1j4j1qnnpnJRJ1OJKJ3J5OprKQ
$$ 209 215 223 228 225 216 205 196 187 177 164 147 128 112 104 100 93 84 78 80 87 94 104 119 143 172 198 216 222 218 207 193 182 174 169 164 157 152 153 162 173 179 180 182 195 210 216 209 200 202 210
10533B10mk4l5l1k1j1JJ5K0J5%j0j6j4oNJ5J7J6J9K6K7J3qk6l8l8l2k4k3k8l0k6j3%LLj%N
$$ 210 206 182 147 116 95 84 85 100 120 135 135 125 109 95 89 94 109 126 142 161 187 214 227 219 193 155 117 85 61 38 10 -20 -46 -59 -59 -56 -53 -54 -54 -49
10517d9J7K5K4K2K0J7Qrk1j3QK9L7L3K5J7Nj0k4l0k5j3JRJ0NKK%lnlmrj6j8j7j5j6j3lPJ0
$$ -49 -32 -7 17 39 59 76 84 75 54 41 49 78 115 148 173 190 195 185 161 131 106 93 94 103 113 118 120 122 122 119 114 111 107 98 82 64 47 32 16 3 0 7 17
10500A7PNRJ7K1J9J5J2J2J2RLln%QJ4J6J2RRNlj1j3j0qj2j4j2rrp%J0J3Plnorj1pMJ6K2K2
$$ 17 24 29 38 55 76 95 110 122 134 146 155 158 155 150 150 158 172 188 200 209 218 223 220 209 196 186 178 166 152 140 131 122 115 115 125 138 145 142 137 131 122 111 104 108 124 146 168
10481A68J9J6J4J1J1J5K0K2J2mk0k3j8j5j7k7l5l9l5k4j1LJ2J7J1%j0j6k0j5%K0L6L5K6J4
$$ 168 187 203 217 228 239 254 274 296 308 304 284 261 243 228 211 184 149 110 75 51 40 43 55 72 83 83 73 57 37 22 22 42 78 113 139 153
10466A53Ojpronpj1pKJ0J3J2P%mmjLJoj4j7j2mJkrj5j3oLRJ1PKlrj2rJJ1J3Kj2j9j7j2rpj
$$ 153 159 158 151 142 136 131 124 113 106 108 118 131 143 150 150 146 142 141 144 145 139 125 108 96 92 93 91 82 67 54 48 51 60 71 78 80 77 68 56 47 48 59 72 74 62 43 26 14 5 -2 -3
10446cJ2L3M6M8M2L5K2Jk5m2l8j8OK0K0J5J2RQRRPok1l2k8j4NK1L2L2J6pk7l1k2j1KJ4K4K7
$$ -3 9 42 88 136 178 213 235 236 211 169 131 113 119 139 159 174 186 195 203 212 221 228 222 201 169 141 127 132 153 185 217 233 226 199 168 146 135 137 151 175 202
10429B02K1J4Olj5k5k5j4k%kom%OQROKpj8k9l3k4pJ0J9K1J9J7J5J3QLmponlKJ0J5J2NOJ6K5
$$ 202 223 237 243 240 225 200 175 161 159 159 157 151 147 147 153 161 170 176 178 171 153 124 91 67 60 70 89 110 129 146 161 174 182 185 181 174 168 163 160 162 172 187 199 204 210 226 251
10411B51J7lk1k4j8rkKPPNLLLkj3k2k3k0j7j9k5k5k2j4pmjk%JMNNMJ0J8K0J3OMNMJOJ7K4J6
$$ 251 268 265 244 220 202 193 191 193 200 207 212 215 218 221 219 206 184 161 141 124 105 80 55 33 19 12 8 7 5 5 6 10 15 20 24 34 52 72 85 91 95 100 104 105 111 128 152 168
10391A68MkJJnq%ONlrrqnKJ3J5Poj3j5j6j4j1rqj0pjPJ8K5K4J4OOJ2J5Rjrj1qjKJknnkKJ0
$$ 168 172 170 171 172 167 159 159 165 170 167 158 149 141 136 138 151 166 173 167 154 139 123 109 98 89 81 71 64 63 70 88 113 137 151 157 163 175 190 199 198 189 178 170 169 171 172 170 165 160 158 160 170
10370A70J1%j3j3m%rk2k9k5j6qJJ0J5J3RKjJJ1J7J1nj5j0oqj4j4mLML%nrqKJ5J7J1%qj3j2
$$ 170 181 181 168 155 151 151 142 120 91 66 50 42 43 53 68 81 90 92 91 92 103 120 131 126 111 101 95 87 73 59 55 58 62 65 65 60 51 43 45 60 77 88 88 80 67 55
10352E5oNJ3J3Lj0j4oPJ6J6J3J3J8K2K3K0J6Oqj7j2jONMLNNNMKknlKL%rj3j3j1rj7k9m0m4
$$ 55 49 54 67 80 83 73 59 53 60 76 92 105 118 136 158 181 201 217 223 215 198 186 185 191 196 200 203 208 213 218 222 224 222 217 214 216 219 219 210 197 184 173 164 147 118 78 34
10333C4l4j8LJ8K9L0K0Pj%NJ2J5J6J0KmJQPnj9k2j3LJ7K4K4K1J7J7K0J8J0kj4j7j3lLJpj4
$$ 34 0 -18 -15 3 32 62 82 89 88 88 93 105 120 136 146 148 144 145 153 160 155 136 114 101 104 121 145 169 190 207 224 244 262 272 270 256 239 226 223 226 227 220 206
10316B06j9k4k6k6j7oNOMKQK0K6K0Q%MJ2J7J6Qlj0pNJ4J4R%pj5j4pkjJPJ1Lj0j5j3j7k5k9
$$ 206 187 163 137 111 94 88 93 99 103 105 113 133 159 179 187 187 191 203 220 236 244 241 231 224 229 243 257 266 266 259 244 230 223 221 220 221 228 239 242 232 217 204 187 162 133
10298A33k0rj1k1k1nJ5K6K5J9J7J4Prk5k9k2j6j1qKJ4K1J9K0K4L3L8L4K1Nj1k0k0j3kKjpj0
$$ 133 113 104 93 72 51 46 61 87 112 131 148 162 169 160 135 106 84 68 57 49 51 65 86 105 125 149 182 220 254 275 280 269 249 229 216 214 216 215 208 198
10282A98j1j0j0p%NJmojNJ2J7K3K2J7PJnj1j3qlmj4k1k1j6j2rmKNjrj3qJJ0J4J0NLNKrk1k4
$$ 198 187 177 167 160 160 165 166 162 156 155 160 172 189 212 234 251 258 259 254 243 230 222 219 215 201 180 159 143 131 122 118 120 125 124 115 102 94 95 105 119 129 134 137 142 144 135 114 90
10262I0j4%J1J7K1K1J7J0Joj0pmoj5k5k2oJ3K7L0K7K0J0%l%Jmj2j7j7k2k7l0k1j3j2k0k1j3
$$ 90 76 76 87 104 125 146 163 173 174 168 158 151 147 141 126 101 79 73 86 113 143 170 190 200 200 197 197 198 194 182 165 148 126 99 69 48 35 23 3 -18 -31
10246c1NK0K5K3J6RQRJ0OKnj4k2k5j7lJ4K3L0K8J8Jj4j8rNJ7K1J6Lj1j3%J6J9RjJQJ2O%lk
$$ -31 -26 -6 19 42 58 67 75 84 94 100 102 97 83 61 36 19 16 30 53 83 111 129 130 116 98 89 94 111 132 148 151 140 127 127 143 162 171 170 171 179 191 197 197 194 192
10228A92PJ3J2JqnQJ4Qnj3j7j8k1k1j7j0JJ2K1K6K9K5J4nj7j9j2rj0j1nKK%mkNJ0P%mJOLm
$$ 192 199 212 224 225 217 212 220 234 242 237 224 207 189 168 147 130 120 121 133 154 180 209 234 248 243 226 207 195 186 176 165 160 162 164 164 160 158 163 173 180 180 176 177 183 186 182
10209A82qjQJ5K0J8Oqj5qJLqk3l5l6k4jJ6J7Nprn%NPOLLQJ2J3J5J8J7J5OjprmNJ2Rjj1j5j4
$$ 182 174 173 181 196 216 234 240 232 217 209 210 213 205 182 147 111 87 86 102 119 124 117 108 103 103 108 115 121 124 127 135 147 160 175 193 210 225 231 230 223 214 210 215 227 236 235 224 209 195
10190A95j4j8j8j0KJ5K2J8Qmronqj4j7j3lRJ8K3K2K0J6J5J0NJoj7k9l7m0l7k8j3NJ5J5J2J2
$$ 195 181 163 145 135 137 152 174 192 200 196 187 181 176 168 154 137 124 121 130 148 171 193 213 229 244 254 259 260 254 237 208 171 131 94 66 53 58 73 88 100 112
10173A12J2MooLJ1J1%j2j6j0LJ4J5J2J2J5Rqk7l4k9j5jOPNOJ0J4J4J2QKkkMJ0J4J8J7J1kj3
$$ 112 124 128 122 116 119 130 141 141 129 113 103 106 120 135 147 159 174 183 175 148 114 85 70 69 75 82 87 93 103 117 131 143 151 153 151 149 153 163 177 195 212 223 221 208
10156B08j8j8k0k7l4l1k3j0JNNJJJ0K7M1M4K6mk9l4k1qj0k1k4j3PK1K7K4J9J2OK%mpj0j4j7
$$ 208 190 172 152 125 91 60 37 27 28 33 38 39 40 50 77 118 162 188 184 155 121 100 92 82 61 37 24 31 52 79 103 122 134 140 142 142 138 131 121 107 90
10139I0j9j3jJ0J4J2J1J8K7K9K4J6RJqj5k4k9l4l6l5k7j3QK6K9J3j0k6l0k5j9pJ2K8L9M2M0
$$ 90 71 58 57 67 81 93 104 122 149 178 202 218 227 228 220 205 181 152 118 82 47 20 7 15 41 70 83 73 47 17 -8 -27 -34 -22 6 45 87 127
10124A27L8K9J7Mmj2k0k3k5k4k0j2%J4K1J8Nj1k3k3j6j1qpprj4j5j3qn%J1K3K7K7K7L5L9L4
$$ 127 165 194 211 215 211 199 179 156 131 107 87 75 75 89 110 128 133 122 99 76 60 49 41 34 27 18 4 -11 -24 -32 -37 -37 -26 -3 24 51 78 113 152 186
10108A86K1J2POQJ1J3J2J1J2J5J6Ppj6j3j0j7l1l6k9j8j2j2j3j2j2j1lMOLOJ1Oj2k4k5j4k
$$ 186 207 219 226 232 240 251 264 276 287 299 314 330 337 330 314 301 291 274 243 207 178 160 148 136 123 111 99 88 85 89 95 98 104 115 121 109 85 60 46 44
10092D4RJ9K3J7Q%mokPJ5J2Jnqj0j3j1rj3k4k5j7pj%NJ5K3K5K2J1mj5k0k2j9nJ6L4L6K6J6
$$ 44 53 72 95 112 120 120 116 110 108 115 130 142 143 138 130 120 107 96 87 74 50 25 8 1 0 0 5 20 43 68 90 101 97 82 62 40 21 16 32 66 102 128 144
10074A44J0%rj2j0pkjkooPK6L4K3Jj1j3j2roJQJ2J1Nmj6k1j9j2j0j1j1pjOJ0J2RKlmmrj8j6
$$ 144 154 154 145 133 123 116 114 113 111 105 99 106 132 166 189 190 179 166 154 145 139 140 148 160 171 176 172 156 135 116 104 94 83 72 65 64 70 80 92 101 103 100 96 92 83 65 49
10056D9kJ2J6Lj1k0k3j9pLJ5K0K2K3K1J1J%NQMlkJLjmjJmrr%J0J4J5J3J0Kj0j9k1j4nKLKN
$$ 49 47 59 75 78 67 47 24 5 -2 1 16 36 58 81 102 113 114 114 119 127 131 128 126 127 130 129 125 124 125 121 112 103 103 113 127 142 155 165 167 157 138 117 103 98 100 103 105 110
10036A10RJ1J2R%j0k0k2j4JJ1J6J8J9J8J4Mrk0k2k0k3k7l0k5j7j5j5rMJ6J9J4QjrqlMOOOO
$$ 110 119 130 142 151 151 141 121 99 85 86 97 113 131 150 168 182 186 177 157 135 115 92 65 35 10 -7 -22 -37 -46 -42 -26 -7 7 15 14 5 -3 -6 -2 4 10 16 22
10019B2ORJ1J1J2J6J9K1K2K4K3J5Jj0j3pmnj1j9k5k7k3j7pjJoj0oOJ2RNLKJPJ8K5K1J3QP%
$$ 22 28 37 48 59 71 87 106 127 149 173 196 211 212 202 189 182 178 173 162 143 118 91 68 51 44 43 44 38 28 22 28 40 49 54 57 59 60 67 85 110 131 144 152 159 159
10001A59rj4qmlkKPQOkqj3j0nmooPK1K5J5jrpkMPKlmNJ4J4Njmrj9k6k1j0KJ0Rlk1l3k3kJ1
$$ 159 150 136 128 124 121 119 121 128 136 142 140 132 119 109 104 100 94 88 95 116 141 156 155 146 139 137 141 148 150 147 143 148 162 176 181 180 176 167 148 122 101 91 93 103 112 109 88 55 32 30 41
9980D1NooKPLkoj2j9j7qjLLMNQJ4J6J2M%MJ0J1PNMLKMPJ0J3J8K2J9PmmMJ2J1Mknj0j9k0j0
$$ 41 46 40 34 36 43 46 44 38 26 7 -10 -18 -19 -16 -13 -9 -4 4 18 34 46 50 50 54 64 75 82 87 91 94 96 100 107 117 130 148 170 189 196 192 188 192 204 215 219 217 212 202 183 163 153
9960A53LP%rj5k3l3l9l3k0j1ppj5k5k6j2J1K5K8K9L3M0M0M0M1L5K2Lj1j4j2nJKrk5l3k3pL
$$ 153 156 163 163 154 139 116 83 44 11 -9 -20 -27 -34 -49 -74 -100 -112 -101 -76 -48 -19 14 54 94 134 175 210 232 235 224 210 198 193 194 196 187 162 129 106 99 102
9944A02Llj1j8j9j4kMPJ1K1K4J8POJ1J2Omrj5j8j8j1prj6j9j2KJ7K5K3J4N%mpnjLJlopolL
$$ 102 105 102 91 73 54 40 38 42 49 60 81 105 123 130 136 147 159 165 161 152 137 119 101 90 83 74 58 39 27 29 46 71 94 108 113 113 109 102 97 96 99 100 97 91 84 78 75 78
9924G8PJ0J1J3J1Jj0j6j2nkj%QJ7K4J7%j7k7k9l2l5k8j1J0K5L2L0J8LrqlJkrj6k2k3k2j9j6
$$ 78 85 95 106 119 130 131 121 105 93 88 86 85 85 93 110 134 151 151 134 107 78 46 11 -17 -28 -18 7 39 69 87 90 81 73 70 71 69 60 44 22 -1 -23 -42 -58
9907e8j4j3rjNNjn%J1J8K1J8J4J0J0J5K3K3J6Lpj4j2JK0L5L4K6K1K3K7K6J6kk3l3k7j3oqr
$$ -58 -72 -85 -94 -95 -90 -85 -86 -91 -91 -80 -62 -41 -23 -9 1 11 26 49 72 88 91 84 70 58 59 79 114 148 174 195 218 245 271 287 285 262 229 202 189 183 175 166
9890A66pmj1k3l2k6rJ5L3L5K1lk4l4l6l5l3k7j4QK7L6L4K3J0jj2j9j9j1LK0L8M6M3L0J5Mq
$$ 166 159 155 144 121 89 63 54 69 102 137 158 155 131 97 61 26 -7 -34 -48 -40 -13 23 57 80 90 89 77 58 39 28 31 51 89 135 178 208 223 227 219
9874B19k1l3l7k8j7j3k2l1k7j0J2K7L6L8L6K3Lj3k0j8j4pPK5L2K0pk9l6k3jJ7K8L0K2Nj1j8
$$ 219 198 165 128 100 83 70 48 17 -10 -20 -8 19 55 93 129 152 155 142 122 104 90 83 90 115 147 167 160 131 95 72 71 88 116 146 168 173 162 144
9859A44k1k3k8k7k0j0mJLLNJ3K3K4Rj0j7oOJ4J8K2J9Kk1l4l0j9j1j3j9j9mJ9L4L5K3J4PNN
$$ 144 123 100 72 45 25 15 11 12 15 18 23 36 59 83 92 82 65 59 65 79 97 119 138 140 119 85 55 36 25 12 -7 -26 -30 -11 23 58 81 95 102 107 112
9843A12RJ1PLjmj2k4k9k3j4qo%ON%oojMRJ1J1J3J3J2J2J0J2J0Nqj9k2j6q%LJ0K1K9K7J2kr
$$ 112 121 132 139 142 141 137 125 101 72 49 35 27 21 21 27 32 32 26 20 19 23 32 43 54 67 80 92 104 114 126 136 141 133 114 92 76 68 68 71 81 102 131 158 170 168 159
9824A59pnnqj1j4j4rJRPJpj0j2j2j3j0mK%qj2qPK2L2L4L0K0J0NPJ0J0Pjpj1j3j5k0k3j8oP
$$ 159 152 147 142 134 123 109 95 86 87 96 103 104 97 87 75 63 50 40 36 38 38 30 18 10 17 39 71 105 135 155 165 170 177 187 197 204 203 196 185 172 157 137 114 96 90 97
9806I7J0Nk%J2K6L7L7K8J6RJ0J7J8J2Jqj1rj0j1j1mKOjj1k0j8rllpj0j0pKJ0J5Nj2k7l1k6
$$ 97 107 112 110 110 122 148 185 222 250 266 275 285 302 320 332 333 325 314 305 295 284 273 269 271 277 276 265 245 227 218 215 212 205 195 185 178 180 190 205 210 198 171 140 114
9788A14j4JJ6J8J4RJ3J5Rmj4j9k0j8j3qpj2j5j2lPQMljRJ7J4NMJ0J5J4RQJ0RLlrj8k8l3k4
$$ 114 100 101 117 135 149 158 171 186 195 191 177 158 138 120 107 99 92 80 65 53 50 57 65 69 66 65 74 91 105 110 114 124 139 153 162 170 180 189 192 189 180 162 134 101 77
9770G7kJ6J8PkLJ7K4J5nk4l0k3pK%omQJ7J9J5J5J9K8L3K9J4pk3k5j6olj1k2k8k5j9j8k2k0
$$ 77 75 91 109 116 114 117 134 158 173 168 144 114 91 84 86 86 80 76 84 101 120 135 150 169 197 230 259 273 266 243 218 202 196 193 182 160 132 107 88 70 48 28
9753B8rKMlokPJ3J6J5RMMJ2K5L2K7J3lj4j8k3k8k3nJ8K6J4kj2j2rnnqj4j7j4j0qmjLJmj2j6
$$ 28 19 21 25 22 16 14 21 34 50 65 74 78 82 94 119 151 178 191 188 174 156 133 105 82 77 95 121 135 133 121 109 100 95 90 82 68 51 37 27 19 15 14 17 18 14 2 -14
9734a4k3k6k6j9nJ6L6N1N3M6L1J8Ojmm%J%mqj0lPJ3J4J0O%ornMJ3J6J0Lopn%MMJloomrj9l0
$$ -14 -37 -63 -89 -108 -113 -97 -61 -10 43 89 120 138 144 143 139 135 135 136 136 132 124 114 111 118 131 145 155 161 161 155 146 141 145 158 174 184 187 181 174 169 169 173 177 178 175 169 163 159 150 131 101
9714A01l5k9j8pMJ2J5J2J0J3J6J5RJlmlJJnj6k5k8k7j8nJ2K2K3J9J6J2KopjNKmkMJ3J4RKl
$$ 101 66 37 19 12 16 28 43 55 65 78 94 109 118 119 116 112 109 110 111 106 90 65 37 10 -8 -13 -1 21 44 63 79 91 93 87 80 79 84 86 82 80 84 97 111 120 122 119
9695A19mpj2j5j2ppj4j8j1LJ5J5R%opnMJ1J2QPJ1J5J1kj6k3k2k2k0j4oKNK%JNRJ0J2RLkon
$$ 119 115 108 96 81 69 62 55 41 23 12 15 30 45 54 54 48 41 36 40 51 63 71 78 89 104 115 113 97 74 52 30 10 -4 -10 -8 -3 -1 -1 0 5 14 24 36 45 48 46 40 35
9676C5rj7k8k9j7LJ4J4QMPJ5K5L5L1K0RPJ0J3J3J2Ojm%Knk0k2j4nqj8k1j3jJ2J9K1J4KnmJ
$$ 35 26 9 -19 -48 -65 -62 -48 -34 -26 -22 -15 0 25 60 91 111 120 127 137 150 163 175 181 180 176 176 178 173 153 131 117 112 104 86 65 52 51 63 82 103 117 119 114 110 111
9658A11LJorrl%Kmj6k9m0m1l4j7OK6L1K3J2PQQOQJ4J4O%NK1L2K9J5%rmJ0K2K2J1%llpj2j5
$$ 111 114 115 109 100 91 88 88 90 86 70 41 1 -40 -74 -91 -85 -59 -28 -5 7 14 22 30 36 44 58 72 78 78 83 104 136 165 180 180 171 167 177 199 221 232 232 229 226 219 207 192
9639A92j3qonpnJONlj2j3pKPJ0ROJoj1j9k8l3k7j2MJ3K0K5L2L4K3Lj3j5mL%qj0nKMKlnnkJ
$$ 192 179 171 165 160 153 148 149 155 160 157 145 132 125 127 134 144 153 159 160 154 143 124 96 63 36 24 28 41 61 86 118 152 175 178 165 150 146 149 149 141 131 126 128 132 134 131 126 121 119 120
9619A20lj4k6k7j6%QKrj5j3j2j9k4j9kJ4J6Qmj2j5j6j6j1%J6L1M0L6K7J4M%KNONJJKQJ1QL
$$ 120 117 103 77 50 34 34 42 44 35 20 7 -5 -24 -48 -67 -69 -55 -39 -31 -35 -47 -62 -78 -94 -105 -105 -89 -58 -18 18 45 59 63 63 65 70 76 81 82 83 85 93 104 112 115
9601A15kKJ4K8L7L7K6J4OOQOjj1j9l0l7l7k4j1lmpqrj0qJJ1J3OlnLJ2J9J8J2LKQJ8K6L2L8
$$ 115 113 115 129 157 194 231 257 271 277 283 291 297 296 285 266 236 199 162 138 127 124 120 113 105 96 86 78 79 90 103 109 106 101 104 116 135 153 165 168 170 178 196 222 254 292
9583B92M7N6O9Q5R5R9R8R9R5P4K1m7j05j33j31j11q7o9o1n7n0l2j2knj5k5k9k3j1LJ2J4J6
$$ 292 339 395 464 549 644 743 841 940 1035 1109 1130 1083 978 845 714 603 516 447 386 329 279 247 235 233 228 213 188 159 136 125 128 140 154 170
9569A70J7J4QOJ1J6J7J2Mpj9l2l7l2j9pkKOJ2J1Nmqj0j4j8k0j7j1lQJ8K3K2K3K6K6J9Mqj1
$$ 170 187 201 209 215 226 242 259 271 275 268 249 217 180 148 129 122 120 122 128 140 151 156 152 144 134 120 102 82 65 54 51 59 77 100 122 145 171 197 216 220 212 201
9552B01nKMMkj2k2k3j2QK1K1J1Kkoj2j6j7j6j2kRK0K4K5K7K4J5%j5k5k8k2j6j1j1j3j2j0r
$$ 201 196 198 202 206 204 192 170 147 135 143 164 185 196 198 196 190 178 162 145 129 117 115 124 144 168 193 220 244 259 259 244 219 191 169 153 142 131 118 106 96 87
9536H7rmKLkqpjMNONNK%KJ2K3K7J9Jk1l5l6k4lK0L5L7L0J8Nqj9k4j8pQK0K6K7K2J6J0Lpqj
$$ 87 78 74 76 79 77 69 62 61 65 70 76 81 86 88 88 90 102 125 152 171 172 151 116 80 56 53 73 108 145 175 193 198 190 171 147 129 122 130 150 176 203 225 241 251 254 247 239 238
9517B38J1J4Kj6l2m0m3m0l1k0j2lNJ5K0J5PNRJ1Pnj6k0j2LK0K7K5J7Onj4j3qkoj7l1m3m4l6
$$ 238 249 263 265 249 217 177 134 94 63 43 31 28 33 48 68 83 90 95 104 115 122 117 101 81 69 72 92 119 144 161 167 162 148 135 127 125 119 102 71 28 -16 -52
9500e2j4J1K9L2L2L1L1K1PorqonJLnj7k2j4qj0j5j2mMN%nj0oJOLmrrmOJ4K0J9J4J2J4J1Km
$$ -52 -66 -55 -26 6 38 69 100 121 128 122 113 105 99 94 95 98 93 76 54 40 32 22 7 -5 -9 -5 0 0 -5 -15 -21 -20 -14 -11 -15 -24 -33 -37 -31 -17 3 22 36 48 62 73 75 71
9481G1lLNNMQJ0J0Nlj2j9j9j8j2JJ6K9K6Qj2k0j8j2o%J0K1K9L2L2K7J9J3Onk0k5j4QK1J7N
$$ 71 68 71 76 81 85 93 103 113 118 115 103 84 65 47 35 36 52 81 107 115 103 83 65 53 47 47 57 78 107 139 171 198 217 230 236 231 211 186 172 180 201 218 223
9463B23mj1k1k7k3oQJ7K5L0K4Lj5j9j5j8l0l7k8j2%L%jl%MQJ0PNjoj4k3l2l8l6k1oJmj1j0
$$ 223 219 208 187 160 137 131 139 156 181 211 235 238 223 204 189 171 141 104 76 64 64 67 67 66 63 63 67 75 85 92 97 96 90 76 53 21 -17 -53 -74 -80 -79 -83 -94 -104
9446a04%ORJ1J7K3K3K1K2K4K0Rpk2k9k5qJ4L2L5L1K1Ppj0nMOLJJjknj1k0k7k3j0NJ5J5Pnj4
$$ -104 -104 -98 -89 -78 -61 -38 -15 6 28 52 72 81 74 52 23 -2 -10 4 36 71 102 123 130 123 113 108 112 118 121 122 123 122 120 115 104 84 57 34 24 29 44 59 66 61 47
9428D7rQK3K6K0J2PQJ0J1Okmj%lj0j2j1oKJ3J7J6J0Mj2l2n2n7m8l3j5LJ8K4K4K8L2L2K6J9
$$ 47 38 46 69 95 115 127 134 142 152 163 169 167 163 162 162 159 149 137 126 120 122 135 152 168 178 182 170 138 86 29 -19 -52 -67 -64 -46 -22 2 30 62 94 120 139
9411A39Rnk0k8k4j3jJj1k7k5kK6L5K2OKOjj3j8j0%NKmmkNQPKl%PJ5J8J1jlKJ2J2Jj6k1j7o
$$ 139 148 143 123 95 71 58 57 58 47 20 -5 -7 19 54 76 82 84 90 89 76 58 48 48 53 55 51 47 45 50 58 65 67 64 64 71 86 104 115 114 111 113 125 137 138 122 101 84 78
9391G8koj5k0k4k3k3j8j3j2j2kJ7L5L9K7J4RJ0J5K0K1J7QJoj2k1l0l2k4j5p%J3L0M2L6J6o
$$ 78 76 70 55 35 11 -12 -35 -53 -66 -78 -90 -92 -75 -40 -1 26 40 49 59 74 94 115 132 140 141 135 123 102 72 40 16 1 -6 -6 7 37 79 115 131 125
9375A25j6j6qjLNLoj4j2jJ0J5J3J6K4K6J6jj7k9l8m1l6j8NK5L3K8J3mj8k9k8j8kJ1J1Kj1k0
$$ 125 109 93 85 84 87 92 95 89 75 63 62 72 87 100 116 140 166 182 181 164 135 97 56 20 2 7 32 65 93 106 102 84 55 27 9 7 18 29 31 20 0
9359@k2j2KJ0OJNJ7K5K1J1QJ0J4J0Koj0oPK2L6L9L3K0J0MJnj4k0k2j7rMJ2J3QMKlj2k0k6k7
$$ 0 -22 -34 -32 -22 -16 -15 -10 7 32 53 64 72 82 96 106 108 102 92 86 93 115 151 190 223 243 253 257 258 253 239 219 197 180 171 175 187 200 208 212 214 211 199 179 153 126
9341A26k1j2n%jmj2k2l0k2lJ7L0L0K4J4Mkoj1k0k5k1j3nOJ6K0J1lj2j0qpl%KkljK%mnnkKQ
$$ 126 105 93 88 88 87 83 71 49 19 -3 -6 11 41 71 95 109 113 111 105 94 74 49 28 15 10 16 32 52 63 60 48 38 30 23 20 20 22 20 17 16 18 18 14 9 4 2 4 12
9322A2J5K4K6K2J0lj2j6j7j2kMLknmrk0k0j2NJ5J5QJkjNJ0PLMRJ3J1QL%lpm%MKlkQJ5Qj3l2
$$ 12 27 51 77 99 109 106 94 78 61 49 47 51 54 52 47 43 34 14 -6 -18 -13 2 17 25 26 24 23 28 38 45 48 52 61 74 85 93 96 96 93 86 82 82 86 88 85 83 91 106 114 101 69
9301F9l3j8JJ1QkpmMPNJ1K2L4L6L0K6K4K1J5J1J1Pkj2k0k5k9l1k5j6qonmlmlkoj3j5j0LJ4
$$ 69 36 18 19 30 38 36 29 25 29 36 41 52 74 108 144 174 200 224 245 260 271 282 289 287 275 255 230 201 170 145 129 121 115 110 106 103 99 96 94 88 75 60 50 53 67
9283F7J5J0Jklrj9j8%K7M4L9K3J1QNlj5k1k1j7rjjrk1k5k1j6j0kQJ2Lj0k0k4k2j1NK5L3L2
$$ 67 82 92 93 91 88 79 60 42 42 69 113 152 175 186 194 199 196 181 160 139 122 113 112 111 102 81 56 35 19 9 7 15 27 30 20 0 -24 -46 -57 -52 -27 6 38
9266C8J9QKMKoj4j4pMJ3J8K1J7Lj9l4l4j9jJ4J8Rqk6l2k2nJ0J4J0LKMNKjjj%%%QK1L3L9L8
$$ 38 57 65 67 71 73 67 53 39 32 36 49 67 88 105 108 89 55 21 2 1 15 33 42 34 8 -24 -46 -51 -41 -27 -17 -14 -12 -8 -3 -1 -2 -3 -4 -4 -4 -4 4 25 58 97 135
9247A35K9J3j1l2m4m3m0l2j7LK1K3J7J2J0QM%KLjj1k1k1j4mMPJ0J5J4RQJ1J4Qok0k4j9pLJ1
$$ 135 164 177 166 134 90 47 7 -25 -42 -39 -18 5 22 34 44 52 56 56 58 61 60 49 28 7 -7 -11 -7 0 10 25 39 48 56 67 81 89 83 63 39 20 13 16 27
9230B7J1QJ1J7K1J6PK%JjmmLJ3J7J4OLNNNMKoqjJ2J6J1L%j0k7l8l3j6nlj0j8k2j8mJ3K0J4
$$ 27 38 46 57 74 95 111 118 120 120 121 120 116 112 115 128 145 159 165 168 173 178 183 187 189 183 175 174 186 202 213 216 216 206 179 141 108 92 87 84 74 56 34 16 12 25 45 59
9211E9OMONKnrj0j1j1qJQJ2J1J3J9K3J2oj8k0j0MJ5K1J4kj9k7k6j5JJ3J6J1Mlpq%OLmnPK7
$$ 59 65 69 75 80 82 77 68 58 47 36 28 29 37 49 60 73 92 115 127 121 103 83 73 77 92 113 127 125 106 79 53 38 39 52 68 79 83 80 73 65 65 71 74 70 65 72 99
9192I9M0L7K0ol1m5m6l6j9lOMnj1j1qmmnkNJ1J1J0J3K0K4K4J8J0%qq%J0Rkj4j9j9k0k2j8j1
$$ 99 139 176 196 190 159 114 68 32 13 10 16 20 15 4 -7 -15 -19 -23 -28 -30 -25 -14 -3 7 20 40 64 88 106 116 116 108 100 100 110 119 117 103 84 65 45 23 5 -6
9174fj1j2pRK7L2K5J0lqoljLJ1K2L1L2K3Rkoj3k6l9m2l1j4kNNLknqrj1qjQJ6K0K5K6K2J7O
$$ -6 -17 -29 -36 -27 0 32 57 67 64 56 50 47 46 49 60 82 113 145 168 177 175 169 156 130 91 49 18 4 2 7 12 15 13 8 0 -9 -20 -28 -29 -21 -5 15 40 66 88 105 111
9155A11nj7j9j5poj3k0j9j4qmkMJ1J9J8J2%j3k3k8j8LK2L0K3J5QOJ0J5J7J9K0J7Qj0k7l1k1
$$ 111 106 89 70 55 48 42 29 9 -10 -24 -32 -36 -38 -34 -23 -4 14 26 26 13 -10 -38 -56 -53 -31 -1 22 37 45 51 61 76 93 112 132 149 157 147 120 89 68
9139F8oLONMNRJ1Nmj1nOJ1Lqj1qoqj0pJM%mjOJ3J4J1RJ2K0K7K8J9Pqk1l1l5l0j9nLONOPMp
$$ 68 62 65 71 76 80 85 94 105 110 106 95 90 96 107 110 102 91 83 77 69 59 52 53 57 57 53 52 58 71 85 96 105 117 137 164 192 211 218 210 189 158 123 93 74 69 72 78 83 89 96 100 93
9118I3j7j8j5j4j6j3%J2J6J1MkmoomkKN%j1j8k2k4l0l6l0j5MK3L8M3L4J6ORJ0Krj4j3rnLM
$$ 93 76 58 43 29 13 0 0 12 28 39 43 41 37 31 25 21 19 21 26 26 15 -3 -25 -49 -79 -115 -145 -160 -156 -133 -95 -52 -18 -2 4 13 23 25 16 2 -11 -20 -25 -22 -18
9100a8JkLJ2J8K2K4K5K5J8Mj3k4k3j6j2j9k2j8rnnnlJNJ2J6J6J4J2J3J0PLK%mqrpmJQJ2J1
$$ -18 -17 -19 -16 -4 14 36 60 85 110 128 132 119 95 72 56 44 25 3 -15 -24 -29 -34 -39 -42 -41 -36 -24 -8 8 22 34 47 57 64 67 69 69 65 57 48 41 37 38 46 58 69
9081F9KljNJ2J8K1J7J1L%JLlj5k7l3k9j9rJQJ1Nlrj0oMJ2K0K2J9Ppj6j6rjNPLqk1k6j5kNM
$$ 69 71 68 67 72 84 102 123 140 151 154 154 155 158 155 140 113 80 51 32 23 24 32 43 48 45 36 26 20 24 36 56 78 97 104 97 81 65 56 55 60 67 70 62 41 15 0 -2 3 7
9062Gnj2j0%J1J3Pln%NPNMNOMmj4k2k1j2nmlKJ7K7L2K9K2J3Njnoj0qkQJ1QOM%j0j9j7p%MO
$$ 7 2 -10 -20 -20 -9 4 11 8 3 3 8 15 20 24 29 35 39 35 21 -1 -22 -34 -39 -43 -46 -44 -27 0 32 61 83 96 101 100 95 89 79 71 69 77 88 96 102 106 106 96 77 60 53 53 57 63
9041F3J5K7L5L0J5%ojNNmrj0nll%LN%j2k4l0l2k7k0j1lLML%qj4j7j0RK3K3Qj1j6j2qj4k5k8
$$ 63 78 105 140 170 185 185 179 178 183 188 184 175 165 160 157 154 154 157 162 162 150 126 96 64 37 17 6 3 6 10 13 13 5 -9 -26 -36 -27 -4 19 27 16 0 -12 -20 -34 -59 -87
9022h7j9qJQJ8K4K4K0J9J6Mj2j8j3%J0J4J7J3Okoj3j6j0J0K1J5lj3pKOQJ7L1M2M2L1J1pj5
$$ -87 -106 -114 -113 -105 -87 -63 -39 -19 0 16 20 8 -10 -23 -23 -13 1 18 31 37 35 29 16 0 -10 0 21 36 33 20 13 15 21 29 46 77 119 161 192 203 196 181
9005A81j6k0k9k8j4PK0J9J3J2J5Rlj6k2k1j6j1oJNOKjMJ7K8L0K1Q%mnqqqpprj4k2k6j8lOL
$$ 181 165 145 116 88 74 81 101 120 133 145 160 169 166 150 128 107 91 80 74 75 80 86 88 87 91 108 136 166 187 195 195 191 186 178 170 162 155 148 139 125 103 77 59 56 62 65
8987F5orqorj1rlPJ4J4Q%kLRJ0J0QNjmlkloj3j8k1j6oLJ5K4K7J8jj5j8j4j3j3pJ0K7L4K3O
$$ 65 59 50 42 36 27 16 7 4 11 25 39 47 47 45 48 57 67 77 85 90 89 85 82 80 77 71 58 40 19 3 -3 0 15 39 66 84 83 68 50 36 23 10 3 13 40 74 97 103
8967A03rj5j4rlK%rj6j5nLPQJ4K3K4J8RQJ2J4Mj4l2m3m3l6k7j4%J5K2K1J6J1J3J5J3Kj3k1
$$ 103 94 79 65 56 53 55 55 46 30 15 10 13 20 28 42 65 89 107 116 124 136 150 154 140 108 65 22 -14 -41 -55 -55 -40 -18 3 19 30 43 58 71 73 60 39
8950C9k1k0j9j2ooj0rMK0K7K4K0J5J0Nkrj5j4JJ7J9QlkNPKpj5j3kJ1J7J7J6K0K3J7Nrk2l4
$$ 39 18 -2 -21 -33 -39 -45 -55 -64 -60 -40 -13 11 31 46 56 61 59 50 35 21 22 39 58 66 63 61 66 73 75 68 53 40 38 49 66 83 99 119 142 159 164 155 133 99
8933I9l5k4mQPjokNJ2J1Lloooo%QJ4K0K6K9J9Lqrrj4k0k2k3k7l1k8j9oQJ9K3J9J4J4J8J8J2
$$ 99 64 40 36 44 51 50 44 42 47 59 70 73 70 64 58 52 46 46 54 68 88 114 143 162 165 157 148 139 125 105 83 60 33 2 -26 -45 -51 -43 -24 -1 18 32 46 64 82 94
8914I4LLPJ2Rjj2j7j6j3j7k7l5l4j9JJ5K2K0K0K7L3L1J9J0Njk3n2o3m5j2J0J1MJKKNJ2K0J6
$$ 94 97 100 107 119 128 127 115 98 82 69 52 25 -10 -44 -63 -62 -47 -25 -5 15 42 75 106 125 135 140 139 116 64 1 -44 -56 -46 -35 -31 -30 -28 -26 -21 -9 11 27
8897B7Jj4k1k1k2k1j4NK1K8K3J3J4J6J3KqpPJ7J7Q%JPJ7K4K6K0Mj2k1k2j6rnlj%LKMPPMLQ
$$ 27 28 14 -7 -28 -50 -71 -85 -80 -59 -31 -8 5 19 35 48 50 42 35 42 59 76 84 84 85 92 109 133 159 179 183 171 150 128 112 103 98 95 94 94 97 99 103 110 117 121 124 132
8879A32J5J7J4QLnj6k6k6k6l1l5k6qJ3K3K1J6J1RJ0J2Rlj7k6j9lJ2K0K1J7J0kj4k0j9j0LJ5
$$ 132 147 164 178 186 189 184 168 142 116 90 59 24 -2 -10 3 26 47 63 74 83 93 105 114 111 94 68 49 46 58 78 99 116 126 124 110 90 71 61 64 79
8863G9K1J6Pmj1j5j9k0k1k0j7j9k0k3k2j3KK2L3L4K0Mrj1lPJ1J4J5J3Onj3j3lJ3K5L2K9K2
$$ 79 100 116 123 119 108 93 74 54 33 13 -4 -23 -43 -66 -88 -101 -99 -77 -44 -10 10 14 5 -6 -9 -2 9 23 38 51 57 52 39 26 23 36 61 93 122 144
8846A44J2KmmJMkqp%NMNPMj2k7l4l2l0k8j7lJ4K1K3J8J3QPPJopok%LRJ3J2J1J0PMJJlnnmq
$$ 144 156 158 154 150 151 155 153 145 138 138 143 147 152 159 163 151 124 90 58 28 0 -17 -20 -6 15 38 56 69 77 84 91 92 86 79 73 71 71 74 83 96 108 119 129 136 140 141 142 139 134 129 125 117
8826A17j8k4j8nPJ0Q%plPJ6J6J1QQMnrpkJNOK%LJ2J7J0oj9k4k2j6j5j9k3j9lJ6K6J9QkmlJ
$$ 117 99 75 57 52 59 69 77 77 70 67 74 90 106 117 125 133 137 132 123 116 114 115 120 126 128 128 131 143 160 170 164 145 121 99 83 68 49 26 7 4 20 46 65 73 71 67 64 65
8806F5PJ3J1Lmj1k2l3l7k8pJ2K1K6L1K7Rj6l2k9j9j0lRJ9K4K2K2L1L9L2J2qj6j1lklnlk%j
$$ 65 72 85 96 99 95 84 62 29 -8 -36 -43 -31 -10 16 47 74 83 67 35 6 -13 -23 -26 -17 2 26 48 70 101 140 172 184 176 160 149 146 144 141 136 133 131 131 130
8789A30npplnj5k4k3j1MJ8K4K6J5jj2j5qOJ7K4J9Oqj6k0k0j5mLNKJKKKJ%mlJPO%qj5j4oQJ8
$$ 130 125 118 111 108 103 88 64 41 30 34 52 76 102 117 116 104 89 81 87 104 128 147 153 145 129 109 89 74 70 73 78 80 81 83 85 87 88 88 84 81 82 89 95 95 87 72 58 52 60 78
8769G8K0J7J3RKmlOJ3J0jj7k8k9k3j7j7j7j2nloplKLKKJKRK0K9K6J5Lpj8k9l3k8j7lRJ4Po
$$ 78 98 115 128 137 139 135 132 138 151 161 160 143 115 86 63 46 29 12 0 -5 -8 -14 -21 -24 -22 -19 -17 -15 -14 -12 -3 17 46 72 87 90 83 65 36 3 -25 -42 -45 -36 -22 -15 -21
8750b1j3rKOMJOJ7K4K4J8J7K4L0K8J9Oqk0k7k6k0j5rJJ4K5K7K3J6Qoj9k9l3k9j7mOJ0J8L3
$$ -21 -34 -43 -41 -35 -31 -30 -24 -7 17 41 59 76 100 130 158 177 183 175 155 128 102 82 67 58 59 73 98 125 148 164 172 166 147 118 85 56 39 35 41 51 69 102
8733A02M3L6J6mj3j5j6j3kRJ8J9J6J5J3Plj3j9j5mJ2K3K8K2J1mj4k2k8k9k2pRJ6J5PJqj7k4
$$ 102 145 181 197 193 180 165 149 136 134 143 161 180 196 211 224 231 228 215 196 181 177 189 212 240 262 273 269 255 233 205 176 154 147 156 172 187 194 195 187 170 146
8717A46k9k9k9k5j1J0L2M5M3K8J1MPJ1Opk4l5l7k6kK3L4K6Rmqj0j5k2k4j4KJ7K2K0J5RPLJ
$$ 146 117 88 59 34 23 33 65 110 153 181 192 196 203 214 220 213 189 154 117 91 89 112 146 172 181 177 169 159 144 122 98 84 86 103 125 145 160 169 176 179 180
8700A80%JjlpqqqlLJ1J2J1QOKkmjNPJpj5k1k5k6k3j4kJ0J8K2K4K0J3%j6k8l5l5k9k2j6j3l
$$ 180 180 181 180 177 170 162 154 146 143 146 157 169 180 188 194 196 194 190 189 194 201 202 195 180 159 134 108 85 71 69 79 97 119 143 163 176 176 160 132 97 62 33 11 -5 -18 -21
8682b1RJ5J5J0J1J6J6J1QJ3K3K7K0Mj6l1l5k5oJ0J8J3Lpj3rjJ1K2K9K8J5kj2q%jj1k0j7mQ
$$ -21 -12 3 18 28 39 55 71 82 90 103 126 153 173 177 161 130 95 70 64 74 92 105 108 101 88 79 78 89 111 140 168 183 181 169 161 161 160 149 129 112 108 116
8665A16J3J0LkjPJ4J3jj6k6k6k4k2j8j2mMJ2K0K1J4QRJ2J3P%kKQOjpnKQJ2J4J7J8J4QQJ4J4
$$ 116 129 139 142 140 139 146 160 173 172 156 130 104 80 58 40 28 24 28 40 60 81 95 103 112 124 137 144 144 142 144 152 158 157 150 145 147 155 167 181 198 216 230 238 246 260 274
8647B74OmrqoprplLOMkoqj2j6j7j3j0qj0j1j1j3j5j0lKMLlj1j7j3KJ3J8J8K0J8J0Kloj2k3
$$ 274 280 276 267 259 253 246 237 230 227 230 236 240 238 232 224 212 196 179 166 156 148 138 127 116 103 88 78 75 77 81 84 81 70 53 40 42 55 73 91 111 129 139 141 138 132 120 97
8628I7l1l1l1k4j6olqpJ0L5M7M7L9L0J9Lj3j8j3oj0j9k6k2rMJ4K3L2L7L0J8J2J3J5Pnj5j5
$$ 97 66 35 4 -20 -36 -42 -45 -53 -60 -50 -15 32 79 118 148 167 170 157 139 126 120 110 91 65 43 34 38 52 75 107 144 174 192 204 217 232 239 234 219 204
8612B04j3j2j2j1qolKOMmj0j7k4k8k1qLQJ0J5J7J0KKLmj6j8nJ1J7J5J5J8J4J0PPnk5m1m2l5
$$ 204 191 179 167 156 148 142 139 141 147 151 147 137 120 96 68 47 39 42 50 60 75 92 102 104 106 109 105 89 71 66 77 94 109 124 142 156 166 173 180 175 150 109 67 32
8594C2l4m0l6j8NJ8J9J3J4K1L3M2M1L6K4Qoj5j1l%jmkkmqpKJ3K2K3J9J0Jj4l3m9m7l1j9j2
$$ 32 -2 -42 -78 -96 -91 -73 -54 -41 -27 -6 27 69 110 146 170 178 172 157 146 143 143 142 138 136 134 130 122 115 117 130 152 175 194 204 205 191 158 109 62 31 12 0
8577@j1JJ3J9J5QKjoqqooLK0L8M4L4J5kj5k3k8k9k4j9r%OPMNJ5K6K7J2pj6j6j3j0pMJ7K4K4
$$ 0 -11 -10 3 22 37 45 47 46 40 32 24 18 12 15 35 73 117 151 166 164 149 126 98 69 45 26 17 17 23 30 34 39 54 80 107 119 112 96 80 67 57 50 54 71 95 119
8559A19J3%qnMJ1RMlj3j8j8rj%qj7k0j3JJ7K0J0%kOJ1QJrj9k4j9nRJ7J8J8J8K2K3J9Qpk1l1
$$ 119 132 132 124 119 123 134 143 147 144 131 113 95 86 85 85 77 60 40 27 28 45 65 75 75 73 79 90 98 99 90 71 47 28 23 32 49 67 85 103 125 148 167 175 168 147 116
8540A16k9j8pnj5k3j7kMOMPJ0RJ1J9K5K5J7PJnol%jqj6k0k3k0j5pjMNKkJORMJNJ2J3PKKLL
$$ 116 87 69 62 57 42 19 2 0 4 10 14 21 31 40 51 70 95 120 137 144 145 140 134 131 131 130 122 106 86 63 43 28 21 20 24 29 31 29 30 36 45 49 50 55 67 80 87 89 91 94 97
8520I7LPQOJjLKmrmOJ7K3K6K7K0Pj0k1k7k4k0qOJ8K4J4mk0k5j6n%LJ0K0K3Rj2k8l4l6l6l3
$$ 97 100 107 115 121 122 121 124 126 122 113 109 115 132 155 181 208 228 235 225 204 177 153 133 125 131 149 173 187 183 163 138 122 117 117 120 130 150 173 182 170 142 108 72 36 3
8502Ck1pOJ5J9K1J7J0Kj%MO%pj0nJLMOP%rj4j4j0lJ0K6L6L5K6J3Lknj4l0m1m4l7l2k4j5jP
$$ 3 -18 -25 -19 -4 15 36 53 63 65 64 64 68 74 74 67 57 52 53 56 60 66 73 73 64 50 36 26 23 33 59 95 130 156 169 172 170 165 151 121 80 36 -1 -33 -57 -72 -73 -66
8483f6J3J8K6K5J7Nkrj9k5k3j3nJPJ4J4QMJ1K2K4J3kj6k2k0qJ2L6M6M0K0mk3l3l2k5j7j0K
$$ -66 -53 -35 -9 16 33 38 36 27 8 -17 -40 -53 -58 -57 -50 -36 -22 -14 -10 1 23 47 60 58 42 20 0 -8 4 40 86 126 146 142 119 86 54 29 12 2 4
8466DJ7K5J9KrkJ4L0L3K0nk3k2nJ1J2MLJ0J6J7J3J0QRJ0QJnoJJrk5l5l3k4rQJ6J1kj3j5j3
$$ 4 21 46 65 67 58 56 70 100 133 153 148 125 103 98 109 121 125 128 138 154 171 184 194 202 211 221 229 230 225 219 220 221 212 187 152 119 95 86 94 110 121 119 106 91 78
8448G8rprj0qJJ3J7J1Knj1j3qLJ6J5%j3j6j0opj1qlKJmj0j2oKNJnolNJ5K1K0J5J4J8K4K2J6
$$ 78 69 62 53 43 35 36 49 66 77 79 74 63 50 42 45 61 76 76 63 47 37 31 24 13 5 2 4 5 1 -9 -21 -27 -25 -20 -19 -24 -30 -33 -28 -13 8 28 43 57 75 99 121 137
8429A37QJlpppj3j9k0j1KRRQKj0k2k8k4j5pLJ1J1RMLQJ2J6K1K3J9J3Krj8j9j2m%LNPKj1j8
$$ 137 145 146 143 136 129 122 109 90 70 59 61 70 79 87 89 79 57 29 5 -10 -17 -14 -3 8 17 21 24 32 44 60 81 104 123 136 138 129 111 92 80 76 76 79 84 91 93 82 64
8410F4j5mJjpoJMNPJ1J7J3OJKKnj3j9k1k2k1j2JJ4K5K9K6K1J7J4Pnj7j8pPJ0NkjOJ6J9J3J
$$ 64 49 45 46 45 38 32 33 37 42 49 60 77 90 96 97 99 101 96 83 64 43 21 0 -12 -11 3 28 57 83 104 121 135 142 137 120 102 95 102 112 117 115 114 120 136 155 168 169
8391A69j1j9k6l2l1j6JJ0J0Lqk4l5l6j8RL1L9L8L2K0PmnJQJ1J0J0OjpnJjj2k1j9j0lJNRJ0
$$ 169 158 139 113 81 50 34 35 45 55 58 50 26 -9 -45 -63 -54 -23 16 54 86 106 113 109 104 105 113 124 134 144 150 149 142 137 138 137 125 104 85 75 72 73 78 87 97
8373I7LkmKQJ2J1OLKMLlrj2rrj0j0rj2j7k2k1j2nOJ5K4K6K3K1K3K3J8Qjj0j9k5k6k5k2j7j0
$$ 97 100 98 94 96 104 116 127 133 136 138 142 145 142 133 121 112 103 93 83 74 62 45 23 2 -10 -15 -9 6 30 56 79 100 123 146 164 172 171 161 142 117 91 66 44 27 17
8355A7kkpqJK0L3K8J0rk1k1j6rmJPJ1PJ%QJ8J8J0kj2k2l1l3k4pPJ4J6J9K5K1Qqj4q%NNJlj0
$$ 17 15 13 6 -2 -1 19 52 80 90 81 60 39 23 14 10 11 18 29 36 37 37 45 63 81 91 89 77 55 24 -9 -33 -40 -33 -19 -3 16 41 62 70 62 48 40 40 45 50 51 48 38
8336C8j3nRJ8J7RRJ1J4Q%kKJ2J7J6Pmj2j6j8k0j7j3nJMOQJ2Rjj3k0j2LJ3Prk0j9j2j0j6k4
$$ 38 25 20 29 47 64 73 82 93 107 115 115 113 115 127 144 160 167 163 151 135 117 97 80 67 62 63 67 73 81 93 102 101 88 68 56 59 72 79 70 50 31 19 9 -7 -31
8318c1k1j1JNMMOJ3J7J8J3Moj0o%J2K1K6K2J0KjLQRNlj3k5l2k7rJ1K0J5OkllKJ0J7J9K0J9
$$ -31 -52 -63 -62 -57 -53 -49 -43 -30 -13 5 18 22 16 6 0 0 12 33 59 81 91 93 92 95 103 112 117 114 101 76 44 17 8 19 39 54 60 58 55 52 54 64 81 100 120 139
8300A39J5Kj5k7k8k4k1j6j1rj6k8l0k3j4j1oKJ5K7L6L4K0%j5k2j8j2pjJ1K0K0J0mj2j2qmj
$$ 139 154 156 141 114 86 62 41 25 14 5 -11 -39 -69 -92 -106 -117 -123 -121 -106 -79 -43 -9 11 11 -4 -26 -44 -56 -63 -64 -53 -33 -13 -3 -7 -19 -31 -39 -43 -44
8284d4LJ1K2K7K7K2J8J7J5RKkKJ1J7J7Qmj7k6k9k4j4jJ4K4K5J6LknnolMOLjJNPMLNJ0RKor
$$ -44 -41 -30 -8 19 46 68 86 103 118 127 129 127 129 140 157 174 182 178 161 135 106 82 68 67 81 105 130 146 149 147 142 137 131 128 132 138 141 140 141 146 153 157 160 165 175 184 186 180 171
8264A71roj0j4j6pNJ5J5J2PNJj0k3l3l2k2rLJ3K4L1K9K1J3J0RQLknomjlj2j9j7nM%j4k3j9
$$ 171 162 156 146 132 116 109 114 129 144 156 163 168 169 159 136 103 71 49 40 43 56 80 111 140 161 174 184 193 201 204 202 197 191 187 186 183 171 152 135 130 134 134 120 97 78
8246G8qJJorrqj0j6j8j7rjLjnkQK3L1L5L2K5K0J2jj5k2j9j5j3jJ9M0M4K2ql6n0m6l0pJ0J3
$$ 78 70 71 72 66 57 48 40 30 14 -4 -21 -30 -31 -28 -29 -34 -36 -28 -5 26 61 93 118 138 150 149 134 112 93 78 65 64 83 123 167 189 181 145 95 49 19 12 22 35
8228C5J5J9K7K7J7kj5j8mJ7L2K6Qrj5j1nKJmojM%j0j5oPJ1Nlrj7j9rOJ1Jj7k4j9rmpj3j8k2
$$ 35 50 69 96 123 140 138 123 105 101 118 150 176 184 175 160 149 144 146 147 143 137 136 140 140 130 115 109 116 127 132 129 120 103 84 75 81 92 93 76 52 33 24 20 13 0 -18 -40
8209d0k3j9oJ3K6K2QLPR%j5k0j0PJ7K2K4K3J8J2J1O%qj2rjNONJmj4k2k5j7mkj0j6j0JQNkp
$$ -40 -63 -82 -88 -75 -49 -27 -19 -16 -9 0 0 -15 -35 -45 -38 -21 1 25 48 66 78 89 95 95 87 75 66 65 70 76 81 82 78 64 42 17 0 -4 -6 -16 -32 -42 -41 -33 -28 -30 -37
8190c7qpoj0j7k0rJ2K8K7J3jrj1mJ3L3L8K8J1kppqj1j3j0JJ2J3Nm%RJ1Koj1j4k3l2l1j8kP
$$ -37 -45 -52 -58 -68 -85 -105 -114 -102 -74 -47 -34 -35 -44 -55 -59 -46 -13 25 53 64 62 55 48 40 29 16 6 7 19 32 37 33 33 42 53 55 49 38 24 1 -31 -62 -80 -82 -75
8172g5J0RQJ0J6K1K4K6K7K9K6J7Olqj4j8j7j1pqj2rjRJ8K5L0L3L1K1jk7l9k5lJ2J2Nmj6k6
$$ -75 -65 -56 -48 -38 -22 -1 23 49 76 105 131 148 154 151 143 129 111 94 83 76 68 56 47 46 55 73 98 128 161 192 213 212 185 146 121 118 130 142 147 143 127 101
8155A01k4oJ2K1K4K7K6J0j1k0j2lopJJ4J8Ppk0l0l9m5m4m0l1k0pOJ6K1K0J8J3PkpkJ1K4K5
$$ 101 77 71 83 104 128 155 181 191 180 160 148 145 139 132 133 147 165 172 165 145 115 76 31 -13 -53 -84 -104 -111 -105 -89 -68 -48 -30 -17 -10 -12 -19 -21 -10 14 39
8139C9J2kj0qJJ2K0J8J0jj2k3l1l3l2k6j6njqj4qRK1K3K2K6K4K0J1J2J7J5Okloj3k3k6j9o
$$ 39 51 49 39 31 32 44 64 82 92 91 79 56 25 -8 -40 -66 -82 -87 -88 -96 -110 -118 -109 -88 -65 -43 -17 7 27 38 50 67 82 88 86 83 77 64 41 15 -4 -10
8122a0RK2K9K8K0Pqj7j7j4j6j9j4lLlj0qjLLQK0L2L8L7K9J3pk3k4j9j6j4j2mNJ1J1Plj3j9
$$ -10 -1 21 50 78 98 105 97 80 63 49 33 14 0 -3 0 -3 -13 -21 -22 -19 -16 -8 12 44 82 119 148 161 154 131 107 88 72 58 46 42 47 58 69 76 73 60 41
8105D1k5k8l2k8j6lPJ2J1J1J4J6J3Kpp%MPJ3K3K6J9J1Jqj6j6oOJ4J5Qjj1j1jJ1J4PKKLjqj4
$$ 41 16 -12 -44 -72 -88 -91 -84 -72 -61 -50 -36 -20 -7 -5 -12 -19 -19 -15 -8 5 28 54 73 84 85 77 61 45 39 45 59 74 82 81 70 59 58 69 83 90 92 94 97 96 88 74
8086G4j4j1qpnlLJ0J6J8K1J9Rqk0j9mJ4K2J8Mj3k9l1k3qKkj1j1KJ8K4J9J3RKj4k5k3nJ0J3
$$ 74 60 49 41 34 29 26 29 39 55 73 94 113 122 114 94 75 71 85 107 125 129 116 87 56 33 25 27 25 14 3 5 23 47 66 79 88 90 76 51 28 23 33 46
8069D6J3J7K1J8QjJJ3K4K6K1J7J5J7J5Rjj8l5m6m4k9j1KOQJ0RROOPMmj7k5k3j2LJ1J3J5J7
$$ 46 59 76 97 115 123 122 123 136 160 186 207 224 239 256 271 280 279 261 226 180 136 107 96 98 104 112 122 131 140 146 152 159 163 159 142 117 94 82 85 96 109 124 141
8052A41K0K1J6J0Kjlmoj1j3rlmj3k0j6lLKjmonMJ9L0K9J9RLpk0k3j6ojnj0j7j8j0QK3K6J5
$$ 141 161 182 198 208 210 209 206 202 196 185 172 163 160 156 143 123 107 104 107 109 108 104 98 93 97 116 146 175 194 203 206 199 179 156 140 134 133 128 118 101 83 73 81 104 130 145
8033A45QOPJmnloj3j8j7mJ2K4K0NrqMJ1Q%monopj1j5j8j7j1olmqj2j0%J5K1J5Knokjpj4j8
$$ 145 153 159 166 167 163 158 155 149 136 118 101 97 109 133 153 158 149 141 145 156 164 164 160 154 149 143 136 125 110 92 75 64 58 55 51 43 31 21 21 36 57 72 74 69 63 61 60 53 39 21
8013B1j5pJRJ8J8Rmj0nLJ1J8K4K1J0JNJ7K0J0pk1l4m2m2l1j9j4j5j5rjKLQK0L4M3M3L6K4J1
$$ 21 6 -1 0 9 27 45 54 50 40 35 38 49 67 91 112 122 123 128 145 165 175 168 147 113 71 29 -2 -21 -35 -50 -65 -74 -75 -73 -70 -62 -42 -8 35 78 114 138 149
7996A49kj0rmKJ0J5J6Pqk2l5m3m4l4j7JJ1J7J7J6J1NMKjkJOMkrj0j0kJ5L6M4L4J6Mnj6k7k9
$$ 149 147 137 128 124 126 136 151 167 174 166 144 109 66 22 -12 -29 -28 -17 0 17 33 44 49 53 55 54 52 53 59 63 61 52 42 32 30 45 81 125 159 175 179 174 158 131 102
7978A02j9rrj5j9j8j3mJ1K6K9K1Rjpj3j9k3j9rJPQQQRPJpj0j2j3qJJ5J0rk6k3nRQNMQPJ1J5
$$ 102 83 74 65 50 31 13 0 -4 7 33 62 83 92 91 84 71 52 29 10 1 2 9 17 25 33 42 49 50 43 33 21 8 0 1 16 26 17 -9 -32 -37 -28 -20 -15 -11 -3 4 15 30
7959C0J5Pnj1oKOLjKRJ6J6J4J1J1RKj1k2k7k0mJ2J7J5J0Nnj5k0j4qmJJ0J9K1J9J6J8J9K0J7
$$ 30 45 52 47 36 30 32 38 41 40 42 51 67 83 97 108 119 128 130 119 97 70 50 46 58 75 90 100 105 100 85 65 51 43 39 40 50 69 90 109 125 143 162 182 199
7941A99Pqk3l2l3l2l2k8j7%J9L4L4K0jj5j6j3j2rkOOkonkjkMJ6K3J7MnmlkkQJ9K1J3Krj4j3
$$ 199 206 198 175 143 110 78 46 18 1 1 20 54 88 108 107 92 76 63 51 42 40 46 52 50 44 39 37 36 34 38 54 77 94 98 93 89 86 84 82 90 109 130 143 145 136 122 109
7922A09mKnj6k1j0MROLL%kknj4k1k2j7j9k0j6mJ0J5J5J1N%mpj0qKJ0RJj0j9k3k1qJ1K9L5L0
$$ 109 105 107 102 86 65 55 59 68 74 77 80 80 78 76 71 57 36 14 -3 -22 -42 -58 -62 -52 -37 -22 -11 -6 -6 -10 -17 -27 -35 -33 -23 -14 -13 -23 -42 -65 -86 -94 -83 -54 -19 11
7904A1K6J7RKJOJ1J2Q%qpLJ6K3J9J0Jmlmj1k2k7k4j7j1lJ2K7K9J3oj4j2j0j1qMJ9K1Pj1k2
$$ 11 37 54 63 65 66 72 83 95 103 103 95 88 91 107 130 149 159 160 156 153 149 138 116 89 65 48 37 34 46 73 102 115 109 95 83 73 62 54 58 77 98 105 94 72
7886G2k0j4j1j1q%J1J9K6L3M0L8K8J2joo%QJ5K2K3K0J4QJmoj2k3l4m1m0l6l2k3j0KJ3J4J0
$$ 72 52 38 27 16 8 8 19 38 64 97 137 175 203 215 214 208 202 202 210 225 247 270 290 304 312 313 309 303 291 268 234 193 153 117 85 62 52 54 67 81 91
7870I1ONJ1J6J4J2J2J4Oj0k8l4l1j5RL0L2J8LkLQJ0J0J1Nnj4j8k1j7pRJ7J8J4Nj1k9l3k2q
$$ 91 97 102 113 129 143 155 167 181 187 177 149 115 84 69 78 108 140 158 161 159 162 170 180 190 201 206 201 187 169 148 131 124 133 150 168 182 187 176 147 114 92 84
7853H4%LJ2K0J8Mj0j6j3p%PJ2J7K1K4K3J2lj5k1j6j0nnmjKK%%KJ%JOJ0J2QLJPJ2J0Jo%J3K4
$$ 84 84 87 99 119 137 141 131 115 102 95 95 102 114 131 152 176 199 211 208 193 172 156 146 141 136 132 131 133 135 135 135 137 138 138 139 145 155 167 175 178 179 186 198 208 209 203 203 216 240
7833B40J9Jk3l7l6k4j1pmKQJ0OJkjJLPNLLRJ5J9K4L2L0J3j3l0k7j3kNRJ1J1Kqj5j1KK0L4L6
$$ 240 259 260 237 200 164 140 129 122 118 120 128 138 144 145 143 142 143 146 153 158 161 164 173 188 207 231 263 293 306 293 263 236 223 221 226 235 246 257 259 251 236 225 227 247 281 317
7815C17K7Rqj2p%kj1j6qRK3K4J9J5J8K4K6K3K0J9J9J4OLJ0K6M2N3N8O2O3O3O6P3Q7J05J27
$$ 317 344 353 345 333 326 326 324 313 297 289 298 321 345 364 379 397 421 447 470 490 509 528 542 548 551 561 587 629 682 740 802 865 928 994 1067 1154 1259 1386
7799A386J49J68J82J87J92K02K27K71L28L92M59N29O07O91P78Q65R59J059J144J170J071P91
$$ 1386 1535 1703 1885 2072 2264 2466 2693 2964 3292 3684 4143 4672 5279 5970 6748 7613 8572 9631 10775 11945 13016 13807
7790A3807L21k71q44j252j433j420j297j123r36p58o08m94m06l40k87k45k06j69j39j21j11
$$ 13807 14128 13857 13013 11761 10328 8908 7611 6488 5552 4794 4186 3692 3286 2946 2659 2414 2208 2039 1900 1779 1668
7782A668j06r9q3n9l4j3npj7l2m5n0m8m3l7l0j8oKJ2K2K4J5LkKQJ6L0M8O2O1N4M7N1N9P2Q6
$$ 1668 1562 1463 1380 1321 1287 1274 1269 1262 1245 1213 1168 1118 1070 1027 990 960 942 936 938 950 972 996 1011 1014 1012 1014 1022 1038 1068 1116 1178 1239 1293 1340 1391 1450 1522 1608
7767A608J08J37J71K05K39K76L18L71M31M97N66O36P14Q04R06J019J123J194J179J006O32
$$ 1608 1716 1853 2024 2229 2468 2744 3062 3433 3864 4361 4927 5563 6277 7081 7987 9006 10129 11323 12502 13508 14140
7758A4140Q3n26j044j359j454j384j230j057q86p33o00m98m18l46k76k14j69j40j16r4p6o5
$$ 14140 14223 13697 12653 11294 9840 8456 7226 6169 5283 4550 3950 3452 3034 2688 2412 2198 2029 1889 1773 1679 1603 1538
7749A538o3o7p5p7o9n3l8l3l0k5j5nkpj6l0m0m5m3l4j5J0L0L6L3M0N7P5Q1P0N6M8N3P0R3J14
$$ 1538 1475 1408 1333 1256 1187 1134 1096 1063 1033 1008 993 988 986 979 963 933 893 848 805 771 756 766 796 832 865 905 962 1037 1118 1188 1244 1292 1345 1415 1508 1622
7735A622J26J34J48J74K12K54K97L35L76M30N05N95O86P67Q44R27J023J111J152J085Q49M12
$$ 1622 1748 1882 2030 2204 2416 2670 2967 3302 3678 4108 4613 5208 5894 6661 7505 8432 9455 10566 11718 12803 13652 14064
7726A4064j68p60j208j425j427j300j134r71q22o86n65m67l92l29k77k31j94j62j34j12r5
$$ 14064 13896 13136 11928 10503 9076 7776 6642 5671 4849 4163 3598 3131 2739 2410 2133 1902 1708 1546 1412 1300 1205
7718A205q6p9p6p2o7n5l9k7k1k0k2l2m5n1m3l2k7k5j6OK9M2M1K8Qoj1qpj2j6j9k3k8l3k8j9
$$ 1205 1119 1040 964 892 825 770 731 704 683 663 641 609 564 513 470 438 411 386 370 376 405 447 488 516 524 518 507 499 492 480 464 445 422 394 361 333 314
7703C14j8k4l7m4m4l3j6jNPPQQQMkrj2kJ4K8L3K9J8QKmj0j6j4oJlj3j8j9j7j6j0PK3L2K8J2
$$ 314 296 272 235 191 147 114 98 97 102 109 116 124 132 140 144 142 133 121 119 133 161 194 223 241 249 251 247 237 221 207 201 202 199 186 168 149 132 116 106 113 136 168 196 208
7685B08pk4k6j5JJ1J5J1%j3k4k7l1l6l8l0j6mNJ5K0J8J5J7K1K6K6K6K4J5jj2j0KQOmj6k1j7
$$ 208 201 177 151 136 137 148 163 174 174 161 137 110 79 43 5 -25 -41 -45 -40 -25 -5 13 28 45 66 92 118 144 168 183 182 170 160 162 170 176 172 156 135 118
7669A18rj0k3l5l5k5j6oNJ4K1J9K0J9J6Pkqj2j8k2k3j8j1mjj%NJ0J1Jj4k6l0k5j5kJ4L2M6
$$ 118 109 99 76 41 6 -19 -35 -41 -36 -22 -1 18 38 57 73 80 78 70 58 40 18 -5 -23 -34 -38 -39 -40 -40 -35 -25 -14 -13 -27 -53 -83 -108 -123 -125 -111 -79 -33
7653c3M9M1K6RmrmQJ3MnnOJ5K0K0J6Ppj7j7j7j7j8j9k0j5%K2L7L4K4J8K2K2J8J6J2Mj5l3m4
$$ -33 16 57 83 92 88 79 75 83 96 100 95 90 96 111 131 151 167 174 167 150 133 116 99 81 62 42 27 27 49 86 120 144 162 184 206 224 240 252 256 241 208 164
7636A64m6m1l2k0qOJ7K3J8RNJ3K1K0J4RJ3J7J5J1Lnj2j3rprj3j2ompj0j1rjQK0K7J9jk1l2
$$ 164 118 77 45 25 17 23 40 63 81 90 95 108 129 149 163 172 185 202 217 228 231 226 214 201 192 185 176 163 151 145 141 134 124 113 104 103 111 131 158 177 176 155 123
7619A23k4pJ1K2K3J6Noj5j8j8j6j5j2oKJ0J0Nlj0j5k0j9j2rj1j9k0j3olkLJ4J9J4Kpqmlkl
$$ 123 99 92 103 125 148 164 169 163 148 130 112 96 81 69 63 65 75 85 90 87 77 62 42 23 11 2 -9 -28 -48 -61 -67 -70 -72 -69 -55 -36 -22 -20 -27 -35 -39 -42 -44 -47
7601d7kmrj3j3mQJ8K5L0K9K5J9J7J8J8J1jj0j1njmoporj5j9j8j4j1j0mkmj2j4rk%lj0j6j8
$$ -47 -49 -53 -62 -75 -88 -92 -84 -66 -41 -11 18 43 62 79 97 115 126 125 115 104 99 98 94 88 81 75 66 51 32 14 0 -11 -21 -25 -27 -31 -43 -57 -66 -68 -68 -71 -81 -97 -115
7583a15j0LJ0P%%JJjNJ6K3K0Opj7j3MK1K6K1K0K3K5J8Lj0j9j8j3kPJ0J0RMnj3qJQMoj7k2k0
$$ -115 -125 -122 -112 -105 -105 -105 -104 -103 -104 -99 -83 -60 -40 -34 -41 -58 -71 -67 -46 -20 1 21 44 69 87 90 80 61 43 30 28 35 45 55 64 68 63 50 42 43 51 55 49 32 10 -10
7564a0j1JRRRJ1J1QRJ6K5K4J1pk0j9qPJ4PlqnLRJ1jj8l3l3k0oMOJ2J7J7J3Jj3k3k5j5lRJ2
$$ -10 -21 -20 -11 -2 7 18 29 37 46 62 87 111 122 115 95 76 68 75 89 96 93 85 80 83 92 103 102 84 51 18 -2 -8 -4 2 14 31 48 61 62 49 26 1 -14 -17 -8 4
7546DJ1J1J3J3Nrj8k0j2kPJ9K3J2rk3j8JJ9K3J8J3J1QOK%LQJ2J2Lj3k4k7k2j7qPK2K9K6J7
$$ 4 15 26 39 52 57 48 30 10 -2 -4 3 22 45 57 48 25 7 8 27 50 68 81 92 100 106 108 108 111 119 131 143 146 133 109 82 60 43 35 42 64 93 119 136
7529A36J3Olj3j1kMKorrnmqj2j3j0nMJ5K1J7Nnopj4k3k1j3lJNRPlj0rnopmkJJLQJ0OK%J%%
$$ 136 149 155 152 139 128 126 130 132 126 117 108 103 99 91 79 66 56 51 55 70 91 108 113 108 102 95 81 58 37 24 21 22 27 36 43 40 30 21 16 10 3 -1 -3 -2 -1 2 10 20 26 28 28 29 29 29
7507B9lmookLJ0J3J1Mnrrnk%knkMJ3J8J8J4RKMJ4K4K8K5J6Ompqj0j7j9qJ0K1K0J2RO%j1k1
$$ 29 26 22 16 10 8 11 21 34 45 49 44 35 26 21 19 19 17 12 10 14 27 45 63 77 86 88 92 106 130 158 183 199 205 201 194 186 176 159 140 132 142 163 183 195 204 210 210 199 178
7487A78k2j7j5j7k5k9k5j6j1okPJ2R%ojRJ5J8K0K4L1L9M2K8Pj1j7j7j7k0k0j2kKjpj2j5j7
$$ 178 156 139 124 107 82 53 28 12 1 -5 -7 0 12 21 21 15 14 23 38 56 76 100 131 170 212 240 247 236 219 202 185 165 145 133 131 133 132 125 113 98 81
7471H1j2jJ2K1K6K7K7K0Oqj7k1k5l0l3k6j1KPKoj3j6j2lRK1K0Rjnprj8k8l5k6nJ7L4L5L2K9
$$ 81 69 68 80 101 127 154 181 201 207 199 182 161 136 106 73 47 36 38 45 47 41 28 12 0 -3 6 27 47 56 55 50 43 34 16 -12 -47 -73 -78 -61 -27 8 40 69
7454F9K4J9RLKNPOJlnkMJ0J2PKjknj0j5k1k6l3l0j6NJ4J2M%%jkkjLPNJnomKLLLJJLQJ1PJo
$$ 69 93 112 121 124 126 131 138 144 145 142 137 135 139 149 161 168 170 169 167 162 152 137 116 90 57 27 11 16 30 42 46 46 46 45 43 41 40 43 50 55 56 51 45 41 43 46 49 52 53 54 57 65 76 83 84 78
7431G8j2j9k1j5nJMRJ6J9J5ROMkj2j8j9k1j8j1NK0K5J7QNRRKj0k2k5k2rMJ5J7J2Kkknj2k2
$$ 78 66 47 26 11 6 7 11 20 36 55 70 79 85 89 87 75 57 38 17 -1 -12 -7 13 38 55 63 68 77 86 88 78 56 31 9 0 4 19 36 48 50 48 46 41 29 7
7413Gk7j9lJ2J9J7J8J3Nqj3qLJ3J5J2RLmj3k3l1l1k2j0pj1j9j7oRK0K7L0L6L8L6K8K0J4R%
$$ 7 -20 -39 -42 -30 -11 6 24 37 42 34 21 13 16 29 44 56 65 68 64 51 28 -3 -34 -56 -66 -73 -84 -103 -120 -126 -117 -97 -70 -40 -4 34 70 98 118 132 141 141
7396A41j2k3k7k2j0%K%lkjjmjQK2K9K9J9RMNOJrj5j4qk%oj3j4j2mLPOMKjpj7k4j7kJ2J8J9
$$ 141 129 106 79 57 47 47 49 49 46 44 43 42 38 37 45 67 96 125 144 153 157 162 168 169 160 145 131 123 121 121 115 102 88 76 72 75 82 88 92 94 93 86 69 45 28 26 38 56 75
7376G5K1K5K9K4J1mj6k2k3k4k1j1NJ2OlnKOOJ2K0K2J2JjJKKMJj1k3k3j5nkLPLj1k1j8qk%K
$$ 75 96 121 150 174 185 181 165 143 120 96 75 64 69 81 87 84 79 81 87 93 105 125 147 159 160 159 160 162 164 168 169 158 135 112 97 92 90 93 100 103 92 71 53 45 43 43 45
7358D5ML%JLjrr%J2J6J2Nkj0j5j4j2rojJpk1l4k9rJ0K1K0J8J4J0Lqj3j1LJ6J8J8J5J4J1Lj
$$ 45 49 52 52 53 56 55 46 37 37 49 65 77 82 80 70 55 41 29 20 14 13 14 7 -14 -48 -77 -86 -76 -55 -35 -17 -3 7 10 2 -11 -22 -19 -3 15 33 48 62 73 76 75
7339G5kjKJKJmqqpnnkOJ2J3J2Nnj6k1j1LJ1J2J2J5J7Pj0k4l2l1k6j7kJ4K3L0L0K7J8Plprp
$$ 75 73 72 74 75 77 78 74 66 58 51 46 41 39 45 57 70 82 87 82 66 45 34 37 48 60 72 87 104 111 101 77 45 14 -12 -29 -31 -17 6 36 66 93 111 118 115 108 99 92
7320I2okMJ2J9K2K5K2J0j1l0l5k6j1NJ4J5Pqk1k9k9k4j3LJ4J8J2Ojnqj1j1qolklk%MLknmR
$$ 92 86 84 88 100 119 141 166 188 198 187 157 122 96 85 90 104 119 126 118 97 68 39 15 2 5 19 37 49 55 54 49 41 30 19 11 5 2 0 -3 -5 -5 -1 2 0 -5 -9 0
7301@K1J8Kj5j7pPK3L1K9J6Mnj1k0l0l5l1k6k0j2kQJ7K6K8K0J0RK4M0M2K8Prk2l2m1m6l9k3
$$ 0 21 39 41 26 9 2 9 32 63 92 108 112 107 96 76 46 11 -20 -46 -66 -78 -80 -72 -55 -29 -1 19 29 38 62 102 144 172 179 170 148 116 75 29 -10 -33
7285c3jJ5J4PPJ7K7K7J5Lj0k2l2l5l1k0qNJ6K5K0Roj8l0m2n0m2j8J6M0M9M0K5Pqj4j2j0j3
$$ -33 -34 -19 -5 2 9 26 53 80 95 98 88 66 34 -1 -32 -52 -60 -55 -39 -14 6 15 9 -9 -39 -81 -131 -173 -191 -175 -135 -86 -46 -21 -14 -22 -36 -48 -58 -71
7269g1k0k4j7LK3L6L8L2K0Qjpj1j1rjRJ0J0RJ0MlnLJ1J1JmmnqjJ7L8N0M8L4J2j2k7k7k0j4
$$ -71 -91 -115 -132 -129 -106 -70 -32 0 20 28 27 20 9 -2 -11 -12 -3 7 17 26 36 40 37 32 35 46 57 58 54 50 45 37 36 53 91 141 189 223 235 223 196 169 149 135
7251A35j2j0orj7k2j7lPQLjjJKKPQOJjLLnj1j0jKmrnJJrj8j9j1jRJ9L3M0M1L3K7K3K1J2nj8
$$ 135 123 113 107 98 81 59 42 39 46 54 57 56 55 56 58 60 67 75 81 82 81 84 87 82 71 61 60 62 58 49 44 45 46 37 19 0 -11 -12 -3 16 49 89 130 163 190 213 234 246 241 223
7231B23j7rJNNNjj1k0j6oJ%mjPJ2Poj2rOJ7J7Nj6l3l9l6k3j3j1j5j0NJ7J7RQJ8K9K8K2J5J3
$$ 223 206 197 198 203 208 213 212 201 181 165 159 160 160 156 155 162 174 181 175 163 154 160 177 194 199 183 150 111 75 52 39 28 13 3 8 25 42 51 59 77 106 134 156 171 184
7213A84J3J0PKnj5j9j8j3pmqj3j3mPJ0Lj1j9j7rqj6l1l9l8k4pJ0K0K6K7K6K5K1J5J2J3J5J7
$$ 184 197 207 214 216 211 196 177 159 146 139 135 127 114 101 97 104 114 117 106 87 70 61 53 37 6 -33 -71 -95 -102 -92 -72 -46 -19 7 32 53 68 80 93 108 125
7197A25J3OmpmjkpnNK0L4M3M2K6Jj6j8j0mmllmj2k0k2j9j7j2qmlpj2j9k5k8k7k3j7j0mkjJ
$$ 125 138 144 140 133 129 128 126 119 114 119 139 173 216 258 284 285 269 251 241 237 233 230 227 223 211 191 169 150 133 121 113 109 106 99 87 68 43 15 -12 -35 -52 -62 -66 -68 -69 -68
7178f8J0J9K2J7Qmj1j1kJ1J9K4J8NmomlrrnjlnlMM%nkNJ1J1OkoplMJ6K9L5L0J2nj3%K1L4K7
$$ -68 -58 -39 -17 0 8 4 -7 -18 -20 -9 10 34 52 57 53 47 43 40 31 22 17 16 13 8 5 9 13 13 8 6 11 22 33 39 37 31 24 21 25 41 70 105 135 147 142 129 129 150 184 211
7158B11Qnokmj0j4j2mPJ5J1mj8k4k2k2k1j3JJ4J9J9J5J1OKmj2k3k8k5j4mlqj6j2KJ4J4PJL
$$ 211 219 214 208 206 202 192 178 166 162 169 184 195 191 173 149 127 105 84 71 72 86 105 124 139 150 156 158 154 142 119 91 66 52 48 45 37 21 9 11 25 39 46 47 50
7140E0Mkj3k2k3k7k7k7k5k1k0j8j2%J5K6L2L5L6L8L5K7J3jj4k7l2k7j0J1K6K8K4K1J9J6Oo
$$ 50 54 52 39 17 -6 -33 -60 -87 -112 -133 -153 -171 -183 -183 -168 -142 -110 -75 -39 -1 34 61 74 73 59 32 0 -27 -37 -26 0 28 52 73 92 108 114 108
7125A08j5j8j7j0NK2K9J9Jj8l0k9j7MK1K6K1J1Njoj5k5k8k0nRJ7K3L0L0K3J5J1PLnonnrj3
$$ 108 93 75 58 48 53 75 104 123 124 106 76 47 30 34 55 81 102 113 118 117 111 96 71 43 23 18 27 44 67 97 127 150 165 176 183 186 181 175 170 165 156 143
7108A43j7k1k3k1j5qmmqrkJ4K8K3Mk0l2l0j9pMJ0J2OK%QK1K4J1j2k9l3k6j4jPN%kMJ1J5J2
$$ 143 126 105 82 61 46 38 34 30 22 13 11 25 53 76 80 60 28 -2 -21 -28 -24 -14 -2 4 6 6 14 35 59 70 58 29 -4 -30 -44 -45 -38 -33 -33 -35 -31 -20 -5 7
7091GJ6K4L4L5K8J7J2Q%j1k2k8k6j8nPRMkkNJ4J6J3MlkPJ7J7Qnj9l1l8l5k6j5pJNJoojKmj1
$$ 7 23 47 81 116 144 161 173 181 181 170 148 120 94 76 71 78 87 91 89 87 92 106 122 135 139 136 134 141 158 175 183 178 159 128 90 55 29 14 7 8 13 14 8 2 1 3 -1 -12
7071a2lJ5K6K3J0LLOOJj1k3k6j7jRJ7K1K3K3K0K0K2K6K4J0pj9j9qJMLKONlj6k8l1k0lJ2J4
$$ -12 -15 0 26 49 59 62 65 71 77 78 67 44 18 1 0 9 26 47 70 93 113 133 155 181 205 215 208 189 170 162 163 167 170 172 178 183 180 164 136 105 85 82 94 108
7054A08Moj1j2j9l2l6k9j0MJ5K5L6L2J3qk0k3k4k4j6jQRRJ9L6M1K9Qqj4j8j9j9j6qjMRJ4J7
$$ 108 112 106 95 83 64 32 -4 -33 -43 -39 -24 1 37 69 82 74 54 31 7 -17 -33 -34 -26 -17 -8 11 47 88 117 125 117 103 85 66 47 31 23 22 26 35 49 66
7037F6J2LjKNPQLok2l2l0j6qmkLQJ4K2K9K4J0rk0j6lJ4K4J7%j4j6j4j7k1k0oQJ9J9J4J1RO
$$ 66 78 81 80 82 87 94 102 105 99 77 45 15 -1 -9 -13 -15 -12 -4 10 32 61 85 95 86 66 50 47 61 85 102 102 88 72 58 41 20 0 -6 2 21 40 54 65 74 80
7019H0LKLQJ3J3J0OMJjnol%MKjmqj5j8j8j4j3j8j7%K4L5L1J8J0Mjoj1j4j4pMQOPJ7K5J9Mm
$$ 80 83 85 88 96 109 122 132 138 142 143 142 137 131 128 128 132 134 133 129 121 106 88 70 56 43 25 8 8 32 67 98 116 126 130 129 123 112 98 84 77 81 89 95 102 119 144 163 167 163
6999A63kjnj1j5j6j7j6j3j3j4j1jOOMJqj8k1j4kONMLJjnpkPJ5J9J0nj4j6j6k0k1j3jNJljQ
$$ 163 161 160 155 144 129 113 96 80 67 54 40 29 28 34 40 44 45 37 19 -2 -16 -18 -12 -7 -3 0 1 0 -5 -12 -14 -7 8 27 37 32 18 2 -14 -34 -55 -68 -69 -64 -63 -66 -67 -59
6980e9J6J7J3J0RJ0J5K4K9K6J3%qj5k2k3j7ojMJ1J9J8J2OJ1J8K1J6Nj0k0j7oKNNQJ2J4J6J6
$$ -59 -43 -26 -13 -3 6 16 31 55 84 110 123 123 115 100 78 55 38 32 31 35 46 65 83 95 101 112 130 151 167 172 162 142 125 119 121 126 131 139 151 165 181 197
6963A97J3Lrj1j1j3k2k5j8qpj5k2j9j3qqm%QJ0Ojm%PJ5K1J7Lj6l0l6l0k6j7j0oonkOJ3J8K5
$$ 197 210 213 204 193 182 169 147 122 104 96 89 74 52 33 20 12 4 0 0 8 18 24 23 19 19 26 41 62 79 82 66 36 0 -30 -56 -73 -83 -89 -95 -100 -102 -96 -83 -65 -40
6945d0K5J7Kj7k8k6j2OK3L5L9L5K4J3MKJKOJ5K5L2K9J9Onj1j6k0k4k7k6k5j6pJ%nplPJ4K0
$$ -40 -15 2 4 -13 -41 -67 -79 -73 -50 -15 24 59 83 96 100 102 103 105 111 126 151 183 212 231 237 232 221 205 185 161 134 108 83 67 60 61 61 56 49 46 53 67 87
6928H7J9J4jj1j3lMPQJ2J5Orj8j4omj5k9m0m1l4k0oNJ8L1L8L5K1Kj1k0k2k0j3lJ1K2K8K0M
$$ 87 106 120 119 108 95 92 96 103 111 123 138 144 135 117 103 97 93 78 49 9 -32 -66 -86 -92 -87 -69 -38 0 35 56 58 47 27 5 -15 -28 -31 -20 2 30 50 54
6911E4rj2KK5M8N3L5Lk3l4k8j8j1j2j4j2n%lrj2j2j0j7k1j9qQK6L5L0J0j3l0l6l8l4k0KK0
$$ 54 45 33 35 60 108 161 196 199 176 142 114 96 85 73 59 47 42 42 39 30 18 6 -4 -21 -42 -61 -69 -61 -35 0 30 40 27 -3 -39 -77 -111 -131 -129 -109
6895a09K5J7Nqj5j4nKKNJ2J7J4NjLQNJjLOJ1J7K6K6J5Lprj0rqqmOK0L0K9J5kj4k2k4k6k6k3
$$ -109 -84 -67 -62 -70 -85 -99 -104 -102 -100 -95 -83 -66 -52 -47 -48 -45 -37 -32 -31 -32 -29 -23 -12 5 31 57 72 75 68 59 49 40 32 24 20 26 46 76 105 120 118 104 82 58 32 6 -17
6876a7k1j8j8j8j3nPJ3J7K0K2J8Mqj2j0nj%KkormNJ8L0L5L7L0J6%j4j9j3mMROlj5k5k9k4j2
$$ -17 -38 -56 -74 -92 -105 -110 -103 -90 -73 -53 -31 -13 -9 -17 -29 -39 -44 -45 -45 -43 -45 -51 -60 -64 -59 -41 -11 24 61 91 107 107 93 74 61 57 61 70 76 73 58 33 4 -20 -32
6858c2KJ2J7J7J9J6Mj4k8k7k1j5j4rMJ3J0NQJ3J2Kmk%pj7k0j3rj1k0k6k8k3j1QL0M8N4M7L2
$$ -32 -30 -18 -1 16 35 51 55 41 13 -14 -35 -50 -64 -73 -69 -56 -46 -41 -33 -20 -8 -6 -10 -12 -12 -19 -36 -56 -69 -78 -89 -109 -135 -163 -186 -197 -189 -159 -111 -57 -10 22
6841B2J8Nnpoorj2pJJ1K0K3K1J6J3J3J2Pnj4j6j1j0j4k4l2l0k2j0KJ2J7J6RMMN%opkNOLMJ1
$$ 22 40 45 40 33 27 21 12 0 -7 -6 5 25 48 69 85 98 111 123 130 125 111 95 84 74 60 36 4 -26 -48 -58 -56 -44 -27 -11 -2 2 6 11 11 5 -2 -4 1 7 10 14 25
6822B5J7J8J6J5J4Ppj7j2NJ5RklPJ6J3Lqk1l3l9l4k4j8j6j1%J3K3K9L5L4K3Ooroqj8k5j8l
$$ 25 42 60 76 91 105 112 105 88 76 81 96 105 103 100 107 123 136 139 131 110 77 38 4 -20 -38 -54 -65 -65 -52 -29 0 35 69 92 98 92 83 77 69 51 26 8 5
6805EPRORJ7K5K8K7J5mk6l7l7l0k2j9j4j3j4j0jRJ4J3J1J0J1QMOJ3K2K5K0Qnj3j5j5j5j1J
$$ 5 12 21 27 36 53 78 106 133 148 144 118 81 44 14 -8 -27 -41 -54 -68 -78 -79 -70 -56 -43 -32 -22 -11 -3 1 7 20 42 67 87 95 90 77 62 47 32 21 22
6788B2J5K8L3K4RmrpjKMjj4l2l6k2PK8K7J2ok2l1k8j4jJqj7j9j4nJ1K6L6L5L2K6J5Jj0j6k3
$$ 22 37 65 98 122 131 127 118 111 110 112 116 115 101 69 33 11 18 46 73 85 79 57 26 -2 -16 -17 -16 -24 -41 -60 -74 -79 -68 -42 -6 29 61 87 102 103 93 77 54
6770E4k6k1mJ0J3Kqj2qlPJ4J2M%%mj5k5k2rPJ9K4L0L2K8J5pk3k4pRJ8J9J8J2Lnpqj8k9l0j8
$$ 54 28 7 3 13 26 28 20 8 0 -3 4 18 30 34 34 34 30 15 -10 -32 -41 -34 -15 9 39 71 99 114 107 84 60 53 62 80 99 117 129 132 127 120 112 94 65 35 17
6752A7kPJ0J3J3Mpj1qjLPRPjnKJ7K6K2J0Kjkqj6k0k1k0j8j3oMJ3K2K9K8K3K1J8Qrk3k8k9l3
$$ 17 15 22 32 45 58 62 55 44 36 35 38 45 54 61 60 55 57 74 100 122 132 134 133 131 123 107 87 66 46 28 15 9 13 26 48 77 105 128 149 167 175 166 143 115 86 53
6734E3l8l8l2k0j0kKMRJ8K7L0L3K7J8Nnrj3k0k3j3MJ8K0J9J5QJjPJ3J3J0Olj4j9j3kKkpqr
$$ 53 15 -23 -55 -75 -85 -87 -85 -81 -72 -54 -27 3 36 63 81 86 81 72 59 39 16 3 7 25 45 64 79 87 88 87 94 107 120 130 136 133 119 100 87 85 87 85 78 70 61
6716F1j0qkPJ3K0K7L0K3Mj5k4j8lOKj1j7j6j1j3k0k6l2l0k3rPJ9K8L9M3L8K3RMON%oj4k4l5
$$ 61 51 43 41 48 61 81 108 138 161 165 150 126 108 105 111 113 102 85 69 58 45 25 -1 -33 -63 -86 -95 -88 -69 -41 -2 41 79 102 111 115 121 126 126 120 106 82 47
6699D7l7k4nJ5K6K7K1J4J1J8K6K6J6PRJ0MnnNQkk1l0k7k2k0k3k7k5j5KJ2J2PORQjj3k1k3k0
$$ 47 10 -14 -19 -4 22 49 70 84 95 113 139 165 181 188 197 207 211 206 201 206 214 212 191 161 134 112 92 69 42 17 2 4 16 28 35 41 50 58 57 44 23 0 -20
6681b0j1nlomRK2K6K4K5K5K0Rkqj1j1oj%pj0jJ3K1J8J1Knrj1j1pnJNQRPPRJ4K1K1J3lj7k2
$$ -20 -31 -36 -39 -45 -49 -40 -18 8 32 57 82 102 111 109 101 90 79 73 72 72 65 55 54 67 88 106 117 119 114 105 94 83 76 71 72 77 85 94 101 108 117 131 152 173 186 183 166 144
6662A44k1j4oLQOjj1j8j6nNRONQR%j6k5j7kPOLPJ3J0%rj0kOJ1J5J5J0NLJ3K4K7J5jj0j3j0
$$ 144 123 109 103 106 114 120 119 108 90 74 69 74 83 89 94 102 111 111 95 70 53 51 58 64 67 74 87 97 97 88 78 76 82 93 108 123 133 138 141 154 178 205 220 219 209 196 186
6643A86lJL%nqj0j8k9l6l2j9kRK0L1L8L8L0K0Rok4l6l7k8j4mNJ0J5J7J1lk0k7k1qlljNJ2J4
$$ 186 183 184 187 187 182 174 164 146 117 81 49 30 28 37 57 88 126 164 194 214 223 217 193 157 120 92 78 74 79 89 104 121 132 129 109 82 61 53 50 47 46 51 63 77
6626G7J5J2RJrj8k4k5k3j8j9k0k0j7j1mOJ4J8J5J0Mnj3j4j1mjJOPNNJ0J7K1J4PjnrpmMRJ0
$$ 77 92 104 113 114 105 87 63 38 15 -3 -22 -42 -62 -79 -90 -94 -88 -74 -56 -41 -31 -27 -32 -45 -59 -70 -74 -75 -74 -68 -61 -56 -51 -41 -24 -3 11 18 17 12 3 -4 -8 -4 5 15
6607A5MjLJ4K1J4%rj2j1j2qlkoj1j0%J0J7J8RkpMJ9K7K3J2NNRJ3J4J2J4J5J2%j8l8n4o1m4
$$ 15 19 18 21 35 56 70 70 61 49 38 26 18 15 13 7 -4 -14 -14 -4 13 31 40 38 31 35 54 81 104 116 121 126 135 148 162 174 188 203 215 215 197 159 105 44 0
6589@j3J5K3J2jqj2j9k5j9kJ4K3K6K4J3jj4j7j7j6j8j5oNJ3J6J8J9J7J1J0J3J9J5Mmppj0j3
$$ 0 -13 2 25 37 36 28 16 -3 -28 -47 -49 -35 -12 14 38 51 50 36 19 2 -14 -32 -47 -53 -48 -35 -19 -1 18 35 46 56 69 88 103 107 103 96 89 79 66
6573F6j0kORO%rj3rLJ1J0Ojmqj1j0oloqnLJ1J6J8J6RKnj0qkNRPJ1K1L0L1K1Poj9k8l2l1k7
$$ 66 56 54 60 69 75 75 66 53 44 47 58 68 74 73 69 61 50 40 34 31 25 17 12 15 26 42 60 76 85 87 82 72 64 62 67 76 83 94 115 145 176 197 204 198 179 151 119 88 61
6553F1k3k3k4k6j9nJ5K7L3L6L4K5J0nqponnoj3k0j6nKjqj0qrj0j1olMJ1J5J2QOOPPLjkJ0L0
$$ 61 38 15 -9 -35 -54 -59 -44 -17 16 52 86 111 121 116 108 101 95 90 85 79 66 46 30 25 27 26 18 8 0 -9 -19 -30 -36 -39 -35 -24 -9 3 11 17 23 30 37 40 39 37 47 77
6534G7M4M0K1Kpj6k2k4j6mKKmj1j3pPJ6J4OLLNJ1J8K4J8PKMOkj2k0k4k9l1k5j3%J4K8L0J7
$$ 77 121 161 182 184 177 161 139 115 99 95 97 99 95 84 71 64 71 87 101 107 110 113 118 129 147 171 189 196 198 202 208 206 194 174 150 121 90 65 52 52 66 94 124 141
6516A41jj0qqj7k5k8k6k0j3%J2J2P%nj0q%QPlrlPJ5J6J7K4K8K2Mj7k5k0j0lk%NQLnp%J0J4
$$ 141 140 130 122 114 97 72 44 18 -2 -15 -15 -3 9 16 16 11 1 -7 -7 1 8 5 -4 -7 0 15 31 48 72 100 122 126 109 84 64 54 51 49 49 54 62 65 60 53 53 63 77
6497G7Rlo%J6K9K9J4j3l5m2l0rJ2K7L4K9J4mj3j0lLRJ4Qmj6k0k2k5k7k7k3j8j4j2j5k1k0q
$$ 77 86 83 77 77 93 122 151 165 152 117 75 45 36 48 75 109 138 152 148 135 125 122 125 134 148 156 152 136 116 94 69 42 15 -8 -26 -40 -52 -67 -88 -108 -116
6481a16QK0K7L3L6L3K3J6J2J4J4J3J0OMNNmj8k3k0j3j3j8j9j3kPOnk1l2l3k1nJ1K1K2K4K6
$$ -116 -108 -88 -61 -28 8 41 64 80 92 106 120 133 143 149 153 158 163 159 141 118 98 85 72 54 35 22 20 27 33 28 7 -25 -58 -79 -84 -73 -52 -30 -6 20
6465B0L1K5Roj3j1lMOJlKJ3K2K0J2Mnj7k5k4j4lLLjoj1j6j7j8j4lQJ3J7K1K5K2J3Kqj7k1k2
$$ 20 51 76 85 79 66 55 52 56 62 63 60 62 75 97 117 129 133 128 111 86 62 48 45 48 51 50 44 33 17 0 -18 -32 -35 -27 -14 3 24 49 71 84 86 78 61 40 18
6447A8j8j7j5j5j4rlOJ0OkonjLOJ2J7K0K0K2K4K4J7OlpJJ0J2Noj4j7j8j6j2qpolNJ3J8J3N
$$ 18 0 -17 -32 -47 -61 -70 -73 -67 -57 -51 -53 -59 -64 -65 -62 -56 -44 -27 -7 13 35 59 83 100 106 103 96 97 107 119 124 118 104 87 69 53 41 33 26 20 17 22 35 53 66 71
6428G1jjPJ2J3J0QMlnJQQjmNK0K9K5Pk1m7n9m9k5mjj1j9j3NK0K3K1J5Qkj4j5qJNMLLOQNkp
$$ 71 70 69 76 88 101 111 119 123 120 115 116 124 132 131 127 132 152 181 206 213 192 145 86 37 12 8 7 -4 -23 -36 -31 -11 12 33 48 56 54 40 25 17 18 23 27 30 33 39 47 52 50 43
6408D3ojkokJ2K5K8K4K0J4Mqj1rj0j6k0j3mmpq%J2K0J6Lj1j9j9k1k8l4l1j9qk%lqj2qOJ8K3
$$ 43 37 36 34 28 26 38 63 91 115 135 149 153 145 134 125 115 99 79 66 62 58 51 43 43 55 75 91 94 83 64 45 24 -4 -38 -69 -88 -96 -98 -98 -101 -109 -121 -129 -123 -105 -82
6390h2J7J1QPNJoj1j1KK1L6L5K4J3RJ2J4J2J1Mqk4l6l8l2k1qPJ7K1K3K6K7K2Qnj0j0j1j3j5
$$ -82 -65 -54 -46 -39 -34 -33 -39 -50 -61 -59 -38 -2 33 57 70 79 91 105 117 128 132 124 100 64 26 -6 -27 -35 -28 -11 10 33 59 86 108 116 111 101 91 80 67 52
6373E2qPK1K6J6%j1j4j3j2pjRJ3J3J3J9K7L0K2Nj3k3j9j1mrj8k9l4l5l1k2rKKkKJ0J5RJop
$$ 52 44 51 72 98 114 114 103 89 76 64 57 56 65 78 91 104 123 150 180 202 207 194 171 152 141 137 128 110 81 47 12 -19 -41 -50 -48 -46 -48 -46 -36 -21 -12 -11 -17 -24
6355b4lJ2L6N9N9L5Mj7k7l2l2k6j5m%JmrrnjJLJ1K0K8L0K8K0Nj2k1k2j4JJ7K6K1Lj1j2n%k
$$ -24 -27 -15 21 80 139 174 178 161 134 102 70 44 29 25 25 26 22 13 4 -1 -2 -1 2 13 33 61 91 119 139 144 132 111 89 75 76 93 119 140 143 132 120 115 115 113
6338A13on%kj0j7j4kJ1K0K1K1J8J4Nnj6j9j6j2j4j8k1j6pmJJ2L2N0N6M5K5Kj9l1l3k7j7j1
$$ 113 107 102 102 100 90 73 59 57 68 88 109 130 148 162 167 162 146 127 111 99 85 67 46 30 23 19 20 32 64 114 170 215 240 242 223 192 159 132 115 104
6322A04j0j0mJ2K8L1J9pl2m7n1m4l1j6%J3J7J1lj1qLJ3J8K0K3K6L3L9M1L1J0j4l0l6k6oJ8
$$ 104 94 84 80 92 120 151 170 163 131 84 33 -11 -42 -58 -58 -45 -28 -17 -20 -31 -39 -36 -23 -5 15 38 64 97 136 177 208 218 204 174 138 112 106 124
6306A24K7J8kj9k1j6pkkqj7k2k1j3nj%lj1k2k1pJ1K2K6K7K5J7OkmnmJRJ4J0L%%kl%LJloj0
$$ 124 151 169 167 148 127 111 104 102 100 92 75 53 32 19 14 13 13 10 -1 -23 -44 -51 -40 -18 8 35 60 77 83 81 77 72 68 69 78 92 102 105 105 105 103 100 100 103 104 101 95 85
6287H5j6k0j8qj%kjkkKQJ3J3J6K1J9Pqj9k5k5k1j2mlj0k1l2l4k1JK0L2M0M4M1K2%j1qNJ4J8
$$ 85 69 49 31 23 22 22 20 19 17 15 17 25 38 51 67 88 107 114 106 87 62 37 16 4 0 -3 -13 -34 -66 -100 -121 -120 -100 -68 -28 16 57 79 79 68 60 65 79 97
6269I7J0%onqj7k4j7JR%j7k2j6qjOJ0QJjjRK9M4M3K6Mnnloj6k7l0k3j1orj6j9j4mJ0K1K3K1
$$ 97 107 107 101 96 88 71 47 30 31 40 40 23 1 -15 -23 -24 -18 -8 0 1 0 -1 8 37 81 124 150 154 149 144 141 135 119 92 62 39 28 22 13 -3 -22 -36 -40 -30 -9 14 35
6250C5J9J9J8J2Lnj0j1mRJ4Pj0j8j9j8j7j1OK2K7K1Qkj0j0lMLln%J1J8J6%k1l6l8l0k2j2J
$$ 35 54 73 91 103 106 101 91 80 76 85 99 106 96 78 59 41 24 13 19 41 68 89 97 95 85 75 72 76 79 76 71 71 82 100 116 116 95 59 21 -9 -31 -43 -42
6233d2J5K2J8J4J4K1K9K9J9Pjkkrk2l5l5k7j3njMPJ3J1OKMPPlj6k5k1qJ3K8L5L1K4J6Mqk1
$$ -42 -27 -5 13 27 41 62 91 120 139 146 145 143 141 132 110 75 40 13 0 -5 -6 -2 5 18 29 35 37 41 48 55 52 36 11 -10 -18 -5 23 58 89 113 129 133 125 104
6216A04k6k6k2k0j5rJJ4K5K9K9J9Jk4m1m1k3KJ5J0J%PRLmjQJ1OMJ4K7K6J2qj9k0j5j3j3j4
$$ 104 78 52 30 10 -5 -14 -13 1 26 55 84 103 104 80 39 -2 -25 -23 -8 2 3 3 10 19 22 18 17 25 36 42 46 60 87 113 125 117 98 78 63 50 37 23
6199B3rjQJ4J3J0MkrqJPNlp%J2J9J8Pj0k1j7jJ4J2jj2j6j3j2j4j7j5nOQ%qnklpqjOJ6K5L5
$$ 23 14 13 21 35 48 58 62 60 51 43 44 51 56 53 46 46 58 77 95 102 92 71 54 53 67 79 78 66 50 37 25 11 -6 -21 -26 -20 -12 -12 -20 -25 -27 -30 -37 -45 -46 -40 -24 1 36
6179C6L6K5Rmj2j8k5k9k0oJ0K1K2J8J1OPJ0J4Oqk2k5k0j7j4pKJ1J3Q%j0j4rLJ3J4J3J8K2K0
$$ 36 72 97 106 102 90 72 47 18 -2 -8 2 23 45 63 74 80 87 97 111 117 109 87 62 42 25 11 4 6 17 30 38 38 28 14 5 8 21 35 48 66 88 108
6162A08J3OKjpj2j4j5j8k2k0j1KJ8K6K6J7PL%ln%PJ3J5J5J1LqrlJmj2k1k2k2j6qjPJ3J9K3
$$ 108 121 127 129 128 121 109 95 80 62 40 20 9 11 29 55 81 98 105 108 108 105 100 100 107 120 135 150 161 164 156 147 144 145 141 129 108 86 64 48 40 39 46 59 78 101
6144A01K2K0J6Qkqrj0r%J7K8K7J8J6J9K0J8J3Mj1l0l9l3k3j1JJ6K7L5M3M8N1N3N9O8P8Q7J00
$$ 101 123 143 159 167 165 157 148 138 129 129 146 174 201 219 235 254 274 292 305 309 298 268 229 196 173 162 163 179 206 241 284 332 383 436 495 563 641 728 828
6128H28J16J26J32J48J76K17K69L33M16N04N83O18N54L42kl70o31p24o80n72m54l56k85k39
$$ 828 944 1070 1202 1350 1526 1743 2012 2345 2761 3265 3848 4466 5020 5362 5360 4990 4359 3635 2955 2383 1929 1573 1288 1049
6119A049j96j47j03p8o6o0n3m6l2j7qj6l0m0l5k1jK0K9K1Lj0j0o%LPMjlLJ2J3Omj2j7k4l3
$$ 1049 853 706 603 525 459 399 346 300 268 251 243 227 197 157 122 101 100 120 149 170 173 163 153 147 147 150 157 161 160 157 160 172 185 191 187 175 158 134 101
6103A01l6k7j0LRNjnolJmj5j6pNO%%OJ2Nj2k6l3k9j9j3qkQJ2NjQK7L9L1J6jj5k4k4j1NJ4J7
$$ 101 65 38 28 31 40 45 44 39 33 30 31 27 12 -4 -11 -6 0 0 0 6 18 23 11 -15 -48 -77 -96 -109 -117 -119 -111 -99 -94 -95 -87 -60 -21 10 26 25 10 -14 -38 -49 -44 -30 -13
6084a3J6J5J2J1RMnj4j8k3l1l4k3kJ3J9K3K8L3L8L4K1Pknpj3k4l0l3l5l8l2j2J5L3L8L3K8
$$ -13 3 18 30 41 50 54 49 35 17 -6 -37 -71 -94 -96 -83 -64 -41 -13 20 58 92 113 120 118 113 106 93 69 39 6 -29 -67 -99 -111 -96 -63 -25 8 36
6069C6K0Lj7l1l3l2k9k1kJ7K5K1J3QNPJ0J6J9J9K2K3J8Kj1j5j1nLJ3J9J4jj9l2l4k5rMQRJ5
$$ 36 56 59 42 11 -22 -54 -83 -104 -106 -89 -64 -43 -30 -22 -17 -10 0 16 35 54 76 99 117 119 108 93 82 77 80 93 112 126 125 106 74 40 15 6 10 18 27 42
6052D2L1M3M3L3J9Mj1k0k1j3omoj2k0k5l1l6l3k4j2opo%Jpj2nRJ5PlmJJ0J8K3K3J5RQROkj2
$$ 42 73 116 159 192 211 215 204 184 163 150 144 140 134 122 102 77 46 10 -23 -47 -59 -65 -72 -78 -78 -77 -84 -96 -101 -92 -77 -70 -73 -77 -76 -66 -48 -25 -2 13 22 30 39 45 43 31
6033C1j5j5qlLKJjNJ1K0J9J3MJLNjprnkmj0j6j9k0j8j0%J0K1L1L0J3j4l3k9j3KNjplJ0K3L1
$$ 31 16 1 -7 -10 -7 -5 -4 -5 0 11 31 50 63 67 68 71 76 75 68 59 54 52 48 38 22 3 -17 -35 -45 -45 -35 -14 17 47 60 46 13 -16 -29 -27 -22 -23 -30 -33 -23 0 31
6014C1K8J8Opj6j8j4q%RJ3Qqk1j8jJ6K1J0jn%NMMQJ3Qnj8k4k3j8j2JJ2J2J1PRROJlnoj1j6
$$ 31 59 77 83 76 60 42 28 20 20 29 42 50 42 21 3 2 18 39 49 48 43 43 48 52 56 64 77 85 80 62 38 15 -3 -15 -14 -2 10 21 28 37 46 52 53 50 45 39 28 12
5995A2j3nJ0K4K1J0%lkmqqJJ4K0J5OLNOkj3j8j9k1k5k2k1k8m6n8m9k4PL2M5M6L5J9PMMRJ6
$$ 12 -1 -6 4 28 49 59 59 56 54 50 42 34 35 49 69 84 90 93 98 104 102 89 71 52 31 6 -16 -37 -65 -111 -169 -218 -242 -235 -203 -158 -112 -77 -58 -51 -47 -43 -34 -18
5977a8K1K6K5J7Qkj0j8k5k9k7j9j2oKJ5K8L4L2K2J2L%LPJ0QNLLJkqj0lOJ0Nnj2j2j1pooj0
$$ -18 3 29 54 71 79 77 67 49 24 -5 -32 -51 -63 -69 -67 -52 -24 10 42 64 76 79 79 82 89 99 107 112 115 118 119 117 109 99 96 102 112 117 112 100 88 77 70 64 58 48
5959D8j3j4j7k3l2l4k5mJ7K7K5J4mj8k6k3j1LJ2J7K2L2L5K8J3KJLOQJ2J6J5Q%qj6k7l2l0j7
$$ 48 35 21 4 -19 -51 -85 -110 -114 -97 -70 -45 -31 -35 -53 -79 -102 -113 -110 -98 -81 -59 -27 8 36 49 51 52 55 61 69 81 97 112 120 120 112 96 69 37 7 -10
5943a0qmnlOJ9L0L2K0Noqj2k1k5k0j4j1j0pmnplNO%o%J1J8J9J8J1%j2j8j5oMQOlqmQK1K4K4
$$ -10 -18 -22 -27 -30 -24 -5 25 57 77 82 76 68 56 35 10 -10 -24 -35 -45 -52 -56 -61 -68 -71 -66 -60 -60 -66 -66 -55 -37 -18 0 11 11 -1 -19 -34 -40 -36 -28 -22 -25 -33 -37 -29 -8 16 40
5923D0K0J5J1J2J3J1RMmj2j3mNJj1k0j7j1j0j2rKRQkj4k1j9j6j1kJ2K3J9Pnj2j9k1j4JJ6J9
$$ 40 60 75 86 98 111 122 131 135 131 119 106 102 107 108 97 77 60 49 39 27 18 20 29 37 35 21 0 -19 -35 -46 -48 -36 -13 6 13 8 -4 -23 -44 -58 -57 -41 -22
5906b2J5RLoj9k3j8mJ1K2K4J8J1RJ2J5J5R%rj0JJ4K3K1J0nj9k7k8k5j9j2j3j5j7j3jJ0J4J1
$$ -22 -7 2 5 -1 -20 -43 -61 -65 -54 -32 -8 10 21 30 42 57 72 81 81 72 62 63 77 100 121 131 126 107 80 52 27 8 -4 -17 -32 -49 -62 -63 -53 -39 -28
5889b8PORO%j1j8k1k3k4j9lJ6K7K6K2J4Npj1j0j4k2k4j4MJ5K4L5M1M2L5K5Qj6l6l5j6%Mkm
$$ -28 -21 -15 -6 0 0 -11 -29 -50 -73 -97 -116 -119 -103 -76 -50 -28 -14 -9 -16 -27 -37 -51 -73 -97 -111 -107 -92 -68 -33 8 50 85 110 118 102 66 31 15 15 19 17 13
5872A3kqj4j8j1KJ3J6J3J0J4J9J7Ooqj0j5j8j3%NjnmOJ4J4J0POKJMJ0P%m%OQKknnopqqj3j8
$$ 13 11 3 -11 -29 -40 -38 -25 -9 4 14 28 47 64 70 64 56 46 31 13 0 0 5 4 -1 -5 1 15 29 39 46 52 54 55 59 69 76 76 72 72 78 86 88 86 81 76 70 63 55 47 34 16
5852A6k0j7j1mLJ1J8J8Rkrp%ORRQPOLnrkQJ1Loj2j6k3k1qJ3K3J9J1MOJ4K1K3J1nj3j2j2j6
$$ 16 -4 -21 -32 -36 -33 -22 -4 14 23 21 12 5 5 11 20 29 37 44 50 53 48 39 37 45 56 59 53 41 25 2 -19 -27 -14 9 28 39 43 49 63 84 107 118 113 100 88 76 60
5833F0j9j5%J1J6J1L%lqj9k5j6JJ2J6J4J3Nj0k5k6j5lPJ2J8J9J7RKoj3j6j5rjLM%lkJKKJO
$$ 60 41 26 26 37 53 64 67 67 64 56 37 12 -4 -3 9 25 39 52 57 47 22 -4 -19 -22 -15 -3 15 34 51 60 62 56 43 27 12 3 2 5 9 9 6 4 5 7 9 10 16
5814A6J0J1Jj9l3l2j6%RPL%nj2j6qJ0K6L2K3J2MMRJ2J2OLJNNNJjoj3j8k1k2k1j3PL1M2L6J6
$$ 16 26 37 38 19 -14 -46 -62 -62 -53 -46 -43 -43 -48 -60 -76 -84 -74 -48 -16 7 19 23 27 36 48 60 66 69 70 75 80 85 86 85 79 66 48 27 5 -16 -29 -22 9 51 87 103
5796A03rl2m6m4l0rJ1L4N0N1L7J9Qkj5k6k5j1KNMkj1k4l2l5l6l0j9j0mJPJ3J2Olrj4j5j1n
$$ 103 94 62 16 -28 -58 -67 -56 -22 28 79 116 135 143 141 126 100 75 64 66 71 75 73 62 38 6 -29 -65 -95 -114 -124 -128 -127 -120 -107 -95 -89 -92 -101 -115 -130 -141 -146
5779a46jMJ4K5L3L3K7J8J1PNLjlkkrj5j0KPlj5j5kRJ2J4J2J2Njmmllkj%joj0j4j6j8j8j2J
$$ -146 -147 -143 -129 -104 -71 -38 -11 7 18 25 30 33 32 29 27 25 16 1 -9 -7 0 -3 -18 -33 -35 -26 -14 0 12 24 29 28 24 20 17 14 12 11 11 10 4 -6 -20 -36 -54 -72 -84 -83
5759h3J7K3J7MnlLNLPJ6K0RorKJ1J2RPPLmj2k0k4k1j6j2j2j0onpmQK0K5K1J5J0MLJ3K7L4K9
$$ -83 -66 -43 -26 -22 -27 -30 -27 -22 -19 -12 4 24 33 27 18 20 31 43 52 59 66 69 65 53 33 9 -12 -28 -40 -52 -62 -68 -73 -80 -84 -76 -56 -31 -10 5 15 19 22 35 62 96 125
5741A25K3J9K0J9J8J3%j4k2k0j2poqj0qkJ2K8L8L9K5Nj4k4l0l4l8l8l3k4rNJ7J8J2QPQPNJ
$$ 125 148 167 187 206 224 237 237 223 201 181 169 162 156 148 138 130 128 140 168 206 245 270 275 261 237 207 173 135 97 64 40 31 36 53 71 83 91 98 106 113 118 119
5724A19lprj1rpl%JJJlj0j3lJ3K3K3J5J4J7J6J3Pjqj3j3j2j2j4j3rmKNLjjLJ0J0RJ1J9L2L3
$$ 119 116 109 100 89 80 73 70 70 71 72 73 70 60 47 44 57 80 103 118 132 149 165 178 185 184 176 163 150 138 126 112 99 90 86 88 93 96 95 94 97 107 117 126 137 156 188 221
5705B21K3Nj3k2k6k6k7l0k9k8k4k2k2k1j4kQRKmKJ5K5K4J7J3J6J9J4RPQQLLRJ8K1J6Pnj5k0
$$ 221 244 249 236 214 188 162 135 105 76 48 24 2 -20 -41 -55 -57 -49 -40 -38 -42 -40 -25 0 24 41 54 70 89 103 112 119 127 135 138 141 150 168 189 205 212 207 192 172
5688A72j1LRjj8k7k3j3pon%MJpj0nKMmj6k0j2KJ1J0Mjk%%lmJQJ5K0J7Qlqrqj0j3j2j1j1rl
$$ 172 161 164 173 172 154 127 104 91 84 78 73 73 77 78 71 61 56 58 62 58 42 22 10 12 23 33 37 36 34 34 34 31 27 28 36 51 71 88 96 93 85 76 68 58 45 33 22 11 2 -1
5667aMJ6K1J6MonMJ3J7J4Pmj7k4k4j8rjMLMJ1K1K6K0J0L%jlmloj2j8k3k1j8k0k4k5j4MK0K3
$$ -1 3 19 40 56 60 54 49 53 66 83 97 104 100 83 59 35 17 8 7 11 14 18 29 50 76 96 106 109 109 108 105 101 98 92 80 62 39 18 0 -20 -44 -69 -83 -79 -59 -36
5649c6J9J7J4J2M%%QJ2J3PkpqnoqoKOMkpj1j0kRJ5J5J1OJmrj0njLLJlpo%LL%KNNNJ0K1K4J6
$$ -36 -17 0 14 26 30 30 30 38 50 63 70 68 61 53 48 42 34 28 30 36 40 38 31 20 10 8 17 32 47 58 64 65 61 52 42 37 36 39 42 43 40 33 27 27 30 33 33 35 40 45 50 60 81 105 121
5627A21Mkmqj4k0k1k1j8j2lLMPJ3J4NormLMOJ2J9J8Qoj7k2k4k5k6k7j8lJ1K0K4K4J8PlpmN
$$ 121 125 123 119 111 97 77 56 35 17 5 2 5 9 16 29 43 48 42 33 29 32 36 42 54 73 91 99 93 76 54 30 5 -21 -48 -66 -69 -58 -38 -14 10 28 35 32 25 21 26
5608B6J4J2Krj0oknj1j0kLRJ0J0QONPRJ1RK%LNM%klk%LON%jLOMJ%jnj4k1j9rKOJm%J1J4Pn
$$ 26 40 52 54 45 35 29 27 22 11 1 -1 2 11 21 31 39 45 50 57 66 77 86 88 88 91 96 100 100 98 95 93 93 96 102 107 107 106 109 115 119 120 120 119 114 100 79 60 51 53 59 60 56 56 67 81 88 83
5586H3j4k0j7nQJ4PmqolKJ4K4K3J5J3J9K4J6kj7k2j9r%LL%nj4k4k7j9mNQRJ0J3J7J7J5J1Q
$$ 83 69 49 32 27 35 49 56 52 44 38 35 37 51 75 98 113 126 145 169 185 183 166 144 125 116 116 119 122 122 117 103 79 52 33 29 34 42 51 61 74 91 108 123 134 142
5567A42OMJjnj0j0kRJ7J5J3RMpj7j8j4ojPJ1QkojPLqj7j8j7j8k2j5KJ6K1J6R%rj5j3nKLKM
$$ 142 148 152 153 152 147 137 127 125 134 151 166 179 188 192 185 168 150 136 130 129 136 147 155 153 147 146 153 156 148 131 113 96 78 56 41 43 59 80 96 105 105 96 81 68 63 65 68 70 74
5548G4QQOORJ3J0QOQMnj3j3kNMjkklqj2pkjmnKJ6K6K2Pppmmj2j7j7j6k0k1j4mLNNJ3K3L2L3
$$ 74 82 90 96 102 111 124 134 142 148 156 160 155 142 129 127 132 136 135 133 131 128 120 108 101 99 98 94 89 91 107 133 155 162 155 148 144 140 128 111 94 78 58 37 23 19 22 27 32 45 68 100 133
5527A33K0Jj4j5j2porj2j4j1LK2L2L0J8ROOJj2l0m1l4j3NJ2Lj0k2l1k7j5LJ6J8J5J0J1J2J1
$$ 133 153 154 140 125 113 106 100 91 79 65 54 57 79 111 141 159 168 174 180 181 169 139 98 64 51 56 68 71 61 39 8 -19 -34 -31 -15 3 18 28 39 51 62
5510F2J1J6K3K2Pj0k0j7j3j2qMJ3J2MJPRLpj0mOJ1J0%j2k2k4j9rlKMMKnj0j4j2j1j1rl%kr
$$ 62 73 89 112 134 141 131 111 94 81 69 61 65 78 90 94 95 102 111 114 107 97 93 99 110 120 120 108 86 62 43 34 31 33 37 41 43 38 28 14 2 -9 -20 -29 -32 -32 -34 -43
5492d3j1lPJ3J3J1QQJ1J4J0Jrj5j0kMNOPJ1J4J1Npk1k9k2mJ3J2jj2j2kMMJNRJ5J9J8J1mj6
$$ -43 -54 -57 -50 -37 -24 -13 -5 3 14 28 38 39 30 15 5 3 7 12 18 25 36 50 61 66 59 38 9 -13 -17 -4 8 7 -5 -17 -19 -15 -11 -10 -5 4 19 38 56 67 63 47
5473D7j5%J7K3J8RQJ3J2Kj3k7k7j7kQJ0POLjj3k3k8k0j0kKjnpmKJ1K2L1L1J9%j6k2k0j3kM
$$ 47 32 32 49 72 90 99 107 120 132 134 121 94 67 50 48 56 66 73 79 82 81 68 45 17 -3 -13 -15 -13 -14 -19 -26 -30 -28 -17 5 36 67 86 86 70 48 28 15 13 17
5455A7Nnj9l5m0l1j3jLkkKPJ0J5K8L5K7J1Jl%LPRQNPJ1RJrrppj0rkLKlnmnj0k0k3j7oPJ6K0
$$ 17 22 17 -2 -37 -77 -108 -121 -122 -119 -121 -123 -121 -114 -104 -89 -61 -26 1 12 13 10 10 13 20 29 37 42 49 60 69 70 61 52 45 38 28 19 17 20 22 19 14 10 5 -5 -25 -48 -65 -71 -64 -48 -28
5434b8K0J0jpm%mj2j9j3mKLjoj1j0mPJ5K1K2J6M%NK0K5J6NJMMlj2j5j1nKQQKopkJnj1qMJ3
$$ -28 -8 2 1 -6 -10 -10 -14 -26 -45 -58 -62 -60 -57 -58 -64 -75 -85 -89 -82 -67 -46 -24 -8 -4 -4 1 21 46 62 67 68 72 76 73 61 46 35 30 32 40 48 50 44 37 35 36 31 20 12 16 29
5414B9Ork2k5k5k0rMJ7J7Mj7l3l1j6JJ4K2K9L3L3K9K4J9J0nj8k1j5o%K%oj0rjJ2K5L1K4Qj3
$$ 29 35 26 4 -21 -46 -66 -75 -71 -54 -37 -33 -50 -83 -114 -130 -129 -115 -93 -64 -31 2 31 55 74 84 79 61 40 25 19 19 21 21 15 5 -4 -5 7 32 63 87 95 82
5396H2k7k7j9rlMJ3J7J2%j1j6j5j1j1j9k6k8j8o%loj1j3j2oJ0K7M2M8M1K3Nj0j2qkLMJ3K3
$$ 82 55 28 9 0 -3 1 14 31 43 43 32 16 1 -10 -21 -40 -66 -94 -112 -118 -118 -121 -127 -138 -151 -163 -169 -159 -132 -90 -42 -1 22 27 17 5 -3 -5 -2 2 15 38
5380C8L3L2K0PJ%lJJ0K2K2J4Nkj2k6l4l0j8j0pmOJ5K0K0J4Kj0j5j5j1rj2j9k3k4j9j1kPJ0
$$ 38 71 103 123 130 131 131 128 129 139 161 183 197 202 200 188 162 128 98 80 70 63 59 65 80 100 120 134 136 126 111 96 85 76 64 45 22 -2 -21 -32 -34 -27 -17
5363a7NmoKJ6K5K7K6J9Pnj2qJNLLLLkj3k5l4k9j6%J1K0K8L0K6J3Mk%LRJ8K1J8Pkmloj6l0m2
$$ -17 -12 -16 -22 -20 -4 21 48 74 93 100 95 83 75 76 81 84 87 90 93 91 78 53 19 -10 -26 -26 -15 5 33 63 89 102 106 104 104 107 116 134 155 173 180 178 174 171 165 149 119 77
5343G7m3l1qJ1K1J7J1OLoj6k0j6j1j1j5j9j8j0MJ3J2ROQLkooqj2j3lJ2K9L9M0K7QmmLOLjj
$$ 77 34 3 -5 6 27 44 55 61 64 58 42 22 6 -5 -16 -31 -50 -68 -78 -74 -61 -49 -40 -34 -26 -23 -25 -31 -37 -45 -57 -70 -73 -61 -32 7 47 74 82 78 74 77 83 86 85 84
5325H4kpj3j9j6oPJ5J7K0K5L1K7J3ok2l3l1k3j4mOJ8L1M1M2L1J3oj8k0k0j9j4lRR%j2k0k1
$$ 84 82 75 62 43 27 21 28 43 60 80 105 136 163 176 170 148 115 84 61 47 43 49 67 98 139 181 212 225 219 201 181 161 142 128 125 134 143 143 131 111 90
5308I0j7qkjlpj0j4j3oNJ3J6J8J3%j4j9j4rj2j3r%NPOQ%j2k2k1j7j7k4k8j9MK7L8L2K1J3J0
$$ 90 73 65 63 62 59 52 42 28 15 9 14 27 43 61 74 74 60 41 27 18 6 -7 -16 -16 -11 -4 2 10 10 -2 -24 -45 -62 -79 -103 -131 -150 -146 -119 -81 -49 -28 -15 -5
5291eKj0j6j0JMK%PJ6J5Mj3k5j8NL1L9L3J8Nnj3j8j6qoqj3j5j1lMQRQQJ0RLlkNJ1J1P%j2k2
$$ -5 -3 -13 -29 -39 -38 -34 -32 -32 -25 -9 6 10 -3 -28 -46 -41 -10 29 62 80 85 80 67 49 33 25 19 11 -2 -17 -28 -31 -27 -19 -10 -2 6 16 25 28 25 23 28 39 50 57 57 45 23
5271B3k6j9qLO%mJJ2K0J9J2PQLpj6j2MK5L5L0J2j0k7l4l1j7QK9K9Qj1j5j1j0j3oQJ8J5Mmq
$$ 23 -3 -22 -30 -27 -21 -21 -25 -24 -12 8 27 39 46 54 57 50 34 22 26 51 86 116 128 118 91 57 26 9 17 46 75 83 72 57 46 36 23 17 25 43 58 62 58 50
5253E0j0j4j9k5k6k0q%%nooljLLJKQJ3J4Q%mjJ1K6L9M3L0Rj1k3k6k2j7r%J1J6J6J1MjlJRJ2
$$ 50 40 26 7 -18 -44 -64 -72 -72 -72 -77 -83 -89 -92 -93 -90 -87 -86 -84 -76 -63 -49 -41 -41 -45 -46 -35 -9 30 73 103 112 101 78 52 30 13 4 4 15 31 47 58 62 61 58 59 68 80
5234H0Kj3j9j1JMJkLOjj4k4k2j6j2pLJ8J9NprKPLjjMKLQJ1J0NPJ3J2Kqj2j3j9k2k0nJ1J5J3
$$ 80 82 69 50 39 40 44 45 43 46 52 51 37 13 -9 -25 -37 -44 -41 -23 -4 1 -6 -15 -13 -6 -3 -4 -5 -1 1 4 12 23 33 38 45 58 70 72 64 52 39 20 -2 -22 -27 -16 -1 12
5215A2J6K5L5L5K5J1nj9k7k2qJJnnlnj3j6j2okpj6k5k2rNQjqoLJ3J6J5RNMPJ1Qmj8j9j1JR
$$ 12 28 53 88 123 148 159 154 135 108 86 78 79 80 75 70 67 62 49 33 21 15 13 6 -10 -35 -57 -66 -61 -53 -54 -62 -68 -65 -52 -36 -21 -12 -7 -3 4 15 23 19 1 -18 -29 -28 -19
5195a9QNNLJlpj1j2qJQKrj9j8j2j2j4j3j2j1oKJ1J4J1RJ2J6J9K2K1J7J3J1J1J0NJkklmjkn
$$ -19 -11 -6 -1 2 3 0 -7 -18 -30 -38 -37 -29 -27 -36 -55 -73 -85 -97 -111 -124 -136 -147 -153 -151 -140 -126 -115 -106 -94 -78 -59 -37 -16 1 14 25 36 46 51 52 50 48 45 41 40 38 33
5176C3ojRJ5J0Kllmj0j3j0KJ7K3K3J8Rlj6k0j9j7j7j8j6j3j3j0lRJ2RLMONOPQ%j2rOK9M0L4
$$ 33 27 26 35 50 60 62 59 56 52 42 29 19 21 38 61 84 102 111 108 92 72 53 36 19 1 -15 -28 -41 -51 -54 -45 -33 -24 -21 -17 -11 -6 0 7 15 15 3 -6 0 29 69 103
5157A03K0Lj2k1k1j3nlj%Jlomjjrj9k3j9mJ6K9L6L2K2Qpj9k2j7qMJ5K0Rj1k3k5k1j9j5lOL
$$ 103 123 126 114 93 72 59 54 51 50 50 51 48 42 38 37 36 27 8 -15 -34 -38 -22 7 43 75 97 105 98 79 57 40 32 36 51 71 80 69 46 21 0 -19 -34 -37 -31 -28
5139b8pnQJ9J5PKjmjJ0K4K7J7lk0l0l0k4k0j8j5nQJ7K2K2J8J5RLjkmqj3j4j2ojknpojJ1K9
$$ -28 -35 -40 -32 -13 2 9 11 10 6 5 15 39 66 83 80 60 30 0 -24 -44 -62 -77 -82 -74 -57 -35 -13 5 20 29 32 31 29 25 17 4 -10 -22 -28 -29 -31 -36 -43 -49 -50 -39 -10
5121a0M3M7L6J9kk2l7l7k7j6j2j1mPJ5J1%oolmj0j7j4oMJ2J5J5J4J4J8K1K0J6J7J7Rrk6k8
$$ -10 33 80 116 135 133 111 74 37 10 -6 -18 -29 -33 -26 -11 0 0 -6 -12 -15 -19 -29 -46 -60 -66 -62 -50 -35 -20 -6 8 26 47 67 83 100 117 126 117 91 63
5104F3k0j2nkKMNMkoonoj4j6j6j1j2j3j0JJ0J1RLmj3j4q%NMJ%JPJ5J7J6J5J6J5Pjonlj%%j
$$ 63 43 31 26 24 26 30 35 39 37 31 25 20 14 0 -16 -32 -43 -55 -68 -78 -77 -67 -56 -47 -44 -48 -61 -75 -83 -83 -78 -74 -73 -73 -72 -65 -50 -33 -17 -2 14 29 36 35 29 24 21 20 20 20 19
5084A9rj9k9k7j4JRMpj0oKJ1J7J6QNQJ8J8J0mj1qjRJ9K3J8Opj2j0kPJ1Plj2j7j1%J0R%j4k2
$$ 19 10 -9 -38 -65 -79 -78 -69 -65 -72 -82 -88 -86 -75 -58 -42 -34 -29 -21 -3 15 25 21 10 2 1 10 29 52 70 76 69 57 47 45 52 63 70 67 55 38 27 27 37 46 46 32 10
5065A0k6k6j9oNJ3J8K2K3K0J1Klnonlnrj1kJ0K3K4J6QLnj6k5k3j3mMRJ4J4J3J2J1PLNJ0J5
$$ 10 -16 -42 -61 -67 -62 -49 -31 -9 14 34 45 47 44 39 33 28 25 20 11 0 -2 8 31 55 71 79 82 77 61 36 13 0 -4 0 9 23 37 50 62 73 80 83 88 98 113
5047A13J1Lnj5k3k4j2PJ9J4MNK1L6L5J5nj9k5l1l3k6j0MJ2J5J9K5K2J2Jqrpnllnpqpqj0qn
$$ 113 124 127 122 107 84 60 48 55 74 88 92 97 118 154 189 204 199 180 155 124 91 65 55 59 71 86 105 130 152 164 165 157 148 141 136 133 130 125 118 110 103 95 85 77 72
5029G2KJ1K0K7K8K1Qmj8l1m0l9k6rMJ4K1K3J5jj0pPJ9K4K2J9J2J0J1J3R%qrqm%PJ0Mj1l0m7
$$ 72 74 85 105 132 160 181 189 185 167 136 96 57 31 22 26 40 61 84 99 98 88 81 88 107 131 153 172 184 194 205 218 227 227 219 210 202 198 198 205 215 219 208 178 131
5011A31o2o9o4m4j9jQJ1J5J8K1J8J4Qkrj6j7j5j6j4j3qmKPNLPK0K9K7J4MNQJ3J8K2K1Oj4l0
$$ 131 69 0 -64 -108 -127 -128 -120 -109 -94 -76 -55 -37 -23 -15 -17 -26 -42 -59 -74 -90 -104 -117 -125 -129 -127 -120 -115 -112 -105 -85 -56 -29 -15 -11 -6 2 15 33 55 76 82 68 38
4994C8l5k9k0nJ1J7J4QJ%KNLnj2j8k1k4k2nK1M3N0M2K7J4%j8l5m7m3k9j2jJkrj8k1j1OK1K6
$$ 38 3 -26 -46 -51 -40 -23 -9 -1 0 0 2 7 10 5 -7 -25 -46 -70 -92 -97 -76 -33 17 59 86 100 100 82 47 0 -43 -72 -84 -85 -84 -86 -95 -113 -134 -145 -139 -118 -92
4976i2K3K3K8K9K4J2OM%rj9k2j8j0%J1J5J5J2J1J0Lj3k6k4j2LJ2J1jj5k4j6JRPjlJJOJ5K5
$$ -92 -69 -46 -18 11 35 47 53 57 57 48 29 7 -11 -21 -21 -10 5 20 32 43 53 56 43 17 -7 -19 -16 -4 7 6 -9 -33 -49 -48 -39 -32 -33 -36 -35 -34 -28 -13 12
4959A2K7J8Oj0k3l0k8k1j5nQK2K8K5K0J5Pkj1j6j9j7j0KJ4K2L5M3L4J0j5k5k6k6k4j4JJ0J5
$$ 12 39 57 63 53 30 0 -28 -49 -64 -69 -61 -39 -11 14 34 49 56 54 43 27 8 -9 -19 -17 -3 19 54 97 131 141 126 101 75 49 25 11 12 22 37
4943C7K2K7K5J9J5J6K0J6Rok6m2m1k5mJ0J6J3jj8l0k5j0OJ7K6K7J7MlkKLNJ0J8K3J9Lj9l6
$$ 37 59 86 111 130 145 161 181 197 206 200 174 132 91 66 62 72 88 101 100 82 52 27 17 23 40 66 93 110 114 111 109 111 114 119 129 147 170 189 192 173 137
4927A37l6k6j6j2qKP%k2m1m5k7jJ6J8J4J1R%qj0jJ0J5J8J9J1lj5j8j9k1k4k0j3qnlLQPKqj2
$$ 137 101 75 59 47 39 41 48 48 26 -15 -60 -87 -88 -72 -54 -40 -29 -20 -20 -28 -38 -39 -29 -14 4 23 34 31 16 -2 -21 -42 -66 -86 -99 -107 -112 -115 -112 -104 -97 -95 -103 -115
4909a15rLJ6K0J5QLjqj2nQJ4J0LLJ0J5J2N%j%lmkLN%nlLP%j2j7j4mkrj5j2JJ5K4K8K7J9Ok
$$ -115 -124 -121 -105 -85 -70 -62 -59 -60 -68 -80 -85 -77 -63 -53 -50 -47 -37 -22 -10 -5 -5 -6 -6 -9 -13 -15 -12 -7 -7 -12 -15 -12 -5 -5 -17 -34 -48 -52 -54 -63 -78 -90 -89 -74 -50 -22 5 24 30 28
4889B8%Jlj2j7j6rNK3L4L0J1pj3j3j4j6j2lNMnj4j7j0k%MJ0K0K1J9J1J0J3J5J1%j0j3j3j4
$$ 28 28 29 26 14 -3 -19 -28 -23 0 34 64 75 68 55 42 28 12 0 -3 2 6 1 -13 -30 -40 -42 -42 -38 -28 -8 13 32 43 53 66 81 92 92 82 69 56 42
4872D2j6j4pnoj2j0KJ5J9J1JkKJ2K5L6M0L2Rj9l5l5k9k9l2k8j2KRRNjj2j5j0LJ4K1K8L1K2
$$ 42 26 12 5 0 -6 -18 -28 -26 -11 8 19 20 18 20 32 57 93 133 165 174 155 120 85 56 27 -5 -33 -45 -43 -34 -25 -20 -21 -33 -48 -58 -55 -41 -20 8 39 61
4856F1J0KLLqk0j9mJ6K0J0mrnkkmMJ1J2Mpj0rj0j9k9l5k6rJ1K5L2K9K2J2Mjqj5j8j6j9k9k9
$$ 61 71 73 76 79 71 51 32 28 44 64 74 70 61 56 54 52 48 52 63 75 79 72 62 53 43 24 -5 -40 -66 -75 -64 -39 -7 22 44 56 60 59 51 36 18 2 -17 -46 -75
4837g5j6QK3K5K2K0J6MnnKPPOOKmnJONJJMRJ4J7K1J9Rnj2j3j0o%QJ2J3J3J6J3%j8k7k1j2o
$$ -75 -91 -83 -60 -35 -13 7 23 27 22 17 19 26 33 39 45 47 43 38 39 45 50 51 52 56 65 79 96 117 136 145 140 128 115 105 99 99 107 119 132 145 161 174 174 156 129 108 96 90
4818I0onnj0k3l5l5k2KK2K7K0Mj5l2l9k8qJ1K1K5L0L2L1K3J1Kmnpj5k3k0lJ4J9J0jlKRJ3J1
$$ 90 84 79 74 64 41 6 -29 -51 -49 -27 0 20 24 9 -23 -62 -90 -98 -87 -66 -41 -11 21 52 75 86 88 84 79 72 57 34 14 11 25 44 54 53 50 52 61 74 85
4801H5JrrmKJoj2j6j8j3okLRK0K1Qj4k6k4j1MJ3J4J1Lnj2j4j2lRJ3J3QOORJ1MmoKJ1J2Njk
$$ 85 86 77 68 64 66 67 61 49 33 15 2 -4 -6 -3 6 26 47 55 41 15 -9 -20 -16 -3 11 22 25 20 8 -6 -18 -21 -12 1 14 22 28 34 43 54 58 54 48 50 61 73 78 77 75
4781G5MJ1J3J0Jrj5j4j1j0j0o%OOjj5k4k2j5nLJ0J7J9K0J8J3QKpj6k2k0j3lMJ5K8L5L0J5j
$$ 75 79 90 103 113 114 105 90 76 65 55 45 39 39 45 51 50 35 11 -11 -26 -31 -28 -18 -1 18 38 56 69 77 79 72 56 34 14 1 -2 2 17 45 80 110 125 124
4764A24pk%mj4k0j8j3j1j2j2j2k0k5k1rLOL%jnj2pKPkj3j4q%QJ9K8K9K3K4L3L9L3J3nj7k3
$$ 124 117 115 115 111 97 77 59 46 35 23 11 -1 -21 -46 -67 -76 -73 -67 -64 -64 -65 -70 -82 -89 -87 -80 -82 -95 -109 -117 -117 -109 -90 -62 -33 -10 14 47 86 119 132 127 110 87
4746H7k4k1j3nJ%mj3k1k2j4jRJ3J8K5L1K4Pj0j5qlnqnLJ2J6J8J6J4J1PKKQJ4Rmj8j9j0loj6
$$ 87 63 42 29 24 25 25 21 8 -13 -35 -49 -50 -41 -28 -10 15 46 70 77 67 52 44 41 36 28 23 26 38 54 72 88 102 113 120 122 124 132 146 155 151 133 114 104 101 95 79
4728G9k1j7oNO%mqj2j8j9j1MK1L0L2K3J1MNP%j4k5k6k2j6qLJ5K4K4J4nj9k1nJ4K7K5J8RNL
$$ 79 58 41 35 40 46 46 42 34 22 4 -15 -26 -22 -1 29 61 84 95 99 104 111 111 97 72 46 24 8 0 3 18 42 66 80 75 56 35 30 44 71 96 114 123 128 131
4710A31Klj2k2k8l0k5j6oNJ4J7J5Qjj1j7k0j2kQN%lLJ4J3Nklkoj4j9j6j0rj3j7j1NK6L5L0
$$ 131 133 130 118 96 68 38 13 -3 -9 -4 10 27 42 50 49 38 21 1 -11 -13 -5 0 0 -3 0 14 27 32 30 27 25 19 5 -14 -30 -40 -49 -62 -79 -90 -85 -59 -24 6
4692FJ6MLJ2K0J9Oj2k4k7j9mJ4K5L0K7J8Rjrj7k2k1j8j9k6l8l6k2nOJ2J6J7J0Jm%QJ9L1M2
$$ 6 22 26 29 41 61 80 86 74 50 23 4 0 14 39 69 96 114 123 122 113 96 74 53 35 16 -10 -48 -84 -106 -111 -105 -93 -77 -60 -50 -49 -53 -53 -45 -26 5 47
4676D7L8J9mj7j2NK2K6J3rk2k4k3k4k7k4j7pJ0K5K7J3qj9j8j3j0pnJQJ5J8J1Jpj0j1j0qj3
$$ 47 85 104 100 83 71 76 98 124 137 128 106 82 59 35 8 -16 -33 -40 -30 -5 22 35 27 8 -10 -23 -33 -40 -45 -44 -36 -21 -3 8 9 2 -8 -19 -29 -37 -50
4659e0k5l5l1qK1M2M4L3J7Mk%OJ2J0jj7k3k0j4j2j2rmj%KMPJ5K5K8J9jj3j1%MK%KNMJj1k2
$$ -50 -75 -110 -141 -149 -128 -86 -42 -9 8 12 10 10 16 28 38 37 20 -3 -23 -37 -49 -61 -70 -74 -75 -75 -73 -69 -62 -47 -22 6 25 24 11 0 0 4 6 6 8 13 17 18 7 -15
4641a5k3oJ4K6K3J7Pnj4j2NJ8J5KqkJ0K3K7K5J4lj6k3k0j1%J0J7J7J4J0RJ0Ojqpkkrk0k6k7
$$ -15 -38 -44 -30 -4 19 36 43 38 24 12 17 35 50 52 44 42 52 75 102 127 141 138 122 99 79 68 68 78 95 112 126 136 145 155 161 160 152 145 143 141 132 112 86 59
4623E9k4j3KJ8L2L4K8J7Q%pj7k4k7k5j3MJ8K0J2M%Jlj1j7k2k8l3l2k4j0KPNknjRJ4RKJQJ3
$$ 59 35 22 24 42 74 108 136 153 161 161 154 137 113 86 61 48 52 70 90 102 106 106 107 104 93 76 54 26 -7 -39 -63 -73 -71 -64 -59 -61 -66 -67 -58 -44 -35 -33 -32 -24 -11
4605a1J6J8J9K0J3MmpnllopJJ1J5J1Lrk3l3l4k7j9j9k3k8k8k2j3jJ1K0L0L5L2K3J5J4J4Po
$$ -11 5 23 42 62 75 79 75 68 63 60 57 51 44 45 56 71 82 85 76 53 20 -14 -41 -60 -79 -102 -130 -158 -180 -193 -194 -183 -163 -133 -98 -66 -43 -28 -14 0 7 1
4588Aj5j8j0jJ0J6J5J1J3K1K7K4J8J4Qnk0k8k2j0%Jlrj5j6j0%QJ2MnoJJ2J9J6Qlj6k2j7qJ
$$ 1 -14 -32 -42 -43 -33 -17 -2 9 22 43 70 94 112 126 134 129 109 81 59 49 49 50 47 38 23 7 -3 -3 5 17 21 16 10 11 23 42 58 66 63 47 25 8 0 1
4570AMKj%NJ3J6K0K2K3J9J1M%qj8k6k4j4pqpm%lnmJJkkOJ7K1J4%j2j5j4j2oKJ1J3J0RRJ1Q
$$ 1 5 7 6 6 11 24 40 60 82 105 124 135 139 139 131 113 87 63 49 42 34 27 23 23 20 15 11 12 13 11 9 15 32 53 67 67 55 40 26 14 8 10 21 34 44 53 62 73 81
4551H1M%%%MRJ1J1J2J5J7Qj0l2m3m3l7k5j3jLkqlJ2K5K5J3KkNJ5K9L7L4K4J3J1J0Nrk3l4l6
$$ 81 85 85 85 85 89 98 109 120 132 147 164 172 162 130 87 44 7 -18 -31 -32 -29 -31 -39 -42 -30 -5 20 33 35 33 38 53 82 119 153 177 190 201 211 216 207 184 150 114
4533A14k8j2mj0k2k5rJ4K7K6J6Q%rk1k6k1j0%koj0rokJOPJ0J2J2QJnpokLRJ2J3J1P%oqooq
$$ 114 86 74 70 60 38 13 4 18 45 71 87 95 95 86 65 39 18 8 8 6 0 -10 -19 -25 -27 -26 -20 -13 -3 9 21 29 30 25 18 12 10 13 22 34 47 58 65 65 59 51 45 39 31
4513C1j2j2j5j7j1KJ4J5QK%klkLJ3K3K4J1j1k8k9k1k2k4j6OL0M2L8L0J4lj7k3k1j4lRJ6J2
$$ 31 19 7 -8 -25 -36 -34 -20 -5 3 5 5 3 0 -2 1 14 37 61 72 61 33 4 -17 -39 -63 -79 -73 -43 -1 37 67 81 78 61 38 17 3 0 9 25 37
4497C7jj2j5rLJ4J8J3Lqj6k5k6k3qOJ0Njk%%j%NJ4J5RLkllmqj1j7j9j4kRJ5J8K0J9J7J7K2
$$ 37 36 24 9 0 3 17 35 48 51 43 27 2 -24 -47 -55 -49 -39 -34 -35 -37 -37 -37 -38 -38 -33 -19 -4 5 8 6 3 0 -4 -12 -23 -40 -59 -73 -75 -66 -51 -33 -13 6 23 40 62
4478F2K6J6kj6k2k3k2k0j6oMJ0J0J1J4K4L3L2J4qk5k9k3j2kLknojJljOJ7K3K0J4Lrk8m3n0
$$ 62 88 104 102 86 64 41 19 -1 -17 -23 -19 -9 1 12 26 50 83 115 129 121 96 67 44 32 30 33 31 26 20 19 20 17 16 22 39 62 82 96 99 90 62 19 -31
4461c1m3k8j5mMJ3J9J7J3J0J3J9K2J8PmpLJ4K1J8J3QOPJ3K2K5J9jk3l9m2l3k3k0j6qOPJ%J4
$$ -31 -74 -102 -117 -121 -117 -104 -85 -68 -55 -45 -32 -13 9 27 34 30 23 26 40 61 79 92 100 106 113 126 148 173 192 191 168 129 87 54 31 11 -5 -13 -7 0 1 1 15
4444A5K8L1K1J7K0K5K3J4OlqnKjj6l1l7l0k0rJPO%m%ORPLLL%noKMok2k9k1pJORPjroKOJnn
$$ 15 43 74 95 112 132 157 180 194 200 197 189 184 186 185 169 138 101 71 51 42 43 50 56 56 52 52 58 67 74 77 80 83 83 78 72 74 78 72 50 21 0 -7 -6 0 9 16 15 6 0 2 8 9 4 -1
4422aqj1j5j5j3rjRJ6J4Mj2k4l0l1k2pJ4L2M0L4K0QKlj0j4j1LJ8K7K9K0QjkLJj0j8j4lKjo
$$ -1 -9 -20 -35 -50 -63 -72 -73 -64 -48 -34 -30 -42 -66 -96 -127 -149 -156 -142 -110 -70 -36 -16 -8 -6 -9 -19 -33 -44 -41 -23 4 33 53 61 60 58 61 62 52 34 20 17 19 18 12
4404A2j2j4j6j0%PJ0QPLoj2j2rppkPJ8K4K3J8RMNJ2J2Mpj1j0omJPJ1J1Okol%qk6l7l6j9KK2
$$ 12 0 -14 -30 -40 -40 -33 -23 -15 -8 -5 -11 -23 -35 -44 -51 -58 -60 -53 -35 -11 12 30 39 43 48 60 72 76 69 58 48 42 38 39 46 57 68 74 72 66 63 63 55 29 -8 -44 -63 -61 -39
4384c9L6M4M6M0L8L5K6Rj2k7l2l0k8l0l2k4oJ0J5RJmj0j6k2k2j6pjlj7k9l0k2j1mLJ9L5M2
$$ -39 -3 41 87 127 165 200 226 235 223 196 164 134 106 76 44 20 14 24 39 48 49 45 35 19 -3 -25 -41 -48 -49 -52 -69 -98 -128 -150 -161 -165 -162 -143 -108 -66
4368f6L6J9Mnqj0j7k4k4j4kQJ7K7L0K5J0krj2ojmj4j9j1PK0J9Rlj1j4j2rrrnMRO%%J1K4L1
$$ -66 -30 -11 -7 -12 -20 -30 -47 -71 -95 -109 -111 -103 -86 -59 -29 -4 6 4 -5 -17 -23 -24 -28 -42 -61 -72 -65 -45 -26 -17 -20 -31 -45 -57 -66 -75 -84 -89 -85 -76 -70 -70 -70 -59 -35 -4
4350dK6J4LmJJ1J4Lj3k1j1JLqk1k3j5kJ1J7J2Mkmlopn%krj9k5k1j0LJ3J9K1K0Roj6j4kJ1K1
$$ -4 22 36 39 35 36 47 61 64 51 30 19 20 23 15 -6 -29 -44 -46 -35 -18 -6 -2 -4 -8 -11 -17 -24 -29 -29 -31 -40 -59 -84 -105 -115 -112 -99 -80 -59 -39 -30 -36 -52 -66 -68 -57 -36
4331c6K9K7J7ONQRJonJNLKMOOKkmjNJ5K4K6J5lj5j4nLLJKjpj5j9j5j0j1j9k4j7oRJ4J7J9J8
$$ -36 -7 20 37 43 48 56 65 66 60 55 56 61 64 66 70 76 82 84 82 78 77 82 97 121 147 162 159 144 130 125 128 131 132 134 133 126 111 92 77 67 56 37 13 -4 -10 -1 13 30 49 67
4311F7Qpj9k1j5mLLqj6j7roj2j8j6rlJNJ1J1PQJ2J5J1Jj1j9k0j6j0kLQJ7K4K4J3KlOJ9K6K2
$$ 67 75 68 49 28 13 9 12 15 7 -9 -26 -35 -41 -53 -71 -87 -96 -99 -98 -93 -82 -71 -64 -56 -44 -29 -18 -17 -28 -47 -67 -83 -93 -95 -92 -84 -67 -43 -19 -6 -4 -7 -1 18 44 66
4292F6J1%j0j5j5j0rj0rmLQJ0J0OlpJJ6K0Nj8l3k7j6rrj0pmjNJ6K3K0QLJ0K2L1K7J8Npj6k3
$$ 66 77 77 67 52 37 27 18 8 -1 -5 -2 6 16 26 32 29 22 23 39 59 64 46 13 -14 -30 -39 -48 -58 -65 -69 -70 -65 -49 -26 -6 2 5 15 37 68 95 113 118 111 95 72
4274G2k2j8qMJ1J1PNQJ1J0O%oj4j7j3kJ0J5J4QK%kopmKPKj0k2k9l3l5l0j3NJ8K1J5Omj2j1
$$ 72 50 32 24 28 39 50 57 62 70 81 91 97 97 91 77 60 47 45 55 70 84 92 94 94 92 86 79 75 77 84 86 76 54 25 -8 -43 -73 -86 -81 -63 -42 -27 -21 -25 -37 -48
4255d8lQJ7J8J0kj6k2j8j1rpLK2L4K9J6RJ4K4K4J8QJnj2j9j8j1opj2j1m%kqj0j3j5k1k5k6
$$ -48 -51 -43 -26 -8 2 0 -16 -38 -56 -67 -76 -83 -80 -58 -24 5 21 30 44 68 92 110 118 119 114 102 83 65 54 48 41 29 18 14 14 12 4 -6 -19 -34 -55 -80 -106
4238a06j9oJ1K1J8Nj1k2k0qQK0K5K6K7K1Rnj1qnmKJ4K2K3J9J5J6J6J2Jj3k3k6k5k2k1j6nO
$$ -106 -125 -131 -120 -99 -81 -76 -87 -109 -129 -137 -129 -109 -84 -58 -31 -10 -1 -6 -17 -25 -30 -34 -32 -18 4 27 46 61 77 93 105 106 93 70 44 19 -3 -24 -40 -45 -39
4221c9J3J3J0QJ1J1Pjqj0qmKPLqk2l1k2pOJ2RJlLJ5K7L1K9K0QlpoqrpNJ2J1MJLNQPPKmqj2
$$ -39 -26 -13 -3 5 16 27 34 33 25 15 7 3 5 12 15 7 -15 -46 -68 -75 -69 -57 -48 -47 -50 -47 -32 -5 26 55 75 83 80 73 67 59 50 43 48 60 71 75 76 79 84 92 99 106 108 104 96 84
4201H4j5j3mLN%rk1l1l4k2mJ0J5J6J2OkomJLLJlnLJ4J6Onrj0j5k0j3OJ6J2jj0mJ0K6L7L6K4
$$ 84 69 56 52 55 60 60 51 30 -1 -35 -57 -61 -51 -36 -20 -8 -2 -4 -10 -14 -13 -10 -7 -6 -9 -14 -11 3 19 25 20 11 1 -14 -34 -47 -41 -25 -13 -14 -24 -28 -18 8 45 81 105
4182A05Oj2k4l2l2l1k4j0QJ2%j7k1rOQjj3j7j5mRK2L1K8J4mj9k2j9j5j1nLQRONOMKLPJ0Pm
$$ 105 111 99 75 43 11 -20 -44 -54 -46 -34 -34 -51 -72 -81 -75 -67 -68 -81 -98 -113 -117 -108 -86 -55 -27 -13 -17 -36 -58 -77 -92 -103 -108 -105 -97 -88 -82 -77 -71 -67 -65 -62 -55 -45 -38 -42
4163d2j5k0j3JK1L9M4L7K3J3J0J1QPNNNOOJj2k4l2l1l2k7j8KK0K8K0Mppknj1j0JJ2J1Jml%
$$ -42 -57 -77 -90 -89 -68 -29 15 52 75 88 98 109 117 124 129 134 139 145 151 152 140 116 84 53 21 -6 -24 -22 -2 26 46 50 43 36 34 29 18 8 9 21 32 33 29 26 26
4145B6jknj0rkPJ3QJnqj1pLJ5K0J2mj7j6kJ8K7K1QJKNKj2l1m3l7k3j0rj1pKOMj%OJ4K2K5K2
$$ 26 25 23 18 8 -1 -3 4 17 25 26 21 13 2 -5 -2 13 33 45 41 24 8 6 24 51 72 80 81 83 88 90 78 47 4 -33 -56 -66 -75 -86 -93 -91 -85 -81 -82 -82 -76 -62 -40 -15 7
4126GJ8J1Jj3k5l1k1LK8M8N2L8J2rk0k2k1j8j6j1pJJ2K0K3J9Rjj4k0j8qPJ5J1%j3j6j5j8k6
$$ 7 25 36 37 24 -1 -32 -53 -50 -22 26 78 116 128 119 99 77 56 38 22 11 4 5 17 37 60 79 88 87 73 53 35 27 34 49 60 60 47 31 16 -2 -28
4109b8l5l5k9j9rLJ2J8J7J2LkmpqpjRJ4J3J4J8J9J1kr%J4K4K6J7Kpj1j2j1nMJ0J0NOJ2J6J4
$$ -28 -63 -98 -127 -146 -155 -152 -140 -122 -105 -93 -90 -92 -96 -103 -111 -118 -119 -110 -96 -83 -69 -51 -32 -21 -23 -32 -32 -18 6 32 49 51 44 33 21 10 5 9 19 29 34 40 52 68 82
4091H2J4J6J3%k0m1n6o0n2k8mJ2J7K1K5K4K0J6J3QkqmMPKlkNRQ%j0j5j6j6j2oMJ4K6L9M5L7
$$ 82 96 112 125 125 105 64 8 -52 -104 -132 -136 -124 -107 -86 -61 -37 -17 -1 12 20 18 10 6 10 17 19 16 14 19 28 36 36 26 11 -5 -21 -33 -39 -35 -21 5 44 89 126
4073A26K1Nkmmj1j8k3k1j5j2j1rjJ1J5J5J9K7L0K0kk0l0l4l5l1j9nJ3K4L0K5K1K3K0Lk2l7
$$ 126 147 152 150 146 142 131 113 90 69 54 42 31 22 21 32 47 62 81 108 138 158 156 136 106 72 37 6 -13 -18 -5 19 49 74 95 118 138 141 119 82
4058H2l5k4j7j4qKJ3K1K4J5lk1k7k5k1k0j5oNJ2J6J5J2Okj3j7j3nJNRJ3J3OmpnkNJ6K2K3J6
$$ 82 47 23 6 -8 -16 -14 -1 20 44 59 56 35 8 -17 -38 -58 -73 -79 -74 -62 -46 -31 -19 -13 -15 -28 -45 -58 -63 -62 -57 -48 -35 -22 -16 -20 -27 -32 -34 -29 -13 9 32 48
4040D8J0RJ2J2J4J0jj6k7k5j4OK1K6J3j1l0l8l7l3k5j5oMJ7L3M1L8K9J7Kj4k1j7j1qqjRJ6
$$ 48 58 67 79 91 105 115 114 98 71 46 32 38 59 85 98 87 57 19 -18 -51 -76 -91 -97 -93 -76 -43 -2 36 65 82 84 70 49 32 21 13 5 4 13 29
4024B9J6J0Mnj4j9j9j6j7j6j7j9k1j3JJ3J6J4J7K0J8J3PKlpojNOLJknJQJ6J2Kpqn%%kkjjq
$$ 29 45 55 59 54 40 21 2 -14 -31 -47 -64 -83 -104 -117 -116 -103 -87 -73 -56 -36 -18 -5 2 4 1 -6 -12 -13 -8 -2 1 2 0 -5 -4 4 20 32 34 27 19 14 14 14 12 10 9 8 0
4004@j8k8l3l1k0JK3L7L0J7RRJ1QMKKjrj5j4pNJ4J5J1QRJ5K1K3K2J7Kj9l6l7k6j8j8k2k2k2
$$ 0 -18 -46 -79 -110 -130 -129 -106 -69 -39 -22 -13 -4 7 15 19 21 23 22 13 -2 -16 -23 -18 -4 11 22 30 39 54 75 98 120 137 139 120 84 47 21 3 -15 -37 -59 -81
3987h1k6k5rJ7L6L6K2Ooj5j9j8oJ0J7J0lj5j7j4j2oNJ9K9K9J9PJQJ6K4J9Qlqrj4k2k6k0rl
$$ -81 -107 -132 -141 -124 -88 -52 -30 -24 -30 -45 -64 -82 -88 -78 -61 -51 -54 -69 -86 -100 -112 -118 -113 -94 -65 -36 -17 -10 -9 -1 15 39 58 66 63 55 46 32 10 -16 -36 -45 -48
3970d8JPJ4K0J6J0Lpj6j6j0mj0k2k9k1pQK0L2M3M8M6L0Nk2l3k8j7j1mKJ5K2K5K9L1K4Qj1k0
$$ -48 -47 -40 -26 -6 10 20 23 16 0 -16 -26 -30 -40 -62 -91 -112 -119 -111 -91 -59 -16 32 78 108 113 91 58 30 13 2 -2 0 15 37 62 91 122 146 154 143 123
3953A23k0j4pmnqplkpj4j4nJ0J6J6J3J1J0OjonlJMOPONLKlrj4j6j4oLNKkk%JJKJpj9k5j8j0
$$ 123 103 89 82 78 73 65 58 55 53 46 32 18 13 23 39 55 68 79 89 95 94 88 83 80 81 85 91 98 104 109 112 114 111 102 88 72 58 52 55 60 62 60 58 58 59 60 62 63 56 37 12 -6 -16
3932a6lpj4j7qNJ1PNQJ5J4QPLmqLK3L0K0ROQMpj6k3k6k5j6qkNJ2J8J6J5J5J4Kj3j9j9k3l1
$$ -16 -19 -26 -40 -57 -65 -60 -49 -42 -37 -29 -14 0 8 15 18 14 6 9 32 62 82 91 97 105 109 102 86 63 37 12 -4 -12 -14 -9 3 21 37 52 67 81 83 70 51 32 9 -22
3913b2l7l3k0j0mkopKJ7K5K5J8J6J4RMJjkjNJ3K5K9K3Kk3l8l3k4j9j8j6oPJ8K3K2J8J4J6J6
$$ -22 -59 -92 -112 -122 -126 -128 -134 -141 -139 -122 -97 -72 -54 -38 -24 -15 -11 -10 -11 -13 -14 -9 4 29 58 81 83 60 22 -11 -35 -54 -72 -88 -94 -87 -69 -46 -24 -6 8 24 40
3896D0R%pqpmLJ1J3Okprj3j9k5k4pJ3K3J6NLQJ2Npj4j4j0nJ%lmljmrj1nLJ0RO%JOJ4J6Rjm
$$ 40 49 49 42 34 27 23 26 37 50 56 54 47 38 25 6 -19 -43 -50 -37 -14 2 7 10 18 30 35 28 14 0 -10 -15 -14 -14 -17 -21 -24 -25 -29 -38 -49 -54 -51 -41 -32 -26 -26 -25 -19 -5 11 20 19 15
3875A5KJ3K2K3K3K3J7Lj2j6j0kJOJ6L1L7L0J4lj6k2j8qJLJlnj2j8k3k0j6j1qprj5j5qLLqk0
$$ 15 17 30 52 75 98 121 138 141 129 113 103 101 102 108 124 155 192 222 236 233 217 195 177 169 170 173 174 171 166 154 136 113 93 77 66 58 51 42 27 12 4 7 10 2 -18
3857a8k5k1j5mPJ8K1J9J8J7J6J1OLKPJ5K1J7Oj0k2l1l3k8k6k2j6kJ8L1L0K2J3Pnj7k2j3%J1
$$ -18 -43 -64 -79 -83 -76 -58 -37 -18 0 17 33 44 50 53 55 62 77 98 115 121 111 89 58 25 -3 -29 -51 -67 -69 -51 -20 10 32 45 52 47 30 8 -5 -5 6
3840FJ8J6RLlkMO%j1j7rNJ1P%qj4j5j2qpj2j8k2k2j7rLJ2J7K5L5M1L7K3J1JmnlLNQJ2J5Rl
$$ 6 24 40 49 52 49 47 51 57 57 46 29 20 25 36 43 43 35 21 6 -6 -14 -21 -33 -51 -73 -95 -112 -121 -118 -106 -89 -64 -29 12 49 72 83 84 80 75 72 75 80 88 100 115 124 121
3821A21j3j5k0l6m9n0k9lJ5K0J0lj2j1%J7L0M0M2L0J0oj0pj%JLRJ2J0OKjmj0j3j6j6j5j3j1
$$ 121 108 93 73 37 -12 -62 -91 -94 -79 -59 -49 -52 -64 -75 -75 -58 -28 12 54 84 94 88 78 71 70 70 71 74 83 95 105 111 113 112 108 98 85 69 53 38 25 14
3804A4j3j6j5oOJ3J4J4J4J3J4J4J6J4RNlj5k7k9k2j4j0oMJ2J4J4K0L3M3M7M8M3K6Kj3j4j2
$$ 14 1 -15 -30 -36 -30 -17 -3 11 25 38 52 66 82 96 105 110 107 92 65 36 14 0 -10 -16 -12 0 14 28 48 81 124 171 219 262 288 290 277 263 251
3789B51j5k4l0k7k1j1MJ8J9Oj4k5k2j2nlnom%Kkj0j7j5qloj5k2k1j1jLPJ7K2J9J5J0QJqpP
$$ 251 236 212 182 155 134 123 127 145 164 170 156 131 109 97 92 89 84 78 74 74 76 74 64 47 32 24 21 15 0 -22 -43 -54 -55 -52 -45 -28 -6 13 28 38 46 47 39 32 39
3771C9K3L0K3J2Kknoj1j6j8j5rrj6k2k5k5k4k1j4qkMJ1J8J9J3OJNJ4K7L4L3K3J6J2J2Pmj6
$$ 39 62 92 115 127 129 127 122 116 105 89 71 56 47 38 22 0 -25 -50 -74 -95 -109 -117 -119 -115 -104 -86 -67 -54 -48 -47 -42 -28 -1 33 66 89 105 117 129 136 132 116
3754A16k3k3j6j4j7k5l1l0j5LJ5J5NkjRJ7J8J8J8K3L4M4M2K1pl1m3m2l6k2pjlqmLQPJjLMj
$$ 116 93 70 54 40 23 -2 -33 -63 -78 -75 -60 -45 -40 -42 -43 -34 -17 1 19 37 60 94 138 180 201 194 163 120 78 42 20 13 12 9 1 -3 0 8 15 16 15 18 22 21
3736B1j0j6j6j2j4k0k4k0j0mjMJ5K3K6K4K4J7Oqj5j1jRJ2Nknooj3j6j4rppmKMllQK2K7K3J3
$$ 21 11 -5 -21 -33 -47 -67 -91 -111 -121 -125 -126 -122 -107 -84 -58 -34 -10 7 13 5 -10 -21 -22 -13 -1 4 2 -3 -9 -15 -28 -44 -58 -67 -74 -81 -85 -83 -79 -82 -85 -77 -55 -28 -5 8
3718HRNmj3j8j7p%pk5l4k4lJ1J2J0J3K0J8J2Jqj2oMJ3J5J1Npj5j2MK3K9K5J6Mj2k4k6k0j1
$$ 8 17 22 18 5 -13 -30 -37 -37 -44 -69 -103 -127 -130 -119 -107 -97 -84 -64 -46 -34 -33 -41 -53 -59 -55 -42 -27 -16 -11 -18 -33 -45 -41 -18 11 36 52 56 44 20 -6 -26 -37
3700c7qppqj1j6k1j9j6r%QJ3J5J1NKRK1K8K4J4RJ1J7J8J5J3J1J0J0PLkpqkJ2K6L0J8Lnpom
$$ -37 -45 -52 -59 -67 -78 -94 -115 -134 -150 -159 -159 -151 -138 -123 -112 -107 -105 -96 -75 -47 -23 -9 0 11 28 46 61 74 85 95 105 112 115 113 106 98 96 108 134 164 182 185 180 173 167 163
3682A63%L%j1k1k4k1j7j0KJ0J0Kqj4j5j3pJQJ4J7J6Qlj3j6rMRJ0OOMkj4k4k6k0qJOJ1J1J0
$$ 163 163 166 166 155 134 110 89 72 62 64 74 84 86 78 64 49 36 29 30 38 52 69 85 93 90 77 61 52 56 65 75 81 87 91 89 75 51 25 5 -3 -2 4 15 26 36
3664C6RQJ1J3J4Pnj6k2k4k5k1j4kOJ2J6K1K1J6Npj5j3%J4J6Nrj9k4k1j1RJ9J2kojmj7l1k6
$$ 36 45 53 64 77 91 98 93 77 55 31 6 -15 -29 -31 -25 -13 3 24 45 61 66 59 44 31 31 45 61 66 57 38 14 -7 -18 -9 10 22 20 14 13 9 -8 -39 -65
3646f5j1nrj7j3JJ4K2K8L5L9L4K3J5J1R%qqmnj9l6m0l0j3%K%jNJ3J9J5RJLJ1J9K0J1L%%pj7
$$ -65 -76 -81 -90 -107 -120 -119 -105 -83 -55 -20 19 53 76 91 102 111 111 103 95 91 86 67 31 -9 -39 -52 -52 -50 -50 -51 -46 -33 -14 1 10 11 14 25 44 64 75 78 78 78 71 54
3628E4k0j6oNK0L2L1J7Lqj8k9l3k2qjj%PJ4J3QKnj1j4j0oorj1p%J0J7J7J0LkKOJ1J3J2RQQ
$$ 54 34 18 12 17 37 69 100 117 120 112 94 65 32 10 2 1 0 0 7 21 34 42 44 39 28 14 4 -2 -8 -17 -28 -35 -35 -25 -8 9 19 22 20 22 28 39 52 64 73 81 89
3609H9Lrk0k0qQJ8K1K1K1J8J3Lj2k3k8l1l5l6l0j5JRRONLJmnnrj5k2j9rMK0L3L9L1J9J1QN
$$ 89 92 83 63 43 35 43 61 82 103 124 142 155 158 146 123 95 64 29 -7 -37 -52 -51 -42 -33 -27 -22 -19 -18 -22 -27 -32 -41 -56 -78 -97 -106 -102 -82 -49 -10 21 40 51 59 64
3591F4nj3j3j1j1j0kMQMJj%nj0j2j2lJ3K7L3K7J7J0Lnj2j2j0qoommonjPJ6J8Oj7m0m7l8j7
$$ 64 59 46 33 22 11 1 -1 3 11 15 16 15 15 10 0 -12 -24 -27 -14 13 46 73 90 100 103 98 86 74 64 56 50 44 40 36 30 25 24 31 47 65 71 54 14 -33 -71 -88
3573h8JJ6K5K9K9K7K4K2J3Mnqqoljjnj2k1l0l2k8j8qlNJ4K1K1J6J3J6J0jpl%nj4k0j7j0kN
$$ -88 -87 -71 -46 -17 12 39 63 85 98 102 97 89 81 75 72 71 70 65 53 32 2 -30 -58 -76 -84 -87 -82 -68 -47 -26 -10 3 19 29 28 21 18 18 13 -1 -21 -38 -48 -50 -45
3555d5OJonMJ2J4J2QMLPJ3J6J0Jqj4j4j1qj0j9j8oLjrpOJ9K2J8J2J1RRN%KOOkpJJ0J1Njlr
$$ -45 -39 -38 -44 -49 -45 -33 -19 -7 1 5 8 15 28 44 54 55 47 33 19 8 0 -10 -29 -47 -53 -50 -51 -60 -67 -61 -42 -20 -2 10 21 30 39 44 44 46 52 58 56 49 50 60 71 76 75 72 63
3534F3k2l1l0k7k4j4kLMRK0K5J3nrkMjqj3j2rlJnj3j5n%oj4j2jPQRJ6K3K0J1NRJ6J8K3K4K2
$$ 63 41 10 -20 -47 -71 -85 -87 -84 -80 -71 -51 -26 -13 -18 -27 -29 -25 -26 -34 -47 -59 -68 -71 -70 -75 -88 -103 -108 -108 -114 -128 -140 -141 -134 -126 -117 -101 -78 -58 -47 -42 -33 -17 1 24 48 70
3515G0Rj2k8k7j5okoj0j6j7pRJ9J4jj0j0kPJ6K3K7K3J5RRQ%j4k4k9k7k8k6k1j5rJJ7K5K2J1
$$ 70 79 67 39 12 -3 -9 -11 -17 -27 -43 -60 -67 -58 -39 -25 -26 -36 -46 -48 -41 -25 -2 25 48 63 72 81 89 89 75 51 22 -5 -33 -59 -80 -95 -104 -103 -86 -61 -39 -28
3498b8MNJ0J3K3L5M4L6J9Kpj2j3j2p%%nj6k3k4j8j3j1qkQJ6J6Qok6m3n2m1k0OK5L7L6J8nj6
$$ -28 -24 -19 -9 4 27 62 106 142 161 163 156 144 131 119 112 112 112 107 91 68 44 26 13 2 -6 -8 0 16 32 40 34 8 -35 -87 -128 -148 -142 -117 -80 -44 -26 -31 -47
3481d7oJ1K1K0J5J9K1J6%j9k7k4j5kRJ2Mrj6pPJ2RRJ6K0J5Lorqj4k2k8k9k5j8j5j4j5rJJ4
$$ -47 -53 -42 -21 -1 14 33 54 70 70 51 24 0 -15 -17 -8 4 8 -1 -17 -24 -17 -5 4 13 29 49 64 67 61 52 44 30 8 -20 -49 -74 -92 -107 -121 -136 -145 -144 -130
3463a30K7L9M4L6K0PKJ%nqrj3j6j9j5j0lNRLqj2lPJ1O%%J0K3K9K6J5ONOM%JJJKPJ1J2J0J1
$$ -130 -103 -64 -20 16 36 43 45 46 46 41 33 24 11 -5 -24 -39 -49 -52 -47 -38 -35 -43 -55 -58 -51 -40 -34 -34 -34 -24 -1 28 54 69 75 80 86 90 90 91 92 93 95 102 113 125 135 146
3444A46J5J3Kj5k9l7l3j8LJ5J7J4J1Plj9k9k6j7nJKnj4k2k2j6j0opn%PJ0RJ1K2L2L1J9Jj1
$$ 146 161 174 176 161 132 95 62 44 47 62 79 93 104 111 108 89 60 34 17 12 13 15 10 -4 -26 -48 -64 -74 -80 -87 -92 -92 -85 -75 -66 -55 -33 -1 30 49 50 39
3427C9j8k2k3j6nNRRRJ3J9K2J4O%kqj8k6k8k4j3NK7M3M3K2ok3k8k2j1prj3j2nKJkjJ0J9K4
$$ 39 21 -1 -24 -40 -45 -40 -31 -22 -13 0 19 41 55 61 61 59 51 33 7 -21 -45 -58 -53 -26 17 60 82 76 53 25 3 -8 -15 -24 -37 -49 -54 -52 -51 -53 -54 -44 -25 -1
3410aK3K2J6Jj9l2l0k3j7j0KJ7K3J2kj0qlKRJ5J6J4J3J4Oqk0j5JJ0Pkj2k0k6k6j5JJ8L0L1
$$ -1 22 44 60 61 42 10 -20 -43 -60 -70 -68 -51 -28 -16 -18 -28 -36 -39 -37 -28 -13 3 17 30 44 50 42 22 7 8 18 25 23 11 -9 -35 -61 -76 -75 -57 -27 4
3393DK3J1L%%KJ0K3L1K8J2qk2l3l7l6l1k9k6k0j0LJ5J7QloJPQPPNKJJ0K1K8K8K1J0rk5l2k3
$$ 4 27 38 41 41 41 43 53 76 107 135 147 139 117 84 47 11 -20 -49 -75 -95 -105 -102 -87 -70 -62 -65 -71 -70 -63 -55 -48 -41 -36 -34 -33 -23 -2 26 54 75 85 76 51 19 -4
3375dj1%LJlomjmj1j3nPK0K9L1K6Qmp%JJKPOlj5k1k0rQK1K5K3J9J9J8J2Nmrj2qpj1j5rJ3M0
$$ -4 -15 -15 -12 -11 -14 -20 -24 -25 -29 -40 -53 -58 -51 -31 -2 29 55 63 59 52 52 53 54 56 63 69 66 51 30 10 1 9 30 55 78 97 116 134 146 151 147 138 126 118 111 100 85 76 89 129
3355A29N4N0L3J4mk1k8k8k4k5l3l8l4k0j3j3j9k0j1prj4j4%J8L4L6K3Nqj2j1j7k2k4j9qMJ6
$$ 129 183 233 266 280 276 255 227 199 175 150 117 79 45 25 12 -1 -20 -40 -51 -58 -67 -81 -95 -95 -77 -43 -7 16 21 13 1 -10 -27 -49 -73 -92 -100 -96 -80
3339h0K3K8L0L4L4K5J3%lkKPONK%jklknpkPJ1%j6k0j0MJ0RMJKPJ3J1Nlqj4k1k2j8j8j9j2O
$$ -80 -57 -29 1 35 69 94 107 107 104 102 104 111 117 122 124 124 123 121 118 116 111 104 102 109 120 120 104 84 74 78 88 97 101 102 104 111 124 135 140 137 129 115 94 72 54 36 17 5 11
3319A1J8Qj3k4j7rrj4j4mOJ2J3J2J1Mj0k9l9l4j6KJ6K5K8K5J9J6J7J8J8K1K6K6K1J2Jj1k4
$$ 11 29 37 24 0 -17 -26 -35 -49 -63 -67 -61 -49 -36 -24 -13 -9 -19 -48 -87 -121 -137 -135 -119 -94 -66 -41 -22 -6 11 29 47 68 94 120 141 153 154 143 119
3304A19l2k8j3%RJ3RJqj1plllLJ1J4J0MLONOJ0J5J5Mj3k7k9k2j0JKmj0pLJ1J8K6L7M0K5jk3
$$ 119 87 59 46 46 55 68 77 78 70 59 52 49 46 43 46 57 71 81 85 88 94 99 105 115 130 145 149 136 109 80 58 48 49 51 47 37 30 33 44 62 88 125 165 190 189 166
3285A66k7k0j1onn%NJ0Q%onMQMmoJJ0J5J5J0jj7l5m0l1j4JPLlqkQJ3Mj2k7l0k6k0j2%J1J6
$$ 166 139 119 108 102 97 92 92 97 107 115 115 109 104 108 116 120 116 110 111 121 136 151 161 160 143 108 68 37 23 24 31 34 31 23 21 29 42 46 34 7 -23 -49 -69 -81 -81 -70 -54
3266e4Qj2l3l8k8j0JJ1K3L3L0J5jpqpmjjqj3j0QK9M0L7K6J6QLqk5m1m5l2pJ3K2K4K3K4K9K7
$$ -54 -46 -58 -91 -129 -157 -167 -166 -155 -132 -99 -69 -54 -55 -62 -70 -77 -81 -82 -83 -91 -104 -114 -106 -77 -37 0 26 42 50 53 45 20 -21 -66 -98 -105 -92 -70 -46 -23 1 30 57
3249E7J7Nmoqj0qlKLkpj1j3j2pOJ7K2J9J4RN%nj4k8m0m4l0mJ7K4K0J6J4J2Kj5k4k3j3lNPN
$$ 57 74 79 75 69 61 51 43 40 42 45 43 36 25 12 0 -7 -1 16 38 57 71 80 85 85 80 66 38 -2 -46 -76 -80 -63 -39 -19 -3 11 23 25 10 -14 -37 -50 -53 -48 -41 -36
3230c6JJOLpj8k1j2MJ6J9J1lj7k4k1j4rpj0j3j5qNJ7J9J6J5J7J9J6J1POPONOPPL%%J%llmr
$$ -36 -35 -34 -28 -25 -32 -50 -71 -83 -79 -63 -44 -33 -36 -53 -77 -98 -112 -121 -128 -138 -151 -166 -174 -169 -152 -133 -117 -102 -85 -66 -50 -39 -32 -26 -19 -13 -8 -2 5 12 15 15 15 16 16 13 10 6 -3
3211ck1k3j0QK2K6K7L0L1L2K9K2Pj1k3k5k5k4k0nJ5K8K4J3Mjmj1k0k4j5JJ3J7J2%j8l3l9l2
$$ -3 -24 -47 -57 -49 -27 -1 26 56 87 119 148 170 177 166 143 118 93 69 49 44 59 87 111 124 128 127 123 112 92 68 53 54 67 84 96 96 78 45 6 -26
3195b6k0j3j2j4j3mJ0K0K1J2RJ4J9K2J9J6Rkj1j2qqj1j2mJ1L0M2M6L3Rj0j8k1k4k7k7k2j4
$$ -26 -46 -59 -71 -85 -98 -102 -92 -72 -51 -39 -30 -16 3 25 44 60 69 67 56 44 36 28 17 5 1 12 42 84 130 163 172 162 144 123 99 72 45 23 9
3179InLRQM%%QJ7K0J2kj6k2k0j7rjJ0K5L2L5K7J6NJkoj3j8j6j4j2j4j4j4j5j6j7j0kOJ0J4
$$ 9 4 7 16 24 28 28 28 36 53 73 85 83 67 45 25 8 -1 -2 8 33 65 100 127 143 148 149 147 141 128 110 94 80 68 54 40 26 11 -5 -22 -32 -34 -28 -18 -4
3161dJ6J7J0L%%%mpopj0j1j0kRJ7K3J6nk6k9j6NK0K3K3J3kj2rKJ1J2NKjk%JKkpj2j2j0omj
$$ -4 12 29 39 42 42 42 42 38 31 25 18 8 -3 -13 -15 -6 11 34 50 45 19 -10 -26 -21 -1 22 45 58 56 44 35 37 48 60 65 67 66 64 64 65 67 65 58 46 34 24 18 14 13
3142A3MJ0J1jj6k4k4j4kQJ1PJLJ3K3L0K4J4Lqj4j7j3mOJ4J9K1K2J7Mj1k2k7l1l2k5j4orj4
$$ 13 17 27 38 37 21 -3 -27 -41 -43 -35 -24 -17 -16 -13 0 23 53 77 91 94 86 72 55 42 38 44 58 77 98 120 137 141 130 108 81 50 18 -7 -21 -27 -36 -50
3125e0j1KRRL%mrj6j8qRK6L2K7J6Lrj3j2jJ2J9K0J1JokPJ4J4Ojlkkkml%MNL%LNmj9k5j3LP
$$ -50 -61 -59 -50 -41 -38 -38 -42 -51 -67 -85 -93 -84 -58 -26 1 17 20 11 -2 -14 -15 -3 16 36 47 48 42 40 47 61 75 81 80 77 75 73 71 67 64 64 68 73 76 76 79 84 80 61 36 23 26 33
3104C3%j0qjPJ6K6K7J6nk3l0k3nJ4K6K4J5Njpj2rOJ9J6jj8k9l2l6l5k9j3JPMkkRJ9K3J9J5
$$ 33 33 23 15 14 21 37 63 90 106 101 78 48 25 20 34 60 84 99 104 103 96 84 75 81 100 116 115 97 68 36 0 -35 -64 -77 -76 -69 -65 -67 -69 -60 -41 -18 1 16
3086A6Pnk3l1k2JJ8K1J7J1QKjknj0j4j2rnjOJ3Qoj9j9j1KJ0Q%olPJ5J5J2RRRJ3K3K8K1Mj9
$$ 16 23 18 -5 -36 -58 -57 -39 -18 -1 10 18 20 19 17 12 2 -12 -24 -33 -38 -39 -33 -20 -12 -18 -37 -56 -67 -65 -55 -47 -47 -53 -56 -49 -34 -19 -7 2 11 20 33 56 84 105 109 90
3067I0l3l6k7j4ollKPJ0RNKlpj0pkMRJ2J3J7K2K3J3kj0nPJ3Olj0pJQPmj8l3l8l7k3oQJ7K6
$$ 90 57 21 -6 -20 -26 -29 -32 -30 -23 -13 -4 1 3 0 -7 -17 -24 -26 -22 -13 -1 12 29 51 74 87 85 75 70 77 90 96 93 83 76 77 85 92 88 70 37 -1 -38 -61 -67 -59 -42 -16
3048a6L2K6Nj3j5jJ5K2J6Nqj6j1KJ1J7K1J9J3Kn%RQjj3j9j1KRJ0OMLORJ2J6J2Nmj1j8k2j6
$$ -16 16 42 47 34 19 18 33 55 71 76 68 52 41 43 54 71 92 111 124 126 121 121 130 138 137 124 105 94 96 105 115 121 125 128 134 143 155 171 183 188 184 173 155 133 117
3030A17poj8l5m1l5k9k5k1j0NJ6J9J5J4J8K8L2K7J4OK%jj%jjKRJ0MnqnjLNLmrj2j2j3j6j7
$$ 117 110 104 86 51 10 -25 -54 -79 -100 -110 -105 -89 -70 -55 -41 -23 5 37 64 78 84 86 86 85 84 84 83 82 84 93 103 107 102 94 89 88 91 96 99 95 86 74 62 49 33 16
3012A6j7j8j6pOJ8J9J3Jj1j8j8qJJ0J3J6J9J8J3J0Nlj5k2j9j0mKPJ3Opj3kK1L7L3J7%j4k7
$$ 16 -1 -19 -35 -42 -36 -18 1 14 15 4 -14 -32 -40 -39 -29 -16 0 19 37 50 60 65 62 47 25 6 -4 -8 -6 1 14 20 13 0 -2 19 56 89 106 106 92 65
2995F5l5k8rPQjrj2nLOMKNJ2J9K0J9J4Mnrj3j7k2k0j1nnqj2j4j5rKJ7K4K0OopNJ8K5J9RKM
$$ 65 30 2 -7 0 8 7 -2 -14 -19 -16 -10 -6 -4 1 13 32 52 71 85 89 84 75 62 45 23 3 -8 -13 -18 -26 -38 -52 -67 -76 -74 -57 -33 -13 -7 -13 -20 -15 3 28 47 56 58 62
2975F2OQQQOjj3k2k6j7lQJ3J4J9K1K0J4Pjqrqmnqrqj2j9k5k2j5%J7K5J8kj4j2olpj3j3nJ3
$$ 62 68 76 84 92 98 97 84 62 36 19 16 24 37 51 70 91 111 125 132 131 123 114 106 102 97 89 80 72 60 41 16 -6 -21 -21 -4 21 39 37 23 11 5 2 -5 -18 -31 -36 -23
2957b3K9L5K2jj4j2kMJpj7k1k0j3pJJ3K8L2K2QKKPQRRPK%mqnMJ9K4J9J0jj1k7m4n3n0l7k0
$$ -23 6 41 63 62 48 36 34 38 39 32 15 -6 -26 -39 -46 -45 -32 -4 28 50 58 60 62 69 77 86 95 102 104 104 100 92 87 91 110 134 153 163 162 151 124 80 27 -23 -60 -80
2938h0pmpmOJ8K2J6Kj1j7j2npj8k5k0pNJ5K4L5L5K8J7QOLJmpqpnlkKLkmKJ3J5RK%LKmj0j2
$$ -80 -87 -91 -98 -102 -96 -78 -56 -40 -38 -49 -66 -78 -83 -90 -108 -133 -153 -160 -155 -140 -116 -81 -46 -18 -1 7 13 16 17 13 6 -2 -9 -14 -17 -19 -17 -14 -16 -20 -18 -5 10 19 21 21 24 26 22 12 0
2918@mMJ0Pmj3k0k1k2j4KJ4J2jj1j1lPJ6J9J6J0PORJ2J5J1JpjJ7K9K6J1%lJOOkj3j7qNJ2J0
$$ 0 -4 0 10 17 13 0 -20 -41 -63 -77 -75 -61 -49 -50 -61 -72 -75 -68 -52 -33 -17 -7 0 6 15 27 42 53 54 47 46 63 92 118 129 129 126 127 133 139 137 124 107 99 104 116 126
2899A26RNnk2l5l7k6j1MJ7K1J9J4J0Lmj1j2rl%JJ%lmJONJLJ1K1K3J3Jnj1j9k7k6j4KJ3J6J1
$$ 126 135 140 135 113 78 41 15 4 8 25 46 65 79 89 92 88 77 65 56 53 53 54 55 55 52 48 49 55 60 61 64 75 96 119 132 133 128 117 98 71 45 31 33 46 62 73
2880G3Kqj6k0j7j0LJ2J1Jqj4j5j7j5rJQO%prqmNJ6J9J4Loj3j3pNJ2Rlj4k1k2k0qQJ9J5Mnm
$$ 73 75 67 51 31 14 4 7 19 30 31 23 9 -6 -23 -38 -47 -46 -38 -32 -32 -39 -48 -56 -60 -55 -39 -20 -6 -3 -9 -22 -35 -42 -37 -25 -16 -19 -33 -54 -76 -96 -104 -96 -77 -62 -58 -63 -67
2861f7jKORRPOJ2J7J6J5J2J2J0J0J2J2Mj0j7j5nPJ1J2Mqk3l3l1k7k1j9j3mNPNRJ7J9J5J2J6
$$ -67 -68 -66 -60 -51 -42 -35 -29 -17 0 16 31 43 55 65 75 87 99 103 93 76 61 56 63 74 86 90 82 59 26 -5 -32 -53 -72 -85 -89 -84 -77 -72 -63 -46 -27 -12 0 16
2843A6K6K4J5NLNmk5m8n7m8k0NJ7J6J2J3J8K3K3J9Pnj2j5j2oljJKNORJ2J3Qjmnrj6j6nJ0K0
$$ 16 42 66 81 86 89 94 90 65 17 -40 -88 -108 -103 -86 -70 -58 -45 -27 -4 19 38 45 40 28 13 1 -5 -8 -9 -8 -6 -1 5 14 26 39 47 46 42 37 28 12 -4 -9 1 21
2825B1J6Jj8k8k5nJ3J3%j1j2j2j2pMJ2J8K1K2K0J2NMNNM%nrpKPMpj5j2mPJ5J7J5J2QLnqm%
$$ 21 37 38 20 -8 -33 -38 -25 -12 -12 -23 -35 -47 -59 -66 -62 -50 -32 -11 11 31 43 48 52 57 62 66 66 61 52 45 47 54 58 51 36 24 20 27 42 59 74 86 94 97 92 84 80 80
2806H0kojQJ0jj5k0j6j1qnjjmpmKKlqropj4j5oPJ1QKkkLJ5K4K6K2J7J4J4R%j1k1k7k5j6lM
$$ 80 78 72 71 79 89 88 73 53 37 26 18 13 12 11 7 0 -4 -2 0 -3 -11 -20 -26 -33 -47 -62 -68 -61 -50 -42 -40 -42 -44 -41 -26 -2 24 46 63 77 91 100 100 89 68 41 16 0 -3 1
2786AJ1Ooj6j5%J7J9J6QNMJ%oj3k4k8k5j4nj%jkoj3k0k5k6k2j5mPJ4J8K0K0J8J5J1Okj0j7
$$ 1 12 18 12 -4 -19 -19 -2 17 33 41 46 50 51 51 45 32 8 -20 -45 -59 -64 -65 -65 -66 -68 -74 -87 -107 -132 -158 -180 -195 -199 -192 -178 -160 -140 -120 -102 -87 -76 -70 -72 -82 -99
2767i9j6j0%RJ7K1K5K9K8K3J2MJK%kLJ0J2Kj8l1l2k4j0QL0M3M1J9qk1j6kJ0Pj0l8n9n7k9M
$$ -99 -115 -125 -125 -116 -99 -78 -53 -24 4 27 39 43 44 46 46 44 47 57 69 71 53 22 -10 -34 -44 -36 -6 37 78 97 89 68 52 50 60 67 57 19 -40 -97 -126 -122
2751a22K3K2J6J6J8J9J4J4J2J0Lk%RJ5J5LqrkLnj8k6k4j9j4pJOPJkjKKJknprj4j9j7oJ0K0
$$ -122 -99 -77 -61 -45 -27 -8 6 20 32 42 45 43 43 52 67 82 85 77 68 66 69 64 46 20 -4 -23 -37 -44 -43 -37 -30 -29 -31 -32 -30 -28 -27 -29 -34 -41 -50 -64 -83 -100 -106 -96 -76
2732g6K1K0K0J7Qj1k6k5nJ8L0K4J2kqnOJ7K4K0J2QQJ2J4J4J2Nmqpmml%Kkrj7k3k5k4j9j4p
$$ -76 -55 -35 -15 2 10 -1 -27 -52 -57 -39 -9 15 27 25 17 12 18 35 59 79 91 99 107 119 133 147 159 164 160 152 145 141 137 134 134 136 134 125 108 85 60 36 17 3 -4
2714dJJ1K0K1J2Jj1j5j4j1rj2j4qKJ1J3QOQJ2J3Oqj5oJ0J8Oj6l5l6k6oQJ4J3J4J7J7J4J1J0
$$ -4 -3 8 28 49 61 62 51 36 22 11 2 -10 -24 -32 -30 -19 -6 2 8 16 28 41 47 39 24 18 28 46 52 36 1 -35 -61 -67 -59 -45 -32 -18 -1 16 30 41 51
2696E1Nkrj2j3j2j0j0pnkPJ3Rlj6j6kJ5K5K3J0pk2l1l3k4j1%Kj%OJ1J1MmmKJ3J6RKjJKKJk
$$ 51 56 54 45 33 20 8 -2 -12 -19 -24 -26 -19 -6 3 0 -16 -32 -34 -19 6 29 39 32 10 -21 -54 -78 -89 -89 -87 -88 -88 -82 -71 -60 -56 -60 -64 -62 -49 -33 -24 -22 -23 -22 -20 -18 -17 -19
2677a9k%OJ0J1J1J3J6K1K7L0K3Rmj5k8m3m7l1j0PJ3J2OnqNK4K9J9J0Nmj9l2l3j9nJ1K1K4J2
$$ -19 -21 -21 -15 -5 6 17 30 46 67 94 124 147 156 152 137 109 66 19 -12 -22 -15 -2 10 16 11 3 8 32 61 80 90 95 91 72 40 7 -12 -17 -6 15 39 51
2660E1lrmMRQNJnj2j5j1JJ1J3Onj1oPJ7J0j2l3l4j9mLRJ8K4J8Okorj1j0lLRROKnqpmJJnj5
$$ 51 48 39 35 39 48 56 61 62 57 45 30 19 20 31 44 50 45 34 28 35 52 62 50 17 -17 -36 -40 -37 -28 -10 14 32 38 36 30 21 10 0 -3 0 9 18 24 26 21 13 6 2 3 4 -1 -16
2639a6j5nRK0K3K3J4lj3j2JJ2K1K4K0Nj1j3nKkj0j1njoj3j3kJ1J6J2MMJ1J6J8J1%j4k1j7q
$$ -16 -31 -36 -27 -7 16 39 53 50 37 25 26 38 59 83 103 108 97 84 79 81 79 69 58 53 52 46 33 20 18 29 45 57 61 65 76 92 110 121 121 107 86 69 61
2622F1%j%RK0K1J1pk2k4j2MJ6J3Ojnqj2j9k4k6k0j2j0j2j2qlKMJ0K0K9L3K8J4kj4j7j7j2p
$$ 61 61 60 60 69 89 110 121 114 92 68 56 60 76 89 95 94 89 81 69 50 26 0 -20 -32 -42 -54 -66 -74 -77 -75 -71 -61 -41 -12 21 49 63 61 47 30 13 1 -6
2604fprj4j3kRJ8K1J8J4Nkqj6k4k3pJ2J7PkjPJ3J6J8K1K3K8K9K5J0pk0k2j7pMQRRJ2K0K8K6
$$ -6 -13 -22 -36 -49 -51 -42 -24 -3 15 29 34 32 24 8 -16 -39 -46 -34 -17 -10 -12 -13 -6 7 23 41 62 85 113 142 167 177 170 150 128 111 104 108 116 125 134 146 166 194 220
2586B20J2j0k8l0k0nN%j2j5nJ5K5J8Kj0j4j6j7j8j7j8k0k2k0k0k4k4j9j5j3qlMJ0J4J5J5J4
$$ 220 232 222 194 164 144 139 144 144 132 117 112 127 152 170 172 162 148 132 115 97 80 62 42 20 0 -20 -44 -68 -87 -102 -115 -123 -126 -122 -112 -98 -83 -68 -54
2571e4J2J2J0QQPKnoMRPj%QRNJJJ%JKKJLJ2J9J7Ooj7k6l1l1l6m1m0k2NK4L0K6K5K6J9QKNJ5
$$ -54 -42 -30 -20 -12 -4 3 5 0 -6 -2 7 14 13 13 21 30 35 36 37 38 38 39 41 43 44 47 59 78 95 101 95 78 52 21 -10 -46 -87 -127 -149 -144 -120 -90 -64 -39 -13 6 14 16 21 36
2551C6J9J0kqpJOONjj1k2k5j6%RPjj1j3rJPJ1PKjnrj4j8j9j6rnmmnoppojJ2K8L7L6K5J2L%
$$ 36 55 65 63 55 48 49 55 61 66 65 54 32 7 -9 -9 0 7 6 -5 -18 -27 -26 -19 -8 -1 1 0 -5 -14 -28 -46 -65 -81 -90 -95 -99 -103 -108 -114 -121 -128 -134 -135 -123 -95 -58 -22 3 15 18 18
2530A8JMOOMjmnk%nj5k1j7mPJ1J3J3J5J1jj1j7j4lJ4K7K9K3J3Kj2k4k8k2qOJ2Ppj8j9j3pj
$$ 18 19 23 29 35 39 38 34 29 27 27 22 7 -14 -31 -35 -28 -17 -4 9 24 35 34 23 6 -8 -11 3 30 59 82 95 97 85 61 33 11 3 9 21 28 21 3 -16 -29 -36 -37
2512c7PJ7K1K0J3QNNQJ5J8J4QPJ2J8J6Rkpqrj6k6l0k1pJkj0j4j5j7j6j4oMQKjLRQlj1pLJ5
$$ -37 -30 -13 8 28 41 49 54 59 67 82 100 114 122 129 141 159 175 184 182 175 167 158 142 116 86 65 58 59 57 47 33 18 1 -15 -29 -35 -31 -23 -21 -22 -19 -10 -2 -5 -16 -23 -20 -5
2492eK1K8K8J8Jj5k4k2j4ojJJ%jmpj0j1j1j3j3j2oNJ3J3OLKJoj0LK4L5K8J2Kkmj2k2k6k1r
$$ -5 16 44 72 90 91 76 52 30 16 10 9 10 11 11 10 6 -1 -11 -22 -33 -46 -59 -71 -77 -72 -59 -46 -40 -37 -35 -34 -40 -50 -47 -23 12 40 52 54 52 48 36 14 -12 -33 -42
2474d2jnj2j1%RJ0KKRJ9K0RjmMJ2J2MJQJ8J8Mrj6j8k3k6k2rMRPRRRKprqom%NRRJ4J9J9J0k
$$ -42 -43 -48 -60 -71 -71 -62 -52 -50 -48 -39 -20 0 9 8 4 8 20 32 36 37 45 63 81 85 76 60 42 19 -7 -29 -38 -34 -25 -18 -9 0 9 11 4 -5 -13 -19 -23 -23 -18 -9 0 14 33 52 62 60
2453F0j2j9k4k3j7rj1k0k5j8oPJ2J0O%jmrj2oRJ8J4Jj1j8j7rNJ4J4ROOKkjKMJ%PJ4J9J6PJ
$$ 60 48 29 5 -18 -35 -44 -55 -75 -100 -118 -124 -117 -105 -95 -89 -89 -90 -94 -103 -115 -121 -112 -94 -80 -79 -90 -108 -125 -134 -129 -115 -101 -92 -86 -80 -78 -80 -81 -79 -75 -74 -74 -67 -53 -34 -18 -11 -10
2434a0jKOLkrkJ2K0J8QLL%j1k3k5j7qk%nj4k1j5JJ4J3M%LONRJ8K8L2K8J8QJnrj0mkmj1rKJ5
$$ -10 -11 -9 -3 0 -2 -11 -13 -1 19 37 45 48 51 51 40 17 -8 -25 -33 -35 -35 -40 -54 -75 -90 -89 -75 -62 -58 -58 -55 -49 -44 -35 -17 11 43 71 89 97 98 93 84 74 70 68 64 53 44 46 61
2413F1J8J3RQlj8l0l2l1l6m1l7k2jJ7K3J8RRJ6J7Qoj4j8j8j2QK7L3K0Kqj4j5j2JJ3J4QMRK1
$$ 61 79 92 101 109 106 88 58 26 -5 -41 -82 -119 -141 -142 -125 -102 -84 -75 -66 -50 -33 -25 -31 -45 -63 -81 -93 -85 -58 -25 -5 -3 -11 -25 -40 -52 -51 -38 -24 -16 -12 -3 18
2396A8L2L5K8J6Lpj8k6l0k4j7j3j4j1kRJ7K0K1J7J4J2J6J9J8J5J6J6J2O%lj0k0k8l0k4j5j0
$$ 18 50 85 113 129 132 125 107 81 51 27 10 -3 -17 -28 -30 -21 -4 16 37 54 68 80 96 115 133 148 164 180 192 198 198 195 185 165 137 107 83 68 58
2380E8j1j1oJKmj0qoqj7k0j1jLjnlLRQjrj1kJ0J7J7J1ORJ5J5Lj6k6k2rjJKOPLj%KMLLK%ko
$$ 58 47 36 30 31 33 29 19 11 5 -3 -20 -40 -51 -52 -49 -50 -55 -58 -55 -46 -38 -39 -48 -59 -61 -51 -34 -17 -6 0 9 24 39 42 26 0 -22 -31 -32 -31 -29 -23 -16 -13 -14 -14 -12 -8 -5 -2 0 0 -2 -8
2359hqplKK%oj1j9k0j1RK5L0K3J3Q%om%LLRK0K8K2Qnj2j7k1k2j4jOKqj4j0NK0K6K0Nj7l4l7
$$ -8 -16 -23 -26 -24 -22 -22 -28 -39 -58 -78 -89 -80 -55 -25 -2 11 19 19 13 9 9 12 15 24 44 72 94 102 97 85 68 47 25 11 10 16 18 10 -4 -14 -9 11 37 57 62 45 11 -26
2339b6k3mPRQQQNLNMJljLONLJmrj5k0j9qNJ0Kpj1j0rpJJ3J9K0J2NKLQJ3QJmm%joj4k2j7mQ
$$ -26 -49 -53 -46 -37 -29 -21 -13 -8 -5 0 4 5 2 1 4 10 15 18 19 15 6 -9 -29 -48 -56 -51 -41 -39 -46 -57 -67 -76 -83 -82 -69 -50 -30 -18 -13 -11 -8 0 13 21 22 18 14 14 13 7 -7 -29 -46 -50 -42
2317d2RKjMJ3J6J8J3LlkOQjj5k2j7qMJ7K6K5J8Qlj7k6k3j1nmnJOQNNN%j0k2k9k8k0j3omml
$$ -42 -33 -31 -32 -28 -15 1 19 32 35 32 30 36 44 43 28 6 -11 -19 -15 2 28 53 71 79 76 59 33 10 -1 -6 -10 -15 -14 -8 0 5 10 15 15 5 -17 -46 -74 -94 -107 -113 -117 -121 -124
2298a24kkpj3j5qQJ9K4K0J1lj6j9pPJ6K1K8L4L2K4J2Mjoj0j0lQK2K9K4J3OMMLjkmrj5j8j6
$$ -124 -126 -128 -135 -148 -163 -171 -163 -144 -120 -100 -89 -92 -108 -127 -134 -127 -111 -90 -62 -28 4 28 40 44 43 37 27 17 14 22 44 73 97 110 116 120 124 127 126 124 120 111 96 78 62
2280F2pQK3K9K1J1Jqj9k6k1lJ3J4%j7k8k9k2j6j7j7j1%J2J7J7J3Krj7j5jJ3K1K2J9J5J0Lr
$$ 62 55 63 86 115 136 147 148 140 121 95 74 71 84 98 98 81 53 24 2 -14 -31 -48 -59 -59 -47 -30 -13 0 2 -7 -24 -39 -40 -27 -6 16 35 50 60 63 54
2263E4k1k3j7j2j1j4j0%J3K3K7K6J7jk0l1l3k1pLQJ2J3J3Plj3j6j2jRJ4J3J2RMnj2j5oRK0
$$ 54 33 10 -7 -19 -30 -44 -54 -54 -41 -18 9 35 52 51 31 0 -33 -54 -61 -58 -50 -38 -25 -12 -5 -8 -21 -37 -49 -50 -41 -27 -14 -2 7 11 6 -6 -21 -27 -18 2
2246BK5J6kj8k6k1qPJ8J9J7J3J0PKpj2qJJj2k6k5qQJ6J9K7L4L1J6%oomqj6k3k5k1j7j7j5n
$$ 2 27 43 41 23 -3 -24 -32 -25 -7 12 29 42 52 59 61 54 42 34 35 36 24 -2 -27 -35 -27 -11 8 35 69 100 116 116 110 104 100 92 76 53 28 7 -10 -27 -42 -47
2229d7RJ4RLKOQOmj3j4mJ0J3KnoNJ7K6K6J8Plprj1roookRJ8J9J3Mpj4rJ1L1L5K2Lrj6j9k0
$$ -47 -38 -24 -15 -12 -10 -4 4 10 6 -7 -21 -25 -15 -2 0 -5 -11 -6 11 37 63 81 88 85 78 69 58 49 43 37 31 29 38 56 75 88 92 85 71 62 73 104 139 161 164 155 139 120 100
2209A00k2k2j9r%NKkoj1j4rjNPQPMjkmrj5j9j1mj%MNjroLJ0RONMKNQJ0lj9k8k1r%KLNQPLk
$$ 100 78 56 37 28 28 33 35 33 27 16 2 -7 -8 -3 4 12 19 23 22 20 16 7 -8 -27 -38 -42 -43 -43 -39 -34 -35 -44 -50 -47 -37 -28 -22 -17 -13 -11 -6 2 12 9 -10 -38 -59 -68 -68 -66 -63 -58 -50 -43 -40 -42
2186d2nmnjMPOkqj2j0lOJ3J5J1J1J4J6J2NknnKJ1J9J6Ok%NRPOJ1J5J7J0Jrj6j8j1m%lj1j6
$$ -42 -47 -51 -56 -57 -53 -46 -40 -42 -50 -62 -72 -75 -69 -56 -41 -30 -19 -5 11 23 28 26 21 16 18 29 48 64 70 68 68 73 82 89 95 106 121 138 148 149 140 124 106 95 91 91 88 77 61
2167F1j3pKJ1J9K1J8Rlj3j8k1j8j4qooqpj2j3j0jJ1J5Nj2k0j1J2L4M2L8K6J3MJLQJ1Qjj4k2
$$ 61 48 41 43 54 73 94 112 121 118 105 87 66 48 34 26 20 14 6 -1 -13 -26 -36 -37 -26 -11 -6 -18 -38 -49 -37 -3 39 77 103 116 120 121 124 132 143 151 150 136 114
2149A14k1j4njlrj5j6rjJkrj7k3k3j5kMJl%RJ4Qmj2j2oJLLJmj1j1lJ4K8L5L3K9K0J2NLkrj8
$$ 114 93 79 74 73 70 61 46 30 21 20 21 19 10 -7 -30 -53 -68 -70 -66 -65 -68 -68 -59 -45 -37 -41 -53 -65 -71 -70 -67 -64 -63 -67 -78 -89 -92 -78 -50 -15 18 47 67 79 84 87 85 76 58
2129E8j6nPJ4J0KlJQRJrj2j0j0j3j4rkK%jjkmrj7k2k1k0k2k5j9jJ8K5K1J3Nlj3j4oRJ9K3J7
$$ 58 42 37 44 58 68 70 67 68 76 85 86 77 65 55 45 32 18 9 7 9 9 8 7 5 1 -8 -25 -47 -68 -88 -110 -135 -154 -155 -137 -112 -91 -78 -73 -76 -89 -103 -109 -100 -81 -58 -41
2111d1RPJ1J5J2MkjLPO%rj4qNK0K2Rj1l2l6k4mRJ0PPNjj0j5j7j6rPK7L8M0L9L3J7qk7l1k1
$$ -41 -32 -25 -14 1 13 17 15 14 17 24 30 30 21 7 -1 4 24 46 55 44 12 -24 -48 -52 -43 -33 -26 -19 -14 -15 -25 -40 -57 -73 -82 -75 -48 -10 30 69 102 119 111 84 53 32
2092C2q%J0J6J9J5J2J0Oqk8m3m4l6k4j5pjOJ0J1QKlJJ6L3M1M0L3K7K5K3J6Lj2k1k0j7j7k2
$$ 32 24 24 34 50 69 84 96 106 112 104 76 33 -11 -47 -71 -86 -93 -94 -88 -78 -67 -59 -57 -60 -59 -43 -10 31 71 104 131 156 179 195 198 186 165 145 128 111 89
2076H9k4j9rjK%kKJ0J4Ppj3oNPjrj2oMJ0J1J2J6K7L2K9J4nk1l1k9j6njLJ0J5J3Kpj0j1j2j4
$$ 89 65 46 37 36 38 38 36 38 48 62 69 62 49 43 48 55 54 45 33 27 31 41 52 64 80 107 139 168 182 177 156 125 96 80 75 74 77 87 102 115 117 110 100 89 77 63
$$ [...]
-2084i2
##END=	
##END=	
