##TITLE=	Jul23-2022.30.fid
TM-VI-152, Ph-pyr, CD3OD
##JCAMP-DX=	6.0	$$ MestReNova 14.3.1-31739
##DATA TYPE=	LINK
##BLOCK_ID=	1
##BLOCKS=	2    
##ORIGIN=	Mestrelab Research S.L.
##OWNER=	hrzepa
##$MNOVA/LINK_BLOCK_TYPE=	ITEM	$$ NMR Spectrum
##$MNOVA/ITEM/POLYGON=	(XY..XY)
5321,5835
8722,5835
8722,8208
5321,8208
5321,5835
##$MNOVA/ITEM/Z=	0
##$MNOVA/ITEM/ANGLE=	0
##TITLE=	Jul23-2022.30.fid
##JCAMP-DX=	6.0	$$ MestReNova 14.3.1-31739
##BLOCK_ID=	2
##DATA TYPE=	MNOVA NMR VIEW DATA
##DATA CLASS=	MNOVA VIEW DATA
##$MNOVA/ITEM/ZOOM/X=	-4.005464375234057961,	16.005769727017405302
##$MNOVA/ITEM/ZOOM/Y=	-1543.8994016647338867,	16948.0501708984375
##END=	
##TITLE=	Jul23-2022.30.fid
##JCAMP-DX=	6.0	$$ MestReNova 14.3.1-31739
##BLOCK_ID=	3
##DATA TYPE=	NMR SPECTRUM
##DATA CLASS=	XYDATA
##NUMDIM=	1
##ORIGIN=	Bruker BioSpin GmbH
##OWNER=	nmr
##.OBSERVE FREQUENCY=	400.4124024600000098
##.OBSERVE NUCLEUS=	^1H
##.SOLVENT NAME=	MeOD
##.PULSE SEQUENCE=	zg30
##LONGDATE=	2022/07/23 16:40:00.000
##.ACQUISITIONMODE=	SIMULTANEOUS (DQD)
##$ORIGINAL FORMAT=	Bruker XWIN-NMR
##$MNOVA/SCALES_VERSION=	9
##$PARAMETER FILE=	(acqus, ASCII, //ch-nmrserv3.ch.ic.ac.uk/Av400A/agmb/nmr/Jul23-2022/30/acqus, 0)
$$ ##TITLE= Parameter file, TOPSPIN		Version 3.2
$$ ##JCAMPDX= 5.0
$$ ##DATATYPE= Parameter Values
$$ ##NPOINTS= 11	$$ modification sequence number
$$ ##ORIGIN= Bruker BioSpin GmbH
$$ ##OWNER= nmr
$$ $$ 2022-07-23 16:40:17.990 +0100  nmr@CZC10666PP
$$ $$ /opt/topspin/data/agmb/nmr/Jul23-2022/30/acqus
$$ $$ process /opt/topspin3.2/prog/mod/shimcntl
$$ ##$ACQT0= -2.36344537815126
$$ ##$AMP= (0..31)
$$ 100 100 100 100 100 100 100 100 100 100 100 100 100 100 100 100 100 100
$$ 100 100 100 100 100 100 100 100 100 100 100 100 100 100
$$ ##$AMPCOIL= (0..19)
$$ 0 0 0 0 0 0 0 0 0 0 0 0 0 0 0 0 0 0 0 0
$$ ##$ANAVPT= -1
$$ ##$AQSEQ= 0
$$ ##$AQ_mod= 3
$$ ##$AUNM= <au_zg>
$$ ##$AUTOPOS= <12 >
$$ ##$BF1= 400.41
$$ ##$BF2= 400.41
$$ ##$BF3= 400.41
$$ ##$BF4= 400.41
$$ ##$BF5= 400.41
$$ ##$BF6= 400.41
$$ ##$BF7= 400.41
$$ ##$BF8= 400.41
$$ ##$BYTORDA= 0
$$ ##$CAGPARS= (0..11)
$$ 0 0 0 0 0 0 0 0 0 0 0 0
$$ ##$CFDGTYP= 0
$$ ##$CFRGTYP= 9
$$ ##$CHEMSTR= <none>
$$ ##$CNST= (0..63)
$$ 1 1 145 1 1 1 1 1 1 1 1 1 1 1 1 1 1 1 1 1 1 1 1 1 1 1 1 1 1 1 1 1 1 1 1
$$ 1 1 1 1 1 1 1 1 1 1 1 1 1 1 1 1 1 1 1 1 1 1 1 1 1 1 1 1 1
$$ ##$CPDPRG= (0..8)
$$ <> <> <> <> <mlev> <mlev> <mlev> <mlev> <mlev>
$$ ##$D= (0..63)
$$ 0 1 0 0 0 0 0 0 0 0.06 0 0 0 0 0 0 0.0002 0 0 0 0 0 0 0 0 0 0 0 0 0 0 0
$$ 0 0 0 0 0 0 0 0 0 0 0 0 0 0 0 0 0 0 0 0 0 0 0 0 0 0 0 0 0 0 0 0
$$ ##$DATE= 1658590817
$$ ##$DE= 6.5
$$ ##$DECBNUC= <off>
$$ ##$DECIM= 2496
$$ ##$DECNUC= <off>
$$ ##$DECSTAT= 4
$$ ##$DIGMOD= 1
$$ ##$DIGTYP= 12
$$ ##$DQDMODE= 0
$$ ##$DR= 22
$$ ##$DS= 2
$$ ##$DSPFIRM= 0
$$ ##$DSPFVS= 20
$$ ##$DTYPA= 0
$$ ##$EXP= <proton>
$$ ##$F1LIST= <111111111111111>
$$ ##$F2LIST= <222222222222222>
$$ ##$F3LIST= <333333333333333>
$$ ##$FCUCHAN= (0..9)
$$ 0 2 0 0 0 0 0 0 0 0
$$ ##$FL1= 90
$$ ##$FL2= 90
$$ ##$FL3= 90
$$ ##$FL4= 90
$$ ##$FOV= 20
$$ [...]
$$ 90 74 58 42 26 10 0 0
$$ ##$Sgu3PowerLevels= (0..7)
$$ 0 0 0 0 0 0 0 0
$$ ##$Sgu4PowerLevels= (0..7)
$$ 0 0 0 0 0 0 0 0
$$ ##$Sgu5PowerLevels= (0..7)
$$ 0 0 0 0 0 0 0 0
$$ ##$Sgu6PowerLevels= (0..7)
$$ 0 0 0 0 0 0 0 0
$$ ##$Sgu7PowerLevels= (0..7)
$$ 0 0 0 0 0 0 0 0
$$ ##$Sgu8PowerLevels= (0..7)
$$ 0 0 0 0 0 0 0 0
$$ ##$SguType= 3
$$ ##$ShimPowMaxUA= (0..63)
$$ 130000 130000 130000 130000 130000 130000 130000 130000 130000 130000 130000
$$ 130000 130000 130000 130000 130000 130000 130000 130000 130000 0 0 0 0
$$ 0 0 0 0 0 0 0 0 0 0 0 0 0 0 0 0 0 0 0 0 0 0 0 0 0 0 0 0 0 0 0 0 0 0 0 0
$$ 0 0 0 0
$$ ##$ShimPowMaxUC= (0..63)
$$ 130000 130000 130000 130000 130000 130000 130000 130000 130000 130000 130000
$$ 130000 130000 130000 130000 130000 130000 130000 130000 130000 0 0 0 0
$$ 0 0 0 0 0 0 0 0 0 0 0 0 0 0 0 0 0 0 0 0 0 0 0 0 0 0 0 0 0 0 0 0 0 0 0 0
$$ 0 0 0 0
$$ ##$ShimPowMaxUG= (0..63)
$$ 524287 524287 524287 524287 524287 524287 524287 524287 524287 524287 524287
$$ 524287 524287 524287 524287 524287 524287 524287 524287 524287 0 0 0 0
$$ 0 0 0 0 0 0 0 0 0 0 0 0 0 0 0 0 0 0 0 0 0 0 0 0 0 0 0 0 0 0 0 0 0 0 0 0
$$ 0 0 0 0
$$ ##$ShimPowRcbType= 3
$$ ##$ShimPowRes= (0..63)
$$ 1e-20 1e-20 1e-20 1e-20 1e-20 1e-20 1e-20 1e-20 1e-20 1e-20 1e-20 1e-20
$$ 1e-20 1e-20 1e-20 1e-20 1e-20 1e-20 1e-20 1e-20 0 0 0 0 0 0 0 0 0 0 0 0
$$ 0 0 0 0 0 0 0 0 0 0 0 0 0 0 0 0 0 0 0 0 0 0 0 0 0 0 0 0 0 0 0 0
$$ ##$ShimPowRng0= (0..63)
$$ 1 1 1 1 1 1 1 1 1 1 1 1 1 1 1 1 1 1 1 1 0 0 0 0 0 0 0 0 0 0 0 0 0 0 0 0
$$ 0 0 0 0 0 0 0 0 0 0 0 0 0 0 0 0 0 0 0 0 0 0 0 0 0 0 0 0
$$ ##$ShimPowRng1= (0..63)
$$ 1 1 1 1 1 1 1 1 1 1 1 1 1 1 1 1 1 1 1 1 0 0 0 0 0 0 0 0 0 0 0 0 0 0 0 0
$$ 0 0 0 0 0 0 0 0 0 0 0 0 0 0 0 0 0 0 0 0 0 0 0 0 0 0 0 0
$$ ##$ShimPowRng2= (0..63)
$$ 1 1 1 1 1 1 1 1 1 1 1 1 1 1 1 1 1 1 1 1 0 0 0 0 0 0 0 0 0 0 0 0 0 0 0 0
$$ 0 0 0 0 0 0 0 0 0 0 0 0 0 0 0 0 0 0 0 0 0 0 0 0 0 0 0 0
$$ ##$ShimPowRng3= (0..63)
$$ 1 1 1 1 1 1 1 1 1 1 1 1 1 1 1 1 1 1 1 1 0 0 0 0 0 0 0 0 0 0 0 0 0 0 0 0
$$ 0 0 0 0 0 0 0 0 0 0 0 0 0 0 0 0 0 0 0 0 0 0 0 0 0 0 0 0
$$ ##$ShimSysFunc= (0..63)
$$ 1 2 3 4 5 7 9 11 15 16 8 10 12 14 6 17 13 18 19 20 0 0 0 0 0 0 0 0 0 0
$$ 0 0 0 0 0 0 0 0 0 0 0 0 0 0 0 0 0 0 0 0 0 0 0 0 0 0 0 0 0 0 0 0 0 0
$$ ##$ShimSysMatrix= 0
$$ ##$ShimSysType= 1
$$ ##$TFXNUM= 0
$$ ##$TRIPLO2= 0
$$ ##$VTU= 2
$$ ##$VTUETH= <149.236.99.20>
$$ ##$VTUTY= <no>
$$ ##$WBREFAM= (0..15)
$$ 135 116 100 100 100 100 100 100 100 100 100 100 100 100 100 100
$$ ##$WBREFLM= (0..15)
$$ 0 0 0 0 0 0 0 0 0 0 0 0 0 0 0 0
$$ ##$WBREFPH= (0..15)
$$ 71.66 -68.25 0 0 0 0 0 0 0 0 0 0 0 0 0 0
$$ ##$WBSGU= (0..15)
$$ 0 0 0 0 0 0 0 0 0 0 0 0 0 0 0 0
$$ ##$XFAC= 2
$$ ##END=
$$ 
##$DECIM=	2496
##$DSPFVS=	20
##XUNITS=	HZ
##YUNITS=	ARBITRARY UNITS
##FIRSTX=	6408.8702563950400872
##LASTX=	-1603.827990487469151
##DELTAX=	-0.12226593800080123864
##XFACTOR=	1
##YFACTOR=	0.006619890261437190275
##FIRSTY=	7.4286479949951171875
##MINY=	-3.1877980232238769531
##MAXY=	15407.263671875
##NPOINTS=	65536
##XYDATA=	(X++(Y..Y))
$$ [...]
2614 137 157 191 199 193 188 180 172 158 144 129 115 127 139 139 112 91 69 73 77 84 91 98 104 104 104 103 103 82 62 43 25 33 67 86 106 116 126 136 146 149 152 155 158 162 167 171 176
2608 176 171 167 188 208 215 195 164 132 123 115 106 97 111 125 139 153 154 154 155 156 177 198 218 239 222 204 187 170 159 148 137 127 116 106 95 85 108 130 153 176
2603 176 170 165 159 153 163 173 183 193 186 179 172 165 182 200 206 185 167 149 129 109 107 104 127 151 158 165 172 178 169 159 149 140 135 130 151 171 167 136 121 105 112 119 124 129 138 121 103
2597 103 113 142 171 175 180 185 191 196 201 219 237 227 191 167 170 201 231 249 266 239 211 176 140 149 158 173 187 200 213 220 201 171 140 126 112 98 84 105 125 145
2592 145 166 191 215 213 212 196 180 164 149 159 169 194 193 186 180 172 163 177 190 202 214 213 191 181 171 179 186 193 200 194 187 182 177 180 205 244 284 306 328 324 320 290 261 245
2587 245 252 249 247 246 245 238 232 226 219 202 184 167 149 139 129 119 108 118 128 138 148 160 173 185 197 196 194 193 191 163 134 132 129 140 151 135 118 100 81 90 98 105 112 119 126
2581 126 141 155 170 185 182 178 150 121 113 127 135 130 112 80 43 28 42 56 70 85 86 75 58 63 92 121 138 132 133 135 135 135 146 157 167 178 187 197 206 215 218 220 196
2576 196 172 163 155 146 137 131 126 121 115 102 88 74 60 88 116 126 122 125 154 183 184 160 137 111 86 77 68 75 95 101 62 7 -48 -71 -67 -59 -37 7 65 122 166 186 179 154
2571 154 142 141 153 174 168 152 136 118 100 99 98 96 95 109 124 138 152 148 143 139 135 115 95 75 55 59 63 67 72 76 80 84 89 85 81 77 73 80 87 94 101 107 112 118 123 129 134 140 146 146 146 146 147 139
2564 139 131 123 115 118 121 107 79 60 67 85 103 117 130 144 158 173 188 204 219 200 180 160 141 158 175 165 156 155 154 179 204 233 250 245 214 182 163 155 159 164 169 175
2559 175 180 159 139 105 94 99 105 111 118 140 161 183 205 211 217 197 176 165 155 179 217 241 242 220 184 147 110 103 117 131 122 100 78 68 57 47 37 54 70 87
2554 87 104 116 128 140 152 139 127 115 102 108 114 121 127 126 126 125 125 137 149 161 173 178 184 189 195 174 154 134 114 96 77 59 41 40 40 66 92 119 146 128 111 91
2549 91 70 77 83 83 82 82 82 78 74 71 69 65 84 115 146 175 182 158 135 135 157 167 177 170 162 155 147 124 101 78 55 67 79 90 102 107 112 117 122 131 140 140 153 176 178 149 121 123
2543 123 152 166 179 192 205 191 150 111 100 99 97 100 102 104 107 111 114 118 122 110 99 87 75 73 72 70 68 90 113 136 158 180 202 239 249 224 198 170 143 157 172 186
2538 186 201 186 172 158 143 138 133 128 123 118 113 108 103 113 123 132 142 151 161 171 180 182 183 185 186 172 158 144 130 137 144 151 157 166 174 183 191 175 159 168 178 205 219 212 178 145 126
2532 126 124 123 120 117 114 112 108 116 133 124 116 121 118 114 121 128 135 142 133 124 116 107 107 107 107 107 96 85 74 63 75 87 98 110 97 85 72 59 70 81 92 103 115 126 136 146 147 135
2526 135 116 123 135 146 159 172 160 148 136 124 114 104 93 83 76 68 72 102 134 153 153 126 95 77 75 73 64 28 -7 -16 3 23 45 67 79 91 103 115 141
2522 141 167 165 136 107 93 87 95 107 106 96 71 49 40 42 57 69 81 95 108 99 89 80 70 65 60 55 50 45 40 35 30 36 42 49 56 60 78 77 50 12 -11 -8 7 19 16 15 27
2516 27 36 45 55 64 63 62 60 59 71 84 96 108 141 161 160 133 118 129 158 173 180 187 193 199 203 207 211 215 194 174 153 133 119 105 91 78 75 72 69 67 56 46 36 26 35 45
2510 45 56 68 83 124 151 177 172 167 162 157 145 133 122 110 98 87 75 63 67 70 74 77 96 115 134 153 150 146 143 139 146 154 161 169 141 113 86 58 54 51 48 44 35 26 17 8 2 -4
2504 -4 -10 -16 -35 -53 -27 -1 15 32 48 65 71 77 83 89 75 61 47 33 36 40 43 47 75 102 130 158 149 140 131 122 119 117 115 112 123 133 142 151 155 132 125 117 129 142 155 167 173 179
2499 179 185 191 169 147 127 107 93 106 147 188 203 190 193 195 184 172 160 148 131 113 96 79 78 77 103 129 150 170 177 162 131 113 113 113 97 81 92 103 123
2494 123 144 176 209 232 232 209 173 136 114 119 138 156 173 191 209 210 211 212 212 208 203 199 195 190 186 180 175 153 118 78 60 70 81 93 106 84 63 35 21 32 66 88
2489 88 110 118 127 122 117 114 111 135 159 193 227 235 242 233 224 215 205 188 171 153 136 118 101 83 66 63 60 58 55 59 63 67 71 88 104 120 136 133 129 125 121 115 108 101 95 88 82 75 68 75 82 89
2482 89 96 88 79 71 62 66 69 73 76 73 70 68 65 88 124 165 183 178 172 165 158 161 164 165 167 145 101 65 61 93 137 162 165 158 150 141 132 106 79 97 115 135 156 150 144 128 112 124 135 155
2476 155 176 170 163 160 156 153 149 134 119 130 141 155 169 156 144 128 113 111 109 132 155 165 175 177 178 179 180 178 176 148 121 112 125 147 155 152 149 145 141 133 125 144 163 154 146 124 102
2470 102 73 44 29 35 57 66 47 16 10 17 16 15 14 13 13 12 32 66 91 94 73 52 56 61 70 78 87 95 102 108 115 122 128 135 141 148 124 101 78 54 47 39 31 23 46 68 91 114 112 110
2464 110 108 106 125 143 162 181 198 214 230 245 251 231 199 167 164 161 158 155 116 76 38 0 -20 -15 20 55 96 137 149 134 93 53 37 21 9 -1 13 28 46
2460 46 63 81 98 92 86 80 74 82 90 125 159 180 201 222 243 245 248 251 253 242 230 219 208 196 185 174 162 155 148 126 131 142 153 141 129 134 165 196 201 172 144 125 133
2454 133 167 201 225 222 184 145 131 118 108 99 64 30 2 1 12 22 43 64 85 106 109 112 115 117 117 117 117 117 128 139 150 161 152 143 135 126 117 109 100 92 82 73 63 54 53 52
2449 52 50 49 55 61 85 122 162 176 152 115 79 57 46 48 60 85 128 172 204 210 189 167 162 183 205 200 186 172 183 194 203 212 210 181 153 125 96 66 64 62 60 57 63
2443 63 68 74 79 87 95 127 160 174 161 120 80 35 18 29 41 43 45 47 49 62 75 88 101 81 62 68 75 73 72 70 69 95 121 147 172 176 179 181 184 165 133 120 133 147 148
2438 148 159 169 166 163 160 157 143 129 115 101 104 106 109 111 93 76 58 41 39 37 35 34 21 8 -4 -17 -2 12 27 42 57 72 87 102 109 116 122 129 125 121 116 112 113 114 115 116 106
2432 106 96 86 76 88 100 112 124 141 158 175 192 188 184 153 122 115 107 100 92 113 133 179 224 260 270 258 232 198 163 128 92 77 62 73 84 96 109 121
2428 121 133 125 117 110 102 113 124 124 98 76 67 49 31 8 -14 -25 -9 16 43 71 98 134 169 178 186 186 185 184 183 177 170 163 157 150 144 136 129 131 120 102 110 140 171 176 181 177 174 153
2422 153 119 94 96 127 158 164 170 176 181 157 132 119 133 145 157 171 184 175 166 156 147 138 129 120 111 120 130 139 148 164 180 169 158 139 121 102 83 80 77 100 124 134 144
2416 144 154 164 166 168 197 226 215 205 194 183 182 180 179 177 182 187 192 198 192 187 182 177 176 176 176 175 178 181 157 133 117 101 86 70 73 75 78 80 98 116 120 102 93 97 118 140 139 138 137 137
2410 137 134 132 130 127 125 123 120 118 125 132 139 145 152 159 166 173 157 141 126 110 100 89 78 68 82 96 84 71 48 24 3 -18 -26 -4 45 94 108 122 135 149 167 185 176 167
2405 167 146 125 104 83 66 48 58 67 84 101 118 135 143 151 134 117 123 151 173 183 175 168 173 178 160 143 152 161 166 171 175 180 172 164 156 171 194 205 197 190 197 205 213 220 224 229 233 237
2399 237 215 194 198 203 205 207 209 211 199 187 175 163 151 138 126 113 104 95 111 127 142 136 115 94 83 72 96 133 164 172 167 162 145 128 124 121 129 138 133 128 138 148 158 168
2394 168 161 153 145 137 136 135 134 133 131 129 128 126 131 136 141 146 123 100 71 56 71 109 135 161 176 191 207 222 213 204 195 186 187 188 189 189 159 116 94 95 105 116 128 140 117 95 72
2388 72 50 41 33 51 69 103 138 159 180 201 223 231 239 230 220 210 201 187 173 159 145 146 148 162 177 188 198 183 167 150 133 142 150 153 133 100 67 53 62 94 140
2383 140 181 209 219 228 242 255 232 196 172 171 168 143 109 75 53 31 22 12 47 82 101 120 112 105 97 89 82 74 81 89 85 80 71 84 128 172 194 194 180 166 175 184 193 202 185
2377 185 168 151 134 139 144 149 154 143 132 121 111 132 153 173 193 189 171 161 174 194 215 210 205 197 190 183 175 177 179 199 233 254 254 240 227 220 212 192 172 150 129 108 86
2372 86 66 46 26 6 14 23 32 40 43 45 47 49 51 54 56 58 78 99 119 139 160 180 200 221 213 205 197 189 174 160 145 131 129 128 127 125 140 154 168 183 181 179 176 174 166 157 148 140 148 156
2366 156 164 172 178 184 216 247 278 295 287 258 227 196 165 135 103 93 115 137 132 128 124 119 139 159 134 110 84 58 59 60 80 101 122 142 144 147 149 151 155 159 163 167 160 153 120
2361 120 87 61 49 60 94 127 146 156 152 156 173 181 190 198 206 214 222 200 179 158 137 149 161 171 182 183 161 152 144 123 102 76 62 80 119 159 176 168 147 134 120
2356 120 130 167 189 211 210 210 209 208 200 192 183 175 174 172 171 169 186 202 218 235 236 237 237 238 241 244 246 249 245 241 237 233 237 241 246 250 243 237 230 223 227 231 235 239 218 198 177 156 138 120 87 80 87 94
2349 94 103 112 134 156 178 200 184 168 153 137 133 129 125 121 134 147 149 125 85 59 70 108 141 174 182 190 173 157 167 178 183 189 185 195 199 175 161 159 155 151 148 145 160 175
2344 175 190 204 199 194 189 184 181 177 174 170 178 186 193 201 203 204 205 206 216 213 202 218 253 289 326 363 362 361 360 360 349 339 329 318 310 302 268 234 189 157 147 163 205 246 263 280
2338 280 297 314 330 347 363 379 366 327 280 247 224 214 198 182 168 155 136 145 174 217 251 271 270 244 225 219 231 243 239 234 229 224 200 176 152 129 138 148 157
2333 157 166 172 178 184 189 195 201 207 212 184 156 128 100 110 120 129 139 161 184 206 228 231 233 236 238 243 247 252 257 246 234 233 258 287 290 265 240 219 199 179 159 157 155 153 152 156 161 166
2327 166 171 164 157 149 142 142 141 141 140 134 129 123 118 137 155 174 193 201 210 218 227 239 251 264 276 281 287 249 212 177 170 174 178 181 183 210 238 234 203 187 171 168 165 162 159 156 152 149 146 158 169
2321 169 179 189 185 155 139 123 121 119 116 114 108 103 140 177 207 211 186 161 161 160 185 210 227 218 197 177 178 179 180 181 186 192 198 203 209 215 220 226 232 237 243 248 243 238 232 227 188 150 98 73
2315 73 78 110 128 147 152 157 162 168 173 178 184 189 180 171 162 152 166 180 208 210 198 185 170 156 153 149 146 143 145 147 149 151 160 169 178 186 164 141 119 96 80 64 48 32 64 95 127 158
2309 158 169 181 192 204 190 177 164 151 166 182 198 213 205 196 188 180 165 150 134 119 126 132 138 144 135 126 116 107 80 52 10 -4 27 59 93 127 154 181 197 186
2304 186 161 136 136 136 156 176 196 216 199 183 169 154 148 169 175 181 178 176 174 172 154 135 143 151 159 167 148 129 126 123 120 117 123 129 135 142 139 135 132 129 126 123 122 121 126 159 191 197 168 139
2298 139 120 128 145 161 179 198 189 180 171 161 150 139 127 116 114 112 110 109 123 137 141 119 74 55 80 106 136 141 132 97 57 44 59 73 87 100 113 127 114 101
2293 101 88 75 84 92 101 109 107 104 101 98 115 132 148 165 173 182 190 198 191 185 151 118 112 106 102 98 92 108 137 167 187 193 194 172 137 115 122 141 143 145 148 150 141 132 122 113 119 126 132 138 134 129
2287 129 124 119 115 110 105 101 93 85 77 70 73 76 80 83 104 126 145 165 184 180 162 144 157 170 182 195 199 204 208 212 203 194 184 175 166 156 147 138 144 151 158 164 155 147 138 129 128 128 128 128 142 157 145
2280 145 133 131 130 128 126 104 82 61 41 44 70 109 149 182 214 247 280 290 300 310 320 311 301 291 281 268 256 258 233 199 165 157 176 200 211 212 199 176 153
2276 153 155 158 173 189 204 220 237 255 261 241 209 178 172 194 226 232 228 223 249 274 273 272 258 245 231 217 211 204 171 139 116 93 70 47 56 64 99 134 169 205 213 222
2270 222 246 270 300 317 295 247 205 177 143 108 74 41 52 63 75 86 112 138 153 142 125 134 153 172 190 207 225 243 251 259 266 274 253 219 177 162 160 157
2266 157 138 106 78 76 103 130 146 163 153 143 150 156 163 169 152 135 145 154 170 186 208 217 188 134 86 52 37 36 55 102 155 182 182 181 173 165 157 150 133 116 127 165
2261 165 193 194 168 143 136 156 160 164 177 191 202 214 219 197 190 183 183 184 159 134 134 160 197 233 257 254 221 189 158 128 126 152 187 223 259 295 309 297 274 250 227
2256 227 203 192 207 234 261 264 266 245 225 204 184 165 146 154 161 181 202 195 189 200 212 238 238 219 201 224 246 263 253 231 209 187 165 143 121 111 101 117
2251 117 134 150 165 180 196 193 190 187 184 182 180 178 176 154 132 122 139 146 154 163 172 152 133 140 147 158 169 180 191 189 186 184 181 185 189 192 196 215 234 226 218 211 204 197 189 208 226 244 262
2245 262 287 311 309 307 291 275 259 243 244 245 244 243 252 234 205 176 174 172 170 168 143 118 119 120 122 124 126 128 132 135 139 142 151 159 167 175 199 222 219 215 214 214 213 212 215 218 220 223 255 286 291 297 285
2239 285 274 262 250 248 246 271 295 285 275 264 254 229 204 179 155 163 172 207 242 281 320 329 312 289 265 215 165 141 143 157 171 165 159 153 147 137 126 143 159 174
2234 174 190 205 220 234 249 237 224 232 240 248 256 259 262 238 214 183 152 120 89 75 60 57 81 117 153 191 229 238 248 258 267 261 255 249 243 234 224 215 205 165 125 112
2228 112 99 102 104 107 110 117 124 132 139 137 134 173 213 230 204 157 111 108 104 102 100 115 157 210 263 287 310 308 305 288 272 255 239 210 181 196 212 228 245 234 224 199 174
2223 174 149 124 107 89 72 55 59 63 50 24 -6 -10 23 70 110 124 127 130 150 170 190 210 217 223 230 236 243 249 256 262 243 223 204 184 193 203 212 221 228 234 241 247 268 288 307
2218 307 326 328 304 269 235 209 209 221 233 228 224 220 215 199 182 152 147 166 199 233 253 245 236 226 217 211 205 199 193 207 221 236 250 239 229 219 208 169 130 91 52 53
2213 53 54 55 57 75 93 112 130 144 158 196 234 266 253 205 156 146 163 165 166 146 125 104 84 90 97 104 110 122 133 145 156 180 204 201 199 185 171 184 196 210 224
2208 224 252 254 244 234 222 210 208 206 204 201 228 255 270 259 238 217 195 173 182 191 176 160 132 131 160 188 212 235 247 232 214 195 175 155 162 169 177 184 184 184 184 184 204
2202 204 223 243 263 261 259 257 254 259 263 268 272 283 295 321 321 293 265 236 207 210 214 217 220 214 208 202 195 166 137 120 129 153 178 204 229 245 260 263 240 209 178 172 166 149 132
2197 132 126 148 180 212 245 277 300 297 264 231 206 181 185 189 206 250 279 308 316 324 331 339 312 285 258 231 251 271 290 310 314 318 321 325 322 320 317 314 298 281 250 245 258
2192 258 272 245 217 188 187 196 206 217 228 239 250 237 225 224 250 285 321 331 341 340 339 337 336 334 332 304 275 254 233 238 243 247 250 227 204 185 166 149 132 134 163 204
2186 204 245 259 274 287 300 304 281 249 216 209 228 259 289 285 281 277 272 280 287 294 301 319 338 354 371 358 323 292 275 259 242 253 264 277 290 303 316 293 269 260
2182 260 273 286 298 313 327 322 317 303 303 314 304 274 257 261 278 275 249 221 206 209 211 212 213 213 214 233 252 244 236 228 221 240 258 276 295 313 331 344 357 369 381 368
2176 368 342 311 303 323 357 385 412 428 443 430 418 405 371 323 276 262 270 265 261 256 251 247 242 254 265 277 289 290 290 291 292 291 290 289 288 274 259 246 232 213 217 234 251
2171 251 254 256 277 310 347 361 352 329 320 310 299 289 312 336 360 384 403 422 414 406 391 375 360 344 360 377 393 409 398 387 376 365 348 330 313 295 286 277 268
2166 268 259 265 271 278 284 293 302 310 319 334 350 365 381 406 431 456 481 463 446 429 412 401 390 379 368 357 345 334 323 327 331 335 339 320 301 267 259 285 311 353 369 341
2161 341 314 312 338 359 353 337 322 340 357 375 393 411 430 405 381 372 389 417 444 441 411 396 382 360 339 319 299 299 326 338 350 353 355 358 360 366 372 378 384 407 430
2156 430 426 422 388 354 331 336 346 356 369 381 396 411 426 442 448 455 489 523 521 520 519 518 503 488 473 458 457 457 456 455 429 402 387 398 408 418 403 387 397 406 429 452
2151 452 443 433 424 415 434 453 459 442 418 407 423 453 468 470 461 439 412 385 359 356 377 411 438 464 474 461 435 408 403 399 394 389 366 343 346 350 351 353 354 355 346 336 344 366
2146 366 396 403 380 356 353 350 347 344 358 373 387 401 404 408 411 414 430 446 462 478 469 459 476 493 510 526 529 532 509 473 446 440 448 456 439 421 411 401 392 382 359 336 314
2140 314 291 278 266 253 241 261 281 315 349 381 413 419 425 404 383 363 342 364 386 409 431 433 435 438 440 429 418 407 396 372 348 325 302 321 354 369 358 337
2136 337 342 358 374 369 364 372 380 389 398 420 442 453 465 450 435 424 414 403 393 381 370 358 347 351 355 359 363 377 391 405 419 427 435 443 451 462 473 497 521 553 585 605
2131 605 599 579 559 549 565 588 597 589 580 554 528 502 476 469 463 444 425 411 411 432 480 537 582 606 603 596 588 566 544 531 518 532 546 529 513 496 479 457 435 414
2126 414 392 400 407 415 423 432 440 449 457 477 497 528 559 568 550 521 491 471 451 457 463 483 504 513 496 475 468 478 488 499 510 494 479 469 458 475 492 499 506 500 495 488 481 474 467
2120 467 463 459 465 498 526 528 502 476 486 496 507 517 544 570 597 624 617 611 604 598 595 592 589 586 577 567 558 548 545 542 539 536 562 587 613 639 644 649 653 656 637 591 560 529 539 549
2115 549 559 569 590 611 632 653 637 621 604 588 583 578 573 567 569 571 573 575 579 582 586 590 584 578 598 619 663 708 723 712 701 691 679 668 652 637 664 690 692 649 616 610 631
2109 631 652 674 697 691 686 696 679 645 612 561 538 539 539 542 544 553 563 572 581 602 623 644 665 657 649 641 634 635 637 638 640 648 656 665 673 665 656 664 644 611 590 607 651 691 731 771 811
2104 811 819 800 796 792 770 748 726 704 690 677 663 649 655 660 623 586 571 584 615 634 627 621 614 607 612 618 623 629 629 630 631 632 620 622 631 613 579 545 539 560 587 614 643 672 679
2098 679 685 693 701 703 718 742 739 727 729 722 715 712 709 706 703 725 746 768 789 769 748 729 710 711 739 766 767 764 747 728 723 732 741 750 759 752 733 705 703 721 726 741 755 761 768 774 781 806
2092 806 830 853 876 891 879 874 882 872 862 868 848 829 823 808 792 786 779 773 766 748 731 713 695 687 679 671 663 684 705 726 747 761 775 789 803 818 832 844 857 850 816
2087 816 800 783 792 827 846 865 862 832 818 803 803 802 801 800 805 810 815 820 841 861 897 906 888 870 877 884 876 868 845 849 872 895 893 891 871 852 860 867 878 888 872 856 856 857 857 858 845
2082 845 831 820 808 796 810 836 861 869 877 885 893 887 880 898 916 936 931 913 895 893 890 887 885 892 900 907 915 937 960 956 952 964 977 989 1002 991 981 970 959 966 973 968 937 914 891
2076 891 902 957 1033 1082 1085 1060 1036 1012 1013 1015 1021 1027 1034 1040 1057 1075 1092 1110 1145 1180 1204 1201 1178 1156 1131 1107 1075 1044 1039 1034 1038 1043 1047 1051 1043 1035 1012 1016 1029 1042 1057 1071 1072 1072
2071 1072 1075 1077 1091 1132 1173 1188 1175 1162 1148 1133 1124 1115 1117 1146 1165 1184 1179 1173 1164 1155 1146 1137 1148 1158 1169 1180 1190 1201 1212 1222 1214 1206 1198 1190 1182 1173 1165 1157 1158 1159 1160 1161 1162 1163 1164 1165 1213 1261
2065 1261 1307 1353 1365 1351 1326 1301 1306 1337 1354 1370 1387 1403 1420 1436 1431 1426 1421 1416 1407 1398 1415 1433 1435 1437 1440 1442 1446 1450 1454 1458 1471 1484 1498 1511 1524 1537 1550 1563 1549 1535 1521 1506
2060 1506 1517 1527 1537 1547 1560 1572 1585 1597 1615 1633 1626 1619 1632 1667 1715 1764 1790 1794 1784 1773 1778 1782 1782 1769 1748 1750 1765 1780 1778 1775 1773 1771 1772 1772 1799 1826 1857 1888 1919 1950 1961
2055 1961 1972 1956 1941 1945 1949 1967 1984 1992 2001 2009 2017 2017 2016 2015 2014 2006 1999 1991 1983 2011 2039 2067 2094 2111 2128 2144 2161 2158 2155 2152 2149 2152 2156 2160 2163 2169 2176 2182 2188 2206 2223 2241 2258 2278 2298 2318 2338
2049 2338 2358 2378 2399 2419 2421 2424 2427 2429 2439 2448 2458 2467 2493 2519 2545 2571 2585 2600 2615 2630 2639 2649 2659 2668 2667 2665 2664 2662 2668 2674 2673 2686 2729 2795 2849 2902 2941 2980 3006 3032 3031 3031 3045
2044 3045 3081 3111 3142 3173 3204 3208 3190 3176 3176 3190 3204 3218 3233 3269 3305 3327 3350 3372 3395 3392 3389 3398 3433 3461 3475 3481 3486 3518 3550 3579 3608 3638 3667 3687 3707 3754 3800 3846
2039 3846 3892 3951 4010 4072 4133 4151 4168 4185 4202 4246 4290 4310 4329 4349 4369 4390 4412 4433 4455 4499 4543 4588 4632 4669 4707 4745 4782 4810 4837 4864 4891 4929 4966 5005
2035 5005 5043 5100 5170 5234 5271 5284 5297 5319 5368 5423 5477 5506 5535 5568 5600 5646 5692 5749 5807 5877 5948 6029 6110 6191 6272 6344 6416 6515 6614 6690 6767 6829 6891 6929
2031 6929 6954 6985 7042 7101 7160 7221 7282 7314 7345 7387 7456 7520 7558 7597 7664 7748 7833 7893 7953 8014 8075 8137 8198 8252 8306 8373 8466 8586 8720 8847 8975 9075
2027 9075 9175 9276 9376 9471 9567 9672 9804 9955 10079 10176 10272 10393 10513 10634 10755 10879 11002 11113 11223 11343 11463 11610 11757 11898
2024 11898 12038 12189 12366 12555 12716 12868 13020 13213 13405 13588 13744 13906 14094 14280 14465 14621 14778 14936 15094 15269 15470 15700 15931
2021 15931 16170 16409 16648 16887 17139 17392 17645 17898 18176 18454 18732 19010 19284 19558 19859 20160 20482 20804 21126 21449 21762 22075 22418
2018 22418 22787 23172 23557 23970 24384 24824 25265 25720 26174 26626 27077 27544 28010 28507 29030 29567 30132 30717 31303 31917 32530 33162 33793
2015 33793 34441 35088 35780 36515 37275 38062 38864 39693 40540 41415 42310 43250 44221 45237 46271 47305 48365 49468 50631 51838
2013 51838 53082 54371 55708 57107 58557 60070 61638 63251 64919 66666 68513 70440 72431 74485 76619 78842 81160
2011 81160 83568 86069 88659 91364 94194 97146 100223 103433 106803 110326 114009 117862 121876 126092 130503 135137 139965
2009 139965 144984 150233 155720 161473 167508 173808 180404 187266 194424 201883 209671 217761 226176 234928 243987 253348 262961
2007 262961 272840 282974 293339 303900 314620 325451 336371 347288 358151 368881 379380 389580 399406 408739
2005 408739 417522 425658 433031 439567 445197 449872 453535 456094 457534 457839 457026 455127 452110 448031 442941 436905 429998
2003 429998 422316 413941 404971 395485 385580 375336 364884 354307 343645 332957 322320 311772 301379 291217 281288
2001 281288 271590 262128 252933 244064 235497 227239 219283 211619 204258 197197 190439 183937 177703 171707 165978 160504 155262
1999 155262 150250 145433 140803 136368 132109 128010 124100 120349 116758 113327 110030 106856 103814 100896 98092 95412 92818
1997 92818 90313 87908 85592 83366 81229 79151 77163 75252 73394 71618 69895 68229 66606 65028 63512 62039 60611
1995 60611 59220 57874 56583 55355 54162 52996 51872 50793 49763 48778 47834 46890 45952 45013 44115 43261 42444 41627 40836 40046
1992 40046 39286 38553 37849 37171 36527 35910 35303 34696 34090 33485 32888 32292 31726 31185 30686 30186 29688 29190 28707 28225 27770 27315 26875
1990 26875 26461 26076 25692 25315 24937 24572 24233 23905 23578 23252 22926 22593 22261 21955 21649 21334 21020 20690 20388 20129 19869 19587 19305
1987 19305 19056 18833 18596 18359 18113 17867 17622 17376 17139 16902 16710 16517 16329 16140 15952 15763 15566 15370 15173 14976 14802 14628 14454
1984 14454 14279 14125 13971 13790 13609 13435 13260 13113 12965 12836 12707 12580 12453 12353 12280 12180 12053 11909 11764 11648 11558 11479 11400 11296
1981 11296 11192 11081 10970 10861 10752 10637 10549 10488 10428 10338 10222 10095 9969 9861 9780 9693 9593 9480 9395 9338 9281 9213 9146 9077 9009 8914 8806
1978 8806 8717 8654 8588 8509 8432 8368 8296 8223 8151 8079 7978 7878 7789 7726 7667 7608 7550 7493 7417 7341 7265 7190 7137 7084 7030 6976 6916 6831 6744 6684 6631 6566 6485
1974 6485 6403 6327 6278 6241 6231 6245 6232 6189 6119 6062 6005 5947 5889 5851 5813 5775 5737 5717 5698 5678 5659 5615 5571 5501 5431 5381 5331 5280 5230 5184 5138 5118 5099 5076
1970 5076 5052 5029 5006 4973 4941 4909 4877 4844 4811 4754 4696 4649 4629 4609 4562 4488 4415 4366 4317 4294 4272 4274 4276 4258 4214 4178 4155 4137 4132 4145 4159 4172 4159 4108 4043 3987
1965 3987 3957 3948 3953 3943 3933 3924 3915 3891 3867 3843 3819 3795 3772 3746 3721 3706 3665 3639 3613 3583 3554 3540 3499 3446 3393 3339 3284 3285 3286 3287 3288 3284 3279 3274 3269 3235 3201 3169 3137 3107
1960 3107 3103 3084 3065 3029 2994 2943 2919 2905 2890 2878 2865 2852 2839 2827 2814 2778 2743 2707 2672 2660 2649 2665 2680 2701 2722 2713 2678 2655 2633 2609 2585 2586 2587 2588 2589 2597 2605 2586
1956 2586 2567 2535 2503 2513 2523 2549 2547 2517 2486 2461 2436 2437 2439 2423 2406 2390 2374 2348 2322 2296 2269 2229 2189 2179 2195 2201 2207 2188 2169 2148 2127 2106 2085 2066 2047 2028 2009
1951 2009 1996 1984 1971 1959 1956 1953 1950 1948 1956 1964 1972 1980 1961 1941 1921 1901 1875 1848 1824 1799 1821 1869 1909 1935 1938 1915 1906 1898 1871 1845 1821 1797 1790 1811 1817 1822 1806 1791 1776 1762 1765 1794
1946 1794 1823 1826 1809 1791 1773 1754 1742 1729 1717 1705 1706 1707 1707 1708 1689 1670 1651 1631 1618 1605 1592 1579 1565 1552 1539 1526 1522 1519 1513 1508 1502 1470 1427 1385 1362 1366 1397 1429 1440 1425
1941 1425 1417 1422 1432 1441 1451 1461 1460 1459 1458 1457 1467 1477 1487 1497 1496 1494 1493 1492 1479 1466 1454 1443 1445 1474 1503 1505 1485 1465 1455 1471 1488 1493 1470 1434 1420 1420 1419 1404 1396 1387 1376 1366 1365 1352
1936 1352 1331 1336 1346 1355 1367 1378 1362 1346 1330 1314 1305 1295 1286 1277 1273 1269 1266 1262 1258 1254 1251 1247 1253 1258 1263 1269 1256 1243 1230 1217 1245 1273 1271 1243 1200 1158 1116 1074 1041 1034 1039 1044 1043 1041 1066 1091
1930 1091 1122 1152 1139 1125 1116 1107 1125 1143 1150 1157 1165 1172 1170 1168 1166 1164 1149 1135 1121 1106 1101 1096 1118 1140 1137 1133 1130 1127 1124 1122 1145 1169 1197 1224 1225 1225 1215 1204 1219 1233 1254 1247 1229 1211 1217
1925 1217 1222 1201 1179 1159 1138 1118 1097 1076 1054 1059 1064 1079 1094 1124 1127 1097 1067 1036 1005 1001 997 1019 1040 1056 1045 1005 965 932 899 911 923 943 964 958 952 941 930 945
1920 945 959 976 966 944 922 926 931 935 939 942 945 947 950 935 920 890 887 895 902 885 868 877 886 895 904 920 936 938 919 895 885 893 901 892 884 878 871 870 891 907 910 896 882 893 905 894 883
1914 883 872 861 852 842 833 824 825 825 826 827 807 788 769 749 761 773 784 796 823 850 876 902 894 865 835 828 822 816 812 808 802 797 791 785 781 764 741 741 755 770 785 801 831 862
1909 862 866 869 879 888 896 905 929 940 927 893 850 830 823 815 811 808 804 800 788 775 763 750 730 709 715 721 735 749 763 778 765 752 739 726 720 714 708 702 703 703 704 705 711 718 725 732 721
1903 721 709 699 689 685 704 743 769 778 772 767 774 773 772 772 772 761 750 741 731 742 780 809 825 836 834 819 790 742 694 656 646 645 645 647 648 670 692 714 736 717 699 680
1898 680 661 623 584 557 557 558 560 563 566 579 591 577 563 549 535 548 560 581 601 619 638 654 644 623 601 580 559 538 517 533 550 567 583 569 554 551 574 607
1893 607 640 664 661 661 673 701 730 724 691 674 656 655 654 652 651 643 635 627 619 610 600 591 582 597 612 627 642 635 627 619 611 603 595 587 579 586 592 598 605 618 631 642 654 640 600 568 549 540
1887 540 532 525 517 528 539 550 560 581 601 621 641 673 705 724 717 696 662 634 605 606 607 608 609 596 583 571 558 563 568 599 631 662 680 676 646 606 566 524 483 494
1882 494 505 516 527 563 600 636 672 706 740 747 755 760 764 743 721 712 704 695 687 680 674 667 661 654 647 641 634 643 652 661 670 668 666 664 662 691 721 751 780 817 841 843 819 783 761 755 750 728
1877 728 707 711 716 718 720 722 723 722 720 692 664 641 618 596 573 569 564 560 555 555 555 554 554 534 513 494 474 476 492 516 513 492 485 496 507 518 543 577 583 577 583 608 632 644 656 641
1871 641 627 629 631 633 635 631 627 623 619 624 629 635 640 618 595 604 634 655 653 638 624 619 614 609 604 599 593 588 583 558 533 535 536 539 541 543 545 537 530 522 515 520 526 540 541 538 557 599 654 695 713 725 724
1864 724 698 659 640 644 653 663 674 685 714 742 745 747 754 762 743 724 703 681 660 639 643 647 651 655 660 664 642 619 594 568 543 517 482 448 427 429 450 471 467 464 478 506
1859 506 511 495 465 435 405 374 355 358 374 391 384 376 368 360 377 395 412 430 432 434 437 440 442 467 491 494 475 455 449 465 501 538 562 565 556 561 592 637 669 679 676 672 669 665 635
1854 635 605 589 573 584 595 596 597 597 598 598 598 610 600 555 511 480 471 493 528 563 584 577 548 531 513 506 499 492 484 504 523 529 512 484 468 471 473 469 465 475 507 553 598
1849 598 631 641 633 624 614 604 556 507 485 494 508 509 501 479 461 456 468 481 480 466 445 447 456 451 448 459 483 520 536 531 527 524 520 515 502 489 477 464 471 478 485 492 479 467 455
1843 455 443 456 483 514 524 509 494 477 461 450 439 429 420 419 440 474 509 536 550 557 542 509 475 455 456 453 449 447 445 438 431 424 417 404 392 380 367 384 400 417 433
1838 433 456 480 503 526 516 506 496 486 476 466 457 447 437 427 417 407 416 425 433 442 451 459 468 477 481 486 490 494 488 481 474 468 461 455 448 441 459 477 495 513 502 490 481 471 477 504
1832 504 526 535 538 528 516 517 506 482 467 451 457 464 470 477 468 458 449 440 440 439 439 438 449 459 470 480 491 502 512 523 539 556 554 540 519 521 553 585 585 562 546 542 561 593
1827 593 625 643 636 607 583 571 566 560 556 551 558 565 571 578 569 561 552 542 531 506 477 470 484 512 545 556 542 515 486 471 482 494 507 519 534 550 563 577 600 596 562 501
1822 501 459 444 457 470 472 475 477 480 505 531 556 582 592 602 612 623 633 643 653 664 670 677 684 690 726 762 797 833 877 921 967 1012 1080 1174 1297 1421 1525
1817 1525 1630 1746 1889 2040 2190 2314 2437 2534 2605 2636 2622 2573 2524 2436 2303 2133 1964 1821 1677 1536 1423 1341 1286 1240 1194 1177 1159
1814 1159 1137 1115 1093 1071 1050 1029 1007 986 1003 1020 1037 1053 1063 1073 1084 1094 1111 1129 1175 1222 1284 1373 1493 1613 1744 1903 2077 2278 2496 2741
1810 2741 3053 3428 3828 4229 4658 5086 5507 5883 6195 6445 6601 6623 6512 6302 6021 5696 5325 4927 4515 4104 3711 3363 3041
1808 3041 2745 2484 2285 2126 1994 1879 1764 1681 1625 1580 1536 1477 1419 1372 1352 1344 1336 1331 1326 1333 1366 1384 1402 1429 1456 1486 1516 1568 1664 1797 1930 2090
1804 2090 2249 2448 2692 2983 3318 3703 4133 4579 5026 5486 5918 6292 6586 6776 6850 6789 6594 6307 5941 5529 5117 4676 4235 3815
1801 3815 3438 3127 2861 2612 2364 2150 1962 1808 1680 1587 1520 1463 1406 1350 1295 1248 1202 1155 1108 1108 1108 1108 1108 1126 1144 1162 1181 1183 1186 1188 1191 1243 1294 1346
1797 1346 1397 1441 1485 1558 1658 1766 1875 1985 2095 2215 2334 2451 2569 2670 2745 2777 2764 2712 2614 2474 2308 2130 1952 1802 1679 1574
1793 1574 1468 1393 1317 1265 1239 1199 1159 1121 1084 1047 1010 982 953 925 896 885 874 848 848 866 883 902 921 891 860 830 800 794 789 794 825 867 881 868 855 840
1789 840 825 810 795 794 793 778 789 804 819 835 852 827 801 776 751 740 729 718 707 716 725 734 743 745 746 733 747 773 798 826 853 848 843 813 783 755 754 782 811 828
1784 828 846 838 829 849 869 889 909 910 910 910 911 922 934 945 957 964 971 976 981 1002 996 960 925 920 914 909 904 884 865 873 880 924 968 995 977 947 944 950 956 925 894 865 836 835 861
1779 861 873 884 899 915 930 945 954 963 971 980 988 996 1004 1012 1040 1067 1108 1122 1112 1076 1052 1054 1079 1105 1110 1102 1094 1112 1146 1180 1218 1256 1280 1304 1293 1282 1251 1219 1202 1211 1214 1204
1774 1204 1189 1189 1220 1265 1294 1310 1312 1300 1286 1286 1298 1311 1312 1300 1281 1288 1316 1345 1374 1403 1411 1405 1414 1450 1507 1564 1598 1605 1611 1616 1620 1624 1627 1631 1665 1700 1733 1767 1760 1754 1764 1774 1797
1768 1797 1820 1841 1861 1869 1876 1884 1892 1901 1909 1893 1878 1865 1851 1855 1885 1932 1978 2011 2045 2056 2067 2083 2100 2138 2176 2185 2194 2203 2212 2235 2258 2281 2304 2307 2311 2309 2320 2359 2425 2477 2529
1763 2529 2563 2596 2617 2637 2651 2665 2701 2737 2788 2840 2867 2867 2859 2851 2863 2876 2889 2902 2901 2901 2915 2929 2965 3002 3003 3004 3012 3047 3092 3136 3183 3229 3299 3369 3460 3550 3628 3680
1759 3680 3697 3714 3736 3758 3805 3879 3956 4033 4081 4128 4188 4247 4320 4392 4458 4525 4577 4630 4697 4764 4862 4959 5048 5138 5204 5271 5322 5372 5423 5473 5530 5587 5683 5778
1754 5778 5866 5927 5963 5999 6053 6106 6191 6276 6367 6458 6549 6640 6743 6846 6965 7110 7261 7412 7564 7717 7892 8068 8244 8420 8611 8803 9025
1751 9025 9248 9485 9721 9958 10194 10442 10689 10968 11246 11555 11864 12205 12547 12916 13312 13734 14201 14689 15178 15686 16222 16779 17363
1748 17363 17979 18621 19291 20004 20791 21674 22632 23651 24752 25951 27285 28770 30422 32279 34403 36820 39584 42729 46341
1746 46341 50494 55308 60931 67566 75452 84823 95908 108903 124011 141464 161456 183965 208694 234931 261718
1744 261718 288148 313494 337073 357793 373837 383114 384153 376862 362432 342763 319818 295256 270256 245594
1742 245594 221763 199334 178950 161141 146034 133467 123142 114718 107865 102308 97817 94268 91544 89512 88116
1741 88116 87341 87130 87435 88242 89565 91423 93831 96845 100588 105129 110577 117081 124810 133964 144735 157476 172652
1739 172652 190824 212637 238791 270043 307022 350377 400822 459100 525538 599454 678831 760605 841588 919391
1737 919391 992373 1057913 1110915 1144327 1152262 1133077 1089944 1028890 956448 878198 798201 718967 642008 568867
1735 568867 501624 442143 391237 348483 312918 283445 258978 238508 221237 206647 194319 183891 175097 167778
1733 167778 161798 156936 153061 150091 148025 146793 146454 147092 148793 151612 155642 161075 168079 176806 187511 200650 216738
1731 216738 236396 260314 289259 323896 364802 412677 468349 532278 604075 682036 763282 844512 922989 996925
1730 996925 1064200 1120460 1158835 1172634 1158851 1119556 1060423 988153 908762 826826 745191 665522 589280 518482
1728 518482 455161 400420 354116 315337 282968 255919 233115 213702 197078 182793 170444 159720 150399 142307
1726 142307 135263 129069 123603 118805 114628 111057 108107 105808 104130 103075 102678 102970 103991 105771 108422 112129 117062
1724 117062 123439 131469 141392 153394 167673 184493 204019 226156 250471 276119 302089 327401 351381 373319
1722 373319 391927 405153 410849 407789 396234 377700 354290 327985 300441 272772 245615 219505 195049 172884
1721 172884 153452 136808 122709 110829 100807 92294 84971 78625 73120 68308 64048 60268 56907 53918 51191 48696
1719 48696 46391 44282 42324 40526 38884 37366 35969 34660 33434 32332 31326 30373 29463 28606 27776 27000 26261 25575 24929
1716 24929 24282 23665 23102 22570 22039 21519 20999 20541 20084 19676 19268 18904 18541 18178 17815 17479 17143 16813 16483 16166 15850 15565 15280
1714 15280 15021 14763 14529 14295 14088 13881 13703 13525 13335 13118 12896 12673 12475 12278 12110 11943 11802 11661 11514 11366 11229 11119 11002
1711 11002 10872 10745 10631 10544 10483 10434 10386 10327 10268 10183 10097 10010 9923 9809 9695 9565 9436 9306 9177 9047 8917 8788 8658 8549 8439 8357
1708 8357 8274 8178 8082 7986 7890 7802 7715 7654 7593 7523 7454 7384 7315 7258 7200 7143 7085 7013 6940 6867 6794 6737 6681 6624 6567 6516 6464 6439 6414 6407 6400 6386 6386 6420 6479 6552
1703 6552 6624 6674 6725 6775 6825 6881 6924 6925 6900 6856 6786 6700 6587 6475 6363 6249 6135 6015 5894 5773 5652 5550 5447 5371 5295 5242 5189 5136 5083
1700 5083 5030 4976 4934 4919 4922 4925 4929 4934 4898 4861 4825 4789 4794 4799 4804 4809 4794 4779 4764 4749 4758 4766 4774 4783 4809 4836 4889 4942 5009 5075 5142 5208 5235 5261 5287 5313 5335 5344 5312 5253 5158
1695 5158 5036 4928 4820 4729 4638 4557 4461 4367 4299 4270 4254 4230 4206 4183 4160 4177 4193 4237 4280 4349 4418 4473 4556 4671 4813 4986 5159 5336 5512 5685
1691 5685 5859 6007 6111 6164 6172 6102 5971 5792 5613 5459 5305 5152 4998 4838 4677 4530 4410 4319 4254 4213 4185 4157 4129 4075 4021 3967 3914 3860
1688 3860 3807 3752 3697 3686 3676 3667 3657 3648 3639 3647 3655 3675 3723 3786 3863 3929 4008 4108 4253 4449 4690 4986 5327 5721 6160 6662 7208 7792 8376 8923
1684 8923 9425 9862 10202 10382 10376 10184 9841 9389 8856 8296 7736 7204 6672 6180 5733 5348 5024 4743 4507 4325 4170 4030 3891 3783
1681 3783 3701 3648 3596 3556 3516 3476 3436 3402 3367 3333 3298 3274 3249 3269 3289 3312 3335 3372 3435 3517 3627 3771 3942 4131 4347 4598 4912 5286 5723 6219
1677 6219 6760 7313 7867 8389 8884 9343 9722 9982 10055 9926 9628 9193 8661 8089 7518 6987 6457 5938 5464 5056 4728 4454 4224
1674 4224 4039 3881 3729 3577 3439 3327 3247 3168 3075 3008 2967 2925 2885 2844 2831 2817 2804 2791 2782 2774 2792 2810 2818 2825 2833 2841 2879 2918 2986 3081 3186 3290 3411
1670 3411 3558 3745 3976 4246 4516 4798 5080 5359 5637 5877 6072 6200 6248 6228 6145 6000 5811 5586 5334 5034 4734 4443 4178 3930
1668 3930 3708 3514 3346 3192 3037 2912 2788 2725 2663 2609 2555 2502 2448 2444 2441 2437 2433 2429 2425 2421 2418 2417 2416 2415 2413 2419 2425 2457 2489 2554 2619 2710 2801 2908 3016 3163
1663 3163 3355 3583 3855 4170 4546 4961 5403 5847 6264 6653 7015 7329 7564 7701 7705 7558 7278 6919 6516 6086 5655 5241 4827 4445
1660 4445 4090 3772 3499 3293 3131 2994 2856 2748 2640 2585 2531 2502 2474 2451 2427 2431 2434 2463 2492 2521 2550 2581 2613 2618 2623 2623 2622 2648 2675 2762 2849 2966
1656 2966 3082 3199 3361 3572 3829 4133 4481 4872 5290 5689 6088 6457 6826 7137 7367 7495 7507 7383 7126 6773 6376 5949 5495
1653 5495 5040 4613 4214 3859 3547 3296 3100 2949 2821 2692 2589 2486 2427 2368 2349 2329 2354 2379 2435 2492 2548 2604 2668 2732 2809 2860 2858 2829 2813
1650 2813 2798 2754 2709 2665 2620 2547 2474 2427 2381 2360 2340 2358 2421 2517 2639 2748 2858 2971 3083 3182 3253 3282 3267 3209 3123 3024 2898 2758 2618 2475
1646 2475 2332 2177 2049 1962 1919 1880 1841 1788 1736 1714 1718 1728 1739 1778 1817 1865 1913 1961 2009 2066 2123 2204 2286 2347 2382 2386 2390 2362 2308 2222 2110 1989 1869
1642 1869 1748 1626 1523 1421 1348 1302 1275 1247 1221 1196 1188 1181 1174 1166 1161 1156 1150 1145 1120 1094 1069 1044 1039 1033 1028 1023 1011 1000 988 976 993 1010 1027 1043 1060 1077 1094 1111
1638 1111 1123 1135 1147 1159 1195 1231 1268 1304 1327 1350 1372 1393 1413 1407 1353 1300 1256 1213 1169 1125 1092 1058 1025 992 996 1013 1011 982 925 867 838 835 823 811 812 840 871
1633 871 902 935 967 1015 1050 1062 1048 1026 990 953 929 930 932 936 939 945 963 990 989 986 984 979 975 959 943 928 912 907 903 898 893 889 884 879 875 870 865 860 855 861 867 874 880 871 862 853 843 850 856 863 869
1627 869 885 900 915 930 926 921 916 911 903 895 901 880 842 789 730 697 708 745 769 793 819 844 870 896 915 935 955 974 983 992 1000 1009 1022 1034 1047 1060 1061 1063 1065 1066 1061 1055 1050 1044
1621 1044 1027 1011 994 977 931 885 839 793 790 786 782 778 785 792 798 805 822 840 858 875 867 858 851 844 867 917 952 987 1017 1047 1065 1057 1048 1039 1056 1072 1086 1101 1115 1130 1144 1159
1616 1159 1172 1185 1175 1139 1092 1046 1014 1010 1017 1024 1022 1020 1007 967 911 854 825 823 818 814 798 782 763 743 750 757 759 762 778 793 813 833 827 820 798 776 781 786 787 789 791 793 828 863
1611 863 886 882 861 839 842 845 867 890 912 934 949 964 953 942 942 942 955 969 977 985 979 974 956 938 963 987 1001 988 963 938 903 869 834 799 772 745 745 745 717 689
1606 689 661 633 621 609 623 637 628 618 608 599 618 638 669 700 721 715 681 648 629 636 661 674 661 636 615 621 639 656 676 695 699 703 708 712 705 698 691 684 661 638 599
1601 599 586 593 587 569 565 591 631 652 646 620 593 565 537 525 513 501 490 502 515 527 540 570 599 628 658 654 650 646 642 639 637 634 632 635 638 614 591 577 564 577 590 594
1596 594 598 589 581 586 605 631 631 617 602 586 570 585 599 614 628 626 624 596 567 527 488 475 462 479 496 526 557 574 592 598 578 541 504 473 456 445 462 491 520
1591 520 527 533 567 600 616 632 621 611 583 555 553 552 548 545 555 565 584 603 595 588 582 575 569 563 562 561 559 558 561 563 565 568 564 559 555 551 539 527 515 503 519 534 536 515 483 451 448 468
1585 468 476 472 469 479 507 534 563 592 596 600 604 609 594 580 566 552 543 533 524 515 510 506 476 446 426 421 438 478 507 523 521 518 517 516 533 563 592 599 593 586 602 618 633 649 620
1580 620 591 562 533 524 515 493 494 516 539 550 539 522 518 541 577 596 593 577 561 561 561 561 562 537 513 488 464 446 429 411 393 403 413 423 433 459 484 510 535
1575 535 541 547 553 559 545 532 518 504 491 478 465 452 455 457 460 462 484 505 527 548 541 533 526 518 521 524 527 530 518 505 493 480 479 477 476 474 465 456 456 442 447 474 487 501 500 500 500 500 509
1569 509 532 559 563 543 509 474 452 442 432 423 415 426 437 448 459 463 467 471 475 486 497 508 519 503 486 470 454 449 444 439 434 433 432 430 429 428 427 426 426 440 468 499 509 497
1564 497 472 453 434 425 416 407 399 383 367 352 336 351 366 381 396 405 415 437 437 417 397 406 437 465 470 463 456 460 463 466 469 471 473 474 476 496 516 536 556 547 538 529 520 525 530 535 539 533
1558 533 527 533 518 468 418 393 368 367 365 363 361 366 371 376 380 389 398 395 366 349 333 342 350 358 365 373 380 394 408 423 437 463 490 503 516 526 535 518 501 509 517 525 533 527 521 516 511 507 528
1552 528 535 542 536 529 510 490 477 463 477 490 493 496 472 448 432 417 416 416 439 489 526 536 522 507 491 475 479 482 511 541 541 540 539 538 538 538 538 538 506 474 444 413 400 413
1546 413 438 463 479 495 484 474 469 464 472 481 473 466 472 478 479 480 495 510 507 504 501 498 472 446 420 394 390 386 394 428 480 533 558 556 558 560 561 561 568 574 581 588 580 573 566 559 545 531 528 553
1540 553 574 595 573 552 520 489 485 480 495 511 525 538 537 509 496 483 489 494 500 505 506 508 509 511 501 492 469 446 435 423 438 453 462 471 453 435 408 380 379 378 391 405 405
1535 405 405 417 428 427 425 432 439 445 452 426 400 386 398 417 436 443 450 453 456 458 461 472 484 495 506 521 536 525 513 497 481 478 476 506 535 567 572 550 529 519 509 506 503 499
1530 499 496 497 497 525 552 572 592 586 579 588 596 594 564 525 487 460 433 398 363 358 379 411 443 475 508 525 516 479 442 404 387 395 416 424 431 440 448 447 446 445 444 436 428 420 413 415 418
1524 418 420 423 419 415 411 407 418 429 438 448 439 408 383 371 373 388 415 455 495 522 526 507 486 466 457 470 491 489 458 428 418 431 431 432 431 429 428 427 414 401 388 375 369 363 356
1518 356 350 359 368 377 386 401 417 431 445 450 433 429 424 418 412 406 400 411 421 431 441 458 475 492 509 528 547 565 583 606 607 578 549 532 538 557 577 565 553 541 528 505
1513 505 482 459 436 455 475 494 513 529 546 562 579 566 554 541 529 517 505 493 481 494 507 517 528 543 531 519 533 575 616 614 613 605 598 563 529 512 495
1509 495 504 514 543 572 601 630 645 660 675 690 696 702 707 713 677 641 604 568 536 504 473 441 456 471 485 500 497 494 491 488 485 482 479 476 480 485 490 494 492 491 489 487 477 467 457
1503 457 447 462 476 491 505 511 516 521 527 526 524 523 522 504 486 469 451 480 509 536 564 585 579 589 598 595 592 589 585 572 559 546 533 514 494 474 455 439 423 407 391 390
1498 390 390 390 389 388 387 387 386 400 415 430 444 450 455 460 465 471 476 481 486 473 460 448 436 425 441 456 445 427 410 417 424 402 379 383 387 405 423 441 460 496 532 540 521 474 454
1493 454 477 500 504 482 432 382 351 347 355 363 356 349 344 339 336 359 394 429 450 472 494 515 521 526 532 538 558 579 573 567 571 574 578 582 591 600 609 617 597 577 557 537 542 546 550 555 559 563 567 571
1486 571 575 579 583 587 547 508 468 428 428 428 427 427 409 392 400 409 414 419 424 429 434 440 443 447 438 403 368 359 373 388 404 420 440 459 453 446 428 409 391 373 364 356 347 338 344 349 355 360 371 381
1480 381 418 455 450 445 440 435 438 441 487 533 576 591 593 596 585 547 492 449 450 465 473 481 488 495 502 509 506 504 501 498 484 470 456 442 453 465 477 488 484 480 476 473 471 470 467 465 443 408
1474 408 365 349 357 365 375 385 395 405 416 426 446 466 486 506 491 476 488 500 506 513 519 526 527 528 529 529 532 522 504 513 543 574 595 589 583 578 571 564 555 547 538 529 537 545 552 560 561 562
1469 562 563 564 559 554 549 543 540 536 515 481 447 440 452 478 481 457 436 440 458 488 512 536 547 545 536 553 581 608 608 582 569 556 542 528 540 552 538 523 530 538 547 556 570 610
1463 610 651 665 641 616 589 563 560 557 554 551 548 546 531 490 440 389 366 370 400 431 464 496 508 521 533 545 548 551 554 556 556 555 581 607 627 646 639 631 616 601 588 574
1458 574 575 603 640 677 691 677 666 654 635 615 609 604 625 646 654 662 639 616 580 544 524 503 483 462 444 426 435 443 448 454 432 411 398 386 372 385 415 445 451 456
1453 456 453 450 447 444 447 451 454 458 423 389 366 370 378 385 394 404 429 455 454 453 464 475 486 497 491 484 478 472 477 482 487 492 499 506 487 468 480 492 492 466 453 439 450 461 464 466 455 444
1447 444 442 439 451 462 478 507 544 554 537 519 512 532 556 581 581 581 564 547 530 513 499 486 472 458 456 453 450 448 462 476 490 504 532 560 577 566 537 507 489
1443 489 471 482 493 503 514 514 513 513 512 513 514 515 517 495 474 480 485 491 497 503 509 530 551 572 594 575 557 539 520 517 513 485 456 446 463 491 519 523 528 532 536 542 548 554 559 539 519
1437 519 500 481 473 492 528 552 547 528 504 481 472 491 515 526 517 508 524 540 544 548 552 556 548 540 542 572 599 613 617 607 573 525 470 442 444 460 470 479 460 440 422 404
1432 404 411 441 458 474 478 481 484 487 490 493 496 500 507 514 521 528 513 497 468 461 455 435 425 415 419 423 427 432 447 461 476 491 482 472 462 453 449 444 440 436 438 440 443 445 442 439 436 433 425 417 409 400 378
1425 378 357 349 363 392 421 420 398 373 370 397 425 419 414 408 403 401 399 397 395 418 440 463 485 485 484 484 484 495 505 515 524 521 495 482 469 448 427 407 386 400 426 458 467 470
1420 470 473 472 471 457 412 379 359 343 349 352 342 331 334 364 407 435 441 433 425 438 451 464 477 479 481 483 485 505 526 517 481 461 441 419 397 384 371 360 348 333 344 385
1415 385 425 459 493 514 510 504 499 492 485 470 455 440 424 425 425 425 425 421 417 413 409 417 424 431 438 426 414 402 390 389 388 387 386 374 362 352 342 359 402 431 459 469 479 488 498 528
1409 528 557 587 617 632 647 662 677 668 659 649 640 638 637 635 633 647 661 674 688 719 750 780 811 824 836 848 861 880 899 943 987 1023 1032 1013 995 1002 1035 1054 1073
1404 1073 1060 1047 1051 1028 998 995 975 955 917 879 842 806 802 824 832 839 833 826 820 813 789 765 741 717 686 655 626 596 590 610 630 623 591 559 510 487 478 468 433 398
1399 398 363 328 321 341 365 363 334 306 287 295 315 335 354 373 365 357 373 388 404 420 419 418 418 419 434 475 501 528 541 554 568 581 563 545 526 508 483 459 461 463
1394 463 473 483 491 499 515 505 482 460 462 465 467 469 455 441 426 412 406 401 395 389 368 346 351 357 361 365 369 373 398 422 420 417 428 439 465 465 454 442 430 417 404 391 379 366
1389 366 366 366 367 367 374 380 387 394 408 423 437 451 481 511 541 571 582 593 604 615 611 607 602 598 569 541 512 484 479 475 470 464 462 433 404 402 398 394 367 340 349 384 419 427 422 417 436
1383 436 456 457 458 471 510 532 554 578 602 635 668 701 734 722 710 697 685 671 657 669 682 697 713 727 741 731 694 646 597 555 514 473 433 431 455 464 473
1379 473 503 534 565 596 613 630 662 668 651 633 615 596 572 548 525 501 489 476 464 451 450 449 448 447 461 476 490 505 504 503 502 500 508 515 495 476 458 439 421 402
1374 402 406 411 415 419 430 441 452 462 466 471 475 479 481 483 485 487 472 458 470 482 499 517 507 498 506 513 521 528 524 521 519 516 517 544 573 576 538 527 554 593 617 627 629 659 690 707 734
1368 734 760 777 793 810 826 803 779 773 781 775 744 701 658 641 623 606 588 581 574 593 613 630 647 637 628 635 642 649 656 639 623 608 593 605 643 673 689 696 690 691 691 676
1363 676 660 646 632 632 660 672 684 705 726 746 767 793 819 844 870 879 888 870 853 838 823 835 847 871 895 920 944 967 991 1014 1038 1063 1088 1113 1138 1155
1359 1155 1171 1214 1257 1301 1344 1387 1430 1473 1515 1596 1721 1870 2033 2213 2438 2720 3048 3409 3815 4272 4755 5232 5696 6141 6572 6963
1355 6963 7274 7430 7400 7178 6822 6378 5890 5394 4897 4424 3977 3580 3246 2980 2759 2568 2403 2289 2237 2226 2228 2228 2255 2322 2402 2466 2516
1352 2516 2569 2634 2715 2810 2904 2985 3028 3046 3051 3055 3063 3071 3052 3033 3017 3001 2986 2972 2970 2995 3069 3170 3277 3370 3441 3486 3484 3454 3438 3423 3422 3422 3421 3421 3410 3399 3387 3376
1348 3376 3401 3426 3477 3528 3553 3578 3603 3628 3666 3703 3741 3779 3815 3851 3887 3923 3979 4036 4121 4232 4360 4473 4565 4630 4680 4703 4720 4723 4718 4700 4683 4679 4704 4757
1343 4757 4824 4918 5013 5109 5207 5306 5425 5571 5759 5991 6257 6549 6851 7165 7507 7876 8290 8747 9276 9866 10537 11289 12142 13111 14251
1340 14251 15595 17181 19042 21231 23785 26765 30180 33971 38054 42311 46684 51186 55839 60554 65048 68990 72266
1338 72266 75097 77874 80966 84609 88790 93344 98124 103100 108424 114121 119765 124645 128198 130455 131955 133428 135404
1336 135404 138142 141547 145289 149183 153343 157881 162472 166113 167676 166651 163440 158942 154034 149353 145223 141601 138387
1334 138387 135611 133492 132114 131003 129319 126410 122144 116900 111249 105650 100416 95626 91224 87124 83446 80284 77554
1332 77554 74877 71833 68167 63922 59304 54550 49849 45362 41140 37158 33442 30070 27106 24554 22375 20538 19002
1330 19002 17675 16544 15548 14676 13911 13200 12555 11963 11460 11010 10596 10182 9785 9389 9036 8684 8403 8121 7867 7612 7357 7102
1327 7102 6892 6681 6502 6322 6142 5962 5787 5613 5482 5352 5208 5064 4920 4776 4692 4609 4526 4442 4370 4298 4199 4100 4007 3914 3866 3817 3742
1324 3742 3667 3592 3517 3438 3359 3280 3202 3165 3128 3092 3055 2995 2934 2873 2812 2767 2722 2677 2632 2598 2565 2531 2498 2471 2444 2418 2391 2369 2346 2324 2301 2259 2217 2174
1320 2174 2132 2097 2062 2028 1993 1965 1937 1909 1881 1874 1868 1860 1852 1834 1793 1752 1734 1729 1725 1722 1719 1716 1712 1708 1703 1684 1643 1616 1589 1580 1594 1603 1598 1581 1563 1545 1527 1534 1540 1547 1553 1527 1500 1474
1314 1474 1448 1433 1417 1402 1387 1377 1366 1356 1346 1329 1312 1295 1278 1263 1247 1232 1217 1208 1199 1192 1185 1185 1208 1226 1230 1219 1208 1196 1184 1178 1171 1165 1158 1163 1167 1170 1173 1153 1110 1073 1049
1309 1049 1043 1049 1049 1049 1058 1067 1076 1084 1104 1124 1143 1162 1151 1127 1098 1090 1101 1112 1142 1141 1108 1076 1041 1007 995 983 972 960 978 996 988 979 966 953 941 929 930 958 977 982 959
1304 959 910 874 838 797 756 734 756 797 824 832 813 806 799 790 782 793 804 815 827 858 889 910 904 895 899 902 892 874 856 837 818 821 824 827 830 848 865 853 815 774 746
1299 746 728 723 746 768 780 765 729 693 681 670 671 672 673 674 701 728 743 732 709 685 660 635 652 669 686 703 721 739 713 687 675 662 650 638 626 614 588
1295 588 588 619 650 655 633 606 607 634 662 672 682 681 653 607 560 539 518 512 506 526 547 554 562 570 578 568 558 547 537 541 545 550 554 553 565 582 577 556 535 543 573 602 609 595
1289 595 567 547 549 545 528 504 480 490 514 524 511 506 513 531 561 593 611 622 633 642 650 639 605 577 561 553 545 537 529 518 506 521 536 541 545 549 554 560 566 572 578 553 529 504
1284 504 479 497 515 532 550 545 541 536 532 538 545 551 558 565 572 579 586 592 599 579 558 543 527 512 496 490 484 478 472 475 478 480 483 472 461 450 438 440 442 470 498 534 556 555 531 492 466
1278 466 468 484 496 509 523 536 544 551 532 513 499 486 472 458 467 475 510 544 535 526 517 508 500 492 484 476 475 474 472 471 477 482 488 494 511 528 544 561 557 554 550 546 535 525 514 504 498 493
1272 493 487 481 476 471 493 514 505 495 486 477 458 439 420 402 402 403 404 405 416 428 440 452 477 502 526 551 560 569 578 586 588 576 557 565 586 620 663 679 667 655 642 628 630 632
1267 632 659 687 690 679 686 721 764 794 806 818 827 836 846 855 874 892 911 929 928 927 926 925 935 945 954 964 952 939 926 913 919 925 930 936 955 974 966 959 934 909 901 907 901 868
1262 868 809 750 727 732 721 711 684 656 604 552 529 533 536 513 459 405 363 348 363 405 449 467 463 460 455 450 463 476 489 503 502 502 475 448 432 417 427 438 447 456
1257 456 465 473 477 481 485 488 487 486 485 484 490 495 501 506 501 496 491 486 492 498 504 510 509 508 507 506 500 494 488 482 473 463 480 498 500 502 504 507 488 469 449 429 412 381 343 332 347 362 379 395 390 384 388 420
1250 420 458 483 480 464 443 423 401 380 377 374 371 368 361 353 345 337 322 307 319 331 340 350 359 368 353 338 350 361 384 406 402 398 394 390 386 381 366 351 354 370 386 375 355 335
1245 335 329 350 382 414 432 450 468 486 496 506 490 473 472 471 469 468 465 462 460 457 439 422 405 389 347 318 330 365 399 420 447 474 478 451 408 378 373 381 389 385 387 389 390
1240 390 391 382 372 363 353 355 356 358 359 359 359 360 360 374 389 410 418 416 392 363 364 395 425 432 438 458 479 499 518 510 489 463 459 486 512 526 518 497 476 454 431 414 397 406 416
1234 416 415 415 414 414 423 433 415 398 396 394 392 390 378 366 355 343 343 342 342 341 348 354 360 366 356 332 306 301 323 367 407 434 448 462 467 441 392 357 349 354 368 382 397 412 421 429
1228 429 438 446 418 391 363 335 345 355 382 422 463 478 455 419 386 379 402 424 441 457 447 437 447 458 468 478 481 484 461 438 431 425 419 412 404 396 388 380 381 382 382 383 375 366
1223 366 357 349 326 303 306 310 329 348 367 386 373 359 372 385 406 428 455 469 460 425 389 380 383 386 390 395 406 416 427 438 433 428 424 419 434 449 462 476 470 438 413 402
1218 402 410 418 401 384 381 379 378 378 381 410 440 443 405 366 370 374 372 370 368 366 366 365 382 412 451 463 446 430 432 433 435 437 419 400 382 363 368 372 377 381 366 351 364 404 451 472 464
1212 464 457 443 429 429 428 452 475 487 472 460 448 448 448 448 447 447 447 459 471 457 442 444 446 448 450 450 450 475 500 504 482 447 413 400 388 401 415 420 425 416 408 409 411 413 415 404 394
1206 394 384 374 394 414 433 453 450 447 444 441 426 410 406 428 448 468 490 511 507 504 473 443 414 384 368 352 364 376 388 400 419 438 458 477 480 482 485 487 471 455
1202 455 438 447 467 487 483 478 478 478 478 478 469 459 449 440 450 460 471 481 484 488 491 495 498 502 505 509 510 512 513 515 517 518 520 522 522 522 523 523 517 510 504 498 501 505 508 511 495 478 462 445 446 447 448 449 460
1195 460 471 483 494 477 459 430 401 381 388 406 424 439 454 443 431 416 401 386 371 376 382 387 392 386 380 369 346 323 326 341 355 362 369 376 383 398 413 428 443 437 432 427
1190 427 422 411 401 390 379 397 415 433 451 443 435 427 419 411 403 395 387 384 380 376 373 380 388 395 403 402 401 401 400 398 396 412 441 465 462 433 403 395 414 428 427 417 433 460 487 486 484 470 455
1184 455 437 419 428 437 447 456 439 422 417 412 434 456 470 485 474 462 464 466 493 520 522 493 442 415 420 438 451 463 473 483 493 503 495 488 453 419 420 421 421 422 420 418 416 414
1178 414 418 423 462 515 559 573 567 549 532 515 498 480 453 426 426 426 411 395 380 365 360 354 349 344 358 373 387 402 411 421 430 439 442 445 447 450 429 408 387 366 370 373 377 380 372
1173 372 365 357 349 345 340 362 384 408 432 429 426 431 437 442 448 468 489 482 476 452 427 403 379 402 426 450 473 483 493 503 513 487 461 453 458 461 441 428 427 431 436 440 445 435 424
1167 424 413 402 377 352 327 301 288 275 289 302 350 398 434 444 437 430 421 412 435 458 454 451 448 445 443 440 437 434 458 481 505 528 525 522 508 493 479 464 469 474 506 537 567
1162 567 597 615 606 591 576 560 544 550 556 562 568 552 535 519 502 485 468 477 487 506 525 542 559 540 494 447 428 441 454 469 484 508 533 530 528 525 521 542 563 570
1157 570 550 521 491 472 479 531 584 624 637 639 640 663 686 682 678 668 659 649 640 620 601 608 615 616 617 619 620 606 592 577 563 568 573 552 530 513 495 477 460 450 440 432 424
1152 424 413 428 454 480 494 481 457 433 430 427 425 422 433 443 453 463 489 514 513 511 508 504 501 497 479 461 445 428 415 428 470 512 533 554 574 595 568 542 526 538
1147 538 559 580 576 572 562 551 541 530 515 500 484 469 473 477 482 486 503 520 537 554 556 557 583 609 633 630 615 601 614 626 612 598 598 597 596 596 600 605 610 615 604 593 583
1142 583 572 559 546 533 521 526 532 537 543 544 546 522 497 466 434 430 425 423 422 422 422 413 431 494 557 611 638 636 634 649 665 680 696 704 712 747 782 802 822 841 861 887 914
1137 914 940 966 968 970 971 973 947 920 894 867 852 837 796 754 716 678 640 603 594 598 595 592 577 561 538 529 526 524 515 520 557 607 641 644 622 600 596 604 608 611 596 568 531 494
1131 494 476 471 479 487 514 554 591 606 599 578 563 561 569 591 609 626 644 662 659 644 635 627 612 597 575 566 565 563 562 562 550 538 525 513 489 453 417 394 392 404 418 418 430
1126 430 456 480 490 488 472 464 455 454 467 472 477 479 482 483 485 483 468 461 453 438 423 409 395 407 433 450 468 477 473 468 476 487 484 464 444 422 415 419 436 454 471 490 508 499 491 482
1120 482 473 451 428 398 382 391 400 411 421 435 449 464 478 517 556 568 580 567 553 513 473 443 412 408 404 400 396 392 387 419 450 481 511 539 554 528 480 432 406
1115 406 387 380 393 418 437 457 463 469 475 481 486 490 495 500 501 503 504 505 495 484 474 463 473 483 492 502 498 495 492 488 450 412 406 422 430 437 444 452 459 452 439 449 471 479 477 462 444 426
1110 426 407 388 382 377 371 366 382 398 414 430 428 425 450 474 472 470 468 466 469 472 474 477 446 415 399 404 418 431 445 460 439 417 396 374 383 392 401 410 408 406 404 402 410 419 428 436 452 467
1104 467 482 498 486 474 462 451 446 441 435 430 432 433 434 435 462 490 490 491 481 471 461 451 440 428 416 405 409 414 418 422 420 418 415 413 431 449 467 485 469 454 439 423 426 429 432
1098 432 435 446 457 469 480 469 458 459 483 500 495 478 460 448 435 425 414 413 435 444 453 447 440 434 427 433 440 446 452 435 418 427 436 451 465 478 491 487 461 440 433 432 431 431 431 444
1093 444 457 470 483 499 515 532 548 550 553 556 558 558 557 530 502 475 447 446 445 439 432 426 420 412 404 396 389 388 386 385 384 397 410 424 437 434 432 429 427 431 436 440 445 438 431 425 418 417 415 414 412 411 409 408
1086 408 406 409 411 414 416 445 473 500 527 551 547 514 481 443 405 378 378 390 402 416 429 425 420 427 461 485 509 535 560 570 579 561 543 536 529 522 515 526 538 549 560 551 543
1081 543 534 525 494 462 416 396 399 403 408 413 399 384 398 438 473 482 464 447 456 492 513 534 531 528 525 523 540 557 574 591 569 546 523 500 489 477 465 454 463 472 481 490 475
1076 475 460 445 429 450 470 490 510 537 564 579 568 549 531 510 490 449 407 413 445 486 527 543 559 567 575 556 537 521 505 489 473 471 468 466 464 449 435 420
1071 420 405 420 434 448 462 476 490 504 518 511 505 499 493 478 463 448 434 434 434 452 483 522 535 510 472 446 447 459 471 484 497 511 524 519 514 509 504 524 544 564
1066 564 584 587 590 593 596 593 589 560 530 497 465 468 484 486 461 445 442 443 456 488 520 531 514 487 459 453 447 441 435 432 430 429 427 451 489 508 499 497 494 489 485 470 456 468 480 497
1060 497 514 530 547 554 562 569 576 577 578 579 580 578 576 556 523 505 514 552 589 624 658 665 673 675 677 679 680 650 606 582 584 601 618 637 655 641 626 612 597 593 588 557 525 494 463
1055 463 458 453 451 448 446 443 471 499 527 555 567 579 591 602 608 613 618 623 602 580 558 537 517 497 478 460 438 443 459 476 479 482 485 488 491 495 498 501 519 536 553 571 594 618
1049 618 630 616 587 559 556 552 538 523 509 494 482 470 484 498 501 504 506 509 485 460 436 411 404 396 389 381 386 392 397 402 367 333 310 313 341 368 397 427 454 482 498 487
1044 487 459 431 430 456 480 503 529 554 549 543 538 533 538 544 550 555 554 553 552 551 544 536 529 522 534 547 559 572 581 591 600 610 604 598 592 586 575 564 553 542 562 582 575 568 559 550 541 532 545
1038 545 559 573 586 596 605 606 620 638 634 619 603 598 616 634 630 609 588 566 544 553 562 571 580 600 620 640 660 651 641 631 621 645 668 692 715 726 736 746 757 762
1033 762 767 746 725 713 702 691 680 667 655 642 629 604 580 555 530 498 466 423 402 433 478 502 505 493 481 468 455 437 419 401 383 380 377 375 372 376 380 383 387 391
1029 391 395 399 402 415 427 440 452 449 446 488 529 578 627 649 671 672 672 673 673 679 685 664 643 617 591 565 540 520 500 480 460 466 472 478 484 503 522 515 477 433 411 420 428 428
1023 428 428 429 429 407 386 366 346 352 380 396 412 414 415 417 419 413 408 403 398 399 400 402 403 387 371 356 340 332 324 304 306 336 366 388 424 453 460 480 500 492 472 446 442 454 465 479
1018 479 492 520 549 578 606 616 626 624 645 698 763 822 880 929 956 958 948 930 912 893 874 853 832 768 704 660 639 614 575 539 516 516 538 560 568 566 551
1013 551 533 514 521 529 535 541 520 500 480 461 441 422 415 408 401 394 387 380 374 368 388 430 460 489 500 511 522 533 523 513 503 493 494 496 497 498 474 450 419 402 404 433 455
1008 455 464 465 467 468 469 471 474 476 479 482 486 507 541 585 603 600 583 565 546 527 508 506 505 503 501 482 462 443 424 429 434 439 444 427 410 392 375 373 372 370 368 333 299 258 231 241 278
1002 278 301 323 332 341 351 360 362 365 367 369 348 326 304 282 312 343 372 401 434 441 425 396 372 348 350 351 368 385 402 418 437 455 474 492 497 501 505 509 491 473 454 436
997 436 418 401 410 419 445 471 468 438 418 412 423 433 438 443 448 453 449 446 442 438 426 414 403 393 386 405 454 503 545 587 604 621 654 713 787 861 957 1098 1293 1488
992 1488 1699 1909 2164 2418 2666 2915 3133 3352 3532 3667 3735 3723 3624 3461 3264 3041 2777 2514 2251 1988 1751 1540 1371 1247
989 1247 1152 1084 1030 976 936 896 855 815 774 732 718 703 680 657 634 611 597 583 569 554 560 566 571 577 573 570 567 563 549 534 520 505 503 501 499 497 494 490 487 483 494 505 490
984 490 476 471 493 525 557 557 530 518 507 506 506 505 505 484 464 444 424 431 437 444 451 472 492 486 479 488 497 506 514 507 499 492 484 508 533 557 581 593 606 607 582 555 527 498 470 449
978 449 428 434 440 431 422 414 405 418 431 445 458 452 445 438 432 421 409 398 387 387 387 387 387 389 391 391 391 410 403 383 364 378 392 406 420 426 431 437 443 429 415 401 387 382 377 398 418 418
972 418 391 379 367 366 365 365 364 350 336 323 309 300 291 309 327 330 334 337 340 345 350 355 359 358 357 355 354 368 382 396 411 421 431 442 452 452 451 450 449 451 453 454 456 458 460 461 463 458 453 447 442 453
966 453 463 473 484 478 472 464 456 436 389 343 323 302 282 248 241 272 303 324 318 292 267 266 265 282 298 314 330 344 359 388 391 385 380 372 365 339 313 300 287 278 269 281 292
961 292 291 263 239 215 221 253 302 350 383 415 448 480 477 474 471 467 440 413 386 359 356 353 363 373 384 396 376 356 342 327 334 342 332 322 299 276 264 251 270 289
956 289 314 339 351 364 373 382 391 400 397 394 369 345 352 360 368 375 374 373 371 370 376 381 386 392 390 389 388 386 383 381 400 420 432 444 456 468 457 446 422 397 388 378 390 402 419 435 421 406
950 406 396 386 377 367 355 343 331 320 330 341 352 362 352 342 332 322 316 311 294 277 260 271 288 306 304 303 315 327 341 355 340 324 317 333 366 400 435 469
945 469 490 512 502 493 483 474 492 511 516 521 505 488 494 500 524 549 574 599 595 592 575 558 562 565 548 531 526 543 560 578 581 585 588 592 565 538 511 484 473 462 464 466 465 465 443
940 443 422 412 424 445 465 479 470 451 433 442 451 461 470 457 444 431 418 429 441 453 465 489 527 570 591 582 573 562 552 573 594 603 611 600 589 600 611 645 680
935 680 736 793 825 858 878 898 914 930 945 960 952 922 883 843 819 795 771 747 715 683 651 619 586 552 520 488 469 472 470 454 440 425 436 447 453 459 464 470 484
930 484 498 487 477 482 513 563 598 600 574 536 498 495 492 489 486 511 536 561 586 578 569 561 553 551 549 548 546 560 574 588 602 621 640 659 679 691 704 717 729 756 783 810
925 810 837 864 891 917 944 979 1013 1049 1085 1149 1241 1366 1518 1668 1844 2054 2291 2526 2761 3004 3234 3438 3615 3731 3767 3735 3623 3443
922 3443 3218 2964 2709 2479 2248 2031 1813 1609 1431 1298 1192 1117 1041 976 911 872 834 807 780 754 727 704 680 666 639 598 583 590 610 623
918 623 637 651 665 648 630 613 596 578 561 543 526 519 513 508 503 502 527 572 630 673 671 633 595 566 537 535 532 519 507 494 481 462 442 449 456 438 420 401 383 368
913 368 353 337 322 327 331 362 392 397 402 407 412 418 425 432 439 447 455 454 426 394 390 422 467 500 506 501 496 498 501 503 505 515 526 510 494 472 450 455 461 469 477 486 494 467 439 411 384 363 342
907 342 332 350 364 379 396 412 415 417 420 423 429 435 441 448 447 447 422 396 382 395 435 476 488 473 433 419 438 470 485 473 475 477 477 477 503 529 555 581 583 585 561 537 500
902 500 477 475 499 538 563 578 580 576 572 566 561 577 593 609 625 660 696 720 717 709 701 680 632 580 527 503 505 522 540 532 525 518 511 504 496 494 492 490 488 470 452 434 416 398 380
896 380 362 344 362 381 400 418 417 416 414 413 414 416 417 418 403 389 375 360 357 354 350 347 368 389 410 431 447 463 478 493 485 450 406 361 313 292 293 307 325 344 354 377
891 377 412 420 418 415 424 433 442 451 467 484 487 464 432 387 332 304 321 338 331 323 330 337 344 351 350 349 347 345 310 261 240 263 303 342 341 339 352 365 378 392 393 394 368 342 327 311
886 311 295 280 260 241 248 255 272 289 305 322 355 388 421 453 456 458 460 463 459 456 427 398 392 399 411 400 364 314 285 279 293 321 342 363 392 399 383 354 336 340 339 325
880 325 323 335 338 341 331 321 311 301 278 255 259 263 293 322 352 382 387 393 373 354 320 300 321 363 400 405 385 365 336 308 293 301 317 332 322 313 320 326 333 340 349 357 366 374
875 374 376 378 380 382 367 353 339 324 339 353 368 382 373 365 356 348 339 331 322 314 304 294 284 274 284 295 305 315 318 322 325 329 324 319 327 357 389 408 416 411 415 419 423 427 414 401 401 423
869 423 457 476 478 480 454 427 394 375 396 444 477 511 527 544 560 577 573 570 566 563 567 572 577 581 549 516 511 533 565 569 554 525 490 456 447 438 448 459 467 476 473 443 422 413
864 413 400 387 375 363 368 373 378 383 366 349 359 368 379 389 364 326 294 288 303 331 352 373 368 363 344 326 293 286 283 280 278 276 289 301 313 326 338 350 363 375 384 393 403
859 403 412 421 430 439 448 473 498 528 545 525 479 441 415 402 402 395 389 407 426 445 463 469 474 480 485 515 545 573 601 622 616 625 634 621 609 596 583 562 541 521 501 509 531
853 531 559 561 518 462 398 359 352 345 339 333 331 329 327 325 343 361 377 394 392 363 336 335 351 381 412 430 421 411 401 391 392 393 394 395 418 441 464 486 510 534 552 583 645
848 645 733 814 881 926 945 970 1009 1056 1104 1158 1199 1228 1230 1201 1173 1131 1089 1047 1005 953 901 850 798 761 723 685 648 593 539 514 516 525 534 543 552 532 486 454
843 454 423 410 397 384 371 387 403 419 435 420 406 391 376 361 346 332 317 315 313 311 310 314 319 324 329 319 308 298 287 302 316 330 344 338 332 326 320 320 320 329 325 330 362 385
838 385 394 408 409 401 420 469 518 535 531 497 449 408 368 326 298 294 312 330 348 349 337 329 344 371 399 412 425 437 450 451 452 465 457 436 415 393 371 373 375 376 378 364
833 364 350 336 322 297 272 235 221 246 285 318 351 366 382 397 413 404 395 386 378 375 373 371 369 367 365 362 360 368 376 370 387 410 412 420 441 460 478 510 520 504 488 471 454 435
828 435 416 397 378 375 371 369 367 364 383 398 398 388 378 367 356 376 396 417 437 468 500 531 563 613 664 715 766 766 766 765 765 752 738 725 711 698 684 671 657 623
823 623 589 555 521 528 534 541 547 547 547 523 498 475 479 511 543 577 585 581 577 589 601 614 628 663 724 770 816 906 996 1085 1175 1293 1411 1526 1642 1712 1738 1716
818 1716 1649 1564 1478 1392 1305 1210 1142 1103 1064 1015 966 918 871 845 845 830 816 813 811 809 806 815 824 833 842 857 872 872 898 951 1003 1058 1114 1184 1282 1411 1540 1686
813 1686 1877 2118 2403 2740 3121 3542 3963 4371 4779 5161 5499 5779 5960 6014 5917 5696 5359 4960 4534 4113 3692 3302 2938 2599
810 2599 2305 2085 1928 1798 1669 1574 1506 1458 1437 1449 1488 1547 1607 1667 1728 1823 1917 2042 2194 2378 2589 2845 3180 3600 4099 4667 5279
807 5279 5912 6544 7144 7717 8270 8726 8961 8921 8622 8136 7552 6905 6243 5581 4955 4374 3826 3323 2889 2534 2258 2027 1825 1649
804 1649 1509 1395 1315 1262 1219 1176 1121 1066 1048 1031 1013 995 940 885 829 774 742 711 693 674 657 640 650 659 662 666 655 645 628 612 621 631 637 642 634 627 624 621 591
799 591 562 547 533 532 530 502 473 444 416 410 404 424 445 442 440 424 408 399 390 381 373 364 355 346 337 343 350 370 390 375 360 372 384 417 450 470 489 456 423 390 357 352 347 316
794 316 284 292 299 320 341 340 339 311 283 250 216 209 202 203 205 206 208 225 242 259 276 308 339 345 350 350 351 351 351 344 336 329 321 313 306 298 289 277 252 222 213 233 253 275 296 312 329 332
788 332 335 311 286 288 289 290 278 260 265 292 320 334 327 308 289 282 275 273 271 268 266 270 273 250 227 201 175 176 177 205 234 231 206 182 172 179 186 200 214 227 241 263 285 307 329
783 329 332 336 339 342 313 283 253 223 223 223 223 223 231 239 274 308 329 349 343 337 309 280 265 273 290 295 295 295 300 305 297 288 256 224 193 161 166 171 176 181 196 211 224 238 231 202 179 168
777 168 171 174 177 181 184 188 191 195 190 186 181 177 173 168 164 159 161 162 164 165 159 154 183 226 248 244 211 178 172 167 161 156 149 143 147 177 206 209 184 158 162 165 169 172 188 204 220 237 232 227 223 218 225 231 238 244 257
770 257 269 282 294 283 271 259 247 234 222 209 197 200 203 206 209 241 274 305 335 322 282 249 230 225 220 216 211 207 203 199 196 201 220 247 247 235 237 230 223 232 241 251 260 285 310
764 310 325 313 278 256 269 282 281 279 278 276 288 299 311 322 332 342 367 365 359 354 347 340 355 371 402 405 385 364 326 316 310 304 300 296 282 269 256 242 258 273 288 304
759 304 290 276 262 248 249 251 252 254 260 267 273 279 286 292 299 305 292 279 266 253 246 240 233 227 248 269 290 311 316 322 326 331 332 319 299 305 329 353 379 404 391 378 366 353 333 314
754 314 294 275 268 262 256 250 251 251 252 252 245 238 231 225 242 273 286 272 250 242 254 292 327 349 353 358 362 367 371 375 378 382 375 341 299 283 287 303 328 339 323 294 271 275 298 307 292 278
748 278 289 300 294 287 281 274 280 287 291 296 281 240 207 187 185 196 193 204 215 226 237 249 227 206 184 162 158 154 150 145 161 177 193 208 224 240 255 271 280 289 298 307 284 262
742 262 224 213 216 219 223 227 241 255 269 283 282 280 279 277 286 296 305 314 299 283 268 253 242 232 220 208 201 168 135 128 123 118 114 110 122 134 146 158 141 125 109 92 92 91 90
737 90 89 123 157 189 221 247 246 217 188 176 190 190 189 190 191 192 193 172 150 158 192 224 256 289 321 312 277 257 237 221 206 191 176 179 182 185 189 199 208 218 228 231 233 236 238
731 238 234 230 226 222 232 241 251 261 264 268 271 274 250 227 203 180 160 140 148 183 210 210 200 191 204 217 230 243 231 218 205 193 191 189 186 183 166 126 92 72 59 59 60 49
726 49 54 72 82 91 102 113 123 134 145 155 166 177 181 185 189 193 203 212 222 232 227 221 217 212 193 187 187 164 148 145 133 121 125 129 134 138 149 159 170 181 184 187 204 198 187 189 175
720 175 174 182 190 199 208 193 177 162 147 147 148 148 149 160 172 183 195 195 196 196 196 190 183 177 171 186 201 216 231 226 222 217 212 222 233 243 254 249 243 240 236 239 264 283 289 292 282 271 273 281
714 281 289 297 306 281 257 233 210 213 239 270 269 231 192 184 197 214 231 249 268 289 310 331 352 335 319 303 286 247 208 170 133 122 138 165 192 200 207 215 222 212
709 212 203 193 183 158 133 108 83 93 103 114 124 134 144 164 211 248 260 243 226 209 191 173 156 152 149 121 93 75 83 103 122 134 145 156 168 166 164 189
705 189 213 243 273 301 330 336 315 283 251 223 196 180 191 214 237 235 233 233 234 234 235 240 246 251 257 261 264 268 272 259 246 206 167 151 136 147 159 164 170 176 181 169 156 144 131
699 131 143 155 167 179 195 211 227 242 235 229 222 215 204 193 207 221 240 233 215 196 165 134 114 121 148 174 176 177 190 203 206 182 165 174 212 249 276 304 321 311
694 311 286 275 291 321 333 332 340 348 342 336 330 324 320 316 312 308 304 300 296 292 299 307 314 322 325 327 303 279 273 267 260 254 255 256 258 259 285 310 309 308 329 349 370 391 386 381 376 371 378 386 394 402 397 391 351 298
687 298 263 256 286 329 340 324 291 272 269 280 275 242 238 261 302 329 330 331 332 332 298 264 242 246 258 270 284 298 294 290 286 282 299 317 308 299 320 342 363 385 367 349 331
682 331 313 307 301 295 290 295 300 305 311 301 292 284 276 266 282 328 374 372 369 365 361 338 289 240 217 225 232 241 251 260 269 278 288 295 302 309 316 303 290 277 264 237 210 185 160 162 190 204
676 204 218 237 257 277 296 305 313 322 330 331 332 333 333 323 313 302 292 277 262 247 232 238 244 265 259 241 224 247 271 299 301 291 282 250 218 187 155 164 173 181 190 210 231 266
671 266 275 270 264 257 251 255 260 264 269 263 256 250 243 219 194 170 145 136 127 118 109 112 115 118 121 139 157 176 194 187 179 172 164 193 222 250 279 279 280 253 227 190 152 144 163 197 232 224 215 197
665 197 179 187 195 197 199 226 252 267 256 242 256 304 325 309 279 259 252 236 221 210 199 188 177 166 155 144 133 167 201 234 266 264 235 222 208 202 196 216 236
660 236 258 267 254 215 179 157 144 145 151 156 162 168 173 177 167 183 205 226 249 272 253 234 216 199 196 219 227 235 231 228 224 220 217 213 209 205 201 197 192 188 199 210 222 233 230 226 223 220 232
654 232 245 257 269 272 276 279 282 265 248 232 215 218 220 223 226 235 245 254 264 298 332 366 399 432 451 492 506 497 473 449 437 447 456 466 476 445 414 383 352 350 349 347 345
649 345 345 346 347 347 380 412 444 477 498 520 515 509 486 463 439 416 393 370 341 326 331 359 387 393 386 379 370 362 369 376 383 390 392 394 395 397 376 356 335 314 311 309 324 352 377 379 359
643 359 325 296 288 287 299 318 350 388 404 398 391 410 429 426 424 421 418 426 435 443 451 466 481 495 510 519 528 549 549 529 509 487 466 458 451 470 490 527 565 602 640 637 634 632 629 653
637 653 678 702 726 739 753 739 726 716 706 731 770 799 806 782 757 733 709 712 714 721 727 733 739 713 687 662 636 641 646 651 656 674 692 710 728 738 749 785 821 842 838
632 838 821 805 772 740 708 675 679 683 687 690 710 730 750 770 765 759 727 695 672 650 654 658 672 686 673 660 625 590 555 520 515 509 504 499 496 492 471 437 405 399 423 446 465
627 465 484 502 521 535 548 536 523 504 486 494 502 513 525 536 548 560 572 584 596 593 589 586 582 587 592 596 601 628 656 683 710 728 746 737 728 720 713 705 697 681 665 660 682 692
622 692 688 694 700 706 712 718 724 741 758 774 791 799 807 817 826 859 918 988 1059 1118 1176 1247 1345 1472 1612 1760 1934 2131 2356 2614 2935 3331 3771 4217 4662
617 4662 5083 5503 5903 6277 6577 6743 6752 6610 6356 6021 5639 5231 4799 4366 3955 3587 3276 3009 2769 2555 2388 2248 2142 2063
614 2063 2024 1984 1946 1909 1855 1801 1749 1697 1686 1701 1704 1706 1710 1740 1799 1859 1916 1974 2045 2143 2276 2435 2634 2859 3137 3495 3929 4461 5083 5802 6592
611 6592 7443 8369 9340 10319 11236 12070 12823 13438 13813 13853 13547 12963 12192 11322 10389 9439 8490 7584 6741 5975 5289 4701 4210 3814
608 3814 3497 3244 3036 2880 2769 2683 2598 2515 2432 2364 2297 2229 2162 2119 2076 2032 1989 1976 1962 1951 1940 1941 1986 2072 2184 2306 2428 2572 2762 2994
604 2994 3253 3546 3902 4316 4757 5185 5613 6028 6416 6766 7090 7364 7540 7573 7455 7208 6863 6463 6036 5585 5134 4685 4235 3823
601 3823 3454 3137 2864 2638 2457 2303 2176 2078 2008 1951 1894 1843 1792 1770 1747 1744 1768 1792 1789 1772 1754 1780 1806 1833 1860 1845 1829 1811 1819 1839 1859 1843 1827
597 1827 1810 1794 1743 1692 1641 1589 1538 1487 1436 1385 1334 1284 1233 1183 1161 1139 1118 1096 1115 1133 1152 1170 1189 1207 1226 1245 1263 1282 1301 1320 1354 1389 1423 1457 1487
593 1487 1518 1548 1578 1614 1651 1688 1724 1765 1807 1848 1889 1925 1961 1996 2030 2062 2066 2023 1953 1888 1850 1822 1794 1747 1699 1678 1657 1647 1637 1627 1617 1594 1571 1550 1529
589 1529 1526 1549 1558 1567 1570 1573 1576 1579 1591 1604 1616 1629 1630 1631 1677 1723 1751 1778 1806 1833 1830 1828 1825 1822 1831 1841 1877 1913 1945 1978 1984 1990 1999 2008 2044 2080 2114 2148 2155 2163 2177 2192 2180 2168 2158
583 2158 2148 2139 2129 2180 2232 2310 2387 2437 2486 2536 2585 2623 2661 2700 2738 2766 2795 2796 2798 2813 2828 2843 2858 2846 2834 2795 2756 2685 2613 2579 2589 2624 2660 2698 2737 2746 2755
578 2755 2737 2719 2721 2722 2768 2814 2871 2928 2985 3043 3137 3231 3325 3419 3531 3644 3756 3868 3934 3999 4037 4076 4091 4107 4123 4138 4155 4172 4189 4205 4213 4220 4272 4324 4393
574 4393 4463 4533 4602 4724 4846 4982 5145 5337 5574 5832 6090 6386 6681 7040 7399 7798 8224 8698 9234 9818 10402 10984 11521 12014
571 12014 12427 12718 12858 12842 12675 12379 11985 11523 11033 10541 10075 9647 9264 8917 8615 8388 8241 8155 8094 8040 8012 8008 8017 8037 8057 8104 8151
568 8151 8197 8243 8289 8335 8409 8484 8558 8633 8734 8834 8935 9035 9144 9252 9388 9523 9654 9785 9917 10048 10201 10354 10507 10660 10797 10935
565 10935 11072 11210 11388 11567 11747 11927 12125 12350 12597 12858 13125 13406 13706 14007 14314 14622 14956 15290 15661 16033 16406 16779 17169
562 17169 17586 18036 18511 18978 19445 19953 20506 21109 21757 22432 23134 23879 24668 25516 26426 27370 28340 29366 30455 31622 32869 34177
559 34177 35549 36978 38488 40079 41768 43561 45488 47609 49934 52467 55222 58265 61638 65385 69549 74180 79370
557 79370 85211 91771 99160 107517 117000 127806 140217 154626 171499 191399 215035 243209 276700 316282 362735
555 362735 416950 479657 550942 629587 712974 797734 880913 960616 1035115 1100800 1151192 1178778 1178675 1151038
554 1151038 1100507 1033692 957091 876006 794087 713479 635767 562882 497118 440169 392330 352883 320736 294763
552 294763 273745 256636 242707 231435 222348 215027 209286 205022 202055 200255 199610 200152 201884 204876 209305 215420 223329
550 223329 233112 245044 259431 276536 296792 320903 349771 384446 426241 476791 537798 610652 696816 798131
548 798131 916564 1052883 1205224 1368630 1536061 1700846 1859053 2008397 2143478 2252042 2317552 2327419
547 2327419 2279729 2182931 2050588 1896489 1732093 1565370 1400771 1240949 1089448 951214 830352 728156
545 728156 643303 573494 516380 469479 430514 397783 370113 346510 326066 308233 292729 279197 267269 256710
544 256710 247447 239446 232613 227076 223006 220482 219489 220042 222261 226202 231958 239791 250142 263494 280338 301427 327569
541 327569 359484 397758 443189 496668 558690 628662 704690 783785 862684 938896 1010899 1076468 1130787 1166629
540 1166629 1177402 1160612 1118736 1057554 983737 903221 820441 738118 657865 581308 510585 447737 393779 348454
538 348454 310792 279609 253727 232039 213645 197870 184181 172157 161474 151925 143309 135432 128134 121352 115041
536 115041 109179 103751 98766 94215 90070 86289 82835 79656 76714 73959 71382 68992 66757 64638 62629 60737 58968
534 58968 57315 55750 54265 52851 51499 50209 48999 47858 46778 45727 44721 43774 42888 42046 41249 40513 39823 39136 38450
532 38450 37814 37177 36603 36029 35529 35030 34530 34030 33492 32954 32416 31878 31344 30811 30277 29743 29214 28686 28220 27754 27347 26939 26564
529 26564 26216 25900 25629 25399 25196 24989 24782 24604 24425 24264 24103 23898 23692 23430 23168 22844 22520 22162 21805 21491 21178 20899 20620
526 20620 20356 20118 19936 19798 19703 19633 19584 19534 19530 19527 19587 19646 19733 19819 19898 19976 20040 20078 20067 20011 19896 19720 19485 19224 18976 18728 18489 18278 18100
523 18100 17984 17917 17913 17946 18041 18213 18483 18845 19287 19778 20295 20799 21303 21788 22227 22588 22780 22768 22551 22156 21646 21070 20468 19862 19282
520 19282 18734 18230 17804 17475 17246 17097 17001 16950 16925 16927 16965 17030 17129 17254 17411 17567 17723 17879 18061 18244 18490 18736 18982 19228 19435 19643
516 19643 19826 20009 20209 20454 20741 21054 21370 21712 22099 22566 23105 23724 24398 25152 26001 26965 28027 29135 30219 31260 32231 33139
514 33139 33899 34384 34465 34094 33317 32248 30978 29593 28155 26690 25215 23785 22453 21236 20149 19158 18253 17445 16741 16135
511 16135 15609 15145 14719 14319 13967 13642 13334 13053 12797 12567 12327 12086 11866 11690 11555 11419 11306 11238 11212 11212 11253 11321 11402 11483 11544 11604
508 11604 11695 11786 11918 12112 12390 12729 13120 13555 13995 14435 14857 15279 15655 15915 15997 15874 15550 15057 14444 13769 13095 12420 11785 11194
505 11194 10630 10092 9596 9163 8830 8596 8412 8273 8163 8081 8030 8005 7994 7983 7958 7932 7909 7885 7875 7892 7922 7952 7983 8041 8113 8212 8330 8447 8592
502 8592 8738 8870 9001 9093 9105 9029 8873 8649 8380 8104 7827 7577 7326 7071 6844 6650 6482 6326 6195 6081 5994 5919 5844 5771 5697 5636
498 5636 5575 5540 5506 5475 5444 5411 5378 5335 5265 5184 5104 5042 5006 4957 4908 4873 4866 4872 4877 4895 4939 5013 5087 5112 5137 5175 5240 5329 5445 5574 5704 5822 5940 6053
494 6053 6167 6229 6211 6154 6070 5960 5824 5701 5577 5463 5348 5253 5202 5174 5146 5120 5095 5112 5129 5210 5291 5405 5545 5710 5920 6169 6463 6807
491 6807 7195 7624 8053 8481 8909 9303 9635 9864 9960 9897 9699 9408 9037 8607 8151 7692 7260 6858 6500 6176 5897 5667 5481 5323
488 5323 5191 5094 5041 5009 4978 4929 4881 4833 4785 4761 4738 4714 4690 4648 4606 4591 4575 4605 4636 4728 4820 4940 5060 5183 5306 5458 5654 5911 6231 6609
484 6609 7068 7623 8276 9017 9855 10759 11663 12553 13416 14235 14956 15488 15745 15685 15314 14701 13920 13063 12179 11296 10439 9610 8824 8107
481 8107 7488 6969 6549 6211 5936 5706 5521 5355 5216 5111 5034 4965 4896 4829 4762 4695 4628 4562 4495 4419 4343 4311 4279 4273 4266 4260 4253 4279 4304 4373 4443 4574
477 4574 4704 4881 5057 5296 5562 5846 6184 6557 6957 7342 7727 8095 8409 8646 8759 8731 8578 8313 7960 7540 7095 6645 6221 5820
474 5820 5445 5089 4761 4473 4238 4061 3937 3844 3751 3662 3573 3481 3390 3342 3295 3254 3213 3172 3131 3108 3085 3035 2985 2934 2884 2833 2782 2749 2717 2684 2651
471 2651 2641 2630 2620 2609 2574 2539 2531 2523 2517 2512 2462 2412 2388 2364 2366 2369 2370 2371 2345 2319 2274 2229 2229 2228 2230 2231 2233 2234 2232 2230 2228 2225 2226 2227 2228 2228 2194 2159 2169 2178 2188 2197 2144 2092 2060 2027 1995
465 1995 1963 1968 1973 2023 2072 2121 2171 2176 2181 2163 2146 2128 2111 2120 2128 2092 2057 2020 1983 2008 2033 2032 2031 2029 2028 2022 2017 2011 2005 1998 1991 2011 2031 2047 2062 2051 2041 2014 1988 1988 1988 1989 1990 1965 1939
459 1939 1922 1906 1903 1900 1874 1847 1821 1795 1770 1745 1747 1749 1756 1762 1769 1775 1789 1803 1804 1804 1810 1816 1795 1774 1774 1774 1787 1800 1799 1797 1770 1742 1704 1666 1655 1643 1634 1625 1616 1607 1627 1646 1666 1686 1680
454 1680 1675 1644 1614 1582 1577 1584 1591 1599 1608 1589 1571 1559 1546 1534 1521 1521 1521 1521 1521 1522 1523 1523 1524 1507 1490 1486 1483 1488 1493 1525 1557 1575 1593 1584 1575 1562 1550 1538 1525 1516 1506 1496 1486 1465 1444
448 1444 1423 1402 1405 1407 1409 1412 1412 1413 1400 1387 1378 1370 1388 1406 1429 1453 1464 1449 1419 1389 1370 1352 1339 1326 1313 1300 1302 1304 1293 1282 1256 1229 1230 1230 1243 1255 1254 1253 1259 1265 1283 1301 1299
443 1299 1270 1244 1218 1218 1245 1284 1322 1341 1359 1351 1343 1329 1315 1315 1315 1318 1322 1337 1353 1364 1349 1322 1296 1260 1225 1216 1208 1216 1225 1222 1193 1147 1101 1069 1036 1032 1055 1090 1125 1154 1184
438 1184 1199 1214 1214 1188 1149 1111 1098 1085 1097 1109 1135 1133 1102 1071 1053 1034 1029 1023 1028 1032 1049 1067 1083 1099 1089 1078 1067 1055 1087 1118 1139 1134 1100 1065 1056 1048 1053 1057 1067 1077
433 1077 1100 1123 1127 1130 1107 1083 1077 1071 1077 1084 1089 1093 1097 1102 1118 1135 1151 1166 1157 1122 1076 1031 999 993 998 1004 1015 1026 1036 1047 1032 1017 1003 988 992 997 1010 1010 1000 1017 1033 1022 981
428 981 940 910 905 915 926 937 949 962 976 989 1002 1001 1001 1000 999 982 964 974 983 991 1000 982 963 939 914 915 917 925 933 915 896 881 866 864 862 864 867 882 898 925 953 967 981
423 981 974 966 958 950 935 920 916 939 962 985 1008 1031 1048 1038 1017 995 975 955 935 915 917 920 922 925 928 931 934 937 962 988 1027 1039 1026 986 952 931 916 902 888 875 879 883 888
417 888 892 871 849 841 833 834 835 863 891 912 932 940 947 936 926 902 878 871 863 882 901 917 934 948 963 981 971 950 930 940 951 962 973 975 978 980 983 990 996 1003 1010 1014 1017 994 971
412 971 941 911 907 903 911 918 912 905 913 920 927 935 921 908 894 880 896 911 927 942 939 935 931 928 916 904 905 907 917 928 914 899 881 889 908 928 917 906 908 910 911 912 888 864 859 881
406 881 887 894 893 892 866 840 820 828 864 901 921 941 934 927 922 917 939 961 975 989 990 991 969 948 926 905 886 868 876 885 894 904 914 924 925 926 941 955 976 998 992 987 987 987 973
401 973 960 953 946 953 960 985 1010 1005 974 945 915 910 906 911 917 922 928 910 893 876 859 852 845 838 831 815 799 782 766 764 762 785 808 823 817 796 775 785 794 803 813 821 829 836 844 852 860 868 876
395 876 875 875 874 874 893 912 976 1039 1098 1157 1189 1221 1243 1265 1272 1257 1219 1168 1124 1079 1067 1054 1041 1029 1001 973 972 971 975 979 984 988 985 983 980 977 1002 1027 1026 1024 1023 1021 977 932 885
389 885 851 842 855 884 912 934 925 914 916 909 902 895 888 907 927 961 995 1029 1063 1072 1082 1091 1101 1113 1126 1112 1099 1089 1092 1118 1166 1218 1239 1217 1164 1110 1069 1046 1022 1006
384 1006 990 973 956 943 917 886 877 886 895 905 916 907 897 888 878 864 849 836 823 835 874 897 919 918 890 851 811 802 793 775 731 701 716 766 816 846 876 921 940
380 940 930 920 908 896 900 904 908 912 933 954 975 997 993 990 987 984 957 930 903 876 861 845 829 813 815 817 819 821 829 838 846 855 870 884 899 913 892 870 834 824 858 892 926
374 926 959 974 962 938 914 897 881 891 901 924 948 998 1048 1099 1151 1175 1200 1195 1189 1184 1179 1178 1176 1175 1174 1202 1230 1246 1236 1221 1206 1189 1172 1169 1167 1164 1161 1150 1139 1128 1118
369 1118 1113 1109 1080 1051 1029 1033 1066 1098 1129 1133 1125 1117 1118 1119 1119 1120 1143 1167 1190 1214 1245 1276 1306 1337 1375 1413 1450 1488 1524 1561 1598 1635 1672 1708 1745 1782 1776 1770 1763 1755 1744 1706
364 1706 1640 1574 1495 1443 1418 1393 1372 1325 1266 1207 1174 1141 1108 1075 1042 1009 976 943 910 876 869 862 851 840 829 818 831 845 859 872 886 899 913 927 923 919 915
360 915 911 932 952 973 993 1026 1058 1089 1120 1137 1127 1133 1138 1163 1187 1227 1240 1216 1193 1168 1143 1107 1070 1033 996 959 923 913 904 901 898 895 892 873 854 819 811 811 812 813 815 812
355 812 809 779 749 736 723 712 701 691 709 736 763 766 742 718 721 735 749 738 728 730 746 768 763 731 685 645 605 585 565 572 578 570 562 553 545 557 568 580 591 619 647
350 647 649 650 634 618 629 639 652 664 676 688 706 723 714 705 682 659 621 610 617 624 615 593 582 598 633 654 669 685 700 715 724 734 744 754 746 738 730 723 701 680 670
345 670 686 693 686 682 690 707 723 714 705 694 683 672 661 659 657 654 651 649 620 601 595 617 665 713 734 745 729 702 674 647 646 666 699 729 732 714 682 658 634 610 585 557
339 557 530 531 558 607 643 658 647 641 634 651 668 678 662 618 574 556 566 560 554 554 554 554 553 563 573 583 593 594 594 595 595 567 540 538 536 533 517 495 496 527 558 577 574 571 589
334 589 611 602 563 524 509 494 483 471 473 497 523 536 532 527 523 518 515 512 517 544 572 578 569 583 616 636 626 604 576 569 581 592 577 563 523 483 469 487 513 540 541 543
329 543 551 558 566 573 564 554 544 535 544 553 562 572 592 612 631 650 643 614 597 580 562 544 526 508 508 508 495 505 543 580 589 576 558 563 587 598 591 571 550 542 555 568 555
324 555 541 532 523 514 504 500 496 491 487 489 491 494 496 501 505 497 510 533 543 527 497 471 472 483 495 495 496 496 497 527 556 574 566 554 542 529 515 517 519 521 524 527 530 507 483 448 413 392
318 392 397 424 478 507 509 493 477 459 441 441 442 442 443 457 471 484 496 510 497 474 451 449 473 497 495 482 468 480 491 502 513 524 534 529 523 517 511 482 453 451 449 447 445
312 445 444 442 457 471 486 501 502 503 477 451 452 453 453 454 468 483 498 512 515 518 521 524 504 485 465 445 431 417 430 442 464 486 508 530 508 486 463 441 435 428 421 414 406 397
307 397 388 380 376 372 380 415 453 492 505 519 520 521 523 524 510 496 482 468 454 441 427 413 423 433 444 454 472 491 483 475 454 433 412 391 402 413 423 434 433 431 430 428 445
302 445 462 479 495 500 504 482 460 453 446 438 431 421 412 403 395 413 453 473 462 434 420 422 425 430 435 413 391 356 322 319 338 347 356 366 377 371 366 362 357 374 405 414 401 393 385 376 366
296 366 372 378 410 442 467 492 490 489 485 482 478 475 450 425 426 427 422 404 381 379 392 405 419 433 427 421 415 409 420 431 442 453 473 492 485 478 473 469 465 461 440 419 425 431 441 452 462
290 462 472 483 494 517 518 492 466 439 412 413 415 416 418 412 406 400 394 380 365 378 390 394 398 402 405 409 413 417 421 451 482 501 493 467 441 440 439 446 452 459 466 450 434 418 402 402 401 402 404
284 404 409 441 490 526 532 512 463 413 385 384 394 404 404 404 430 457 478 499 510 494 475 469 481 493 477 460 445 430 409 415 441 480 521 536 529 509 498 487 475
280 475 464 452 440 429 418 396 387 398 436 474 485 487 488 491 493 485 450 405 374 370 379 380 380 382 383 379 375 370 366 387 409 404 398 401 404 408 411 421 431 441 451 460 469 451 433 426 419 398
274 398 378 371 364 384 403 422 441 449 429 402 375 373 371 371 371 372 372 401 431 475 492 479 466 450 435 431 427 423 419 431 444 456 468 451 434 417 399 386 373 346 320 309
269 309 299 315 332 345 359 360 360 359 358 343 329 317 304 319 333 341 349 343 338 322 307 318 329 344 359 386 412 433 428 410 393 370 347 335 350 374 398 423 448 458
264 458 468 452 436 405 375 371 368 367 367 367 366 359 351 328 332 362 393 398 403 408 413 446 478 485 493 474 455 438 422 432 443 441 440 411 383 376 368 374 380 384 387 390 394 389 385 381 376 396 417 437
258 437 457 454 452 449 447 418 389 389 416 456 482 473 464 464 464 464 463 437 410 393 403 420 410 391 373 378 409 433 444 437 431 437 443 442 442 415 389 366 343 328 326 338 377 426 476
252 476 495 488 454 419 389 385 394 431 481 517 518 491 450 436 440 458 474 476 473 469 474 465 436 380 321 288 285 309 324 325 335 346 359 372 386 399 408 417 426 435 432 430 428 426 418 411
246 411 404 396 400 404 408 412 399 387 374 362 362 363 363 363 350 337 341 359 385 384 366 361 376 404 433 449 442 436 428 421 420 419 418 417 423 428 434 440 438 436 434 432 441 450 460 469 469 469 468 468 468 468 468 468 449
240 449 430 411 393 396 400 404 408 425 442 433 423 411 399 388 376 390 405 393 381 369 357 372 387 406 425 443 462 472 482 491 501 478 455 432 409 373 336 313
235 313 316 332 363 402 415 408 400 391 382 378 373 369 365 369 373 377 381 373 364 313 261 258 281 289 297 321 346 371 396 406 415 424 434 430 426 422 418 391 364 339 314 297 307 327 346 355 338 309
229 309 279 269 259 275 291 306 322 337 352 342 332 323 313 299 285 298 311 313 315 316 318 325 332 313 293 314 336 357 378 388 399 382 366 368 370 373 376 378 393 416 412 372
224 372 332 309 331 372 399 401 390 388 399 409 406 400 395 415 435 450 465 478 492 484 449 396 357 338 332 331 356 397 426 427 415 415 429 442 442 432 435 456 478 471 465 458 451
219 451 446 441 436 431 417 403 389 374 344 314 284 254 208 174 179 211 260 295 295 295 298 302 305 309 298 287 277 266 265 263 262 260 266 271 276 281 278 275 272 269 281 293 306 318 322 326 331 335 350
213 350 365 355 346 330 342 381 420 444 440 408 375 339 303 296 316 345 375 380 385 378 371 364 357 372 386 375 363 351 339 354 368 394 419 444 470 474 478 456 434 409 383
208 383 358 332 307 281 267 280 307 334 335 337 347 357 367 377 375 372 369 367 356 346 321 322 342 362 383 405 400 395 391 386 376 367 357 347 332 316 327 338 341 344 347 350 348 345
202 345 343 341 347 353 360 366 382 399 387 349 311 299 331 363 387 385 371 357 354 350 347 344 358 373 388 402 408 413 391 370 372 374 375 377 389 400 411 422 415 408 400 393 392 391 390 389 392 396 399
196 399 402 413 425 409 394 371 348 325 301 290 280 295 311 332 354 374 394 412 403 383 363 356 349 344 338 353 394 428 449 444 438 432 427 425 436 456 449 421 406 409 412 401
191 401 390 378 367 383 400 416 432 420 407 395 382 383 384 386 387 378 370 362 354 347 341 361 381 383 385 360 335 315 296 302 309 320 331 359 401 435 442 429 402 385 381 369 357
186 357 359 362 364 366 373 381 388 395 411 426 431 409 384 373 395 418 419 393 367 368 393 417 432 420 397 374 349 324 326 328 331 333 333 333 332 332 332 332 332 333 336 351 375 371 348 324 299 273
180 273 264 254 271 288 312 337 360 384 393 379 352 324 306 287 268 249 243 237 244 273 308 329 340 338 345 351 357 364 368 372 377 381 381 380 380 379 394 409 410 389 366 355 363 370 364 357 350
174 350 343 350 357 389 421 437 421 397 373 367 361 355 349 349 349 376 403 423 443 437 430 425 419 414 408 410 412 413 415 405 395 386 376 367 358 348 339 341 342 344 346 354 363 371 380 377 375 372 370 369 368 367 366 349 331
168 331 340 350 359 368 364 337 308 292 294 296 284 271 272 295 317 325 315 306 282 259 262 265 266 267 254 242 269 296 323 350 363 375 361 347 339 332 324 317 308 299 316 332 317 276 235
162 235 221 238 255 274 292 288 283 279 274 256 237 219 201 199 197 207 243 291 327 334 328 337 346 354 363 368 373 379 384 387 390 394 397 416 435 443 424 403 382 394 420 441 435 418 402 395 388
156 388 368 348 335 322 296 270 256 242 242 241 269 296 310 324 336 348 359 371 353 335 317 299 297 294 291 289 313 337 344 337 338 365 402 438 444 423 390 357 335 313
152 313 289 292 306 320 308 297 286 275 265 256 270 312 340 343 328 327 344 360 362 363 364 366 347 329 310 291 285 278 298 319 346 374 375 376 380 384 388 392 381 370 386 401 403 406
146 406 408 410 387 364 368 371 374 376 379 381 389 396 377 358 328 298 279 288 309 331 328 325 337 349 361 373 377 382 360 338 314 291 280 295 312 330 304 279 274 269 263 258 258 259 261 263 286
140 286 336 386 409 404 398 392 385 377 369 362 354 353 352 337 323 307 292 303 315 316 316 317 318 343 368 366 364 349 333 330 328 353 378 389 401 406 410 415 420 396 371 346 321 308 294 280
135 280 266 290 314 338 362 353 344 335 326 323 321 319 316 312 308 304 300 306 313 320 327 343 358 374 389 385 380 363 345 329 313 308 330 344 359 349 338 337 336 362 388 405 423 429 408 373
129 373 339 314 317 323 329 311 292 277 262 260 258 270 282 293 305 333 362 378 368 351 334 328 323 331 338 333 327 323 319 315 311 310 309 308 306 296 285 275 264 250 236 248 261 285 310
124 310 334 359 394 429 453 450 439 428 390 353 310 294 308 322 347 372 383 395 407 420 448 449 428 407 384 362 341 320 326 332 323 314 305 296 315 334 353 372 372 372
119 372 359 346 332 319 348 377 415 426 426 426 433 440 421 401 387 372 371 370 370 371 359 348 337 352 368 356 334 313 316 319 313 308 303 297 297 297 296 296 296 295 295 295 302 309 316 323 315 307 298 290
113 290 280 271 261 251 242 232 222 213 220 227 234 241 236 230 238 246 253 260 292 325 348 345 330 316 314 312 310 308 304 301 297 294 314 335 356 377 390 402 415 427 420 413 380 346 336 325 328 331
107 331 314 297 280 263 275 288 313 339 349 359 343 326 308 290 274 258 264 296 303 284 250 243 263 283 310 338 365 393 390 387 384 381 374 367 360 353 366 380 393 406 394
102 394 382 369 357 339 321 288 282 290 298 295 292 300 309 291 273 259 245 244 243 233 223 227 230 239 247 269 291 320 349 365 381 372 363 356 349 335 348 373 398 387 377 367 357 356
96 356 355 354 353 343 334 338 342 343 344 318 292 279 266 267 267 277 286 295 305 337 368 373 378 372 366 360 354 365 376 375 347 299 250 211 199 201 204 208 212 228 245 262 278 290 303 315 327
91 327 320 313 306 299 301 304 320 335 337 339 366 392 415 411 377 343 330 316 330 343 353 364 361 358 365 372 366 360 342 324 306 287 282 277 299 321 328 335 342 349 344 338 333 328 330 331 350 381 399
85 399 372 320 281 271 274 278 269 265 261 256 252 272 291 311 331 338 345 352 359 343 327 293 246 196 174 189 217 243 254 266 291 333 360 360 346 321 295 270 244 235 226 217 209 225
79 225 242 259 276 287 297 273 234 197 185 195 217 248 266 266 265 282 299 316 333 329 324 319 315 305 296 286 276 274 271 268 265 261 258 254 250 241 231 216 214 251 315 364 413 456
74 456 487 495 477 449 421 391 361 304 246 218 215 224 220 206 179 166 166 177 201 219 237 256 275 289 303 317 330 323 316 308 301 293 286 278 271 293 314 336 358 364 370 376 382 389 396
68 396 418 413 394 376 355 335 329 323 318 312 299 287 274 262 264 265 267 269 250 232 215 198 189 206 208 211 214 218 222 226 237 247 258 269 268 268 268 267 264 262 259 256 264 273 281 289 298 307 316 325 334 343 352
62 352 361 351 341 331 320 309 298 296 281 261 268 258 249 257 265 274 282 292 302 310 318 317 290 277 264 260 256 252 248 224 201 172 156 173 216 246 275 281 288 295 301 305 308 312 315 321 327 357
56 357 388 409 403 367 332 291 250 210 171 142 136 155 186 217 248 254 259 249 240 230 221 221 221 220 220 241 263 284 305 310 316 321 327 324 321 318 314 305 295 268 227 189 174 198 236
51 236 254 250 260 269 264 258 253 247 266 285 304 323 320 317 315 312 304 296 275 277 296 315 335 356 347 339 332 325 320 338 342 345 335 302 276 263 272 303 323 343 345 348 351 354 327 300 286 295 308
45 308 299 261 223 207 214 234 255 279 304 328 352 359 366 373 380 405 430 428 395 359 323 311 300 304 308 313 318 331 357 389 399 408 431 443 455 454 430 420 409 396 384 372
39 372 360 368 377 386 395 388 382 375 368 365 362 359 356 364 372 380 388 384 380 376 372 352 332 313 293 279 265 251 237 239 240 242 244 247 251 254 258 255 252 248 245 238 231 223 214 216 203 184 192 212 245 289 306 302 325
33 325 346 341 324 306 287 268 269 269 270 271 278 286 293 300 292 284 275 267 284 300 314 329 330 304 293 282 280 279 277 275 302 329 356 383 391 399 407 415 407 399 365 330 289 248 236 251 275 299
27 299 325 351 374 396 418 441 426 410 395 380 364 349 333 318 336 354 371 388 369 338 298 286 295 305 316 327 320 313 307 300 287 273 260 247 252 257 262 267 287 308
22 308 329 349 354 358 363 367 351 336 320 305 287 270 253 235 227 219 212 205 193 195 218 269 299 330 363 396 398 400 403 405 392 378 365 352 343 334 326 317 308 300 327 367 383 372 369 380
16 380 382 385 404 395 374 352 329 306 307 309 310 311 307 303 299 294 301 308 315 322 308 294 280 267 260 253 246 239 236 234 232 230 234 239 243 248 250 253 256 259 283 319 362 379 363 335 314 293 294 322 333 344
10 344 330 289 265 240 245 277 300 310 312 301 289 290 289 276 271 266 259 253 246 240 253 267 280 293 292 290 289 287 292 297 302 308 307 307 307 307 291 276 260 245 256 268 280 292 293 294 295 296 302
4 302 308 314 319 314 309 304 299 277 255 233 211 249 287 325 363 374 385 394 404 389 353 316 302 301 299 313 304 289 286 283 267 267 281 286 291 304 316 329 341 327 313 299 285 296
-1 296 306 316 327 316 306 296 286 286 298 290 260 230 222 245 267 280 293 306 318 325 331 337 343 330 316 302 289 279 268 258 248 258 268 279 290 289 302 320 316 300
-6 300 284 297 332 355 356 345 333 317 302 287 271 281 290 300 309 319 328 336 344 334 298 262 253 257 261 241 220 229 239 248 257 262 268 274 280 292 304 289 275 258 240 250 259 286
-12 286 312 311 283 257 257 285 313 327 341 354 368 364 361 357 353 335 316 298 279 272 264 257 249 261 272 284 295 318 341 363 386 401 415 430 445 432 419 407 394 376
-17 376 358 367 376 389 403 417 430 415 399 383 368 367 367 367 367 347 326 306 285 297 309 294 279 254 228 230 231 216 200 185 169 183 196 210 223 232 240 222 204 212 220
-22 220 227 235 236 237 238 239 241 243 270 297 329 335 310 286 273 261 248 235 242 249 256 263 280 296 299 280 265 264 253 243 248 254 259 264 258 252 246 240 253 265 278 290 278 267 255 243 239
-27 239 234 230 226 233 240 247 254 252 250 248 246 229 212 209 227 245 249 236 223 226 228 231 234 247 260 274 287 286 286 285 285 266 248 256 264 263 263 263 263 266 269 272 275 293 311 303 294 274 254 234 214 201
-34 201 188 175 161 157 153 175 197 237 263 266 246 228 223 235 248 259 270 280 290 292 273 265 258 266 275 283 292 320 349 352 323 282 254 236 230 225 207 190 187 191 210 234 236 210
-39 210 184 202 247 301 328 335 329 313 298 281 265 274 284 294 304 291 279 267 255 258 262 265 268 260 251 242 234 252 270 289 307 311 315 293 270 257 243 257 270 283 295 281
-44 281 266 258 249 240 232 244 256 268 280 268 256 243 231 236 240 245 250 238 225 240 255 271 288 278 267 252 237 223 209 211 227 225 196 167 150 162 188 216 257 306
-49 306 328 304 268 237 206 205 205 231 257 275 293 311 329 337 344 352 359 338 317 295 274 266 258 250 241 240 239 237 236 246 257 267 277 277 276 275 275 261 248 234 221 210 200 217
-54 217 233 250 267 257 248 228 209 217 224 221 219 216 213 238 262 287 312 300 287 302 316 304 292 280 269 269 269 269 269 269 269 269 269 269 268 268 267 247 227 236 272 328 383 411 412 408
-60 408 404 372 340 302 265 255 244 243 241 266 291 322 352 356 360 347 334 321 308 287 266 245 223 232 241 276 311 350 389 400 412 406 401 368 336 301 267 245 249 254 260
-65 260 268 275 266 257 248 239 236 234 231 229 214 198 183 168 159 151 142 133 133 132 132 131 162 192 195 199 189 180 170 161 183 205 227 250 239 229 218 208 191 174 157 140 143 147 151 154 172 189
-71 189 207 224 242 259 249 240 252 264 276 288 282 276 270 264 269 275 280 285 263 241 219 198 191 185 179 173 190 208 226 243 244 245 271 297 321 318 303 288 273 258 243 227 221 215
-76 215 209 202 196 190 184 177 202 227 253 278 278 279 280 280 276 272 268 264 255 245 236 227 209 192 186 206 234 263 281 273 262 251 238 225 196 166 148 157 164 171 153 135 120 105 89 74
-82 74 82 90 124 159 187 215 216 217 230 243 256 269 296 322 322 322 313 304 295 287 276 266 256 245 230 214 199 183 183 183 183 183 176 169 162 155 163 172 180 188 198 208 231 231 219 207 194
-88 194 181 177 173 169 165 155 146 137 128 132 137 166 196 222 227 217 207 194 182 171 159 154 171 175 180 186 191 197 203 220 237 254 271 269 267 265 263 245 228 210 192 193 193 193 193 205 216 228
-94 228 239 228 217 206 195 192 189 186 183 173 162 178 195 202 210 218 226 230 234 238 242 246 250 254 258 245 232 218 205 219 232 245 257 269 258 233 209 209 209 208 208 206 204 201 199 191 183 189 217
-100 217 251 272 270 246 224 202 180 158 143 151 173 195 198 202 205 209 189 169 176 183 195 207 219 231 237 244 250 257 279 300 295 290 274 258 241 225 215 204 204 230 269 282
-105 282 249 217 196 176 157 138 112 112 124 136 135 134 160 186 202 218 234 250 248 245 243 241 227 213 198 184 179 175 170 165 177 188 173 158 144 130 116 102 93 85 103
-110 103 122 125 128 132 135 135 135 136 136 134 133 132 130 155 180 178 176 172 168 164 160 139 118 127 162 193 225 256 287 299 283 256 229 226 223 220 218 236 254 272 290 287 284 254 224 212 200
-115 200 215 229 233 236 213 190 175 159 171 182 201 220 239 258 262 267 271 276 255 235 215 195 212 230 247 264 281 298 301 282 255 241 244 248 253 258 263 268 278 288 262
-120 262 223 204 206 203 186 177 167 156 145 129 113 123 134 154 173 166 159 161 162 164 165 168 171 148 125 115 126 152 178 179 179 180 181 183 185 187 190 198 207 215 224 243 263 282 302 317
-126 317 332 347 362 344 326 307 289 270 251 232 213 194 175 156 137 141 146 151 155 171 187 201 216 203 167 138 122 120 131 160 190 201 191 168 144 132 141 165
-131 165 188 212 235 232 229 200 172 143 114 115 116 117 118 150 181 212 242 266 267 245 210 177 157 155 153 139 124 110 95 89 83 78 73 85 118 147 162 162 162 162 163 168 195 216
-136 216 225 217 195 172 161 143 103 69 49 37 38 34 29 36 65 89 100 98 96 120 143 140 136 133 129 134 138 143 148 149 150 151 152 154 157 159 162 160 157 181 205 208 210 213 215 208 200 192 184 196 208 194
-143 194 179 193 206 193 180 163 146 130 115 102 111 144 191 230 257 260 241 232 236 231 226 225 225 225 224 202 180 158 136 114 92 97 102 126 150 174 199 193 187 181 175 145 115
-148 115 112 109 112 116 119 123 118 112 134 156 162 169 175 182 169 156 144 133 144 181 210 225 222 205 195 185 171 156 168 180 179 177 176 174 175 176 203 230 227 224 221 218 217 215 214 213 205 198 182
-154 182 179 178 150 131 124 115 107 99 91 76 61 47 32 41 49 57 66 82 99 89 79 77 75 72 70 99 129 147 138 130 122 113 104 104 104 147 190 214 211 196 181 175 168 161 154 158 162 139 116
-160 116 128 141 153 165 171 176 182 188 187 185 184 183 180 177 173 170 168 166 165 163 149 136 147 159 154 124 93 89 100 110 96 82 71 61 51 40 33 26 19 12 27 42 57 71 66 60 65
-165 65 97 138 165 164 150 144 138 131 124 111 97 84 70 59 48 81 113 161 196 209 196 173 165 182 212 224 208 208 209 200 191 183 174 156 138 120 102 93 84 102 119 148
-171 148 177 179 182 205 228 250 272 297 309 299 263 196 128 89 76 85 94 104 114 131 147 163 180 171 163 155 147 149 151 154 156 165 173 182 191 173 155 137 119 121 122 124 126 146 165
-176 165 184 204 194 185 175 166 167 169 170 171 155 140 124 108 126 145 146 133 134 162 181 187 181 174 167 160 155 150 144 139 116 93 97 100 121 141 161 182 203 225 220 216 206 196 186
-182 186 176 201 226 251 276 272 268 264 260 256 252 249 245 228 210 168 125 109 120 116 111 107 103 98 94 108 122 136 150 139 129 119 108 113 118 123 128 133 138 144 149 155 161 167 173 183 193 177
-187 177 160 154 148 142 136 114 91 95 99 104 109 114 119 119 119 119 119 119 118 118 117 140 162 184 207 225 243 235 226 217 208 200 191 185 180 175 169 149 129 135 141 121 101 82 62 69 76 110 144 152 160 143
-194 143 126 100 100 128 156 183 184 173 162 149 136 122 109 131 152 198 244 270 270 258 246 234 221 182 143 113 82 53 24 18 39 72 104 119 133 121 108
-198 108 92 76 60 44 28 12 -2 -16 -22 -1 31 64 77 91 130 169 206 217 215 214 216 217 218 219 207 195 157 120 108 121 163 205 229 226 212 198 180 162 129
-203 129 123 134 146 132 119 101 82 64 45 58 71 84 97 99 100 102 104 92 80 68 57 72 87 103 118 107 97 129 161 183 179 146 112 102 92 82 72 49
-208 49 25 3 -18 -13 18 34 51 38 25 11 -1 -16 -31 -20 -9 7 23 40 56 67 78 89 100 96 92 87 83 84 86 87 89 103 117 157 197 214 232 222 213 207 201
-213 201 196 190 196 203 183 163 136 109 109 109 116 124 131 138 141 143 146 148 166 184 202 221 211 202 193 184 150 116 108 101 90 80 96 112 129 146 137 128 115 102 89 76 70 64 58 53 47 41
-219 41 35 29 28 28 27 27 19 12 5 -1 12 26 40 54 68 81 95 109 105 101 97 93 71 49 27 4 6 7 36 64 92 120 122 123 120 116 113 109 97 85 73 61 60 59 57 56 54 51 76
-225 76 100 126 152 151 150 137 124 111 98 97 96 96 95 94 93 92 91 85 79 74 68 89 111 121 104 63 22 8 22 35 47 35 23 19 15 37 60 65 71 77 83 72 61 50 39
-230 39 39 39 64 89 115 115 85 55 40 25 37 48 71 94 91 87 94 100 105 110 101 66 48 30 19 36 37 38 50 62 58 80 102 98 110 122 124 126 128 130 121 112 103 94 104 113 122
-236 122 131 126 121 116 112 106 101 122 143 174 205 192 179 173 166 160 154 165 175 186 197 186 174 163 151 140 128 117 105 97 90 82 74 91 107 124 141 135 129 123 117 100 82 65
-241 65 48 36 23 -4 -5 29 64 75 85 75 65 82 127 154 154 138 135 155 188 223 243 242 241 239 237 220 202 185 168 151 133 116 99 93 88 83 78 94 122 159 169
-246 169 158 161 163 151 134 118 102 85 47 22 18 41 52 50 57 64 78 92 106 120 139 158 192 200 182 163 144 124 120 116 111 107 110 113 117 120 138 157 176 195 195 195 195 195
-252 195 188 182 175 169 185 201 217 232 233 233 233 234 204 175 145 115 101 87 73 59 35 11 -13 -37 -32 -28 -23 -19 2 23 60 70 68 79 82 84 97 111 125 138 132 126 120 113
-257 113 131 148 164 180 173 139 121 102 106 110 115 119 123 127 131 135 136 138 139 140 156 173 188 203 189 148 123 97 70 42 17 -8 -6 21 34 47 62 77 92 107 103 100 96
-262 96 93 93 94 94 95 129 162 166 144 124 104 108 113 117 120 81 42 10 6 12 19 46 73 101 128 122 115 124 106 92 79 63 47 39 30 21 12 -1 -15 -44 -46 -17 12 43 74 87
-268 87 99 112 125 113 101 90 78 64 51 22 20 38 56 76 95 135 175 186 170 145 121 94 68 47 25 47 68 74 54 34 40 53 67 97 101 113 125
-272 125 134 142 137 105 90 75 68 87 91 95 100 104 109 113 129 145 160 176 154 131 109 87 75 64 53 42 50 58 66 74 71 67 64 61 60 58 57 56 65 75 85 94 106 117 128 139 133
-278 133 128 134 119 98 76 41 28 54 79 106 133 123 112 101 90 73 55 39 23 37 72 94 116 127 116 117 118 90 62 35 9 -15 -18 9 37 55 51 17
-283 17 -17 -43 -47 -28 4 34 50 48 46 61 76 91 106 95 85 75 65 55 45 35 25 36 47 71 73 55 37 5 -4 21 47 72 98 108 95 95 94 74 53
-288 53 32 12 15 19 22 25 34 30 21 33 40 46 54 61 58 54 51 47 55 62 70 77 61 45 29 13 17 21 25 29 48 66 85 103 111 118 126 133 119 105 78 74 103 133 164 195 207 218 230
-294 230 242 234 225 216 207 200 180 155 152 152 151 152 152 141 129 117 105 93 82 71 60 85 123 166 187 174 160 157 133 95 58 7 -21 -16 -11 -4 2 -2 -7 -12 -16 2 22 66
-299 66 110 141 140 112 84 56 29 2 -23 -20 5 18 31 51 72 93 114 113 112 119 114 114 137 146 155 162 168 174 180 158 135 113 90 88 86 84 82 87 92 97 103 110 131 157 160 144 128
-305 128 110 92 86 80 74 68 73 78 83 88 97 106 115 124 126 128 131 133 124 115 106 97 77 57 37 17 16 14 13 12 17 23 28 34 52 70 100 108 82 43 19 27 59 90 92 72 53 34 14 -5
-311 -5 6 18 29 41 39 37 35 33 29 25 38 65 100 112 101 77 63 62 53 43 39 34 30 25 39 52 66 79 81 84 86 89 86 84 81 78 87 96 104 113 105 97 89 81 67 53 38 24 30 37 44
-317 44 50 39 27 26 10 -16 -12 16 46 68 90 85 80 72 63 54 46 55 65 75 84 104 123 142 160 154 126 98 92 94 95 98 101 88 75 63 50 49 47 46 45 46 48 67 100 124 121
-323 121 92 62 73 111 141 157 163 156 137 106 71 62 73 98 116 108 82 69 71 73 77 81 84 100 125 123 129 149 160 171 176 182 188 194 171 148 125 102 85 69 53 36
-328 36 35 35 34 33 35 37 39 41 43 45 47 49 37 24 12 0 16 32 48 65 77 89 101 114 97 81 66 51 50 75 94 99 117 149 170 191 196 173 167 160 154 161 174 161 133
-333 133 92 42 19 24 42 54 66 66 65 64 63 31 -1 -4 19 43 66 65 64 47 31 15 0 0 13 20 26 38 51 76 78 76 74 57 63 108 152 198 243 255 254 261 268 244
-339 244 221 198 175 150 124 107 76 27 -9 -27 -15 20 42 38 20 14 21 20 19 26 33 40 47 53 60 73 74 59 44 21 11 22 33 47 60 67 88 113 117 113 110 105 101 98
-344 98 95 92 89 86 83 81 78 85 93 100 108 95 81 77 59 41 46 36 26 33 27 16 27 41 55 79 89 88 100 111 108 98 88 69 64 57 37 18 12 14 16 1 -27 -51 -62 -44
-350 -44 -13 13 41 55 48 41 35 27 19 37 55 72 89 97 83 74 79 98 116 109 102 84 66 75 111 155 172 161 151 146 141 137 132 108 84 60 36 18 1 -15 -33 -9 13
-355 13 37 60 83 106 119 105 86 94 112 130 108 86 65 43 27 10 -3 -18 -17 10 48 85 100 87 77 66 46 26 31 36 39 14 -19 -53 -62 -44 -15 14
-360 14 40 66 66 65 53 40 54 68 83 97 67 37 18 0 7 14 8 1 -18 -38 -24 -11 2 15 12 9 6 3 16 30 43 56 60 64 82 99 111 123 91 59 37
-365 37 16 21 26 24 22 21 19 16 12 8 4 12 19 27 34 28 21 15 9 1 -5 13 32 48 63 68 46 22 11 11 24 34 45 43 41 40 39 51 63 45 26 -4 -36 -68 -101 -104 -81 -52 -22
-371 -22 -18 -14 -8 -3 27 57 60 37 -3 -30 -34 -11 17 33 18 3 -2 19 30 29 29 42 63 84 105 126 117 95 66 64 92 120 137 154 148 142 111 80 47 40 45 50 53 57
-376 57 61 64 71 77 57 37 18 0 -6 -12 -5 1 8 15 21 28 61 94 109 125 113 101 95 89 83 77 59 40 21 3 16 29 42 55 81 107 121 109 90 71 77 82 105 127
-382 127 123 119 115 111 80 49 20 -9 -12 -15 -13 -10 -8 -6 -33 -60 -75 -64 -41 -17 7 32 23 14 4 -4 15 34 54 73 61 48 36 24 38 53 83 86 70 54 37 19
-387 19 17 15 13 11 13 15 18 20 11 2 -6 -15 -4 5 16 27 53 78 77 77 73 69 65 61 70 80 90 100 94 87 81 74 62 50 64 79 97 115 106 97 96 94 93 91 56 20 11 3 -8 -19 -30
-393 -30 -41 -60 -79 -86 -67 -31 4 -2 -8 -11 -14 8 32 46 60 48 35 36 37 38 39 31 24 17 9 15 21 28 36 36 63 90 90 57 24 34 44 44 45 45 46 66 85 120 128 118 108
-399 108 96 84 100 116 132 148 129 109 90 71 59 46 7 -31 -45 -58 -71 -84 -73 -62 -51 -41 -41 -41 -42 -42 -23 -4 13 32 34 35 37 38 62 86 83 81 80 80 80
-404 80 79 95 112 114 94 73 51 30 8 8 29 46 49 43 37 30 23 3 -15 -6 1 35 82 113 112 87 62 62 61 42 22 16 32 43 40 47 53 39 25 10 -3 6 16 0
-409 0 -16 -17 -19 -20 -22 -2 17 37 57 54 51 48 45 45 44 70 97 95 94 92 91 103 115 113 90 51 26 24 45 65 85 106 126 101 63 45 49 46 19 0 -6 6 18 32 45
-415 45 70 94 84 60 41 44 60 77 75 73 71 69 74 79 84 89 98 107 90 73 72 71 70 70 52 33 42 50 67 84 92 114 132 128 110 93 90 88 67 34 0 -12 -2 21 37 41
-420 41 44 60 85 96 79 49 20 5 1 10 23 37 24 12 -5 -22 -13 -4 2 8 15 21 14 7 0 -7 -12 -18 -23 -29 -44 -59 -60 -39 -8 22 20 4 -2 13 24 21 17 25 33 28 20 12 2
-426 2 -6 10 27 44 61 64 67 70 73 72 70 96 121 107 93 79 65 70 75 80 86 55 24 -6 -37 -50 -63 -50 -36 -13 9 32 55 54 53 53 52 30 7 -1 11 36 48 50
-432 50 38 10 -17 -20 -23 -23 -36 -54 -50 -17 15 19 1 -16 -11 5 22 30 38 46 53 39 25 10 -3 6 16 27 38 50 74 102 108 89 49 11 -12 -18 -25 -30 -36 -20 -5
-437 -5 10 26 60 94 102 79 47 28 27 26 26 27 27 28 -2 -34 -51 -46 -47 -48 -48 -48 -41 -35 -28 -21 -13 -5 -24 -43 -62 -81 -73 -65 -49 -34 -18 -2 3 9 15 21 28 34 40 46 33 19 5 -8
-443 -8 -19 -31 -43 -54 -45 -35 -51 -68 -72 -77 -81 -85 -82 -78 -50 -21 -9 -19 -28 -16 12 41 58 52 57 62 66 70 71 73 75 77 63 49 35 21 22 24 25 27 27 27 27 28 21 15 8 2 5 8 12 15
-449 15 24 34 44 54 68 81 95 109 93 78 63 48 41 34 27 20 14 7 1 -3 11 52 77 101 114 100 74 48 8 -31 -51 -27 19 66 86 79 64 49 32 16
-454 16 25 34 43 53 55 57 59 61 53 44 35 26 17 9 0 -7 -9 -11 29 70 84 72 48 24 -3 -31 -57 -83 -77 -45 -29 -13 -13 -39 -64 -64 -45 -26 -8 10 10 -15 -26 -37 -44 -50 -56
-460 -56 -62 -40 -17 4 27 26 25 25 24 39 54 68 83 84 84 85 85 111 136 131 103 84 79 91 102 98 93 88 83 55 28 2 -23 -24 -4 11 14 19 24 16 30 51 73 95 117
-465 117 107 83 55 49 53 58 38 17 -15 -48 -50 -30 -4 8 3 -1 -6 -12 -43 -74 -72 -48 -28 -22 -20 -17 -15 -14 -5 2 11 19 38 56 74 93 82 71 61 50 38 25 13 0
-471 0 3 6 10 13 39 78 121 141 119 66 23 -6 -13 -8 -9 -10 -10 -10 -10 -11 -17 -23 -30 -36 -27 -18 -9 0 12 24 36 48 18 -10 -40 -70 -63 -56 -48 -41 -49 -57 -66 -74 -61 -48 -36 -23 -4 15
-477 15 34 54 65 75 71 94 123 152 157 161 156 150 145 140 121 102 58 14 -12 -12 0 10 0 -9 -19 -29 -37 -45 -54 -62 -43 -24 -5 12 18 23 2 -18 -14 -11 -8 -5 14 34 27
-482 27 20 -3 -28 -25 -23 4 32 33 34 28 21 15 8 8 9 9 9 8 6 5 3 13 23 23 -3 -26 -22 8 40 51 62 47 32 8 -14 -26 -12 21 54 78 75 57 38 19 0
-488 0 -17 -34 -50 -67 -57 -46 -36 -25 -8 8 -1 -10 -21 -31 -41 -51 -34 -16 0 18 24 31 37 43 55 67 78 90 75 61 46 32 29 26 -3 -33 -73 -112 -105 -71
-493 -71 -23 24 42 38 29 19 8 -2 -4 -6 -8 -10 -12 -13 -15 -17 -7 2 11 20 16 -10 -49 -88 -100 -90 -66 -41 -22 -3 -11 -19 -42 -66 -64 -61 -66 -72 -78 -83 -82 -81 -53 -25 -12 0 13
-499 13 26 28 30 32 34 24 13 37 75 95 93 96 113 148 184 189 171 136 100 89 79 62 44 27 10 6 1 -2 -6 -26 -46 -66 -85 -58 -30 -2 25 45 65 50 21
-504 21 5 11 31 50 64 78 92 107 99 91 83 75 60 46 31 16 24 31 39 46 60 74 89 103 82 62 41 21 -14 -49 -58 -67 -46 -26 -5 15 12 9 6 3 1 -1 -15 -30
-509 -30 -44 -36 -14 6 8 10 11 13 10 6 3 0 -11 -22 -33 -44 -44 -44 -45 -45 -31 -18 -5 8 20 33 45 58 73 88 102 94 62 31 11 14 16 5 -10 -25 -20 -15 3 21
-514 21 23 24 25 27 13 0 -38 -77 -113 -127 -117 -93 -67 -42 -30 -40 -61 -81 -90 -99 -102 -106 -84 -61 -47 -33 -19 -4 -9 -13 -17 -21 -6 8 23 37 61 84 81 77 81 85 89 94
-520 94 78 62 46 30 7 -14 -10 -6 -6 -5 -4 -3 16 35 67 98 125 130 120 111 88 65 42 18 6 -6 7 21 26 31 9 -12 -10 -7 7 22 20 18 2 -13 -7 -2 15
-525 15 34 30 26 22 18 8 -1 -11 -20 -37 -53 -70 -86 -87 -88 -63 -37 -20 -3 -31 -58 -75 -91 -81 -71 -67 -62 -71 -80 -76 -73 -57 -40 -23 -7 -4 0 -5 -10 10 32 52 71 65 58
-530 58 37 15 20 26 28 30 19 8 4 1 11 21 26 31 22 14 27 41 41 41 48 55 49 43 34 24 42 59 77 96 88 80 52 24 41 58 58 58 58 58 34 10 -14 -38 -38 -37 -10 16
-536 16 43 70 70 71 67 64 61 57 63 69 76 82 93 105 117 128 116 103 90 78 61 44 27 11 -5 -22 -38 -54 -43 -18 12 18 5 -6 -20 -34 -34 -34 -43 -38 -40 -69 -96
-542 -96 -98 -91 -84 -75 -66 -64 -62 -60 -58 -41 -24 -7 8 25 42 59 76 76 77 77 77 62 47 32 18 34 63 100 111 108 105 101 96 81 66 67 41 23 18 4 -9 -13 -17 -21 -24 -44 -63
-547 -63 -81 -98 -88 -52 -30 -9 -10 -11 -12 -13 -13 -13 -13 -12 -12 -11 -19 -14 -13 -39 -49 -60 -65 -70 -75 -81 -91 -101 -111 -121 -106 -78 -43 -34 -36 -39 -43 -47 -11 24 60 97 106 115 98 81 47
-553 47 13 8 29 64 86 97 95 74 39 11 -16 -15 -13 -12 -11 13 39 65 90 83 77 70 63 32 0 -30 -61 -55 -49 -43 -37 -38 -39 -39 -40 -29 -17 -6 4 0 -3 -7 -11 -34 -57 -80
-559 -80 -103 -98 -92 -86 -80 -76 -72 -68 -64 -62 -60 -33 -7 16 13 -18 -50 -46 -43 -39 -35 -34 -33 -32 -31 -24 -16 -9 -1 -10 -19 -29 -38 -45 -53 -76 -71 -53 -35 -15 5 13 22 31 40 28 16 4 -7 -19 -31 -43
-565 -43 -56 -70 -85 -97 -110 -118 -99 -95 -91 -86 -80 -75 -69 -44 -19 -21 -51 -77 -77 -49 -21 -26 -31 -35 -40 -44 -48 -52 -56 -67 -77 -88 -99 -109 -119 -129 -140 -139 -138 -137 -137 -138 -139 -140 -141 -129 -118 -106
-571 -106 -95 -72 -50 -72 -94 -117 -140 -136 -133 -130 -128 -126 -124 -109 -94 -79 -64 -60 -57 -53 -50 -51 -52 -54 -55 -82 -108 -123 -112 -97 -83 -80 -77 -80 -82 -70 -59 -39 -20 -13 -7 3 13 -1 -15
-576 -15 -14 13 51 89 110 105 88 71 66 61 29 -2 -20 -39 -30 -22 0 21 32 16 -5 -27 -24 -22 -11 -1 -5 -8 5 18 45 71 69 66 37 7 -17 -43 -42 -41 -36 -32 -41 -49
-582 -49 -66 -83 -73 -63 -62 -61 -60 -59 -57 -54 -51 -48 -45 -42 -39 -37 -29 -22 -16 -10 -16 -49 -82 -88 -89 -89 -88 -87 -86 -84 -83 -82 -71 -61 -50 -40 -41 -41 -42 -42 -38 -34 -30 -25 -22 -18 -40 -61 -67 -50 -39 -41 -45 -49 -54 -59
-589 -59 -91 -123 -129 -135 -152 -169 -172 -176 -148 -120 -92 -64 -60 -56 -78 -100 -110 -120 -87 -53 -40 -40 -33 -3 35 61 69 77 71 64 40 2 -32 -46 -37 -15 11 16 7 0 6 13 7 2 13
-594 13 37 53 47 29 11 4 -1 -10 -20 -29 -39 -56 -73 -117 -160 -163 -166 -156 -145 -131 -117 -104 -90 -57 -24 8 41 53 64 62 37 0 -39 -52 -65 -43 -21 -26 -31 -49
-599 -49 -68 -60 -52 -35 -18 -1 15 26 37 47 57 55 32 7 -16 -26 -36 -19 -2 10 23 22 21 17 14 -3 -20 -27 -34 -41 -47 -31 -14 2 19 23 28 47 40 -1 -42 -56
-604 -56 -43 -17 8 10 11 32 53 63 45 18 -9 -53 -71 -65 -58 -78 -125 -153 -155 -147 -139 -141 -142 -143 -145 -131 -118 -105 -92 -63 -34 -5 23 27 31 35 39 48 57 66 75 73 70 56 16 -26
-610 -26 -68 -67 -67 -55 -42 -30 -17 -26 -36 -45 -54 -52 -49 -47 -44 -41 -39 -36 -34 -41 -48 -56 -63 -75 -87 -100 -112 -81 -50 -30 -37 -59 -81 -60 -40 -38 -36 -34 -32 -43 -54 -65 -76 -73 -71 -69 -67 -64 -62
-616 -62 -60 -57 -63 -69 -75 -81 -72 -62 -52 -43 -53 -63 -73 -83 -59 -36 -13 10 -4 -19 -34 -49 -49 -48 -48 -47 -61 -75 -89 -102 -110 -117 -124 -131 -122 -113 -104 -94 -74 -53 -33 -13 -15 -17 -5 -19
-621 -19 -58 -98 -111 -97 -76 -68 -70 -86 -111 -135 -161 -186 -183 -180 -176 -173 -163 -154 -118 -82 -42 -15 -9 -31 -58 -85 -114 -143 -123 -103 -83 -63 -50 -36 -23 -10 10 30 48
-626 48 67 70 46 -6 -59 -75 -91 -113 -121 -105 -62 -26 -3 6 16 41 38 14 -10 -42 -60 -53 -19 15 23 19 15 9 3 5 8 10 12 0 -13 -26 -39 -47 -55 -62 -70 -62 -54 -46 -38 -37 -35
-632 -35 -33 -32 -42 -51 -27 10 29 3 -40 -84 -95 -105 -116 -127 -133 -140 -120 -100 -95 -90 -86 -81 -77 -73 -69 -65 -44 -23 -3 16 38 46 30 -7 -42 -63 -63 -40 1 29 30 18 14 22
-637 22 35 25 -8 -41 -50 -58 -51 -44 -35 -27 -28 -7 33 61 50 16 -12 -27 -23 -6 3 13 9 5 0 -3 1 6 11 15 9 3 -2 -9 -23 -38 -53 -68 -54 -40 -26 -11 -13 -14 -16 -17 3 24
-643 24 46 67 75 84 65 47 33 18 4 -9 0 10 20 30 33 37 40 43 45 46 47 48 38 28 18 8 -9 -27 -46 -64 -55 -46 -37 -28 -11 5 -3 -12 -22 -32 -42 -52 -60 -69 -77
-649 -77 -85 -78 -71 -63 -56 -72 -88 -104 -119 -115 -111 -81 -51 -2 33 45 35 28 34 39 31 12 -5 2 10 23 50 81 90 78 65 51 37 26 15 5 -5 -19 -32 -45 -59 -81
-654 -81 -102 -98 -93 -103 -112 -122 -132 -125 -118 -124 -152 -171 -167 -151 -134 -129 -124 -101 -65 -49 -63 -86 -109 -117 -125 -132 -138 -117 -74 -38 -14 -4 -16 -30 -22 8 25 16 -7 -25 -29 -35 -54 -84
-659 -84 -115 -119 -124 -116 -108 -74 -40 -35 -30 -25 -20 -34 -47 -60 -74 -87 -100 -114 -127 -111 -96 -80 -65 -83 -102 -121 -140 -146 -153 -133 -113 -76 -38 -28 -17 -27 -38 -48 -59 -68 -77
-664 -77 -86 -95 -90 -85 -80 -75 -52 -29 -33 -36 -47 -57 -41 -24 -26 -27 -28 -30 -49 -69 -89 -109 -119 -129 -139 -149 -128 -106 -85 -63 -54 -44 -46 -74 -108 -141 -150 -158 -153 -148 -144 -139 -139 -139 -139 -139 -136 -133
-670 -133 -130 -127 -125 -123 -94 -65 -36 -6 -3 0 7 16 24 33 46 59 72 85 104 123 112 75 26 -22 -43 -38 -28 -19 -8 2 -4 -11 -17 -24 -37 -50 -63 -77 -60 -44 -28 -12 -26
-675 -26 -40 -54 -68 -71 -74 -101 -129 -151 -147 -131 -116 -86 -57 -29 -1 -24 -74 -108 -143 -181 -220 -247 -247 -210 -173 -136 -100 -75 -77 -91 -105 -90 -75 -60 -45 -42 -38 -34 -30 -42
-680 -42 -53 -65 -77 -91 -104 -118 -132 -139 -146 -153 -160 -163 -166 -169 -171 -189 -207 -198 -189 -166 -142 -119 -95 -81 -67 -53 -39 -15 8 32 56 59 61 61 62 56 23 -20 -64 -77 -90 -76 -62
-685 -62 -57 -52 -47 -43 -29 -16 -30 -43 -59 -74 -114 -155 -187 -192 -152 -112 -75 -65 -67 -69 -33 1 10 19 17 14 -14 -43 -36 -29 -32 -62 -103 -117 -104 -91 -72 -53 -61 -68 -67 -65 -62 -59 -63 -40
-691 -40 -6 27 31 35 39 42 37 31 25 20 -5 -31 -55 -79 -97 -88 -68 -48 -42 -36 -57 -78 -98 -117 -135 -153 -149 -117 -101 -84 -65 -46 -53 -61 -72 -83 -68 -52 -53 -54 -56 -57 -55 -52 -48 -45
-697 -45 -49 -27 -20 -12 -15 -18 -20 -23 -41 -59 -78 -96 -94 -91 -89 -87 -112 -137 -175 -186 -158 -103 -46 -16 -21 -25 -31 -37 -34 -30 -27 -23 -27 -30 -33 -36 -23 -10 17 18 6 -5 -19 -33 -50 -67 -82
-702 -82 -98 -95 -65 -50 -35 -35 -35 -35 -35 -46 -57 -68 -79 -87 -95 -118 -114 -86 -58 -30 -2 1 -21 -72 -123 -132 -114 -69 -24 -4 -11 -30 -48 -67 -85 -103 -121 -107 -93 -79 -65
-707 -65 -66 -68 -69 -71 -45 -19 6 32 64 96 99 102 102 75 19 -36 -79 -122 -154 -158 -138 -117 -105 -120 -133 -119 -96 -72 -64 -56 -48 -41 -31 -22 -13 -4 -25 -58 -96 -112 -111 -98 -82
-713 -82 -81 -99 -118 -136 -154 -138 -99 -74 -48 -43 -38 -33 -28 -46 -63 -81 -99 -102 -105 -91 -63 -38 -36 -63 -90 -113 -112 -98 -84 -71 -58 -72 -86 -71 -57 -43 -29 -18 -6 16
-718 16 18 -14 -48 -81 -114 -123 -109 -101 -106 -110 -113 -130 -125 -104 -82 -59 -36 -19 -1 7 28 52 52 24 -4 -13 0 9 5 0 -4 -10 -16 -28 -41 -53 -65 -71 -77 -81 -85 -80 -52 -20 -18 -49
-723 -49 -80 -112 -145 -126 -106 -87 -68 -68 -69 -69 -70 -89 -108 -126 -144 -166 -166 -152 -138 -138 -138 -106 -53 -12 14 23 32 24 17 9 2 -16 -35 -67 -76 -52 -28 -4 19 16 -13 -28 -43
-729 -43 -47 -51 -55 -59 -51 -44 -37 -30 -32 -34 -36 -39 -41 -43 -45 -47 -48 -48 -49 -49 -59 -69 -79 -89 -101 -113 -115 -90 -61 -46 -57 -82 -101 -106 -93 -79 -66 -52 -41 -29 -2 -2 -29 -57 -65 -48 -38
-734 -38 -42 -56 -84 -105 -126 -119 -112 -104 -97 -83 -69 -55 -41 -28 -16 -4 8 12 16 11 -21 -56 -65 -48 -31 -31 -58 -77 -83 -75 -67 -59 -50 -34 -17 -2 13 27 27 18 36 29 -3 -34
-740 -34 -37 -31 1 29 43 49 68 87 92 91 104 113 110 90 43 3 -22 -27 -19 -17 -15 -24 -32 -40 -48 -71 -95 -119 -142 -147 -152 -157 -162 -151 -141 -130 -119 -121 -122 -124 -125 -123 -121 -118 -114 -115 -89 -64 -65 -78
-746 -78 -91 -106 -121 -117 -113 -109 -105 -81 -57 -33 -9 -12 -15 -19 -22 -41 -60 -79 -98 -95 -93 -91 -88 -86 -84 -81 -79 -59 -39 -19 1 1 1 1 1 -28 -59 -90 -121 -124 -128 -131 -135 -145 -156 -139 -95
-752 -95 -58 -47 -65 -82 -68 -54 -39 -25 -29 -34 -38 -42 -50 -57 -64 -72 -73 -74 -74 -75 -59 -43 -29 -15 -1 -14 -13 -11 -3 4 11 19 11 3 -4 -11 -23 -34 -46 -57 -80 -103 -125 -148 -154 -159 -164 -168
-757 -168 -162 -131 -114 -97 -66 -36 -8 20 29 11 -34 -80 -100 -94 -102 -110 -78 -45 -12 19 20 20 20 20 -16 -54 -91 -129 -118 -107 -97 -88 -88 -115 -125 -135 -122 -83 -52 -34
-762 -34 -22 -10 1 13 4 9 21 6 1 -4 -11 -18 -33 -47 -62 -77 -67 -58 -50 -42 -60 -106 -143 -167 -187 -193 -171 -135 -105 -101 -108 -115 -99 -83 -67 -52 -43 -35 -26 -18 -37 -56 -75 -93
-768 -93 -89 -85 -55 -24 9 43 32 22 -1 -25 -49 -73 -66 -59 -53 -46 -42 -37 -33 -28 -44 -59 -75 -90 -114 -139 -176 -187 -169 -125 -80 -62 -64 -79 -97 -100 -97 -94 -89 -85 -91 -97 -103 -109 -104 -99
-773 -99 -94 -89 -59 -30 -1 27 10 -6 -24 -41 -50 -58 -67 -75 -65 -54 -53 -38 -25 -38 -61 -84 -114 -117 -101 -71 -54 -63 -84 -104 -102 -100 -97 -95 -92 -89 -86 -83 -92 -100 -108 -116 -132 -148 -163 -179
-779 -179 -153 -126 -100 -73 -58 -42 -27 -11 -4 3 -23 -64 -98 -105 -101 -98 -77 -56 -35 -15 -15 -16 -17 -18 -12 -6 -1 4 -8 -21 -33 -46 -52 -59 -65 -71 -67 -62 -58 -54 -60 -67 -74 -81 -92 -104 -116
-785 -116 -127 -128 -129 -129 -130 -105 -81 -42 -29 -52 -75 -100 -125 -124 -123 -122 -121 -109 -97 -85 -73 -64 -56 -48 -40 -51 -76 -118 -116 -101 -99 -82 -77 -105 -159 -213 -241 -231 -209 -192 -174 -148
-790 -148 -122 -97 -71 -42 -25 -30 -61 -108 -143 -156 -143 -129 -114 -98 -82 -81 -81 -80 -79 -68 -57 -88 -119 -130 -115 -107 -112 -117 -123 -129 -135 -120 -105 -116 -128 -134 -140 -147 -153 -165 -177 -162
-795 -162 -148 -130 -113 -97 -81 -76 -97 -129 -160 -163 -139 -131 -122 -100 -79 -57 -36 -40 -44 -21 1 7 13 19 25 18 12 -19 -51 -51 -24 2 1 -13 -28 -45 -62 -45 -29 -12 3 7
-800 7 10 13 17 10 4 24 44 57 71 58 45 24 3 -17 -37 -34 -31 -28 -25 -52 -79 -88 -84 -84 -111 -136 -134 -114 -80 -45 -23 -28 -34 -40 -46 -53 -59 -65 -71 -99 -127 -155 -182 -172 -162 -152
-806 -152 -142 -117 -92 -51 -38 -48 -59 -45 -30 -26 -21 -16 -12 -12 -13 -13 -13 -25 -37 -49 -61 -89 -116 -144 -171 -154 -137 -120 -103 -88 -72 -57 -41 -24 -7 -17 -26 -48 -70
-810 -70 -92 -114 -109 -105 -75 -46 -35 -50 -77 -105 -108 -111 -114 -117 -115 -113 -111 -109 -107 -105 -104 -102 -102 -101 -101 -101 -72 -43 -25 -35 -61 -86 -114 -141 -151 -160 -169 -178 -163 -148 -107 -67 -36 -31 -54 -77
-816 -77 -90 -77 -62 -73 -92 -84 -67 -49 -53 -57 -35 -12 -4 3 11 19 9 0 -10 -21 -18 -16 -14 -12 1 14 28 41 50 58 82 79 42 6 -5 -16 -36 -57 -77 -97 -96 -95 -93 -92 -86
-822 -86 -79 -74 -70 -59 -75 -92 -81 -57 -32 -8 16 22 1 -3 -9 -40 -71 -100 -130 -150 -143 -152 -160 -156 -152 -148 -144 -140 -136 -132 -128 -108 -88 -53 -45 -64 -83 -104 -124 -121 -118 -116 -113 -117 -120 -124 -128 -129 -130
-828 -130 -130 -131 -148 -164 -180 -196 -176 -155 -135 -114 -102 -90 -61 -58 -62 -38 -31 -25 -41 -57 -72 -88 -95 -101 -108 -114 -119 -123 -142 -135 -111 -74 -37 -13 -25 -63 -95 -114 -126 -137 -148
-833 -148 -159 -158 -158 -158 -157 -151 -144 -137 -131 -131 -131 -131 -131 -133 -136 -138 -141 -123 -106 -88 -71 -71 -72 -73 -73 -80 -88 -95 -102 -111 -120 -129 -137 -131 -124 -118 -111 -119 -127 -135 -143 -118 -92 -67 -42 -43 -44 -45 -45 -46 -47 -48 -49 -71 -93 -114 -136
-840 -136 -147 -157 -168 -179 -167 -155 -143 -131 -109 -88 -67 -45 -49 -53 -74 -109 -135 -138 -110 -82 -81 -80 -79 -78 -103 -128 -153 -178 -184 -191 -198 -205 -195 -185 -174 -164 -145 -126 -152 -178
-844 -178 -202 -226 -218 -189 -167 -145 -121 -98 -87 -77 -66 -55 -50 -45 -53 -39 -4 16 1 -13 -17 -20 -24 -28 -45 -63 -81 -98 -107 -116 -125 -134 -136 -138 -141 -143 -139 -135 -130 -125 -122 -106 -85 -87 -98 -109
-850 -109 -122 -134 -123 -111 -99 -87 -89 -90 -92 -93 -101 -110 -118 -126 -137 -147 -158 -169 -159 -150 -127 -128 -145 -162 -154 -146 -137 -127 -91 -55 -31 -7 -9 -12 -31 -51 -43 -36 -34 -32 -71 -111 -145 -135
-855 -135 -105 -75 -53 -30 -9 11 28 17 -4 -26 -30 -33 -37 -40 -39 -38 -36 -35 -55 -75 -95 -114 -114 -114 -114 -114 -102 -90 -78 -66 -85 -105 -123 -141 -162 -156 -139 -122 -127 -131 -136 -140 -123
-861 -123 -105 -113 -120 -136 -126 -103 -81 -54 -27 12 26 -15 -83 -126 -142 -137 -132 -125 -118 -118 -117 -92 -67 -64 -87 -96 -104 -118 -131 -143 -155 -171 -160 -138 -116 -124 -132 -113 -94 -85 -75 -93
-866 -93 -110 -124 -138 -123 -82 -52 -23 -18 -14 -37 -60 -58 -56 -47 -65 -94 -124 -118 -112 -107 -101 -91 -81 -71 -60 -64 -68 -72 -75 -104 -132 -149 -139 -112 -85 -84 -82 -70 -58 -72 -87 -105 -123
-871 -123 -114 -105 -98 -90 -109 -129 -129 -130 -131 -132 -159 -185 -185 -185 -188 -192 -196 -200 -194 -188 -182 -177 -171 -165 -159 -154 -132 -111 -89 -68 -82 -97 -112 -126 -149 -171 -167 -163 -143 -124 -104 -84 -55 -26 -41 -56 -66
-877 -66 -76 -86 -96 -102 -109 -116 -122 -118 -113 -109 -105 -99 -94 -89 -84 -94 -104 -114 -125 -110 -95 -80 -65 -77 -89 -101 -114 -134 -155 -151 -146 -134 -148 -171 -195 -194 -165 -152 -138 -134 -130 -124 -118 -117 -89
-882 -89 -51 -14 -7 -28 -33 -39 -39 -39 -40 -40 -67 -93 -93 -93 -109 -124 -139 -155 -162 -169 -176 -183 -186 -189 -192 -195 -205 -214 -197 -180 -167 -153 -116 -78 -69 -105 -143 -180 -188 -196 -205 -213 -187 -162 -137 -112 -117
-888 -117 -123 -102 -81 -82 -82 -83 -84 -76 -69 -61 -54 -58 -61 -65 -69 -78 -88 -98 -107 -97 -86 -76 -65 -86 -106 -127 -147 -147 -148 -148 -149 -112 -76 -42 -7 13 7 -26 -60 -83 -79 -65 -51 -48 -71 -106
-894 -106 -141 -135 -130 -124 -119 -118 -116 -115 -114 -90 -65 -70 -101 -133 -166 -155 -144 -147 -149 -151 -154 -147 -139 -132 -125 -103 -82 -62 -41 -29 -43 -69 -95 -100 -104 -109 -113 -83 -53 -67 -82 -86 -91 -95 -99 -131 -163
-899 -163 -193 -223 -226 -206 -199 -192 -190 -188 -186 -184 -185 -186 -188 -189 -179 -169 -159 -149 -139 -130 -122 -114 -117 -142 -162 -169 -162 -155 -147 -140 -135 -130 -125 -120 -87 -53 -52 -72 -89 -106 -124 -142 -145 -148 -151 -155 -151 -148 -144 -141 -144 -146
-906 -146 -147 -149 -130 -89 -54 -32 -36 -53 -64 -74 -94 -114 -107 -100 -83 -65 -48 -31 -27 -24 -20 -17 -27 -37 -47 -57 -32 -7 -9 -11 -36 -62 -88 -113 -140 -167 -167 -167 -160 -153 -146 -139 -121
-911 -121 -103 -84 -66 -68 -70 -89 -122 -149 -153 -145 -136 -138 -140 -143 -145 -141 -136 -132 -128 -112 -97 -108 -119 -125 -131 -137 -142 -138 -134 -103 -72 -43 -13 1 -5 -8 -12 -17 -23 -53 -97 -121 -119 -107 -95 -108 -121
-917 -121 -117 -114 -110 -106 -90 -73 -56 -39 -19 1 -4 -10 -12 -14 -15 -17 -36 -55 -74 -93 -104 -116 -126 -136 -139 -115 -74 -46 -50 -81 -97 -113 -128 -143 -158 -172 -184 -195 -180 -164 -148
-922 -148 -132 -116 -100 -87 -74 -61 -47 -57 -67 -61 -82 -124 -153 -154 -142 -121 -100 -78 -56 -29 -2 12 0 -30 -62 -68 -74 -58 -42 -53 -63 -73 -84 -68 -51 -33 -14
-926 -14 -22 -31 -32 -34 -53 -86 -104 -96 -95 -107 -128 -136 -115 -81 -62 -43 -25 -7 -1 -21 -62 -116 -160 -178 -192 -192 -188 -183 -178 -173 -152 -132 -112 -92 -99 -106 -139 -173 -170 -168 -165 -162 -160 -157 -154 -151 -155
-932 -155 -158 -134 -111 -87 -64 -67 -70 -75 -81 -86 -92 -59 -27 -21 -14 -24 -20 -8 -22 -73 -111 -129 -119 -113 -107 -99 -91 -98 -106 -113 -121 -133 -146 -132 -118 -116 -114 -129 -158 -177 -169 -169 -183 -187 -192 -197 -203 -198
-938 -198 -193 -163 -134 -132 -157 -174 -178 -172 -165 -157 -150 -136 -122 -108 -93 -76 -58 -41 -23 -39 -55 -71 -87 -108 -129 -149 -169 -191 -199 -169 -112 -62 -39 -36 -46 -50 -55 -60 -65 -79 -92
-943 -92 -106 -120 -113 -107 -101 -94 -98 -102 -105 -109 -119 -129 -140 -150 -128 -106 -84 -62 -53 -44 -44 -31 -19 -35 -77 -119 -137 -129 -136 -142 -156 -171 -185 -199 -213 -227 -241 -255 -219 -184 -133 -109
-948 -109 -117 -124 -132 -139 -118 -71 -23 -2 -33 -64 -96 -127 -158 -163 -183 -203 -210 -217 -224 -231 -195 -158 -124 -89 -69 -75 -65 -56 -55 -53 -51 -49 -54 -59 -63 -68 -91 -115 -138 -161 -156 -150 -144 -139 -128 -117
-954 -117 -107 -96 -92 -88 -84 -80 -103 -126 -148 -171 -152 -132 -113 -93 -73 -52 -32 -11 -6 -1 -40 -80 -120 -161 -175 -189 -200 -210 -195 -179 -163 -147 -159 -170 -181 -192 -176 -161
-958 -161 -158 -155 -177 -198 -211 -197 -171 -145 -131 -117 -130 -142 -169 -195 -195 -195 -183 -172 -160 -149 -149 -150 -166 -155 -141 -127 -111 -95 -91 -86 -81 -77 -72 -67 -61 -56 -45 -33 -48 -63 -96 -129
-964 -129 -132 -112 -84 -70 -73 -76 -81 -85 -89 -93 -98 -104 -110 -116 -125 -134 -143 -152 -142 -131 -120 -109 -88 -68 -49 -30 -41 -82 -132 -182 -213 -231 -230 -198 -153 -121 -129 -160 -177 -194 -212 -230 -219
-969 -219 -208 -197 -185 -177 -168 -159 -150 -142 -133 -124 -116 -116 -117 -117 -117 -118 -118 -119 -119 -94 -68 -43 -17 -38 -59 -80 -101 -92 -83 -73 -64 -70 -77 -83 -89 -99 -110 -120 -130 -125 -119 -114 -109 -119 -129 -139 -149 -144 -138
-975 -138 -133 -127 -115 -102 -89 -77 -83 -89 -107 -103 -83 -62 -42 -22 -9 -27 -72 -117 -132 -148 -137 -126 -117 -108 -99 -90 -99 -107 -116 -125 -133 -142 -150 -159 -152 -146 -154 -136 -113 -89 -65 -40 -45 -50 -55 -60 -81
-981 -81 -101 -122 -143 -141 -139 -137 -136 -136 -136 -136 -136 -123 -111 -125 -139 -147 -155 -128 -87 -63 -66 -60 -42 -24 -7 -17 -54 -78 -90 -84 -78 -82 -86 -90 -94 -101 -107 -114 -120 -115 -111 -106 -101 -85 -69 -53 -37 -32 -27
-987 -27 -22 -17 -46 -75 -120 -137 -123 -109 -93 -77 -94 -110 -126 -142 -151 -161 -169 -177 -170 -137 -112 -100 -106 -125 -129 -145 -168 -165 -177 -190 -176 -162 -149 -135 -123 -111 -98 -86 -74 -62
-991 -62 -50 -37 -73 -109 -144 -180 -169 -157 -146 -135 -114 -93 -72 -51 -58 -66 -74 -81 -94 -107 -120 -133 -140 -146 -153 -159 -161 -163 -166 -169 -172 -188 -204 -207 -195 -184 -190 -209 -233 -243 -225 -194 -171
-997 -171 -160 -168 -176 -161 -145 -130 -114 -121 -129 -129 -142 -153 -165 -185 -191 -168 -144 -121 -98 -96 -107 -110 -113 -105 -84 -72 -59 -62 -78 -94 -97 -86 -75 -50 -47 -56 -51 -56 -61 -86 -112 -111 -79 -48
-1002 -48 -29 -29 -29 -52 -89 -117 -145 -145 -131 -132 -120 -101 -81 -54 -39 -46 -53 -61 -68 -85 -102 -119 -137 -154 -171 -188 -205 -228 -251 -280 -297 -291 -272 -253 -246 -246 -245 -245 -246 -246 -246 -247 -247 -239
-1007 -239 -230 -214 -210 -214 -205 -197 -202 -198 -194 -198 -189 -176 -163 -149 -136 -134 -133 -132 -130 -129 -128 -126 -125 -108 -92 -75 -59 -74 -89 -104 -119 -142 -165 -161 -158 -171 -185 -173 -162 -134 -132 -158 -185 -203 -195
-1013 -195 -177 -159 -135 -139 -170 -201 -234 -239 -216 -192 -175 -159 -169 -180 -213 -246 -234 -223 -224 -226 -228 -229 -228 -227 -226 -225 -228 -231 -249 -240 -200 -160 -105 -76 -106 -162 -203 -200 -181 -162 -167 -172
-1018 -172 -162 -152 -127 -129 -140 -151 -164 -177 -183 -188 -167 -147 -141 -135 -129 -123 -119 -114 -125 -109 -84 -60 -61 -61 -95 -128 -150 -145 -138 -132 -124 -115 -114 -113 -112 -111 -110 -109 -108 -106 -108 -110 -112 -113 -111 -109 -134 -158 -162 -166
-1024 -166 -170 -174 -164 -154 -144 -134 -148 -162 -177 -191 -187 -184 -180 -176 -167 -159 -177 -195 -198 -202 -205 -208 -222 -237 -251 -266 -259 -253 -238 -235 -236 -210 -173 -136 -108 -81 -80 -79 -86 -94 -101 -109 -98 -87 -76
-1030 -76 -65 -71 -77 -82 -88 -100 -112 -124 -137 -136 -136 -136 -135 -119 -103 -88 -72 -75 -78 -81 -84 -102 -121 -139 -158 -150 -143 -135 -128 -122 -117 -139 -160 -170 -180 -199 -245 -285 -281 -250 -205 -175 -159 -152 -159
-1035 -159 -163 -153 -127 -100 -104 -134 -148 -163 -172 -180 -188 -196 -204 -212 -220 -227 -226 -224 -222 -221 -207 -194 -207 -221 -242 -264 -259 -254 -234 -214 -221 -228 -225 -222 -218 -214 -202 -177 -144 -138 -143 -147 -152 -158 -176 -194 -184 -147
-1041 -147 -117 -114 -96 -78 -69 -87 -116 -145 -142 -138 -134 -130 -133 -136 -139 -142 -160 -179 -197 -215 -215 -214 -214 -213 -198 -182 -193 -204 -195 -185 -176 -166 -153 -140 -129 -118 -101 -111 -133 -154 -149 -143 -138 -132
-1046 -132 -99 -66 -45 -51 -55 -60 -66 -72 -73 -74 -76 -77 -63 -49 -62 -75 -95 -115 -135 -154 -173 -191 -182 -174 -149 -124 -125 -127 -128 -128 -129 -129 -140 -151 -162 -173 -150 -128 -105 -83 -70 -56 -43
-1052 -43 -30 -45 -61 -77 -92 -117 -143 -168 -193 -213 -233 -227 -220 -205 -190 -175 -160 -144 -128 -138 -149 -149 -149 -149 -149 -144 -139 -134 -130 -128 -126 -125 -123 -137 -151 -165 -179 -198 -217 -235 -253 -260
-1057 -260 -245 -216 -187 -185 -183 -181 -179 -164 -149 -134 -119 -116 -112 -109 -105 -102 -99 -95 -92 -104 -117 -129 -142 -169 -197 -197 -198 -188 -177 -166 -156 -122 -88 -81 -74 -80 -87 -94 -101 -116 -131 -146 -161 -172
-1062 -172 -182 -193 -204 -179 -153 -128 -103 -74 -45 -30 -37 -53 -68 -86 -103 -126 -149 -146 -143 -130 -117 -104 -91 -89 -87 -85 -83 -103 -124 -144 -165 -180 -196 -186 -175 -147 -120 -93
-1067 -93 -65 -38 -11 -11 -10 -15 -19 -24 -28 -51 -73 -95 -118 -118 -119 -120 -120 -127 -134 -115 -95 -90 -86 -81 -76 -52 -29 -7 15 9 -18 -60 -102 -109 -116 -122 -129 -144 -159 -174 -189 -183 -178 -172 -166 -171 -177 -182 -187
-1073 -187 -201 -214 -227 -240 -220 -200 -179 -159 -148 -136 -124 -113 -97 -81 -101 -134 -153 -151 -154 -170 -174 -177 -182 -186 -173 -159 -145 -131 -126 -121 -115 -110 -97 -85 -98 -111 -141 -157 -148 -118
-1078 -118 -100 -82 -57 -45 -58 -93 -123 -141 -147 -153 -176 -213 -244 -254 -232 -210 -204 -198 -192 -187 -194 -215 -241 -244 -232 -220 -207 -194 -206 -231 -259 -265 -245 -203 -166 -142 -147 -174 -196
-1082 -196 -206 -202 -198 -193 -188 -199 -209 -212 -183 -138 -105 -96 -108 -116 -123 -132 -141 -149 -156 -164 -172 -164 -157 -149 -141 -133 -124 -116 -108 -102 -109 -121 -111 -83 -54 -72 -112 -137 -130 -104 -99 -128 -157 -175 -167 -163 -158 -152 -146 -150
-1089 -150 -153 -157 -160 -140 -119 -98 -77 -94 -111 -129 -146 -131 -117 -102 -88 -89 -90 -118 -146 -182 -219 -225 -205 -177 -148 -117 -87 -71 -55 -24 -19 -50 -80 -111 -141 -145 -121 -113 -104
-1093 -104 -105 -106 -107 -108 -103 -97 -92 -86 -89 -91 -94 -96 -114 -132 -150 -169 -159 -149 -140 -130 -121 -111 -102 -92 -111 -131 -165 -173 -153 -133 -112 -91 -85 -79 -73 -66 -60 -54 -48 -42 -41 -40 -39 -37 -61 -84 -107 -131
-1099 -131 -128 -126 -124 -121 -101 -81 -88 -94 -120 -145 -141 -111 -71 -31 -16 -1 3 9 -11 -32 -71 -109 -121 -132 -130 -128 -126 -124 -109 -94 -79 -64 -62 -59 -57 -55 -37 -20 -3 12 5 -27 -45
-1104 -45 -63 -77 -91 -130 -169 -181 -165 -138 -111 -106 -100 -95 -90 -96 -102 -108 -114 -125 -135 -161 -161 -127 -93 -58 -23 -16 -9 -3 3 6 10 14 18 -11 -40 -70 -99 -115 -131 -146 -162 -166 -171 -175 -180
-1110 -180 -169 -159 -149 -139 -127 -116 -131 -147 -158 -168 -154 -140 -127 -141 -182 -224 -245 -240 -250 -259 -255 -250 -219 -187 -157 -127 -141 -155 -158 -161 -149 -164 -207 -250 -269 -287 -285 -282
-1115 -282 -279 -277 -268 -259 -221 -157 -88 -20 -4 -33 -79 -124 -146 -167 -168 -169 -170 -171 -151 -131 -123 -142 -155 -168 -183 -197 -204 -211 -218 -225 -210 -195 -182 -169 -160 -178 -224 -270 -309 -321 -303
-1120 -303 -259 -213 -194 -185 -176 -162 -148 -160 -173 -180 -188 -169 -150 -123 -96 -96 -123 -152 -155 -148 -140 -138 -135 -133 -130 -143 -156 -169 -181 -174 -167 -160 -153 -163 -174 -184 -195 -187 -179 -171 -162 -140 -104 -87
-1125 -87 -97 -120 -143 -141 -139 -141 -143 -145 -146 -148 -137 -118 -125 -133 -128 -124 -134 -156 -177 -199 -222 -240 -257 -274 -290 -308 -300 -262 -225 -190 -155 -115 -88 -99 -136 -167 -185 -186 -187 -186 -185 -158 -118
-1130 -118 -71 -50 -55 -61 -43 -25 -29 -59 -108 -144 -151 -144 -144 -144 -134 -123 -113 -103 -116 -129 -142 -154 -169 -184 -198 -213 -203 -192 -194 -222 -255 -288 -296 -304 -284 -263 -242 -222 -203
-1135 -203 -184 -191 -199 -205 -210 -189 -168 -146 -123 -101 -78 -88 -98 -135 -172 -195 -219 -217 -214 -233 -253 -260 -242 -216 -190 -190 -189 -181 -173 -164 -156 -150 -143 -137 -130 -146 -161 -177 -192 -192 -192 -192 -192 -177 -161
-1141 -161 -146 -131 -140 -149 -159 -168 -162 -156 -150 -143 -153 -162 -172 -181 -195 -208 -222 -235 -215 -196 -176 -156 -143 -130 -118 -107 -98 -117 -147 -177 -173 -169 -165 -161 -148 -135 -121 -108 -103 -98 -93 -88 -100
-1146 -100 -112 -99 -86 -71 -83 -106 -130 -118 -107 -95 -84 -83 -82 -81 -80 -69 -59 -49 -38 -27 -15 -30 -45 -60 -75 -64 -52 -77 -101 -124 -147 -166 -158 -150 -168 -195 -222
-1150 -222 -204 -159 -132 -104 -102 -100 -124 -148 -145 -143 -166 -190 -213 -237 -234 -232 -205 -177 -143 -136 -158 -180 -202 -225 -235 -219 -201 -182 -176 -144 -95 -46 -42 -65 -88 -110 -134 -158 -173
-1155 -173 -188 -176 -164 -137 -110 -109 -108 -116 -124 -130 -137 -144 -125 -121 -116 -123 -130 -137 -144 -144 -144 -145 -145 -135 -126 -116 -106 -105 -104 -103 -101 -92 -82 -99 -116 -133 -150 -140 -130 -141 -153 -164 -175 -165 -155 -145
-1161 -145 -134 -153 -172 -190 -209 -217 -224 -232 -239 -221 -203 -184 -166 -167 -169 -171 -172 -165 -157 -149 -142 -145 -149 -152 -156 -152 -147 -143 -139 -149 -158 -183 -181 -146 -111 -75 -39 -49 -59 -69 -79 -91 -104 -116 -128
-1166 -128 -133 -139 -119 -99 -70 -67 -93 -120 -128 -136 -144 -152 -144 -136 -128 -121 -137 -154 -170 -187 -192 -196 -200 -205 -189 -174 -158 -142 -137 -131 -125 -119 -133 -147 -161 -175 -159 -143 -127 -111 -141 -172 -202 -233
-1172 -233 -226 -220 -213 -206 -189 -171 -153 -135 -142 -149 -140 -159 -169 -179 -190 -202 -192 -182 -172 -162 -157 -152 -162 -146 -116 -86 -54 -23 -29 -35 -41 -47 -56 -64 -72 -81 -102 -123 -144 -165 -190 -216 -197
-1177 -197 -177 -162 -146 -157 -167 -176 -185 -193 -202 -201 -201 -200 -199 -189 -180 -170 -160 -150 -140 -131 -121 -139 -156 -174 -192 -190 -188 -185 -183 -187 -191 -195 -198 -181 -163 -146 -130 -112 -121 -159 -197 -196 -195 -195 -194 -181
-1182 -181 -169 -157 -144 -147 -150 -153 -157 -154 -151 -148 -145 -162 -180 -197 -214 -215 -217 -218 -219 -205 -191 -177 -163 -159 -155 -152 -148 -151 -154 -157 -160 -145 -129 -115 -101 -101 -128 -140 -152 -169 -187 -204 -222 -239 -257
-1188 -257 -274 -292 -278 -265 -252 -239 -221 -202 -169 -163 -165 -168 -172 -176 -181 -185 -180 -148 -118 -114 -139 -163 -191 -219 -246 -272 -268 -237 -221 -206 -188 -170 -153 -135 -133 -131 -128 -126 -139 -152 -165
-1193 -165 -179 -189 -200 -211 -222 -217 -213 -208 -203 -194 -185 -176 -167 -164 -162 -160 -157 -166 -175 -184 -193 -190 -188 -186 -184 -164 -144 -124 -104 -97 -89 -67 -72 -103 -134 -174 -200 -194 -176 -164 -152 -157 -162 -167 -172 -183 -195 -206
-1199 -206 -218 -221 -225 -228 -231 -235 -238 -241 -245 -243 -241 -239 -237 -235 -233 -231 -229 -243 -257 -271 -284 -281 -264 -254 -245 -246 -247 -240 -246 -251 -244 -217 -191 -175 -159 -144 -129 -127 -148 -181 -215 -221 -215 -215 -216 -217 -218 -220 -221 -211 -201
-1205 -201 -191 -181 -185 -189 -185 -194 -221 -248 -255 -222 -173 -145 -152 -180 -209 -225 -212 -187 -169 -152 -135 -117 -110 -117 -141 -166 -186 -192 -170 -135 -109 -105 -114 -123 -114 -92 -71 -63 -60 -70 -99 -128
-1210 -128 -145 -148 -150 -166 -170 -161 -161 -160 -165 -170 -175 -180 -185 -189 -194 -198 -192 -185 -178 -172 -158 -144 -131 -117 -110 -103 -96 -89 -97 -104 -112 -120 -112 -104 -96 -88 -105 -121 -138 -154 -189 -224 -230 -208 -195 -182 -193 -205 -231 -257
-1216 -257 -256 -255 -226 -197 -180 -190 -212 -235 -259 -284 -286 -289 -265 -241 -217 -193 -196 -198 -205 -212 -219 -226 -232 -238 -218 -198 -188 -178 -211 -244 -261 -251 -229 -207 -199 -191 -182 -174 -175 -177 -178 -179 -174 -168 -162 -156
-1222 -156 -166 -176 -186 -196 -209 -223 -234 -246 -255 -236 -206 -177 -148 -119 -75 -58 -75 -93 -112 -131 -146 -162 -178 -194 -215 -236 -227 -192 -168 -143 -144 -145 -165 -186 -207 -227
-1226 -227 -226 -224 -223 -221 -213 -205 -197 -189 -198 -206 -215 -223 -221 -218 -216 -213 -214 -215 -216 -217 -202 -188 -173 -159 -176 -194 -211 -228 -244 -260 -291 -295 -251 -208 -162 -117 -114 -111 -108 -105 -103 -102 -100 -98 -81 -64 -47 -30 -49
-1232 -49 -69 -88 -108 -112 -116 -120 -124 -125 -127 -129 -131 -109 -86 -63 -41 -58 -75 -92 -109 -126 -143 -160 -177 -175 -173 -171 -169 -183 -196 -210 -224 -242 -261 -278 -295 -290 -257 -225 -219 -236 -253 -260
-1238 -260 -240 -206 -171 -164 -184 -208 -232 -231 -230 -247 -264 -279 -294 -298 -275 -267 -259 -249 -240 -230 -221 -197 -173 -150 -126 -131 -137 -142 -147 -133 -120 -108 -96 -81 -91 -130 -169 -204 -212 -208 -205 -211
-1243 -211 -217 -223 -228 -207 -185 -164 -142 -132 -121 -111 -101 -103 -106 -109 -112 -152 -193 -233 -274 -282 -290 -298 -306 -294 -282 -270 -258 -248 -238 -228 -219 -230 -242 -254 -266 -269 -271 -231 -191 -146 -128
-1248 -128 -121 -115 -112 -110 -108 -105 -116 -126 -136 -147 -148 -150 -152 -153 -170 -188 -205 -222 -208 -194 -181 -167 -169 -171 -172 -174 -184 -193 -203 -212 -202 -192 -181 -171 -176 -182 -187 -193 -208 -223 -253 -256 -241 -226 -210
-1253 -210 -193 -210 -227 -242 -258 -252 -219 -201 -184 -186 -188 -191 -193 -174 -156 -149 -168 -214 -261 -279 -271 -250 -230 -208 -185 -176 -166 -157 -147 -159 -170 -181 -193 -181 -170 -144 -144 -155 -166
-1258 -166 -193 -194 -194 -195 -193 -192 -191 -191 -205 -193 -189 -186 -180 -175 -184 -194 -219 -217 -187 -158 -127 -97 -94 -91 -88 -85 -95 -105 -115 -125 -134 -144 -180 -216 -221 -226 -232 -237 -211 -185 -159 -132 -144 -155 -167
-1263 -167 -179 -184 -190 -194 -198 -189 -155 -135 -115 -90 -65 -52 -65 -106 -146 -162 -177 -181 -185 -190 -194 -161 -129 -123 -117 -123 -129 -135 -141 -150 -158 -141 -123 -89 -55 -32 -36 -38 -39 -42 -45 -47 -48 -49 -51 -75 -99
-1269 -99 -123 -147 -160 -174 -161 -147 -134 -121 -135 -148 -164 -181 -197 -213 -198 -183 -168 -152 -143 -134 -126 -118 -133 -175 -202 -228 -235 -242 -249 -256 -258 -260 -262 -264 -242 -220 -225 -230 -232 -234 -263 -291 -313
-1274 -313 -335 -331 -326 -305 -284 -263 -242 -232 -222 -212 -202 -207 -213 -191 -169 -151 -132 -114 -95 -97 -100 -102 -105 -98 -90 -111 -158 -194 -204 -185 -167 -184 -200 -217 -234 -255 -277 -270 -237 -226
-1279 -226 -230 -224 -218 -221 -224 -227 -230 -223 -217 -210 -203 -181 -159 -137 -114 -117 -120 -123 -126 -115 -103 -117 -132 -135 -138 -142 -145 -176 -207 -211 -215 -195 -175 -155 -134 -130 -125 -120 -116 -92 -69 -57 -71 -100 -129 -132 -136 -141
-1285 -141 -147 -152 -158 -128 -98 -69 -39 -53 -66 -79 -93 -98 -103 -108 -113 -140 -167 -167 -168 -167 -167 -167 -166 -170 -174 -178 -182 -175 -167 -160 -153 -153 -153 -162 -157 -137 -144 -160 -177 -174 -157 -133 -136 -154 -172 -192 -212 -198
-1291 -198 -185 -170 -181 -193 -206 -193 -181 -160 -139 -145 -151 -158 -165 -186 -206 -212 -217 -235 -252 -258 -238 -206 -174 -174 -174 -161 -148 -129 -111 -136 -162 -192 -222 -225 -228 -224 -221 -232 -242 -245 -248 -237
-1296 -237 -227 -232 -237 -230 -222 -197 -171 -146 -121 -117 -112 -106 -127 -173 -219 -255 -265 -246 -228 -222 -215 -232 -249 -266 -283 -275 -267 -233 -198 -173 -149 -151 -153 -152 -151 -139 -127 -141 -181 -206 -231 -240
-1301 -240 -248 -230 -212 -184 -156 -141 -126 -140 -155 -157 -134 -112 -91 -83 -76 -59 -69 -107 -145 -165 -158 -139 -120 -122 -125 -127 -129 -143 -156 -145 -133 -122 -137 -152 -141 -97 -52 -33 -14
-1306 -14 -17 -20 -36 -53 -76 -99 -95 -91 -79 -66 -67 -68 -92 -115 -127 -113 -102 -91 -106 -120 -138 -156 -176 -170 -162 -153 -157 -160 -149 -139 -153 -168 -160 -126 -105 -110 -148 -186 -214 -216 -191 -166
-1311 -166 -153 -140 -130 -120 -135 -150 -166 -156 -147 -139 -144 -150 -155 -160 -163 -166 -169 -172 -190 -209 -201 -193 -180 -167 -154 -140 -143 -146 -149 -152 -149 -145 -141 -137 -143 -148 -154 -159 -154 -148 -142 -137 -131 -125 -119 -114 -114 -115 -116 -117 -117 -116 -116 -115
-1318 -115 -115 -115 -114 -114 -131 -148 -165 -182 -193 -203 -214 -224 -222 -219 -217 -214 -217 -220 -210 -200 -225 -250 -249 -247 -256 -265 -262 -232 -198 -164 -173 -182 -195 -208 -194 -180 -184 -188 -192 -196 -176 -156 -135 -115 -132
-1323 -132 -150 -194 -238 -267 -295 -297 -299 -276 -253 -229 -206 -201 -196 -192 -187 -199 -211 -223 -235 -218 -201 -185 -168 -167 -167 -166 -166 -181 -196 -211 -226 -223 -220 -217 -214 -207 -200 -194 -187 -162 -137 -138 -170 -208
-1329 -208 -224 -210 -196 -193 -190 -188 -185 -178 -171 -164 -157 -161 -166 -145 -124 -121 -139 -153 -153 -143 -134 -123 -113 -134 -155 -177 -198 -208 -217 -200 -183 -166 -148 -131 -113 -114 -115 -116 -116 -133 -149 -165 -182
-1334 -182 -178 -174 -170 -166 -137 -108 -94 -102 -122 -143 -164 -186 -163 -140 -117 -94 -94 -94 -94 -94 -101 -107 -114 -121 -122 -124 -126 -128 -142 -168 -200 -209 -200 -190 -178 -167 -118 -69 -40 -55 -88 -121 -158 -194
-1339 -194 -202 -210 -201 -178 -170 -189 -219 -248 -243 -238 -232 -227 -235 -243 -251 -259 -262 -265 -268 -271 -255 -239 -250 -261 -272 -283 -267 -252 -249 -247 -244 -242 -216 -190 -176 -188 -229 -269 -299 -302 -284 -253 -228 -202 -199
-1345 -199 -195 -191 -188 -162 -137 -138 -140 -133 -125 -118 -111 -117 -123 -128 -134 -138 -141 -145 -149 -159 -169 -180 -190 -189 -188 -187 -186 -199 -211 -224 -237 -240 -244 -220 -197 -180 -164 -174 -184 -191 -199 -206 -214 -198 -183 -168 -152 -150
-1351 -150 -148 -146 -144 -127 -110 -120 -129 -147 -165 -182 -200 -234 -267 -300 -333 -332 -331 -303 -275 -216 -156 -108 -87 -106 -126 -146 -167 -166 -164 -162 -160 -161 -161 -162 -162 -163 -163 -165 -166 -181 -210 -243 -255
-1356 -255 -250 -246 -239 -232 -220 -186 -158 -143 -139 -149 -160 -158 -140 -123 -104 -86 -92 -98 -105 -111 -114 -118 -121 -125 -124 -122 -121 -120 -136 -153 -195 -237 -274 -289 -272 -255 -239 -224 -235 -246 -254 -262 -251 -228
-1361 -228 -220 -234 -243 -238 -234 -229 -224 -219 -214 -209 -204 -199 -189 -178 -156 -155 -169 -183 -198 -213 -204 -195 -185 -176 -165 -154 -142 -131 -104 -77 -52 -26 -29 -53 -65 -76 -91 -106 -121 -135 -151 -166
-1367 -166 -208 -250 -283 -317 -306 -295 -281 -267 -280 -293 -277 -261 -245 -229 -212 -194 -177 -160 -176 -191 -207 -223 -237 -250 -263 -277 -261 -245 -230 -214 -201 -188 -163 -160 -174
-1371 -174 -200 -234 -245 -233 -222 -196 -193 -206 -219 -234 -248 -238 -228 -218 -207 -207 -206 -205 -204 -215 -225 -218 -197 -173 -170 -199 -228 -230 -232 -234 -236 -221 -206 -191 -176 -157 -139 -121 -103 -118
-1376 -118 -133 -148 -163 -185 -207 -229 -251 -249 -246 -243 -240 -232 -212 -186 -183 -186 -189 -194 -199 -191 -184 -177 -170 -182 -195 -208 -220 -230 -239 -249 -258 -259 -260 -261 -262 -263 -263 -237 -211 -185 -158 -163 -189 -212 -212 -181
-1381 -181 -151 -147 -143 -139 -135 -147 -159 -171 -183 -218 -254 -258 -240 -234 -241 -246 -237 -223 -195 -162 -151 -152 -153 -156 -158 -145 -132 -119 -106 -129 -152 -175 -197 -209 -221 -232 -244 -259 -274 -290 -305
-1386 -305 -291 -278 -264 -250 -223 -195 -169 -142 -134 -148 -171 -180 -163 -145 -149 -153 -163 -174 -184 -194 -219 -243 -249 -233 -209 -185 -182 -179 -184 -189 -181 -173 -175 -178 -193 -209 -222 -235 -218 -200 -177
-1391 -177 -154 -153 -153 -169 -198 -232 -244 -233 -222 -209 -197 -207 -218 -228 -239 -225 -211 -198 -184 -195 -206 -217 -229 -211 -193 -175 -158 -143 -128 -114 -99 -109 -118 -128 -138 -144
-1396 -144 -150 -156 -162 -158 -154 -150 -146 -134 -122 -124 -126 -141 -156 -148 -141 -124 -107 -113 -118 -125 -132 -139 -146 -142 -138 -133 -129 -157 -185 -196 -184 -171 -171 -176 -181 -171 -160 -150 -139 -140 -141 -142 -142 -150 -157 -164 -172 -171 -171 -170 -170 -157
-1402 -157 -144 -131 -118 -118 -117 -94 -71 -60 -50 -53 -56 -41 -27 -10 -21 -38 -54 -51 -47 -66 -85 -105 -124 -142 -160 -177 -195 -183 -171 -158 -146 -161 -177 -192 -207 -226 -245
-1407 -245 -242 -239 -221 -203 -185 -167 -157 -147 -160 -172 -172 -173 -160 -147 -151 -154 -157 -160 -178 -196 -214 -232 -228 -224 -221 -217 -224 -231 -239 -246 -240 -235 -229 -223 -229 -234 -239 -245 -231 -217 -204 -190 -183 -176 -168 -161 -144 -127
-1412 -127 -112 -97 -87 -104 -128 -153 -159 -165 -171 -177 -186 -194 -203 -212 -196 -180 -170 -186 -197 -182 -170 -158 -166 -174 -183 -191 -185 -178 -194 -209 -230 -251 -245 -240 -239 -239 -238 -238 -236 -234 -233 -231 -239 -247 -254 -262 -258 -255 -226
-1418 -226 -197 -200 -224 -236 -249 -253 -256 -260 -264 -275 -287 -267 -225 -175 -139 -142 -167 -194 -199 -192 -185 -182 -180 -177 -175 -177 -180 -182 -185 -171 -156 -142 -127 -136 -144 -152 -161 -202 -243 -258 -273 -260 -248 -235 -223
-1424 -223 -222 -220 -219 -218 -201 -184 -168 -151 -158 -164 -171 -178 -191 -205 -218 -232 -231 -230 -229 -228 -219 -210 -227 -244 -250 -256 -262 -269 -267 -265 -263 -262 -237 -212 -202 -214 -246 -279 -286 -293 -281 -269 -257 -245 -228 -210
-1430 -210 -194 -178 -154 -151 -173 -208 -234 -246 -241 -235 -216 -197 -179 -160 -144 -129 -140 -151 -157 -164 -170 -177 -185 -193 -201 -210 -219 -228 -237 -247 -247 -246 -246 -246 -240 -234 -254 -275 -295 -315 -309 -303 -271 -239 -208
-1435 -208 -176 -149 -122 -122 -122 -130 -137 -172 -206 -227 -248 -267 -287 -272 -235 -204 -187 -182 -191 -201 -197 -190 -182 -186 -212 -238 -242 -234 -225 -245 -265 -285 -305 -304 -302 -301 -299 -293 -287 -280 -274 -283 -293 -302 -311 -286
-1441 -286 -260 -235 -209 -189 -168 -174 -181 -177 -173 -169 -165 -156 -147 -140 -132 -151 -192 -229 -252 -267 -282 -307 -310 -278 -223 -173 -137 -126 -129 -125 -120 -121 -121 -121 -121 -128 -135 -154 -152 -125 -98 -90 -96 -117 -161 -209
-1446 -209 -227 -202 -164 -151 -151 -152 -153 -155 -157 -163 -168 -174 -179 -178 -177 -176 -175 -161 -148 -136 -124 -131 -164 -181 -197 -196 -168 -157 -146 -151 -183 -200 -217 -215 -212 -208 -204 -179 -127 -76 -51 -49 -60 -65 -71 -77
-1452 -77 -83 -89 -95 -97 -99 -100 -102 -93 -84 -74 -65 -76 -87 -97 -108 -126 -143 -161 -180 -188 -209 -238 -240 -220 -201 -179 -158 -167 -177 -186 -195 -179 -163 -173 -182 -205 -215 -186 -131 -67 -29 -28 -72
-1457 -72 -126 -153 -154 -155 -160 -164 -169 -174 -181 -189 -196 -204 -196 -187 -179 -171 -169 -166 -163 -160 -158 -155 -152 -149 -153 -156 -159 -162 -165 -169 -172 -175 -184 -193 -202 -211 -220 -230 -239 -248 -243 -238 -234 -229 -224 -220 -215 -210 -209 -207 -205 -204 -209 -214 -219 -224 -219 -214 -209 -204 -188 -172 -156
-1465 -156 -140 -135 -130 -126 -121 -127 -133 -139 -145 -162 -179 -196 -212 -222 -233 -243 -253 -232 -211 -189 -168 -177 -186 -185 -199 -202 -184 -179 -174 -168 -162 -155 -149 -157 -165 -164 -176 -194 -189 -198 -206 -199 -193 -186 -180 -173 -166 -160 -153 -134
-1471 -134 -114 -95 -75 -89 -103 -117 -130 -165 -200 -235 -269 -275 -281 -287 -293 -279 -264 -250 -235 -230 -225 -221 -216 -189 -175 -185 -217 -249 -268 -277 -272 -257 -241 -225 -208 -215 -221 -227 -233 -251 -269
-1476 -269 -285 -301 -301 -279 -269 -259 -222 -184 -148 -113 -110 -138 -156 -161 -160 -160 -158 -157 -157 -157 -157 -157 -137 -116 -122 -128 -118 -107 -97 -86 -68 -50 -46 -64 -76 -88 -101 -115 -100 -86 -84 -105
-1481 -105 -128 -137 -128 -120 -129 -139 -148 -158 -145 -133 -121 -109 -104 -100 -96 -91 -93 -96 -97 -99 -86 -61 -30 -22 -45 -68 -75 -68 -67 -87 -127 -154 -155 -133 -116 -112 -113 -115 -143 -171 -209 -233 -233 -210 -182
-1487 -182 -153 -123 -92 -60 -27 -22 -16 -31 -46 -62 -77 -100 -124 -148 -171 -167 -163 -159 -155 -141 -128 -140 -153 -161 -169 -150 -132 -123 -114 -105 -95 -92 -76 -55 -57 -90 -137 -176 -216 -242 -247
-1492 -247 -227 -195 -181 -180 -171 -162 -137 -111 -99 -108 -124 -127 -112 -97 -90 -83 -78 -72 -67 -83 -112 -141 -149 -129 -125 -121 -111 -101 -118 -135 -154 -173 -165 -157 -155 -153 -151 -149 -149 -148 -148 -148 -147 -146 -119 -91 -79
-1497 -79 -67 -55 -42 -46 -49 -53 -56 -54 -51 -76 -100 -136 -173 -179 -159 -137 -114 -90 -65 -62 -60 -57 -54 -48 -42 -36 -30 -24 -18 -12 -6 -26 -46 -64 -83 -87 -65 -16 33 70 80 86 77 45 0 -27
-1503 -27 -28 -23 -17 -9 -2 -2 -3 -29 -56 -78 -99 -120 -141 -135 -129 -123 -117 -108 -100 -91 -83 -71 -60 -48 -36 -41 -47 -52 -57 -48 -38 -55 -72 -67 -62 -57 -52 -56 -59 -62 -66 -75 -84 -91 -98 -113 -101 -69 -23 16 29
-1509 29 32 34 35 35 35 36 22 7 20 32 32 32 23 27 41 29 0 -17 -10 -3 -24 -71 -108 -131 -144 -144 -132 -121 -135 -150 -160 -170 -168 -165 -161 -158 -128 -99 -77 -56 -34 -13 4
-1515 4 22 14 5 -3 -12 -22 -31 -33 -34 -22 -10 4 19 58 97 103 64 17 -16 -33 -37 -47 -58 -67 -77 -73 -69 -38 -8 9 1 -12 -27 -30 -32 -25 -18 -24 -30 -42 -53 -65 -77 -85 -93 -75
-1520 -75 -56 -35 -15 -20 -24 -19 -1 11 -2 -22 -42 -36 -31 -28 -25 -39 -66 -75 -57 -28 0 0 0 0 0 -12 -24 -37 -49 -65 -82 -86 -64 -32 0 25 38 27 -10 -48 -59
-1525 -59 -45 -17 11 27 27 27 26 26 32 38 43 49 49 50 50 50 28 7 12 17 36 55 74 94 80 67 54 40 56 71 73 75 51 27 15 30 41 51 64 77 83 88 94 100 114
-1531 114 128 115 103 95 87 106 125 134 143 125 107 92 77 75 73 75 77 79 82 96 111 99 87 89 90 92 94 65 36 7 -21 -13 -5 1 9 26 44 74 105 130 155 136 117
-1536 117 102 87 98 110 89 68 46 25 17 8 1 -6 -2 15 39 38 25 12 24 36 55 74 80 86 86 86 100 113 125 136 135 133 124 115 106 97 93 89 85 82 98 128 165 175
-1541 175 163 150 136 122 123 124 139 153 163 173 160 147 164 180 196 212 200 188 175 163 166 169 172 175 165 155 145 135 150 164 179 193 206 219 232 245 238 231
-1546 231 225 218 208 198 188 178 193 207 222 236 240 244 248 252 256 259 263 267 253 238 223 208 195 181 167 153 151 150 162 174 186 198 188 178 160 142 156 169 197 225
-1551 225 231 236 233 229 239 249 243 237 231 226 222 219 216 213 221 229 237 245 252 258 265 271 276 280 285 290 297 305 282 259 233 207 203 200 223 247 258 268 264 260 270 280 275 270 265 260 264 268 272 276 251 226 211
-1557 211 218 227 236 247 257 288 319 331 321 301 281 273 265 257 248 253 259 265 272 259 260 284 329 376 400 400 400 398 397 361 326 285 257 260 286 299 313 320 327 334 341 338 335 332 328 326 323 333
-1563 333 343 331 305 296 309 324 326 337 349 345 341 337 333 335 337 338 340 342 343 345 347 341 335 329 324 329 334 340 345 357 370 382 395 396 398 399 401 392 383 374 365 363 361 359 357 370 383 397 410 408 406 404 402
-1570 402 405 408 412 415 418 421 425 428 438 448 458 468 458 448 438 428 444 461 477 493 498 503 508 514 500 486 473 459 466 472 478 485 476 467 458 449 440 431 422 412 409 406 403 400 417 434 450 465
-1576 465 474 460 459 458 445 432 418 405 406 407 408 409 408 407 432 457 491 511 508 483 454 438 439 441 450 459 468 476 494 511 528 545 553 560 568 575 576 577 577 578 547 516 485 454 452 450 448 446
-1581 446 459 471 484 497 510 522 535 548 553 558 563 568 567 565 563 562 561 559 558 557 545 532 521 511 507 526 540 540 543 545 547 549 536 523 510 496 512 528 544 559 584 610 635
-1587 635 660 656 653 649 645 638 630 623 615 608 600 593 586 598 610 622 634 631 628 625 621 606 590 574 559 572 585 598 611 614 616 619 621 639 657 675 693 686 678 671 664 645 627 608 590 598 607
-1592 607 616 624 633 642 650 659 676 694 711 728 717 705 694 682 681 679 678 676 686 695 705 715 712 710 707 705 709 714 718 722 742 763 783 803 798 794 790 785 765 744 723 703 705 707 709 711 727 743
-1598 743 733 722 693 664 680 696 722 749 749 749 736 723 737 751 754 756 758 760 758 755 752 750 774 797 821 845 862 879 851 824 808 793 804 815 819 824 828 833 833 833 833 833 833 833
-1604 833 833
-1604H33
##END=	
##END=	
