##TITLE=	Nov08-2021.20.fid
TM-VI-152

##JCAMP-DX=	6.0	$$ MestReNova 14.3.1-31739
##DATA TYPE=	LINK
##BLOCK_ID=	1
##BLOCKS=	2    
##ORIGIN=	Mestrelab Research S.L.
##OWNER=	hrzepa
##$MNOVA/LINK_BLOCK_TYPE=	ITEM	$$ NMR Spectrum
##$MNOVA/ITEM/POLYGON=	(XY..XY)
5321,5835
8722,5835
8722,8208
5321,8208
5321,5835
##$MNOVA/ITEM/Z=	0
##$MNOVA/ITEM/ANGLE=	0
##TITLE=	Nov08-2021.20.fid
##JCAMP-DX=	6.0	$$ MestReNova 14.3.1-31739
##BLOCK_ID=	2
##DATA TYPE=	MNOVA NMR VIEW DATA
##DATA CLASS=	MNOVA VIEW DATA
##$MNOVA/ITEM/ZOOM/X=	-4.0107147498308073352,	16.011019999997905927
##$MNOVA/ITEM/ZOOM/Y=	-442.7381647527217865,	4864.97613525390625
##END=	
##TITLE=	Nov08-2021.20.fid
##JCAMP-DX=	6.0	$$ MestReNova 14.3.1-31739
##BLOCK_ID=	3
##DATA TYPE=	NMR SPECTRUM
##DATA CLASS=	XYDATA
##NUMDIM=	1
##ORIGIN=	Bruker BioSpin GmbH
##OWNER=	nmr
##.OBSERVE FREQUENCY=	400.20240119999999706
##.OBSERVE NUCLEUS=	^1H
##.SOLVENT NAME=	CDCl3
##.PULSE SEQUENCE=	zg30
##LONGDATE=	2021/11/08 10:55:00.000
##.ACQUISITIONMODE=	SIMULTANEOUS (DQD)
##$ORIGINAL FORMAT=	Bruker XWIN-NMR
##$MNOVA/SCALES_VERSION=	9
##$PARAMETER FILE=	(acqus, ASCII, /private/var/folders/f6/rjf_tdyn2v98c5c0wvkgn4s80000gn/T/RbNSuh6+Qb+QMWup4kjysA/20/acqus, 0)
$$ ##TITLE= Parameter file, TOPSPIN		Version 3.2
$$ ##JCAMPDX= 5.0
$$ ##DATATYPE= Parameter Values
$$ ##NPOINTS= 11	$$ modification sequence number
$$ ##ORIGIN= Bruker BioSpin GmbH
$$ ##OWNER= nmr
$$ $$ 2021-11-08 10:55:49.171 +0000  nmr@CZC2439F63
$$ $$ /opt/topspin/data/agmb/nmr/Nov08-2021/20/acqus
$$ $$ process /opt/topspin3.2/prog/mod/shimcntl
$$ ##$ACQT0= -2.10084033613445
$$ ##$AMP= (0..31)
$$ 100 100 100 100 100 100 100 100 100 100 100 100 100 100 100 100 100 100
$$ 100 100 100 100 100 100 100 100 100 100 100 100 100 100
$$ ##$AMPCOIL= (0..19)
$$ 0 0 0 0 0 0 0 0 0 0 0 0 0 0 0 0 0 0 0 0
$$ ##$ANAVPT= -1
$$ ##$AQSEQ= 0
$$ ##$AQ_mod= 3
$$ ##$AUNM= <au_zg>
$$ ##$AUTOPOS= <45 >
$$ ##$BF1= 400.2
$$ ##$BF2= 400.2
$$ ##$BF3= 400.2
$$ ##$BF4= 400.2
$$ ##$BF5= 400.2
$$ ##$BF6= 400.2
$$ ##$BF7= 400.2
$$ ##$BF8= 400.2
$$ ##$BYTORDA= 0
$$ ##$CAGPARS= (0..11)
$$ 0 0 0 0 0 0 0 0 0 0 0 0
$$ ##$CFDGTYP= 0
$$ ##$CFRGTYP= 9
$$ ##$CHEMSTR= <none>
$$ ##$CNST= (0..63)
$$ 1 1 145 1 1 1 1 1 1 1 1 1 1 1 1 1 1 1 1 1 1 1 1 1 1 1 1 1 1 1 1 1 1 1 1
$$ 1 1 1 1 1 1 1 1 1 1 1 1 1 1 1 1 1 1 1 1 1 1 1 1 1 1 1 1 1
$$ ##$CPDPRG= (0..8)
$$ <> <> <> <> <mlev> <mlev> <mlev> <mlev> <mlev>
$$ ##$D= (0..63)
$$ 0 1 0 0 0 0 0 0 0 0.06 0 0 0 0 0 0 0.0002 0 0 0 0 0 0 0 0 0 0 0 0 0 0 0
$$ 0 0 0 0 0 0 0 0 0 0 0 0 0 0 0 0 0 0 0 0 0 0 0 0 0 0 0 0 0 0 0 0
$$ ##$DATE= 1636368948
$$ ##$DE= 6.5
$$ ##$DECBNUC= <off>
$$ ##$DECIM= 2496
$$ ##$DECNUC= <off>
$$ ##$DECSTAT= 4
$$ ##$DIGMOD= 1
$$ ##$DIGTYP= 12
$$ ##$DQDMODE= 0
$$ ##$DR= 22
$$ ##$DS= 2
$$ ##$DSPFIRM= 0
$$ ##$DSPFVS= 20
$$ ##$DTYPA= 0
$$ ##$EXP= <proton>
$$ ##$F1LIST= <111111111111111>
$$ ##$F2LIST= <222222222222222>
$$ ##$F3LIST= <333333333333333>
$$ ##$FCUCHAN= (0..9)
$$ 0 2 0 0 0 0 0 0 0 0
$$ ##$FL1= 90
$$ ##$FL2= 90
$$ ##$FL3= 90
$$ ##$FL4= 90
$$ [...]
$$ ##$Sgu3PowerLevels= (0..7)
$$ 0 0 0 0 0 0 0 0
$$ ##$Sgu4PowerLevels= (0..7)
$$ 0 0 0 0 0 0 0 0
$$ ##$Sgu5PowerLevels= (0..7)
$$ 0 0 0 0 0 0 0 0
$$ ##$Sgu6PowerLevels= (0..7)
$$ 0 0 0 0 0 0 0 0
$$ ##$Sgu7PowerLevels= (0..7)
$$ 0 0 0 0 0 0 0 0
$$ ##$Sgu8PowerLevels= (0..7)
$$ 0 0 0 0 0 0 0 0
$$ ##$SguType= 3
$$ ##$ShimPowMaxUA= (0..63)
$$ 130000 130000 130000 130000 130000 130000 130000 130000 130000 130000 130000
$$ 130000 130000 130000 130000 130000 130000 130000 130000 130000 0 0 0 0
$$ 0 0 0 0 0 0 0 0 0 0 0 0 0 0 0 0 0 0 0 0 0 0 0 0 0 0 0 0 0 0 0 0 0 0 0 0
$$ 0 0 0 0
$$ ##$ShimPowMaxUC= (0..63)
$$ 130000 130000 130000 130000 130000 130000 130000 130000 130000 130000 130000
$$ 130000 130000 130000 130000 130000 130000 130000 130000 130000 0 0 0 0
$$ 0 0 0 0 0 0 0 0 0 0 0 0 0 0 0 0 0 0 0 0 0 0 0 0 0 0 0 0 0 0 0 0 0 0 0 0
$$ 0 0 0 0
$$ ##$ShimPowMaxUG= (0..63)
$$ 524287 524287 524287 524287 524287 524287 524287 524287 524287 524287 524287
$$ 524287 524287 524287 524287 524287 524287 524287 524287 524287 0 0 0 0
$$ 0 0 0 0 0 0 0 0 0 0 0 0 0 0 0 0 0 0 0 0 0 0 0 0 0 0 0 0 0 0 0 0 0 0 0 0
$$ 0 0 0 0
$$ ##$ShimPowRcbType= 3
$$ ##$ShimPowRes= (0..63)
$$ 1e-20 1e-20 1e-20 1e-20 1e-20 1e-20 1e-20 1e-20 1e-20 1e-20 1e-20 1e-20
$$ 1e-20 1e-20 1e-20 1e-20 1e-20 1e-20 1e-20 1e-20 0 0 0 0 0 0 0 0 0 0 0 0
$$ 0 0 0 0 0 0 0 0 0 0 0 0 0 0 0 0 0 0 0 0 0 0 0 0 0 0 0 0 0 0 0 0
$$ ##$ShimPowRng0= (0..63)
$$ 1 1 1 1 1 1 1 1 1 1 1 1 1 1 1 1 1 1 1 1 0 0 0 0 0 0 0 0 0 0 0 0 0 0 0 0
$$ 0 0 0 0 0 0 0 0 0 0 0 0 0 0 0 0 0 0 0 0 0 0 0 0 0 0 0 0
$$ ##$ShimPowRng1= (0..63)
$$ 1 1 1 1 1 1 1 1 1 1 1 1 1 1 1 1 1 1 1 1 0 0 0 0 0 0 0 0 0 0 0 0 0 0 0 0
$$ 0 0 0 0 0 0 0 0 0 0 0 0 0 0 0 0 0 0 0 0 0 0 0 0 0 0 0 0
$$ ##$ShimPowRng2= (0..63)
$$ 1 1 1 1 1 1 1 1 1 1 1 1 1 1 1 1 1 1 1 1 0 0 0 0 0 0 0 0 0 0 0 0 0 0 0 0
$$ 0 0 0 0 0 0 0 0 0 0 0 0 0 0 0 0 0 0 0 0 0 0 0 0 0 0 0 0
$$ ##$ShimPowRng3= (0..63)
$$ 1 1 1 1 1 1 1 1 1 1 1 1 1 1 1 1 1 1 1 1 0 0 0 0 0 0 0 0 0 0 0 0 0 0 0 0
$$ 0 0 0 0 0 0 0 0 0 0 0 0 0 0 0 0 0 0 0 0 0 0 0 0 0 0 0 0
$$ ##$ShimSysFunc= (0..63)
$$ 1 2 3 4 5 7 9 11 15 16 8 10 12 14 6 17 13 18 19 20 0 0 0 0 0 0 0 0 0 0
$$ 0 0 0 0 0 0 0 0 0 0 0 0 0 0 0 0 0 0 0 0 0 0 0 0 0 0 0 0 0 0 0 0 0 0
$$ ##$ShimSysMatrix= 0
$$ ##$ShimSysType= 1
$$ ##$TFXNUM= 0
$$ ##$TRIPLO2= 0
$$ ##$VTU= 2
$$ ##$VTUETH= <149.236.99.20>
$$ ##$VTUTY= <no>
$$ ##$WBREFAM= (0..15)
$$ 135.5 97.7 100 100 100 100 100 100 100 100 100 100 100 100 100 100
$$ ##$WBREFLM= (0..15)
$$ 0 0 0 0 0 0 0 0 0 0 0 0 0 0 0 0
$$ ##$WBREFPH= (0..15)
$$ 72.26 -67.22 0 0 0 0 0 0 0 0 0 0 0 0 0 0
$$ ##$WBSGU= (0..15)
$$ 0 0 0 0 0 0 0 0 0 0 0 0 0 0 0 0
$$ ##$XFAC= 2
$$ ##END=
$$ 
##$DECIM=	2496
##$DSPFVS=	20
##XUNITS=	HZ
##YUNITS=	ARBITRARY UNITS
##FIRSTX=	6407.6102040000005218
##LASTX=	-1605.0880428824991668
##DELTAX=	-0.12226593800080109986
##XFACTOR=	1
##YFACTOR=	0.020234196678910784661
##FIRSTY=	5.6214146614074707031
##MINY=	-0.46759590506553649902
##MAXY=	4422.70556640625
##NPOINTS=	65536
##XYDATA=	(X++(Y..Y))
$$ [...]
2018H24k1L8M5Oj7rrl3l5J0P1J01Q1L0j5k2NK0j2o1p8m8j0RJ1%k4m7m6k2j2k1l1j9jN%j9n3
$$ 824 803 841 886 892 875 866 857 824 789 799 870 971 1052 1082 1067 1045 1050 1070 1058 997 919 871 861 870 881 881 857 810 764 742 730 709 678 659 658 663 663 644 591
2013E91p7n1J5N8L9jjK2J0l2m5j4Pk3n6m1NK2jj9r%j2k1lK4K6Rjj0l3n7m5PN2O1L9Ok7m6k5
$$ 591 514 463 478 536 575 574 573 595 605 573 528 514 521 498 442 401 406 428 427 408 399 399 387 366 363 387 413 422 421 411 378 321 276 283 335 396 435 441 414 368 343
2008C43K0M0J5j2oMj7m0k6OPk2k9mJ5J1J4K5J7j2k2p%KL8R7R4Op3n6J6M1QrNKk6l1mK0K2L5
$$ 343 363 403 418 406 400 404 387 347 321 327 334 312 283 279 294 305 319 344 361 349 327 320 320 322 360 457 551 557 484 428 444 485 493 484 489 491 465 434 430 450 472 507
2003E07N2K4m6q0l5L0M5K1J0J6J7J6K9M9M4K2J0J0LlJ2L8M6L4K3J8J1rk3l1l4k1J2M1L3%j0
$$ 507 559 583 537 457 422 452 497 518 528 544 561 577 606 655 699 721 731 741 744 741 753 791 837 871 894 912 923 914 891 860 826 805 817 858 891 891 881
1998H81J1K6Ok5l1k6l7n5n4k9j4k6m1k6RL4K7J1J1K8K6j0n7p8o3l0jQjj8k0mJ6K4K4K0J1j0
$$ 881 892 918 924 899 868 842 805 750 696 667 653 627 586 560 569 603 630 641 652 680 706 696 639 561 498 468 467 475 474 456 436 432 448 472 496 516 527 517
1994E17l2m4m0k5kJ1Kj5JM7O6K4k7j8L6N1Kn1n0k3rlJ7L1J4j4j3J7L4J8prJ0K7L0K0PKLJ3
$$ 517 485 441 401 376 374 385 387 372 373 420 486 510 483 465 501 552 554 503 453 430 421 418 435 466 480 466 453 470 504 522 515 506 516 543 573 593 600 602 605 618
1989F18M0P0O5J8j8J2P5Q2K5j4J4M1jn7l6L7N1j5p2o1j7MMPLj2k1j3qj4j0Qkn5j03q9k3K2
$$ 618 658 728 793 811 793 805 880 962 987 973 987 1028 1027 970 934 971 1022 1007 935 874 857 861 865 872 875 863 842 829 821 807 797 805 803 748 645 556 533 555
1984E55J6j2j5PK3J3kJJ4mm9o0oN5M5j5m2k4l1q3j03m6K1K6LJ6M3L3JQL9L2j0j7K4N4M0J6
$$ 555 571 559 544 551 574 587 585 586 600 596 547 487 481 536 581 566 524 500 469 386 283 237 258 284 287 303 346 379 380 388 427 459 449 432 456 510 550 566
1979E66RJ0J7M1O0K2n6q1j1P3Q0K6j0mJ6K3K5K8K0Q%kk%Lnk0k1lMrk0nQ%qJ0K8Ol9n7l3kQ
$$ 566 575 585 602 643 703 725 669 588 577 650 730 756 746 742 758 781 806 834 854 862 862 860 858 858 861 856 836 815 812 816 807 787 782 790 790 782 792 820 826 787 730 697 695 703
1974G03NKkmmj5m1m9j2L8L8j6n5l6LLk5l9k4mJ3L2M0K2j9m4l5j1ok1l7l1lK6L0Nk1qL5N7K0
$$ 703 708 710 708 704 700 685 644 595 583 621 659 643 588 552 555 558 533 494 470 466 479 511 551 573 554 510 475 464 458 437 400 369 366 392 422 427 406 398 433 490 510
1969E10m4p2m3oJjJ7N2P0N5Rm6p9o1mL7L5K6M5N9J7n4p5l3J7K7J4Jj3k5qJ6on7o0NN1J6k8
$$ 510 466 394 351 345 346 345 362 414 484 539 548 502 423 362 358 395 430 456 501 560 577 523 448 415 432 459 473 474 461 436 428 444 438 381 321 326 377 393 365
1964C65JN8M6k4n3j7J2KJL0L9%l0pL1K0l0o1m5jL7M6L0J8L3M8K4k7n6m0j0J1K2J2l0o7m7J0
$$ 365 366 424 470 446 393 376 388 390 391 421 460 460 430 423 454 474 444 383 338 337 374 420 450 468 501 549 573 546 490 450 440 451 473 485 455 388 341 351
1960C51K2k4m5LM8L1%K3O2N1ml8n0o5n8MO8N8ol1NL3K1L%j4l7k6K1M6L0J3J1j4o3o6OO9M5
$$ 351 373 349 304 307 355 386 386 409 471 522 518 480 430 365 307 311 379 437 431 400 405 438 459 462 462 448 411 385 406 452 482 495 506 492 429 363 369 438 483
1955D83k2m3j5kj7k5j4nOL5N6K2m1n9j5L2L7K1J7J0mmJ8K0j9n3l2K5M6K1j1k1l0m9m9j8J3
$$ 483 461 418 403 401 384 359 345 340 346 381 437 459 418 359 344 376 413 434 451 461 457 453 471 491 472 419 387 412 458 479 468 447 417 368 319 301 314
1950C14J3%J0L3L6J8J5L0L3J2j2k4n0r2r5j8Q8J22N7k8m8qK7K5MmKKj9m7m9j1M0M7%n6o8k9
$$ 314 327 327 337 370 406 424 439 469 502 514 502 478 428 336 241 223 311 433 490 462 414 406 433 458 462 458 460 462 443 396 347 336 376 423 423 367 299 270
1946B70J9M1L4J7J1J1Nqj3%K2L4K3%k5m1l6rJ7K6K6M0N2L3pk0JJ3j4n1n4l1j3j0oOK1M0N0
$$ 270 289 330 364 381 392 403 408 400 387 387 409 443 466 466 441 400 364 355 372 398 424 464 516 549 542 522 523 536 522 471 417 386 373 363 357 363 384 424 474
1941D74L4ok9nK9K2j5k0K5N5K7l0o2n4l6k5j4%QOJ2L4N4L9j2n0l8RL2Km4n7l7pK3N3O9N3J4
$$ 474 508 502 473 468 497 519 504 484 509 564 591 561 499 445 409 384 370 370 378 384 396 430 484 523 511 461 423 432 464 466 422 365 328 321 344 397 466 519 533
1936E33j6k6k8k6j0J3J5nk2rQOj2j8pLMjjPJ4K1K5K1jk6l0mK3J7rj5J2L4K3jj6k5m2m7j7J5
$$ 533 517 491 463 437 427 440 455 450 428 419 427 433 421 403 396 399 403 402 401 408 422 443 468 489 488 462 432 428 451 468 459 444 456 490 513 512 496 471 429 382 365 380
1931C80Rj9oN0P8M3j2l2k8l0l4j2L0M5K4mlK0K7jl9n0k5mrk0rNmj5J0M6K5l7n8JO4N5Kl0k9
$$ 380 389 370 364 414 492 535 523 491 463 433 399 387 417 462 486 482 479 499 526 525 486 436 411 407 398 378 369 374 370 355 365 411 436 399 341 342 406 461 463 433 404
1926D04k5qL6O6M0qj7Kj0m9n1j0K0J1MJ4Qk4l5kK9K1PK3K9j4o6o0lK9J5ooJl%J7L3K6lk8l2
$$ 404 379 371 407 473 513 505 488 490 480 431 380 370 390 401 405 419 427 403 368 366 395 416 423 446 475 461 395 335 332 361 376 370 364 365 362 362 379 412 438 435 407 375
1921C75oL3N8M4J2rrrk1l4l0j1J3K3J2j2k2qPKj3j4ppjK9N3L0l4p2m5OK9K1J6K0Rk0l5j8J9
$$ 375 369 402 460 504 516 507 498 489 468 434 404 393 406 429 441 429 407 399 406 408 395 381 374 367 366 395 448 478 444 372 327 333 362 383 399 419 428 408 373 355 374
1916C74M6N3N2M6K1k2n2l4K3N9L7k0n8o0n1m2k6jJ8K5K4J2j8l9j8L6O3M3J8K4K7lm8o1m0j4
$$ 374 420 473 525 571 592 570 518 484 507 566 603 583 525 465 414 372 346 345 363 388 412 424 406 367 349 385 448 491 509 533 560 557 509 448 408 394
1911C94RK6J6k9n9l0K0J5l7n6rM2M7L5M2N3L1oj9j0j0j9k1pRJ6Pk6n8m6PL7Mn1n3nL1K7Po
$$ 394 403 429 445 416 357 327 347 362 325 269 260 302 349 384 426 479 510 504 485 475 465 446 425 418 427 443 450 424 366 320 327 364 368 317 264 259 290 317 324 318
1907C18j3oL0P6Q2L7j7l4k0JJ1Kk0l1j2J7K4O%Kj0l6l1J0L0Kl0j6K2L0NrMK0J0k7p1q5m2L7
$$ 318 305 299 329 405 487 524 507 473 453 454 465 467 447 416 404 421 445 451 451 453 443 407 376 386 416 418 388 372 394 424 429 420 424 444 454 427 356 271 229 266
1902B66Q2O1K1J0J1rl3k5Jkj8lK4Rl8l9RL3kk2K0O7M8qk0LJk8k6J6L8J2k3k7j9k4k5oK2L3
$$ 266 348 409 430 440 451 442 409 384 385 383 365 362 386 395 357 318 327 360 358 336 356 423 471 463 443 446 447 419 393 409 447 459 436 409 390 366 341 335 357 390
1897C90L4L0J1k6m7k4K4M6K7rl2l4k1pNK1M6O7N2mn6n1ON6M5j0m5l4qj2l1k4J8M9L6QOK0Q
$$ 390 424 454 465 439 392 368 392 438 465 456 424 390 369 362 367 388 434 501 553 549 493 442 448 504 549 539 494 460 452 440 409 385 403 452 488 496 502 522 530
1892E30k7m9l6j9j5qJ7L0J3j2j0J2K1J7Nj3l7m4j1K7K9QPK7K1k4n4l9j3j0rK1N5N4K9J3ll9
$$ 530 503 454 418 399 384 376 393 423 436 424 414 426 447 464 469 456 419 375 364 391 420 428 435 462 483 459 405 366 353 343 334 355 410 464 493 506 503 464
1887D64p0m6J5M2J0k4j4K1M4N3N6M0%l6m8m3m2l7j1K1L2J9nl6n7l9J8N9M8J6K0L9J5m0m7J5
$$ 464 394 348 363 405 415 391 377 398 442 495 551 591 591 555 507 464 422 385 374 395 427 446 441 405 348 309 327 386 434 450 470 509 524 484 437 452
1883D52O7M5j6l8j7JkjJ3J7jk3l3l3m2n1m5j5J9K7PmK7P6Q3L0k6l6qRMpj6l1m3k9J4N4O3L3
$$ 452 519 564 548 510 493 494 492 491 504 521 520 497 464 431 389 338 293 278 297 324 331 327 354 430 513 543 517 481 473 482 486 479 463 432 389 360 374 428 491 524
1878E24k0o7p3k5L2M6J9qj6j8k0nK7L8Pk3j8NJ0lrrk2k7MM7M8ll8qM3M7mm9m9k2JJ3J6Nj1
$$ 524 504 437 364 339 371 417 436 428 412 394 374 369 396 434 441 418 400 405 415 412 403 394 372 345 349 396 444 441 403 395 438 485 481 432 383 361 362 375 391 396 385
1873C85j1QK0Kk6l1j2LPQJ1J1J1K4L2Rl9o1k8K2L5J4jjmj6k0j0oj5k3j7mJ6L9N8N0J7j4k9
$$ 385 374 382 402 404 378 347 335 338 345 353 364 375 386 410 442 451 412 351 323 345 380 394 393 392 388 372 352 342 336 321 298 281 277 293 332 390 440 457 443 414
1868D14l3l3k1kMnoJ4L6L1Qpj3j5qJ9M6L9Kl5m4l4j8nJ2K8L3K6J1KKJj3k7k1LJ6Mo%%k4m0
$$ 414 381 348 327 325 329 324 318 332 368 399 407 400 387 372 364 383 429 468 470 435 391 357 339 334 346 374 407 433 444 446 448 449 436 409 388 391 407 411 405 405 405 381 341
1863C41k3J1J8KKK6L6K0OQLk4l6rK8K8ql8l2rMKqpJ2L1K0j8m5l1LK2K7L2L3J6jQJ7j0n2m6
$$ 341 318 329 347 349 351 377 413 433 439 447 450 426 390 381 409 437 429 391 359 350 354 356 348 341 353 384 404 386 341 310 313 335 362 394 427 443 442 450 467 457 405 359
1858C59J4N6L2j2j3J1Nk6k9OL0J6nj1j3l2l9j8J5K7K7K3Ml4n1nO2O9Pl8rL5K1l4n6l0qj3p
$$ 359 373 429 461 449 436 447 452 426 397 403 433 449 444 433 420 388 349 331 346 373 400 423 427 393 342 337 399 468 475 437 428 463 484 450 394 364 356 343 336
1853C36K4L8kn0m6OM0L0Pkj2l3l9j0K2J9j0j3K1N4M4Lk5k1KJ9K0RJJ3M7O2K6l8o5k9J6J2k7
$$ 336 360 398 396 346 300 306 346 376 383 381 369 336 297 287 309 328 318 305 326 380 424 427 402 381 383 402 422 431 432 445 492 554 580 542 477 448 464 476 449
1848D49l9j5jj5k3J2N2M2j2m6k3K5M8L6J3oj6k3k4j6PL1K9Kj5J0M9M8Mk4pK8L6L1L1J8k8q1
$$ 449 410 395 394 379 356 368 420 462 450 404 381 406 454 490 503 497 481 458 434 418 425 456 485 487 472 482 531 579 583 559 552 580 616 647 678 696 668 587
1844E87q2m2j3j7j1K1L5Ll9l3J0L7K5Mrk1l7m4k6kJ3J5J4J3J2J4J0ql0l6j1K8M7L5J0PL1N1
$$ 587 505 463 450 433 422 443 478 481 442 409 419 456 481 485 476 455 418 374 348 346 359 374 388 401 413 427 437 429 399 363 352 380 427 462 472 479 510 561
1839E61L5kj3K2O2O0L2K0L3L9K1KOK0K9K6Qk7n8n1pL0K0k3o2q6r3p2k8NJj7j7pj5l5l1kJ8
$$ 561 596 594 581 603 665 725 757 777 810 849 870 872 878 898 927 953 961 934 876 825 818 848 868 845 783 697 604 532 504 509 510 493 476 469 454 419 388 386 404
1834D04J3RK1L5K4nk6k1J0M5N0J0l5k9K2N2L0plK9L9J6kQK9L0J8J5K8L8J9k0m1j1M2O7M1o
$$ 404 417 426 447 482 506 501 475 454 464 509 559 569 534 505 527 579 609 602 599 628 667 683 681 689 718 748 766 781 809 847 866 846 805 794 836 903 944 938
1829I38l8m9m9l9j9j4m2p7p1k3J9Rl0n0l6j8j7j6ML3L3Nj2J0L8K4k3m8k4J8L5K9J4ql7m4r
$$ 938 900 851 802 763 744 730 688 611 540 517 536 545 515 465 429 411 394 378 382 415 448 453 441 451 489 513 490 442 418 436 471 500 514 506 469 425 416
1825D16M0N0Pm0m5rK1K6K1L3N5O0M1K3K3J5k4o6n6jL1ln9o7k9mj2k3j3LRQJ1J5J8K0J5jk2
$$ 416 456 506 513 473 428 419 440 466 487 520 575 635 676 699 722 737 713 647 591 590 621 618 559 492 463 459 447 424 411 414 423 431 442 457 475 495 510 509 487
1820D87l0l0k8k7j4KPLJ0K6L3K2Nj0k7l4j4K3M1K8Oj0k1l1k7ojj7k0J2M3K5k5m4j0K8K5rl0
$$ 487 457 427 399 372 358 360 367 370 380 406 439 461 466 456 429 395 381 404 445 473 479 469 448 417 390 384 383 366 346 358 401 426 401 357 347 375 400 391 361
1815C61k0LK0K3J6Rok3k7qJ7J5j6l3pM0N2J9k1l0j1J3K9L5L3J6ql1l7k8j1KKnqmMJ5L3M7L2
$$ 361 341 344 364 387 403 412 406 383 356 348 365 380 364 331 324 364 416 435 414 384 373 386 415 450 483 499 491 460 423 395 384 386 388 383 375 371 375 390 423 470 502
1810E02j3n5n8j5L7N7L5Jk1k8k2oJ2J6ol4m2k3JJj6k8qM0P1M1k8n5JP3O6mm7k2J1kk9k5nk
$$ 502 489 434 376 361 398 455 490 491 470 442 420 414 426 442 436 402 360 337 338 339 323 295 287 327 398 439 411 356 357 430 496 492 445 423 434 432 403 378 373 371
1806C71j3mJ2J7J8K8J8k9o5l7K4L4j2l8j2K0J5KJ8M1L8J8RONPJ4J1mj4j4l6o5n2J2N9L8j0
$$ 371 358 354 366 383 401 429 447 418 353 316 340 374 362 324 312 332 347 349 367 408 446 464 473 479 484 491 505 516 512 498 484 448 383 331 343 402 440 430
1801D30j8NRnOK9J3l6n9l0J1K3K0J9Qj4k4rPJ0J6K6J1k8m2pK5jn4n9jN9O8M1Nk9m7k4L3O5
$$ 430 412 417 426 421 427 456 469 433 374 344 355 378 398 417 425 411 387 378 385 395 411 437 448 420 378 371 396 395 341 282 281 340 408 449 454 425 378 354 387 452
1796D52L0l6n6j5K9K7MKJ2%l7n3k7PJ2NJ2K5J5j3k6j3mj1qJ5K9%m1n3k4J1L0L3L1K5K3K9K5
$$ 452 482 446 390 375 404 431 435 437 449 449 412 359 332 339 351 356 368 393 408 395 369 356 352 341 333 348 377 377 336 283 259 270 300 333 364 389 412 441 466
1791D66ml6k6J8M8K8j4l3k1mJJ1L1M5L0om1m8k8PK8J4k7n9m2J4N9N4J8KJ9L4Ql8n7l0J7M1
$$ 466 462 426 400 418 466 494 480 447 426 422 423 434 465 510 540 534 493 445 417 424 452 466 439 380 338 352 411 465 483 485 504 538 546 508 451 421 438 479
1787D79L1Mj0LK2J1l5o8l8K1L6%rM9R9N8l5p6m0j3l5n3k7Kj1k1K6Q6O9nm3rK4J4ML3N5K5j9
$$ 479 510 514 504 507 529 540 505 437 399 420 456 456 447 496 595 653 618 542 502 489 454 401 374 376 365 344 370 456 525 520 477 468 492 506 510 543 598 623 604
1782F04j5K2K4rj6J9L5lm1j6M6P0K2m0m7KN3O0K8jnlj1k8l7l5l4k7qK0M3M9M1J9JPM7R2R9
$$ 604 589 611 635 626 610 629 664 661 620 604 650 720 742 702 655 657 710 770 798 797 792 789 778 750 713 678 644 617 609 629 672 721 762 781 782 789 836 928 1027
1777A027N3nk3J5P8J05O7kl6nM4O1N1N3P1Q1Q2R4J17J26J25J54K20K85L16L38L81M31M72N37
$$ 1027 1080 1075 1052 1067 1145 1250 1317 1315 1279 1274 1318 1379 1430 1483 1554 1635 1717 1811 1928 2054 2179 2333 2553 2838 3154 3492 3873 4304 4776 5313
1773E313O57Q16R69J114J319J632K038K446K744K849K736K453K081J699J358J066P97M95J13
$$ 5313 5970 6786 7755 8869 10188 11820 13858 16304 19048 21897 24633 27086 29167 30866 32224 33290 34087 34582 34695
1771C4695l78r82j657k296k776l029l057k892k554k110j660j295j016q05o52n49m47l14j97
$$ 34695 34317 33335 31678 29382 26606 23577 20520 17628 15074 12964 11304 10009 8993 8188 7536 6987 6540 6226 6029
1769F029j57j74j69j02k2K9N7R2J43K19L15M14M90N66O91Q69J053J218J390J610J881K201
$$ 6029 5872 5698 5529 5427 5405 5434 5491 5583 5726 5945 6260 6674 7164 7730 8421 9290 10343 11561 12951 14561 16442 18643
1766A8643K598L114L776M621N672O865P979Q684Q736Q107P013N763M577L526K596J737P94
$$ 18643 21241 24355 28131 32752 38424 45289 53268 61952 70688 78795 85808 91571 96148 99674 102270 104007 104801
1764A04801n07k341m545o686q382r471r877r527q504p137n790m613l588k756k195j850j551
$$ 104801 104294 101953 97408 90722 82340 72869 62992 53465 44961 37824 32034 27421 23833 21077 18882 17032 15481
1762A5481j222r51p99p08o12n36m96m31k96j55p7l2M5J62K81M11N67P24Q52R96J220J509J794
$$ 15481 14259 13308 12509 11801 11189 10653 10157 9726 9430 9275 9198 9166 9211 9373 9654 10065 10632 11356 12208 13204 14424 15933 17727
1759A7727K078K426K882L454M192N181O405P652Q578Q873Q429P408O144M929L856K886J982
$$ 17727 19805 22231 25113 28567 32759 37940 44345 51997 60575 69448 77877 85285 91429 96358 100214 103100 105082
1757A05082J068p9j708l819o055p982r337j0019r955r160p870o454n173m097l207k510j994
$$ 105082 106150 106071 104363 100544 94489 86507 77170 67151 57196 48036 40166 33712 28539 24442 21235 18725 16731
1755A6731j605j312j118j016r40q39p17o02m95l92l20k86k54j88j08o0l8pM9J20K08L20M30
$$ 16731 15126 13814 12696 11680 10740 9901 9184 8582 8087 7695 7375 7089 6835 6647 6539 6479 6441 6434 6483 6603 6811 7131 7561
1752G561N01N58O65Q44J063J299J589J957K348K664K824K787K554K168J732J342J026P34M14
$$ 7561 8062 8620 9285 10129 11192 12491 14080 16037 18385 21049 23873 26660 29214 31382 33114 34456 35482 36216 36630
1750C6630L7m24j010j720k445l007l289l298l118k812k396j917j488j194j004q26o40n08m60
$$ 36630 36667 36243 35233 33513 31068 28061 24772 21474 18356 15544 13148 11231 9743 8549 7545 6719 6079 5571 5111
1747E111m32l65k75k19k05k02j93j83j64j24q5p2p4n3k7m4j03j42j30j00q6p3m2j4j4k5j7
$$ 5111 4679 4314 4039 3820 3615 3413 3220 3037 2873 2749 2664 2592 2518 2465 2438 2394 2291 2149 2019 1919 1833 1760 1718 1704 1690 1665 1648
1744A648MJ0mk7m5n5m2rJ2ll6n8n9n4l9j5mk1m2k8QK7J7OMok1k2qok0k1KJ2j0k7qK8L1jj8
$$ 1648 1652 1662 1658 1631 1586 1531 1489 1480 1492 1489 1453 1395 1336 1282 1243 1228 1224 1203 1161 1133 1141 1168 1185 1191 1195 1189 1168 1146 1138 1132 1112 1091 1093 1105 1095 1068 1060 1088 1119 1118 1100
1739A100JL5N1M7L5J4j6m4n0l2nLj4l6m7m7m2l1mK5K8Mj4oRRLQJ7Qj5l5l4k0nNPLlj3k7l9
$$ 1100 1101 1136 1187 1234 1269 1283 1267 1223 1173 1141 1136 1139 1125 1089 1042 995 953 922 918 943 971 975 961 955 964 973 976 984 1001 1009 994 959 925 905 900 905 912 915 912 899 872 833
1734H33k6J0K8Ll8m5oK8K1j0j8J7O5Q3O2L4K2K0jl4m8k7%MJRK0J1j1j3J5M3M5K6Oj0j0LJ6
$$ 833 807 817 845 848 810 765 759 787 808 798 780 797 862 945 1007 1041 1063 1083 1082 1048 1000 973 973 977 978 987 1007 1018 1007 994 1009 1052 1097 1123 1129 1119 1109 1112 1128
1729A128J5J0J4K1J4%RL6M4K4MJ1J8Lk5l3k6k4l1l6k9k1j4j1j9m1n5l8j1ok4l8k7jK1K6Rj8
$$ 1128 1143 1153 1167 1188 1202 1202 1211 1247 1291 1315 1319 1330 1348 1351 1326 1293 1267 1243 1212 1176 1147 1126 1112 1101 1082 1041 986 948 937 931 907 869 842 841 862 888 897 879
1725H79l2j5J1J5jNM6Q7Q8N1J6J1L2M9L8J1QL9O1L6lJ2P9J23J00O0O2Q4O8K1JK6M2J4l7o8
$$ 879 847 832 843 858 857 862 908 995 1083 1134 1150 1161 1193 1242 1280 1291 1299 1338 1399 1435 1432 1444 1523 1646 1746 1806 1868 1952 2020 2041 2042 2068 2110 2124 2087 2019
1720B019p2o0m5m1o8j12j33j06o6n2n4m0j4j4n1q7q6n0mK7K8jl3l7j0K0K7K2K6L4K9Qj6k6
$$ 2019 1947 1887 1842 1801 1733 1621 1488 1382 1316 1264 1210 1170 1156 1142 1091 1004 918 868 864 891 919 918 885 848 838 858 885 907 933 967 996 1004 988 962
1716I62k0%L4O5P5O2M3L7N4P5P6N8M6N9Q3Q0N7M7O6P6M4lj7pk1o7r1o4k6m3j02j33j08o5n1
$$ 962 942 942 976 1041 1116 1178 1221 1258 1312 1387 1463 1521 1567 1626 1709 1789 1846 1893 1959 2035 2079 2076 2059 2052 2031 1964 1873 1809 1783 1740 1638 1505 1397 1332 1281
1712A281n5m3k1k4n7p2m4opl4m2k5j9l4l4KK8Nk9j8K6L5nl8k6RL1M6N2L4KJM0N9J2n1n1NM2
$$ 1281 1226 1183 1162 1138 1081 1009 965 959 952 918 876 851 832 798 764 766 794 799 770 752 778 813 808 770 744 753 784 830 882 916 918 919 959 1018 1030 979 928 933 975
1707I75K4kLK9M1L1Lk6l2rJ2ll1l0lpm8p4n2j9j0rMJ4jj5ML1K4pk0onk9m7l5rrk8l3MN4O0
$$ 975 999 997 1000 1029 1070 1101 1104 1078 1046 1037 1049 1046 1015 985 982 975 927 853 801 782 772 763 767 781 780 765 769 800 824 817 797 791 786 757 710 675 666 657 629 596 600 654 714
1702G14%o7o2J7P5M9rk2RJ6j7l7k0MNJNkk5k6QL5J1k9k5K8O9O1J8k1l5j6K5N1L9Lk0k0j2p
$$ 714 714 647 585 602 677 726 717 695 704 720 703 666 646 650 655 656 661 659 634 608 616 651 662 633 608 636 705 766 784 763 728 712 737 788 827 830 810 790 778 771
1697G71pppPL2L7Pl8n2k8%J1J4J3nl1l4mJ3pl7k5K0N0M2J4j0l2m5l3lRrl2k1MRoLM5P3M4j5
$$ 771 764 757 750 757 789 826 833 795 743 715 715 726 740 753 748 717 683 679 692 685 648 623 643 693 735 749 739 707 662 629 626 635 626 594 573 577 586 580 583 628 701 745 730
1692G30l9j2J0j1m6l4K9Q0P1K9J1L4O4O9N5L7J6kKK9M5J7l0m4k3j7n4q5o0KL1Km1o0n6m3k1
$$ 730 691 679 689 678 632 598 627 707 778 807 818 852 916 985 1040 1077 1093 1091 1093 1122 1167 1184 1154 1110 1087 1070 1016 931 871 873 904 906 865 805 749 706 685
1687F85lqk9k4J4L7Ql9l9%K3Mj7j2nk2m5l9nK7M3M2K3%rPK2Ok4k7J1N9R5J09J04P6L9K2L6
$$ 685 682 674 645 621 635 672 680 641 602 602 625 629 612 600 595 573 528 489 484 511 554 596 619 619 610 617 639 645 621 594 605 664 759 868 972 1048 1087 1109 1145
1682A145N2M7K2jj6k0j4rk1m7n7l0jqm8p0n6l7l6m5m4l1k1pJ5K8J6j0k6k7k9k3jK7K4j1l7
$$ 1145 1197 1244 1266 1265 1249 1229 1215 1206 1185 1138 1081 1051 1050 1042 994 924 868 831 795 750 706 675 654 647 662 690 706 696 670 643 614 591 590 617 641 630 593
1678E93l1j7k1k8rL1N9O2N4L9J1k5m2l0j2qj1QM4N9K9k1m2j7J5J5nj0MJ0mj2jNj1k0lJ4ml1
$$ 593 562 545 524 496 487 518 577 639 693 732 743 718 676 646 634 626 615 623 667 726 755 734 692 675 690 705 700 690 694 704 700 688 687 692 681 661 658 672 668 637
1673F37j9K0K9kk1%J2j9n5m5jK0Kk5l6k0K5P2P4J9k7nM9M7j7p2o2k2JLPQpk6k9j8KK3L8L2
$$ 637 618 638 667 665 644 644 656 637 582 537 536 556 558 533 497 477 502 574 648 667 640 635 684 731 714 642 580 558 559 562 569 577 570 544 515 497 499 522 560 592
1668E92J7J2J7%l5m6j2K1J9LNOj3k0J4N0L3k3m7k4kOK1M3K2l6o7l3J1J1j5j6jKOL0M4J1l4
$$ 592 609 621 638 638 603 557 545 566 585 588 593 599 586 566 580 630 663 640 593 569 567 573 594 637 659 623 556 523 534 545 530 514 513 515 521 551 595 606 572
1663E72k9J9L4j4o3m9J4O7P2L2k0m5l3k1m3p1m3L2O4J7l7k5L0M4J0j1J1K7%l6l1J5N1M3jm3
$$ 572 543 562 596 582 519 470 484 551 623 655 635 590 557 536 493 422 379 411 475 492 455 430 460 504 514 503 514 541 541 505 474 489 540 583 582 539
1659E39n5m0k6j6KL7O1M7J3NK5L5J4j2j6qqj6j7j7k0j0J6L5J4k9m5j3L3M6J1l8n8l8oJj0n
$$ 539 484 444 418 402 404 441 502 549 562 567 592 627 641 629 613 605 597 581 564 547 527 517 533 568 582 553 508 495 528 574 585 547 489 451 445 446 436 431
1654D31K6L7Jm0k6K8M9J9j5j6JJ0K2M2M9K7%j1j6k7k5ML2K8Pkok3l5j2K7L3km4n5l8nK9L6
$$ 431 457 494 495 455 429 457 506 525 510 494 495 505 527 569 618 645 645 634 618 591 566 570 602 630 637 635 629 606 571 559 586 619 617 573 518 480 475 504 540
1649E40Pk5j7J7K4mj4K0M8L0oj6jol5n8m4OO3Q9O3Rj1J8M3K6lJ6P1J02P5K8%ML1O3O3K2k2
$$ 540 547 522 505 522 546 542 528 548 596 626 620 604 603 597 562 504 460 466 529 618 681 690 679 697 740 766 763 779 850 952 1027 1055 1055 1059 1090 1153 1216 1238 1216
1645A216k1Kom1m9j5km5r0p5k5kk3m9m8l0rRQj6l2j1K4K4qj7QK1pl3j0L6M7J3j5%L4N7O5P4
$$ 1216 1195 1197 1191 1150 1101 1086 1084 1039 949 874 849 847 824 775 727 697 688 697 705 689 657 646 670 694 686 669 677 698 691 658 648 684 731 744 729 729 763 820 885 959
1640I59O9L8LNM4R3J21J32J31J09O7L4K8L5K4KnJ0J3k0q0j30j52j45j17p7m5l1l6n2o9p2n2
$$ 959 1028 1066 1069 1074 1118 1211 1332 1464 1595 1704 1771 1805 1833 1868 1892 1894 1889 1899 1912 1892 1812 1682 1530 1385 1268 1191 1146 1115 1079 1027 958 886 834
1636H34j9krk8l7k8lK3K5rm9m7MM3K4k4k9J2L8Ql7m1JM1M7L4K7L2L8M7O0P1N7K3MK1N2N6K7
$$ 834 815 813 804 776 739 711 708 731 756 747 698 651 655 698 722 698 669 681 719 727 690 649 650 691 738 772 799 831 869 916 976 1047 1104 1127 1131 1152 1204 1260 1287
1631A287kj3k9n9p9o5l8l4m9n0l9l6m9n1l2j1j1k2k5j6LK3K5pn3p4n6k1LJ7K1J6LnOK1L0K9
$$ 1287 1285 1272 1243 1184 1105 1040 1002 968 919 869 830 794 745 694 662 651 640 618 593 577 580 603 628 621 568 494 438 417 420 437 458 474 477 472 478 499 529 558
1626E58J9kk9m1l1rJ3L4L7Nl7l7PM4L1NQK4J4j4k1rj2k0JL7L5ql6k0krj6J0L7K9jj0OJ5Jj6
$$ 558 577 575 546 505 474 465 478 512 549 554 517 480 487 531 562 567 575 599 613 599 578 569 557 537 538 575 610 602 566 546 544 535 519 529 566 595 594 584 590 605 606 590
1621E90k0qJ5K7Nm3o8m4p%j1ML2K3k0l7JM2M6K6Rj3l9l8lJ0l0o0j3O4O0k6q1l3L9M0j1l0k
$$ 590 570 562 577 604 609 566 498 454 447 447 436 440 472 495 475 438 439 481 527 553 562 549 510 472 469 479 449 389 376 440 500 474 393 360 399 439 428 398 396
1616C96J9K1L8O9O0Mk8JM4K7l1n8l6j3k2l8k3J4M1M0K0mk1k1j2nj2k3k0qlj7l5l0KM0M7K2
$$ 396 415 436 474 543 603 607 579 580 624 651 620 562 526 513 491 453 430 444 485 525 545 541 520 499 487 482 470 447 427 419 416 399 364 334 336 376 423 445
1612D45kj0j2k6l3pL2L1j5m9k9J4K9J2PK5L7K4MkLPJ1J2%j7rK5L8jn1m1J9N0J2l9m3j5oj6
$$ 445 443 433 421 395 362 355 387 418 403 354 325 339 368 380 387 412 449 473 477 475 478 485 496 508 508 491 482 507 545 544 493 452 471 521 533 494 451 436 430 414
1607D14j3J3K8J8NOJ0N%J0J9J6Lj0j4lK2L5Nm4n2MN5L4m0p4k8L8N2J1k4j7J1J8kk5k5qkj1
$$ 414 401 414 442 460 465 471 481 486 486 496 515 531 534 524 510 507 529 564 569 525 473 477 532 566 526 452 424 462 514 525 501 484 495 513 511 486 461 453 451 440
1602D40mK7N2L8RNK0K2MjJ0pn9q9m5L2O2L6J5L0L2j6o6n4QM4K4lKLl7p4l9M8Q7M0j9j8lm0
$$ 440 436 463 515 553 562 567 587 609 613 612 622 615 556 467 422 454 516 552 567 597 629 613 547 493 501 545 569 566 568 571 534 460 421 469 556 596 577 559 556 516
1597E16q9o0L8R6O3Oj4j5l0k8J3M6K3k1k6nkj4NM0M2J0LL4M7Ql8m6k8k0k6l8n8o4k2N2Q4L7
$$ 516 427 367 405 501 564 570 556 541 511 483 496 542 565 544 518 513 511 497 502 542 584 594 597 631 678 686 648 602 574 554 528 490 432 368 346 398 482 519
1592E19l2m1RM7M3K3Lk2m9o2m6j6K6O4O8K4l0l8qkl7n2oN3N1Jk6jK3Ll9n7l2QL2K8NnJ0K9
$$ 519 487 446 455 502 545 568 571 549 500 438 392 376 402 466 534 558 528 490 482 480 443 391 385 438 489 490 464 463 486 489 450 393 361 369 401 429 434 429 439 468
1588D68J8k2l5NM8L5rj7K1L7Kk9oL0J7k8l9mK9L5L4L4J9j0l0l7m7n8m0QM5M9L4J2j6l5j6K0
$$ 468 486 464 429 434 482 517 508 491 512 549 551 522 516 546 563 535 496 492 521 556 590 624 643 633 603 566 519 461 421 429 474 523 557 569 553 518 502 522
1583E22J8k4l8NN1M3J5R%m5q4n2J4K3j8k5L5Q3O6J9j2l3o0o7k7K5M5K9Mj3j8j0kj0k0MM6N1
$$ 522 540 516 478 483 534 577 592 601 601 556 472 420 434 457 439 414 449 532 598 617 605 572 512 445 418 443 488 517 521 508 490 480 478 468 448 452 498 549
1578E49Rk2rJ1ol6l7j7j8k9j2K8N2M1J5j0k5k0nj4n5p8l4L9O8M1J8K1K5J0JJ4K5J6mj8k6k1
$$ 549 558 536 527 538 532 496 459 442 424 395 383 411 463 504 519 509 484 464 459 445 390 312 278 317 385 426 444 465 490 500 501 515 540 556 552 534 508 487
1574D87OL4K6j3l6k9k2k7qM2O3J0o6p9k9J7J9J0K1M0L0ll4l4j2RJ9K1K1Jm0o1l0L2N2K1nJ3
$$ 487 493 527 553 540 504 475 453 426 418 460 523 533 467 388 359 376 395 405 426 466 496 493 459 425 413 422 441 462 483 484 444 383 353 385 437 458 453 466
1569D66K3j8o6l9M3Q2L5l2m3j1J0LqKK1K4Mj8nL6O6M8Nk7m8p6q7l9M1P4K8l5n1k9j4rJ3L6
$$ 466 489 471 405 366 409 491 526 494 451 440 450 453 445 447 468 492 496 478 473 509 575 623 628 601 553 477 390 351 392 466 494 459 408 379 365 356 369 405
1564D05L4PoLMj4k0J2N3N1mn6m6J3M5On7o9j9L0L3Mk0k5qL7Q0O8j1q7q4j9L6M6L8L0J7koL
$$ 405 439 446 440 443 447 433 413 425 478 529 525 469 423 436 481 487 430 361 342 372 405 409 389 364 356 393 473 541 530 443 359 340 376 422 460 490 507 505 499 502
1559E02jk3l5j4J5K8K2Lk3m1k7J4M9M7J2k5l6j8J2K3PoJ0L4K5qk6j6poMK6J7k0m1j7J4K5K3
$$ 502 501 478 443 429 444 472 494 497 474 433 406 420 469 516 528 503 467 449 461 484 491 485 495 529 554 546 520 504 497 491 495 521 538 518 477 460 474 499 522
1555E22J9j8p4o6L0J08O3m4p9k6Pj3j5K9N0J6jM2O0j7j09r1J3Q3O6L1K4J5j5l2j3%j7l1lL7
$$ 522 541 523 449 383 413 521 584 540 461 435 442 429 414 443 493 509 508 550 610 593 484 393 406 489 555 586 610 625 610 578 565 565 548 517 514 551
1550E51L4j5o0o1k8NJ4JqMK4J8j2l2k0MJ1LKJ1Pj4l1k4LK6K7Nj4j3JNpj7oJ1J6J0J3K6K7J1
$$ 551 585 570 510 449 421 426 440 441 433 437 461 479 467 435 415 419 430 433 435 446 453 439 408 384 387 413 440 445 431 418 419 424 417 400 394 405 421 431 444 470 497 508
1545E08j1k1k0j1PK0J0j9l6k3%KoOL0L6K5K8M8L9j3n7m4pj0m3m0J1M5J8k5k2J2K7J2nrj0o
$$ 508 497 476 456 445 452 472 482 463 427 404 404 406 400 406 436 472 497 525 573 612 599 542 498 491 481 438 398 409 454 472 447 425 437 464 476 471 462 452 446
1540D46MJ1Opj1plJ1K6K0j3l0nL1L0Lqmj5k8jM3M0j2l2J6N3Ro9q5m0%PJ0K0J5jlJ6K9L5M7
$$ 446 450 461 467 460 449 442 439 450 476 496 483 453 448 479 509 512 504 500 485 457 456 499 539 527 495 511 564 573 504 419 379 379 386 396 416 431 430 427 443 472 507 554
1535E54N7L5pk3oQlj6j5k2l8l9j5%j0j4J7M7L2npL0M2ln6n0KL2J2k0j8POk6l6jM0L6LjL5N2
$$ 554 611 646 639 616 610 618 615 599 584 562 524 485 470 470 460 446 463 510 542 537 530 560 602 599 543 493 495 527 539 519 501 508 514 488 452 451 491 527 530 529 564 616
1530F16J8k8k9RL8L1Jk6l7k7NL6M2K8J0ol0m6l5mJ2nk7k3KJ6Oj2k3l1k8kM3O7M5Kj1J2K6J0
$$ 616 634 606 577 586 624 655 656 630 593 566 571 607 649 677 687 681 651 605 570 566 578 573 546 523 525 541 547 535 512 481 453 451 494 561 606 608 597 609 635 645
1525F45oJ1L5K0k0j9M3J07J16P6L2Kj8j8JK9M5N0N3L6j0n8p9p7q9j19j28q5j6K9L0Prj1j0
$$ 645 639 650 685 705 685 666 709 816 932 1008 1040 1042 1024 1006 1007 1036 1081 1131 1184 1220 1210 1152 1073 996 907 788 660 575 559 588 618 625 616 605 595
1521E95j4j5rjJMK2L6K0k3n2m5k6j1OL1L5Pj8mPl3q1o1J7N1Pk7J7P8N8k6p6m6QK5Jk4j7K2
$$ 595 581 566 557 556 557 561 583 619 639 616 564 519 493 482 488 519 554 561 543 539 546 513 432 371 388 439 446 419 436 514 572 546 470 424 432 457 458 434 417 439
1516D39O2O6K1l3m3j2J7J3j0k3j4QK4J4k3o0o4k9K4N4M3RnJ5M7N0K1qk0k2k5j8LJ5J7J9J2
$$ 439 501 567 588 555 512 500 517 530 520 497 483 491 515 529 506 446 382 353 377 431 474 483 478 493 540 590 611 603 583 561 536 518 521 536 553 572 584
1511E84k5p8q5l0J9Rj7PN6N6J2jL5M3j3o4m1K5O2M8J1k1l8l4j3RK3M2O1M1k4p7o2%M3M0J5
$$ 584 559 481 396 366 385 394 377 384 440 496 508 507 542 585 572 508 467 492 554 602 613 592 554 520 507 516 539 581 642 683 659 582 520 520 563 603 618
1507F18j4n0p8o7rN2O1J4l3k8J7L9Ol3k2J5On3q3l7K9M3J6JMLNL1N3L5jj2qk7n1k3L9N0pn0
$$ 618 604 554 476 409 400 452 513 527 494 466 483 522 528 495 473 488 494 441 358 321 350 393 409 410 414 417 422 453 506 541 540 528 520 493 442 419 458 508 501 451
1502D51k2K5K2rj3J3K7J7jj4j6OM2M8J2k0lL1K7nj6j1k8n7n1pK0J5J7L2Qn9q5k6M9M8ok9%
$$ 451 429 454 476 467 454 467 494 511 510 496 480 486 528 576 588 568 565 596 623 618 602 591 563 506 455 448 468 483 500 532 540 481 396 370 419 467 461 432 432
1497D32K9K9K4K7J2j6j3J6J9k8o6m2J6L5J2oNJ5Kj8k1jJ7J3j6m5l8QM6L6qk8oK4K0ok0jL4
$$ 432 461 490 514 541 553 537 524 540 559 531 465 423 439 474 486 480 485 500 502 484 463 462 479 492 476 431 393 401 447 483 475 447 441 465 485 479 459 458 492
1493D92N8M9J2k0l1l0l0k9j5ljRM2O0J0p2r7l1M7N8K1lJmk2l2k4j1%J0Mj5j4K1M1Nm4k9M2
$$ 492 550 599 611 591 560 530 500 471 456 453 452 461 503 563 573 501 404 373 420 478 499 496 497 493 471 439 415 404 404 414 418 403 389 410 451 456 412 383 425
1488D25P7L1k8l8j2pk3l2k3mK5N3N0Ln2n6j1K3J0k1k2J2L4J9oMM4N6J9k1j2K0J5l0m7rL8M0
$$ 425 502 533 505 467 455 448 425 393 370 366 391 444 494 497 445 389 378 401 411 390 368 380 414 433 427 431 475 531 550 529 517 537 552 522 475 466 504 544
1483E44Mk6l4j9RL3K9LmJ9L2Pl1l7j1J5K4K0kk9l1kJ5j1m0k4J7K7ol7m2k9oL1N6M3Lk0j3O
$$ 544 548 522 488 469 478 511 540 543 539 558 590 597 566 529 518 533 557 577 575 546 515 513 528 517 477 453 470 497 491 454 412 383 377 408 464 507 510 490 477 483
1478D83K2L6L2km3n4k9QM6P7O8Mo8q1m6k2j4J5O0N8Mk8qJ0j6m1k0J3J3LJ8L3Ol2k5J0J9nj7
$$ 483 505 541 573 571 528 474 445 453 499 576 644 648 580 499 453 431 417 432 492 550 554 526 518 528 512 471 451 464 477 480 498 531 537 505 480 490 509 504 487
1473D87j0j6l1k5RK9K5J9J6qn6q9p7l2J1L2L2K5L0M5M5J5k1l2j5RL3N0M2Oj7lPl1p2n2J5M3
$$ 487 477 461 430 405 414 443 468 487 503 495 439 350 273 241 252 284 316 341 371 416 461 476 455 423 408 417 450 500 542 548 531 528 535 504 432 380 395 438
1469D38J0j6PK9Qk8k8ML3M7L3k2q8q7pO9O2J0nJ7J4k5l9j1J8J3jlrk4j6L0O3L8j9l9j2J4Q
$$ 438 448 432 439 468 476 448 420 424 457 504 537 515 427 340 333 402 464 474 469 486 500 475 436 425 443 456 455 452 443 419 403 433 496 534 515 476 464 478 486
1464D86rj8k3l0j7K0M5J9l3n0j2M0N1L3J7J2lk2j8QK4J5nj3j8k4j7NJ0k4o7o2MO6P4M1J8J7
$$ 486 477 459 436 406 389 409 454 473 440 390 378 418 469 502 519 531 528 506 488 496 520 535 530 517 499 475 458 463 473 449 382 320 324 390 464 505 523 540
1459E40J2qk5k1nOJ3J9J3rk2NN0N6J0l0k9j9k9k9J6N7K2n6p1MO7M3k1l9j4Kqrnk5n1l7J3M8
$$ 540 552 544 519 498 493 499 512 531 544 535 513 518 568 624 634 604 575 556 527 498 514 571 593 537 466 470 537 580 559 520 506 508 500 491 486 461 410 373 386 434
1454D34M4L3L8M0J8mpkj5k6j1J6J6j8m2l0ook8l6rK9M1K8J0ok2l6l4j9kJ5L7M9J7m4o6k2L3
$$ 434 478 511 549 589 607 603 596 594 579 553 542 558 574 556 514 484 478 472 444 408 399 428 469 497 507 501 479 443 409 390 388 403 440 489 506 462 396 374 407
1450D07K9j7k9J3N5M8J5kJ5M1M5J6l0n2k3K1K4j6m2k7%Nj1k4k7j9%K2K6J7J6K7L0J8J1J2k
$$ 407 436 419 390 403 458 506 521 519 534 575 620 636 606 554 531 552 576 560 518 491 491 496 485 461 434 415 415 437 463 480 496 523 553 571 582 594 592
1445E92k9k9LJ6j1k5J7O1L6k4l3J2K6k2o9n7j2J7K0J3PJ1L2M5J1n2p4l3J8K9J6J5J1j1k7m
$$ 592 563 534 537 553 542 517 534 595 631 607 574 586 612 590 521 464 452 469 489 502 509 520 552 597 608 556 482 449 467 496 512 527 538 527 500 496
1441D96L5M2K0jj6l9n2k6K0L5Rk1k5j9j7j0PJ9J7J1%j8k4JL5L9J4lJml3n3l1J0K6J6RJ5K0
$$ 496 531 573 593 592 576 537 485 459 479 514 523 502 477 458 441 431 438 457 474 485 485 467 443 444 479 518 532 529 530 526 493 440 409 419 445 461 470 485 505
1436E05Rj4l5l9j5K6N3M6J2k0k7mL0L7Ml2l4j0nk3k9rNNK0M6L5k3n7k0L2L3joJ2Qj5j8j0k4
$$ 505 514 500 465 426 411 437 490 536 548 528 501 497 527 564 568 536 502 492 487 464 435 426 431 436 456 502 537 514 457 437 469 502 501 495 507 515 500 482 472 448
1431D48l8rL6K8k3l4J8N5K5k2k7kQRJ5J6%mJ1J8%j3mkj5j4J4J6l1o1k1L7L1j2j8J3J6k2l7
$$ 448 410 401 437 465 442 408 426 481 506 484 457 455 463 472 487 503 503 499 510 528 528 515 511 509 494 480 494 510 479 418 397 434 465 453 435 448 464 442 405
1426D05jM3M7Ql9o4m2J5N1L3lmJ3Jk3qL2K7l0o9m6KL2M7M6J9j3j0J8J7j0kN0P1K0m2m4j3l
$$ 405 404 447 494 502 463 399 357 372 423 456 453 449 462 463 440 432 464 491 461 392 346 348 380 427 473 492 479 469 487 504 494 492 542 613 633 591 547 534 531
1422E31j2qkj5k3qJk5n1k8J5K4%rQJ7J5K3L7K7nk0j3onQK3J4j1qK2K9j6o0n2nK6J6mj1k3n3
$$ 531 519 511 509 494 471 463 464 439 388 360 375 399 399 390 398 415 430 453 490 517 512 492 479 473 468 476 499 513 502 494 516 545 529 469 417 412 438 454 450 439 416 363
1416C63p2l4L9O8J4m2oQ3R3pr0m4N6P3Pk9PL0pm8l0J5K1rk4rRK1L2M1L7J7pj8j2rk4m1l0J7
$$ 363 291 257 296 364 378 336 330 413 506 499 409 365 421 494 501 472 479 509 502 454 424 439 460 451 427 418 427 448 480 521 558 575 568 550 538 529 505 464 434 451
1412D51N2L1j3j4J7J9k8n6k4L0M2J3k1l7l5j4J6K6Mj6qJ1Pj6k4rPKj0mK5O0O3J7m1n4j1L7
$$ 451 503 534 521 507 524 543 515 459 435 465 507 520 499 462 427 413 429 455 459 443 435 446 453 437 413 404 411 413 403 399 424 484 547 564 523 469 458 495
1407D95M6K2Knj3k7l8m1l7j5J1J6rk8kM1M7J3j6j2OOmj2j9l0k9JL5L9Pj8mL0L9J4nPK0Qk5
$$ 495 541 563 565 560 547 520 482 441 404 389 400 416 407 379 377 418 465 478 462 450 456 462 458 446 427 397 368 369 404 443 450 432 428 458 497 511 506 513 533 541 516
1402E16m6n0m7k9RL9L2Jj2ljj0mJ6J4j1k3pQJ1L1N6L3m6r3m5L7N9K7J5M5N3J2l4m1j4J2J9
$$ 516 470 420 373 344 353 392 424 425 413 410 409 399 395 411 425 414 391 384 392 403 434 490 523 477 384 339 376 435 462 477 522 575 587 553 512 498 510 529
1397E29jl4n1l0LJ2NORrl2j4L8O1L4mj1nj0k2j8qJOJ0jk2k7KM4O9N6J9k0k1K0N8K8n8j14p8
$$ 529 528 494 443 413 416 428 433 439 448 439 407 393 431 492 526 522 511 506 496 474 456 448 449 455 465 464 442 415 417 461 530 586 605 585 564 584 642 670 612 498 420
1392D20JM2K9RK4M9L4k1n8l3L0N2Mn4n6j0K2K0J1Nj0k3JM6M5j0m2jN7N5J4JK3L5J9OJ5K3J8
$$ 420 421 463 492 501 525 574 608 587 529 496 526 578 582 528 472 462 484 504 515 520 510 487 488 534 579 569 527 526 583 638 652 653 676 711 730 736 751 774 792
1387G92J1J0OQL3O0N1Mk9j6K6O0P7Q4Q5Q7J10J51J80J77J55J35J23J26J61K18K44J96J12O9
$$ 792 803 813 819 827 860 920 971 975 946 930 956 1016 1093 1177 1262 1349 1459 1610 1790 1967 2122 2257 2380 2506 2667 2885 3129 3325 3437 3506
1384C506Q7J11R1L9j0n9j17j71j87j83j92k16k18j92j63j50j38j27j35j53j37p9l4l8n3k8
$$ 3506 3593 3704 3795 3834 3824 3765 3648 3477 3290 3107 2915 2699 2481 2289 2126 1976 1838 1711 1576 1423 1286 1207 1173 1135 1082 1054
1381A054J1Kn0q0n9k0jpk7m9n1k2P%k1j4J2J5moJj8m9l2J7K4k0k6L8P4J2o7n7QK6nrJ5Nm8
$$ 1054 1065 1067 1017 937 878 858 857 850 823 774 723 701 708 708 687 673 685 700 696 690 691 673 624 592 609 633 613 587 625 699 711 644 587 595 621 616 607 622 627 579
1376E79o8l5nqkL4N4J9l0m8l0nJ7K2Lk0qK6L0j1l1JL4Rm5n3j3J8K4M3P9Q1J4p0q8m0Ojk1j0
$$ 579 511 476 471 463 461 495 549 568 538 490 460 455 472 494 497 477 469 495 525 514 483 484 518 527 482 429 416 434 458 501 580 661 675 605 517 477 483 482 461 451
1371D51J3on1m2L6R2N3k6l8J7M1Jl8k3Ojj4J5N8N2km0k0K9N7M1jl7m7k6QL8M0Rm4p9p0l1m
$$ 451 464 458 407 365 401 493 546 520 482 499 540 541 503 480 486 485 471 486 544 596 594 554 534 563 620 661 660 623 576 550 558 596 636 645 601 522 452 421 417
1366D17klJ3L0K3jj8k3j7nOJ0NJ%oj2rPJ8J9J3LprKJ5Qj0rJ6L1K9L3M4L1j8o6p0m4k4rK0N2
$$ 417 415 412 425 455 478 477 459 436 419 414 420 430 435 436 436 430 418 409 416 434 453 466 469 462 453 455 470 478 468 459 475 506 535 568 612 643 625 559 489 445 421 412 432 484
1361D84N3J5k9n0l6%L3L3kl8m1j7PJ6J7J3JkJ7M3M2Ol1l7j4%j4k8pL5M8Ql1j8K1J7k4l3QL5
$$ 484 537 552 523 473 437 437 470 503 501 463 422 405 412 428 445 458 459 457 474 517 559 565 534 497 483 483 469 441 434 469 517 525 494 476 497 514 490 457 465 500
1356E00Ml5k9MJ4%j2j8k2mK9L5j1n7m1J1L0Rj0j6j5lL6O5M3lj8pj6l4j4K8L3lj2J8K8rl3j1
$$ 500 504 469 440 444 458 458 446 428 406 402 431 466 455 398 357 368 398 407 397 381 366 363 399 464 507 504 486 479 463 429 415 443 476 473 461 479 507 498 465 454
1351D54Qk0m7k9jj4l6oM3M3pl5j8Lqj8MM2N8M3J3j9m0l9qL4N8M8J6j1j5j5k2k8k3j2oRL4L8
$$ 454 462 442 395 366 365 351 315 309 352 395 388 353 335 338 330 312 316 358 416 459 472 453 413 374 366 400 458 506 522 511 496 481 459 431 408 396 390 399 433 471
1346D71lm1j2N8Q0K3k7j2K5J1l1l6nQj0k1lJ5J4QNjj0qMROPQKj6k8k3rRK8M0K9Kk3l3k6JL1
$$ 471 468 427 415 473 553 576 549 537 562 573 542 506 501 509 499 478 475 490 504 512 517 516 506 498 502 511 517 524 532 534 518 490 467 458 467 495 535 564 566 543 510 484 485 516
1341E16M1J7j9l7l7l0j1K5N8N2Rl4m8l4j0QJ2POJ3J9J1ok1k8k9j1K5N9P2N2Lo0r2n8J6N4K4
$$ 516 557 574 555 518 481 451 440 465 523 575 584 550 502 468 458 466 478 485 491 504 523 534 528 507 479 450 439 464 523 595 647 650 590 498 440 456 510 534
1336E34k5l0kJ7K4M1M9K0l2n2k9qqj0MK0K3J4rl5l5KK9Jn1n3MM9L8Jk6m2m0mN4Q3N2Kk6k1
$$ 534 509 479 477 494 518 559 608 628 596 544 515 507 499 489 493 513 536 550 541 506 471 473 502 503 452 399 403 452 490 491 465 423 383 379 433 516 568 570 544 523
1331E23KL4M1qo6n6J0K8l7q3j8Q1R2J5m6m8m3m7k3K9M5J2j4JK0RlJ3J9j8n7m5lMk6k9L0R4
$$ 523 525 559 600 592 526 470 480 508 471 388 370 451 543 558 512 464 421 374 351 380 425 437 423 424 444 453 450 463 482 464 407 362 359 363 337 308 338 432
1326D32Q9J4n6o1j6J7Jk3kN2P0K5k9l1J0L3J1j8k2oMNNMpj5pJ2J4oj7oLj1l0k0LJj9rM3P7
$$ 432 521 535 479 418 402 419 420 397 395 447 517 542 513 482 492 525 536 518 496 490 494 499 504 508 501 486 479 491 505 499 482 476 479 468 438 418 421 422 403 394 437 514
1321E14M3k3n3l6jK9M2K0m7r7o4L1Q3M2k7m7j6OPRK0J6kj1j1rkK9O4O1J0m1m9k2PJ7J0qk9
$$ 514 557 534 481 445 444 473 515 535 488 391 327 358 441 483 456 409 393 399 406 415 435 451 449 438 427 418 416 445 509 570 580 539 490 468 475 492 502 494 465
1317D65k9qKk0m0j2M7O6K2l7n0k6jJ5L6N5M9K6J0Opl3m8l5j1%KJ1K9L8K4rm0m4k5onj2j2m
$$ 465 436 428 430 410 370 358 405 471 493 456 406 380 379 394 430 485 534 560 570 576 569 536 488 453 442 442 444 455 484 522 546 537 497 453 428 422 417 405 393 389
1312C89LJ8N1Q0P3L7Mj3l3n1l7J5N6L9j6n9o8m4jL9M3J3pRL3K6Mmj1m0o5l8K6N3J2l9m6j3
$$ 389 392 410 461 541 614 651 655 642 609 558 521 536 592 631 615 556 488 444 443 482 525 538 531 540 573 599 603 599 588 548 483 445 471 524 536 497 451 438
1307D38K0K7J5loRK6J3k7n7n2k7rmrj0NL5N1L0lrLrl8m2oJ8Kj9nK3K7J3PPrl0l2j9qlJ1K1
$$ 438 458 485 500 497 491 500 526 539 512 455 403 376 367 363 354 344 349 384 435 465 462 453 456 447 409 367 361 379 381 362 357 380 407 420 427 434 425 395 363 344 336 333 344 365
1302C65J0j6k7j5QL0M2L1%k4j8LJ4J5J9J7JoJ1K7Ol5l9QM4K5k2m4k8nnj9k7j2J5L5L1J1pj2
$$ 365 375 359 332 317 325 355 397 428 428 404 386 389 403 418 437 454 455 449 460 487 493 458 419 427 471 496 474 430 402 397 392 373 346 334 349 384 415 426 419 407
1297D07oJ2L0K7%k1qK5L3J6QK2L2K0jlPJ1lk8m9l9jL3K0k5m2j6J4Mk3k3PL5M1L7K2j5o2q6
$$ 407 401 413 443 470 470 449 441 466 499 515 523 545 577 597 596 593 600 611 608 580 531 492 491 524 544 519 477 461 475 479 456 433 440 475 516 553 575 560 498 412
1292D12o3oM5O1M2J4lorj8k5k0jK4M2L9J6jMJ7Nk9m5k7jRJ3K9L8J7j3j7j%j9k2%J8Nj9j7J2
$$ 412 349 343 388 449 491 505 502 496 487 469 444 424 423 447 489 528 544 543 547 564 569 540 495 468 467 476 489 518 556 573 560 543 542 542 523 501 501 519 524 505 488 500
1287E00L2J3k4l8j1K7M0K0kpNJ4J5Qnk3k8k0j0omLMj1k4j9%J2Pmj5j8j0QJ6QJLPMJNjk4k9
$$ 500 532 545 521 483 472 499 539 559 557 550 555 569 584 592 587 564 536 516 506 500 496 499 503 492 468 449 449 461 468 464 449 431 421 429 445 453 454 457 464 468 469 474 473 449 420
1281D20ML6K6j3k2RK9J2j1j3jRJ7J4j6n7n9qM4M8K1lj4j9qK6M8L5J0MKk9o4n3kK6Qj9rK6M2
$$ 420 424 460 486 473 451 460 489 501 490 477 476 485 502 516 500 443 384 376 420 468 489 486 472 453 445 471 519 554 564 568 570 541 477 424 422 448 456 437 428 454 496
1276D96K2j7l5j5K0L1Pj3nNj1k0J1N7M5j4m9k2J5J1j6k6j9j9k7k5j6lJ7L4J9k2m1j1K5K0r
$$ 496 518 501 466 451 471 502 509 496 491 496 485 465 476 533 578 564 515 493 508 519 503 477 458 439 412 387 371 368 385 419 438 416 375 364 389 409 400
1272D00j0J9M2L8J5k2o8q8m4L4Q5P6L1rk6k0nol0l2PM3J8l7m0J2M6K5m%Mk0l5j3J2%j9JL3
$$ 400 390 409 451 489 504 482 414 326 282 316 401 477 508 499 473 453 448 442 412 380 387 430 448 411 371 383 429 454 450 450 454 434 399 386 398 398 379 380 413
1267D13K5j1j9J1K9J0k0l9m3k9J6O3O9L5Nkqk7l8l1j6kK7O5P6M2nk7k7k1j3LRj0l0k9j8j8
$$ 413 438 427 408 419 448 458 438 399 356 327 343 406 475 510 515 513 505 478 440 409 393 391 418 483 559 601 596 569 542 521 508 511 520 510 480 451 433 415
1262D15k2rJ2Nk3l2qJ2Jk1pL9P5O5J7l6o3n3j1K9K9pk5J0N3L1m7q3k2O6P5J5j7J1L7J5j5r
$$ 415 393 384 396 401 378 346 338 350 351 330 323 362 437 502 519 483 420 367 356 385 414 407 382 392 445 476 429 346 324 390 465 480 463 474 511 526 511 502
1258E02Pok3kM0N0J5k4m1m0k2J5L8Rn5q2m1K0M4L0J8J7%l2m6j5L3M6J9j5k2k0k8k8J4P7Q6
$$ 502 509 503 480 478 518 568 583 559 518 478 456 471 509 518 463 381 340 360 404 434 452 469 469 437 391 376 409 455 474 459 437 417 389 361 375 452 538
1253E38L3j1OK8j6q6q3lO0N2J8Qjl1m5pM1M4Nk7l8m1m1k1J2L6M8N1L3j4o0o0j6K8M7N0L4j1
$$ 538 571 560 566 594 578 492 409 406 466 518 536 544 543 512 467 460 501 545 550 523 485 444 403 382 394 430 478 529 562 548 488 428 412 440 487 537 571 560
1248E60o1o8l2Mjk6l1rJ5K0J0JKJ3K8L5L3J5k1n1m1J1N1L0l0n5k6Kj1l2%O9R0K5n3n1K2O4
$$ 560 499 431 399 403 402 376 345 336 351 371 381 382 384 397 425 460 493 508 487 436 395 406 457 487 457 402 376 378 367 335 335 404 494 519 466 415 437 501
1244E01J4o4p2pM2L0RK9N6L9JrLj4n6p2m9k5j8JL5M3J2pQJ6j4m3k9J5M0M3L8K6MoMkl8m9m
$$ 501 515 451 379 372 414 444 453 482 538 577 578 569 572 558 502 430 381 356 338 339 374 417 429 422 430 446 432 389 360 375 415 458 496 522 526 520 524 522 484 435 431
1239D31M6K3l9m5J5N7L6lpQJ3J4J9Ok7l5LL5J0m2n0qK8J4k7n0l4KK9K1nrJ5L2J5j6k6j2NK1
$$ 431 477 500 461 416 431 488 524 521 514 522 535 549 568 574 547 512 515 550 560 518 468 460 488 502 475 425 391 393 422 443 438 429 444 476 491 475 449 437 442 463
1234D63L4L1nm9o3l9j3opOK8M3L5J0qmJ6J7nk3j1J1RorKnk8l6j1J5K1K4L7M0J1k7l5rJ0Lj
$$ 463 497 528 523 474 411 372 359 353 346 352 380 423 458 468 460 456 472 489 484 461 450 461 470 464 455 457 452 424 388 377 392 413 437 474 514 525 498 463 454 464 467 466
1229D66K0M3L0j5m5k7J8L9K1prJ1K6J5j1l7m9m2j8QK1K2J6MqqRK4J5j2k8j6J9M8L8j5p1p1
$$ 466 486 529 559 544 499 472 490 529 550 543 534 545 571 586 575 538 489 447 429 437 458 480 496 500 492 484 493 517 532 520 492 476 495 543 581 566 495 424
1224D24j0M3L0k0l3nJl4n4j3M4N6K7KjkmKKj6l7k3J1K4OnJ1K5J2j3k3j8j3kJ3J4j4m3l6nR
$$ 424 414 457 487 467 434 429 430 396 342 329 373 429 456 458 457 455 451 453 455 439 402 379 390 414 420 415 426 451 463 450 427 409 396 394 407 421 407 364 328 323 332
1219C32%nJ1K6K4J1%rj1J3N0N2Nl5j4M8P2L2j9k7j2j6l1k3J2M1M3K9Ok9o0n7j5K7L4K0J5J1
$$ 332 332 327 338 364 388 399 399 390 379 392 442 494 499 464 450 498 570 602 583 556 544 528 497 474 486 527 570 599 605 576 516 459 444 471 505 525 540 551
1214E51k2p2r0m9J7M7L5K4L9N2J9m0o5l3PPj2mJ9Mm4n5NP2P1J2l2l0j8k1k8j8lJ0K9M7M9K7
$$ 551 529 457 367 318 335 382 417 441 480 532 551 511 446 413 420 427 415 411 430 434 390 335 340 412 483 495 463 433 415 394 366 348 345 355 384 431 480 507
1210E07Lj0j1%K3M3L1j2n2o4n1k8J0M1L2j1l0JL9L8K5M3O0J0p5r4l1J9qm8k2L3L6j2l2LM0
$$ 507 510 500 489 489 512 555 586 574 522 458 407 379 389 430 462 451 421 422 461 499 524 567 627 637 562 468 437 456 448 400 378 411 447 435 403 406 446
1205D46M2K4Nj2k2qJ0om1l6J1L0ol4KN4M8Jk2j3j2l0k3OJ5qk4j1kj1pK5M6L0RK4N3M0j8o3
$$ 446 488 512 517 505 483 475 485 479 438 402 413 443 437 403 405 459 507 508 486 473 461 431 408 414 429 421 397 386 384 373 366 391 437 467 476 500 553 593 575 512
1200E12m9LL9L3Jj2JLl0n9l0L1M4nl3J4O4L4l8n2QM8K0k7l4j2NJ4K7K9Rj5k4k6l1k4JK3J8
$$ 512 463 466 505 538 539 527 528 531 501 442 412 443 487 482 449 463 527 561 523 471 479 527 547 520 486 474 479 493 520 549 558 543 519 493 462 438 439 462 480
1196D80JjJ7L6L5J2j6l3l4l0l9m9l7rJ3K0K9M9N1K7OJ3K7J2k3m2k3J1K6J0k1l6j8OLk4m0k7
$$ 480 481 480 497 533 568 580 564 531 497 467 428 379 342 333 346 366 395 444 495 522 528 541 568 580 557 515 492 503 529 539 518 482 464 470 473 449 409 382
1191C82qopJ3M0M4J6k1l2rL2N0K7j0j6jml4m5j7J5K5L2N6O1J9k6k3Lj3o3p2j6L7K3k6m2rK6
$$ 382 374 368 361 374 414 458 474 453 421 412 444 494 521 511 495 494 490 456 411 394 409 434 466 522 583 602 576 553 556 543 480 408 392 429 452 426 384 375 401
1186D01K7jj9lK8K9rm3l1QK0ql2j7J8M1L6Qk7m0j3K9M1K1RJ6K0KqMRj2l3j9J4K8K2K1K6Ol9
$$ 401 428 427 408 405 433 462 453 410 379 387 407 399 367 350 368 409 445 453 426 386 373 402 443 464 473 489 509 511 503 507 516 504 471 452 466 494 516 537 563 569 530
1181E30o5l9J7N0L5nk8k1kQJ1J5Ol2o4l8L4Q2N7ll3k4j3j2mOjk4k4LK4J3qnJ7K6J4KOJ4Lk2
$$ 530 465 426 443 493 528 523 495 474 472 480 491 506 512 480 416 378 412 494 551 548 515 491 478 466 462 468 467 443 419 422 446 459 451 446 463 489 503 505 511 525 528 506
1176E06l1oL4N0K4k0m7l9rJ1PlQL4L8Jm0l9oLk5l9mM1M1Ok0k0k0l2k8QM4L8j4o1n0RN4M8K0
$$ 506 475 469 503 553 577 557 510 471 462 473 480 477 485 519 557 558 518 479 473 476 451 412 408 449 490 496 476 456 436 404 376 384 428 466 452 391 341 350 404 452 472
1171D72K2M6M0j2o4p7n6l1j3JRJ2K7N6O0J8m0n6k1K9N8M3j0o4o9k3J9K3J3K8M6L8K7M7O5L8
$$ 472 494 540 580 568 504 427 371 340 327 328 337 349 376 432 492 510 470 414 393 422 480 523 513 449 380 357 376 399 412 440 486 524 551 598 663 701
1167G01j3j8J8L0jj5J9N0M3L3N2O2L0j1j5NMj9l2l3l3k7jJ6nn1p3o3m7l3pJ4J1j2j4J1K0l
$$ 701 688 670 688 718 717 702 721 771 814 847 899 961 991 980 965 970 974 955 923 890 857 830 829 845 840 789 716 653 606 573 566 580 591 579 565 576 596 593
1162E93k6j3K7N7N5L3Nj7k6k3j6j3j2JK3L7K9PmJ0L3L5K2K1M2O7P3O5N7M6K5J0J4K6K2Mp%
$$ 593 567 554 581 638 693 726 731 714 688 665 649 636 624 625 648 685 714 721 717 727 760 795 817 838 880 947 1020 1085 1142 1188 1213 1223 1237 1263 1285 1289 1282 1282
1157A282Jqj5rlj9l8k8PK2j1n6p0n0l6l9k1K3M6J4l3l8j2nk2j8J5K4j6o1o9n5m2k5RL0K1O
$$ 1282 1283 1275 1260 1251 1248 1229 1191 1163 1170 1192 1181 1125 1055 1005 969 930 909 932 978 992 959 921 909 904 882 864 879 903 887 826 757 702 660 635 644 674 695 701
1153G01QJ0rk1oJ0mj9%K7J3j3QN6O0J2j1K8O0L8OJ1L5L4K8M7O0K8k1k8KJ5kJL0L6j9r3j12
$$ 701 709 719 710 689 683 693 689 670 670 697 710 697 705 761 821 833 822 850 910 948 954 965 1000 1034 1062 1109 1169 1197 1176 1148 1150 1165 1163 1164 1194 1230 1211 1118 1006
1148A006p4k8k0m8p0n3j0J8jm4o4m4rJ2K5K8J1k3m2k7j5l7o1k6M9P2J4m8l5K2L8Mk0oLj3k5
$$ 1006 932 904 884 836 766 713 703 721 720 676 612 568 559 571 596 624 635 612 570 543 528 491 430 404 453 525 539 491 456 478 516 520 500 494 497 484 459
1143D59j2rk6k2K2O2M6LnJ6J5k0m3k2J5L1J1k6m4j3N3P8J6p4q8j7M5L4orK0L3Rk2k9qK9M4
$$ 459 447 438 412 390 412 474 520 523 518 534 549 529 486 464 479 510 521 495 451 438 491 569 585 511 423 406 451 485 479 470 490 523 532 510 481 473 502 546
1139E46J0m4n0jL4Rl6m1j6j2j8QN5O1K0j5k2l4o0m7K3P9N3j4l6nJ8QNL3M6J1k4%O5Q4K3n6
$$ 546 556 512 462 461 495 504 468 427 411 399 381 389 444 505 525 510 488 454 394 347 370 449 502 488 452 447 465 473 478 511 557 568 544 544 609 693 716 660
1134F60q0n1j2QJ1%k9o2p0m8oL1N0L5LqK3N1K8k6n5m5l7m0j9L3O2K8k6m5l1k4k0J2O0P6N1
$$ 660 580 529 517 525 536 536 507 445 375 327 321 352 402 437 440 432 455 506 534 508 453 408 371 331 312 345 407 435 409 364 333 309 289 301 361 437 488
1130D88K6K7L1J0l2n8n1j9Kpk3j0K8M1J6nJ3L1Ll6k4K3L2rl4qK4J4rpJ1J9J8J3j5o0o9k5J0
$$ 488 514 541 572 582 550 492 441 422 424 417 394 384 412 453 469 464 477 508 511 475 451 474 506 497 463 455 479 493 484 477 488 507 525 538 523 463 394 369 379
1125C79rm1j8L0K3k9l6K4O9M2rj1J5J8rj3J1K8J6oj6j3ppj8l5m3k6LJ6J4J6K5K7K2J7J5J3
$$ 379 370 329 311 341 364 335 299 323 392 434 425 414 429 447 438 425 436 464 480 474 458 445 438 431 413 378 335 309 312 328 342 358 383 410 432 449 464 477
1120D77RJ0J2Kj2j0J1J9nm3n0lO5R9O1j4o3n8l2k3k0kPk5n3j5O7Q2pr2p3QM9K8J5K9K6nk5
$$ 477 486 496 508 510 498 488 499 518 513 470 420 417 482 581 642 628 565 507 475 452 432 430 437 412 359 344 411 493 486 394 321 329 378 406 421 450 476 471 446
1115D46rJ0J1J1K1J3plL1M9J7k6l2mK2L1K2rn2p1n6l9l3pM8P9N0OQL6K8j8l9nM1M6J8j6l0
$$ 446 437 447 458 469 490 503 496 493 524 573 590 564 532 528 550 581 603 594 542 471 415 376 343 336 384 463 513 519 527 563 591 573 534 529 570 616 634 618 588
1111E88l0l1m0n0l8nK1K8L8M9K4m0p1j8N2M8j0k3K3M6Ml8k0J6J4j4j9J1L4J9k3n9n2j0J6n
$$ 588 558 527 487 437 399 394 415 443 481 530 554 514 443 425 477 525 515 492 515 561 565 527 507 523 537 523 504 515 549 568 545 486 434 424 440 435
1106D35l2pN1O6K2j7j4j1l6n6k8J8L2J4JLJ3K7L1Km8o7k6K8L9J1nJ2L8M8K8j3m7m5j3J1RR
$$ 435 403 396 447 513 535 518 504 493 457 401 373 391 423 437 438 441 454 481 512 514 466 399 373 401 440 451 446 458 496 544 572 559 512 467 454 465 474 483
1102D83K7L3Nl1k9KK3J6ok5k3JK1J2oJ2N0M0k7n9mP1P0J0k9l5n5q3o7qM1M7L3J0k7n6m0KJ5
$$ 483 510 543 548 517 488 490 513 529 523 498 475 476 497 509 503 515 565 605 578 519 515 586 656 666 637 602 547 464 397 389 430 477 510 520 493 437 397 399 414
1097D14j1k4kK4K5J6J2RQK0K9J5j2j8lKrj1lj%RJ1j2k9pL1K7mj2Jlj6ML3Qm9m3L5P5K5m0m3
$$ 414 403 379 377 401 426 442 454 463 471 491 520 535 523 505 502 504 495 484 481 480 480 489 500 488 459 452 483 510 506 494 495 492 476 480 513 521 472 429 464 539 564 524 481
1092D81k0k3k1K4O3L3l2n4k1J4K6J8qm1m9k1NNKJ4J2j0j5J1J8j9k7L3Q5M5l5n7k4qj8KL8L1
$$ 481 461 438 417 441 504 537 505 451 430 444 470 488 480 439 390 369 374 379 381 395 407 397 382 393 411 392 365 398 483 528 493 436 412 404 386 388 426 457
1087D57poL7M2nl2jK7Ol5n5n0l3lJ7ll1j0M1N1J4MM5N9J1l3j1L7M6K8J4rn2o2j0M0J0n3n1
$$ 457 450 444 481 523 518 486 485 512 518 483 428 378 345 342 359 356 325 315 356 407 421 425 470 529 540 507 496 533 579 607 621 612 560 498 488 528 538 485 434
1082D34J8O0L6nj8l0o3q6o6j3M4Q2Q4M0j4k6RL6J9j3k2k0l8n9m4%L0K9K4L6M3K5nk3j7mPO
$$ 434 452 512 548 543 525 495 432 346 280 267 311 393 477 517 503 477 486 522 541 528 506 486 448 389 345 345 375 404 428 464 507 532 527 504 487 483 490 496
1078D96j6n0o2k6L1N6L6NmLRJ8K5J1j8k4jJ5%j0K1N0J8n5q6n3rok1pL4O7O7K9k0m8m1j7j0
$$ 496 480 430 368 342 373 429 465 470 466 469 478 496 521 532 514 490 489 504 504 494 515 565 583 528 442 389 380 374 353 346 380 447 514 543 523 475 434 417 407
1073D07j5oJ4K0PkLNQK8M7L3j6m6l7j7j5k0j4qoQL5N0L8K2J6Rj2k5j9p%J4L1K6Jj3JQpj8k
$$ 407 392 386 400 420 427 425 428 433 441 469 516 549 533 487 450 433 418 398 384 376 370 378 413 463 501 523 539 548 536 511 492 485 485 499 530 556 557 544 545 553 546 528 526
1068E26J3kl2m7l6rK9M5J3k8j0M8N2j4m8J2P8N2k2l4J2J7l5p0m8j8j7k4k5k1%N1Q3L6n6q6
$$ 526 539 537 505 458 422 413 442 487 500 472 462 510 562 548 500 512 590 642 620 586 598 615 580 510 462 444 427 403 378 357 357 408 491 527 471 385
1063C85k8L4L8J4KK%J2K9J3l7n8k0K4K6OQK3J3j3j4J5M4M5J7k6m9l6p%j3rRJ2k%K1K4LkJ7
$$ 385 357 391 429 443 445 447 447 459 488 501 464 406 386 410 436 442 450 473 486 473 459 474 518 563 580 554 505 469 462 462 449 440 449 461 459 459 480 504 507 505 522
1058E22J2k6l7J5O7M9j0l3oK1K2J9L1N9R0R4N6J3L1J00J25N9j2mM3M2pl2k5l9q2r4o6l3k4
$$ 522 534 508 471 486 553 602 592 559 553 574 596 615 646 705 795 889 945 958 989 1089 1214 1273 1261 1257 1300 1342 1335 1303 1278 1239 1157 1063 997 964 940
1054I40k1l1o6r2o2rol8k2L5L8l9q2j5P4P5J0k3j3j9m1k3L6O8L1k6n1l4J5P7J08P1kl4jM2
$$ 940 919 888 822 730 668 659 653 615 593 628 666 627 545 530 604 679 689 666 653 634 593 570 606 674 705 679 628 594 609 686 794 865 863 829 828 870
1049H70L4j0m1l5lL7O6O5M1K8L4L4Jl8l0K2O5N3Rj4OM5N5K3k2l2JL2J3m7q6o0%L1Mm9q6q5
$$ 870 904 894 853 818 815 852 918 983 1024 1052 1086 1120 1121 1083 1053 1075 1140 1193 1202 1188 1194 1239 1294 1317 1295 1263 1264 1296 1309 1262 1176 1116 1116 1147 1151 1102 1016 931
1045I31n0kK4Pm1p0n9l8m5o8n8nM6M9J3j6k0j7j5LM5O9L6l6o8k1M8O6K4j6j9ponJ1K8K5K1
$$ 931 881 879 903 910 869 799 740 702 657 589 531 526 572 621 634 618 598 581 566 569 614 683 719 683 615 594 642 708 732 716 697 690 684 679 690 718 743 764
1040G64M3P8Q4N5K1Lj1j8oK0K5mm1n3m4l7l4k5j5k2m3n4l7qLj4l3l3j5kLJ0K1K0Jj3qkk0m3
$$ 764 807 885 969 1024 1045 1048 1037 1019 1013 1033 1058 1054 1013 960 916 879 845 820 805 783 740 686 649 641 644 630 597 564 549 547 550 560 581 601 602 589 581 579 559 516
1035E16l5lJ5Kj7j8j2oLPj6m6l2L5R1P3Kn0m9j7J7L4K0j5k4J8O3M4k4o1l5MJ2J0J9J0l7o4
$$ 516 481 478 493 495 478 460 448 442 445 452 436 390 358 393 484 557 559 509 460 443 460 494 514 499 475 493 556 600 576 515 480 484 496 506 525 535 498 434
1031D34j9N4N9Pj2L6O9K2l7k4L7N4jm5k1L3N8L7jl1m8m1j4NLnkJ0Rmk1l6l8k4lmk2k1QK7N
$$ 434 415 469 528 535 523 559 628 650 613 589 626 680 679 634 613 646 704 741 740 709 661 620 606 611 614 609 607 617 626 622 601 565 527 503 500 496 474 453 461 488 493
1026D93k4j6J4K0qk4j2lj5k1nJ6K1K1K3J5nj0J0K3Mk3k9k2k5l0j2J4J3pj3QK7L2L3K7nm8o0
$$ 493 469 453 467 487 479 455 443 440 425 404 399 415 436 457 480 495 490 480 490 513 517 494 465 443 418 388 376 390 403 396 383 391 418 450 483 510 505 457 397
1021C97k2K6M0K2%j5k7k5kL0L3Oj8rK0L7L2J6ql7n4k9K7N9L5j8m2k7lRJ7K5J6pj4QK3J0j1
$$ 397 375 401 441 463 463 448 421 396 394 424 457 463 445 436 456 493 525 541 533 496 442 413 440 499 534 516 474 447 444 453 470 495 511 504 490 498 521 531 520
1016E20j0Kmj9j1J0Pk3m0k0J4K4Qrj8k4k7j3K7P0P7L3k4m7k8j0k0m1m3j5J9M7N7M1J0j3j6
$$ 520 510 512 508 489 478 488 495 472 432 412 426 450 458 449 431 407 380 367 394 464 541 574 550 503 475 465 445 404 361 346 365 412 469 510 520 507 491
1012D91j4j1J2N1M8l2j19j11nR9J13N8jk9l1k2j0qJL5P9P5J1n4o2k7kLJ1K9K8Lk0k5k1j8j0
$$ 491 477 466 478 529 577 545 426 315 310 409 522 580 579 550 519 497 487 479 480 515 594 669 680 626 564 537 535 538 549 578 606 609 589 564 543 525 515
1007E15NOj0k7k2JK7N0O3M8kn3o3k6J5J8j0l0k5jJ8K7K3Oj4j9oJnqLMk1l4MO2P0J6l5l4j5
$$ 515 520 526 516 489 467 468 495 545 608 656 654 601 538 512 527 545 535 505 480 479 497 524 547 553 539 520 514 515 510 502 505 509 488 454 458 520 590 606 571 537 522
1002E22k5m5k6L1O2L4k0m0j5K0K5kk0kL5M3J0k7l2k6l8n3l1K8O3M3mk1nKk0m1k6J9M3K6KO
$$ 522 497 452 426 457 519 553 533 493 478 498 523 521 501 499 534 577 587 560 528 502 464 411 380 408 471 514 510 489 484 486 466 425 399 418 461 487 489 495
997D95K2Mm9q0m2L3P4N4Pj8k2k5k5j2RJ5pk7j0L7P0N5J6qplnJOpl4l5JM1M1%l9m4rL9N9K9
$$ 495 517 521 472 392 350 383 457 511 518 500 478 453 428 416 425 440 433 406 396 433 503 558 574 566 559 556 551 552 558 551 517 482 483 524 565 565 526 482 473 512 571 600
992F00j8l1oJ6J1LNNnKK9K8k7q0o8rL0K8J7J2%rQL1J3l8o0k4K8M7L9K5J2nj4j4k0l3l5k9l7
$$ 600 582 551 545 561 572 575 580 585 580 582 611 639 612 532 464 455 485 513 530 542 542 533 541 572 585 547 487 463 491 538 577 602 614 609 595 581 561 528 493 464 427
987D27m8l0J4M0L3K7L9K6k3m6JN9L9m5q5l4M6P4L9j8n7o6l8PL5K7OJ0M1N9L5j5m0k0J8K6%
$$ 427 379 349 363 403 436 463 502 528 505 459 460 519 558 513 428 394 440 514 553 535 478 412 374 381 416 443 449 459 500 559 594 579 539 519 537 563 563
983E63j9qJ5K5J7J0jk4m8n3l1%K7L2Ol9o5m0J5M4K5j3k5nK7L8K5%j4oJ4K5K2Nj2k5l0k7k1
$$ 563 544 536 551 576 593 603 602 578 530 477 446 446 473 505 511 472 407 367 382 426 451 438 413 408 435 473 498 498 484 478 492 517 539 544 532 507 477 450 429
978D29j5oJNPJ8L4M4L1nm2n0k0J9K3pk4KL5K4j0j1K2L3NoK1L6Ll4k8kok6j9NOqJK8L0Oj2k4
$$ 429 414 408 409 414 421 439 473 517 548 543 501 451 431 450 473 466 442 444 479 503 493 482 504 537 542 536 557 593 596 562 534 532 526 500 481 486 492 484 485 513 543 549 537 513
973E13m9o5k5M1N5Ol2qL0L1J9L1L9J1k6k1J0J3j1j2J9L4%m5m5%M7N4K3j7m4n2m7l3rJ3K5K9
$$ 513 464 399 374 415 470 476 444 436 466 497 516 547 586 597 571 550 560 573 562 550 569 603 603 558 513 513 560 614 637 620 576 524 477 444 435 448 473 502
968E02K5Lm0o5l8K2M9K8JLMk2m6k7K1M9M2J8mj4kJ5Ml3m3KM4J4n3o1lM0K5MK1M5K6j6l4l1
$$ 502 527 530 490 425 387 409 458 486 487 490 494 472 426 399 420 469 511 529 525 511 509 524 528 495 452 454 498 512 459 398 395 435 460 464 485 530 556 540 506 475
963D75l4l4j5J1J3pj5kPJ1K4M6M7J6j8j9J4M0L4Kk5l0j8j2j5rPJ5kk3k0RL6L4J4nrmJ%moo
$$ 475 441 407 392 403 416 409 394 392 399 410 434 480 527 543 525 506 520 560 594 596 571 541 523 511 496 487 494 509 507 484 464 473 509 543 557 552 543 539 540 540 536 530 524
958E24pj5k1qJ7L1J8qj9pJ3K1J2pk2k1oNOQK7N0M4km7m3%L1J8j4k5j0OKj6k1mJ8J7pk1jL8
$$ 524 517 502 481 473 490 521 539 531 512 505 518 539 551 544 522 501 495 500 506 514 541 591 635 633 586 543 543 574 592 578 553 543 549 551 535 514 510 528 545 538 517 516 554
952E54N0K5pj7j3j0j4j2%J1J9J8J0mj9k6k0JL1L5%m2m2ML9L2Lj6k5l5k5PK1j1n3l9K0M6J1
$$ 554 604 629 622 605 592 582 568 556 556 567 586 604 614 610 591 565 545 546 577 612 612 570 528 532 571 603 606 590 565 530 505 512 533 522 469 430 450 496 507
948E07l3l4kK2K2J1Mjl%KJ0K0J8KnQJ5rm0l3%J4%jK0K3nj5K3N8M0rk7pOLJQNrrJ%k4m3l3j4
$$ 507 474 440 438 460 482 493 497 496 493 493 495 505 525 543 545 540 548 563 554 514 481 481 495 495 494 514 537 532 517 540 598 638 629 602 595 601 604 605 613 618 609 600 601 601 577 534 501 487
942D87j2l2m7l1QL4L1K0K3K8%m2n2j8J6K3K6L6K4k2n3k7K2L7K4K7L9J6l3n5l3qKJ7N0P3N1
$$ 487 475 443 396 365 373 407 438 458 481 509 509 467 415 397 413 436 462 498 522 500 447 420 442 479 503 530 569 585 552 497 464 456 458 475 525 598 649
937F49ln3o7l0K7M6Pl6k6J3K4K0M5O8J9p2r2j6M4J7l5l0joj1K0L8j7q1n2L6O0Kl6%M1L0KL
$$ 649 646 593 526 496 523 569 576 540 514 527 551 571 616 684 703 631 539 523 567 584 549 519 518 512 501 521 559 542 461 409 445 505 507 471 471 512 542 544 547
933E47Pj3l1j3J2Mk4l1j8JJ7K9K3KjK5M2J5k4l1j8j9l7l3mK3L5M0L3qn8o5j4L9M3Lk9k3MJ6
$$ 547 554 541 510 497 509 513 489 458 440 441 458 487 510 512 511 536 578 593 569 538 520 501 464 431 427 450 485 525 558 550 492 427 413 452 495 498 469 446 450 466
928D66Mj4j0J4L5L5K9K8K3ol7l9mK7K2j2l8l7j2J5K4J6NPJ0kj5j1RMl3n4k2L3M5Ll3j4L7O6
$$ 466 470 456 446 460 495 530 559 587 610 604 567 528 524 551 573 561 523 486 474 489 513 529 534 541 551 549 534 523 532 536 503 449 427 460 505 508 475 461 498 564
923E64M4mm0m7k7LJ9J1j5l4l5j6J3L7M1J3l0n4m2qK0L1K8J6JmJ2L4L5J4pj3j4j1JK4L4J6p
$$ 564 608 604 564 517 490 493 512 523 508 474 439 423 436 473 514 527 497 443 401 393 413 444 472 488 489 485 497 531 566 580 573 560 546 535 536 560 594 610 603
918F03j2mj0k9l1j1%j6l1oL9O0L6nk1j3l%LNjj7k9k8j5kQJ3J6J3Oqj8j4J2M0M6K7J1Q%l1n3
$$ 603 591 587 577 548 517 506 506 490 459 453 492 552 588 583 562 549 546 546 549 554 553 536 507 479 464 462 470 483 499 512 518 510 492 478 490 530 576 603 614 622 622 591 538
913E38l0K4M5J1k9k4J3L0J0k0l5k5OM0M6Pm0m2JK7Nl1k2K6N8M7J8Jlj0k2l0l3k5rJ6L3K5K
$$ 538 508 532 577 588 559 535 548 578 588 568 533 508 514 554 600 607 567 525 526 553 558 527 505 531 589 636 654 655 652 642 620 590 557 532 523 539 572 597 599
908E99j0JJ9J6pk3j6j0j4j6MK1Ll4l6PM8M0Mj1nqk5k7kK5L0K7L4L4Ql5o0m7j1J1Kl3n2l1J3
$$ 599 589 590 609 625 618 595 579 569 555 539 543 564 567 533 497 504 552 592 596 585 580 572 547 520 518 543 573 600 634 668 676 641 581 534 523 534 536 503 451 420 433
903D33L7J9kLK6L3J9QQJqNM1N2J4l7m3rJ8J9J4J4mm4p2o2l0oRK7M4L8J2qj1lPJ1J2J4K0K3
$$ 433 470 489 487 490 516 549 568 576 584 585 577 582 623 675 689 652 609 600 618 637 651 665 661 617 545 483 453 447 456 483 527 565 577 569 558 555 562 573 585 599 619 642
898F42Jl7m7j4J5nl8j9L8M8pm1mM7L4k3m4j6PLjMnk7k5J5M4K2k4m6k7PL3L0pm9n1kN2O2L3
$$ 642 643 606 559 545 560 555 517 498 536 584 577 536 532 579 613 590 546 530 537 540 539 543 538 511 486 501 545 567 543 497 470 477 510 540 533 484 433 431 483 545 578
893E78RJ0K4K4jl1l5oK0Nl7n0j3K3J7nML0K8jj2RK7J7LJ1K4Rl1o4p3n8k8J0M3N4M6L0K5K9
$$ 578 587 597 621 645 644 613 578 572 592 597 560 510 497 520 537 532 536 566 594 593 581 590 617 634 637 648 672 681 650 586 513 455 427 437 480 534 580 610 635 664
888F64L1J2k7o2o0j2M6O3J9n1q8o6j2K1J5MJ5L5L6J8MLJqj4qlj5l2k7J2N7O4K1l9n9k0L5N1
$$ 664 695 707 680 618 558 546 592 655 674 623 535 469 457 478 493 497 512 547 583 601 605 608 609 601 587 579 576 561 529 502 514 571 635 656 617 558 538 573 624
883F24K5LRK1Rk1m3m2k9j8j1oMK0L4L3J9OJ6M7O7M8nm7l9JJ3j6l7j6J8J4k3l2nQj6m2l5j1
$$ 624 649 652 661 682 691 670 627 585 556 538 527 521 525 545 579 612 631 637 653 700 767 815 810 763 724 725 738 722 685 669 687 701 678 646 641 649 633 591 556 545
878E45poJ7M6L2j5m4k1J1J1lJ5N6N4j4p8n8K4N9qr8j02k2M7N6L9L1J5j6k9JL6K5rj6NJ4Ko
$$ 545 538 532 549 595 627 612 568 547 558 569 566 581 637 691 677 599 541 565 624 616 518 416 394 441 497 536 567 582 566 537 538 574 599 590 574 579 593 595 589
873E89mj0k4j8J1K9K3J2J3J9Qj4k9k8j8pLK6O2P1J1q1j07k9O1O1pl8mJ8j8n4k6L5O1L9Rj1
$$ 589 585 575 551 533 544 573 596 608 621 640 648 634 605 577 559 552 555 581 643 714 725 644 537 508 569 630 623 585 581 599 581 527 501 536 597 636 645 634
869F34k5l0j8QL1M3L0pl6k7PPk9l9J3P5P8L2j1l0l6k6jK1J7RK0K5nl6k4RPk5l5pOj7l5j7P
$$ 634 609 579 561 569 600 643 673 666 630 603 610 617 588 549 562 637 715 747 736 706 670 644 643 664 681 690 710 735 730 694 670 679 686 661 626 619 625 608 573 556 563
864E63jk0j5J5L1K1mk4k5oJ4K0J8K8M2L2ml7m8m9l5NN9Q1N6J4j5l9n5m3jK1Lj9kK7J9j6k7
$$ 563 562 542 527 542 573 594 590 566 541 535 549 569 587 615 657 689 685 648 600 551 516 521 580 661 717 731 716 677 622 579 578 599 602 583 581 608 627 611 584
859E84LL4L6J0j9l3k5%J6RlJJ3RmjJ5J4j4m3m4j3K5L7J1k3j7K7N2K1l1m2j3J3J6J4K0K0J0
$$ 584 587 621 657 667 648 615 590 590 606 615 612 613 626 635 631 630 645 659 645 602 558 545 570 607 618 595 578 605 657 678 647 605 592 605 621 635 655 675 685
854F85MQJ0J1J7K8K6K0K2J4j9m6j3N1O8K6KM6R7Q3L2K6O6R0P1O2J02J71K21K34K34K50K96
$$ 685 689 697 707 718 735 763 789 809 831 845 826 780 767 818 886 912 914 960 1057 1140 1172 1198 1264 1354 1425 1487 1589 1760 1981 2215 2449 2699 2995
850B995L42L52L16K73K54K45K14J58R2J8o6j36j72k06k68l31l45l12k92l01k93k48k03j84
$$ 2995 3337 3689 4005 4278 4532 4777 4991 5149 5241 5259 5193 5057 4885 4679 4411 4080 3735 3423 3131 2830 2537 2289 2086 1902
847A902j64j12o4n4o8o6n1n2n7l9j1oj8j3Opn2p2l7Oln7r1p4l4j5j5oK4N3M2jl3k5jnk7k1
$$ 1902 1738 1626 1562 1508 1440 1374 1323 1271 1214 1175 1164 1158 1140 1127 1133 1126 1074 1002 965 971 968 911 820 746 712 697 682 676 700 753 795 794 761 736 735 730 703 682
843F82K4N2K5k4l9j3J0J1OJ8L3L1J3oj5j8k2l0l5k4j1j7l7l4J1N2L7j2k3J6M7K6j8k9pJ3K1
$$ 682 706 758 783 759 720 707 717 728 734 752 785 816 829 823 808 790 768 738 703 679 668 651 614 580 591 643 680 668 645 661 708 734 716 687 680 693 714
838G14K4J7%oK5O3N9J4j7nK0J8%kQOj3k7k4j7j6j3QM3O2M7Ml4l9j1K0K1j0m9n9k7J4J9j1l7
$$ 714 738 755 755 749 774 837 896 910 893 888 908 926 926 924 932 938 925 898 874 857 841 828 836 879 941 988 992 958 919 908 928 949 939 890 831 804 818 837 826 789
833G89k7jJj6j5J7L9K2j4k4KL5M8M1K3J6L1O1P7N2J3NM3Q7R0N3K1K7N3O0L9J6J1J9J7Kj6l6
$$ 789 762 761 762 746 731 748 787 809 795 771 773 808 856 897 920 936 967 1028 1105 1157 1170 1175 1218 1305 1395 1448 1469 1496 1549 1609 1648 1664 1675 1694 1711 1713 1697 1661
829A661n9p5p4o7o3m4QN9M9k5r0q7m1k2l8m8l1j5k0l9m7l9j1L5O6M8rm7k9J4L5K4QRJ6J5J1
$$ 1661 1602 1527 1453 1386 1323 1279 1287 1346 1395 1370 1280 1193 1152 1130 1092 1044 1013 998 978 939 892 853 842 877 943 991 982 935 906 920 955 979 987 996 1012 1027 1038
824A038K1M3N7L9%j7J2N4O4M4M2P3R3N7nl4pL6M3Qm3p2o1k8qj6k8k0j1l0o8q2n5j8rk4l4k5
$$ 1038 1059 1102 1159 1198 1198 1181 1193 1247 1311 1355 1397 1470 1563 1620 1615 1581 1574 1610 1653 1661 1618 1546 1485 1457 1449 1433 1405 1385 1374 1344 1276 1194 1139 1121 1112 1088 1054 1029
819A029j2k2m9o6m8oK2J7j4l3k6mJ0NmML8O8O0J9j4j8j6k3k0J2L5J0l4k7L5P7N6J5J0K1Jl2
$$ 1029 1017 995 946 880 832 826 848 865 851 818 792 788 798 803 799 803 841 909 969 988 974 956 940 917 897 909 944 954 920 893 928 1005 1061 1076 1086 1107 1108 1076
815A076k9J0L0Mk6k4LK1K1Qj2k6j4J1J0k7n5l6mpl3l8j9k0m6m6jL1Rl1k8PJ2j6k8KK5Kl2k3
$$ 1076 1047 1057 1087 1091 1065 1041 1044 1065 1086 1094 1082 1056 1042 1053 1063 1036 981 945 941 934 901 863 844 824 778 732 731 762 771 740 712 719 731 715 687 689 714 716 684 661
810F61K7N7K6l1m6%N8O1Kn0m2JJ3j6l6j0L0L2PjK3M2L3RnOL1N0L1k4p2p6l9oKjLRPJk%OJ4
$$ 661 688 745 771 740 694 694 752 813 815 765 723 724 737 721 685 675 705 737 744 743 766 808 841 850 845 851 882 932 963 939 867 791 752 746 748 747 750 759 766 767 765 765 771 785
805G85J8J8R%j2k1k3j1QJ8J9K0J5pl2l3j5oj1kJ5J1k6m2lN0N1jl8k6RK5K2Qqj9j6qrj8j3J4
$$ 785 803 821 830 830 818 797 774 763 771 789 808 828 843 836 804 771 756 750 739 737 752 763 737 695 692 742 793 792 754 728 737 762 784 792 784 765 749 741 732 714 701 715
799G15L1J6j5l5l3j4J1L2L2J4PJ7J4j7m0k2J2J4j2j7J0K5Nj5KK6J5j3oM1O6L3j8k7lJl2o0
$$ 715 746 762 747 712 679 665 676 708 740 754 761 778 792 775 735 713 725 739 727 710 720 745 750 735 737 763 778 765 759 800 866 899 881 854 851 852 820 760
795G60m9j0J5J1KKJ1J4J2Olk1k9j3J9L5J7mMK9K9Kj2J3N0N2J5k4l0j5j0k6m6m7j9J2K1Jk1
$$ 760 711 701 716 727 729 731 742 756 768 774 771 750 721 708 727 762 779 775 779 808 837 839 827 840 890 942 957 933 903 888 878 852 806 759 740 752 773 774 753
790G53k9k9k5oK8M6K2k4l9j5J3K0J5J7J6RPJ9K0nl4l5j1NJ3K8M3L4ll6l7k1j1mJ0J6Q%K0N6
$$ 753 724 695 670 664 692 738 760 736 697 682 695 715 730 747 763 772 779 798 818 813 779 744 733 738 751 779 822 856 853 817 780 759 748 744 754 770 778 778 798 854
785H54N9J0m6m3J0L9kp0q7m7j2j9l1pL6N0K7ORK4L6M4M5K1k4m7k0L7O3K9l6o7l7J8L7Ml0j8
$$ 854 913 923 877 834 844 883 881 811 724 677 665 646 615 608 644 694 721 727 736 760 796 840 885 906 882 835 815 852 915 944 908 841 804 822 859 863 833 815
780H15K2L4%l3l0j1nj1qMNnj2nQJ2PPK7M8L0k5p1n9oK9K2OQJ3QQK2K0k4p2p0j6L6M5J9j4k6
$$ 815 837 871 871 838 808 797 792 781 773 777 782 777 765 760 768 780 787 794 821 869 899 874 803 744 738 767 789 795 803 816 824 832 854 874 850 778 708 692 728 773 792 778 752
775G52j1J0J1rj1J3L3J8KK3N9N6Pm3n2k9J1M7N6L2OOK0Ml6n7n0m9n5k9K4L9om1mN9O2J0k3
$$ 752 741 751 762 753 742 755 788 806 808 831 890 946 953 910 858 829 840 887 943 975 981 987 1007 1011 975 918 868 819 764 735 759 798 792 751 747 806 868 878 855
770H55oJ7Jk9l5j7lllK3O5Q0K9n3p9k9K8K1k5l4lJ1mj0J5L1J4qj0jPK0L4K6qk5kK5K0lj0j1
$$ 855 849 866 867 838 803 786 783 780 777 800 865 945 974 921 842 813 841 862 837 803 800 811 807 797 812 843 857 849 839 838 845 865 899 925 917 892 890 915 935 932 922 911
765I11l8o9n6OO1O2L1J8L4M1Ql7m2ON4M9kl9l2j1mj1j1qoQL3M2J7j1rJ0Nk5m4l9l2l7l6j5
$$ 911 873 804 748 754 815 877 908 926 960 1001 1009 972 930 936 990 1039 1037 998 966 955 951 940 929 921 915 923 956 998 1015 1004 995 1005 1010 985 941 902 870 833 797 782
760G82LJoJ1M1M7J8j8l3k0KJ9K9L1K8J6Loooj0j2qkKjkLJ1J1PLJ0J7J9J3J1J3Ok0m2l5lK0
$$ 782 785 786 780 791 832 879 897 879 846 826 828 847 876 907 935 951 954 948 942 936 926 914 906 904 906 905 903 906 917 928 935 938 948 965 984 997 1008 1021 1027 1007 965 930 927 947
755I47J3knJ%lQK5K7J6J1J5Ok6n6n3qM3N8L3MNK7L8K5Oj1l6o4o0j2L0J8j8k7rj3k7nM4N0j1
$$ 947 960 958 953 954 954 951 959 984 1011 1027 1038 1053 1059 1033 977 924 916 959 1017 1050 1054 1059 1086 1124 1149 1155 1144 1108 1044 984 972 1002 1020 1002 975 966 953 926 921 965 1015 1004
750A004o0l4K4L9J5JJj5l8k7OJ3qKN0P1K7k9l7j5j1k1oK8L9K4J3J3%k8l7j8j2l7n9l9OM0N6
$$ 1004 944 910 934 973 988 989 990 975 937 910 916 929 921 923 973 1044 1071 1042 1005 990 979 958 952 980 1019 1043 1056 1069 1069 1041 1004 986 974 937 878 839 845 885 941
745I41O8O6L1j4k7j4j8n1n9j0M5M0j2m1j2L4M8K8J0J0K2K9K6Qj6l4l5k5j2JJ2K0K0Rj2k6j7
$$ 941 1009 1075 1106 1092 1065 1051 1033 982 923 913 958 998 986 945 933 967 1015 1043 1053 1063 1085 1114 1140 1148 1132 1098 1063 1038 1026 1027 1039 1059 1079 1088 1076 1050 1033
741A033QJ8ol3k4K1M8K9j0k1lJ2Pj2k6k6j1PJ2M%J2K3J8OQK0J7kj1m%j9n0o7m9pL7N4L9Nk4
$$ 1033 1041 1059 1053 1020 996 1017 1065 1094 1084 1063 1060 1072 1079 1067 1041 1015 1004 1011 1023 1027 1027 1039 1062 1080 1086 1094 1114 1131 1129 1118 1114 1114 1095 1045 978 929 922 959 1013 1052 1057 1033
735A033l5k4JL0M0K6Jk2l9m2j2M4P7N7J2rkkk0k5kJ6Jk2k1%J5J0MLOkj3j5LL6N2K6k6n9m4
$$ 1033 998 974 975 1005 1045 1071 1072 1050 1011 969 957 1001 1078 1135 1147 1138 1136 1134 1114 1089 1087 1103 1104 1082 1061 1061 1076 1086 1090 1093 1099 1097 1084 1069 1072 1108 1160 1186 1160 1101 1057
730A057NN0N5J5m3o3k1L3L1j7l3RM2Rn0o0k0K0L0K7K2J3RJ4Rj7l2JN0N4J2j8j2pk0l0j7kl
$$ 1057 1062 1112 1167 1182 1139 1076 1055 1088 1119 1102 1069 1078 1120 1129 1079 1019 999 1019 1049 1076 1098 1111 1120 1134 1143 1126 1094 1095 1145 1199 1211 1193 1181 1174 1154 1124 1107 1105 1102
726A102jOJj3mL0M0Qk4j1J7J8krqk1k5J6P6R0L5l5o8o6m9l0j6j0kJ7L4L1J4J0K0K0QMJ5J9
$$ 1102 1101 1107 1108 1095 1091 1121 1161 1169 1145 1134 1151 1169 1167 1158 1150 1129 1104 1120 1196 1286 1321 1286 1218 1152 1103 1073 1057 1047 1045 1062 1096 1127 1141 1151 1171 1191 1199 1203 1218 1237
721A237QLRQkKL0M5K1k7n9o0m0j9prj1%J5J2jNL7N1K0j9j8OJ9K0L2L6kn5n6JM7L6ql0k1lJ3
$$ 1237 1245 1248 1257 1265 1263 1265 1295 1340 1361 1334 1275 1215 1175 1156 1149 1140 1129 1129 1144 1156 1155 1160 1197 1248 1268 1249 1231 1237 1256 1276 1308 1344 1342 1287 1231 1232 1279 1315 1307 1277 1256 1253 1266
716A266K0Pk7n0l2J3M4M1J0k4k8J0N6N6Mm4m2j6pj0LJ9Qk0k8j5j9l8l8lK4K0J0J5K5K2K2L4
$$ 1266 1286 1293 1266 1216 1184 1197 1241 1282 1292 1268 1240 1250 1306 1362 1366 1322 1280 1264 1257 1247 1250 1269 1277 1257 1229 1214 1195 1157 1119 1116 1140 1160 1170 1185 1210 1232 1254 1288
711A288M0K0rk3k6l1k3OL4K9Opoj1j3RL7L1j4n2m8j2L3O4N6Ln0m4J3M3Ol6k0K3K6j0j7K8O1
$$ 1288 1328 1348 1339 1316 1290 1259 1236 1242 1276 1305 1311 1304 1298 1287 1274 1283 1320 1351 1337 1285 1237 1225 1258 1322 1378 1381 1331 1287 1300 1343 1349 1313 1293 1316 1342 1332 1315 1343 1404
706A404L2k9n2j9K0K3mk9l4k7j8nJ4L6L7Qk3k1J5L7Pm1l9K2O8M5j0k1J0J3l4o1k2L1L0MK0
$$ 1404 1436 1407 1355 1336 1356 1379 1375 1346 1312 1285 1267 1262 1276 1312 1349 1357 1334 1313 1328 1365 1372 1331 1292 1314 1382 1427 1417 1396 1406 1419 1385 1324 1302 1333 1363 1367 1387
702A387N8L7m5q5l0L8L6j4k8PL7L6K4Pj9l4pL6L6j3o0n7j4L3N7M3Nj8jK9K1k0m1k8k3l7k6
$$ 1387 1445 1482 1437 1352 1322 1360 1396 1382 1354 1361 1398 1434 1458 1465 1446 1412 1405 1441 1477 1464 1404 1347 1333 1366 1423 1466 1471 1453 1452 1481 1502 1482 1441 1413 1390 1353 1327
697A327J8M5K1mK4O4M5j6m0j2J1rk4KL4K6j3l3j7J2K9L2K1Jk3l6k4J1M6N1J1m6o5k9K2L6J2
$$ 1327 1345 1390 1411 1407 1431 1495 1540 1524 1484 1472 1483 1474 1450 1452 1486 1512 1499 1466 1449 1461 1490 1522 1543 1544 1521 1485 1461 1472 1518 1569 1580 1534 1469 1440 1462 1498 1510
693A510j3qPJ2Jqqj1j4j4mLmj7j7JK1L1K9J8Lrj2pnrmJ5L4L2J1mj2k3l2k0J1L0K1KNK2K9J1
$$ 1510 1497 1489 1496 1508 1509 1501 1493 1482 1468 1454 1450 1453 1449 1432 1415 1416 1437 1468 1497 1515 1518 1509 1497 1490 1485 1476 1472 1487 1521 1553 1564 1560 1548 1525 1493 1473 1484 1514 1535 1537 1542 1564 1593 1604
687A604j0j7j1lJ1L1L3%m8o6l3J4K0j6m4k0K9N4L5lj7nJ3J2j%J7K7Rk3l0lK4J6k2n0m6j9J0
$$ 1604 1594 1577 1566 1563 1574 1605 1638 1638 1590 1524 1491 1505 1525 1509 1465 1445 1474 1528 1563 1560 1543 1538 1551 1563 1562 1562 1579 1606 1615 1592 1562 1559 1583 1599 1577 1527 1481 1462 1472
682A472L1M5M6L4J2pj0mql5m8k1L2N1K8OK1M4K9j2l9m0k9qK5M8K8j5k8oJ2NLJ5J9OPL0L2j4
$$ 1472 1503 1548 1594 1628 1640 1633 1623 1619 1611 1576 1528 1507 1539 1590 1618 1624 1645 1689 1718 1706 1667 1627 1598 1590 1615 1663 1691 1676 1648 1642 1654 1659 1662 1677 1696 1702 1709 1739 1771 1757
677A757o0m3J1K5j2l1OM6K5l4n6j6K7J4l2m2jL7L0QJ9M6K5m7j00p7oM4M9K1j7m1k7J7M4K3
$$ 1757 1697 1654 1665 1690 1678 1647 1653 1699 1724 1690 1634 1618 1645 1659 1627 1585 1584 1621 1651 1659 1678 1724 1749 1702 1602 1525 1519 1563 1612 1633 1616 1575 1548 1565 1609 1632
673A632j3k0j4k0k7LM8N2Pk8j9KMqqkNJ9M0M1J3j6k5k0j2ML0M2K7QJ0K4K3RNMoj7j1NKk0l1
$$ 1632 1619 1599 1585 1565 1538 1541 1589 1641 1648 1620 1601 1603 1607 1599 1591 1589 1594 1613 1653 1694 1707 1691 1666 1646 1634 1638 1668 1710 1737 1745 1755 1779 1802 1811 1816 1820 1814 1797 1786 1791 1793 1773 1742
668A742rL0N6M8Nm1n3j8K8M6K9kk1k9k1pLQJ6K4Qk9m1LN3L4l7o7j2O5P8K6k8m1k2QK6J4k0
$$ 1742 1733 1763 1819 1867 1872 1831 1778 1760 1788 1834 1863 1861 1840 1811 1790 1783 1786 1794 1810 1834 1842 1813 1772 1775 1828 1862 1825 1758 1746 1811 1889 1915 1887 1846 1824 1832 1858 1872 1852
663A852m5k9J2M2L8J6nj5j2kQJ9M1O5O9L7KkJ2lm3n0jN3M7Jj7J0L2J2j6mK4K1njL3K8m4j11
$$ 1852 1807 1778 1790 1832 1870 1886 1881 1866 1854 1852 1860 1879 1920 1985 2054 2091 2093 2091 2103 2100 2057 2007 2006 2059 2106 2107 2090 2100 2132 2144 2128 2124 2148 2169 2164 2163 2196 2224 2180 2069
658B069q7kN1L4LPK5J4j6k2J1M7M6Pl3k9J1M1K7npK1L5J4rj0%QJ8L4L2Mk1j4RRkMK7K8Mj3
$$ 2069 1982 1980 2031 2065 2068 2075 2100 2114 2098 2076 2087 2134 2180 2187 2154 2125 2136 2177 2204 2199 2192 2213 2248 2262 2253 2243 2243 2251 2269 2303 2335 2339 2318 2304 2313 2322 2320 2324 2351 2379 2383 2370
653B370pok3l7k1NPk1m0j9K2L7Jm8n9l1omkJ7K4%k2nL4M3J7ormjOKk5m6k1L0M4J2oK3N1L5
$$ 2370 2363 2357 2334 2297 2276 2281 2288 2267 2227 2208 2230 2267 2268 2220 2161 2130 2124 2120 2118 2135 2159 2159 2137 2132 2166 2209 2226 2220 2211 2207 2206 2212 2214 2189 2143 2122 2152 2196 2208 2202 2225 2276 2311
648B311MjJ3J3OJ0Rj7m2l1jKk3l8k5rmrj2oK4N5M2k1o2k1M4K9n9j05n1K5L7NjK8M2J9j3k4
$$ 2311 2315 2314 2327 2340 2346 2356 2365 2348 2306 2275 2274 2276 2253 2215 2190 2181 2177 2168 2156 2150 2174 2229 2271 2250 2188 2167 2211 2240 2181 2076 2025 2050 2087 2092 2091 2119 2161 2180 2167 2143
643B143j0J5L7L9J1k5n1o1n2j5L7O5M5J0MK0J5k2m0rM2O3L7LjK5N4N9N2M9M2J9j6l0j6oj9
$$ 2143 2133 2148 2185 2224 2235 2210 2159 2098 2046 2031 2068 2133 2178 2188 2192 2212 2227 2205 2165 2156 2198 2261 2298 2301 2300 2325 2379 2438 2490 2539 2581 2600 2584 2554 2538 2532 2513
638B513l6k9j1j2l8o0o0n2n3n6n2m2l5l6m1m6m2l1j9j4j2oLJ2J1RJ2K8M4L8%m8o0k6K2M5M4
$$ 2513 2477 2448 2437 2425 2387 2327 2267 2215 2162 2106 2054 2012 1977 1941 1900 1854 1812 1781 1762 1748 1736 1730 1733 1745 1756 1765 1777 1805 1849 1887 1887 1839 1779 1753 1775 1820 1864
634A864L5K7J7J2K0L6M2L6M0O8J11J44J34Q4L4K9N9O6K0l2l4kkm9r0r0p6q6j07j03p3m2k6
$$ 1864 1899 1926 1943 1955 1975 2011 2053 2089 2129 2197 2308 2452 2586 2670 2704 2733 2792 2858 2878 2846 2812 2810 2808 2759 2669 2579 2503 2417 2310 2207 2134 2092 2066
630B066j8j2j9l6n5n7m3k5k1l5m6k7J0K9Km6o0k3L3M7J2l2l4jK4K2J2J2Mj9k5J9P7R0N5K8
$$ 2066 2048 2036 2017 1981 1926 1869 1826 1801 1780 1745 1699 1672 1682 1711 1713 1667 1607 1584 1617 1664 1676 1644 1610 1609 1633 1655 1667 1679 1683 1664 1639 1658 1735 1825 1880 1908
625A908L2L3J5PK9N2M3J1j1j8j8lK0J8k9q7j04p9m6l0k3j9k5l8l8k3nNQRNkonkj1l3o0n7o
$$ 1908 1940 1973 1988 1995 2024 2076 2119 2130 2119 2101 2083 2080 2100 2118 2089 2002 1898 1819 1773 1743 1720 1701 1676 1638 1600 1577 1572 1577 1585 1594 1599 1597 1591 1586 1584 1573 1540 1480 1423 1417
621A417N2M4k9p9m3K4L5mj9MJ2nmK1J3l9o3pO2N3j4m3JM3K5k5l6LM1L4kj7mNrk8k2lmj7rJ3
$$ 1417 1469 1513 1484 1405 1362 1386 1421 1417 1398 1402 1414 1409 1405 1426 1439 1400 1337 1330 1392 1445 1431 1388 1389 1432 1457 1432 1396 1399 1440 1474 1472 1455 1451 1456 1447 1419 1397 1394 1390 1373 1364 1377
615A377J5poK8M2J1k5j4J5J3p%K2Qm0o3l9j4k2m1l1RM4N3K9j3l9k4QJ8PJ5M3N0K9J4K7K5j6
$$ 1377 1392 1385 1379 1407 1449 1460 1435 1421 1436 1449 1442 1442 1464 1472 1432 1369 1330 1316 1294 1253 1222 1231 1275 1328 1357 1344 1305 1281 1289 1307 1314 1329 1372 1422 1451 1465 1492 1517 1501
611A501n2l6NLl9o5n3k8j4lkj5k7rK6K9lj9J1M0K4j5k7j4j3k3k2rj5l5k9J6N0K7k5l8LM6M1
$$ 1501 1449 1413 1418 1421 1382 1317 1264 1236 1222 1219 1217 1202 1175 1166 1192 1221 1218 1199 1210 1250 1274 1259 1232 1218 1205 1182 1160 1151 1136 1101 1072 1088 1138 1165 1140 1102 1105 1151 1192
606A192Nj6JL1M0J8j9m6n4m6k9j6j1j3j1%J8K7J4j3l4k8jJ0j6n2m9KN5O8N1L5K1kk5k4pqk9
$$ 1192 1197 1181 1182 1213 1253 1271 1252 1206 1152 1106 1077 1061 1050 1037 1026 1026 1044 1071 1085 1072 1038 1010 1009 1019 1003 951 902 904 959 1027 1078 1113 1134 1132 1107 1083 1076 1068 1039
601A039k9QM2L5Lj6j4qoj4l5o0n4lM1K8pKM7N2kl7MO3N3j3m8j7K6K1j9m8l7JK6J6j6l4k2j1
$$ 1039 1010 1018 1060 1095 1098 1082 1068 1060 1054 1040 1005 945 891 888 929 957 950 952 999 1051 1049 1012 1016 1079 1132 1119 1071 1054 1080 1101 1082 1034 997 998 1024 1040 1024 990 968 957
596I57j6rL3O6M6oj5J7K3k5o4l5K3L8%m4n6l5NL7L5jk7qK0J1j8j1L3N0J1l2k6J8M2L5J9J6
$$ 957 941 932 965 1031 1077 1071 1056 1073 1096 1071 1007 972 995 1033 1033 989 933 898 903 940 975 974 947 939 959 970 952 941 974 1024 1035 1003 977 995 1037 1072 1091 1107
592A107Rqj9j2PJ6RlojJj3m1o4n9j7L8O5M4Kj7KK2Nl9o6n0jM6O6N1J3j7k7k6k9j8K5O9O4J8
$$ 1107 1116 1108 1089 1077 1084 1100 1109 1106 1100 1099 1100 1087 1046 982 923 906 944 1009 1053 1055 1038 1040 1062 1067 1028 962 912 911 957 1023 1074 1087 1070 1043 1017 988 970 995 1064 1128 1146
587A146mL1P8R1Q1Q2Q0M6LkK8L3LqL4Q3Q5O0O3J07J49J51J23J06J31J94K69L24L56L98M69
$$ 1146 1142 1173 1251 1342 1423 1505 1585 1631 1634 1632 1660 1693 1696 1688 1722 1805 1890 1950 2013 2120 2269 2420 2543 2649 2780 2974 3243 3567 3923 4321 4790
583D790N57O42P41Q89J095J338J599J865K088K188K126J944J713J466J200R27O80M58J97j67
$$ 4790 5347 5989 6730 7619 8714 10052 11651 13516 15604 17792 19918 21862 23575 25041 26241 27168 27848 28306 28503 28336
580B8336o35j139j594j936k124k137j982j707j370j028p20m56k30k3J80L89O04Q22J036J256
$$ 28336 27701 26562 24968 23032 20908 18771 16789 15082 13712 12684 11964 11508 11278 11255 11435 11824 12428 13250 14286 15542
578A5542J527J901K396K993L698M594N761P144Q461R301R357Q632P438O162N018M012L091
$$ 15542 17069 18970 21366 24359 28057 32651 38412 45556 54017 63318 72675 81307 88745 94907 99925 103937 107028
576A07028K211J222j74k184m642p058q959j0119j0471j0018q900p437n982m713l668k855k273
$$ 107028 109239 110461 110287 108103 103461 96403 87444 77325 66854 56836 47936 40499 34517 29804 26136 23281 21008
574B1008j844j477j160r45q18o99n58m37l56k77j83r4j2R8K46L94N51P62J031J309J588J928
$$ 21008 19164 17687 16527 15582 14764 14065 13507 13070 12714 12437 12254 12160 12148 12246 12492 12886 13437 14199 15230 16539 18127 20055
571B0055K352K811L290L861M603N550O782Q482J0790J3582J6404J8531J9235J8203J5879J3173
$$ 20055 22407 25218 28508 32369 36972 42522 49304 57786 68576 82158 98562 117093 136328 154531 170410 183583
569A83583J0734Q617O663M885L179R14k655p496j2644j6997j9988k1412k1109j9157j6179
$$ 183583 194317 202934 209597 214482 217661 218575 215920 208424 195780 178783 158795 137383 116274 97117 80938
567H0938j3062j0356q131o312m908l902l168k597k160j841j582j352j177j060r61q58p58o60
$$ 80938 67876 57520 49389 43077 38169 34267 31099 28502 26342 24501 22919 21567 20390 19330 18369 17511 16753 16093
565A6093n45m27l26k21p0J12K78M45O61R12J145J377J676K053K473K989L736M768N998P286
$$ 16093 15548 15121 14795 14574 14504 14616 14894 15339 16000 16912 18057 19434 21110 23163 25636 28625 32361 37129 43127 50413
563E0413Q440R137R030Q109O802N574M541L569K613J711P03p52k806n179p394r104j0127j0338
$$ 50413 58853 67990 77020 85129 91931 97505 102046 105615 108228 109939 110642 109890 107084 101905 94511 85407 75280 64942
560F4942r715q473o982n547m291l249k453j903j532j258j054r16q10p01o15o01o52o95o87
$$ 64942 55227 46754 39772 34225 29934 26685 24232 22329 20797 19539 18485 17569 16759 16058 15443 14842 14190 13495 12808
558A2808o63o75p00o72n81m89m51m42m13l51l00k84k80k44j77j21j12j36j44j12p4p0r1r7
$$ 12808 12145 11470 10770 10098 9517 9028 8577 8135 7722 7371 7071 6787 6507 6263 6086 5965 5853 5717 5573 5461 5387 5317 5226 5129
555E129q1p9j03j17r0n1m1o1p6p1n0l2k7n0r0j12q7m0j9l3n4n9m8l1j0kj5l1k2NMl2o6o2m1
$$ 5129 5048 4969 4866 4749 4659 4608 4567 4506 4430 4359 4309 4277 4250 4200 4110 3998 3911 3871 3852 3819 3765 3706 3658 3627 3617 3615 3600 3569 3547 3552 3556 3524 3458 3396 3355
551C355k8k0%Ml3p0m0M3Q9L7m4n4J2O6M7ol9l6j6J5N2O9M8J0j0j7k8l6k5j6l0m6k0L1M5J4
$$ 3355 3327 3307 3307 3311 3278 3208 3168 3211 3300 3337 3293 3239 3251 3317 3364 3358 3319 3283 3267 3282 3334 3403 3451 3461 3451 3434 3406 3370 3345 3329 3299 3253 3233 3264 3309 3323
546C323pJ2J5l5q5o2J8P9Q3O4N6O5Q0R9J15J28J54K02K45K50K40K59K90K88K41J89J49R8L5
$$ 3323 3316 3328 3343 3308 3223 3161 3179 3258 3341 3405 3461 3526 3606 3705 3820 3948 4102 4304 4549 4799 5039 5298 5588 5876 6117 6306 6455 6553 6588
543F588nj7n2j37k31k71k64k57k62k58k34k02j66j26r3q1r4j04r0n6k6k6n4p3o1l9m1m3lO5
$$ 6588 6583 6566 6514 6377 6146 5875 5611 5354 5092 4834 4600 4398 4232 4106 4013 3932 3838 3734 3644 3588 3562 3536 3482 3409 3348 3309 3268 3225 3222 3287
539C287Q1J9m4l2K9N4L1J4L8O8O9N5M9O2Q4J14J41J51J45J48J66J83J90J91J95J89J66J38
$$ 3287 3368 3387 3343 3311 3340 3394 3425 3439 3477 3545 3614 3669 3718 3780 3864 3978 4119 4270 4415 4563 4729 4912 5102 5293 5488 5677 5843 5981
536E981J20R9N1k6j07j49j45j28j40j89k36k39k07j66j23q0n4o0p2m5RK3l0r4q9k1L7L1k0
$$ 5981 6101 6200 6251 6225 6118 5969 5824 5696 5556 5367 5131 4892 4685 4519 4396 4316 4262 4202 4130 4085 4094 4117 4087 3993 3904 3883 3920 3951 3931
532C931n5l7J9O3N9K6J4M3P0O0L5M3Q1R9P6M5N1R3J26J25J02R3J15J42J38R8N8N2O8P0M9L4
$$ 3931 3876 3839 3858 3921 3980 4006 4020 4063 4133 4193 4228 4271 4352 4451 4527 4572 4623 4716 4842 4967 5069 5162 5277 5419 5557 5655 5713 5765 5833 5903 5952 5986
528E986L7K8j4o8r0p8p1r0j08r4n7k4nJ6M0L7J0lL6J04J49J60J76K24L03L90M75N23M98M22
$$ 5986 6023 6051 6037 5969 5879 5801 5730 5640 5532 5438 5381 5357 5352 5368 5408 5445 5455 5452 5488 5592 5741 5901 6077 6301 6604 6994 7469 7992 8490 8912
525H912L73L98M39M03K85J61Q1K0o9j78k72l44m04m52m70m50m04l45k97k84k89k59j65o5l7
$$ 8912 9285 9683 10122 10525 10810 10971 11052 11072 11003 10825 10553 10209 9805 9353 8883 8433 8029 7684 7387 7103 6814 6555 6390 6325 6288
522F288p5r2m4K2M6L7L1K7kl9l8LL6M4M4N0M3L2M9R5J11O3RK3R4J27R3N5P9J40J70J48J13
$$ 6288 6213 6121 6077 6099 6145 6182 6213 6240 6238 6199 6161 6164 6200 6244 6288 6338 6381 6413 6462 6557 6668 6731 6740 6763 6857 6984 7077 7132 7211 7351 7521 7669 7782
518G782J07J33J70J81J64J45J62K04K23K01J93K36L01L24L07L05L39L72L86M19M92N56N53
$$ 7782 7889 8022 8192 8373 8537 8682 8844 9048 9271 9472 9665 9901 10202 10526 10833 11138 11477 11849 12235 12654 13146 13702 14255
515A4255N13N14N89P01Q02Q87R57J002J034J089J188J296J364J386J401J438J498J562J610
$$ 14255 14768 15282 15871 16572 17374 18261 19218 20220 21254 22343 23531 24827 26191 27577 28978 30416 31914 33476 35086
512C5086J620J578J495J379J229J040Q27O13L81J02k15n28q14j097j388j651j847k003k150
$$ 35086 36706 38284 39779 41158 42387 43427 44254 44867 45248 45350 45135 44607 43793 42696 41308 39657 37810 35807 33657
510C3657k271k310k262k165k039j878j704j568j472j357j189j010q72p72o80o03n61n24m55
$$ 33657 31386 29076 26814 24649 22610 20732 19028 17460 15988 14631 13442 12432 11560 10788 10108 9505 8944 8420 7965
508G965l71l25l15k97k53k14k04k01j88j68j54j32j06r5j11j24j07n4OM5L5j3m5j5M6N8Om0
$$ 7965 7594 7269 6954 6657 6404 6190 5986 5785 5597 5429 5275 5143 5037 4942 4831 4707 4600 4546 4552 4597 4632 4619 4574 4559 4605 4663 4669 4629
504D629k9ol1p8r0p5q5j29j59j62j54j36r3n5o9j14j17o6k2k1j9J6L6ln8n9j9lk6n1n4m8l4
$$ 4629 4600 4594 4563 4485 4395 4320 4235 4106 3947 3785 3631 3495 3402 3347 3278 3164 3047 2981 2959 2938 2919 2935 2971 2968 2910 2851 2832 2829 2803 2752 2698 2650 2616
500B616j0om0p7o0j3om8o8l0K1L1K0L0N3N2K9J5K0K5J9J4K6M8O2M1j8p6p7k4J1k8r8j08m6
$$ 2616 2606 2600 2560 2483 2423 2410 2404 2356 2288 2258 2279 2310 2330 2360 2413 2465 2494 2509 2529 2554 2573 2587 2613 2661 2723 2764 2746 2670 2593 2569 2580 2552 2454 2346 2300
496B300J6K1j3l2k6k7n0p2n4NO2N4k1j01j06l8K6K7j0k3jJ3j0l8l0LJ6ol3l7k9k1JL6N3K8
$$ 2300 2316 2337 2324 2292 2266 2239 2189 2117 2063 2068 2130 2184 2163 2062 1956 1918 1944 1971 1961 1938 1937 1950 1940 1902 1872 1875 1891 1885 1852 1815 1786 1765 1766 1802 1855 1883
492A883j4l0l6n8p3k8O0R0K2o0n4J9N8K3k8n0n5o6o9m0J1M6N6M2J3j4j4PJ9lm7p5o4k9MK5
$$ 1883 1869 1839 1803 1745 1672 1644 1704 1794 1816 1756 1702 1721 1779 1802 1774 1724 1669 1603 1534 1494 1505 1551 1607 1649 1662 1648 1634 1641 1660 1657 1610 1535 1471 1442 1446 1471
487A471L8M9M4J1k8k8J4M9L2j5l0pJ6J6J3K4K4qm9n9l7j4lloj3j9k3j6PL8M3Pm7o7n0k7k1
$$ 1471 1509 1558 1602 1613 1585 1557 1571 1620 1652 1637 1607 1600 1616 1632 1645 1669 1693 1685 1636 1577 1540 1526 1523 1520 1514 1501 1482 1459 1443 1450 1488 1531 1538 1491 1424 1374 1347 1326
483A326j8oOPJ1J9J6OQJ3rm5l9K3O1K3l8l0L3O3L1qj3j1k4l3k1o%LNnj4ON3P2K6m0o7m9k7
$$ 1326 1308 1302 1308 1315 1326 1345 1361 1367 1375 1388 1379 1334 1295 1318 1379 1402 1364 1334 1367 1430 1461 1453 1440 1429 1405 1372 1351 1345 1345 1348 1353 1348 1334 1340 1393 1465 1491 1451 1384 1335 1308
478A308k7m2l9pL8N8L2j7m1l3k7k3kL2L3qk9ML5Jo0o3lM1L0NPPj5k8KM3M9L0J8Rj5l7k2J6
$$ 1308 1281 1239 1200 1193 1231 1289 1321 1304 1263 1230 1203 1180 1178 1210 1243 1235 1206 1210 1245 1246 1186 1123 1120 1161 1191 1196 1203 1210 1195 1167 1169 1212 1261 1291 1309 1318 1303 1266 1244 1260
473A260K1j2k2J6M9K3k6k8J9M8K4j8m2n2n7m3j0J2%j5mQnk7k3m%nJ2L4K4j0j5J4K5kk3rP%
$$ 1260 1281 1269 1247 1263 1312 1335 1309 1281 1300 1348 1372 1354 1312 1260 1203 1160 1150 1162 1162 1147 1143 1151 1146 1119 1096 1092 1092 1087 1099 1133 1157 1147 1132 1146 1171 1169 1146 1137 1144 1144
468A144qORk1l7QO9O8Nm2l8k3k7k3J0M1K6qj0K4M8L2lk0j6j4k5k7qJ3Oj8l0k5l2m6k2N4J15
$$ 1144 1136 1142 1151 1130 1093 1101 1170 1238 1243 1201 1163 1140 1113 1090 1100 1141 1167 1159 1149 1173 1221 1253 1250 1230 1214 1200 1175 1148 1140 1153 1159 1141 1111 1086 1054 1008 986 1040 1155
463A155R7K2l0l4l8o3p5l7J7L5J6%QK2K0Kj2pJ4K1Lj7oK3K6j2m9m8k3j7k9l2j2K0M7N9N1K6
$$ 1155 1252 1274 1244 1210 1172 1109 1034 997 1014 1049 1065 1065 1073 1095 1115 1117 1105 1098 1112 1133 1136 1119 1113 1136 1162 1150 1101 1053 1030 1013 984 952 940 960 1007 1066 1117 1143
458A143nl0m8n4l3J3M2J7l2l5K3P2M9k3n9k7K3L1Nj6j2rj8k1JJ9Ml3m9k4J2L3L0K0J1J0J4
$$ 1143 1138 1108 1060 1006 973 986 1028 1045 1013 978 1001 1073 1122 1099 1040 1013 1036 1067 1072 1056 1044 1035 1017 996 997 1016 1020 987 938 914 926 959 989 1009 1020 1030 1044
454A044J4%j5rJ5K1mk5pL0L5%l2k3J3L9M0K5Qnj2lJ0Jm3q8q1j6N3O5J7k9k7J2M2L5Lk8l5j9
$$ 1044 1058 1058 1043 1034 1049 1070 1066 1041 1034 1064 1099 1099 1067 1044 1057 1096 1136 1161 1169 1164 1152 1149 1159 1160 1117 1029 948 932 985 1050 1067 1038 1011 1023 1065 1100 1103 1075 1040 1021
449A021kkj7k0ML0L3J6KNJ7K6K5J5lk0k3mK4L2Km0n7l6jJ9L0L9L3Lk5j7Kj0m6m9j0K0J9K3
$$ 1021 1019 1017 1000 980 984 1014 1047 1063 1065 1070 1087 1113 1138 1153 1150 1130 1107 1103 1127 1159 1161 1121 1064 1028 1027 1046 1076 1115 1148 1151 1126 1109 1111 1101 1055 1006 996 1016 1035 1058
444A058M2K6m4p8j6O4M7l1n0J3N1J0l2j9J1PlJ5K5ol2lL6K8qk0k3n3p5l1M5O5K4jJ3Nm4o9
$$ 1058 1100 1126 1082 1004 988 1052 1099 1068 1018 1031 1082 1092 1060 1041 1052 1059 1056 1071 1096 1090 1058 1055 1091 1119 1111 1091 1068 1015 940 909 954 1019 1043 1042 1055 1060 1016 947
439I47l5J0K0J5K8M0K1jMK2K9K8J4l2r0p9K3J11Q1k7q1m6kj4m3l8lJ8J2j0j9QN5P7M9J3J8
$$ 947 912 922 942 957 985 1025 1046 1045 1049 1071 1100 1128 1142 1110 1020 941 964 1075 1156 1129 1048 1002 1000 986 943 905 902 920 932 922 903 911 966 1043 1092 1105 1123
435A123M0K5j2qL5L3l1p5m6mj7n1l3J6K0l3o5l3K0L6J3r%K7M1K2nlK9L4rn0k9K2K6j5l7j7
$$ 1123 1163 1188 1176 1168 1203 1236 1205 1130 1084 1080 1063 1012 979 995 1015 982 917 884 904 940 953 944 944 971 1012 1034 1029 1026 1055 1089 1080 1030 1001 1023 1049 1034 997 980
430I80nk4l1J1O0N4Qj7KK8K0j5l7k4J3L2J4k3m2l6k6j7NL0M0K6Rol0m4j3M8O7J1n5n5JM1L9
$$ 980 975 951 920 931 991 1045 1053 1036 1038 1066 1086 1071 1034 1010 1023 1055 1069 1046 1004 968 942 925 930 960 1000 1026 1035 1029 999 955 942 990 1057 1068 1013 958 959 1000 1039
426A039J6nk4k8JM0M7J8j2k4l2l6k0L%k8k8J9N6L0k7m4j4Oj0k0J1N5N8J2l3m7l0mK0L0J3j9
$$ 1039 1055 1050 1026 998 999 1039 1086 1104 1092 1068 1036 1000 980 983 983 955 927 946 1002 1032 1005 961 947 953 943 923 934 989 1047 1059 1026 979 949 945 965 995 1008 989
421I89l0mK3J2k3l1JL6M8M9N0L0rl7l1k6m9o7m0J3L8K5J9L1L0Nj2jJ6J1pj2j2j6j8qPJ6J2
$$ 989 959 955 978 990 967 936 937 973 1021 1070 1120 1150 1141 1104 1073 1047 998 931 891 904 942 967 986 1017 1047 1052 1040 1039 1055 1066 1059 1047 1035 1019 1001 993 1000 1016 1028
416A028rl9m3OO6O3lm2lM9K8l0l6J4L1j5n4k6K4K9LkJ7K3Oqj0k1m4m7j0M4P3N6J4k4l4j8L
$$ 1028 1019 980 937 943 1009 1072 1069 1027 1024 1073 1101 1071 1035 1049 1080 1065 1011 985 1009 1038 1041 1039 1056 1079 1085 1077 1067 1046 1002 955 945 989 1062 1118 1132 1108 1074 1056 1059
411A059Oqk0k7l0l0j9%Nnj3j1j1j8j0K2L9J0l6l2J8M5J5k4j3K7M2K3Kj0k8m5m1j0J5K2J4K
$$ 1059 1065 1057 1037 1010 980 950 931 931 936 931 918 907 896 878 868 890 929 939 903 871 889 934 949 925 912 939 981 1004 1006 996 968 923 882 872 887 909 923 925
407I25j9l1j5J9L3K1QQjk5l7j7J1K3K6L2K1ql1k1lqj7kK4J3k2l8k0np%K8L7Ml2k1K2M2K6N
$$ 925 906 875 860 879 912 933 941 949 948 923 886 869 880 903 929 961 982 974 943 922 919 911 894 892 916 929 907 869 849 844 837 837 865 902 906 874 853 875 917 943 948
402I48mj6l4l1jJ5j3n8o3j9K9M0L0L4N1M7J2k7l2jL3K7j5n1m3nK2K4K1K4J2k0l7j3J6Ml0l0
$$ 948 944 928 894 863 862 877 864 806 743 724 753 793 823 857 908 955 967 940 908 907 940 967 952 901 858 853 875 899 920 944 956 936 899 886 902 906 876 846
397H46LK1pl7l6j2OJ6K4K1LoJMqk1j6n%LMmnK2N9N3Kl6k6j5l6m2NN4M2OJ1L7Rn3o3kL7Mm3
$$ 846 849 870 863 826 790 778 784 800 824 845 848 842 843 847 839 818 802 797 797 800 804 800 795 817 876 929 931 895 869 854 818 776 781 835 877 883 894 931 940 887 824 822 859 863 820
392H20m1j0Knj2j5rJ3K9Pk8j9K6L9LkN3Q5K3o1o1QL7%l1j9LJj0rmQL0M3K1j9l2j8j7l9m4j5
$$ 820 779 769 771 766 754 739 730 743 772 779 751 732 758 797 800 798 851 936 959 898 837 845 882 882 851 832 835 836 826 817 813 821 851 894 915 896 864 846 829 790 746 731
386G31J1J3J5L5M4J9j8l2j8%J7K9K0pk3oJ8J7lj0jql3k7K6P7O9J4l2l6k5k3k2j2mqnJ7K6q
$$ 731 742 755 770 805 849 868 850 818 800 800 817 846 866 859 836 830 848 865 862 852 851 843 810 783 809 886 955 969 937 901 876 853 831 819 815 807 802 819 845 837
381H37o0o9k0L6N5L3OoNK0J0l1m9oN8O6J3k4mJ5j1m9m3mK0K6L3L0Oj0LJ1k4n8k8M2P0L3nj5
$$ 837 777 708 688 724 779 812 818 812 817 837 847 816 767 761 819 885 898 874 870 885 874 825 782 778 798 824 857 887 893 883 886 897 873 815 787 829 899 932 927 912
377I12j8k7j6Okl6k9L4P3K6n9q3l5K7N1L6Mk4l2j1J2J9J1PJ0J5K7L9L8K6K6M0L6%l6l9j5J5
$$ 912 894 867 851 857 855 819 790 824 897 923 864 781 746 773 824 860 864 840 808 797 809 828 839 846 856 871 898 937 975 1001 1027 1067 1103 1103 1067 1028 1013 1028
372A028M7P4O6J1m8n8j7L0M6K9kk2kN7J15J21Q3M4M3P3J09J26J15R0Q3R4J00Q5P3Q4R5P1J9
$$ 1028 1075 1149 1215 1226 1178 1120 1103 1133 1179 1208 1206 1184 1182 1239 1354 1475 1558 1602 1645 1718 1827 1953 2068 2158 2241 2335 2435 2520 2593 2677 2772 2843 2862
368B862j4j4nj4l3l6k7l1o0r3r6o3l7n0p3n7k0j9n8o2LO3M0k4k4M9Q7L0n6p3j6M6P4P5P0O6
$$ 2862 2848 2834 2829 2815 2782 2746 2719 2688 2628 2535 2439 2376 2339 2289 2216 2159 2139 2120 2062 2000 2003 2066 2106 2082 2058 2107 2194 2224 2168 2095 2079 2125 2199 2274 2344 2410
364B410P1R9J44J80J98K08K29K62K79K65K36K08J74J19O1L3L6K0l1q5j12j41k12k91l22l03
$$ 2410 2481 2580 2724 2904 3102 3310 3539 3801 4080 4345 4581 4789 4963 5082 5143 5176 5212 5232 5201 5116 5004 4863 4651 4360 4038 3735
360C735k77k61k32j90j64j50j17o7l6m0m5l9m9p8q0k3L8M4%l2l9m3m8l6nJ6K0K3K3J0mK4R3
$$ 3735 3458 3197 2965 2775 2611 2461 2344 2277 2241 2201 2156 2117 2068 1990 1910 1887 1925 1969 1969 1937 1898 1855 1807 1771 1766 1782 1802 1825 1848 1858 1854 1878 1971
356A971J41J20N7J9K8O0R8J41J60J24M6nOL5L6J5QJ1k0q0j14r6n8n1q3j28j60j50q9j6Ll9
$$ 1971 2112 2232 2289 2308 2336 2396 2494 2635 2795 2919 2965 2960 2966 3001 3037 3052 3060 3071 3051 2971 2857 2761 2703 2652 2569 2441 2281 2131 2042 2026 2029 1990
352A990p5n5nJ7Qmj2l2n1m1j5onJ7M6M5J6NJ5Nl1m2j6%k6m8k5J8M0M9O3O0J8k6l0j7k5k8J2
$$ 1990 1915 1860 1855 1872 1880 1876 1864 1832 1781 1740 1725 1719 1714 1731 1777 1822 1838 1843 1858 1863 1832 1790 1774 1774 1748 1700 1675 1693 1733 1782 1845 1905 1923 1897 1867 1850 1825 1797 1809
348A809O9O2Kk5J3N3L7QJ9N1M8J8KMk1p3r0m4K1L9J2rPK5Nm0o0l0J4K5%j6kJ6J0NK7N4M3n
$$ 1809 1878 1940 1942 1917 1930 1983 2020 2028 2047 2098 2146 2164 2166 2170 2149 2076 1986 1942 1963 2002 2014 2005 2012 2037 2042 2002 1942 1912 1926 1951 1951 1935 1933 1949 1959 1964 1991 2045 2088 2083
343B083l0jL0On0o7k8J3K2K0M0N6M0J6J6K7J6rj4pj7m5m8k0%lqLJk0k9kK4Ol6n6l9j3KMrl1
$$ 2083 2053 2052 2082 2088 2038 1971 1943 1956 1978 1998 2038 2094 2134 2150 2166 2193 2209 2200 2186 2179 2162 2117 2069 2049 2049 2046 2038 2041 2042 2022 1993 1991 2015 2021 1985 1929 1890 1877 1879 1883 1874 1843
338A843k7J5N0K7l9p8n9j2J0KrqjNM%QK2K8K3K4L9M7K4qj8KK5M1N2N2K1k7m7l3j5k2l3l1j8
$$ 1843 1816 1831 1881 1908 1869 1791 1732 1720 1730 1732 1723 1715 1714 1719 1723 1723 1731 1753 1781 1804 1828 1867 1914 1938 1930 1912 1914 1939 1980 2032 2084 2105 2078 2031 1998 1983 1961 1928 1897 1879
333A879pJ8M8M4j8q3p5jM9J4n6p8m4j9l9p3p1l7plrj4qJ5M6M8lo6q2m5qnoJ4L4K4%pnj4k0
$$ 1879 1872 1890 1938 1982 1964 1881 1806 1805 1854 1868 1812 1734 1690 1671 1632 1559 1488 1451 1444 1441 1432 1418 1410 1425 1471 1519 1516 1450 1368 1323 1315 1310 1304 1318 1352 1376 1376 1369 1364 1350 1330
328A330ML2K5rj8OJ5j0k0J5N0L2j9m4k4rk9n7n2j7pm2p9o3oK4nm7n2k9j5rPK1Jl4l9qJ3Kj8
$$ 1330 1334 1366 1391 1382 1364 1370 1385 1375 1355 1370 1420 1452 1433 1389 1365 1356 1327 1270 1218 1201 1194 1152 1073 1010 1004 1028 1023 976 924 895 880 871 878 899 900 866 827 819 832 834 816
323H16k6k4rK2L9Mn2m9K5P8L9l4n5j7J3J3J3K6L0Pk0m2n8o0l9rJ2K5M4N7L9%k8l4l7l9k3J7
$$ 816 790 766 757 779 818 822 770 721 746 824 863 829 774 757 770 783 796 822 852 859 839 797 739 679 640 631 643 668 712 769 808 808 780 746 709 670 647 664
318F64N0M9J7k1l9k7MK1J3LQJ0j5m5k7K9N9K1l7n4k5PK1L0M5M7K5j1l1k0MJ6Mj9l2k7j9j4
$$ 664 714 763 780 759 720 693 697 718 731 734 742 752 737 692 665 694 753 774 737 683 658 665 686 716 761 808 833 822 791 771 775 791 795 776 744 717 698 684
313F84j2oKOJLJ8L7L3jl9m4j6J0J2Lmj0j5nJ1J1nrMJk7m7k0J9K3PJ4L7L3lk1oNooK2M3K5o
$$ 684 672 666 668 674 675 678 696 733 766 765 726 682 666 676 688 691 687 677 662 657 668 679 674 665 669 670 643 596 576 595 618 625 639 676 709 706 685 679 684 678 672 694 737 762 756
308G56k3l6n6n4j2K8K3j2j9PJ6nj8OL0J6j5k8j6KK8O7Q5M2l5o3j5M3L8nj6ROm0o0j4M2L9q
$$ 756 733 697 641 587 575 603 626 614 595 602 618 613 595 601 631 647 632 604 588 590 618 685 770 812 777 714 699 742 780 775 759 768 774 734 674 660 702 741 733
303G33l5k6j3j4lJ5J7PJ5L4K3k4m7k1J3Kk9l3pROLJ1J4QJ0J3jk4k5KK3J2j3j4RK7K6K1J8J3
$$ 733 698 672 659 645 642 657 674 681 696 730 753 729 682 661 674 676 647 614 607 616 622 625 636 650 658 668 681 680 656 631 633 656 668 655 641 650 677 703 724 742 755
298G55lj2qok7n5n5k4MLqMK6L0J1oj1j2j4j0KKrj9j1J3L9N1L8Oj7rRMk1l8l0j6mJ8L5K1j6
$$ 755 752 740 732 726 699 644 589 565 569 572 564 568 594 624 635 629 618 606 592 582 584 586 577 558 547 560 599 650 688 694 677 668 677 681 660 622 592 576 572 590 625 646 630
293F30l4j8MJ3L0N2L6l5r6p6lM2L1J6K0J4k0m9l4NK2QlOK5L4L0J3qk3k0olj4j7NL0J5k9m2
$$ 630 596 578 582 595 625 677 713 678 582 506 503 545 576 592 612 626 606 557 523 528 550 558 555 561 586 620 650 663 655 632 612 606 603 589 572 577 607 622 593 551
288E51jM1L4Jj3rj9k3K0P7P8K5oJ2J9j8m3j4K0%m6n4k9j3pJ2L2K3M%ml1m6j0M0L5rk3KRj9
$$ 551 550 591 625 626 613 604 585 562 582 659 737 762 756 768 787 769 726 712 732 732 686 632 603 590 583 595 627 650 654 654 650 619 573 563 603 638 629 606 608 617 598
283E98l4j0K0L2L8L4Ll8l7JJ4j4k7LK8J1j9k2j0oML1M6K4j3l1k8j0J9L5Rl6l4J5L9Lk5%K7
$$ 598 564 554 574 606 644 678 681 643 606 607 621 607 580 583 611 622 603 581 571 565 569 600 646 670 657 626 598 588 607 642 651 615 581 596 635 638 613 613 640
278F40%l5j2L2J9k8l8j7k3n0k7L9N9J5j3K7O5L5k9m9k2NQKpj7j1K4N7N0Nl4l9j2J7K0Nplj0
$$ 640 640 605 593 625 644 616 578 561 538 488 461 500 559 574 561 588 653 688 659 610 588 593 601 603 596 579 568 592 649 699 704 670 631 619 636 656 661 654 651 641
273F41l8n5l1J3K9J9K2M2K9k1n7m6j8roJ5L2K0jnmqPM8O9K6l8n8l0j4j8KM6O0K7kJjl5n7k3
$$ 641 603 548 517 530 559 578 600 642 671 650 593 547 529 520 514 529 561 581 580 575 571 563 570 618 687 713 675 617 587 573 555 557 603 663 690 688 689 688 653 596 573
268E73K1J2l2m4j2Mk1l1J2O2N7Ok7k3rj6l1l9l7l4k4ON6R5R5N3Kj7p%j2k0JK2J1k4l6j4J7
$$ 573 594 606 574 530 518 522 501 470 482 544 601 607 580 557 548 532 501 462 425 391 367 373 429 524 619 672 674 657 650 650 638 618 619 641 652 628 592 578 595
264E95K9K5Ml0m9j6M6O6J8m4n6k5QJ7Ok1m8m0J0N4M7J9K1L7J6m3p7n4j1J2K0K4J9jj6j2k%
$$ 595 624 649 653 623 574 558 604 670 688 644 588 563 571 588 594 573 525 485 495 549 596 615 636 673 689 646 569 515 504 516 536 560 579 578 562 550 548 548
259E48KJ0J8J7J9K6K0ql3l2k1j8j0K1N3M7km4l9nJ2nk9l4k4k3k5qK4L1Nj2J0L7K2mJ1N5N5
$$ 548 550 560 578 595 614 640 660 652 619 587 566 548 538 559 612 659 657 613 574 569 581 576 547 513 489 466 441 433 457 488 493 481 491 528 550 546 557 612 667
254F67Jm1k7nj5k1J0M1J4l7m2nOk9l9J0O7O2Ol9m3k6j4nOJ6K2K9L3J9j4m3l5NK9J7opJj1l3
$$ 667 668 627 600 595 580 559 569 610 624 587 545 540 546 517 478 488 555 617 623 584 541 515 501 496 502 518 540 569 602 621 607 564 529 534 563 580 574 567 568 557 524
249E24k1J9M6M4L5K6j7p6q2j6M9M4MmJ6J2oJ0N0M3j9o5m8qJ0RJ3Kl1n2l3MK2K5K9K8PrJ1M3
$$ 524 503 522 568 612 647 673 656 580 498 482 531 575 579 575 591 603 597 607 657 700 681 616 568 560 570 579 592 594 563 511 478 482 504 529 558 586 593 584 595 638
244F38K5m3q6m3L4N6Kn3m5RL9K3mj1MK5M0K9j2m8m3rJj3jN0O5jo6m4L1M8Kj5K7N1J3k6qK4
$$ 638 663 620 534 491 525 581 583 530 485 494 533 556 552 541 545 570 610 639 627 579 536 527 528 515 514 564 629 628 562 518 549 597 599 584 611 662 675 649 641 665
239F65Jm6m2J2L9Mm2m6j0J3%k9l3lK5K0PK4N1L7rl2pK5K1nk9n1n5j1N7P8L0j6j2mk7m1ON6
$$ 665 666 620 578 590 629 633 591 545 535 548 548 519 486 483 508 528 535 559 610 647 638 606 599 624 645 640 611 560 505 494 551 629 659 643 631 627 600 559 565 621
234F21M0j2j8J1Km6n2kL6K6PNqk6pM8O3J7k5j5mk7l8LM4J7m4o5m3k4qL3O4L0l7m9J1N0K1l0
$$ 621 661 649 631 642 644 598 546 544 580 606 613 618 610 584 577 625 688 705 680 665 661 634 596 599 643 660 616 551 508 484 476 509 573 603 566 517 528 578 599 569
230E69l3kJ3L%QNj5m3n9n3j9K9N3L5kj6NK9L0Rj1k1k3j2J6M5M8J4k5l1qJ2J8K8M8N5K5k3n7
$$ 569 536 534 547 550 550 558 563 548 505 446 393 374 403 456 491 489 473 478 507 537 546 535 514 491 479 495 540 588 602 577 546 538 550 568 596 644 699 724 701 644
225F44o9o0l3J1M7N6L7Pj6k8j8mj2m5n6j1N1N6j0o7n0J8N7L3j9m2j7K6M3J8k2l0ON9Q2N5N
$$ 644 575 515 482 493 540 596 633 640 624 596 578 574 562 517 461 450 501 557 547 480 430 448 505 538 519 477 460 486 529 547 525 495 501 560 642 697 702
220G02l2l8k8k6l3l1pK4M0M1K4qm3o1m4j1J6L3M1L2Ormnl0m2nM0K7l1m0K3P8N4ol2l0m2n6
$$ 702 670 632 604 578 545 514 507 531 571 612 636 628 585 524 480 469 485 518 559 591 597 588 584 579 549 507 502 542 569 538 498 521 599 653 647 615 585 543 487
215D87k9K8M5J1k1j7qj9k7jL9M8K3j2l5m6m3k3QL3K8%j4J0M1K6l3o8l9J1K1MJ3M7M9Qk4j2
$$ 487 458 486 531 542 521 504 496 477 450 449 488 536 559 547 512 466 423 400 408 441 469 469 455 465 506 532 499 431 392 403 424 428 441 488 537 545 521 509
211E09Lj2k9j6RK0K5M5N2J4m8p6o3m7m3j8L5P2N4Qk2k1j0RM0O8N8lo7q1l5K3M3K9J4J9K7J7
$$ 509 512 500 471 455 464 484 509 554 606 620 572 496 433 386 343 325 360 432 486 494 472 451 441 450 490 558 616 613 546 465 430 453 496 525 539 558 585 602
206F02ok8l8l5j8LJ4RLQJ2kk8m2k8PM1N4L5ll2l9k8j0J1L1L9K7J2%j2k4j9PK0J3J2K8K9j4
$$ 602 596 568 530 495 477 480 494 503 506 514 526 524 496 454 426 433 474 528 563 560 528 489 461 451 462 493 532 559 571 571 559 535 516 523 543 556 568 596 625 611
201F11o3o3k7opJ3M9N2J5j6j9k7m8l7K1O0L1k7l8kK9L1J0k7o4o2mN4N3J1nJ5J8j1l1j9orj6
$$ 611 548 485 458 452 445 458 507 559 574 558 539 512 464 427 448 508 539 512 474 472 501 532 542 515 451 389 385 439 492 503 498 513 531 520 489 470 464 455 439
196D39j2ppoqk0j8J8N3L8rj7J7K4j8m3%N0L6j5k8JK1J1OJ2Oj4j3J1K0kk5k5j1OJ9J3l2p9p2
$$ 439 427 420 413 407 399 379 361 379 432 470 461 444 461 485 467 424 424 474 510 495 467 468 489 500 506 518 524 510 497 508 528 526 501 476 465 471 490 503 471 392 320
191C20qM6N0L9M8M7Kn1m3J4M0J0j6QM0J9l8o5l5J1L5L4K2PkJ2L5L0j5n8n5j5K0K5J4QJ3K7
$$ 320 312 358 408 447 495 542 544 493 450 464 504 514 498 506 546 565 527 462 427 438 473 507 529 536 534 546 581 611 596 538 483 468 488 513 527 535 548 575
187E75L5J5k7m9k4J9L3J0qjQQOQll0l9j7RJ2MJ0K2J9RJj7m6n5j8K6L1PJK3L0J0rj0j7m3n5
$$ 575 610 625 598 549 525 544 577 587 579 578 586 594 600 608 605 575 536 519 528 540 544 554 576 595 604 605 588 542 487 469 495 526 533 534 557 587 597 588 578 561 518 463
182D63l5OL2L2Nl2n1k8J7M3L9L2K4j0n9p4l3J7K8J9K5L8J9j9l3rJ3Pj1qK2M5K4l2o7l6L1O0
$$ 463 428 434 466 498 503 471 420 392 409 452 491 523 547 537 478 404 371 388 416 435 460 498 517 498 465 456 469 476 465 457 479 524 548 516 449 413 444 504
177E04K9pmRmk3j0J7Pl2m7k2NJ6K8M4M1K2J1Kl3p1m9K9P5L2l8n1j7pk8k6J3L8K2rl3m7m6q
$$ 504 533 526 522 531 527 504 494 511 518 486 439 417 422 438 466 510 551 573 584 586 553 482 433 462 537 569 531 480 463 456 428 402 415 453 475 466 433 386 340 332
172C32N4Q3N4Kk8l4l6k6lJ1lk1j2QJ1mlJ2J4%pKJ1J4K3L6K0j9l7oK8J6j4j2J9K3j0l1pK1J9
$$ 332 386 469 523 525 497 463 427 401 398 409 406 385 373 381 392 388 385 397 411 411 404 406 417 431 454 490 510 491 454 448 476 492 478 466 485 508 498 467 460 481 500
167E00lqJRJ8M2O0L5k5o1m5qOnnJ0J4lj9pK3L0Jl5m2k3kMlj2j6oJ4K1%k7j9K2N0K7j9l8k1
$$ 500 497 489 490 499 517 559 619 654 629 568 523 515 521 516 511 521 535 532 513 506 529 559 560 525 483 460 458 462 459 447 431 425 439 460 460 433 414 436 486 513 494 456 435
162D35PK7L6L2Lm5q0p1k5K7M5K1j7l7k5LL7N6M0j2m7j9M1M4k1n9kP7P5Ll0JK2j1m2l2rj5k3
$$ 435 442 469 505 537 540 495 415 344 319 346 391 412 395 358 333 336 373 429 469 457 410 391 432 476 455 396 394 471 546 549 519 520 542 531 489 457 448 433 410
157D10pJ4J4J8N1O6K4l0k7J9K3l3p3l7L0N7K8qj8j0j1k5k4OM3M1Nj7nKj8k1L1Q8O8j3o3m1
$$ 410 403 417 431 449 500 566 590 560 533 552 575 542 469 432 462 519 547 539 521 511 500 475 451 457 500 541 546 529 524 526 508 487 518 606 674 661 598 557
152E57rj3l2k4oMJ0K3J8j1k4KJ2l8q6n5L6P5K4m1l7RK9PqJ6N1M8Rk6k4RL3K9J0oj3j8j4j0
$$ 557 548 535 503 479 473 477 487 510 528 517 493 495 507 469 383 328 364 439 463 422 385 394 423 430 422 438 489 537 546 520 496 505 538 567 577 571 558 540 526 516
147E16j4k3j7J2L3K2JOK4J9j2l6l1rJ2K6J8k1n8n3j1J4%j3NK8K5RJ5M2N0L0Lj1j4k1l4m5m0
$$ 516 502 479 462 474 507 529 530 536 560 579 567 531 500 491 503 529 547 526 468 415 404 418 418 405 410 438 463 472 487 529 579 609 612 601 587 566 532 487 447
143D47oK7K7kpL3O5M0j9m2j4J8K1J0mj9l4l2k0j8j8J0N4N5no6p2l5JK0L1L3K1J1J1Jk7m5k7
$$ 447 441 468 495 493 486 519 584 624 605 563 549 567 588 598 594 575 541 509 489 471 453 463 517 572 567 501 429 394 395 415 446 479 500 511 522 523 496 451 424
138D24nmoK6O0M0j6l3MK9kl9k5J8K8kl4m0k1OK7K6PJJ3J4j0k5kK6Lm7n9j9J4J0qnKOJ5K7K2
$$ 424 419 415 409 435 495 535 519 486 490 519 517 478 453 471 499 497 463 423 402 408 435 461 468 469 482 496 486 461 459 485 488 441 382 363 377 387 379 374 376 382 397 424 446
133D46kLN0P5L0m8o9k8J1J1kLR%j1j1j3j7j0J5K6lm4n8l4KK5K6J1%J0L5K9j8n3k2M2O0J2l4
$$ 446 444 447 497 572 602 554 485 457 468 479 477 480 489 489 478 467 454 437 427 442 468 465 421 363 329 331 356 382 393 393 403 438 467 449 396 374 416 476 488 454
128D54k6OJ5jqmoj1KK7L6K6J4Qqk3j5J0J4j3l1pK9L2QKJ1%l4m4pL9L6j1m0k2J7L7J7k5n9o3
$$ 454 428 434 449 448 440 436 430 419 421 448 484 510 524 532 524 501 486 496 510 497 466 459 488 520 528 530 541 541 507 463 456 495 531 520 480 458 475 512 529 504 445 382
123C82l0J3L6L2K0J5Rnk1k3mK4M4L7Ml5m8k4J4L1J6rj9j6pjjpk2k5KM6O0K3k9k7K4N5J9l4
$$ 382 352 365 401 433 453 468 477 472 451 428 424 448 492 529 533 498 450 426 440 471 487 478 459 443 436 435 434 427 405 380 382 428 488 511 482 455 479 534 553 519
118E19l4J2L1ll7k3J0Ok6l8rK8M1L2J1orJ0L2K8lk9l4l6m8n5m3j6QK8L3J6j7k3J5N6N0Jl9
$$ 519 485 497 528 525 488 465 475 481 455 417 408 436 477 509 520 514 505 515 547 575 572 543 509 473 425 370 327 311 319 347 380 396 379 356 371 427 477 478 439
113D39l4pJ4K3K1Pj5j7J2M8N0J3l2m8l3nK0M0N1L2j5o2n8j1K6J4j1KL7L3j6n0k7RNk1j7J7
$$ 439 405 398 412 435 456 463 448 431 443 491 541 554 522 474 441 436 456 496 547 579 564 502 444 433 459 473 462 464 501 534 518 468 441 450 455 434 417 434
108D34K6Kj6OL7M3K8K0J3rl3l0oOok3l0l9n3n4k8LJ5J7L2M4J9l4n2oN6O6K8lj1k3m9n2j3K8
$$ 434 460 462 446 452 489 532 560 580 593 584 551 521 515 521 515 492 462 423 370 316 288 291 306 323 355 399 418 384 332 326 382 448 476 473 462 439 390 338 325 353
103C53L0J1OJ9K1Orj7k5k0J3M1K2k9m6nM1M2J1kJ3K9K2rn0o8l8J8M0J0k3pL5M2Mk9k6j3j2
$$ 353 383 394 400 419 440 446 437 420 395 375 388 429 451 422 376 371 412 454 465 463 476 505 527 518 468 400 362 380 420 430 407 400 435 477 481 452 426 413 401
99D01oJ4K2nm6n8l4KK9M2M1L1K2J8J6Omoqk1l3l0j0NLorNK6L7J7k3l9pL9M5Rj8qJ2Qj0j0R
$$ 401 395 409 431 426 380 322 288 290 319 361 402 433 455 473 489 495 491 485 477 456 423 393 383 388 391 385 376 381 407 444 461 438 399 392 431 476 485 467 459 471 479 469 459 468
93D68J9J1JKPKpqNK1K2ll9n3l9k3k5k6PN7O5J5m5n3j4J7K2K2L5M2K5lj7j8k1l1l3j1K2L4J0
$$ 468 487 498 499 501 508 510 503 495 500 521 543 540 501 448 409 386 361 335 342 399 464 479 434 381 367 384 406 428 463 505 530 527 510 492 471 440 407 396 418 452 462
88D62l0m3j5K6L6Qk6l2%M7O7L5k4n3k1L9P1N1Qk6m4m6k8%J8K2K8L2J1l4n3k3J8J7j2k9k5k9
$$ 462 432 389 374 400 436 444 418 386 386 433 500 535 511 458 437 476 547 598 606 580 536 490 462 462 480 502 530 562 573 539 486 463 481 498 486 457 432 403
84D03l6j0L1L1j5l8NN5M6mk0OK5J2KJ2J1k1n2m8k1j1k3l3k9j2J4M2N1L1KrLNrj7pJ2L0M3M8
$$ 403 367 357 388 419 404 366 371 426 472 468 448 454 479 491 493 505 516 495 443 395 374 363 340 307 278 266 280 322 373 404 406 397 400 405 396 379 372 384 414 457 505
79E05K6j7m7l8rlj6j4J1K1jj8MM0M4K0RJ8J8mj6MK6J7j7m1m4l1qJ6K0ol4l4j2OJ0J5J8Lj7
$$ 505 531 514 467 429 420 417 401 387 398 419 418 400 404 444 488 508 517 535 553 549 533 537 563 580 563 522 478 447 439 455 475 469 435 401 389 395 405 420 438 441 424
74D24oL9O5L8j2k6jJ8Mj8j2QJ4mk5l8m6n0m3j6K0L6J9j5l6k4RM0N2M4L4K0Kj6k0MK8J7l4p3
$$ 424 418 457 522 560 548 522 521 539 543 525 513 521 535 531 506 468 422 372 329 313 333 369 388 373 337 313 322 362 414 458 492 512 514 498 478 482 510 527 493 420
69D20m9J9O7N7K0j1l1l9k6J5M2K0l1n1k6RJ4NQJ8K0Mj8m1n6m3kL6L8J4RL5M6J3l8n7k6K0L2
$$ 420 371 390 457 514 534 523 492 453 427 442 484 504 473 422 396 405 419 424 432 450 470 474 456 415 359 316 314 350 388 402 411 446 492 505 467 410 384 404 436
64D36J1j5j3J0K0ll4l2OL8L0%j2%Ppk0qJ4K3J5LJLOMnj8l1l1k2pJ8M6N1J7k8m1j6%j6l2j3
$$ 436 447 432 419 429 449 446 412 380 386 424 454 454 442 442 449 442 422 414 428 451 466 469 470 473 479 483 478 460 429 398 376 369 387 433 484 501 473 432 416 416 400 368 355
59C55K0K7J1J1K4J9mkK9L6j4o9o4j5Qj2j8J2L8K4jKJ8J0j5k5j9j4JL5N6K5k7l0J5K9k1o2l7
$$ 355 375 402 413 424 448 467 463 461 490 526 512 443 379 364 372 360 342 354 392 416 415 417 435 445 430 405 386 372 373 408 464 489 462 432 447 476 455 393 356
54C56jj8m8pP2P5qo6k9K4Mm1j8N7R2N7J3lj5l4l2pjk6l7j1J4PJL0N9L8j4m0k2PL3N3M4k2j04
$$ 356 355 337 289 282 354 429 421 355 326 350 354 313 295 352 444 501 514 511 496 462 430 423 422 396 359 348 362 369 370 400 459 497 483 443 421 428 461 514 558 536 432
49D32j16k9P1J02O5K0oj8k2j4pqoJ1J9nm0m1rJ6J4NJ5K3J7OJ6K8J9j8n1n8l1J8N6N2Qm3p1
$$ 432 316 287 358 460 525 545 539 521 499 485 478 470 464 475 494 489 449 408 399 415 429 434 449 472 489 495 511 539 558 540 489 431 400 418 474 526 534 491 420
44D20o7m3MN5P5M0j3l0j2%kLK5K5j0l7j9J0Ml5n4k5J7L3K5J6K3K7Nl4n5k1L6M8qn7l2M7R3
$$ 420 353 310 314 369 444 484 471 441 429 429 427 430 455 480 470 433 414 424 428 393 339 314 331 364 389 405 428 455 460 426 371 350 386 434 426 369 337 384 477
39D77O1jk7pK3K7QqNL2K8k4p4o4j6Lj2rK8L7rm2pM9M5%j3J0Km5o1j4L2K6JMJ2j1l9k1J8K1
$$ 477 538 537 510 503 526 553 561 553 558 590 618 594 520 456 440 443 431 422 450 487 478 436 429 478 523 523 510 520 522 477 416 402 434 460 461 465 477 466 427 406 424 445
34D45j3k1J8M9K8j6l1j3ONoj5k3k2qJ4K4J3nj5j6j2JK6M5K6k0m9l1NJ4jkK5M0J8j6k7k0j8
$$ 445 432 411 429 478 506 490 459 446 452 457 451 436 413 391 383 397 421 434 429 414 398 386 387 413 458 484 464 415 384 389 403 402 400 425 465 483 467 440 420 402
29D02j6KL0L9K0ok1k4j2J3L2K3jqQJ3j2l7k7PK8K6K5L4L4Ql0n2m6j8RK0Mk0k7pK2L0J2nML2
$$ 402 386 388 418 457 477 471 450 426 414 427 459 482 481 473 481 494 482 445 418 425 453 479 504 538 572 580 550 498 452 434 443 463 467 447 420 413 435 465 477 472 476 508
24E08N0M0J0j9l3l0j4J0K9L2J9%rook2n1n9k6J9K5j2m1k7Mml9m1J2O7P0K8j3k6j7lJ0J3Kr
$$ 508 558 598 608 589 556 526 512 522 551 583 602 602 593 587 581 559 508 449 423 442 467 455 414 387 391 387 348 307 319 386 456 484 471 445 428 425 435 448 450 441
19D41j1nkloroPK1K4J3pk9m6l9%L9L6nk5ML6K6j2k7lK7M9O3N6J5l6m8k2pk5m8l9j1QJ3Prk4
$$ 441 430 425 423 420 414 405 399 406 427 451 464 457 428 382 343 343 382 418 413 388 392 428 454 442 415 412 439 488 551 607 622 586 538 516 509 484 436 397 386 394 407 414 405 381
14C81j6PJ2j5k9mK7J7k0l9k4%J9L2L1J0j2j5rj0lL2O0M0qk4lJk6l2ML1Nk8j5K0K2lj0KNLK4
$$ 381 365 372 384 369 340 336 363 380 360 321 297 297 316 348 379 389 377 362 353 343 340 372 432 472 464 440 437 438 412 380 384 415 420 392 377 397 419 416 406 408 413 416 440
9D40M6L1j0k2NJ7j4m5l4MK0Rj0k7k9mK9L6Oj3J2M1K7j5l0PN5O8L4k2o8p2m5k5l1k9J2N3L9
$$ 440 486 517 507 485 490 507 493 448 414 418 438 447 437 410 381 377 406 442 448 435 447 488 515 500 470 477 532 600 634 612 544 472 427 402 371 342 354 407 446
4D46j6l3NL9K1j2nK4K3j2k7LL7L6Kl1m0l4k5j5rj9l6k7K8Q4P1nn5j9M5M6j1m1j2J1oj4J7L2
$$ 446 430 397 402 441 462 450 445 469 492 480 453 456 493 529 531 500 460 426 401 386 377 358 322 295 323 407 478 473 418 399 444 490 479 438 426 437 431 417 434 466
-1D66j6o7l3N7Q6K1n4n5lL2K5LnLJ3Pj3k8k1mqk8k9pRLnOJ8J8J5K0J9Npnnj5k4qJ8K8J5j0
$$ 466 450 383 350 407 493 514 460 405 402 434 459 462 457 460 473 480 467 439 418 414 406 378 349 342 351 354 349 355 373 391 406 426 445 450 443 438 433 418 394 386 404 432 447 437
-6D37k7k5lK8M0L0J3Mrl2l9k0Jjj1oRRMJ2J8kk6j3K6K8k1o6m4J7N5M8K6Oj7m6n5k5K3M4K3
$$ 437 410 385 382 410 450 480 493 497 488 456 417 397 398 397 386 380 389 398 402 414 432 430 404 391 417 445 424 358 314 331 386 434 460 466 449 403 348 323 346 390 413
-11D13rj5J6N0N2J8j8k7j5pj2j2KJ7J4QJ7L1J4l2n8l1J1J8oj1Lrm9n9rN0O3L9K5K2Nj0JJ5
$$ 413 404 389 405 455 507 525 507 480 465 458 446 434 436 453 467 475 492 523 537 505 447 416 427 445 439 428 431 422 373 314 305 355 418 457 482 504 509 499 500 515
-16E15j0n6n3J1O0L9j9m9l9k7l1l2j3J8L6K6JrQK7J6rNN9Q8M1m2p7m2lj9o6p4k2L8M9J6j1
$$ 515 505 449 396 407 467 506 487 438 399 372 341 309 296 314 350 376 377 368 376 403 419 410 415 474 562 603 561 484 442 439 420 354 280 258 296 345 361 350
-21C50%J3Jj8rK2L6Rl0m0pM0O4L7k1n9n2k2%J0K2K9K0RJ1Ok4m4pM9L6m0q2l8K7L8J5J9M2M9
$$ 350 350 363 364 346 337 359 395 404 374 334 327 367 431 468 447 388 336 314 314 324 346 375 395 404 415 421 397 353 346 395 431 391 309 271 298 336 351 370 412 461
-26D61L2J8J1jj7k9n1o6l6L1O3K1k6qM0L8nk0jml5m2j6NQK4N1M0nj7K1L8on2l4J4K3j2m0l8
$$ 461 493 511 522 521 504 475 424 358 322 353 416 437 411 403 443 481 476 456 455 451 416 374 358 363 371 395 446 486 481 464 485 523 517 465 431 445 468 456 416 378
-31C78j7RK7J5j9l4rJ5RoLJ6nl8l0J8M9L8RlLJ1J3nl1l5mK8K6ORK2J4k0l7k2pj2j0J9N7O1
$$ 378 361 370 397 412 393 359 350 365 374 368 371 387 382 344 314 332 381 419 428 425 428 439 452 447 416 381 377 405 431 437 446 468 482 462 425 403 396 384 374 393 450 511
-36E11K6j3j9JJ7Kk6l7k4rj0j8k5k4rK3N0K9k7n6k5K0L0J6J0on2q3m5L1N9K4j6j1K2N3O8M7
$$ 511 537 524 505 506 523 525 499 462 438 429 419 401 376 352 343 366 416 445 418 362 337 357 387 403 413 407 355 272 227 258 317 341 325 314 336 389 457 504
-40E04j9q2p4j3K5Oj0OJ4j4k8RN1M0LpPMj2j7j8l3l7jL8L4KoMj0l9k3L8O8M2J1K0L5J9rj6
$$ 504 485 403 329 316 341 347 337 343 357 343 315 324 375 415 418 411 418 422 410 393 375 342 305 304 342 376 378 372 376 366 327 304 342 410 452 463 483 518 537 528 512
-45E12j7k4j5J8L4mn3n5k1%%J1L0K2pj1J6K7Kj8%J4j3n4m9j0J0j%K6L7Nl5m0j9rj1KL0M4K8
$$ 512 495 471 456 474 508 504 451 396 375 375 375 386 416 438 431 420 436 463 465 447 447 461 448 394 345 335 345 344 344 370 407 412 377 337 318 309 298 300 330 374 402
-50D02jk2l1l0j1J6K7J5mj4j8k8l2j4K0N0O4N0J3k5l2%L1J9k2m4k6PK0J7J2RKJJ6L6L1Jk5
$$ 402 401 379 348 318 307 323 350 365 361 347 329 301 269 255 275 325 389 439 452 427 395 395 426 445 423 379 353 360 380 397 409 418 420 421 437 473 504 505 480
-55D80k6j3j7k9k4%J0pk4j1J4J9RK0M3L3j8n4l0K0K5j4m1k1J5L2L6L4J7j4k7j2Mj4m1l8nJ4
$$ 480 454 441 424 395 371 371 381 374 350 339 353 372 381 401 444 477 459 405 375 395 420 406 365 344 359 391 427 461 478 464 437 425 429 415 374 336 331 345
-60C45QKJ4K2J0%J5L9L3jk4j4PQj2l5l8k3JJ7J0rj9j5mMK2M2M6J7j6k1j2j4k2jM1N1Om4m8
$$ 345 353 355 369 391 401 401 416 455 488 487 463 449 456 464 452 417 379 356 357 374 384 375 356 341 337 341 363 405 451 468 452 431 419 405 383 382 423 474 480 436 388
-65C88j1J3J1Mjj0j9pK1K9jl9n0l0kJ5K3K3J6J1J8K9J9j8n7n9k2J5J4j0oK9M7J4l9o2m5k0
$$ 388 377 390 401 405 404 394 375 368 389 418 417 378 328 298 296 311 334 357 373 384 402 431 450 432 375 316 294 309 323 313 307 336 383 397 358 296 251 231
-70B31q%J5L4M6M4K8J0J0K8L7J7j2j7kMj3l3l7k3%J9J7j2l5j7K5M9M2L1J4k3o0m4J2L1j9o1
$$ 231 223 223 238 272 318 362 390 400 410 438 475 492 480 463 461 465 452 419 382 359 359 378 395 383 348 331 356 405 447 478 492 469 409 365 377 408 389 328
-74C28l2K6L1jpJ6J0l0m2pJ6jj7J0M9M4Lk2j4JMJmj3j2QL7M7K4k1n5n7k6J5L6L2K6L0K6ll8
$$ 328 296 322 353 352 345 361 371 341 299 292 308 307 290 300 349 393 396 374 360 361 365 366 362 349 337 345 382 429 453 432 377 320 294 309 345 377 403 433 459 456 418
-79D18m6k7pMQJ1Omm%nj7oK5L1kl2j3L1L1j5l2J3N4K5m1n5mM4L9Qj3l1m9m3JL5J9k7m3j6K4
$$ 418 372 345 338 342 350 361 367 363 359 359 354 337 331 356 387 385 353 340 371 402 387 355 368 422 447 406 351 347 391 430 438 425 394 345 302 303 338 357 330 287 271 295
-84B95M7M9K5j8n5o1l8JM4P5O0Oj9J5M5qr8j05rP1N7NqNj0m0m1j2J7M5Q2R2L9l7o1l1j0j9
$$ 295 342 391 416 398 343 282 244 245 289 364 424 430 411 426 471 463 365 260 251 322 379 384 376 381 371 331 290 278 295 340 422 514 553 516 455 424 414 395
-89C95j9PK0nl0j3K8M6K9ll4m5l0OK5J2rqJ7L3J8j8m4l7lK8L5K8K1J3oj9j2JkrKJ4jl2k9J3
$$ 395 376 383 403 398 368 355 383 429 458 455 421 376 346 352 377 389 380 372 389 422 440 422 378 341 338 366 401 429 450 463 457 438 426 427 425 416 418 432 431 399 370 383
-94C83M0K7ONJk9n3l3J0L4L6L7L3Ll7n3m3k2LL7N6L9Kj0OJ1j2m1n0l8k1nNN%K%k0m4l5QN2
$$ 383 423 450 456 461 462 433 380 347 357 391 427 464 497 500 463 410 367 345 348 385 441 480 482 472 478 489 477 436 386 348 327 322 327 332 332 334 334 314 270 235 243 295
-99B95O0L3ql8m2j2L1M4J4j7rK9N0L3Nqj1k2l7k0L8R0P2rp0n6kJ4j6l6j5J5J7qk6j8QK6J5
$$ 295 355 388 380 342 300 288 319 363 377 360 351 380 430 463 468 460 449 427 390 370 408 498 570 561 491 435 433 447 431 395 380 395 412 404 378 360 368 394 409
-104D09k0l8j9K0L6K8K5K1om1m2nJ8J1J5M3M6%m7m8l1l5k9J8N9L1l6n1KM1K5LJ2K1OoJ6L7
$$ 409 389 351 332 352 388 416 441 462 456 415 373 368 386 397 412 455 501 501 454 406 375 340 311 329 388 419 383 332 334 375 400 403 415 436 442 436 452 489
-109D89J2l3m3j2J5Pj1j1OJ2ql2k5J2L4Rk6nO2R7N1k6n8l6j1j2k7l0j7JROMKj0l9o1l9K6Q0
$$ 489 501 468 425 413 428 435 424 413 419 431 423 391 366 378 412 421 395 390 452 549 600 574 516 480 469 457 430 400 383 384 393 399 403 405 395 356 295 256 282 362
-114C62P7L0k0m2l4j2MJJJ7K7qn6n2OM6L5K8P2R7L7o9j11p3k9k0j9mOJ3M1P4N5j1m8j3L4K6
$$ 362 439 469 449 407 373 361 365 366 367 384 411 403 347 295 301 347 382 410 482 579 616 547 436 363 334 314 295 291 297 310 351 425 480 469 421 408 442 468
-118D68j5k2J0K2qm2m0qJ5Qj0j7lJ1Kk0l0k0j1mJ0K9L1K2K1K1kl3k7J4K6j7n8l8J1K4Jqjm
$$ 468 453 431 441 463 455 413 373 365 380 388 378 361 358 369 371 351 321 301 290 286 296 325 356 378 399 420 418 385 358 372 398 381 323 285 296 320 321 313 312 308
-123C08j6oJ6J1j0mL7N5K7JPJ4k2o5o1oL8L3%j8j4kNJj5k9k2J0M2M1%m2m4j3J7K8M2O8P2K5
$$ 308 292 286 302 313 303 299 336 391 418 419 426 440 418 353 292 286 324 357 357 339 325 323 328 329 314 285 263 273 315 356 356 314 270 257 274 302 344 412 484 509
-128E09m4q2p5n1k0J8M6L6MjK9M7J9j7j4RRj8k7lK3K5J2nj3oJ3K3Kl4m8l4j9j2QM4N5K1j9
$$ 509 465 383 308 257 237 255 301 337 341 340 369 416 435 418 404 413 422 404 377 374 397 422 434 429 416 410 423 446 448 414 366 332 313 301 309 353 408 429 410
-133D10j2J8J5k7m3lM2L6kk2j8k0l0j4K9N5L3pk4j6oNJ2Kk6m0j5J6Ok5k8JOk9m5PP8Q3J4m2
$$ 410 398 416 431 404 361 358 400 436 434 412 394 374 344 330 359 414 447 440 416 400 394 399 411 413 387 347 332 348 354 329 301 302 308 279 234 241 319 402 416 374
-138C74l1J0K0krQJ2j5l7j9J7K5KnJ2J8j0l2j5J4J0k4l7j0K7M1L5K2Kj4j0J6M2N0L6Km0o3
$$ 374 343 353 373 371 362 370 382 367 330 311 328 353 355 350 362 380 370 338 323 337 347 323 286 276 303 344 379 401 403 389 379 395 437 487 523 525 485 422
-142D22m6qJ7K0K2K1Mj7qK5L1j0m5m0k5l1l2kK6Pl5m0j3MNK2N1M7Jl6l6j7pJP%j1QN2O7L3
$$ 422 376 368 385 405 427 448 452 435 427 452 483 473 428 388 363 332 300 298 324 331 296 256 243 247 252 274 325 372 373 337 301 284 277 278 285 285 274 282 334 401 434
-147D34j5m1n3n2j9L6N5J1l4j5M2N4Ql5m0k8j9LL2L4j0n3m8jM8O7N8K5k0m7l6lK2K7K6K2J0
$$ 434 419 378 325 273 254 290 345 356 322 307 349 403 411 376 336 308 289 292 324 358 348 295 247 246 294 361 419 444 424 377 341 338 360 387 413 435 445
-152D45j7l9l7oL2N2M6J8j3l2m0m9n3l5J3N5M5j4n5l4J4K2j3l0jL8L4J1J5M7N0op3p7j2M8
$$ 445 428 389 352 346 378 430 476 494 481 449 409 360 307 272 285 340 385 371 316 282 296 318 305 275 274 312 346 357 372 419 469 463 390 313 301 349
-156C49M4LqK5M0j1q1q3k4K1RrJ1L7K0j2lM3O2K7k1l6k8k7l4k4RM1M0RqK2O5N9mn5m1KJ0j7
$$ 349 393 396 388 413 453 442 361 278 254 275 284 275 286 323 343 331 328 371 433 460 439 403 375 348 314 290 299 340 380 389 381 403 468 527 523 468 427 429 439 422
-161D22k2kPjool2o7m9J6N4L1LJ8M0Rm7o5l6qjlrj7MN4P5K7l7l8OJ2k8l8J4N7M6K7M3N7Ro1
$$ 422 400 398 405 404 398 392 360 293 244 260 314 345 348 366 406 415 368 303 267 259 258 255 246 229 233 287 362 389 352 314 320 332 304 266 280 337 383 410 453 510 519 458
-166D58p4l1QRNJ7K1%k4k5j2orj1mQJ7K4L6M0J8k8n4k9J8K7qk4NK7mm9m0J4M5L5L1M3K6k5
$$ 458 384 353 361 370 375 392 413 413 389 364 352 346 337 326 322 330 347 371 407 447 465 437 383 354 372 399 391 367 372 399 395 346 306 320 365 400 431 474 500 475
-171D75m7mM4K7k7l3J7M5J4l2l6rMnj0mqj7j0J1J0k4n6l7QK3jj2K1N4L1k6n3l2lMRK7L5J3
$$ 475 428 424 468 495 468 435 452 497 511 479 443 434 438 433 423 419 411 394 384 395 405 381 325 288 296 319 318 306 327 381 412 386 333 301 298 302 311 338 373 386
-176C86j0kK3K0j8n3m9j1L1N1L4nl0k1LQj0k1j4kjJ0L4M4J7j5j1J8K2j0k9rJ8J4JOJ6Jk8k3
$$ 386 376 374 397 417 399 346 297 286 317 368 402 397 367 346 349 357 347 326 312 310 309 319 353 397 414 399 388 406 428 418 389 380 398 412 413 419 435 436 408 385
-181C85J6L6J0k3k5pKKLnk1j6J9L7Ml6k1K3K0l8p6m9oLMK8M2Mn2n3OO7Q7P0L7Jj6j1qk5l3
$$ 385 401 437 447 424 399 392 394 396 399 394 373 357 376 413 417 381 360 383 403 365 289 240 234 237 241 269 311 315 263 210 216 283 370 440 477 478 462 451 443 418 385
-186C85j1J3om9m8RO4O6L0kj9j8ML9M5J3k5l7k7j8jL2N5M1nm0m1j8OJ2Jq%Rpm2n5k5J6L4K5
$$ 385 374 387 381 332 284 293 357 423 453 451 432 414 418 457 502 515 490 453 426 408 407 439 494 535 530 490 449 431 437 449 450 442 442 451 444 402 347 322 338 372 397
-191C97Lk8n7m5J0N8M4j2m8l8j0J3K9L2Ol4m3pL5M4K5J0QJ0%j3j8j4j0k4l8k0L3O9M1k3m8
$$ 397 400 372 315 270 280 338 382 370 322 284 274 287 316 348 354 320 277 270 305 349 374 384 392 402 402 389 371 357 347 323 285 265 298 367 408 385 337
-195C37j4K2J8klkk1l6j2K7K2k3m3nM3M2RjJ2J1j4k3PL7L1lk0j5oqj4k4l3k0K4O2M3j4m6j5
$$ 337 323 345 363 361 358 356 335 299 287 314 336 313 270 265 308 350 359 358 370 381 367 344 351 388 419 416 396 381 375 367 353 329 296 276 300 362 405 391 345 330
-200C30K9L3J0%%j2l0k6omj8j6J0L0K2jk5l9l2OM9N8L1RJ3J6pl7l7j3J1K3L1L8L9K4Jk8m8
$$ 330 359 392 402 402 402 390 360 334 328 324 306 290 300 330 352 351 326 287 255 261 310 368 399 408 421 437 430 393 356 343 354 377 408 446 485 509 510 482 434
-205D34n3l7rJ9K9Km0n4k0K1K0j2k6rMnnK0M2L2J5J8J7ok6rK9L7Kl3m2k7pMMnj3j0nKK1M6
$$ 434 381 344 335 354 383 385 345 291 271 292 312 300 274 265 269 264 259 279 321 353 368 386 403 397 371 362 391 428 430 397 355 328 321 325 329 324 311 301 296 298 319 365
-210C65M0mm8m6j5nk2k1K1O6O1On3o3k4J7K2KjJ5J7JlJ9K9Oj5JK2Ml0k4J7L5J6poOJ7L0L1
$$ 365 405 401 353 307 292 287 265 244 265 331 392 398 345 282 258 275 297 299 298 313 330 331 328 347 376 382 367 368 390 394 364 340 357 392 408 401 395 401 418 448 479
-215D79%l8l7njl8o1l3J6L2J3j3k4j2J7L2J1k5l9k8j9mL7P8O0ml1J0M5J0n1o3l6k4k7mM2O2
$$ 479 479 441 404 399 398 360 299 266 282 314 327 314 290 278 295 327 338 313 274 246 227 223 260 338 398 394 363 373 418 428 377 314 278 254 227 223 265 327
-220C27L2j4k8jM8P2M1j9m0j1J6%j4J3M9L6j1l7m1m7m4rK7J8j0mK6K1k0k7J0L1J1mJ5K0k1
$$ 327 359 345 317 316 364 436 477 458 418 407 423 423 409 422 471 507 496 459 418 371 327 318 345 363 353 349 375 396 376 349 359 390 401 397 412 432 411
-224D11n3k5K5K0l8q1o3jN7O9L7J%J3om9n6qL9L2kpJ1K0J8K2K2Pj4j7j1j5j7q%%J6N1O0J4
$$ 411 358 333 358 378 340 259 196 195 252 321 358 359 359 372 366 317 261 253 292 324 322 315 326 346 364 386 408 415 401 384 373 358 341 333 333 333 349 400 460 474
-229D74l1qN0M9k3q0o3j2J4ROkk2l1MN3N9Qm8m6RM8J8n4q0j9O5Q4K6l3l3JK5K8K8K9K1Pkj1
$$ 474 443 435 485 534 511 431 368 356 370 379 385 383 361 330 334 387 446 454 406 360 369 417 435 381 301 282 347 431 457 424 391 392 417 445 473 502 523 530 528 517
-234E17k3k8j6%MkMK0J8ql0j2K1K5j5n7n1mK9J9j1k0pJoj0kOOQJ3J3P%oj7l3m0k7lK0L0J5
$$ 517 494 466 450 450 454 452 456 476 494 486 456 444 465 490 475 418 367 363 392 411 400 380 373 374 368 358 356 362 368 376 389 402 409 409 403 386 353 313 286 283 303 333 348
-239C48j4k9jN0P0M2J3J1J1k3o1n3j0J4OJJ0Lk7l2NL6K4J0L9O9L9l0n2j0J6j7m9j9L0K5l0
$$ 348 334 305 304 354 424 466 479 490 501 478 417 364 354 368 374 375 385 388 361 329 334 370 394 404 443 512 551 521 469 459 475 458 409 390 420 445 415
-244D15n8l7j1njJ7J6oqL8Q1O4Mk6LL4J2m4o4l1J4K0j3m1l8k3k1k0jK2K1lpK3M8L6kk7k8j8
$$ 415 357 320 309 304 303 320 336 330 322 360 441 505 509 483 486 520 532 488 424 393 407 427 414 373 335 312 291 271 270 292 313 310 303 326 374 410 408 381 353 335
-249C35kK0K9Pk7l1nJ1kj6rOPLJ0J6J3J3K9M3K1k9o3n5k2KRJ0J6J7QlJK3M6M1Nk9l1kJ7j0
$$ 335 333 353 382 389 362 331 326 337 335 319 310 316 323 326 336 352 365 378 407 450 471 442 379 324 302 304 313 323 339 356 364 361 362 385 431 472 477 448 417 415 432 422
-254D22n9p7m3OL1L4M1M3J1l0l2J4M3J2l0k2Rpo5q6l8J7J7oKM0O0M0Lk0j3K6N9M2k3p5n9J
$$ 422 363 286 243 249 280 314 355 398 409 379 347 361 404 416 386 364 373 366 301 215 177 194 211 205 207 247 307 347 350 330 317 343 402 444 421 346 287 288
-259B88L6K6LoOK9M8L7%j1K9N7Mr1j15m3K9L0JQK5%m7m9mK5Qk1k7j4OL2M9L3j0l5j9J6L9M3
$$ 288 324 350 353 347 353 382 430 467 467 456 485 542 546 455 340 297 326 356 357 365 390 390 343 294 290 315 323 302 275 261 267 299 348 381 371 336 317 333 372 415
-264D15L2J0j5k5j1Lkk1l6l6k1OL4M3K4rm1n9n9l5LL0L2K9L5L8K5J1J4K5J8nj8j6k7n4n8j6
$$ 415 447 457 442 417 406 409 407 386 350 314 293 299 333 376 400 391 350 291 232 197 200 230 262 291 326 364 389 400 414 439 457 452 434 418 391 337 279 263
-268B63L2L4mk8j5QJ0PK0L4J6k2m0j6K8N8O4M4Nl7n2l2%J7J8J2Omj0mlj8l9m3k1PK7L2J9o
$$ 263 295 329 325 297 282 290 300 307 327 361 377 355 315 299 327 385 449 493 498 461 409 377 377 394 412 424 430 426 416 412 409 391 352 309 288 295 322 354 373 367
-273C67j0K5N8L7k6o0l6jlj9j0J2J0qjK7M4K8Kj3j9pJ6K7jm0m5j0J6J5J1J4km4o3l1J3K4J0
$$ 367 357 382 440 477 451 391 355 354 351 332 322 334 344 336 335 362 406 434 436 423 404 397 413 440 439 399 354 344 360 375 386 400 398 354 291 260 273 297 307
-278C07Jj0l5n0k3K1L6K0J5L0K6j2m1l3lJ7K1J9J0nqJ2L7L0pl6k1K3M2J3k7l0pLnRM5M6qn3
$$ 307 308 298 263 213 190 211 247 267 282 312 338 326 285 252 249 266 287 306 316 311 303 315 352 382 375 339 318 341 383 396 369 339 332 335 330 339 384 430 422 369
-283C69k7L1M3Oj5LJ4j0l4k3J4L9K7j8o5n9PM9No7m6M9R0K9k5KK9k8r8o6K9N5rm1J7Q4O9k
$$ 369 342 373 416 422 407 410 424 414 380 357 371 410 437 419 354 295 302 351 356 289 243 292 382 411 386 388 417 389 291 225 254 309 300 259 276 360 429 427
-287D27m8l7KL0K3j6n0m7j8pj4oJ6K3jk2j3J8M3M3Rl7m7pL7L3J0J5J9k9r8q6PO4L1j5JL5J7
$$ 427 379 342 344 374 397 381 331 284 266 259 245 239 255 278 277 255 242 260 303 346 355 318 271 264 301 334 344 359 378 349 251 165 172 236 267 252 253 288 305
-292C05j8oK6J6k4k4J4L1Mj0J3M3M7L1Km2o5l6J5K1k0l7JM0L1L%Pj4m2k1L4N0Kn0m0J1K7j1
$$ 305 287 281 307 323 299 275 289 320 324 314 327 370 417 448 450 408 343 307 322 343 323 286 287 327 358 361 361 368 354 312 291 325 375 377 327 287 298 325 314
-297C14m5k8K1N2N3L9Om9q9o2J5O3M5J4K0L6J3k9l1PL4K8J8J6ll5l3J8O0L9k8o9n4j0J6J4
$$ 314 269 241 262 314 367 406 412 363 274 212 227 290 335 349 369 405 418 389 358 365 399 427 445 461 458 423 390 408 468 507 479 410 356 346 362 376
-301C76PJ6K9J9j5l7k9j3j8k6nL0L0kj6NK2%l4n0m7l2lK5K1j2j8J7M0On0n6j5K1K7K8L4L4
$$ 376 383 399 428 447 432 395 366 353 335 309 304 334 364 362 346 351 373 373 339 289 242 210 207 232 253 241 223 240 280 286 236 180 165 186 213 241 275 309
-306C09K1QKqj9j8r%J4M1N4L1j1k5oMk0m5l8oJ3Qj0k3k7j7%J7K4J6jj0QM7N8J8l7m4%L4J4
$$ 309 330 338 340 332 313 295 286 286 300 341 395 426 415 390 384 388 368 323 285 279 292 300 290 267 240 223 223 240 264 280 279 269 277 324 382 400 363 319 319 353 367
-311C67l5n2k4J6L0J8JonnkJ1K5J2k1m1j6K3K6nj5J1L0Ol1j9L6O7L3l3o6m8j4%oj1JJ3J4N
$$ 367 332 280 256 272 302 320 321 315 310 305 303 314 339 351 330 289 273 296 322 317 302 313 343 349 318 299 335 402 435 402 336 288 274 274 268 257 258 271 285 290
-316B90oj9l3l6j9MJ6K2L0L7K9J3J0K7M4M6L2Jl5n6l6MK5Rj3j0OPj0k1j2RK2Ml7o2l8J0L1
$$ 290 284 265 232 196 177 181 197 219 249 286 315 328 338 365 409 455 487 488 453 397 361 365 390 399 386 376 382 389 379 358 346 355 377 381 344 282 244 254 285
-321B85J0j0JK5K5Nj2k1k8k2J1N4P0M9J7j1k4k1qlk1m2l2ML0K3lj6qK0M6M2%n1n9k1J3Oj6
$$ 285 295 285 286 311 336 341 329 308 280 258 269 323 393 442 459 448 424 403 395 392 371 329 297 301 331 354 351 335 327 347 393 435 435 384 325 304 317 323 307
-325C07j4J2J8j3m4l9mK3K2QQK6L4K0mj9k4l0k4KL8N3L3%k5l4l6l4k3oJ6K9K4jk5k2OK3Qk1
$$ 307 293 305 323 310 266 227 223 246 268 276 284 310 344 364 360 341 317 287 263 265 303 356 389 389 364 330 294 260 237 231 247 276 300 299 274 252 258 281 289 268
-330B68l6k4ML1L9K3ok2k2j8k4k3%L6N4M2J4qj1nkrj8j0J1K3Kk8k0L0O4L5k7m0J3N8K8m5o4
$$ 268 232 208 212 243 282 305 299 277 255 237 213 190 190 226 280 322 336 328 317 312 310 301 283 273 284 307 309 281 261 291 355 390 363 323 336 394 422 377 313
-335C13lN3L1l4m7OM9K5k7m1j0K0L2M1M3J3m1p1m1J8N3M1J5mj8l7m3j5L2M6On5p5m1jRMK3
$$ 313 310 363 394 360 313 319 368 393 366 325 315 335 367 408 451 464 423 352 311 329 382 423 438 434 416 379 336 321 353 399 405 350 275 234 233 242 246 269
-340B69O0O8K3l2l6KJ9j4n5m7%L0K1JjONMJ4J3j4m1k7J3K6Kk7k4j2k3m9n1j3L7O0M9K7K6M9
$$ 269 329 397 420 388 352 354 373 359 304 257 257 287 308 309 308 314 319 323 337 350 336 295 268 281 307 309 282 258 246 223 174 123 110 147 207 256 283 309 358
-345C58N9L0j7k9kJ4j6n0m4JL4L8K9J3j0l1k3NJ3j1l1k3okKK2M4M1J9L%rk3k4rJpj0JQok3
$$ 358 417 447 430 401 399 413 397 347 303 304 338 376 405 418 408 377 354 359 372 361 330 307 301 299 301 323 367 408 427 430 430 421 398 374 365 366 359 349 350 358 352 329
-350C29k1%J1N%QJ8J8Rok2k7j4QJ4LKJ7J8k0n8n1nK4Pk0j5J1J9OJK2M9M0nm0k9J6M2K1j3k4
$$ 329 308 308 319 324 324 332 350 368 377 371 349 322 308 316 330 333 335 352 370 350 292 241 236 260 267 247 232 243 262 268 269 291 340 380 375 335 306 322 364 385 372 348
-355C48rNJ7L5L7pp0q3l5K4M1L4K4Ol1m6k2J2J7J8M0M4rp6p4j2K5nm3l0J5M6N6M3%n3n2J6
$$ 348 339 344 361 396 433 426 356 273 238 262 303 337 361 367 336 290 268 280 297 315 355 399 390 314 240 228 253 248 205 175 190 236 292 335 335 282 230 246
-359B46P9O5Ml0k2j2j7k0j4k1m3n1k0L5Q3R0N1rn5o3m8j3M2R0P7Jn6m0Mjm0m1%J2k7n6k9K2
$$ 246 325 390 394 364 342 330 313 293 279 258 215 164 144 179 262 352 403 394 339 276 228 215 257 347 424 425 369 329 333 332 292 251 251 263 236 180 151 173
-364A73M6M7L7Ol1k3M2R4P2J0j8pLjOJ0j5n2m4LJ9j3l9j3K5K2KJ4L2On0o4k0J9Qj3RM8M3l
$$ 173 219 266 303 309 278 255 297 391 463 473 455 448 451 450 456 466 451 399 355 358 377 364 325 312 337 359 361 375 407 413 363 299 279 298 306 293 302 350 393 390
-369C90l1j2J7J7KmlqoNNj9m1k7RK5J9J5J7%k4j7K1M1J3k2j7RJ0j2j9j0j1k7k9nK1J6j5m1
$$ 390 359 347 364 381 383 379 376 368 362 367 372 353 312 285 294 319 338 353 370 370 346 329 350 391 404 382 365 374 384 372 353 343 332 305 276 271 292 308 293 252
-374B52l6QN9P0L2qj0POj0JK8K7j5m5k1K3K6j0l4j5K2L9K3j2m4n3l2PM3M7Rm5o6l3J5L0J2
$$ 252 216 224 283 353 385 377 367 374 380 370 371 399 426 411 366 345 368 394 384 350 335 357 396 419 407 363 310 278 285 328 375 384 339 273 240 255 285 297
-379B97NJ8K8J9J8K7J3k9n2k0J7Rk2j7J8K2k0n0l3LK0L2N3O0K9rrJ3J0l1o7o4l2NK8L7K8J
$$ 297 302 320 348 367 385 412 425 396 344 324 341 350 328 311 329 351 331 281 248 251 271 303 356 416 445 436 427 440 450 419 352 288 256 261 289 326 354 355
-383C55k8m9n4l7KN3P9N5rn9n4pK9K9K1L8N4K0n0q5m6J2K0j2k0J1L6K3oj8j7j3oNRJjJ3J8
$$ 355 327 278 224 187 189 242 321 376 367 308 254 247 276 305 326 364 418 438 388 303 257 269 289 277 257 268 304 327 321 303 286 273 267 272 281 282 281 294 312
-388C12LlJ8L4Ol6k8J6K5j6l1J8O3L5k9l5J1K3k4n1nN8N6km4m0j9mNjk4m0k1J8K9QLK7M5K8
$$ 312 315 312 330 364 370 334 306 322 347 331 300 318 381 416 387 352 363 386 362 311 306 364 420 418 374 334 315 311 316 315 291 251 230 248 277 285 288 315 360 388
-393C88jj1lmj0j0lOJ9L5L3Nk0k0j1k3m2l6KL8M7L3J2rj7qnk5m5k9J1K2j9n4l4K1M5J8j8k1
$$ 388 387 376 373 369 359 349 346 352 371 406 439 444 424 404 393 370 328 292 294 332 379 412 424 415 398 390 385 360 315 286 297 319 300 246 212 233 278 296 278 257
-398B57jJ2NlLJ8K5J6Lmj5l4m1k1RK8L2M2N5N2K9Nj2l5n2m4j4KmkJ7K3Mj2lMj4k0PL2J8lJ3
$$ 257 256 268 273 270 273 291 316 332 335 331 316 282 241 220 229 257 289 331 386 438 467 472 460 425 373 329 315 317 313 311 328 351 355 343 340 344 330 310 317 349 367 364 377
-403C77L1po9p6k4J6K4M3P1M2l8p0nN5J9o5q5l9jJOK3K3QJ2K8J5j4j2K8N3M2K1Pk3o2o4k1
$$ 377 408 401 332 256 232 248 272 315 386 428 390 320 315 370 389 324 239 200 199 200 206 229 252 260 272 300 315 301 289 317 370 412 433 440 417 355 291 270
-408B70Rpk4%K9J3k3j9K5N6M2Lk8m3l8j1K9N0M9L6K3Pj4k7j9JJ3kl1m2j7J4Ql2n4k8J7L6K8
$$ 270 279 272 248 248 277 290 267 248 273 329 371 374 346 303 265 254 283 333 382 418 441 448 434 407 388 389 402 400 369 327 310 324 332 300 246 218 235 271 299
-412B99K0K3L1L5L3J4j9l6k2jkj3j0lj1k1nJ9J5j1j7LOj2j6J2L1Rk1k1JOj0j7rMK6N3N7J9
$$ 299 319 342 373 408 441 455 436 400 378 377 375 362 352 349 338 317 312 331 346 335 318 321 327 315 299 311 342 351 330 309 310 316 306 289 280 284 310 363 420 439
-417D39k8l7qNk0m5k8J6L5Rl5n2l2%J1RJ4L2L8K4%j5k2k0mJ9J9ok2MM1M7K6QJk1m6l7lRj6
$$ 439 411 374 366 371 351 306 278 294 329 338 303 251 219 219 230 239 253 285 323 347 347 332 310 290 286 305 324 318 296 300 341 388 414 422 423 402 356 319 316 325 309
-422C09l1lL2L0OOJ8J1j7k8j6j0k3k3KK7K7K0L0M1K0k8n6l7J1M3L3j4n1m1J0N1L0k3m5j6J1
$$ 309 278 275 307 337 343 349 367 378 361 333 317 307 284 261 263 290 317 337 367 408 428 400 344 307 318 361 394 380 329 288 298 349 379 356 311 295 306
-427C06rm1j7N1Q4M5j3k8mJ2J4J8K1qn6o6k6Pj0l9k4K4M4K9K0L0K2j9m4j6K6K5oj7llk5k6
$$ 306 297 256 239 290 374 419 406 378 374 386 400 418 439 431 375 309 283 290 280 241 217 241 285 314 334 364 386 367 323 307 333 358 352 335 332 329 304 278
-431B78OK5%l1j1M0N3J3l3l3%L0L5J6j8m3m1j5KjlJ1K1J2l%J2J3J0K4M3L0j1l8l1k1l0l2l
$$ 278 284 309 309 278 267 307 360 373 340 307 307 337 372 388 370 327 286 271 273 272 269 280 301 313 310 310 322 335 345 369 412 442 431 393 362 341 311 279 276
-436B76L0L4J7J3K2Nl7n0jO3P7L4j9m4m2l0pJ4J6rl2l0j2OK4M3M0Kl1j2L7N2Qm0m3k0j3j0
$$ 276 306 340 357 370 392 397 360 310 309 372 449 483 464 420 378 348 341 355 371 362 330 300 288 294 318 361 401 403 372 360 397 449 457 417 374 354 341 331
-441C31J1L5K8Jpll3p8p9j4N2O1L4J0j0l4l5PM7K3m2p3l9MJ5J5L3N4M0ll6l6k1j5j2nQOqj3
$$ 331 342 377 405 406 399 396 363 285 206 192 244 305 339 349 339 305 270 277 324 347 305 232 193 197 212 227 260 314 354 351 315 279 258 243 231 226 234 240 232 219
-446B19J7N6O0K2j7j7Kjk7m3l4rJ9M6N8L8nm4n8m7qM6P5N1%k0ljl0m7k7JNJ1L9N1J2l4k1K8
$$ 219 236 292 352 374 357 340 342 341 314 271 237 228 247 293 351 389 384 340 282 235 227 273 348 399 399 379 376 375 345 298 271 272 277 288 327 378 390 356 335 363
-451C63M2J6LK0J4l9q1o4j6Npj7j2JK5N4O2L2qk0pqk2j8J1K3pm5l8J5N8N6K1nj9l3m4k2L0
$$ 363 405 421 424 444 458 419 338 274 258 263 256 239 227 228 253 307 369 401 393 373 366 358 336 318 329 352 345 300 262 277 335 391 412 407 388 355 311 289 319
-455C19O2L2j9k3J9L0k1o3l0L4L5k6n8qO1O7J2l1k8rnk2l0j9NJ5kk5j8J6M2L2J3RJ2KqQL0
$$ 319 381 413 394 371 390 420 399 336 306 340 375 349 291 283 344 411 423 392 364 355 350 328 298 279 284 299 297 272 254 270 312 344 357 366 378 380 372 380 410
-460D10J8k5n2l8j1KJ1K2J8kj6mJk6n6m0J6N4N1L6K8J4k5n7n4k5nllOJ2J1Moj0JK3L8L2J4
$$ 410 428 403 351 313 302 304 315 337 355 353 337 333 334 308 252 212 228 282 333 369 397 411 386 329 275 250 245 242 239 245 257 268 272 266 256 257 280 318 350 364
-465C64%JOPnl0n6n2j5L2N7N0K0j8m0k8OK1Kj3PK4Jm0l4J0L0jk9j1J9J6qj9k0k9l6j1K9M6
$$ 364 364 365 371 378 373 343 287 235 220 252 309 359 379 361 321 293 299 320 322 309 316 340 341 301 267 277 307 306 277 266 285 301 293 274 254 225 189 178 207 253
-470B53L6J7mk4k8oJ6Qj6rK9M9K7qk0j1KJ6K5K2Jk2l7l8k3J5M9M8J5j7k7k0kK5K7j4n2k8L9
$$ 253 289 306 302 278 250 244 260 268 252 243 272 321 348 340 320 309 311 327 352 374 375 353 316 278 255 270 319 367 382 365 338 318 316 341 368 354 302 274 313
-475C13M5l1q4k6P4Q4mo8m7lj0m6m9oL5N0M0K1Mj%LlqoRL2M9L7kl3l1j5k4l8j4L5M7%m0k0
$$ 313 358 327 243 217 291 375 371 303 256 253 243 197 148 142 177 227 267 288 292 291 291 294 291 283 277 286 318 367 404 402 369 338 323 299 261 247 282 329 329 289 269
-480B69K3K0k9n9m2pJ5L1M3L9J9OJ4K6K0Monklllj3k6l1j8OK4K2Rpk3l5l4j5RJ4PNJ5J8Qj
$$ 269 292 312 283 224 182 175 190 221 264 303 322 328 342 368 388 392 386 381 379 376 373 370 357 331 300 282 288 312 334 343 336 313 278 244 229 238 252 259 264 279 297 305 304
-485C04lrj5RO1Q9M6k8n5k6Jrl4m4m4l7pM1P0N7K6Mk0m6m2JL1%o2p3k0L9O5O9O1L0k3n0k7
$$ 304 301 292 277 286 347 436 482 454 399 373 374 365 331 287 243 206 199 240 310 367 393 397 377 331 289 290 321 321 259 186 166 205 270 339 400 430 407 357 330
-490C30J0J4j5m3m7k8J4O5Q0L6k9n2k5QK0K4K7J0k7m4j3K6K4qk0LK3J6jmJjrj5k2l8m4k3K3
$$ 330 340 354 339 296 249 221 235 300 380 416 387 335 310 318 338 362 389 399 372 328 315 341 365 357 337 340 363 379 378 374 375 374 365 350 328 290 246 223 246
-495B46N3M5J2roNjj6j1J7K9km5m5KL4J2l5m5nM2M9J6k7m7l4kK0K2J5J6J8J6J2J4Rj1l4m1
$$ 246 299 344 356 347 341 346 345 329 318 335 364 362 317 272 274 308 320 285 240 235 277 326 342 315 268 234 232 252 274 289 305 323 339 351 365 374 363 329 288
-499B88l4k3mK8N7N1J1k1pL0M3Mn2p3l5K1L9J4rKJ8RrkJ5Mk8l4oRkMM4P5M6j5m9n2m2k2J8
$$ 288 254 231 227 255 312 363 374 353 346 376 419 423 371 298 263 284 323 337 328 330 348 357 348 346 361 365 337 303 297 306 304 308 352 427 473 458 409 357 315 293 311
-504C11M2J6l1l3K0N9M4%k0j4prj0jRRkj8l2m7o0n7k1L4N5K1k1j6J6J4k4l5J3O3N2Kj6J9N6
$$ 311 353 369 338 305 325 384 428 428 408 394 387 378 368 367 376 385 383 365 333 286 226 169 148 182 237 258 237 221 237 251 227 192 205 268 320 322 306 325 381
-509C81M7km4m7k3%lj2lK0L2J9%qj2j4j3j9m9p9o2J4Q5R0M5J0Olk6l3j2ol3n7k6L9O8M0J%
$$ 381 428 426 382 335 312 312 309 297 294 314 346 365 365 357 345 331 318 299 250 171 109 123 208 298 343 353 359 356 330 297 285 279 246 189 163 202 270 310 311 311
-514C11J1qm7m5J0N9N0Mk8k4rLJ7K3Nk2k4NL1K8J1jj3k8k6j2nrjL0M4J8j4qJ4Kl0l5nJ5OJ
$$ 311 322 314 267 222 232 291 341 345 317 293 284 287 304 327 332 310 286 291 322 350 361 360 347 319 293 281 276 267 266 296 340 358 344 336 350 352 322 287 282 297 303 304
-519C04K3M1K4j2k8k6j8rOJ8J2nk1l8n4n4j8M4R2R7O4J5k6m5l8j6qk8n9n9k0K3K5%jL4O1M3
$$ 304 327 368 392 380 352 326 308 299 305 323 335 330 309 271 217 163 145 189 281 378 442 457 431 386 348 332 324 296 237 178 158 181 206 206 205 239 300 343
-524C43J1J4L7K9j7n1m8k8j6KL5N2K1l2m7j2L2L2rm6m4j0J3QmKK2K5Jk8l8k8jL1N4M9K8J0
$$ 343 354 368 405 434 417 366 318 290 274 276 311 363 384 352 305 293 325 357 348 302 258 248 261 269 265 267 289 314 315 287 249 221 220 251 305 354 382 392
-528C92kk0k9j5J4K4RoqrnK3N6L9k4p0n4j9j2j7lNk0l9NQ1R7L5k5l5k7l8m7k4QK3L1N2N3L
$$ 392 390 370 341 326 340 364 373 367 359 350 345 368 424 463 439 369 315 296 284 267 264 269 249 210 215 296 393 428 403 368 341 303 256 232 240 263 294 346 399 402
-533D02n6n2J2N9L8qj9NJ0j6l3mM3N7L0J%Orm2n3l3j1j7l6m0j6J5K8L3L8M1J9k4m3j6K5K3
$$ 402 346 294 306 365 403 395 376 381 391 375 342 338 381 438 468 469 469 475 466 424 371 338 327 310 274 234 218 233 261 294 332 373 392 368 325 309 334 357
-538C57j9l8rK3J0l3m9k8%J5K7L9L6K1Lj6l9m8j7M1Q1P0K6k8p4r7p1j1L3L1NJJ9K7J0j5k3
$$ 357 338 300 291 314 324 291 242 214 214 229 256 295 331 352 355 339 300 252 235 276 357 427 453 425 351 254 183 172 205 236 241 242 261 288 298 283 260
-542B60k0j7j4oRK4K2MmJ1M0M6J9j8l2j9kkpkOlk3j6K4M9J6l7m0lRk2k9J4M2Qk2J3N3J6n9
$$ 260 240 223 209 203 212 236 258 262 258 269 309 355 374 356 324 305 303 301 294 292 298 295 272 256 280 329 345 308 268 265 274 252 223 237 279 287 265 278 331 347 288
-547B88n9J1M0kk6RL2NrK8M6pn4k4L0J9k6k1K0J4l2l3K9P3M3nj9o%qj6k8l1j6LKpjJ0pm0m7
$$ 288 229 240 280 278 252 261 293 298 289 317 363 356 302 278 308 327 301 280 300 314 282 249 278 351 394 389 370 364 364 356 340 312 281 265 268 270 263 262 272 265 225 178
-553A78k0J6N0P5O2jn4k7M0M7j5m3LM8J9l5m0mK1K9L8K9j0m4k8J5L3J6lj6k6k5kJ4pl6l2n
$$ 178 158 174 224 299 361 360 306 279 319 366 351 308 311 359 378 343 303 299 320 349 387 416 406 362 334 349 382 398 395 379 353 328 326 340 333 297 265 260
-557B60kk4k9j0OQJ2K1J6KLJ8K2Lk0k6j2J6M8N7L2jj2mkLK4L6Rl8n3k5KJj0j2j0j0%J3J8J5
$$ 260 258 234 205 195 201 209 221 242 258 260 263 281 303 306 286 260 248 264 312 369 401 400 388 384 382 385 409 445 454 416 363 338 340 341 331 319 309 299 299 312 330 345
-562C45J7J4j9o2o2pM1M2K6L1L8Nm6n5j6K4K9Rj2k8l4j9QJ9Jk5k0J1L2J9lnJ7K2OjK1L7Pm4
$$ 345 362 376 357 295 233 226 267 309 335 366 404 409 363 308 292 316 345 354 342 314 280 261 269 288 289 264 244 255 287 306 303 298 315 337 343 342 363 400 407 363
-567C63m7KL2%m7m4OL8K1j5l1j6PJ7Qj2k1qJ5K7K1Lj6k4j7oLK0M5O0L9MpPKl1l9KL0j1q2q3
$$ 363 316 318 350 350 303 259 265 303 324 309 278 262 269 286 294 282 261 253 268 295 316 319 303 279 262 256 259 279 324 384 423 427 420 427 429 398 359 361 391 380 298 215
-572B15j1M2J9k5k9kJ1KKPkj5nK5L9L0K3L0L0Rqonk3m1l2j1nlK2M8K1m6p3k0M0L6oj2J7K6
$$ 215 204 246 265 240 211 209 220 222 224 231 229 214 209 234 273 303 326 356 386 395 387 381 376 353 312 280 269 264 261 283 331 352 306 233 213 253 289 283 271 288 314
-577C14LmJ3Rk0k3J5L5Jl4j8J7K1QJ5K2ql8j8K8K3k0k1M0O9J8n3o3k9pQM0N8K6k2k3Jj8p8
$$ 314 317 313 326 335 315 292 307 342 343 309 291 308 329 337 352 374 366 328 310 338 361 341 320 360 429 447 394 331 302 295 303 343 401 427 405 382 383 365 287
-582B87q6j1N8M3j1qM4M5l5j03p3J6O4M3QRK7L1K0J2jk0k8pK3K6Jj7oJ9K8Qk2m1l5j6jPK3
$$ 287 201 190 248 291 280 272 316 361 326 223 150 166 230 273 281 290 317 348 368 380 379 359 331 324 347 373 374 357 351 370 398 406 384 343 308 292 291 298 321
-587C21L9L4Qj0pqk9n3m5j7lOL3N8M5kk5jJ7qm4l6QL8K9Mj3j6j1oj1k3k5j2kkLJ9K7J3opn
$$ 321 360 394 402 392 385 377 348 295 250 233 230 236 269 327 372 370 345 344 361 353 309 273 281 319 348 352 339 323 312 306 295 272 247 235 233 231 234 253 280 293 287 280 275
-592B75qML1L5j3n8l6K7M9Lm0k5K3M8L4Mj9k3j2jj1l4l8j8kqj4JK1K1J0J2K4L1K2QkmLMj0
$$ 275 267 271 302 337 324 266 230 257 306 309 269 244 267 315 349 353 334 311 299 298 287 253 215 197 195 187 173 174 195 216 226 238 262 293 315 323 321 317 320 324 314
-597C14l7m4k1RK0J6J6K0K1J3Jj9m5n4k7J7M1L9L5M0M5L0rn7q3n9%L3J4k1j8J8L6J9KJM%Q
$$ 314 277 233 212 221 241 257 273 293 314 327 328 309 264 210 183 200 241 280 315 355 400 430 421 364 281 222 222 255 269 248 230 248 284 303 305 306 310 310 318
-602C18K9L7K0jj3l5o0m8J0M9J5m1k8M1Q0M1k1m6m2l8k7kJ9J8RJ0Oj8m4l6JL4N2N8M3mn0n0
$$ 318 347 384 404 403 390 355 295 247 257 306 321 280 252 293 373 414 393 347 305 267 240 238 257 275 284 294 300 282 238 202 203 237 289 347 390 386 336 286
-607B86MN9O5K0l7o4m9j8j8m8o0k3K8L9J2NK9L6jm3m6k4rML0N0L7Jj8j1%LNNnk2j8J4M9N7
$$ 286 290 349 414 434 397 333 284 266 248 200 140 117 145 184 196 201 230 266 265 222 176 152 143 147 177 227 264 265 247 236 236 239 244 249 244 222 204 218 267 324
-612C24L1ql5l3rJ1Rnj0olj0j7pJ3L0K6Lj3oJj7m0k6K3M3jm7k7L1M7Pk2mK1J7jJJ8L3K9Ol6
$$ 324 355 347 312 279 270 281 290 285 275 269 266 256 239 232 245 275 301 304 291 285 286 269 229 203 226 269 268 221 194 225 272 279 257 253 274 291 290 291 309 342 371 377 341
-617C41o7n2qJ9J8K0L3K5pk9j7JPK2L9K1l5n9j1N1N5J2j4j1mPL2L8nn5m5QL0J0lPkl1l2MK2
$$ 341 274 222 214 233 251 271 304 329 322 293 276 277 284 306 345 366 331 272 261 312 367 379 365 354 350 357 389 427 422 367 322 330 360 370 367 374 372 341 309 313 335
-622C35Jj5NK3RkK7O4N8J0m1o9p1l7OJ9rl0rK0K6J5J6J1j5l3j7Ojk6k9j6k0l2j3K9M5K7Lr
$$ 335 336 321 326 349 358 356 383 447 505 515 474 405 334 297 303 322 313 283 274 294 320 335 351 362 347 314 297 303 302 276 247 231 211 179 166 195 240 267 270 261
-627B61k4l5j8K9N6M6J8Mmj4qJ8L4J4k4m3k8KK0K0J1kj3k2k4j6nKPJ7K7Rk9n0k4K2N2N0K6
$$ 261 237 202 184 213 269 315 333 337 333 319 311 329 363 377 353 310 282 284 304 324 335 333 320 298 274 258 253 255 262 279 306 315 286 236 212 234 286 336 362
-631C62k0p4q9n1lOJL3Q7R0K4m1m2jK9K7J2MJ4L2K7k1p0p2k9LQJ6L6L4%j2K2M9K5j5k5k2m4
$$ 362 342 268 179 128 125 131 132 165 252 342 366 325 283 282 311 338 350 354 368 400 427 406 336 264 235 238 246 262 298 332 332 320 342 391 416 401 376 354 310
-636C10o4l1L7P2N1J3j2k5k9j1J5K6J6ROqk5j9J0K6Qk3l5k2lNqk2pK8L7Jl8l9j9j5j6J4N1
$$ 310 246 215 252 324 375 388 376 351 322 311 326 352 368 377 383 375 350 331 341 367 375 352 317 295 292 297 289 267 260 288 325 326 288 249 230 215 199 213 264
-641B64M0ql2j9j6l9m4j0K4K9K2K3J5rj8OK2Nj1opm2o9m0RJ7MJ7N1M6J1kJ4Qk8l7KL1J2j8
$$ 264 304 296 264 245 229 190 146 136 160 189 211 234 249 240 222 228 250 255 244 238 231 189 120 80 89 106 110 127 178 224 235 233 247 255 227 190 192 223 235 217
-646B17rJ9J7j1k3j7j2lK3N1N3L4K9M1L7Ol1n1n2m6k4J2M4N6N6M4Rm0o7m6LK6Pk2k8j7j3j7
$$ 217 208 227 244 233 210 193 181 178 201 252 305 339 368 409 446 452 421 370 318 272 248 260 304 360 416 460 469 429 362 316 319 345 352 330 302 285 272 255
-651B55j1QK5K7J8Kj2k4k4j5lPJ8L1L7L2J1j1k1j3KQMJNlk7m8l6LL0K8J1MRJ6J9J2j0m3n8
$$ 255 244 252 277 304 322 324 312 288 264 249 246 253 271 302 339 371 382 371 350 337 339 347 351 352 357 354 327 279 243 246 276 304 315 319 328 344 363 375 365 322 264
-656B64m0%L9N9N1Pm6n5mM6L3k8o1l8o%JJ7K3lk7j7ROk1k9j6j6k6nN3Q5M3l4o8l5J8L7J9j
$$ 264 224 224 263 322 373 380 334 279 275 321 354 326 265 227 221 221 222 239 262 259 232 215 224 230 209 180 164 148 122 117 170 255 298 264 196 161 179 216 235 234
-660B34NM0P1O6K0k5l9k4pjkj2k4j7J4K4k1q3q5j7M1L8K0L7O2L8j9m9k8%J3L1N2L5j5m0oL4
$$ 234 239 279 350 416 436 411 372 348 341 340 338 326 302 285 299 323 302 219 134 117 158 196 216 253 315 353 334 285 257 257 270 301 353 388 373 333 327 361
-665C61J6l6n8l1QK5L0K3jl2l9j5J5L0K7J6mk0k1rnj2j9k0j9j7rLJ1K0M0O0M9Ok5k0lj3l3
$$ 361 377 341 283 252 260 285 315 338 337 305 266 251 266 296 323 339 335 315 294 285 280 268 249 229 210 193 184 187 198 218 258 318 367 373 348 328 325 312 279
-670B79k7RK6Kl6m6k5lJ1K8N1M8J0l8m9j2L8O0L6j8o1n6rL2K7j1l2k0JJ5L2M2K2j1oM4P0K4
$$ 279 252 261 287 289 253 207 182 179 190 218 269 317 327 289 240 228 266 326 362 344 283 227 218 250 277 266 234 214 215 230 262 304 326 315 309 353 423 447
-675D47l8l7J4L9J2k0k9l7m6l0J2L6J9rj7j4pJ2L8M2J1k4l4k7j3RL3L4J4mj5l4n1k2L5M4j5
$$ 447 409 372 386 425 437 417 388 351 305 275 287 323 342 333 316 302 295 307 345 387 398 374 340 313 300 309 342 376 390 386 371 337 286 264 299 343 328
-679C28o0k2M7N4Pk0jJ1rl5m6m2j8K6O2N0J2qok0m8l8J6N9M5ll7l7nL7M8J1m0m7j6Npj0J4
$$ 328 268 246 293 347 354 334 333 344 335 300 254 212 194 220 282 332 344 336 330 310 262 224 240 299 344 341 304 267 262 299 347 358 318 271 255 260 253 243 257
-684B57L3K2MKLnnJ8K9Pl0m2l1j7nLOPJ9L1J3k8m0j2Rok3KL8L8J5K0N0N4J7j8k0qj6l9m7l0
$$ 257 290 312 316 318 321 316 311 329 358 365 335 293 262 245 240 243 249 256 275 306 319 291 251 239 248 242 219 221 259 297 312 332 382 436 453 435 415 407 391 352 305 275
-689B75KJ5Kj7j5Jok8k5J2L4J0j8KM8N4J5j6k0k0l2l0JL3L5Qk0k8rJ8K6J4Jnj9l6j9L5O1J4
$$ 275 277 292 294 277 262 263 257 229 204 216 250 260 242 244 292 346 361 345 325 305 273 243 244 277 312 320 300 272 263 281 307 321 322 317 298 262 243 278 339 353
-694C53m2k4L3L2l2o0j3K5rn7m6JJ7RK0M4L4ok8j7pqLL2L7J2pRL2K5j0l6l0kK5K7J1MK0M0
$$ 353 311 287 320 352 320 260 247 272 263 206 160 161 178 187 207 251 285 279 251 234 227 219 222 254 291 303 296 305 337 362 352 316 286 284 309 336 347 351 371 411
-699D11K5k3n8n0j8jj1j8j0LKqpPJ9J8RjkMJ7K6J6jnjj3m8o9l9J5M0K1kmPJ2J9L1L2Rj5k1
$$ 411 436 413 355 305 287 286 275 257 247 250 252 244 237 244 263 281 290 289 287 291 308 334 350 349 344 343 330 282 213 174 189 229 250 248 244 251 263 282 313 345 354 339 318
-704C18oRJ6J5Qnj8k1rJ3L1K8OrkQnk6k8qMQK1M0L5PjJ2J0j5k4JK0Lj8kK2J2j8k9k1k5l3j0
$$ 318 312 321 337 352 360 355 337 316 307 320 351 379 385 376 374 382 377 351 323 315 319 327 348 388 423 430 429 441 451 436 412 413 433 436 418 416 438 450 432 403 382 357 324 314
-709C14L3N0K1k7n4m9j9J5K3OKK4K9j2m5j0N6N3k7q7n6J4L7Ok4j8J2L7M0K0ko%KOK2K5on4
$$ 314 347 397 418 391 337 288 269 284 307 313 315 339 368 356 311 301 357 410 383 296 240 254 291 297 273 255 267 304 344 364 362 356 356 358 364 386 411 405 351
-714C51o4l8j0QL7O0K9m1o8j7M2L3j9l9j4J4J5Q%j1j9j4onkJ2J6ok7j2K5M1L3K5K0mm3n8k9
$$ 351 287 249 239 247 284 344 373 332 264 247 289 322 303 264 250 264 279 287 287 276 257 243 237 232 230 242 258 252 225 213 238 279 312 337 357 353 310 252 223
-719B23J4K5Jk7k8j3j3l3l2J8P8Q2K7k2k7k2m0m9j1M0M7K5L0N3L9j3m2k5nj2j8JK0K4K8M1
$$ 223 237 262 263 236 208 195 182 149 117 135 213 295 322 300 273 251 211 162 151 191 238 263 293 346 385 372 330 305 300 288 270 271 291 315 343 384
-723C84L5ml9m2k7k6l0j4NMJK5N8M9jm1l1PL1K7J0ok3m1m8l6pK2K9J7lj4qLPpk8k8nK1K2L
$$ 384 419 415 376 334 307 281 251 237 242 246 247 272 330 379 378 337 306 313 344 371 381 375 352 311 263 227 220 242 271 288 285 271 263 266 273 266 238 210 205 226 248 251
-728B51j4j4j0kJ6L8M4J8k3n2m7lN0O7K7l0m6j7J4J8RRQmj2mMnj7j3oj6l3k7%J9J3Jpj1j8
$$ 251 237 223 213 211 227 265 309 327 304 252 205 202 252 319 346 316 270 253 267 285 294 303 311 307 295 291 295 290 273 260 254 238 205 178 178 197 210 211 204 193 175
-733A75j2J4L4K8%j3%J6J6J6L5N4L2k1m5j8J1ol3j3L6N0J7j1rjmKJ2kl4l4RL0ll5rL8L5lj6
$$ 175 163 177 211 239 239 226 226 242 258 274 309 363 395 374 329 311 322 316 283 270 306 356 373 362 353 352 348 350 362 360 326 292 301 331 328 293 284 322 357 354 338
-738C38PJ8OKJ2Mj7j7J1K4ll7l8j4QPj0k3mM0M9rp6o2J2L7k6q4m6L5N9J0k4JM6N6K9kk2k5
$$ 338 345 363 369 371 383 387 370 353 364 388 385 348 310 296 304 311 301 278 274 314 363 354 278 216 228 265 239 155 109 144 203 213 189 190 236 292 321 319 297 272
-743B72k2k5l9n2l8NN3P9P2M3Pj0qmj3k8l3k4mK5M9M7K2PJ0Nl1o7n0%K7J4jNPj2k1RL9J9l6
$$ 272 250 225 186 134 96 101 154 233 305 348 355 345 337 333 320 292 259 235 231 256 305 352 374 381 391 396 365 298 248 248 275 289 288 293 300 288 267 276 315 334 298
-748B98o0k8K4M1K2qk5k7j2J5L5L1RojJ1Lj8k5j0RQmlJ2J7Lj0QL7M3J9kLJ3om8p4o3l1o%o
$$ 298 238 210 234 275 297 289 264 237 225 240 275 306 315 309 308 319 322 304 279 269 278 286 282 279 291 308 311 301 309 346 389 408 406 409 422 416 368 294 231 200 194 194 188
-754A88j2j5oJ2L0M1M1K1k0n7n4qL5M1K3J1Qjp%Lj7m0l0pj5l8j0P1J10N7j6j8J8Nn1o3j3K5
$$ 188 176 161 155 167 197 238 279 300 280 223 169 161 196 237 260 271 279 278 271 271 274 257 217 187 180 165 127 117 188 298 355 339 321 339 344 293 230 217 242
-758B42Rj2RL2J2j6LN5O9L0k1m9n8n2k5OJ6J1K0M3M4J6j3j6j5k8l9k6%J5K0K9K9Ll6m7k5M
$$ 242 251 239 248 280 292 276 279 334 403 433 412 363 305 253 228 234 250 261 281 324 368 384 371 355 340 312 273 247 247 262 282 311 340 343 307 260 235 239
-763B39J4J4J3RknMLk1l9j4M2P1L3l9p4l8K8N8L1rk5j4ponkj0j1K3O6N3k8r4o2K7N8Qm3k4
$$ 239 253 267 280 289 287 282 286 289 268 229 215 257 328 361 322 248 210 238 296 327 318 293 279 272 266 261 259 249 238 261 327 380 352 258 196 223 281 289 246 222
-768B22K4K8oj9OK9K4PNLj7l8l2jK2J3j1j6JJ5J0KRJ6Kk2k1OJ6JnJ9L8J8j7k1OK4K0J5J2j0
$$ 222 246 274 268 249 255 284 308 315 320 323 306 268 236 235 257 270 259 243 244 259 269 271 280 296 298 276 255 261 277 278 273 292 330 348 331 310 316 340 360 375 387 377
-773C77m8o7m6j0J8K7J8j3m7m1MM4M2K0J7K7K7K3K8K2k1q0q8k7M7P4M7%m1n9l5K3O1L8k3n3
$$ 377 329 262 216 206 224 251 269 256 209 168 172 216 258 278 295 322 349 372 400 422 401 321 233 206 253 327 374 374 333 274 239 262 323 361 338 285
-777B85k9jqk3mL4L5kl0j7LjpJ9N2M1j2m4l1j3k4l2KO0Q5N1kl0k6j3j0k0k3mK7L8J4j7j9M
$$ 285 256 255 247 224 220 254 289 287 257 240 243 242 235 254 306 347 335 291 260 247 223 191 193 253 338 389 387 357 331 318 308 288 265 261 288 326 340 323 304 308
-782C08Pk1m0j6L4N4K7j5l0j5LOqj9j0K2N1M9Ql2l8j1J7J9%k4l4j7K6N4L1k4m8j8J9K2J0J2
$$ 308 315 294 254 238 272 326 353 338 308 293 296 302 294 275 265 287 338 387 395 363 325 314 331 350 350 326 292 275 301 355 386 362 314 296 315 337 347 359
-787C59J0l2q1p1pL2Qk1lL3L2MlK1L8K7Jk1l6l5j4J3K4K1J7J3%j7l2l2j3J6L6J7l2n1j1M5
$$ 359 369 337 256 185 178 210 218 197 194 227 259 263 260 281 319 346 347 326 290 255 241 254 278 299 316 329 329 312 280 248 235 251 287 304 272 221 210 255
-792B55O0L3Qlk6n1m7qK2J9K%J1K7M2M8K3k7n8m4nJ1ml8n9n1pL9M7J5j7j7KJ8K8K6Mk7k9J1
$$ 255 315 348 356 353 327 276 229 221 243 262 264 264 275 302 344 392 415 388 330 286 281 292 288 250 191 140 133 172 219 234 217 200 202 220 248 274 278 251 222 233
-797B33M7M4J7PJ1Lj9l6l7k9nL8O5M1j2l7k1jOQJ5Rj2k0j4j8l3k4J8L9jn7o1j6R%lK4M5L2
$$ 233 280 324 341 348 359 362 343 307 270 241 236 274 339 380 368 331 310 309 315 323 338 347 335 315 301 283 250 226 244 283 282 225 164 148 157 157 154 178 223 255
-801B55J4K7M0J5l0m8k9nQK7N4M9Ok6j3J5Nl3m7k9j1j0%L0N3L9Qj3k7m1n1m4k2NL1M5K6pj1
$$ 255 269 296 336 351 321 273 244 239 247 274 328 377 383 357 344 359 364 331 284 255 244 234 234 264 317 356 364 351 324 283 232 188 166 171 202 247 273 266 255
-806B55K1M0Ol9k5L5O3L0k2m5l7k5rNQMJ9N2O1J5m7o2k0L1M5J9j6l2j9J5L1J2k3k9jK4J6j2
$$ 255 276 316 322 283 258 293 356 386 364 319 282 257 248 253 261 265 284 336 397 412 365 303 283 314 359 378 362 330 311 326 357 369 346 317 316 340 356 344
-811C44k3j6j5k6j9J9M3J3n0o9j9M5N7K7QRKk9n0l4JJ6Lj1lK6N9O7L8rm3m0j2J8K8J5orJ1
$$ 344 321 305 290 264 245 264 307 320 270 201 182 227 284 311 319 328 330 301 251 217 218 234 237 226 223 249 308 375 413 404 361 321 309 327 355 370 364 355 366
-816C66L2K7Kj9k4k5j9%K2J9j0k4mK7L5K3Oj1k9k8j0ml1n0k0L8M6j1o0m5J4M5K7qk6k3rNJ0
$$ 366 398 425 427 408 384 359 340 340 362 381 371 347 343 370 405 428 434 423 394 366 356 352 321 271 251 289 335 324 264 219 233 278 305 297 271 248 239 244 254
-820B54KqJJ8K0jk1j4Kkj7qL7P3N6Jl9l9j6%PPLKJ0J6ll5m0j3Pj4m1k7J8L6J3pjJ2J1J5L7
$$ 254 256 248 249 267 287 286 265 251 253 251 234 226 263 336 392 393 354 315 299 299 306 313 316 318 328 344 341 306 266 253 260 246 205 178 196 232 245 238 237 249 260 275 312
-826C12N1K5j9m3m2m5n0l3J3M4L6J4Mjj7l1j4K0L3J9J1K0J4k5n2l3jnk8j0N2Q9O0Pj5j1j0
$$ 312 363 388 369 326 284 239 189 156 169 213 249 263 267 266 249 218 204 224 257 276 287 307 321 296 244 211 210 205 177 167 219 308 368 375 360 349 339
-830C39oJ6K8Jl4k6J6L4Rj9k9l1l3k2PK0PmLOrqJ4K1j3m6l0Njl8m2QN5M8J3j1j5j1NK8L5J6
$$ 339 333 349 377 378 344 318 334 368 377 358 329 298 265 243 250 270 277 273 276 282 273 265 279 300 287 241 211 216 215 177 135 143 198 246 259 248 233 222 227 255 290 306
-835C06rj1jjpOK9K9lk9j6J3J8j3m6m5j6J8L5L5J9j1m0m4j2L4N6L6j3n5n8k4J1J9J1J8M5N1
$$ 306 297 286 285 284 277 283 312 341 338 309 293 306 324 311 265 220 204 222 257 292 311 300 260 216 204 238 294 330 317 262 204 180 191 210 221 239 284 335
-840C35J4k9l6j0RQJ8L9L5qm2k3K1K7j8o5o1kO2Q1M2k1m6k3R%l3m6k7oJJ4L6M2J8j5k6k0j4
$$ 335 349 320 284 274 283 291 309 348 383 375 333 310 331 358 340 275 214 212 274 355 397 376 330 307 316 316 283 237 210 204 205 219 255 297 315 300 274 254 240
-845B40j0jKlnQJ8PrlJ2Pj1j1PK0J5Q%k2m3k0L4N0jn4m2J4L6Rj6j0OPKM%j7k7j6NK2L1K6J0
$$ 240 230 229 231 228 223 231 249 256 247 244 256 263 252 241 248 268 283 291 291 269 226 206 240 290 289 235 193 207 243 252 236 226 232 239 241 245 245 228 201 185 190 212 243 269 279
-850B79oNL3L6jm2m0oK1J0j7k9rL5O9O5J9l6o1m3%L5L7Nl3m3k2RL2M3L9K1kk6n4p9o9nP2Q1
$$ 279 273 278 311 347 346 304 264 258 279 289 272 243 234 269 338 403 422 386 325 282 282 317 354 359 326 283 261 270 302 345 384 405 403 377 323 244 175 170 242 323
-855C23J8l8k7K3M9L8J7jj9k5j0lj9k7JL1J5l0m6k1qk2k2OK4Kk5j6PJ2MJ6M3M7J6k5m9m3j3
$$ 323 341 303 276 299 348 386 403 402 383 358 348 345 326 299 300 331 346 316 270 249 241 219 197 203 227 229 204 188 195 207 211 227 270 317 333 308 259 216 203
-860B03J8K9K1J5J4OpqKKj5k3j1j0k7l0jJ7nl3j4K2Pm3m9J5P5O0RmL1N6K7k6n4l6jPj4l0j3
$$ 203 221 250 271 286 300 306 299 291 293 295 280 257 246 236 209 179 178 195 190 157 143 165 172 129 80 95 170 230 239 235 266 322 349 323 269 233 232 239 225 195 182
-865A82K1L5J9kj4j8oK4M8K6k8o0l8PK4J5Krk5l5j5J9L6L0K7K9J5j7m0k2J1J9mk7k1QL7M7
$$ 182 203 238 257 255 241 223 217 241 289 315 287 227 189 196 220 235 237 228 203 168 153 172 208 238 265 294 309 292 252 230 241 260 256 229 208 216 253 300
-870C00L7J1j2j9j9j8j1QK6K0lrJ1J7j5m9k7L0M5j0o7o3k0OMMJ8K1OkLJ2J3RP%lJ2K9J8k1
$$ 300 337 348 336 317 298 280 269 277 303 323 320 311 322 339 324 275 248 278 323 313 246 183 163 169 173 177 195 216 222 220 223 235 248 257 264 264 261 273 302 320 299
-875B99m3j9K9O1N0Om3n9k8J7K5MLK8K6k7o8m0J9L4Kj2RJ5j8l7oL5L4Lj1KPqj9qJ2J3ql0l1
$$ 299 256 237 266 327 377 383 340 281 253 270 295 299 302 330 356 329 261 221 240 274 276 264 273 288 270 233 227 262 296 299 288 290 297 289 270 262 274 287 279 249 218
-880B18j4OJ4QKKlj4j6PL0K0k6o0m0J6N5M0qm1l3mJ7J6lj6rK3M8L5j1m3k4K3M3J7j7j6PJ4
$$ 218 204 210 224 232 234 236 233 219 203 210 240 260 234 174 134 150 205 245 237 196 163 159 176 192 189 173 164 187 235 270 259 216 192 215 258 275 258 242 249 263
-884B63nk3j3PNk2l5oM4O2L1j7l3j4Lmk4k9rK0L4K4NKJ9K8Rk9n2m6j9RL3M5M1J7j2l3l8k3
$$ 263 258 235 222 229 234 212 177 171 215 277 308 291 258 244 247 243 219 190 181 201 235 259 264 266 285 313 322 293 241 195 176 185 218 263 304 321 309 276 238 215
-889B15JJ4Kj3qJ6K8K3J9K9K7om3m7j6J2Nk3m2k9NK7K6J2J1J9J8POK4L4J5j6l1k3j3pkKPK0
$$ 215 216 230 232 219 211 227 255 278 297 326 353 347 304 257 241 253 258 235 193 164 169 196 222 234 245 264 282 289 295 319 353 368 352 321 298 285 278 276 278 285 305
-894C05L8L4%l0k7pjqPM1M5Ml4k8Jlm3o3k4L8M9nn7m0K6N8J6m4m8kL2K4Olj3k2mM0N6J5m1
$$ 305 343 377 377 347 320 313 312 304 311 352 397 401 367 339 340 337 294 231 207 245 294 289 232 192 218 276 292 248 200 198 230 254 260 257 244 222 218 258 314 329 288
-899B88n4k4QJ5J7J9J7J6K4L5J6k8o1n0j3Nqk5k0JJ3J1J1J2P%PK1J2l5o6l7K7N7L4PJ1K5K1
$$ 288 234 210 218 233 250 269 286 302 326 361 377 349 288 238 225 230 222 197 177 178 191 202 213 225 232 232 239 260 272 237 171 134 161 218 252 259 270 295 316
-904C16Kk4n4n5OQ3Q8Qn0k0K8%p0q2l0RQK2N5N3Pl0k8k8l1NO9P1qo8l1M2N1J3jPj1m1k6J8
$$ 316 318 294 240 185 191 274 362 370 320 300 328 328 258 176 146 155 163 185 240 293 300 270 242 214 183 188 257 328 320 252 221 263 314 327 326 333 322 281 255 273
$$ [...]
-1605B57
##END=	
##END=	
