##TITLE=	ia9kf7w9Sa2u6ByUdYwmUw.32.ser
TM-VI-111 cosy

##JCAMP-DX=	6.0	$$ MestReNova 14.3.1-31739
##DATA TYPE=	LINK
##BLOCK_ID=	1
##BLOCKS=	2    
##ORIGIN=	Mestrelab Research S.L.
##OWNER=	hrzepa
##$MNOVA/LINK_BLOCK_TYPE=	ITEM	$$ NMR Spectrum
##$MNOVA/ITEM/POLYGON=	(XY..XY)
5321,5835
8722,5835
8722,8208
5321,8208
5321,5835
##$MNOVA/ITEM/Z=	0
##$MNOVA/ITEM/ANGLE=	0
##TITLE=	ia9kf7w9Sa2u6ByUdYwmUw.32.ser
##JCAMP-DX=	6.0	$$ MestReNova 14.3.1-31739
##BLOCK_ID=	2
##DATA TYPE=	MNOVA NMR VIEW DATA
##DATA CLASS=	MNOVA VIEW DATA
##$MNOVA/2D/THRESHOLD=	45.567546844482421875
##$MNOVA/ITEM/ZOOM/X=	-0.98001264966690615488,	11.003459999979801509
##$MNOVA/ITEM/ZOOM/Y=	-0.98001264966690615488,	11.003459999979801509
##END=	
##TITLE=	ia9kf7w9Sa2u6ByUdYwmUw.32.ser
##JCAMP-DX=	6.0	$$ MestReNova 14.3.1-31739
##BLOCK_ID=	3
##DATA TYPE=	nD NMR SPECTRUM
##DATA CLASS=	NTUPLES
##NUMDIM=	2
##ORIGIN=	Bruker BioSpin GmbH
##OWNER=	nmr
##.OBSERVE FREQUENCY=	400.41200205000001233
##.OBSERVE NUCLEUS=	^1H
##.SOLVENT NAME=	CDCl3
##.PULSE SEQUENCE=	cosygpqf
##LONGDATE=	2021/10/07 18:47:56.000
##.ACQUISITIONMODE=	SIMULTANEOUS (DQD)
##$ORIGINAL FORMAT=	Bruker XWIN-NMR
##$MNOVA/SCALES_VERSION=	9
##$PARAMETER FILE=	(acqu2s, ASCII, /private/var/folders/f6/rjf_tdyn2v98c5c0wvkgn4s80000gn/T/ia9kf7w9Sa2u6ByUdYwmUw/32/acqu2s, 0)
$$ ##TITLE= Parameter file, TOPSPIN		Version 3.2
$$ ##JCAMPDX= 5.0
$$ ##DATATYPE= Parameter Values
$$ ##NPOINTS= 121	$$ modification sequence number
$$ ##ORIGIN= Bruker BioSpin GmbH
$$ ##OWNER= nmr
$$ $$ 2021-10-07 18:56:52.077 +0100  nmr@CZC10666PP
$$ $$ /opt/topspin/data/agmb/nmr/Oct07-2021/32/acqu2s
$$ $$ process /opt/topspin3.2/prog/mod/go
$$ ##$ACQT0= 0
$$ ##$BF1= 400.41
$$ ##$FnMODE= 1
$$ ##$NUC1= <1H>
$$ ##$NusJSP= 0
$$ ##$NusT2= 1
$$ ##$NusTD= 120
$$ ##$O1= 2002.04999998732
$$ ##$SFO1= 400.41200205
$$ ##$SW= 12.0068636381483
$$ ##$SW_h= 4807.69230769231
$$ ##$TD= 120
$$ ##END=
$$ 
##$PARAMETER FILE=	(acqus, ASCII, /private/var/folders/f6/rjf_tdyn2v98c5c0wvkgn4s80000gn/T/ia9kf7w9Sa2u6ByUdYwmUw/32/acqus, 0)
$$ ##TITLE= Parameter file, TOPSPIN		Version 3.2
$$ ##JCAMPDX= 5.0
$$ ##DATATYPE= Parameter Values
$$ ##NPOINTS= 12	$$ modification sequence number
$$ ##ORIGIN= Bruker BioSpin GmbH
$$ ##OWNER= nmr
$$ $$ 2021-10-07 18:56:55.742 +0100  nmr@CZC10666PP
$$ $$ /opt/topspin/data/agmb/nmr/Oct07-2021/32/acqus
$$ $$ process /opt/topspin3.2/prog/mod/shimcntl
$$ ##$ACQT0= 1000000
$$ ##$AMP= (0..31)
$$ 100 100 100 100 100 100 100 100 100 100 100 100 100 100 100 100 100 100
$$ 100 100 100 100 100 100 100 100 100 100 100 100 100 100
$$ ##$AMPCOIL= (0..19)
$$ 0 0 0 0 0 0 0 0 0 0 0 0 0 0 0 0 0 0 0 0
$$ ##$ANAVPT= -1
$$ ##$AQSEQ= 0
$$ ##$AQ_mod= 3
$$ ##$AUNM= <au_zg>
$$ ##$AUTOPOS= <31 >
$$ ##$BF1= 400.41
$$ ##$BF2= 400.41
$$ ##$BF3= 400.41
$$ ##$BF4= 400.41
$$ ##$BF5= 400.41
$$ ##$BF6= 400.41
$$ ##$BF7= 400.41
$$ ##$BF8= 400.41
$$ ##$BYTORDA= 0
$$ ##$CAGPARS= (0..11)
$$ 0 0 0 0 0 0 0 0 0 0 0 0
$$ ##$CFDGTYP= 0
$$ ##$CFRGTYP= 9
$$ ##$CHEMSTR= <none>
$$ ##$CNST= (0..63)
$$ [...]
$$ 0 0 0 0
$$ ##$ShimPowMaxUC= (0..63)
$$ 130000 130000 130000 130000 130000 130000 130000 130000 130000 130000 130000
$$ 130000 130000 130000 130000 130000 130000 130000 130000 130000 0 0 0 0
$$ 0 0 0 0 0 0 0 0 0 0 0 0 0 0 0 0 0 0 0 0 0 0 0 0 0 0 0 0 0 0 0 0 0 0 0 0
$$ 0 0 0 0
$$ ##$ShimPowMaxUG= (0..63)
$$ 524287 524287 524287 524287 524287 524287 524287 524287 524287 524287 524287
$$ 524287 524287 524287 524287 524287 524287 524287 524287 524287 0 0 0 0
$$ 0 0 0 0 0 0 0 0 0 0 0 0 0 0 0 0 0 0 0 0 0 0 0 0 0 0 0 0 0 0 0 0 0 0 0 0
$$ 0 0 0 0
$$ ##$ShimPowRcbType= 3
$$ ##$ShimPowRes= (0..63)
$$ 1e-20 1e-20 1e-20 1e-20 1e-20 1e-20 1e-20 1e-20 1e-20 1e-20 1e-20 1e-20
$$ 1e-20 1e-20 1e-20 1e-20 1e-20 1e-20 1e-20 1e-20 0 0 0 0 0 0 0 0 0 0 0 0
$$ 0 0 0 0 0 0 0 0 0 0 0 0 0 0 0 0 0 0 0 0 0 0 0 0 0 0 0 0 0 0 0 0
$$ ##$ShimPowRng0= (0..63)
$$ 1 1 1 1 1 1 1 1 1 1 1 1 1 1 1 1 1 1 1 1 0 0 0 0 0 0 0 0 0 0 0 0 0 0 0 0
$$ 0 0 0 0 0 0 0 0 0 0 0 0 0 0 0 0 0 0 0 0 0 0 0 0 0 0 0 0
$$ ##$ShimPowRng1= (0..63)
$$ 1 1 1 1 1 1 1 1 1 1 1 1 1 1 1 1 1 1 1 1 0 0 0 0 0 0 0 0 0 0 0 0 0 0 0 0
$$ 0 0 0 0 0 0 0 0 0 0 0 0 0 0 0 0 0 0 0 0 0 0 0 0 0 0 0 0
$$ ##$ShimPowRng2= (0..63)
$$ 1 1 1 1 1 1 1 1 1 1 1 1 1 1 1 1 1 1 1 1 0 0 0 0 0 0 0 0 0 0 0 0 0 0 0 0
$$ 0 0 0 0 0 0 0 0 0 0 0 0 0 0 0 0 0 0 0 0 0 0 0 0 0 0 0 0
$$ ##$ShimPowRng3= (0..63)
$$ 1 1 1 1 1 1 1 1 1 1 1 1 1 1 1 1 1 1 1 1 0 0 0 0 0 0 0 0 0 0 0 0 0 0 0 0
$$ 0 0 0 0 0 0 0 0 0 0 0 0 0 0 0 0 0 0 0 0 0 0 0 0 0 0 0 0
$$ ##$ShimSysFunc= (0..63)
$$ 1 2 3 4 5 7 9 11 15 16 8 10 12 14 6 17 13 18 19 20 0 0 0 0 0 0 0 0 0 0
$$ 0 0 0 0 0 0 0 0 0 0 0 0 0 0 0 0 0 0 0 0 0 0 0 0 0 0 0 0 0 0 0 0 0 0
$$ ##$ShimSysMatrix= 0
$$ ##$ShimSysType= 1
$$ ##$TFXNUM= 0
$$ ##$TRIPLO2= 0
$$ ##$VTU= 2
$$ ##$VTUETH= <149.236.99.20>
$$ ##$VTUTY= <no>
$$ ##$WBREFAM= (0..15)
$$ 135 116 100 100 100 100 100 100 100 100 100 100 100 100 100 100
$$ ##$WBREFLM= (0..15)
$$ 0 0 0 0 0 0 0 0 0 0 0 0 0 0 0 0
$$ ##$WBREFPH= (0..15)
$$ 71.66 -68.25 0 0 0 0 0 0 0 0 0 0 0 0 0 0
$$ ##$WBSGU= (0..15)
$$ 0 0 0 0 0 0 0 0 0 0 0 0 0 0 0 0
$$ ##$XFAC= 2
$$ ##END=
$$ 
##$DECIM=	4160
##$DSPFVS=	20
##.ACQUISITIONSCHEME=	NOT PHASESENSITIVE
##NTUPLES=	nD NMR SPECTRUM
##VAR_NAME=	FREQUENCY1,	FREQUENCY2,	SPECTRUM
##SYMBOL=	F1,	F2,	Y
##.NUCLEUS=	1H,	1H
##.OBSERVE FREQUENCY=	400.41200205000001233,	400.41200205000001233
##VAR_TYPE=	INDEPENDENT,	INDEPENDENT,	DEPENDENT
##VAR_FORM=	AFFN,	AFFN,	ASDF
##VAR_DIM=	512,	512,	262144
##UNITS=	HZ,	HZ,	ARBITRARY UNITS
##FIRST=	4405.895418600002813,	4405.895418600002813,	0.17919285595417022705
##LAST=	-392.40686505384644533,	-392.40686505384644533,	0.34199950098991394043
##MIN=	-392.40686505384644533,	-392.40686505384644533,	0.0007456290186382830143
##MAX=	4405.895418600002813,	4405.895418600002813,	4176.6748046875
##FACTOR=	1,	1,	0.0046450820368702508065
##PAGE=	F1=4405.9
##FIRST=	4405.895418600002813,	4405.895418600002813,	0.17919285595417022705
##DATA TABLE=	(F2++(Y..Y)), PROFILE
$$ [...]
##PAGE=	F1=2264.97
##FIRST=	4405.895418600002813,	4405.895418600002813,	0.19633254408836364746
##DATA TABLE=	(F2++(Y..Y)), PROFILE
697A03l4J6L8K7j06J44M2J65j74j03P2J081N03K8j016m89m5Oj04L8rm4j28P1J7Q1j26O2R9
$$ 103 69 85 123 150 44 188 230 395 221 118 190 1271 1774 1802 786 297 252 258 154 192 183 139 11 82 99 180 54 116 215
425B15m8j42K8K1L2k7Q2j17K8N5k0k4l4J2J16p4no8J05j6J22K2o7j32j8J3J30j16j1J8R5q3
$$ 215 167 25 53 74 106 79 161 44 72 127 107 83 49 61 177 103 98 30 135 119 241 263 196 64 46 59 189 73 62 80 175 92
124I2L8M9l1m7q9M7N3n1J3l2k4M9nP0J03p5q9R6p8p6P3j9l0J31q7k4J50p4l0K0p4M1N1o4Q8
$$ 92 130 179 148 101 12 59 112 61 74 42 18 67 62 132 235 160 71 167 89 13 86 67 37 168 81 57 207 133 103 123 49 90 141 77 165
-205A65p8J0N8j8Ll1J2O3Oo7j9p6j1O1k4N6M3l6K0k7
$$ 165 87 97 155 137 140 109 121 184 190 123 104 28 17 78 54 110 153 117 137 110
-392A10
##PAGE=	F1=2246.19
##FIRST=	4405.895418600002813,	4405.895418600002813,	0.20909227430820465088
##DATA TABLE=	(F2++(Y..Y)), PROFILE
4406F1N0m2Knj9R0m0nj6K7j0K1l1j2Nj9J2j5J24o6lq2lkQN5j8rL8k5J18lO4j85n8M1nR1Lq8
$$ 61 111 69 71 66 47 137 97 92 76 103 93 114 83 71 76 57 69 54 178 112 109 27 24 22 30 85 67 58 96 71 189 186 250 65 7 48 43 134 137 49
4030D9O8r0O3o0N9L5p3%pK8K8l6k0J02Q3r9n6QJ32j19J47j28o0O4K3rm2m6O9k7m0M5O5o1m
$$ 49 117 27 90 30 89 124 51 51 44 72 100 64 44 146 229 130 74 82 214 95 242 114 54 118 141 132 90 44 113 86 46 91 156 95 91
3702I1L4O1r3kK0M4m4n8N5Kk4K3P2o8J17j28J22j61k4J32r9Q1Oj27J58N2p0pl7pn5o1Q2K6
$$ 91 125 186 93 91 111 155 111 53 108 110 86 109 181 113 230 102 224 63 39 171 72 153 159 32 190 242 172 165 128 121 66 5 87 113
3382A13j01J75k5J77j4P87p28R2r4n0n3j14j41J8J9M4J88J07l91J90j39K58K02J8J861K203
$$ 113 12 187 162 339 325 1112 384 476 382 332 279 165 24 42 61 105 293 400 9 199 60 318 520 538 2399 4602
3138D602j958J009k747m59k92K7L3n5l1J37P8j06M74R17j11J14j515J46J081j88N0n40m15
$$ 4602 2644 3653 906 447 155 182 215 160 129 266 344 238 712 1629 1518 1632 117 263 1344 1156 1206 666 251
2922B51%j1p2j09K3n9J50j3k6p2N3m6L1ok2J14j22R7o4R1j15P4n9lM9q3P0l5L7m1J02j42M9
$$ 251 251 240 168 59 82 23 173 160 134 62 115 69 100 94 72 186 64 161 97 188 73 147 88 85 134 51 121 86 123 82 184 42 91
2612I1l5l9K2J10L6r7o0J8l0M8n3L6M6N6q4J11oj36K3R8L0j07O7m6k8n6K9L5MJ15K8r4l0K3
$$ 91 56 17 39 149 185 88 28 46 16 64 11 47 93 149 65 176 170 34 57 155 185 78 145 99 71 15 44 79 83 198 226 132 102 125
2293A25%L4lj03l8L7Q1Km9j2l0R9rj14L5J1L2Qo7j3J49m5K6m8l5j8N6m8LJ13M1j02K8j34J08
$$ 125 125 159 156 53 15 52 133 135 86 74 44 143 134 20 55 66 98 106 39 26 175 130 156 108 73 55 111 63 66 179 220 118 146 12 120
1964A20m9k4N9mp4J5M7L8J6n5N0j22J20M3j4lm8P7j36k2L38J57r0N7k81r2m0k6m1N7J4L2n6
$$ 120 71 47 106 102 28 43 90 128 144 89 139 17 137 180 166 163 115 192 56 34 372 529 439 496 215 123 83 57 16 73 87 119 63
1655F3Ql6Q6j8pQ6r7m1N9l9J12o7m1m6O1m3Q8r1P8o6nO5J8m4j3J01qj16N6n0j2jQ3Q5k2L5
$$ 63 71 35 121 103 96 182 85 44 103 64 176 109 68 22 83 40 128 37 115 49 44 109 127 83 70 171 163 47 103 53 41 40 123 208 186 221
1317B21n6n2N1n1%J0r4J35o5K01j10l6j19KR5k5R1L0j34l6J50j04N0k0j15Q7J12j29JK1l6
$$ 221 165 113 164 113 113 123 29 164 99 300 190 154 35 37 132 107 198 228 94 58 208 104 154 134 19 106 218 89 90 111 75
1025G5Q5j1j5Kq6L3N2j02J0P1m7j0J52j40M4j6J5p7L9noJ4j5n3Q3j9LL0m5Q7o1o4R7k3k2J6
$$ 75 160 149 134 136 50 83 135 33 43 114 67 57 209 69 113 97 112 35 74 69 63 77 62 9 92 73 76 106 61 148 87 23 120 97 75 91
687I1k7O4J4q0O8P4K17j57j56L2O31M04l0n64l48K3m7n7qO5m4j45O8K6O9j45O5J15l1j44J2
$$ 91 64 128 142 62 130 204 421 264 108 140 771 1175 1145 581 233 256 209 152 144 209 165 20 88 114 183 38 103 218 187 43 55
396E5L8J2qP0j40M6L6L7m5o4O1J18r5l8p5R6J8J10Jl9j16l9L6J23j21mNP2r6J08L2m3n5p9
$$ 55 93 105 97 167 27 73 109 146 101 37 98 216 121 83 8 104 122 232 233 194 78 39 75 198 77 73 78 150 54 162 194 151 96 17
77A7M5Mm5P8k9l5K3PJ8J23p7l3Q5o3o9M5k4m4J31p7kJ18q1j8K2n7P7K7p9N8o7l6Q2mJ5j7k
$$ 17 62 66 21 99 70 35 58 65 83 206 129 96 181 118 49 94 70 26 157 80 78 196 115 97 119 62 139 166 87 145 78 42 124 120 135 118 116
-270A16O7L8j23qm9J4L2l5L1L7L6k6j3
$$ 116 183 221 98 90 41 55 87 52 83 120 156 130 117
-392A17
##PAGE=	F1=2227.41
##FIRST=	4405.895418600002813,	4405.895418600002813,	0.36813452839851379395
##DATA TABLE=	(F2++(Y..Y)), PROFILE
4406F9J2L7l4j7l8O9Nk8n0P7Lj8M1Jl2p4J7j0J73q2%j00lJ6pN7k0k4M4j0J20k0N8j76l0J5
$$ 69 81 118 84 67 29 98 103 75 25 102 105 87 128 129 97 23 40 30 203 121 121 21 18 34 27 84 64 40 84 74 194 174 232 56 26 41
4068D1k3J34Mj29R5o8L6p2O3JOpm9O5Jm1%J10L4o8k5l8J39j48J36q3n5O5L3l1mo2J0M7l0J6
$$ 41 18 152 156 27 122 54 90 18 81 82 88 81 32 97 98 57 57 167 201 133 108 70 209 61 197 114 59 124 157 126 122 60 70 117 87 103
3730A03L9m9J8j5N1q3K7J8M5m6l2J5j7J1M4M8m1J18j60J70j79j9R2r4J04kj12J66K3q9J1j1
$$ 103 142 93 111 96 147 64 91 109 154 108 76 91 74 85 129 177 136 254 94 264 85 66 158 64 168 166 54 220 243 154 165 154
3429A54k1q4l8O6K4q9J31k9J63kP86o29J47q6q1O3j36J30l79l5K8O8R5r4K0j17J91L70k62
$$ 154 133 49 11 77 101 12 143 114 277 275 1061 432 579 493 412 475 339 469 90 55 83 151 246 152 172 55 246 616 354
3157C54R38K402k536n65M1j50l83QNoO2J11L7o7R40O03j1m39j145J19Q51l9J79n39n13J3p1
$$ 354 1292 3694 1158 593 634 484 101 109 114 108 170 281 318 251 1191 1794 1783 1344 199 318 1169 1130 1309 770 257 270 199
2903A99oj70Q1o2J24j9n2j8L6l8J5Mn8J21r1J00p6O6m7L4n8M6L2j21N6OL0j2M2j34P4o4k9
$$ 199 193 23 104 42 166 147 95 77 113 75 90 94 36 157 66 166 90 156 109 143 85 131 163 42 98 104 134 122 164 30 104 40 11
2594A1M5N9N8r9l2K4m0L4n2K2K5P5p2J18j1o4n8J44%r4K8Jm2n7J9M7pR4J8r1rj7J6P2J8j02
$$ 11 56 115 173 74 42 66 26 60 8 30 55 130 58 176 165 101 43 187 187 93 121 122 80 23 42 89 82 176 194 103 94 77 93 165 183 81
2256H1m2j0Q9K0k0l9nR9k4j29N5nJ3Ll7k4J59l5j2k1l8m5J09o6KJ46K0j20M1j36P6o0M0M7
$$ 81 39 29 118 138 118 79 74 173 149 20 75 70 83 86 49 25 184 149 137 116 78 33 142 76 78 224 244 124 165 29 105 45 85 132
1936A32j8p7PP2L0M9j41Q0j11J21N1m2J4m9Q2r8J24K24j91m7J40j53j58J14r8l0O3j9O7o5
$$ 132 114 37 44 116 146 195 54 134 23 144 195 153 167 118 200 102 226 450 259 212 352 199 41 155 57 27 90 71 138 73
1655G3j5rN5l7L4P7j24K0M9k9O3n6k3m9N6k4Q1q9P2n9k4M5P7o2l6Q8J2j24M3m4J2J9M7R0M
$$ 73 58 49 104 67 101 178 54 74 123 94 157 101 78 29 85 61 142 53 125 66 42 87 164 102 66 154 166 42 85 41 53 72 119 209 213
1326B13pm1q8N7j9l0K2r7J14lJ97r2o8j14oO3l4J17M8j54k4J36r9O3k0o4J4J46j50J8N9p8
$$ 213 206 165 77 134 115 85 107 10 124 121 318 226 158 44 38 101 67 184 232 78 54 190 91 154 134 70 84 230 80 98 157 79
1025G9J21n2n1Rn3P6J8j06RP4j03J5J63j15K0LJ6p0QPJ5K4m1j6N4Jl9J3LO9o9k5N3l2j9N6
$$ 79 200 148 97 106 53 129 147 41 50 124 21 36 199 84 104 107 123 53 61 68 83 107 66 50 104 105 66 79 82 151 82 57 110 78 59 115
687A15p2R1ln2qR1K47j12j86k7J10L62m0j10j89on7j0m8J22m1j30N7L0L6j36N9J16j2j32m
$$ 115 43 134 131 79 71 162 409 297 111 84 194 556 516 406 217 211 154 144 96 218 177 47 104 134 170 34 93 209 197 65 61
396F1N5j8J8N8j40K9K2Q1n7p9R8J15j10o2l6L9N3P8j7rq0n3L4J06j02nlN9r0J51j3m0m4p8
$$ 61 116 98 116 174 34 63 85 166 109 30 128 243 133 71 35 74 127 205 188 179 99 46 80 186 84 79 76 135 45 196 183 143 99 21
77B1O1j0k1O7j7j5l1Ok4J28n5L7K8m7n5K8l6k6Q6m7K8O4p5rJ8k9J13k1p3J7n6k9N5L0K3k7
$$ 21 82 72 51 118 101 86 55 61 37 165 110 147 175 128 73 101 65 39 125 78 106 170 95 86 104 75 188 167 94 111 55 26 81 111 134 107
-261A07QN9O8j53l2jM1k2j7OjJ19o9J0
$$ 107 115 174 242 89 57 56 97 75 58 64 63 182 113 123
-392A23
##PAGE=	F1=2208.63
##FIRST=	4405.895418600002813,	4405.895418600002813,	0.57188194990158081055
##DATA TABLE=	(F2++(Y..Y)), PROFILE
4406F5k7J10m1m9rPL3l2oM8J3o8R6M2p8p6j7PK06j06J0r0j9M9l9N2k1k8M2MJ01j6J7j32jK2
$$ 65 38 148 107 58 49 56 89 57 51 99 112 44 140 182 104 28 11 18 224 118 128 38 19 68 29 81 60 32 74 78 179 163 180 48 47 69
4068F9n3J29K1j59J14n6L4r2P1m5Q8lk2J7j9k2M0P1k3l3J6p9J25j40J03m7k4N2M2o8K4p2m0
$$ 69 16 145 166 7 121 65 99 7 78 33 121 118 96 113 94 72 112 183 160 127 143 64 189 49 152 105 81 133 175 107 131 59 19
3758A9J23j5j4J3k8M2p0M0q9N7K9M9j7l3l6l0M1P4Kj9J04j74K22j93mN0r5J23j5p9J61k5r3
$$ 19 142 127 113 126 98 140 70 110 21 78 107 156 139 106 70 40 81 155 157 138 242 68 290 97 93 143 48 171 156 77 238 213 120
3448A20M0K1m7p4l1M6Qo2P5k2J32kP04m71K04m9r1K08J85L22j074k0J12j41K50kk19J09j53
$$ 120 160 181 134 60 29 75 83 21 96 74 206 204 908 437 641 592 501 709 894 1216 142 122 234 93 343 341 122 231 78
3176G8O88L97M55L895J372j304n257L9k68m4J10m8Q4J07l1k9J186J167J64r71j363j7M78o
$$ 78 766 1163 1618 5513 6885 5581 324 363 95 51 161 113 197 304 273 244 1430 2597 2761 1790 427 410 888 882
2950H82L15n22l78n9p5K2j50P9m8R8m1m3J9Pk3oJ7p5J10o7J23j11M7Nml6R3Kp2l9M9K1K3l0
$$ 882 1197 675 297 238 163 185 35 114 66 164 123 80 99 106 83 77 94 19 129 62 185 74 121 126 122 86 179 181 109 70 119 140 163 133
2631A33j15Q5m7m4O7pQ3r4MJ9k6J8n7KnQ2n8J26j3Qr9J38j9p3ML1o9m9K0N3j4O5J2p8Nm9J5
$$ 133 18 103 56 12 79 72 155 61 65 84 58 76 19 21 16 98 40 166 153 161 62 200 181 108 112 143 74 25 45 98 84 149 161 83 88 39 54
2284E4J06N4j16m1l9P9L6jn9K5R4k9j19N1qk0oj5j2J47j9m9mj9o5J31o2KJ54jj25N1j17L0
$$ 54 160 214 98 57 18 97 133 132 73 98 192 163 44 95 87 67 61 46 34 181 162 113 109 90 25 156 94 96 250 249 124 175 58 88
1964H8n0P3M1k3q9O2K8J7Q4k10R6r2J22O0o0K9n4P6m8K27L52k24m56J34j5r5J43j36l0N2l6
$$ 88 38 111 152 129 40 102 130 147 231 21 117 25 147 207 147 176 122 198 150 377 729 505 49 183 168 73 216 80 50 102 66
1673F6R1q7OpK0k7M3O4j21N0M7k4Ol0j7l3N5j6N9p2N7n0m2M1J15p8l0N4K0j21N1m5J3L7J6
$$ 66 157 70 76 69 89 62 105 169 48 98 145 121 127 97 80 47 102 86 145 73 130 80 38 79 194 116 86 140 160 39 90 45 58 95 111
1345A11R2J3k8k0q9J3jk0L4p1N5M3J75o9p6j12K8J0m7J32N2j72OJ10q8N6nj7n9J79j57L4Q2
$$ 111 203 216 188 168 79 92 91 71 105 34 89 132 307 238 162 50 78 88 41 173 225 53 59 169 81 137 132 115 56 235 78 112 194
1035A94j20J49q2p7Nj3J14k1j00RP1j10OJ55r1NK7J6n7k4J4K4M1o3K8K3K5p4j1K9M3o4RKl0
$$ 194 74 223 141 64 69 56 170 149 49 58 129 19 25 180 89 94 121 137 80 56 70 94 135 72 100 123 148 74 63 92 135 71 80 82 52
706E2NQ4j11J03j1k5o0O8K48m3j56n8K81J71o2j36j98k4j9L1p9J49m2r6M9K8mj07M7J02Rj30
$$ 52 57 141 30 133 122 97 37 105 353 310 154 96 377 548 486 350 152 128 109 140 61 210 168 72 121 149 145 38 85 187 196 66
406F6MO7l7L7M7j35rL2Q9n8p6J13J11j09p9j0nP9M2l5J9l5n5J3Q4p0pNN1o6J46p3k1k1p2O4
$$ 66 70 137 100 137 184 49 40 72 161 103 27 140 251 142 63 53 48 127 169 134 153 118 63 76 160 90 83 88 139 73 219 146 125 104 32 96
68I6J0qL4%Mq4kk1Q6j0R4m4l9l3K0n2PJ9kO1Jn9nNRJ42q2m8l0l7N8k7N6K2n9M1L1R9j36j02
$$ 96 106 98 132 132 136 52 50 29 115 105 199 155 116 83 103 51 58 77 75 136 137 78 73 78 87 229 147 99 69 32 90 63 119 141 82 123 154 253 117 15
-308A5O1N8q3Nmk6J63j00M0
$$ 15 76 134 51 56 52 26 189 89 129
-392A29
##PAGE=	F1=2189.85
##FIRST=	4405.895418600002813,	4405.895418600002813,	0.70414274930953979492
##DATA TABLE=	(F2++(Y..Y)), PROFILE
4406F2m8J38j0q6J7k5J8k5Q2k6Rr5J07R6j15l2m7L7J75j29K1m9m4P9q5P4m6j1L0NP7%m3p2
$$ 62 14 152 142 56 73 48 66 41 123 97 106 11 118 214 99 67 20 57 232 103 124 75 31 110 25 99 53 42 72 77 154 154 111 39
4087C9L0L3n6P1M9j21P4n9O1j05O5n5J12J5j5k3k3pQ0K5p8kP1j03P4r0N3k5K3L4M4j12L5o6
$$ 39 69 102 46 117 166 45 119 60 121 16 81 26 138 153 138 115 92 85 165 190 112 110 181 78 152 62 115 90 113 147 191 79 114 48
3767D8J1R3Lk5Lk2N7q5ll4QM6O3J4l6q7j6K8J11m8nP5j71K66j92J1Nq3J25k3m0J41p9q2O7
$$ 48 59 152 155 130 133 111 168 83 80 46 54 100 163 177 141 54 38 66 177 129 124 199 28 294 102 113 118 35 160 137 97 238 159 77 144
3439A44O0q0l3l8K7Nn1K5QQ2k0N56k74K38%p6L74O59N42j952k7K35r5K62q0m13L27j02N44
$$ 144 204 124 91 53 80 85 34 59 67 149 129 685 411 649 649 573 947 1606 2148 196 169 404 309 571 491 78 405 303 847
3166H47Q96J694N775L270p59j0645r72P2J2J69p7k3Q9j26m6J150J931M01o64k278k16J46q8
$$ 847 1743 3437 9212 12482 11723 1078 106 178 190 359 282 259 348 222 176 1326 3257 3658 2994 716 500 646 558
2950E58L79n44j17l8r7Mr7O1k0Q4o6j0J4rk6rK6l0M4n4J56j32PL6k1j0J30k8k9j17Q4J7L9
$$ 558 937 393 276 238 141 145 48 109 89 173 107 97 111 102 76 67 93 63 107 53 209 77 84 120 99 89 219 191 162 45 129 146 185
2641A85r0r4Q6k3k7O7o1R4o8K6Jj5K7o4lNOk3J15j0O8j04R8k7m9lK3p8m2L7M5j1M7po0J3j8
$$ 185 95 1 87 64 37 104 43 137 69 95 96 81 108 44 41 46 52 29 144 134 202 98 196 169 120 117 140 62 20 57 102 91 138 131 71 84 66
2293F6m0J24Q7j35l5n4O8M0Lo1M0R2k6j03M2qn2j5%J1J23Nq6J1Np7J31l9nJ38j8j19O2j02
$$ 66 26 150 237 102 67 13 81 121 124 63 103 195 169 66 108 100 48 33 33 44 167 172 86 97 102 25 156 117 112 250 232 113 175 73
1974G3mj6O8L6j6j00J09j9kJ18k00M3o1J12P2o5L9n9O5j1K98N10j13n69k86J02K3J09j41m6
$$ 73 69 53 121 157 141 41 150 131 129 247 47 90 29 141 213 148 187 128 193 182 480 990 877 308 22 124 147 256 115 69
1692F9L8j7Q0j06L4oj8JK9N3r9M6O0k7m2Jk4j0O0j1K6m4L9m8m4M2J21q4j4K7J4j11P2m4j3
$$ 69 107 90 170 64 98 92 74 75 104 157 58 104 164 137 95 96 72 62 122 111 137 93 132 84 40 82 203 119 105 132 146 35 107 63 50
1364E0N4QQ3Nl2Ko1n9JK5L9m7KN6J46m5o6j09N8%o7J23M4j73L2Q3p6L2J5K6r2J73j48M6R0
$$ 50 104 112 195 200 168 170 109 50 51 76 115 68 70 126 272 227 161 52 110 110 43 166 210 37 69 152 76 108 123 149 57 230 82 128 218
1035B18j53J57r3r3kJ9J43n1r1OP2r3MJ13p4ON1J4m1l6jK6N2p2O8j3N7r0m5K9J8n4L2m3j1
$$ 218 65 222 129 36 34 53 196 145 54 60 132 39 43 156 82 88 139 153 112 76 75 101 153 81 149 136 193 103 58 87 105 51 83 40 29
706B9K7J05j29Q7nKo7kK09L8q1j3O55K60q8m59n44M5J7N5r4J37m8m9L8K9l6p1L2P3K7j35L1
$$ 29 56 161 32 119 114 116 49 47 256 294 213 200 855 1115 1027 568 24 69 86 141 47 184 136 87 125 154 118 47 79 152 179 44 75
396G5P4k8L9L6j33m6N9O1n2n5R8J10r1q5Lk6P8J8n4M5Pn7j3O7l2pK9L0m3J19j34PLm3M2K6
$$ 75 149 121 160 196 63 17 76 137 85 30 128 238 147 62 65 39 117 135 81 126 133 76 63 130 98 91 120 150 107 226 92 99 102 59 101 127
58A27NJ1J5J7j32pJ4J2M6J25j01m9kJ6o6L6m4M5R2n6l4rj3N1J57j38k3p0M2O7l3L9J0r2P9
$$ 127 132 143 158 175 43 36 50 62 108 233 132 83 81 97 31 67 23 68 160 104 70 61 48 99 256 118 95 25 67 134 101 140 150 58 137
-270A37nJ25j05r2L9O2j05j8NL8R6j01N4
$$ 137 132 257 152 60 99 161 56 38 43 81 177 76 130
-392A30
##PAGE=	F1=2171.07
##FIRST=	4405.895418600002813,	4405.895418600002813,	0.76632952690124511719
##DATA TABLE=	(F2++(Y..Y)), PROFILE
4406F4k8Q9M3r4J1j1k1k1J38p6j4l7K4J52j19qm5N4J19j40K2J8o9R7j34J12p6PJ9qO4J2q2
$$ 64 36 125 168 74 85 74 53 32 170 94 80 43 67 219 100 92 47 101 220 80 102 120 51 148 14 126 50 57 76 68 132 144 62
4096F2j7M7L5n4MP8q3N3q2R5q5M0k9P8L0k3m4j2pJ12j3j24J7J42j16%j4Kj8O9K4L1j44K1k0
$$ 62 45 92 127 73 77 155 72 125 43 138 53 93 64 142 172 149 105 93 86 198 185 61 78 220 104 104 90 92 74 143 167 198 54 75 55
3767E5O5K8J7j1K7n0O0n4o9K9p5N9Q4M1l1j17J9m3J49q0jL6j24K56j74K2l5n1J06k1rJ10j10
$$ 55 120 148 165 154 181 131 191 137 68 97 22 81 165 206 175 58 77 34 183 103 102 138 14 270 96 118 83 32 138 117 108 218 108
3458A08p4Q6R6j10J6m8J3On0KL8M3n0L64o9K27M3m6N49J204P74k846j21L72j26K24j31m22
$$ 108 34 120 216 106 122 74 87 93 43 45 83 126 76 440 371 598 641 595 1144 2348 3122 276 155 527 401 625 494 72
3195G2M14N3K05Q97K460O701L657M33j3293j403J25NJ81j09q2N3j73J06J018K081M63rk914
$$ 72 486 539 744 1641 4101 10802 14459 14892 1599 196 321 326 507 398 316 369 196 302 1320 3401 3864 3855 941
2979I41l74J2k43L59n57N6R4j56j9p1N6RO8o3j1JMn7OL0Plm5J79j04p1M3nKJ53m9oj42Q7K4
$$ 941 567 579 336 695 138 194 288 132 113 42 98 107 175 112 101 102 106 49 55 85 92 89 44 223 119 48 91 86 88 241 192 186 44 131 155
2650A55J8j10n2N3rK2N0p2O3j7K8l3pN8o7k1K2o8L7O0lJ08q3M4k4k7Pk2m2n3N8K1MM9l7m4
$$ 155 173 63 11 64 55 77 127 55 118 101 129 96 89 147 80 59 81 13 50 110 107 215 132 176 152 125 132 110 68 15 73 94 98 147 110 66
2312F6K2K8n7Q1J02j51j9o3O7K7rl4K6R2j8q0K9pp4j3J7J5R8L8j01QJ6q8J24Jk5J09l1j05
$$ 66 88 116 59 140 242 91 72 9 76 103 94 60 86 178 160 80 109 102 28 15 32 47 145 183 82 90 106 18 142 143 118 227 196 91
1993I1P8r2k0RN3K2Jr5J24n0k1J38j43l5j3P6Q6n7M3o1N6ML29O24J7o40l52j00J32O7j22p5
$$ 91 169 77 57 66 119 141 142 47 171 121 100 238 95 60 47 123 209 152 195 134 190 194 523 1147 1164 524 172 72 204 271 149 74
1692G4L9J5M5j10N2jn4J6K2M2q2L3Q5l3o8J9l9J8O7lj2j6K6n9k4M0R7p9NJ1lr6R2l1n7P6K2
$$ 74 113 128 173 63 115 114 60 76 98 140 58 91 176 143 75 94 55 73 140 137 125 109 135 76 52 92 189 110 115 126 123 27 119 88 31 107 129
1345A29N6j3k5J7k5j20L0M8K9k1k9K7J19k0n0r6P1K2r3J09K6j39K4O4o7JL2O0p3J20j28N7
$$ 129 185 172 147 164 139 19 49 97 126 105 76 103 222 202 152 56 127 149 56 165 191 52 76 140 73 74 106 166 93 213 85 142
1044A42Q2j66J40q4r8J6J2J57o4q2mQ3r0K7N6o1K4P1Ok2l6k6K3N2o0R1n1R2r0p6NPn8M8n3
$$ 142 224 58 198 114 16 32 44 201 137 55 51 134 44 71 127 66 90 161 167 145 109 83 106 158 98 189 138 230 140 64 69 76 18 66 13
716A3K2J9J17j30N0K1K5p7J8N8J09J5O4Q45M08r6o18p20Kn6M8q1R1o1JK1L8n1l6J4L3M2j10
$$ 13 35 54 171 41 91 112 137 60 78 136 245 260 324 1169 1577 1481 863 143 145 89 137 56 147 86 87 108 146 95 59 73 106 148 38
406C8L8O9RL2K4j23m2L6K3m4j9N5J11o4p6Ol4N6J6o5O3K7n9k8O0OnN5rk2Q0j74K1K7jJ7K1
$$ 38 76 145 154 186 210 87 45 81 104 60 41 96 207 143 67 73 39 95 111 46 109 136 77 49 109 115 110 165 156 134 214 40 61 88 87 104 125
58A25K1KK9J8j70ML8l0P8J22j20q0L4On2L7l9L2J15q6j1k7k5R3J46j63j5n6R7L3j2J2j0r0
$$ 125 146 148 177 195 25 29 67 37 115 237 117 37 71 77 25 62 23 55 170 84 73 46 21 114 260 97 82 26 123 156 144 156 146 56
-261E6Q5j6J34r2n3%N8q8o0RQ7L0o9L8
$$ 56 141 125 259 167 114 114 172 84 24 33 120 150 81 119
-392A19
##PAGE=	F1=2152.29
##FIRST=	4405.895418600002813,	4405.895418600002813,	0.71589398384094238281
##DATA TABLE=	(F2++(Y..Y)), PROFILE
4406F1k5L9R2o3k2J1m2JJ24r2m9L1m2J70p2l0k5P1N0j33RR4p6Q6j52J26q1J0Ok7P0Pn0jM0
$$ 61 36 75 167 104 82 93 51 52 176 84 35 66 24 194 122 92 67 138 188 55 64 158 82 168 16 142 61 71 77 50 120 127 77 76 116
4077A16K4m8n6R4n1O5j23J21m2J3k1M5K7l7m0J1k3J31l7j59M4K00j26o8O7m2k2R4L3kj40k0
$$ 116 140 92 36 130 79 144 21 142 100 113 92 137 164 127 87 98 75 206 169 10 54 254 128 60 127 85 63 157 190 188 48 28
3777B8O6P1l2K2K3O8r3N0qj04M4j21L5J02O9k0j20M4j07J47p2j2kl0J72j45L5o6j1P2nOO9
$$ 28 94 165 133 155 178 246 153 203 195 91 135 14 49 151 220 200 80 124 17 164 92 80 78 48 220 75 110 44 33 105 100 106 175
3467A75o7r9J10R0j25O0o0J2j8k0KL3M1n5J49R9J66P0j5P13J713R88l548j89M25j3k32j58
$$ 175 108 9 119 209 84 144 84 96 78 58 60 93 134 79 228 327 493 563 548 1261 2974 3962 414 225 650 637 405 247
3204B47j18K70J81r3L47K413N130K247J917j1122j012K1m6J40j54p0L3j17L25J273J725J17
$$ 247 129 399 580 487 834 3247 8377 10624 12541 1419 407 428 382 522 368 298 331 214 539 1812 3537 3654
2997C654L49l034m00J94l71K21l19j46J80j66j5j10M9K8L6j5o6J4L1j08K5L5L1j6k8J62m2
$$ 3654 4003 969 569 763 392 613 294 148 328 162 147 37 86 114 150 135 69 83 114 6 31 66 97 81 53 215 173
2744A73j56K8L9jJ52n1oj10N7M4m3q2k8K9J9O2J4o4K1M9J6q1%J04o5n9L3%j4qjJ27m3j0k0
$$ 173 17 45 84 83 235 184 178 68 125 169 126 44 16 45 64 126 140 76 97 146 162 81 81 185 120 61 94 94 80 72 71 198 155 145 125
2415A25j1L8r1L3p6O4j3K8O5o4l1L4O0n3K5Q5j49Lm7M9Lj5Qj6Q7mn6J3jn6J1J8k4P5P6p7k0
$$ 125 114 152 61 94 18 82 69 97 162 98 67 101 161 108 133 218 69 72 25 74 77 62 70 54 141 137 81 94 93 37 48 66 42 117 193 116 96
2068I6Kp8R6N1n3P3l9r1J05q6j4RL7kJ9o5R8m6l4J24o4j05M5J8R5l7M1n7N3j0L06O56J47o44
$$ 96 98 20 116 167 114 187 148 57 162 76 62 71 108 106 125 60 158 112 78 202 138 33 78 96 191 154 195 138 191 181 487 1143 1290 646
1749F46l36k87K15K4r1j12O6L9%r6N7Np9OL5K9q5K9J12l8o5J2n6N3P3Nm4MJ8q2J2L8M5n6K2
$$ 646 310 23 238 262 171 59 125 164 164 68 125 130 51 57 92 121 36 65 177 139 74 86 30 83 156 161 117 121 139 57 69 107 152 96 118
1420A18mj9p6J04qj08J10M2J3l2j3K2J3j41P2K8J1Ql6l2R6Om1p2P0N5j16R9Jr5LN6o7k3L6
$$ 118 114 95 19 123 115 7 117 159 172 140 127 149 162 21 93 121 132 140 104 72 168 174 133 61 131 186 70 169 170 75 78 134 67 44 80
1091H0Q5l3N3j05P3O0j61J08o1p6L3j7J45n7p6k5J02r5O4%m7N1P9knk9n2J6L8k2Q7q7J28p9
$$ 80 165 132 185 80 153 213 52 160 99 23 56 39 184 127 51 26 128 33 97 97 50 101 180 178 173 144 92 108 146 124 211 124 252 173
772A73j00k5K1m6J6K3jrJ15j24RO8M0j08J03j39J56J06J59Q36N06o0o28p91o8j23J3m0K5p2
$$ 173 73 48 69 23 39 62 61 52 167 43 52 120 160 52 155 16 172 278 437 1273 1779 1719 1091 300 232 109 122 82 107 35
490C5L4JN6n0lqrM9k0j0M9O0K8J4r8m6ojl1J2J0J00m1n3jm3L4L1m0N7J3o3j5N1N1nP2n9nL9
$$ 35 69 70 126 76 73 65 56 105 85 75 124 184 212 226 128 82 76 75 44 56 66 166 125 72 71 28 62 93 53 110 123 60 45 96 147 142 214 155 150 189
115A89j53j6M8L7J0rL5jM5Qj70J4M5l0P5Q2r6j01M6oJj2J1kJ10p7jn3j5J15J11j41l1MR7n
$$ 189 36 20 68 105 115 106 141 140 185 193 23 37 82 52 127 209 113 12 58 52 53 41 52 50 160 83 82 29 14 129 240 99 68 72 169 164
-223A64%om3m3N1J8J23j14jl5O0p4k9l4Q7pk8j
$$ 164 164 158 115 72 123 141 264 150 149 114 174 100 71 37 124 117 89 88
-392H8
##PAGE=	F1=2133.51
##FIRST=	4405.895418600002813,	4405.895418600002813,	0.52528136968612670898
##DATA TABLE=	(F2++(Y..Y)), PROFILE
4406E3j6J6Q3Np4L2m3L7N0o9n4N8LO9Mq2J2Q1j6j12k0J60m9L7j30J02n2%j7m4R8k2%K1J6R
$$ 53 37 53 136 141 67 99 56 93 143 74 20 78 81 150 154 72 84 165 149 37 17 177 128 165 35 137 85 85 68 24 122 100 100 121 137 146
4068A46m5q7Q0k8J07j59J16J9j4k7K2km2k0L6m1J26m1j06N6J80j28r7J10p2k3Q6N4m0r8m5
$$ 146 101 14 94 66 173 14 130 149 135 108 130 128 86 66 102 61 187 146 40 96 276 148 51 161 89 66 152 206 166 68 23
3777B3J15N2p5K1N6J10j29L3L0r8J8j07l6J05R7pr5N4q7M1j9l3l9L4Q7j08N6n6nK9K0NJ7M6
$$ 23 138 190 115 136 192 302 173 206 236 138 156 49 13 118 215 208 113 167 80 121 102 69 30 64 151 43 99 43 38 67 87 92 109 155
3458A55j04J20J3j19Q8p7L6n1K5J0oN9m0J0J67P4Q0%Q30K078J157l897q9M16O18q46m02n8
$$ 155 51 171 184 65 153 76 112 61 86 96 90 149 109 119 286 360 440 440 1270 3348 4505 608 519 935 1553 707 305 247
3195B47j05K45K5N74K273k36n37K022l811k45k7j11O8j69qQ7n7M17J518J982k58J0l160k73
$$ 247 142 387 412 986 3259 3023 2486 4508 697 452 425 314 382 213 205 292 235 652 2170 4152 3894 3904 744 471
2969D71O40k91p3l60k03J93j46k5j40J2L1j5P5j65Q0L8p7l2K4O1Nk6J09K6j78k5P7mJ19l5
$$ 471 1111 820 747 387 184 377 231 206 66 78 109 94 169 4 84 122 45 13 37 98 103 77 186 212 34 9 86 82 201 166
2688A66j9m9J6O7j25j8j1J5P2O2m0n5rJ23nj32J2J43n3j13L8R8p5n8k2J27Qn1k3kQ2j40R3
$$ 166 147 98 114 181 56 38 27 42 114 176 136 81 72 195 190 58 70 213 160 47 85 183 108 50 28 155 163 112 89 87 169 29 122
2378A22r7N6m8N1P8o8k0L7Q3m1k0L5j12J3k3K5k5L5No2Q2ml1pJ8oJ3K1p1M6J13l3n7l1k8L1
$$ 122 25 81 33 84 162 94 74 111 194 153 133 168 56 69 46 71 46 81 86 24 106 102 71 64 82 76 89 110 39 85 198 165 108 77 49 80
2040H0J05q4M2m7o8J30q5Rj5K4k8K8j8M4Kl6O2K0j32Q2m8R7j5L6m5N6n2K20N93K63n78k48
$$ 80 185 101 143 96 28 158 73 82 67 91 63 91 73 117 119 83 145 165 33 115 67 164 149 185 140 196 144 364 957 1220 642 394
1739C94l52K09j6o1j44J15M1m3p0N6J0p8l7O6J2r8N2J08l7m9oo8Q8Q2Qo4RJ8j14N9L3k1pK2
$$ 394 42 251 235 174 30 145 186 143 73 129 139 61 24 90 102 4 56 164 127 78 72 4 92 174 182 118 127 145 31 90 123 102 95 117
1420A17k3k4l8R6J2j28J25N1l6m5KJ9N1j42R2J0nL3k8r8P9L7m8m8O9Q1j30R2k6n9j8O3p7l1
$$ 117 94 70 32 128 140 12 137 188 152 107 109 128 179 37 129 139 134 167 139 41 120 157 109 61 130 211 81 173 147 88 70 133 56 25
1101B5L4Q9J1qq8R5K8j41P3l2m4L3k8J03l4o3l4Q3q8J02k9l6O3P9j1J1k0p4MK0L0N9j15J57
$$ 25 59 148 159 151 63 158 186 45 118 86 42 75 47 150 116 53 19 102 14 116 87 51 114 193 182 193 173 99 103 123 153 212 97 254
781B54o0j10l3L5j7m8Q6j5l8J00j09j0J04M4j56J93j28PJ67K42O55N02L1m91p79j44j44l8
$$ 254 194 84 51 86 69 21 107 92 54 154 45 35 139 183 27 220 92 99 266 508 1163 1665 1696 1205 426 282 138 100
518A00J8m4k1j7%N8l6K6k6m3M8P0n7J2J12L1J3o0p2n1pJJ4J8L4k6k0k1l1NM3LM5k3o8L5J8
$$ 100 118 74 53 36 36 94 58 84 58 15 63 133 76 88 200 231 244 184 112 61 54 55 69 87 121 95 75 54 23 28 71 74 119 96 28 63 81
171H1J06j1Q1r9mJ0j02PJL6K7n6M5JN7nj26J1L9m2Q2K8m7o8pRL8p8N0J4N6l7nq3J1J20O2q2
$$ 81 187 176 257 158 154 164 62 69 70 106 133 77 122 123 180 175 49 60 99 57 139 167 120 52 45 54 92 14 64 78 134 97 92 9 20 140 202 120
-186A20l6L4P8k3j9pr4L8rP8J10j59M6n8Q6q8L9p0K6Nj2m1
$$ 120 84 118 196 173 154 147 53 91 82 160 270 111 157 99 185 97 136 66 92 97 85 44
-392D4
##PAGE=	F1=2114.73
##FIRST=	4405.895418600002813,	4405.895418600002813,	0.28466051816940307617
##DATA TABLE=	(F2++(Y..Y)), PROFILE
4406F6PL6j5Q0j20M1j5N6m1j4rK1M1k0O3j12M3O9m1r5JJ27J1l6r7P2j4j3m1k1J03o3K8O4j2
$$ 66 73 109 94 174 54 95 80 136 95 81 72 93 134 114 177 65 108 177 136 41 42 169 180 144 47 119 105 92 51 30 133 70 98 162 150
4077A50om1o6K8k0J56j70Q0Q2m0l4Km5k0jM6m6R6k7l4P7J15j19j01J22r1qM6P4o4m4n3J24
$$ 150 144 103 37 65 45 201 31 111 193 153 119 121 76 56 55 101 55 151 124 90 167 282 163 62 184 93 85 131 205 141 97 44 168
3767A68K5q8J5P3J37j45J5N0o1k5r0l9L4J19Om5M9n4p6N5n3n8M4K2j0K7k4k3j9M0%l2J66j09
$$ 168 193 105 120 193 330 185 200 250 189 164 74 35 69 188 194 149 198 144 68 123 70 12 56 78 68 95 71 48 29 69 69 37 203 94
3448I4J41q2q4Q0r9Q7j9mJ9m5O6k7KJ23j7R5k8Q65K210J269l834R7N08J678j175p69p46j08
$$ 94 235 153 69 149 50 137 118 114 133 88 154 127 129 252 235 330 302 1167 3377 4646 812 909 1417 3095 1920 1151 405 297
3185B97J13J72J491L557P21M318l495n661j049j21j88kJ27q5J88j52K85J271K596j48p1l824
$$ 297 410 582 2073 5630 6351 10669 7174 1513 464 343 155 153 280 195 383 231 516 1787 4383 4235 4164 340
2979C40n8J146k9k79n66l68L03k01n2j36j0Qp2J72j27L6J4l5k7k7J01J3m9M9P5j53j0K9LN8
$$ 340 282 1428 1399 1120 554 186 489 288 236 100 90 98 26 198 71 107 121 86 59 32 133 146 97 146 221 68 58 87 90 148
2697A48j7k4J5j8P7j22k1J8j8J33N0j03n1rJ79k9j71L4J57l5j70L5K03j27p5m4Q3N4o7k7n
$$ 148 131 107 122 104 181 59 38 56 38 171 221 118 67 58 237 208 37 71 228 193 23 58 261 134 59 15 98 152 85 58 53
2406E3J26j23Q5r8K6m8M0Q3n2lK1J04k8m8l3l2rjJ6o9J23l5n7P0l4k1l0N6L8LL1j04NJ35J4
$$ 53 179 56 141 43 69 21 61 144 92 89 110 214 186 138 105 73 64 63 79 10 133 98 41 111 77 56 26 82 120 123 154 50 55 190 204
2077B04q8n9K5m6J52r8K3n8pJ08q8L8n1J7r%J4j3P0k5l2R1j10R1j06R1KK8k4O5j06P4M39L61
$$ 204 116 57 82 36 188 90 113 55 48 156 68 106 55 72 63 63 77 64 134 109 77 168 58 149 43 134 136 164 140 205 99 173 612 973
1758I73m65r4l29J61m9l7j26J26L1p6m4N5J6n9p0Q1ol9M1M7k6l5j9k9O8J00Jp6NK5j43J03
$$ 973 508 414 85 246 197 160 34 160 191 115 71 126 142 83 13 94 88 49 90 137 111 76 57 28 96 196 197 121 126 151 8 111
1457A11K9o6N1j0m5j0jQ8J6j41J35N0p7n3J6J2Q4j35Q6Mj1M7j2j47O3P5p1l6P8Q9j33R0n1
$$ 111 140 74 125 115 70 60 59 147 163 22 157 207 130 77 93 105 189 54 140 144 133 180 168 21 84 159 88 52 130 219 86 176 125
1148A25m0l3Q0q8j3K7O4M6n4o7J08jj19M8oj8L2k4M1jl9Qk0j7Q9j5n1O0P4j7K0pr3j1QP9J9
$$ 125 85 52 132 44 31 58 122 168 114 47 155 154 35 83 77 59 91 67 108 107 68 76 56 39 128 113 62 122 196 179 199 192 99 88 96 175 194
800A94j33J74l5j03k5L6%q1J13j9n7P8p9JR7M3j92K45j00o8J40K85L67L58J72k13o77k35j21
$$ 194 61 235 200 97 72 108 108 27 140 121 64 142 63 64 161 204 12 257 157 89 229 514 881 1239 1411 1198 521 286 165
528A65p6O0r2M4p4N1j8j8M6l0j4J8R8q6k6J51L7K7k2j11p7j1L2LO3o1j7J3m0L5o1M6L2M0m9
$$ 165 89 149 57 101 27 78 60 42 88 58 44 62 160 74 48 199 236 263 241 130 53 42 74 77 140 79 62 75 35 70 9 55 87 127 78
199G8m9N9l2J64k1Q7j15k4Np6O6l6j5N2r4N2J8M4j2p8J9K3p3J02Lk1n1m0N4M5j11N8L9j9R
$$ 78 29 88 56 220 199 286 171 147 152 76 142 106 91 143 49 101 119 163 151 73 92 115 42 144 147 126 75 35 89 134 23 81 120 101 110
-129A10rq1J3J10K5k2k7M4L7j6m8lj01P4n6J10J10j88O1o2J34j27J05r7n3O5l5j3
$$ 110 101 20 33 143 168 146 119 163 200 184 136 133 32 106 50 160 270 82 143 81 215 88 193 96 43 108 73 60
-392F0
##PAGE=	F1=2095.95
##FIRST=	4405.895418600002813,	4405.895418600002813,	0.20111057162284851074
##DATA TABLE=	(F2++(Y..Y)), PROFILE
4406H8J2N0p1J06j26K3L2N0r3K7OJ3M1m3N8p7L6M0k2p3PN0Q6j06p0O1%k5m8L7P4q8K0J08l4
$$ 88 100 150 79 185 59 82 114 164 71 98 104 117 158 115 173 96 132 172 150 77 84 134 220 114 44 105 105 80 32 69 143 55 75 183 149
4077A49j6l0m4J5l0J68j58M3J29o5l3k2p0L3rL3k8M7mK9R0M9j05j13J27r2J2KO7m4qq3J36
$$ 149 133 103 59 74 44 212 54 97 226 161 128 106 36 69 60 93 65 112 108 137 227 276 171 58 185 93 105 107 174 130 122 39 175
3767A75Lo6mP0J43j37NM8j0o0r0j9m1J24K1J6L0j5j35Q0o0n9J1kJ00m0j0k6l6K3NJ9J70j08
$$ 175 178 112 108 178 321 184 189 237 227 167 77 58 17 141 162 178 208 193 58 138 78 19 30 28 128 88 78 52 16 39 44 63 233 125
3448A25J44j39k9L5j15J37M1q5L6m6L8k5J6Q0o8J31r9P89K075J324l400L02O87L097j518j333
$$ 125 269 130 101 136 21 158 199 114 150 104 142 117 133 213 145 276 177 966 3041 4365 965 1267 1954 5051 3533 2200
3204B200j615P8K34l62J688M576L613P766k071j3359k020k98j99j08L71j98K43k84j16P46
$$ 2200 585 663 897 535 2223 6799 10412 18178 16107 2748 728 430 231 123 494 296 539 255 139 885
3016H85K163K91Q21m102P7J390L14k64o36p97M69l25n6j09%l4n1J64p2j7Kolk9J11pq5K1Q3
$$ 885 3048 3339 4160 58 135 1525 1839 1575 939 142 611 286 230 121 121 87 36 200 128 111 113 107 104 75 186 179 94 115 198
2744A98j01plMjj2kN2k7N9l7q8N5p7J98M1j56m6J7J94m7j94N8J53j9k09K2K86j53q2k6lQ0
$$ 198 97 90 87 91 90 78 76 128 101 160 123 35 90 13 211 252 96 50 67 261 214 20 78 231 212 3 25 311 158 76 50 47 127
2434A27n9jk9J38j06P7p1l1Rk0P8k5K1j1J19j1o2p5L1l4NL8p6J41o6m1Q7n9m7j7O3O2j5N2
$$ 127 68 67 38 176 70 147 76 45 54 34 112 87 108 97 216 205 143 68 99 65 70 108 32 173 107 66 153 94 47 30 93 155 140 192
2115A92j24l1J25N7j07n9N3q8J55q5K4o8L2Q2r7O2r0K1N5k4j8k8R9mj05J16o2R0j43Q3KK3
$$ 192 68 37 162 219 112 53 106 18 173 88 112 44 76 158 61 123 33 54 109 85 67 39 138 134 29 145 83 173 30 113 115 138
1814A38%P9j04k3Q7M68l63Q8k52J09p7j4o9R4J6r1k2N1K4m0n8O2j8RL6k8j2k0k4NL4J30j1
$$ 138 138 217 113 90 177 645 282 370 118 227 150 136 67 161 177 86 64 115 139 99 41 103 85 94 130 102 90 70 46 51 85 215 204
1504B04q4%L2j48J31J7l6N9o3o2J4K0R5jj59J48M2r8o1L0MJ07j14N0NqN5Lj55L9J10r1m5Q9
$$ 204 120 120 152 4 135 152 116 175 112 50 64 84 179 178 19 167 209 111 50 80 84 191 77 127 132 124 179 182 27 66 176 85 40 129
1185A29Q1j30R7p1l8m5J02q5QK2L3N7p9k1Q1qj07L8J1kL3j6j6K5qM3q9L9N2J7q8N3P4k5K5
$$ 129 210 80 177 106 68 23 125 40 48 70 103 160 81 60 141 133 26 64 75 73 106 90 74 99 91 134 45 84 136 153 65 118 192 167 192
856A92Rj15k2K0J00j8j34J63op5k8M0Pj01J26j6o4O5m8lQ3M6j79K19q3m9M8K63P8M6L33J75
$$ 192 201 86 64 84 184 166 32 195 189 114 86 126 133 32 158 142 78 143 95 92 175 221 42 261 178 129 177 440 518 564 897 1072
556A072m76l42p0q1O0j05Q3p9P3r3pM8j5J0J9N7r1l6J55L9O0Oj48p9j2L2LJ04j43KL2j6O6
$$ 1072 596 254 184 103 163 58 141 62 135 42 35 83 68 78 97 154 63 27 182 221 281 287 139 60 48 80 83 187 44 46 78 62 128
246A28j14N7K2M1l8j6K7p3J97l1R6j04o2K9q1J26n4q2O3r9N4O2j7mm2L7Jj09J25L0n3m2m6
$$ 128 14 71 93 134 96 80 107 34 231 200 296 192 130 159 78 204 150 68 131 32 86 148 131 127 85 122 123 14 139 169 116 74 28
-64B8R6N4j35P2L7p3L1pn8J7P1K3Kj6O2k1Jl2k8lj4l3O4J12j49J6m7J75j63J35j17o0R0o9
$$ 28 124 178 43 115 152 79 110 103 45 62 133 156 158 142 204 183 184 152 124 121 107 74 138 250 101 117 70 245 82 217 100 40 130 61
-383F1M5
$$ 61 106
-392A06
##PAGE=	F1=2077.17
##FIRST=	4405.895418600002813,	4405.895418600002813,	0.27168959379196166992
##DATA TABLE=	(F2++(Y..Y)), PROFILE
4406I0oN6m4O0p0l7P8M2j02L1J0L6Kj3Nj7K6J0Jk7k4k8J50j42l0M5k5l2k4Q2L4o0j3J07m0
$$ 90 84 140 96 156 86 49 127 169 67 98 108 144 146 133 138 121 147 157 158 131 107 79 229 87 57 102 77 45 21 103 137 77 64 171 131
4077A31k2ll3L0m1J33j06MJ51q5k6m7m5M8rOoMRP9Q6J1r6j33J21p5K9k5K2K8nj22J42ml2l8
$$ 131 109 106 73 103 62 195 89 93 244 159 133 86 41 89 80 86 80 84 93 172 258 269 173 40 161 86 115 90 112 140 135 13 155 151 119 81
3739H1O8J31j12QK9L3p5j14K0m4N4M3O5KL1j09K7m9o3mK0J30j10j0j3Lk3mJ09J13j04J15j21
$$ 81 149 280 168 176 205 238 163 49 69 25 79 122 187 189 220 111 138 89 26 22 42 172 62 52 39 42 19 15 124 237 133 248 127
3429A27J7k9j00J48Q4j75O6J2l2l5J1N0p4J68j43O04J699J332k711M56Q88M741j823j971k487
$$ 127 144 115 15 163 247 72 138 150 118 83 94 144 70 238 95 699 2398 3730 1019 1475 2363 7104 5281 3310 823
3195H23R0L41q48N94L717K891R077M87j4229j891l93k24k21K82k26L41k31J21J617j423Q85
$$ 823 913 1254 406 1000 4717 7608 16685 17172 2943 1052 659 435 214 496 270 611 380 501 2118 695 1580
2997A580J294k627j2J076N81l5n76j074M38m38J1r7K5q0j9J09j4o3K5kK7lR6l7j08L2N7m9
$$ 1580 2874 247 235 1311 1892 1857 1281 207 645 207 218 121 146 66 47 156 142 79 104 102 129 126 222 185 77 109 166 117
2734A17k4rj7k0k0M0M7j0J1L8j38J00p4J79M1j75j8J4J79n3j92N9J54j6j89k2L15j31j02j3
$$ 117 93 84 67 47 27 67 114 104 115 153 15 115 41 220 261 86 68 82 261 208 16 75 229 213 24 2 317 186 84 71
2453G1k2N8n7N6m8J03j08Q7k2r7N5n4N5MM4m1J16J0o7n6K3l0qP2o9J09o9m1J12m5q8J2M0O6
$$ 71 49 107 50 106 58 161 53 140 118 21 76 22 77 81 125 84 200 210 143 87 110 80 72 144 75 184 115 74 186 141 53 65 105 171
2134A71m2R5j42m5P7Q7j06l6N7m2O5m3L5o9K1Q0r6N9j17K8J12j4q6PO1L4q7L7mQ1j50R0l1
$$ 171 129 224 82 37 114 201 95 59 116 74 139 96 131 62 83 163 67 126 9 37 149 135 49 56 117 151 64 101 97 178 28 118 87
1824H7K3K3R6m0J09l5K29l44J25j34N8r9J3k6N5Rq3j1M4L5l5m7N8j6L3L1r1l%j3J8j5J71k2
$$ 87 110 133 229 189 298 263 492 148 273 139 197 98 111 85 140 149 66 55 99 134 99 52 110 94 127 158 67 64 64 51 69 54 225 203
1504B03r7KL4j30J48%K1M4j17p1K8L2J18l1j66J42L2r0p7M1OJ13p8j1RnO6J1j23PJ38r6p0
$$ 203 106 108 142 12 160 160 181 225 108 37 65 97 215 184 18 160 192 102 25 66 72 185 107 96 105 100 166 177 54 61 199 103 33
1195C3Q7O8j24J09q0m7j3P4o4K8OK6L6q1L1K8J4r3K4J6PK8%m6K4K6O5o9J6J2M2j19L3Q7l4
$$ 33 120 188 64 173 93 46 33 107 43 71 77 103 139 58 89 117 131 38 62 78 85 113 113 67 91 117 182 113 129 141 183 64 97 184 150
866A50K4K5j40k2O6P5m2q6R4K2m0m2N6Jj04J23j2n7O4k3k8O4O1j61J65p4nl6J72K0m0n3O01
$$ 150 174 199 59 37 103 178 136 50 144 166 126 84 140 141 37 160 148 91 155 132 104 168 229 68 233 159 154 118 290 310 270 217 818
556H18j73m39j3o6K5q2J03q6Q5j23oL6JK4K0pp6MJ07L2J10J7j69p5MoL5J12j96M0L5K8N6j26
$$ 818 645 206 193 127 152 70 173 87 172 49 43 79 80 104 124 117 41 45 152 184 294 311 142 67 71 65 100 212 16 56 91 119 175 49
237D9N6nM8j4lk0p0J73l9J11q2r9P3j06J66n3j35M0o0M5J09j02K3k1N4j6j13J15P4j08m0k6
$$ 49 105 100 148 134 131 111 41 214 175 286 204 105 178 72 238 185 50 90 30 75 184 82 105 84 138 122 9 124 198 90 50 24
-64B4J22P2j69J05Lp4J1mk3M1jM6j0qJ04r0PM9q4P1r3OJ6Q0o9m6k9J95j91J30j30J1P0j06
$$ 24 146 218 49 154 157 83 94 90 67 108 107 153 143 135 239 149 156 205 121 192 99 105 121 201 132 86 57 252 61 191 61 72 142 36
-383C6Q3
$$ 36 119
-392A19
##PAGE=	F1=2058.39
##FIRST=	4405.895418600002813,	4405.895418600002813,	0.37004435062408447266
##DATA TABLE=	(F2++(Y..Y)), PROFILE
4406H6p3O7M4l7M8j20Q6N3p8PJ8P2p2L3n3L2M7Mk8N7r0p9J69j10L7k5n4J2l0J01j8K2k3J9
$$ 86 13 80 124 87 135 15 101 154 76 83 101 173 101 134 81 113 160 164 136 193 103 24 193 83 120 95 41 53 23 124 106 128 105 124
4087A24k6j9K8l1M5k4N3j5l9J53j00k1m7m1O5Oj3nj9nJ23N9K2j06j10N6m3M3l0n1J28k5q4
$$ 124 98 79 107 76 121 97 150 135 96 249 149 128 81 40 105 111 98 93 74 69 192 251 273 167 57 113 70 113 83 32 160 135 51
3777E1O1J1j3q0Q9J07q5K7JN0p1j09O0m7m0Q6O8k5R2n4n4j4p2J3J1J18j41K2m4N5nm1J34O2
$$ 51 112 123 110 30 119 226 141 168 169 219 148 39 99 52 12 98 166 141 233 179 125 111 39 52 63 181 40 62 18 73 68 27 161 223
3458B23r0L6j8L0q0q7J39Q7j63N2R3j25j4n8J4L7P4r0L54J165J301j917M97J050O352k004
$$ 223 133 169 151 181 101 14 153 240 77 129 222 97 83 25 39 76 150 60 414 1579 2880 963 1460 2510 8862 6858
3213F858k543l091KMl12J126J437k0N009p46o210l91l93k36j95j21j24M68NN21K938Q75o6
$$ 6858 4315 1224 1226 1230 918 2044 3481 3461 8470 7724 1514 1123 730 494 299 178 54 522 527 1048 3986 4861 4795
2997D795l078j442J3N59O38L09m61r82K06m87J66j28L2r7j5M5L4m4M5l3M6O0L9n1o1K2L9m5
$$ 4795 1717 275 288 847 1485 1794 1333 351 557 70 236 108 140 43 28 73 107 63 108 75 121 181 220 169 108 130 169 124
2734A24n9K6q3L4N4j5MK0n3Q5j10R9rP7M9j49K5k8J51n1j25j2J73l4j41k4K51o4j18k1LM2
$$ 124 65 91 8 42 96 81 85 105 52 137 27 126 117 194 243 94 119 91 242 191 66 54 227 193 52 28 279 215 97 76 79 121
2434A21q5J18p9O8j12Q9L3j01L5k9oK8N9m8Q2K9o5l0nMl1R8n5M1l5n9J25oj19K1K3N3p1J60
$$ 121 36 154 75 143 31 120 153 52 87 58 52 80 139 91 173 202 137 107 102 106 75 173 118 159 124 65 190 184 65 86 109 162 91 251
2115B51j67m0QR7q3j4O3J5m1J5M6n5k8J03p2J4p1j5J42Rj40K3PR1n8l6L1O6j26J12r3L6L4
$$ 251 84 44 52 149 66 52 115 130 89 104 150 95 67 170 98 112 41 26 168 177 37 60 67 158 100 64 95 161 35 147 54 90 124
1805A24J11L3K00J48R0l32k29NRj01L5j7K2K0o2j1L8M8m8m1O9JK9K4j09j6J8J7Oo9K12l0j16
$$ 124 235 268 468 616 706 374 145 150 159 58 93 76 98 118 56 45 83 131 83 42 111 112 141 165 56 40 58 75 81 12 224 194 78
1495G8J4K7q7J54k3P6K2j56p8L9L0J47o4j41J01J6m8j05M7K5R8l2q3J2j0Q8J2o8k9J59r2q6
$$ 78 92 119 32 186 163 239 261 105 27 66 96 243 179 38 139 155 107 2 49 74 172 140 57 69 59 147 159 91 62 221 129 43
1195D3N8O0j20J23p6m7M6j3k7N4k3L9nn9N5k3N6o9jJ5J0PK8m1lN7O4k9j3k4M8j02k5J11m5
$$ 43 101 161 41 164 88 41 87 74 47 101 78 117 112 53 108 85 141 72 71 86 96 103 131 90 87 144 208 179 166 142 190 88 63 174 129
866A29J9M1j59j6J31J6m7k9J2L8j1m9P2lp9Q5j6l5P0oo8M2Q9j43R9o8M8q8L7M01O02n67j15
$$ 129 148 189 30 14 145 161 114 85 97 135 124 75 147 144 65 150 134 99 169 163 95 137 226 83 182 114 162 74 111 512 1114 547 432
556D32K13m81L9n7l5k4J15j08Q6j18OK5oL8Mn7k8K0M8J6J69Rj64p9L1o5J05Q0k01N4N2N8K3
$$ 432 645 164 203 146 111 87 202 94 180 62 68 93 87 125 129 72 44 64 112 128 297 306 142 63 94 29 134 214 13 67 119 177 200
246B00q8J9k0O2qJ4p5m0J03l6J28o3j20J33j40J67l0j58k3J0K9J38j65N1j1N2j1j05R4R8j24
$$ 200 112 131 111 173 165 179 104 64 167 131 259 196 76 209 69 236 206 48 25 35 64 202 37 88 77 129 118 13 107 205 81
-45H1o4J0J34Q7j97J28m9j6n1OJ1Q3r8O8l7NJ69j65jJ50j13R0r3k8N0l7K1q5rJ89j90O3q9
$$ 81 17 27 161 248 51 179 130 114 63 69 80 163 65 133 96 101 270 105 104 254 141 231 138 110 160 123 144 59 50 239 49 112 23
-355B3O1P2j38O5
$$ 23 84 156 18 83
-392H3
##PAGE=	F1=2039.61
##FIRST=	4405.895418600002813,	4405.895418600002813,	0.53908306360244750977
##DATA TABLE=	(F2++(Y..Y)), PROFILE
4406A45m1l3R6j34J60r4n1R7Jl3OQ7j50N2l6J0J12J5j09J47j70k8O7kQ8j16j2N0q0Q4p0J33
$$ 145 104 71 167 33 193 99 48 145 146 113 119 206 56 108 72 82 194 209 100 247 77 49 116 114 202 86 74 124 44 128 58 191
4105A91k4j08Qj2M7k6N0K9o0Q6p9J38j04j9Nr8J09J9k8k6k1k3J46J4P6j33n5n1qP3k8KR1n5
$$ 191 167 59 67 55 102 76 126 155 95 181 102 240 136 117 122 24 133 152 124 98 77 54 200 214 290 157 102 51 43 116 88 90 181 126
3786A26j8m9O0m1m1P7Q3q7N4j6L4o1mM4r5k2N6J6l6J73lj33K3q6J9K5O0n7M7r2M9J9l6R3L1
$$ 126 108 59 119 78 37 114 197 110 164 148 182 121 117 161 66 44 100 116 80 253 250 117 140 54 73 98 158 101 148 56 105 124 88 181 212
3458B12n0j03J33Lp7j01J46K6Rk7J31k07O9j05J10O1k13R7O9N65J234j136L89J120P585j986
$$ 212 162 59 192 195 118 17 163 189 198 171 302 95 164 59 169 230 17 114 183 748 1982 846 1235 2355 9940 7954
3213G954k883l215J84q72J34L528N976Q494M650r287j3135o83l75j28K94j38%k34L12P96L547
$$ 7954 5071 1856 2040 1168 1302 4830 10806 19300 23950 14663 1528 845 470 342 636 498 498 264 576 1372 4919
3016D919L786l7l844m150m53J18M87O02l86n95rl37J60j56j0j0K7k0k5P0j6p8L7J55m8j8J6
$$ 4919 8705 8668 4824 674 221 339 826 1428 1042 447 438 101 261 105 95 85 112 92 67 137 121 43 80 235 187 169 185
2763A85k5N6j01r9J13n4jJ05p6m0M0q4O2PL6P2m6M8r2O8p4J23n6l4j11K05o9o9k9J54K5j13
$$ 185 160 216 115 16 129 75 74 179 103 63 103 19 81 88 124 196 150 198 106 174 100 223 167 133 22 227 158 89 60 214 239 126
2462A26n9L0O7j02J41j18N5o9J5Q4o5kNn5L2O5l5L8K9m4l0k8N0m7J03k9m9K1p3J12M2j35J3
$$ 126 67 97 164 62 203 85 140 71 86 170 105 103 108 53 85 150 115 153 182 138 108 80 130 83 186 157 108 129 56 168 210 75 88
2152H8J4K6q0K24j95k9rL1l0j2Q7O3j42O8N4k1r0J29l5n6j1n3J43L7j52Lm2J43l6k3j9N4q2
$$ 88 102 128 48 272 77 48 39 70 40 28 115 178 36 104 158 137 47 176 141 85 74 21 164 201 49 52 10 153 117 94 75 129 47
1842D7J36j57N3K9J23Q6K49K76J54l82n85J23l2k7j1l9%N1l9k4M2O2n4n9Q3K4QK0q5k7LN8
$$ 47 183 26 79 108 231 317 566 842 996 614 29 152 120 93 82 43 43 94 55 31 73 135 81 22 105 129 137 157 72 45 48 106
1542A06j6l3J53l2j41L6K4m2J55m8J14jj73q0N9%J77r2j03M7qK0r8J1N3O5J8j52K3k6J10K1
$$ 106 90 57 210 178 37 73 97 55 210 162 276 275 102 22 81 81 258 166 63 110 102 122 24 35 88 153 171 19 42 16 126 147
1241A47k0o4J76q6q2J1O1j24J31o3k4Q0j10K2Q4n7M5l8l0M9n1R3m0k7J1Rl3P6k5l3P9L9J3
$$ 147 127 63 239 153 71 82 143 19 150 87 63 143 33 55 139 82 127 89 59 108 57 150 110 83 94 103 70 146 121 88 167 206 219
932B19l3n4M2l2j16J35n0QN6j22m7J87n5l7J0k7J9Nk7O6J4n4K4k4j1Q8jj11J9J16j11K4n5
$$ 219 186 132 174 142 26 161 111 119 175 53 6 193 138 101 111 84 103 108 81 147 161 107 131 107 96 184 183 72 91 207 96 120 65
622F5J07p1R3N68J105n73j137M13m40R4p0j06N3J27j43P6q9L2J9m0O3l8j7%j6noK21rj38p8
$$ 65 172 101 194 762 1867 1294 157 570 130 224 154 48 101 228 85 161 72 104 123 83 146 108 91 91 75 70 64 285 276 138 60
331F0M5q7J55K5j65L3R2O7k7j5m3k1Q6k8M7j30qJ6j1J26m8j21J99j62J16J2j65Oj6L3J23j08
$$ 60 105 18 173 198 33 66 158 225 198 183 140 119 205 177 224 94 86 102 91 217 169 48 247 85 201 213 48 54 38 71 194 86
30H6Lj5J8K9j00P6R2n4r9OJ40Q5k03J22j02Q3j34M9%J40k05O9k4J6K15k31RK02o4K5Qj50J36
$$ 86 89 74 92 121 21 97 189 135 36 42 182 267 64 186 84 167 33 82 82 222 17 86 62 78 293 62 71 273 209 234 242 92 228
-280B28j76Q6n2J6J36j03j19J17m5J11r8p0
$$ 228 52 138 86 102 238 135 16 133 88 199 101 31
-392C1
##PAGE=	F1=2020.83
##FIRST=	4405.895418600002813,	4405.895418600002813,	0.5885639190673828125
##DATA TABLE=	(F2++(Y..Y)), PROFILE
4406B31j9o6O0j03J27m7r7O6Q6n5l9Q7j44j9O7l5J42J1j49J68k18K9m4J17J09j54J2O6j06
$$ 231 212 146 206 103 230 183 86 152 238 183 144 231 87 68 135 100 242 253 104 272 54 83 39 156 265 111 123 189 83
4134H3L4p0K02l8j55kpN9j8M0Q9j47J35r7J08q3k2P2j44J21L2m9n4LqJ18l6J33j62kr1l5J24
$$ 83 117 47 249 211 56 54 47 106 88 128 217 70 205 108 216 133 111 183 39 160 192 143 89 92 84 202 166 299 137 135 44 9 133
3824A33l5P4J5o4K8j10J09j15O1L5P1j10O4kLo3R9K7j47jL3n4RK22K5j87M0r1PP8k8L9O1j35
$$ 133 98 172 187 123 151 41 150 35 96 131 202 92 156 154 157 94 193 220 73 72 105 51 60 282 307 120 160 69 76 154 126 165 226 91
3504I1K8N0oL5J4%j61J70n2j3r3J43n8J58r4J40k61J64j25K13L3k63O4m1n8J108m40J60J072
$$ 91 119 169 163 198 212 212 51 221 169 156 63 206 148 306 212 352 91 255 130 343 376 113 177 136 78 1186 746 906 1978
3232A978Q069j734k828k821P03j084j339N120J0655J5025J2727q938l0679m064o14N7Q06J45
$$ 1978 10047 8313 5485 2664 3367 2283 944 6064 16719 31744 44471 35533 4854 790 176 233 1039 1184
3063A184j13r59M04R99L005N350m2k439o178r82j60L93O17m52j78nk42L5j01r6J08O3k8r0
$$ 1184 1071 112 516 1515 4520 9870 9828 7389 1211 229 69 462 1079 627 449 444 202 237 136 40 148 211 183 93
2838I3J09q5q2j1K50j21M0N2p0Q4j61n6J33j6m8J22j24m3M4l6n5J29l2J34j38J9j3R7r8J01
$$ 93 202 117 35 24 274 153 193 245 175 259 98 42 175 159 111 233 109 66 110 74 19 148 116 250 112 131 118 215 117 218
2556B18q0N4j80K07r8Nl0O1Q7q3j12N1J02r3J32j41N3l8o7J11lk4K9r5J7P4k5L1j2Ln1m3P7
$$ 218 138 192 12 219 121 126 96 157 244 161 49 100 202 109 241 100 153 115 48 159 156 132 161 66 83 157 132 163 151 154 103 60 137
2246A37n2R9Lj35O7n6Q5N9j32LN%k5K18k08j7N1p0K6l2R8Q6j96P4O7K4j06J07oj16L2p2J22
$$ 137 85 184 187 52 119 63 148 207 75 78 83 83 58 276 68 51 102 32 58 26 124 210 14 88 155 179 73 180 174 58 90 18 140
1936A40O4j39M%O9k0L1j02M5l5J50j77M3RJ34J03K71L52K63m12o71K5o1Q3q8p6J2N9j8m0N4
$$ 140 204 65 69 69 138 118 149 47 92 57 207 30 73 82 216 319 590 942 1205 793 122 147 86 169 81 5 17 76 58 18 72
1645G2P3k5q7O4L4j3K6m9k5l4R3l1RP7k8j47M1N3l8J63o8J30k5j65p2Q2m5J88j02p2Qm3R4
$$ 72 145 120 33 97 131 118 144 95 70 36 129 98 107 184 156 9 50 103 65 228 160 290 265 100 28 110 65 253 151 79 87 44 138
1335A38r7mO2L4O0j72K7kN7N2pq5J85p8p0k8O3j17J10m2OR8j55L6J06q3L0m2j8L2n0J08k1
$$ 138 41 37 99 133 193 21 48 46 103 155 148 63 248 170 100 72 135 18 128 86 92 190 35 71 177 94 124 82 64 96 46 154 133
1025A33m5J2Oq0J33j2n8Q6LM3l3p7L5N2j71J10m1kP2p1p5K09j18k0K9j7j9%J4M0N3m5l8j7
$$ 133 88 100 106 26 159 147 89 175 178 221 188 111 146 198 27 137 96 94 166 95 20 229 111 91 120 103 84 84 98 138 191 146 108 91
706I1j0J18j5j42J3J13n1n4j1J41k3K17N38J506n01j221k95l33J72r9q5L8J39j79N5m1N9R
$$ 91 81 199 184 42 55 168 117 63 52 193 170 387 925 2431 1930 709 414 81 253 154 69 107 246 67 122 81 140 149
443A49q2J00r5Q1j6n4k5m5K40j9j07m4J5l9J41k5j29J4J36N5p1N8j01k1J14n8Q6j72J7o3M3
$$ 149 67 167 72 153 137 83 58 13 253 234 127 83 98 59 200 175 46 60 196 251 180 238 137 116 230 172 258 86 103 40 83
152H3Q3l1j03K47j66L3N6j64R0r1O9O3k6l7l3m1R5n6K4O9L5j46OJ49O8j98J06j28J59j93J15
$$ 83 166 135 32 279 113 146 202 38 128 37 106 169 143 106 73 32 127 71 95 164 199 53 59 208 276 78 184 56 215 22 137
-139A37n3J89k40QO8qJ94k55P1J41M8r0J46k91K02j80L8K9J5R1k9j43J39j32J57o2r5
$$ 137 84 273 33 41 109 101 295 40 111 252 300 210 356 65 267 87 125 154 169 260 231 88 227 95 252 190 95
-392I5
##PAGE=	F1=2002.05
##FIRST=	4405.895418600002813,	4405.895418600002813,	0.52423071861267089844
##DATA TABLE=	(F2++(Y..Y)), PROFILE
4406B68k2r3L6o2Q4K0p7k4J51m9j06J08j06n8J04pQ9j6q0Q6j70J3RP1J01r3l7P4q5l9j7K05
$$ 268 246 153 189 127 211 231 154 130 281 232 126 234 128 70 174 167 256 240 160 246 76 89 98 169 270 177 140 214 129 90 73 278
4105B78p7j09m0j5J01l1L6J02j72J08o2N1k8k3J05j75J01P6r1o8M4RP0o4J51j82L7k3q2J15
$$ 278 201 92 52 37 138 107 143 245 73 181 119 170 142 119 224 49 150 226 135 67 111 120 190 126 277 95 132 109 27 142
3824A42n1J11m8j4K3q6J04j74J04J5O7p9K2L7j6q6J51J1j52k3L6q8Q0J99L9k14L8o0j9J35
$$ 142 91 202 154 140 163 77 181 7 111 126 193 114 136 173 157 71 222 233 81 58 94 6 86 285 324 110 148 88 69 204
3542B04j04P5O4j57RR9M6k8j5K7j31J13j05Q3p4J26r3J81j48J53k63K46j57K87j7k83J7k1
$$ 204 100 175 239 82 91 190 236 208 193 220 89 202 97 180 106 232 139 320 172 325 62 308 151 438 421 138 155 134
3279A34K16K52O0l1R29P511j273k260k043J328m73j794K153J1132J3569J9596m438l7861n196
$$ 134 350 602 662 631 1560 9071 7798 5538 3495 4823 4350 2556 4709 15841 29410 49006 44568 6707 1511
3101A511n86l56N96L83p7r15K06J315K912L506p34m75n875j021k49L60O02o50q0R6k81n7N3
$$ 1511 925 569 1165 1548 1471 556 762 2077 4989 8495 7761 7286 1411 390 141 501 1103 453 373 469 188 131 184
2885A84q7P3P8n0j02J03j24k2kK17j30N0M9q8J13j64j2J05J7o5Q6j58j0P2l8n8J40p4J47j52
$$ 184 97 170 248 198 96 199 75 53 51 268 138 188 237 149 262 98 86 191 208 143 229 71 61 133 95 37 177 103 250 98
2603I8m9Q5R4j04Q6r8R9j72J54q9L5k5K9P9m6j19L6J20p1J07j23M2m1p7O9P4l4M3j34pR5k8
$$ 98 49 134 228 124 210 112 211 39 193 104 139 114 143 222 176 57 93 213 142 249 126 168 127 50 119 193 159 202 68 61 156 128
2303A28O6r1P4p5n4O6l4R4K6j56M0pP9K1j16J7k9jL6J60j73j2R3l8j2m6P7Q6j88K7Q2O8r5
$$ 128 194 103 177 102 48 114 80 174 200 44 84 77 156 177 61 78 49 48 84 244 71 59 152 114 102 56 133 219 31 58 140 208 113
1993A13O7mj33L1o6J01Q1j25L6J8Nj0P1j25Nj1J46j59K3j8J43P5K92M00L57m06o88q4p5J83
$$ 113 180 176 43 74 8 109 190 65 101 119 124 114 185 60 65 54 200 41 64 46 189 264 556 956 1313 907 219 135 60 243
1711B43j42n6J8j3J0pK5P7J6j20M4J1j7N1k3l1n4R4k1K7J7j7q5j8J04q9J85o8J21m7j38o4
$$ 243 101 45 63 50 60 53 78 155 171 51 95 106 89 140 117 86 32 126 105 132 149 132 47 29 133 44 229 161 282 235 97 33
1410C3R4o6J66q3n9j4n4J24r4NM1K7Q5j50%J7MJ00l3q0J86p1o5n1O3q2N2j2L6R7j47J2J28
$$ 33 127 61 227 144 85 71 17 141 47 52 93 120 205 55 55 72 76 176 143 63 249 178 113 62 125 43 95 83 119 216 69 81 209
1101B09j07Pj6l0K4n4J19k3m8K5mm6J14j8p4P6k1N5j5r1M1J07j89N2qjQ5m6q7J96j55%L8P
$$ 209 102 109 93 63 87 33 152 129 81 106 102 56 170 152 78 154 133 188 173 82 123 230 41 93 85 84 169 123 36 232 77 77 115 122
781A22m0k0L6K7R2m8q2K2n1J46m8j30L2N2L8r9L8J15K5K85M84J760l70j094j085j91K56j21
$$ 122 82 62 98 125 217 169 87 109 58 204 156 26 58 110 148 49 87 202 227 512 996 2756 2386 1292 207 16 272 151
518A51K2p0J44k05L6PP2Kj05J28j46J59m2m9on7J61or6J5l4pJ27m6j03PJ61K1p4Q1j13k8J29
$$ 151 173 103 247 42 78 85 157 159 54 182 36 195 153 104 98 41 202 196 100 115 81 74 201 155 52 59 220 241 167 248 135 107 236
209B36q2J15k04L5n4L9K8J3r1K47j61l9Q7j30J39j42J08nJ7n1m6kO9Om4M3R4j85L4J44O0k12
$$ 236 154 269 65 100 46 85 113 126 35 282 121 82 169 39 178 36 144 139 156 105 59 57 126 132 88 131 225 40 74 218 278 66
-92F6J07j19J69j76J36p2J89k57K6P9m1J43k02R8M4J80j91K39l81J96j11k4J12j4N0K2j69
$$ 66 173 54 223 47 183 111 300 43 69 148 107 250 48 146 190 370 179 418 37 233 122 98 210 196 246 268 99
-345I9J59j58J57j2j08
$$ 99 258 100 257 245 137
-392A37
##PAGE=	F1=1983.27
##FIRST=	4405.895418600002813,	4405.895418600002813,	0.5483729243278503418
##DATA TABLE=	(F2++(Y..Y)), PROFILE
4406B05m6q6K4K4J7Q9n0j25J60M2j34J23j24M0qP7m6n3J16r5k2m9P1l4P1R0j20K5j4j25QK07
$$ 205 159 73 97 121 138 227 177 52 212 254 120 243 119 159 151 228 182 129 245 150 128 79 150 116 187 277 157 182 168 43 51 258
4105B58j40l6Kj7J24q1P7J1j17LQ2o8N8rO4j97O2J92j66n5P2KJ7nR7j77L6P6j09N5p4J16n8
$$ 258 118 82 84 67 191 110 187 198 81 84 166 98 156 147 211 14 76 268 102 47 119 121 138 133 230 53 89 165 56 111 37 153 95
3796I5R0m7l4P2j48L6kO5N7p4P2l4p8R9Mm1j08N7n4M1J54O5j59k9K8m7J29j58L4N8r0l5J67
$$ 95 185 138 104 176 28 64 62 127 184 110 182 148 70 169 173 132 24 81 27 68 222 287 128 99 127 80 209 51 85 143 53 18 185
3486A85J06j15l6K0p1K5LL9l6O7o2N0o2O8n5J60j94K71n0j63n0l6L80j69J92J0Q81N758o80
$$ 185 291 176 140 160 89 114 117 156 120 187 125 175 113 181 126 286 92 363 313 150 100 64 444 275 467 477 1358 7116 6436
3213F436j156j132J779Q88P18J391K947l019J6012J661k1529k799p05o99j19M94K54l48N17
$$ 6436 5280 4148 5927 6815 7533 8924 11871 8852 24864 26525 4996 2197 1492 793 674 1168 1422 1074 1591
3035A591J959O199M181p92m662p470n38J37J80N23j022k6R1k44J5J17n2o1K9n8p2J39q6K0
$$ 1591 3550 9749 13930 13138 8476 1006 468 605 785 1308 286 260 351 107 122 239 187 126 155 97 25 164 78 98
2810I8J1P5k9o1L5l4J36q4l7L2O6j4l8j11pJ22r9l4J25k1M1o7o4J22M1j09O8nMp4N5k3j6j8
$$ 98 109 184 155 94 129 95 231 147 110 142 208 194 156 45 38 160 61 27 152 131 172 105 41 163 204 95 163 158 162 88 143 120 104 86
2490H6Q2K8m3l7l7J02m3O5l4J3r2jl4J56l8M7j49nQ1n2J19j78J58r4m7kM9N9L0j27l1P0P4
$$ 86 168 196 153 116 79 181 138 203 169 182 90 89 55 211 173 220 71 66 147 95 214 36 194 100 53 51 100 159 189 62 31 101 175
2180A75l2j08O8r3L3K3R1m4l0R0Nk7r0Q4N9j52kO8Q7p9N8m8q8l1LO1P5j15O5M5ll1P0p4o0
$$ 175 143 35 103 10 43 66 157 113 83 173 178 151 61 145 204 52 50 118 205 126 184 136 48 17 20 81 156 41 106 151 148 117 187 113 53
1852E3oJ01j23N7n8J31kL30M61M01l81o65j85o4K46j50o7K3o6K0N6j7N9N1j54O3n4nR1po2
$$ 53 47 148 25 82 24 155 153 483 944 1345 964 299 114 50 296 146 79 102 36 56 112 95 154 205 51 114 60 55 146 139 77
1561G7l6M0M2mrlm2j1R8r7J48l2R0p0j03m0O1m0J17l5o8k9j5P7o4K5j6O6P7j21n3L1j1J39
$$ 77 41 81 123 119 110 107 65 54 152 55 203 171 261 191 88 48 109 69 186 151 83 54 39 116 52 77 61 127 204 83 30 61 50 189
1241A89p8m7J79o9q1m2M4rl5K9N7Q0j34j5J66j36qK2n7L6q4J29m2j5L8k6J2P6n0p3M1j3N5
$$ 189 111 64 243 174 93 51 95 86 51 80 137 217 83 68 234 98 90 112 55 91 7 136 94 79 117 91 103 179 129 56 97 84 139
932A39J3j01P0R8j89mM9J4R0n4n9J20j17j9N4J6l4m9K5O8R7o2r1O7q2J24r6k4oj4J36r5N2
$$ 139 152 51 121 219 30 26 75 89 179 125 66 186 69 50 104 120 86 37 62 130 227 165 74 141 59 183 87 63 57 43 179 84 136
622A36L9O5K87M66J844k07q57j632qJ33j03J20j89J27k15N0M4N1jp4J10j69J75p5M6nj01Q2
$$ 136 175 240 527 993 2837 2630 1773 141 133 266 163 283 94 221 6 56 100 151 150 76 186 17 192 117 163 158 57 139
359A39L3j22P6ro1J16k2r1%J60l5jQl7l5R6q2J04k22N1N0o0J5Q5q2J62j46o0Q6k0R7j32J03
$$ 139 172 50 126 117 56 172 150 59 59 219 184 183 191 154 119 215 133 237 15 66 116 56 71 156 74 236 90 30 116 96 193 61 164
49A64o1nk4kP0k7P1j12j3J26q0kQ0R0k60J17q9J21k1M7j0J07k46Q4Km9N9l2K5m5K97j65J57
$$ 164 103 98 74 72 142 115 186 74 61 187 107 105 185 275 15 132 43 164 143 190 180 287 41 125 127 78 137 105 130 85 382 217 374
-261C74k36l6J2p1J92q5k2P1j76J95m3lQ0j20
$$ 374 138 102 114 43 235 150 128 199 23 218 175 172 252 132
-392A32
##PAGE=	F1=1964.49
##FIRST=	4405.895418600002813,	4405.895418600002813,	0.56550139188766479492
##DATA TABLE=	(F2++(Y..Y)), PROFILE
4406B07M9Q4m8L3o7j7k6K5k14L49l2K6l01K36k01J95k75J03K70l60J63q0M2j29R1L08j44j57
$$ 207 256 340 292 325 258 241 215 240 26 375 343 369 68 304 103 298 23 126 396 36 199 119 161 32 123 431 287 130
4143A30O1j51RJ74o7n4R4k5P1j70K11k37J48j01J77k43J29N9r4K2rK30k40n0L6m3MJ84J1j01
$$ 130 191 40 49 223 156 102 196 171 242 72 283 46 194 93 270 27 156 215 121 143 134 364 124 74 110 67 71 255 266 165
3861A65r7J31j15LL2p0J56O7j88K3OJ0L5m1j1J87j74M9o3P5o2J1J33j40Kj05J1J26J21J9j57
$$ 165 68 199 84 87 119 49 205 272 84 107 113 123 158 117 106 293 119 168 105 180 118 129 262 122 124 19 30 156 277 296 139
3570A39O4o7LqKl4J18m0pJ59k32J51J3L2j12J36k42P4J5J38j33K84l38K10j28J1p8K70J86
$$ 139 203 136 139 131 133 99 217 177 170 329 97 248 261 293 181 317 75 149 164 302 169 453 115 325 197 208 130 400 586
3298E86q6j18j09k7j7M54R90K898q4L44l96J812L151N650Q277J2676K7842j610k7707k9692
$$ 586 500 382 273 246 229 683 1673 4571 4487 4831 4435 6247 9398 15048 23325 36001 63843 62233 34526 4834
3110D834j979j384o04j86m27O41Q62J014K948J1572J2639M66j0687j8400r01Q24P33m40p18
$$ 4834 2855 1471 867 681 254 895 1757 2771 5719 17291 29930 30396 19709 1309 408 1232 1965 1525 807
2932H07n55K40p5Op6m5r8r8J59jR8j00n7j2j84K86j45K1M7M5k0r3p9J58J07j86P6j12O3j13
$$ 807 252 492 417 423 347 302 204 106 265 264 362 262 205 193 9 295 150 171 218 263 243 150 71 229 336 150 226 114 177 64
2650F4L6M3J31k03R6k7O8l0j13K4K27k72J41j14Q6j08k0K23Qj69J16j32K8j0J6J44k2j76O7
$$ 64 100 143 274 71 167 140 208 178 65 89 316 44 185 71 157 49 29 252 260 91 207 75 103 93 109 253 231 55 122
2378A22p8J71j4L2q7K8k3j16J70j32J45q8qo2J18l2%o0L4N6NMj34R0n7k3l5j2J82o7K6N1J
$$ 122 44 215 201 233 146 174 151 35 205 73 218 130 122 60 178 146 146 86 120 176 181 185 51 141 84 61 26 14 196 129 155 206 207
2068B07j84J78j6n7j0k0O2o4J15j14%j5k0NL2o3K8J35L2r7K1J3q8J4l1k9J28q9M6r4L63N64
$$ 207 23 201 185 128 118 98 160 96 211 97 97 82 62 67 99 36 64 199 231 134 155 168 80 94 63 34 162 73 119 25 388 952
1767I52L90l75n79k98k9K53j03q0K8m1o4J26n4J5P6j51J04q1n9J20J3j17L1m1J39r2Kml1P2
$$ 952 1342 967 388 90 61 314 211 131 159 118 54 180 126 141 217 66 170 89 30 150 163 46 77 36 175 83 85 81 50 122
1486A22J0M8l6N2M1q9p5M6p8N4P5Pr6l9qK7M0K8j09J42L1r5o1JN7R7r8k8J63o8j27Q0o9J07
$$ 122 132 180 144 196 237 148 73 119 41 95 170 177 81 42 34 61 101 129 20 162 193 98 37 38 95 192 94 66 229 161 34 114 45 152
1166A52j17M2O0P4j46k7K30j61k5M7p1N4k3Pj1L0K5n7L8P3q4j8l2qO5K9j14J28jj03L8k3K2
$$ 152 35 77 137 211 65 38 268 107 82 129 58 112 89 96 85 115 140 83 121 194 110 92 60 52 117 146 32 160 159 56 94 71 93
856I3R0o6Rl9O2j27Q5j3oo8L0J37N0j03n5Q0m6J3r2J03j06M2J20p1P5p5O5K27N15J792m0o08
$$ 93 183 117 126 87 149 22 107 94 88 20 50 187 237 134 79 159 113 126 34 137 31 73 193 122 197 122 187 414 929 2721 2681 2073
556B073j741m8m0l1J74l01P8q6L8N8j3j6j4M9j59J26r0K13l7j59RO8r5N2J34j48N1K3q2l1
$$ 2073 332 284 244 213 387 86 164 78 116 174 161 145 131 180 21 147 57 270 233 74 83 151 56 108 242 94 145 168 86 55
274E5J52j23J63j69J27k5j4l3K3m6j0J27j94L3J32k9l4k1J5QN4j9m5M0o2l0N7M6N2j01J00
$$ 55 207 84 247 78 205 180 166 133 156 110 100 227 33 66 198 169 135 114 129 137 191 172 127 167 105 75 132 178 230 129 229
-17B29j12l0M0J53r9q4J72j43r2J22k1J75j47J22n0p9Q2r1N3r5J25j38k2K75N9k02J61j96
$$ 229 117 87 127 280 181 97 269 126 34 156 135 310 163 285 235 156 238 147 200 105 230 92 70 345 404 202 363 167
-280A67K6l9J30r7j1M4R0JR4k37J37j6
$$ 167 193 154 284 187 176 220 310 311 405 168 305 289
-392B89
##PAGE=	F1=1945.71
##FIRST=	4405.895418600002813,	4405.895418600002813,	0.36036697030067443848
##DATA TABLE=	(F2++(Y..Y)), PROFILE
4406E84J55R5j01j8j15j72mJ79k09L01J9p7m58L17k40J92j10J30J78l90M5p0j9O1J21K60j22
$$ 584 739 834 733 715 600 428 424 603 394 695 714 637 179 496 256 448 338 468 646 256 301 231 212 273 394 654 532
4152E32l09k3m8Q3Q7J28j66Q6n4m1k55M24k29K05p6P5k83nK05k61L00J7J48k93j19rl9J56
$$ 532 223 200 152 235 322 450 284 370 316 275 20 444 215 420 344 419 136 131 336 75 375 392 540 247 128 119 80 236
3889B36K43qj16j72K5p2J07J01r5K16o0l27J6l2K40J21o5l1J02k40m5%K47l0kJ03j97m4r0
$$ 236 479 471 355 183 208 136 243 344 249 465 405 78 94 62 302 423 358 327 429 189 144 144 391 361 359 462 265 221 131
3617A31Q2J58R9J13k49j6q6k02L56Q6j8M2p9k06J73j51L49O6K6j79P9m20J59J41K73k7K97
$$ 131 213 371 470 583 334 318 232 30 386 472 454 496 417 211 384 233 582 648 674 495 574 154 313 454 727 700 997
3364I97m75P9l33L19qM67K70j71k65n32J83L77O42J075j8J42J609j26J331O464J2345J9078
$$ 997 522 601 268 587 579 1046 1316 1145 880 348 531 908 1550 2625 2607 2749 4358 4232 5563 12027 24372 43450
3157D3450L6348P7834K5448m7149j17298j3720l653N80J081j86j175J119J433M198J7870K5017
$$ 43450 79798 157632 183080 135931 18633 4913 1260 1840 2921 2735 1560 2679 4112 8310 26180 51197
3007E1197J862j5626l3929l034J185J826j745M65j584N50k31j26k56p0M0QJ90n9R9k29j55
$$ 51197 53059 37433 3504 470 1655 3481 1736 2201 617 1167 936 810 554 484 524 532 722 663 762 533 378
2810C78l5n3K94q0K2l6m5p2j09OJ44J73j91Q4k14o9L8O2K5J94k41L4o0K9k0m4LL29l46J30
$$ 378 343 290 584 504 526 490 445 373 264 270 414 587 396 480 266 197 235 297 322 516 275 309 249 278 258 214 217 546 200 330
2528C30k76J63k4rK40J7l28K06j95o5M7O4K32n0j74k7j7J04O8j2KL7j24j67J36K6Q4l7Jm9
$$ 330 54 217 193 184 424 441 113 319 124 59 106 170 402 352 178 151 134 238 306 294 296 333 209 42 178 204 288 251 252 203
2246B03R0j43p9J04J00L6j10J12j88N3Qo1M2L4J09j11r5R5Q2j99K48j19M0l7j14l1jK10q6
$$ 203 293 150 71 175 275 311 201 313 125 178 186 125 167 201 310 199 104 199 281 82 330 211 251 214 100 69 68 278 192
1974A92MJ6r1m4m4Q4l9K26N0j83o4J07n4L6n5pJ49j47m7J07R5O93L54m28m01m16oK05Ko4K9
$$ 192 196 212 121 77 33 117 78 304 354 171 107 214 160 196 141 134 283 136 89 196 291 984 1338 910 509 93 87 292 294 230 259
1683B59j8j56J60p7k3R0q8J24p0j29O9M7j19Q2K1R3j49j1n0n0K08j38K80l02J89k0r0o8J76
$$ 259 241 85 245 168 145 235 147 271 201 72 141 188 69 151 172 265 116 105 55 5 213 75 355 53 242 222 132 64 240
1410B40j61Q1O3jj37%n1N4J11J6j18J18l9p6M6j4P1Qm8r3J36n0n7J45j53J46j34l1L9J29j76
$$ 240 79 160 223 222 85 85 34 88 199 215 97 215 176 100 146 132 203 211 163 70 206 156 99 244 91 237 103 72 111 240 64
1119F4M0K38j74p8M8m1P1M1j40J15%nq0LJ33m3Rk7j13Q4K0p7J64j73P4P2j39lQ7j9P3j27J79
$$ 64 104 342 168 90 138 97 168 209 69 184 184 179 99 102 235 192 201 174 61 145 165 88 252 79 153 225 86 83 170 151 224 97 276
810B76j97O0r1N8PO5J15Jk13K0N2M0q7R1M8j62Q0K0k6J23j18r4J19O24J688J18m60j669n0
$$ 276 79 139 48 106 113 178 293 294 81 101 153 193 106 197 245 83 163 183 157 280 162 68 187 811 2499 2617 2157 488 438
537D38j81M8J72l89j0J10M9P9n4p1Ok5r5N7N5K25q5j92n5L9N1m1K95j88l9J1p1p5J73r9K29
$$ 438 257 305 477 88 78 188 237 316 262 191 197 172 77 134 189 414 329 137 82 121 172 131 426 238 199 210 139 64 237 138 367
246C67j90J10j8j68P9n6J55j1J16k36m2J25Q5k29K16j0jK0j69Q1k3M5M8K5K5k6j16Q5m2O7
$$ 367 177 287 269 101 180 124 279 268 384 148 106 231 316 87 303 293 292 312 143 224 201 246 294 319 344 318 202 287 245 312
-36C12m9K57k14k37K02L7j50K19j0J68l35K16k23J64R7q0R8r5M0k09O9R4L41m74M50j79q5
$$ 312 263 520 306 69 271 308 158 377 367 535 200 416 193 357 454 374 472 377 417 208 277 371 712 238 688 509 424
-289D24k9O7L6J07K4J20p0Q5k52M4J09
$$ 424 395 462 498 605 629 749 679 764 512 556 665
-392F65
##PAGE=	F1=1926.93
##FIRST=	4405.895418600002813,	4405.895418600002813,	0.14186148345470428467
##DATA TABLE=	(F2++(Y..Y)), PROFILE
4406A128K46P1j63q2j74k79L1K77j66K60J0j79n74L10j85J70N1J33Q6m56q3n9J4K00J91J54
$$ 1128 1374 1445 1282 1200 1026 747 778 1055 889 1149 1159 980 406 716 531 701 752 885 971 515 432 373 387 587 778 932
4162I32r9m05k18Q5J91R3K46k78L3j06j87j36N05r8J52p2n5l15j90M22j84L62L1O3l68k23
$$ 932 833 428 210 295 486 579 825 547 580 474 287 151 656 558 710 638 583 268 78 500 316 678 709 772 404 181
3918A81J9O0K53K51mj84k43j36L0K62J48q8K31k10l99p3J43L09K13j00m0n2k86j13J64L33
$$ 181 200 260 513 764 760 576 333 197 227 489 637 549 780 570 171 98 241 550 763 663 623 571 285 172 336 669
3673F69O0k7Nk89q0k9J59K75P5J21l52j26j04q9M71J55Nn9j43l59J68M5M75J41j0k67m6m49
$$ 669 729 702 707 418 338 309 468 743 818 939 587 461 357 268 739 894 899 840 697 338 506 551 1026 1167 1157 890 844 395
3411C95K08L08M05M5K82o29r3l26N07K52N88K88k89m77n94J54R48R13J195l91n78R24n04O01
$$ 395 603 911 1316 1361 1643 1014 921 595 1102 1354 1942 2230 1941 1464 870 1024 1972 2885 4080 3689 3111 4035 3531 4132
3185D132J0629J9453L1729O6887J39703O9913o8582k35018k9558n977Q54J674J41k231N1J639
$$ 4132 14761 34214 65943 132830 272533 342446 273864 38846 9288 3311 4165 5839 5980 3749 3800 5439
3035E439N698K4713L8349K988k0061n0870n432P66L071l032K119k450O72m18l07l96j08K13
$$ 5439 11137 35850 74199 77187 57126 6256 824 1590 4661 1629 3748 1298 1970 1552 1245 849 741 954
2866I54J14K19j18P8l91k58m0R2L25k3J5j44j12j85q3J31J52J88j80M0l25j92K05J01N1K06
$$ 954 1068 1287 1169 1247 856 598 558 650 975 952 967 823 711 526 443 574 726 914 734 774 449 257 462 563 614 820
2622H20k47o6j40J0P0kL0L39l41L1l52J57J08qK53J7m17J79k20k3N8J49K01p9j81j48L0Q3
$$ 820 573 507 367 377 447 445 475 814 473 504 152 309 417 409 662 679 262 441 221 198 256 405 606 527 346 198 228 311
2359C11J76n3O0J6j92j91O7J64O2K1k0n3N0k27j48K81J30L3j92J76k53pR2o4J22Q3kj57k16
$$ 311 487 434 494 510 318 127 194 358 420 441 421 368 418 191 43 324 454 487 295 471 218 211 303 239 361 444 442 285 69
2087F9J04K02j47K80k05R4q3j77p1J11K01j7k9K2j62p8lJ18LK23L6k63j14J36K6N0nn1J48
$$ 69 173 375 228 508 303 397 314 137 66 177 378 361 332 354 192 114 111 229 232 455 491 228 114 250 276 326 321 270 418
1814D18k22j32L19j16P40L50n77j27n09k1J12J54j8K6j9k23J41q1j0R8l7J40q0j80k7R8n3
$$ 418 196 64 383 267 1007 1357 780 653 144 123 235 389 371 397 378 155 296 215 205 303 266 406 326 146 119 217 164
1561A64R3R3L0j51p3j24N2K33k16M51m70K21q7n5p3L05j56L0N1l8j87O9n5J18J00Jj28P8j20
$$ 164 257 350 380 229 156 32 84 317 101 552 82 303 216 161 88 393 237 267 318 280 93 162 107 225 325 326 198 276 156
1288A56m7J76j1O6o9Qk00R9J1O0J53j85J14j49j19jK62j67P6K28j95j60K8K9J04Q5j90J62
$$ 156 109 285 274 340 271 279 79 178 189 249 402 217 331 182 63 62 324 157 233 461 266 106 134 163 267 352 162 324
1025C24o4l3q6o6K38L2kj9k32R0J6j0K02k45J39Q4k50o6Q9J04J08o8J35k58K8j80J55Q7R0
$$ 324 260 227 141 75 313 345 343 324 92 182 198 188 390 145 284 368 118 52 141 245 353 285 420 162 190 10 165 252 342
753C42Q3j5l75R5LJ52m6J52j0j83N1j04N2J84o5j73j6N27J642K45m86j495J0k17O8J27m51
$$ 342 425 410 35 130 133 285 239 391 381 198 249 145 197 381 316 143 127 654 2296 2541 2055 560 570 353 421 548 97
500I7m6K69P5J02n9j52k7q7JQ2J49J70j33k03j12l9K23m8L78k10j03n9o5q9K35j0J92j19k0
$$ 97 51 320 395 497 438 286 259 172 173 255 404 574 441 238 126 87 310 262 640 430 327 268 203 114 349 339 531 412 392
227C92k9k84J85L1J88J3P3k77j32R2K44k34L09q0J0n6k82J81l8J65J02j0k4j37q8P6L0J82
$$ 392 363 79 264 295 483 496 569 292 160 252 496 262 571 491 501 445 163 344 306 471 573 563 539 402 314 390 420 602
-36F02p4K64l31k06M5K21j09K51M4Q0m18J90k95L44J45m9J10j06o7k20J10M4N14m14M00j69
$$ 602 528 792 461 255 300 521 412 663 707 787 369 559 264 608 753 704 814 708 641 421 531 575 1089 675 1075 906
-280I06j80k7O2J73K11N9Q0j07K3k23k4K15
$$ 906 726 699 761 934 1145 1204 1284 1177 1200 977 953 1168
-392A168
$$ 1168
##PAGE=	F1=1908.15
##FIRST=	4405.895418600002813,	4405.895418600002813,	0.2037982940673828125
##DATA TABLE=	(F2++(Y..Y)), PROFILE
4406A711L32K4k22j55k38l53Q5L40j05K18l5k82o61K67r2J75J84J10J4n57j87n5J12K94K52
$$ 1711 2043 2067 1845 1690 1452 1099 1184 1524 1419 1637 1602 1320 659 926 834 1009 1193 1303 1317 760 573 518 630 924 1176
4171A176M5r2m82m15K17L09J35L13l74m4j76l24K5N72M5Q2q4j98l43l63O52p8M04K4rm69l26
$$ 1176 1221 1129 647 232 449 758 893 1206 832 788 612 288 313 885 930 1012 928 730 387 24 676 598 1002 1026 1017 548 222
3918B22J03J49L48K40rk61l17k96J66M14J96r1K28l54m62j32L28L55K93j38n5k30l19r9K99
$$ 222 325 474 822 1062 1053 792 475 179 345 759 955 864 1092 738 276 144 472 827 1120 982 927 697 378 279 578
3683E78L93J53o0j10l97j04O9K32L94N8R7m54k39j12O2N73K01K3j60k27m64J89K34N70K17
$$ 578 971 1124 1064 954 557 453 522 754 1148 1206 1303 849 610 498 560 1133 1334 1357 1197 970 506 695 929 1499 1716
3448A716n7l62k11m09K86M62N45P7K36p74k71k35O72N45O83K74m16p29o14K28J512J273J342
$$ 1716 1659 1297 1086 677 963 1425 1970 2047 2283 1509 1238 1003 1675 2220 2903 3177 2761 2032 1418 1646 3158 4431 5773
3232E773K25j072r86j482R30J4190K5356M3797R8713K03773J26657q7452l66167m6788q346
$$ 5773 5998 4926 3940 2458 3388 17578 42934 86731 185444 389217 515874 428422 62255 15467 7121
3091G121M19J468L76l012j398J591P422L2033N0086L561k4942o5852p652N5L808m082L818
$$ 7121 7540 9008 9384 6372 4974 6565 13987 46020 96106 99667 74725 8873 1221 1276 5084 1002 4820
2932D820k601M46m81n02n06j44L80K09K46j58J6n36l57l1K28L69K4nk61j71l00l7K54J77J77
$$ 4820 2219 2665 2184 1682 1176 1032 1412 1621 1867 1709 1725 1189 832 801 1029 1398 1422 1417 1156 985 685 648 902 1079 1256
2697A256j68k3m33k63L37J43Q8J99k59j53k39J7J66L6N6L18l17q3m23J73K30jK65nm87J27
$$ 1256 1088 1065 632 369 706 849 937 1136 877 724 485 502 668 704 760 1078 761 678 255 428 658 657 922 917 430 557
2453E57k18K0Q5K24J67j17k08k31L5J04K81q2Q8l0k28k41P7K33P0P2n9o9kk64j04L39J30M0
$$ 557 339 359 444 668 835 718 510 279 314 418 699 617 705 675 447 206 283 516 586 658 599 530 528 264 160 499 629 669
2190F69k19J70l05p3J76m0J94J16j20j96k26K0L13p9K97k75J16j39k06K1J26J49M4n0Kk20
$$ 669 450 620 315 242 418 378 572 688 568 372 146 166 479 400 697 422 538 399 193 214 340 489 533 483 485 265
1946B65r8O5J22O3J98Kl20j05R1J22N5M5q4J21k96k03M98j53O02M21q39K10n62n2RL07M0K6
$$ 265 167 232 354 417 615 617 297 192 283 405 460 505 421 542 246 43 541 388 990 1411 572 782 220 168 177 484 524 550
1683E50m4k61P9o5M6J12k3J57j16k05j38J54L0J04J54l7j45j44j72J47K33j74M94n18J49j49
$$ 550 506 245 324 259 305 417 394 551 435 230 92 246 276 380 534 497 352 208 36 183 416 242 736 218 367 218
1439B18%p6M12j46j1J0o8k41J49m2J77P6j5j47L3j95K0K76oO0j25L7l04O2J04J52J47j96N6
$$ 218 218 142 554 408 397 407 339 98 247 205 382 458 443 296 329 134 154 430 424 484 359 396 92 154 258 410 557 361 417
1166D17j62k03kL82j45Q8K26k32k49lJ22J52J02j89J56j37n0q0o5K86R4j7k7l35O8K6Q6K38
$$ 417 255 52 50 432 287 375 601 369 120 117 239 391 493 304 460 323 273 193 128 414 508 491 464 129 197 223 309 547
903E47k61J38P5l41j41R9K44J34j3P4l09lj81J89J63R5M7nm63O7k7K48M5J62n5k05pk31J60
$$ 547 286 424 499 158 17 116 360 494 481 555 246 243 62 251 414 509 556 551 88 155 128 376 421 583 528 323 316 85 245
631B45K44jj23Q5L2J721L13o59j304J12j65L9N5m89O1K84J18J15m8k43q4j26J10J37K05R0
$$ 245 489 488 365 450 482 2203 2516 1857 553 665 500 539 594 105 166 450 568 683 635 392 308 182 292 429 634 724
387G24j71k00j87o7L44%M07k20j64j40o3p3L14N0J57o2j45o3l01K17J67J68M9Rl16k18N2M14
$$ 724 553 353 166 99 443 443 850 630 466 326 263 190 504 554 711 649 504 441 140 357 524 692 741 750 434 216 268 682
124F82k19L98j68K4j50l33K37j9K75J29l9q5k59m2J02P6L04j00K36m31j63r4L70k7K58J04
$$ 682 463 861 693 717 567 234 471 452 727 856 817 732 473 431 533 609 913 813 1049 618 455 361 731 704 962 1066
-120A066m4m34J03k75M53K17l0J07j30j69k18J57O7O02k95K79j62k66j1Q4L02L00J17Nj35
$$ 1066 1022 588 691 416 869 1086 1056 1163 1033 864 646 803 870 1472 1177 1456 1294 1028 1017 1101 1403 1703 1820 1825 1690
-355A690n3j77p0L11
$$ 1690 1637 1460 1390 1701
-392A701
$$ 1701
##PAGE=	F1=1889.37
##FIRST=	4405.895418600002813,	4405.895418600002813,	0.12378181517124176025
##DATA TABLE=	(F2++(Y..Y)), PROFILE
4406B219L97l3k68k30k86l98J49L73l7J68r3l75p02K02J5J94K85O4k9o71k53n3K31L51K96
$$ 2219 2616 2583 2315 2085 1799 1401 1550 1923 1886 2054 1961 1586 884 1086 1101 1295 1580 1644 1615 944 691 638 869 1220 1516
4171A516n6j00n33n63L23M13J89L35m44j22k57m10J82O14J77Kj02l33l59l81P38L6M20kn9
$$ 1516 1460 1360 827 264 587 1000 1189 1524 1080 958 701 291 473 1087 1264 1266 1164 831 472 91 829 865 1285 1283 1224
3936A224n75m05K11K25M22K13k7l24l82m11K96N31K43j03K02m65n15j53M92L79L53j75p4m01
$$ 1224 649 244 455 680 1102 1315 1288 964 582 171 467 998 1241 1138 1340 875 360 207 699 1078 1431 1256 1182 781
3711G81l32l8L99M28K31r5k17n02j08J81K92M82M4O5n43l35j01K19O46K12L5k40l17n17K33
$$ 781 449 411 810 1238 1469 1374 1157 655 547 728 1020 1502 1546 1611 1068 733 632 851 1497 1709 1744 1504 1187 670 903
3476I03L88O24K74j00m48l83l15L82N71O68O9J66q80m19j05Q09Q07P34K34n27r77o17M29J961
$$ 903 1291 1915 2189 2089 1641 1258 943 1325 1896 2564 2633 2799 1919 1500 1395 2204 3011 3745 3979 3452 2475 1858 2287 4248
3251D248J625J477N01j350k524k631L675J5162K8738N2761J25447K57657J87300r9652m87601
$$ 4248 5873 7350 7851 6501 3977 1346 5021 20183 48921 101682 227129 484786 672086 572434 84833
3110H4833o2418j0624k05L24K80l354k831J288R164L9472N8640L739l1311p6113r281K92L043
$$ 84833 22415 11791 11586 11910 12190 8836 6005 7293 16457 55929 114569 118308 86997 10884 1603 1895 4938
2950D938l034L007j668j39l64o70o05j72N17K74K71j65q2o30m38j9L39M12N7l2l67k22l83
$$ 4938 1904 4911 3243 3104 2740 2070 1465 1293 1810 2084 2355 2190 2108 1478 1040 1021 1360 1772 1829 1797 1430 1208 825
2734H25QL61K05J46j48r6n23k73M20J73J28J81k71k18l31M7K31P5P6K77k84j88m82K12L20
$$ 825 833 1194 1399 1545 1397 1301 778 505 925 1098 1226 1407 1136 918 587 634 865 940 1016 1293 1009 821 339 551 871
2500H71J1K66l8n39P7j96N1J19K81J42j64k43k57%J44L68j03J03r7k32k97J28K58R3J05r9
$$ 871 882 1148 1110 571 648 452 503 622 903 1045 881 638 381 381 525 893 790 893 796 564 267 395 653 746 851 752
2256G52r1n6k59o5L78J11N4k09J18l34j27K41jK50J28k23k22j93n2L74rK93l24J11j91k03
$$ 752 661 605 346 281 659 770 824 615 733 399 272 513 512 762 890 667 445 252 200 574 565 858 534 645 454 251
2011B51J06J43Q3Q5m9l9k52j07J24J33J11J56l3l48q7M5K01N1Q3r9P1l47k44O03p0L54N74
$$ 251 357 500 583 668 619 580 328 221 345 478 589 745 712 364 277 322 523 574 657 558 629 282 38 641 571 925 1499
1758A499j198N59n65q1l0L76R4L4q6k66j4l0J13J32l3J75j71j97k29J93J05J17J91r4j42k08
$$ 1499 301 860 295 214 184 560 654 688 602 336 322 292 405 537 504 679 508 311 82 275 380 497 688 594 452 244
1514B44j72K05K16r8M77n25P2k00N8p4M88j32l3o8p0k88K20j9K26N0l4j72qk50J15L28oN7
$$ 244 72 277 493 395 872 347 419 219 277 203 691 559 526 458 388 100 320 301 527 577 543 371 363 113 228 556 550 607
1251F07j61M3l83M6J88K09J25j77j6j74k47P3L93j09Q4K30k83l21l3K16K02R4j60J21k12m7
$$ 607 446 489 106 152 340 549 674 497 481 307 60 133 526 417 501 731 448 127 94 310 512 606 446 567 355 308
1007C08o7j7K90J26j7n7m00J7M3K03K64k86J43M5l98j24N6L30J63K2J3l40k9j85K40K29P6
$$ 308 241 224 514 640 623 566 166 183 226 429 693 407 550 595 197 73 129 459 622 644 657 317 288 103 343 572 648
753F48J0J4n14J2j0K93J39J48p7k34p6l13K53K92M5m8J50m04J861L01q24j154K03p1mk8n08
$$ 648 658 672 158 170 160 453 592 740 663 429 353 40 293 585 630 582 732 328 2189 2490 1666 512 715 644 640 612 104
500A04J77K69J75J11k8l29j42j46K21J80K42Jj93j85k72k4L84Q1L91k16k22k09o9l1L81Q8
$$ 104 281 550 725 836 808 479 337 191 412 592 834 835 642 457 185 161 545 626 1017 801 579 370 301 270 651 739
256G39J31l4k32j12k83K23L08J26R2o8l47k76J5N57k05M84k59M1k43l49K76QL69J28n3j49
$$ 739 870 836 604 492 209 432 740 866 958 890 543 267 282 839 634 1118 859 900 657 308 584 592 961 1089 1036 887
11H87l75J6J49R8M13j32J86m95j19j90M60Q4K31J59j76m05kk21N23K95l2R9j60k48k15K23
$$ 887 512 528 677 775 1188 1056 1242 747 628 438 898 982 1213 1372 1196 791 789 568 1091 1386 1354 1453 1293 1045 830 1053
-233A053R4O39j51J23j52l41K5J13M08L65J82q9j57j23j20j00L93
$$ 1053 1147 1786 1635 1758 1606 1265 1290 1403 1811 2176 2358 2269 2112 1989 1869 1769 2162
-392B162
$$ 2162
##PAGE=	F1=1870.59
##FIRST=	4405.895418600002813,	4405.895418600002813,	0.49312904477119445801
##DATA TABLE=	(F2++(Y..Y)), PROFILE
4406B547M32q8k91k95l02m18K13L74K9J07j41m46o86J27J15K16L46Ll9p73k69m7L33L70L16
$$ 2547 2979 2891 2600 2305 2003 1585 1798 2172 2201 2308 2167 1721 1035 1162 1277 1493 1839 1842 1803 1030 761 714 1047 1417 1733
4171A733j39j13n49o42L93M78K43L09m75j82l35m21L04O13K80p6j21m38l57l38P61J38M03
$$ 1733 1594 1481 932 290 683 1161 1404 1713 1238 1056 721 300 604 1217 1497 1421 1300 862 505 167 928 1066 1469
3955A469l9p9o67m38L12K84M54J74n5l55m27m50L82N94K80j16J52n27n42j47O21L68L89k08
$$ 1469 1430 1351 684 246 558 842 1296 1470 1415 1060 633 183 565 1159 1439 1323 1475 948 406 259 880 1248 1637 1429
3730A429r0n33l22M2M54M38K76j20l01n80q9K78L34N19L1L8o04l99o9L54O70J90L6k79m01
$$ 1429 1339 806 484 526 980 1418 1694 1574 1273 693 604 882 1216 1735 1766 1804 1200 801 732 1086 1756 1946 1982 1703 1302
3495A302n12K85M89O28K96j25n08n28j85M75O14P46L1P9r22n04L2Q95R82P30J73n99j172n88
$$ 1302 790 1075 1564 2192 2488 2363 1855 1327 1142 1617 2231 2977 3008 3087 2165 1661 1693 2588 3570 4300 4473 3874 2702 2114
3270B114P07K206J873J544M00j541l351k814O311J4584K8983N6646J41296K89761K40759j01979
$$ 2114 2821 5027 6900 8444 8844 7303 3952 1138 7449 22033 51016 107662 248958 538719 779478 677499
3119F77499n75292p3377j2314p32j678m07l112l869P02J0504M5850O3506M131l9024q0271
$$ 677499 102207 28830 16516 15784 14106 13699 10587 6718 7420 17924 63774 127280 131411 92387 12116
2979A2116r999R77J934o75m48K55r09j16p89o96j89O12K92K97j39k02o54m82j7M13M39P6o0
$$ 12116 2117 3094 5028 4353 3905 4160 3251 3135 2346 1650 1461 2073 2365 2662 2523 2321 1667 1185 1168 1581 2020 2096 2036
2763B036m43k60m13L8M39K25R6j14j64n81k34M53J81J63J56k78k52l99R9K45J14Q4K27k49
$$ 2036 1593 1333 920 958 1397 1622 1718 1604 1440 859 625 1078 1259 1422 1578 1300 1048 649 748 993 1107 1191 1418 1169
2537A169k65n16K64L62K4K54p1n67M2j61O9J49L09J30k12k75k30n6J79M28j14J05j69k05l42
$$ 1169 904 388 652 1014 1038 1292 1221 654 696 535 604 753 1062 1192 980 705 475 419 598 1026 912 1017 848 643 301
2303C01J83K61J20J10j27j09j05k22l2L91P9O8j75M5l33j58K73L8K88J20k98k31j48r3L93
$$ 301 484 745 865 975 848 739 634 412 380 771 850 918 743 788 455 297 570 608 896 1016 718 487 339 246 639
2068F39M9K71l48Q4k29j66J68J58J4R7k5q8k55j07J66J54J30J01n5l43p8K8K39M4J01r5Pl62
$$ 639 688 959 611 695 466 300 468 626 640 737 712 624 369 262 428 582 712 813 758 415 337 365 604 648 749 654 661 299
1805B99k29N95N5R6P76j541Q13n14r9J2L33J32N5j38k35j18J6J63J53n0J84k26j56k79K02
$$ 299 70 665 720 816 1592 51 864 350 251 263 596 728 783 645 410 292 308 471 624 574 758 532 376 97 299
1570B99J60J23K02j35j41k52j40K29J88j0M13m90jk31J06o5N23j20k9j72m1l13K65PK57K7
$$ 299 459 582 784 649 508 256 116 345 533 523 936 446 445 214 320 255 778 658 629 457 416 103 368 375 632 659
1326F59n5j96l9k79K13L34j0N7j77L4m27O2K36K24R3j28r2j84k35J33L55n7O2K35l37l53n4
$$ 659 604 408 369 90 303 637 627 684 507 541 114 176 412 636 729 601 509 325 90 223 578 521 583 818 481 128 74
1072G4K91K35O7j11O8k76k5m9L3K83J17Qj04m14n0N9L15K74l14J59km12q1K8L47J90L4l4l47
$$ 74 365 600 667 556 624 348 323 274 307 590 707 715 611 197 147 206 521 795 481 640 638 226 145 173 520 710 744 710 363
800C63m7j92K95K73M3k6L2n26m6L9K95K11J17o8k74j34k59K31L21O2L8J65o96J906K24q30
$$ 363 316 124 419 692 735 709 741 215 169 208 503 714 831 763 489 355 96 327 648 710 748 913 217 2123 2347 1517
556A517j015K22K0l7j11n06K86K24K39Q3ll95j81j59L24J98K60q4j95j58l48M8L65J77L38
$$ 1517 502 724 744 707 596 90 376 600 839 922 919 524 343 184 508 706 966 882 687 529 181 229 594 771 1109
321A109k03k64k53q0K6M15J08J15l4k70j61k55K19M26P5J29j38l67k95j0O43j92N47l36O2
$$ 1109 906 642 389 309 335 750 858 973 939 669 508 253 472 898 973 1102 964 597 302 292 935 743 1290 954 1016
86A016l22l39L09K6M32J08n1k05m68Q3J94J02M87j63J21n08q2k36M86K01J73K00k87l49r5
$$ 1016 694 355 664 690 1122 1230 1179 974 506 589 783 885 1372 1209 1330 822 740 504 990 1191 1364 1564 1277 928 833
-148H33j59N58L56n4R2j88k91k14L05R4O34om5j30m02Q3J32M77L96K40j82j74j72n8j17M48
$$ 833 674 1232 1588 1534 1626 1438 1147 933 1238 1332 1966 1960 1915 1785 1383 1466 1598 2075 2471 2711 2529 2355 2183 2125 2008 2456
-392B456
$$ 2456
##PAGE=	F1=1851.81
##FIRST=	4405.895418600002813,	4405.895418600002813,	0.72361731529235839844
##DATA TABLE=	(F2++(Y..Y)), PROFILE
4406B632M30j31k86l43k73m13K62L46Q3L5j60m84o17O0J89K27L65o1k1q38k38l0L93L48L18
$$ 2632 3062 2931 2645 2302 2029 1616 1878 2224 2307 2342 2182 1698 1081 1141 1330 1557 1922 1861 1840 1002 764 734 1127 1475 1793
4171A793k06j19n25o45M19M95K86K42m69k09l93l63L76N67L37j41j34m94l35k59P30K11L52
$$ 1793 1587 1468 943 298 717 1212 1498 1740 1271 1062 669 306 682 1249 1586 1445 1311 817 482 223 953 1164 1516
3955A516p7p1p23m17L88L15M32J31q5l51m39m12M15N89K96j20P9n28n31j22O97L16M05k38
$$ 1516 1439 1368 645 228 616 931 1363 1494 1409 1058 619 207 622 1211 1507 1387 1466 938 407 285 982 1298 1703 1465
3730A465r5o06k85J17M57M19K84j29l55o11n2L44L53M95J7K7o30m27j1M44O34J44K4k67m64
$$ 1465 1370 764 479 596 1053 1472 1756 1627 1272 661 609 953 1306 1801 1818 1845 1215 788 777 1221 1855 1999 2023 1756 1292
3495A292m59L34N25N81K77j24n30o23m0N44N86P56k0j4q88n10J47R16J033O72J00o19j272
$$ 1292 833 1167 1692 2273 2550 2426 1896 1273 1233 1777 2363 3119 3099 3085 2197 1687 1834 2750 3783 4455 4555 3936 2664
3279B664n07R77K204J944J500J07j684l500j821P381J3292K6259N4586J42649K92690K75604
$$ 2664 2157 3134 5338 7282 8782 8889 7205 3705 1884 9265 22557 48816 103402 246051 538741 814345
3129H14345r2913o10684p7351j2954q99m143j925k299m179j93J0907M9240O4545N343m5689
$$ 814345 721432 110748 33397 20443 19544 15401 13476 11177 6998 6805 17712 66952 131497 136840 91151
2988I1151p8524r806R09J796J051m357K507j552J17q45p63j85O58K61L15r3l16o14m74l0M45
$$ 91151 12627 2821 3730 5526 6577 2220 4727 3175 3292 2447 1684 1499 2157 2418 2733 2640 2324 1710 1236 1206 1651
2791A651M42P8q3m78k82l78M5M79K34K5o5k16n98j58M40J62J89J25k72k56m28J62K07J47Q0
$$ 1651 2093 2171 2088 1610 1328 950 995 1474 1708 1733 1668 1452 854 696 1136 1298 1487 1612 1340 1084 656 818 1025 1172 1252
2556A252J75k17l00n18L15L48L9K31r9n66L1j21P7J63L06J28k52k95j63j13J96M53j17R9k31
$$ 1252 1427 1210 910 392 707 1055 1094 1325 1226 660 691 570 647 810 1116 1244 992 697 534 421 617 1070 953 1052 821
2321H21j56l60K15K52J44Q2j31j19j40j64jL68M4P8j32k6l02j66K71O4L12Q6l32k21r9j17
$$ 821 665 305 520 772 916 998 867 748 608 444 443 811 855 933 801 775 473 307 578 642 954 1040 708 487 388 271
2077B71L87Q3K40l40L4k44j04K00J67m9Q0J9j35k31r9J87J85J09M3n9l06p9M4K32L1R8p7o0
$$ 271 658 741 981 641 675 431 327 527 694 645 725 744 609 378 279 466 651 760 803 744 438 359 403 635 666 764 687 627
1814F27l30j77M94J56j01R57j345N12m23j04Q3K29J50Q9j91j77k09O4J79J73o4J76k66r2k95
$$ 627 297 120 614 770 669 1626 281 793 370 266 349 578 728 817 626 449 240 304 483 656 592 768 502 410 115
1579A15J96J85J21J85j54j36k71q0K13J53P1L17m19o1k36J37m9N07j06mk85J6l07K74K8K69
$$ 115 311 496 617 802 648 512 241 161 374 527 598 915 496 435 199 336 287 794 688 684 399 415 108 382 410 679
1335F79J1p9k14n2k82K96K99j6N3j64J0m32J01K47J97N2n0j63j88j82J73K76OK5K41l84l38
$$ 679 690 611 397 345 63 359 658 642 695 531 541 109 210 457 654 706 656 493 305 123 296 572 578 603 844 460 122
1082A22n1L20K43L1n5J3l20J1k7O3K76O7O0j64l75j16O9L96K67l38J87o0l78l2ML18K08K4
$$ 122 71 391 634 665 610 623 303 314 287 350 626 693 753 589 214 98 167 563 830 492 679 619 241 209 213 531 739 763
819G63o1l26n5j94L38K83Po0M4m91r5R0K74K44P6k8l22j64j55J66L26N6J12J31p74J700J16
$$ 763 702 376 321 127 465 748 755 695 739 248 153 243 517 761 837 809 487 323 168 334 660 716 828 959 185 1885 2001
565B001o51q05J62P2n2j82m77L73J48L01L3K3m31j86j70M05J84K59j51j80j22m00J29K96K73
$$ 2001 1350 545 707 779 727 545 68 441 589 890 923 946 515 329 159 564 748 1007 856 676 554 154 283 579 852
331H52K55j82k82k64r6Q9M08J10J03n6k53j95k26K08M97K3J52j86l72k68k3O59j78N68l85
$$ 852 1107 925 643 379 283 372 780 890 993 937 684 489 263 471 968 991 1143 957 585 317 294 953 775 1343 958
96I58Q5l74l02L32K4M52P8l2k46n29J60K18R3N13j82M5m67n5k28M51K96R2K22l52k84j55r8
$$ 958 1043 669 367 699 723 1175 1253 1221 975 446 606 824 917 1430 1248 1293 826 771 543 994 1290 1382 1604 1252 968 813 715
-158G15N50L85r1R0k07k92k13L87N9N89J21k02q8m43J54J31M98L91K76k54j87j90Mj24M69
$$ 715 1265 1650 1559 1649 1442 1150 937 1324 1383 1972 2093 1891 1803 1360 1514 1645 2143 2534 2810 2556 2369 2179 2183 2059 2528
-392B528
$$ 2528
##PAGE=	F1=1833.03
##FIRST=	4405.895418600002813,	4405.895418600002813,	0.72333437204360961914
##DATA TABLE=	(F2++(Y..Y)), PROFILE
4406B465L91j54k57l65j97l89K88K92J21m5j45m80n07J5K22K19L46j18J8q52j65lL98K87L07
$$ 2465 2856 2702 2445 2080 1883 1494 1782 2074 2195 2150 2005 1525 1018 1033 1255 1474 1820 1702 1720 868 703 700 1098 1385 1692
4171A692k56j12m63n72L97M62L10J44m31j95m18k62M01M79L45j87j39m93k94j55O49K42K74
$$ 1692 1436 1324 861 289 686 1148 1458 1602 1171 976 558 296 697 1176 1521 1334 1195 702 408 253 902 1144 1418
3955A418j07m4p27l47M28L17L50R5j11l13m14l18M00N19K88j11rm74m81p9P09K28M03k66q3
$$ 1418 1311 1267 540 193 621 938 1288 1383 1272 959 545 227 627 1146 1434 1323 1314 840 359 280 989 1217 1620 1354 1271
3720A271o13k25J73M10L74K54j16l77n87pL69L53M10JL7o22m15O5M78N41Q5kk06m94l73L71
$$ 1271 658 433 606 1016 1390 1644 1528 1151 564 557 926 1279 1689 1690 1727 1105 690 755 1233 1774 1859 1857 1651 1157 784 1155
3476A155M96M96K12r1n13o57R8N75M97O91o8j01p83m39K19Q71R51N72K5n87j253l68J151J975
$$ 1155 1651 2147 2359 2268 1755 1098 1196 1771 2268 2959 2891 2790 2007 1568 1787 2658 3609 4181 4206 3619 2366 1998 3149 5124
3251E124J811J324j86j771l127o73P395J1496K1384M7082J29146K65593K83002p3208n85831
$$ 5124 6935 8259 8073 6302 3175 2502 9897 21393 42777 89859 219005 484598 767600 694392 108561
3110A08561p3446j2263n26o414m417j131l565j316R935M7696O1273P386m7240p2106q926l18
$$ 108561 35115 22852 22326 15912 11495 10364 6799 5483 15418 63114 124387 131773 84533 12427 3501 3183
2960C183K170K013o659M019j738J68q36p70j53O59J93L11n1l96n26m06n3M33M16O4r8m68k92
$$ 3183 5353 7366 707 4726 2988 3156 2320 1550 1397 2056 2249 2560 2509 2113 1587 1181 1128 1561 1977 2041 1943 1475 1183
2744A183k76L0M79K29o4pk40n72o6L96J16K03Q6k48k33m18K28J29J69O5J27j94k86m91L56
$$ 1183 907 937 1416 1645 1581 1574 1334 762 696 1092 1208 1411 1497 1249 1016 598 826 955 1124 1189 1316 1122 836 345 701
2509G01K88N2J99j17n35L9p7Q0J53K76J27k76k93p5j56J90M40j11Q0k66r6l41K10K35J62K3
$$ 701 989 1041 1240 1123 588 627 550 630 783 1059 1186 910 617 542 386 576 1016 905 985 719 623 282 492 727 889 912
2265I12j11j13j58r6K4L16RQ0q8q1k45j51K39O8L24L2l25j94n2j30L66Q9K04k99l3k34k7K02
$$ 912 801 688 530 434 458 774 783 863 775 694 449 298 537 605 929 961 636 442 390 260 626 715 919 620 587 353 326 528
2002E28J65r7L8P4j71j88q1J86K20N2j1m5k40r2Q6J89J2P8n3j16k59j04L38J83k17J057j055
$$ 528 693 596 634 708 537 349 268 454 674 726 715 670 430 338 424 613 625 703 650 534 275 171 509 692 475 1532 477
1749D77J88l20r1J53R8J47J31k36j04k68J10J48J93o8J42k73j9k88J89J79J05J47j51j19k66
$$ 477 665 345 254 407 505 652 783 547 443 175 285 433 626 558 700 427 408 120 309 488 593 740 589 470 204
1514B04nJ58J22J27K10l27j02k16J49k5M42r3L5l85R0k74K52M0K60%j02k22m4k62L50K34j9
$$ 204 199 357 479 606 816 489 387 171 320 295 737 644 679 294 384 110 362 402 662 662 560 338 294 32 382 616 597
1260E97L6j17k9m00J49K32J32J1M2k15j92j01J95J69O9j8K41m17k77k2L00K21onk9l39N3%
$$ 597 633 516 487 87 236 468 600 611 653 438 246 145 340 509 578 560 801 384 107 85 385 606 600 595 566 227 280 280
997B80O3K71j4J29k22k90j67P1M24K46l46K15j18l06K0k3K60K10ko3k77o1j79L55K50j6r5
$$ 280 343 614 600 729 507 217 50 121 545 791 445 660 542 236 256 233 493 703 701 638 361 300 121 476 726 710 615
744F15M9m11j22J24K36K33L5L2l69j59m0Q3L08M0J52N9n81J144K5l76m78P5O6m4k37m10M24
$$ 615 664 253 131 255 491 724 759 791 422 263 223 306 614 654 806 865 284 1428 1453 1077 599 674 740 696 459 49 473
490D73M9L48l5M8m30j54j74M45J41K42j94j51q1m17K06J92L48J55j59k68k43j06J41L60R7
$$ 473 522 870 835 883 453 299 125 570 711 953 759 608 527 110 316 508 856 1011 852 584 341 235 376 736 833
256H33R4r0j95k00k02J93N09k3J53j99l63k01k5O08j61N37l96J03l89k41L41jM27M7%k70n46
$$ 833 927 837 642 442 240 433 942 919 1072 873 510 309 284 892 731 1268 872 975 586 345 686 685 1112 1159 1159 889 343
2C43K37K11P3M90j83l5l75m4j67L65L46MK23l59k26j68m5N02L68j34R4k11k53k10M55mN09
$$ 343 580 791 864 1354 1171 1136 761 717 550 915 1261 1265 1488 1129 903 735 690 1192 1560 1426 1520 1309 1056 846 1301 1297 1806
-252A806K11l26k8m59K30J05M69L54K81k95j93j71N6j18M51
$$ 1806 2017 1691 1663 1204 1434 1539 2008 2362 2643 2348 2155 1984 2040 1922 2373
-392B373
$$ 2373
##PAGE=	F1=1814.25
##FIRST=	4405.895418600002813,	4405.895418600002813,	0.79863965511322021484
##DATA TABLE=	(F2++(Y..Y)), PROFILE
4406B092L21j56k07l61q0l55K91K13J44j29r8m34l76NK04J93K96j61O5q10o5L2L53J92K90
$$ 2092 2413 2257 2050 1689 1609 1254 1545 1758 1902 1773 1675 1241 865 870 1074 1267 1563 1402 1467 657 592 624 977 1169 1459
4171A459k92q8l73m33L24L95L07L3l73j44m05j45L90L57L14k12j40m34k42m0N31K29J82j23
$$ 1459 1167 1079 706 273 597 992 1299 1332 959 815 410 265 655 1012 1326 1114 974 540 298 258 789 1018 1200 1077
3946A077j2o75k44M34K91K19P1j28k56l49j96L52M00K52q8r7l86l95j7O51J19L87k94n4n57
$$ 1077 1065 390 146 580 871 1090 1161 1033 777 428 232 584 984 1236 1148 1051 665 270 253 904 1023 1410 1116 1062 505
3711E05j48K00L21L13J95q8l68n15L7L58L39K78j8O4n87l66J49M56M06K9m5j08m87k71L90
$$ 505 357 557 878 1191 1386 1298 930 415 452 810 1149 1427 1409 1473 886 520 669 1125 1531 1560 1515 1407 920 649 1039
3476A039M15L86J16l4m60o38K17N60L72N58r9j75o25l09K40P74P56M46m4n11j119j82J176
$$ 1039 1454 1840 1956 1922 1462 824 1041 1601 1973 2531 2432 2257 1632 1323 1563 2337 3093 3539 3495 2984 1865 1683 2859
3260B859J579J497J034l60j764k432L31O485R315J5533L5860J03825K14654K59370m6043n05710
$$ 2859 4438 5935 6969 6609 4845 2413 2744 9229 18544 34077 69937 173762 388416 647786 601743 96033
3110I6033o2455j0240M13p759p795m6k006k310P409M0303N2917R527m0403o2284p433k234
$$ 96033 33578 23338 23751 15992 8197 8151 6145 3835 11244 51547 104464 113991 73588 11304 3871 1637
2960A637J992K301n505L626j278o2p67o76q3O18J06K71l4m21m19k78p2L78L64L7j09m15k92
$$ 1637 3629 5930 425 4051 2773 2711 1944 1268 1185 1803 1909 2180 2146 1725 1306 1028 956 1334 1698 1735 1626 1211 919
2744I19j24LM43K11j62M5k31n03K1L36N1K06L9k13j88l74K88L5J72M6Q3j79k27m42L79J95
$$ 919 795 798 1241 1452 1290 1335 1104 601 622 958 1009 1215 1254 1041 853 479 767 802 974 1020 1103 924 697 255 634 829
2500H29O1J64j26m78O1l1P9J18K30J21k80k68J7j79J65L92r6M8k66l9k78J66K06J74n7o9r3
$$ 829 890 1054 928 450 511 480 559 677 907 1028 748 480 497 318 483 875 779 827 561 522 244 410 616 790 733 664 571
2246E71j63k5M3K43j8P4n4j12j72j13J80N0L29l9k81j56pj35L32P0J72k29j14k01N1J83J50
$$ 571 408 383 426 669 651 725 671 559 387 274 454 504 833 794 513 357 350 215 547 617 789 560 446 245 296 479 629
1993F29j27j6J26j88j39n3J66K48k5n4k2j53j12J43J27j4M5l2j52j61k3J79J12k70J038p05
$$ 629 502 486 612 424 285 232 398 646 621 567 545 392 280 423 550 536 581 549 397 236 213 392 504 234 1272 567
1749E67n8k36n8K07l1J25J74k71k8k73J43O7K14o0Q1k41M6k62J86J45P9R6j31q6k41P3P5R7
$$ 567 509 273 215 422 391 516 690 419 391 118 261 328 542 482 563 322 368 106 292 437 516 612 481 395 154 227 302 399
1486C99J49J13k35j22j76J47ML36p3P2m51J64k22K09M2K31mj24k17j7j96L41J51j1kl6q3l41
$$ 399 548 661 426 304 128 275 279 615 542 614 163 327 105 314 356 587 583 459 242 225 29 370 521 510 508 472 389 48
1223D8J97K00M6l0J32k40j97qK02N1J23n6K28m28j88K7K42J73l4K7m7l34R1L2L4K69j10K01
$$ 48 245 445 491 461 593 353 156 148 350 401 524 468 696 268 80 107 349 522 488 515 468 134 225 257 291 560 450 651
960F51k69j74j88O1L88K16l28K29j63k11O8n4J91J90l2m8j97p4j38L38J74j3j33M5k99j06
$$ 651 382 208 20 81 469 685 357 586 423 212 280 226 417 607 575 527 330 256 118 456 630 617 484 529 230 124
716A24J17J88J82LR8m05j21O9oK67K6J48l1j74L04Lj20n1J8%k1k77k98M33n8L70j15P2l93
$$ 124 241 429 611 614 712 307 186 255 249 516 542 690 659 485 789 792 672 621 639 639 618 341 43 476 418 788 673 745 352
443C52r0j60M28P6K15k15j08m7l93K69P6L87N1j39k22j96r7J63K81P1Q4j25j10j73j85J83
$$ 352 262 102 530 606 821 606 498 451 58 327 403 790 841 702 480 284 187 350 631 702 786 661 551 378 193 376
199C76M53n7J33j74l43j08k0N06j38M58l72J14l68j60L32m2L59K2M0k78n05K94J77M0M25j64
$$ 376 829 772 905 731 388 280 260 766 628 1086 714 828 460 300 632 590 949 971 1011 733 228 522 699 739 1164 1000
-45A000j13k47m7o6K50L39p9K05l05j88j34JM17L04j68R9j98j87j98M95p7L99K54m01M2m43
$$ 1000 887 640 593 527 777 1116 1037 1242 937 749 615 616 1033 1337 1169 1268 1070 883 685 1180 1103 1502 1756 1355 1397 954
-289I54K98N9L94K97K55l02j93j19R7j04M01
$$ 954 1252 1311 1705 2002 2257 1955 1762 1643 1740 1636 2037
-392B037
$$ 2037
##PAGE=	F1=1795.47
##FIRST=	4405.895418600002813,	4405.895418600002813,	3.6850714683532714844
##DATA TABLE=	(F2++(Y..Y)), PROFILE
4406A597K30j39j46l36O7l21K76J14J53k07l4l47k44K6J40J53K26j85J04p12M2O7K73P4K73
$$ 1597 1827 1688 1542 1206 1273 952 1228 1342 1495 1288 1254 907 663 689 829 982 1208 1023 1127 415 457 524 797 871 1144
4171A144l10n5k71k45K05L14K75p1l10o7l55l6L52K19K58k18j41l30j84P4L93J75R2j25J3
$$ 1144 834 779 508 263 468 782 1057 986 676 609 254 218 570 789 1047 829 688 358 174 248 641 816 908 783 796
3936G96n67j38M15K44N8O5j35j92k46q0K85K57J92n6j69k87k86O3N29J1L57l19j1m53n8J93
$$ 796 229 91 506 750 808 873 738 546 300 220 505 762 954 898 729 442 156 219 748 759 1116 797 786 333 275 468
3692D68K04K47J15m9l36m08O9L24L13J22m0J02n33k85K24L88K53j1j05Pm38j75L86L02K74
$$ 468 672 919 1034 985 649 241 310 634 947 1069 1029 1131 598 313 537 925 1178 1167 1062 1069 631 456 842 1144 1418
3458A418LL2l76n82L08M98K42L80j09k28m41j45K08O46M89L18r9m11q89J9J042J105J069O79
$$ 1418 1421 1453 1077 495 803 1301 1543 1923 1814 1586 1145 1000 1208 1854 2343 2661 2562 2151 1262 1281 2323 3428 4497 5176
3232E176l88j624j588J050M867O898R882K3385P2290J51512K07886j6637l86952m6663p179
$$ 5176 4788 3164 1576 2626 7493 14391 24273 47658 119948 271460 479346 462709 75757 29094 21915
3091B1915J751p696j1327J46L96k440L483K8216L8980J0641k5194m9800n243j494p26Q46j058
$$ 21915 23666 15970 4643 4789 5185 2745 6228 34444 73424 84065 58871 9071 3828 2334 1608 2454 1396
2932A396J372k43n29o48m46K2N34K0J88o1l79l12j03p1K80K94lj15l33k86N7k5L78J87k58
$$ 1396 2768 2525 1996 1348 902 924 1458 1478 1666 1605 1226 914 811 740 1020 1314 1311 1196 863 577 634 609 987 1174 916
2697I16P5j87l95P9K77k1J94j1j71j29l07L29m6J54K4M3j69j35l82L82R1O4J29j30l97Q1K1
$$ 916 991 804 409 488 765 744 938 927 756 627 320 649 603 757 781 824 655 520 138 520 611 675 804 674 277 358 379
2443C79P5O1J80J05k65k25J00j75J21L19p2%k24Kj71R3J53J82j40j9n8j62M0N5J65l4N8l0
$$ 379 454 515 695 800 535 310 410 235 356 675 603 603 379 381 210 303 456 638 498 479 421 259 299 354 519 485 543 513
2180E13j22r0n8J03J3L31j17k13j14M3j45K89L6J48j41k00j50J14J62J17j38o9J63j87r4j2
$$ 513 391 301 243 346 359 690 573 360 246 289 144 433 469 617 476 276 126 240 402 519 381 312 475 288 194 182
1936A82J30K62j02q6jn2j36K00P5n6Oj7j63o0N8O6Jk05P68l11k08j89nK36j35R1K07k91L7
$$ 182 312 574 472 386 385 333 197 397 472 416 422 405 242 182 240 306 307 102 870 559 351 162 157 393 258 349 556 265 302
1664C02k02J48n9K34l8oj67Q6k23J88Q8N6M0j06l5j98J32j5Q3J31M5j64j21j26J37L6K04m1
$$ 302 100 248 189 423 385 379 212 298 75 263 351 407 447 341 306 108 240 225 308 439 484 320 199 73 210 246 450 409
1401D09R1m62K13j60J56L6J90pj37k04K7q4K62O4J0o4P4j49k39K10J58l5p2K02k31k02P7J96
$$ 409 500 38 251 91 247 283 473 466 329 125 152 68 330 394 404 340 414 265 26 236 394 359 287 489 258 56 133 329
1138C29n8J57p2J95m16r4Q9J62J11n3L8m1l04J14O6j0K61j99K55k91l9j70K7K94J82k83K21
$$ 329 271 428 356 551 135 41 130 292 403 350 388 347 43 157 223 213 474 275 530 239 200 30 57 351 533 250 471
885D71j85j16J07q1J27J49o0k2q6j07p7K96N9K0j73L8j76l7O3J31J08j7J54m16o3J54q8K11
$$ 471 286 170 277 196 323 472 412 390 304 197 120 416 475 495 322 360 184 147 210 341 449 432 586 170 107 261 173 384
622C84K7R8j16L48o76K11o5L87J2j12Nl01j58M14j57L60j96R5l13k4j17L49LJ83k16n9k6l32
$$ 384 411 509 393 741 65 276 211 598 610 498 503 202 44 458 301 661 465 560 247 223 106 455 458 641 425 366 340 8
359HL14k1L72m5j20j54j36m5J26J91L8P3j53k5j15j68J77L41p9R7j21l11nj4L78j12L45l22
$$ 8 322 301 673 628 508 354 218 173 299 490 528 601 448 423 308 140 317 658 579 676 555 244 239 225 603 491 836 514
96E14J16l15p4L11r4K63OQ1k73l62K70J31qL36j28j82j01o7O1J27K74j41J72k04j74n7L5L08
$$ 514 630 315 241 552 458 721 727 808 535 173 443 574 566 902 774 592 491 424 485 612 886 745 917 713 539 482 517 825
-167H25K02j83R9j66j08j77M99j43K75K49m25J13l94L46jK89K30K08k83j82m4J20q0L27
$$ 825 1027 844 943 777 669 492 991 848 1123 1372 947 1060 666 1012 1011 1300 1530 1738 1455 1273 1229 1349 1269 1596
-392A596
$$ 1596
##PAGE=	F1=1776.69
##FIRST=	4405.895418600002813,	4405.895418600002813,	7.0811886787414550781
##DATA TABLE=	(F2++(Y..Y)), PROFILE
4406A069J38j12p8l03K28k99K55JJ52k67L0k25j30O6L7J14J47j92J31n51J11R1J83n1K59l08
$$ 1069 1207 1095 1017 714 942 643 898 899 1051 784 814 589 459 525 562 676 823 631 762 211 322 413 596 545 804 496
4162D96k0j72m1N9K36K22j53k50K5k89M9K99Q5J98k13j44j95j26J61K58R3J8j10J9l89p0L70
$$ 496 476 304 263 322 558 780 627 377 402 113 162 461 546 744 531 387 192 66 227 485 578 596 486 505 116 46 416
3908D16J84j03P4j31j36q7k4K15J16J16k3k08k04j64J51L63p6L11l35L9l09M2J38P3J85L2
$$ 416 600 497 571 440 304 217 193 408 524 640 617 409 205 41 192 555 479 790 455 494 185 227 365 438 623 655
3664F55j0k82k89J02K56K83l3o2J43m60j65K50K87J04k3j77J17l48p8L31J83J77j09R6k66
$$ 655 645 363 74 176 432 715 682 620 763 303 138 388 675 779 756 579 696 348 270 601 784 961 852 948 682
3429F82n13L70L92J33J89j02k55k57L1J26N08K04K05j35l04n85J84P79O39O12L32l12j338
$$ 682 169 539 931 1064 1253 1151 896 639 670 796 1304 1508 1713 1578 1274 689 873 1652 2291 2903 3235 2923 1585
3213A585o07J277K890M441N299J2148M1156R0097J38274Q691k53398k9232l631L160o281j2152
$$ 1585 978 2255 5145 9586 14885 27033 68189 158286 296560 305251 51853 22621 18990 22150 15869 3717
3063C717k722L459j692p1J5928J8718R689n683l5274k565J098m13j847J254k453J012j033
$$ 3717 995 4454 2762 2691 18619 37337 47026 41343 6069 3504 4602 4189 2342 3596 1143 2155 1122
2903A122m95k0R7L84n3O7j26k76k08J00m5J29K20n4j09k39k69K36m9K86J67l34O8j13k24P0
$$ 1122 627 607 704 1088 1035 1102 976 700 492 592 547 676 896 842 733 494 225 461 412 698 865 531 599 486 262 332
2659C32K21q9J67n5j32n9k21L29q8J09OQj55k9k65L01lN8R9j30k95Q7P9O0rJ42P5k29j72J64
$$ 332 553 464 631 576 444 385 164 493 405 514 520 528 373 344 79 380 377 435 534 404 109 196 275 335 326 468 543 314 142 306
2378C06j35M9K33m0o0j45J5k8L4M5J86k07K5j2j65R7O1R4l7L5j7j14j4PJ9l5L31j89j38p3
$$ 306 171 220 453 413 353 208 223 195 229 274 460 253 278 266 101 198 259 353 316 351 334 220 206 213 232 197 528 339 201 128
2096A28J07j71K37LJ30m4k75r2J50J47O6j34r4J67j72n9L9Q0K52j55j03PN0j51K38N7j19k9
$$ 128 235 64 301 304 434 390 115 23 173 320 386 252 158 325 153 94 133 213 465 310 207 214 264 113 351 408 289 260
1833B60j4j50K3J32J7O0JJ29M7k92j45K9K32j99N6K18k96Q5p1J27k03K48rj04m2P2j77J93
$$ 260 246 96 119 251 268 328 329 458 505 213 68 97 329 130 186 404 108 193 122 249 46 294 285 181 139 211 34 227
1570B27J9M6qr2K7j38J58r0P4Q1J5j27r2q5J27N9O6QQ0k59P3r7J03K6J44rj40j73P1J4J62
$$ 227 246 292 284 192 219 81 239 149 223 304 319 192 100 15 142 201 267 275 355 96 169 72 175 201 345 336 196 23 94 108 270
1279B70j3M7j44J98k14o5J32J13p9j26K42j85j00L3J76j41J65n0J33l64kJ29P4M3o1L0j3j95
$$ 270 257 304 160 358 144 79 211 324 245 119 361 176 76 109 285 144 309 259 392 28 26 155 229 272 211 241 228 33
1016C3N5R8m2K28k53K67k77R2j60J1J63J47k07J78j77m0J33r9P9R2p3OM4j64j6K48p7Q1k13
$$ 33 88 186 144 372 119 386 109 201 41 52 215 362 155 333 156 116 249 150 229 321 248 254 298 134 118 366 289 370 157
744A57K9n3M7j3P4L5k5J84l60j9J84j30J31N2Rj58Q63l75J0k42J52M0k40J8k97l8L92k34L20
$$ 157 186 133 180 167 241 276 251 435 75 56 240 110 241 293 302 144 1007 632 642 400 552 592 352 370 73 35 427 193 513
471E13k71J24j70j0o6K41o4J52k07pk2j79K68n8K86j22r4q6p5M3L6J10JO3j66M3l8j46J68
$$ 513 242 366 196 186 120 361 297 449 242 235 213 34 302 244 530 408 314 228 153 196 232 342 343 406 240 283 245 99 267
199B67J95r1N9n6k72R6k0K53q4K20k63J19k48LK83j45J57kJ15k53j07J27R3p4K47q5k37M6
$$ 267 462 371 430 374 102 198 178 431 347 567 304 423 175 178 461 316 473 471 586 333 226 353 446 372 619 534 297 343
-64C43r9J85J8J70j75J28p3j77M5M6J95P9j72R2j18k9j56M67j87J55J99l97J75l14L61o5J73
$$ 343 244 429 447 617 442 570 497 320 365 411 606 685 513 605 487 458 302 769 582 737 936 539 714 400 761 696 869
-317H69J63J57k49j59L5J25n0K44
$$ 869 1032 1189 940 781 816 941 891 1135
-392A135
$$ 1135
##PAGE=	F1=1757.91
##FIRST=	4405.895418600002813,	4405.895418600002813,	8.5140542984008789063
##DATA TABLE=	(F2++(Y..Y)), PROFILE
4406E81P3q7jk84L84k92K31j17J46k97Q2o5n8R5q6R4O4j79J41k54L5R2J01j63K48k79J8r8
$$ 581 654 567 566 282 666 374 605 488 634 337 419 354 296 391 305 399 463 284 425 171 206 298 399 236 484 205 223 125
4143A25J42q8J72J58k03j96J35k33R4K38k3J48k04j34l7l5J39J51nl1p8J4j17q5K73J21k32
$$ 125 267 179 351 509 306 110 245 12 106 344 321 469 265 131 94 59 198 349 344 313 235 249 132 47 320 441 209
3889B09R6j18r5J28o1J46PK9Mj90j48N4J06J92j28K49l37J01j10R9M8p0J39m0K1j82q3P8R5
$$ 209 305 187 92 220 159 305 312 341 345 155 7 61 167 359 231 480 143 244 134 233 281 211 350 310 331 149 66 144 239
3617B39K51j60q3J82k96QJ16J66k3mk40J96j95N5J49P4J10k02J43j06k65J99K43N6K7q5k50
$$ 239 490 330 247 429 133 141 257 423 400 396 156 352 157 212 361 435 545 343 486 380 115 314 557 613 640 555 305
3364C05q2K02rL61m0J15j48j90j62J84M43K38K10O9j98r34O12P76R62K159K150L987J6265
$$ 305 223 425 416 777 737 852 704 514 352 536 979 1217 1427 1496 1298 364 976 1752 2714 4873 7023 11010 27275
3148B7275M2812O4806K3908j29896j3388k73M225m077r276k189J250k185j66J2754p085M132
$$ 27275 70087 134893 158801 28905 15517 15244 19469 15392 6116 3927 5177 2992 2826 15580 8495 12627
2997A2627J0530j9642o14K554Q23r20M78n379J089j186k05M27nJ60j08n6k03j29m6K51k0p1
$$ 12627 23157 3515 2901 5455 6278 5358 5836 457 1546 360 155 582 577 737 629 573 370 241 195 446 426 355
2791C55J61j15o3j41r3K17p5J74J60l49qj7M1m2J55j23J05q0r0J6n0J82o9L6nj0j11N7n0P0
$$ 355 516 401 338 197 104 321 246 420 580 231 223 206 247 205 360 237 342 262 172 188 138 320 251 287 282 272 161 218 168 238
2509B38n4K6P5j23q6j6J32L3p5J17L1j49q6J48m5o9J47nj15l8oJ15M2j39J85k37M6M4p7L7
$$ 238 184 210 285 162 76 60 192 225 150 267 298 149 63 211 166 97 244 239 124 86 80 195 237 98 283 46 92 136 59 96
2227I6O8K9j8Onq7L2O4n1q7L23k38o3m5J86j71J26oJ09N0k26k3M6J40jj22j0O5j42l9R2J9
$$ 96 164 193 175 181 176 89 121 185 134 47 370 132 69 24 210 39 165 159 268 318 92 69 115 255 254 132 122 187 45 6 98 117
1927A17K19j67j02jJ31j34K28P9j93l1m4o9K5J88LK34J7l5L1l50Qj05J97k08K4J96k30N7N9
$$ 117 336 169 67 66 197 63 291 370 177 146 102 33 58 246 249 483 500 465 496 146 154 49 246 38 62 258 28 85 144
1655A44J11j67Q7K1j72J26k4j19J78n1O3k5j15Q9p2J50j26O2K0J1j24J8m7N8N5n7P5L4l4p4
$$ 144 255 88 175 196 24 150 126 7 185 134 197 172 57 146 74 224 98 160 180 191 67 85 38 96 151 94 169 203 169 95
1373I5m1N5J3J07j1j16ok6O6O7o9R0j99K91k11K6M3P3n4j74K12j01L4p2J35j81J45J7M5j56
$$ 95 54 109 122 229 218 102 96 70 136 203 134 224 25 316 105 131 174 247 193 19 231 130 164 92 227 46 191 208 253 97
1091I7k2J03Lk6o1J2L8o1m7J13k8J47k00J71j84J56j75K7K1J12r7R3j36LJ39r9M6L3m9L3J46
$$ 97 75 178 181 155 94 106 144 83 36 149 121 268 68 239 55 211 36 63 84 196 99 192 56 59 198 99 145 178 129 162 308
800C08k20K0K07k12J53k44L9N6R3q1K4J1l5J67j52o4J25p5qJ00j02K7J101l4q5k96l08O8l44
$$ 308 88 108 315 103 256 12 51 107 200 119 143 154 119 286 134 70 195 120 112 212 110 137 1238 1204 1119 823 515 583 239
528B39J3j17j24L73k69K48l18J51L2p3l2J37j10J30j95L9k7l6K05k5J42j74k8n2l1J21o5N6
$$ 239 252 135 11 384 115 363 45 196 228 155 123 260 150 280 85 124 97 61 266 241 383 209 181 129 98 219 154 210
265B10l1N1j42O9L4j03J36M7r4L9rj94J59n5J52n1J02k02J30j85N2K54j88O3pJ38k00J23m2
$$ 210 179 230 88 157 191 88 224 271 177 216 207 13 172 117 269 218 320 118 248 63 115 369 181 244 237 375 175 298 256
-7B56Q1j54J75m5k65J82j32K62o2N5j79P8O6j72J38K3R4l6j40Q4n4L7j51M02k03O2J16l29
$$ 256 337 183 358 313 48 230 98 360 298 353 174 252 318 146 284 307 401 365 225 309 255 292 141 543 340 402 518 189
-270A89K27k02L19j31O6J07J28k08j13Q7J01k1J72
$$ 189 416 214 533 402 468 575 703 495 382 469 570 549 721
-392G21
##PAGE=	F1=1739.13
##FIRST=	4405.895418600002813,	4405.895418600002813,	6.7999868392944335938
##DATA TABLE=	(F2++(Y..Y)), PROFILE
4406A74J26j12R4k05L74k58J76k08J30k79J45R5o5R3k09J40m3j22J19P2j25O2M4j74J69j75
$$ 174 300 188 282 77 451 193 369 161 291 12 157 252 187 280 71 211 168 46 165 237 112 174 218 44 213 38
4162C8P9j04K39j44O4J02k13K7J04j32J2J51n3R2j90Q0m8qO2R3r3p0J8K8L2r7J49O2k01M6
$$ 38 117 13 252 108 172 274 61 88 192 60 72 223 170 262 72 152 104 96 158 251 158 88 106 134 166 69 218 280 79 125
3880A25o4K3J65j26Q3m9o7K5jM6m7J4O1j21J58j28L2L2Q9j8k13J10q4M7O2j8O4j16K10j91
$$ 125 61 84 249 123 206 157 90 115 114 160 113 127 188 67 225 97 129 161 250 232 19 129 45 92 154 136 200 84 294 103
3598A03n3J32N3l7k6M1j25N1Q2r6L3J12j04j1P8j90R5J40jr0M7J0l8n7L8j2J49j17J33j08
$$ 103 50 182 235 198 172 213 88 139 221 125 158 270 166 155 233 43 138 278 277 187 234 244 206 149 187 175 324 207 340 232
3317B32m6o2J03J73q0J14p5q3J3j68K74P92K6n48K31L26l63J162J6405N056K4335l6881j720
$$ 232 186 124 227 400 320 434 359 276 289 121 395 1187 1213 665 896 1222 859 2021 18426 23482 47817 10936 9216
3101I216K220M567j846n799l09j88l596o48J1331o96l120m940l874r07L202K652j304P92n271
$$ 9216 11436 16003 14157 8358 8049 7861 4265 3617 14948 14252 11132 6192 2318 1411 4613 7265 5961 6753 1482
2922A482q42Jl9M4j86n1j25q6K1o3J07J12k8k38J35k00J67k4R8m8r1M3J74j63j19n5K57j34
$$ 1482 640 641 602 646 460 409 284 198 219 156 263 375 347 109 244 44 211 187 285 237 146 189 363 200 81 26 283 149
2659A49O2l9n0k8L2j9J12o8J8n6JL1K6jP7j39K4p5K7k7R4r0P8jl2K0k8N3j8MN6j64M1L5Km8
$$ 149 211 172 122 94 126 107 219 151 169 113 114 145 171 170 247 108 132 57 84 57 151 61 139 138 106 126 98 151 133 137 193 29 70 105 107 59
2321E9j4J40R3k14P0k8n3JJ20j36N8l1L2l7L7nl2R1p3qJ60k04M5k2J49j02n7N7M3J28q8p4
$$ 59 45 185 278 64 134 106 53 54 174 38 96 65 97 60 97 92 60 151 78 70 230 26 71 49 198 96 39 96 139 267 179 105
2021A05j0J14o4j11J54j04l2RJ5l7J61j05k0K4M3p3J52J21k38N2j46Q3o1J93jL38mK37k21
$$ 105 95 209 145 34 188 84 52 61 76 39 200 95 75 99 142 69 221 342 104 156 10 93 32 225 224 562 558 795 574
1749E74l74O3k39J45j04mP9j6j20J34J08o7q8L2J3N9j30k4R5j06J06K2j08L6k3J34j08L3J3
$$ 574 200 263 24 169 65 61 140 124 4 138 246 179 91 123 136 195 65 41 136 30 136 158 50 86 63 197 89 122 135
1476A35k2p9J06p3L3%l2M3k9J11j53OJ2%R8qm2M9q2P1j0p4R8l6J65j26Kl0L4L0q7J1nJ06j31
$$ 135 113 34 140 67 100 100 68 111 82 193 40 46 58 58 156 148 106 155 73 144 134 60 158 122 287 161 163 133 167 197 110 121 116 222 91
1148I1P0j02N5Q6k3k8l1P3k9q6l3QP8k5m9N6K7L7n9mj2J17j96N4l7J5M5j4p0MJ16q2K4rO3
$$ 91 161 59 114 200 177 149 118 191 162 76 43 51 129 104 55 111 138 175 116 112 100 217 21 75 38 53 98 84 14 18 134 52 76 67 130
819A30L5J50k42J9J73j66O4o4KK4O4j19j3J18m7L8L5j10M2N2j53J45j30J96J149K05r0l89
$$ 130 165 315 73 92 265 99 163 99 101 125 189 70 57 175 128 166 201 91 133 185 32 177 47 243 1392 1597 1507 1118
556A118o15O9l84jP7k23K84k37J38p9o5J88j38k4N0j03J06r6k1RJ5J41N2j6j86J13q6l9J69
$$ 1118 503 572 188 187 264 41 325 88 226 147 82 270 132 108 158 55 161 65 44 53 68 209 261 245 59 172 86 47 216
284B16j51M2j7J2ojM2k9P0p3q8Q8l9K6O9j12Q1Nj4l9O4j22L2K20k14L2l5J34n9J98j79J02
$$ 216 65 107 90 102 96 95 137 108 178 105 17 105 66 92 161 49 130 135 121 82 146 24 56 276 62 94 59 193 134 332 153 255
-17B55k22J22k4J7K1o0J60j07qq2o3J85n4R4l6J9p3j08J14J2L8j49K78j87L5Jp8J18o0J88
$$ 255 33 155 131 148 169 109 269 162 154 72 9 194 140 234 198 217 144 36 150 162 200 51 329 142 177 178 100 218 158 346
-299C46j88l0P6J58j24pkM0LJ30
$$ 346 158 128 204 362 238 231 229 269 272 402
-392D02
##PAGE=	F1=1720.35
##FIRST=	4405.895418600002813,	4405.895418600002813,	3.2132904529571533203
##DATA TABLE=	(F2++(Y..Y)), PROFILE
4406B10J75j24K7L5o2j7k8J6n0N9LJj41R8n3Q2j32R8j04J69j85l3L3J73j77P1L9r6J09K5j77
$$ 210 385 261 288 323 261 244 216 232 182 241 244 245 104 202 149 231 99 197 93 262 77 44 77 250 73 144 183 87 196 221 44
4115D4P9OP9%j36M6j2J06n7k9J59j73j8J3R9m9p3P0M9o3n3J6J2J19j07J0L2O8j29K6k5oj9
$$ 44 123 129 208 208 72 118 106 212 155 126 285 112 94 107 206 157 84 154 203 140 87 103 115 234 127 137 169 237 108 134 109 103 84
3805H4J02M4j22m6K8L2j5J38q0oO9j7n6r6Q0j4Q5p3R0j28K8P8L0j52K22j33o4K0M5p8L26k50
$$ 84 186 230 108 62 90 122 107 245 165 159 228 211 155 59 139 125 210 137 227 99 127 205 235 83 305 172 108 128 173 95 421 171
3504A71OJ14j98Q1l0J39j67J71K2j83m9j0J79J3J43j19j0kj86L56j97J25R9k4k40K5J03J89
$$ 171 177 291 93 174 144 283 116 287 309 126 77 67 246 259 402 283 273 271 85 441 244 369 468 444 204 229 332 521
3242E21J10q3J25N10m88K08J105O48J915L265j946K9087r329k2407J691L267L971k16k498
$$ 521 631 548 673 1183 695 903 2008 2656 4571 7836 5890 34977 25648 3241 4932 8199 12170 11954 9456
3063I456K073K68l267J572q299J3105L035n660j0180m9N837O492l795k821o089j207M82k34
$$ 9456 11529 11797 8530 10102 1803 14908 17943 12283 2103 2054 7891 14383 10588 7767 1678 471 953 719
2894G19k34k10j97J64P5K03k16pl3k1l2qJ2R7m1O4j79J7m6J12N5k4j75J55j40L0J02r6L5M3
$$ 719 485 275 78 242 317 520 304 297 264 243 211 203 215 312 271 335 156 173 127 239 294 270 95 250 110 140 242 146 181 224
2612B24j35J62k24J28o5J4P6N0q6J23k27J67o6q2R4J7p5%k3J48j61j0J58m6q1J22j02m0l9
$$ 224 89 251 27 155 90 104 180 230 144 267 40 207 141 59 153 170 95 95 72 220 59 49 207 161 80 202 100 60 21
2340B1K04j69L8N4J38j06r9R6l1j03K02j26l8K3nn3O8J9j05P0nN7m1kJ1l6Q5l0n0N8r1J78
$$ 21 225 56 94 148 286 180 81 177 146 43 245 119 81 104 99 46 114 133 28 98 93 150 109 107 118 82 167 137 87 145 54 232
2040B32nj38L0N4q4l8J85j92M2jl2l7N5M4QN6p0m2Q1J49k09J38j60M0m3J21J2L24J1N11l54
$$ 232 227 89 119 173 89 51 236 44 86 85 53 16 71 115 123 179 109 67 148 297 88 226 66 106 63 184 196 520 531 1042 688
1749F88m05M0k72P4ok3j7R5j35N9J08K4j43k0J43J1j85K3J3J3J4Q8o5q5%J17n3%Q6j16K6P6
$$ 688 283 323 51 125 119 96 79 174 39 98 206 230 87 67 210 221 36 59 72 85 99 187 122 37 37 154 101 101 187 71 97 173
1448A73j10P1q1J31q6RN7j45L8j5lJ14mpK8r8O4n3J3NQ2Q4o2m3o0j5J25n7r4M8J29j28k0K0
$$ 173 63 134 53 184 98 107 164 19 57 42 39 153 149 142 170 72 136 83 96 101 183 267 205 162 102 87 212 155 61 109 238 110 90 110
1129A10K2P2k3l1j2N4j8j02J9J1N0m8Ll5Q5m5J8p7P1Q4j58J8M8m8M8k6q0L7M0o0L3J1J14L3
$$ 110 132 204 181 150 138 192 174 72 91 102 152 104 107 72 157 112 130 53 124 208 50 68 116 68 116 90 10 47 87 27 60 71 185 218
810B18P7k17PJ26K7j42P5oj5oj08jK20o2r4J24j39LJ65j68Q6l2J25J179L68K6n63p62L6l62
$$ 218 295 78 85 211 238 96 171 165 150 144 36 35 255 193 99 223 84 87 252 84 170 138 263 1442 1810 1836 1273 511 547 185
528A85pJ87k64J42j31nJ68k13K09j39n8rL2K1L1j42Q5l2O3J56j56l5J23j13q5J61j35J6Q6
$$ 185 178 365 101 243 112 107 275 62 271 132 74 65 97 118 149 7 92 60 123 279 123 88 211 98 13 174 39 55 141
256A41p1P2k3n2Q5l6o0P2J7r9R0J9q7rQ6j12J60p6n3rJ26j24J15n8p5J33J37k21J17n5l9q7
$$ 141 70 142 119 67 152 116 56 128 145 46 136 155 68 59 145 33 193 117 64 55 181 57 172 114 39 172 309 88 205 150 111 24
-45B4K47j40N9m6j14J56L2k5p9J23n1j03l9J86o4N4j2o2Njl0Q1l1J05q9k7Q0o3k0L8Q6L1M4
$$ 24 271 131 190 144 30 186 218 193 114 237 186 83 44 230 166 220 208 146 151 150 120 201 170 275 186 159 239 176 156 194 280 311 355
-355C55j99M7j7Q3
$$ 355 156 203 186 269
-392B69
##PAGE=	F1=1701.57
##FIRST=	4405.895418600002813,	4405.895418600002813,	0.32114318013191223145
##DATA TABLE=	(F2++(Y..Y)), PROFILE
4406E27J07j38n2J00l71L04j82K02r0j4L3j57j22J22J03J1j03N6j61Q3o9k5L4K27j96k5M2
$$ 527 634 496 444 544 173 477 295 497 407 393 426 269 147 269 372 383 280 336 175 258 189 164 198 425 229 204 246
4152B46r4p1L18k34K0N8K2l9j98K05r0K08j88O5J30k73K5J8J04N9r4NM5k01R9o9j1K92j63
$$ 246 152 81 399 165 185 243 265 226 28 233 143 351 163 228 358 85 110 128 232 291 197 202 247 46 145 76 65 357 194
3880A94rOl1J7nlP4l6j2J5j46O2N6K6mJ01j31n9L4P0R3j38N6j3l1o9J00J0j96K95Kk40J82
$$ 194 185 191 160 177 172 169 243 207 195 210 64 126 182 208 204 305 174 115 149 219 312 174 230 217 186 117 217 227 31 326 328 88 270
3570B70k03m5K01J36j96L34k65j08J15m7J72j06J31j92L7j6j49J82K3J11mO1j91j01K24q7
$$ 270 67 22 223 359 163 497 232 124 239 192 364 258 389 197 234 218 69 251 274 385 381 442 251 150 374 287
3326B87M03k19K4L0j71j56K28K96K05m2j60j13L11o00J447J949J151K309J513K8368J1650
$$ 287 690 471 495 525 354 198 426 722 927 885 725 612 923 323 1770 3719 4870 7179 8692 37060 48710
3129D8710l848l9316k452K781K506M78M56M727K237j030P356J1325J3725M29q060l1407m95
$$ 48710 44862 5546 3094 5875 8381 8859 9315 14042 16279 15249 22605 33930 47655 48084 40024 8617 8122
2969H122R911J2354n211r809j4331M02o63l57k37M16j98K42j16J08l55j21o0J67K06j33L2
$$ 8122 18033 30387 25176 15367 1036 1438 775 418 181 597 399 641 525 633 278 157 97 264 470 337 369
2772C69m3r0M5k37K91l7p7J02J1k01j9q0J90R1m0l9Nk23J83j6L8k9k7L5jj28J43m4J12m2q7
$$ 369 326 236 281 44 335 298 221 323 334 133 114 34 224 315 275 236 241 18 201 185 223 194 167 202 201 73 216 172 284 242 155
2481A55L1n1j9l8OK54l12J12P3q8l8J03Kk5j13K30k51N9J2J33M0j24L4jj15J86k6j27J19j02
$$ 155 186 135 116 78 84 338 26 138 211 123 85 188 190 165 52 282 31 90 102 235 275 151 185 184 69 255 229 102 221 119
2199A19l8M3jp4J6Q5M6j72J02ql4L8L0M8Nj96J93K4k01J53l9k5j0J45j81K0oj7k4L2Q0k1P8
$$ 119 81 124 123 49 65 150 196 24 126 118 84 122 152 200 205 9 202 226 25 178 139 114 104 249 68 88 82 65 41 73 153 132 210
1889B10j02p4O0J27j12J73k02qJ3M0M3K17J53O01l58m42k0k00J1M1o3k0Q7j34J0Q1J17j11
$$ 210 108 34 94 221 109 282 80 72 85 125 168 385 538 1139 781 339 319 119 130 171 108 88 175 41 51 132 249 138
1626A38o6J56j2j88L8n0J68j12J30l9j44K8N0K5k6J55k13P7M9j32J46j27K20j62P6r1q3Q6
$$ 138 72 228 216 28 66 16 184 72 202 163 19 47 97 122 96 251 38 115 164 32 178 51 271 109 185 94 11 97
1364I7k2J8J01j5k6qq5Q1l1M4q1J16N8l9q6nq7J96o6r0K6J13n1j33J27M0PJ3j08K1O3J7r4
$$ 97 75 93 194 179 153 145 60 141 110 154 73 189 247 208 122 117 30 226 160 70 96 209 158 25 152 192 199 212 104 125 188 205 111
1054A11K7qL5n8P2j04R6n0j4mJ6N7n4r4J46j9k3Kr8N6M4r6R3%Q7M2k3j39RL9K01k87J47k3
$$ 111 138 130 165 107 179 75 171 121 107 103 119 176 122 28 174 155 132 134 36 92 136 40 133 133 220 262 239 100 109 148 349 62 209 186
734A86l1o2j3K9K08q0j52J16j46Q9J65j72M2JJ9J184M94K57q05q00l3l11j7K56k50m0K8j40
$$ 186 155 93 80 109 317 237 85 201 55 144 309 137 179 180 199 1383 1877 2134 1329 529 496 185 168 424 174 134 162 22
471B2L37k80J38m7j16M0P4l2P3j61O5m7n1K83k28J00N4j08j7nO9o5J23j08M5j3j12J93j92
$$ 22 359 79 217 170 54 94 168 136 209 48 113 66 15 298 70 170 224 116 99 94 163 98 221 113 158 145 33 226 34
199C4J36P2o0m7K8lPpO3q9J47j72nN2n7O9J35q7j15Q9L8k7J8P1p8p7K08k68J85k27J05J95
$$ 34 170 242 182 135 163 160 167 160 223 134 281 109 104 156 99 168 303 216 101 190 228 201 219 290 212 135 343 75 260 33 138 333
-101C33Jqk93L12k03ljK64j17L6m3j58J91j17J08N0J8L2j14j11J58R9k4N6m9N9M9k36J89m6
$$ 333 334 326 33 345 142 139 138 402 285 321 278 120 311 194 302 352 370 402 288 177 335 434 410 466 417 476 525 289 478 432
-383D32M
$$ 432 436
-392D36
##PAGE=	F1=1682.79
##FIRST=	4405.895418600002813,	4405.895418600002813,	0.70505195856094360352
##DATA TABLE=	(F2++(Y..Y)), PROFILE
4406H55M0j62p2J29l42L45k15J94q7j73R6k40LJ21J24m9j14Kk12Q3M8QM1J52j80j54P0n3j39
$$ 855 895 733 661 790 448 793 578 772 685 512 608 368 371 492 616 567 453 455 243 326 374 382 423 575 395 241 311 258 119
4134A19M86k66j3nj9l9j78L06n4J62k82R0P6k61J06M7N6J02j52o3J7j24J62k3J6J80k07l2
$$ 119 605 339 326 321 302 263 85 391 337 499 217 307 383 122 228 275 331 433 281 218 235 111 273 250 266 446 239 207
3871B07k9j55L06j5m9Q4o1j36l1K2J69L8o3K2j7j74K3j6J63J89k04j4pj65J31M8J09j84K18
$$ 207 178 23 329 314 265 349 288 152 121 143 312 350 287 309 292 118 141 125 288 477 273 259 252 87 218 266 375 191 409
3598D09o1l02R8K1KJ99J48l12K67k43r1Q8J28J99j62J8k29q6P4N4K26L8l8m8n8j71k2L61J4
$$ 409 348 46 144 165 167 366 514 202 469 226 135 223 351 550 388 406 177 91 165 219 445 483 445 397 339 168 146 507 521
3326E21L28k70j35m2n0P8K58L20Q0k54k08k00L17j49J619K279J451L367M972P1163M501n1485
$$ 521 849 579 444 402 352 430 688 1008 1088 834 626 426 743 594 2213 4492 5943 9310 14282 85445 89946 38461
3119C8461l4727j467K155O21K48K916P256N195K472J5667M5527L3476j162l4236o1739l721
$$ 38461 3734 2267 4422 5043 5291 8207 15463 20658 23130 38797 84324 117800 116638 82402 20663 16942
2969A6942J5031K0017o091j6043k8683O62j737N82L45M17n06K19m93r8l93J52J51J39J74k64
$$ 16942 31973 51990 45899 29856 1173 1835 98 680 1025 1442 936 1155 662 564 171 323 474 613 787 523
2781E23o5k19j06K05n6L05o6k15Pj3n4j00O7K00ok0j44m2k3m5K41%n2j00m5r1j6O6K07K7l9
$$ 523 458 239 133 338 282 587 521 306 313 300 246 146 213 413 407 387 243 201 178 133 374 374 322 222 177 86 70 136 343 370 331
2490C31r9p1l7R2m7L9K42m18J62l2j11J43K3Q7l8j65J80j89l0R4rK21j42o3J4n8Q3J59k07
$$ 331 232 161 124 216 169 208 450 32 194 162 51 194 217 304 266 101 281 92 62 156 147 368 226 163 177 119 202 361 154
2218A54J87k00l5ol0M9L5Q5j1j15j2k8L3M6MJ54n3k34J49K6j05J81j49N3l8R9j41j5L6K6p9
$$ 154 341 141 106 100 70 119 154 239 228 113 101 73 106 152 156 310 257 23 172 198 93 274 125 178 140 239 98 83 119 145 66
1927F6J16mn6O6n1o5N6K9k0J78k55j2M6rL8J24M22M43k86m73q7n4m5O3j10j0K3o9N4q0K17
$$ 66 182 178 122 188 137 72 128 157 137 315 60 48 94 85 123 247 669 1112 826 353 266 212 167 230 120 110 133 64 118 38 255
1636B55n9n9P3l0j11J4M9J49k07J20j4j15N7m9R3m0J71k73P1K7m1J56j30K27k11J13k11qJ47
$$ 255 196 137 210 180 69 83 132 281 74 194 180 65 122 73 166 126 297 24 95 122 81 237 107 334 123 236 25 17 164
1364A64k9L7P1m3o5k7m4J32MOr3M2P7n5j30J35p8J56j19n4kO8Q3j43J00N3o2M6k00N1J28M4
$$ 164 135 172 243 200 135 108 64 196 200 206 113 155 232 177 47 182 104 260 141 87 85 153 236 93 193 246 184 230 30 81 209 253
1063B53r8K3n0K9j9J39j27M3lj22P9l0PR3j66J71Jp8lk9L8Q9j74J67n0M2N8j37RJ4q3L41l62
$$ 253 155 178 128 157 138 277 150 193 190 68 147 117 124 217 51 222 223 145 142 113 151 240 66 233 183 225 283 146 155 169 86 427 65
753F5J56m4l7RPM5J52r5j78Q9r8J89R9j79K3j9r3J142O23N27j058p66j42k49m4L13j79j99
$$ 65 221 177 140 149 156 201 353 258 80 169 71 260 359 180 203 184 91 1233 1856 2383 1325 559 417 168 124 437 258 59
490E9J74j24K93l24M0J27j08P7K3o2P6j54L8kJ2J87j64O4k0p6P7j38K27j25J20j42K1k6J2
$$ 59 233 109 402 78 118 245 137 214 237 175 251 97 135 133 145 332 168 232 212 136 213 75 302 177 297 155 176 150 162
218A62J71k29J76O4j62K9j0K6N7J2L0j12J34k07L3J32j61J46J40j30o9n2m0K51p1J03j05p3
$$ 162 333 104 280 344 182 211 201 227 284 296 326 214 348 141 174 306 145 291 431 301 232 180 140 391 320 423 318 245
-45B45J48l17K72j09R2J41m1nl45M01k78J42jK14j67J7m2j20K72r3J03qK0k0o1j35K68J55
$$ 245 393 76 348 239 331 472 431 426 81 482 204 346 345 559 392 409 367 247 519 426 529 521 541 521 460 325 593 748
-308G48q1Q2j20L4Q2j92K98o1l7
$$ 748 667 749 629 663 745 553 851 790 753
-392G53
##PAGE=	F1=1664.01
##FIRST=	4405.895418600002813,	4405.895418600002813,	0.22015725076198577881
##DATA TABLE=	(F2++(Y..Y)), PROFILE
4406A199k3j83n0J41k32L09k13J08q0l34J62k37J02J11R8j13j38n1k45J75R3K9N4K8j62k54
$$ 1199 1176 993 943 1084 852 1161 948 1056 976 642 804 567 669 780 878 765 627 576 331 506 599 628 682 710 548 294
4162B94J22ko1M72k92o3q7k3lj17L38j0P7l62Q9J7j36J51P8lQ8k14j32j9R3J55J0K1L5k48
$$ 294 416 414 353 825 533 470 383 360 357 240 578 568 645 283 372 389 253 404 482 479 567 353 221 202 295 450 460 481 516 268
3880B68l5l6l9L66k9j10N2j03k41M5J73K28Qj71J5j56j93K45J9J19K28k86j14j0j83L47K9
$$ 268 233 197 158 524 495 385 437 334 93 138 311 539 547 376 391 235 42 287 306 425 653 367 253 243 60 407 436
3627D36J06j75J11j51k81K7L14J2J36J17m16J44j73J08Q5J64J72k04j41k86J1K88P7J86M0
$$ 436 542 367 478 327 46 73 387 399 535 652 236 380 207 315 400 564 736 532 391 105 116 404 481 667 707
3392G07k21j20k07J57J50K67L5K16l18l22r7M19J37K16K64j28m29l5l14Q38n6J313K264J593
$$ 707 486 366 159 316 466 733 768 984 666 344 247 666 803 1019 1283 1155 726 691 377 1215 1159 2472 4736 6329
3166F329N075J3471J15905K8849j25157m0938k098K093q12m6M127R055Q406O433K5122Q8238
$$ 6329 11404 24875 140780 169629 44472 3534 1436 3529 2717 2671 6798 15853 24259 30692 55814 144052
3016A44052O4750N28p1579j01096q918J9997K7547p337k0364m4655j635j51O67L87L15r71
$$ 144052 208802 209330 137751 36655 27737 47734 75281 67944 47580 2925 1290 1139 1806 2193 2508 1537
2866A537J83r58l14l1M04K20O5M5l90k25l30J04L16J6K52j16l14j16q7J98qM2J55r2o2k33
$$ 1537 1720 762 448 417 821 1041 1106 1151 761 536 206 310 626 642 894 778 464 348 261 459 451 493 648 556 494 261
2622B61k6J72j34L06mr8j95j16o9J46j1L03n1o0j16j81R5J67o9N7J85m45J23j21K7J89J2R4
$$ 261 235 407 273 579 575 477 282 166 97 243 232 535 484 424 308 127 222 389 320 377 562 117 240 119 146 335 347 441
2359D41o5k18Q8n5o1J65j34L11j81j30j9M6r4M13k60K09k74m5p0J1J42P0O8r1n5j26o6J68
$$ 441 376 158 246 191 130 295 161 472 291 161 142 188 94 507 247 456 182 137 67 78 220 290 358 267 212 86 20 188
2096A88Q7r3K31j06k56R4M3M0J73k44J03r2N6r3j7J07L4j24J52q9o9kN7lM8Kn9J60k92R5k0
$$ 188 275 182 413 307 51 145 188 228 401 157 260 168 224 131 114 221 255 131 283 194 125 123 180 177 225 227 168 328 36 131 111
1805A11L3q2J83O10J73k07m80j15R1r8P7j48k3o4Q8Q4j12J44j0l9k9o2K4j8J38J05k60O1J0
$$ 111 144 62 245 855 1028 821 341 226 317 219 296 148 125 61 149 233 121 265 255 216 187 125 149 131 269 374 114 175 185
1533A85o7R7o8Q7m1J34k78NL8R4J23j33K05k51J27j47m4J83l4N2K3q7j07K5j5J88J3n2p7p3
$$ 185 118 215 147 234 193 327 49 54 92 186 309 176 381 130 257 110 66 249 215 267 290 203 96 121 106 294 307 255 178 105
1251A05J24q6r0K12o1J20k09k8NL3K07j35M1M8j22O5j46k2K14M1j11J4j11K6N8K02j41k0M1
$$ 105 229 143 53 265 204 324 115 87 92 125 332 197 238 286 164 229 83 61 275 316 205 219 108 134 192 394 253 233 274
979B74k44J38j5r7K68j62J14jj18n0R8K3J25k50K35j18j2P5k37J96J0j40L65l94J35n1k7J41
$$ 274 30 168 153 56 324 162 276 275 157 107 205 228 353 103 338 220 208 283 46 242 252 112 477 83 218 167 140 281
716B81m3P4N6j01j96J19m2K36K9j96K0o8n1R13P87O97j275o33k91j76n9L31o6j47J26j10J96
$$ 281 238 312 368 267 71 190 148 384 413 217 237 169 118 1031 1818 2515 1240 607 316 140 81 412 346 199 325 215 411
462D11l43K1K47o6P8m1q5O3j26L5M6P0Q0r4j7q2j8J66j32K34j74R7j79M0p5J53J56k13J29
$$ 411 68 89 336 270 348 307 222 285 159 194 240 310 390 296 279 197 179 345 213 447 273 370 191 231 156 309 465 252 381
190C81N9k71J11j7J02M5L3%j61J18j61L5K20k09J39J33j80k0j79M6L84j28P0j29o4Q9k26K55
$$ 381 440 169 280 263 365 410 443 443 282 400 239 274 494 285 424 557 377 357 178 224 608 480 550 421 357 446 220 475
-73D75LP4M2p2rk82M25k78K13j5J27j98Lj7oK77o3Q6p9j3k8J6q1L13J86j59R7j45MJ32j12
$$ 475 478 552 594 522 513 231 656 378 591 576 703 505 508 491 485 762 699 785 706 693 665 681 600 913 1099 940 1037 892 896 1028 916
-364I16L55o4o6
$$ 916 1271 1207 1141
-392A141
$$ 1141
##PAGE=	F1=1645.23
##FIRST=	4405.895418600002813,	4405.895418600002813,	0.58115994930267333984
##DATA TABLE=	(F2++(Y..Y)), PROFILE
4406A533p6j97rJ43j20K53j83j5p7m62K09j89J75Q5O7j80j56j06k43K71J07L9P5j11j56l04
$$ 1533 1457 1260 1251 1394 1274 1527 1344 1329 1252 790 999 810 985 1070 1137 957 801 695 452 723 830 869 944 833 677 373
4162C73J77L6J5M34l07j25j61kM7o9L50K7j7m23P3k5%J88J14o2M4k67j88j9K60J70K7K0j16
$$ 373 550 586 601 1035 728 603 442 440 487 418 768 795 778 355 428 403 403 591 705 643 687 420 232 213 473 643 670 690 574
3889E74k80k8J0P1L76m1j62nj61k86K51J69K78k3k65k6k93l2L26Q6N4K29l63k23k3NL90N0
$$ 574 294 266 276 347 723 682 520 515 354 68 319 488 766 743 478 452 159 127 453 539 593 822 459 236 213 218 608 658
3627F58N4j67Pk57j36J09L30O6N6N1m82ol5K75J35J45J11k30k86k90K24L75N9J44K6l74k03
$$ 658 712 545 552 295 159 268 598 664 720 771 289 283 248 523 658 803 914 684 398 108 332 707 766 910 936 562 359
3373C59k46M65K49K03j1J15l47m13j9P17J50J77J91l43m77L14o47J560k10R59K118J646O479
$$ 359 113 578 827 1030 1019 1134 787 374 355 1072 1222 1399 1590 1247 770 1084 437 1997 1787 2746 4864 6510 12989
3157A2989K1140J57994O0789j78870o4887p129R01o02J813K052R229J1032R988L3923J31853
$$ 12989 34129 192123 252912 74042 9155 2026 2927 2325 4138 6190 15419 26451 36439 70362 202215
3016B02215J01859M784j10293j44496j5051K4724L2709j0480k1732n9563l945J801M84L62
$$ 202215 304074 308858 198565 54069 39018 63742 96451 85971 64239 4676 731 2532 3016 3378
2885C378K18j470J37j382l47K99N21K84j3j06m91l86k60K48L43O4J68j60l88j99j07L51O8
$$ 3378 3596 2126 2263 881 534 833 1354 1638 1625 1519 1028 642 382 630 973 1037 1205 1045 657 458 351 702 770
2669G70L3Q6j40j50k75O5K51j20K59Nj40k94j15O6J29K4K67j03r2j43k25J98K22r5P7J09m56
$$ 770 803 889 749 599 324 389 640 520 779 784 644 350 235 301 430 454 721 618 526 383 158 356 578 483 560 669 213
2415B13P3j07J21J70O0N3r9k62nO5k7J90j32K70k36j45r8J52k00N93k81J86l06p6q3R5J49
$$ 213 286 179 300 470 530 583 484 222 217 282 255 445 313 583 347 202 104 256 56 649 368 554 248 172 89 184 333
2162C33R3O3j72j9j65l3J95J20j65K49j44k69L8J01J40J71l12J27j54K1n5PJ75K1j35J36j59
$$ 333 426 489 317 298 133 100 295 415 250 499 355 86 124 225 365 536 224 351 197 218 163 170 345 366 231 367 208
1908B08n1j24J91O8L9M9j77J22k77J81p5Q8j18K05O80m4j89m44n6J37j34Q2j75m4j16K26Q9
$$ 208 157 33 224 292 331 380 203 325 48 229 154 242 124 329 1009 965 776 332 276 413 279 361 186 142 26 252 341
1655C41q4K6L0k5j00j22J73m0K09M6k92oK3qJ37o0O9m2P1k74l0J04J54Q5j41J68k89J30o0
$$ 341 257 283 313 288 188 66 239 199 408 454 162 156 179 171 308 248 317 275 346 72 42 146 300 385 244 412 123 253 193
1382A93o7K12l6O4l7j40j42J36k1K40Pj06o6j50J58r4J2J81l5R0k96l3M4P2K36j18k4L3j61
$$ 193 126 338 302 366 329 189 47 183 162 402 409 303 237 87 245 151 163 344 309 399 103 70 114 186 422 304 280 313 152
1110A52N6l2m0K32J8j23%j82K5J42K63j54p1P2l46J55N2j99M09j43N4k3j46j29K47K4J42l02
$$ 152 208 176 136 368 386 263 263 81 106 248 511 357 286 358 12 167 219 20 429 286 340 317 171 42 289 313 455 153
847A53K84j90o2Q3j57K28Jj24K87l93R4j6%K30j03J18o4r8j95J98m6K66j9k23J8j14J13N61
$$ 153 437 247 185 268 111 339 340 216 503 110 204 188 188 418 315 433 369 271 76 274 228 494 475 252 270 156 269 830
584H30J015O23j439l59m65r1L3K20O2o2O2j06P0l32J56K09rO1j05j03M6r0N5Q0J07km5j05
$$ 830 1845 2468 1029 670 205 114 147 367 429 367 429 323 393 61 217 426 417 478 373 270 316 226 281 361 468 466 421 316
321C16j22M9K29j03K10k01O3k14Q2j15K55J54j94O1N8l56J68mK00mN3k3k19R8p8J8L13k58
$$ 316 194 243 472 369 579 378 441 227 309 194 449 603 409 470 528 172 340 336 536 532 585 562 343 441 363 381 694 436
58D36J18J24k33J8k50K03M02j61Nj41o0M5j11K27R4O0p9q7k3j90M43k58K54k6J9k10MPJ22
$$ 436 554 678 445 463 213 416 818 657 662 521 461 506 395 622 716 776 697 610 587 397 840 582 836 810 829 619 623 630 752
-214G52K52l0P0j51o6lQ8J4L02K18k28R0j37j8J77qL57m9q4
$$ 752 1004 974 1044 893 827 824 912 926 1228 1446 1218 1308 1171 1153 1330 1322 1679 1630 1546
-392A546
$$ 1546
##PAGE=	F1=1626.45
##FIRST=	4405.895418600002813,	4405.895418600002813,	0.55686402320861816406
##DATA TABLE=	(F2++(Y..Y)), PROFILE
4406A805j21k01L0J34k3J93j29j37q3n44K30j32K32M3N7k46j51j73k14L37J11M9J01k37j69
$$ 1805 1684 1483 1513 1647 1624 1817 1688 1551 1468 924 1154 1022 1254 1297 1354 1108 957 784 570 907 1018 1067 1168 931 762
4171G62l11K21N8Q2L89l07j84k16J2R9k5L47M9r4m58M5m6J06K17J55j15ol04k22J7L38K03
$$ 762 451 672 730 812 1201 894 710 494 506 605 580 927 976 882 424 469 423 529 746 901 786 780 476 254 271 609 812
3918H12L0K0k43k96l7P9J45L74m4j93o6k26k72M19J34L14m8l15r3m08J49L50J65%K07m11l26
$$ 812 842 862 619 323 286 365 510 884 840 647 581 355 83 502 636 950 902 587 494 86 235 585 750 750 957 546 220
3664B20m0J71M19Q8%j59p0l54j6J86L07J62k4l6m90j20R2L60J99J26M3k45l74k47L17M53M6
$$ 220 180 351 770 858 858 699 629 275 259 445 752 914 890 854 364 244 336 696 895 1021 1064 819 445 198 515 968 1014
3411A014J20Nm71k62j32N36L37J76q5N2l57m08O4Q33J81J52J38m94m69N74j105K326l25O94
$$ 1014 1134 1139 668 406 274 810 1147 1323 1238 1290 933 525 589 1422 1603 1755 1893 1399 930 1504 399 2725 2400 3094
3185C094J971J795P125K6117J91739Q3870k15751q6092j0426r04M73L601L65P443J2369J2402
$$ 3094 5065 6860 13985 40102 231841 315711 99960 13868 3442 2538 3011 6612 6977 14420 26789 39191
3035C9191M0237J67528J38277J0416j41438j84574k0711L0183L4358j7556k0576o9331l142
$$ 39191 79428 246956 385233 395649 254211 69637 48926 79109 113467 95911 75335 6004 2862
2913B862R36J51L42J94j871R0j647k80M47N68L45p0k35n52n08j74L28L37J29O9j82m36k51
$$ 2862 3798 3949 4291 4485 2614 2704 1057 777 1224 1792 2137 2067 1832 1280 772 598 926 1263 1392 1461 1279 843 592
2697E92p5L94J29M2Rj52k43k87J51K63o4J81K0j62l81q1J56R6Q9J91j24j20j80k08K30K70
$$ 592 517 911 1040 1082 1091 939 696 409 560 823 759 940 960 798 417 336 492 588 677 868 744 624 444 236 466 736
2453G36j08R3L4m53K9m6J53J31J37mj29k88n7J17L1J92r8K06k82j34j64K07r4N49k70J33k96
$$ 736 628 721 755 302 331 285 438 569 706 702 573 285 228 345 376 568 470 676 394 260 96 303 209 758 488 621 325
2199C25j29m7J37J52R8P1k38nj61j9K09J35j88K14j58k73j0J72J96J69l52J39k09jl9L3K35
$$ 325 196 149 286 438 536 607 369 364 203 184 393 528 340 554 396 123 113 285 481 650 298 437 228 227 188 221 456
1946D56kj13Q7k09k0j27J86J33K8J10k89P2k44K41r5J14o6J16P38j36k70l62K3J13j47P7j91
$$ 456 454 341 428 219 199 72 258 391 419 529 240 312 68 309 214 328 262 378 1116 980 710 348 371 484 337 414 223
1692B23n9m8K28P4m0p8O7k4j38j63K76n3K62j7l12n2J6N2J71m8N8m5J0k80%J51J68M6j45J26
$$ 223 164 116 344 418 378 300 367 343 205 42 318 265 527 510 198 146 162 214 385 337 395 350 360 80 80 231 399 445 300 426
1410D26l18J23J2n8K26l2P2r6j90j51K25k7K82lj45o9j59J49p2O9J37MN5l43p5R4J35K12q3
$$ 426 108 231 243 185 411 379 451 355 165 14 239 212 494 491 346 277 118 267 195 264 401 405 460 117 42 136 271 483 400
1138D00q7J6j67J1P4k4K31qj21j9k49K5K06L15j59j05Q8m01J18J38j98M29j18J0n8j61j47
$$ 400 313 329 162 173 247 223 454 446 325 306 57 82 288 603 444 339 427 26 144 282 84 513 395 405 347 186 39
885C9L07M1J40l18L05k50r4P7l6K13pr3J80l57L5N1K5K68j54J73j89q9j71K73q4K85l5k49
$$ 39 346 387 527 209 514 264 170 247 211 424 417 324 504 147 182 233 258 526 372 545 356 267 96 369 285 570 535 286
622B86Qj36K58K81J329K99j524p0o26jJ46P0J72K2J5j07o8k91K80J48N7L9j61j16L0n7P7J10
$$ 286 294 158 416 697 2026 2325 801 731 105 104 250 320 492 514 529 422 354 63 343 491 548 587 426 310 340 283 360 470
359D70J21n0j4j86j46J15K60o6J71k00K6k42J19j23L00J66j74j1O2m01J84J2L02o2O5l6k65
$$ 470 591 541 527 341 195 310 570 504 675 475 501 259 378 255 555 721 547 536 598 197 381 393 695 633 698 662 397
105C97O5J1qM05l04R2J21k85L7k65L31L88j76o4j35p2J8JJ91J63N4j96r0m4r1M45k29K79l0
$$ 397 462 473 465 870 566 658 779 494 531 266 597 985 809 745 610 538 556 557 748 911 965 769 679 635 544 989 760 1039 1009
-167A009q6k06J1J4K47K05J3N3k16j19L3J41J28K44K59k70N5j08l7K05J10L14k1q9
$$ 1009 923 717 728 742 989 1194 1207 1260 1044 925 958 1099 1227 1471 1730 1460 1515 1407 1370 1575 1685 1999 1978 1889
-392A889
$$ 1889
##PAGE=	F1=1607.67
##FIRST=	4405.895418600002813,	4405.895418600002813,	0.089634776115417480469
##DATA TABLE=	(F2++(Y..Y)), PROFILE
4406A952j59j94N4J16M9J41n9k25j01n78K28q7K75nP4l00j17k50j79L69J13O2J28l21k04k87
$$ 1952 1793 1599 1653 1769 1818 1959 1900 1675 1574 996 1224 1137 1412 1407 1481 1181 1064 814 635 1004 1117 1179 1307 986 782 495
4162D95K46O3J31L55k96k24k42kJ43J6L34N2j38m61J3o2J75K32J94j50m3l23k30M1L50K51
$$ 495 741 804 935 1290 994 770 528 526 669 685 1019 1071 933 472 485 423 598 830 1024 874 831 508 278 319 669 920
3918I20J9K8l22k92q4J50J93L54k8j97j14k84k51N41Q9L28o1l08j67m50K39L48K42l6J70m14
$$ 920 939 967 645 353 269 419 612 966 938 741 627 343 92 633 722 1050 989 681 514 64 303 651 893 857 1027 613
3673F13m01m5K65M22J27l0j50j05m23M6K39K61K81r2j24m34j75J35L86K58J13ok52l92k48
$$ 613 212 167 432 854 981 951 801 696 273 319 558 819 1100 1008 884 450 275 410 796 1054 1167 1161 909 517 269
3439B69L61N00M2J22j7n05k93r0N64M09J76j55K6l42l97J00Q67K30J42J15n61m81O96j546
$$ 269 630 1130 1172 1294 1277 772 479 389 953 1362 1538 1383 1409 1067 670 770 1637 1867 2009 2124 1563 1082 1778 232
3213B32K997l35N54J811K102P241K8492K12189R0020k34553r4570j1700k117J025M711J59
$$ 232 3229 2894 3448 5259 7361 14602 43094 255283 345303 110750 16180 4480 2363 3388 8099 8258
3063H258M797J2076J3244M2657J87408J67618J5934j57936k13866k4442L8085L3940k9686
$$ 8258 13055 25131 38375 81032 268440 436058 451992 294056 80190 55748 93833 127773 98087
2941I8087k0573p0503k172k81k41L61K99k040M2j690l21N11N48L93q1l01n71n74j31L52L12
$$ 98087 77514 7011 4839 4558 4317 4678 4977 2937 2979 1289 968 1479 2027 2420 2339 2038 1467 893 762 1114 1426
2744A426K00j9j72m47k86m5L81J65O8n7j36l10k86J98K31K1R6L9j56m43n0K19M6J63R9j13
$$ 1426 1626 1607 1435 988 702 657 1038 1203 1271 1214 1078 768 482 680 911 932 1028 1067 911 468 418 637 683 846 945 832
2500H32j34k23j69K16L02r8J00k2m37lNJ59Q3K17n4j50k85o9R4J00J72n6J47k97j18j93K02
$$ 832 698 475 306 522 824 726 826 804 367 364 369 528 611 828 774 624 339 270 364 464 636 580 727 430 312 119 321
2246C21J9M70k29O3k48j93LJ45J63Q2Q9k79mj40j6K10J32j72J52j46k66m3K19K23J64l62J42
$$ 321 340 810 581 644 396 203 206 351 514 596 685 406 402 262 246 456 588 416 568 422 156 113 332 555 719 357 499
1993D99k44rm7M7K80k9o4K7k31Lp4J17J79J8J61l62K2k20K81q8J14J6k9Q48j14m58k61N2Q1
$$ 499 255 246 199 246 526 497 433 460 229 232 158 275 454 472 633 271 293 73 354 266 380 396 367 1215 1101 643 382 434 515
1720E15j39O9j90o7OK08M4J9j61J05l5j61j48K98n2K90p1l14o6j8J05J91l3O0n4l0k97L6J88
$$ 515 376 445 255 188 194 402 446 465 304 409 374 213 65 363 311 601 530 216 150 132 237 428 395 455 401 371 74 110 298
1448B98J63J0j36Q2l09R2N1j8K16k2Q1j44k26r3K15j9L06j0j62q3j36J23n1J08Q3O0Ml40j01
$$ 298 461 471 335 417 108 200 251 233 449 427 508 364 138 45 260 241 547 537 375 292 156 279 228 336 419 479 483 143 42
1176D2J06J83J69l2j38Mj37p0J53NK21k4j01m0k95J0K45L47j52j19R3m20N4K17j89M25r3q
$$ 42 148 331 500 468 330 334 197 127 280 285 506 482 381 341 46 56 301 648 496 377 470 50 104 321 132 557 464 456
913D56r4j64q8K49P4J19k94K99k91j01N7M6K07j4n7P5k92l4J21M0K68j83K29l02p5j35L21
$$ 456 362 198 110 359 433 552 258 557 266 165 222 268 475 461 404 479 187 153 274 314 582 399 628 326 251 116 437
659D37j37K98k5k58j7j21L63J47J744P5j439k91o96L2K13m6K42R3j2j06j98k23L50R1J16K3
$$ 437 300 598 573 315 298 177 540 687 2431 2506 1067 776 80 112 325 279 521 614 602 496 298 75 425 516 632 655
415F55k01j22K1m0Q9J37J14n8Jk47j64J70K59k2J20j71jk61J30j04K95J92j54p2P4m18J67
$$ 655 454 332 353 313 402 539 653 595 596 349 185 355 614 592 712 541 540 279 409 305 600 792 638 566 640 222 389
162C89K7L84j12O8l5k89K2Q3l5M83l38O4J28l30L3k43M17L58j77j14j09j09MJ00J42K13N3
$$ 389 416 800 688 756 721 432 454 537 502 985 647 711 839 509 542 299 716 1074 897 783 674 565 569 669 811 1024 1077
-92A077k81q3p6KM17j90K91k6j68j90J2kL53J47O5L7k64j56N1J70K40J51L08k73lp1o2K11
$$ 1077 796 713 637 639 1056 866 1157 1131 963 773 785 783 1136 1283 1348 1385 1121 965 1016 1186 1426 1577 1885 1612 1609 1538 1476 1687
-355A687K27K38J8q2
$$ 1687 1914 2152 2170 2088
-392B088
$$ 2088
##PAGE=	F1=1588.89
##FIRST=	4405.895418600002813,	4405.895418600002813,	0.32098776102066040039
##DATA TABLE=	(F2++(Y..Y)), PROFILE
4406A927j89j74N5Q7R6J01J6k54j25n73K15p0L04n1J20l37n3l30j56L77J06Q8J43l42k53k45
$$ 1927 1738 1564 1619 1706 1802 1903 1919 1665 1540 967 1182 1112 1416 1365 1485 1148 1095 765 609 986 1092 1180 1323 981 728 483
4162D83K47N0J61L33k74k30k37n2J73M7L18M0j41m31j7r3K10K35K19j56n9l20k13K5L19L00
$$ 483 730 780 941 1274 1000 770 533 481 654 701 1019 1059 918 487 470 377 587 822 1041 885 826 506 293 318 637 937
3918I37mN1l43k60j80K15K17L13Lj68j40l18k28N85M7L14n9k42k31l94K00L17L04m9J26l64
$$ 937 933 984 641 381 201 416 633 946 949 781 641 323 95 680 727 1041 982 740 509 115 315 632 936 887 1013 649
3673F49m40k4K61L94J53k6j35r4m50L8K59K06L94j41j89l26k05J16L65K94J04k0k46l49k94
$$ 649 209 185 446 840 993 967 832 738 288 326 585 791 1185 1044 855 529 324 440 805 1099 1203 1183 937 588 294
3439B94L70M99M5J44l4m75k99j18N56M45J94k01L3k94m01J00Q21K78J44J18n49m91O70j622
$$ 294 664 1163 1208 1352 1318 843 544 426 982 1427 1621 1420 1453 1159 758 858 1679 1957 2101 2219 1670 1179 1849 227
3213B27L187k55N16J582K372P107K8876K16091P9705k33869q9464j1172k580Q92N000P29K478
$$ 227 3414 3159 3675 5257 7629 14736 43612 259703 339408 105539 16075 4903 2323 3215 8215 8944 11422
3054A1422J0288J2458M0581J86730J85002J9942j55994k26874k5105M9937L5638m3456l0222
$$ 11422 21710 34168 74749 261479 446481 466423 310429 83555 58450 108387 144025 100569 70347
2932G0347o2022l178o51n18M23N49j882j2j510n17M89M83M19m0k75n50n81j31K92K99K50p2
$$ 70347 8325 5147 4496 3978 4401 4950 3068 3056 1546 1029 1518 2001 2420 2380 2105 1555 974 843 1135 1434 1684 1612
2725A612j29m16l02m0L28J72J04r6r9l29k79J87J70J17K3N8j16m74l3K58k3K28J4p4j31k61
$$ 1612 1483 1067 765 725 1053 1225 1329 1233 1134 805 526 713 883 1000 1023 1081 965 491 458 716 693 921 935 861 730 469
2481D69j23J63L14o6R1m4m04j8K5J43L5K81q4j54k53o2K4J62J35j9J06k71r8k06J59J15L70
$$ 469 346 509 823 757 848 804 400 382 407 550 585 866 782 628 375 313 337 499 634 615 721 450 352 146 305 420 790
2227G90j66lj75k52N4J13J83N1J09k88oj12k2J93J14j28Q1j14k40n9K31K23J47l36J34k51
$$ 790 624 621 446 194 248 361 544 595 704 416 410 298 276 469 583 455 536 422 182 123 354 577 724 388 522 271
1983B71lp3M3L00n5Mk9k25J9l4M8K02RJ98l86j6j97K78o5J02J05j80J032k8p29j75J5O5j13
$$ 271 268 195 238 538 483 487 458 233 252 218 266 468 477 675 289 273 76 354 289 391 496 316 1348 1320 591 416 431 496 383
1711C83O4j69p2M6J61QQ3k19J47n6j79j19K86l9K91j08k94m5p8J39J97j6P2o8l9l16O1K05
$$ 383 447 278 206 252 413 421 504 285 432 376 197 78 364 325 616 508 214 169 91 230 427 411 483 415 376 60 121 326
1448C26J47k0j11M1k47L1N0M1J81oR1j72k29n6J69PL03qj56j00j00Q6m3J43K2J30o1k94p1
$$ 326 473 453 342 383 136 167 217 258 439 433 524 352 123 67 236 243 546 538 382 282 182 268 225 368 390 520 459 165 94
1176I4M9K01J24K5j69Nr1j62J91L8J99k2o4n7l11k6K56L50j25j17R0l98k1K64j68L93p3Jj16
$$ 94 143 344 468 493 324 329 238 76 267 305 504 482 418 361 50 24 280 630 505 388 478 80 59 323 155 548 475 476 360
903C60j53n1J69J11Q5k30K66l08q9L3P2K17k1k6ok08j06J77M4K38j86K78l87o0r2L35j98L05
$$ 360 207 156 325 436 521 291 557 249 160 193 265 482 461 435 429 221 115 292 336 574 388 666 279 219 127 462 264 569
640E69%k37n3q3M32J62K295L50j589j050o58j0K22j15K71J44j9r9l01j35L46N0J55J9k16j19
$$ 569 569 332 279 196 628 790 3085 3435 1846 796 138 128 350 235 506 650 631 532 231 96 442 492 647 666 450 331
396C31J7m1Q2J61Q9l0Rk86j60J86K30K7O6j23qk67J06o7K50K22j32j13R8m20J25L9M32j41
$$ 331 348 307 389 550 639 609 618 332 172 358 588 615 681 558 550 283 389 322 572 794 662 549 647 227 352 391 823 682
133F82N8j4k86l0J29o6N36l48L3J49l60Jj97M54L20j66j31o8j66lJ74Q2K45N5l18p0j13P8
$$ 682 740 726 440 410 539 473 1009 661 694 843 483 484 287 741 1061 895 764 696 530 527 701 783 1028 1083 765 695 582 660
-129F60L48j36K88j8k09j65ll7M28Q3J25J5k85j62L3J75L30M0L56k39p0l9r6J98L20J47N9
$$ 660 1008 872 1160 1142 933 768 765 728 1156 1239 1364 1379 1094 932 965 1140 1470 1510 1866 1627 1557 1518 1422 1620 1940 2087 2146
-383B146o2
$$ 2146 2084
-392B084
$$ 2084
##PAGE=	F1=1570.11
##FIRST=	4405.895418600002813,	4405.895418600002813,	0.41279461979866027832
##DATA TABLE=	(F2++(Y..Y)), PROFILE
4406A724k11j41L0M5J20P7Q4k13j45n42K02r4L21q8J85l45L0l97j63L72Q6J29J39k91l05j99
$$ 1724 1513 1372 1402 1447 1567 1644 1728 1515 1370 828 1030 936 1257 1169 1354 1009 1039 642 479 851 937 1066 1205 914 609 410
4162D10K22K2J69L25k41j99j98j40J85N9L06J7j05l66m3j45K15K26K23j30m9k97j66m2K59
$$ 410 632 654 823 1148 907 708 510 370 555 614 920 937 832 466 423 278 493 719 942 812 763 466 300 258 517
3927E17L41l6R1l06k05l19K69K18K50M7j09j40l13j81N10J7K68l9j32k67k98Q3K64L38l5P7
$$ 517 858 822 913 607 402 83 352 570 820 867 758 618 305 124 634 651 919 880 748 481 183 266 530 868 833 910
3683I10k61m42K5J61L34J59J4j16m1m29l5K48J55M67j65k13j88k29P2K98K99R5Lk19k66l62
$$ 910 649 207 232 393 727 886 900 784 743 314 279 527 682 1149 984 771 583 354 426 724 1023 1118 1121 902 636 274
3439B74L52M37N0J81m3l87k78j90N07M27K20k10O3k12m10P4O90L04J59J32m71m57N14j190
$$ 274 626 1063 1113 1294 1251 864 586 396 903 1330 1550 1340 1403 1191 781 855 1545 1849 2008 2140 1669 1212 1726 536
3213E36K721j37N31J277K370O647K7422K02726N9840k14924p4636r532k589L60M403J499J043
$$ 536 3257 3120 3651 4928 7298 13945 41367 244093 303933 89009 14373 4841 2252 2612 7015 8514 9557
3054I557P540J0346L4395J65161J88114K1468j35903k21476k2177O5782M3280m9961n7422
$$ 9557 17097 27443 61838 226999 415113 436581 300678 79202 57025 122807 166087 116126 58704
2932E8704m7863q266R00m89N08R04j369r1j144p89L14L97M23L4j39n00n30j60J27L26K50p3
$$ 58704 10841 2575 3475 2986 3494 4398 3029 2938 1794 1005 1319 1716 2139 2173 2034 1534 1004 844 971 1297 1547 1474
2725A474o1l37k93p0K45J41J42r7m9k93k61J09R6K06k7P4m5m74j4K61j11K72m9j7j09k84p2
$$ 1474 1413 1076 783 713 958 1099 1241 1144 1095 802 541 650 746 952 925 999 954 480 466 727 616 888 839 822 713 429 357
2472C57P2L08k3O8k8l54j4PJ09lL08q5j33j97n2o8J99R0J0Q6k05p3k16J00J69K66r1n1r0k85
$$ 357 429 737 714 782 754 400 386 393 502 499 807 722 589 392 340 272 471 561 571 657 452 379 163 263 432 698 607 556 466 181
2190A81R4L4K12J1J28k65mq3l0J48Q9p4K4p0j94n7K13J87J18k78J13k26J7j08K0K88p4P7p0
$$ 181 275 309 521 532 660 395 391 308 278 426 515 441 465 395 201 144 357 544 662 384 497 271 288 180 200 488 414 491 421
1918D21j91L5j8j8K03JK19l64l4j48K08m4R4J87k83J251P6j040j19p3O8p8O6j31p5P5Q4k4
$$ 421 230 265 247 229 432 433 652 288 254 106 314 270 364 551 268 1519 1595 555 436 363 431 353 419 288 213 288 372 348
1655C48J44k53J95p9j97r3K54j7K68j22k52Pj54J40J90J1Q5q5k0l24P4J87J25m1p2J0j55l5
$$ 348 492 239 434 355 158 65 319 302 570 448 196 203 49 189 379 390 475 390 370 46 120 307 432 391 319 329 174 139
1392A39J3J05J21J6J05j78j86o5J02N0K64Rj31j15n7L9n2J76m1K08j33k11k1l1J78R0P6j79
$$ 139 152 257 378 394 499 321 135 70 172 222 486 495 364 249 192 231 179 355 314 522 389 178 157 126 304 394 470 291
1129B91K6n2k17J65O7J64%j9o3l01j9J87L20p8j05Q3l41l8K14j30L29n8L2j17j28m9Q5J44
$$ 291 317 265 48 213 280 444 444 425 362 61 42 229 549 471 366 449 108 70 284 154 483 425 457 340 212 163 248 392
866C92M1j33K14l02o2NM6K41k6rm8j19j69K08M0J84j62L09m34k6n4L00k57L08K9j84r5l6M74
$$ 392 433 300 514 212 150 155 201 442 416 407 359 240 71 279 319 503 341 650 216 190 136 436 179 487 516 332 237 201 675
594F75K66K985R63k166j929n96n0J72j47K73J74j4q2l59l3K61K9J63L0k03j02J8o6O1J74N4
$$ 675 941 3926 4889 2723 794 198 148 320 173 446 620 606 524 165 132 393 422 585 615 412 310 328 262 323 497 551
349E51K1K1l05r3J17J78Q0J3o5Qk51M5k5J79K49j09j29J37m12N7N2M36j46M0K6k61o9J29r5
$$ 551 572 593 288 195 312 490 570 583 518 526 275 320 295 474 723 614 485 622 210 267 319 755 609 649 675 414 345 474 379
77C79N53l31NJ78l60o4j38M44K76j47j04k4k28j4K19J5K59O3l06n0j47J27K35o7K70qk05j30
$$ 379 932 601 606 784 424 360 222 666 942 795 691 667 439 425 644 659 918 981 675 625 478 605 840 773 1043 1035 830 700
-186G00m0q4M60K4J83qk72j34l1J59L81o8L96j79j26j5j45J68L73N7R7l2
$$ 700 660 576 1036 1060 1243 1235 963 829 798 957 1338 1270 1666 1487 1361 1346 1201 1369 1742 1799 1896 1864
-392A864
$$ 1864
##PAGE=	F1=1551.33
##FIRST=	4405.895418600002813,	4405.895418600002813,	0.26924231648445129395
##DATA TABLE=	(F2++(Y..Y)), PROFILE
4406A385k18j02j3j6J25O6J39j13j40n00J96j70L24j07K58l13J02m22k16L62M9J83J13j73
$$ 1385 1167 1065 1052 1036 1161 1227 1366 1253 1113 613 809 639 963 856 1114 801 903 481 265 627 676 859 972 799
4181G99l42j50J55j8J65L17j89j36j25k64J78M5L06rm1k70o4k08J78K13K02p0j6k53r5j60
$$ 799 457 307 462 444 609 926 737 601 476 212 390 435 741 732 691 421 357 149 327 540 742 672 656 403 308 148
3936A48J85L65p2J46k25j31l47J71J95J79R1k3j18k59j19L24jK00okk64j86q3K01L36JK9j16
$$ 148 333 698 626 772 547 416 69 240 435 614 705 682 564 305 186 510 509 709 703 701 437 251 168 369 705 706 735 619
3673F19m17R2mK48J42Q2r2M3l71j41K04J27M71j66j85n3k41M1J78K66Q7N2j67j66m19L21L03
$$ 619 202 294 290 538 680 762 670 713 342 201 405 532 1003 837 652 599 358 399 577 843 930 982 815 649 230 551 854
3420H54N7K21m2k57k35k61M07L55K39j79J07j09m04L8M79K94J83J48l48l69K81o21J960k9
$$ 854 911 1132 1090 833 598 337 744 1099 1338 1159 1266 1157 753 791 1270 1564 1747 1895 1547 1178 1459 838 2798 2769
3195B769N44R46K018N689K3883J74223L9296j81495n5760p595k515j44L023K079N84M538P444
$$ 2769 3313 4259 6277 11966 35849 210072 249368 67873 12113 4518 2003 1859 4882 6961 7545 12083 19527
3035A9527K5447J27000J77597K0100j01918j99306j5908Q3421N6396m5227r2291l9581j0153
$$ 19527 44974 171974 349571 369671 267753 68447 52539 135960 192356 147129 54838 15257 5104
2913E104l189k73N29J272n67k19o46r41j13K94M12R4R4m27m23k04j26L96J76j8K0k14k62j18
$$ 5104 1915 1642 2171 3443 2876 2657 2011 1070 957 1251 1663 1757 1851 1424 1001 797 671 1067 1243 1225 1245 1031 769 651
2688F51J41O1J74n5Lk11k25k9L5K63n3Q3N1m50L0K19k15K83q1N1p6k76k2n3K98J0L1K9k95
$$ 651 792 853 1027 972 975 764 539 510 545 808 755 838 889 439 469 688 473 756 675 726 650 374 352 299 597 607 638 667 372
2415C72J1m5O7l7K98n8q7j30m2j60J99M4L2Q3j11l9k27M5J62J72j4p0j3k69J07q3K43k6J36
$$ 372 383 338 405 368 666 608 521 391 349 189 388 432 464 547 436 397 170 215 377 549 535 465 452 183 290 207 450 424 560
2143E60k15Rn8k5O3O7k5pk7j27l6J76J12P7j95P7j68M6j44j1K35p3J34q8j35N5k2q9J89lK28
$$ 560 345 354 296 271 334 401 376 369 342 215 179 355 467 544 349 426 258 304 160 149 384 311 445 357 222 277 255 166 355 352 580
1852E80l15k7p9Q5l4J06K48k74J404J64j333q6j78P1m2P7q3p4R7j6m2J90k69K45r7k06q3K15
$$ 580 265 238 159 244 210 316 564 290 1694 1858 525 439 261 332 290 367 284 210 307 291 249 439 170 415 318 112 29 244
1589B44LK27j13j95P5k03Q4J69O0Q2j02K0l03P8J20J04n4k4qo4p6k9J35M6M2J24j65j11j13
$$ 244 247 474 361 166 241 38 122 291 351 433 331 351 48 126 246 350 296 272 264 200 124 95 230 276 318 442 277 166 53
1317E3K7J09J85M4r4j18j8j4p2K00r1K74j98j02K9j04J11P6J05j68O5k9j85N2P9J17M2K3n1
$$ 53 80 189 374 418 324 206 188 174 102 302 211 485 287 185 214 110 221 297 402 234 299 270 85 137 216 333 375 398 347
1044C47k74L7M7K65j5r6P7k59J0P1p8K36m2P6r4q8r1J7J63rj5J53k80j8l5j7K74k6j1m6l3
$$ 347 73 110 157 422 407 311 388 129 139 210 132 368 326 402 308 220 129 146 309 300 285 438 158 140 105 88 362 336 325 279 246
753B46k11K04L8J07j17L20m44N9m8K10l06L08N5j05j36KN00L99L715J599k944k671n33p6Q6
$$ 246 35 239 277 384 267 587 143 202 154 364 58 366 421 316 180 182 682 1081 4796 6395 3451 780 247 171 257
518B57j41K36J83mn6l49N7J04L3J39M9j62o8K1j04L2J60J8Q2M5l08M4m6J14J33l3oM2k04m0
$$ 257 116 352 535 531 475 126 183 287 320 459 508 346 278 299 195 227 387 405 487 532 224 268 222 336 469 436 430 472 268 228
237B28kR9K65q1j25J94l93l8O3L98j27J8Q6k24n7N0j21N35k88j0K03l11j69p8L92K30j22l4
$$ 228 226 325 590 509 384 578 185 147 210 608 481 499 585 361 304 354 233 768 480 470 673 362 193 115 507 737 615 581
-26E81J2k62n5K29m6K58P8k58j8j57J41P1J5K39Nj59q4j00j26M34k1K34l5k12q2j25J12L88
$$ 581 593 331 276 505 459 717 795 537 519 362 503 574 589 828 833 674 590 490 364 798 777 1011 976 764 682 557 669 1057
-289A057j54M19j09j46Mk13J21L79k0J30Q
$$ 1057 903 1322 1213 1067 1071 858 979 1358 1338 1468 1476
-392A476
$$ 1476
##PAGE=	F1=1532.55
##FIRST=	4405.895418600002813,	4405.895418600002813,	0.18823708593845367432
##DATA TABLE=	(F2++(Y..Y)), PROFILE
4406A009k01o4m4j29J19M9J92Pp4m24J62l24L31j17L26k24J27l61k54K63rK48O5ol38o6no6
$$ 1009 808 744 700 571 690 739 931 938 864 440 602 278 609 492 818 594 721 360 106 369 360 608 673 667 329 263 258 192
4143A92J56K99j11n7k3l88J22PL20k1K9j46q8j53j6K02J57J3L4j83j7k51P2L43j03K06j21
$$ 192 348 647 536 479 456 68 190 197 517 496 525 379 291 138 122 324 481 494 528 345 328 77 149 492 389 595 474
3889D74m9j92j14J42J10J25P6q1j62p0Q9j2J21L1J21k20p7k49J38K85M8j4N0l77J70j93J49
$$ 474 425 233 119 261 371 496 572 491 329 259 348 336 457 488 609 389 312 63 201 486 534 520 570 193 363 170 319
3636C19R8J66o6J37k90k02J08J30L78j46j09N4k29N6QJ86Q6J07q9q1m12K78R8O3K51l0j10
$$ 319 417 583 517 654 364 162 270 400 778 632 523 577 348 404 412 598 684 791 702 621 209 487 585 648 899 869 759
3382G59j75k58K28K47K29j14J56nl69J3K04K47K10J56k00k44M4q5J087M5N17O53J424M304
$$ 759 584 326 554 801 1030 916 1072 1067 698 711 915 1162 1372 1528 1328 1084 1128 1043 2130 2175 2692 3345 4769 9073
3157I073J8351J35272K4388j39161l7974n899k488j44J145K104R13J932M336J5909Q0335J56626
$$ 9073 27424 162696 187084 47923 9949 4050 1562 1418 2563 4667 5580 7512 11848 27757 108092 264718
3007B64718J5829o1299j65098p419R8883P0503l3532j15648m5054n809j3270j872j48J512
$$ 264718 280547 219248 54150 46731 145614 216117 182585 66937 21883 16074 2804 932 784 2296
2875B296L82m10q0q37o35O8L66O8L83l33k63k55l00L78J1Q9R4n8k14j49L0q9J97K3N0j06j72
$$ 2296 2678 2268 2188 1351 716 784 1150 1218 1601 1268 1005 750 450 828 839 928 1022 964 750 601 631 542 739 762 812 706 534
2622E34j83K5K40o0P9J56m13J26J26l22K51q3J20m2k25K2j80K90lj1J19k39N4j06L2q2K53
$$ 534 351 376 616 556 635 791 378 504 630 308 559 476 596 554 329 351 171 461 458 447 566 327 381 275 307 225 478
2368D78j3j9p0k6k09J34LN1Q6j1Jk30J3R2R9M6n8M1j99Q6j90K42n1J31j48K9l6Oo7N7LKkm3
$$ 478 465 446 376 350 141 275 278 329 415 404 405 175 188 280 379 425 367 408 209 295 105 347 296 427 279 308 272 278 211 268 271 273 271 228
2049B28JJ33KK7r1K5q5P4j66k5J22l1J49q9o2Q2l4j74J70JK24k59Kj0m4m4J44K82j40J425
$$ 228 229 362 364 391 300 325 240 314 148 123 245 214 363 274 212 294 260 86 256 257 481 222 224 214 170 126 270 552 412 1837
1767A837K02j553o8k25L2j1R2l9o5J17j29l0K01k71K92j06j92n0J39%J76q3j36J46k05kJ13
$$ 1837 2039 486 418 193 225 214 306 267 202 319 190 160 361 90 382 276 84 34 173 173 349 266 130 276 71 69 182
1514A82J35M9j12O2k43P5OR6o5K9j5Qq1j0P0l5P3J46j39k9j81JJ42O3R6n3j00%n6o2J71r5
$$ 182 317 366 254 316 73 148 154 250 185 214 199 207 126 116 186 151 224 370 231 202 21 22 164 227 323 270 170 170 114 52 223 128
1213A28K89k42K1N9j35nQ6J02j42J16k6j10l9L1O0R9M8k2k32J02j12K04N0r6P3j66P2j00q
$$ 128 417 175 196 255 120 115 201 303 161 277 251 141 102 133 193 292 340 318 86 188 76 280 330 234 307 141 213 113 105
941A05J18k2J22n2m0j67k5J63m8J00R4k53N1j01K3J92j6m1JM1j86J30N2Ro7L10m22J90p3P1
$$ 105 223 201 323 271 231 64 39 202 154 254 348 95 146 45 68 260 244 203 204 245 59 189 241 250 183 493 71 261 188 259
659B59j83J53P6mj76J5N20N09M300K093l679l117m71j00J0o1R9J74Lk0k66J07r3O7Q5O5r8
$$ 259 76 229 305 301 125 140 660 1169 5469 7562 3883 766 295 195 205 144 243 417 420 400 134 241 148 215 300 365 267
406B67k1L0j21J1P8j2J34R0k99K03k58N7J78o3M5Q1j25r1n2M5K52n4j09K75l66q7NL21q9o
$$ 267 246 276 155 166 244 232 366 456 157 360 102 159 337 274 319 400 275 184 132 177 429 375 266 541 175 88 93 414 325 319
124C19J65j86L5j24j44M88k29KK07j98k48k6K41J85r4P5K6k09j64J91q6K45J09k04L9j06J03
$$ 319 484 298 333 209 65 553 324 326 533 335 87 61 302 487 393 468 494 285 121 312 226 471 580 376 415 309 412
-129D12j48J01J99K6q7k0j76r0K81m6K72o9q4k9j80j0L47k01M15m3j00L1k80L4L35q3J55O4
$$ 412 264 365 564 590 503 483 307 217 498 452 724 655 571 542 362 352 699 498 913 870 770 801 521 555 890 807 962 1026
-392A026
$$ 1026
##PAGE=	F1=1513.77
##FIRST=	4405.895418600002813,	4405.895418600002813,	0.26135084033012390137
##DATA TABLE=	(F2++(Y..Y)), PROFILE
4406G38j36l0J3k68N0m2K67N4Q5k55L7m31K45j46L61o3O1j83l7j36j32L26OJ62k63O3k21n9
$$ 738 602 572 585 317 367 325 592 646 731 476 513 82 327 181 542 479 540 357 320 184 52 378 384 546 283 346 125 66
4143F6L4K59J5LQ4k91j28K7K26RO9j1j20L7j85K4R4J04R8r3L6j64k0J16j10K41j7K5m9k61
$$ 66 100 359 374 377 461 170 42 69 295 304 373 362 242 279 94 118 212 316 414 321 357 193 173 289 179 420 403 428 379 118
3861A18j7M8J34J73l9n2m2r8m3M2N4K13j44J3k38L9J08Q6n0K14l38K47l12M9j2K46m0K21k02
$$ 118 101 149 283 456 417 365 323 225 182 224 278 491 347 360 122 161 269 355 305 519 181 428 116 165 153 399 359 580 378
3589C78j55j0J37J71j12KJ13j83J18j60L8J09J34J0l2l05K14j38O8K44nK7j12j46mJ50J40
$$ 378 223 213 350 521 409 411 524 341 459 299 337 446 580 590 558 253 467 329 397 641 636 663 551 405 401 551 691
3335F91k3J93P8k99J2q7J64K36J45m9j16r7K69K65Q7M39M44Q03K868J1741R2300J6618r4480
$$ 691 668 861 939 640 652 565 729 965 1110 1061 945 848 1117 1382 1469 1908 2352 3155 6023 17764 110064 126682 32202
3119C2202k4277m484k294M62K67M35J633J83J461R184L6825J28206Q547k3050j25316J183
$$ 32202 7925 3441 1147 1609 1876 2311 3944 4127 5588 14772 51597 179803 188350 165300 39984 41167
2969D1167J08064Q0374j9838j24652n4583k25k4388m136j342P55J290o15M56n85p95k65J43
$$ 41167 149231 229605 209767 85115 30532 30307 5919 1783 441 1196 2486 1871 2327 1742 947 682 825
2810H25j45O55k14p2l15o6pk17K21J32J14j67j30n2k93J92J09Q9j2j16k37Q7O7o7N6K49l72
$$ 825 680 1335 1121 1049 734 668 661 444 665 797 911 744 614 562 269 461 570 659 647 531 294 381 448 381 437 686 314
2556C14K63J1l87J55p1J82j8j28L9j80K15r2n7K35k03J08j32K7j62J82K8N3k5oj77Pl9P4P4
$$ 314 577 588 201 356 285 467 449 321 360 180 395 303 246 481 278 386 254 281 119 301 329 382 357 351 174 181 142 216 290
2284B90P0M2k16J4nM7O5k6O4r6M5j41Q4n9J14q3N3j1N7k27P2kN5j0M2M9R0j16k6K2m4J3R3
$$ 290 360 402 186 200 195 242 307 281 345 249 294 153 237 178 292 209 262 251 308 81 153 151 206 196 238 287 377 261 235 257 213 226 319
1974C19j65j1m4Q0Q7p8K1J03l6k73J60J6K03k18N8L1j27k2J40K95M9J341J63j670m8j57p3
$$ 319 154 143 99 179 266 188 209 312 276 3 163 179 382 164 222 253 126 104 244 539 588 1929 2092 422 374 217 144
1720A44J1R7j2m9J44k24J6J50k53L17j03j51J1N7m7J16m0q9K02j91J3l2K19j9j10R4j60O3
$$ 144 155 252 240 191 335 111 127 277 24 341 238 87 98 155 108 224 184 95 297 106 119 87 306 287 177 271 111 174
1457A74j23J16q6P4pM8n2K9k7j05R6J69j13L8k12Q7N4r1J62j8n5j5o1L9J6RJ85k55J42N5j17
$$ 174 51 167 81 155 148 196 144 173 146 41 137 306 193 231 19 106 160 69 231 213 158 143 82 121 137 146 331 76 218 273 156
1166A56j06Q2O4j12J69m2k0l0j04oJ60M9J9j77J58k36J59Q1j12P0p6J27k54P4pqJ64lOk12
$$ 156 50 132 196 84 253 211 191 161 57 51 211 260 279 102 260 24 183 264 152 222 146 273 19 93 86 78 242 239 245 33
885C3J6M6J2J07N1k30J32j24J60m7J0r5P5R6j35N0P6p0n8K86l79L18j00r1O0r7R7J04j96q
$$ 33 49 95 107 214 265 35 167 43 203 156 166 71 146 242 107 157 233 163 105 391 12 330 230 139 199 102 199 303 107 99
603I9N25N61M540K416m167l219m06j30j5K8p9J40kK6j47J25k86J34J0O2k4K9M5p4J8j09k8
$$ 99 624 1185 5725 8141 3974 755 349 219 204 232 153 293 291 317 170 295 9 143 153 215 191 220 265 191 209 100 72
349G2J61J54k67L19m12O5J13n5P1J01k5n3k07J21J31l2j00L66l41K6j28J34k7m1K51j50J63
$$ 72 233 387 120 439 27 92 205 150 221 322 297 244 37 158 289 257 157 523 182 208 80 214 187 146 397 247 410
96D10l06j0K51j72O4J55m1j28m4o1J22o4K11J0n6k22mo1J95J59j86J33lM5k88N0J61P0k2O2
$$ 410 104 94 345 173 237 392 351 223 179 118 240 176 387 397 341 119 115 54 249 408 222 355 352 397 109 159 320 390 368 430
-186D30k10J14r4m8K78j24J34j8m8j89J72j54L08NL9R4k36j03J74j27J39J46
$$ 430 220 334 240 192 470 346 480 462 414 225 397 243 551 556 595 689 453 350 524 397 536 682
-392F82
##PAGE=	F1=1494.99
##FIRST=	4405.895418600002813,	4405.895418600002813,	0.36153680086135864258
##DATA TABLE=	(F2++(Y..Y)), PROFILE
4406F73n4oJ27k14n4j68K38r7K78q6q3k01j9j27J58J06n7OJ11k99l8N3k7K30j55J71k48M2
$$ 673 619 613 740 526 472 304 542 445 723 637 554 353 334 207 365 471 414 420 531 232 194 247 220 450 295 466 218 260
4143B60j59L3J71J2J59j78j21J00j59J30J4J10j63J98j40j97l3J38J65j0M8o1pj60j3J43O5
$$ 260 101 134 305 317 476 298 177 277 118 248 262 372 209 407 267 70 37 175 340 330 378 317 310 150 137 280 345
3889C45P7N9k70q1n3L8K44mL7k8j29r9k1PK48n8P6j60L3r5L7p7L47l09L16l01L8j26J57k2
$$ 345 422 481 211 130 77 115 359 355 392 364 235 136 115 122 370 312 388 228 261 166 203 126 473 164 480 179 217 91 248 226
3608B26K77j22o8m4R7q3p2J21J20j06J81k35j69J65J00J10k5j39J40k43K1J53L1J33o2Rj74
$$ 226 503 381 313 269 366 283 211 332 452 346 527 292 123 288 388 498 473 334 474 231 252 405 436 569 507 516 342
3354C42J38q3P2K06J24k04K5k75L4K40J02Q0j3n1L29l64J12L14L27L65J912N885N2061J3255
$$ 342 480 397 469 675 799 595 620 345 379 619 721 801 788 737 1066 702 814 1128 1455 1820 3732 9617 61678 74933
3129G4933n4111j4965l126j539P99J087j769J549m51q71J0269K4339P9768k336K495q6812
$$ 74933 20822 5857 2731 1192 1991 3078 1309 2858 2407 1536 11805 36144 115912 113576 116071 29259
2979B9259P086J08574Q2511p430j22115n7545N286l6428o627j622o39K008p25Q31l53p41l75
$$ 29259 36345 144919 227430 220000 97885 40340 45626 9198 2571 949 310 2318 1593 2424 2071 1330 955
2819I55j52m25P12o5J00l85L02m56l11K42R9K71j39p7q1l30O2J17J24L4p2j38J14j31p9LL01
$$ 955 803 378 1090 1025 1125 740 1042 586 275 517 616 887 748 671 590 260 322 439 563 597 525 387 501 370 291 294 595
2565E95l35L96q3l47J4q8K18j1rJ9p6J13k24j10L61j98J60j09M2j99Q8J8R6J0J1j18o1o1O4
$$ 595 260 656 573 226 240 152 370 359 350 369 293 406 182 72 433 235 395 286 328 129 217 235 331 341 352 234 173 112 176
2293A76K1J13P9j82K6l8J1J4nO1QJk1j14m8Q2l7P3K6R8l08P6p4J48n8J14J01M1k00o7J15j18
$$ 176 197 310 389 207 233 195 206 220 215 276 284 285 264 150 102 184 147 220 246 344 36 112 38 186 128 242 343 384 184 117 232 114
1993A14J07R8j41oj44J73k7n8J01J06k6k25M7K4J63k05J41K4j37O3N2K90K36J189O5j693j8
$$ 114 221 319 178 172 28 201 174 116 217 323 297 72 119 143 306 101 242 266 129 192 244 534 770 1959 2024 331 313
1739C13m2j52L4O5km1J79k38K6O3j50K47r2j12O3K0r2L4J6p1K31j63N9j02K12r8q9J02o6L4
$$ 313 271 119 153 218 216 175 354 116 142 205 55 302 210 98 161 181 89 123 139 68 299 136 195 93 305 207 118 220 154 188
1457A88j31Q9j33Q9J6N5jL2o8n5J0J76r2P2j90J08Kq9Q4%Qn4j6R0j22J42L3k28K31J8o9q1
$$ 188 57 146 13 102 118 173 172 204 136 81 91 267 175 247 57 165 167 78 162 162 170 116 100 190 68 210 243 15 246 264 195 114
1157A14j2kp6K06o9O6Nj82J8Q3K2N6j09J93k41J10M0j41O5JJ64k24J6mq1J62M0L4j42j0p6
$$ 114 102 100 24 230 161 227 232 50 68 151 173 229 120 313 72 182 222 81 146 147 311 87 103 99 18 180 220 254 112 102 26
866B6J77k8L3j81J56p5K03k44N6o6N5J27q9J0Q4o1j37K58k75L47j09k41K64k65J07J94j89
$$ 26 203 175 208 27 183 108 311 67 123 57 112 239 150 160 244 183 46 304 29 376 267 26 290 25 132 326 137
612A37l0M80N47M289K628m277l036l26j73j1P5j79O3k2Q3m6J31k13Ok4nL7O8O0mK5k44N4K4
$$ 137 107 587 1134 5423 8051 3774 738 412 239 228 303 124 187 165 248 202 333 120 126 102 97 134 202 262 258 283 39 93 117
340A17K22k17L61l46P9j13M3K1Q2P3Nk83K13l2k3j24M39l24J37j67j06Q7j23L10j04K48l28
$$ 117 339 122 483 137 216 103 146 167 249 322 327 44 257 225 202 78 517 193 330 163 57 144 21 331 227 475 147
86A47O7K1j40J29N2J02k2p3j40p3m1L25l1R7j90r9N7j6J65k36K48O7L1j30k20J04J26k8J40
$$ 147 214 235 95 224 276 378 356 283 143 70 29 354 323 420 230 131 188 172 337 101 349 416 447 317 97 201 327 299 439
-186D39j66K34k56k0J21j89L37n2J34j86l8RJ9J2J87J62j12j08j2p3k9J91
$$ 439 273 507 251 231 352 163 500 448 582 396 358 367 386 398 585 747 635 527 515 442 413 604
-392F04
##PAGE=	F1=1476.21
$$ [...]
-392G3
##END NTUPLES=	nD NMR SPECTRUM
##END=	
##END=	
