##TITLE=	ZM9SuHzjRZmaKV8NQ2wdvQ.35.ser
TM-VI-111 hmbc

##JCAMP-DX=	6.0	$$ MestReNova 14.3.1-31739
##DATA TYPE=	LINK
##BLOCK_ID=	1
##BLOCKS=	2    
##ORIGIN=	Mestrelab Research S.L.
##OWNER=	hrzepa
##$MNOVA/LINK_BLOCK_TYPE=	ITEM	$$ NMR Spectrum
##$MNOVA/ITEM/POLYGON=	(XY..XY)
5321,5835
8722,5835
8722,8208
5321,8208
5321,5835
##$MNOVA/ITEM/Z=	0
##$MNOVA/ITEM/ANGLE=	0
##TITLE=	ZM9SuHzjRZmaKV8NQ2wdvQ.35.ser
##JCAMP-DX=	6.0	$$ MestReNova 14.3.1-31739
##BLOCK_ID=	2
##DATA TYPE=	MNOVA NMR VIEW DATA
##DATA CLASS=	MNOVA VIEW DATA
##$MNOVA/2D/THRESHOLD=	4.5962595939636230469
##$MNOVA/ITEM/ZOOM/X=	-0.47501081208716700033,	14.504330000039219684
##$MNOVA/ITEM/ZOOM/Y=	-9.5107036222489718114,	249.98529999918474687
##END=	
##TITLE=	ZM9SuHzjRZmaKV8NQ2wdvQ.35.ser
##JCAMP-DX=	6.0	$$ MestReNova 14.3.1-31739
##BLOCK_ID=	3
##DATA TYPE=	nD NMR SPECTRUM
##DATA CLASS=	NTUPLES
##NUMDIM=	2
##ORIGIN=	Bruker BioSpin GmbH
##OWNER=	nmr
##.OBSERVE FREQUENCY=	400.41280287000000726
##.OBSERVE NUCLEUS=	^1H
##.SOLVENT NAME=	CDCl3
##.PULSE SEQUENCE=	hmbcgplpndqf
##LONGDATE=	2021/10/07 20:03:18.000
##.ACQUISITIONMODE=	SIMULTANEOUS (DQD)
##$ORIGINAL FORMAT=	Bruker XWIN-NMR
##$MNOVA/SCALES_VERSION=	9
##$PARAMETER FILE=	(acqu2s, ASCII, /private/var/folders/f6/rjf_tdyn2v98c5c0wvkgn4s80000gn/T/ZM9SuHzjRZmaKV8NQ2wdvQ/35/acqu2s, 0)
$$ ##TITLE= Parameter file, TOPSPIN		Version 3.2
$$ ##JCAMPDX= 5.0
$$ ##DATATYPE= Parameter Values
$$ ##NPOINTS= 129	$$ modification sequence number
$$ ##ORIGIN= Bruker BioSpin GmbH
$$ ##OWNER= nmr
$$ $$ 2021-10-07 20:22:55.047 +0100  nmr@CZC10666PP
$$ $$ /opt/topspin/data/agmb/nmr/Oct07-2021/35/acqu2s
$$ $$ process /opt/topspin3.2/prog/mod/go
$$ ##$ACQT0= 0
$$ ##$BF1= 100.683175
$$ ##$FnMODE= 1
$$ ##$NUC1= <13C>
$$ ##$NusJSP= 0
$$ ##$NusT2= 1
$$ ##$NusTD= 128
$$ ##$O1= 12080.308799824
$$ ##$SFO1= 100.6952553088
$$ ##$SW= 259.972631192251
$$ ##$SW_h= 26178.0104712042
$$ ##$TD= 128
$$ ##END=
$$ 
##$PARAMETER FILE=	(acqus, ASCII, /private/var/folders/f6/rjf_tdyn2v98c5c0wvkgn4s80000gn/T/ZM9SuHzjRZmaKV8NQ2wdvQ/35/acqus, 0)
$$ ##TITLE= Parameter file, TOPSPIN		Version 3.2
$$ ##JCAMPDX= 5.0
$$ ##DATATYPE= Parameter Values
$$ ##NPOINTS= 12	$$ modification sequence number
$$ ##ORIGIN= Bruker BioSpin GmbH
$$ ##OWNER= nmr
$$ $$ 2021-10-07 20:22:59.004 +0100  nmr@CZC10666PP
$$ $$ /opt/topspin/data/agmb/nmr/Oct07-2021/35/acqus
$$ $$ process /opt/topspin3.2/prog/mod/shimcntl
$$ ##$ACQT0= 1000000
$$ ##$AMP= (0..31)
$$ 100 100 100 100 100 100 100 100 100 100 100 100 100 100 100 100 100 100
$$ 100 100 100 100 100 100 100 100 100 100 100 100 100 100
$$ ##$AMPCOIL= (0..19)
$$ 0 0 0 0 0 0 0 0 0 0 0 0 0 0 0 0 0 0 0 0
$$ ##$ANAVPT= -1
$$ ##$AQSEQ= 0
$$ ##$AQ_mod= 3
$$ ##$AUNM= <au_zg>
$$ ##$AUTOPOS= <31 >
$$ ##$BF1= 400.41
$$ ##$BF2= 100.683175
$$ ##$BF3= 400.41
$$ ##$BF4= 400.41
$$ ##$BF5= 400.41
$$ ##$BF6= 400.41
$$ ##$BF7= 400.41
$$ ##$BF8= 400.41
$$ ##$BYTORDA= 0
$$ ##$CAGPARS= (0..11)
$$ 0 0 0 0 0 0 0 0 0 0 0 0
$$ ##$CFDGTYP= 0
$$ ##$CFRGTYP= 9
$$ ##$CHEMSTR= <none>
$$ [...]
$$ 0 0 0 0
$$ ##$ShimPowMaxUC= (0..63)
$$ 130000 130000 130000 130000 130000 130000 130000 130000 130000 130000 130000
$$ 130000 130000 130000 130000 130000 130000 130000 130000 130000 0 0 0 0
$$ 0 0 0 0 0 0 0 0 0 0 0 0 0 0 0 0 0 0 0 0 0 0 0 0 0 0 0 0 0 0 0 0 0 0 0 0
$$ 0 0 0 0
$$ ##$ShimPowMaxUG= (0..63)
$$ 524287 524287 524287 524287 524287 524287 524287 524287 524287 524287 524287
$$ 524287 524287 524287 524287 524287 524287 524287 524287 524287 0 0 0 0
$$ 0 0 0 0 0 0 0 0 0 0 0 0 0 0 0 0 0 0 0 0 0 0 0 0 0 0 0 0 0 0 0 0 0 0 0 0
$$ 0 0 0 0
$$ ##$ShimPowRcbType= 3
$$ ##$ShimPowRes= (0..63)
$$ 1e-20 1e-20 1e-20 1e-20 1e-20 1e-20 1e-20 1e-20 1e-20 1e-20 1e-20 1e-20
$$ 1e-20 1e-20 1e-20 1e-20 1e-20 1e-20 1e-20 1e-20 0 0 0 0 0 0 0 0 0 0 0 0
$$ 0 0 0 0 0 0 0 0 0 0 0 0 0 0 0 0 0 0 0 0 0 0 0 0 0 0 0 0 0 0 0 0
$$ ##$ShimPowRng0= (0..63)
$$ 1 1 1 1 1 1 1 1 1 1 1 1 1 1 1 1 1 1 1 1 0 0 0 0 0 0 0 0 0 0 0 0 0 0 0 0
$$ 0 0 0 0 0 0 0 0 0 0 0 0 0 0 0 0 0 0 0 0 0 0 0 0 0 0 0 0
$$ ##$ShimPowRng1= (0..63)
$$ 1 1 1 1 1 1 1 1 1 1 1 1 1 1 1 1 1 1 1 1 0 0 0 0 0 0 0 0 0 0 0 0 0 0 0 0
$$ 0 0 0 0 0 0 0 0 0 0 0 0 0 0 0 0 0 0 0 0 0 0 0 0 0 0 0 0
$$ ##$ShimPowRng2= (0..63)
$$ 1 1 1 1 1 1 1 1 1 1 1 1 1 1 1 1 1 1 1 1 0 0 0 0 0 0 0 0 0 0 0 0 0 0 0 0
$$ 0 0 0 0 0 0 0 0 0 0 0 0 0 0 0 0 0 0 0 0 0 0 0 0 0 0 0 0
$$ ##$ShimPowRng3= (0..63)
$$ 1 1 1 1 1 1 1 1 1 1 1 1 1 1 1 1 1 1 1 1 0 0 0 0 0 0 0 0 0 0 0 0 0 0 0 0
$$ 0 0 0 0 0 0 0 0 0 0 0 0 0 0 0 0 0 0 0 0 0 0 0 0 0 0 0 0
$$ ##$ShimSysFunc= (0..63)
$$ 1 2 3 4 5 7 9 11 15 16 8 10 12 14 6 17 13 18 19 20 0 0 0 0 0 0 0 0 0 0
$$ 0 0 0 0 0 0 0 0 0 0 0 0 0 0 0 0 0 0 0 0 0 0 0 0 0 0 0 0 0 0 0 0 0 0
$$ ##$ShimSysMatrix= 0
$$ ##$ShimSysType= 1
$$ ##$TFXNUM= 0
$$ ##$TRIPLO2= 0
$$ ##$VTU= 2
$$ ##$VTUETH= <149.236.99.20>
$$ ##$VTUTY= <no>
$$ ##$WBREFAM= (0..15)
$$ 135 116 100 100 100 100 100 100 100 100 100 100 100 100 100 100
$$ ##$WBREFLM= (0..15)
$$ 0 0 0 0 0 0 0 0 0 0 0 0 0 0 0 0
$$ ##$WBREFPH= (0..15)
$$ 71.66 -68.25 0 0 0 0 0 0 0 0 0 0 0 0 0 0
$$ ##$WBSGU= (0..15)
$$ 0 0 0 0 0 0 0 0 0 0 0 0 0 0 0 0
$$ ##$XFAC= 2
$$ ##END=
$$ 
##$DECIM=	3328
##$DSPFVS=	20
##.ACQUISITIONSCHEME=	NOT PHASESENSITIVE
##NTUPLES=	nD NMR SPECTRUM
##VAR_NAME=	FREQUENCY1,	FREQUENCY2,	SPECTRUM
##SYMBOL=	F1,	F2,	Y
##.NUCLEUS=	13C,	1H
##.OBSERVE FREQUENCY=	100.69525530880000019,	400.41280287000000726
##VAR_TYPE=	INDEPENDENT,	INDEPENDENT,	DEPENDENT
##VAR_FORM=	AFFN,	AFFN,	ASDF
##VAR_DIM=	512,	512,	262144
##UNITS=	HZ,	HZ,	ARBITRARY UNITS
##FIRST=	25169.313707327481097,	5807.6787752999953227,	0.35536816716194152832
##LAST=	-957.56783717514929322,	-190.19907926730809322,	0.32940980792045593262
##MIN=	-957.56783717514929322,	-190.19907926730809322,	0.00050189229659736156464
##MAX=	25169.313707327481097,	5807.6787752999953227,	48.94541168212890625
##FACTOR=	1,	1,	0.0029905634662072849185
##PAGE=	F1=25169.3
##FIRST=	25169.313707327481097,	5807.6787752999953227,	0.35536816716194152832
##DATA TABLE=	(F2++(Y..Y)), PROFILE
$$ [...]
##PAGE=	F1=2979.36
##FIRST=	25169.313707327481097,	5807.6787752999953227,	0.15535968542098999023
##DATA TABLE=	(F2++(Y..Y)), PROFILE
1300 115 144 125 236 158 35 34 146 92 36 82 114 38 102 179 202 121 143 176 237 136 144 112 98 225 189 65 89 191 304 141 67
937 67 94 36 31 163 147 106 75 182 140 44 205 174 121 120 164 69 178 185 74 66 92 79 150 63 98 136 35 99 66 145 73 70 50 139 137 193
514 193 175 277 151 143 70 151 205 237 228 58 198 53 200 158 96 185 121 230 302 128 171 164 389 142 75 76 58 62 98 294 259 217
138 217 255 91 113 114 168 115 96 113 19 194 19 172 171 46 240 134 95 85 184 250 181 16 91 48 46 68 99 65
-190F5
##PAGE=	F1=2877.1
##FIRST=	25169.313707327481097,	5807.6787752999953227,	0.33972966670989990234
##DATA TABLE=	(F2++(Y..Y)), PROFILE
5808 75 51 51 47 51 59 228 260 117 103 253 174 175 143 222 127 101 47 106 164 47 101 357 232 216 59 71 116 122 31 249 96 119 47 49
5409 49 82 124 168 50 158 162 178 198 39 131 217 168 101 119 74 171 101 32 109 110 169 255 117 95 37 52 35 155 242 44 149 225 122
5021 122 121 103 48 239 311 193 118 184 132 101 23 75 105 92 65 25 178 282 245 101 60 54 101 143 171 53 163 174 106 193 36 97
4646 97 109 112 62 94 68 58 98 39 31 50 107 62 101 33 110 171 159 195 144 54 91 122 245 328 130 139 94 85 48 220 175 91 109 102 140 84
4223 84 151 133 72 27 159 118 266 172 154 263 120 159 97 70 140 46 110 123 197 83 173 186 102 40 137 170 134 63 210 220 103 103
3848 103 150 133 243 50 113 70 132 53 128 116 151 63 55 89 212 23 216 116 176 152 153 255 110 120 84 129 162 37 14 69 218
3484 218 57 122 136 162 201 88 132 251 31 79 146 53 81 299 104 207 345 164 344 369 924 3844 3833 527 214 244 57
3167 57 347 915 1075 719 350 173 71 314 401 617 2913 3887 3548 6088 4621 1060 401 540 225 27 246 380 131
2897 131 207 304 89 80 25 117 202 140 142 246 86 179 47 166 116 213 170 95 88 176 143 115 218 230 107 207 90 32 219 105 79
2533 79 288 27 244 215 163 86 20 294 160 13 112 93 205 86 106 180 264 261 144 52 93 160 166 70 179 229 93 61 59 118 99
2169 99 98 191 196 74 149 60 65 110 155 243 140 187 123 176 145 62 38 259 289 127 179 197 42 108 75 104 122 56 115 156 200 177 270 181
1770 181 82 83 118 21 195 132 109 106 44 39 85 88 61 45 130 179 84 198 201 165 205 124 140 125 136 120 70 196 46 59 116 102 56 56 72 103
1347 103 139 4 31 51 104 185 232 183 87 40 139 84 41 85 120 14 86 196 163 124 106 154 206 108 199 177 119 231 191 34 78 195
972 195 254 108 30 69 89 31 115 158 119 76 184 135 67 179 179 154 111 122 57 190 232 112 48 94 37 101 48 73 71 10 66 111 177 69
573 69 54 75 174 115 155 169 235 120 89 71 171 211 222 255 54 191 93 217 144 82 169 130 265 289 162 170 171 392 128 85 102 54
197 54 123 126 364 293 226 239 102 104 100 169 92 101 84 78 215 42 174 198 33 195 108 119 128 181 290 193 24 93 49 50 77 128 102
-190A02
##PAGE=	F1=2774.84
##FIRST=	25169.313707327481097,	5807.6787752999953227,	0.43501552939414978027
##DATA TABLE=	(F2++(Y..Y)), PROFILE
5808 97 72 45 51 70 82 190 278 154 56 219 175 259 188 268 127 72 50 97 150 32 78 357 220 187 45 102 129 130 15 200 63
5444 63 155 77 79 68 123 184 69 213 173 213 241 41 118 216 185 117 122 102 117 27 75 38 109 184 277 135 99 91 33 121 183 294 69 176
5045 176 181 92 122 79 1 230 290 176 147 222 172 129 19 50 100 60 98 23 140 280 291 126 82 41 141 152 198 76 213 201 126
4681 126 201 51 70 92 124 39 68 59 68 103 54 48 84 112 83 135 27 89 144 192 247 128 60 97 128 283 333 98 108 90 79 65 203
4294 203 195 76 90 149 173 85 58 87 96 34 110 90 233 172 229 300 95 125 93 76 118 48 54 121 172 53 191 151 89 83 100 195 134 58
3894 58 195 196 125 72 157 141 310 49 148 50 132 23 125 167 147 103 111 143 224 21 228 121 222 151 163 279 53 116 104 129 235
3531 235 29 47 51 214 25 159 136 158 154 53 37 255 57 84 156 64 104 288 169 276 422 193 328 518 1049 4362 4318
3214 4318 624 302 331 92 476 1356 1709 998 324 240 140 357 504 742 3371 4108 5343 9263 6778 1541 575 688
2955 688 295 51 291 353 95 256 352 23 106 70 110 218 219 122 269 109 186 49 167 86 219 120 92 93 158 98 128 194 257 116
2603 116 208 108 13 204 20 122 295 71 220 189 213 56 32 237 113 43 100 124 247 71 101 153 279 265 167 26 83 124
2275 124 143 95 174 228 70 63 59 140 123 75 184 148 88 134 94 80 111 153 281 126 199 93 205 196 95 74 234 277 71 201 239
1911 239 22 162 52 74 121 30 122 170 213 164 242 167 70 39 133 71 226 100 133 107 23 100 112 97 52 53 121 190 90 227 232 206
1535 206 240 137 147 123 111 128 61 207 93 64 102 45 11 101 70 97 110 46 83 79 63 237 222 204 129 60 141 95 37 102 131 15 87
1148 87 208 137 120 64 136 160 63 233 222 142 230 181 22 47 193 191 65 16 138 161 29 67 163 120 100 177 127 75 135 173 187 127
772 127 82 64 187 277 155 59 129 97 81 67 57 22 37 32 155 189 47 27 102 200 90 110 190 216 176 45 76 188 210 195 250 64
397 64 166 134 211 113 57 134 126 283 265 198 174 185 384 116 75 127 113 179 142 399 311 221 204 129 95 102 166 81 111 64 118 220 54
9 54 163 210 44 139 92 131 169 142 298 196 41 123 51 54 89 146 139
-190A39
##PAGE=	F1=2672.59
##FIRST=	25169.313707327481097,	5807.6787752999953227,	0.5375614166259765625
##DATA TABLE=	(F2++(Y..Y)), PROFILE
5808 109 84 49 38 87 124 146 271 176 13 179 179 313 221 297 121 32 60 86 126 54 68 330 197 154 47 121 130 124 10 145 69
5444 69 171 92 109 64 120 189 97 258 171 232 252 90 134 195 206 132 106 106 84 133 147 53 123 181 276 135 102 139 60 179 200 341 114
5056 114 188 126 53 120 37 68 233 246 144 148 217 190 139 31 26 109 53 115 27 102 268 312 152 126 24 177 152 217 98 231 191
4693 191 171 214 74 52 82 119 42 56 71 74 103 58 59 107 113 103 159 22 51 107 211 310 126 121 105 127 285 323 83 69 80 80 83 168 209
4282 209 73 66 188 204 86 59 35 109 67 61 94 193 192 287 296 65 93 92 70 99 40 18 121 135 50 207 101 86 150 82 221 131 55
3894 55 165 169 149 34 146 144 344 35 173 21 118 20 114 187 119 141 200 188 211 44 220 116 240 133 160 278 19 134 97
3554 97 121 289 41 74 104 210 80 198 140 166 90 148 64 237 98 95 170 65 122 241 236 310 451 208 281 612 1052 4391 4333
3214 4333 660 359 403 144 584 1723 2253 1211 303 294 198 360 550 805 3448 3819 6860 11906 8506 1916 715
2967 715 760 366 87 304 306 66 295 390 38 136 135 108 217 270 108 284 131 150 89 158 55 217 62 91 83 140 76 142 152 260
2615 260 152 236 151 48 167 68 136 277 117 184 160 245 24 79 161 76 84 82 136 276 50 86 108 282 273 196 20 105 93 131 113
2251 113 152 235 44 70 57 156 127 65 149 87 109 117 136 93 99 155 301 101 202 57 221 222 125 99 200 276 38 213 256 89 216
1887 216 47 35 114 34 126 161 198 137 205 141 48 51 156 102 254 94 169 112 17 138 126 99 46 68 123 194 100 249 272 241 268 150
1512 150 156 142 84 148 81 215 126 72 64 14 78 192 84 96 82 77 118 143 34 264 217 226 160 76 153 119 41 124 147 1 108 210 119
1124 119 113 49 120 118 16 238 239 151 213 161 25 26 188 129 20 61 244 229 23 48 162 110 113 165 123 63 82 150 205 164 54 113 168
737 168 299 199 135 190 174 97 100 73 54 65 38 184 181 44 7 121 211 61 69 230 232 243 16 84 203 204 160 223 80 128 172 188 70
350 70 21 85 114 281 231 223 178 193 361 110 49 152 183 223 145 393 302 203 160 154 99 111 151 85 126 53 130 205 51 146 200 62 88
-38 88 88 145 198 102 281 193 63 166 71 57 100 151 171
-190A71
##PAGE=	F1=2570.33
##FIRST=	25169.313707327481097,	5807.6787752999953227,	0.65949064493179321289
##DATA TABLE=	(F2++(Y..Y)), PROFILE
5808 108 87 64 35 118 161 104 249 185 42 137 183 324 230 297 108 33 95 83 103 73 82 286 163 122 57 129 120 104 26 97 97 166 90
5420 90 133 65 110 182 125 286 159 227 233 142 175 158 226 136 74 76 116 260 220 104 122 163 250 117 101 166 71 200 202 374 155 189 99
5033 99 28 118 21 137 256 187 117 116 177 184 134 52 8 136 60 115 51 74 254 302 155 158 10 208 144 231 115 216 148 219 222 105
4657 105 48 87 91 36 48 92 76 99 65 68 120 106 120 166 27 26 64 207 371 144 174 119 119 245 289 94 67 70 98 99 114 213 78 33
4258 33 212 229 82 134 15 110 102 16 118 156 222 314 251 28 68 94 53 83 12 6 121 108 84 218 48 100 207 88 236 130
3906 130 63 135 148 164 11 117 128 327 50 180 50 90 70 98 176 79 160 281 219 183 74 199 108 226 108 153 247 96 171
3566 171 65 116 313 62 88 154 204 119 219 143 170 59 234 150 208 139 120 176 55 129 182 276 306 424 207 221 633 932 3921
3225 3921 3876 623 373 444 197 644 1929 2572 1308 288 310 231 323 527 793 3127 3091 7747 13414 9408 2104 791
2967 791 746 420 127 275 262 67 319 409 83 164 171 124 195 282 94 284 161 82 152 144 25 200 27 90 68 133 99 155 97 242
2615 242 188 276 206 73 119 122 125 230 152 140 126 248 30 124 90 79 111 62 126 279 26 56 64 274 277 223 35 133 73 141 120 123 252
2228 252 38 81 50 166 131 80 94 48 121 100 168 90 78 178 305 73 200 25 225 217 140 108 162 281 68 200 249 151 256
1887 256 79 14 102 56 128 129 158 118 164 103 27 114 186 103 268 102 198 121 47 145 124 95 54 79 125 191 111 257 306 263 282 159 150
1500 150 166 66 169 139 231 136 81 34 71 140 276 102 100 64 94 130 181 30 260 211 249 177 89 172 145 59 144 174 42 144 199
1136 199 95 104 62 99 108 53 212 224 143 178 137 31 68 183 79 22 104 335 276 23 73 154 92 102 161 122 36 55 106 200 208 49
761 49 169 141 292 238 223 251 240 118 130 108 90 96 61 194 161 97 44 132 201 31 65 273 262 283 12 93 214 194 123 183 95 89 205
373 205 160 25 21 42 100 260 190 232 173 186 321 111 18 167 233 255 143 349 263 173 119 164 120 116 119 108 140 48 115 171 32 127 164
-14 164 70 69 109 169 207 133 255 186 87 204 96 59 109 143 194
-190A94
##PAGE=	F1=2468.07
##FIRST=	25169.313707327481097,	5807.6787752999953227,	0.64801609516143798828
##DATA TABLE=	(F2++(Y..Y)), PROFILE
5808 100 88 81 70 164 188 79 230 187 87 108 180 291 211 267 89 77 143 93 94 73 107 238 118 96 73 134 108 74 43 60 115 146
5432 146 84 152 65 98 168 146 289 139 199 192 190 218 114 241 129 50 19 189 365 270 130 103 149 202 85 95 165 56 184 189 383
5068 383 181 178 113 49 114 70 192 289 124 130 58 126 158 119 72 26 171 64 106 92 62 240 262 130 171 26 229 133 240 123
4716 123 176 86 259 218 139 65 108 42 34 52 119 81 89 92 80 125 95 127 153 38 67 23 180 410 173 207 135 107 167 232 107 100 67 126
4317 126 114 45 203 91 23 219 245 67 180 54 101 140 45 135 144 248 301 181 18 53 97 27 69 44 26 113 112 115 219 50 124
3953 124 240 105 238 136 83 117 141 169 45 75 86 257 103 169 104 55 117 90 147 66 147 329 227 156 117 178 95 186 93 147
3601 147 190 169 210 20 121 302 68 88 187 194 132 218 140 161 109 284 207 177 171 150 165 38 131 154 279 266 351 195 177 584 720
3237 720 3065 3057 520 344 443 241 644 1919 2581 1263 266 284 229 252 440 712 2487 2109 7797 13437 9274 2062
2979 2062 789 658 450 156 209 250 85 325 403 105 182 166 151 151 256 79 266 198 44 214 131 6 169 58 91 71 142
2662 142 130 169 41 216 207 309 262 88 72 146 106 164 169 93 87 218 68 153 71 110 119 45 95 253 5 14 86 258 267 240 43 146
2286 146 63 160 113 99 269 56 92 36 169 166 116 30 83 112 81 178 72 65 212 290 52 197 41 229 195 136 106 135 277 105
1934 105 160 225 191 269 114 64 81 67 130 79 114 135 126 57 54 169 220 75 265 107 207 132 85 124 109 89 79 88 113 181 120 240 314
1547 314 271 276 159 125 176 67 185 200 250 122 99 85 117 170 328 115 107 66 99 122 188 43 229 199 265 178 107 188 160 77 157 208
1171 208 97 179 174 57 94 76 70 129 95 158 179 121 128 114 50 121 178 50 50 139 388 291 26 91 140 70 69 173 125 40 94 44 169 246
772 246 64 211 117 261 260 294 296 287 130 149 142 111 127 68 187 152 161 83 133 170 26 96 307 282 288 22 100 217 180 89 140 107 67 233
373 233 141 15 67 72 88 220 142 221 153 161 265 115 42 164 246 281 154 279 201 133 82 149 140 112 76 148 154 48 82 125 13 110 107
-14 107 65 96 150 192 196 203 239 179 112 226 109 60 113 127 208
-190B08
##PAGE=	F1=2365.81
##FIRST=	25169.313707327481097,	5807.6787752999953227,	0.40103650093078613281
##DATA TABLE=	(F2++(Y..Y)), PROFILE
5808 106 91 90 111 214 204 92 223 187 130 111 170 224 167 220 71 113 190 114 102 55 131 200 66 72 95 145 110 38 59 25 113 124 98
5420 98 166 60 93 155 156 269 114 154 141 221 249 72 246 110 77 67 268 424 278 127 83 155 143 48 81 139 46 142 162 364
5068 364 187 158 131 82 105 110 222 315 71 180 20 117 119 104 84 40 201 73 99 135 61 226 200 84 170 48 238 121 242
4728 242 121 122 49 284 202 169 98 131 27 75 84 149 99 74 127 89 122 87 122 123 53 120 45 154 408 197 214 141 105 70 165 109 124
4340 124 67 155 134 58 183 115 74 209 254 50 188 78 90 180 114 133 165 259 250 112 57 52 99 6 67 106 86 89 131 125 211 109 147
3953 147 245 120 228 149 108 125 139 173 81 34 26 150 160 143 152 25 154 105 127 111 100 326 213 141 162 163 76 131 98 144 118 224
3578 224 237 25 132 262 50 87 204 182 118 198 127 139 165 293 225 144 192 170 132 24 139 175 247 203 249 181 183 486 467 2022
3225 2022 2066 380 278 400 270 585 1694 2270 1081 222 222 194 161 314 584 1682 1125 7003 11992 8141 1803 714
2967 714 521 452 166 145 273 97 316 369 104 188 124 169 96 200 69 232 232 114 260 127 21 136 88 98 97 167 147 188 31
2627 31 195 202 322 309 101 43 143 103 91 165 52 56 157 109 160 105 136 108 40 53 203 28 52 154 233 238 241 39 139 63 173
2263 173 93 89 273 75 94 32 161 231 158 30 119 78 61 159 48 67 238 259 41 197 77 241 182 118 107 145 249 129 101
1923 101 190 202 247 133 110 56 74 137 22 126 175 96 25 101 202 253 30 246 106 187 141 125 92 96 88 111 105 92 166 124 194 289 263
1535 263 247 146 82 160 81 188 241 261 85 128 153 151 159 336 119 113 90 98 106 179 60 188 179 267 161 133 192 156 83 155 235 152 201 138
1136 138 11 87 85 32 148 117 85 114 95 78 92 84 167 168 53 57 161 391 277 30 84 115 49 24 194 131 92 142 35 117 270 81
761 81 228 101 216 259 334 317 310 137 158 169 119 150 58 170 168 215 119 124 122 46 124 323 288 268 29 107 213 158 61 98 117 67 254
373 254 142 43 106 124 78 162 88 194 118 124 198 123 95 139 220 305 186 195 131 86 43 112 146 101 48 188 171 49 54 75 50 99 54 50 140
-38 140 192 204 168 254 235 171 134 232 104 64 108 109 214
-190B14
##PAGE=	F1=2263.55
##FIRST=	25169.313707327481097,	5807.6787752999953227,	0.10747279226779937744
##DATA TABLE=	(F2++(Y..Y)), PROFILE
5808 136 99 86 136 254 211 128 223 183 166 135 152 140 108 177 71 131 221 141 118 28 148 178 20 52 119 165 132 5 72 27 90 107
5432 107 136 181 52 105 149 154 228 92 111 87 226 258 39 238 82 120 147 333 425 236 100 77 172 92 11 67 110 95 90 128 315
5068 315 170 134 141 118 91 131 222 323 57 236 102 158 78 104 83 41 214 92 104 165 63 205 127 47 157 68 234 106 233
4728 233 113 70 77 291 179 187 130 146 89 130 124 176 130 55 155 92 110 85 106 87 81 172 94 175 356 207 192 129 123 49 121 98 126 64
4329 64 172 163 154 160 142 124 190 260 59 160 83 88 220 188 114 200 246 173 82 85 62 95 24 86 166 159 56 137 107 197 173 164 225 134 218 168
3906 168 132 164 133 195 115 39 62 54 207 106 182 25 177 130 133 163 26 271 175 134 191 156 61 76 107 133 48 250 241 54 142 205
3531 205 18 96 203 174 81 166 107 111 202 263 205 110 198 169 82 45 157 201 195 138 140 171 222 374 234 1015 1110 238 189 326 276 483
3155 483 1313 1719 804 158 138 136 77 190 438 889 469 5555 9441 6280 1390 587 368 424 157 164 302 94 291 314 82
2862 82 180 76 162 54 131 75 198 255 176 284 133 38 121 106 115 127 199 153 213 74 175 173 309 335 116 45 124 117 35 141 21
2498 21 57 75 144 148 129 142 80 42 27 138 55 115 219 201 194 225 31 115 65 169 68 89 253 85 82 54 140 299 198 68 124 34
2122 34 45 112 26 79 242 214 37 200 105 262 198 95 130 191 195 140 44 150 191 192 128 141 43 94 149 37 197 210 79 65 146 206
1746 206 275 41 215 100 139 146 164 80 102 95 137 131 78 145 122 123 232 243 196 116 29 114 92 177 253 255 36 161 210 172 116 296 114
1359 114 119 125 101 103 176 79 159 158 249 127 166 182 136 76 136 244 191 201 97 35 87 99 12 148 115 24 41 79 56 72 122 200 147 81 44
948 44 167 351 241 51 53 81 41 34 209 138 148 173 102 66 273 86 220 92 170 230 336 315 310 142 162 182 117 156 55 151 203
584 203 251 149 104 61 59 133 316 286 241 36 114 200 126 38 67 128 73 262 161 58 133 161 64 90 36 156 71 91 131 135 154 100 160
197 160 326 226 113 100 44 22 68 131 92 68 215 189 52 66 43 93 99 76 47 185 224 202 129 266 227 162 152 221 84 72 93 102
-178 102 214
-190B14
##PAGE=	F1=2161.3
##FIRST=	25169.313707327481097,	5807.6787752999953227,	0.25943961739540100098
##DATA TABLE=	(F2++(Y..Y)), PROFILE
5808 176 107 69 138 276 209 168 217 169 192 154 132 62 50 152 91 128 230 169 133 23 155 167 43 31 137 187 165 28 77 70 54
5444 54 91 178 201 40 130 152 137 177 84 97 35 201 243 30 214 49 146 215 365 365 150 60 75 179 80 20 56 108 157 61 101 242
5068 242 130 113 155 163 72 128 197 306 87 279 174 196 48 120 67 27 199 113 121 173 69 175 59 78 135 91 221 85 212
4728 212 104 32 104 279 162 183 148 148 142 177 153 193 164 35 167 87 88 87 83 63 125 222 138 245 262 197 146 98 155 125 132 78 110 57 175
4317 175 194 244 151 153 159 181 268 89 115 78 101 252 246 88 226 209 106 99 94 77 83 32 121 213 226 60 123 65 187 230 172 188 150 215
3918 215 187 150 220 116 232 145 71 132 114 234 66 185 38 186 146 151 200 64 181 121 119 192 149 69 44 105 108 23 243 218 59
3554 59 151 152 50 111 188 173 36 135 86 85 216 210 156 78 185 145 31 80 169 199 149 97 50 166 262 290 122 228 357 129 101 238
3178 238 252 365 873 1071 495 99 45 80 68 128 303 258 498 3783 6377 4105 914 440 225 361 139 241 309 78
2897 78 256 253 51 156 112 129 51 84 88 182 263 205 281 143 54 128 124 140 146 227 155 238 108 145 128 266 332 133 60 106 127 47 101 11
2498 11 81 39 167 124 126 125 42 46 50 71 77 170 265 166 145 197 49 89 62 146 63 91 207 87 56 84 108 343 225 85 96 63 59 71 16
2087 16 99 226 162 46 203 118 284 225 77 173 248 125 144 57 109 177 123 109 150 52 125 159 83 272 223 80 121 180 183 279 84
1723 84 176 101 79 149 192 103 129 107 149 155 88 119 115 39 152 217 128 72 33 45 94 151 232 233 28 185 247 186 79 221 101 128 162 109
1324 109 118 193 96 159 142 216 83 197 159 113 57 103 226 207 181 64 65 95 124 52 130 91 79 42 83 68 65 159 212 112 117 30 158 286
925 286 200 95 18 44 54 76 205 142 194 181 156 58 255 68 194 79 132 182 306 293 286 148 173 181 108 139 84 136 238 267 170 77
549 77 3 63 120 281 283 227 52 119 181 86 17 74 147 73 255 186 64 140 171 46 10 51 114 16 88 73 156 215 56 84 339 255 57
162 57 147 58 76 70 103 91 93 220 201 58 92 66 128 112 125 73 227 239 193 88 235 199 154 164 199 56 84 75 114 213
-190B13
##PAGE=	F1=2059.04
##FIRST=	25169.313707327481097,	5807.6787752999953227,	0.28631079196929931641
##DATA TABLE=	(F2++(Y..Y)), PROFILE
5808 206 110 56 123 279 204 203 197 144 205 155 123 41 29 141 120 107 217 193 140 38 146 157 83 10 144 206 196 44 72 102 34 74
5432 74 207 223 28 158 162 108 126 96 116 27 150 209 38 172 16 149 258 355 257 48 21 59 163 99 46 48 132 201 69 99
5080 99 158 77 102 184 212 52 101 159 261 124 301 221 204 47 140 39 20 153 123 140 156 84 135 35 124 101 124 202 57 181
4728 181 91 17 104 250 160 154 142 138 177 204 163 195 190 18 160 78 59 87 62 58 178 261 171 323 149 169 93 73 187 178 169 54 89 54
4329 54 161 217 308 168 136 172 197 281 114 97 82 120 265 267 65 233 155 115 122 85 89 61 24 154 238 268 107 106 10 186 271 174 147
3941 147 167 220 194 156 274 92 267 167 94 184 191 236 29 158 42 186 143 158 212 139 86 62 89 157 138 89 52 88 69 58 207
3578 207 169 51 161 123 97 119 160 180 46 112 69 73 209 159 88 56 151 100 43 111 159 160 125 92 47 163 284 260 175 269 122 77
3202 77 85 156 194 259 479 489 228 100 45 69 111 146 199 149 573 2054 3431 2048 479 303 117 267 134 297 280 50 214
2885 214 206 34 123 186 77 53 105 87 194 256 199 256 151 69 134 153 166 149 241 154 258 126 99 75 197 302 146 79 105 123 69
2521 69 62 39 109 130 177 101 95 86 12 52 70 33 88 208 284 133 106 168 83 85 45 112 90 95 143 83 22 106 69 351 229 86 57 126 99
2110 99 117 33 131 198 122 70 201 113 301 237 71 222 297 58 151 99 74 186 106 105 138 61 150 159 112 323 214 108 177 197 143 262
1735 262 107 136 119 62 154 200 132 159 120 145 166 104 89 103 54 76 189 57 41 79 37 90 119 184 203 74 194 258 196 105 132 85
1359 85 146 192 128 146 218 108 176 125 172 50 218 127 100 29 71 180 197 152 52 74 103 153 84 103 56 136 99 94 83 88 192 200 65
972 65 155 57 142 219 168 149 53 43 80 104 178 140 223 166 188 88 219 26 158 60 111 126 258 254 243 150 190 164 96 102 126 131 260 268 184
561 184 57 64 65 95 219 280 240 79 122 160 46 7 114 179 76 232 207 68 126 154 30 78 112 76 37 114 31 187 269 22 11
197 11 338 261 73 212 104 136 118 69 96 101 204 198 66 105 107 150 134 148 109 259 240 185 56 175 151 145 169 171 32 94 63 135 211
-190B11
##PAGE=	F1=1956.78
##FIRST=	25169.313707327481097,	5807.6787752999953227,	0.1394253075122833252
##DATA TABLE=	(F2++(Y..Y)), PROFILE
5808 214 104 68 120 265 195 226 167 109 207 142 137 78 51 132 149 74 187 207 135 36 119 137 111 29 138 217 214 43 54 111 73 74 217
5420 217 238 21 178 172 71 86 116 139 65 88 166 39 116 34 127 272 303 126 89 21 40 124 115 67 38 151 210 83 122 88 39 99
5045 99 224 256 30 59 118 196 152 298 230 173 60 147 7 55 93 116 158 120 109 90 74 155 50 171 183 26 141 71 21 80 211
4681 211 171 104 111 120 191 210 155 184 200 7 140 69 33 80 55 57 230 283 188 377 89 131 91 101 207 207 202 32 69 64 133 223 329 202
4282 202 96 164 233 294 123 129 108 136 253 242 46 219 100 164 133 62 90 36 33 174 236 274 155 117 43 190 288 177 113 183 223
3918 223 181 148 310 79 282 177 107 207 228 216 8 103 44 183 122 152 201 184 63 12 48 91 121 98 66 58 31 79 153 103 67
3554 67 173 123 128 110 124 187 99 96 58 78 187 145 16 52 99 45 76 132 123 92 112 97 93 157 287 267 214 447 304 85 151 98 105 189
3155 189 197 97 59 129 117 95 128 161 135 305 432 685 1087 433 216 198 94 160 158 301 216 22 169 189 50 89 239 51 31
2815 31 149 62 217 237 168 216 153 80 123 189 181 135 229 149 266 127 47 22 116 249 154 97 120 106 72 67 74 136 220 176 95 53 49 43 59
2404 59 71 61 83 221 274 112 91 145 114 108 17 77 121 98 78 77 36 114 39 317 206 86 74 181 143 204 75 167 169 120 99 190 91
2016 91 306 223 91 267 322 19 164 124 62 211 168 144 115 55 155 144 121 338 190 156 221 193 98 227 104 108 154 113 162 184
1664 184 145 179 132 130 157 103 57 87 121 93 164 41 90 108 118 94 87 121 174 109 187 243 202 153 80 77 174 212 159 184 233 120 192 96 131
1254 131 68 220 91 93 4 75 115 170 132 52 61 103 177 97 80 38 175 138 97 101 133 219 165 30 185 93 126 171 155 203 87 81 106 115
854 115 131 129 233 138 199 110 176 44 127 36 108 74 212 204 185 142 205 134 83 61 162 136 264 262 193 62 111 69 90 138 270 275 122
467 122 118 141 43 35 161 222 96 194 216 72 95 113 33 154 167 49 81 141 7 222 309 31 46 319 238 121 257 145 186 166
115 166 41 103 96 180 177 75 100 145 159 155 133 137 275 228 180 48 103 92 138 171 142 19 99 54 152 207
-190B07
##PAGE=	F1=1854.52
##FIRST=	25169.313707327481097,	5807.6787752999953227,	0.26921668648719787598
##DATA TABLE=	(F2++(Y..Y)), PROFILE
5808 196 90 100 162 245 184 233 135 69 202 121 174 114 59 124 175 38 151 204 117 33 73 107 123 63 120 218 213 39 44 89 129 105 209
5420 209 238 21 184 178 46 64 132 151 90 38 122 28 51 74 88 258 220 39 179 41 62 66 117 83 44 154 180 84 146 85 68 105
5045 105 263 283 11 27 81 140 166 273 199 110 66 133 30 93 82 95 173 81 134 63 111 176 22 230 169 17 97 37 32 44 170
4681 170 187 64 61 103 186 202 141 168 192 4 119 62 36 61 66 54 272 280 190 393 143 94 152 157 212 221 231 52 45 84 94 207 303 236
4282 236 84 138 270 303 116 167 139 143 217 176 24 187 66 188 134 37 76 46 80 178 208 246 189 151 78 189 280 187 100 194 214
3918 214 141 130 317 91 267 173 119 200 225 182 32 38 58 181 92 142 173 186 105 34 39 5 103 88 69 30 46 85 99 40 113 183 135
3531 135 135 92 89 186 145 79 61 94 156 166 52 61 40 28 86 138 91 10 91 96 127 150 269 275 207 408 288 127 217 77 5 162 15
3143 15 120 36 134 164 119 110 141 103 300 193 330 438 594 249 133 136 90 194 255 129 37 129 194 70 66 252 93 19 183 16
2791 16 232 205 130 173 152 83 97 216 181 107 191 141 264 111 48 22 73 185 156 108 144 88 64 107 102 165 290 170 116 55 78 76 61
2404 61 55 90 62 208 237 108 100 129 130 136 34 64 141 96 46 80 79 109 39 252 162 93 127 217 179 286 131 194 150 154 124 167 56 297
2005 297 190 129 304 319 19 187 131 78 231 232 199 99 35 133 114 110 317 161 207 248 167 64 185 81 110 194 164 171 147 137 179
1641 179 142 121 130 80 25 69 161 171 144 88 156 114 185 119 64 66 152 127 169 207 199 182 122 84 203 219 199 234 234 139 199 59 104 104 198 59
1218 59 76 44 111 41 138 131 42 37 90 185 91 69 68 197 156 90 144 183 241 117 66 202 112 120 146 162 248 96 117 124 111 72 111 227 107
807 107 196 118 133 118 115 20 115 32 188 156 120 121 203 94 73 69 184 150 254 259 197 80 137 75 125 75 251 318 176 104 125 81 71 198
408 198 267 133 149 215 76 53 60 48 209 200 39 108 156 20 254 327 63 78 279 193 168 273 172 215 196 40 113 110 175 139 87
45 87 81 175 162 167 85 151 268 203 174 54 38 35 136 171 121 18 104 41 161 199
-190A99
##PAGE=	F1=1752.27
##FIRST=	25169.313707327481097,	5807.6787752999953227,	0.40063723921775817871
##DATA TABLE=	(F2++(Y..Y)), PROFILE
5808 157 71 133 231 232 169 221 111 37 191 98 223 156 52 120 193 24 123 183 93 76 15 77 121 90 91 204 191 64 82 41 186 141
5432 141 189 218 19 174 181 71 53 136 150 98 40 82 20 30 116 41 225 126 123 238 59 105 9 111 97 80 149 122 71 155 130 102
5056 102 120 289 282 8 60 44 140 160 231 141 58 62 99 57 116 134 73 186 79 154 87 140 201 108 290 163 38 59 19 41 27 134
4681 134 201 90 14 90 168 188 140 158 167 8 104 54 56 29 85 61 295 254 178 371 197 71 212 201 199 229 256 104 8 113 47 171
4305 171 235 256 143 106 295 304 96 185 160 139 166 89 18 147 57 171 127 31 46 79 132 165 159 192 205 177 86 174 250 207 113 197 186
3918 186 78 113 294 115 224 155 131 172 190 142 50 72 83 180 71 146 145 148 123 65 83 88 97 65 63 41 87 81 56 55 158 183 145 118 82
3507 82 63 168 174 57 87 113 123 186 106 77 53 63 70 132 125 70 55 99 154 142 234 270 174 269 181 180 263 87 115 156 129 248 81 109 178
3096 178 136 70 91 89 241 171 680 1192 1063 307 100 166 109 218 183 44 70 103 206 84 60 228 138 75 202 39 230 165
2768 165 110 137 149 74 73 223 164 68 133 141 258 89 93 56 126 121 155 109 171 90 60 141 114 191 335 170 159 110 138 100 54 30 102 32
2369 32 179 186 109 122 115 125 152 77 80 146 83 68 97 119 100 60 171 124 99 163 235 199 341 186 200 146 188 135 131 22 273 152 166 331
1970 331 291 15 215 129 95 227 267 240 105 33 89 73 82 268 141 246 250 125 52 144 48 139 227 198 175 106 108 158 148 133 90 43
1594 43 7 53 170 236 130 117 213 101 227 160 55 74 139 130 150 161 183 183 184 105 222 214 238 284 224 160 197 65 101 128 152 44 51 85
1195 85 151 32 114 143 25 31 67 169 86 77 103 210 159 78 208 230 259 82 112 202 102 122 135 181 277 79 140 129 97 16 93 205
819 205 83 187 116 98 183 126 43 127 7 194 131 59 87 181 49 68 113 193 165 238 264 193 88 135 79 169 112 223 358 234 81
455 81 108 120 112 215 305 170 111 209 76 11 27 57 231 203 43 115 157 53 275 322 102 84 222 143 210 257 182 219 207 61 128
92 128 162 202 98 109 67 196 168 163 46 150 238 162 161 62 8 7 143 171 114 31 115 16 158 185
-190A85
##PAGE=	F1=1650.01
##FIRST=	25169.313707327481097,	5807.6787752999953227,	0.25090476870536804199
##DATA TABLE=	(F2++(Y..Y)), PROFILE
5808 111 58 159 294 231 147 193 94 40 176 80 271 206 54 114 200 45 113 143 85 141 60 80 107 103 54 175 149 107 139 41 240
5444 240 157 169 180 7 156 190 121 41 129 145 92 55 48 41 92 155 10 188 55 187 268 79 136 80 101 106 128 148 85 48 145 169 114
5056 114 137 299 252 20 100 31 184 136 186 106 112 50 50 73 116 174 64 199 112 163 131 160 239 199 337 159 52 64 81 42 44 105
4681 105 212 139 52 81 141 171 153 154 132 23 96 39 71 17 108 83 297 215 158 322 218 69 245 212 173 228 274 159 44 152
4329 152 8 120 138 254 213 75 300 292 68 176 161 130 112 25 58 111 44 122 109 48 9 104 173 138 97 130 205 181 74 153 211
3965 211 228 140 185 136 22 112 247 139 163 127 140 140 139 100 59 145 112 174 71 164 135 84 113 100 127 172 112 43 51 66 122 74 29 98
3566 98 184 171 147 87 97 45 135 180 31 124 127 97 185 142 94 115 79 42 118 200 135 14 119 175 135 183 249 134 141 91 219 287 111
3178 111 206 145 240 360 125 79 150 139 41 27 86 212 275 686 1339 1082 281 89 158 134 218 121 21 97 100 215 100 59 185
2838 185 166 130 208 89 205 117 116 114 150 54 65 200 136 25 79 158 253 75 126 75 188 65 150 96 198 125 68 158 99 210 349
2474 349 182 209 161 189 115 41 33 100 34 149 144 97 149 103 98 150 116 108 141 59 91 126 156 97 87 95 145 99 172 238 199 362 227 184 154
2063 154 203 126 84 41 234 124 188 347 256 49 243 132 97 194 263 254 122 71 56 44 48 203 137 262 228 87 63 109 23 167
1711 167 241 214 174 92 62 117 149 154 49 40 40 42 151 269 127 120 252 83 242 201 62 117 128 119 141 126 154 162 229 130 223 200 264 319
1312 319 208 174 188 115 115 133 90 57 49 122 180 87 99 160 49 56 45 131 118 108 126 216 153 75 272 263 267 83 140 182 63 124 143 201 287
901 287 42 147 119 79 33 75 172 66 182 112 68 222 142 74 139 40 220 137 13 47 140 4 67 146 192 173 227 274 177 78 106
538 106 88 195 179 193 385 286 66 89 151 155 206 321 191 95 196 67 20 58 51 217 175 57 102 151 101 286 294 141 71 154 125
174 125 242 215 178 198 200 82 152 233 244 74 144 75 204 181 144 102 140 185 105 142 75 36 29 157 171 123 58 133 18 146 164
-190A64
##PAGE=	F1=1547.75
##FIRST=	25169.313707327481097,	5807.6787752999953227,	0.09474112093448638916
##DATA TABLE=	(F2++(Y..Y)), PROFILE
5808 85 59 176 329 237 120 154 76 61 159 74 307 253 81 98 190 66 115 91 102 201 125 112 85 92 20 133 91 143 189 111 282 140
5432 140 157 136 18 150 214 170 25 116 149 79 61 24 68 149 186 41 158 65 214 286 102 148 150 94 113 173 149 135 26 116 191
5068 191 110 145 287 196 34 123 73 222 102 158 149 184 37 15 76 95 176 63 212 143 163 169 170 281 277 359 148 62 107 151 29 64
4693 64 86 216 171 89 78 107 146 168 150 101 47 88 22 76 61 127 106 279 183 135 261 212 71 239 185 139 209 275 200 103 204 59
4317 59 67 33 227 259 55 286 268 41 142 139 122 76 55 100 97 20 94 76 63 48 112 190 99 32 72 193 162 69 142 175 241 160 154 70
3918 70 89 123 188 157 104 93 140 127 92 56 59 197 137 160 76 184 148 49 98 140 160 234 136 40 36 80 142 68 13 119 183 152 143 54 123
3507 123 23 96 164 23 155 130 79 160 163 105 162 67 56 101 266 178 25 146 188 125 124 220 93 86 72 228 288 134 260 119 262
3143 262 357 112 75 74 117 61 47 96 191 242 407 952 713 172 103 108 132 194 83 24 113 110 219 127 59 159 177 170 201 120 163 69 136
2756 136 96 152 24 58 147 116 50 78 184 248 71 139 79 222 19 139 81 217 178 81 158 58 215 332 205 252 191 221 124
2416 124 37 58 90 73 139 148 63 172 92 51 130 143 137 136 32 103 157 190 97 127 43 210 106 157 234 177 346 245 156 170 194 98 34
2028 34 73 184 111 189 346 238 100 258 144 81 138 227 238 132 114 96 68 44 138 147 250 190 97 88 85 29 179 232 222 165 107 25
1653 25 63 144 169 30 76 73 37 118 259 131 99 269 79 231 229 79 147 117 99 146 124 120 134 252 150 204 178 267 325 191 178 175
1277 175 158 127 120 54 83 79 144 194 125 82 176 95 80 42 97 178 150 131 216 143 91 315 276 263 100 145 147 6 122 172 209 281 13 140
878 140 97 65 61 57 129 50 183 109 34 224 149 103 152 76 248 148 19 24 91 37 66 155 184 172 224 279 147 53 57 109 190 223 166 395
479 395 318 83 65 172 193 169 310 185 99 172 47 35 83 30 167 130 75 74 147 156 287 251 170 50 90 155 258 159 164 159 174 92 182
92 182 301 276 88 185 98 199 194 117 169 133 117 40 120 103 50 35 173 166 146 92 147 60 128 134
-190A34
##PAGE=	F1=1445.49
##FIRST=	25169.313707327481097,	5807.6787752999953227,	0.21696652472019195557
##DATA TABLE=	(F2++(Y..Y)), PROFILE
5808 92 70 181 326 237 89 119 52 73 145 86 318 280 117 84 162 85 112 38 120 240 180 139 62 59 48 92 27 157 218 171 303 93
5432 93 162 103 52 168 251 207 15 105 164 68 70 35 91 194 202 64 143 93 220 313 123 147 205 90 119 204 141 207 46 78 199 115
5056 115 135 253 122 60 125 120 235 82 163 210 224 32 48 70 74 138 62 225 157 161 190 170 309 327 344 125 74 152 219 20 95 78
4681 78 207 178 108 81 71 105 174 140 97 79 79 38 72 101 135 120 244 178 113 203 195 65 197 124 106 170 255 215 153 263 110 40 69
4294 69 178 269 46 254 230 32 87 101 125 65 59 133 108 52 147 39 63 94 113 185 49 31 31 173 131 92 148 148 239 164 102 18 158
3906 158 130 133 166 75 58 130 145 74 5 61 217 153 133 74 195 168 94 105 178 178 269 150 49 31 82 143 63 21 113 160 132 137 30 140
3507 140 13 75 130 47 171 122 71 115 169 104 184 34 112 84 305 197 54 167 187 110 65 190 56 60 52 207 273 144 267 84
3155 84 168 186 86 79 48 122 131 105 126 128 66 170 248 80 97 153 32 125 156 55 45 122 120 217 169 81 173 183 190 177 127 116 44 156 71
2744 71 152 12 35 70 125 116 114 202 236 63 137 68 222 20 118 84 218 230 93 157 6 203 285 230 273 191 226 129 43 74 78 108 148
2357 148 191 8 182 75 8 96 157 165 138 30 110 183 223 90 181 27 271 134 129 231 142 299 235 137 185 163 72 28 92 128 105
1993 105 174 327 239 143 251 151 52 70 173 199 129 151 156 112 74 84 166 213 151 144 120 92 54 167 199 227 153 114 62 13 136 172 42
1606 42 106 106 51 90 204 132 64 263 84 202 231 97 152 103 75 155 149 93 116 255 161 166 154 245 295 180 176 161 175 122 93 102 110 106 143
1195 143 192 146 56 184 135 93 60 114 231 184 116 206 130 113 323 264 247 100 123 105 54 116 212 200 264 46 127 73 57 70 40 83
819 83 52 189 108 7 190 144 125 165 105 266 140 50 48 53 73 64 138 169 165 222 269 112 30 21 141 155 231 144 385 320 118 44 185
432 185 220 111 268 151 103 132 24 29 88 8 93 106 90 42 147 210 279 201 181 35 71 202 256 101 144 106 133 84 210 346 285
68 285 119 222 118 182 200 99 209 139 51 35 102 137 54 28 186 150 172 124 147 103 110 99
-190I9
##PAGE=	F1=1343.23
##FIRST=	25169.313707327481097,	5807.6787752999953227,	0.14646789431571960449
##DATA TABLE=	(F2++(Y..Y)), PROFILE
5808 109 80 175 289 221 57 100 30 71 139 107 298 273 144 98 118 102 97 34 121 252 219 145 39 10 95 78 32 140 217 209 293 50
5432 50 186 92 88 197 287 225 17 97 181 63 84 55 113 229 200 72 139 96 235 349 141 152 238 85 121 214 116 256 88 63
5080 63 197 150 106 198 44 97 106 152 222 97 184 242 219 33 69 64 91 90 78 234 150 162 192 162 309 340 291 96 93 189 276 45 139
4693 139 90 180 167 113 93 58 51 170 124 120 111 72 71 65 127 128 122 202 196 97 157 175 56 130 49 86 120 218 198 185 318 153 70 148 118 248
4270 248 46 207 181 38 17 57 142 64 16 149 126 102 219 65 48 131 133 179 59 89 12 147 103 117 154 123 222 151 40 79 205
3906 205 121 95 163 86 33 113 181 98 49 77 201 158 96 64 194 181 130 123 200 182 279 145 52 54 83 122 54 42 89 122 116 132 21 143
3507 143 49 85 90 74 166 111 72 61 164 91 177 37 168 65 311 194 74 170 172 93 17 167 52 48 25 169 246 129 234 45
3155 45 158 280 258 74 199 255 268 158 178 65 208 1113 1885 1337 369 242 80 133 144 164 181 127 123 205 220 135 200 194 189 134
2803 134 120 95 72 170 42 145 50 38 39 151 189 137 200 212 37 126 45 193 52 88 115 194 268 100 177 77 174 215 248 264 158
2439 158 209 130 43 72 70 131 161 241 57 174 43 71 55 159 188 144 54 110 196 254 69 245 37 300 168 106 232 112 233
2099 233 203 149 195 124 90 69 92 77 97 158 289 240 167 216 141 42 27 114 149 114 179 199 150 97 49 182 165 129 186 148 131 89 133 152
1700 152 231 138 97 110 65 126 170 49 121 133 84 89 111 119 36 235 76 164 199 109 131 85 51 157 172 82 110 242 162 117 138 207 234
1312 234 179 179 150 164 93 66 161 137 117 116 178 156 26 175 158 93 80 160 254 194 80 183 111 121 289 228 222 78 80 68 99 111 245
925 245 170 242 73 115 78 55 64 32 48 91 195 109 46 133 139 139 172 123 269 104 98 76 44 103 61 105 148 155 214 240 89 35 67 172 98
514 98 209 128 357 289 148 37 190 230 44 210 91 97 79 44 7 78 36 38 138 99 29 147 251 263 154 166 32 101 239 239
162 239 56 118 48 91 60 227 358 270 146 246 130 160 197 102 215 151 55 89 91 162 47 17 193 123 191 146 131 146 98 64
-190F4
##PAGE=	F1=1240.98
##FIRST=	25169.313707327481097,	5807.6787752999953227,	0.013529114425182342529
##DATA TABLE=	(F2++(Y..Y)), PROFILE
5808 114 85 162 230 187 33 99 33 56 143 126 244 227 153 137 66 116 74 68 97 237 240 127 20 45 131 98 79 96 190 219 251 98 226
5420 226 97 118 214 309 219 17 88 186 63 90 64 138 255 184 70 147 77 266 377 152 173 244 74 120 202 79 270 128 91
5080 91 186 196 68 130 45 137 71 163 194 123 201 234 173 28 66 69 133 105 122 238 126 165 175 153 276 314 209 95 111 218 315 73
4704 73 186 126 133 157 112 109 91 31 158 105 147 135 66 97 63 135 108 116 163 215 89 125 148 64 65 53 76 86 175 155 195 355 181 107 201
4294 201 68 213 52 147 129 41 61 28 169 64 61 145 134 141 268 132 38 156 183 206 148 141 18 125 85 122 141 90 197 129 42
3930 42 134 227 102 81 144 102 39 101 221 136 102 103 155 154 58 55 183 182 130 128 196 175 271 122 48 88 100 82 40 56 59 81 103 129 20 131
3507 131 82 103 65 95 146 117 81 18 154 75 141 82 211 41 287 169 89 155 145 79 25 154 94 79 70 137 213 84 182 5 300
3143 300 552 424 94 352 467 466 214 245 197 522 2409 4283 2984 746 355 168 166 229 372 372 137 118 178 262 200 215 221
2826 221 173 83 122 120 115 169 55 125 83 104 120 174 267 140 175 176 22 118 16 146 76 51 154 146 281 102 222 144 134 134 249 224
2451 224 105 176 125 35 52 67 139 167 277 116 150 8 127 17 156 200 142 74 97 192 275 34 308 82 288 186 97 236
2122 236 109 163 164 179 195 95 140 98 73 57 87 150 234 222 170 155 108 77 78 66 103 96 197 215 171 99 31 186 130 133 206 164 174 127 87
1711 87 113 232 125 59 147 122 114 173 41 124 148 123 112 17 88 40 188 44 130 138 111 91 61 35 146 179 77 101 220 154 63 143
1336 143 163 159 188 188 141 136 39 64 202 157 119 74 156 160 36 146 159 84 100 192 235 170 28 149 88 106 215 176 193 55 23 43 115
948 115 112 261 125 221 86 109 115 64 50 39 50 147 200 108 79 90 152 147 169 130 259 49 157 105 48 129 63 79 125 142 205 196 99 45
549 45 107 194 34 170 118 315 230 161 52 188 220 54 169 21 82 65 88 42 72 61 106 185 102 47 139 268 237 119 126 37 121
185 121 258 214 36 86 20 106 38 225 333 235 162 252 135 143 189 112 187 156 111 125 86 163 30 10 194 87 192 153 107 185 101
-178 101 37
-190C7
##PAGE=	F1=1138.72
##FIRST=	25169.313707327481097,	5807.6787752999953227,	0.091330833733081817627
##DATA TABLE=	(F2++(Y..Y)), PROFILE
5808 105 86 145 164 141 35 101 47 30 152 138 162 152 144 171 23 122 56 90 52 207 245 96 32 96 149 120 108 50 150 206 181 164
5432 164 270 108 137 209 308 190 32 66 170 65 83 61 165 274 168 66 164 49 298 386 154 198 223 54 113 172 47
5115 47 250 158 124 168 229 60 69 105 172 31 160 165 138 207 202 111 18 51 86 171 167 175 232 95 163 146 148 217 261 112 139 122 242 330 86
4704 86 220 172 74 158 115 122 141 87 141 83 161 140 58 109 66 126 91 115 138 221 92 104 117 93 49 107 62 99 135 101 188 363 189 136
4305 136 231 62 184 71 82 94 34 139 39 195 78 149 127 125 157 283 201 77 170 242 260 246 185 27 120 70 107 110 46 174
3953 174 114 95 168 229 89 81 112 106 67 96 254 170 146 127 92 143 53 44 163 171 94 110 168 162 253 88 42 119 130 32 33 60 45 49 90 132
3531 132 25 104 104 113 72 108 116 144 93 46 146 76 83 115 234 13 242 124 102 128 112 79 47 149 148 104 121 132 178 29 137 87 241
3143 241 458 393 151 470 696 691 277 313 384 818 3895 6982 4791 1152 472 239 247 384 615 585 154 109 129 274 256 210
2838 210 265 150 69 149 160 153 148 102 92 106 173 189 182 340 144 134 133 75 122 22 98 92 19 188 88 271 98 272 192 94 54 228
2462 228 164 95 146 116 60 22 70 133 166 290 153 123 63 168 24 150 199 128 83 69 173 280 15 362 150 233 172 110 235
2122 235 129 106 134 203 186 91 185 110 46 79 77 142 171 184 161 80 56 118 128 36 80 87 204 202 168 81 20 173 126 150 202 162 197 157 61
1711 61 111 227 117 40 171 171 101 184 23 115 144 153 139 123 49 50 126 14 111 68 109 42 42 32 120 163 63 81 192 140 13 168 125
1324 125 97 199 196 132 116 45 95 218 167 130 55 131 157 68 107 145 76 116 190 177 114 38 107 69 66 112 122 165 82 36 35 100 116 257 72
913 72 202 90 107 160 87 30 47 72 203 204 103 98 110 187 152 149 128 240 16 210 138 41 152 77 85 113 121 197 161 131 34 125 201 21
514 21 132 113 268 161 154 78 181 193 120 184 61 70 127 129 95 92 71 183 214 110 66 117 257 200 98 69 42 114 257 190 41 48 74
127 74 183 63 198 273 194 171 241 136 141 180 111 137 148 155 141 85 135 36 16 186 54 172 142 89 216 112 35
-190C5
##PAGE=	F1=1036.46
##FIRST=	25169.313707327481097,	5807.6787752999953227,	0.13797068595886230469
##DATA TABLE=	(F2++(Y..Y)), PROFILE
5808 85 81 128 107 95 53 100 49 8 160 150 70 80 118 185 35 115 68 97 8 173 238 75 58 133 143 130 122 71 118 175 97 206 302 128
5409 128 142 184 281 144 70 29 133 67 74 57 188 290 172 74 183 36 313 372 144 209 182 38 102 132 42 206 173 140 149 238
5056 238 102 71 149 198 4 153 147 143 208 184 94 39 52 105 192 217 216 215 66 151 110 145 153 203 30 198 130 263 319 78 230 213 64
4669 64 165 121 127 184 138 121 63 156 121 50 102 73 112 101 133 126 208 104 91 93 120 71 136 49 135 100 63 177 341 174 155 242 79 173
4270 173 106 26 97 36 208 55 216 110 222 106 106 150 269 259 134 174 283 307 328 220 35 140 44 87 87 31 157 110 131
3930 131 181 221 92 82 79 101 98 88 274 192 176 140 32 127 85 25 138 152 37 75 125 148 231 56 34 141 158 35 55 54 56 33 81
3542 81 146 34 73 108 121 90 112 87 172 99 73 143 103 14 124 234 19 184 62 109 106 89 99 66 149 203 106 169 158 147 108 128 238
3155 238 322 333 133 208 514 885 896 334 364 574 1041 5279 9457 6416 1512 571 298 352 541 836 779 174 104 72 235
2862 235 288 194 322 132 121 189 193 185 103 142 51 114 227 230 178 401 178 86 87 133 140 60 65 104 34 206 79 246 93 302 212 66
2486 66 14 186 115 170 134 111 120 20 75 116 159 278 157 109 113 188 41 142 186 109 78 43 144 266 56 400 225 147 123 141 224
2122 224 148 75 121 212 167 104 206 109 35 104 72 117 109 144 153 32 14 148 162 51 88 101 201 165 139 54 26 145 140 168 177 142 189 169
1723 169 81 139 211 116 79 182 211 89 190 7 94 118 163 165 220 53 45 63 86 106 62 112 12 58 38 79 131 43 64 163 121 24 193
1336 193 96 91 197 192 117 126 128 132 209 167 155 90 110 144 91 89 124 85 124 158 96 44 104 73 60 9 10 84 142 139 90 42 72 116 235 27 188
901 188 93 103 197 121 9 46 89 245 212 96 100 157 228 158 114 124 219 66 242 172 26 172 100 108 121 91 184 159 164 18 124 193
526 193 58 103 109 224 112 133 108 172 159 179 236 124 76 194 157 149 124 63 239 215 128 75 85 219 153 85 6 50 78 238 170 58
150 58 13 123 268 102 149 190 163 177 216 135 149 172 92 81 128 178 141 90 81 79 25 169 54 134 113 87 234 123 44
-190D4
##PAGE=	F1=934.202
##FIRST=	25169.313707327481097,	5807.6787752999953227,	0.08936004340648651123
##DATA TABLE=	(F2++(Y..Y)), PROFILE
5808 63 69 118 59 59 69 101 37 38 162 163 62 104 88 179 52 100 98 98 64 148 223 75 74 153 116 131 123 120 113 137 27 217 311 158 134 153 233
5373 233 92 117 21 80 67 83 67 200 302 194 98 194 54 302 338 126 201 134 57 95 92 50 152 171 140 140 223 151 118 173 218 16
4998 16 151 145 155 212 202 133 83 78 115 196 238 231 186 52 131 73 138 117 167 72 253 151 277 282 48 213 237 131 165 126 116 209 171
4610 171 99 53 139 79 55 78 86 111 134 171 119 179 120 82 92 130 70 142 81 162 63 53 171 293 136 166 240 78 173 149 42 121 61
4223 61 260 65 224 142 261 102 97 131 243 300 188 166 294 322 378 244 43 177 16 91 107 88 142 105 143 177 217 99 84
3883 84 83 91 120 65 277 197 194 142 49 108 119 22 109 130 64 48 87 135 204 38 38 151 170 74 89 45 73 45 83 172 41 67 99 135 98
3472 98 108 67 182 91 81 142 143 68 105 213 44 126 12 108 106 95 139 84 147 257 97 220 207 133 223 184 469 1354 1986 889
3120 889 259 461 988 1032 367 383 738 1145 6235 11156 7505 1751 636 368 414 639 977 917 190 119 135 132 285 176
2838 176 379 124 180 226 215 209 40 156 27 109 255 243 170 438 238 42 44 182 158 100 70 120 61 208 143 224 93 299 200
2498 200 54 60 134 122 257 141 119 187 45 79 90 148 244 131 111 138 186 45 134 173 112 66 62 115 234 95 418 294 56 46
2146 46 182 197 152 71 115 208 139 113 199 100 42 113 67 72 59 132 149 77 67 163 177 100 111 128 192 113 93 50 50 109 148 182 141 109 152 159
1723 159 111 166 185 120 116 182 244 85 180 4 68 82 149 189 281 105 34 71 160 100 115 131 39 96 51 29 97 56 86 138 99 46 202
1336 202 70 127 179 172 96 150 207 160 183 158 182 130 96 123 99 108 106 104 120 109 28 73 161 69 55 57 109 69 131 191 130 62 75 107 200 51
913 51 181 99 90 218 156 30 35 98 266 223 89 92 192 264 167 69 126 199 96 243 197 28 185 124 124 142 66 156 182 187 65 120 173
526 173 71 84 101 189 107 110 139 164 137 228 281 165 94 239 166 194 149 43 265 191 154 75 50 162 103 81 51 59 20 205 152 81 34
138 34 160 330 124 86 100 150 184 183 129 155 163 55 46 108 177 130 100 22 127 28 143 89 95 71 93 236 125 44
-190D4
##PAGE=	F1=831.945
##FIRST=	25169.313707327481097,	5807.6787752999953227,	0.11527950316667556763
##DATA TABLE=	(F2++(Y..Y)), PROFILE
5808 47 49 115 12 36 77 112 13 70 155 170 139 173 79 163 50 94 130 101 115 134 203 77 69 157 77 127 113 146 120 99 52 200 288 187
5409 187 121 140 169 58 158 77 25 68 102 85 199 306 215 128 192 80 270 294 114 179 100 93 99 63 49 110 156 135 148 192 187 156 182
5021 182 238 10 152 159 184 215 230 159 133 103 112 197 231 214 146 56 109 41 121 124 161 124 294 194 279 222 0 174 235 202 154 127 90
4634 90 209 187 74 62 126 51 75 44 104 128 166 220 107 140 133 73 94 116 45 153 147 171 21 38 167 235 82 173 233 48 168 190
4258 190 71 139 95 291 76 217 159 258 121 114 115 224 321 230 146 274 299 389 252 54 217 35 114 142 147 126 83 143 160 225 91
3894 91 96 125 81 129 34 263 182 206 139 88 84 143 70 79 107 132 58 79 124 174 46 65 150 161 95 122 43 91 72 91 203 42 94 89 158
3484 158 94 95 61 166 68 73 132 186 140 68 176 62 93 85 100 123 129 189 100 139 305 95 266 268 147 336 309 763 2892 4413 2135
3120 2135 347 311 979 1067 363 367 852 1106 6508 11671 7802 1816 655 462 373 630 1000 971 194 161 291 31 253
2850 253 165 421 118 226 253 228 226 34 140 70 106 257 241 168 444 295 9 11 216 164 138 100 141 81 193 214 218 93 256 155
2498 155 47 85 86 158 317 144 138 243 59 80 59 134 192 95 117 128 169 46 133 176 146 52 99 99 188 126 414 346 87 42 217 159
2122 159 140 78 105 210 108 108 165 93 40 103 58 37 37 152 141 112 111 167 173 160 135 156 186 64 71 75 77 75 139 192 104 72 99 129 126 180 151
1688 151 122 133 175 271 91 151 7 79 73 115 213 299 154 57 142 223 81 150 163 47 128 70 29 85 98 128 123 74 52 186 58 166
1312 166 151 142 70 167 264 170 147 149 195 153 88 100 94 132 90 117 105 63 64 150 200 93 44 115 189 59 135 226 152 91 110 85 159 98 185 107
890 107 67 220 185 65 30 101 265 234 82 86 208 290 178 28 136 181 98 213 201 51 183 143 126 163 82 105 200 199 133 131 150
526 150 66 89 88 168 117 98 165 157 148 268 300 182 109 254 156 220 155 21 258 155 177 68 35 101 81 98 90 67 45 162 137 103 66
138 66 181 352 121 36 35 150 189 144 116 150 147 8 51 97 160 108 108 68 166 22 116 131 98 28 98 222 112 38
-190C8
##PAGE=	F1=729.687
##FIRST=	25169.313707327481097,	5807.6787752999953227,	0.31499820947647094727
##DATA TABLE=	(F2++(Y..Y)), PROFILE
5808 42 25 115 47 32 78 131 13 95 135 161 194 219 107 149 46 111 158 109 154 130 183 76 38 151 42 111 88 139 117 74 75 168 235
5420 235 203 109 156 102 72 186 126 26 74 113 94 189 295 217 156 176 101 227 249 126 154 101 119 112 51 49 97 132 140 167 156 202 177 181
5021 181 261 35 146 180 219 202 233 151 178 119 94 209 209 169 103 64 95 17 100 141 162 155 316 247 263 147 53 131 210 253 138 121 50
4634 50 185 188 48 84 135 107 97 9 120 149 186 264 88 101 140 71 78 77 10 186 212 162 20 8 157 184 20 184 230 30 157
4270 157 220 79 145 122 297 89 196 156 220 144 141 113 222 322 255 118 239 254 366 247 67 251 60 132 156 194 108 45 141
3930 141 135 247 63 121 173 69 126 66 239 148 218 142 110 58 155 128 63 88 179 73 97 117 142 68 100 148 134 93 146 50 108 100 93 225
3531 225 42 121 93 182 80 76 68 129 49 56 112 226 201 27 129 72 109 150 88 137 174 239 108 123 340 113 294 323 184 429 475
3167 475 1078 4688 7237 3587 503 102 865 995 319 331 899 938 6005 10865 7231 1698 624 575 216 507 897
2920 897 932 178 222 470 230 216 169 436 108 252 262 234 233 96 95 129 119 242 240 169 416 328 10 21 238 153 168 135 160 93 166
2556 166 268 225 84 178 84 39 88 55 180 332 127 157 273 59 79 28 118 132 98 123 82 150 66 144 196 192 47 123 106 138 144 388
2181 388 375 171 123 236 120 121 82 92 234 100 85 118 95 43 81 45 85 47 177 122 120 140 169 150 220 155 175 192 59 124 99 100 54
1793 54 117 197 75 53 69 89 126 180 113 113 130 169 290 104 109 37 136 120 70 235 277 186 105 208 265 56 157 197 30 142 91 76
1418 76 94 138 161 112 46 42 148 85 197 130 116 48 169 289 160 109 145 189 158 83 83 81 138 71 111 83 36 97 210 214 121 23 156 232
1019 232 40 148 236 157 117 136 48 119 140 203 112 44 205 204 99 59 103 244 236 76 91 206 305 186 27 148 169 76 162 182 71
655 71 161 151 119 176 121 40 202 205 199 153 132 52 125 74 160 114 106 185 149 186 302 291 173 115 238 132 223 142 21 223 120 192 61
268 61 49 63 121 141 103 71 106 117 128 119 97 185 326 90 69 71 147 185 102 97 133 127 41 61 97 147 70 107 123 186 11 100 172 138 48 106
-155 106 194 87 41
-190D1
##PAGE=	F1=627.429
##FIRST=	25169.313707327481097,	5807.6787752999953227,	0.45003277063369750977
##DATA TABLE=	(F2++(Y..Y)), PROFILE
5808 47 40 112 106 53 73 147 31 112 107 133 217 231 148 142 69 144 185 118 178 133 165 98 22 140 33 74 46 98 93 81 65 133 162 199 105 180
5385 180 41 108 193 156 55 84 107 82 175 260 196 176 155 114 186 209 159 135 127 126 127 56 59 104 106 153 182 124 193 180 173 279 85 129 200 242
4963 242 167 201 123 208 132 71 238 190 111 69 68 88 1 95 144 142 172 318 288 230 74 103 111 167 275 125 108 36 145 176 25 106 158
4575 158 186 111 23 119 161 192 290 69 76 139 88 58 24 25 227 254 137 55 80 154 155 43 204 239 98 143 235 68 141 134 279 104
4200 104 169 140 159 153 157 121 228 303 261 95 216 218 329 233 81 269 69 140 137 221 90 43 142 109 271 46 152 212 57 119 132
3836 132 216 100 228 146 117 36 157 181 69 77 192 71 121 117 115 96 132 161 97 75 157 61 121 122 84 228 50 127 105 197 60 50
3460 50 79 95 70 44 93 255 243 27 81 76 146 196 75 140 215 276 104 106 352 154 299 350 232 490 638 1353 6370 9867 4936
3120 4936 696 179 678 840 251 299 878 703 4831 8920 5920 1428 543 668 32 311 698 812 144 283 638 432
2862 432 210 188 419 110 258 250 231 234 134 46 190 149 220 252 168 358 323 18 40 253 125 184 166 170 100 134 295 231 66 80
2509 80 18 32 73 31 174 297 86 169 273 58 77 8 100 72 141 133 28 140 104 162 219 229 51 131 136 100 146 339 377 231 180
2146 180 234 98 102 79 92 277 140 48 81 110 90 58 42 147 62 191 92 112 158 177 110 270 171 182 213 94 198 110 114 43 86 196
1770 196 67 74 92 54 119 172 75 93 118 165 298 116 65 76 195 178 26 250 228 194 148 252 286 62 143 223 6 131 109 111 96
1406 96 164 172 100 17 22 103 125 217 139 106 39 163 277 134 72 144 165 152 76 72 68 123 49 81 60 49 105 245 202 143 21 176 234 30
1007 30 152 224 148 135 140 7 90 173 231 105 45 177 209 122 103 109 209 224 68 101 193 311 186 44 159 163 42 109 142 84 121
643 121 146 119 181 153 64 199 219 250 166 126 42 173 64 160 104 135 196 137 230 327 259 145 112 199 100 203 111 31 169 93 195 56
268 56 63 67 181 195 93 67 149 75 121 130 128 176 256 43 115 116 131 165 62 76 109 104 86 64 100 167 35 95 150 185 14 101 209 177 97
-143 97 121 159 55 56
-190E6
##PAGE=	F1=525.171
##FIRST=	25169.313707327481097,	5807.6787752999953227,	0.48805028200149536133
##DATA TABLE=	(F2++(Y..Y)), PROFILE
5808 59 85 105 153 81 67 153 34 120 91 102 209 214 181 135 108 177 215 124 190 140 154 152 86 129 46 15 37 35 53 116 33 101 83 171 106 195
5385 195 22 141 182 158 59 93 92 50 159 203 164 190 139 118 156 182 197 123 157 110 134 72 73 109 81 158 185 92 165 172 162 280 134 106
4986 106 212 247 111 145 118 220 150 62 274 187 64 63 72 80 9 113 137 96 185 297 301 185 59 139 124 122 263 114 92 82 107 155
4610 155 24 123 174 254 114 46 93 160 186 286 62 72 130 117 98 42 37 254 257 102 79 168 186 144 92 231 264 175 134 233 48 140
4235 140 132 243 115 148 128 95 137 153 128 227 263 248 95 225 212 298 215 88 264 59 140 90 223 74 97 138 101 282 87 182
3883 182 238 59 120 189 204 52 226 141 116 31 150 218 79 83 170 57 145 125 89 125 155 196 69 58 155 70 126 132 69 213 77
3519 77 111 113 199 36 18 88 99 108 48 97 266 263 52 41 80 171 217 62 131 243 291 89 103 331 207 286 333 278 508 747 1524
3155 1524 7532 11671 5853 867 389 475 652 186 291 803 519 3258 6279 4162 1074 417 682 178 133 460 636
2909 636 93 328 762 596 244 212 374 140 243 214 216 229 142 67 247 178 202 275 162 276 280 19 61 266 86 183 184 163 105
2568 105 108 291 233 68 26 102 35 59 19 151 222 42 169 247 68 74 26 85 37 181 146 84 143 143 176 234 250 55 136 178 93 128
2193 128 270 352 255 203 212 100 85 69 118 325 205 39 87 130 158 54 70 194 71 194 66 115 178 190 57 306 181 179 241
1852 241 126 261 109 117 38 53 188 83 111 117 46 112 160 43 73 109 161 288 117 35 113 232 224 9 251 169 179 171 263 294 102
1488 102 117 234 51 100 121 129 77 174 158 91 12 9 85 157 221 168 105 44 162 229 99 41 134 129 143 63 57 61 102 35 32 39 96 110 256 173
1066 173 159 50 174 202 50 138 194 130 140 122 66 87 195 260 82 66 144 200 129 148 117 169 199 56 104 177 309 175 53 165
714 165 165 15 73 88 99 78 132 136 181 167 138 211 242 274 160 132 38 212 64 157 111 174 200 120 264 336 210 110 102 149 71 165 73
326 73 30 108 74 191 56 65 82 233 243 63 56 168 45 108 142 155 163 160 36 144 144 98 129 30 59 85 84 122 73 99 218 83 73 147
-73 147 165 33 113 241 193 143 144 124 24 66
-190F6
##PAGE=	F1=422.913
##FIRST=	25169.313707327481097,	5807.6787752999953227,	0.46578755974769592285
##DATA TABLE=	(F2++(Y..Y)), PROFILE
5808 72 135 95 178 104 64 148 19 126 118 110 184 184 196 120 139 203 245 126 188 147 155 214 150 121 72 88 103 36 2 157 49 72 42 123 106
5397 106 193 51 167 156 127 40 96 86 16 144 135 145 202 137 110 131 173 227 111 183 79 132 95 80 104 62 139 173 57 134 164 149
5021 149 255 168 84 213 232 65 87 154 211 172 77 304 199 47 77 81 65 21 131 131 33 194 256 279 138 102 157 145 89 218 96
4657 96 75 128 88 134 50 137 172 303 113 61 47 149 175 248 67 76 117 146 175 96 30 253 218 60 97 252 256 143 121 260 299 238
4282 238 133 218 41 153 122 196 122 144 137 41 94 135 133 207 203 218 113 252 223 279 201 85 233 46 135 46 202 68 151 120 120 273
3906 273 139 204 250 84 125 222 203 41 206 117 114 43 136 232 74 106 119 64 163 133 54 154 173 242 66 63 141 74 121 131 62 183
3531 183 115 87 111 190 13 19 93 120 133 60 124 251 260 69 24 89 172 215 49 111 251 281 68 122 272 247 263 270 314 485 767 1543
3155 1543 7865 12169 6095 959 525 315 490 147 297 691 484 1641 3516 2332 722 254 558 171 57 252
2920 252 439 33 344 818 690 279 229 316 181 210 156 183 221 124 115 289 195 197 302 153 183 205 20 91 284 38 167 186 140
2580 140 112 92 257 233 108 105 185 51 91 66 134 131 73 158 204 85 67 44 75 58 200 155 153 144 170 177 239 254 54 149 223 112 97 187
2181 187 302 242 192 176 109 66 59 159 362 270 90 121 150 223 69 118 220 72 185 61 144 200 200 18 331 187 167 262 145
1840 145 297 104 112 40 22 173 106 142 119 58 107 145 23 78 106 153 260 107 32 134 238 248 36 235 121 146 162 241 295 140
1488 140 90 230 96 68 127 129 46 170 128 108 39 34 109 169 206 192 100 49 174 156 68 28 106 86 133 44 45 63 88 31 32 18 155 140
1089 140 247 140 170 73 158 148 68 105 156 104 135 97 133 112 199 278 44 80 108 182 117 180 122 132 163 44 99 161 294 149 69 169
714 169 170 25 67 33 128 78 116 166 180 165 197 244 264 265 136 142 36 232 79 142 136 214 198 101 280 323 154 84 89 100 52 121 46 22
315 22 56 56 184 60 56 85 260 270 23 41 162 28 93 152 170 156 58 88 154 159 57 85 23 48 66 68 143 94 101 270 150 51 117 133
-85 133 50 122 263 182 180 169 102 13 60
-190F0
##PAGE=	F1=320.655
##FIRST=	25169.313707327481097,	5807.6787752999953227,	0.31644782423973083496
##DATA TABLE=	(F2++(Y..Y)), PROFILE
5808 83 183 88 174 117 63 135 11 138 175 158 163 162 185 97 151 217 266 125 173 148 168 260 196 114 110 187 166 97 51 192 100 48 85 67
5409 67 100 177 69 183 119 70 33 93 94 66 133 87 152 216 146 95 97 180 238 93 203 56 126 114 82 94 51 92 149 20 123 163 141
5021 141 205 176 69 206 207 89 56 192 185 189 96 314 212 37 94 99 56 38 131 132 35 194 204 225 97 136 159 152 71 147 65 59 156 90
4622 90 130 85 147 147 327 121 72 50 131 169 179 69 74 105 165 247 137 46 226 145 23 120 315 335 154 125 285 329 272 133 194
4258 194 62 182 120 147 125 154 157 13 31 127 134 166 128 182 133 274 223 257 190 68 173 65 121 72 168 85 192 87 148 244 174
3894 174 216 251 115 119 219 201 69 165 73 116 56 116 218 49 135 59 97 170 136 11 185 194 280 72 77 119 69 112 121 75 153 153 94
3507 94 104 173 9 62 99 118 137 70 153 210 237 85 41 105 149 196 35 85 238 247 51 153 182 254 228 173 334 426 683 1399 7258
3143 7258 11203 5588 943 558 235 394 123 294 562 518 346 1172 802 460 65 297 80 77 125 255 25 325 795
2873 795 698 283 228 262 201 160 90 128 212 106 137 306 198 209 325 147 98 115 37 129 308 25 142 171 105 119 81 201 235 152
2521 152 156 244 79 155 122 140 84 129 137 161 94 52 60 74 89 198 151 197 133 177 162 237 246 50 169 258 137 88 105 237 204 157 138 113
2122 113 58 62 198 378 317 143 155 163 267 86 173 222 67 162 75 181 213 196 77 351 191 150 265 147 300 100 98 56 9
1782 9 152 124 160 100 67 100 126 20 105 100 136 215 88 40 134 212 246 58 203 107 107 120 191 294 163 83 214 130 62 129 114 55 161
1394 161 93 151 62 58 139 159 175 197 85 53 191 76 54 37 61 42 121 29 64 75 81 18 93 5 209 187 226 122 179 82 134 85 65
1007 65 71 116 71 120 83 195 150 186 273 2 78 70 162 91 186 119 105 123 34 93 148 266 113 99 176 172 29 78 47 168 124 107 197 182
608 182 154 231 278 270 225 99 146 36 236 107 113 157 243 192 80 273 289 94 82 82 69 47 83 54 34 21 45 179 67 45 77 258
232 258 268 18 32 141 15 101 157 171 162 31 131 149 164 36 53 31 38 54 56 149 116 109 300 195 36 74 101 61 123 273 148 207
-143 207 191 97 25 38
-190C8
##PAGE=	F1=218.397
##FIRST=	25169.313707327481097,	5807.6787752999953227,	0.038160607218742370605
##DATA TABLE=	(F2++(Y..Y)), PROFILE
5808 88 224 84 144 126 67 122 51 164 230 206 162 157 149 69 138 216 269 124 142 139 187 280 215 108 152 269 204 137 99 214 140 59 132
5420 132 65 91 159 77 187 78 41 80 86 102 122 133 90 172 232 162 86 46 192 222 68 211 68 124 124 85 88 47 25 116 25 135 176
5033 176 149 140 156 60 195 181 134 50 207 150 193 105 302 212 12 116 122 74 62 106 133 88 182 160 154 65 153 151 141 55 63 29 43 161
4634 161 95 144 122 153 109 324 144 77 119 110 170 96 57 69 99 176 297 160 97 183 59 47 153 347 398 180 107 300 343 271 130
4270 130 172 90 219 132 103 123 166 173 33 42 155 137 114 67 157 149 280 207 219 178 39 89 109 96 112 135 118 214 44 163 202 180 213
3883 213 246 136 97 184 190 94 125 27 123 61 94 177 41 158 49 126 161 135 70 222 224 296 66 80 92 47 105 109 94 134 178 130 103
3495 103 154 20 106 110 79 125 77 177 150 197 105 64 127 109 170 23 57 207 191 46 183 91 223 180 72 333 344 511 1119 5853
3143 5853 9012 4463 819 495 207 344 89 270 429 494 576 447 431 341 126 280 527 280 65 115 76 279 702 624
2862 624 245 206 226 182 97 71 50 200 124 124 296 199 232 341 147 66 43 69 166 337 93 115 141 79 125 63 137 240 175 173 273
2498 273 110 221 164 152 119 162 105 129 96 29 77 83 107 180 133 208 104 165 132 237 230 47 182 274 155 131 75 169 162 113 103 112 74
2110 74 73 223 372 340 180 180 167 283 107 226 205 58 123 90 206 205 174 136 368 198 132 246 136 269 98 79 80 33 127 129 160
1746 160 77 71 90 107 22 129 84 108 163 65 49 117 168 221 79 164 123 76 58 135 284 168 112 197 150 73 129 88 100 148 64 194 77
1359 77 74 154 134 132 177 74 58 204 65 54 43 54 8 105 50 102 92 72 23 140 30 242 229 201 123 183 76 109 23 37 78 82 33
972 33 99 92 244 185 155 239 46 64 29 152 79 158 104 87 83 26 96 135 224 86 133 186 169 19 92 93 207 168 109 220 190 144 238 293
573 293 254 168 57 137 41 229 142 77 162 253 182 59 242 236 38 94 91 67 51 61 79 67 10 55 179 81 43 62 227 236 55 38 119
185 119 0 139 153 169 178 90 155 139 166 62 66 41 25 49 53 142 127 122 298 200 38 41 76 66 118 268 101 220 204 98 41 28
-190B8
##PAGE=	F1=116.14
##FIRST=	25169.313707327481097,	5807.6787752999953227,	0.25633922219276428223
##DATA TABLE=	(F2++(Y..Y)), PROFILE
5808 86 253 81 99 137 76 116 94 198 268 232 179 162 92 45 104 197 246 120 95 114 202 269 207 105 180 311 205 148 135 224 160 101
5432 101 169 130 82 155 82 176 36 118 135 71 97 166 145 109 187 248 181 103 37 195 172 31 206 92 131 120 94 90 44 63 84 56 150
5045 150 202 175 81 119 58 181 157 155 36 195 110 184 102 271 193 41 149 140 114 87 63 129 116 160 139 95 41 165 141 112 32 45
4669 45 44 28 147 94 158 153 154 71 294 175 76 178 91 169 28 35 82 101 182 315 167 151 137 32 94 185 345 427 209 71 301
4305 301 334 237 125 161 113 258 151 67 115 172 177 59 113 209 149 88 93 159 162 271 189 169 156 32 11 154 68 132 121 154 217 6
3930 6 159 165 155 196 239 140 76 142 166 112 123 57 136 55 75 118 94 170 92 135 144 134 146 262 258 280 42 66 60 5 104 98 107 129 181 161 118
3495 118 140 20 147 124 27 122 85 195 88 151 127 91 153 65 145 14 26 171 121 50 207 109 163 115 78 313 256 294 769 4010
3143 4010 6168 3021 624 367 184 294 59 229 310 382 849 1126 841 301 279 628 977 513 10 45 111 222 563 490
2862 490 174 168 214 121 41 132 54 186 170 81 265 211 253 345 146 107 79 103 193 362 163 92 102 98 125 40 87 246 166 166 268 135
2486 135 268 176 147 148 162 65 114 109 12 97 96 112 155 105 192 67 138 92 239 212 49 177 267 163 186 122 118 141 81 77 111 97 78 227
2087 227 347 336 191 197 164 269 137 268 172 54 74 102 211 172 139 178 379 207 114 206 117 212 94 54 100 55 102 118 145 77
1735 77 78 79 94 19 135 59 73 120 46 55 106 129 185 91 134 145 67 65 103 258 161 152 185 156 68 131 55 137 128 43 217 81 80 151 100 88 140
1300 140 94 70 207 125 48 41 120 48 91 83 134 111 77 69 164 51 248 258 178 134 179 66 88 36 37 116 54 17 74 116 274 207 115 176
901 176 76 48 33 164 113 93 79 78 44 19 106 124 176 95 157 193 159 12 100 125 229 189 114 228 202 145 217 282 220 126 20 112 43
514 43 218 170 45 158 242 169 37 194 175 14 103 121 80 56 52 101 102 6 74 186 100 60 45 176 181 85 50 111 18 173 149 182 195
127 195 122 159 133 165 86 98 62 11 54 57 133 126 135 262 158 58 52 66 64 109 250 55 216 203 95 58 65
-190F5
##PAGE=	F1=13.8818
##FIRST=	25169.313707327481097,	5807.6787752999953227,	0.23199161887168884277
##DATA TABLE=	(F2++(Y..Y)), PROFILE
5808 78 270 76 58 149 85 117 133 228 280 228 200 168 25 47 58 161 199 112 41 75 207 233 180 107 184 299 165 133 158 224 165 145
5432 145 195 198 80 173 89 149 9 200 179 48 84 189 163 110 192 259 200 144 114 182 94 26 184 102 146 115 105 96 39 141 66 75 153
5045 153 234 208 70 100 63 161 134 143 23 167 70 167 90 229 152 92 192 147 157 110 15 120 116 138 138 99 22 186 129 76 9 121
4669 121 83 30 122 88 152 171 149 45 240 205 65 208 77 155 60 49 123 114 192 303 160 192 103 79 136 204 316 414 226 37
4317 37 287 306 187 125 163 125 290 168 37 103 173 175 88 170 265 173 118 148 178 171 253 181 128 127 81 115 192 56 130 131 182 204 34 137
3918 137 140 105 166 232 128 99 137 135 125 161 103 155 38 65 68 155 167 124 121 136 136 216 297 282 233 31 34 34 57 107 86 109 133 160 167 142 131
3484 131 9 178 138 94 142 92 209 60 113 145 119 180 32 129 26 13 147 78 61 222 190 93 35 133 281 178 90 433 2203
3143 2203 3406 1638 413 222 162 220 93 180 219 207 669 1055 778 234 343 788 1131 594 50 32 131 175 409 329 90
2850 90 127 212 31 69 204 157 177 212 58 233 237 261 332 143 145 130 131 206 374 222 71 56 145 118 42 81 251 128 156 237 143 281
2474 281 156 117 138 127 24 115 144 37 118 105 106 129 78 162 58 105 49 243 193 58 151 243 157 223 173 98 145 73 65 111 105 69 207
2087 207 310 309 175 204 157 236 174 292 132 59 38 110 197 133 104 198 378 216 96 149 94 141 83 27 107 73 80 92 126 97 89 65 87
1700 87 16 127 34 49 115 35 53 122 115 149 91 135 157 75 139 110 209 149 176 180 149 42 137 25 151 99 23 213 73 74 133 67 51 105
1300 105 142 92 199 170 35 45 192 91 84 110 149 127 119 117 160 64 233 276 161 147 161 67 76 90 106 147 28 60 55 137 280 212 81
913 81 94 86 43 89 197 170 13 47 74 12 18 114 121 143 132 164 197 144 29 97 137 228 183 116 223 217 152 172 248 178 128 37 79 38 204
502 204 181 31 161 213 158 15 143 115 48 107 166 96 59 47 115 131 3 84 199 120 92 28 127 121 108 59 111 36 175 164 212 204 137
115 137 150 133 161 90 122 98 9 68 66 138 124 144 198 78 93 81 71 59 98 220 35 195 183 82 74 103
-190A03
##PAGE=	F1=-88.3761
##FIRST=	25169.313707327481097,	5807.6787752999953227,	0.10690202564001083374
##DATA TABLE=	(F2++(Y..Y)), PROFILE
5808 67 272 69 44 153 85 119 164 244 263 196 214 171 46 79 29 109 137 97 60 42 199 181 149 115 161 233 92 100 166 217 160 180 210
5420 210 247 86 200 99 110 38 264 203 23 78 189 174 94 191 259 215 194 190 152 56 97 150 90 164 129 116 101 33 201 80 85 146
5045 146 259 236 98 129 72 129 109 103 63 145 35 143 78 186 101 134 233 138 192 126 31 106 97 126 131 139 10 216 108 53 27 182
4669 182 105 58 101 78 121 172 136 27 171 227 47 200 69 117 89 99 172 132 209 267 143 214 102 92 168 202 270 363 225 54
4317 54 260 265 145 135 171 122 311 178 31 88 177 176 118 207 310 199 155 181 194 176 229 177 129 111 140 208 217 64 117 152 199 176 64
3930 64 118 120 44 129 227 109 145 176 107 130 194 130 180 13 67 95 198 149 136 89 147 133 266 315 285 167 71 12 58 128 117 70 102
3542 102 140 120 147 166 125 14 190 150 173 166 94 216 75 95 159 145 209 8 123 61 48 149 147 86 227 241 31 58 142 247 123
3178 123 56 202 862 1390 634 249 105 151 133 153 132 156 49 210 477 343 112 273 511 681 348 44 5 136 155 267
2873 267 172 25 92 207 68 120 263 246 175 237 124 221 267 253 303 140 156 155 144 210 360 252 50 9 188 104 71 112 253 81
2521 81 163 188 127 258 113 73 89 69 31 126 191 61 138 108 92 105 59 134 83 80 21 246 171 74 108 211 140 226 200 96 150 73 73
2134 73 109 91 55 169 269 270 137 201 149 197 209 292 96 66 63 114 171 138 90 192 359 221 76 89 75 74 65 9 93 89 67 56 125 113
1735 113 100 46 80 25 113 23 70 147 28 48 156 127 124 80 164 154 86 197 118 140 134 171 174 129 23 143 50 143 66 10 182 55 62
1347 62 103 39 34 97 196 124 180 183 37 64 248 130 79 120 144 137 177 151 127 64 210 289 154 162 125 81 75 142 185 159 0 103 58 145
948 145 264 198 83 35 76 45 148 235 227 112 19 69 28 30 110 130 147 164 150 199 127 42 77 126 206 152 114 207 231 158 109 204 136 152
549 152 77 58 30 187 166 48 179 173 154 12 108 66 73 111 217 111 59 42 123 149 17 79 213 136 136 27 99 94 127 64 105 52 135
162 135 201 239 196 146 140 136 153 76 133 142 18 87 79 162 141 147 115 44 131 105 86 61 82 185 50 163 152 67 81 122
-190A22
##PAGE=	F1=-190.634
##FIRST=	25169.313707327481097,	5807.6787752999953227,	0.32154035568237304688
##DATA TABLE=	(F2++(Y..Y)), PROFILE
5808 57 260 63 47 142 69 118 182 240 226 144 222 173 103 122 57 49 99 70 131 76 183 125 126 122 128 137 21 60 164 206 154 200 210 268 94
5397 94 223 109 68 59 299 205 49 86 170 171 77 186 242 221 240 247 111 150 179 120 59 185 172 128 106 25 230 110 93 133 263 251
5021 251 121 170 78 85 80 55 112 140 56 108 72 144 57 153 259 111 212 132 56 88 78 128 107 168 10 239 76 71 50 215 104 89
4646 89 97 61 76 155 118 16 124 241 27 159 71 59 85 153 214 152 230 219 117 220 136 66 186 178 216 285 207 90 221 221 135 155
4270 155 180 104 317 186 70 71 190 189 144 220 334 214 162 181 194 172 201 161 159 134 193 277 226 77 104 172 204 136 95 133 97 25 93
3883 93 223 97 175 210 91 125 197 133 207 16 82 156 215 122 133 48 166 119 287 306 262 106 116 66 111 196 137 50 93 150 73 109
3507 109 181 112 38 178 162 221 172 88 212 76 105 176 163 242 29 125 106 85 176 249 127 224 239 35 158 96 223 100 96 174 271
3143 271 671 295 200 48 152 56 203 88 102 190 335 317 288 120 184 349 574 438 75 81 138 171 159 43 49 69 189 148 146
2803 146 304 303 176 239 205 233 293 239 261 148 136 156 141 207 314 243 35 40 214 93 93 159 246 70 179 134 88 208 85 69 24
2439 24 7 64 141 230 77 155 104 83 88 49 121 104 67 43 244 144 98 56 183 117 194 202 91 142 66 94 104 58 63 121 233 230 89 186
2040 186 139 164 230 268 79 70 95 114 144 197 103 162 323 219 54 37 62 35 38 30 69 105 62 31 146 123 110 18 69 40 103 26 109 183
1641 183 35 69 189 148 108 72 200 134 97 219 102 64 119 142 167 96 56 143 98 121 47 31 135 33 60 68 22 44 110 240 158
1277 158 153 160 71 86 279 163 66 111 124 139 229 159 72 51 192 296 155 178 68 94 83 184 256 152 30 141 82 130 230 169
925 169 115 95 53 41 201 265 270 214 14 63 56 57 93 142 173 174 120 206 111 43 44 96 176 107 111 185 237 154 54 175 95 160 110 68 39 178
502 178 125 94 200 130 159 33 101 30 89 122 261 125 58 40 125 154 38 61 224 140 186 50 86 122 143 65 82 70 57 239 244 170
127 170 154 138 136 140 55 127 182 23 109 98 188 181 145 30 145 159 120 104 78 66 151 68 133 125 68 79 117
-190A17
##PAGE=	F1=-292.892
##FIRST=	25169.313707327481097,	5807.6787752999953227,	0.29096460342407226563
##DATA TABLE=	(F2++(Y..Y)), PROFILE
5808 49 236 64 40 116 34 114 186 221 181 88 224 171 143 171 89 24 131 36 197 139 169 79 114 122 127 102 85 33 153 194 152 205 195
5420 195 257 97 232 114 42 65 305 189 98 91 140 145 71 174 207 213 273 276 75 245 259 127 55 209 225 144 115 24 223 137 111
5056 111 126 238 251 133 191 77 33 50 56 155 147 119 62 74 106 45 145 263 69 216 129 68 61 76 137 73 172 8 239 38 106
4693 106 68 218 82 113 110 47 32 128 97 56 149 249 27 97 81 11 58 197 238 169 247 171 81 221 183 24 188 141 159 199 181
4329 181 116 174 181 147 180 189 76 303 198 123 54 214 212 162 212 335 208 130 157 175 160 168 130 188 185 234 314 216 99 101 186 202 91 129
3930 129 175 81 71 65 219 92 171 208 83 109 164 116 233 43 108 204 202 92 123 7 179 91 278 269 220 90 148 121 165 244 166
3566 166 29 89 164 37 64 184 88 59 139 177 228 150 79 195 45 144 206 168 279 91 128 154 115 214 339 176 214 186 95 261
3214 261 37 218 112 46 278 702 1420 782 272 72 175 53 243 56 77 342 818 1094 962 345 550 1786 2615 1599
2932 1599 327 183 159 223 108 44 80 64 160 194 141 320 316 171 224 271 251 309 234 210 169 89 138 130 200 236 196 47 89 216 102
2568 102 94 214 227 98 183 90 36 161 109 114 64 50 87 151 253 86 166 99 88 94 49 125 104 63 68 236 112 123 8 168 94 135
2193 135 180 89 134 60 114 104 32 97 75 206 198 45 161 121 143 232 225 79 68 107 110 121 261 120 115 271 206 31 19 60 38 6 45
1805 45 84 123 58 56 176 136 119 27 62 53 97 33 141 202 64 118 213 173 96 77 226 100 107 200 66 55 116 125 163 60 82 137 140 98
1406 98 58 51 92 29 86 43 17 63 114 265 184 115 108 114 100 283 185 42 85 99 134 262 142 16 24 184 293 157 192 5 102 92
1031 92 211 308 133 61 170 113 90 187 133 151 155 33 28 239 275 291 291 25 64 79 95 68 148 188 157 84 216 102 36 36 53 161 70
643 70 111 160 233 141 92 185 58 143 126 82 63 185 65 158 209 89 172 52 105 1 104 142 288 134 63 47 131 145 69 36 230
279 230 126 234 83 63 158 156 60 46 96 53 257 217 128 155 143 128 123 54 107 209 24 136 120 199 224 133 61 234 163 119 120 103 53
-108 53 125 83 118 124 90 74 89
-190H9
##PAGE=	F1=-395.15
##FIRST=	25169.313707327481097,	5807.6787752999953227,	0.23386704921722412109
##DATA TABLE=	(F2++(Y..Y)), PROFILE
5808 39 204 74 19 82 14 110 179 201 140 59 221 162 165 218 113 68 186 25 243 201 168 60 105 111 167 188 143 51 135 181 150 192
5432 192 165 217 91 225 114 44 52 282 165 142 82 113 94 70 153 155 190 289 274 72 311 324 176 115 232 273 159 130 46 178
5080 178 152 143 137 183 237 143 179 68 18 20 98 187 155 190 10 81 80 55 114 243 21 210 122 81 28 78 145 66 155 26 212 43 136
4693 136 81 192 65 122 126 58 12 99 81 111 212 251 42 57 95 69 35 223 241 182 252 129 40 225 224 55 179 114 100 125 156
4329 156 128 126 152 156 202 200 51 270 216 179 42 242 238 168 184 313 180 67 135 143 146 138 87 204 234 259 317 187 134 104 190 200 51
3941 51 161 218 96 100 46 213 87 135 165 73 89 102 92 252 63 143 226 167 67 115 27 181 52 243 207 170 119 160 170 207 261
3578 261 191 20 92 177 26 25 171 52 73 76 194 203 108 76 167 21 207 249 158 312 173 127 196 133 252 395 218 196 97 163
3225 163 361 137 234 150 115 449 1685 2929 1620 404 142 232 96 285 56 148 460 1168 1728 1568 600 1119 3619
2955 3619 5172 3073 683 292 208 301 128 91 122 88 132 201 112 313 285 155 196 306 261 315 252 157 200 52 113 123 185 136
2627 136 130 76 135 200 133 70 265 193 119 164 75 54 158 143 153 122 79 101 152 256 97 173 98 106 129 64 142 97 67 83 224 74 141
2239 141 51 161 80 73 145 110 159 72 126 118 59 132 44 192 181 17 129 93 130 215 171 82 64 98 106 95 300 129 57 202 179 10
1864 10 32 69 46 26 49 145 141 53 95 202 158 134 61 75 56 91 51 156 199 100 171 226 197 102 83 234 63 116 147 64 125 135 151 167
1465 167 47 82 133 168 81 73 61 81 49 125 61 24 81 96 264 191 75 40 156 102 265 196 17 48 78 126 271 115 73 23 181
1101 181 272 155 199 89 108 92 219 331 106 89 190 144 35 154 100 180 189 28 22 256 261 287 329 29 81 100 140 48 141 176 109
737 109 59 218 108 26 76 10 173 74 115 135 217 131 161 228 58 107 117 86 85 204 20 222 200 53 185 71 100 28 125 169 291
373 291 134 72 68 147 128 103 23 224 93 267 117 23 177 161 51 21 128 149 246 161 81 146 145 114 104 68 75 217 22 166 139
9 139 190 254 111 135 289 140 97 131 129 51 114 98 117 145 118 73 49
-190D9
##PAGE=	F1=-497.407
##FIRST=	25169.313707327481097,	5807.6787752999953227,	0.4381993412971496582
##DATA TABLE=	(F2++(Y..Y)), PROFILE
5808 27 165 87 23 64 64 109 172 197 106 77 214 146 174 255 133 98 224 58 264 250 181 69 92 91 212 275 166 80 111 165 146 163
5432 163 125 157 76 205 115 59 22 239 142 173 65 95 25 80 124 102 159 294 246 106 338 361 239 193 250 302 164 152 85 103 146
5068 146 177 168 104 209 157 135 54 58 8 129 211 160 253 51 87 77 56 72 208 47 202 117 106 29 71 154 97 121 64 165 85 156
4693 156 90 148 80 114 132 89 43 79 78 162 264 247 54 92 107 102 47 228 225 188 241 98 22 233 248 102 162 119 52 80 133 136 95 136
4294 136 158 218 216 44 223 233 234 50 266 255 159 141 275 140 42 145 105 135 117 45 207 265 267 293 138 174 105 181 207 40 185
3930 185 241 127 109 32 201 70 85 91 55 78 31 75 259 74 183 220 124 51 110 55 177 22 190 133 132 150 152 202 230 243 203 34
3554 34 98 184 34 9 142 9 76 21 210 181 75 85 135 100 280 299 137 329 260 119 225 134 281 408 243 169 17 232
3225 232 450 262 263 197 284 657 2901 4739 2577 553 228 304 129 329 74 253 542 1383 2179 2043 848 1721 5511
2955 5511 7761 4560 1074 389 271 381 172 108 188 126 139 183 95 283 223 132 167 307 256 309 287 110 230 106 91 133 165
2639 165 77 108 108 177 175 171 29 301 144 118 120 92 118 198 153 165 151 80 115 141 241 116 173 103 124 176 87 167 108 79 86 208 33 143
2239 143 92 154 76 65 105 146 212 101 131 146 92 157 32 187 178 13 97 55 119 184 118 75 63 76 108 62 303 134 8 121 133
1876 133 9 39 87 60 55 43 208 154 51 128 219 183 156 82 97 47 85 79 150 174 134 213 230 210 136 78 222 47 125 76 126 186 167
1488 167 191 178 74 67 145 173 73 78 56 103 71 161 97 42 95 66 235 172 69 48 191 94 235 191 37 10 61 120 267 110 137
1124 137 71 177 229 143 195 175 124 79 209 324 73 108 198 168 42 150 82 197 198 23 42 252 224 257 323 38 110 121 185 45
772 45 124 136 37 70 204 133 14 113 36 199 105 116 108 190 148 214 277 99 72 83 95 98 221 73 267 172 36 195 92 83 63 148
397 148 199 266 122 81 97 171 110 135 32 206 49 270 144 56 171 154 47 43 160 223 207 91 48 127 137 97 93 73 38 205 22
33 22 193 145 164 262 81 195 308 95 66 140 149 67 118 114 112 165 140 72 14
-190A4
##PAGE=	F1=-599.665
##FIRST=	25169.313707327481097,	5807.6787752999953227,	0.5137920379638671875
##DATA TABLE=	(F2++(Y..Y)), PROFILE
5808 20 123 99 58 75 107 115 182 211 74 104 202 129 173 273 153 106 230 85 258 279 194 84 75 69 236 326 153 98 80 143 131 120
5432 120 84 89 57 174 125 85 28 186 126 186 65 85 79 119 98 81 139 305 201 153 330 363 294 267 256 309 153 174 131 25 116 201
5056 201 209 24 168 178 75 36 80 33 139 228 163 296 93 89 84 51 52 171 94 193 117 133 60 57 162 124 77 110 126 123 164 92 102 107
4657 107 91 122 121 103 76 89 195 287 232 61 139 111 98 61 210 196 184 216 74 56 237 252 131 141 147 63 67 111 152 104 129 163 227
4270 227 233 50 169 241 279 75 280 254 133 88 231 108 114 178 69 132 112 14 204 272 265 257 68 200 96 155 222 63 196 237
3918 237 149 101 26 180 47 70 27 34 84 58 74 251 79 219 192 87 51 104 80 171 52 129 58 125 169 135 209 230 197 199 55 104
3542 104 180 51 25 98 38 71 91 220 200 100 102 107 182 346 342 114 320 335 107 245 120 292 379 244 130 99 288 520 367
3202 367 294 235 439 840 3964 6270 3364 674 300 362 151 362 87 345 587 1489 2456 2351 1050 2224 7057 9817
2944 9817 5729 1409 459 322 436 203 106 263 158 184 163 127 239 150 107 146 274 234 290 323 79 256 186 82 165 161 145
2627 145 164 132 211 155 204 29 311 89 99 59 118 177 235 131 147 146 64 134 128 216 139 165 113 133 217 111 193 142 91 78 190 25
2251 25 126 122 139 77 103 68 180 265 133 134 179 111 170 31 186 181 9 77 27 113 154 77 53 71 50 120 40 271 147 65 32 72 24
1864 24 43 110 96 77 31 249 159 59 150 230 200 180 81 110 28 89 106 123 138 159 236 220 203 181 69 191 66 134 44 194 225 195
1488 195 206 186 104 81 179 156 69 74 34 126 88 183 127 68 101 78 183 128 110 111 218 83 204 171 63 20 45 124 266 137 187 120
1113 120 167 167 120 183 250 151 54 193 288 32 116 196 179 90 170 84 202 188 26 68 226 171 204 279 63 142 143 220 52 112 84 52
737 52 106 178 174 16 131 64 220 131 111 78 155 194 240 310 136 59 47 127 98 228 116 275 131 52 196 118 54 97 168 225 216 98
361 98 86 124 193 100 155 42 174 29 234 161 124 143 133 65 62 182 258 158 28 54 105 115 83 106 56 22 176 29 207 132 132 250
-14 250 53 239 297 41 71 149 159 104 135 129 89 176 151 62 23
-190B3
##PAGE=	F1=-701.923
##FIRST=	25169.313707327481097,	5807.6787752999953227,	0.44017109274864196777
##DATA TABLE=	(F2++(Y..Y)), PROFILE
5808 36 83 105 91 93 133 127 210 229 45 121 186 119 164 264 173 94 204 97 228 281 192 89 57 51 234 340 116 98 43 117 103 73
5432 73 52 27 52 139 142 129 83 137 110 185 95 78 175 178 95 111 150 340 147 203 296 330 330 326 249 297 126 193 175 98 61 206 240 69 122
5021 122 200 64 18 83 52 129 238 166 310 114 83 77 46 86 152 128 182 121 145 79 66 160 127 32 156 139 147 165 93 81 119 63 97
4634 97 145 186 90 110 201 278 202 67 168 103 59 70 174 162 168 179 56 86 230 238 141 117 173 109 65 92 180 136 125 172 227 244 50
4247 50 119 228 306 98 280 226 94 38 191 95 170 202 42 137 124 23 198 255 265 224 21 205 68 112 238 95 193 208 150
3906 150 80 42 151 47 103 95 33 93 112 81 232 84 241 152 69 69 99 106 161 89 74 14 139 178 119 188 208 141 184 79 111 164 78
3519 78 40 56 81 63 164 220 245 147 118 86 249 389 365 102 280 383 102 261 104 282 321 220 81 155 323 564 432 314
3190 314 252 537 939 4552 7054 3753 725 335 385 161 368 99 403 588 1514 2573 2474 1169 2515 7898 10857
2944 10857 6302 1605 490 342 445 208 96 325 168 234 157 175 193 89 82 141 214 199 259 343 77 276 253 85 219 194
2639 194 218 228 145 232 147 223 70 297 75 72 20 143 223 250 85 108 112 64 154 127 186 157 145 125 129 237 134 219 174 87 61 171
2263 171 70 91 145 115 80 127 36 197 295 155 142 207 115 174 40 184 177 1 77 71 119 140 60 25 89 29 139 80 215 172 121 54
1887 54 28 40 51 134 143 94 29 255 152 75 161 238 200 196 57 106 6 105 122 80 106 176 237 195 175 213 78 149 86 143 92 246 242 206
1488 206 185 187 120 132 221 124 68 70 17 140 105 183 144 100 98 130 118 66 150 156 238 71 177 135 71 38 38 134 280 172 214 158 148 100 87
1077 87 165 307 181 45 181 228 37 113 184 170 115 190 101 199 171 60 91 184 112 136 209 97 170 165 237 63 127 78 144 148 158 220
702 220 49 127 79 222 141 97 43 123 249 242 318 150 68 71 173 85 223 133 241 94 79 185 147 21 127 175 235 148 68 97 140
338 140 197 97 157 45 132 63 157 168 180 97 99 95 64 188 253 127 28 72 86 81 78 139 24 43 138 41 204 101 106 227 48 264 268
-49 268 15 118 158 157 155 162 140 47 180 151 38 29
-190B9
##PAGE=	F1=-804.181
##FIRST=	25169.313707327481097,	5807.6787752999953227,	0.35671305656433105469
##DATA TABLE=	(F2++(Y..Y)), PROFILE
5808 60 58 107 112 100 137 143 241 243 59 127 167 120 147 229 185 68 155 94 182 257 168 79 48 35 214 327 79 77 12 88 60 65 42 15 61 106
5385 106 158 182 139 108 91 183 126 74 265 236 117 148 182 393 89 246 248 268 340 364 230 270 91 205 205 187 14 192 248 129
5033 129 90 213 127 10 71 67 104 241 165 290 110 68 54 48 137 156 143 160 122 135 81 101 140 102 9 196 188 159 160 104 92 112 57 63
4634 63 155 268 106 134 183 245 158 77 179 83 12 102 124 125 137 137 48 103 208 216 143 94 182 147 71 85 209 162 114 176 220 241 45 82
4235 82 192 305 108 272 169 60 43 162 93 189 206 27 145 146 46 192 220 274 202 114 195 22 64 242 132 185 160 131 52
3894 52 73 125 79 127 159 52 96 138 91 208 94 242 113 66 96 99 136 141 117 44 42 151 180 111 140 173 99 166 106 120 142 103 52 73
3495 73 117 57 222 215 278 183 129 74 287 397 358 101 212 395 116 283 107 250 251 177 44 168 331 578 452 311 240 559
3167 559 924 4511 6889 3652 687 320 365 159 340 126 418 541 1467 2533 2401 1177 2525 7835 10631 6140
2932 6140 1613 480 321 398 190 81 360 152 262 164 202 157 54 54 151 137 157 223 334 94 289 293 93 284 249 249 264 141
2603 141 237 145 227 94 268 127 46 77 169 253 239 32 81 62 98 165 142 156 166 112 131 113 225 164 243 186 58 39 156 118 43
2239 43 165 91 81 128 15 191 291 164 155 223 112 175 63 176 155 7 85 132 142 142 71 38 116 15 155 137 153 201 170 129 91
1876 91 63 72 155 185 110 42 225 132 86 165 245 182 196 38 95 31 125 123 28 87 188 224 156 129 218 107 104 92 147 131 272 239 196 135
1477 135 181 119 182 258 94 69 75 61 145 127 162 146 131 87 179 59 29 167 177 253 61 159 87 57 43 49 139 305 199 212 174 119 52
1089 52 49 149 338 205 75 177 159 101 99 161 139 115 194 122 195 159 103 110 134 57 62 132 131 193 183 230 85 167 133 229 191 165 259 93
690 93 102 80 204 133 75 9 108 293 225 299 139 84 120 214 66 210 121 171 98 103 164 177 21 148 164 220 75 52 129 147 175 97 140
303 140 42 87 94 51 176 210 45 60 124 56 175 224 132 49 80 75 47 81 170 34 56 106 52 186 64 91 206 66 269 235 44
-61 44 160 162 144 213 192 142 5 180 143 7 17
-190A7
##PAGE=	F1=-906.439
##FIRST=	25169.313707327481097,	5807.6787752999953227,	0.34499388933181762695
##DATA TABLE=	(F2++(Y..Y)), PROFILE
5808 84 62 110 120 95 120 159 257 252 97 123 148 131 121 175 185 37 96 86 131 216 124 55 58 14 192 304 72 37 43 66 15 111 50 35
5409 35 68 80 164 225 186 108 68 186 144 77 335 277 143 171 211 446 36 271 193 190 325 379 206 235 75 205 210 253 94 166 224
5045 224 167 100 212 189 30 50 77 71 234 159 246 91 49 45 56 184 174 141 128 118 104 77 140 97 56 43 225 232 161 151 122 109 97
4657 97 81 31 150 324 115 158 153 197 106 87 176 54 70 159 68 91 92 95 56 106 172 194 148 73 173 168 87 91 227 171 95 162 202 219 46
4247 46 59 136 271 102 267 89 78 84 140 83 168 190 27 151 168 66 185 177 289 193 206 185 36 49 227 171 180 109 100 17 110 124
3871 124 115 123 193 67 91 132 103 187 111 220 83 73 119 106 167 109 133 57 50 148 174 110 77 136 92 152 137 136 119 115 54 124 147 52 261
3460 261 211 281 197 131 61 293 371 318 98 128 370 145 310 126 203 190 127 74 138 313 562 433 279 202 507 801 3882 5869
3132 5869 3122 569 264 307 143 284 164 390 449 1344 2331 2137 1066 2256 6887 9204 5288 1432 437 263 303
2885 303 162 63 364 110 254 174 198 135 37 29 168 61 119 190 294 111 292 301 98 344 293 230 264 123 221 140 218 94 236
2545 236 183 30 127 201 265 210 32 107 22 139 165 162 128 162 66 129 90 182 204 266 175 11 12 148 161 16 184 84 81 123 42 164
2169 164 253 159 168 224 111 177 90 159 108 19 89 189 174 148 94 80 150 10 163 181 111 222 209 185 157 96 107 167 208 127 58 174
1793 174 104 87 166 248 153 176 76 102 59 138 112 24 76 200 206 112 75 191 134 66 81 140 143 272 222 166 86 176 103 208 278 83 69
1406 69 97 116 141 156 124 134 153 72 204 57 91 159 175 264 59 147 33 27 36 69 128 327 219 179 161 82 61 28 140 342 217 109
1031 109 170 111 171 84 134 91 115 175 139 198 164 140 121 82 25 14 63 157 214 191 197 118 213 190 296 228 191 280 136 64 74 164 110 57
631 57 32 120 312 197 257 109 108 153 238 56 194 88 83 138 120 134 205 53 160 133 176 50 64 179 155 126 97 109 34 48 125 100
256 100 198 215 39 43 145 53 141 197 155 57 85 74 51 89 181 76 51 97 56 163 62 80 197 90 255 203 57 179 158 126 266
-108 266 217 136 57 174 131 34 17
-190A7
##PAGE=	F1=-1008.7
##FIRST=	25169.313707327481097,	5807.6787752999953227,	0
##DATA TABLE=	(F2++(Y..Y)), PROFILE
5808 102 81 118 114 94 88 171 253 257 119 110 129 147 92 123 172 21 40 77 83 176 72 26 82 29 182 279 91 11 77 58 38 160 60 34
5409 34 66 74 158 244 214 116 55 191 147 79 378 293 159 179 223 477 34 272 137 113 290 373 180 200 101 189 184 286 168 146 173
5045 173 187 133 194 230 56 34 86 34 221 151 193 80 33 74 75 218 195 128 92 107 66 86 172 46 56 73 241 253 161 137 134 118 95
4657 95 111 15 126 337 111 175 131 145 56 90 164 23 117 217 22 71 55 68 83 99 126 178 158 60 147 174 103 95 228 163 74 132
4282 132 172 178 59 49 89 207 87 276 45 129 115 119 64 117 163 36 148 179 77 172 135 295 186 277 186 88 84 192 204 184 68
3918 68 77 29 148 156 143 94 198 73 79 98 117 169 128 182 66 86 130 111 194 68 138 78 39 128 158 110 45 111 97 150 172 160 98 108
3519 108 44 166 173 46 287 219 254 192 123 42 271 316 252 91 44 316 178 333 141 152 151 82 120 79 276 523 385 219 150
3178 150 402 603 2862 4316 2330 404 185 224 113 213 193 327 322 1141 1976 1717 854 1774 5285 6930 3956 1111
2920 1111 374 190 178 140 37 340 51 207 185 164 122 28 48 183 56 94 167 228 118 283 277 104 381 305 174 234 95 185
2592 185 127 198 73 204 215 26 159 240 260 173 62 150 41 174 157 171 102 149 25 122 67 117 247 287 150 67 21 145 195
2251 195 70 198 103 82 140 84 121 190 149 175 208 119 185 113 133 42 53 81 232 201 145 111 117 186 22 163 201 111 226 234 218 205 138
1864 138 153 168 206 142 69 127 73 79 163 242 123 138 127 133 78 144 97 69 62 209 189 70 31 134 143 39 60 115 131 249 197 119 91 176
1465 176 79 203 274 89 66 135 170 133 185 79 110 155 58 202 96 152 142 155 269 72 137 24 36 21 88 96 329 238 116 124 43
1101 43 82 47 143 321 212 124 153 129 234 83 115 36 150 139 145 217 186 159 121 45 33 60 25 169 234 186 146 154 254 227 336 252
725 252 210 274 166 32 67 109 86 66 57 145 298 162 204 73 134 157 244 74 178 50 27 176 129 105 229 77 164 92 111 110 85
361 85 229 177 57 107 86 27 49 170 227 233 203 86 63 158 63 93 190 171 73 106 80 93 101 159 107 33 114 51 148 104 70 201 115 227
-38 227 175 61 175 146 111 304 229 121 94 155 120 57 48
-190D8
##PAGE=	F1=-1110.95
##FIRST=	25169.313707327481097,	5807.6787752999953227,	0
##DATA TABLE=	(F2++(Y..Y)), PROFILE
5808 113 92 127 94 120 50 176 232 249 106 85 112 160 64 102 150 34 8 66 44 157 35 48 109 72 182 253 108 57 99 57 67
5444 67 191 68 36 68 88 144 233 217 113 68 186 149 72 390 282 157 176 218 473 81 249 89 69 243 352 154 169 143
5115 143 159 132 284 222 149 104 199 159 161 247 85 29 96 17 204 146 151 97 24 101 101 236 209 108 61 93 39 111 193 59 125 106 243
4728 243 248 163 117 130 122 108 136 26 86 299 97 182 129 91 32 84 147 10 134 254 50 84 81 85 124 85 81 160 169 60 108 171 109 87
4329 87 212 156 64 92 131 120 73 43 113 125 85 292 114 176 132 92 45 54 137 50 135 171 78 149 105 274 174 316 189 122 111 144
3953 144 222 189 47 89 75 180 196 161 52 183 75 63 59 133 145 139 140 67 107 123 103 209 34 134 88 49 95 134 106 91 105 90
3578 90 158 206 191 83 84 23 183 197 39 306 238 209 176 109 15 236 244 178 96 22 248 206 338 139 106 137 52 150 8 227 469
3214 469 324 138 97 275 381 1723 2644 1485 235 117 136 71 145 199 247 178 872 1505 1208 583 1195 3403 4340 2457
2932 2457 727 305 145 63 134 3 298 26 129 194 122 115 38 93 193 115 86 147 154 113 261 234 116 381 276 123 187 65
2603 65 134 108 174 42 164 213 36 170 276 240 136 70 177 60 201 151 159 73 126 48 122 52 46 280 304 126 137 50 143 215 124
2239 124 202 130 88 185 131 73 116 147 173 178 137 197 129 106 54 108 66 254 215 131 112 139 216 37 162 191 137 214 242 230 228 183 201 156
1840 156 178 148 72 111 51 76 149 224 99 92 164 162 81 139 90 100 42 207 170 39 57 66 135 29 50 71 102 212 169 65 133 180 51
1453 51 174 248 90 64 180 213 123 209 52 80 135 49 179 129 200 154 122 271 102 127 70 80 8 102 48 304 256 32 81 12 85
1089 85 69 152 281 190 112 125 184 282 111 126 8 206 111 142 244 213 156 108 47 45 88 32 164 249 167 97 185 282 241 346 253 203
714 203 241 172 34 65 55 84 97 65 167 255 122 149 48 152 129 235 105 161 36 81 193 126 90 247 88 163 63 65 178
373 178 96 261 207 42 138 110 30 92 226 331 262 190 124 85 165 75 36 194 176 104 152 96 135 113 108 122 33 135 49 144 146 76 214
-14 214 140 191 147 68 158 132 105 317 223 104 104 128 116 62 75
-190G5
##PAGE=	F1=-1213.21
##FIRST=	25169.313707327481097,	5807.6787752999953227,	0
##DATA TABLE=	(F2++(Y..Y)), PROFILE
5808 119 90 127 67 162 22 172 203 213 56 49 100 166 47 115 123 46 25 44 13 153 33 90 136 119 182 224 115 91 104 52 70 195
5432 195 77 61 93 109 131 197 192 94 100 162 165 50 369 253 139 166 203 431 127 212 59 84 203 322 134 144 176 116 80 251
5080 251 244 167 32 211 166 119 242 116 29 104 47 184 151 130 123 15 101 128 237 213 80 43 86 33 135 202 108 197 147 231 222 171
4704 171 92 114 126 116 155 51 63 220 90 177 132 45 52 69 125 30 118 259 97 117 133 133 171 76 60 135 175 74 62 165 99 75
4329 75 188 170 75 59 91 65 79 35 180 60 102 301 175 206 133 55 45 21 119 65 114 143 82 116 97 221 150 313 178 129 113
3965 113 93 219 186 56 126 121 200 221 170 12 160 87 45 80 145 107 141 113 97 136 96 78 207 54 124 84 90 54 102 96 140 110 67
3578 67 170 231 224 83 48 14 174 216 45 320 261 163 154 96 20 207 169 131 128 60 177 226 318 118 76 135 40 155 67 179 408
3214 408 262 47 59 155 186 725 1227 768 108 95 82 30 98 177 176 60 572 990 701 310 643 1639 1979 1104 362 241 159
2897 159 98 140 36 246 95 47 194 110 127 60 139 196 167 88 123 97 100 229 188 142 343 209 143 143 38 79 84 149 34 115 183 58
2521 58 162 298 208 104 56 173 63 222 153 125 42 95 81 129 43 34 295 316 113 190 73 136 219 173 197 147 103 236 179 58
2169 58 54 160 161 144 162 209 140 95 133 172 59 248 209 107 97 145 234 51 167 155 157 186 233 228 230 226 238 134 130 143 64 115 50 91 118
1758 118 197 79 57 177 172 64 122 98 115 26 188 145 24 111 58 119 51 71 20 68 173 142 13 167 185 30 137 202 74 72
1406 72 216 243 115 222 66 65 91 40 152 155 234 200 85 269 142 119 106 115 18 109 40 254 267 60 81 7 79 76 155 231 151 76
1031 76 93 234 308 156 166 31 253 119 141 264 230 135 88 70 48 87 37 142 251 136 98 208 291 231 325 230 167 187 149 41
678 41 64 57 106 126 53 179 192 82 95 42 152 76 216 133 140 50 117 184 116 91 255 83 159 77 102 233 92 263 227 110 185 165
303 165 43 145 277 391 269 183 145 101 169 83 25 190 171 135 209 124 162 121 48 126 63 145 72 138 172 106 231 163 152 114 80 147
-73 147 121 109 302 200 99 83 128 127 57 91
-190I1
##PAGE=	F1=-1315.47
##FIRST=	25169.313707327481097,	5807.6787752999953227,	0
##DATA TABLE=	(F2++(Y..Y)), PROFILE
5808 123 73 110 43 198 45 164 172 143 34 16 93 160 37 132 95 48 36 31 11 148 36 121 159 159 180 199 117 103 92 37 45 171 88
5420 88 95 132 128 127 148 147 62 138 120 194 17 318 214 112 151 189 358 165 174 57 113 187 289 128 126 193 69 89 198 230 183 36
5045 36 220 151 86 222 146 33 110 76 161 159 115 143 20 72 150 226 204 43 46 96 21 147 198 133 252 195 203 185 185 66 109 135 104
4657 104 171 85 102 127 100 162 125 59 74 52 98 46 90 230 140 148 174 182 216 85 84 101 177 95 15 158 82 79 170 208 108 43 80 88 75
4247 75 21 237 97 116 294 200 211 118 8 78 50 117 77 93 103 105 73 113 137 116 272 145 113 92 52 194 168 86 166 160 204 218 169
3859 169 21 140 116 33 142 147 59 129 118 150 170 55 61 185 89 110 70 128 13 64 78 172 109 36 180 243 252 111 12 37 145 232
3484 232 71 323 275 129 134 90 61 197 104 139 171 65 110 236 274 98 66 134 41 135 127 143 347 209 43 52 65 93 151 346 285
3120 285 66 108 113 48 78 133 157 108 295 523 293 111 228 305 258 134 82 185 184 174 154 76 189 159 83 178 142 160 78 178 194
2756 194 207 99 93 76 87 196 157 174 274 126 203 123 10 30 62 129 62 83 138 89 140 298 167 79 35 141 62 233 158 76 40
2392 40 62 94 135 33 80 289 319 109 210 85 122 202 210 189 149 125 275 225 98 58 178 142 123 189 215 149 119 198 230 73 213
2028 213 181 77 87 137 237 67 176 99 159 150 209 217 217 260 259 111 85 125 46 107 57 120 70 168 53 58 166 159 30 94 123 117 29 151
1629 151 112 31 166 122 113 91 101 60 46 147 117 33 180 184 35 114 147 45 96 230 259 106 222 94 82 37 30 139 178 256 250 51
1254 51 264 183 119 130 134 37 105 93 196 262 142 123 16 86 67 145 182 99 42 69 265 312 203 216 37 273 153 159 265 225 111
890 111 77 86 44 60 38 105 237 100 143 224 284 203 277 183 109 127 99 28 58 94 126 142 30 185 133 54 44 56 136 20 186 149 109
502 109 56 125 158 106 96 251 64 149 105 153 268 80 229 223 164 234 218 55 197 307 400 243 177 146 117 168 85 78 171 161 159 263
127 263 165 170 118 81 131 91 136 111 118 180 145 251 182 115 74 96 147 121 119 261 171 113 35 176 151 74 95
-190I5
##PAGE=	F1=-1417.73
##FIRST=	25169.313707327481097,	5807.6787752999953227,	0
##DATA TABLE=	(F2++(Y..Y)), PROFILE
5808 129 49 80 31 209 78 155 143 55 125 40 91 144 30 142 63 39 55 73 33 133 39 128 173 188 181 194 116 92 72 18 4 123
5432 123 100 126 169 141 128 107 95 32 174 69 222 26 247 176 100 128 181 267 187 145 75 130 194 256 139 110 191 41 140 142 186 187
5056 187 88 220 121 93 201 175 50 108 95 134 158 99 151 51 36 166 211 183 39 70 116 10 145 185 122 281 241 158 147 195
4704 195 53 139 146 74 189 122 157 73 120 143 104 115 85 48 69 59 101 176 175 167 190 215 250 113 118 64 170 119 22 149 75 107 174 252
4305 252 161 49 111 156 63 15 268 155 115 276 189 189 91 61 133 62 132 81 81 61 137 32 134 40 79 202 96 93 56 24 151 138
3930 138 124 194 187 188 184 156 33 133 156 41 199 134 45 104 138 211 205 13 95 148 110 96 59 144 21 21 51 186 98 19 183 234 268
3542 268 153 23 53 111 244 107 308 267 108 119 95 109 201 64 173 207 40 54 236 215 114 76 133 51 97 173 128 291 171
3202 171 117 73 28 128 398 336 77 68 125 172 84 72 82 194 178 90 187 79 140 94 463 673 392 84 138 188 214 171 114 131 208
2838 208 154 148 182 199 86 209 189 235 122 70 69 77 172 145 200 200 88 244 130 34 0 58 112 91 112 100 118 117 275 121 60 45 90
2451 90 72 230 160 39 78 40 82 124 21 114 268 311 111 192 88 103 164 227 186 134 153 294 264 152 94 187 123 125 213 210 156 162 236
2063 236 265 93 153 136 47 117 122 229 88 182 34 138 113 177 202 197 283 263 102 87 95 30 79 55 152 39 146 16 76 135 134 25
1688 25 62 158 110 40 105 79 57 216 176 122 132 124 120 62 141 97 58 171 175 55 108 96 54 138 216 263 96 210 117 113 49 40 142 201 267
1277 267 278 31 256 217 131 145 133 55 90 136 148 234 200 159 25 112 48 120 142 36 78 59 276 294 240 262 70 268 183 196 241
913 241 199 113 85 91 36 33 62 58 205 66 184 233 264 165 207 120 53 93 31 22 46 111 124 138 50 193 108 62 20 81 115 68 145 152 68 55
491 55 115 128 109 93 232 37 133 122 180 278 72 163 190 191 271 251 60 242 308 362 188 160 134 141 156 83 121 143 152 174 305 214 153 105
92 105 150 143 108 116 147 87 175 177 271 194 84 28 122 143 139 133 198 162 146 41 240 176 120 89
-190H9
##PAGE=	F1=-1519.99
##FIRST=	25169.313707327481097,	5807.6787752999953227,	0
##DATA TABLE=	(F2++(Y..Y)), PROFILE
5808 138 26 50 28 190 105 153 124 106 208 67 91 123 35 150 26 36 85 131 53 119 64 108 175 203 190 214 115 64 61 38 64 67 108
5420 108 148 196 148 125 83 70 40 205 33 236 60 167 149 120 101 178 171 186 124 106 136 210 226 159 93 173 59 176 104 125 177 129
5045 129 210 82 132 187 201 77 100 101 99 143 98 153 91 69 180 197 157 95 105 134 54 139 165 78 279 275 96 119 193 65 187 159 64
4657 64 212 151 193 108 137 120 79 167 88 62 43 73 156 109 195 168 178 224 267 147 141 47 156 143 46 141 87 141 192 288 227 82 152 212
4258 212 48 36 269 187 97 270 169 142 57 129 198 60 153 72 80 36 160 44 152 60 62 123 40 89 25 23 103 104 153 203 201 158 125
3871 125 131 29 142 197 59 237 108 100 76 152 268 237 31 151 105 108 85 64 130 46 28 26 188 78 45 177 206 266 187 44 55
3507 55 86 253 144 266 231 91 110 105 159 204 59 200 226 5 56 223 155 159 99 132 67 52 202 125 245 152 172 105 36 150 475
3143 475 374 92 53 149 221 104 65 53 234 203 21 33 86 204 137 682 870 489 143 114 175 217 188 149 77 235 195 112 209
2803 209 228 91 232 190 253 147 74 59 74 163 138 207 155 145 252 146 89 8 79 97 112 162 78 136 111 237 73 48 75 57 90
2439 90 208 155 70 117 45 52 97 32 138 244 289 120 141 91 84 108 215 185 106 182 293 293 203 118 174 107 141 230 192 157 202 242 267 102
2040 102 80 81 55 168 110 215 113 179 34 97 87 142 185 180 296 251 115 125 60 44 56 38 180 97 136 42 96 96 114 73 50 192
1664 192 100 47 74 68 98 251 204 129 160 131 163 96 148 88 61 140 156 74 100 63 117 191 176 259 80 189 135 136 103 73 145 219 267 275 28
1254 28 244 233 147 151 118 71 72 152 122 185 223 174 38 141 42 88 110 30 141 58 268 261 258 293 139 249 194 236 197 158 141 99 84 32
854 32 74 102 9 160 43 198 235 239 127 121 53 48 107 60 71 40 96 92 116 99 209 124 104 60 105 113 125 93 146 21 70 105 106 131 82 200
432 200 23 111 123 175 258 80 77 136 191 288 258 57 270 286 295 121 126 121 169 127 75 148 120 144 189 328 261 114 86 197 156 112 107 167
33 167 62 164 196 284 199 60 22 164 124 181 152 129 190 187 104 288 188 169 77
-190G7
##PAGE=	F1=-1622.24
##FIRST=	25169.313707327481097,	5807.6787752999953227,	0
##DATA TABLE=	(F2++(Y..Y)), PROFILE
5808 150 25 54 19 146 119 158 127 217 259 75 96 107 60 163 31 72 115 179 69 117 97 65 162 203 200 246 124 40 72 73 123 47
5432 47 106 160 209 155 112 70 89 73 227 48 231 84 98 133 156 79 181 82 165 109 143 139 217 200 176 76 144 85 182 99 62 154 161
5045 161 197 43 173 180 222 108 93 95 55 121 121 153 130 124 191 186 136 152 138 140 96 134 141 17 250 288 46 117 175 86 227 170 109 239
4646 239 167 197 149 145 96 69 203 86 81 35 89 214 48 198 152 145 203 264 174 145 68 152 164 54 136 101 164 208 310 295 129 182
4270 182 239 33 58 241 187 79 292 185 77 34 187 258 78 165 57 89 49 162 83 166 136 81 60 24 96 28 54 62 78 166
3918 166 194 200 122 67 96 19 160 233 70 249 73 158 71 150 308 263 53 194 81 81 79 79 85 57 72 42 181 58 78 163 159 240 200
3531 200 52 43 74 257 179 202 171 68 108 116 209 196 62 216 227 58 115 197 106 204 123 133 91 23 213 117 215 143 205 135 35 136
3155 136 394 256 119 40 184 253 107 58 62 246 186 34 20 49 212 85 527 595 318 129 128 177 195 199 184 31 239 198 94
2815 94 219 240 100 248 203 259 166 102 82 81 158 118 185 158 215 228 157 150 11 106 82 120 189 57 132 126 194 50 43 98 88 102 171 140
2416 140 115 143 61 49 78 64 153 220 254 135 74 105 71 45 172 176 75 205 275 307 248 128 138 99 154 233 162 148 227 222 230 99 71
2028 71 30 106 210 102 204 133 166 96 54 82 113 169 167 304 227 133 153 47 75 83 9 202 168 128 97 120 70 105 114 70 213 92 53
1641 53 87 88 148 265 204 121 170 120 177 128 153 91 45 96 130 85 78 60 187 246 123 249 62 162 149 145 141 107 134 227 257 247 32 225
1242 225 221 153 146 91 82 83 137 108 124 210 169 54 160 73 64 80 95 195 54 245 219 255 306 214 231 187 266 153 115 171 104 80 43 135
843 135 147 44 113 36 179 226 216 107 28 21 72 135 141 126 60 62 32 86 145 224 150 162 101 112 133 161 37 135 44 105 102 93 163 72 171 41
420 41 88 113 151 215 98 20 80 170 281 241 49 280 255 225 83 80 115 189 82 62 157 114 139 209 334 296 60 77 211 159 110 131
45 131 165 72 149 199 285 193 45 67 210 90 240 169 83 239 225 151 306 176 201 64
-190F4
##PAGE=	F1=-1724.5
##FIRST=	25169.313707327481097,	5807.6787752999953227,	0
##DATA TABLE=	(F2++(Y..Y)), PROFILE
5808 162 44 80 1 98 120 169 153 303 267 69 106 99 91 179 87 135 137 206 75 121 115 12 133 185 199 273 146 55 92 106 165 87 91 164
5409 164 215 164 89 50 117 109 241 69 210 96 72 126 185 77 189 29 150 110 172 145 209 177 182 64 111 101 163 113 20 123 184
5045 184 188 12 199 166 235 142 99 83 8 113 145 151 162 163 199 176 125 191 157 131 121 124 112 44 200 281 100 147 143 103 248 178 168 267
4646 267 176 165 169 142 76 79 219 92 94 52 107 252 30 182 123 108 159 244 190 129 98 183 176 53 136 104 173 206 321 349 173 197 234
4258 234 17 76 194 159 85 326 238 11 40 220 294 121 164 51 109 85 144 111 179 184 110 59 64 99 55 99 46 68 159 172 189 94
3883 94 68 56 12 181 262 68 233 39 199 98 134 325 282 57 209 100 42 80 97 18 54 107 74 169 48 114 144 101 192 188
3531 188 57 20 75 250 206 126 105 44 114 128 250 174 56 226 217 108 175 163 77 233 138 136 120 49 201 94 201 131 217 155 26
3167 26 98 276 183 163 44 220 268 104 56 80 220 140 18 77 118 189 15 218 155 59 89 162 209 163 207 216 3 223 167 111 216
2803 216 235 116 262 225 251 170 132 132 95 143 81 133 178 264 184 159 204 37 125 70 118 182 22 103 145 157 85 44 107 132 102 130 116
2416 116 146 151 75 94 107 103 152 194 208 149 44 128 65 65 102 150 53 215 244 305 285 129 87 97 154 220 123 132 228 184 161 100 146 36 163
2005 163 224 100 199 141 144 150 65 88 91 159 162 308 193 143 156 81 103 128 39 215 225 115 145 151 89 91 137 92 216 89 58 117 115 200 258
1594 258 179 96 164 93 161 148 147 103 18 66 103 89 51 73 245 287 71 230 45 133 162 145 158 130 107 214 241 207 47 199 179 142
1218 142 127 58 90 127 97 102 90 168 150 74 164 118 73 45 153 229 47 214 174 238 300 272 214 168 280 139 86 186 90 100 61 186
843 186 185 89 88 45 130 201 205 115 69 68 74 153 214 166 89 83 47 70 176 226 172 221 137 94 153 169 29 126 98 143 95 88 192 79 171 65
420 65 73 99 129 162 115 96 67 139 251 206 39 273 230 180 110 32 118 194 32 45 148 124 137 237 326 311 5 87 190 146 111 172
45 172 146 91 127 189 269 172 42 99 243 66 299 179 100 284 248 166 291 139 208 59
-190E9
##PAGE=	F1=-1826.76
##FIRST=	25169.313707327481097,	5807.6787752999953227,	0
##DATA TABLE=	(F2++(Y..Y)), PROFILE
5808 173 64 98 30 86 111 185 181 345 233 79 123 97 118 190 145 208 148 204 69 111 107 42 92 147 177 284 175 83 107 131 184 128
5432 128 62 164 219 175 63 22 134 144 247 74 181 105 90 122 200 94 200 71 176 124 182 154 184 159 176 66 80 103 127
5092 127 126 31 95 201 183 17 202 137 238 175 117 84 48 128 149 148 182 182 201 165 119 202 156 112 120 94 78 85 142 260 182 189 105 110 250
4681 250 178 216 292 191 106 171 130 75 96 220 112 95 76 124 259 59 160 94 97 98 215 190 98 118 236 173 67 144 93 170 183
4317 183 327 377 201 199 199 17 102 142 113 104 344 285 68 54 219 298 166 151 69 143 128 115 123 193 205 129 88 96 101 95 151 50 68 138
3918 138 148 173 83 103 20 15 200 282 61 194 23 217 129 112 315 292 56 194 140 65 86 121 58 41 127 98 149 52 151 124 42
3554 42 128 162 70 15 88 229 223 71 94 47 122 145 281 136 52 239 205 148 222 134 70 241 138 140 154 82 171 67 200 110 210
3190 210 160 19 54 191 200 187 47 244 268 108 57 94 160 84 61 173 221 163 101 67 206 149 65 189 249 136 215 241 21 201
2838 201 118 151 206 221 138 278 251 232 161 153 174 106 107 32 57 191 290 132 149 238 66 130 68 114 141 45 60 157 129 131 45 102 158 92
2439 92 103 82 158 143 94 140 158 140 123 158 159 157 87 151 66 140 51 107 46 210 205 287 313 129 49 100 145 191 85 117 206 143 73 126 219
2028 219 70 207 208 107 193 132 118 190 111 87 74 162 161 305 154 135 137 127 122 158 83 213 255 101 174 181 138 67 140 101 198 90 62
1641 62 136 135 243 237 139 59 150 58 119 153 126 115 31 96 85 88 52 91 276 303 33 198 40 106 174 150 155 136 66 175 220 173 78 170
1242 170 117 111 95 47 101 175 48 121 129 112 127 101 152 163 106 23 194 239 45 178 132 220 277 295 189 145 279 163 77 179 63
878 63 140 76 217 209 125 110 64 66 158 205 142 157 106 56 159 271 180 108 158 127 87 189 207 189 263 168 55 155 150 67 119 144 171 76
479 76 96 209 99 211 89 69 84 132 119 126 155 97 106 201 159 27 255 210 167 148 31 122 186 68 34 130 139 139 265 309 300 49 107
92 107 143 118 113 206 125 94 101 176 236 131 48 113 246 79 342 178 139 308 246 148 253 82 187 71
-190G1
##PAGE=	F1=-1929.02
##FIRST=	25169.313707327481097,	5807.6787752999953227,	0
##DATA TABLE=	(F2++(Y..Y)), PROFILE
5808 179 87 103 59 119 111 205 193 341 180 124 146 97 138 191 197 276 153 176 51 81 79 79 55 95 137 278 199 98 111 148 178 154 26
5420 26 162 227 187 43 10 141 172 245 65 152 121 116 117 200 120 203 118 228 126 166 165 149 145 158 81 57 96 89 128 38 99 211 171 38
5021 38 178 93 227 208 129 117 97 148 129 149 189 186 201 160 112 181 140 95 99 35 51 97 92 240 250 221 70 105 239 166 240 308 222 36
4622 36 162 110 99 113 217 143 83 97 136 232 79 146 82 117 32 181 177 57 121 278 150 99 156 72 160 154 332 375 203 192 146 48
4247 48 143 122 63 112 327 296 121 65 185 268 196 133 95 185 169 87 121 200 208 141 107 116 121 142 201 65 68 115 131 157 80 116 15 31 218
3836 218 296 77 140 29 206 146 95 285 294 76 155 171 127 98 148 128 32 129 111 118 60 181 106 33 57 145 92 46 111 194 229 85
3460 85 148 72 131 171 298 86 80 256 199 174 247 126 79 228 122 145 190 111 138 88 200 85 188 155 19 25 123 172 174 55 252
3096 252 254 117 49 106 87 48 79 226 263 143 135 195 344 231 61 197 273 122 219 250 26 190 70 198 193 207 159 297 270 213
2744 213 141 158 187 103 61 51 32 194 293 88 124 241 87 119 86 122 76 106 55 157 109 164 41 89 160 79 102 43 154 126 121 167
2369 167 194 172 66 115 115 158 121 168 68 207 118 70 43 190 163 258 331 134 68 108 135 150 61 112 167 116 17 170 265 87 227
2005 227 166 120 179 104 89 213 143 71 56 175 163 291 116 111 108 169 131 162 119 190 252 104 179 201 191 67 126 95 166 97 65 141 152
1617 152 270 215 107 27 144 48 62 143 91 124 67 146 88 90 84 114 272 285 12 150 43 84 185 175 148 126 27 108 193 154 115 149
1242 149 63 67 64 93 122 210 48 162 189 60 107 131 126 201 145 63 215 221 64 147 94 209 247 275 148 125 267 194 80 154 57 180
866 180 82 220 215 152 161 82 56 99 212 177 233 131 51 158 305 161 107 226 190 116 185 173 196 275 192 34 133 108 89 113 177 179 47
479 47 114 208 119 266 111 84 72 158 103 133 188 121 78 140 112 8 234 187 161 162 62 119 178 142 45 126 153 142 282 284 258 83 124
92 124 82 82 108 220 124 77 92 170 188 75 61 104 214 106 354 165 161 306 214 118 210 22 144 92
-190I2
##PAGE=	F1=-2031.28
##FIRST=	25169.313707327481097,	5807.6787752999953227,	0
##DATA TABLE=	(F2++(Y..Y)), PROFILE
5808 179 110 101 82 159 139 224 179 301 143 180 171 94 152 180 231 326 158 129 38 40 57 95 63 86 104 256 208 96 104 156 156 164 35 161
5409 161 242 197 36 32 135 188 235 47 132 144 142 110 187 152 189 150 262 96 129 173 109 134 133 100 45 82 60 120 28 140 215 140 56
5021 56 130 60 204 235 124 174 136 154 103 159 188 185 204 165 104 138 129 96 88 50 75 86 61 228 289 229 41 90 224 140 238 310 264 59
4622 59 145 93 129 130 221 178 61 108 137 176 81 148 96 144 28 150 155 18 107 285 110 128 167 50 151 150 334 343 186 179 86 85 191
4235 191 151 33 104 270 260 148 77 129 214 205 115 118 220 193 66 110 193 205 158 118 129 152 180 242 96 66 101 128 145 72 94 33 62
3848 62 238 302 120 91 32 171 143 97 241 284 112 109 182 176 110 172 178 48 115 113 79 68 195 89 74 11 152 111 75 131 147 224 120
3460 120 196 89 139 202 302 35 125 271 205 185 248 135 99 199 100 151 225 139 132 151 191 82 155 149 18 43 49 97 138 80 253 233
3085 233 119 28 112 51 55 66 223 228 120 112 187 276 195 57 182 279 126 208 240 30 196 47 243 177 205 174 309 277 203 114 142
2721 142 165 83 61 123 120 194 277 75 83 209 93 95 112 149 21 158 95 149 88 177 30 74 142 70 110 21 139 105 150 168 200 197 42
2333 42 87 84 158 135 178 66 252 198 83 32 159 123 220 338 144 98 121 139 104 59 116 131 119 88 208 275 88 215 115 131 153
1970 153 66 64 215 151 51 32 187 164 264 89 80 83 198 133 144 140 145 215 131 158 205 235 113 104 81 129 106 68 139 180 277 203 108 28
1570 28 150 83 23 124 50 134 100 180 109 106 113 141 237 234 35 92 42 75 187 215 150 106 54 22 158 144 142 144 73 19 74 158 160 221 84
1160 84 198 231 37 92 152 85 229 183 114 212 177 101 130 62 207 222 217 96 108 248 210 83 118 103 205 78 197 202 171 217 88
796 88 115 28 217 214 290 144 84 155 312 116 85 263 220 135 171 137 184 250 203 75 93 57 93 104 193 168 31 123 189 133 310 129
420 129 120 69 186 100 141 195 127 55 74 102 21 215 159 141 146 78 108 175 214 69 158 159 144 279 253 189 93 133 47 54 93 212 147 58 125
9 125 173 132 31 78 76 155 121 330 143 160 279 156 134 188 54 93 106
-190A06
##PAGE=	F1=-2133.53
##FIRST=	25169.313707327481097,	5807.6787752999953227,	0
##DATA TABLE=	(F2++(Y..Y)), PROFILE
5808 171 125 102 91 188 187 237 139 245 148 221 191 86 162 162 240 344 166 75 58 36 74 91 112 162 119 226 201 78 91 154 130 163 78
5420 78 162 262 206 41 44 118 190 216 29 123 166 169 101 165 185 156 163 250 27 93 177 70 127 104 115 43 67 46 101 20 193 212 87
5033 87 68 68 75 168 251 103 242 160 139 106 179 181 185 211 179 101 100 154 113 116 146 125 80 53 220 292 207 28 68 212 101 211 296 302 124
4622 124 121 97 152 146 231 207 60 106 127 117 69 154 122 165 78 122 128 18 78 245 61 135 165 32 147 187 330 289 159 162 40 120
4247 120 230 191 46 87 185 187 146 89 77 160 190 95 142 234 191 48 97 167 203 185 126 134 175 193 268 138 63 101 139 138 52 44 45 102 257
3836 257 300 168 88 33 118 122 114 193 261 143 83 166 198 116 181 201 76 91 110 43 79 183 74 102 63 164 115 96 138 96 214 133
3460 133 213 86 146 233 295 58 167 277 219 182 229 140 117 163 90 159 256 169 152 209 166 109 114 148 14 71 77 77 106 112 254 214 108
3073 108 32 103 85 65 81 199 140 93 54 133 126 119 50 149 282 144 174 212 53 214 44 276 157 216 183 306 267 202 83 109 119
2709 119 67 122 195 197 194 241 91 30 149 88 67 134 182 69 185 121 136 64 172 17 61 107 67 109 39 120 87 172 151 174 211 122 100
2322 100 71 161 138 182 58 269 252 122 22 125 92 183 332 153 111 138 154 62 63 119 122 146 135 223 248 74 174 70 126 122 47
1958 47 66 198 134 66 8 187 161 222 81 69 64 216 131 113 145 103 151 167 120 195 262 162 90 76 99 115 77 144 226 265 204 137 46
1570 46 159 126 69 101 14 149 126 190 136 133 130 166 184 160 77 70 37 81 178 250 163 89 106 93 117 131 147 148 102 28 115 219 210 207 100 204
1148 204 245 49 82 153 45 242 214 162 185 112 141 131 36 208 215 139 47 91 224 203 87 84 163 208 65 151 170 182 268 83 167 55
772 55 207 246 320 144 113 154 290 57 52 260 210 138 154 115 150 196 199 109 60 25 84 94 194 141 44 110 155 142 333 135 170 74 202
385 202 88 150 184 118 34 25 150 59 194 135 104 101 71 91 174 272 93 209 156 145 249 218 103 83 133 88 59 72 190 170 75 180
9 180 181 75 76 96 47 84 117 270 114 141 237 84 197 194 104 63 104
-190A04
##PAGE=	F1=-2235.79
##FIRST=	25169.313707327481097,	5807.6787752999953227,	0
##DATA TABLE=	(F2++(Y..Y)), PROFILE
5808 152 126 103 82 201 234 234 82 197 165 234 201 72 171 141 219 327 174 27 93 71 97 76 163 259 172 197 184 52 75 140 112
5444 112 154 116 165 281 212 50 44 90 186 188 29 123 175 193 92 139 216 112 155 185 84 95 178 36 123 80 126 43 56 47 75 46 238
5056 238 204 16 66 12 103 124 251 88 305 170 108 139 200 176 184 217 194 96 115 212 133 156 234 167 100 68 210 262 157 47 46 207
4681 207 51 167 264 321 169 101 128 161 159 237 224 105 89 108 118 51 150 148 179 116 100 102 30 44 163 10 110 143 14 147 239 317
4305 317 222 138 141 52 146 245 209 59 78 98 103 118 92 60 131 157 75 170 217 164 35 89 129 207 216 131 131 174 172 276 178 62 107 157 132
3894 132 26 47 56 138 272 289 202 131 43 73 99 131 148 228 153 90 129 185 111 168 196 100 68 107 50 94 143 67 117 95 158 103 105 124 52
3484 52 203 122 195 61 151 252 276 115 193 263 227 165 195 125 127 127 101 169 281 198 166 238 124 140 73 145 7 94 156 109 93 131 254
3096 254 203 88 77 75 107 59 134 205 48 75 38 161 167 128 48 112 290 165 117 170 93 240 34 289 135 236 186 283 241 197 51
2732 51 78 83 93 182 259 254 191 187 107 48 75 81 57 140 204 116 182 115 123 40 158 6 52 63 76 94 52 102 74 183 138 124 214 198 124 73
2310 73 163 140 185 46 259 268 147 44 97 71 157 313 155 106 157 168 32 58 112 144 181 153 209 194 52 117 37 101 110 82 99 167
1934 167 98 110 34 168 151 173 96 91 38 224 131 81 143 129 72 195 75 174 265 190 99 95 86 120 89 158 276 237 208 168 64 161 159 118
1535 118 76 28 173 147 176 160 162 135 184 138 85 123 127 38 98 158 265 173 82 155 193 78 113 124 148 107 63 153 261 264 174 86 173 228
1136 228 58 69 131 61 237 234 197 136 43 172 146 21 211 228 76 17 67 194 175 92 66 216 186 49 100 127 184 303 93 195
784 195 131 175 265 322 136 121 155 245 34 44 223 167 127 146 112 94 131 179 116 69 54 71 84 183 107 50 67 114 148 330 126 220 82
397 82 200 63 159 168 101 14 61 212 98 169 124 61 34 45 75 164 313 112 252 142 149 197 182 23 57 122 139 89 70 170 179 118
21 118 232 187 26 129 112 44 46 94 187 82 119 196 16 259 214 135 85 82
-190H2
##PAGE=	F1=-2338.05
##FIRST=	25169.313707327481097,	5807.6787752999953227,	0
##DATA TABLE=	(F2++(Y..Y)), PROFILE
5808 125 109 100 53 195 263 211 52 173 162 213 196 52 179 123 173 274 178 21 121 97 95 61 203 344 223 182 171 29 59 114
5456 114 97 142 144 174 293 208 55 37 70 183 153 47 126 168 206 86 113 234 83 127 92 201 131 178 14 123 74 135 38 56
5103 56 59 45 84 267 193 66 47 33 116 74 232 110 349 170 77 169 215 181 178 214 203 82 175 276 148 179 291 187 128 96 199
4740 199 209 91 80 29 205 14 127 216 314 188 105 170 159 163 234 229 165 62 86 178 54 129 165 187 146 87 77 26 25 60 31 53 100
4352 100 10 148 279 294 153 127 114 91 155 231 190 60 88 62 71 80 78 68 137 113 56 194 164 121 49 90 100 223 236 132 118 150 120
3965 120 269 205 65 112 172 123 28 120 69 161 276 264 213 177 61 94 98 141 105 188 140 109 95 145 95 136 166 113 56 105 79 108 87
3578 87 86 131 103 124 92 101 91 58 194 94 154 30 150 254 244 161 197 223 218 138 155 89 130 100 117 181 297 222 155 227 70 157 38
3190 38 132 17 105 208 98 104 134 249 200 70 119 38 99 54 165 223 24 76 82 195 251 175 51 88 296 179 56 122 135 275
2838 275 34 280 120 253 185 246 204 177 30 88 97 140 225 305 288 178 123 112 112 59 82 86 127 209 139 152 77 110 22 142 3 48
2462 48 25 103 75 48 88 65 184 156 80 203 244 129 88 161 141 187 39 228 249 146 80 80 53 156 285 150 99 178 166 24 38
2099 38 94 173 212 148 168 130 35 59 11 60 126 127 133 133 52 150 68 132 132 137 128 118 6 228 132 57 147 206 11 209 42 153 247 187 131
1688 131 124 84 123 97 169 311 201 203 186 95 158 178 154 52 47 198 162 145 179 183 133 192 120 58 159 198 58 117 130 249 165 88 199
1300 199 269 58 96 74 133 90 89 174 273 311 135 54 113 189 57 50 89 107 214 237 214 72 75 185 163 27 221 245 86 6 35 158
925 158 132 99 64 249 143 39 72 78 173 314 138 198 198 116 262 294 128 104 159 191 69 77 176 110 112 156 112 30 84 147 92 92 77 64
526 64 80 164 77 39 8 74 157 310 103 259 93 181 51 166 169 83 34 107 259 127 143 124 33 41 21 66 148 332 123 272 117
162 117 159 135 151 79 27 103 175 123 98 165 171 158 269 185 31 166 125 58 75 62 105 46 106 177 43 289 230 147 122 44
-190D4
##PAGE=	F1=-2440.31
##FIRST=	25169.313707327481097,	5807.6787752999953227,	0
##DATA TABLE=	(F2++(Y..Y)), PROFILE
5808 97 74 85 6 168 267 168 108 178 135 162 172 28 185 114 114 197 175 38 134 112 63 58 222 400 255 186 176 19 46 80 74 130 165
5420 165 190 295 185 50 31 83 180 114 70 127 146 199 86 88 234 111 89 97 305 172 177 26 125 93 146 25 65 74 18 120 276
5056 276 188 141 25 43 118 23 198 144 360 163 69 180 218 199 166 200 205 59 243 326 157 176 302 183 142 122 189 147 24 111
4704 111 25 201 73 123 156 281 180 131 211 151 154 226 224 218 42 69 231 80 95 168 189 171 87 49 23 27 59 61 30 67 41 151 295
4317 295 263 95 120 81 128 148 197 134 62 106 92 114 62 51 65 152 69 45 200 80 91 72 95 102 250 233 126 92 111 53 250 212
3941 212 76 111 175 110 57 186 83 163 266 225 204 210 81 152 124 138 63 148 112 132 99 88 80 94 119 112 64 105 95 114 69 132 162 92
3542 92 67 117 84 48 104 184 64 121 59 139 237 201 182 177 154 181 102 116 56 138 85 123 194 303 234 116 174 18 156 19 109 40 105
3155 105 226 54 135 124 238 200 61 141 55 82 82 155 207 35 84 103 163 245 182 56 85 283 179 76 76 172 316 71 255 121
2803 121 259 177 213 164 138 47 128 125 176 246 328 297 156 61 106 165 122 89 135 96 201 141 107 40 103 22 127 12 46 47 138 68 30
2416 30 77 57 183 198 89 177 254 107 106 153 134 187 49 186 209 122 113 82 34 181 252 144 104 197 143 34 10 69 192 234 132
2052 132 112 89 38 19 61 25 145 162 153 109 7 169 97 83 104 144 168 128 66 231 132 41 155 282 68 209 33 135 213 159
1700 159 177 144 85 122 95 166 313 164 181 188 141 172 189 174 52 63 216 169 110 189 190 133 188 120 92 175 252 90 136 104 202 135 109
1312 109 236 304 61 86 21 103 71 108 177 250 339 117 60 60 136 44 23 49 136 176 221 212 5 157 178 173 39 235 251 123 26 19 121
925 121 84 107 69 258 88 43 90 35 146 295 197 180 250 41 233 242 131 84 160 159 88 111 147 81 113 180 102 50 76 114 43 97 79
538 79 64 86 145 58 44 82 40 171 284 68 274 114 150 78 174 200 65 76 142 278 137 120 121 38 110 61 62 143 331 123 264
174 264 83 174 97 123 137 4 76 193 150 130 175 163 186 283 175 59 183 137 53 98 36 80 12 101 180 67 276 234 143 148 5
-190E
##PAGE=	F1=-2542.56
##FIRST=	25169.313707327481097,	5807.6787752999953227,	0
##DATA TABLE=	(F2++(Y..Y)), PROFILE
5808 77 30 62 55 129 245 119 178 201 92 98 130 4 186 121 71 112 168 37 133 126 9 79 217 415 260 203 205 23 38 65 37 121
5432 121 184 208 287 139 29 41 113 171 77 91 123 112 173 93 57 213 168 68 195 374 209 175 48 125 121 154 12 76 85 13 147
5068 147 267 191 201 60 15 129 23 159 158 333 157 84 173 212 229 153 177 200 61 306 350 160 155 266 168 138 132 179 88 35 130
4704 130 33 188 136 166 96 232 147 159 245 143 129 218 214 247 45 59 250 102 56 149 183 195 104 11 60 27 143 79 119 111 75 155
4329 155 289 228 64 113 45 160 129 157 54 85 123 110 148 78 38 46 156 33 50 178 22 102 77 95 123 280 208 112 58 70 49
3965 49 225 196 95 108 164 95 80 233 97 144 242 176 193 224 97 203 149 123 17 118 88 159 132 36 79 66 63 97 91 105 92 113
3589 113 125 191 207 67 12 170 56 33 148 167 55 125 113 116 205 155 175 135 58 119 60 84 82 160 76 117 208 296 232 69 89 32 141
3202 141 20 88 66 94 215 57 175 111 225 199 56 136 109 94 130 123 151 33 87 98 78 189 152 63 93 242 168 139 45 198
2850 198 351 113 224 137 249 162 199 132 92 82 160 132 188 245 323 278 127 53 104 192 176 90 185 60 193 126 70 89 108 32 110
2486 110 31 45 83 165 74 23 67 51 186 237 135 134 233 77 123 145 116 189 73 149 174 81 134 108 48 218 216 149 112 208 102 52 31
2099 31 44 197 242 119 55 95 50 36 138 50 147 181 154 102 32 163 116 42 80 183 202 115 128 230 125 24 155 329 102 198
1746 198 33 122 173 119 227 148 86 120 77 140 278 130 143 171 189 217 198 175 82 89 217 161 87 186 181 134 173 111 121 166 277 124
1371 124 155 84 133 88 146 262 291 66 84 72 65 78 123 166 197 344 133 111 89 79 25 17 63 134 129 189 190 67 230 159 172 42 244
984 244 236 141 69 50 89 42 117 71 240 33 55 115 19 107 246 241 144 282 76 181 175 141 95 151 177 79 137 147 100 140 205 84 109
596 109 83 103 18 78 63 70 101 132 53 98 163 19 187 265 36 264 143 121 112 184 252 45 122 166 269 121 107 107 41 161 112 60
221 60 163 311 109 229 43 186 109 98 166 24 48 190 169 145 186 178 195 274 159 73 183 153 21 98 43 121 35 91 190 68
-132 68 223 225 128 158 55
-190E5
##PAGE=	F1=-2644.82
##FIRST=	25169.313707327481097,	5807.6787752999953227,	0
##DATA TABLE=	(F2++(Y..Y)), PROFILE
5808 77 23 53 118 99 207 98 234 229 49 67 75 17 181 144 73 44 155 19 129 145 54 123 194 386 238 223 246 32 33 93 18
5444 18 120 204 220 272 74 7 69 134 154 48 109 115 73 136 104 16 174 220 80 266 391 241 173 72 123 147 155 31 86 92 21 159
5068 159 243 198 236 118 44 158 54 131 138 271 153 98 155 201 266 146 151 191 107 355 349 160 133 195 171 126 118 160 39 70 134 45
4693 45 166 191 222 69 197 98 174 274 141 90 215 200 244 52 59 229 107 17 106 167 221 129 42 112 46 198 89 197 184 102
4340 102 158 266 192 73 113 16 187 105 135 43 124 138 102 154 96 66 25 144 28 77 129 122 130 56 78 139 301 168 95 22 36 102
3965 102 200 162 120 111 139 78 95 255 111 111 209 138 199 219 106 233 160 106 31 105 83 185 157 24 99 73 7 75 133 109 78 109 188
3578 188 251 251 41 67 223 23 67 177 142 71 149 158 86 163 118 144 76 54 62 18 67 133 188 74 106 218 280 218 66 24 59 130 27
3190 27 80 92 81 190 97 208 99 208 196 61 115 154 132 175 128 78 73 88 80 33 166 110 67 98 180 154 181 42 215 370 140
2826 140 203 155 221 140 199 112 67 117 171 110 179 228 292 229 93 96 116 187 200 79 225 49 198 101 61 156 128 38 87 59 46 106 171
2439 171 76 44 58 63 198 259 178 79 204 85 139 143 98 201 108 132 170 36 138 144 95 255 184 167 106 205 58 76 65 33 192 235
2063 235 117 12 109 60 81 223 75 124 184 137 102 63 136 122 72 91 216 221 83 177 221 109 10 136 339 108 183 29 109 139
1711 139 91 275 135 95 123 44 95 212 101 99 138 225 279 213 158 115 125 194 138 88 169 154 135 148 84 132 134 271 155 170 72 68 53
1324 53 188 272 233 64 87 128 32 99 133 148 124 323 161 154 134 27 32 49 102 98 87 147 153 118 284 145 161 36 231 202 141 115 79
937 79 68 44 126 67 199 24 68 122 35 71 174 251 106 296 166 122 107 143 132 127 221 45 163 152 118 179 216 68 157 94 125 79
561 79 53 37 79 120 130 67 163 227 29 204 260 40 232 167 105 137 199 307 22 160 180 240 80 106 81 53 187 156 54 191
209 191 278 86 179 3 185 135 77 167 49 31 170 174 137 185 217 184 247 142 69 171 181 47 88 63 156 68 69 189 69 143 206
-155 206 108 152 102
-190A02
##PAGE=	F1=-2747.08
##FIRST=	25169.313707327481097,	5807.6787752999953227,	0
##DATA TABLE=	(F2++(Y..Y)), PROFILE
5808 90 60 76 173 104 174 134 266 248 26 108 22 38 170 174 84 53 140 10 131 167 112 177 172 318 194 239 287 41 34 138 68 128
5432 128 222 218 254 17 46 103 137 144 38 118 104 33 98 114 54 124 252 96 284 358 267 173 101 124 164 145 56 93 100 20 152 208 202 244
5033 244 173 125 190 66 127 83 194 153 101 134 190 301 148 131 180 159 384 330 160 126 125 209 118 87 127 19 85 125 54 140 231 269
4657 269 99 215 66 178 298 145 45 214 175 209 42 71 176 96 19 60 150 242 155 108 165 93 218 94 248 241 115 156
4329 156 236 160 96 125 27 207 83 135 126 165 154 79 141 96 92 28 125 44 115 66 205 146 27 43 144 303 134 86 10 8 135 171
3953 171 120 141 123 107 65 104 253 120 80 172 150 221 196 104 238 151 105 79 113 86 198 162 37 128 102 44 55 179 121 69 112 231
3578 231 301 276 30 114 257 11 100 185 109 91 163 184 67 117 104 97 38 167 100 27 65 166 206 86 104 224 259 200 105 112 69 141
3202 141 39 78 113 73 179 112 228 91 180 185 92 111 179 163 205 173 19 110 101 66 89 181 81 65 103 114 140 190 52 226 366
2838 366 141 197 169 180 119 189 102 83 144 160 66 158 200 241 155 56 131 133 152 193 57 246 69 216 73 69 208 157 37 62 87 52
2462 52 114 153 64 66 49 103 218 262 211 18 190 133 160 156 102 227 152 141 192 20 125 176 150 285 157 189 79 185 55 98 91
2099 91 47 183 213 124 24 98 73 141 297 74 83 171 108 98 85 104 116 135 142 221 220 40 202 200 83 24 97 311 96 170 36 92
1723 92 119 88 311 116 122 134 17 42 146 79 72 94 240 336 226 122 131 161 148 114 103 142 110 128 116 46 134 88 238 179 180 62 69
1336 69 81 220 261 145 61 93 159 32 111 135 127 58 281 178 168 150 30 67 72 127 47 83 109 109 144 308 148 141 38 192 164 134
960 134 149 92 55 83 134 56 143 59 80 108 48 77 103 220 104 295 237 88 61 127 164 89 257 15 192 145 114 212 207 64 195
596 195 121 167 129 73 12 94 139 138 99 218 260 45 218 266 69 191 172 96 152 215 348 12 183 181 209 23 115 46 104 195 187 45
221 45 207 238 62 124 34 166 144 73 152 80 38 135 165 102 171 256 151 210 127 48 153 226 127 91 73 164 96 37 173 101 61 178
-155 178 91 136 140
-190A40
##PAGE=	F1=-2849.34
##FIRST=	25169.313707327481097,	5807.6787752999953227,	0
##DATA TABLE=	(F2++(Y..Y)), PROFILE
5808 106 83 106 212 128 166 185 270 246 38 155 54 62 154 206 72 79 123 47 141 185 154 224 172 225 135 247 314 41 47 175 115 140
5432 140 231 199 236 68 82 127 124 156 51 116 92 5 71 113 119 70 259 99 250 284 278 176 137 134 173 129 74 97 115 21 130 164 199
5045 199 227 217 212 211 57 145 8 139 156 94 114 180 330 155 121 165 197 387 304 159 128 121 261 120 68 106 52 83 111 56 112 248
4669 248 297 136 275 106 178 317 153 37 208 134 152 12 92 106 85 51 94 140 250 176 181 209 143 213 92 262 265 111 148 206
4317 206 134 111 143 40 221 72 140 190 195 173 69 123 79 96 48 107 60 146 53 256 143 69 6 142 281 124 102 30 29 140 139
3953 139 80 149 133 77 59 111 231 117 67 146 199 235 161 93 223 128 130 121 134 82 184 146 36 159 138 85 52 218 138 76 119 253
3578 253 332 273 33 137 265 36 121 171 76 107 153 191 77 70 108 51 98 265 170 66 71 168 206 117 117 224 237 183 137 183 70 170
3202 170 57 65 127 69 205 107 230 96 142 159 140 150 185 173 216 205 25 119 126 63 101 178 80 61 110 72 117 167 68 229 342 114
2826 114 204 179 132 115 159 95 102 160 131 11 141 165 187 90 26 150 142 99 157 35 240 83 230 49 69 236 189 29 41 111 62
2462 62 108 120 38 81 44 154 241 246 236 58 193 179 189 182 127 263 197 165 216 56 102 192 197 299 138 200 50 154 89 113 105 78 177
2075 177 180 131 45 56 93 207 344 46 39 152 77 88 99 92 101 195 204 197 204 3 196 165 55 39 53 259 85 160 56 70 115 93 327
1688 327 102 165 151 51 38 140 69 83 58 229 369 228 76 125 180 93 127 120 119 54 110 80 14 135 64 193 197 186 62 115 125
1324 125 229 226 68 69 99 156 44 112 130 107 64 227 172 149 136 70 104 79 131 64 118 96 71 138 294 159 116 67 132 144 139 158 88
937 88 46 122 139 48 81 81 89 80 59 117 88 156 156 284 272 106 71 102 179 52 271 64 219 130 95 231 177 75 227 161 211 164 118
549 118 6 116 156 148 138 250 253 52 225 282 97 157 153 75 164 225 362 36 186 167 187 38 130 27 172 195 200 34 206 202 60
185 60 77 60 130 133 90 138 114 52 92 143 49 152 273 100 174 115 30 129 281 211 109 70 149 121 22 149 144 59 143 87 118 169
-190A69
##PAGE=	F1=-2951.6
##FIRST=	25169.313707327481097,	5807.6787752999953227,	0
##DATA TABLE=	(F2++(Y..Y)), PROFILE
5808 114 87 127 229 147 185 225 249 220 58 184 104 92 137 234 42 84 111 86 156 194 176 250 187 125 73 246 316 27 70 195 147
5444 147 145 231 165 217 111 105 131 100 183 81 104 81 31 52 97 172 42 239 88 181 190 268 180 176 157 184 117 80 99 133 37 99 115 186
5045 186 191 247 288 216 42 171 71 142 162 82 110 167 347 159 122 143 210 359 280 158 127 165 299 127 94 140 88 70 101 48 84
4681 84 238 302 154 341 173 184 330 158 72 191 76 107 43 113 39 93 75 165 143 236 191 247 234 179 195 82 239 251 92 135
4329 135 176 116 112 157 40 227 75 135 227 209 193 94 109 62 76 69 102 75 156 105 272 125 126 59 145 241 135 133 52 68 122 107 54 133
3930 133 123 53 67 117 191 94 68 141 246 226 130 75 195 102 165 153 157 79 140 118 35 184 169 112 60 236 147 88 120 257 342 241
3554 241 34 137 250 49 130 139 49 115 123 181 99 35 116 34 162 331 217 100 75 148 189 157 133 220 216 172 153 221 67 199 75
3190 75 36 135 59 247 114 213 115 114 117 184 200 177 161 212 203 34 100 153 73 71 157 103 64 117 64 82 127 97 225 306 65 218 186 84
2791 84 131 117 94 99 159 94 45 135 129 152 133 53 158 135 69 101 33 207 79 227 27 57 241 219 22 32 127 72 96 96 6 90 49
2404 49 200 260 219 252 127 193 206 223 215 149 297 234 189 231 85 79 187 228 293 126 193 81 133 116 118 109 118 176 138 136 74 13 118 261
2005 261 353 29 15 145 63 77 106 105 80 239 258 159 187 30 166 121 46 48 57 201 91 152 77 52 117 94 320 89 211 165 85
1641 85 76 194 78 102 76 200 366 206 44 112 174 83 181 132 120 21 80 45 41 143 103 158 212 197 80 149 156 211 175 98 84 104 122
1254 122 46 106 115 87 101 172 141 111 106 103 133 67 116 122 159 113 61 107 242 158 92 108 66 149 156 142 75 33 153 138 61 35 92 96 59 75 155
819 155 130 91 222 268 266 144 111 98 181 48 259 112 232 110 80 231 135 95 254 193 249 183 153 23 145 168 152 172 252 203
467 203 46 224 304 118 138 111 34 184 218 344 62 169 139 179 86 145 65 234 197 193 25 200 186 78 44 74 84 113 117 136 145
103 145 61 50 113 26 140 254 42 151 102 70 100 334 284 124 61 130 148 43 127 174 106 98 98 108 190
-190A90
##PAGE=	F1=-3053.85
##FIRST=	25169.313707327481097,	5807.6787752999953227,	0
##DATA TABLE=	(F2++(Y..Y)), PROFILE
5808 113 76 131 225 151 208 245 211 175 73 189 141 132 122 257 63 78 102 123 174 195 181 246 194 36 46 235 290 6 97 197 162
5444 162 136 222 121 193 123 109 111 71 203 121 95 71 49 28 63 195 69 201 76 103 98 233 178 214 189 211 122 73 97 152 60 69 65
5056 65 158 148 260 341 210 68 193 129 167 172 73 144 144 351 159 128 114 200 301 258 159 123 193 309 137 131 205 114 54 102 33 47
4681 47 202 285 147 393 230 203 335 155 98 160 18 122 106 128 23 114 88 215 152 193 198 294 236 187 172 66 190 202 67
4340 67 120 146 107 105 160 32 224 91 120 239 204 212 139 98 73 41 86 106 90 139 150 255 104 162 99 160 193 142 163 88 105 89 86 48
3941 48 92 86 40 88 120 137 54 65 156 267 192 114 58 162 83 193 174 171 91 69 88 52 197 185 121 62 227 139 95 107 250 330 188
3554 188 40 122 221 48 127 100 34 115 83 162 117 49 119 40 203 357 231 125 73 146 175 193 135 213 194 168 160 226 62 211 90
3190 90 30 143 36 275 146 174 134 132 65 213 232 167 134 198 174 30 67 173 90 24 147 120 76 122 68 65 103 133 209 272 18 235
2815 235 192 46 153 97 106 70 142 56 94 136 94 155 231 103 162 114 104 50 52 150 66 201 26 51 225 242 33 43 133 81 90 107 36
2427 36 100 68 226 264 183 257 191 177 209 256 250 156 318 255 205 237 100 66 164 232 261 118 169 138 144 124 114 106 161 177 92 140 114 96 142
2016 142 289 320 85 22 168 99 70 104 118 55 257 290 146 178 40 122 76 68 51 93 157 101 141 94 54 114 87 289 62 250 167
1653 167 101 96 248 109 101 123 164 325 158 82 128 139 131 243 138 142 75 41 21 76 156 154 152 225 219 109 166 170 172 119 157 97 102 71 43 104
1230 104 88 69 111 123 90 90 89 125 148 40 89 157 190 144 82 88 158 133 77 147 21 155 178 107 69 15 172 128 87 54 97 97 66 96 178
819 178 165 101 271 245 223 176 150 129 178 65 229 146 223 84 78 212 90 121 273 207 278 191 163 54 179 174 144 190 226 118 43
455 43 214 330 134 129 62 25 214 189 297 87 140 101 180 107 157 112 271 193 165 26 204 198 90 36 76 57 102 144 149 164 63 24
80 24 83 89 142 202 50 140 87 126 68 372 334 126 49 132 180 57 120 179 127 45 115 105 205
-190B05
##PAGE=	F1=-3156.11
##FIRST=	25169.313707327481097,	5807.6787752999953227,	0
##DATA TABLE=	(F2++(Y..Y)), PROFILE
5808 102 56 120 206 144 223 247 166 122 80 173 161 181 114 274 126 81 90 156 197 189 171 209 181 27 77 218 239 49 122 190 164 112 210
5420 210 73 160 105 99 75 46 204 162 105 65 57 10 22 178 102 159 76 55 32 174 173 242 225 260 141 59 92 166 82 45 38 111 110 261
5021 261 363 197 122 206 153 173 186 70 203 112 340 150 136 82 173 217 229 164 124 188 287 148 152 259 124 46 117 31 19 147
4669 147 255 123 423 261 237 331 139 106 113 57 167 171 137 53 128 84 225 155 120 197 314 212 162 142 54 125 132 56 108 112 102 105 147
4282 147 32 210 110 108 231 184 225 189 94 108 30 91 109 107 111 178 218 88 164 113 181 147 135 184 135 132 51 81 54 58 37 44 113 113 74 32
3859 32 53 175 255 141 103 47 125 75 209 182 169 109 19 73 74 192 171 115 51 191 108 97 85 233 298 126 67 104 192 38 115 68
3484 68 37 116 43 141 125 82 117 39 209 339 218 142 63 202 189 212 112 208 166 170 164 210 51 202 100 73 155 20 271 186 116
3120 116 133 176 35 223 235 157 100 182 143 24 39 177 106 16 150 115 95 127 75 110 117 158 186 248 62 247 192 24 166 112 131
2756 131 23 112 28 135 135 62 183 319 154 169 89 149 69 73 82 68 162 70 74 194 255 58 70 135 89 102 135 74 111 95 227 246 139
2369 139 248 245 155 187 276 280 143 317 252 211 238 97 59 131 206 205 112 137 184 176 117 106 102 198 173 59 145 157 180 162 283 254 143 37
1970 37 214 165 71 100 114 38 249 290 170 179 39 83 39 100 55 113 137 98 120 108 75 100 80 240 25 273 157 95 90 277 158
1606 158 73 160 134 253 89 139 186 83 176 286 142 160 123 12 22 110 167 185 163 235 245 139 170 170 128 83 187 103 96 37 51 112
1230 112 50 53 92 86 27 114 91 132 149 7 65 158 207 178 115 125 60 89 73 175 33 145 193 71 77 15 174 108 110 84 104 89 84 116
831 116 185 172 155 291 215 154 198 179 165 182 67 192 163 190 44 76 178 56 149 279 202 297 192 150 100 212 177 122 187 185 42
467 42 77 190 349 147 118 47 93 251 141 235 116 110 78 185 97 170 151 271 172 122 36 220 225 85 54 75 77 110 169 167 166 57 24
80 24 63 147 153 130 104 127 72 178 38 384 356 113 39 160 210 56 123 157 116 16 130 105 214
-190B14
##PAGE=	F1=-3258.37
##FIRST=	25169.313707327481097,	5807.6787752999953227,	0
##DATA TABLE=	(F2++(Y..Y)), PROFILE
5808 81 43 100 180 132 222 240 125 74 74 139 164 231 117 279 180 102 66 185 221 177 152 145 151 53 104 203 176 96 140 186 160 81 200 34
5409 34 119 67 88 48 53 193 195 127 65 57 54 49 124 125 133 88 81 45 107 178 255 259 320 161 56 85 175 104 28 74 47 96 250 356 177 175 206
4974 206 138 153 203 71 263 75 317 134 142 48 145 115 185 174 133 155 246 156 149 283 118 61 143 55 70 85 219 95 431 259
4622 259 278 318 115 100 52 101 198 227 147 78 126 63 191 149 39 185 308 171 107 107 58 62 65 76 98 75 97 133 126 41 184 121 113 210
4223 210 152 226 237 108 142 56 78 107 128 129 198 175 78 136 97 197 111 115 195 181 141 18 84 59 103 77 60 134 95 25 80 45 185 214
3824 214 91 75 44 86 79 213 181 145 111 100 90 91 168 122 102 33 137 54 98 70 205 252 71 110 91 176 44 95 55 60 125 15 120
3437 120 127 108 117 40 180 286 194 151 46 284 226 208 67 206 127 172 168 199 41 173 107 113 173 52 237 221 63 104 206 61
3085 61 225 215 142 63 166 134 64 33 162 111 33 142 83 126 135 87 169 137 157 163 236 114 248 184 24 160 124 156 57 77 46 170
2709 170 132 49 213 376 198 177 75 174 120 94 38 95 132 129 116 154 254 86 104 136 99 137 159 106 124 125 203 204 92 221 282 157
2333 157 142 279 299 111 294 226 209 241 80 48 96 151 133 105 112 205 200 104 100 100 221 160 81 152 189 252 179 244 173 180 77 263 232 76
1934 76 100 89 55 226 258 198 184 50 67 32 135 65 105 129 77 84 121 98 73 75 188 75 277 147 70 61 282 220 35 175 113 162
1559 162 10 185 257 34 193 296 146 156 152 50 30 141 167 184 167 235 263 167 170 156 93 83 183 101 87 69 70 129 39 43 61 68 39
1171 39 149 91 124 136 26 74 130 209 211 149 180 59 54 78 187 42 131 194 54 88 45 158 79 125 97 115 71 87 130 181 152 185 277
784 277 176 80 209 191 183 194 55 158 169 140 34 58 137 36 173 268 187 306 184 126 150 241 178 93 167 145 125 134 150 354 161
420 161 97 78 157 285 83 184 149 89 97 191 60 187 176 235 130 76 47 234 250 61 79 82 111 130 190 180 151 40 37 61 192 166
45 166 76 141 101 65 216 42 366 351 92 28 192 228 40 124 122 77 72 135 103 216
-190B16
##PAGE=	F1=-3360.63
##FIRST=	25169.313707327481097,	5807.6787752999953227,	0
##DATA TABLE=	(F2++(Y..Y)), PROFILE
5808 57 50 78 154 117 208 232 96 43 56 93 153 273 131 264 206 130 27 208 236 158 125 72 133 45 109 194 118 134 146 196 156 77 190
5420 190 35 74 30 82 53 79 185 211 141 69 56 100 99 56 136 129 107 124 68 89 211 248 283 371 175 75 80 176 124 23 122 29 109
5033 109 231 326 142 212 193 90 128 216 69 307 45 284 108 142 21 129 32 126 183 143 111 209 158 127 269 98 91 173 86
4693 86 131 46 186 72 415 222 318 296 93 88 25 122 202 266 161 114 121 48 126 136 101 166 284 128 35 78 74 49 75 110 92 45 88
4305 88 180 116 44 146 115 132 184 116 213 274 144 165 72 53 109 158 202 217 138 70 106 59 196 87 92 200 211 133 14 85 61 173
3930 173 151 77 143 71 74 129 51 180 162 66 28 64 56 87 208 170 98 91 165 127 101 133 46 107 45 80 18 99 71 169 196 40 154 79
3531 79 177 79 72 66 94 140 27 95 131 123 122 59 128 212 182 155 27 351 261 182 69 210 78 169 164 207 50 131 114 133 191 88 189
3143 189 244 98 47 204 85 231 190 113 30 152 147 133 62 131 102 41 116 44 166 149 97 208 142 128 148 233 157 233 163 41 134
2779 134 102 173 125 55 85 206 128 78 237 397 231 185 81 175 159 115 72 124 139 187 159 115 235 109 134 138 112 195 175 128 133 153
2404 153 166 140 61 178 297 194 87 260 298 68 250 179 204 248 69 29 64 80 58 96 104 201 201 97 98 96 225 143 138 153 201 301
2028 301 199 182 109 185 132 297 281 82 111 63 91 213 200 202 187 76 84 50 169 90 67 121 45 34 132 115 39 76 157 150 266 153
1653 153 35 30 273 285 77 162 95 69 64 207 317 76 180 271 151 123 164 85 31 162 148 150 154 219 259 193 169 128 68 93 154 93
1277 93 80 104 90 146 88 42 69 75 98 168 74 100 109 48 114 102 200 241 181 214 133 78 94 184 61 149 178 55 91 82 128 56 137 92 131 44
854 44 72 135 170 114 178 236 133 37 206 181 178 207 67 133 176 81 98 27 100 21 186 238 174 307 165 112 195 260 178 74 147 112 217
467 217 192 94 340 179 70 103 204 306 54 173 180 89 131 195 14 204 184 174 85 57 52 234 260 43 101 97 134 154 202 185 120
103 120 19 79 76 223 178 88 148 57 65 238 83 320 327 74 15 209 227 14 119 102 23 124 127 103 210
-190B10
##PAGE=	F1=-3462.89
##FIRST=	25169.313707327481097,	5807.6787752999953227,	0
##DATA TABLE=	(F2++(Y..Y)), PROFILE
5808 45 64 61 131 102 185 229 84 28 31 44 131 295 148 223 196 154 33 219 233 130 96 62 154 33 94 192 77 153 138 208 157 116
5432 116 172 62 50 43 76 52 95 191 208 134 69 61 139 139 69 143 136 130 163 73 155 264 224 290 399 180 99 78 166 142 51 160 102 130 208
5021 208 282 88 225 170 26 124 219 64 328 39 247 71 134 21 128 113 65 187 149 82 202 155 96 227 75 119 202 112
4693 112 179 68 165 48 375 157 345 265 93 78 87 118 184 284 175 160 134 82 64 121 202 150 255 115 48 85 88 105 143 148 89
4329 89 52 79 226 137 35 97 90 149 158 87 192 292 183 173 69 67 123 196 282 238 113 71 120 48 174 66 90 206 217 111 29
3965 29 84 59 226 207 90 136 62 129 157 64 164 131 85 83 112 63 89 200 150 34 64 203 168 104 99 72 142 92 41 90 103 73 133
3578 133 141 52 187 64 196 125 54 96 128 148 49 63 138 129 135 80 73 137 194 156 14 381 273 142 147 216 26 152 146 220 76 89 121
3190 121 131 203 114 147 251 168 24 169 90 242 178 70 33 138 160 202 101 92 84 62 83 61 207 163 95 217 147 88 142 228 191
2826 191 204 131 69 90 42 176 184 61 121 244 124 127 256 388 249 192 96 156 177 139 101 140 169 226 193 97 202 120 152 140 130 263
2451 263 183 139 136 170 135 67 83 129 293 239 66 219 272 25 190 122 201 258 85 36 33 58 43 84 110 183 180 104 96 89 211 142 196 143
2052 143 189 320 223 114 99 157 185 308 297 89 135 80 123 219 129 180 186 100 117 70 201 132 15 113 32 29 139 126 37 83 168 210
1676 210 245 176 14 52 258 337 152 123 80 10 119 200 352 135 145 220 157 69 163 108 32 166 110 95 129 187 230 217 168 101 70
1312 70 88 114 80 74 123 101 153 141 52 110 92 141 164 49 65 68 59 160 118 182 260 202 212 173 112 121 175 106 206 149 55 84 122 97 67 156
890 156 76 152 18 57 134 153 69 138 186 95 66 188 151 155 214 117 120 199 27 163 35 87 5 178 193 170 300 131 123 222 265 180 80
502 80 150 79 271 239 26 306 201 46 114 226 306 90 193 196 108 149 194 53 210 174 106 78 81 50 216 254 70 117 113 143 177
138 177 201 178 78 40 147 108 242 186 117 128 6 65 251 131 253 293 67 16 202 206 16 116 115 38 172 108 109 199
-190A99
##PAGE=	F1=-3565.14
##FIRST=	25169.313707327481097,	5807.6787752999953227,	0
##DATA TABLE=	(F2++(Y..Y)), PROFILE
5808 57 75 47 110 88 158 232 93 24 21 29 104 290 161 159 149 168 82 215 210 93 68 128 201 73 83 188 55 150 116 204 157 164 139 80
5409 80 74 71 74 24 95 203 188 104 59 73 168 163 126 150 141 150 196 62 238 311 189 276 392 178 113 75 144 149 96 183 161 143 187 239 26
4998 26 212 141 41 137 209 56 324 48 214 28 116 33 128 200 57 180 149 82 224 152 68 170 59 133 222 128 203 100 168
4657 168 19 311 77 348 226 116 69 135 99 154 281 176 200 168 135 68 109 285 154 233 140 113 128 91 169 212 187 86 85 72
4305 72 255 173 18 50 48 154 136 77 169 287 211 164 54 122 145 236 338 252 98 89 165 90 134 45 109 215 195 81 37 78 50 248
3930 248 232 101 114 78 166 158 72 153 143 127 183 174 84 75 189 124 51 86 210 202 100 82 167 192 148 41 156 116 63 121 102 84 203
3542 203 41 226 169 55 136 154 134 72 27 150 135 154 86 62 81 220 154 21 364 258 100 223 221 60 119 112 213 97 68
3202 68 126 108 210 124 120 242 219 94 113 81 244 176 21 63 125 161 245 131 68 78 90 55 112 240 172 93 202 183 96 136 214 214
2826 214 171 93 102 44 46 169 224 81 142 274 119 176 277 360 251 199 109 125 173 166 101 136 191 234 214 111 160 116 151 135 152 326
2451 326 180 139 129 167 124 20 127 102 283 268 112 157 226 39 122 72 203 262 112 73 20 120 97 68 119 161 146 124 88 80 187
2087 187 177 245 117 152 308 250 63 117 114 227 295 276 98 161 128 139 229 63 142 182 112 150 86 222 186 76 116 62 90 140 136 78
1711 78 94 203 236 222 196 33 86 239 359 216 69 90 63 145 172 356 184 105 159 158 27 156 114 39 150 60 50 111 147 183
1359 183 237 166 125 127 70 76 69 66 129 99 140 182 69 144 102 162 142 34 27 16 58 198 161 163 259 209 178 168 119 155 172 156 266 120 56
948 56 74 162 83 93 175 60 175 41 85 132 128 27 86 146 70 99 160 109 132 209 174 117 236 52 210 73 99 15 144 145 172 286
573 286 85 148 229 259 184 100 178 47 276 268 47 257 225 40 115 224 280 131 211 190 138 137 185 96 197 154 61 107 106 38 188 233
197 233 111 124 123 139 197 187 165 53 83 226 151 251 186 128 97 62 57 266 180 177 259 79 35 175 171 45 129 144 84 216 97 119
-178 119 185
-190A85
##PAGE=	F1=-3667.4
##FIRST=	25169.313707327481097,	5807.6787752999953227,	0
##DATA TABLE=	(F2++(Y..Y)), PROFILE
5808 81 80 34 87 76 131 239 115 46 38 66 74 256 161 96 74 168 117 193 169 53 40 188 244 128 106 179 61 128 84 172 152 201 88
5420 88 83 108 94 93 47 93 204 160 57 36 91 186 174 153 154 140 159 218 50 310 332 148 242 351 173 112 68 109 140 142 192 199 139 172
5021 172 207 70 179 115 89 138 190 46 300 52 190 37 88 34 122 258 109 159 147 89 250 157 58 119 59 126 232 135 197
4681 197 115 201 68 232 15 323 179 143 63 158 73 125 261 158 221 199 178 96 106 335 182 215 173 158 183 81 229 273 222
4340 222 82 118 72 258 199 32 52 5 143 119 86 149 257 216 140 39 173 161 267 355 252 88 116 201 126 87 25 134 222
4000 222 153 50 44 59 33 238 225 116 78 97 180 136 74 162 173 175 277 233 81 54 178 100 129 142 193 226 88 82 246 234 203 44
3624 44 205 135 42 146 101 118 197 15 258 205 70 176 167 92 94 25 162 147 178 71 99 56 245 150 46 302 224 70 270 225
3272 225 123 74 66 174 101 85 124 77 213 115 103 217 237 149 56 73 224 169 32 85 110 153 248 141 88 99 114 36 159 256 169
2909 169 112 181 245 148 122 182 223 150 54 133 66 142 160 239 94 141 285 113 214 304 324 242 202 120 93 150 192 72 118 189 205 222
2533 222 129 120 97 132 121 176 365 156 137 114 140 128 68 159 124 285 270 163 79 176 85 58 57 208 248 128 109 41 173 141 54 126
2157 126 137 116 150 74 76 158 231 279 79 96 270 276 67 118 108 252 264 224 110 181 174 131 216 34 110 177 108 169 95 227 238 154 139
1770 139 91 141 140 146 121 107 234 218 207 199 46 105 211 339 256 29 126 87 143 149 330 219 80 105 152 76 147 104 50 119 44 76 116
1383 116 111 130 252 162 199 216 54 48 77 55 128 85 108 205 86 159 99 157 112 32 21 48 52 224 198 149 237 201 131 126 90 184 185 194 302
972 302 115 71 69 197 98 108 179 60 198 78 138 138 96 6 65 129 61 123 137 73 123 193 219 117 275 111 230 102 116 29 89
608 89 121 173 267 37 170 213 246 188 115 211 78 242 277 115 199 244 45 114 204 231 153 206 157 169 97 167 121 163 133 66 123 114 35
221 35 164 206 140 124 127 129 213 166 159 85 125 298 197 250 180 133 96 114 53 289 227 111 231 107 54 134 132 70 156 165 110 253 124 131
-178 131 174
-190A74
##PAGE=	F1=-3769.66
##FIRST=	25169.313707327481097,	5807.6787752999953227,	0
##DATA TABLE=	(F2++(Y..Y)), PROFILE
5808 103 79 22 61 74 103 242 139 87 58 95 46 199 149 103 27 149 124 158 117 43 28 229 272 172 149 168 105 100 51 108 138 217
5432 217 25 70 131 117 130 117 114 185 134 26 6 110 194 175 142 151 137 154 225 61 361 318 108 195 284 162 95 66 74 113 179 193 217
5045 217 117 164 197 142 134 93 115 110 173 36 268 52 175 82 52 19 107 283 160 124 139 83 264 168 69 92 73 99 230 132 167
4681 167 113 250 151 159 71 277 125 163 73 156 51 106 228 120 212 209 200 94 113 349 222 191 193 178 236 76 282 321 248 80 141
4317 141 73 231 200 65 101 59 119 103 101 131 208 196 101 36 204 163 278 334 239 76 146 215 137 46 16 150 222 108 29 55 38 26
3941 26 205 191 135 42 100 177 110 74 190 191 215 346 277 42 101 169 96 198 185 167 239 67 90 294 251 248 34 230 152 52 188
3578 188 130 148 170 12 286 231 87 202 164 27 112 57 165 172 202 41 139 46 263 143 87 213 186 60 275 235 176 30 22
3237 22 103 84 119 113 59 214 88 89 184 229 182 42 80 177 144 67 90 93 146 215 130 124 130 128 27 198 253 152 145 166 305 192 98 127 212
2826 212 153 17 154 119 221 158 227 95 118 270 112 237 336 290 225 196 131 67 113 211 36 103 162 146 222 131 92 70 101 103 198
2462 198 366 110 147 90 89 139 100 169 172 305 247 190 4 160 132 33 75 212 208 131 132 59 196 165 54 135 110 106 173 58 77 128 278
2075 278 297 50 30 211 300 96 103 165 265 227 159 125 185 203 95 167 42 98 172 95 163 95 215 270 218 173 108 171 144 156 157 118
1700 118 247 162 205 181 52 101 173 276 265 67 164 79 119 154 283 241 81 69 138 120 133 81 61 93 88 118 132 91 88 263 155 280
1324 280 308 59 58 115 55 120 65 76 220 100 159 83 126 90 23 46 109 46 239 213 145 200 183 112 74 29 196 208 216 306 139 94 73
937 73 221 120 101 155 84 218 110 185 157 68 24 94 125 67 147 130 73 126 166 244 111 301 172 225 114 124 32 47 141 169 242 39
561 39 183 181 234 193 129 233 150 202 268 166 136 251 43 117 182 168 154 176 103 192 63 145 133 115 121 80 109 102 68 169 186 150 122 125
162 125 122 223 149 169 136 155 345 236 239 169 161 140 150 80 316 274 96 215 144 67 93 104 89 178 175 114 279 181 139 169
-190A69
##PAGE=	F1=-3871.92
##FIRST=	25169.313707327481097,	5807.6787752999953227,	0
##DATA TABLE=	(F2++(Y..Y)), PROFILE
5808 119 76 18 30 97 71 235 155 129 72 110 31 131 126 162 106 109 96 123 63 85 64 250 282 196 180 162 166 88 52 24 121 209 46 43 137
5397 137 140 165 178 152 146 117 53 39 126 193 171 113 141 133 140 222 95 386 270 67 147 205 146 68 80 79 71 196 193 223 82 160 206 198 91
4986 91 76 120 58 173 23 236 57 164 117 11 12 84 275 196 82 125 65 260 177 88 89 96 61 216 120 132 96 296 239 116 110
4622 110 221 69 173 100 137 35 103 187 69 173 187 194 67 131 333 260 149 194 177 279 98 323 348 256 83 149 72 180
4294 180 177 99 152 110 88 86 109 104 148 154 56 40 209 148 263 284 222 60 175 219 121 25 22 155 211 92 34 68 76 72 162 139 155 41 82
3883 82 169 105 80 219 184 233 376 297 30 200 168 120 249 195 150 246 43 102 308 234 278 22 227 157 106 227 166 166 130 27
3531 27 308 246 94 202 140 49 119 80 155 205 221 38 178 39 271 139 136 122 159 62 241 252 211 31 43 13 51 150 100 63 208
3167 208 52 99 150 210 194 67 99 112 102 85 74 75 145 165 111 152 154 133 23 231 231 116 171 150 339 208 74 57 185 177 20 163
2791 163 158 262 156 194 81 81 232 125 245 366 263 207 175 149 47 70 217 55 106 123 82 223 109 85 53 81 112 212 325
2451 325 63 175 63 44 160 105 157 216 326 210 190 72 193 178 61 87 211 139 140 137 63 188 169 73 151 96 115 187 46 81
2099 81 93 302 305 74 51 143 322 119 103 235 269 195 101 140 166 214 34 87 35 102 171 83 127 84 190 268 256 203 118 177 154 160 179
1711 179 120 232 89 213 152 60 78 125 181 247 103 190 47 86 171 225 246 94 46 118 138 115 48 73 95 126 143 143 92 69 271 146
1336 146 339 381 75 101 166 78 103 58 85 240 112 152 68 75 101 26 63 160 44 246 208 152 169 163 135 82 52 183 229 224 279 167
960 167 113 86 224 136 72 101 124 232 133 212 180 64 33 125 118 89 179 140 105 128 136 248 96 307 226 207 109 119 26 89 180 158 212
573 212 75 181 142 228 198 148 242 215 202 248 192 74 238 40 126 175 100 141 128 39 201 104 131 141 69 117 76 72 73 118 218 195 143
185 143 122 119 122 229 148 190 179 170 356 261 214 156 209 190 166 129 339 316 130 216 178 70 63 97 99 183 175 98 285 239 142 169
-190A69
##PAGE=	F1=-3974.17
##FIRST=	25169.313707327481097,	5807.6787752999953227,	0
##DATA TABLE=	(F2++(Y..Y)), PROFILE
5808 127 71 15 13 143 42 210 156 160 79 113 45 65 101 205 171 56 39 116 27 132 116 252 276 194 184 163 221 101 86 78 112 179
5432 179 104 33 127 157 181 210 179 99 102 70 75 136 184 163 117 138 128 130 219 129 383 204 31 110 133 120 40 106 126 31 188 188 227 64
5033 64 154 219 228 62 62 113 34 194 13 213 76 147 132 34 51 60 244 215 40 108 40 238 177 103 97 121 48 191 104 113 73 324 313
4646 313 104 125 169 21 172 127 115 37 116 143 19 109 134 163 61 151 296 291 87 178 161 304 139 350 346 242 91 144 66 115
4294 115 137 126 194 153 61 75 104 62 90 101 38 47 190 125 220 229 211 43 207 233 95 14 25 153 189 115 51 77 153 141 123 82 165
3906 165 70 46 177 126 104 232 152 220 363 292 123 309 190 163 273 165 151 249 36 114 293 178 286 32 200 151 173 255
3578 255 201 169 92 34 324 253 87 171 95 122 110 88 131 235 230 75 220 49 269 145 183 89 143 72 185 269 225 58 79 79 26
3214 26 171 92 68 189 54 139 116 192 192 81 124 43 55 94 37 59 146 124 94 163 164 134 23 256 198 65 176 119 343 194 66
2850 66 30 155 214 60 159 169 252 140 147 51 46 190 147 242 381 243 191 146 176 32 31 206 91 118 89 78 224 66 99 67 101
2486 101 158 211 250 81 205 41 81 191 86 132 245 329 178 168 115 238 219 80 86 204 65 176 128 51 160 157 99 176 127
2146 127 133 187 43 84 58 298 307 122 119 77 343 134 143 290 265 176 61 153 120 210 63 35 22 109 172 90 69 68 164 229 258 221 133
1758 133 167 171 156 185 108 190 76 225 126 71 44 77 78 214 117 197 24 58 172 168 235 106 23 99 134 97 14 83 116 141 149 144 115 73
1359 73 275 137 362 418 82 150 213 112 82 80 123 267 122 143 79 10 136 68 66 192 49 250 190 163 165 147 159 134 130 147 232 227
984 227 235 180 118 105 203 138 27 46 168 238 147 216 200 88 37 141 101 124 220 156 142 119 113 235 83 288 265 198 95 108 17 139
608 139 210 139 177 96 161 103 231 202 175 242 248 237 220 189 30 200 53 134 185 44 123 77 24 196 168 131 155 52 113 52 46 35 167
221 167 293 237 126 129 107 131 232 158 210 203 171 326 268 172 138 251 219 166 180 346 347 161 232 198 62 54 107 100 162 170 70 267 278
-167 278 140 168
-190A68
##PAGE=	F1=-4076.43
##FIRST=	25169.313707327481097,	5807.6787752999953227,	0
##DATA TABLE=	(F2++(Y..Y)), PROFILE
5808 125 68 11 53 196 52 166 141 174 80 113 67 11 81 213 202 48 35 144 54 168 164 241 258 167 159 166 254 120 118 165 125 134 141 66
5409 66 104 158 173 203 176 71 78 60 98 137 170 148 169 156 121 131 223 150 355 147 44 87 83 88 20 132 176 32 156 169 242 103 140
5021 140 224 229 47 47 106 94 220 32 202 104 122 127 75 92 46 200 218 16 98 17 198 168 110 113 140 80 158 87 113 52 326 362 87
4634 87 124 130 45 164 139 104 60 131 101 20 33 58 118 113 166 249 309 23 151 139 305 175 362 310 209 107 137 56 55 99 146 223 184
4247 184 45 78 83 10 51 52 72 62 158 106 156 189 206 34 240 259 84 12 28 149 160 143 63 74 233 217 95 33 159 92 8 205
3871 205 152 147 223 100 174 315 266 213 403 236 215 266 101 166 251 59 116 256 91 271 45 157 157 239 268 233 162 84 33 334
3519 334 253 65 117 44 175 82 85 107 246 223 106 261 77 259 161 215 129 130 83 129 269 221 77 102 156 53 175 92 60 154
3167 154 105 189 86 174 182 83 149 10 16 104 18 45 143 104 77 160 161 142 49 267 168 13 158 71 326 157 74 95 137 252 103 147
2791 147 152 191 104 97 11 22 170 161 236 373 228 177 127 208 29 35 177 104 121 80 120 223 27 131 94 150 219 198 156 133 222 32
2416 32 136 217 58 111 256 302 165 138 120 266 253 79 90 192 97 234 116 29 128 143 121 204 185 150 171 48 89 60 274 306
2063 306 163 176 30 360 144 202 319 252 174 46 164 53 197 152 131 62 109 171 118 40 58 144 161 226 220 167 158 191 154 178 90
1700 90 123 140 233 113 80 10 36 38 181 104 188 69 44 150 124 210 113 27 93 128 84 16 91 128 129 139 146 160 98 278 130 346 414
1312 414 74 190 245 143 84 117 150 285 132 128 119 58 168 114 58 198 58 252 166 169 180 133 158 171 187 99 212 229 189 172 112
948 112 127 154 130 27 86 202 235 154 197 210 114 41 143 78 165 265 169 174 102 112 213 92 248 280 209 82 97 25 162 221 111
584 111 142 95 121 73 237 201 199 237 239 262 191 156 55 138 76 138 202 41 108 41 70 178 212 141 173 70 111 27 86 34 202 366 295
197 295 103 143 88 143 230 165 220 205 165 259 256 114 112 266 217 165 221 327 353 166 253 198 50 64 123 94 119 161 46 230 289 134
-178 134 161
-190A61
##PAGE=	F1=-4178.69
##FIRST=	25169.313707327481097,	5807.6787752999953227,	0
##DATA TABLE=	(F2++(Y..Y)), PROFILE
5808 111 64 29 92 238 92 109 114 169 79 116 86 23 69 188 196 104 107 179 91 186 196 220 227 119 128 165 256 133 139 229 160 89 148 100 73
5397 73 142 148 161 139 92 42 24 105 125 153 131 226 186 113 139 229 153 306 127 87 70 58 53 19 148 209 45 112 131 271 163 116 214
5010 214 203 35 31 98 144 239 67 197 133 90 107 110 126 54 155 207 30 101 5 145 150 107 134 145 113 120 76 109 49 299 380 45 121
4622 121 111 88 151 133 104 92 137 72 45 44 29 98 175 171 196 309 82 119 120 280 190 353 240 165 133 146 47 38 78 155 230 200 47 92
4223 92 50 59 50 21 107 80 123 105 82 174 194 42 265 280 97 49 34 144 127 159 67 59 295 285 79 45 137 101 39 235 169 201 195 38
3824 38 104 245 231 279 460 295 265 233 17 186 250 84 99 203 12 236 51 114 193 294 268 258 155 107 30 338 247 33
3495 33 79 77 200 42 83 96 224 200 121 290 106 245 177 224 165 119 90 90 242 204 87 113 206 87 159 91 50 104 156 229 92
3132 92 159 169 86 167 36 3 121 76 31 129 84 53 149 148 162 86 263 154 40 126 29 301 110 81 141 131 282 145 128 114 90
2768 90 62 54 65 5 177 150 237 337 213 160 134 237 43 66 134 87 106 87 144 218 56 173 112 197 273 177 66 162 215 27 167
2404 167 223 43 107 248 250 162 105 89 266 270 64 114 181 185 290 117 28 112 142 132 226 236 158 147 55 105 105 245 300 187 215 35
2028 35 369 153 253 322 227 184 75 176 60 180 235 223 117 97 161 160 104 71 130 86 168 200 213 168 211 169 165 94 44 193 234 108
1653 108 81 21 22 81 159 76 167 118 46 134 104 182 110 61 105 143 73 34 94 118 99 120 157 217 141 280 128 300 371 57 212 252 167
1265 167 130 154 149 277 136 103 169 118 181 149 41 181 65 255 141 162 190 116 130 179 208 59 171 224 154 142 107 148 84 118 68
901 68 146 215 224 156 164 208 130 46 139 57 203 305 176 194 81 129 186 117 194 265 228 79 95 39 150 210 78 107 73 63 56 241 191
514 191 207 224 192 255 166 97 93 62 90 140 209 77 100 28 97 154 223 151 188 96 121 69 138 82 216 415 341 71 161 61 154 222 161
127 161 219 188 169 170 225 46 85 246 182 175 247 274 322 141 265 174 51 80 136 82 63 148 37 185 271 124 143
-190A43
##PAGE=	F1=-4280.95
##FIRST=	25169.313707327481097,	5807.6787752999953227,	0
##DATA TABLE=	(F2++(Y..Y)), PROFILE
5808 86 59 56 118 257 125 47 83 148 86 120 96 39 68 139 159 149 158 201 120 188 205 194 184 69 145 162 228 136 146 261 199 83 123 114
5409 114 44 113 121 97 80 130 26 31 96 101 133 117 263 210 113 150 226 137 242 133 123 58 50 33 21 153 218 36 73 75 302 215 77
5021 77 187 156 17 15 87 167 244 107 190 158 61 91 135 145 75 114 183 42 105 25 88 127 100 154 132 129 84 76 85 76 246 373 15 124
4622 124 119 124 138 118 106 125 127 74 59 100 103 136 234 168 138 287 157 88 111 234 177 322 145 125 164 178 44 62 85 159 211 197 57
4235 57 107 43 120 59 20 128 97 93 116 15 169 163 63 273 281 109 88 43 138 97 162 68 34 326 332 74 85 105 95 65 252 176 252
3848 252 162 36 28 172 192 305 473 348 302 180 73 205 245 101 64 134 111 187 55 90 244 328 256 271 158 136 36 332
3519 332 234 41 119 155 197 52 99 95 167 163 122 301 128 231 182 206 172 119 86 60 186 180 88 116 227 110 124 77 70 52 192 248
3143 248 141 151 152 98 170 30 4 136 135 36 104 49 28 137 135 191 115 247 161 67 96 54 273 68 80 163 119 291 176 106 78 40
2768 40 94 27 140 33 181 109 247 276 191 141 152 256 63 91 85 44 76 96 138 213 89 212 117 229 312 160 15 155 184 10
2416 10 170 202 56 111 226 196 145 64 60 241 265 39 151 176 251 326 136 64 114 157 127 238 262 153 126 57 136 151 223 281 193
2052 193 230 49 361 158 283 305 194 197 131 195 149 159 297 287 162 71 142 201 166 98 116 51 103 166 259 193 227 206 156 133 61 215
1676 215 227 104 73 34 32 91 147 61 141 153 65 165 119 167 94 90 124 170 52 39 89 88 59 104 178 272 193 283 128 235 297 46 213
1289 213 235 179 194 183 118 233 132 70 210 157 174 164 21 147 75 260 116 138 185 96 85 161 188 50 116 204 136 98 122 169 38
925 38 116 96 175 198 205 154 127 197 132 53 135 46 231 330 172 203 73 145 154 133 137 221 236 86 99 48 112 182 47 76 52 13 54 240
526 240 168 192 198 133 221 159 34 120 18 85 157 205 106 98 17 105 132 201 155 193 124 147 131 177 131 206 425 356 24 179 37 159 203
138 203 142 207 157 187 90 179 38 85 197 123 198 261 189 253 91 260 130 72 89 136 69 17 124 36 148 229 111 115
-190A15
##PAGE=	F1=-4383.21
##FIRST=	25169.313707327481097,	5807.6787752999953227,	0
##DATA TABLE=	(F2++(Y..Y)), PROFILE
5808 57 51 75 122 245 140 10 54 121 102 117 94 39 72 84 105 168 177 199 139 176 190 167 135 73 214 164 179 131 142 265 231 123 76
5420 76 102 20 82 98 34 35 155 71 85 86 67 111 111 272 212 136 176 203 108 171 135 144 58 56 46 31 148 204 15 57 21 318 247 23 146
5010 146 99 19 2 68 162 236 145 174 175 53 95 150 147 90 80 148 50 96 57 70 97 92 165 103 128 54 92 45 122 180 353 70 123 149 147
4599 147 128 111 102 153 110 102 71 128 155 193 284 161 83 247 214 64 116 175 138 267 39 99 195 223 45 79 122 165 168 173 62 117 84
4211 84 166 56 36 133 107 69 123 55 156 117 96 262 256 106 117 46 126 78 163 77 22 318 346 76 119 85 76 74 245 176 290 145
3836 145 99 50 123 152 286 443 380 315 123 148 220 237 104 48 56 186 134 71 93 284 333 235 268 169 154 55 318 211 87 184 224
3472 224 173 113 138 93 82 124 121 290 140 215 170 165 148 135 71 28 111 156 80 118 225 121 82 47 109 38 205 240 177 129 140 116 157
3085 157 12 30 139 185 72 77 39 53 127 129 216 125 232 173 66 89 79 236 53 71 177 90 271 188 79 79 154 172 17 211
$$ [...]
-190A10
##END NTUPLES=	nD NMR SPECTRUM
##END=	
##END=	
