##TITLE=	enk4U0bIRYmVwMSUe$sBBg.34.ser
TM-VI-111 hmqc

##JCAMP-DX=	6.0	$$ MestReNova 14.3.1-31739
##DATA TYPE=	LINK
##BLOCK_ID=	1
##BLOCKS=	2    
##ORIGIN=	Mestrelab Research S.L.
##OWNER=	hrzepa
##$MNOVA/LINK_BLOCK_TYPE=	ITEM	$$ NMR Spectrum
##$MNOVA/ITEM/POLYGON=	(XY..XY)
5321,5835
8722,5835
8722,8208
5321,8208
5321,5835
##$MNOVA/ITEM/Z=	0
##$MNOVA/ITEM/ANGLE=	0
##TITLE=	enk4U0bIRYmVwMSUe$sBBg.34.ser
##JCAMP-DX=	6.0	$$ MestReNova 14.3.1-31739
##BLOCK_ID=	2
##DATA TYPE=	MNOVA NMR VIEW DATA
##DATA CLASS=	MNOVA VIEW DATA
##$MNOVA/2D/THRESHOLD=	4.3362150192260742188
##$MNOVA/ITEM/ZOOM/X=	-0.98001264966690615488,	11.003459999979801509
##$MNOVA/ITEM/ZOOM/Y=	-9.7479769829748601495,	190.10579999390242278
##END=	
##TITLE=	enk4U0bIRYmVwMSUe$sBBg.34.ser
##JCAMP-DX=	6.0	$$ MestReNova 14.3.1-31739
##BLOCK_ID=	3
##DATA TYPE=	nD NMR SPECTRUM
##DATA CLASS=	NTUPLES
##NUMDIM=	2
##ORIGIN=	Bruker BioSpin GmbH
##OWNER=	nmr
##.OBSERVE FREQUENCY=	400.41200205000001233
##.OBSERVE NUCLEUS=	^1H
##.SOLVENT NAME=	CDCl3
##.PULSE SEQUENCE=	hmqcgpqf
##LONGDATE=	2021/10/07 19:11:31.000
##.ACQUISITIONMODE=	SIMULTANEOUS (DQD)
##$ORIGINAL FORMAT=	Bruker XWIN-NMR
##$MNOVA/SCALES_VERSION=	9
##$PARAMETER FILE=	(acqu2s, ASCII, /private/var/folders/f6/rjf_tdyn2v98c5c0wvkgn4s80000gn/T/enk4U0bIRYmVwMSUe$sBBg/34/acqu2s, 0)
$$ ##TITLE= Parameter file, TOPSPIN		Version 3.2
$$ ##JCAMPDX= 5.0
$$ ##DATATYPE= Parameter Values
$$ ##NPOINTS= 129	$$ modification sequence number
$$ ##ORIGIN= Bruker BioSpin GmbH
$$ ##OWNER= nmr
$$ $$ 2021-10-07 19:21:01.443 +0100  nmr@CZC10666PP
$$ $$ /opt/topspin/data/agmb/nmr/Oct07-2021/34/acqu2s
$$ $$ process /opt/topspin3.2/prog/mod/go
$$ ##$ACQT0= 0
$$ ##$BF1= 100.683175
$$ ##$FnMODE= 1
$$ ##$NUC1= <13C>
$$ ##$NusJSP= 0
$$ ##$NusT2= 1
$$ ##$NusTD= 128
$$ ##$O1= 9059.81359838393
$$ ##$SFO1= 100.692234813598
$$ ##$SW= 200.226863172749
$$ ##$SW_h= 20161.2903225806
$$ ##$TD= 128
$$ ##END=
$$ 
##$PARAMETER FILE=	(acqus, ASCII, /private/var/folders/f6/rjf_tdyn2v98c5c0wvkgn4s80000gn/T/enk4U0bIRYmVwMSUe$sBBg/34/acqus, 0)
$$ ##TITLE= Parameter file, TOPSPIN		Version 3.2
$$ ##JCAMPDX= 5.0
$$ ##DATATYPE= Parameter Values
$$ ##NPOINTS= 12	$$ modification sequence number
$$ ##ORIGIN= Bruker BioSpin GmbH
$$ ##OWNER= nmr
$$ $$ 2021-10-07 19:21:05.900 +0100  nmr@CZC10666PP
$$ $$ /opt/topspin/data/agmb/nmr/Oct07-2021/34/acqus
$$ $$ process /opt/topspin3.2/prog/mod/shimcntl
$$ ##$ACQT0= 1000000
$$ ##$AMP= (0..31)
$$ 100 100 100 100 100 100 100 100 100 100 100 100 100 100 100 100 100 100
$$ 100 100 100 100 100 100 100 100 100 100 100 100 100 100
$$ ##$AMPCOIL= (0..19)
$$ 0 0 0 0 0 0 0 0 0 0 0 0 0 0 0 0 0 0 0 0
$$ ##$ANAVPT= -1
$$ ##$AQSEQ= 0
$$ ##$AQ_mod= 3
$$ ##$AUNM= <au_zg>
$$ ##$AUTOPOS= <31 >
$$ ##$BF1= 400.41
$$ ##$BF2= 100.683175
$$ ##$BF3= 400.41
$$ ##$BF4= 400.41
$$ ##$BF5= 400.41
$$ ##$BF6= 400.41
$$ ##$BF7= 400.41
$$ ##$BF8= 400.41
$$ ##$BYTORDA= 0
$$ ##$CAGPARS= (0..11)
$$ 0 0 0 0 0 0 0 0 0 0 0 0
$$ ##$CFDGTYP= 0
$$ ##$CFRGTYP= 9
$$ ##$CHEMSTR= <none>
$$ [...]
$$ 0 0 0 0
$$ ##$ShimPowMaxUC= (0..63)
$$ 130000 130000 130000 130000 130000 130000 130000 130000 130000 130000 130000
$$ 130000 130000 130000 130000 130000 130000 130000 130000 130000 0 0 0 0
$$ 0 0 0 0 0 0 0 0 0 0 0 0 0 0 0 0 0 0 0 0 0 0 0 0 0 0 0 0 0 0 0 0 0 0 0 0
$$ 0 0 0 0
$$ ##$ShimPowMaxUG= (0..63)
$$ 524287 524287 524287 524287 524287 524287 524287 524287 524287 524287 524287
$$ 524287 524287 524287 524287 524287 524287 524287 524287 524287 0 0 0 0
$$ 0 0 0 0 0 0 0 0 0 0 0 0 0 0 0 0 0 0 0 0 0 0 0 0 0 0 0 0 0 0 0 0 0 0 0 0
$$ 0 0 0 0
$$ ##$ShimPowRcbType= 3
$$ ##$ShimPowRes= (0..63)
$$ 1e-20 1e-20 1e-20 1e-20 1e-20 1e-20 1e-20 1e-20 1e-20 1e-20 1e-20 1e-20
$$ 1e-20 1e-20 1e-20 1e-20 1e-20 1e-20 1e-20 1e-20 0 0 0 0 0 0 0 0 0 0 0 0
$$ 0 0 0 0 0 0 0 0 0 0 0 0 0 0 0 0 0 0 0 0 0 0 0 0 0 0 0 0 0 0 0 0
$$ ##$ShimPowRng0= (0..63)
$$ 1 1 1 1 1 1 1 1 1 1 1 1 1 1 1 1 1 1 1 1 0 0 0 0 0 0 0 0 0 0 0 0 0 0 0 0
$$ 0 0 0 0 0 0 0 0 0 0 0 0 0 0 0 0 0 0 0 0 0 0 0 0 0 0 0 0
$$ ##$ShimPowRng1= (0..63)
$$ 1 1 1 1 1 1 1 1 1 1 1 1 1 1 1 1 1 1 1 1 0 0 0 0 0 0 0 0 0 0 0 0 0 0 0 0
$$ 0 0 0 0 0 0 0 0 0 0 0 0 0 0 0 0 0 0 0 0 0 0 0 0 0 0 0 0
$$ ##$ShimPowRng2= (0..63)
$$ 1 1 1 1 1 1 1 1 1 1 1 1 1 1 1 1 1 1 1 1 0 0 0 0 0 0 0 0 0 0 0 0 0 0 0 0
$$ 0 0 0 0 0 0 0 0 0 0 0 0 0 0 0 0 0 0 0 0 0 0 0 0 0 0 0 0
$$ ##$ShimPowRng3= (0..63)
$$ 1 1 1 1 1 1 1 1 1 1 1 1 1 1 1 1 1 1 1 1 0 0 0 0 0 0 0 0 0 0 0 0 0 0 0 0
$$ 0 0 0 0 0 0 0 0 0 0 0 0 0 0 0 0 0 0 0 0 0 0 0 0 0 0 0 0
$$ ##$ShimSysFunc= (0..63)
$$ 1 2 3 4 5 7 9 11 15 16 8 10 12 14 6 17 13 18 19 20 0 0 0 0 0 0 0 0 0 0
$$ 0 0 0 0 0 0 0 0 0 0 0 0 0 0 0 0 0 0 0 0 0 0 0 0 0 0 0 0 0 0 0 0 0 0
$$ ##$ShimSysMatrix= 0
$$ ##$ShimSysType= 1
$$ ##$TFXNUM= 0
$$ ##$TRIPLO2= 0
$$ ##$VTU= 2
$$ ##$VTUETH= <149.236.99.20>
$$ ##$VTUTY= <no>
$$ ##$WBREFAM= (0..15)
$$ 135 116 100 100 100 100 100 100 100 100 100 100 100 100 100 100
$$ ##$WBREFLM= (0..15)
$$ 0 0 0 0 0 0 0 0 0 0 0 0 0 0 0 0
$$ ##$WBREFPH= (0..15)
$$ 71.66 -68.25 0 0 0 0 0 0 0 0 0 0 0 0 0 0
$$ ##$WBSGU= (0..15)
$$ 0 0 0 0 0 0 0 0 0 0 0 0 0 0 0 0
$$ ##$XFAC= 2
$$ ##END=
$$ 
##$DECIM=	4160
##$DSPFVS=	20
##.ACQUISITIONSCHEME=	NOT PHASESENSITIVE
##NTUPLES=	nD NMR SPECTRUM
##VAR_NAME=	FREQUENCY1,	FREQUENCY2,	SPECTRUM
##SYMBOL=	F1,	F2,	Y
##.NUCLEUS=	13C,	1H
##.OBSERVE FREQUENCY=	100.69223481359800587,	400.41200205000001233
##VAR_TYPE=	INDEPENDENT,	INDEPENDENT,	DEPENDENT
##VAR_FORM=	AFFN,	AFFN,	ASDF
##VAR_DIM=	512,	512,	262144
##UNITS=	HZ,	HZ,	ARBITRARY UNITS
##FIRST=	19140.455529915001534,	4405.895418600002813,	0.18912169337272644043
##LAST=	-981.45727250430979893,	-392.40686505384644533,	0.27219873666763305664
##MIN=	-981.45727250430979893,	-392.40686505384644533,	0.00089575123274698853493
##MAX=	19140.455529915001534,	4405.895418600002813,	60.3810882568359375
##FACTOR=	1,	1,	0.0030012293677131470469
##PAGE=	F1=19140.5
##FIRST=	19140.455529915001534,	4405.895418600002813,	0.18912169337272644043
##DATA TABLE=	(F2++(Y..Y)), PROFILE
$$ [...]
##PAGE=	F1=-13621.6
##FIRST=	19140.455529915001534,	4405.895418600002813,	0
##DATA TABLE=	(F2++(Y..Y)), PROFILE
969 66 40 43 131 163 171 127 175 214 73 109 89 83 124 65 84 166 180 86 141 72 41 63 124 106 103 41 93 36 82 46 155 119 66 87 36 72 128
622 128 178 229 343 424 720 892 767 353 342 172 135 192 265 214 137 105 14 97 33 17 89 77 194 173 25 26 156 158 171 99 67 234
321 234 238 33 65 72 51 101 181 60 99 217 219 271 209 98 100 47 95 56 46 79 103 117 101 107 76 66 90 157 122 150 62 76 127 74 39 52
-17 52 67 136 209 216 226 52 132 125 85 164 145 148 164 65 113 132 119 50 232 364 38 135 118 227 179 56 183 187 216 250 99 93 215 44
-336 44 150 168 136 32 38 42
-392D2
##PAGE=	F1=-13700.4
##FIRST=	19140.455529915001534,	4405.895418600002813,	0
##DATA TABLE=	(F2++(Y..Y)), PROFILE
4406 64 97 67 154 76 110 102 47 142 126 219 232 145 203 271 186 82 126 50 147 141 33 53 102 110 235 253 233 80 72 32 97 168 67 108 167
4077 167 73 195 64 279 289 120 274 144 89 64 122 64 120 52 121 160 101 142 141 195 119 183 196 140 10 169 84 138 238 262 164
3786 164 62 113 163 113 68 79 85 77 219 194 38 107 169 174 18 170 172 139 38 41 57 111 16 174 150 57 169 42 166 114 220 241
3486 241 197 38 234 188 56 114 159 45 14 13 77 102 130 45 227 288 132 46 169 286 147 191 245 196 54 92 243 99 116
3213 116 168 187 123 67 110 31 112 27 77 60 159 124 166 100 162 142 185 256 159 64 233 172 157 125 63 105 79 119 236 100 129 65 22
2903 22 67 82 117 159 82 106 106 51 136 76 36 24 116 124 61 35 146 269 166 237 185 28 147 144 52 172 17 130 219 318 258 122
2603 122 108 105 108 59 108 34 170 173 68 80 131 129 106 86 78 177 50 122 123 232 328 104 125 131 109 95 102 120 149 119 143 94 85 123 96 224
2265 224 66 61 113 162 192 156 226 91 99 160 174 182 96 246 213 127 186 198 183 97 168 126 69 163 196 105 117 49 147 158 198 195 157 73 67 133
1927 133 166 44 78 156 244 137 75 171 171 76 106 96 112 177 153 99 174 191 134 102 101 152 328 295 93 341 232 123 110 179 93 31
1626 31 215 226 204 138 225 150 58 96 179 133 152 113 160 63 91 40 207 109 31 154 168 71 66 118 55 62 101 96 71 101 186 168 92 107 155
1298 155 20 182 201 179 94 62 161 78 34 136 120 187 108 88 43 139 206 247 231 187 86 117 110 39 49 62 81 143 57 150 138 139 205 86
979 86 63 81 31 94 108 108 120 151 191 112 93 84 96 128 102 73 193 147 101 173 52 32 75 95 101 104 3 62 77 51 55 131 104 51 156 109
640 109 53 117 230 167 361 375 627 682 652 338 402 185 146 151 252 246 153 94 43 135 43 106 14 50 205 212 18 44 152 189 158 91
340 91 78 227 263 99 51 100 22 76 202 77 122 239 223 227 214 61 77 69 114 107 48 38 82 131 90 97 70 73 74 151 129 150 53 93 113 110
2 110 70 41 79 164 241 200 168 79 173 166 87 184 171 170 179 81 94 116 118 64 215 344 27 128 116 253 202 74 213 210 209 210 105 88 218
-327 218 13 150 136 137 52 43 49
-392D9
##PAGE=	F1=-13779.2
##FIRST=	19140.455529915001534,	4405.895418600002813,	0
##DATA TABLE=	(F2++(Y..Y)), PROFILE
4406 73 103 67 144 61 128 117 42 124 115 238 259 154 210 231 147 134 183 41 163 185 76 37 31 136 266 258 226 60 68 33 139 228 53
4096 53 103 171 90 221 77 297 255 167 291 123 40 64 154 32 140 108 124 142 72 93 116 189 102 172 197 122 37 134 64 129 256
3805 256 291 201 75 114 195 127 64 73 72 98 218 190 25 74 164 205 32 155 187 154 26 19 94 145 47 233 169 74 147 60 175 124
3504 124 226 241 192 46 218 155 26 133 206 65 68 35 71 115 137 69 214 281 116 60 186 274 128 162 186 173 70 123 243
3232 243 92 103 187 200 109 109 77 26 119 48 81 92 173 108 133 107 175 169 157 195 135 63 203 174 152 135 88 79 40 104 230 113 111 84 41
2903 41 75 91 137 196 50 84 120 37 113 78 57 51 89 102 60 39 107 222 93 184 167 32 121 99 84 165 7 122 201 314 256 131
2603 131 94 87 125 44 57 62 137 167 62 56 117 109 106 69 90 204 121 161 106 193 328 120 91 81 92 71 74 124 118 97 182 54 100 118 56 216
2265 216 40 68 129 175 203 142 215 87 100 142 157 156 51 182 191 139 210 203 165 113 142 116 74 165 201 81 97 40 136 159 221 205 146 63
1946 63 84 154 162 57 82 154 220 111 91 184 189 99 133 128 130 232 212 73 151 157 171 36 57 133 283 285 74 325 252 144 125 181 115 34
1626 34 213 228 187 127 211 178 68 103 165 120 149 114 171 34 70 23 192 125 45 187 199 86 79 147 95 94 123 108 72 113 173 166 87 59
1307 59 105 17 185 195 169 104 35 170 67 27 106 154 195 102 86 22 82 182 241 217 170 109 140 119 92 86 76 71 121 67 210 170 139 188
988 188 60 65 122 10 63 101 84 103 98 133 135 88 64 97 121 128 79 208 127 122 187 28 81 77 66 89 97 27 72 128 23 75 88 74 41 196
650 196 177 8 91 258 161 372 406 649 538 508 260 417 217 158 81 200 257 186 66 56 155 61 180 66 17 204 239 46
387 46 61 159 222 133 63 99 230 274 150 38 137 12 51 223 126 139 257 251 218 216 54 65 88 132 140 48 37 55 135 79 90 93 114 52
68 52 123 126 138 35 109 106 140 106 45 117 199 269 180 111 126 190 189 73 184 194 192 194 111 56 88 121 71 177 284 43 115 117 257 204 92
-261 92 229 225 206 157 109 73 200 23 154 109 136 76 47 54
-392E4
##PAGE=	F1=-13857.9
##FIRST=	19140.455529915001534,	4405.895418600002813,	0
##DATA TABLE=	(F2++(Y..Y)), PROFILE
4406 77 105 58 124 40 130 112 89 120 108 259 279 162 219 182 102 180 219 27 176 219 117 97 34 140 268 255 210 30 69 25 165
4115 165 276 40 132 168 95 229 90 297 208 202 300 146 33 83 174 15 193 170 134 126 47 54 103 177 79 160 193 104 56 110 79 119
3814 119 253 297 231 83 120 226 145 66 56 61 100 207 185 31 44 156 232 70 137 189 148 6 36 139 166 107 282 174 83 128
3533 128 78 178 142 233 225 166 59 192 107 3 157 239 101 112 70 57 109 131 97 185 263 102 61 182 242 111 126 102 127 85 158
3242 158 230 66 71 200 195 103 148 58 28 103 86 51 91 168 79 92 109 171 175 125 134 123 82 190 195 168 141 106 70 18 82 211 137 95 104 84
2903 84 113 116 153 212 40 60 128 24 88 81 90 80 60 66 53 35 72 180 53 120 136 56 90 51 118 166 18 116 178 299 241 134 99 102
2584 102 125 31 16 96 94 161 63 65 101 85 88 48 91 216 175 208 85 150 309 142 61 35 83 83 76 115 113 89 231 15 129 133 19 211
2265 211 48 96 153 171 207 138 196 77 103 123 137 148 72 106 168 131 214 194 130 109 105 95 79 161 210 76 75 34 119 155 231 211 129 58
1946 58 87 155 132 77 72 151 185 77 114 198 197 118 146 149 147 267 253 92 189 212 209 35 15 117 226 256 47 287 254 170 126 159 125 53
1626 53 209 252 189 114 187 205 91 104 145 108 135 122 178 27 74 17 160 137 50 207 211 85 83 163 135 137 130 131 87 111 152 167 97 27 44
1298 44 38 178 181 145 108 44 171 59 39 66 174 193 96 80 29 58 148 211 175 139 126 153 116 129 143 88 60 86 69 260 203 143 157 24
979 24 78 155 16 35 127 117 79 31 49 128 87 27 81 106 131 103 209 118 131 184 16 122 73 58 72 80 46 121 184 72 99 31 61 41
659 41 203 230 51 44 249 210 365 479 762 610 446 148 377 235 156 12 126 246 223 37 59 153 76 227 120 16 187
406 187 253 68 71 180 252 103 37 121 230 269 179 27 170 35 50 248 179 144 270 282 243 217 81 69 103 139 154 47 76 29
124 29 129 71 91 114 150 44 86 121 116 14 127 103 164 148 64 144 228 291 167 69 152 177 187 46 162 208 207 206 149 51 54 128 74 128
-195 128 201 81 95 125 243 182 114 240 234 220 111 106 51 166 51 157 90 131 98 53 53
-392E3
##PAGE=	F1=-13936.7
##FIRST=	19140.455529915001534,	4405.895418600002813,	0
##DATA TABLE=	(F2++(Y..Y)), PROFILE
4406 76 104 44 94 8 125 93 139 147 111 269 275 167 225 142 51 205 239 14 177 233 147 155 83 129 245 245 189 23 91 11 171 310
4105 310 30 176 180 87 218 99 274 158 216 295 185 57 104 178 36 251 221 135 116 37 41 102 158 56 152 188 92 64 97 112
3824 112 119 233 283 247 85 131 253 167 76 47 59 82 188 168 72 42 145 248 105 115 174 128 21 56 171 173 165 309 163 82 118
3533 118 91 177 166 240 200 127 74 170 57 15 181 251 127 137 86 38 83 114 127 142 235 88 55 160 197 97 96 60 107 101 194 208 29
3223 29 43 207 177 105 174 87 34 92 146 24 56 148 47 48 101 153 164 97 95 126 109 188 214 189 132 115 94 56 60 187 160 92 119 117 156
2894 156 152 166 208 38 43 132 16 66 85 130 102 43 34 42 17 58 166 109 64 91 76 58 2 147 179 62 115 156 267 212 129 104 124 107
2575 107 15 29 107 53 162 70 84 83 61 57 56 86 209 201 247 60 106 277 164 58 61 85 103 83 92 126 98 260 26 152 153 35 205
2265 205 72 117 179 153 216 146 174 64 114 105 121 181 134 44 164 104 192 173 85 88 60 66 81 148 211 86 53 40 102 152 235 210 108 48
1946 48 71 134 85 92 50 145 146 46 139 206 192 133 142 154 154 271 266 118 212 260 235 68 48 114 184 223 24 235 237 186 108 117 128 75 197
1617 197 280 222 107 161 234 121 99 124 97 111 136 182 39 91 54 118 139 41 215 205 71 79 153 155 169 124 143 94 99 127 168 118 62 13
1298 13 48 164 180 110 103 63 165 66 73 25 181 174 82 74 56 67 110 166 106 99 131 156 109 146 184 100 48 46 76 299 234 162 125 27 100 173
960 173 38 9 148 157 52 63 42 94 85 22 59 95 110 126 201 115 125 168 29 142 63 74 54 55 50 173 235 132 114 35 115 51 182
650 182 263 112 20 206 260 346 530 866 791 514 116 293 224 134 73 77 210 245 45 64 131 85 241 147 48 156 249 86 72 197
368 197 266 74 66 139 218 252 185 32 190 52 66 271 220 131 268 301 277 224 114 94 116 132 152 44 104 10 120 62 93 118 168
77 168 59 63 128 87 40 150 106 184 195 95 152 243 303 166 46 150 135 162 41 126 210 203 209 181 105 35 138 76 89 115 118 67 138 220
-242 220 142 139 261 246 254 105 97 29 129 68 152 81 123 117 59 47
-392D7
##PAGE=	F1=-14015.4
##FIRST=	19140.455529915001534,	4405.895418600002813,	0
##DATA TABLE=	(F2++(Y..Y)), PROFILE
4406 71 99 26 58 31 126 77 175 186 119 258 240 168 222 125 7 207 257 10 159 220 159 195 113 112 211 230 177 74 127 16 158 325
4105 325 28 210 207 67 193 108 233 115 205 277 211 69 118 175 53 293 245 121 120 67 65 107 130 51 151 178 82 61 95 140 129
3814 129 206 256 242 77 141 273 192 91 71 70 47 162 140 112 62 133 248 134 91 146 104 53 65 183 171 212 309 138 79 111 96
3523 96 171 191 246 172 81 91 159 16 37 196 242 133 140 82 20 44 88 155 91 203 77 65 131 153 87 87 117 146 115 222 179 42 74
3213 74 207 159 114 181 129 42 115 211 81 9 119 28 16 84 129 147 80 79 127 130 182 216 203 113 116 131 90 49 162 170 98 123 128 185 187 180 188
2866 188 33 36 137 13 60 89 170 111 51 62 46 14 74 179 168 51 36 88 32 48 170 201 118 116 132 221 179 118 105 137 78 7 44
2556 44 98 41 170 80 88 63 43 42 94 90 184 195 270 41 64 242 179 88 106 90 112 73 59 137 108 251 42 159 167 62 198 92 120
2246 120 201 126 239 163 149 56 137 100 111 239 191 74 191 73 148 152 47 64 15 36 79 132 204 101 38 58 91 153 236 200 78
1955 78 28 40 98 32 97 24 131 111 36 168 203 175 144 120 146 149 247 249 134 197 262 246 81 83 122 173 193 32 180 204 182 75 72 128
1636 128 101 175 290 260 107 148 263 149 91 108 89 76 154 183 53 100 90 80 132 24 216 185 45 79 112 147 178 111 134 86 81
1345 81 105 170 142 100 54 45 146 196 73 95 70 153 88 114 9 177 134 59 67 101 88 77 130 32 61 119 152 103 151 205 113 39 17 94
1025 94 322 257 196 125 79 127 172 49 28 151 178 28 130 126 49 82 75 65 97 84 135 192 115 109 145 46 144 48 96 41 34 37 209 272 181
697 181 111 90 191 65 143 272 163 88 144 283 334 532 897 928 611 218 202 188 92 117 117 152 237 71 84 96 89 220 142 71 115
406 115 230 106 65 197 257 51 111 154 198 222 173 58 189 63 73 282 239 98 248 301 299 239 144 122 124 113 139 37 114 4
124 4 115 49 94 106 165 72 73 147 56 77 178 113 207 243 132 143 237 298 178 43 125 75 120 80 89 201 172 194 198 155 47 145 72 81 48
-205 48 143 36 152 195 93 162 298 266 296 133 84 29 102 66 134 76 114 136 67 37
-392C7
##PAGE=	F1=-14094.2
##FIRST=	19140.455529915001534,	4405.895418600002813,	0
##DATA TABLE=	(F2++(Y..Y)), PROFILE
4406 61 90 9 21 71 134 81 190 216 122 228 180 164 210 122 76 200 284 25 121 179 150 210 127 100 183 218 180 128 163 43 129 322
4105 322 40 222 237 46 161 123 187 86 178 247 215 64 122 175 58 303 233 93 137 111 94 112 94 72 153 157 64 44 100 149 137
3814 137 178 218 211 60 142 286 212 108 112 87 24 138 101 135 75 120 228 152 68 114 95 89 61 174 166 244 280 104 82 97 90 159 210 245
3495 245 144 37 106 154 12 64 198 216 118 126 60 15 20 57 176 42 182 69 104 118 121 81 90 162 190 118 238 148 91 125 202 157
3195 157 121 165 158 51 155 264 141 57 92 35 38 60 111 140 87 64 110 136 163 196 203 98 116 165 110 50 134 157 102 118 112 187 212 190
2875 190 157 25 40 147 10 78 95 203 109 64 115 73 54 106 195 198 75 21 96 19 90 188 228 174 118 103 165 153 104 103 141 48 36
2565 36 48 82 62 173 88 74 37 33 73 130 113 149 160 270 36 36 210 182 122 134 92 107 40 24 131 107 199 38 143 166 74 188
2265 188 107 100 212 99 269 180 122 64 173 119 106 293 232 124 232 75 93 141 50 60 45 41 71 114 193 121 36 78 78 154 230 180
1964 180 44 3 14 70 17 95 7 107 85 56 198 187 150 147 87 131 137 210 217 148 154 222 241 88 103 136 177 166 47 133 162 160 35 48
1645 48 128 128 148 273 277 108 155 283 170 81 105 86 36 168 180 68 98 114 62 125 34 213 157 13 90 49 116 157 93 101 66 63 92
1335 92 169 160 121 76 40 124 214 43 90 62 142 114 153 28 166 76 42 63 152 121 59 135 86 41 95 143 102 148 208 121 44 23 110 324
1016 324 267 235 168 135 151 153 50 59 133 171 16 178 187 32 78 126 107 111 102 128 189 118 91 123 65 142 34 115 32 48 14 222 287 212
697 212 98 128 253 78 96 257 193 146 105 284 336 502 850 971 661 311 177 146 49 124 177 81 205 81 114 61 89 173 108
425 108 81 73 197 129 51 180 225 37 141 161 178 182 146 91 170 68 67 272 232 49 206 280 300 255 171 143 127 90 117 37 105 3
124 3 115 35 96 96 147 70 88 167 38 105 202 123 231 285 166 124 210 273 194 58 87 12 69 125 75 182 114 164 190 179 58 144 58
-186 58 97 40 151 19 161 172 64 178 338 291 326 157 75 60 97 45 109 76 111 153 74 24
-392B4
##PAGE=	F1=-14172.9
##FIRST=	19140.455529915001534,	4405.895418600002813,	0
##DATA TABLE=	(F2++(Y..Y)), PROFILE
4406 45 78 20 35 100 140 98 180 223 116 185 113 155 191 119 150 201 314 44 72 117 121 202 135 87 164 220 198 169 186 70 94 300 62
4096 62 215 255 50 133 144 154 77 149 206 197 46 114 174 50 276 187 56 158 150 113 114 56 100 153 123 46 22 106 137 135 153 173 159 37
3777 37 133 290 222 125 148 104 66 137 57 134 74 108 189 153 49 85 113 125 49 152 162 260 229 73 97 71 74 140 216 234 114 19 117
3467 117 142 21 95 186 182 91 102 35 28 58 28 188 22 182 63 153 136 110 84 87 167 203 107 238 118 137 167 196 170 119 135 166 59
3157 59 185 293 181 100 77 43 58 36 114 147 116 59 71 123 135 161 188 99 117 191 120 53 97 118 98 113 84 157 216 189 121 20 54
2847 54 161 3 99 103 222 100 70 161 101 95 141 198 193 91 73 102 25 121 199 250 218 124 73 108 142 97 103 136 41 68 52 81 81 165 95
2519 95 44 14 34 114 149 147 111 107 242 34 34 179 175 146 140 89 100 12 28 107 95 119 13 108 151 70 175 126 59 207 81 293 192
2209 192 92 83 213 154 104 326 250 152 261 111 70 139 80 75 91 80 58 96 173 141 43 90 61 149 208 150 64 41 29 73 57 93 14
1899 14 77 76 82 228 160 124 140 50 121 125 183 197 168 129 170 225 103 108 150 173 137 50 104 119 128 17 54 129 147 118 228 260 109 174 287
1570 287 177 69 113 90 12 174 168 84 93 121 62 130 64 206 131 44 109 40 95 116 67 56 40 55 90 165 166 123 89 56 98 216 31
1260 31 90 54 134 137 183 32 155 10 58 66 196 166 52 162 159 52 63 126 102 145 200 122 62 25 111 303 264 272 227 188 171 122 50
950 50 82 97 137 30 200 215 59 76 168 157 125 161 114 194 117 79 110 91 155 34 132 23 79 35 209 281 227 113 141 285 88
659 88 48 224 199 180 132 288 346 488 767 942 661 360 238 136 66 97 211 41 170 66 146 37 83 112 60 79 37 156
396 156 150 34 158 182 51 143 156 162 132 109 121 140 65 61 237 202 16 147 243 278 261 200 153 126 70 84 54 84 17 113 26 105 106 130
77 130 53 91 175 43 117 212 136 252 312 191 98 168 228 205 83 48 46 23 160 87 155 43 131 156 172 56 131 35 115 66 143 34
-223 34 160 142 82 182 359 310 333 159 84 100 102 12 91 78 113 168 77 22
-392B2
##PAGE=	F1=-14251.7
##FIRST=	19140.455529915001534,	4405.895418600002813,	0
##DATA TABLE=	(F2++(Y..Y)), PROFILE
4406 21 65 43 70 111 136 114 145 203 99 141 65 139 169 115 220 220 330 62 58 45 75 181 147 62 146 246 228 190 187 92 61 260 90
4096 90 194 255 83 115 166 141 87 128 159 164 20 93 166 43 217 129 15 169 173 116 111 21 115 143 78 66 45 110 106 122 124 129 104 33 113
3767 113 284 221 136 170 115 110 163 19 120 74 98 145 136 36 68 147 160 47 126 159 260 161 72 118 32 58 116 205 209 82 43 122 116
3458 116 28 123 162 139 62 78 42 48 93 25 190 46 202 62 195 170 114 96 76 134 181 86 225 95 172 191 190 184 106 108 160 66 191
3148 191 294 196 120 71 41 63 23 136 162 151 93 18 91 106 123 161 106 118 208 130 52 61 67 83 123 93 99 196 170 89 33 73 178 8
2828 8 109 110 223 93 70 194 118 123 170 183 159 93 114 104 33 138 200 259 243 139 67 62 140 101 106 121 57 96 59 92 91 143 102 25 41
2500 41 44 152 149 184 80 49 192 21 37 145 162 155 130 82 105 75 56 67 83 65 24 63 124 56 160 151 14 184 77 300 193 62
2199 62 102 247 189 102 331 244 153 264 148 116 137 104 84 129 126 46 90 136 156 56 93 41 136 167 115 130 79 36 102 105 99 12 60 86
1880 86 106 251 124 112 124 22 119 115 176 205 190 157 155 203 124 104 162 159 110 42 102 86 100 40 56 127 149 89 164 212 117 192 269 166 53
1551 53 121 104 56 166 147 101 88 109 57 152 92 193 126 89 128 116 126 85 37 54 25 66 91 156 157 111 114 92 69 193 38 91 71 126
1232 126 152 197 30 152 64 91 77 221 213 51 178 206 69 39 100 104 145 188 112 82 23 87 265 252 307 279 230 185 96 63 94 58
932 58 83 52 200 214 82 77 194 199 133 223 103 199 111 78 107 120 184 48 147 11 104 71 173 261 239 170 134 280 94 5 182 184
631 184 188 177 318 351 528 721 891 656 371 318 173 112 56 210 91 162 31 177 42 75 61 34 68 16 120 159 15 145
368 145 149 86 118 138 147 78 67 141 108 59 71 182 156 66 75 192 233 251 231 162 126 61 40 78 58 38 98 27 116 124 127 26 82 163 55 113
30 113 204 150 266 313 197 67 125 168 205 106 45 87 34 180 105 122 73 121 106 143 47 104 35 129 89 124 50 147 104 120 169 347 307
-280 307 310 146 126 144 105 55 98 80 118 175 73 41
-392D1
##PAGE=	F1=-14330.4
##FIRST=	19140.455529915001534,	4405.895418600002813,	0
##DATA TABLE=	(F2++(Y..Y)), PROFILE
4406 15 61 67 94 103 122 124 93 162 72 103 65 119 147 112 272 248 318 75 108 37 27 163 163 30 122 287 270 191 165 105 52 209 117 165
4087 165 236 119 106 180 134 105 115 112 131 17 63 148 61 154 110 21 164 177 108 101 4 111 120 28 117 93 105 67 107 89 107 91 62 88
3767 88 270 207 141 173 116 135 195 34 124 95 91 118 102 23 73 186 192 64 107 154 248 87 105 135 16 54 90 182 173 59 67 119 78 42
3448 42 143 129 86 36 56 74 76 112 46 184 62 225 68 219 199 120 114 69 79 133 74 203 88 194 195 185 189 85 111 156 71 172
3148 172 272 190 116 64 38 58 27 166 177 180 146 39 49 81 94 137 105 114 215 143 48 58 50 61 146 150 22 162 138 71 51 90 194
2838 194 20 104 115 205 92 71 211 117 132 182 152 113 86 139 97 36 141 191 252 247 167 100 48 132 113 112 98 75 112 62 95 92 110 115 59
2509 59 81 60 180 132 216 60 30 137 35 26 114 156 156 121 70 128 138 74 18 82 127 68 35 91 51 146 180 55 147 87 291 182 51
2199 51 114 265 213 98 309 217 131 238 171 179 131 116 80 158 171 47 124 77 162 79 89 30 117 112 87 196 111 23 137 169 113 21 75
1889 75 104 121 261 81 124 104 25 117 106 176 225 203 199 183 179 134 94 170 145 87 40 127 65 86 51 42 121 130 59 94 144 137 202 231 138 42 123
1542 123 129 102 141 125 117 77 84 47 183 111 172 149 125 141 180 183 102 34 108 37 90 83 141 135 97 158 135 51 150 48 87 102 109 160 197 35 164
1195 164 122 118 95 223 254 75 167 221 82 39 70 114 154 184 99 96 55 43 224 239 335 313 255 195 92 82 91 60 40 75 191 196 104 81
875 81 201 228 137 270 103 198 98 89 113 147 215 60 160 8 119 97 124 240 260 238 118 247 99 40 140 154 177 201 359
603 359 355 599 758 854 677 361 384 233 145 67 174 140 178 22 204 84 78 55 66 56 17 106 151 11 139 141 124 80 107 126 38
312 38 41 147 73 67 90 121 110 106 8 137 173 223 255 173 132 64 10 98 32 60 67 33 119 124 131 8 65 130 59 98 183 166 267 283 178 36
-26 36 102 101 190 120 86 113 65 184 118 86 155 146 69 113 49 68 70 140 111 103 59 124 76 157 140 299 276 260 137 191 184 101 113 127 79 120 171
-374 171 63 63
-392F3
##PAGE=	F1=-14409.2
##FIRST=	19140.455529915001534,	4405.895418600002813,	0
##DATA TABLE=	(F2++(Y..Y)), PROFILE
4406 52 71 93 103 78 106 136 35 114 38 78 78 97 117 112 303 273 275 83 161 92 48 158 172 59 107 329 316 174 127 109 76 157 139
4096 139 131 202 147 95 185 116 122 98 84 111 44 29 134 96 141 152 48 147 167 102 82 12 87 92 20 169 138 91 53 104 52 128 141 101 63
3767 63 246 181 139 161 104 135 213 57 162 133 86 126 62 7 100 222 218 89 102 145 231 20 142 145 58 68 69 158 135 58 83 106 34
3458 34 56 150 95 23 8 39 106 106 112 62 176 67 235 79 220 212 123 128 78 16 84 94 176 99 205 181 181 180 59 133 166 75 136 233 172
3129 172 95 51 45 72 45 191 192 199 191 86 36 55 77 132 94 104 208 151 47 86 94 45 166 209 58 140 114 67 61 100 205 29 86 113
2810 113 169 92 81 210 100 113 169 115 81 75 148 79 43 134 173 231 235 204 142 62 109 120 121 66 90 114 51 81 87 71 132 97 115 76 194
2481 194 103 242 52 72 123 81 1 99 161 159 125 55 158 189 77 36 99 201 107 54 59 71 133 203 100 108 107 268 164 73 114 260
2180 260 224 88 268 178 93 190 180 234 125 114 67 177 210 68 187 4 155 108 86 38 96 68 84 245 132 7 175 238 128
1908 128 47 100 124 122 254 36 154 91 39 109 96 166 227 195 215 206 156 129 83 174 142 69 64 165 54 89 41 28 115 96 32 32 73 160
1589 160 202 184 98 57 119 160 145 99 123 127 53 54 64 214 116 151 183 141 146 220 229 142 71 156 51 113 60 119 108 97 208 173 63 98 55
1260 55 76 125 81 165 188 57 187 158 133 117 201 279 124 133 214 95 54 72 138 172 194 95 105 105 20 192 224 351 320 256 204 104 91
950 91 76 102 85 99 188 178 132 85 187 236 147 300 112 187 79 110 125 164 235 67 169 32 121 107 69 221 288 290 107 217 115
659 115 89 97 115 165 200 383 374 649 849 843 712 346 427 299 159 115 117 170 192 67 227 146 108 78 98 53 12 116 129 34 127 141
359 141 151 74 78 98 52 67 136 37 98 100 72 78 132 97 100 108 185 264 181 144 77 60 113 16 78 24 39 110 95 129 44 48 84 62 80 164 184 253
2 253 219 130 51 113 42 161 119 129 129 83 173 125 51 224 179 97 111 60 46 105 145 126 89 67 94 97 185 98 225 222 201 158 261 212 92
-327 92 162 161 80 115 155 48 78
-392G8
##PAGE=	F1=-14487.9
##FIRST=	19140.455529915001534,	4405.895418600002813,	0
##DATA TABLE=	(F2++(Y..Y)), PROFILE
4406 88 85 118 98 53 103 156 54 90 9 70 78 80 75 113 311 288 210 90 193 125 97 167 167 120 127 354 349 146 98 110 111 120 149 90 159 163 75
4058 75 181 85 130 69 90 114 71 25 138 129 187 196 63 130 155 108 59 11 56 85 60 208 169 74 79 111 28 169 199 138 38 211 142
3749 142 136 144 81 114 211 63 207 167 82 147 25 14 140 253 235 113 108 136 219 34 168 150 92 87 59 150 109 68 89 86 9 60 145
3439 145 73 70 35 34 130 129 95 67 166 67 223 92 200 208 123 133 94 40 65 131 153 119 208 155 178 160 34 146 182 79 107 188 155 78
3119 78 46 60 115 75 207 206 208 218 112 70 22 63 153 81 91 184 139 44 108 132 55 169 247 127 154 127 59 58 102 203 28 62 103 119
2800 119 84 98 193 71 69 130 89 84 64 140 54 67 122 149 205 213 241 177 75 74 111 132 27 106 102 26 56 79 33 150 128 138 90 192 75
2472 75 258 53 108 166 131 39 106 178 169 139 37 182 216 67 85 129 247 136 77 32 96 121 213 129 84 128 240 142 105 104 235 225
2171 225 75 219 135 51 131 175 272 126 102 51 187 240 101 257 83 136 136 84 52 73 78 109 268 140 37 207 296 135 73 113
1889 113 142 103 227 15 188 95 45 92 87 136 199 164 196 203 138 123 75 174 152 49 94 208 60 111 21 50 112 69 26 46 13 174
1589 174 193 141 57 94 116 192 181 45 149 129 33 37 112 236 110 140 209 131 141 229 249 167 106 182 55 129 22 91 89 112 249 200
1288 200 91 57 59 64 128 49 176 184 88 212 165 131 142 169 286 181 90 201 104 65 115 173 192 211 107 111 157 77 167 204 346 299 234
979 234 212 114 81 51 141 147 123 196 172 162 85 160 223 164 320 133 170 58 135 143 167 240 77 173 66 112 102 17 200 311 318 102 226
669 226 148 148 54 72 166 186 373 427 663 950 872 733 347 445 364 165 152 64 184 193 97 242 211 157 93 119 64 12 135 98 63 102
368 102 128 159 113 77 68 83 106 114 52 138 96 55 68 152 186 111 52 144 252 176 155 96 100 126 37 88 34 46 96 50 112 85 39 44 78 64 161
21 161 199 225 125 57 110 139 36 120 108 161 138 83 150 129 55 272 201 149 136 65 69 127 140 127 82 79 64 145 201 51 156 164 167 204 316
-308 316 221 82 195 193 90 106 129 34 81
-392H1
##PAGE=	F1=-14566.7
##FIRST=	19140.455529915001534,	4405.895418600002813,	0
##DATA TABLE=	(F2++(Y..Y)), PROFILE
4406 115 92 136 93 58 115 180 114 107 32 79 72 73 17 121 302 291 145 102 192 128 136 185 144 177 169 355 358 116 108 118 142 115 147 47 119
4077 119 164 50 170 48 124 37 109 125 96 58 159 150 232 208 63 127 148 120 35 26 56 118 88 228 181 69 104 118 46 206 240 170
3777 170 29 161 89 135 132 61 85 197 51 232 182 80 155 3 28 182 281 240 135 123 139 219 62 180 160 110 102 60 156 107
3495 107 66 82 61 40 51 131 80 158 87 46 141 137 68 59 150 74 190 97 167 190 121 127 103 84 75 165 135 134 203 124 178 135 24 139 190 85
3157 85 122 155 152 86 63 71 167 111 211 215 212 221 116 98 13 48 184 88 86 150 102 34 110 145 82 153 252 170 185 163 38 44 96 182 17 43
2819 43 81 61 63 114 159 37 14 66 91 104 50 119 42 103 110 124 186 187 268 197 82 57 87 143 22 128 83 29 45 72 11 162 155 148 103
2490 103 176 64 262 58 131 222 174 85 123 201 178 148 22 193 216 48 126 160 262 151 85 14 111 105 210 140 85 141 210 121 126
2199 126 88 197 228 62 173 98 33 75 165 289 130 85 43 189 255 137 315 158 110 155 80 64 50 116 138 267 138 58 224
1927 224 326 133 88 107 162 66 182 52 212 112 42 72 80 89 152 133 164 198 142 154 84 171 169 38 118 250 84 152 44 86 115
1636 115 80 42 88 26 169 176 116 46 134 124 220 203 37 188 120 63 48 165 241 97 142 216 95 129 207 237 170 127 181 47 136 34
1335 34 58 92 132 270 213 114 59 59 65 110 45 198 196 127 228 140 117 169 151 275 227 69 195 105 65 159 205 202 226 126 117 200 126 136
1016 136 182 317 253 192 219 115 48 21 164 196 147 208 172 182 78 142 194 180 337 166 160 42 161 163 159 231 99 169 106 95 91 26
716 26 173 317 330 98 268 195 214 78 37 174 187 340 503 678 1048 962 743 378 438 418 184 178 51 187 196 105 247 264 208
443 208 101 130 84 55 156 67 96 67 98 143 151 99 45 105 136 91 110 174 87 55 73 180 261 150 49 112 220 156 160 114 128 141 68
133 68 90 84 52 88 75 81 128 56 60 107 47 172 203 188 23 51 178 161 67 77 98 175 139 65 115 132 103 300 206 188 163 56 104 133 126
-195 126 107 74 96 47 180 199 32 145 139 181 252 342 206 74 208 221 108 94 99 24 70
-392G0
##PAGE=	F1=-14645.5
##FIRST=	19140.455529915001534,	4405.895418600002813,	0
##DATA TABLE=	(F2++(Y..Y)), PROFILE
4406 128 87 141 105 87 129 199 164 133 59 105 86 81 52 143 279 274 114 121 156 102 156 213 110 220 206 335 340 91 142 140 166 132 138 32
4087 32 89 153 30 156 29 103 29 114 132 116 90 183 154 248 183 52 142 143 123 26 55 89 164 103 225 170 78 111 118 72 226 254 195
3777 195 66 97 24 139 131 64 84 187 31 224 172 81 141 4 33 216 303 233 152 146 166 231 65 179 185 114 110 64 166 117 48 65
3476 65 39 63 32 110 107 237 136 63 134 128 40 42 125 89 141 92 135 167 121 108 99 113 85 186 124 135 190 96 182 108 45 118 177 91 178 154
3138 154 168 117 90 74 213 143 201 210 211 200 100 103 44 51 212 117 98 136 60 21 91 131 106 125 224 181 200 191 9 38 83 141 26 40 49
2810 49 27 35 123 112 20 68 29 116 126 34 89 61 141 100 102 184 162 279 203 84 96 65 152 67 155 75 75 64 66 31 166 185 148 119 151 80
2472 80 253 61 141 269 206 131 140 222 172 148 12 185 195 36 154 181 245 148 83 14 107 81 202 140 93 146 179 101 126 72 157 237
2171 237 55 138 74 59 33 154 285 127 71 47 183 251 172 352 213 85 159 71 75 27 146 159 250 131 56 218 320 126 85
1899 85 85 180 14 124 82 219 126 37 67 78 39 137 154 177 235 186 222 115 164 187 66 126 283 114 199 89 116 120 104 50 112 43
1598 43 144 150 113 73 170 148 243 205 95 220 103 108 65 203 226 81 150 201 40 119 157 198 155 130 161 34 133 86 31 110 147 270
1298 270 207 126 83 56 80 81 78 227 220 169 227 90 94 196 162 251 249 87 195 90 54 182 223 197 229 141 124 226 158 92 168 264 190
988 190 140 220 109 25 9 167 221 170 213 167 179 67 158 170 182 350 199 168 42 184 183 150 214 130 158 143 76 85 63 152 303 339
687 339 108 307 240 277 169 77 174 217 316 572 750 1147 1101 767 422 415 453 210 204 66 180 217 96 235 294 251 106 133 105
415 105 111 183 47 131 36 60 113 164 114 36 116 149 76 164 196 86 52 98 218 310 179 84 94 181 135 155 127 142 152 93 85 122 57 94
96 94 153 47 165 92 94 138 36 180 188 150 104 150 239 175 83 49 104 170 132 34 72 134 157 314 196 205 186 41 130 124 110 71 61 113 49
-233 49 188 176 64 189 165 209 283 331 168 72 204 241 127 84 72 21 50
-392E0
##PAGE=	F1=-14724.2
##FIRST=	19140.455529915001534,	4405.895418600002813,	0
##DATA TABLE=	(F2++(Y..Y)), PROFILE
4406 126 75 132 135 111 135 203 197 144 78 142 125 97 123 172 241 230 134 141 88 57 157 248 76 249 229 302 302 73 171 170 180 148 131 60 71
4077 71 136 27 142 39 70 46 98 130 133 115 194 142 231 125 33 161 137 119 48 84 124 204 107 201 138 87 98 117 90 228 242 213 119
3767 119 35 48 145 134 82 118 196 46 185 141 81 108 9 25 229 314 214 164 175 211 246 46 170 221 108 110 66 168 123 19 47
3476 47 38 79 6 85 132 294 173 83 105 108 28 37 91 104 88 75 110 147 124 83 82 125 88 190 119 119 169 80 191 85 77 109 147 99 237
3148 237 180 197 158 115 71 241 159 178 183 201 160 76 81 61 79 230 150 121 172 99 41 56 96 117 100 171 162 185 198 29 63 61 88 64 47
2819 47 5 73 31 122 71 43 132 104 141 157 42 57 85 173 98 88 197 152 275 197 82 152 86 159 109 186 91 123 85 63 49 163 220
2509 220 146 141 130 104 234 58 140 302 229 167 154 234 145 143 13 163 168 51 169 185 198 130 79 29 86 50 202 139 97 146 148 81 101
2199 101 63 126 249 61 115 66 84 26 150 263 111 66 66 174 228 202 364 241 73 143 56 85 30 161 166 229 129 31 190 284
1918 284 118 65 53 191 44 61 99 209 124 39 84 79 35 188 225 247 308 259 299 158 149 197 111 115 305 140 241 130 135 123 114 44
1617 44 112 40 101 118 117 98 196 185 257 183 143 234 77 137 73 214 189 70 153 172 36 115 91 141 135 122 140 35 118 131 36 127 149 248
1298 248 183 126 104 50 93 67 111 251 240 209 207 41 70 217 186 221 242 110 197 73 37 175 216 176 215 146 133 235 175 37 167
1007 167 200 127 90 212 103 82 36 151 220 189 207 148 151 62 196 174 165 348 221 188 63 198 199 150 195 156 144 166 64 88 94 154
706 154 272 349 141 318 275 321 267 152 156 258 334 610 888 1260 1249 822 452 386 467 223 236 69 168 246 99 201 297 282 111
434 111 121 122 165 213 44 162 25 28 89 149 106 45 118 146 68 194 199 96 57 144 251 321 184 114 86 150 131 143 132 147 155 105 77 143
115 143 60 106 224 35 188 129 107 157 58 173 152 122 199 240 279 182 80 51 120 150 123 32 38 134 202 320 181 204 208 42 142 111
-186 111 107 31 48 130 57 167 135 94 230 208 221 288 287 113 78 191 245 137 74 56 23 41
-392D1
##PAGE=	F1=-14803
##FIRST=	19140.455529915001534,	4405.895418600002813,	0
##DATA TABLE=	(F2++(Y..Y)), PROFILE
4406 112 67 117 168 124 130 190 212 134 86 186 171 111 184 192 183 161 173 155 4 56 137 276 56 267 239 267 253 61 185 197 192 159 136
4096 136 83 56 120 30 132 49 30 51 64 122 144 131 188 127 194 54 15 173 134 121 81 107 148 231 105 163 91 82 79 122 96 217 210 222
3777 222 170 61 116 148 134 94 155 216 84 137 111 77 63 32 10 216 303 182 166 205 260 260 20 156 254 107 106 64 162 120 12 45
3476 45 62 89 23 60 142 322 195 110 58 94 40 60 54 108 51 52 92 134 129 58 55 116 91 180 116 85 140 78 202 67 111 130 106 107 278
3148 278 207 226 202 133 71 248 152 142 132 177 107 62 39 59 113 238 173 144 232 181 82 18 52 114 90 114 121 140 183 53 99 39 59 110
2828 110 57 53 124 58 112 75 69 179 176 153 197 78 29 98 192 101 89 220 171 269 184 75 201 137 163 142 214 118 163 92 65 61 151 253
2509 253 148 167 118 122 208 50 132 322 250 185 160 230 103 145 42 138 157 75 167 168 127 101 86 46 51 31 208 140 95 147 122 57 48 66
2190 66 109 254 77 102 70 96 42 152 227 87 67 92 171 191 225 352 240 83 109 36 98 68 162 159 212 139 31 150 233 114 34
1899 34 20 188 100 28 104 185 105 50 112 82 65 254 301 323 375 333 360 196 124 194 154 88 313 159 269 160 141 121 102 29 88 33
1598 33 50 86 119 109 210 229 260 138 168 230 43 138 69 194 132 66 148 144 95 117 26 78 121 117 137 59 90 159 57 136 135 204 141 114
1279 114 117 43 93 79 132 263 242 238 175 76 49 229 200 190 211 119 205 95 42 136 180 145 187 143 143 230 184 20 174 140 96 58 194
969 194 101 147 58 118 192 202 189 117 104 80 227 206 141 325 229 202 94 200 204 155 177 171 135 166 64 91 124 177 231 348 182 297
669 297 294 335 348 230 132 288 383 610 1051 1402 1398 920 461 363 476 216 263 65 157 259 133 147 277 300 113 94 130 206 239
396 239 54 186 39 14 95 120 77 65 116 133 57 191 185 100 78 199 265 293 163 129 78 134 150 126 124 146 146 100 71 144 61 110 270
86 270 56 195 159 90 157 99 149 98 114 261 304 287 186 63 57 133 121 127 72 55 130 226 323 172 193 230 60 142 109 120 31 42 143
-223 143 62 122 86 110 245 244 211 268 221 62 88 173 229 135 63 60 33 66
-392F6
##PAGE=	F1=-14881.7
##FIRST=	19140.455529915001534,	4405.895418600002813,	0
##DATA TABLE=	(F2++(Y..Y)), PROFILE
4406 94 77 115 191 122 118 162 213 112 82 226 208 119 225 191 109 97 212 158 102 119 101 283 47 281 242 239 203 50 185 215 205 166
4105 166 148 91 51 114 26 133 54 17 41 20 115 149 134 167 121 165 41 20 177 143 142 117 116 164 247 101 117 42 60 79 132 90 199
3796 199 171 220 203 115 170 144 127 89 177 231 116 126 110 65 17 57 29 175 264 139 154 227 299 269 34 138 275 123 99 62 150
3504 150 116 34 65 91 91 54 56 133 323 212 145 24 104 56 89 48 99 44 33 72 127 140 40 25 89 95 167 114 37 106 87 211 52
3195 52 140 164 67 114 295 218 247 244 145 80 235 119 96 62 139 73 72 36 59 140 238 180 159 284 250 122 29 13 97 87 87 79 82 154 59
2866 59 132 56 97 154 81 117 164 78 94 111 91 201 226 148 232 115 8 98 196 105 103 249 210 273 166 62 235 188 163 161 233 142 188
2556 188 84 73 70 130 272 153 189 113 127 181 37 125 325 267 180 154 207 77 161 86 129 165 90 149 145 45 72 102 62 20 57 212
2256 212 140 93 145 107 31 25 77 98 244 99 98 83 92 63 158 185 63 67 120 181 152 237 321 212 103 63 15 119 118 154 140 196 159 86
1936 86 117 188 111 22 6 170 146 80 100 155 77 65 134 85 78 293 353 365 406 384 389 216 89 173 181 58 310 175 285 176 136 116
1636 116 73 37 46 52 27 65 115 103 213 273 249 76 165 217 6 113 53 152 63 74 144 130 141 122 39 26 110 124 149 84 51 171 74
1326 74 135 104 142 83 97 124 35 77 89 141 260 221 248 136 136 37 231 195 159 166 110 219 152 73 74 120 116 150 138 150 216 189 68 179
1007 179 111 116 61 166 103 198 71 80 152 210 163 93 69 114 237 240 147 288 236 200 129 186 191 155 157 168 138 139 69 92 155 194 183 318 207
678 207 254 301 318 393 296 138 292 437 584 1187 1575 1571 1062 481 348 504 220 270 83 154 246 176 92 240 305 114 73 129 224
406 224 254 68 203 74 38 120 112 61 84 115 121 40 159 161 91 101 246 255 234 121 127 62 126 178 106 99 145 124 81 75 130 57 101 284 76
77 76 190 181 43 135 141 114 45 121 282 333 262 185 42 47 135 90 150 110 88 122 223 321 174 183 249 73 137 125 136 57 44 149 62 68 40
-252 40 111 235 264 193 235 161 62 94 148 191 126 51 82 53 101
-392A01
##PAGE=	F1=-14960.5
##FIRST=	19140.455529915001534,	4405.895418600002813,	0
##DATA TABLE=	(F2++(Y..Y)), PROFILE
4406 79 94 131 196 111 106 128 202 94 70 254 225 122 239 164 68 127 246 148 195 183 57 257 39 287 239 221 155 41 177 219
4124 219 222 169 154 90 80 123 24 148 65 57 21 29 115 149 122 136 130 165 95 35 174 165 171 148 111 172 257 103 76 27 33 105 139 75 183 139
3786 139 204 208 147 200 133 113 68 179 230 130 159 139 46 24 74 59 113 199 88 131 235 317 270 70 117 277 152 94 64 135 119 41
3486 41 88 116 84 86 80 104 311 239 183 73 122 68 112 83 82 52 24 44 120 155 32 9 56 106 171 112 16 75 105 214 36 158 188 40
3166 40 117 287 208 254 277 150 93 208 67 44 16 94 104 88 94 98 159 232 169 163 307 287 149 52 28 75 77 111 62 58 121 53 159 101
2847 101 146 190 119 179 189 81 74 138 107 199 252 127 247 138 17 99 189 106 125 277 249 291 141 53 252 226 160 165 237 156 193 67
2547 67 85 79 101 265 153 202 103 125 158 19 126 308 277 154 134 167 101 189 138 146 175 92 118 145 69 61 115 70 43 93 203 130 87
2237 87 134 113 28 109 94 87 221 121 101 98 79 88 161 143 51 60 143 205 131 236 278 162 119 21 9 145 170 141 118 172 182 138 107 161 109
1908 109 51 26 146 177 135 90 127 65 80 141 85 70 289 373 353 391 398 380 210 45 135 186 62 302 190 290 177 123 116 54 73
1617 73 12 91 66 65 108 84 205 305 221 10 138 208 49 80 30 111 31 90 145 128 166 132 68 47 93 138 158 100 12 170 84 130 63
1307 63 67 21 85 126 28 53 83 141 243 180 236 103 177 39 228 176 128 123 82 228 209 102 18 49 98 115 141 151 198 190 100 182 121 146
988 146 78 133 101 225 75 67 128 213 133 107 97 152 227 261 197 256 264 179 164 158 159 141 127 151 149 94 72 95 184 189 131 256 204 199 298 285 401
640 401 338 188 270 474 555 1255 1744 1765 1220 555 334 547 276 254 124 154 211 202 97 191 291 117 100 120 217 261 78 210
378 210 124 88 141 153 106 91 123 119 28 118 135 73 111 274 224 166 65 109 36 117 205 88 57 152 93 68 87 106 44 78 265 89 184
68 184 203 37 97 176 81 62 129 262 332 219 178 29 22 133 69 180 131 103 115 191 307 181 179 256 74 132 148 142 67 51 146 61 40
-242 40 22 99 210 270 188 211 145 102 94 113 140 117 39 111 78 130
-392A30
##PAGE=	F1=-15039.2
##FIRST=	19140.455529915001534,	4405.895418600002813,	0
##DATA TABLE=	(F2++(Y..Y)), PROFILE
4406 72 103 149 186 95 100 105 184 97 56 263 218 123 227 115 132 211 269 129 270 232 51 198 32 278 230 213 116 36 164 209 233
4115 233 162 149 95 136 142 32 173 87 100 7 64 121 142 97 104 143 183 127 44 170 182 189 167 91 175 265 117 55 55 49 135 137 56 168 119
3786 119 174 182 149 204 115 93 35 162 211 121 190 166 30 52 74 81 50 122 40 101 222 310 262 105 108 263 181 91 72 118 129 37 103 133
3467 133 69 118 107 66 298 277 213 117 125 75 123 119 77 66 23 16 108 169 26 30 59 127 198 109 62 55 128 207 27 163 195 22 117 263
3148 263 181 246 293 147 105 174 20 8 86 74 160 96 146 158 174 223 143 154 295 279 158 60 59 61 55 151 73 96 93 60 178 145 179 215
2828 215 161 224 196 64 58 141 117 179 259 101 238 137 37 118 184 107 146 297 269 310 112 56 250 246 156 151 224 159 181 56 96 89
2528 89 63 231 140 200 84 129 141 11 137 269 276 123 101 121 139 217 189 173 168 85 82 181 147 67 116 65 77 120 178 111 80 117 139 52
2209 52 190 112 74 194 137 105 111 69 111 159 110 46 47 154 232 140 223 224 95 123 43 33 170 215 128 100 138 200 171 112 147 104 76 50
1889 50 125 190 177 77 109 87 93 130 83 58 242 368 286 334 371 338 178 9 90 166 103 289 201 284 166 107 125 78 114 63 137 113
1589 113 85 101 59 187 316 179 55 93 210 99 84 9 110 91 107 151 128 173 149 70 88 63 146 152 104 42 165 92 124 51 54 63
1288 63 83 120 31 59 87 137 214 129 204 81 193 50 229 154 99 96 39 217 239 115 64 55 97 107 158 142 172 182 116 187 148 160 90
979 90 97 93 224 72 98 141 212 98 145 151 184 210 271 259 247 313 154 195 121 117 117 89 122 153 57 79 106 209 164 83 172 180 142 287 267 392
640 392 356 258 245 495 538 1240 1857 1942 1354 678 319 572 368 232 170 149 167 200 160 133 253 122 157 109 192 265 80 207 174
368 174 149 155 219 171 79 142 124 39 108 119 58 105 278 183 126 9 81 16 107 231 75 23 172 59 93 102 77 27 44 217 93 183
68 183 225 112 57 203 68 114 133 216 315 187 168 29 44 141 76 199 132 95 117 133 275 183 176 246 62 132 167 135 59 65 134 65 64
-242 64 46 79 183 261 198 209 171 135 89 70 96 117 30 139 102 146
-392A46
##PAGE=	F1=-15118
##FIRST=	19140.455529915001534,	4405.895418600002813,	0
##DATA TABLE=	(F2++(Y..Y)), PROFILE
4406 72 95 151 168 81 106 105 160 111 50 252 188 126 190 67 210 278 277 111 316 258 103 123 40 249 212 216 102 29 143 185 231 144
4105 144 136 115 200 167 45 198 115 144 12 85 128 125 70 80 151 196 132 45 167 179 182 169 60 172 268 141 59 74 94 153 127 43 155
3796 155 108 131 133 123 186 94 72 2 134 184 92 191 175 39 70 56 89 49 73 38 78 186 279 245 139 126 237 200 92 83 100 141 39
3486 39 106 136 50 144 123 42 288 305 227 138 104 77 124 142 96 91 17 44 91 175 16 45 95 154 229 104 95 50 155 193 42 159 186
3176 186 12 115 238 147 228 289 133 111 142 66 50 140 108 206 93 179 214 192 209 107 135 251 231 145 54 87 64 32 183 82
2894 82 137 76 96 192 176 191 231 191 241 187 39 56 119 123 150 258 95 210 110 60 158 195 111 160 301 264 312 85 69 233 248 152
2594 152 120 194 153 156 67 104 102 21 180 114 182 58 145 131 35 156 210 263 115 62 80 163 237 233 195 142 82 69 228 199 73 100 46
2284 46 104 137 141 91 85 115 176 76 255 125 63 173 144 105 116 74 126 148 96 32 32 150 250 160 203 162 36 115 79 60 184 245 118
1974 118 89 97 205 177 107 129 98 90 78 115 183 196 60 98 120 108 102 84 71 167 354 187 252 314 277 129 43 70 121 145 271 202 267
1664 267 145 93 144 119 148 115 186 163 115 97 43 161 300 131 99 44 214 140 128 27 141 144 120 156 130 176 170 51 119 30 142
1373 142 129 93 70 158 101 121 91 134 127 86 104 48 104 139 137 174 82 156 74 189 65 238 137 73 83 24 177 233 109 104 121 105 139
1063 139 184 119 134 163 120 195 177 148 92 61 78 201 82 135 167 205 62 177 196 208 199 278 308 253 356 142 218 96 101 89 58 88
763 88 144 66 98 118 223 129 75 102 162 81 266 287 403 363 329 270 526 565 1181 1908 2083 1452 815 329 555 454 242 216 141
490 141 135 176 222 96 188 118 211 104 162 271 79 193 209 204 165 287 226 47 171 128 51 131 118 56 90 265 145 148 65 57 42 104
190 104 251 65 72 198 36 141 116 47 36 16 150 88 179 240 177 54 222 79 161 133 164 303 197 163 35 93 161 104 199 116
-92 116 65 124 63 222 175 167 219 44 138 180 125 45 86 118 72 90 77 64 162 236 199 215 191 149 87 52 91 121 25 157 120 148
-392A48
##PAGE=	F1=-15196.7
##FIRST=	19140.455529915001534,	4405.895418600002813,	0
##DATA TABLE=	(F2++(Y..Y)), PROFILE
4406 77 69 134 153 76 123 118 130 117 56 223 143 130 135 75 265 307 264 105 332 265 164 75 55 205 184 225 122 11 111 148 210 131
4105 131 131 145 262 189 59 215 142 188 7 89 130 98 58 68 149 190 114 42 160 149 150 150 29 161 265 169 68 82 140 160 119 39
3805 39 147 99 80 78 79 154 73 66 41 102 167 59 159 162 67 82 32 81 89 94 67 73 133 231 218 168 162 206 201 98 92 81 145 55 94 123 39 161
3448 161 122 52 275 306 224 132 58 76 117 148 123 122 9 88 79 164 7 51 123 176 244 97 109 50 179 176 68 152 167 32 113 223
3148 223 119 207 263 109 113 116 115 81 169 158 230 87 187 250 211 192 71 109 188 155 118 43 112 78 50 205 82 166 78 142 197 194 194 238
2828 238 200 222 165 49 64 77 132 121 256 117 189 72 86 205 227 118 162 282 233 286 72 81 201 237 150 74 157 142 130 88 110
2537 110 117 21 140 81 151 36 170 126 59 176 144 245 148 28 58 162 242 261 202 102 97 97 260 214 74 74 16 120 147 107 79
2246 79 114 139 211 91 298 126 63 164 148 95 113 87 129 130 106 22 38 130 251 168 181 99 89 102 105 90 182 254 112 83 61 192 154
1936 154 85 102 86 92 105 112 154 188 44 94 145 126 69 88 97 91 342 135 166 248 223 88 73 105 66 174 246 193 243 118 82 166 155 172
1617 172 164 233 213 150 98 52 130 261 95 118 2 207 165 169 42 166 179 126 156 145 187 187 36 138 40 129 95 69 76 144 107 119 133
1307 133 207 176 83 78 76 152 215 149 124 59 100 78 174 81 251 124 49 72 83 115 186 86 115 168 112 189 205 84 83 141 117 197 203 119 88
979 88 31 53 171 118 154 177 191 30 187 224 223 193 286 334 251 368 150 227 105 133 68 68 57 125 88 127 122 220 103 111 106 175 33 236
659 236 329 454 380 396 367 602 674 1178 1961 2224 1553 943 398 512 508 300 262 146 134 146 265 142 122 95 246 114 136 271
396 271 95 166 219 236 179 347 264 26 200 127 54 149 131 55 74 248 118 200 125 52 69 108 258 55 127 216 60 192 129 21
115 21 72 46 104 77 158 234 216 83 230 96 197 131 127 304 234 175 57 131 185 132 180 87 22 124 39 150 154 149 180 35 149 189
-186 189 126 61 112 108 76 101 109 71 144 196 174 207 180 143 92 90 119 122 22 157 126 139
-392A39
##PAGE=	F1=-15275.5
##FIRST=	19140.455529915001534,	4405.895418600002813,	0
##DATA TABLE=	(F2++(Y..Y)), PROFILE
4406 85 30 107 148 81 144 126 97 104 64 185 93 132 76 122 283 294 232 113 321 256 216 110 67 158 153 234 161 28 64 98 169 146 144 179
4087 179 309 200 78 217 162 224 18 80 126 74 67 72 138 165 88 37 145 95 102 113 35 145 252 196 71 89 178 158 116 37 147
3796 147 95 29 58 31 127 55 84 76 77 172 54 103 129 97 95 60 59 112 124 81 88 71 180 185 190 197 179 185 114 94 63 140 71 69 92 41 163 108
3439 108 65 246 273 207 109 2 73 104 135 140 147 15 125 85 134 11 44 128 183 230 84 106 45 195 160 92 145 148 65 115 222 106
3138 106 192 220 78 110 95 148 101 169 201 232 97 174 259 227 171 51 83 126 71 88 43 128 91 96 219 93 193 102 178 192 201 206 239
2828 239 185 170 137 87 72 33 148 96 256 147 199 85 115 251 264 118 148 243 188 236 74 88 159 215 149 20 121 132 119 107
2547 107 113 129 54 149 72 109 41 192 123 77 190 84 232 203 18 55 139 229 269 193 59 121 129 265 194 85 63 18 125 155 93
2256 93 80 155 169 232 99 315 114 81 166 157 75 104 99 122 108 128 60 63 99 231 154 165 62 169 98 125 120 166 240 105 81 44 161
1946 161 116 53 74 67 83 122 113 104 160 44 93 156 146 55 91 107 57 331 205 106 202 196 83 87 155 55 187 215 179 222 90 78 188
1636 188 182 184 208 272 255 180 99 68 95 209 89 110 28 180 168 194 44 167 194 126 150 176 210 193 56 140 72 111 59 38 60 117 106
1326 106 115 159 251 203 71 54 110 185 282 172 70 70 44 88 158 97 255 104 26 56 135 61 111 61 98 188 113 234 212 45 22 125
1025 125 108 188 223 97 84 39 20 152 169 146 166 178 40 174 241 234 185 289 341 228 335 163 221 133 176 53 100 57 113 90 156
734 156 113 199 97 140 141 197 62 198 358 521 411 452 487 720 858 1312 2093 2406 1696 1049 512 499 525 381 309 173 164 138
471 138 285 228 129 53 257 139 116 253 129 136 206 234 197 393 284 64 222 122 51 143 148 44 62 237 104 243 174 58 86
199 86 110 244 49 167 213 104 231 141 29 113 87 144 79 117 201 220 106 219 103 221 134 113 310 263 203 98 144 201 150 150
-83 150 56 23 107 91 72 122 123 136 42 158 196 143 102 141 111 72 102 133 93 124 143 121 176 140 119 102 137 145 116 24 135 116 122
-392A22
##PAGE=	F1=-15354.3
##FIRST=	19140.455529915001534,	4405.895418600002813,	0
##DATA TABLE=	(F2++(Y..Y)), PROFILE
4406 92 13 93 147 90 163 120 72 75 72 145 50 131 55 161 265 245 185 124 291 239 255 158 71 119 126 235 204 77 16 39 116 185 163 208
4087 208 332 196 99 205 169 242 47 66 120 80 75 83 119 128 71 38 118 34 71 62 70 127 234 220 73 102 202 154 116 35 160 99 22
3777 22 78 18 119 44 110 102 63 186 76 35 90 123 111 111 31 115 129 74 110 20 139 150 197 220 166 161 140 87 50 127 76 35 49 45 152
3448 152 91 61 199 211 183 103 60 69 86 108 138 158 33 150 112 89 14 37 107 177 189 66 92 32 197 144 109 136 134 98 119 228 113
3138 113 191 169 46 109 77 167 120 143 228 213 123 146 245 236 147 63 62 101 35 70 56 135 97 149 230 129 232 136 195 174 206 240 237 154 97
2810 97 112 119 73 48 171 73 252 171 231 153 145 289 285 99 118 188 146 175 76 91 114 186 149 35 96 131 126 122 117 135 75 194 111 61 61 207
2472 207 122 79 192 42 230 261 44 56 101 195 253 169 28 138 143 242 153 108 80 46 119 163 106 88 187 179 233 105 315 94 112
2180 112 175 177 54 92 105 112 89 147 113 88 71 193 119 162 89 232 107 137 145 141 207 93 85 50 115 92 52 52 38 65 124 131 40 132 63 91
1842 91 154 166 71 86 90 68 310 290 102 189 193 98 85 196 103 186 187 170 218 71 81 206 200 184 248 295 276 194 98 75 68 164 103 80 41
1514 41 134 150 203 42 141 193 120 142 210 233 186 80 123 92 96 29 11 46 78 96 115 164 259 206 56 68 145 193 315 192 36 93 22
1204 22 97 146 111 243 76 11 39 169 76 29 55 61 180 105 262 200 16 36 118 92 171 235 116 83 75 27 144 216 113 152 176 80
903 80 151 264 243 172 281 331 192 261 164 202 156 200 40 122 88 127 71 182 94 168 104 150 154 202 108 153 347 569 431 490 580 834
603 834 1066 1553 2312 2622 1877 1129 628 556 520 459 358 210 209 158 281 308 205 35 244 172 93 210 156 120 187 196 210 421 294
331 294 110 232 118 54 114 164 44 50 229 99 261 206 56 90 110 205 55 184 185 145 253 152 58 150 123 226 108 69 141
58 141 190 114 184 95 230 145 106 306 269 237 148 124 203 157 123 36 59 71 124 52 85 94 96 54 163 200 163 144 170 124 60 97 141 109 97
-270 97 82 51 130 96 88 110 171 155 106 35 89 89 107
-392A07
##PAGE=	F1=-15433
##FIRST=	19140.455529915001534,	4405.895418600002813,	0
##DATA TABLE=	(F2++(Y..Y)), PROFILE
4406 97 52 104 138 97 172 102 69 45 86 110 27 130 99 183 221 175 130 132 252 218 277 185 71 93 107 221 238 133 59 42 65 221 171
4096 171 228 325 174 117 181 160 233 72 60 119 114 68 96 95 90 69 49 85 61 89 15 102 114 219 239 86 117 208 149 113 56 190 117 50
3777 50 87 44 129 43 127 113 58 188 92 28 77 140 128 154 12 106 108 50 129 44 114 120 189 228 176 147 171 73 55 113 70 13 5 42 133 86
3439 86 45 142 137 160 133 106 63 65 77 118 158 58 159 147 37 7 64 64 168 147 57 72 24 182 124 117 122 126 126 123 234 138 203 117 19 111
3101 111 57 177 147 102 234 177 146 113 214 232 121 85 50 121 74 62 69 136 94 200 246 180 285 170 191 145 207 286 232 125 27
2810 27 96 133 65 85 194 50 242 184 262 225 176 314 278 56 74 132 129 126 64 95 80 150 148 79 81 137 141 132 121 129 81 234 161 36 77
2481 77 214 124 64 179 23 233 315 76 51 61 144 214 135 19 141 136 197 108 130 101 61 106 167 127 95 198 160 214 118 309 77
2190 77 148 187 202 60 81 109 110 76 153 161 105 74 141 67 165 131 264 120 138 158 113 164 78 93 56 68 114 92 46 9 39 118 174 38
1871 38 132 82 89 140 182 93 69 54 69 269 331 127 187 187 99 72 219 142 180 169 170 228 68 87 214 207 176 279 299 265 187 93 70 71 149
1542 149 113 43 41 78 115 198 59 95 179 108 130 235 245 172 87 90 95 87 10 31 83 52 86 122 152 231 190 50 116 174 173 300 196 60
1223 60 118 59 102 131 119 210 41 25 22 176 110 71 67 40 149 87 266 169 28 81 111 71 156 234 155 80 112 76 134 243 65 158 193
913 193 118 139 300 250 164 268 304 171 171 150 179 167 202 35 126 124 166 48 206 92 156 120 173 146 197 147 103 290 584 424 514
622 514 624 912 1259 1844 2613 2882 2090 1202 732 666 527 529 416 257 260 200 253 370 281 102 217 207 68 146 157 132 184 141
359 141 209 429 301 152 233 119 61 76 175 79 39 215 106 245 215 40 88 115 149 76 180 136 172 255 163 85 177 151 296 150
77 150 58 65 138 109 142 70 217 160 98 283 252 271 195 71 187 155 111 33 82 51 129 126 55 70 65 61 162 199 170 174 197 141 43 89 126 112
-261 112 67 24 39 102 112 68 117 186 149 94 57 24 48 100
-392A00
##PAGE=	F1=-15511.8
##FIRST=	19140.455529915001534,	4405.895418600002813,	0
##DATA TABLE=	(F2++(Y..Y)), PROFILE
4406 95 79 120 119 99 169 78 82 46 115 85 47 138 146 193 170 102 77 137 213 197 279 191 77 74 97 189 257 185 114 104 65 237 160 235 290 136
4068 136 123 153 141 198 83 63 122 147 44 102 70 61 74 67 59 122 119 59 125 105 212 252 112 124 191 141 111 104 231 149 59 71 54 138 48
3739 48 126 105 53 167 91 81 113 144 139 173 17 91 74 20 141 72 98 100 167 230 205 157 198 54 80 103 62 47 47 32 119 93 40 93 66
3411 66 144 178 130 54 42 59 86 152 87 155 182 12 13 120 31 165 148 82 60 44 151 99 119 100 123 150 124 233 173 222 68 29 120
3101 120 35 183 176 69 214 129 154 86 176 214 98 104 47 145 91 58 76 141 82 239 269 225 340 195 170 113 198 327 227 123 62
2810 62 83 123 53 104 204 30 228 190 274 281 205 324 238 14 23 100 139 112 43 102 73 108 145 106 67 147 150 135 122 113 73 250 198 76
2490 76 82 210 125 36 152 14 230 355 111 41 31 85 161 95 19 131 117 146 76 137 110 59 94 163 144 101 183 117 183 146 306 76
2190 76 178 201 219 98 71 117 120 72 140 193 117 98 84 12 165 154 260 132 124 153 83 117 72 103 55 56 159 135 56 44 16 122 229
1880 229 104 159 92 96 119 192 107 43 74 77 217 317 143 171 163 79 68 222 156 176 159 171 231 74 90 206 202 167 300 286 227 161 85
1570 85 59 107 165 113 45 37 25 74 178 92 46 150 88 114 241 242 160 76 52 80 83 10 56 143 81 87 135 130 178 167 54 169 192 134 237
1241 237 176 92 147 91 104 114 121 165 9 35 10 160 118 134 82 76 103 67 248 130 39 102 94 46 148 222 186 66 142 122 112 242 23
932 23 181 217 147 151 341 250 170 271 259 199 138 129 170 177 198 46 121 152 215 57 225 124 197 152 250 159 224 201 113 201 583 404 547
622 547 635 961 1429 2184 3039 3257 2368 1318 848 792 582 601 490 328 319 263 210 422 338 184 201 236 72 91 122 161 208 138
359 138 184 419 305 195 240 123 60 51 175 128 51 188 126 202 205 11 87 132 104 108 163 77 180 241 175 110 193 168 331 183 93 13
58 13 81 99 148 45 183 170 99 242 221 301 232 14 149 143 108 29 101 111 110 201 64 58 45 56 155 186 156 184 218 157 28 76 97 110
-261 110 37 39 105 119 169 68 124 181 130 83 86 51 19 104
-392A04
##PAGE=	F1=-15590.5
##FIRST=	19140.455529915001534,	4405.895418600002813,	0
##DATA TABLE=	(F2++(Y..Y)), PROFILE
4406 88 92 123 93 96 152 59 89 74 158 71 86 152 175 199 141 46 36 140 179 175 264 185 94 70 95 143 255 224 158 157 115 229 131 228 237 92
4068 92 113 128 127 148 73 68 127 162 8 100 50 47 81 90 66 166 130 108 135 96 209 261 146 118 153 128 119 160 272 188 48 35 49 134 55
3739 55 110 83 47 124 84 126 163 134 145 164 20 67 47 7 142 87 79 93 140 231 240 181 213 38 112 102 64 79 83 23 122 103 57 81 11
3411 11 139 213 131 44 20 67 58 150 114 145 210 54 38 186 90 165 193 129 83 77 106 76 113 75 127 171 120 225 210 240 37 61 134 12
3091 12 183 200 84 171 79 144 71 133 183 86 116 50 151 82 72 82 151 63 255 287 252 379 205 137 101 175 352 223 144 109 62
2800 62 93 48 100 192 23 214 190 265 313 228 312 170 84 28 108 156 123 52 108 86 63 142 114 46 152 149 131 118 89 52 235 211 125
2490 125 79 193 119 39 125 11 215 371 145 27 27 34 108 55 28 115 116 109 60 125 107 55 90 149 152 109 145 69 148 185 310 89 199
2180 199 215 221 143 59 126 140 80 114 199 129 117 38 54 150 153 226 144 110 129 50 72 89 112 48 84 196 167 77 81 40 144 276 155 183
1861 183 89 118 94 194 114 13 148 134 179 272 142 134 117 52 88 208 144 176 145 166 211 83 88 183 183 160 308 263 174 129 72 47 152
1551 152 192 110 84 38 23 32 139 120 60 107 61 96 230 230 152 49 28 52 81 13 76 197 126 97 146 108 119 147 58 217 196 106 139
1241 139 140 114 183 122 103 100 117 119 20 34 6 128 99 168 93 122 54 61 212 93 47 98 66 30 142 202 200 45 157 155 87 216 43 199
922 199 230 160 169 368 237 184 297 199 257 197 114 181 197 207 59 116 167 261 93 232 165 271 193 363 217 293 278 211 150 588 424
631 424 599 651 1006 1567 2551 3571 3753 2702 1484 984 904 683 676 570 416 384 335 176 472 375 265 217 255 119 112 65 188
378 188 247 219 131 395 300 239 265 122 47 66 159 172 82 151 156 169 190 27 90 155 118 147 145 24 169 219 181 132 197 177 323 194 118
68 118 67 39 93 216 62 134 165 115 187 181 327 257 94 99 122 98 18 130 192 90 260 108 61 35 37 140 163 120 171 228 171 25
-233 25 59 78 122 30 80 162 152 217 70 122 159 104 76 114 123 63 113
-392A13
##PAGE=	F1=-15669.3
##FIRST=	19140.455529915001534,	4405.895418600002813,	0
##DATA TABLE=	(F2++(Y..Y)), PROFILE
4406 81 93 110 69 91 126 52 80 99 205 71 130 162 182 205 144 40 25 140 150 150 234 173 115 91 98 91 232 244 189 189 163 200 90 208
4087 208 179 55 84 108 134 111 56 63 128 156 33 90 37 43 93 114 95 187 118 143 133 83 204 264 179 103 100 113 138 209 299 227 24 30 44
3758 44 114 62 84 65 43 70 93 167 202 108 149 136 38 28 61 18 132 100 50 93 113 234 268 200 213 28 138 104 72 100 101 27 138
3448 138 105 78 98 30 145 230 114 51 6 81 50 151 131 134 230 89 62 249 169 157 236 177 134 115 51 74 101 56 136 191 115 211 241
3138 241 260 94 100 150 25 173 211 126 117 72 124 73 84 137 95 123 57 137 68 110 93 159 40 240 285 251 385 197 106 118 139 355
2838 355 222 162 133 30 53 58 74 153 32 197 179 237 320 242 279 89 150 71 132 166 134 100 109 96 33 140 110 24 147 141 117 108 63
2528 63 33 189 195 166 76 161 101 87 131 35 181 357 173 11 30 41 69 21 50 103 148 103 57 96 103 70 93 126 150 117 98 66 118 227
2209 227 314 99 205 230 211 186 44 133 163 99 91 176 145 121 53 108 118 130 183 157 135 96 15 40 122 118 42 108 213 185 98 106 72 175
1889 175 301 182 186 80 146 74 189 114 13 221 218 181 245 134 82 56 57 121 182 114 173 116 154 167 106 81 150 156 154 308 242 137 114
1579 114 58 41 192 216 119 120 46 44 4 81 129 117 59 30 83 215 219 145 11 27 21 75 19 95 233 159 101 147 95 75 131 57 254 188
1260 188 119 40 112 129 224 164 107 98 113 92 38 32 8 90 70 166 100 156 20 80 166 71 68 86 44 45 128 181 204 59 153 166 78 185 65
932 65 198 222 154 173 366 217 186 329 131 310 268 117 198 226 233 63 114 167 298 144 210 177 335 232 466 292 367 359 330 220
650 220 598 516 648 683 1050 1639 2858 4082 4250 3014 1635 1111 967 790 735 632 493 439 395 173 510 397 338 261 259
415 259 178 167 85 204 286 323 51 368 280 270 308 112 40 108 121 204 113 111 189 205 199 72 91 170 163 192 140 11 144 192 175 151 190
105 190 181 273 175 119 90 19 93 290 103 83 140 134 129 131 340 271 172 89 108 72 9 166 265 98 296 158 72 33 14 114 129 71 134
-205 134 224 182 38 43 91 156 55 105 207 174 237 64 102 124 81 73 136 176 107 124
-392A24
##PAGE=	F1=-15748
##FIRST=	19140.455529915001534,	4405.895418600002813,	0
##DATA TABLE=	(F2++(Y..Y)), PROFILE
4406 80 92 91 60 88 100 59 54 115 244 82 171 157 169 204 154 69 41 132 126 117 194 156 134 123 106 57 193 246 209 195 193 157 53 176 128
4077 128 54 41 85 154 116 73 45 123 135 75 85 31 51 106 136 123 188 87 159 124 65 191 262 208 90 50 99 158 239 301 254 39 83
3767 83 54 81 67 60 77 50 24 121 207 222 68 157 110 81 35 111 28 120 126 25 91 89 235 283 203 196 24 152 102 73 108 98 34 153
3448 153 97 91 112 63 161 229 91 76 5 87 58 154 134 124 238 122 78 297 244 140 254 215 192 151 7 92 81 51 145 207 107
3157 107 198 264 288 190 145 164 60 151 210 162 97 125 109 86 40 80 123 126 65 111 86 158 109 153 21 194 253 218 353 173 87 141 100
2847 100 337 225 161 138 15 47 74 35 89 46 173 154 195 309 244 224 30 194 97 149 165 136 153 100 93 54 141 102 25 132 130 94
2547 94 96 44 42 120 153 192 85 122 72 135 182 68 131 312 194 18 22 68 49 5 69 95 192 123 64 54 109 102 95 93 142 123 68 100 98 261
2209 261 310 97 199 241 196 224 29 132 188 124 106 127 161 112 98 154 79 96 161 166 193 77 36 52 150 118 43 113 208 187 109 118 93
1899 93 200 299 187 165 72 168 62 179 108 30 270 296 216 281 138 43 12 95 152 152 80 160 80 141 119 149 77 129 136 151 303 228 136
1589 136 129 46 39 218 234 143 142 62 41 32 46 110 174 54 1 79 212 220 132 42 16 40 61 33 112 239 174 87 139 96 56 110 51 274 179
1260 179 149 93 124 142 265 221 119 113 117 97 56 59 16 57 63 129 107 171 44 114 115 65 97 103 68 83 94 167 218 125 129 155 80 185 62 185
922 185 194 135 166 341 219 155 341 78 342 324 148 206 266 267 72 121 159 325 222 146 142 360 266 538 374 423 431 449 360 602 677
631 677 706 761 1116 1675 3103 4587 4787 3376 1772 1234 990 888 778 678 550 485 442 203 524 412 402 323 252 236 203
396 203 181 214 318 419 59 352 264 279 359 106 69 163 93 227 147 68 215 295 252 124 82 173 191 240 155 30 109 161 149 163 177
105 177 186 191 129 110 86 25 95 330 140 48 96 140 90 69 332 279 229 158 140 42 29 196 314 129 307 203 86 41 56 74 89 42
-195 42 76 207 190 65 42 110 196 83 113 244 185 231 75 61 92 67 73 144 200 138 134
-392A34
##PAGE=	F1=-15826.8
##FIRST=	19140.455529915001534,	4405.895418600002813,	0
##DATA TABLE=	(F2++(Y..Y)), PROFILE
4406 87 97 80 68 91 81 82 23 121 267 97 199 131 147 189 150 99 54 119 115 76 153 129 144 153 115 74 146 232 224 176 199 107 49 131 87 74
4068 74 13 53 168 139 119 15 111 107 112 93 29 72 116 152 144 173 51 157 111 47 173 258 230 95 51 90 164 241 274 262 92 135 73
3758 73 48 67 48 102 70 30 149 240 221 28 170 111 133 107 178 63 120 165 45 86 70 228 283 193 166 26 150 93 60 100 75
3467 75 34 154 81 96 109 87 178 214 73 107 3 86 72 159 127 114 230 156 78 323 304 122 246 233 243 179 60 106 58 56 145 213
3166 213 99 191 279 329 295 188 168 100 120 202 180 136 187 105 99 64 16 160 125 73 88 124 199 123 134 27 124 188 158 285 137 85
2866 85 147 71 306 230 135 135 53 88 83 35 15 61 141 119 151 291 233 156 77 201 103 153 157 126 196 88 81 92 148 100 42 110 120 66 90
2537 90 33 68 44 93 204 112 109 55 170 250 103 70 244 206 45 12 93 54 24 74 84 229 154 79 10 128 133 85 52 133 122 87 128
2227 128 91 279 289 81 183 248 187 258 27 123 212 151 156 74 174 104 142 192 84 64 169 157 245 89 79 84 160 112 52 101 178 170
1927 170 106 126 97 214 275 178 125 73 178 58 168 95 34 289 350 256 352 164 60 68 134 177 125 60 132 69 134 106 205 89 134
1636 134 139 150 298 216 154 151 48 35 225 248 170 147 82 14 49 112 67 224 107 21 77 229 241 113 107 31 84 38 53 126 210 175 66
1326 66 129 108 37 74 37 269 191 157 170 164 156 296 285 144 147 133 133 83 109 40 63 101 74 125 169 78 156 60 68 121 158 119 131 40 164 264
988 264 210 87 139 79 236 27 197 184 129 172 335 283 82 328 125 361 385 216 215 338 312 122 174 185 359 338 94 117 342
716 342 320 599 498 493 525 600 567 672 936 889 1015 1367 1942 3639 5582 5940 4273 2170 1523 1129 1074 900 800 647 570
481 570 527 297 539 453 481 423 270 311 231 286 247 361 516 195 373 292 279 415 140 117 228 166 265 206 28 228 390 333 187
209 187 55 177 189 291 196 62 76 142 111 171 165 196 98 79 133 112 86 99 325 172 58 60 132 100 38 297 286 262 249 214 73 50
-92 50 207 337 164 296 239 102 54 117 21 50 77 9 187 198 109 67 108 230 107 107 274 195 206 123 48 96 60 81 135 193 152 144
-392A44
##PAGE=	F1=-15905.5
##FIRST=	19140.455529915001534,	4405.895418600002813,	0
##DATA TABLE=	(F2++(Y..Y)), PROFILE
4406 96 109 78 82 99 73 122 45 119 270 110 210 87 138 157 132 131 60 118 131 52 118 95 146 180 123 104 98 207 240 146 185 54 74 74
4087 74 77 88 75 10 167 145 160 31 94 84 145 115 30 96 117 159 157 150 20 137 101 32 159 252 244 116 83 90 152 217 226 249 149 178 88
3758 88 46 62 50 118 100 41 165 260 203 45 180 126 178 181 250 116 140 204 78 80 67 210 271 181 132 41 134 78 35 77 35 25 137
3448 137 62 98 89 96 189 191 65 134 3 81 91 170 124 113 204 185 61 321 340 122 218 230 275 195 101 102 40 56 132 206 91 193 286
3138 286 377 389 221 160 142 88 190 179 178 235 103 101 118 46 195 121 84 80 154 221 132 111 53 49 102 88 191 94 84 130 51 274 234 91
2819 91 127 81 127 78 80 78 76 111 94 123 275 213 84 122 171 89 149 146 104 226 91 69 126 161 102 57 87 116 35 93 34 87 52 26 204
2490 204 150 153 92 186 312 136 35 167 209 75 37 131 94 39 63 75 255 193 96 43 154 155 61 27 130 111 128 147 106 277 249
2199 249 56 164 249 190 289 54 105 237 174 213 82 179 111 186 221 142 38 189 123 262 104 118 107 143 102 64 84 131 135 95 141
1908 141 86 221 244 175 82 78 177 61 162 79 30 279 372 294 413 201 89 116 166 201 107 62 94 102 136 134 262 117 160 165 154 295
1608 295 195 167 164 72 29 215 257 189 132 103 34 61 188 25 268 161 34 77 259 277 109 182 93 122 41 78 136 149 181 90 130
1317 130 126 21 25 11 240 233 129 223 212 169 316 343 178 195 158 195 119 168 78 123 168 101 174 162 118 206 51 81 134 226 182 189 41
1007 41 179 340 301 56 153 115 312 37 272 249 176 227 397 398 60 311 246 403 479 319 256 463 381 223 299 287 429 488 228
734 228 262 335 433 718 707 644 702 835 872 934 1325 1317 1557 1993 2778 4995 7712 8368 6161 3164 2186 1612 1482 1240 1111 878
490 878 771 727 500 636 572 609 586 364 434 314 403 346 453 638 358 449 376 318 475 219 181 302 301 340 304 89 232 466 419
218 419 259 24 222 179 347 258 119 99 177 119 184 170 213 74 102 210 209 181 111 295 206 100 108 130 141 117 238 294 280 332 298
-73 298 138 69 192 340 195 274 263 118 69 178 46 22 124 89 176 208 163 110 78 255 126 98 294 209 173 183 118 134 53 95
-355 95 106 164 150 153
-392A53
##PAGE=	F1=-15984.3
##FIRST=	19140.455529915001534,	4405.895418600002813,	0
##DATA TABLE=	(F2++(Y..Y)), PROFILE
4406 102 120 68 97 111 74 171 88 110 255 118 202 38 157 119 114 159 56 147 169 95 101 70 146 219 129 123 59 176 257 130 161 16
4105 16 101 24 125 86 138 40 158 131 179 79 72 74 173 139 33 118 112 156 164 125 7 105 95 21 152 247 248 143 101 100 121 178 178 214 200
3777 200 208 91 73 53 65 128 136 33 165 262 173 82 177 130 206 239 313 172 168 231 103 77 87 179 249 178 106 68 110 74 42 47 16 12 103
3448 103 50 102 57 86 191 165 64 153 10 77 114 190 137 131 164 204 37 293 347 137 181 210 283 195 123 74 33 43 108 184 84 204
3148 204 287 420 450 238 136 181 61 173 164 190 258 93 88 156 101 220 116 101 82 164 221 136 106 91 49 18 65 90 51 72 94 23
2847 23 249 234 42 110 88 153 55 121 156 90 100 104 124 264 186 36 145 116 59 141 136 80 244 120 67 152 178 106 67 72 120 12 105
2537 105 45 92 116 38 194 191 220 146 185 357 162 79 101 204 101 70 184 148 56 47 83 275 238 111 87 179 163 31 76 140 91
2246 91 167 169 136 254 195 34 146 243 203 313 95 87 260 192 260 136 174 130 228 240 203 19 206 67 230 105 149 114 103 97 75
1955 75 81 74 84 97 165 70 234 224 191 63 86 177 67 163 66 31 257 364 329 445 229 103 148 192 228 100 80 71 138 147 163 307
1655 307 153 189 195 164 295 164 180 164 110 29 192 260 192 95 123 99 80 244 76 304 201 42 98 287 317 143 256 163 147
1382 147 86 105 142 86 208 155 145 153 78 51 38 193 293 75 262 268 187 330 381 214 246 192 272 160 231 128 198 252 213 252 178
1091 178 170 262 126 101 141 286 253 250 127 214 429 386 110 209 208 388 125 392 373 268 322 519 528 216 333 391 494 606 439
819 439 342 626 475 355 471 442 546 652 440 496 428 609 936 988 885 974 1158 1260 1377 1820 1933 2315 2925 4088 7136
584 7136 10871 11877 8818 4651 3171 2399 2103 1784 1585 1243 1088 1039 795 858 770 795 796 528 613 476 540 510 616 798 537
349 537 571 483 419 538 314 266 382 447 452 428 197 251 513 490 338 78 317 213 411 334 190 187 265 206 217 199 240 163 185 312
68 312 340 292 136 288 247 156 200 169 187 204 174 302 301 395 368 202 86 164 343 220 255 277 135 88 229 116 40 165 180 186 223
-223 223 217 166 26 277 142 106 304 224 142 237 194 170 59 116 63 139 140 160
-392A60
##PAGE=	F1=-16063
##FIRST=	19140.455529915001534,	4405.895418600002813,	0
##DATA TABLE=	(F2++(Y..Y)), PROFILE
4406 105 127 41 112 125 77 219 121 91 228 119 180 47 193 102 113 179 42 202 213 160 102 76 154 272 129 136 65 138 272 152
4124 152 144 46 124 75 197 66 195 88 156 115 170 126 47 76 197 157 42 134 108 145 167 101 7 69 90 12 149 239 241 165 103 117
3824 117 83 145 159 161 236 222 81 97 42 94 146 169 12 151 245 134 105 155 117 208 266 352 218 188 234 114 79 116 137 217 179 93
3523 93 102 88 100 98 41 63 29 59 52 113 29 66 183 139 62 162 15 72 133 213 163 162 117 207 53 250 327 149 143 178 267 179 122 29 23
3195 23 22 78 150 82 218 284 446 465 233 97 211 46 148 148 161 254 85 67 168 142 233 111 120 77 153 203 139 120 134 103 71 116
2894 116 9 14 52 61 21 233 226 40 77 71 166 15 151 218 102 114 134 138 254 155 62 146 79 21 130 124 91 257 160 76 170 196 112
2584 112 77 69 131 35 118 64 82 163 93 177 225 277 187 176 382 177 127 70 190 118 100 235 190 79 57 109 294 284 126 121 196 158
2284 158 37 138 162 70 201 201 165 212 137 42 131 231 219 326 141 78 276 204 288 175 158 152 266 249 244 33 222 33 151 102
2002 102 170 105 65 102 80 93 43 29 123 188 69 257 224 219 86 103 188 70 172 69 56 240 338 365 446 235 104 168 213 258 105
1711 105 120 102 155 160 175 334 185 217 215 173 294 129 198 155 152 36 163 256 178 40 138 167 121 274 138 329 223 53 144 302
1429 302 350 199 317 222 154 138 130 148 121 251 219 160 191 149 115 104 156 353 82 302 335 212 348 391 243 284 230 347 199 294
1148 294 179 267 338 335 337 231 227 314 215 121 159 324 323 309 211 265 511 454 199 275 323 448 223 517 506 372 425 647 641 392 403 530
847 530 615 735 552 444 787 572 498 651 606 682 803 656 739 612 811 1205 1281 1153 1283 1507 1660 1870 2329 2583 3118 3928
603 3928 5511 9518 14301 15622 11593 6248 4236 3269 2786 2383 2092 1641 1439 1384 1125 1139 989 1005 1007 711 816 671 689
387 689 698 822 977 708 706 572 545 591 400 370 464 570 572 552 316 309 526 533 412 158 433 297 475 410 255 294 363 318 266 246 275
96 275 260 272 411 470 398 169 340 286 216 296 244 227 275 134 303 334 430 408 249 105 154 360 233 246 286 152 113 261 182 78
-186 78 200 265 209 239 260 228 52 299 159 139 302 234 122 273 249 183 93 141 15 145 126 163
-392A63
##PAGE=	F1=-16141.8
##FIRST=	19140.455529915001534,	4405.895418600002813,	0
##DATA TABLE=	(F2++(Y..Y)), PROFILE
4406 107 132 7 125 139 82 257 138 65 197 116 153 96 229 120 126 187 25 262 250 216 107 96 169 329 122 158 121 91 280
4134 280 195 149 69 144 132 261 34 236 125 162 125 136 165 20 85 213 164 54 146 110 128 168 83 22 36 80 2 140 222 223 176
3842 176 91 138 55 132 173 94 251 219 60 110 41 129 178 191 23 133 213 92 109 114 104 186 255 358 248 194 211 112 83 138 86 175
3542 175 172 87 134 79 145 161 70 101 57 20 62 130 49 77 167 115 59 162 21 63 138 227 188 189 75 194 101 215 287 145 112 142 230
3232 230 155 103 27 10 48 55 112 87 234 277 454 433 208 51 229 46 115 147 96 232 102 63 153 168 232 110 134 59 128 176 144
2941 144 132 176 139 122 163 66 30 51 73 82 219 205 78 26 33 178 38 169 257 110 133 155 139 239 121 93 133 114 25 116 106 146
2641 146 270 193 86 180 209 122 91 71 147 65 129 84 59 185 136 151 241 308 202 173 389 177 160 75 169 122 120 265 203 110 88 136
2340 136 308 321 141 140 196 146 70 195 192 66 228 240 182 160 91 63 120 213 232 321 187 85 281 207 289 182 130 170 293 246 255
2049 255 75 236 94 53 123 183 84 84 117 77 103 76 31 154 200 88 287 233 246 122 134 206 71 184 91 100 237 304 396 424 214
1758 214 106 179 227 286 124 182 160 154 168 173 339 206 244 218 172 290 100 218 141 193 46 131 241 147 26 149 225 176 277 185
1476 185 339 224 70 199 303 362 250 353 252 143 184 149 154 209 286 259 163 236 211 168 178 161 395 168 343 403 242 372
1213 372 373 254 296 266 402 228 352 224 309 407 440 407 300 271 349 292 131 198 330 383 357 276 321 564 494 284 326 423 479 314
932 314 612 610 462 509 734 715 552 482 630 716 826 636 528 903 641 624 801 737 796 907 833 937 803 989 1440 1508 1370
678 1370 1546 1791 1980 2276 2732 3103 3772 4743 6671 11499 17099 18634 13772 7542 5104 3991 3351 2871 2491 1957 1729
481 1729 1674 1416 1382 1162 1185 1164 860 991 841 822 865 1017 1131 842 815 615 642 616 455 475 536 645 665 644 424 400 507 540
218 540 464 236 532 382 525 467 298 389 431 414 313 296 311 338 340 488 571 474 197 414 306 264 376 324 256 319 136 287 365
-54 365 434 408 273 126 186 388 226 240 289 167 140 268 234 119 230 336 232 248 282 284 116 314 173 183 292 232 120 291
-317 291 271 166 140 167 40 171 110 158
-392A58
##PAGE=	F1=-16220.6
##FIRST=	19140.455529915001534,	4405.895418600002813,	0
##DATA TABLE=	(F2++(Y..Y)), PROFILE
4406 109 137 59 134 149 87 282 139 37 170 114 131 142 255 146 137 186 27 312 273 249 106 109 183 371 106 200 192 40 276 234
4124 234 170 68 163 165 297 33 253 146 163 152 86 191 5 96 220 158 67 152 118 112 168 74 51 26 58 6 120 189 191 172 76 154
3824 154 52 129 194 30 244 199 35 111 56 157 210 196 42 117 174 49 98 64 117 154 212 332 264 189 162 103 85 150 31 123
3542 123 147 78 157 87 192 213 102 122 84 29 71 151 83 123 149 95 57 151 37 47 125 222 202 201 54 168 149 216 241 125 103 110 179
3232 179 136 86 73 46 104 49 78 103 252 268 451 373 171 23 232 56 84 165 33 202 140 88 124 185 224 114 134 30 107 148
2950 148 149 123 206 153 138 180 102 61 82 108 147 197 169 103 39 31 196 96 182 269 112 141 156 118 217 86 102 111 168 59 95 78 207
2641 207 278 205 91 181 211 131 111 78 163 89 138 102 30 185 165 117 234 305 186 180 381 165 175 81 141 111 127 260 176 146 116 150
2340 150 309 337 151 138 172 135 94 235 222 92 248 279 183 107 67 77 108 191 236 295 223 99 270 201 263 154 99 183 304 232
2058 232 235 120 236 151 103 171 189 58 134 132 70 103 114 69 175 198 109 309 234 265 153 172 218 74 192 129 158 239 269 417 391
1767 391 168 119 184 230 301 153 254 215 149 167 167 327 212 269 206 155 279 85 223 128 223 57 95 216 102 90 154 259 226
1495 226 260 211 331 206 86 243 291 347 279 358 243 125 216 159 155 279 296 262 150 276 245 199 244 199 411 248 370 451 268
1223 268 394 331 243 274 294 420 241 395 254 315 439 508 444 358 288 353 339 127 245 301 417 383 306 365 576 503 345 346 480
950 480 473 378 653 656 518 552 751 734 666 527 662 756 851 670 564 937 658 706 885 803 850 939 937 1045 936 1096 1568 1608 1471
678 1471 1692 1932 2138 2486 2923 3363 4113 5158 7268 12549 18516 20118 14781 8198 5551 4380 3648 3118 2670 2100
490 2100 1877 1833 1597 1510 1234 1282 1224 932 1091 937 903 969 1149 1215 908 867 601 672 599 466 553 581 659 706 681 498 489 457 510 478
209 478 296 587 430 543 490 308 448 447 471 337 334 335 383 375 527 627 504 210 462 294 289 424 384 267 328 149 246 375 404
-64 404 370 271 147 236 414 200 230 285 178 163 250 267 156 252 381 243 244 279 322 167 309 182 223 277 218 130 293 259 124 180
-345 180 191 79 188 90 144
-392A44
##PAGE=	F1=-16299.3
##FIRST=	19140.455529915001534,	4405.895418600002813,	0
##DATA TABLE=	(F2++(Y..Y)), PROFILE
4406 109 139 110 139 154 93 295 128 25 147 119 121 183 268 158 138 179 43 342 281 252 97 108 187 387 86 252 264 21 258
4134 258 254 194 43 178 164 300 75 244 154 145 171 37 201 25 106 215 140 78 149 123 99 167 78 83 40 25 12 92 141 148 149 66 160
3824 160 58 116 202 73 216 169 23 106 76 170 226 180 46 108 137 24 88 38 152 136 155 287 274 183 99 97 80 153 24 66 102
3533 102 61 165 98 229 241 120 123 107 49 74 171 107 170 132 83 61 132 61 28 96 195 203 195 69 140 183 250 209 97 115 90 122 129 101
3213 101 104 94 163 57 59 121 269 256 447 325 139 60 220 67 71 188 99 175 177 116 106 201 215 128 115 11 107 124 148 93 220 150
2913 150 124 166 109 87 119 131 203 164 121 108 101 81 219 151 198 254 111 135 135 79 193 53 91 88 199 83 65 48 251 275 194 89
2612 89 173 196 137 138 90 176 101 148 116 17 168 183 80 204 273 142 187 360 144 175 76 109 89 122 222 113 180 129 147 293 329
2321 329 153 118 129 131 98 255 247 131 257 317 171 64 55 81 97 167 228 249 243 105 242 187 215 98 93 189 292 209 190 158 211 181
2021 181 210 222 192 34 171 139 66 91 135 88 179 185 119 314 219 273 175 209 218 91 190 181 224 234 234 423 357 109 138 180 215 298 183
1711 183 319 258 161 166 161 305 201 288 186 122 261 78 203 117 237 70 56 180 54 146 156 260 255 231 214 307 173 95 262
1439 262 271 308 276 333 195 120 232 163 146 315 274 225 129 302 246 204 284 229 397 295 366 463 282 400 279 210 221 305 396 232
1157 232 411 264 285 426 527 442 388 272 320 343 110 285 242 416 381 294 387 541 480 371 331 480 429 403 628 631 529 547 694
885 694 697 713 521 614 714 798 649 542 877 614 726 889 789 823 886 949 1041 973 1101 1550 1552 1426 1683 1886 2089 2445 2847 3296
622 3296 4057 5064 7146 12386 18165 19678 14346 8044 5459 4342 3597 3055 2578 2025 1842 1822 1623 1485 1178 1267 1171
425 1171 905 1084 930 904 985 1178 1204 890 850 534 621 535 430 580 583 611 684 650 524 547 387 446 442 324 586 420 518 469 282
152 282 451 403 474 325 347 336 388 370 520 632 484 201 458 244 282 425 409 264 301 147 178 349 344 301 251 161 274 423 163
-120 163 214 273 183 177 209 276 181 261 394 238 226 252 331 193 276 180 250 257 194 136 283 222 76 200 211 106 184 67 123
-392A23
##PAGE=	F1=-16378.1
##FIRST=	19140.455529915001534,	4405.895418600002813,	0
##DATA TABLE=	(F2++(Y..Y)), PROFILE
4406 103 132 146 140 153 97 298 110 39 126 132 122 222 269 155 135 170 57 347 277 226 80 99 175 372 73 300 326 59 229 253
4124 253 211 1 181 130 279 115 215 157 106 168 37 193 36 110 200 115 82 132 115 90 167 98 113 57 36 19 68 82 95 107 68
3833 68 159 63 91 195 143 173 145 35 102 91 162 213 150 37 103 112 54 95 72 180 146 122 245 289 192 40 95 68 154 73 42 43 50 157
3514 157 106 247 236 123 107 124 54 74 185 116 197 115 81 73 108 87 16 63 147 193 180 108 124 199 284 204 67 127 88 71 130 137 111 142
3195 142 218 66 65 133 276 240 442 319 133 99 194 74 79 203 172 149 201 131 115 219 209 152 76 37 128 108 142 54 216 145 91
2903 91 128 96 102 146 133 239 121 63 96 148 121 237 192 222 219 106 118 97 34 174 24 69 76 201 91 32 63 268 257 162 81 156
2603 156 163 138 171 110 188 98 158 127 42 143 190 64 162 228 77 182 324 123 166 66 76 61 111 165 32 205 128 128 257 295 142
2312 142 93 79 137 81 253 265 166 252 346 160 38 34 77 86 145 209 191 241 97 202 169 157 33 132 186 258 179 129 179 158 184 290
2011 290 255 190 16 187 133 72 73 138 86 168 171 113 293 191 276 187 234 205 121 175 235 290 216 198 411 326 50 150 170 183 275 210
1711 210 362 286 189 180 148 281 174 297 167 90 234 73 158 108 230 83 34 140 40 186 158 228 253 193 196 275 132 94 252
1439 252 246 255 241 287 124 143 229 163 124 316 234 158 119 305 213 188 287 231 355 298 325 433 278 380 233 160 148 297 334 203 396
1148 396 254 228 369 498 405 385 230 250 303 89 304 173 377 351 241 378 466 434 358 287 426 352 385 545 539 491 498 576 610 692
866 692 468 495 594 676 577 466 733 515 677 812 703 718 754 870 931 909 1000 1389 1354 1240 1523 1664 1842 2163 2520 2922 3619
612 3619 4487 6339 11051 16126 17424 12574 7123 4854 3898 3213 2702 2237 1744 1631 1643 1491 1317 1003 1140 1019 781
415 781 966 823 820 911 1097 1098 793 770 435 501 435 355 545 537 517 608 556 495 556 314 362 361 317 534 352 448 407 224 394 307 426
124 426 274 332 309 353 325 470 594 426 166 404 163 245 378 392 254 246 126 91 282 265 215 223 169 285 409 133 197 249 182
-148 182 179 154 265 185 253 374 217 197 205 309 196 218 167 261 238 163 125 260 177 61 196 224 124 163 48 99
-392I9
##PAGE=	F1=-16456.8
##FIRST=	19140.455529915001534,	4405.895418600002813,	0
##DATA TABLE=	(F2++(Y..Y)), PROFILE
4406 93 111 158 135 147 99 295 90 53 107 148 132 257 260 150 133 162 78 331 270 182 58 87 152 331 86 332 373 83 199 232
4124 232 220 49 169 78 252 142 178 162 53 142 68 171 38 111 181 87 78 101 95 83 164 131 139 77 85 32 72 40 47 52 82 157 74 79 185
3796 185 197 124 140 50 104 98 135 171 111 36 99 105 88 111 107 190 166 137 222 308 214 41 95 47 155 112 86 23 62 135 109 243 200 113 84
3467 84 136 49 72 190 110 198 98 83 87 91 110 35 49 85 177 169 157 131 193 293 215 37 120 92 47 125 165 97 176 259 74 88 132 261
3148 261 215 427 337 152 129 156 71 90 205 214 114 208 129 130 233 208 182 26 57 153 104 139 45 198 149 57 79 73 104 156 118 252
2847 252 75 7 75 170 136 238 214 245 171 102 97 52 25 162 5 52 94 181 85 42 114 257 227 122 71 130 113 139 203 136 201 82
2547 82 163 130 67 121 191 99 136 198 8 165 276 110 151 60 55 40 98 117 48 213 118 100 208 243 121 79 66 151 52 234 274 190
2246 190 227 360 160 33 11 71 79 128 178 130 216 71 153 148 109 47 187 175 205 147 63 179 88 166 333 262 183 8 188 112 83
1955 83 56 126 69 150 163 91 247 156 276 188 242 184 151 153 282 348 188 164 382 295 26 148 161 135 236 231 373 300 212 212 126 263
1655 263 139 292 156 98 203 74 106 100 199 91 62 108 77 207 162 177 218 151 161 241 95 86 216 219 207 186 232 88 177 212 164
1364 164 93 299 203 86 134 286 160 160 250 202 294 262 253 370 258 338 206 110 74 272 254 158 348 226 162 284 433 348 357 193
1082 193 155 227 73 298 130 308 298 163 339 366 375 313 224 338 257 332 430 402 412 421 431 488 619 397 336 420 509 471 357 539
800 539 377 572 677 574 558 570 725 744 770 820 1126 1067 958 1255 1325 1459 1712 2022 2344 2916 3583 5057 8894 12929 13948
565 13948 9923 5677 3894 3174 2604 2157 1741 1324 1300 1343 1239 1058 751 930 810 593 762 643 669 769 926 923 641 655
340 655 331 349 317 259 454 449 398 508 415 423 514 259 275 250 278 460 245 346 326 149 290 180 339 191 287 255 287 249 387 528
58 528 360 111 322 68 189 287 337 247 178 98 34 185 190 134 206 174 265 373 124 180 216 178 174 95 237 167 232 328 188 164 148 259
-242 259 178 146 148 260 224 129 96 223 138 93 173 229 141 142 42 88
-392H8
##PAGE=	F1=-16535.6
##FIRST=	19140.455529915001534,	4405.895418600002813,	0
##DATA TABLE=	(F2++(Y..Y)), PROFILE
4406 80 79 147 123 140 97 281 70 60 97 158 145 282 242 157 134 161 115 304 267 137 34 75 128 275 117 343 397 87 177 198 221
4115 221 100 142 35 238 155 148 169 25 101 88 138 41 120 167 62 69 59 62 76 160 167 162 99 128 52 99 76 57 11 102 167 101 101 183 229
3786 229 77 157 57 114 95 96 108 69 61 96 114 113 122 129 178 174 165 214 321 238 72 92 23 148 140 133 78 86 109 112 218 139 94 71 145 39 73
3439 73 185 95 176 80 85 94 98 127 61 62 29 155 167 208 153 167 267 225 32 89 90 58 108 174 69 190 282 84 123 114 222 179 388 340
3119 340 172 149 106 58 95 194 224 62 197 114 129 234 207 211 42 64 174 118 145 70 174 164 50 41 53 93 153 95 247 36 52
2828 52 63 165 125 220 212 258 120 99 82 22 55 155 18 62 136 156 66 87 164 227 192 94 61 95 53 144 227 160 217 56 158 120 82
2519 82 107 186 150 152 200 52 153 223 111 134 56 64 39 89 109 105 198 107 70 155 185 93 83 100 169 51 207 273 199 182 351 170 45
2209 45 47 69 79 118 138 77 173 38 101 126 88 100 235 162 142 116 31 164 62 147 344 248 171 15 178 77 94 47 107 46 136 159
1908 159 60 178 123 275 184 228 161 174 134 311 390 156 138 335 264 62 133 168 83 189 247 355 305 214 248 98 249 104 273
1636 273 149 142 171 83 83 88 149 89 99 93 113 210 167 143 164 115 114 210 75 72 170 187 180 139 182 143 207 181 163 59 277 209 78 159 253 101
1298 101 139 180 152 227 201 161 289 227 281 195 84 43 242 181 108 277 190 106 197 350 293 325 197 53 135 69 269 138 225 238
1016 238 107 272 258 317 251 161 250 164 263 323 262 304 337 305 354 525 343 204 232 328 353 247 345 224 433 514 444 385 372 547
734 547 529 600 609 829 766 652 946 966 1041 1203 1475 1715 2135 2599 3635 6478 9407 10161 7090 4082 2831 2370 1943 1576
509 1576 1238 868 933 998 937 788 484 689 597 395 525 432 488 597 712 722 474 535 251 223 204 168 335 337 283 423 260 325
246 325 432 228 208 155 219 399 130 238 259 77 181 60 238 94 222 182 212 158 286 450 314 52 252 21 127 170
2 170 255 243 115 77 106 73 145 84 213 181 220 319 124 163 176 170 167 59 204 130 206 272 159 137 89 193 146 80 128 253 220 96 57
-308 57 178 114 127 141 226 164 137 44 98
-392I8
##PAGE=	F1=-16614.3
##FIRST=	19140.455529915001534,	4405.895418600002813,	0
##DATA TABLE=	(F2++(Y..Y)), PROFILE
4406 72 42 118 105 130 89 254 47 66 105 157 157 289 213 176 132 165 161 284 274 119 7 68 113 217 150 333 396 77 169 161 216 142
4105 142 113 53 235 159 132 172 65 59 97 101 56 154 169 45 58 16 26 70 152 199 188 114 152 72 129 124 104 64 123 190 133 128 189 237 43
3777 43 182 59 126 84 58 50 26 89 95 129 124 125 141 153 161 174 203 316 251 85 84 29 130 155 165 117 106 90 117 177 71 75 78 152 34 77
3439 77 171 77 140 71 79 87 129 139 83 74 51 128 166 249 176 128 208 223 74 37 73 70 78 165 55 181 283 100 162 83 174 130 322 307 181
3110 181 162 47 52 97 176 212 22 174 101 109 214 202 231 93 58 185 143 154 84 153 175 59 42 45 76 140 77 233 23 94 77 144
2810 144 89 184 190 248 77 98 76 55 73 145 32 87 183 143 42 129 200 191 165 94 50 56 14 148 236 176 232 29 144 95 83 102 176
2500 176 197 190 219 94 166 182 118 114 47 94 51 80 121 127 158 95 44 107 141 68 88 133 186 90 178 265 196 123 316 180 65 82 73 86 114
2171 114 92 51 118 42 55 107 88 138 271 160 80 91 84 140 116 141 330 221 154 22 160 27 103 48 87 32 134 150 38 96 100
1880 100 274 187 195 137 186 131 313 412 129 124 274 232 94 110 194 51 144 255 316 301 193 267 76 234 84 239 140 184 145 92
1598 92 99 73 92 76 126 88 133 200 168 158 116 97 62 178 75 55 135 152 171 137 149 214 222 141 154 36 256 238 129 178 216 49 139
1288 139 109 108 168 142 70 210 189 222 189 100 79 216 139 75 199 157 68 139 270 255 306 236 35 53 70 224 159 152 186 132 187 160 270
979 270 202 109 193 89 203 262 185 184 258 240 226 436 322 203 71 168 249 178 208 82 287 353 350 252 211 375 342 447 432 573 521
687 521 411 667 688 705 761 1005 1205 1481 1811 2454 4436 6480 7046 4827 2752 1934 1700 1424 1124 890 504 617 702 674
462 674 585 284 474 425 261 334 234 324 436 518 536 332 434 207 180 118 113 230 230 192 382 144 233 339 210 178 147 155 376 62
180 62 158 236 51 157 101 156 5 148 104 155 75 183 371 290 62 229 91 73 50 170 231 82 66 169 45 146 84 237
-83 237 191 161 252 113 142 134 155 160 79 175 83 179 227 137 118 37 127 107 56 111 243 222 71 35 135 100 151 113 217 188 144 45 120
-392A20
##PAGE=	F1=-16693.1
##FIRST=	19140.455529915001534,	4405.895418600002813,	0
##DATA TABLE=	(F2++(Y..Y)), PROFILE
4406 74 10 80 83 119 76 213 22 78 126 140 162 273 174 191 123 172 201 286 293 139 22 78 104 171 175 304 368 70 168 129 203 173 100
4096 100 74 227 159 123 164 96 32 99 66 79 208 197 35 52 31 23 67 141 220 216 113 153 93 149 155 143 104 140 211 160 134 190 223 38
3777 38 201 57 134 73 40 71 17 104 96 142 123 129 151 123 132 159 178 287 247 79 75 60 97 159 177 135 113 83 119 127 40 65 92 157 37
3448 37 83 152 58 102 79 65 66 162 150 95 75 86 101 156 271 191 84 131 215 129 23 42 69 45 152 79 152 263 122 200 44 157
3148 157 80 235 239 175 169 15 86 102 160 194 82 148 101 78 173 190 237 130 41 188 163 158 74 141 172 58 51 49 63 123 74 220 41
2838 41 120 112 131 37 138 155 215 50 95 81 90 76 125 40 110 218 139 27 156 219 164 150 112 36 19 72 147 231 177 241 13 128 55
2528 55 69 101 161 228 221 230 115 199 164 119 95 33 129 61 67 120 110 96 83 25 71 128 54 90 150 193 130 151 256 192 65 262 182 85 101
2199 101 86 98 113 48 62 58 83 47 97 89 161 293 175 44 73 140 123 167 148 304 194 131 31 129 34 116 58 73 37 144 133 50
1899 50 21 101 274 202 147 109 187 142 289 412 110 122 207 199 117 91 228 76 114 252 267 288 158 258 64 211 87 192 123
1626 123 206 128 88 113 61 59 55 141 78 134 179 161 195 108 105 12 141 81 34 127 124 164 174 140 268 223 96 133 34 226 259 170 184 185 5
1298 5 158 106 121 132 117 67 145 147 170 176 132 116 200 120 82 138 142 50 123 211 235 307 274 93 45 66 172 161 116 151 185 98 86 237 197
969 197 72 176 56 171 251 205 68 187 225 130 364 308 277 67 71 177 169 165 41 158 218 295 200 145 237 245 335 345 423 365 318 468
669 468 550 539 504 694 916 1092 1407 1803 3242 4790 5246 3619 1979 1391 1296 1158 889 763 380 414 530 521 479 221 332
434 332 309 232 287 74 215 314 398 394 238 347 190 187 67 113 186 159 133 370 148 180 267 191 170 193 102 377 86 135 238 79
152 79 221 189 122 71 86 39 149 64 90 295 262 116 244 130 47 53 116 201 78 56 204 133 173 92 259 202 99 178 87 123 98
-139 98 129 155 115 158 58 152 202 124 101 6 85 66 78 101 227 221 67 48 110 86 162 95 205 201 148 48 139
-392A39
##PAGE=	F1=-16771.8
##FIRST=	19140.455529915001534,	4405.895418600002813,	0
##DATA TABLE=	(F2++(Y..Y)), PROFILE
4406 80 9 46 61 104 61 160 20 97 147 108 155 235 127 191 106 176 222 303 321 175 52 109 91 148 191 263 315 77 161 107 182 191 106
4096 106 73 203 160 110 142 108 28 96 37 99 267 243 32 55 59 53 68 130 229 240 92 138 118 157 163 162 123 149 216 173 113 170 195 48
3777 48 208 52 132 63 54 122 62 99 95 146 111 147 166 97 93 128 139 235 225 59 71 91 55 151 168 134 107 76 112 78 85 71 101 159 47
3448 47 88 133 42 73 95 45 39 183 160 92 65 96 77 134 271 196 43 65 214 181 77 17 62 34 153 112 108 226 146 229 8 194
3148 194 62 151 153 157 168 75 143 111 149 187 140 132 110 54 120 171 229 146 19 178 166 151 43 137 149 40 48 59 60 103 81 207 60 130
2828 130 151 150 19 90 116 162 39 88 93 110 65 92 40 127 228 130 32 162 220 152 144 128 24 22 117 136 218 162 239 32 123 10 43
2519 43 99 145 239 233 219 120 228 161 109 77 28 163 63 52 99 72 18 75 18 48 138 49 95 152 179 154 129 250 195 42 202 173 96
2209 96 95 105 112 112 43 80 9 121 71 102 94 176 303 198 53 62 188 121 197 158 274 173 106 42 85 103 135 77 68 47 160 112 73 68 124
1880 124 277 227 96 78 177 150 246 393 100 126 156 165 139 85 257 118 107 233 216 262 130 224 51 175 101 139 101 202 116 68
1598 68 106 65 79 38 152 55 117 154 144 219 128 123 30 101 82 15 135 121 148 212 156 302 214 55 101 41 179 259 190 181 163 39 183
1288 183 168 178 118 139 147 97 101 124 152 165 152 189 93 110 111 143 52 119 176 222 310 291 114 74 57 127 142 116 129 212 45 62 216 235 43
960 43 169 82 161 255 243 32 120 209 101 301 273 325 122 84 144 192 158 116 81 114 248 198 157 141 240 256 329 379 269 325 351 500
659 500 503 452 526 790 916 1281 1598 2803 4128 4491 3176 1670 1149 1095 1064 793 724 437 309 479 474 429 235 280 232 232 349
406 349 74 160 226 355 298 185 258 181 172 45 132 195 142 103 356 206 181 242 180 156 213 71 378 115 138 232 100 270 247 120
124 120 112 73 50 185 120 8 223 207 156 257 136 53 127 119 155 74 43 210 195 207 86 266 208 58 103 58 114 84 90 147 139 154 89
-186 89 122 192 117 81 23 79 29 98 97 198 204 85 56 108 67 159 82 191 196 140 67 147
-392A47
##PAGE=	F1=-16850.6
##FIRST=	19140.455529915001534,	4405.895418600002813,	0
##DATA TABLE=	(F2++(Y..Y)), PROFILE
4406 86 10 23 43 85 48 103 43 114 160 64 133 178 78 171 82 173 216 313 349 210 78 147 75 152 195 222 244 88 145 91 155 200 115
4096 115 60 162 160 95 114 104 27 94 22 112 319 296 28 61 78 75 73 118 228 253 49 142 146 150 148 160 121 148 194 168 68 127 158 52
3777 52 197 49 114 54 74 159 104 72 89 137 98 171 183 82 55 91 98 166 190 31 82 113 16 134 141 117 91 60 97 39 130 87 102 155
3458 155 61 90 119 29 58 101 28 45 185 169 79 49 79 61 105 250 193 15 67 225 224 114 45 71 53 162 134 60 177 164 244 20
3157 20 241 90 115 76 138 159 123 201 123 138 192 178 142 120 51 76 150 210 141 14 155 148 134 3 135 108 12 37 73 57 79 88 188
2847 188 77 123 187 188 71 47 82 103 32 80 106 114 54 59 30 136 210 106 41 148 209 151 139 137 30 43 140 116 204 136 224 55 131
2537 131 38 14 94 128 233 225 190 117 236 153 88 65 49 188 58 41 64 62 63 77 27 35 149 43 111 141 142 162 120 249 200 64 148
2227 148 157 95 64 127 121 112 81 93 55 148 86 110 112 187 301 215 67 56 221 132 211 163 247 157 79 54 54 169 156 96 70 50 171 103 85
1899 85 122 156 282 249 71 56 159 144 197 361 101 130 154 127 163 96 279 154 118 195 160 223 129 179 33 128 111 99 81 176 106
1608 106 34 85 83 107 39 167 45 89 134 120 217 141 136 64 60 79 26 137 147 126 233 184 318 205 38 64 47 119 240 197 178 148
1307 148 86 206 225 234 118 181 223 69 57 83 121 200 193 174 46 136 105 148 70 99 156 203 298 290 102 78 52 104 121 119 107 201 91 84
988 84 204 286 40 150 124 150 247 253 110 74 171 133 246 212 327 135 103 131 221 128 155 123 47 192 186 167 77 250 189 321 373 202
687 202 321 271 456 480 471 420 693 782 1185 1487 2589 3733 4005 2849 1464 990 932 992 716 642 478 242 463 466 395 231
443 231 277 186 196 404 187 116 148 333 241 151 156 173 125 42 141 203 153 90 320 242 205 257 189 124 190 66 367 133 125 200 106 270
143 270 268 110 119 101 88 232 175 69 164 124 169 244 111 70 167 145 104 61 32 199 228 242 68 252 206 67 41 53 121 109 64 131
-158 131 145 153 137 89 184 120 67 28 84 10 105 102 149 169 112 53 117 59 138 67 174 171 123 99 143
-392A43
##PAGE=	F1=-16929.4
##FIRST=	19140.455529915001534,	4405.895418600002813,	0
##DATA TABLE=	(F2++(Y..Y)), PROFILE
4406 89 9 18 40 64 43 56 61 124 161 15 103 114 41 138 52 161 189 300 366 238 97 179 73 170 189 196 168 93 126 81 122 209 119 67
4087 67 111 154 81 93 90 21 94 25 117 354 347 18 67 91 86 77 107 218 246 11 187 175 129 114 136 102 135 145 144 27 86 123 50 171
3767 171 49 80 39 91 179 139 29 81 112 93 187 192 81 28 57 69 90 147 0 108 125 24 110 103 94 72 38 82 31 162 105 100 144
3458 144 76 84 112 22 56 93 29 81 166 174 80 39 43 52 78 219 187 2 103 241 257 133 73 101 67 163 138 30 124 169 243 35 261
3148 261 115 144 59 131 144 148 243 130 127 210 198 172 123 52 67 131 187 122 40 120 111 111 42 129 57 29 36 88 42 48 91 158 91 105 215 225
2810 225 112 19 60 65 25 79 116 102 82 83 18 136 176 81 42 119 191 154 134 143 51 52 138 85 191 111 198 74 140 69 22 80 109 213
2490 213 204 152 117 219 130 64 64 75 196 46 47 25 107 138 86 46 39 149 27 134 120 94 156 130 246 194 76 105 139 82 18 148
2190 148 122 115 115 97 98 168 79 106 139 192 283 217 69 53 237 143 216 164 224 144 52 61 83 219 170 110 73 46 173 119 80 151 184 284
1871 284 257 97 64 135 123 155 320 112 131 194 89 186 118 294 173 131 143 99 172 144 148 48 75 111 106 76 138 99 20 77 101 119
1570 119 50 187 87 73 132 98 192 132 140 92 33 75 46 124 178 108 230 210 318 198 44 39 54 55 211 202 178 137 133 223 255 267 124
1260 124 229 280 82 27 56 92 234 235 152 24 152 97 145 88 60 135 173 266 282 91 58 61 101 120 105 80 157 136 104 197 325 78
960 78 119 155 127 228 234 164 92 118 172 226 155 297 132 93 121 250 89 157 205 82 135 147 159 51 230 132 298 354 176 288 194
669 194 394 431 480 344 589 626 1031 1320 2349 3305 3511 2463 1223 829 727 893 640 504 460 198 429 453 373 204 282
434 282 182 130 415 291 56 69 294 225 130 53 160 80 63 139 191 161 93 263 247 224 282 213 86 136 74 347 153 89 150 103
152 103 222 255 82 97 128 110 268 219 146 136 29 155 199 61 92 177 163 63 47 37 184 238 272 49 226 195 100 40 72 135
-129 135 155 94 105 135 149 181 64 179 141 81 21 75 18 101 116 82 115 138 67 129 94 105 52 152 132 109 129 128
-392A28
##PAGE=	F1=-17008.1
##FIRST=	19140.455529915001534,	4405.895418600002813,	0
##DATA TABLE=	(F2++(Y..Y)), PROFILE
4406 88 39 33 54 46 41 34 68 124 153 30 76 57 50 104 18 137 154 258 361 253 102 195 92 183 173 200 125 92 111 80 86 223 123 105
4087 105 79 142 75 93 78 13 97 33 120 372 389 9 69 108 88 79 96 199 216 67 250 197 97 69 100 71 112 79 104 62 113 108 52
3777 52 135 59 37 18 103 190 167 24 81 76 99 181 186 93 20 40 63 19 104 27 135 124 49 83 61 71 55 35 80 51 177 117 100 125 90
3448 90 70 117 23 63 76 43 115 130 178 116 49 35 55 59 187 177 5 128 246 280 143 89 138 66 141 122 48 75 158 231 39 244
3148 244 114 178 109 142 123 146 258 128 119 244 214 208 121 40 79 119 167 97 71 93 76 82 71 117 17 60 43 104 16 17 90 118 99 78
2828 78 232 247 138 38 50 81 17 85 121 85 142 151 38 133 154 94 39 84 168 160 128 147 70 52 112 44 174 101 163 86 135 80 46 54
2509 54 87 180 174 120 122 182 95 52 73 92 187 31 65 12 152 195 95 69 62 139 21 156 88 94 145 149 234 167 70 67 121 64 44 164 115
2180 115 123 133 94 125 188 60 84 160 187 248 201 63 49 234 146 216 160 199 132 27 59 128 243 170 114 73 38 169 154 63 152 205
1880 205 283 246 136 88 112 94 122 274 128 127 234 54 196 148 307 169 136 83 49 115 151 148 95 27 102 148 89 100 104 64 98 110
1579 110 113 57 204 145 94 153 88 154 103 135 117 37 72 59 99 197 103 201 222 299 188 43 35 61 7 179 204 178 132 172 234 258 268 135
1260 135 273 309 115 39 66 76 260 267 124 86 161 78 133 96 30 107 137 218 279 131 29 77 100 134 77 51 94 153 108 187 339 123
960 123 82 160 94 204 200 196 139 64 197 263 157 253 143 71 107 279 103 132 273 161 99 95 150 86 174 98 276 315 195 252 118
669 118 324 362 472 319 515 496 858 1142 2120 2952 3148 2186 1025 718 499 786 596 358 396 198 373 430 366 180 275
434 275 202 95 382 371 36 8 233 241 128 53 136 83 94 129 162 161 104 193 230 232 302 235 78 93 88 319 169 55 100 99 156 218 44
124 44 57 142 115 286 248 224 153 74 120 132 24 125 169 170 45 46 60 178 239 287 36 212 185 128 70 87 146 203 148 69 121 136 217
-186 217 61 189 178 114 19 49 20 94 137 2 51 159 107 139 153 75 49 126 90 114 149 105
-392A05
##PAGE=	F1=-17086.9
##FIRST=	19140.455529915001534,	4405.895418600002813,	0
##DATA TABLE=	(F2++(Y..Y)), PROFILE
4406 85 74 62 75 31 37 36 60 114 139 62 73 44 77 85 20 102 135 199 330 257 93 194 111 178 152 230 148 92 98 93 49 243 133 155 121
4077 121 127 76 116 74 14 102 40 123 375 416 36 64 128 86 77 86 167 167 117 305 205 57 29 80 40 80 31 59 103 182 125 63 100 76
3758 76 37 22 107 201 189 69 97 38 104 152 161 112 23 51 68 37 64 48 150 115 69 60 25 57 42 60 92 72 169 120 105 101 99 47 135 36
3420 36 76 63 55 137 86 182 163 74 84 86 47 160 162 19 146 236 294 156 92 170 52 100 93 74 55 133 213 35 199 86 189 175 169
3110 169 99 116 240 115 126 290 240 238 116 24 79 116 149 71 101 110 88 48 83 102 47 83 47 121 30 40 86 76 102 46 237 252 149
2800 149 71 49 114 14 93 119 79 208 222 77 130 167 140 44 51 139 168 124 143 80 53 74 37 153 105 120 84 111 71 64 18 67 135 138
2481 138 103 130 140 55 60 88 96 161 30 84 35 176 226 97 94 93 128 49 172 45 160 133 163 208 119 71 45 107 59 98 176 105 138 133
2162 133 87 131 210 74 46 164 173 200 172 54 43 214 139 207 152 163 122 8 43 154 236 153 106 73 31 166 192 55 133 221 280
1871 280 219 164 108 103 70 94 225 144 119 248 48 182 181 315 138 130 29 79 62 141 161 141 27 86 187 109 70 123 108 128 106 95
1570 95 59 208 195 132 184 94 122 63 126 136 49 67 65 69 193 107 153 215 258 162 31 37 63 35 145 195 171 131 193 239 241 235 148 300 303 134
1232 134 57 90 77 269 278 95 134 163 59 118 89 62 71 102 172 286 204 44 88 89 144 50 25 37 138 93 170 321 159 61 134 61
932 61 180 162 208 175 26 203 322 207 212 164 70 89 302 157 93 312 243 99 65 144 140 90 79 270 267 220 231 82 262 284 442
640 442 324 488 442 723 1006 1936 2741 2968 2102 945 689 301 680 583 272 307 220 301 394 354 172 254 212 138 313 409 103
387 103 73 159 258 138 117 95 96 119 117 129 156 113 120 201 227 313 245 106 125 107 278 163 78 79 97 126 177 12 17 144 106 280 256 292
68 292 187 151 73 111 104 167 159 175 46 54 95 182 239 282 22 228 188 145 88 91 152 243 190 34 121 117 242 65 212 218 142 35 22 17 92
-261 92 158 78 42 172 152 140 206 67 61 96 53 133 153 80
-392H0
##PAGE=	F1=-17165.6
##FIRST=	19140.455529915001534,	4405.895418600002813,	0
##DATA TABLE=	(F2++(Y..Y)), PROFILE
4406 80 104 96 93 25 34 33 42 97 120 74 88 71 93 88 60 58 145 157 282 255 69 180 113 150 130 264 194 93 75 110 13 255 145 205 200 115
4068 115 84 149 85 20 105 44 123 368 427 74 55 146 85 72 79 122 110 147 335 202 20 49 105 25 44 76 46 124 240 158 75 73 90
3758 90 86 53 102 204 204 99 122 30 99 110 120 128 30 73 71 75 32 56 148 104 92 48 2 53 34 82 102 87 137 109 112 77 100 26 163 65 86
3411 86 65 69 145 49 187 199 101 133 135 46 133 138 38 160 212 294 173 90 189 29 60 60 90 84 106 194 27 158 54 178 252 199 75
3101 75 66 198 97 147 335 274 258 109 49 63 120 126 44 126 156 134 18 77 91 87 101 42 135 67 77 81 38 103 16 231 237 146 104 54 136
2772 136 21 99 109 89 264 279 118 133 195 185 63 31 102 178 121 127 79 63 44 107 137 109 79 68 72 47 78 26 67 80 97 99 139 110
2453 110 29 76 102 88 127 53 98 49 180 235 95 116 123 126 80 180 3 231 121 159 171 72 100 82 96 78 142 186 104 159 114 88 113
2143 113 227 125 14 149 157 147 138 50 36 179 121 184 137 112 114 9 20 152 202 121 92 75 37 170 220 79 110 238 274 180 177 115
1842 115 109 60 70 175 155 107 229 88 145 211 313 83 111 33 137 33 115 165 173 56 67 208 129 49 148 146 152 88 72 58 192 225
1542 225 164 210 105 106 50 121 148 49 61 71 53 169 112 95 196 200 116 47 31 55 54 112 168 156 128 198 240 213 170 156 301 262 124 62
1223 62 102 82 255 259 71 158 168 53 103 76 100 31 81 146 296 276 87 87 67 139 56 22 45 97 62 142 277 179 89 83 39 157 124
913 124 204 189 24 187 362 252 176 177 90 66 317 208 59 314 314 116 96 135 191 30 50 270 226 235 213 112 220 196 384 315
631 315 472 433 644 917 1758 2574 2835 2096 951 696 223 569 565 277 213 230 222 340 322 165 229 195 184 219 397 158 117 84
368 84 250 151 144 58 84 131 109 100 147 114 53 166 210 316 248 132 188 130 215 126 123 93 93 158 162 24 36 136 88 252 244 341 215 203 24
40 24 189 195 214 165 185 62 62 136 191 234 257 13 266 207 149 93 89 152 268 208 41 142 93 255 60 232 248 152 53 40 26 98 170
-270 170 144 101 174 184 123 237 73 82 65 27 151 144 57
-392E7
##PAGE=	F1=-17244.4
##FIRST=	19140.455529915001534,	4405.895418600002813,	0
##DATA TABLE=	(F2++(Y..Y)), PROFILE
4406 75 124 128 103 32 43 19 18 78 99 65 98 89 94 100 98 11 168 174 242 256 31 155 91 105 116 284 221 87 35 120 28 248 149 245 277 114
4068 114 100 184 110 32 105 46 117 350 418 115 46 156 89 60 79 65 73 155 341 196 35 90 155 35 11 119 83 123 267 186 82
3777 82 57 94 129 81 92 187 208 104 144 55 81 65 69 130 40 89 68 92 14 48 127 104 116 47 16 60 30 90 105 92 85 90 113 59 95 40
3439 40 194 102 88 67 88 139 45 187 209 119 166 186 62 102 108 59 166 186 275 186 95 191 6 68 39 100 128 94 178 12 154 93
3138 93 167 333 223 54 18 149 90 170 364 296 268 104 90 55 129 90 15 138 197 175 55 63 93 121 117 37 144 93 107 77 10 100
2838 100 19 214 205 132 133 64 142 30 105 94 108 299 311 154 137 209 215 87 48 59 190 117 95 68 81 59 188 139 107 65 43 31 32
2528 32 93 71 95 32 54 101 143 98 47 89 113 72 99 81 101 58 176 230 93 134 148 135 103 181 48 282 109 133 136 77 138 138 86 105
2209 105 169 198 118 181 84 102 74 229 177 49 120 151 103 109 51 34 140 101 148 119 54 105 14 21 126 160 78 77 79 56 179 234 116 114
1889 114 259 264 133 176 112 117 53 62 127 156 93 180 149 111 233 296 12 85 62 180 49 84 152 182 77 54 207 143 35 167 174 167
1589 167 59 57 60 158 228 181 219 114 104 86 129 151 36 55 86 68 137 109 54 178 145 51 100 20 38 65 84 125 135 117 189 235 182 86
1270 86 150 271 201 86 52 91 86 223 217 53 160 181 62 88 70 122 18 88 143 298 325 127 75 45 122 88 48 74 40 26 106 219
969 219 185 139 43 29 138 82 188 178 33 150 361 267 138 167 102 40 323 243 55 285 363 145 145 115 228 111 10 261 206
697 206 254 187 151 211 117 304 282 433 417 604 864 1584 2384 2661 2062 989 701 297 452 522 318 152 228 151 276 281 146
443 146 225 166 199 116 346 189 144 50 210 166 130 90 69 129 113 78 141 105 28 128 183 313 253 139 239 154 132 65 150 111 86 197
143 197 180 36 66 121 66 210 215 361 223 228 19 283 275 255 191 198 90 67 176 199 215 211 44 298 234 140 89 84 151 277 200 71
-158 71 171 64 254 49 233 258 143 64 71 42 107 168 186 149 165 201 84 234 73 107 37 22 158 124 40
-392D0
##PAGE=	F1=-17323.1
##FIRST=	19140.455529915001534,	4405.895418600002813,	0
##DATA TABLE=	(F2++(Y..Y)), PROFILE
4406 73 130 151 101 45 65 5 13 61 75 37 94 88 82 108 130 43 185 226 236 266 14 123 50 69 110 280 216 71 46 115 64 215 143 265
4087 265 330 121 123 216 145 51 102 47 101 319 390 151 44 153 97 41 92 22 79 143 327 196 63 122 206 49 21 136 120 106
3805 106 264 198 84 52 87 153 98 92 144 195 81 152 78 50 31 20 108 59 93 61 88 13 27 94 122 138 50 32 77 31 86 104 88 61
3486 61 75 104 51 87 68 218 138 79 56 112 122 58 177 193 121 178 225 85 64 74 82 155 167 235 187 114 176 11 104 43 105 169 107 167
3166 167 17 178 167 184 406 234 44 65 128 104 185 368 291 267 100 125 84 137 41 26 132 213 192 104 70 108 146 129 43 140 99
2875 99 127 71 16 93 45 188 157 120 161 77 132 36 112 75 133 313 315 174 135 198 225 107 84 16 199 109 51 54 100 92 258 155 105
2565 105 90 39 37 58 108 107 129 61 16 105 138 92 80 98 116 57 91 107 89 74 181 224 93 149 166 145 115 175 85 304 105 86 123 121
2246 121 165 184 74 122 181 208 137 194 57 126 24 211 210 77 86 158 79 94 57 41 114 93 117 99 24 95 11 48 88 140 45 65 83
1936 83 77 184 232 148 147 276 242 80 167 103 120 36 73 88 140 79 119 217 130 241 263 60 63 76 196 70 66 124 168 92 50 185 147
1626 147 32 176 190 178 31 65 69 112 205 179 208 118 97 126 143 148 21 53 109 88 118 94 61 169 124 46 162 25 23 83 67 77 113
1317 113 97 173 222 155 7 127 213 157 57 36 59 98 189 166 38 153 203 71 68 83 125 59 109 141 282 341 152 58 34 99 119
1025 119 80 87 30 19 74 173 179 185 77 36 124 43 163 146 34 101 316 252 94 138 93 14 319 261 71 240 383 178 187 94 243
734 243 181 56 240 202 276 177 176 220 104 237 251 368 382 572 842 1467 2202 2475 1980 1030 706 402 355 465 343 142 228
481 228 122 223 255 113 253 166 183 44 281 196 162 97 154 185 81 152 112 123 133 59 138 88 64 91 151 305 260 127 264 173
199 173 46 48 151 115 78 213 200 45 87 105 46 162 180 351 207 228 45 345 326 281 226 211 118 74 205 203 174 148 84 306 255
-92 255 122 77 74 152 273 173 89 193 28 239 58 210 245 120 66 93 56 107 147 198 177 146 206 28 197 72 135 22 47
-364 47 149 106 31
-392C1
##PAGE=	F1=-17401.9
##FIRST=	19140.455529915001534,	4405.895418600002813,	0
##DATA TABLE=	(F2++(Y..Y)), PROFILE
4406 78 124 161 87 58 89 24 31 51 48 16 76 66 61 110 152 88 187 265 258 277 59 83 27 89 105 251 182 64 117 94 95 160 132 256 344 129
4068 129 143 238 186 77 100 46 78 274 345 180 53 141 105 17 115 62 98 120 303 198 78 140 249 64 40 130 142 82 240 191
3786 191 83 65 73 156 98 115 92 163 36 144 95 13 16 45 58 90 82 50 65 10 8 60 154 157 50 51 98 36 77 103 77 120 85 86 53 84
3448 84 89 229 165 63 33 135 97 60 153 156 108 167 243 99 37 46 109 121 154 178 175 139 150 17 130 64 109 200 128 163 52 194 234
3138 234 232 457 228 55 114 146 125 184 345 255 257 100 145 126 140 29 62 104 196 181 142 105 130 158 132 65 122 89 139 61 44 79 70
2828 70 155 99 125 191 94 108 36 117 53 163 311 293 172 122 167 219 120 119 31 198 92 11 48 118 122 304 169 112 120 64 70 94 123 129
2509 129 155 106 18 110 123 84 115 108 112 45 103 128 61 107 200 225 97 162 175 147 114 165 108 298 114 42 136 154 166 206 58 121 177 206
2190 206 146 192 52 145 38 175 216 84 56 169 72 94 65 51 118 112 117 79 62 87 13 66 56 162 70 51 84 92 177 220 165 182 282
1880 282 203 24 156 93 118 38 84 72 109 67 81 279 188 231 214 120 55 77 186 85 81 87 134 110 51 153 138 39 172 194 189 41
1579 41 98 88 62 158 158 173 115 78 154 152 145 41 46 130 96 121 64 80 163 141 124 214 40 39 109 55 37 91 77 154 196 137 82 88 145 171 104
1232 104 44 31 129 172 135 25 155 227 79 40 104 113 96 129 126 243 319 157 40 36 79 137 109 91 81 43 64 159 160 212 114 58 115 36
913 36 134 100 23 53 240 217 49 99 64 16 301 263 82 200 374 205 212 90 232 216 101 214 199 280 219 193 218 141 219 251 289
622 289 344 518 818 1417 2054 2304 1853 1039 717 472 310 420 338 144 233 150 207 251 77 291 207 152 82 232 189 181 148 126
359 126 209 33 203 183 128 164 39 138 65 87 60 121 291 260 102 260 180 68 111 127 100 74 205 202 62 100 93 42 114 151 317
68 317 169 207 57 357 338 287 250 223 138 82 219 200 113 75 119 283 260 104 60 60 155 261 140 87 197 13 212 90 167 213
-214 213 97 59 103 63 96 110 186 184 121 209 34 138 94 163 33 81 127 99 23
-392B3
##PAGE=	F1=-17480.6
##FIRST=	19140.455529915001534,	4405.895418600002813,	0
##DATA TABLE=	(F2++(Y..Y)), PROFILE
4406 88 110 155 62 66 107 40 41 47 25 57 49 29 36 106 163 129 175 270 276 276 97 48 70 133 94 201 134 91 187 59 119 92 125 214 317 132
4068 132 153 249 225 104 106 45 53 214 287 196 70 123 111 14 137 103 103 99 270 191 77 144 280 90 49 109 144 59 213 170 80 92
3767 92 67 137 85 154 97 121 28 121 106 29 42 89 24 134 61 34 33 4 29 40 185 171 48 70 116 45 78 103 73 190 112 62 64 89
3448 89 97 224 177 49 25 149 68 48 117 116 86 136 235 94 53 39 139 73 137 115 155 166 127 13 141 90 114 220 144 167 93 190
3148 190 278 283 481 210 80 146 171 135 170 304 194 239 104 146 158 138 91 91 57 150 146 163 147 147 151 124 94 101 80 143 48 77 67 92 121
2819 121 41 144 224 117 76 36 112 39 194 301 257 143 101 129 200 124 141 62 182 66 46 55 131 142 314 170 122 134 84 96 127
2528 127 135 132 165 128 38 113 95 80 150 118 101 41 124 140 22 150 216 224 106 171 175 141 103 152 114 267 129 74 155 159 141 199 37 101
2209 101 162 186 140 172 62 150 86 128 200 71 36 173 65 104 69 58 141 149 146 56 89 88 38 69 42 203 121 32 83 96 157 203 168 198
1889 198 270 146 35 147 87 120 83 79 83 70 51 99 322 239 205 159 155 57 75 155 98 116 47 89 137 55 124 115 46 158 184 195 69 142
1570 142 114 21 101 120 120 105 50 169 152 144 77 26 143 87 130 18 80 151 159 193 245 54 64 139 46 15 66 66 126 155 135 143 40 109 216
1241 216 167 76 75 172 173 136 21 166 244 87 13 119 94 119 139 96 183 266 139 27 46 63 137 129 100 114 55 69 174 128 216 121 84
932 84 109 60 109 70 3 40 153 184 34 72 37 31 269 246 80 167 338 212 218 102 197 213 124 195 192 249 289 217 207 154 236 279 221 314
612 314 428 752 1369 1906 2110 1675 980 718 495 306 397 310 123 224 187 229 250 59 312 255 135 123 217 182 202 188 154 235
349 235 89 228 242 150 195 49 139 48 87 38 103 272 244 73 226 173 135 160 88 70 82 185 181 85 108 89 55 78 134 268 116
58 116 166 59 320 308 268 252 231 150 91 216 192 46 38 144 234 245 98 39 45 159 251 114 76 180 57 176 123 114 174 92 45 101
-242 101 65 75 67 163 182 90 213 91 79 135 187 51 113 102 108 11
-392A1
##PAGE=	F1=-17559.4
##FIRST=	19140.455529915001534,	4405.895418600002813,	0
##DATA TABLE=	(F2++(Y..Y)), PROFILE
4406 101 94 134 32 68 117 49 38 40 21 101 29 20 19 101 166 170 157 234 265 257 123 63 109 166 75 144 102 134 239 24 138 27 128 143
4087 143 258 131 150 248 255 127 122 42 34 146 227 200 90 107 114 39 148 124 93 88 226 165 60 133 300 124 48 83 129 43 193 149
3786 149 78 119 78 105 75 191 158 93 87 89 106 63 83 126 110 184 48 20 40 23 49 35 206 180 49 83 125 53 90 96 88 240 137 38
3467 38 80 98 91 204 172 46 47 150 39 28 77 94 69 94 206 67 82 55 167 46 111 56 137 188 127 14 140 115 122 232 147
3176 147 172 129 178 294 316 477 190 107 156 177 128 145 255 121 216 113 127 170 130 146 104 16 90 99 161 174 152 128 108 125 92 96 140
2866 140 45 108 70 106 89 20 164 255 144 54 48 93 59 216 282 219 95 74 92 174 122 149 84 151 39 76 62 138 150 289 162 126
2565 126 127 87 117 149 139 114 158 122 60 112 62 92 182 128 88 46 146 139 42 189 214 212 114 175 166 132 84 137 101 217 138 132 165 132 96 168
2227 168 11 67 137 146 118 141 64 137 122 82 175 51 34 164 51 117 63 59 158 185 174 28 107 103 75 58 37 242 169 10 80 88 125
1918 125 188 161 190 240 80 85 141 82 129 137 58 101 58 32 130 341 270 167 113 161 52 88 110 111 154 10 42 169 72 116 81 47 139
1608 139 163 188 87 187 141 40 80 69 57 84 34 179 149 140 112 10 147 62 128 41 60 130 160 235 247 67 78 171 63 10 34
1317 34 63 88 98 148 180 30 139 249 209 108 129 210 172 143 37 170 248 104 33 120 74 125 140 62 115 192 111 37 66 46 115 137
1016 137 115 124 50 70 195 86 200 96 102 106 77 95 92 29 60 79 176 68 68 59 41 224 212 64 129 285 198 202 112 150 183 124 178 183 178
687 178 346 251 224 129 245 311 203 294 329 635 1266 1738 1868 1458 851 690 482 310 390 277 92 192 203 265 240 73 307
434 307 282 154 137 217 184 217 218 197 257 154 228 273 177 213 99 142 57 70 24 102 248 212 45 163 152 172 179 45 44 98 164 146 106
124 106 108 91 69 72 126 212 63 109 64 258 254 228 229 235 158 101 200 186 25 100 156 171 213 107 30 32 163 246 99 80 147 99 141 144 69 141
-214 141 108 28 89 66 59 40 152 191 59 211 128 60 174 205 67 135 85 121 6
-392F
##PAGE=	F1=-17638.1
##FIRST=	19140.455529915001534,	4405.895418600002813,	0
##DATA TABLE=	(F2++(Y..Y)), PROFILE
4406 109 78 104 12 66 117 51 23 28 34 136 38 69 29 94 169 211 144 165 220 229 137 113 131 180 54 90 117 174 266 30 153 36 134 52
4087 52 200 132 135 242 272 143 144 42 35 75 174 194 111 99 113 58 143 124 84 89 170 120 36 111 309 160 43 67 103 39 176 146 84
3777 84 138 95 77 91 215 207 100 137 66 88 87 122 151 197 229 62 21 84 48 63 32 210 185 53 88 122 59 101 79 110 259 148 23
3467 23 99 105 74 174 152 52 61 134 13 16 51 95 69 53 166 25 99 79 186 78 88 30 131 202 146 32 132 132 135 237 137 165
3166 165 153 184 287 327 454 178 128 146 162 104 117 207 53 195 124 93 159 119 180 95 78 70 69 138 174 144 106 92 147 101 126 126 64 129
2847 129 86 109 64 54 169 276 169 71 74 63 103 222 250 189 41 50 56 141 117 153 102 112 29 85 62 133 140 235 156 115 101 71 137 156
2528 156 130 77 139 90 90 105 33 115 206 133 77 62 162 125 92 211 187 179 117 171 147 127 62 118 74 158 136 179 159 77 47 119 18 46
2209 46 109 89 85 114 49 105 144 56 159 55 48 143 36 130 43 53 158 207 186 5 135 126 116 38 38 273 206 23 77 71 88 179 151 160
1889 160 197 26 120 135 76 139 183 24 112 95 35 149 340 286 136 95 138 32 120 59 123 183 22 15 197 103 134 43 45 116 134 159
1589 159 89 223 166 76 129 11 29 53 53 190 152 132 140 61 146 30 113 98 28 108 146 239 223 83 76 199 105 39 11 65 40 32 168
1279 168 196 67 191 257 219 131 163 227 154 130 58 162 242 132 61 105 62 116 144 49 70 119 97 69 94 21 74 138 130 108 35 61 211
969 211 69 181 57 105 111 78 95 127 57 69 50 192 107 66 94 49 173 167 39 77 219 174 169 106 108 145 110 153 169 85 367 283 281 91
650 91 230 326 250 280 283 505 1120 1591 1624 1252 694 627 456 308 385 252 95 146 194 297 231 108 278 278 189 132 205 197 216 243 224
359 224 265 191 216 275 191 207 159 148 84 54 12 114 222 174 23 80 121 174 167 16 61 115 145 111 118 100 93 73 93 117 153 53 49 81 214
30 214 215 183 188 233 168 109 178 190 59 153 155 108 167 113 51 25 167 245 87 110 107 130 125 152 48 128 129 8 67 68 73 59 163 221 63 198
-308 198 139 80 196 217 84 142 84 127 26
-392B6
##PAGE=	F1=-17716.9
##FIRST=	19140.455529915001534,	4405.895418600002813,	0
##DATA TABLE=	(F2++(Y..Y)), PROFILE
4406 108 62 74 41 61 110 52 16 23 45 160 58 112 47 87 177 245 144 78 155 210 147 160 133 178 47 50 155 204 271 57 166 70
4105 70 134 43 191 143 113 239 273 151 167 49 50 14 141 181 127 97 107 67 121 110 94 94 106 68 28 89 311 186 47 66 73 54 155
3796 155 164 103 149 102 73 127 222 219 121 168 77 48 100 144 164 264 258 87 35 125 73 74 26 198 185 60 85 109 63 104 56 123 246 145
3476 145 26 117 106 48 142 124 70 60 105 17 29 54 103 73 27 130 30 101 102 188 110 95 69 141 205 165 54 118 133 147 236 117 135
3166 135 159 219 270 325 422 175 137 122 130 74 89 161 13 176 134 54 127 106 185 67 141 118 85 96 146 142 115 90 149 105 145 99 89 135
2847 135 96 97 45 75 153 278 184 106 106 42 152 209 200 166 40 37 15 106 112 176 126 78 41 72 53 113 108 163 157 93 76 52 155 145 103 27
2509 27 117 48 124 87 17 140 225 132 76 81 165 97 135 207 144 129 110 161 119 133 52 96 65 106 125 206 143 15 52 65 45 70 87 27 51
2180 51 108 22 61 155 73 160 86 67 116 24 144 12 42 138 210 185 35 180 149 159 24 61 295 228 45 74 61 56 176 139 119 152
1880 152 51 131 123 66 144 211 15 110 141 68 158 337 303 139 97 93 4 160 9 131 196 48 44 211 139 166 19 46 93 101 107 85
1579 85 246 185 110 191 59 81 13 77 198 155 124 160 114 146 13 93 143 5 95 122 204 181 100 58 222 148 84 42 76 24 34 187
1279 187 198 91 232 247 198 146 168 217 117 89 74 152 237 168 82 73 58 104 163 62 89 83 119 108 123 15 28 139 137 74 28 53 217
969 217 112 182 68 95 127 68 99 142 77 57 51 205 140 52 112 60 126 125 10 45 143 155 133 85 82 124 101 110 142 23 346 296 339 100
650 100 205 318 319 268 311 427 977 1509 1463 1104 576 532 427 303 373 227 125 111 164 318 239 149 238 244 210 123 170 209 193 260
368 260 232 255 193 209 261 185 175 208 154 110 65 2 127 203 145 20 29 94 147 134 23 99 127 122 89 117 84 93 64 114 98 102 97 71 101 218
30 218 232 158 140 223 176 113 153 202 69 174 144 66 115 105 80 26 175 244 78 144 79 146 141 151 50 131 145 11 42 71 110 88 187
-280 187 260 116 177 122 94 199 224 109 136 89 120 45
-392D5
##PAGE=	F1=-17795.7
##FIRST=	19140.455529915001534,	4405.895418600002813,	0
##DATA TABLE=	(F2++(Y..Y)), PROFILE
4406 97 48 59 69 56 100 57 47 49 54 174 75 143 64 81 187 262 147 27 97 211 161 194 122 169 71 45 194 226 260 72 180 80
4105 80 120 125 232 164 88 242 259 150 187 64 66 51 129 170 132 94 95 63 88 92 114 101 48 41 50 86 309 196 62 75 54 77 127 186 128
3777 128 160 95 90 158 212 190 130 177 109 30 106 138 163 299 262 107 49 151 91 84 21 174 181 70 77 94 70 99 40 118 208 130 31 132
3458 132 103 19 113 96 99 50 67 42 46 64 104 68 18 114 74 90 115 171 116 122 114 159 196 166 73 111 119 151 222 97 83 144 264 259 325 387 172
3110 172 132 91 89 54 66 117 41 161 138 44 79 93 161 30 186 167 119 40 116 183 156 99 127 87 142 67 105 126 87 72 30 83 117 260
2791 260 184 138 138 56 192 180 133 143 74 47 33 73 108 223 158 71 51 41 38 82 57 85 162 75 91 60 165 121 65 34 102 50 147 58
2472 58 22 165 239 125 91 94 150 63 163 175 112 76 95 148 87 147 67 75 107 101 116 214 122 84 106 15 66 102 79 30 31 123 13 33 156
2143 156 107 167 116 82 88 20 160 37 28 103 194 182 59 223 163 197 30 95 304 236 62 75 73 49 174 124 80 116 80 116 106 53
1842 53 141 218 47 95 174 107 169 350 333 175 93 41 47 195 53 129 185 65 71 207 168 199 47 60 74 73 37 94 255 200 138 236
1542 236 124 127 29 93 196 147 125 173 156 149 28 80 164 28 91 95 139 141 111 25 234 178 131 72 100 65 87 196 191 94 252 237 159 156
1223 156 145 178 70 30 79 160 244 202 94 31 62 110 192 77 124 102 152 145 143 58 67 150 136 37 45 62 210 169 206 125 83 152 59 97 130
894 130 80 27 35 196 161 32 108 75 93 106 26 107 54 147 124 62 71 126 104 61 103 92 291 284 356 141 196 289 369 264 353 422 869 1465
575 1465 1406 1016 538 419 391 299 357 193 139 111 122 322 266 191 198 193 204 120 116 213 151 260 233 227 166 217 248 166 125 232 155 124 88
265 88 15 135 193 132 36 116 87 107 101 29 131 133 93 79 107 75 90 44 119 63 98 146 145 111 246 290 168 97 209 179 112 125 211 64
-54 64 157 131 69 66 87 103 48 188 236 76 162 87 142 174 146 54 135 154 30 47 75 148 107 207 294 182 164 82 89 182 229 142 127 93
-374 93 101 57
-392E7
##PAGE=	F1=-17874.4
##FIRST=	19140.455529915001534,	4405.895418600002813,	0
##DATA TABLE=	(F2++(Y..Y)), PROFILE
4406 74 37 69 89 49 88 64 87 81 63 181 92 158 78 78 190 252 140 86 87 220 177 213 107 161 112 78 231 240 239 72 193 64 90
4096 90 183 273 186 64 245 235 142 202 80 75 94 131 165 122 81 76 46 60 82 128 108 34 57 72 107 305 190 77 89 52 98 102 195 144
3777 144 173 75 106 170 187 128 119 171 138 105 112 102 149 296 239 118 57 158 100 87 29 144 173 87 70 87 89 98 49 94 157 109 32 144
3458 144 98 13 93 78 131 46 27 72 65 66 99 51 2 115 102 71 112 136 96 141 152 175 177 143 86 121 100 140 189 86 23 114 297 260 336
3129 336 348 160 113 58 52 60 53 85 66 146 133 82 23 80 114 43 205 194 150 47 148 265 201 107 93 50 117 60 104 111 58 40 18 82
2810 82 68 223 168 158 168 82 214 140 64 116 92 69 78 51 106 270 191 88 52 21 30 51 26 21 168 85 141 86 164 106 42 89 101 89
2490 89 145 17 49 194 253 111 118 98 118 50 173 121 134 68 85 137 57 164 92 64 168 148 112 208 105 163 166 37 79 117 81 76 33
2180 33 144 43 63 144 139 171 135 92 65 26 178 86 13 62 171 188 68 241 163 227 36 123 298 231 75 80 95 67 168 105 56
1889 56 98 84 78 85 39 133 207 69 71 189 140 190 381 372 214 72 43 90 217 111 117 150 71 86 189 184 224 82 85 69 67 44 127 251
1570 251 219 157 252 179 155 66 98 187 119 141 180 175 155 38 77 155 38 82 62 82 125 111 16 233 187 168 91 124 93 119 190 180 77
1260 77 253 240 114 165 107 120 42 56 69 186 267 228 98 30 66 134 218 86 144 133 174 171 148 100 137 169 127 46 64 77 193 212 231
950 231 178 90 182 61 85 102 67 28 21 156 162 42 87 90 78 108 58 183 43 134 154 65 65 128 108 69 87 141 217 250 316 161 208 250
631 250 387 275 367 439 787 1393 1387 956 550 311 338 294 341 161 128 124 80 311 298 230 165 144 167 117 52 202 104 234 234 196 128
340 128 233 249 158 102 222 149 124 106 24 138 194 122 50 191 105 77 89 30 151 135 62 67 92 89 85 14 104 19 152 189 207 99 273
30 273 350 195 71 195 173 116 91 208 80 113 127 97 44 85 114 81 205 223 85 157 117 122 207 141 58 125 153 50 82 78 176 112 217
-280 217 311 241 170 30 66 152 230 178 122 92 72 58
-392E8
##PAGE=	F1=-17953.2
##FIRST=	19140.455529915001534,	4405.895418600002813,	0
##DATA TABLE=	(F2++(Y..Y)), PROFILE
4406 41 34 86 97 43 78 71 126 106 73 184 108 164 90 80 179 212 116 121 106 218 184 222 95 161 158 120 267 245 210 60 206 25 46 208
4087 208 283 200 51 239 205 128 212 91 77 124 134 168 97 61 50 21 65 81 124 114 62 66 86 137 301 173 86 105 59 111 97 186 139
3777 139 183 46 114 156 149 52 91 159 151 188 124 47 125 263 195 122 61 148 101 80 48 111 159 112 65 89 115 110 65 56 105 88 39 155 96
3448 96 45 85 72 158 60 9 106 88 64 88 29 29 116 108 50 92 88 56 138 179 180 154 102 87 143 96 113 136 90 69 75 304 262 349 301 139 85
3101 85 27 53 77 54 84 88 127 116 124 39 69 65 83 194 198 177 123 231 356 232 109 89 55 82 92 85 105 25 11 13 80 12 174 135 163
2772 163 194 103 213 97 42 93 96 92 111 46 105 297 209 110 50 59 35 62 90 71 175 115 196 102 155 127 76 134 106 120 113 38 92 225
2453 225 266 96 150 96 80 87 168 54 190 114 96 134 33 177 107 66 220 206 109 193 97 223 225 76 81 111 81 111 35 162 66 101
2152 101 120 159 164 141 97 47 41 195 132 12 41 164 204 61 222 151 242 38 139 279 218 91 90 110 85 156 85 49 99 63 30 69
1852 69 27 125 182 77 41 186 161 214 412 404 237 41 89 123 223 170 102 101 70 88 165 183 233 114 111 84 90 119 166 239 243 165 239 216
1533 216 162 90 100 184 79 162 182 164 167 50 76 116 32 64 32 113 131 96 56 217 173 184 99 138 102 126 171 165 46 239 253 77 173
1223 173 88 53 58 124 54 208 296 240 96 80 65 160 231 92 143 155 179 183 136 130 202 187 111 86 73 88 171 230 236 213 117 210 73 64 88
894 88 40 79 81 93 140 68 55 102 77 113 90 244 143 113 195 91 74 116 99 130 134 168 147 204 236 144 217 217 374 302 359 442 715 1265
575 1265 1332 900 564 243 266 288 324 149 106 121 51 290 326 262 140 116 108 107 9 177 88 182 232 175 104 246 259 185 150 182 139 114
274 114 120 26 138 204 105 55 238 131 76 104 38 157 136 56 41 82 114 81 23 72 58 216 219 241 62 298 389 214 72 183 159
-17 159 136 57 193 125 82 140 121 64 121 112 114 220 204 97 135 144 88 230 136 63 99 140 69 119 78 184 104 213 307 278 186 38 27
-327 27 117 223 209 123 84 41 46
-392D6
##PAGE=	F1=-18031.9
##FIRST=	19140.455529915001534,	4405.895418600002813,	0
##DATA TABLE=	(F2++(Y..Y)), PROFILE
4406 5 37 96 96 46 73 73 158 115 81 184 121 167 101 85 152 151 82 119 112 198 177 230 96 170 200 157 298 240 173 42 220 35 5 199
4087 199 255 198 68 219 176 112 218 93 73 145 137 174 67 59 25 22 94 84 101 120 84 48 92 161 295 157 85 124 67 112 111 166 112
3777 112 179 20 115 119 101 63 54 150 145 258 144 47 100 214 145 124 60 129 106 69 74 75 136 139 62 97 137 132 72 12 65 71 56 166 101 78
3439 78 88 71 174 89 41 142 111 60 75 26 74 110 93 33 64 32 20 120 191 174 129 59 77 157 108 70 66 102 137 41 283 249 352
3129 352 246 116 59 23 92 89 65 106 105 103 88 158 91 65 66 111 157 192 206 203 313 424 243 106 133 116 59 126 57 118 57 10 18 79 43
2800 43 125 93 150 220 121 191 57 78 91 103 107 124 47 103 293 204 130 55 101 41 103 155 132 188 147 238 100 149 170 118 160 107 138 61
2481 61 93 142 252 273 83 180 102 72 139 152 19 246 159 120 139 22 176 106 73 249 259 100 176 99 256 276 108 76 85 72 138
2190 138 27 178 76 129 94 164 150 136 97 30 58 205 171 29 66 188 218 43 162 136 240 50 141 257 202 110 102 109 96 140
1908 140 76 57 110 24 33 69 17 120 149 72 12 169 165 232 426 415 236 51 128 141 216 225 97 82 74 78 149 167 220 140 133 112 124 179 194
1579 194 223 270 163 200 228 152 93 104 196 53 179 174 125 187 81 72 57 20 42 53 183 138 68 88 188 142 177 98 134 99 111 143 147
1270 147 12 213 261 52 177 110 16 78 176 68 207 319 242 90 127 53 179 230 97 128 169 173 182 108 140 252 198 88 120 71
988 71 94 152 229 213 224 147 227 85 37 113 9 129 155 21 99 83 23 106 83 112 123 282 232 115 222 119 101 96 72 186 195 183
687 183 107 153 166 95 204 191 341 328 353 440 650 1113 1214 836 554 233 184 275 301 147 95 104 46 265 339 279 128 109 46 84
406 84 51 144 116 110 219 166 98 251 267 235 220 122 127 104 141 24 136 217 79 51 250 156 88 127 55 151 134 93 20 79 131 79 56 32
86 32 123 264 229 236 24 329 398 213 95 171 141 171 61 169 174 119 164 132 88 171 105 135 223 184 101 108 160 47 236 129 67 61 112
-223 112 89 147 71 171 86 199 283 286 191 89 27 98 203 228 123 72 22 27
-392B7
##PAGE=	F1=-18110.7
##FIRST=	19140.455529915001534,	4405.895418600002813,	0
##DATA TABLE=	(F2++(Y..Y)), PROFILE
4406 38 41 95 94 66 78 68 177 104 87 178 128 173 110 94 120 95 60 87 102 163 155 240 115 183 232 180 319 226 137 29 235 96 53 159
4087 159 194 180 102 187 150 100 221 84 70 165 141 177 58 95 38 59 125 82 67 126 106 8 94 171 286 152 80 144 83 101 129 154
3786 154 77 156 31 111 68 47 135 35 149 120 301 164 110 91 171 117 127 58 110 126 74 98 43 103 157 63 109 150 154 68 30 47 56
3476 56 79 177 113 110 95 70 180 128 73 176 128 56 72 47 122 96 68 24 62 22 49 108 192 160 103 59 57 151 121 25 37 115 189 30 240
3148 240 215 339 190 101 53 60 134 90 77 125 108 74 59 180 131 68 107 116 106 195 236 274 369 452 232 102 182 172 60 143 49 141 108
2838 108 23 34 77 94 84 47 124 243 144 162 42 97 108 125 108 117 46 102 264 175 146 63 135 39 144 202 177 200 169 258 81 153 207
2528 207 145 164 96 148 65 142 184 262 268 77 201 121 106 188 129 85 286 184 139 148 31 157 86 78 249 299 94 158 103 257 305 127
2227 127 70 48 58 161 17 191 78 142 92 154 130 123 93 11 71 202 197 45 103 229 218 31 74 133 218 71 136 242 188 126 112
1936 112 94 95 124 82 82 130 22 76 79 13 117 112 57 23 144 153 238 415 397 213 100 153 146 202 267 111 129 94 76 147 141 184 154 146 146 157
1598 157 213 203 203 291 155 144 214 131 71 110 209 64 187 155 80 216 127 74 32 25 45 98 236 136 31 107 152 103 151 93 113 100
1298 100 79 116 126 26 178 254 37 170 140 59 85 207 115 174 323 238 80 162 26 196 223 96 111 183 169 168 78 132 285 199
1016 199 62 143 63 100 137 216 168 213 171 227 93 10 150 22 167 228 63 56 84 7 106 88 109 155 296 297 174 228 141 129 100 41
716 41 223 236 190 105 105 178 37 176 159 305 337 354 464 607 1003 1054 754 522 251 107 251 268 128 93 100 46 238 330 273 132
434 132 106 53 48 73 110 150 36 191 157 87 251 262 281 272 57 113 109 175 35 133 224 53 41 232 171 102 147 72 138 126 143 64 81
124 81 131 79 84 6 178 287 216 191 89 362 377 188 128 156 122 204 99 147 214 184 185 124 100 212 109 139 210 163 96 98 162 11 225
-186 225 120 64 25 74 107 164 62 141 66 175 242 264 178 127 93 114 171 234 115 54 28 35
-392C5
##PAGE=	F1=-18189.4
##FIRST=	19140.455529915001534,	4405.895418600002813,	0
##DATA TABLE=	(F2++(Y..Y)), PROFILE
4406 77 44 87 102 95 92 56 181 75 93 168 125 179 117 102 99 93 69 41 101 130 125 245 148 195 248 186 325 209 117 31 248 151 88 101 115
4077 115 151 132 149 128 96 225 67 77 188 149 173 82 139 66 96 152 72 49 132 134 48 97 165 272 158 82 164 108 80 140 162 78 123
3767 123 60 106 23 23 192 69 152 79 310 178 162 105 150 126 129 61 94 160 107 115 45 64 161 64 129 150 175 57 60 46 43 100 182 132 139
3439 139 103 67 182 169 102 200 137 53 87 72 165 79 53 19 98 71 79 118 184 145 77 93 31 124 121 46 108 126 218 42 185 163 315 142
3119 142 90 65 105 165 79 84 127 91 50 54 191 153 73 138 99 79 211 260 328 393 433 205 96 213 209 62 138 79 156 148 43 61 79
2810 79 140 55 14 93 262 169 145 68 88 124 152 93 97 39 102 234 128 156 66 157 28 172 226 197 201 180 252 59 162 225 149 144 76
2500 76 156 138 173 204 245 248 78 210 148 146 228 101 140 302 185 142 155 54 124 54 79 226 324 103 145 104 228 304 128 68 11
2209 11 49 178 28 200 77 144 118 135 109 105 82 17 77 186 207 54 135 266 197 45 39 146 179 89 130 236 176 132 117 68 83
1918 83 113 94 118 157 66 107 84 26 116 78 40 50 115 128 227 385 355 174 150 168 144 186 288 130 188 125 114 158 113 131 151 150 181 184
1598 184 217 189 180 300 148 84 178 114 23 117 205 77 186 128 93 247 174 94 98 45 73 134 260 130 7 108 121 66 115 86 86 112
1298 112 43 100 109 53 138 229 26 152 155 87 81 216 168 114 298 229 65 178 11 220 224 83 99 197 169 146 79 114 299 191 48
1007 48 155 60 109 119 202 121 184 184 207 93 33 174 39 184 284 124 52 80 22 102 83 108 181 294 328 260 225 161 143 149 61 236
706 236 246 187 109 63 233 47 152 115 274 326 349 520 605 980 915 656 483 263 76 213 232 77 85 130 39 203 291 236 144
434 144 99 113 4 70 82 165 30 152 140 54 252 243 309 295 7 91 132 213 62 129 220 46 32 195 173 115 163 81 125 112 187 115
133 115 82 115 79 104 35 213 285 185 118 170 379 328 142 160 140 108 223 134 128 239 240 190 98 98 235 135 124 180 141 83 108 151 36
-176 36 198 113 55 36 35 120 173 66 108 55 146 188 219 159 146 163 151 134 232 98 34 36 66
-392F6
##PAGE=	F1=-18268.2
##FIRST=	19140.455529915001534,	4405.895418600002813,	0
##DATA TABLE=	(F2++(Y..Y)), PROFILE
4406 110 48 78 117 124 107 43 171 44 100 154 111 178 122 109 104 130 81 30 125 113 102 233 184 200 245 180 316 196 119 31 251 188 104
4096 104 46 40 119 147 112 103 102 230 45 97 212 159 163 109 168 83 127 177 58 71 136 167 108 100 145 256 170 101 181 138 55 140 180 117 103
3767 103 86 98 38 60 230 115 156 41 286 184 192 124 150 146 126 73 78 198 150 121 78 44 147 63 156 144 194 46 75 45 32 111
3467 111 180 153 164 106 63 180 198 126 211 142 55 111 99 194 69 64 14 141 110 88 134 167 133 50 121 8 86 109 90 173 132 225 53
3157 53 132 107 286 115 75 77 147 178 66 85 109 55 60 84 192 158 77 147 65 109 228 269 356 392 379 172 87 226 228 51 112 114 155
2847 155 172 75 93 94 178 38 34 76 271 189 150 105 57 131 168 67 79 29 105 233 78 157 56 165 12 185 225 191 183 179 221 63
2547 63 166 219 131 109 54 160 205 179 194 199 215 83 206 173 173 257 74 180 295 167 126 153 79 87 31 76 191 332 128 142 98
2256 98 182 270 109 74 20 55 187 54 202 79 138 147 116 90 82 66 39 73 158 200 53 156 287 160 67 131 162 135 94 127 230
1964 230 164 124 120 39 61 104 106 155 186 100 119 78 50 117 53 32 73 90 95 201 348 299 131 189 175 142 173 283 140 227 155 180 177 87
1645 87 81 128 146 212 200 192 163 155 295 150 29 126 122 46 125 174 72 178 104 157 271 212 121 158 60 101 155 256 132 41 94 108 52
1335 52 83 82 65 130 31 92 100 70 95 189 19 124 148 97 70 209 209 38 242 211 49 167 53 249 240 58 98 207 164 118 116 102
1035 102 297 181 57 157 69 122 91 187 102 146 186 172 85 73 180 40 176 314 164 75 86 32 101 65 108 198 284 322 339 235
753 235 178 141 216 121 229 234 171 95 43 268 94 145 73 250 300 321 579 644 1026 867 555 451 256 121 165 207 21 82 173 30
471 30 158 221 169 148 95 169 50 51 69 161 67 110 116 17 257 213 317 290 40 66 163 245 96 127 206 53 31 157 160 126 173 79 118
162 118 92 212 153 78 93 75 117 47 225 264 147 48 238 366 260 84 182 128 99 223 149 107 250 278 178 56 83 243 177
-111 177 98 139 118 71 121 131 65 160 111 66 66 34 124 177 92 90 58 116 127 163 151 146 225 185 112 225 78 16 37 95
-392I5
##PAGE=	F1=-18346.9
##FIRST=	19140.455529915001534,	4405.895418600002813,	0
##DATA TABLE=	(F2++(Y..Y)), PROFILE
4406 134 54 79 130 145 114 32 149 54 104 138 88 166 125 119 116 154 74 59 154 114 94 198 213 196 224 169 294 187 123 15 236 200 101
4096 101 48 47 97 142 84 74 115 235 27 118 234 168 152 124 171 81 148 201 50 105 142 194 161 97 122 237 183 132 192 162 34 131
3796 131 191 148 116 106 88 54 85 248 159 164 56 247 185 200 136 153 154 114 95 58 228 190 117 109 72 121 60 186 139 209 42 76 39
3486 39 23 109 169 173 189 107 56 168 201 138 208 147 70 129 126 207 69 80 21 178 137 77 132 138 117 24 135 9 63 93 122 212 130 211
3166 211 56 94 64 264 124 54 79 177 171 68 77 76 21 98 119 188 148 78 132 25 150 229 257 353 379 318 145 71 227 240 36 74
2866 74 136 137 179 111 121 121 205 32 51 79 268 195 164 135 18 127 167 42 77 22 107 257 58 147 36 156 4 182 207 160 144
2575 144 167 175 93 159 192 101 84 52 155 249 158 153 128 178 87 196 191 187 271 64 204 271 139 100 138 98 73 53 71 163 323 155 159 87
2256 87 141 217 78 81 37 67 186 82 195 88 127 161 103 78 55 48 56 64 125 178 45 165 285 118 87 205 166 103 86 120 212 150
1955 150 105 122 14 33 90 119 188 214 122 115 61 77 118 46 43 91 71 72 164 313 243 99 213 176 142 158 254 132 233 172 248 203 66
1645 66 75 89 136 235 204 144 140 129 281 160 19 71 152 125 132 123 60 168 98 216 278 234 142 200 63 119 160 234 146 68 68 108 71 73 86
1317 86 66 142 55 82 96 78 61 143 16 95 121 89 57 191 231 44 160 180 47 129 90 273 267 23 105 211 147 88 152 99 282
1025 282 179 66 150 83 140 60 167 116 109 176 129 67 118 173 24 148 312 181 82 104 42 105 33 104 203 272 284 391 267 190 127
734 127 275 182 206 218 148 63 51 267 134 139 71 224 264 270 604 692 1079 912 473 431 232 185 116 195 90 112 205 34 108 138 81
443 81 134 107 214 102 35 72 141 75 74 92 68 262 173 310 269 60 55 189 259 127 136 190 57 41 132 134 125 176 63 110 71 214 168
133 168 72 78 69 127 44 213 235 116 74 279 318 182 26 187 126 96 203 143 87 247 292 150 11 60 247 228 74 101 94 68 121
-158 121 107 84 119 115 109 95 58 120 177 127 89 66 87 68 113 158 127 265 199 115 213 64 14 36 111
-392A11
##PAGE=	F1=-18425.7
##FIRST=	19140.455529915001534,	4405.895418600002813,	0
##DATA TABLE=	(F2++(Y..Y)), PROFILE
4406 145 64 92 134 152 109 31 121 89 100 122 63 145 130 135 112 156 43 70 165 117 102 139 228 184 186 156 263 177 120 17 199 186 90 76
4087 76 85 91 121 68 46 135 240 22 131 249 177 144 128 150 67 156 222 57 131 150 207 199 86 111 218 195 165 198 174 20 118 188 153
3777 153 139 116 79 46 87 252 196 174 100 219 181 195 138 148 145 94 121 38 245 220 107 124 109 92 52 212 139 215 46 65 37 21
3476 21 93 150 190 217 109 47 142 173 133 195 157 93 130 146 207 76 88 39 206 153 56 104 100 90 12 138 16 66 83 135 220 115 183
3166 183 57 76 41 252 159 33 73 186 146 87 61 36 65 136 146 179 128 76 102 25 173 206 221 320 363 294 141 50 225 256 50
2875 50 32 145 106 172 138 137 146 211 29 52 86 251 184 168 154 18 118 150 47 87 27 104 280 73 128 41 132 20 169 181 116
2584 116 92 150 127 132 143 154 82 107 74 146 268 119 87 55 154 89 183 202 190 272 83 212 241 115 78 110 108 86 83 60 153 300 172
2274 172 191 92 133 171 70 85 47 76 178 108 182 101 113 156 93 79 23 37 62 54 94 147 43 160 263 100 104 248 155 97 78 104
1974 104 185 142 88 127 5 7 69 141 215 232 130 100 41 103 120 52 59 100 65 80 127 285 206 94 216 171 139 137 215 105 207 174 300
1664 300 229 48 106 40 122 247 196 84 139 106 265 172 40 31 184 199 138 69 69 157 108 248 263 238 149 222 52 127 154 204 163 90
1364 90 41 107 96 81 96 83 145 78 64 87 77 51 99 19 75 80 68 44 169 233 117 83 143 64 72 114 285 295 18 116 206 118 69 167
1044 167 89 253 191 64 136 93 164 61 141 131 79 156 90 39 166 165 6 120 281 176 67 122 59 115 7 91 196 258 226 406
763 406 311 192 106 312 231 178 215 144 32 60 241 170 113 90 189 218 205 576 713 1090 982 431 410 194 240 78 185 160 160 215
481 215 50 68 94 55 105 132 244 150 57 90 118 57 53 70 128 266 126 292 247 67 76 203 253 153 164 184 52 61 119 108 107 171 44
171 44 91 55 195 162 68 70 71 142 47 182 211 104 119 286 247 110 43 173 129 95 170 121 81 228 283 117 44 36 252 280 68 80
-129 80 72 72 108 92 99 81 117 164 127 76 110 171 155 87 71 61 30 81 160 95 276 187 129 193 65 21 38 111
-392A11
##PAGE=	F1=-18504.5
##FIRST=	19140.455529915001534,	4405.895418600002813,	0
##DATA TABLE=	(F2++(Y..Y)), PROFILE
4406 146 77 110 131 144 90 38 93 117 84 106 53 129 141 157 86 151 19 59 149 110 117 65 228 167 139 138 225 165 118 60 145 151 90 83 93 93
4068 93 93 62 41 161 241 22 129 254 186 139 129 125 69 154 239 74 141 158 204 220 69 121 197 210 195 200 170 13 108 179 132 149 118
3758 118 73 24 75 245 225 184 135 219 172 189 138 133 126 67 145 37 246 238 100 120 132 76 40 227 140 204 50 50 53 25 68 129 204 246
3439 246 115 41 106 117 111 184 168 113 115 154 204 83 87 58 229 159 47 55 78 52 36 136 27 66 78 129 196 90 148 69 76 20 245
3129 245 192 32 61 167 109 106 39 9 116 163 157 168 103 73 65 55 171 160 168 259 342 320 159 28 217 276 87 20 141 74 154 147 136
2819 136 158 191 21 40 80 224 157 157 160 43 107 123 69 92 45 92 281 85 107 91 107 42 150 160 80 37 132 100 172 123 113 97 161
2509 161 100 149 274 88 21 78 156 85 173 204 187 261 117 207 219 109 76 75 109 99 98 46 153 264 175 230 130 162 164 109 81 56 78
2199 78 173 131 167 114 95 134 79 89 17 37 56 50 79 119 61 146 226 120 120 259 138 107 93 80 158 146 91 134 14 24 49 168 236 237
1880 237 126 81 35 123 123 62 70 100 77 110 109 266 200 115 197 163 127 108 192 69 155 163 327 247 33 131 29 103 248 177 47 159
1579 159 90 255 182 46 31 203 253 140 39 103 146 115 246 225 228 141 228 28 124 147 175 171 104 36 97 112 87 104 105 148 92 36 64
1270 64 66 60 64 27 71 35 45 37 147 217 174 107 115 86 19 117 281 318 48 128 198 97 76 154 60 210 210 55 120 100 189 92 115 133 55
941 55 127 64 9 213 162 44 121 237 156 43 129 83 129 47 73 178 239 162 383 348 185 84 316 260 149 223 173 61 59 207
659 207 203 66 93 147 160 148 495 685 1046 1026 441 382 155 279 67 168 203 196 202 63 64 129 139 78 157 254 185 91 114 98 31 59
359 59 47 175 267 75 260 228 77 106 202 229 169 205 198 41 85 108 103 70 157 59 56 45 176 144 68 55 82 165 79 136 197 106 131 263
40 263 173 60 85 142 128 93 129 99 104 193 249 95 79 22 257 324 79 80 56 77 92 95 118 53 111 211 163 86 101 156 167 72 77 36 33 67
-299 67 140 63 254 149 130 167 80 23 45 96
-392I6
##PAGE=	F1=-18583.2
##FIRST=	19140.455529915001534,	4405.895418600002813,	0
##DATA TABLE=	(F2++(Y..Y)), PROFILE
4406 136 91 125 126 123 63 52 68 129 60 93 71 132 161 179 42 156 66 43 109 95 132 15 216 149 88 109 189 158 130 100 85 104 105 66
4087 66 74 104 70 62 59 189 237 21 119 250 194 140 138 128 107 147 252 90 136 160 187 226 57 140 175 230 217 200 153 11 110 178 94 141
3767 141 119 75 54 77 231 244 192 152 232 155 191 148 117 111 37 161 55 234 245 101 97 136 81 23 226 139 175 53 38 78 35 38 109
3458 109 213 268 125 48 86 65 78 182 173 123 89 151 207 91 80 69 246 155 68 29 101 20 68 127 49 45 67 109 147 60 119 93 87 17
3138 17 231 200 47 49 121 70 114 19 30 151 173 155 157 81 69 37 75 146 102 108 182 315 361 188 34 195 285 123 50 127 62 125 138
2828 138 117 150 148 1 25 61 191 120 130 158 60 92 97 85 87 68 70 260 83 94 156 118 77 129 148 74 12 120 109 211 107 78 129
2519 129 213 116 179 280 104 76 154 175 70 166 197 179 243 150 193 209 119 83 44 106 95 94 44 150 218 166 263 188 203 192 159 73 70 75
2199 75 177 148 154 127 77 99 53 103 59 51 51 58 94 106 86 127 177 150 128 246 127 111 125 54 142 163 115 140 17 39 46 190 248 227 112
1871 112 62 46 133 127 76 72 92 101 139 119 256 216 139 157 151 108 76 205 55 91 146 324 252 20 135 73 79 235 150 84 181 79 251
1561 251 191 45 39 201 276 135 46 144 134 110 212 170 207 124 222 4 115 145 152 165 109 54 84 115 79 100 124 159 98 8 34 48 69
1251 69 43 37 83 31 45 43 130 191 205 183 109 97 61 99 264 331 68 134 191 106 99 119 11 153 222 66 111 101 205 117 98 124 38 93
932 93 57 44 253 161 84 154 206 131 46 125 108 143 80 55 152 212 110 332 369 180 74 286 269 124 223 217 107 60 175 223 39
640 39 83 111 102 123 381 623 973 1038 493 351 142 298 92 147 216 203 170 68 84 172 209 85 170 241 202 117 135 87 42 83 34
349 34 200 261 37 205 205 97 129 186 197 171 247 225 33 108 89 120 26 133 100 27 42 178 131 70 27 94 194 132 77 188 111 105
49 105 229 124 44 107 99 122 85 90 90 137 145 194 93 97 27 253 349 96 85 47 80 87 111 144 43 96 239 194 96 98 129 161 47 88 11
-280 11 35 53 100 63 205 94 112 150 99 24 55 72
-392G2
##PAGE=	F1=-18662
##FIRST=	19140.455529915001534,	4405.895418600002813,	0
##DATA TABLE=	(F2++(Y..Y)), PROFILE
4406 118 100 132 124 94 47 71 48 124 48 81 104 156 186 192 12 174 114 60 61 81 137 81 198 133 42 69 165 165 148 127 56 56 121 36 54 128
4068 128 58 64 73 211 224 30 117 241 196 145 156 159 153 144 261 108 118 151 162 224 60 151 157 254 229 194 130 35 126 190 58 122 122 83 109
3739 109 108 212 252 195 150 230 129 198 169 108 118 8 161 67 212 243 105 66 120 93 12 207 131 133 57 27 103 49 14 95 214 272
3439 272 134 67 107 91 45 189 171 122 62 137 216 108 78 68 252 142 99 81 142 47 103 111 75 18 43 78 84 40 110 125 101 71 197
3129 197 173 63 44 59 52 108 27 41 164 163 143 147 68 64 33 83 105 46 57 102 284 386 214 65 156 275 151 76 102 79 92 121 89
2819 89 126 99 31 33 54 160 75 90 155 81 71 81 95 85 93 45 229 77 94 225 173 124 108 140 84 48 118 139 243 96 52 157 247
2509 247 120 225 290 145 142 219 192 41 161 177 167 220 174 175 204 135 81 33 106 72 72 63 137 166 150 280 246 244 221 200 63 87 70 186
2190 186 156 146 138 74 55 21 116 107 82 69 75 130 113 103 107 122 166 127 218 129 103 156 51 137 180 143 139 17 40 56 197 250 202 95 48
1861 48 54 132 130 88 65 78 128 157 138 247 231 152 108 142 86 56 237 85 28 129 299 243 19 121 108 56 212 117 131 195 70 251
1561 251 204 60 30 182 269 122 64 187 116 99 156 104 176 105 208 40 105 157 138 144 100 69 79 104 55 76 135 177 107 31 47 28
1260 28 73 38 46 103 67 63 53 118 162 205 239 113 93 100 69 244 330 75 127 191 135 119 78 53 95 220 98 126 97 204 123 88 119 45
941 45 61 58 92 281 151 120 191 206 111 76 115 128 156 99 37 119 179 90 268 375 189 95 230 264 101 200 248 142 74 147 217 84
640 84 84 105 95 138 270 569 917 1037 558 331 165 297 140 141 209 183 126 71 100 184 245 115 169 210 197 128 141 84 67 103 54 200
340 200 243 47 124 165 122 147 163 172 160 280 258 42 121 61 141 29 100 138 68 44 202 125 70 14 99 218 189 9 179 114 66 216
40 216 113 43 107 60 120 69 56 94 162 92 128 101 94 36 232 344 109 90 43 81 95 124 171 56 73 241 210 108 97 92 143 19 106
-270 106 13 20 37 70 93 143 39 79 157 118 34 66 46
-392D6
##PAGE=	F1=-18740.7
##FIRST=	19140.455529915001534,	4405.895418600002813,	0
##DATA TABLE=	(F2++(Y..Y)), PROFILE
4406 96 103 130 126 64 57 88 32 105 64 71 137 187 207 188 59 185 147 92 51 80 127 131 179 120 12 23 162 177 158 131 76 28 129 29 80
4077 80 164 54 65 72 216 202 53 137 235 190 154 175 183 191 151 272 132 106 132 140 221 76 147 148 274 226 174 108 72 151 202 45 103 121
3758 121 90 157 142 188 248 192 129 204 101 205 189 107 137 23 142 64 185 230 104 56 89 102 37 172 117 91 64 22 127 66 20
3467 20 86 202 252 136 87 144 150 33 198 160 112 42 116 223 139 91 52 243 122 126 134 175 79 138 88 97 59 12 45 29 34 122 152 111
3148 111 127 145 117 84 48 39 78 93 50 40 155 136 127 139 69 55 45 84 62 31 38 33 261 381 228 96 109 247 167 94 66 103 64 117
2828 117 73 101 88 71 55 80 136 28 43 151 106 44 74 111 112 116 27 204 79 108 290 235 174 91 128 86 76 128 172 263 88 37 175
2519 175 259 115 266 292 178 190 266 197 4 158 145 153 197 188 157 197 155 61 37 115 39 44 90 118 118 132 276 289 280 235 226 61 100 68
2199 68 192 152 146 149 105 29 42 129 154 123 106 97 164 126 106 88 65 163 114 184 135 87 176 80 136 188 165 130 13 28 59 184 240 170 91
1871 91 41 54 121 128 92 53 64 151 160 147 227 225 144 78 139 70 57 261 121 19 117 260 224 33 98 126 46 183 80 160 195 58 247
1561 247 223 93 9 154 243 104 99 228 92 90 90 39 140 89 187 72 100 182 136 111 77 75 86 85 20 36 136 193 128 59 94 20 79
1251 79 49 59 124 93 68 60 109 137 176 259 108 74 114 55 225 311 72 106 190 159 129 65 114 77 203 131 159 89 185 118 71 128 74 39
932 39 59 137 289 119 152 211 220 111 110 105 138 164 100 13 81 150 99 210 375 212 137 168 252 78 154 253 161 95 124 180 126 105 125 146
612 146 168 207 564 910 1045 608 322 195 278 193 169 198 157 84 79 104 167 245 140 156 168 174 128 123 82 75 106 81 174 206 77 24 103
302 103 139 169 145 163 134 297 289 70 118 30 151 63 64 161 116 44 226 113 66 53 91 228 239 60 164 111 83 237 112 39 88
11 88 52 137 50 34 96 171 42 59 101 74 48 192 304 115 96 39 83 103 124 186 79 45 219 203 115 92 52 125 7 127 32 5
-289 5 45 99 121 86 54 45 179 131 55 79 26
-392B6
##PAGE=	F1=-18819.5
##FIRST=	19140.455529915001534,	4405.895418600002813,	0
##DATA TABLE=	(F2++(Y..Y)), PROFILE
4406 76 100 124 128 40 76 97 19 76 86 56 165 211 219 166 88 179 159 114 83 83 103 162 163 110 34 41 174 183 152 115 92 36 129 57 131 198 56
4058 56 68 64 199 170 79 169 239 177 162 188 181 210 171 286 166 129 116 131 220 95 125 149 283 205 134 88 112 179 200 44 93 111 89
3749 89 186 160 161 231 185 95 161 81 207 200 106 149 44 104 47 156 206 91 85 67 108 69 123 98 74 74 51 158 84 39 80 173 208 128 107
3420 107 173 194 46 201 141 95 29 90 217 177 118 27 219 98 141 177 194 98 164 66 109 110 29 30 49 26 138 166 111 169 107 87 112
3110 112 58 97 119 77 73 34 130 96 113 136 85 43 54 85 32 59 43 13 244 348 220 119 76 211 170 104 25 127 63 138 79 98
2810 98 127 112 75 112 120 19 11 142 123 18 62 143 163 131 36 192 92 122 339 280 214 86 113 71 105 148 198 267 83 29 181 252
2509 252 109 287 272 194 220 294 188 52 154 105 140 176 194 142 185 181 27 34 126 30 46 113 99 92 118 249 309 309 225 235 70 106 73
2199 73 186 135 156 164 157 70 90 143 194 167 146 120 183 131 93 74 18 139 94 154 131 69 182 114 132 185 175 113 4 11 48 154 225 145
1880 145 113 48 46 106 115 82 35 56 166 149 137 186 189 114 99 142 63 65 263 140 45 107 216 197 50 77 126 51 152 46 162 183 43
1570 43 232 246 125 26 131 218 81 146 262 67 84 37 46 99 73 159 94 102 216 141 75 49 79 103 63 32 17 125 198 158 83 137
1270 137 29 90 69 75 140 101 48 68 95 126 122 247 89 48 107 86 208 275 71 81 180 167 130 85 161 115 185 151 193 82 153 122 41
960 41 152 105 34 57 170 270 63 182 213 226 136 149 102 135 165 83 25 42 137 115 171 368 235 176 134 238 57 94 230 164 110
669 110 111 122 144 123 142 193 189 208 599 939 1070 630 310 209 246 239 219 198 169 76 94 101 134 217 149 136 128 139 126 77 80 67 88 93 130 152
331 152 98 94 32 142 200 147 169 99 298 314 107 96 14 147 84 42 162 148 36 233 84 58 80 71 217 272 122 144 103 142 270
40 270 97 48 60 70 164 59 30 88 164 16 13 89 46 60 136 233 110 105 33 87 101 105 181 99 20 185 176 113 88 25 120 10 150 45
-280 45 29 71 146 133 66 101 36 196 137 77 93 26
-392B6
##PAGE=	F1=-18898.2
##FIRST=	19140.455529915001534,	4405.895418600002813,	0
##DATA TABLE=	(F2++(Y..Y)), PROFILE
4406 63 93 121 126 29 90 93 24 42 99 34 184 224 217 128 92 155 154 117 106 77 75 176 150 107 66 91 187 174 135 94 86 42 124 81 174 219 64
4058 64 75 68 159 130 99 198 254 165 168 192 150 211 200 304 203 186 121 137 217 115 95 156 275 165 78 65 146 201 179 35 93 98 76 190
3739 190 152 133 203 170 55 127 78 205 198 94 142 55 57 42 124 170 65 116 85 114 102 71 76 87 82 103 197 101 61 71 129 145 107 124 186
3411 186 212 52 194 114 73 31 62 193 208 146 39 190 82 142 211 208 103 180 57 107 144 57 56 88 23 147 165 101 189 145 145 142
3110 142 70 143 157 69 95 34 105 51 104 139 112 37 60 91 34 79 37 30 220 292 188 129 72 178 161 106 40 150 81 164 90 114 166
2800 166 145 93 132 110 58 57 121 120 22 36 188 213 132 52 186 104 126 362 293 234 91 105 45 141 175 210 253 79 24 179 233 118
2500 118 285 227 197 235 305 169 102 143 65 127 161 196 135 169 211 26 25 131 64 79 128 90 101 105 202 302 327 192 228 82 104 84
2199 84 164 105 172 185 210 120 135 157 218 201 177 138 180 119 68 66 42 102 72 131 110 62 177 140 126 175 173 94 25 17 34 118 207 140 149 61 37
1852 37 93 94 55 18 56 168 128 109 123 128 65 136 151 67 64 239 139 48 93 174 164 67 63 113 55 124 33 138 165 29 206 262 143 51
1533 51 126 207 60 185 276 61 77 61 112 60 55 126 106 113 249 145 46 51 99 125 43 74 64 105 186 185 105 167 40 104 92 91 147 90 13
1204 13 88 76 137 55 215 72 42 95 128 188 223 83 75 154 158 124 98 185 157 175 152 216 88 124 146 10 181 125 41 55 184 222 9
894 9 205 198 216 179 196 109 121 157 53 70 34 140 123 149 348 243 198 143 222 37 52 182 154 114 106 64 137 134 139 217 187 231 624 957
575 957 1102 629 285 199 202 266 269 208 224 114 107 96 104 172 142 112 97 103 136 13 75 59 52 85 89 86 109 195 75 130 233 171 178 62 289
246 289 329 143 58 26 134 94 57 142 154 20 230 45 43 86 44 183 282 162 124 91 190 286 63 76 37 85 185 97 41 73 148
-45 148 35 61 70 34 71 70 143 94 112 23 88 88 73 151 106 17 154 143 107 99 43 126 15 176 56 43 88 174 132 83 134 45 197 136
-364 136 93 103 44
-392D4
##PAGE=	F1=-18977
##FIRST=	19140.455529915001534,	4405.895418600002813,	0
##DATA TABLE=	(F2++(Y..Y)), PROFILE
4406 60 90 127 118 36 100 75 46 30 106 6 189 223 205 86 69 129 140 103 108 56 66 176 136 110 99 133 190 150 120 96 62 29 113 90
4087 90 199 222 69 81 95 102 87 112 213 271 159 170 189 96 196 232 323 233 249 146 149 206 137 75 156 247 108 52 46 162 213 143 14
3777 14 101 100 53 173 120 107 167 145 23 127 84 202 186 68 115 56 47 74 92 124 39 131 122 124 128 33 61 104 85 158 240 117 85 59 81
3448 81 76 78 135 185 210 44 176 76 57 51 59 159 222 163 84 171 83 129 235 226 99 187 66 93 154 69 92 114 56 147 146 88 187 223 218
3119 218 164 81 165 188 77 116 45 96 14 103 148 142 46 70 104 46 89 22 22 174 223 129 124 75 155 143 98 83 171 95 178 89 126 186 163
2791 163 111 135 106 85 98 88 92 36 10 231 244 119 60 177 109 116 353 270 226 95 111 23 182 201 204 224 74 18 172 212 145 261
2490 261 165 196 241 296 149 141 118 36 112 151 200 138 150 237 68 39 123 100 110 133 92 123 92 138 268 330 139 205 89 97 98 127 70 188
2171 188 213 253 159 171 170 218 218 197 152 157 90 41 68 72 56 54 116 77 68 167 154 123 165 164 77 59 29 51 87 187 149 181 73 34 85 69 25
1824 25 37 66 157 99 68 49 55 11 161 157 81 54 196 118 35 73 131 124 81 50 92 51 104 55 98 147 33 171 264 139 61 140 200 43
1504 43 197 266 87 73 122 179 38 31 93 108 128 274 145 38 87 137 147 34 108 100 79 162 197 126 182 50 117 112 103 142 65 70 122 72
1185 72 168 19 179 77 67 101 162 163 159 105 101 119 133 115 87 182 179 175 137 219 110 113 177 53 204 131 50 52 172 146 85 214 172 199 230
856 230 245 125 100 141 23 114 71 147 121 133 307 229 193 167 208 19 68 121 135 106 101 51 112 150 115 223 157 238 598 921 1117 619
556 619 246 179 146 270 302 217 287 162 109 93 86 124 123 88 77 70 155 58 70 72 7 58 86 40 112 270 153 108 256 199 180 47 278
246 278 328 170 16 30 116 100 81 106 138 24 238 54 23 75 17 135 264 172 107 78 213 268 20 107 33 91 185 137 56 57 133
-45 133 52 106 64 50 73 7 52 72 112 17 86 68 37 104 98 35 139 126 116 134 70 128 43 209 71 47 82 178 127 99 147 47 180
-355 180 128 99 102 65
-392F5
##PAGE=	F1=-19055.7
##FIRST=	19140.455529915001534,	4405.895418600002813,	0
##DATA TABLE=	(F2++(Y..Y)), PROFILE
4406 61 89 133 104 46 113 48 69 64 116 25 178 210 188 58 28 123 129 77 94 45 82 162 117 115 125 157 177 120 117 124 39 20 93 87 201 209 65
4058 65 81 128 43 57 116 215 278 153 166 181 46 171 258 331 244 293 167 156 184 158 89 144 204 50 119 67 154 215 106 16 114 123 28
3749 28 146 73 85 130 106 29 147 90 202 170 40 77 55 91 117 66 81 59 124 151 136 145 42 58 116 82 202 277 130 108 45 75
3448 75 21 48 137 183 200 26 147 28 65 78 104 130 217 161 129 173 97 107 244 248 90 191 84 76 140 63 123 124 98 141 117 82 177
3138 177 289 266 174 87 164 211 95 135 71 104 30 109 161 169 67 88 124 52 92 37 4 102 162 48 103 63 133 119 82 113 188 96 172
2828 172 79 123 189 166 133 130 106 97 129 60 46 38 57 260 246 92 58 160 105 92 312 220 193 88 120 38 219 223 180 186 64 10 162
2519 162 199 181 224 107 197 237 267 138 160 77 30 87 148 209 152 125 248 104 76 100 130 135 128 94 135 75 66 215 318 86 169 83 86
2209 86 108 91 47 198 247 276 178 195 176 191 213 205 164 131 50 27 72 83 17 41 103 58 80 157 153 126 163 150 69 97 33 82 67 160 156 199
1871 199 79 34 76 50 61 81 85 137 65 29 20 30 60 166 155 102 42 147 87 18 45 90 89 94 36 72 41 93 82 64 137 53 142 251 117
1542 117 51 167 183 34 174 236 124 88 189 240 46 8 67 105 144 284 142 44 120 181 167 35 131 117 52 135 190 146 188 60
1260 60 132 122 107 126 36 137 161 105 207 83 151 95 97 127 183 132 94 127 134 94 97 105 53 154 177 174 111 204 136 121 197 100 215 120 60
932 60 51 138 53 149 203 141 189 274 282 145 82 116 41 147 107 150 109 114 246 198 165 180 206 7 94 58 109 88 94 72 78 183 86 230 107
603 107 223 516 820 1101 618 212 178 74 253 315 212 332 203 96 93 71 81 97 64 60 43 166 118 73 97 40 23 118 82 108
321 108 310 213 95 264 214 171 67 270 308 179 54 20 98 105 91 63 111 60 266 99 31 75 17 107 219 151 95 71 212 215 22
30 22 128 37 95 162 163 70 47 125 65 147 85 60 62 59 36 50 106 27 78 48 26 58 79 53 135 136 150 179 89 118 82 245 95 56 59 165 134
-317 134 102 142 43 151 118 91 88 80
-392H0
##PAGE=	F1=-19134.5
##FIRST=	19140.455529915001534,	4405.895418600002813,	0
##DATA TABLE=	(F2++(Y..Y)), PROFILE
4406 58 84 134 89 51 131 20 87 96 133 50 152 187 179 69 24 135 128 48 76 81 100 135 93 115 138 158 146 98 125 156 54 59 61 76 181
4077 181 188 63 71 154 34 63 113 205 266 140 157 171 63 141 270 318 227 302 167 153 155 173 122 116 165 67 198 124 121 212 91 44 127
3767 127 147 19 128 33 69 98 55 41 159 92 209 155 40 51 61 132 151 65 73 99 103 163 145 151 62 63 126 82 225 299 145 129 30
3458 30 120 45 36 132 190 196 33 107 26 97 98 159 122 197 138 162 188 106 90 234 263 77 194 109 79 113 55 143 120 134 133 87 88 181 327
3129 327 278 170 85 154 224 119 152 108 116 48 117 175 187 90 109 146 51 92 72 34 18 156 48 69 42 103 99 62 119 198 86 151 84
2819 84 105 194 163 151 131 110 95 149 77 48 27 107 269 219 58 47 139 93 66 250 165 146 67 118 62 246 236 146 144 51 0 150 195
2509 195 217 184 88 192 223 220 140 156 20 43 52 150 223 177 95 239 129 117 66 155 158 112 85 131 58 5 158 296 90 128 60 72 111
2199 111 88 61 198 281 279 179 210 172 139 187 204 177 125 29 38 69 74 31 38 93 93 93 149 144 135 169 135 72 134 34 104 54 123 153 199 78 30
1852 30 62 55 120 133 106 125 33 57 74 87 119 151 139 121 40 104 59 32 26 62 81 105 36 61 34 88 101 77 138 73 133 227 90 22 195
1523 195 152 32 120 203 159 118 249 285 61 22 51 106 158 280 140 44 136 214 180 40 142 115 26 122 171 161 188 74 155 118 104
1232 104 105 13 186 193 159 246 141 134 112 120 160 190 100 40 142 153 101 54 97 2 109 159 165 79 176 157 135 195 139 216 96 72 53 97 43
903 43 187 168 109 184 297 297 163 75 88 74 164 130 153 98 96 190 165 129 182 218 32 104 12 78 61 93 77 42 217 87 245 87 194
594 194 405 679 1060 642 205 210 14 221 314 188 349 226 72 97 50 49 77 46 37 28 156 153 92 116 83 20 150 136 102 316 246
302 246 104 257 207 150 94 263 269 165 104 3 83 106 84 22 89 99 305 128 70 110 44 140 158 121 91 79 198 139 55 134 33
11 33 100 122 171 82 50 119 76 184 115 52 36 109 90 38 98 45 69 39 43 57 62 70 133 158 198 220 97 97 118 276 117 79 62 157 150 94 130
-336 130 54 119 107 73 61 81
-392H1
##PAGE=	F1=-19213.2
##FIRST=	19140.455529915001534,	4405.895418600002813,	0
##DATA TABLE=	(F2++(Y..Y)), PROFILE
4406 47 72 127 82 51 143 21 93 111 147 62 114 161 183 97 71 144 135 25 68 131 105 98 63 106 133 134 98 101 141 183 90 108 23 69 143 169
4068 169 92 63 166 68 81 105 186 238 115 145 162 109 109 262 276 181 267 138 142 131 176 154 77 159 132 261 188 71 209 100 74 134
3767 134 151 25 128 47 59 74 6 41 155 94 222 143 59 67 77 158 169 89 107 129 81 155 144 145 75 70 142 94 229 304 165 149 18
3458 18 169 78 45 128 210 202 67 60 79 133 104 201 125 172 101 178 201 99 86 205 263 56 192 135 108 102 80 148 105 156 123 72 94 205
3138 205 333 252 154 74 148 231 140 164 148 122 55 123 186 192 111 124 165 44 89 103 58 75 213 145 32 54 67 91 49 102 199 77 126
2828 126 114 84 210 164 158 144 111 86 159 120 101 12 148 258 172 30 32 115 77 69 190 143 117 54 106 79 260 240 118 104 38 8 133
2519 133 193 242 149 108 174 196 158 151 129 45 67 20 156 234 205 73 208 139 153 39 175 184 88 55 113 52 66 122 261 140 101 19
2218 19 57 102 118 86 192 311 265 168 220 154 73 148 200 189 138 65 57 53 51 50 46 101 148 102 143 133 147 179 121 85 160 46 109 37 93 144
1880 144 183 78 22 51 81 176 186 122 142 30 111 105 128 165 122 111 131 42 80 41 67 61 72 102 110 59 61 37 84 110 112 142 88 146 198 83
1542 83 31 218 122 38 48 190 188 144 291 305 64 45 37 114 168 266 143 31 133 228 182 49 144 105 9 135 153 168 181 101 188 98
1241 98 108 94 6 203 212 214 280 191 130 128 131 190 188 73 41 147 154 122 20 93 54 56 139 154 46 142 167 148 171 165 213 66 87 62 89 129
903 129 192 115 80 173 290 288 178 81 63 98 163 136 161 97 85 183 149 109 181 232 58 105 55 46 35 100 62 15 229 117 257 132 168
594 168 328 554 1011 688 223 248 101 183 313 153 338 230 41 105 24 37 85 40 10 49 124 168 118 121 118 53 172 176 100 300
312 300 252 121 243 173 120 112 252 219 130 142 33 73 103 62 9 80 131 333 131 114 153 79 200 97 136 94 103 184 79 76 127 18
11 18 104 79 161 91 67 107 87 210 134 26 10 141 118 34 93 62 60 52 54 87 59 87 135 173 245 245 96 74 142 291 130 101 109 166 162 78
-327 78 124 78 93 96 52 27 68
-392F8
##PAGE=	F1=-19292
##FIRST=	19140.455529915001534,	4405.895418600002813,	0
##DATA TABLE=	(F2++(Y..Y)), PROFILE
4406 31 55 117 96 54 142 39 83 101 149 59 77 137 194 122 107 138 143 20 71 173 97 64 34 90 116 88 38 124 162 201 128 150 29 75
4087 75 95 160 147 74 162 83 90 92 155 198 83 129 154 143 83 235 210 108 191 85 133 130 166 174 46 191 185 297 244 49 209 115 105
3777 105 132 127 22 134 74 56 53 62 39 139 98 241 132 66 103 105 169 167 116 143 137 69 134 130 130 84 87 163 120 231 294 188 170 12 203
3448 203 101 51 135 232 210 100 18 124 162 96 215 116 150 61 177 206 80 89 162 250 42 176 156 145 126 128 136 83 163 109 80 93
3148 93 239 313 195 129 54 152 231 153 170 179 120 59 126 192 188 128 128 181 33 85 123 70 146 278 229 52 96 39 96 57 80 197 85
2838 85 105 151 74 231 176 152 158 109 77 157 155 142 14 174 233 119 35 16 90 68 102 163 165 134 88 97 88 259 235 109 68 34 16 106 179
2509 179 247 122 128 140 156 92 161 89 108 97 44 162 236 224 75 159 139 177 44 187 209 58 7 98 69 111 136 213 182 101 37 43 82
2199 82 149 101 183 330 242 160 231 126 61 114 198 195 145 107 77 25 23 49 51 127 193 106 139 127 156 188 112 100 175 66 96 20 102 138 161
1871 161 84 26 66 108 218 234 127 183 61 163 114 147 192 91 76 127 38 81 24 111 117 111 124 107 86 73 45 78 107 136 138 94 163 172
1551 172 99 79 228 113 50 28 200 214 155 303 292 51 64 18 123 171 245 149 13 112 218 173 63 140 97 26 162 149 166 164
1270 164 145 225 79 130 106 17 186 214 261 304 227 141 155 129 213 180 58 69 143 138 131 51 97 105 26 134 155 17 108 168 158 130 175 211
950 211 37 106 78 126 187 165 60 63 147 254 264 189 95 51 109 152 124 174 105 81 226 158 119 180 232 75 110 99 26 55 105 50 28
640 28 208 145 245 182 156 331 488 958 730 240 263 181 141 312 123 306 215 19 115 12 41 120 49 37 80 86 186 144 111 146
359 146 84 187 202 103 275 236 126 230 121 92 120 235 175 76 158 64 70 99 31 30 73 154 342 115 154 179 119 249 73 201 105
68 105 134 179 113 86 113 8 101 58 140 97 95 82 98 216 129 36 53 153 120 33 93 75 54 80 62 104 66 104 150 175 280 252 87 63
-252 63 147 284 130 106 156 181 159 58 136 98 80 84 46 28 47
-392D7
##PAGE=	F1=-19370.8
##FIRST=	19140.455529915001534,	4405.895418600002813,	0
##DATA TABLE=	(F2++(Y..Y)), PROFILE
4406 28 49 113 124 73 123 48 62 72 135 40 77 126 206 143 130 120 146 25 75 197 82 62 26 72 101 38 28 149 184 211 159 176 58
4096 58 90 48 158 204 100 145 76 80 72 109 156 55 111 152 162 72 195 142 20 88 31 137 154 145 179 64 228 214 303 280 93 210
3796 210 122 134 122 80 7 128 86 61 39 113 60 123 108 262 120 66 139 141 171 147 135 166 123 63 106 105 107 95 113 180 151 248 275 211 194
$$ [...]
-392I0
##END NTUPLES=	nD NMR SPECTRUM
##END=	
##END=	
