##TITLE=	Jul23-2022.21.fid
TM-VI-153, PMB-pyr, CD3OD 13C

##JCAMP-DX=	6.0	$$ MestReNova 14.3.1-31739
##DATA TYPE=	LINK
##BLOCK_ID=	1
##BLOCKS=	2    
##ORIGIN=	Mestrelab Research S.L.
##OWNER=	hrzepa
##$MNOVA/LINK_BLOCK_TYPE=	ITEM	$$ NMR Spectrum
##$MNOVA/ITEM/POLYGON=	(XY..XY)
5321,5835
8722,5835
8722,8208
5321,8208
5321,5835
##$MNOVA/ITEM/Z=	0
##$MNOVA/ITEM/ANGLE=	0
##TITLE=	Jul23-2022.21.fid
##JCAMP-DX=	6.0	$$ MestReNova 14.3.1-31739
##BLOCK_ID=	2
##DATA TYPE=	MNOVA NMR VIEW DATA
##DATA CLASS=	MNOVA VIEW DATA
##$MNOVA/ITEM/ZOOM/X=	-20.698776542268014111,	240.66949999422217843
##$MNOVA/ITEM/ZOOM/Y=	-378.48951387405395508,	4230.5487060546875
##END=	
##TITLE=	Jul23-2022.21.fid
##JCAMP-DX=	6.0	$$ MestReNova 14.3.1-31739
##BLOCK_ID=	3
##DATA TYPE=	NMR SPECTRUM
##DATA CLASS=	XYDATA
##NUMDIM=	1
##ORIGIN=	Bruker BioSpin GmbH
##OWNER=	nmr
##.OBSERVE FREQUENCY=	100.69424847706599735
##.OBSERVE NUCLEUS=	^13C
##.SOLVENT NAME=	MeOD
##.PULSE SEQUENCE=	zgpg30
##LONGDATE=	2022/07/23 16:37:00.000
##.ACQUISITIONMODE=	SIMULTANEOUS (DQD)
##$ORIGINAL FORMAT=	Bruker XWIN-NMR
##$MNOVA/SCALES_VERSION=	9
##$PARAMETER FILE=	(acqus, ASCII, /private/var/folders/f6/rjf_tdyn2v98c5c0wvkgn4s80000gn/T/$esYu3i3R8aR9PZ+2shN7A/21/acqus, 0)
$$ ##TITLE= Parameter file, TOPSPIN		Version 3.2
$$ ##JCAMPDX= 5.0
$$ ##DATATYPE= Parameter Values
$$ ##NPOINTS= 11	$$ modification sequence number
$$ ##ORIGIN= Bruker BioSpin GmbH
$$ ##OWNER= nmr
$$ $$ 2022-07-23 16:37:56.635 +0100  nmr@CZC10666PP
$$ $$ /opt/topspin/data/agmb/nmr/Jul23-2022/21/acqus
$$ $$ process /opt/topspin3.2/prog/mod/shimcntl
$$ ##$ACQT0= -2.01680680282977
$$ ##$AMP= (0..31)
$$ 100 100 100 100 100 100 100 100 100 100 100 100 100 100 100 100 100 100
$$ 100 100 100 100 100 100 100 100 100 100 100 100 100 100
$$ ##$AMPCOIL= (0..19)
$$ 0 0 0 0 0 0 0 0 0 0 0 0 0 0 0 0 0 0 0 0
$$ ##$ANAVPT= -1
$$ ##$AQSEQ= 0
$$ ##$AQ_mod= 3
$$ ##$AUNM= <au_zgonly>
$$ ##$AUTOPOS= <11 >
$$ ##$BF1= 100.683175
$$ ##$BF2= 400.41
$$ ##$BF3= 100.683175
$$ ##$BF4= 100.683175
$$ ##$BF5= 100.683175
$$ ##$BF6= 100.683175
$$ ##$BF7= 100.683175
$$ ##$BF8= 100.683175
$$ ##$BYTORDA= 0
$$ ##$CAGPARS= (0..11)
$$ 0 0 0 0 0 0 0 0 0 0 0 0
$$ ##$CFDGTYP= 0
$$ ##$CFRGTYP= 9
$$ ##$CHEMSTR= <none>
$$ ##$CNST= (0..63)
$$ 1 1 145 1 1 1 1 1 1 1 1 1 1 1 1 1 1 1 1 1 1 1 1 1 1 1 1 1 1 1 1 1 1 1 1
$$ 1 1 1 1 1 1 1 1 1 1 1 1 1 1 1 1 1 1 1 1 1 1 1 1 1 1 1 1 1
$$ ##$CPDPRG= (0..8)
$$ <waltz16> <> <waltz16> <> <mlev> <mlev> <mlev> <mlev> <mlev>
$$ ##$D= (0..63)
$$ 0 1 0.00345 0 0 0 0 0 0 0.06 0 0.03 2e-05 3e-06 0 0 0.0002 0 0 0 0 0 0
$$ 0 0 0 0 0 0 0 0 0 0 0 0 0 0 0 0 0 0 0 0 0 0 0 0 0 0 0 0 0 0 0 0 0 0 0 0
$$ 0 0 0 0 0
$$ ##$DATE= 1658590675
$$ ##$DE= 6.5
$$ ##$DECBNUC= <off>
$$ ##$DECIM= 760
$$ ##$DECNUC= <off>
$$ ##$DECSTAT= 4
$$ ##$DIGMOD= 1
$$ ##$DIGTYP= 12
$$ ##$DQDMODE= 0
$$ ##$DR= 21
$$ ##$DS= 4
$$ ##$DSPFIRM= 0
$$ ##$DSPFVS= 20
$$ ##$DTYPA= 0
$$ ##$EXP= <c13>
$$ ##$F1LIST= <111111111111111>
$$ ##$F2LIST= <222222222222222>
$$ ##$F3LIST= <333333333333333>
$$ [...]
$$ 90 74 58 42 26 10 0 0
$$ ##$Sgu3PowerLevels= (0..7)
$$ 0 0 0 0 0 0 0 0
$$ ##$Sgu4PowerLevels= (0..7)
$$ 0 0 0 0 0 0 0 0
$$ ##$Sgu5PowerLevels= (0..7)
$$ 0 0 0 0 0 0 0 0
$$ ##$Sgu6PowerLevels= (0..7)
$$ 0 0 0 0 0 0 0 0
$$ ##$Sgu7PowerLevels= (0..7)
$$ 0 0 0 0 0 0 0 0
$$ ##$Sgu8PowerLevels= (0..7)
$$ 0 0 0 0 0 0 0 0
$$ ##$SguType= 3
$$ ##$ShimPowMaxUA= (0..63)
$$ 130000 130000 130000 130000 130000 130000 130000 130000 130000 130000 130000
$$ 130000 130000 130000 130000 130000 130000 130000 130000 130000 0 0 0 0
$$ 0 0 0 0 0 0 0 0 0 0 0 0 0 0 0 0 0 0 0 0 0 0 0 0 0 0 0 0 0 0 0 0 0 0 0 0
$$ 0 0 0 0
$$ ##$ShimPowMaxUC= (0..63)
$$ 130000 130000 130000 130000 130000 130000 130000 130000 130000 130000 130000
$$ 130000 130000 130000 130000 130000 130000 130000 130000 130000 0 0 0 0
$$ 0 0 0 0 0 0 0 0 0 0 0 0 0 0 0 0 0 0 0 0 0 0 0 0 0 0 0 0 0 0 0 0 0 0 0 0
$$ 0 0 0 0
$$ ##$ShimPowMaxUG= (0..63)
$$ 524287 524287 524287 524287 524287 524287 524287 524287 524287 524287 524287
$$ 524287 524287 524287 524287 524287 524287 524287 524287 524287 0 0 0 0
$$ 0 0 0 0 0 0 0 0 0 0 0 0 0 0 0 0 0 0 0 0 0 0 0 0 0 0 0 0 0 0 0 0 0 0 0 0
$$ 0 0 0 0
$$ ##$ShimPowRcbType= 3
$$ ##$ShimPowRes= (0..63)
$$ 1e-20 1e-20 1e-20 1e-20 1e-20 1e-20 1e-20 1e-20 1e-20 1e-20 1e-20 1e-20
$$ 1e-20 1e-20 1e-20 1e-20 1e-20 1e-20 1e-20 1e-20 0 0 0 0 0 0 0 0 0 0 0 0
$$ 0 0 0 0 0 0 0 0 0 0 0 0 0 0 0 0 0 0 0 0 0 0 0 0 0 0 0 0 0 0 0 0
$$ ##$ShimPowRng0= (0..63)
$$ 1 1 1 1 1 1 1 1 1 1 1 1 1 1 1 1 1 1 1 1 0 0 0 0 0 0 0 0 0 0 0 0 0 0 0 0
$$ 0 0 0 0 0 0 0 0 0 0 0 0 0 0 0 0 0 0 0 0 0 0 0 0 0 0 0 0
$$ ##$ShimPowRng1= (0..63)
$$ 1 1 1 1 1 1 1 1 1 1 1 1 1 1 1 1 1 1 1 1 0 0 0 0 0 0 0 0 0 0 0 0 0 0 0 0
$$ 0 0 0 0 0 0 0 0 0 0 0 0 0 0 0 0 0 0 0 0 0 0 0 0 0 0 0 0
$$ ##$ShimPowRng2= (0..63)
$$ 1 1 1 1 1 1 1 1 1 1 1 1 1 1 1 1 1 1 1 1 0 0 0 0 0 0 0 0 0 0 0 0 0 0 0 0
$$ 0 0 0 0 0 0 0 0 0 0 0 0 0 0 0 0 0 0 0 0 0 0 0 0 0 0 0 0
$$ ##$ShimPowRng3= (0..63)
$$ 1 1 1 1 1 1 1 1 1 1 1 1 1 1 1 1 1 1 1 1 0 0 0 0 0 0 0 0 0 0 0 0 0 0 0 0
$$ 0 0 0 0 0 0 0 0 0 0 0 0 0 0 0 0 0 0 0 0 0 0 0 0 0 0 0 0
$$ ##$ShimSysFunc= (0..63)
$$ 1 2 3 4 5 7 9 11 15 16 8 10 12 14 6 17 13 18 19 20 0 0 0 0 0 0 0 0 0 0
$$ 0 0 0 0 0 0 0 0 0 0 0 0 0 0 0 0 0 0 0 0 0 0 0 0 0 0 0 0 0 0 0 0 0 0
$$ ##$ShimSysMatrix= 0
$$ ##$ShimSysType= 1
$$ ##$TFXNUM= 0
$$ ##$TRIPLO2= 0
$$ ##$VTU= 2
$$ ##$VTUETH= <149.236.99.20>
$$ ##$VTUTY= <no>
$$ ##$WBREFAM= (0..15)
$$ 135 116 100 100 100 100 100 100 100 100 100 100 100 100 100 100
$$ ##$WBREFLM= (0..15)
$$ 0 0 0 0 0 0 0 0 0 0 0 0 0 0 0 0
$$ ##$WBREFPH= (0..15)
$$ 71.66 -68.25 0 0 0 0 0 0 0 0 0 0 0 0 0 0
$$ ##$WBSGU= (0..15)
$$ 0 0 0 0 0 0 0 0 0 0 0 0 0 0 0 0
$$ ##$XFAC= 2
$$ ##END=
$$ 
##$DECIM=	760
##$DSPFVS=	20
##XUNITS=	HZ
##YUNITS=	ARBITRARY UNITS
##FIRSTX=	24231.369385662510467
##LASTX=	-2084.0185409410978536
##DELTAX=	-0.40154708059210514337
##XFACTOR=	1
##YFACTOR=	0.070283774830926362687
##FIRSTY=	24.612531661987304688
##MINY=	6.1058230400085449219
##MAXY=	3845.953369140625
##NPOINTS=	65536
##XYDATA=	(X++(Y..Y))
$$ [...]
9917C72k7qQJ5J2Nk%KJmrj7k2l0l7l7k2%J6J5Nkl%PJ8K9L2K5J4OOOPkj6l3m1l4j8kOPLlj0
9899B38j2j2mQJ8K4K7K2Oj6k9j9LJ5RnqjJ0J7K3K5K3K1J4%j2j4lQQKkqk2l4l3j6jKKQJ6J8
9881C16Qjolkmj0j6j9j3nLOJ1K1K9K6J1jmJNMNQRJ1J5J9K0J9J6J5J0Jpj6j9j6pk%%LMqk1k4
9862C92qRJ4Lrj8k0j4o%KNQNnj4j0LJ9L4M5M4K2mk1k3k2k3k3j8q%NRJ4J6J5Oknjjj4l3l9k7
9843C02j0%%KORQRJ3J8K0J5Okoolorj0KK4M4N0L4Rj1k4k7k4j6pmorrpjLKomJ1L3M5L8K6K1
9824E43J7Rlj3j5j2pj%mj5k8l8l8k8j5nLOOMLQJ1J2PMLjpplNNjpqo%mj4j9j4kOJ1J3J5J0J
9804C87jMPPQJ3J2Moj1j7k0j8oJ0J9K7L5L7K9J1qk3l4l8k8j3%PRRJj0j3nNJ3J3Opj7j5j2j8
9786C53k7k6nJ7J8Lj0j1lOJ3J7K0K4K6K7K2J4%j5k9k8j1J1K8K5J1loj%j0k3l2l0k5k0j6j0
$$ plain form
9917 372 345 337 345 360 372 377 375 375 377 378 374 365 348 326 296 259 222 200 200 216 231 236 234 231 231 238 256 285 317 342 356 362 368 374 381 379 363 330 289 255 237 235 241 248 251 248 238
9899 238 226 214 210 218 236 260 287 309 315 299 270 251 254 269 278 273 265 264 274 291 314 339 362 383 397 397 385 371 368 376 384 386 384 376 354 320 287 271 270 272 274 282 298 316
9881 316 324 323 317 314 312 308 298 282 263 250 245 248 254 265 286 315 341 352 351 347 348 353 357 362 370 379 390 405 424 444 463 479 494 504 505 498 482 463 447 440 438 438 438 441 445 437 416 392
9862 392 384 393 407 410 401 383 363 349 343 343 345 350 358 363 358 344 334 337 356 390 435 479 501 497 476 453 431 408 385 367 359 359 364 373 387 403 418 424 422 417 416 415 401 368 329 302
9843 302 292 292 292 294 300 309 317 326 339 357 377 392 398 396 390 384 381 375 366 356 358 382 426 476 510 519 508 484 457 433 417 410 406 400 391 382 375 374 377 379 373 369 380 413 458 496 522 543
9824 543 560 569 566 553 538 526 519 518 518 514 499 471 433 395 367 352 347 350 356 362 366 369 377 388 400 407 411 414 413 406 399 396 401 406 405 398 390 384 384 380 366 347 333 331 337 348 361 376 386 387
9804 387 386 390 397 404 412 425 437 441 435 424 407 387 369 363 373 392 419 454 491 520 531 523 500 466 428 400 387 387 394 403 412 413 403 390 385 390 403 416 422 415 398 383 371 353
9786 353 326 300 295 312 330 333 323 312 309 315 328 345 365 389 415 442 464 478 478 463 434 406 395 406 434 459 470 467 461 460 460 450 427 395 365 340 320 304 294
9770B94opj1rJJ1J2PJLJ3K6L1K8K2J7J0Kl%PJ1J1Ojqj2pLJ4K1K2K2K2K5K6J6lk1k7k1j2j1
9753E25j5k5l3l3k4j1jjkjKLjpj4j9k1k0j7j0jQJ7K4K6K5K1J6J2QJnrnKJ0J0OJlpqqopj1j5
9734C77j4kJ2K2K3K1J7J1Jrj5j1omrj1oRK8M0M1K6QmjPPjj2j4j0rj4j7k0j7j3ojmj0j4j4j1
9717C71rj0pJPMpj9k0j1kNJ2K3L0L0K4K1J6Orj8j0NJ5J1Joj0j0pMK0K3J0j2k9l0k4j8j3j0
9700C48rlPJ9K5J9J0Jnj1j4qKNKjJPJ0J1PNJjoj1j2nNPkj7k7k9k5j7qKJ2K2K6K4J7R%rj5j3
9681C56kJ2J9J8J1PQJ0J3J3J4J1NmqollkOK2L1K9K1J1Nlqj2j7k1j7jJ5J2qk7l5l3k5j6kJ3
9663D09K2J8RKKPPjrj0lJ0J9K6K8K3Rok0l1l9m4m1l0j9oQK2L1L6M0L8K9J0qj7k1k5l2l2j8
9647C93%J1Pqj7j2JJ4K0K1K2J7PnqlPJ5K0J8Poj5j8k0k8l4k9j3knj4k0j8qNJ4J7J9K2K4K3
$$ plain form
9770 294 288 281 270 261 262 273 285 292 293 296 309 335 366 394 416 433 443 445 442 442 449 460 471 477 476 468 456 449 452 466 487 509 531 553 578 604 620 617 596 569 548 536 525
9753 525 510 485 452 419 395 384 383 382 380 379 381 384 383 376 362 343 322 302 285 275 274 282 299 323 349 374 395 411 423 431 432 427 418 413 415 425 435 441 442 439 432 424 416 410 403 392 377
9734 377 363 361 373 395 418 439 456 467 468 459 444 433 427 423 414 403 397 406 434 474 515 541 549 545 544 551 558 557 545 531 521 512 498 481 461 444 431 425 424 420 410 396 382 371
9717 371 362 352 345 346 353 357 350 331 311 300 298 303 315 338 368 398 422 443 459 465 456 438 428 433 448 459 460 454 444 434 427 431 451 474 484 472 443 413 389 371 358 348
9700 348 339 336 343 362 387 406 416 417 412 401 387 379 381 386 388 387 388 395 405 416 423 428 429 428 422 411 399 394 399 406 404 387 360 331 306 289 281 283 295 317 343 367 384 393 393 384 369 356
9681 356 354 366 385 403 414 421 429 439 452 465 479 490 495 491 483 477 474 471 469 475 497 528 557 578 589 594 591 583 571 554 533 516 515 530 542 534 507 472 439 414 398 396 409
9663 409 431 449 458 460 462 469 476 475 466 456 453 463 482 508 536 559 568 562 542 511 472 428 387 357 338 332 340 362 393 429 469 507 536 546 538 521 500 475 443 411 393
9647 393 393 404 411 403 386 374 375 389 409 430 452 469 476 471 463 460 467 482 502 520 527 521 506 488 468 440 406 377 364 362 357 343 323 305 297 302 316 333 352 374 398 421
9630D21K0K1K4K6K3K0J7Qmj0oJPJ3J8J6QMQJ8K8L8M7M3K8J8L0M9N9O0O7Q3J02J43K15L11M22
9615B396N54O87P19N13P4m06o91p15n90m49l43k57j90j48j28j12r3p8o4m9l4k7k2j7j3j8k7
9604D72l4l8l9l8l0j7mQK0L1L6L5K3Oj1k0k5k9k9j7KJ3J0NLKJMJ4J8QkNK0K3Qnj2k3m2n5n5
9587B42m2k1MK6L5L0K6L0K9J9J0J2K1J9J0Jnj2k3k8k2j1jRJ7J6PlmLJ4J8J0j0k8l0k0rrj6
9571C14j7oJ0J6PmnRJ9K2J8J8K3K5K4K0Rpk0k7k7k8k8j9kJ1Rmj0pKPMnj0j4j4qJJ2J7J2Mk
9554C49lJRJ9K3K0J5J5J7J5RONJkMJ7K1J3%rj6k4l0k8k1j1kQJ5J3RMlj1j7j3pnoppj3j8j2
9536C43jNJ%PJ8J7Qnj9k7k7j7okpj1j1nkKNPNNJ1K3L3L3K1Opj7k3k7k8k4k3k1j7oRK1K6K0
9517B93J0jnlMJ0J2ROMPJ2J9K7L0K6J2mj4j7j2lMKrk0k1j1kjoj2j5j0QK8L6K4NkMQLmmMQK
$$ plain form
9630 421 441 462 486 512 535 555 572 580 576 566 560 561 568 581 599 615 623 627 635 653 681 719 766 809 837 855 885 934 993 1053 1120 1203 1305 1448 1663 1974 2396
9615 2396 2950 3637 4356 4869 4943 4537 3846 3131 2541 2092 1749 1492 1302 1154 1026 914 821 743 679 630 596 569 547 530 517 499 472
9604 472 438 400 361 323 293 276 272 280 300 331 367 402 425 431 420 400 375 346 317 300 302 315 325 330 333 335 336 340 354 372 380 378 383 403 426 434 429 417 394 352 297 242
9587 242 200 179 183 209 244 274 300 330 359 378 388 400 421 440 450 451 446 434 411 383 361 350 349 358 375 391 398 395 391 394 408 426 436 426 398 368 348 339 330 314
9571 314 297 291 301 317 324 320 315 324 343 365 383 401 424 449 473 493 502 495 475 448 421 393 365 346 344 355 364 360 350 343 345 352 356 351 341 327 313 305 306 318 335 347 351 349
9554 349 346 347 356 375 398 418 433 448 465 480 489 495 500 501 499 503 520 541 554 554 545 529 505 475 447 426 415 413 421 436 449 458 462 459 448 431 418 411 406 400 393 386 373 355 343
9536 343 342 347 348 348 355 373 390 398 393 374 347 320 303 297 295 288 277 266 261 259 261 266 273 278 283 294 317 350 383 404 410 403 386 363 336 308 284 261 240 223 217 226 247 273 293
9517 293 303 302 297 294 298 308 320 329 335 339 346 358 377 404 434 460 472 468 454 437 425 422 426 428 419 399 378 367 365 364 358 346 331 321 329 357 393 417 422 420 424 432 435 431 427 431 439 441
9498D41j0k2k0pRJ9J5QKJmrj4j0olopmMJ0QMlj0j7j9j7j0%OPjj2j6pNJ0NlpppoJPJ1J0J0J1
9478C40Omj3j3j2j8k7k3mK0L0K4J1OJ3K4K6J7OKJJlrj7k4k0oJ0J6J3QJ0J6J8J2NlnnKJ0J8
9461D59J9J2nk3k8j9pjJPJ0Nok0k8k8j7LJ3Qj1j9j1PK2K5K0J0ko%J2J8J2jqpmrk3l2k3mQJ1
9443C40PJnmMJ6K4K2K1K4K4J3KjLMLKJrj8k0rLOjmnloqqkNPOONM%jKRJ3Q%oopqj0oKOKqj1
9420D29n%Jlmrk0l2l6k9k0qNK1K9K0OnpnKJ5L2M6M7L3J1j1k5k5j4ork1k6j9r%JMPRMkj3k6
9401C33l6k8pQMj0j2%J2J3Lqj3qRK8L6L3K4J9J6J3J0J5K0J6%j9k8k7k0j2pmlKMMJkkoj5k0
9384C36j7nLJ2K5M3N4M4K3Nmrj8k1j9j4j9l0l8l5k1qj%j%MNLKQK4M5N7N1K6lk2k7k3j8pMO
9366D20%rj2j3j1oMRkj6j8qLOOJ3J9K0J7K0K4K8K4J0j3l6m6l7k3j7j9j8nQJ5J2MmmMJ3J7J4
$$ plain form
9498 441 431 409 389 382 391 410 425 433 435 436 432 423 409 399 393 390 384 377 373 377 387 395 399 396 386 369 350 333 323 323 329 336 335 323 307 300 305 315 320 317 310 303 296 290 291 298 309 319 329 340
9478 340 346 342 329 316 304 286 259 236 232 252 282 306 317 323 336 360 386 403 409 411 412 413 410 401 384 360 340 334 344 360 373 381 391 407 425 437 442 439 434 429 431 441 459
9461 459 478 490 485 462 434 415 408 407 408 415 425 430 424 404 376 348 331 334 347 355 344 325 314 321 343 368 388 398 396 390 390 402 420 432 431 423 416 412 403 380 348 325 321 329 340
9443 340 347 348 343 339 343 359 383 405 426 450 474 487 489 488 491 495 498 500 501 492 474 454 445 448 454 453 449 444 441 435 427 419 417 422 429 435 441 446 450 450 449 451 460 473 481 481 475 469 462 454 444 438 440 446 448 440 429
9420 429 424 424 425 422 418 409 389 357 321 292 272 264 269 290 319 339 345 340 333 328 330 345 377 423 470 503 514 503 478 453 439 433 424 403 377 358 349 349 350 354 361 370 374 372 359 333
9401 333 297 269 262 270 274 264 252 252 264 277 280 272 259 251 260 288 324 357 381 400 416 429 439 454 474 490 490 471 443 416 396 384 377 373 370 372 376 380 381 379 377 371 356 336
9384 336 319 314 317 329 354 397 451 495 518 523 519 510 492 471 452 438 419 389 351 316 295 287 286 286 285 285 289 294 297 299 307 331 376 433 484 510 507 485 458 435 417 410 414 420
9366 420 420 411 399 386 375 369 373 382 380 364 346 338 341 347 353 366 385 405 422 442 466 494 518 528 515 479 433 396 373 356 337 319 314 322 337 349 353 349 345 349 362 379 393
9349C93QMNQN%nllj3k7l3k2mOJ1J7K7L0K4J6J0Kqj6j7j0jML%JQJ2Olrj2j7k1j3LJ4J2MNJ3
9330D14K0J7J0Knoommj0j8k0j4nkrj7k2j3kPRKpj0oMJ2J3J0ONRJ6J7Rmj2j2j1j7k9l6l4j9
9312B28JK0L2L4L3K6J4mj6j7rKJ0J7J7J3N%lpj0pj%KOJ8K4J7MnlKNJlnLJ4K7L0K2Ork0k6l1
9293D57l4k9j6JJ3J7J6J2Okj4k5l4l5l1k2j0LJ4J8J7J4J2RNLLN%nkMOmj6k2j8%K2L4K7Pj2
9276C94j8j6j5j6j3lJ1K2K2J2JklklOJ9K3J3loOJ8J9J6Q%j1j6j2lJ%lpj5k2k5k4k6l2l7k8
9258B30j3JPRROLKQJ8K6K6J9J1MJ%JKJNJ1J4Rlj4j9j6j6k0k2j6rrj3qQK5L1K5J6Mqj9j6jJ4
9240C24K0J6OlrojK%mjMJ2K1L1L3K7J5OJnj3j7j6j3j1rqqqrmJRK0K8K6J2pk0j8lJ6L0L2K2
9221E21RLNRMrk6l4l2k2j3oKJ0J8J7Nj3l5m9n0l3rQJ4J1Moj5j7rPK3K8K0Mj0j5j3j1nNJ6J7
$$ plain form
9349 393 401 405 410 418 423 423 418 415 412 399 372 339 317 313 319 330 347 374 404 428 444 454 456 448 432 415 405 404 408 411 411 412 420 432 438 435 426 414 397 376 363 366 380 392 396 401 414
9330 414 434 451 461 463 458 452 446 442 438 428 410 390 376 371 369 360 343 321 308 306 313 322 324 317 307 301 305 317 330 340 346 351 360 376 393 402 398 386 374 363 346 317 281 247 228
9312 228 229 249 281 315 348 374 388 384 368 351 342 344 354 371 388 401 406 406 403 396 386 379 378 378 380 386 404 428 445 449 444 441 443 448 449 446 441 444 458 485 515 537 543 534 514 488 457
9293 457 423 394 378 379 392 409 425 437 443 441 427 402 368 333 302 280 270 273 287 305 322 336 348 357 362 365 368 373 373 368 366 370 376 372 356 334 316 316 338 372 399 406 394
9276 394 376 360 345 329 316 313 324 346 368 380 381 379 376 374 371 377 396 419 432 429 423 429 447 466 482 490 490 479 463 451 448 449 449 446 439 424 402 377 353 327 295 258 230
9258 230 217 218 225 234 243 249 252 254 262 280 306 332 351 362 366 367 367 368 370 371 376 387 401 410 407 393 374 358 342 322 300 284 275 266 253 245 253 278 309 334 350 354 346 327 311 310 324
9240 324 344 360 366 363 354 348 347 349 349 345 344 348 360 381 412 445 472 487 493 494 489 476 459 443 430 419 410 402 394 386 377 373 374 383 403 431 457 469 462 442 424 421 437 467 499 521
9221 521 530 533 538 547 551 542 516 482 450 428 415 409 411 421 439 456 461 448 413 364 314 281 272 280 294 305 309 303 288 271 262 269 292 320 340 344 334 319 306 295 290 295 311 328
9203C28Omj0rj4k1k7k7k3j6q%RJ6K2K1J2jmLPJj0j4oJ0K1K4J8J1QJ3K0K2J6Omj3j6j2KJ7K5
9186C99K2J0jj1j6j8j9j7j1jPQKrj5j4j0o%J0K0K4J4Jrro%QJ3J0KkKJ1J4J0Kmrj3j2qlJMP
9167C78RNkprj2j9k4j8lPLpj0kJ2J9J5NooOK2K6J9QKLPPRQNnj1qPK2K7J9Lj0j8k0k1k1j7j0
9148C87kNJ1J5K2K5K4J6Kj2k3k7k7k1j1m%KJ1K7M3N1M6L2J8Rmk0l6m4m3l4k0p%jjNJ7K0J2
9132D63lj5k1k2j2JJ2J0KjLJ0J0Ojqj4j9j7j0LJ2J2OMJ0J6J5J2ROJpj4j8k0k0j6rnnrj5j9
9114C23k0j0PK0K8K8J8Kj2j4kJ4K0J4jj7k2j3MJ7J4Kpj0j4j6j7qLJ7L1L8L1J7LljLJ3J9J6
9097E15kj8k3j5pprqrj6k2k1j3JJ6K6K9K2J1MKKLLMKnj3j4j0qj1j7k0j5mJ1K3K5J6%j0oNJ8
9079D35J9J3Kmkjnj2j6j3kPRMlnjNQLormkqk2l0k2nMKoj0j6k4k4j4JQPKjoj4k0j7rJNMNOJ0
$$ plain form
9203 328 334 330 320 311 297 276 249 222 199 183 175 175 184 200 222 243 255 254 250 253 260 261 251 237 231 241 262 286 304 315 323 336 356 378 394 400 396 383 367 355 357 374 399
9186 399 421 431 430 419 403 385 366 349 338 337 344 352 354 345 330 316 306 300 300 310 330 354 368 369 360 351 345 345 353 366 376 378 376 378 389 403 413 415 411 402 389 377 369 366 367 371 378
9167 378 387 392 390 383 374 362 343 319 301 298 305 308 301 291 289 301 320 335 340 334 328 334 356 382 401 409 411 414 421 428 437 445 450 445 434 426 433 455 482 501 504 494 476 456 435 414 397 387
9148 387 385 390 401 416 438 463 487 503 505 493 470 443 416 395 384 380 380 382 393 420 463 514 560 592 610 619 615 595 559 515 472 438 418 411 411 410 409 414 431 451 463
9132 463 460 445 424 402 390 391 403 413 415 414 417 427 437 443 442 434 420 401 384 374 377 389 401 407 411 421 437 452 464 473 479 480 473 459 441 421 401 385 376 371 366 357 342 323
9114 323 303 293 300 320 348 376 394 396 384 370 368 382 402 416 415 398 376 363 367 384 398 400 393 383 369 353 336 328 331 348 379 417 448 465 468 465 464 467 480 499 515
9097 515 513 495 472 457 450 443 434 426 417 401 379 358 345 346 362 388 417 439 450 454 456 458 461 464 468 470 465 452 438 428 420 409 392 372 357 353 364 387 412 428 428 418 412 417 435
9079 435 454 467 469 465 463 462 457 445 429 416 414 421 430 434 431 426 425 430 438 441 435 426 422 420 412 390 360 338 333 337 339 333 323 307 283 259 245 246 254 261 263 262 256 242 222 205 196 197 202 206 211 217 227
9058B27J3J4J8K6L2L1K1J1QRLqj8j8j3omoojJ1J8J9J7K1K9K9J6jqm%KNO%rj0%J0Nqj8j8j3
9040D32kJ0J5Rmj1pjLPJ1J2Pkj3k0k4k1j5j0j3j7j7j0mNJ1J6J3OMLKmolRK1K9K9K3J5Okj4
9022D78k8l8l7k0KJ9K1J7J2J2J5J7J6J2QKjoj6l0l7k9j0LKqj4j1jNNkjRK1K4J5Lqj3j6j6j3
9005C63qj0j9k4k0%K0L3L2K7K1J0kj0j1pn%J1J6Pqj4lJ1J8J5P%j1k0k3j9j0nmpojQJ1J2RK
8987C86j1k1j5MJ8J7Nmnj0j2j1mLMJkmlMRROOJ1J6J4Mj5l6l7j1K4L9K5MppprplKLMLMRJ9K2
8967D34J4LNPmk7m0l4k1j5j2mOJ3J6J6Qmj3j1jNLJ%jjOJ3J5RKmj5l1l8k5jJ5J7NorkJ4K6K2
8948C56J2QJ5K5K7J8RKJ%klkkmj0j8k2k4k4j9j3j2j9k7k2jK4L6L4K9K6K6J7Jk2l4l3k5k2k1
8932B85j4JJ5J8J4J1J3J7K2K4K0RJJQJ0Lpj6j8j6j0ooj2j2jJ7K9K7J3kj3k4l2l2j7QK4K1Q
$$ plain form
9058 227 240 254 272 298 330 361 382 393 401 410 413 405 387 369 356 350 346 340 334 333 344 362 381 398 419 448 477 493 492 484 480 480 482 487 493 493 484 474 474 484 489 481 463 445 432
9040 432 430 440 455 464 460 449 442 441 444 451 462 474 481 479 466 446 422 401 386 376 363 346 329 319 315 320 331 347 360 366 370 373 375 371 365 362 371 392 421 450 473 488 494 492 478
9022 478 450 412 375 355 357 376 397 414 426 438 453 470 486 498 506 508 507 501 485 455 418 389 379 382 384 376 362 351 350 355 360 358 357 366 387 411 426 429 421 408 392 376 363
9005 363 355 345 326 302 282 282 302 335 367 394 415 425 423 413 402 395 390 390 401 417 424 416 402 399 410 428 443 450 450 439 419 396 377 367 362 358 351 345 344 352 363 375 384 386
8987 386 375 354 339 343 361 378 383 379 374 364 352 341 337 340 344 345 343 339 336 340 349 358 364 370 381 397 411 415 400 364 327 316 340 379 404 408 401 394 387 378 371 368 370 373 377 380 384 393 412 434
8967 434 448 451 456 463 459 432 392 358 337 322 310 306 312 325 341 357 365 361 348 337 336 341 344 345 345 344 343 349 362 377 386 388 384 369 338 300 275 274 289 306 311 305 296 294 308 334 356
8948 356 368 376 391 416 443 461 470 472 473 473 471 468 466 464 460 450 432 410 386 362 343 330 318 299 272 250 249 273 309 343 372 398 424 441 442 420 386 353 328 306 285
8932 285 271 272 287 305 319 330 343 360 382 406 426 435 436 437 445 455 458 451 435 417 401 391 385 379 367 355 354 371 400 427 440 438 425 401 369 337 320 328 352 373 381
8915C81mnjNPO%pqkOQN%nmKJ0J7K1K2K0J3PKLKNJ0J7J5Nj1k3k6k5k4k6k5j5jPLpj3j0npj5
8895C30k0j7j0kOJ2J7J9K4L2L9L9K8RopJQMnj0qnjNJ0Pmj5j7j3p%RJ9K5K4J7J0kj8l3m1l8
8878D15k9j6lRJ2PMNQJ0J1J2J2QKmj1j6j2lMjj0r%RJ1J0Onj7k3k0j6k2k4k0qJJ3K3K9K1Pj
8860C79JMKJPJ8K8K7J8Jj2j8k0k0k0j9j5j0kNMoj4j1jJkmMJ3J7J8K1K5K7K9L3L2K5J4Mj1k6
8842E47l6l5k6j8j2ql%jkoj0j1mPJ2PJJMLnj6j9j3lLKkj0j8k3k0j2o%QJ5J6QjLJ2J7J1Jnp
8823C46plNJ1J3J1J2K1L0L9M0K7Oj3j6qjnj9k7k2qKNK%JOJ3J4Oj3k9l2k4j3oLJ0J5J5J3J3
8806D33J1OJLRJ1Omj1j4q%J1J5J3Mpj6k1j7qlkjMJ3J4Mj4k8l4l1j9lRKj8l4k3LK2K0P%lk%
8787C00QK1K9L1K9K1J2OJ0K0K3J7Nnj4k3l1l5l1k2rKPLorqpqpjNONOJ0J2ROMKkmJRJ6J6Qo
$$ plain form
8915 381 377 372 371 376 383 389 389 382 374 372 378 386 391 391 386 382 384 394 411 432 454 474 487 494 496 499 501 506 516 533 548 553 542 519 493 468 444 418 393 378 377 384 387 380 367 357 352 345 330
8895 330 310 293 283 281 287 299 316 335 359 391 430 469 497 506 500 493 494 502 506 501 491 483 478 477 482 492 499 495 480 463 450 443 443 452 471 496 520 537 547 545 527 494 453 415
8878 415 386 370 367 376 388 395 399 404 412 422 433 445 457 465 467 463 452 436 424 421 425 424 414 405 405 414 425 435 441 436 419 396 376 360 338 314 294 286 287 300 323 352 373 380 379
8860 379 380 384 386 387 394 412 440 467 485 486 474 456 436 416 396 377 362 352 350 355 359 353 339 328 327 328 326 322 326 339 356 374 395 420 447 476 509 541 566 580 584 573 547
8842 547 511 476 450 432 420 412 409 409 408 406 400 390 379 375 382 394 401 402 403 407 410 405 389 370 357 354 357 359 357 347 329 306 286 274 268 268 276 291 307 315 314 317 329 346 357 358 353 346
8823 346 339 336 341 352 365 376 388 409 439 478 518 545 551 538 522 514 513 508 489 462 440 432 434 439 441 441 442 448 461 475 481 468 439 407 383 370 364 367 377 392 407 420 433
8806 433 444 450 451 454 463 474 480 476 465 451 443 443 454 469 482 486 479 463 442 425 417 414 412 411 415 428 442 446 432 404 370 339 320 317 326 328 310 276 253 256 278 298 305 305 302 300 300
8787 300 308 329 358 389 418 439 451 457 467 487 510 527 532 527 513 490 459 424 393 371 362 364 371 374 368 359 351 344 336 329 328 333 339 344 350 360 372 381 387 391 393 391 387 388 397 413 429 437 431
8767D31k3l5l4k4j3j3k3l0k7qJ3K8K8K2J6J3QJmkNJ1J3J1Moj9k5j8NL2N3N8M8L2K0J4NopJ
8751E55QJj5k7l0k9l2l2k3pPJ3RLmn%J3K8L6K8Qj2k0j5opj3j3oMJ2J3Qlj3k0j7j1JJ0J4Oo
8733D11q%PMpj0o%KLPJ0Qlj4j7j1lOQKoj1r%OPPMK%JOJ2J5J3PPJ0J4J2Mmrj5k3k6j9lRPmj4
8712C89j6j4nLLpk2k3j0J1K8L8M0L3K3J2OJj0k2k5j8pjLNKlj0j6j8j4mRJ5J1Lnj3k1k9k9k2
8695B71j1l%KNJ5K5L2K8J6Kon%NJnrokjoqj1rmPJ6J6QPJ4K1K0J4J2J6J7Rmj5k2k1j6j4j4j5
8676C72j3q%NJ1J3QjnnmlkJ%nj0j1rrj1q%OMjkNJ0J0LlonjJMNJ2K0K6K7K5J9J4PLLQJ2J0%
8655E22j0j6j8k0k3k5k3k1j9j7j1nLRJ6J7J6J3J2J3J0LKLMKljNJ0PMPJ4J7J2%j3k1k4k3k0
8638D08j3prj8k0pJ5K7K1Jj2j0LJ5J9J5Nmpnmj0k1k2j0OJ0LljJjj0j5j4jJ1J8J2nk4l3k9j6
$$ plain form
8767 431 408 373 339 315 302 289 266 236 209 201 214 242 270 292 308 321 329 330 326 324 329 340 353 364 368 362 343 318 300 305 337 390 448 496 528 548 562 567 561 554 555
8751 555 563 564 549 522 492 463 431 399 376 369 376 389 398 401 397 392 392 405 433 469 497 505 493 473 458 452 445 432 419 413 417 429 442 450 447 434 414 397 386 387 397 411 417 411
8733 411 403 403 410 414 407 397 391 391 393 396 403 413 421 418 404 387 376 373 379 387 389 383 372 363 363 369 376 383 387 389 389 390 396 408 423 436 443 450 460 474 486 490 486 477 462 439 413 394 391 400 407 403 389
8712 389 373 359 354 357 360 353 331 308 298 309 337 375 415 448 471 483 489 490 480 458 433 415 408 407 410 415 417 414 404 388 370 356 352 361 376 387 390 385 372 351 322 293 271
8695 271 260 257 257 259 264 279 304 336 364 380 382 376 371 371 376 377 372 363 357 355 354 348 340 329 320 316 323 339 355 363 370 384 405 425 439 451 467 484 493 489 474 452 431 415 401 387 372
8676 372 359 351 351 356 367 380 388 387 382 377 373 370 368 369 369 364 354 343 334 325 314 306 306 312 316 315 313 318 328 338 341 338 332 327 326 327 331 336 348 368 394 421 446 465 479 486 489 492 500 512 522 522
8655 522 512 496 478 458 435 410 387 366 347 330 319 314 317 326 342 359 375 388 400 413 423 426 428 431 435 437 434 433 438 448 455 459 466 480 497 509 509 496 475 451 428 408
8638 408 395 388 379 361 341 334 349 376 397 398 386 376 379 394 413 428 433 429 422 417 413 403 382 360 350 356 366 369 366 365 366 365 355 340 326 325 336 354 366 361 337 304 275 259
8620B59lNPQJ3K0K4K0RjonJPPMoj2j2mRJ6J4PNQQJj0j7j7j2lJ1K5K9J7kj8k4k1j5j1j2j5j2
8602B96qlMRJ4J4QPRJ2J1NjprnJJjJRJ2Lj4j9pRK4L0L0K0Lj3k7m4n7n7m0j6%%pj3j0%J3K2
8583B09K5K3K3K2J7QLLMNNQJ1J2J4J7J8Qqk0j8nNOLkrk0k9k4mJ7K7K6K4K4J2j0k9l3k4j4q
8566C22nmkljMJ1J8K0J8J1PPQPkj2j5qJMJJJ0K2K4J4Jpj2k2l1k9j5jLjlkjkpj0pjOPNLJ0J9
8545C61K4J7Lj3k1k3j8j1mMRJ0Nlprj3j8j8j1jKoj9k5j8qkljMRPMJ1K6L6M0L6L7M1M1L4J9
8528E28Jj5k3k1j0KJ1J2Npj5j4nOQjj1j8j4jJ1J6J4J2J1J0Q%pj1pllj0k1k4k1j5qjRJ6J2L
8510D09lJJ1J8J9J7J4RJpj3j7k7l4l1j5%jj0j1%J4K4K9K9J9LqrmMRJ4J4J2J2J4J2lj7k3k0
8493D55k3k7k7j4jKlrj0oNJ7K1J6MmmjLQRRJ0J0Qkj2k2k6k6k4k0k1k8l4l4k6j3jJ4K9M1N0
$$ plain form
8620 259 256 261 268 276 289 309 333 353 362 361 355 350 351 358 365 369 363 351 339 335 344 360 374 381 386 394 402 403 393 376 359 347 344 355 380 409 426 424 406 382 361 346 335 323 308 296
8602 296 288 285 289 298 312 326 334 341 350 362 373 378 377 370 361 356 357 358 357 358 367 379 382 368 349 342 351 375 405 435 455 458 445 418 374 317 260 220 204 204 204 197 184 174 174 187 209
8583 209 234 257 280 302 319 327 330 333 337 342 347 355 366 378 392 409 427 435 427 407 389 384 389 395 398 396 387 367 338 314 310 327 354 380 404 428 440 430 401 368 344 330 322
8566 322 317 313 311 308 307 311 322 340 360 378 389 396 403 411 418 416 404 389 381 382 386 387 388 398 420 444 458 459 452 440 418 387 358 343 342 345 344 341 339 338 336 329 319 312 311 317 324 329 332 342 361
8545 361 385 402 405 392 371 348 330 319 315 319 328 338 343 340 333 324 311 293 275 264 263 265 259 240 215 197 189 187 184 183 187 196 203 207 218 244 280 320 356 393 434 475 509 528
8528 528 529 514 491 470 460 462 473 485 490 483 468 454 449 455 463 462 451 433 419 418 429 445 459 471 482 492 500 500 493 482 475 472 469 459 438 414 393 378 370 369 378 394 406 409
8510 409 406 407 418 436 455 472 486 495 496 489 476 459 432 398 367 352 352 351 341 330 330 344 368 397 426 445 448 440 431 427 431 440 454 468 480 492 506 518 515 498 475 455
8493 455 432 405 378 364 363 365 362 353 343 337 342 359 380 396 400 396 392 391 394 402 411 420 430 440 448 446 434 412 386 360 336 316 295 267 233 199 173 160 159 173 202 243 293
8476B93N1M9M3L9L4K5J2lqpoj1j8k2k4k5k1j0%KlqrpkRK2K9L1K6J1j2l7n1m8l8k9k2j2JJ2
8459B56J9K0J5KqoJ2L4M8M8L7K1PjlnolNJ1Qlj2j6j9j7pJ0K0J4mj7j9j0kjrk2l6m1l5k2pP
8442B63J9L0L6L6K6RmnMJ1J0QPO%oqqj0j3j1pnj2k1k4j7nJ0K3L0K6J5LlkKNJqj3j5j6k0k2
8424C25j7oKNQJ3J2Lnqrj4k0j8lJ0J0nj6j3%J2J5J1ONL%mpqrj2j7k2k3j9j0JJ0J7K6L5L8L4
8406C36L1L9M8M6K9Nj1j8j9j8j6j1j1j0oJOMjnqj5k2k7k2j0KJ2J4J1J1J7J9J3Jj0j6j2jRJ1
8389C96Kpj1j3j9k3j9j2j5k7l3k5j0LJ0J8K0J5Lmrj2j3j5j4j1nQK0K2J8J0NLNJ1J9K6L6M5
8373C98M1K1KjRJ3Mqj4j5j6j5qnrj5j3jPJ1J3J4J1Kno%MPPJj0j6j5olrj7k0j5qkMRJ4J6J3
8354C69Pmj7k2k2k1k0j4kJ1J9J7J2J0O%npqpKJ5K6K6J7PJmppkKJrj4j3mK%JJ1K3K5Rrj8j5
$$ plain form
8476 293 344 393 436 475 509 534 546 543 535 528 522 511 493 471 447 422 401 391 391 393 390 382 373 366 364 373 395 424 455 481 492 480 443 392 344 306 277 255 243 244 256
8459 256 275 295 310 312 304 298 310 344 392 440 477 498 505 504 501 496 490 487 492 503 511 508 496 480 461 444 437 447 467 481 477 460 441 431 429 428 419 397 361 320 285 263 256 263
8442 263 282 312 348 384 410 419 415 410 414 425 435 443 450 456 456 450 442 434 424 411 400 393 388 376 355 331 314 309 319 342 372 398 413 416 413 411 413 418 419 411 398 383 367 347 325
8424 325 308 302 304 309 317 330 342 345 340 332 323 309 289 271 268 278 288 283 267 254 254 266 281 292 298 303 306 306 302 295 287 278 266 249 227 204 185 175 176 186 203 229 264 302 336
8406 336 367 406 454 500 529 534 523 505 486 468 452 441 430 420 414 415 421 425 424 419 411 396 374 347 325 315 317 329 343 354 365 382 401 414 415 405 389 377 376 385 396
8389 396 398 391 380 367 348 325 306 294 279 252 219 194 184 187 197 215 235 250 253 249 240 228 215 200 186 175 170 178 198 220 238 248 253 256 261 272 291 317 353 398
8373 398 439 460 462 461 470 483 487 479 465 450 434 419 411 406 397 382 369 368 375 386 399 413 424 426 421 415 415 419 426 433 434 424 408 393 387 384 375 358 338 323 315 313 317 326 340 356 369
8354 369 376 372 355 333 311 290 270 256 254 265 284 301 313 323 329 329 324 317 309 302 304 319 345 371 388 395 396 392 385 378 376 378 379 370 356 343 339 341 341 342 353 376 401 410 401 383 368
8335C68qnmqj0rmMJ1J5J1jj9l0l0j9rokPJ7J8J2OMkqj3pPK1K5K1J5J6K0K3J7Kj6l0l2k3j2
8318C33mnnlJMMPJ3J8J7J0Jnpqrj1j5k0k5j6QL5M5L4J5MKKJLNNjj1k2k3j4kJqj9k2j0J0K4
8299C37L1L0K1Pqj7j6pJ%j1k0k0j0%KJRK1K8K0Lrj3j5j8j8j0kK%JPJ4K3K7K5J7J1J2K2K3J1
8282E12mj3j5k2k8k3j2nj0j4oJ1K4K7K7K5J9%k5m0m3l8k8j0J6L4M0K9J5Jj1j6rNJ8K2J5Kr
8266D61j4pQJ4J2OPJ4J9J2jj5k8l4k8j4%Mkrj4j1lMLlj0j1oj%nj2j7k0j7pNRO%k%jlprj0j0
8246B53mRK2K9K9K6J8Mqj1mPJ3J3RNkrj7k5k9k9k7k3j4mOJ1J2QJprnlqj2j2qnlRK7L9L7K6
8228C35J5J2J6K1K0J2lj3j5j6j6j4p%kj2j9j5nkpj9k4j8nRJ2J2J3K2K8K6J6QNLmj2j2lRJ6
8211C67J3Lj2j8j4%J2J5J2J0J3K0K5K8K9K5K1J3PKlqj8k6l0k5j5rlJQJ2J0O%mmnqj2j3ql%
$$ plain form
8335 368 360 355 351 343 333 324 320 324 335 350 361 360 341 311 281 262 253 247 245 252 269 287 299 305 309 307 299 286 279 286 307 332 353 368 384 404 427 444 446 430 400 368 345 333
8318 333 329 324 319 316 317 321 325 332 345 363 380 390 391 386 379 371 362 351 336 316 291 275 283 318 363 397 412 416 418 420 421 424 429 434 433 422 400 377 363 361 362 354 335 313 303 313 337
8299 337 368 398 419 426 418 401 385 378 379 379 368 348 328 318 318 320 321 330 351 379 399 402 393 380 365 347 329 319 317 319 319 320 327 341 364 391 416 433 444 456 478 501 512
8282 512 508 495 480 458 430 407 395 390 380 366 360 371 395 422 449 474 493 493 468 428 385 347 319 309 325 359 399 428 443 444 433 417 408 413 431 453 468 470 461
8266 461 447 440 448 462 474 480 487 501 520 532 531 516 488 454 426 412 412 416 414 405 391 380 377 381 384 381 371 360 354 353 353 348 336 319 299 282 275 280 289 295 295 293 293 292 289 282 273 263 253
8246 253 249 258 280 309 338 364 382 386 378 367 363 370 383 396 405 410 408 399 382 357 328 299 272 249 235 231 237 248 260 268 269 262 253 248 245 237 225 213 205 200 197 206 233 272 309 335
8228 335 350 362 378 399 419 431 428 415 400 384 368 354 347 347 345 333 314 299 294 292 285 266 242 224 219 228 240 252 265 287 315 341 357 365 370 373 369 357 345 342 351 367
8211 367 380 383 371 353 339 339 351 366 378 388 401 421 446 474 503 528 549 562 569 571 568 560 542 516 486 461 446 437 434 435 443 455 465 471 471 467 463 458 450 438 425 417 414 414
8193D14jLJ0J7J6Rjj1k2k4k2j6j5j9k3k1j6oRK4L1K5J2NMPKqj9k3j7JK3M0M6L6K0OjLOKqj4
8176D84qKNjlLJ1Rjj2j4j5k3l2l1j2J6L9M3K8Oj4k2k5k4k5k2j6pjj%MRJ3J3J5K2K6J8%j4j7
8158D26j3j3j4j3rnn%RJ7K0K2K3K1Rnj5j8j5j1o%KMQJ3J0kk0l2l6l2k2nQJ3RRJ3J3OlqnKJ0
8140C60J8K4K2J7J5J6J9J8J7J5J1Mlrj1j1kJ0J4Opj2j0mknj1j6k0k2k0j9j8j4pjMPPLJ%L%
8122C87mlNJ0Kj6l5l7j9PK2J8Kj0j1pJJ0J9K4K2J9J7K1K1J4jk0l6m3l7k2roj4k1k1j6j1oL
8106B19J3K0K1J9J6J3QKjjkjJK%kJPRJpqkORJ2J3J1OOJ1K0J9QmnPJ9K1J5P%qj2q%N%jNRMl
8084E00qqpqpqj2j5j5j0lKJ0J6J3P%jmj3k6l0k2rMRROLJloqjOR%j3k3k5k2j9k1j7j1lKNJ3
8065B37K3K6K3J2Jrj6j7j6j6j8j4jJ8K8K7K1J4Rjrj3rm%%JjmlLJ5K2K3K0J7J3Mpj6k2k8l2
$$ plain form
8193 414 413 416 426 443 459 468 467 456 434 410 388 372 357 338 315 294 278 272 281 305 336 361 373 378 382 389 391 383 364 341 324 325 348 388 434 470 490 496 495 498 504 506 498 484
8176 484 476 478 483 482 479 482 493 502 501 489 475 460 437 405 374 362 378 417 460 488 494 480 458 433 409 384 362 346 339 338 337 337 341 350 363 376 391 413 439 457 457 443 426
8158 426 413 400 386 373 364 359 354 354 363 380 400 422 445 466 475 470 455 437 422 411 405 405 407 411 419 432 442 440 420 388 352 320 298 293 301 314 323 332 345 358 364 361 353 348 350 360
8140 360 378 402 424 441 456 472 491 509 526 541 552 556 553 544 533 522 520 530 544 550 543 531 521 517 515 510 499 483 463 441 421 402 384 370 363 362 366 373 380 383 384 384 387 387
8122 387 383 380 385 395 397 381 346 309 290 297 319 337 339 329 318 311 312 322 341 365 387 406 423 444 465 479 478 458 422 379 342 320 311 305 291 270 249 233 222 216 219
8106 219 232 252 273 292 308 321 329 331 330 329 327 326 327 329 329 327 328 335 344 345 338 330 328 334 343 355 368 379 385 391 402 422 441 449 445 440 447 466 487 502 509 509 501 489 481 481 486 486 485 490 499 503 500
8084 500 492 484 477 469 462 454 442 427 412 402 399 401 411 427 440 447 447 446 442 429 403 373 351 342 346 355 364 370 373 374 371 365 357 356 362 371 371 358 335 310 288 269 248 231 220 217 219 224 237
8065 237 260 286 309 321 322 313 297 280 264 248 230 216 215 233 261 288 309 323 332 331 322 309 300 296 296 296 297 296 292 289 292 307 329 352 372 389 402 406 399 383 361 333 301
8047C01k8j6KJ5K0J3LNK0L3L1J2rk2k3j7oPJ5J5Q%lpp%J3K3K5J6MMJ4K5K2Rpj0n%kqj2j0k
8029D61OP%qrrqpmj%k%K%oj3j6j4j3j0onpj0j0kQJ0jj8k6j8%J5K5L0K8K0Qnj5k0k0j0%RJ9
8010C55L0L8L2J2nj2rj0j5j7j1lLQJ4J9J5Lj0j4pJONORJ0Kj0j6j8j8j6rMJ7K0J6ROOMlj0j2
7992D25mNOlj5k3k2j4nKJ0K2L2L3K2R%mpj0j4k0k5k6j3J0K6K2Lj5k7l3l4k2JJ9J8JqkJ3K2
7975C55K1J5J2QKmpk%pk7m1l7j2J7L7M0L1J6kj4j6j3pnjKJpj2j3nLJ0J3J8K5K9K4J0nj6j7
7958D19j0mmj4k2k1j5j2j6j9j3%QJ0POPJ0J5J7Rkj1j2j2qprj5j8j5rmJNQJ1J6K7L9M1K8J4
7941D26ON%rj8k1k3k1j3jQJ1J2J3J3J0QOJqj7j7j1jPJ7K3K4J4QJ2J6J0j0k9l7l6k8j2J1L0
7924C79L2J9%j3j7k0k0k1k1k1j5lRJ6J8J1LjQK0K9K4J0pk2l0k9k0nRK1K7K4J9J1MkojOJ0L
$$ plain form
8047 301 273 257 259 274 294 307 310 315 335 368 399 411 402 380 357 340 334 341 356 371 379 379 376 369 362 362 375 398 423 439 443 447 461 486 508 517 510 500 495 495 493 485 473 463 461
8029 461 467 474 474 466 457 448 440 433 429 428 428 426 426 428 428 422 409 393 379 366 356 350 345 338 328 318 316 324 334 333 315 289 271 271 286 311 341 369 389 397 392 377 357 337 327 327 336 355
8010 355 385 423 455 467 462 450 441 431 416 399 388 385 388 396 410 429 444 447 437 423 416 417 423 428 434 443 453 455 445 429 411 393 377 368 372 389 409 425 434 440 446 450 447 437 425
7992 425 421 426 432 429 414 391 369 355 350 352 362 384 416 449 471 480 480 476 469 459 445 425 400 374 361 371 397 419 422 407 380 347 313 291 292 311 329 330 322 320 333 355
7975 355 376 391 403 411 413 409 402 400 400 393 366 325 288 276 293 330 370 401 417 415 401 385 372 365 360 359 361 362 355 343 330 325 328 338 351 369 394 423 447 457 452 436 419
7958 419 409 405 401 387 365 344 329 317 301 282 269 269 277 287 294 300 307 317 332 349 358 356 345 333 321 313 306 297 282 264 249 240 236 237 242 250 261 277 304 343 384 412 426
7941 426 432 437 437 428 410 389 366 345 332 331 339 350 362 375 388 398 406 412 413 405 388 371 360 359 366 383 406 430 444 452 464 480 490 480 451 414 378 350 338 349 379
7924 379 411 430 430 417 400 380 360 339 318 297 282 279 288 304 322 333 336 335 343 363 392 416 426 419 397 367 338 318 313 322 343 370 394 413 424 428 426 420 419 425 435 438
7907D38pj5k2k4k2j2kPRJ1PjqpLJ2J6J8J4Mpj7j9j6rmnj1j2%J9L5L8L5L3K7Pk1m5n2m2k4p
7890C22%%j0k3l1k2KL0M6M6L7K4J2JmKJ0J0kj2j1lLMLNJ1J2Nmrqpqj0rm%K%KJ2K3K8K5J6L
7871E19j2l0m0l8k8j6lQJ2Mpj1lLQJ1J5J2Jrj1qnmkj%%PJ6K2K0J6Poj5j7j0jKKlj1j9k4k1
7853C30j7j5k0k5k7k4j2MJ6K4K7K9L0K7K1J4OLMRJ4K2K8K9K2Orj6j1kK%kk%jnj0j5k1k5k2
7836C86j1kjqj3j1pkLM%qj0lJ2K4K6K1J5J2J0J0J2J4Pmj8k1j9j5j3pMJ1J3RJ1J1Pnj6j8j2
7819C98nNJ1J3J5J8J9J1mqJJ6K4K3J2mj9k4j5%QQOQJ0QKnj3j8j4mNNmj4j7j6j4j5j5j5qMJ3
7800C92J7J4J0Jj0j8j9oJ0J9J8J2POM%k%Jqj9k4k0j3j2j3pPK2K6J5kj6k1k2j9j2nkjjNJ2J8
7783C44K0J9J5PLRJ7J5Jj6k8k6j9j0noj2j5j8j9k2k2j2QK6L1K1PkMJ8K5K3J7J1PMNJ1J5Rn
$$ plain form
7907 438 431 416 394 370 348 336 334 341 350 361 368 367 359 352 355 367 383 401 415 419 412 395 376 360 351 347 342 331 319 319 338 373 411 446 479 506 513 492 447 395 353 329 322
7890 322 322 322 312 289 258 236 238 268 314 360 397 421 433 434 430 432 442 452 450 438 427 424 427 431 434 439 450 462 467 463 454 446 439 431 421 412 408 408 410 410 412 424 447 475 500 516 519
7871 519 507 477 437 399 371 355 352 360 372 376 369 358 355 358 366 377 392 404 405 396 385 377 372 368 366 365 365 365 372 388 410 430 446 453 447 432 415 405 404 406 408 405 394 375 351 330
7853 330 313 298 278 253 226 202 190 194 210 234 261 290 320 347 368 382 388 391 395 404 418 440 468 497 519 525 516 500 489 487 489 489 487 485 485 484 479 469 454 433 408 386
7836 386 375 373 372 364 351 340 333 331 334 338 338 330 320 317 329 353 379 400 415 427 437 447 459 473 480 476 458 437 418 403 390 383 387 398 411 420 431 442 449 444 428 410 398
7819 398 393 398 409 422 437 455 474 485 481 473 474 490 514 537 549 545 526 502 487 487 495 503 509 517 527 535 537 532 519 501 487 483 488 493 489 475 458 442 428 413 398 383 375 379 392
7800 392 409 423 433 434 424 406 387 381 391 410 428 440 447 453 457 457 455 455 456 448 429 405 385 372 360 347 340 347 369 395 410 408 392 371 349 330 318 313 311 310 309 314 326 344
7783 344 364 383 398 405 408 417 434 449 450 434 406 380 361 351 346 340 328 313 295 276 254 232 220 228 254 285 306 313 311 315 333 358 381 398 409 416 420 425 436 451 460 455
7766D55j7k3k6k7k4j6ojpj8k5k7k3j6j0NK6M3N0M3K3kk3l2k3nQJ7K8L9M1K8Nj5k6k7k0pOJ3
7750C84RL%%MJ1K2L5L5K6J1MK%j0k2k9k7j7nNRJ0J2J5J6J1Jkjjnj2k1k9l0k0lOONQPlj8k8
7731C74k3j2KJ3K0K1J7RjomOROJMQMpj1mNQN%rj9k3j7nRJ9K1J1j0k6k5j3lJKJmqrrnJJ0J9
7711C53J8J1RJ2J3P%%RJ9K3K2J3lk6m3m9l7j5PJ6J2KnnJOMmj0p%JnpjJ3K3K6K2J4Nknoj2j7
7692D02k0j8j5j7k0j8rJJ0J5J5J5J1O%%QJ7K3K6K7K6J7Jj9l6m5m6m0k6pJ3K7L0J9PMJ2K0K0
7676D36J2OMQRJ0QMmj4k1k2j4jJ0J2PNLKjnj1k0k8k1KK6L2K1MopnLJ0J2J1PKrj7j6oJ%j0j5
7657D14j6j7j9j7j3j0j2j0kJ2K6L9N0N5N3M0K1jk3l7l8k1lLnj5j2%QNkljKJkpj3j4pMROJJ
7639D30RK2L3L8L5K5J8J1Mmppj0j4j6j3qj0j7k6l4l7l5k2mRJ0JopJPJ0PQRJ0Mjmpj0j6k1j9
$$ plain form
7766 455 438 415 389 362 338 322 316 315 308 290 265 238 215 199 189 194 220 263 313 356 379 377 354 322 299 294 302 319 347 386 427 455 460 445 419 392 372 365 371 384
7750 384 393 396 396 396 400 411 433 468 503 529 540 544 546 546 536 514 485 458 441 436 441 450 460 472 487 503 514 515 513 512 511 506 494 473 444 414 394 391 397 403 408 416 423 420 402 374
7731 374 351 339 341 354 374 395 412 421 420 414 410 416 425 431 432 436 444 448 441 430 426 431 439 444 444 435 416 393 376 371 380 399 420 431 421 395 370 357 354 355 357 358 354 346 337 328 323 324 334 353
7711 353 371 382 391 403 416 423 423 423 432 451 474 496 509 506 480 437 388 351 336 343 359 371 373 368 363 364 370 374 370 360 353 353 354 349 342 341 354 377 403 425 439 444 442 437 431 419 402
7692 402 382 364 349 332 312 294 285 286 296 311 326 341 352 358 358 358 366 383 406 432 459 485 502 503 484 448 403 357 317 291 284 297 324 354 373 380 384 396 416 436
7676 436 448 454 458 466 475 485 493 497 493 479 458 436 422 421 431 443 450 455 458 460 459 454 443 423 395 374 376 402 434 455 459 453 446 441 444 454 466 477 484 486 477 460 444 438 439 439 429 414
7657 414 398 381 362 345 332 322 310 300 298 310 336 375 425 480 533 573 594 593 570 533 495 474 471 474 469 454 442 442 450 455 453 450 449 451 452 450 443 430 416 409 413 422 428 429 430
7639 430 439 461 494 532 567 592 610 621 625 621 614 607 597 583 567 554 546 536 519 493 459 422 387 365 361 370 380 381 375 368 369 376 386 393 401 410 420 424 423 419 412 402 386 365 346
7621C46j0LJ2J5J2QLKjnj0j6j6j1jJ0J5J2Nmj0j3j3j5j2%J5K4K0J2J0J1RjnjOOMKKMQJ0RJ
7603D52pj5j9k2j7oNQJkKN%j1k0j9qLJ5J8J8J2QJqj6j7j2lPJ2J4J3Q%rj3j7j3%J8L1L3K4J0
7584D64Jklmpj0j0nMRPlj3j9k4k7k5j3PK6L2K4J1jrj5j6j2kJ0K1K3J6Jq%J8K5J7jj4j8j7j7
7567D21j4rj1j8k8k7j5%J2K1L1M3M5L3J1pj5j7j4nNJ0QMQJ5J7RJjkj1k8m2n1m9l8k2mJ1J8
7550B95J9J5RJ0J5J9J9J6J5J5Qnj7j7nJ0K2K5J3rl0l7k2kJ0NkJJ5K8L3K7J6Kj3k3k3j4jPR
7534D58QONOOQNjj1j8k2j7pJKmlMJ3J7J5RMnj2j2opj7k9l8l8l3j9JJ2PmqJJ3J9J7J6J3J2J2
7515C79J6J8J4Kj5k4k3j3%PRJ1J3J4J1QPPLoj2j0l%mqokmj1j7j1%J0J5J9K1K0J5J1RPLKM%
7496D86j1k3k3j2MJ1Mj5l1l4k3qjjlNJ6K0J2qk5k8j8qlqj2j2mQJ2QKLPMoj0mLPQJ2J8J8J2
$$ plain form
7621 346 336 339 351 366 378 386 389 391 390 385 375 359 343 332 331 341 356 368 373 369 359 346 333 318 306 306 321 345 365 377 387 398 407 406 401 400 406 412 416 418 420 424 432 442 451 452
7603 452 445 430 411 389 372 366 371 379 380 378 380 385 385 374 354 335 327 330 345 363 381 393 401 402 394 378 361 349 346 353 365 379 392 400 400 391 378 361 348 348 366 397 430 454 464
7584 464 465 463 460 456 449 439 429 424 428 437 444 441 428 409 385 358 333 320 327 353 385 409 420 419 410 395 379 367 365 375 396 419 435 436 428 428 446 471 488 487 473 455 438 421
7567 421 407 398 387 369 341 314 299 299 311 332 363 406 451 484 495 488 473 456 442 437 442 452 460 464 472 487 504 513 514 513 511 500 472 430 379 330 292 270 266 277 295
7550 295 314 329 338 348 363 382 401 417 432 447 455 450 433 416 411 421 443 468 481 472 442 405 383 381 391 396 394 395 410 438 471 498 514 516 503 480 457 443 442 449 458
7534 458 466 472 477 483 489 497 502 501 490 472 450 433 426 427 429 425 422 426 439 456 471 480 484 479 467 455 449 442 425 396 358 320 287 268 269 281 288 284 276 277 290 309 326 342 355 367 379
7515 379 395 413 427 429 414 390 367 354 354 361 370 381 394 408 419 427 434 441 444 438 426 416 413 413 409 401 395 393 389 378 361 350 350 360 375 394 415 435 450 461 470 477 480 482 486 486
7496 486 475 452 429 417 421 432 436 421 390 356 333 325 324 323 320 325 341 361 373 365 340 312 294 286 283 275 263 251 247 255 267 275 277 280 287 291 285 275 271 274 281 289 301 319 337 349
7478C49J1J3J3J2J3J4J2QOJ1J2Kj2k2k6k5k5k1j5oKJ0J4J6J5Mj2k4j5RL2L6K5J0mj9l2l7k8
7462C26j3KJ0J3J6J7J7J7J2Loromj1j8j6pkpj6j7rOJ7K3K2J7R%pj1r%PRPOJ4K1K2J0nj6k0
7444D14j6oQJ7J3mk4l2k8j8rjLLoj3j2lPJ2RNlrr%RJ6K0K8M0N0N3M7L2J0j2k4k9l5m4n2m8
7427C59l2j1OJ3J4J4J4J7J9J3Nnj3j5j0jJ2K1K3J6jj7k3j5KJ3J3QQJ0J1Omj8l0l9l5k5j4r
7411C00ppn%J1K9M2M2K7Oj0j8j9j4pljKORRMlj2j8j8j5q%J1J9K3K1J7J1LnmMJ0OkmjKNJ1K1
7392D70K6K2J3Jj1k4l1k8j4KQKqoQJ8J4Knrj4j7qJ2K2J7Krj9l3m5m5k6kJ3J6QjpqkKPJ0RM
7373C36nrpnnonKRJ5J7J5J2OjoojMOMKKKPJ2J5R%nnlmqqpqmPJ8K2J7J5J7J8Rpj7j8j1%OLn
7352D41j3j6k2l1l7k8j0NOMNQNmpjJ2K9M0L7K3Ollkmpj0j2j3qjJlj0j2o%jrj5j2mKjnnppk
$$ plain form
7478 349 360 373 386 398 411 425 437 445 451 462 474 476 464 442 416 391 366 345 330 324 326 336 350 366 381 385 373 349 334 343 375 411 436 446 442 423 391 354 326
7462 326 313 315 325 338 354 371 388 405 417 420 414 405 399 395 384 366 350 343 341 334 318 301 292 298 315 338 360 377 386 386 379 368 359 359 366 375 382 388 402 423 445 455 450 434 414
7444 414 398 392 400 417 430 426 402 370 342 324 315 314 317 320 314 301 289 286 293 305 314 319 316 307 298 298 307 323 343 371 411 461 514 561 593 603 591 567 538 503 459 407 359
7427 359 327 316 322 335 349 363 377 394 413 426 431 426 413 398 388 387 399 420 443 459 458 441 418 403 405 418 431 439 447 457 468 474 470 452 422 383 348 323 309 300
7411 300 293 286 281 281 292 321 363 405 432 438 428 410 391 377 370 367 366 368 374 383 392 396 393 381 363 345 330 322 322 333 352 375 396 413 424 427 422 418 422 432 438 436 432 431 433 438 449 470
7392 470 496 518 531 532 521 497 466 438 424 426 434 436 428 422 430 448 462 464 459 450 436 419 411 423 445 462 464 455 436 403 358 313 287 285 298 314 322 321 314 306 304 306 313 323 332 336
7373 336 331 322 315 310 305 299 294 296 305 320 337 352 364 370 369 363 357 356 360 366 370 372 374 376 383 395 410 419 419 414 409 406 402 394 386 379 371 367 374 392 414 431 446 463 481 490 483 466 448 437 437 443 446 441
7352 441 428 412 390 359 322 294 284 289 295 299 304 312 317 313 306 305 317 346 386 423 446 452 449 446 444 440 433 423 411 398 390 389 390 387 377 365 359 359 358 349 334 322 318 320 319 314 309 302 295 293
7331B93J4L0L3K4J4J0J1J1J0Nrk1k1rNJ2J4J3J2Jj2k1k2j6j3j1j2qm%mrpk%nj5k0j8j5j3j0
7315B15pjQJ5J8J2NPJ8L1L4K6Qj0j6j0NJ5J7J3J1J1RNkj0j8k3k1j1%MLLMLjrj4j5j2nOJ0N
7297C36lonl%PJ9K7K6J8J1MJmpj3j6j1%J6K7L2K3Jj9k8k2j3pnJOJ0J4J8J7RLOJ4J5Mj6l4m4
7278D09l6j6LPNNJ3J7J6J1QMlj0j7k4k5j8mNQJ0J0QL%LMONOLnj5k3l2l8l3j3J1K9L5L1K2J1
7260C96KnpmOJ8K4J9J0mj8k7k5j3kNJ2J8J6%j7k4k3k0j6j0l%jjkjKQJ3J0MlmnlOJ8K2J6Pl
7242C91j3k0k5k4j7j0nnpnMJ2J1LKRJ8K1K3K1Qj9m5m9l1oJ5K4K7K2Rmj2j3rkOJ4J8J6RJ0J8
7224C90L0L3K4QnoKJ0J0N%ljlpj3j1mMKj1k7l4k7j6rj2j8k2j7lJ0J7J6J3J4J4J2OJoj0j2j3
7207C31j0qmjnj4k2j9j0nrqLJ9K9L4L9M2M0L3K4J9J6J3OjjLNmj8k5k3k0k0j6lJ1J8J7J0lj6
$$ plain form
7331 293 307 337 370 394 408 418 429 440 450 455 446 425 404 395 400 412 426 439 451 452 440 419 397 381 368 357 345 337 333 333 329 320 313 311 311 306 291 271 253 238 225 215
7315 215 208 207 215 230 248 260 265 272 290 321 355 381 389 379 363 353 358 373 390 403 414 425 434 439 437 427 409 386 365 354 354 358 361 364 368 371 370 361 347 332 320 315 321 331 336
7297 336 333 327 322 319 319 326 345 372 398 416 427 431 432 428 421 408 392 381 381 397 424 456 479 480 461 433 411 398 391 386 387 393 403 417 435 452 461 464 470 484 499 503 487 453 409
7278 409 373 357 360 367 372 377 390 407 423 434 442 446 443 433 416 392 367 349 345 350 358 368 378 386 389 389 392 396 402 407 413 416 411 396 373 341 303 270 257 268 297 332 363 385 396
7260 396 398 393 386 382 388 406 430 449 459 455 437 410 385 372 370 375 387 405 421 421 404 380 357 337 321 311 308 308 307 306 304 303 305 313 326 336 340 337 333 328 325 331 349 371 387 394 391
7242 391 378 358 333 309 292 282 277 272 265 260 264 276 287 290 292 301 319 340 363 384 392 373 328 279 248 242 257 281 308 330 339 335 323 310 301 299 305 319 337 353 362 372 390
7224 390 420 453 477 485 480 474 476 486 496 501 501 498 497 494 487 474 463 459 463 465 454 427 393 366 350 341 329 311 289 272 269 279 296 312 325 339 353 365 371 372 366 356 344 331
7207 331 321 313 309 308 303 289 267 248 238 233 224 216 219 238 267 301 340 382 422 455 479 498 514 527 533 532 531 534 539 535 517 492 469 449 429 413 410 421 439 456 466 463 447
7189D47k4k3j7j4j0mJLj%LMLOQOJ%Ljj1j9j5nKOJ5K3K3J2%pj2j4j2j1qmRK3K3J4LLQJ0RJ2
7170D68J6J2mk0k4j4NJ5J6Nnj2j2rmknj5k7k9k0qmmkPJ6J3Kj0j1kJ0J8J9J2Nkqj3j8j9j8j3
7152C05m%jqj3j2omlJRJ5Rjo%OQK%LQQOLMORJ2J6K0K1J6Nrj7j9j4qJJ0J7J7Qmj0rlKRJ5J7
7131D37J2Nj%JKMKjoj0j2j3j2j1o%QJ5K0K0K3K6K5J8Pkpj5k6l3l4l1k6j6MK1K2J0mnJONkr
7113D12j6j7j3pjMMjrj2rnml%LLLJ0K1K5K6K4K4J9Qqj6j4omj0k5l7l1j2Kjj5k0rJ0J9J9J4
7095C45J1J0RJ0J3J4J5J9K1J5Mmoqj2j5pMNlrjJ3K1K0J1jj3k2k4j5NK5L9L6K0Lrj7k4k6j9
7078D53mNKnoorj5j9j1JOKnqnlmpnjKkj0j9j4jJ8K6K3J7J8K2K5K1J8J2Mqj4j8k0k4k0j0jk
7059C99j2k3k5j6%J6J9Pj2k3k3j7j4j5j2lJ5L0L9M3M5M0K3lk0k2j4j1j1nMQKrj8k2j3MJ9J5
$$ plain form
7189 447 423 400 383 369 359 355 356 359 358 358 361 365 368 374 382 388 389 389 392 391 380 361 346 341 343 349 364 387 410 422 422 415 403 389 377 366 358 354 363 386 409 423 426 429 437 447 456 468
7170 468 484 496 492 472 448 434 439 454 470 475 470 458 446 437 433 431 426 411 384 355 335 327 323 319 317 324 340 353 355 345 334 332 342 360 379 391 396 394 386 373 355 336 318 305
7152 305 301 301 300 292 279 267 261 257 254 255 264 279 288 287 281 281 287 295 297 297 300 308 316 322 325 329 335 344 356 372 392 413 429 434 425 408 389 375 367 368 378 395 412 420 416 406 397 394 396 405 420 437
7131 437 449 454 453 453 454 456 460 462 461 455 445 433 420 408 397 391 391 399 414 434 454 477 503 528 546 553 551 544 529 503 470 436 405 379 363 367 388 410 420 416 411 412 418 423 421 412
7113 412 396 379 366 359 358 362 366 365 356 344 335 330 326 323 323 326 329 332 342 363 388 414 438 462 481 489 481 465 451 445 441 431 406 369 338 326 328 327 312 292 283 293 312 331 345
7095 345 356 366 375 385 398 412 427 446 467 482 486 482 476 468 456 441 434 438 443 440 431 430 443 464 484 495 494 481 459 435 420 425 450 489 525 545 548 539 522 498 472 453
7078 453 449 454 456 451 445 439 430 415 396 385 386 392 394 389 381 376 373 369 362 357 356 358 356 346 327 313 312 330 356 379 396 414 436 461 482 500 512 516 508 494 476 456 432 412 402 401 399
7059 399 387 364 339 323 323 339 358 365 353 330 307 290 276 261 249 246 261 291 330 373 418 458 481 478 458 436 422 411 400 395 399 407 409 400 382 360 347 351 370 385
7043C85%p%ROmj0j1j1qKJ2J2LnnJPJ2RJ%PJ8J7Lj0j7j7j1JJ2J7J5J1J1R%rj6k1k9l3k9k0q
7025B99%Jkj0j4j0LJ6K7K9K2J1LMRJ2J3J3J0jj5k0j3KJ3J3RKlk%OQQRPPPPMnj7k1j3kJlnL
7005D22J4J7Roj9k7k4j2%%j3k8k8j6KJ3J8J5J0MMPRQMOPPQJ6K6K8J3rk2k2j3ojjJMRJ3J1J
6987D59rqjNjj4k1j6nMJ2J6J6J4J5K3K9K6Qj3k5k5k3k4k9l0k8k8l1l6l4k4j1KRJ1J2J1J2J5
6970B63J7K2K7L0K8J8Kj6k8l2k9j6NK3K7J7NNJ4K5K4J6Pkrj5k0k2k0j3mRJ8K2J5Kqrmlrj6
6954C66j9j7j0KK2L6L6K2Nj0k2k8k4j4mJOJ3J7J6J0Jqj8j6lJ0J7J8K1K1J4MNJ6K5J2j5l6l8
6938D34k3oMJj0k1k5j9pOJ6J7J0Jnpqj6k8l8m0l1rJ0K2K0J0%%J0J9J4lj5j0OJ3POJ3J9J6P
6920C60NQJ0J1J7K4K8K1J2Lqj8j7nOMj3k8l3l0k5j9j5j4j4j1lQJ9K9L6L6K6Qqj8j8j5oOJ5
$$ plain form
7043 385 385 378 378 387 393 389 379 368 357 349 351 363 375 378 373 368 369 376 388 397 398 398 405 423 440 443 433 416 399 388 389 401 418 433 444 455 464 464 455 439 418 389 356 327 307 299
7025 299 299 300 298 288 274 264 267 283 310 339 361 372 375 379 388 400 413 426 436 435 420 400 387 389 402 415 424 426 423 421 421 427 435 443 452 459 466 473 480 484 479 462 441 428 426 427 424 419 422
7005 422 436 453 462 456 437 410 386 374 374 374 361 333 305 289 291 304 322 337 347 351 355 362 371 379 383 389 396 403 411 427 453 481 494 485 463 441 428 422 421 420 421 425 434 447 458 459
6987 459 450 442 441 446 445 431 410 394 389 393 405 421 437 451 466 489 518 544 552 539 514 489 466 442 413 383 355 327 296 260 226 202 191 193 202 213 225 236 248 263
6970 263 280 302 329 359 387 405 407 391 363 331 302 286 291 314 341 358 363 368 382 407 431 447 454 452 443 428 408 386 366 353 349 358 376 398 413 415 407 398 394 391 382 366
6954 366 347 330 320 322 344 380 416 438 443 433 411 383 359 345 341 342 348 361 378 394 404 405 397 379 363 360 370 387 405 426 447 461 465 470 486 511 523 508 472 434
6938 434 411 405 409 410 400 379 354 335 328 334 350 367 377 378 373 366 358 342 314 276 236 205 196 206 228 248 258 258 258 268 287 301 298 283 273 279 292 299 305 318 337 353 360
6920 360 365 373 383 394 411 435 463 484 496 499 491 473 456 451 457 461 448 420 387 357 332 313 298 284 270 259 256 264 283 312 348 384 410 418 410 392 374 359 353 359 374
6904C74K0J7J2NJnj4k3k9k4j1OJ6J9J9K1K4K6K5J9Qlj2k0k9l5l3k4j2lNJ5J9J5PKKJ%KOO%
6887D15qj9l0l6k9j1PJ3J3J5K1K3J4kj7k2k1j7j2oNJ3J3RNQRJ0J0J2J1OOQJ0OJkj1k4l3k5
6870C38jJ9K6J6ok5l0j8JJ3J5J6J7Rrk4k4j5olmorpjKkoppn%J4K8K9J8PKLNRJ1J0NJJKJkk
6850C99JL%mqomkJRK3L1K8J3%qj2j2rKJ4K1J6Noj4j4j0kNRJ0QNM%rk5l8m2l6k3pJ5L7M7L8
6831D53J7mj4j8k0k0k0j8j4nMQNNJ0J8K1J9J3Npj8k2j6j2j4j8j6nJ1K8L5K9J8J1O%j1j7j5
6815D12j0pmnpj5k0j7j0nKJ4K3K5K2K8L6L7K1kj5j3olnj2j6k0j8j5j2j1j3j4j2qlJMRJ0Kr
6797C39j6qRK6L5L7L6L2K6J8J1J1J3Rlj6k3k5k6k4j9qJPRJ0Mpj3j1jJlnjJ1K0K0J4Lmmj%l
6779D81jNJ4J2Jj2j9j8j5j8j9j9j7k1k4k2j2olkQJ6J5Mnj0j6k1j8lJ4J9J7J2J0OOJ0J1Nmq
$$ plain form
6904 374 394 411 423 428 429 424 410 387 358 334 323 329 345 364 383 404 428 454 479 498 506 503 491 471 442 407 374 350 338 335 340 355 374 389 396 398 400 401 401 403 409 415 415
6887 415 407 388 358 322 293 282 289 302 315 330 351 374 388 386 369 347 326 309 297 291 296 309 322 331 336 344 353 363 373 385 396 402 408 416 426 432 433 431 420 396 363 338
6870 338 337 356 382 398 392 367 337 319 320 333 348 364 381 390 381 357 333 318 312 309 305 299 290 283 282 284 282 276 269 262 257 257 271 299 328 346 353 355 358 363 372 383 393 398 399 400 402 403 401 399
6850 399 400 403 403 399 391 385 381 379 380 389 412 443 471 484 484 476 464 452 443 445 459 480 496 501 495 481 467 457 455 460 469 479 487 492 496 496 487 462 424 382 346 323 316 331 368 415 453
6831 453 470 466 452 434 414 394 374 356 342 337 341 349 354 359 369 387 408 427 440 445 438 420 398 382 370 356 338 322 317 328 356 391 420 438 449 455 455 444 427 412
6815 412 402 395 391 386 379 364 344 327 317 312 314 328 351 376 398 426 462 499 520 518 503 490 484 481 476 464 448 428 410 395 383 372 359 345 333 325 322 323 327 336 346 348 339
6797 339 323 315 324 350 385 422 458 490 516 534 545 556 569 578 575 559 536 511 485 461 442 434 435 442 451 461 465 458 445 434 433 434 431 426 425 436 456 476 490 493 489 485 484 484 481
6779 481 480 485 499 511 512 500 481 463 448 430 411 392 375 354 330 308 296 290 287 285 293 309 324 328 323 313 297 276 258 255 269 288 305 317 327 333 339 349 360 365 361 353
6762C53mKOPOjpqn%KQJ5J8J3OKmrj1ropj0pk%JLMjj3j8j2%J0J4J2jj7k9l1k8k4j7nRK0K7L3
6742B85L5K9J7OLL%mmjNNKrk1k9k4j0MPJrj1lJ0K1K2J9J3J1J1Omj2j1okl%OJ1J0LlmnqrnL
6722C51QRQOPRQMlmMJ5K6K9K7J7Lqj3plmj1j6j3j0j0j1pLJ2Rjrj1k0l1k9pK2L1J8%qqj0j3
6703C59rKRPQJ8L0K9J4knKPKlpj0j3j9j9j3mNJ3K4L2L2K1Mj0j7j6j0npj5k3k0qNJ0M%JL%l
6685D03mjKjnj2j6j9k1k0j2%J2J7K2L0L7L2J3pj9k0j8j0KJ0Pmqmkoj5j5j2j1j4j3kJ5K3K4
6668C58K2K2K5K4J6Krj8k4k6k1rMJ1RMj%LPLrk0k0j1JQROOK%morj3j8j9j6j3j3j6j1MK2L0
6649B92K4J0Jmj0j7j6oJ0K1K5K7K7K3J2kj3j4j0j%pk1k5j1J1K1J2qj8j4JJ4K5L0L1K2Kj6k3
6633D05j9j2j0j0j1j0pJPOKKPKj3k1rRJ4N%QJ7J6QJnj1j0JJ2J3Jj5k6k8k3j3nnrqnNJ6K6K6
$$ plain form
6762 353 349 351 357 364 370 369 362 354 349 349 351 359 374 392 405 411 413 409 400 389 380 374 367 357 350 348 348 349 352 356 355 342 324 312 312 322 336 348 347 330 301 270 242 218 201 196 205 225 252 285
6742 285 320 349 366 372 375 378 378 374 370 369 374 379 381 372 351 322 298 288 292 299 300 291 280 277 287 308 330 349 362 373 384 390 386 374 363 357 355 352 352 358 369 379 382 379 375 370 362 353 348 351
6722 351 359 368 376 382 389 398 406 410 407 403 407 422 448 477 504 521 524 516 503 496 493 489 478 462 449 439 429 418 411 414 426 435 434 425 414 394 363 334 327 349 380 398 398 390 382 372 359
6703 359 350 352 361 368 376 394 424 453 467 465 460 462 469 471 468 461 451 438 419 400 387 383 388 401 425 457 489 510 514 504 487 471 461 456 449 434 411 391 383 388 398 402 402 403 406 406 403
6685 403 399 398 400 399 394 382 366 347 326 306 294 294 306 323 345 375 412 444 457 450 431 411 393 383 385 395 402 398 390 386 384 378 363 348 336 325 311 298 296 311 334 358
6668 358 380 402 427 451 467 469 460 442 418 392 371 362 366 377 386 390 389 389 392 399 402 393 373 353 342 343 351 360 366 372 374 374 370 364 355 342 324 305 289 276 263 247 236 240 262 292
6649 292 316 326 327 323 313 296 280 274 284 305 330 357 384 407 419 417 404 390 380 379 379 372 351 326 315 326 347 359 351 333 319 320 334 359 389 420 442 444 428 405
6633 405 386 374 364 354 343 333 326 327 334 340 342 344 351 353 340 319 310 319 333 338 338 346 363 379 387 388 383 372 362 363 375 388 389 374 348 320 297 284 279 274 265 257 252 257 273 299 325
6614C25J5K%ONoj5qJ1K9L4K6Roj4j0okJPJ4J7J4RQJ3J4J1Lk%RJ6J2lk3l3k8rRJ9K2J9Rok6
6596D91l4k7j4noj1j1j1j1q%PPKJLNMMLkj4k3k4k2k0j8j0NJ4J4RNOJ3K0J7QLRK1K6K1J0Kq
6577D51j7k3k3j8j1pnpoOK4L3K8J9J5J6J5J2QKqj7k2j9j5j2j3j2j3j4j1nMJ4K3K5J9Q%moo
6560D28mjLNNLlj1j6j6j5j9k3k0r%Jmrpl%KRJ9K1K1K0K0J4KonKMKJMN%nrj0qjNPPJ0K1L3L5
6540E05K1kk6l7l7k5j6j2j2pPK4L4L0J3kplJ%LRJ8K3J8Qmj5j8j8j4qJJ2J8J3Jj2k1k4k3j6
6523D00j0pj0j6k6l2k7j1QJ7J8J6K1K9L2K7J1pj9k1j1KRQKnj0j3j3nOJ6J6J0ONJj2k4l0j9
6506C32mNJomQJ8K0J8J8J8J8J3RPOONLKJjj0k5l5l0j8j3j1pLJ1QLlk%QJ7K3J5kk1l0k4nJ8
6487C63K6K0Lqj0oLJ2J7J4Noj2nOJ1QLNOpk5l4k4j0lKOQkj0qJLpj2j1lKNPPKmkKJ1K0K2K0
$$ plain form
6614 325 340 342 342 348 353 347 332 324 335 364 398 424 433 427 413 403 397 395 396 403 417 434 448 457 465 478 492 503 506 504 504 513 529 541 538 515 482 454 445 454 473 495 514 523 517 491
6596 491 457 430 416 411 405 394 383 372 361 353 353 360 367 369 370 373 378 382 386 389 387 373 350 326 304 284 266 256 261 275 289 298 303 309 322 342 359 367 370 379 400 426 447 457 459 451
6577 451 434 411 388 370 359 352 347 340 334 340 364 397 425 444 459 475 490 502 510 512 504 487 465 446 431 419 406 394 381 367 356 351 355 369 392 417 436 444 444 440 434 428
6560 428 424 423 426 431 436 439 436 425 409 393 378 359 336 316 307 307 308 304 295 288 285 285 287 296 315 336 357 377 397 411 413 407 402 404 408 410 411 415 420 420 415 406 396 388 387 392 399 406 416 437 470 505
6540 505 526 524 498 461 424 399 383 371 359 352 359 383 417 447 460 458 451 448 449 449 452 461 479 502 520 528 524 509 491 473 459 451 452 464 482 495 496 484 463 439 416 400
6523 400 390 383 373 357 331 299 272 261 269 286 304 320 341 370 402 429 440 433 414 393 382 384 393 401 403 398 388 375 362 357 363 379 395 405 411 416 417 405 381 351 332
6506 332 328 333 334 328 324 332 350 370 388 406 424 442 455 464 471 477 483 488 491 493 494 493 483 458 423 393 375 362 351 344 347 358 366 369 366 364 364 372 389 412 427 425 404 374 350 345 363
6487 363 389 409 412 404 394 388 391 403 420 434 439 433 421 416 422 433 441 444 449 455 448 423 389 365 355 352 354 360 368 366 356 348 349 352 345 333 322 319 321 326 333 340 342 338 336 338 349 369 391 411
6467D11J4RPMJkoj0j4j6j1mMJ3J8J3Lkpj6l1m0l0j0J0K0K6K6J5lj7j5JJ2Rnj5j2kMmk4m4n4
6450B26m5k4nJLJ4L3M7M8L7K3PorkPJ1OLLPJ2J6J0jj2j0JJ5K2K2J4%rrnmj5k8l4k6j2%QJ6
6432C56K3K5J7%j5j8j2JJ5K8L7M3L9K5Nrj5j3j2j6k0k2k7l0k0jJ8K6K5K2J7Lj0j6oNNpj7j5
6416D34rmqj2j9k5l2l0j9JJ5K5K8K9K5J9J2Mpj5j5j0qqrlJLLPJ1RKnj4k4l1k8j5%OPJ0J3J5
6397C29J2QQJ0J2Q%rj1qmjJLK%k%PJ4J1jj3j5oOJ3J4J1J3J6K0J4kj8k8k7k3j8j3plLJ1J8J4
6379C69Kj1j6k1k7l0k6j6nOJ4K0J9J5J6K5L3L5K8J7Mllqk1l4l7k9k3j9rQK4L1L5L9L9K9J4
6363D84Jnqj1j2qmjJQJ4J3Kpj1oJPPNjj0j5j4rj0j4k1k1j4pj%%lqj1qMJ4J8J5J3J3Plq%J1
6344C87J4J1J2J3Rjj0j3j5j7j5j2rpmlqj7k2j8rKJ2J9J7LqnJ1L0L9L7K9J6NjprnMOlj7k6k4
$$ plain form
6467 411 425 434 441 445 446 444 438 428 414 398 387 383 387 400 418 431 434 432 425 409 378 338 308 298 308 328 354 380 395 392 375 360 361 373 382 377 362 350 348 352 348 324 280 226
6450 226 181 157 152 153 156 170 203 250 298 335 358 365 359 350 348 355 366 372 375 378 385 397 413 423 422 410 400 401 416 438 460 474 474 465 456 451 447 432 404 370 344 332 332 340 356
6432 356 379 404 421 421 406 388 376 377 392 420 457 500 539 564 569 560 545 532 520 504 484 462 435 405 385 384 402 428 453 475 492 495 485 469 463 468 473 466 449 434
6416 434 425 421 413 401 382 357 325 295 276 277 292 317 345 374 399 418 430 434 427 412 397 387 379 371 362 359 360 363 366 373 384 393 395 390 376 352 321 293 278 278 284 291 301 314 329
6397 329 341 349 357 367 379 387 387 378 367 359 355 354 355 358 360 360 358 358 365 379 390 389 376 361 355 361 374 388 399 412 428 448 462 460 442 414 387 364 346 333 326 323 326 337 355 369
6379 369 371 360 344 323 296 266 240 224 219 225 239 259 278 293 309 334 367 402 430 447 451 448 445 437 416 382 345 316 293 274 265 273 297 328 363 402 441 470 484
6363 484 485 480 472 461 449 441 437 436 437 445 459 472 474 467 456 450 451 458 465 470 469 459 444 430 421 411 397 376 355 341 334 333 333 333 330 322 311 303 307 321 339 354 367 380 387 384 376 376 387
6344 387 401 412 424 437 446 445 435 422 407 390 375 363 354 347 343 340 332 315 293 275 266 268 280 299 316 319 311 306 317 347 386 423 452 468 473 472 465 456 451 455 461 458 441 415 391
6326C91k1j8j0LJ6K2K1J5Omrj1j1j4j7j6rLJ6K7K5Oj8l1k7j5pnKJ1J6J2J0J6K1J6jj1qKMK
6309D00%mj4k2k2j4pjQK1L4L5K5J1mj0j2qmMJ3K4K9K6J4lj9k4j8j0qj4k0k7k8k1rjmj3j8j1
6292B74%J0J8K0J4jj3j6j0kOJ1QK%OJ2J4J0J1J4J7J4Lpj6k1j8j0%Mmj4j7j1jLMQJ3Qpj8j4
6274C04KJ7K4K2J3LkkJLKJ%JLQPNPJ6J9Pj2k4k8l0l2k7j2LJ1J4J5J4Npj9k5k6k4j6qLJ1J9
6256B66J9J3QJ2J9J5%j6k0j7j4j7j9j5oNJ6K1K3J9J3J0QPKmj0j6j9j9j3jRJ0PKLRJ3J2Oj%
6239C40PJ8K5K7K1J1jj3j4lJ0J3Lrj0jJ3K3L0L1K6Rj1k8l0j8lPPNPJ3J7J3Mmnmnj1j9k2j8
6222D51qjOJ3J6K0K1K2J3jj2j0ljpj1j0j1j9k3k2j7j6j6j2oKJ2J6J2qk9l6k3%J8K3J4QRJ9
6205C93K6K6K4K3J8R%lqj8k8l2l0k7k3j2MJ2RkrpMJ6J5Pjllnrj3j7k5k6j2QK3K6K3J5kj9k2
$$ plain form
6326 391 370 352 342 345 361 383 404 419 425 421 412 401 390 376 359 343 334 337 353 380 405 411 393 362 335 320 313 308 310 321 337 349 359 375 396 412 411 400 392 394 398 400
6309 400 400 396 382 360 338 324 317 316 324 345 379 414 439 450 446 436 424 416 412 416 429 453 482 508 522 519 500 476 458 448 440 426 406 379 351 330 321 320 316 303 285 274
6292 274 274 284 302 322 336 335 322 306 296 294 300 311 319 321 321 327 339 353 363 374 388 405 419 422 415 399 378 360 350 350 354 350 336 319 308 307 310 314 322 335 343 336 318 304
6274 304 306 323 347 369 382 385 383 381 382 385 387 388 388 389 392 400 407 412 419 435 454 461 449 425 397 367 335 308 296 299 310 324 339 353 358 351 332 307 281 257 241 233 236 247 266
6256 266 285 298 306 318 337 352 352 336 316 299 285 268 249 234 228 233 249 270 293 312 325 335 343 350 352 348 338 322 303 284 271 270 279 289 296 298 301 310 323 335 341 340 340
6239 340 347 365 390 417 438 449 448 435 421 418 428 441 444 435 425 424 437 460 490 521 547 556 545 517 487 469 466 473 480 485 492 505 522 535 539 535 530 526 521 510 491 469 451
6222 451 443 442 448 461 477 497 518 540 553 552 540 530 527 526 519 508 498 487 468 445 423 406 390 374 362 356 358 370 386 398 390 361 325 302 302 320 343 357 365 374 393
6205 393 419 445 469 492 510 519 519 516 508 490 462 430 400 373 350 338 342 354 363 361 352 345 349 365 380 387 386 383 380 375 366 353 336 311 285 273 281 304 330 353 368 366 347 325
6187C25nJ7K2J0nj2j0lOJ6K1J9J3NJjLRJ4J6J5J5J4Qkj5k5k8k3j3lKNNJ0J1Pmj5j6j0jMQJ2
6169D22J0Ojlpj3k3k6k0qj%%LQJ3J5J8K2K8K9K8K1Qlrj1j5j8j1MJ2QnrnJKkpj3j4j3j4j5j4
6151C78qJQJ2J4J5J1LoqpJRJ3J2J1J4J9K0J5J7K6L7M1L6K0nk9l8l2k1j4j3j5j8k3k5j9j0o
6135D36pokKLjmoqj0j0nLQJj1j8j6j1pkMOJmnKJ3K3K5J5lj9k6k3j6pmqj3j0MJ4J6J0ONMMN
6115C48Nkqj0pkNJ5K5L0K8K1J0ok0l0l1k0lJ0Rjj3k1k5k6k0j0qj9k8j9QL1L6K4P%%K%kMJ7
6097C04K7K5Rqj5pRJ9J7RMN%j3k5k6j5JJ5K3J8QjnmlMJ6K9L6L6K5Nk0l3l1k1j5rlNJ1J2RL
6079D30%LQNrj9k2j9j8rJ0K9L6L3K8K1Oj1j8j7j0kQRkj7k0j0JPJ0J6K1K6K8K0Mj1j5ojjKP
6061E31J4K5M0M6L7K3K8N2Q7J33J95K45K27J14m5j69k13j91j46j05q2p2o5n7m9m2l5k5j3m
$$ plain form
6187 325 320 337 359 369 364 352 342 339 345 361 382 401 414 419 420 419 422 431 445 461 476 491 505 513 511 496 471 443 420 407 404 406 411 416 426 437 444 440 425 409 399 398 402 410 422
6169 422 432 438 437 434 427 414 391 365 345 337 336 336 336 339 347 360 375 393 415 443 472 500 521 529 526 517 506 491 473 462 466 478 486 481 472 467 468 470 468 461 448 434 421 407 392 378
6151 378 370 371 379 391 405 420 431 434 428 420 413 414 423 436 448 459 473 492 512 527 544 570 607 648 684 704 699 670 632 600 579 565 552 537 519 496 471 452 442 436
6135 436 429 423 421 423 426 425 421 415 407 397 387 382 385 393 394 383 365 349 338 331 329 333 339 340 336 331 333 346 369 394 409 406 387 361 338 322 315 311 303 290 280 284 298 314 324 330 335 339 343 348
6115 348 353 351 343 333 326 324 329 344 369 399 427 448 458 452 432 402 371 351 348 358 367 366 353 332 307 281 261 251 243 224 196 177 185 216 252 276 283 283 283 285 285 283 287 304
6097 304 331 356 365 357 342 335 344 363 380 389 393 398 398 385 360 334 319 320 335 358 376 384 383 378 374 371 375 391 420 456 492 517 522 502 469 438 417 402 393 390 395 406 418 427 430
6079 430 430 433 441 446 437 418 396 377 359 350 360 389 425 458 486 507 513 502 484 467 457 455 463 472 470 453 433 423 424 431 441 457 478 504 532 552 556 545 530 524 523 522 524 531
6061 531 545 570 610 656 693 716 744 796 883 1016 1211 1456 1683 1797 1752 1583 1370 1179 1033 928 846 774 709 652 603 561 526 501 488 484
6049D84kknpprj6j8pJ6L1K4Kj4j5pLKj0k2k3j4npj1rk%JNJ3J5RMMJ0J5J2L%NROnj3j3pMJ8
6030D45K9L1K4Rj0l1l9k7nNklRK2K1Rmj0j5j5j4j4j7j1PK4L0K5J7J3J8K9M5N9P4J01J28J26
6014A083P7Kn9q9r0p1m6k3qKO%nkKmj4j2RK6K5J0qk4l0k2nJKJ9M8O1N0M1N1O8P6Q7R9J03J05
5998A541J33J90K39K77L42M42N50O82R20J298J785K385L103L634L324J741o70k756l640l386
5990A2134k668k003j492j085p88o11m89l78k98k63k33j82j41j27j17q9o4o0o2n5m5m4m2l1
5980G67k4k7l0k2j3j0lMkk2l5l0j9j0mMOOJ5K1J2j2k3j4nqj8j7j3nJ0K7K8J1j0j7j7k5k8j9
5964D29mLjpj7k9m2m3l4j8kJ3J7RkkOJ5K2K2J2lj4k1k4k7j7LK0K4K3K9L3K8J6ROLjmj0j7j8
5947C85nJ4K4J7Kj2j5rknj4j8j2jPJ7K4K5J6JprlQJ9K1J0lj4k5l9m5l8k2rLJ5K3J9J3RJ0O
$$ plain form
6049 484 482 480 475 468 461 452 436 418 411 427 458 482 484 470 455 448 451 453 443 421 398 384 379 372 361 352 350 350 351 356 369 384 393 397 401 411 426 438 441 441 446 455 461 456 443 430 423 427 445
6030 445 474 505 529 538 528 497 458 431 426 431 429 426 435 457 478 487 483 473 458 443 429 415 398 387 394 418 448 473 490 503 521 550 595 654 728 829 957 1083
6014 1083 1160 1162 1103 1014 924 853 807 784 776 778 784 784 779 777 779 775 761 749 758 784 809 819 811 787 757 735 730 731 733 752 800 861 911 952 1003 1071 1147 1234 1333 1436 1541
5998 1541 1674 1864 2103 2380 2722 3164 3714 4396 5316 6614 8399 10784 13887 17521 20845 22586 21916 19160 15520 12134
5990 12134 9466 7463 5971 4886 4098 3487 2998 2620 2322 2059 1826 1644 1503 1376 1259 1170 1106 1046 984 929 884 840 798 767
5980 767 743 716 686 664 651 641 638 642 640 618 583 553 534 524 520 524 530 536 551 572 584 572 549 535 530 522 504 487 474 469 479 506 534 545 535 518 501 476 448 429
5964 429 425 428 427 420 403 374 332 289 255 237 235 248 265 274 272 270 276 291 313 335 347 344 330 309 285 258 241 244 264 288 311 340 373 401 417 426 432 435 434 430 420 403 385
5947 385 380 394 418 435 437 425 410 401 399 394 380 362 350 349 356 373 397 422 438 439 432 423 420 428 447 468 478 475 461 436 397 352 314 292 283 286 301 324 343 356 365 375 381
5930C81LLPLmqpqj1oKMkqpJRJ6K1K1J4Njqj1nPJ2Jj7k3j5jQJ0J0J0QMknj3k4k8j7%PJolLM
5909C35lj0j2oLPOlrj0ojRJ7K0J4QPOJnmMRRNJkKONmj2j1mKMNJqk0k4k0j1KJ3J8J6ROOMJJ
5887C77KjorojPJ6K0J4OMPMqk3l2l5l0j6jRJ2J6J6Qnj7j8j4rjRJ7J8J9J9J5Poj6k1k3j5o%
5869C03jnoonlPJ7K0J6J1Nkj4k2k3j6rkQJ9K2J1rk1j7mM%rj9k2j6mNNOJ4K4K2J5J3J6J6J3
5851C57J1J0Kqj1lKlj3k0k4k5k2j6j0jJ4L0L3K2Rkj0k3l0k2qMQJ0J1J0Kpj3j3jJ7L1L0K2J5
5834C65Pjqj0j0j0j3j6k1k3k2j3plJJ2K5L7M1M0L0J5Jmoj0j6k2k4j9jK2L8L3J5%oqrpnljN
5816C89J5K1J6Nqj8k5k8k9k8j9jJ8K6K2J1jppnnj0j1kJ0J8J7J5J5J6J5J0Kqj6j6j1kMPKlK
5799C96J6K7J6j0k7k2oJ0J5Rok1l0k5j4olkkkjMJ3K7L8L7J9rk9l4k7j4njkJJ2K4K4Pj0j1K
$$ plain form
5930 381 384 387 394 397 393 385 378 370 359 353 355 359 357 349 342 343 352 368 389 410 424 429 428 420 409 404 411 423 424 407 384 369 368 376 386 396 406 414 418 416 411 398 374 346 329 329 336 337 331 328 331 335
5909 335 332 322 310 304 307 314 320 317 308 298 292 291 300 317 337 351 359 366 372 373 368 364 368 377 386 391 392 390 392 398 403 399 387 376 372 374 378 383 384 376 356 332 312 301 303 316 334 350 359 365 371 375 376 377
5887 377 379 378 372 363 357 356 363 379 399 413 419 423 430 434 426 403 371 336 306 290 289 298 310 326 342 350 345 328 310 296 287 286 295 312 330 349 368 383 390 384 368 347 324 309 303 303
5869 303 302 297 291 285 280 277 284 301 321 337 348 353 351 337 315 292 276 267 265 273 292 314 325 316 295 278 274 278 278 269 250 228 212 208 213 218 224 238 262 284 299 312 328 344 357
5851 357 368 378 380 372 361 358 360 357 344 324 300 275 253 237 227 226 240 270 303 325 334 332 322 299 269 247 239 243 251 261 272 282 284 277 264 251 250 267 298 328 350 365
5834 365 372 371 363 353 343 333 320 304 283 260 238 225 218 215 216 228 253 290 331 371 401 416 417 413 407 397 381 359 335 316 315 337 375 408 423 423 417 409 400 393 388 385 384 389
5816 389 404 425 441 446 438 420 395 367 338 310 291 290 308 334 356 367 366 359 352 347 342 332 321 319 329 347 364 379 394 410 425 435 437 429 413 397 386 384 388 395 397 394 396
5799 396 412 439 455 445 418 396 390 400 415 424 418 397 367 342 328 322 319 317 315 313 312 316 329 356 394 431 450 441 412 378 351 337 332 331 329 330 342 366 390 397 387 376 378
5781C78J7K0J4JnnJPJ2J5J2%j4k2k3k3k3k1j1JLJLJ1J4J0MOJ0J4J6J3RJrj7k2k4j9j0%QJ1
5764C64J0PNORJ1Ork3k6j5kKjk%QJ3J2Lqj6j5nJ0K6L7L7K7J3Njqj1nNQJj1j7k0k1j8j4j4k1
5746C42k3j7oNJ5K4K5J5lj8k4k0j0LJ5K2K6K5J6%j2j7j1mkk%PJ4J1jj0oKOlj3j6rMJ9L0L3
5728D32K9K7K1J3Kllnj1j2j2j4k3k5j6kLJJRK0K5K3Rj1k8k8j7pnrj6k3k3j2MJ8J7Orj6j3m
5711C13PJ3J7J0kj1lJ7L1K8J8J3Qlj8k2j3%ONKNPJ0OJ%OJ2J1Jj0j5j4j4k1l3m1l8j9OK6L4
5694C36K8J3JJJ0J1KqmRJ0kj8k1j3kNOMLPJ7K7K9K4J1nj4j1%OOL%mj1j7j6j0qnJOO%j1j9k4
5675C59k5k0lJ9L5L5K6K1K2J7Kj8k6k3j2lkj1k5k6j2LPMQK4L7L1Rj4k1j2j%nj0rrj4j7j8k0
5658C03k2j9oRJ8K1K2J9J1OQJ4J0oj9k1j8j6j3jJ6K8L1K6J5OKOO%j0k0k8l3l0k1j1pponoj3
$$ plain form
5781 378 395 415 429 430 425 420 421 428 440 455 467 467 453 431 408 385 362 341 330 331 334 335 338 349 363 373 377 383 393 407 423 436 445 446 437 420 398 374 355 345 345 353 364
5764 364 374 381 386 392 401 412 418 409 386 360 345 343 345 344 342 342 350 363 375 378 370 354 339 334 344 370 407 444 471 484 489 488 480 469 464 469 477 478 467 450 430 409 391 377 363 342
5746 342 319 302 296 301 316 340 365 380 377 359 335 315 305 308 323 345 371 396 412 412 400 383 372 368 366 364 364 371 385 396 395 385 379 381 387 384 371 355 346 350 369 399 432
5728 432 461 488 509 522 524 521 518 513 502 490 478 464 441 416 400 398 401 402 403 412 432 457 480 489 478 450 422 405 398 393 384 368 345 322 310 314 332 349 355 346 330 317 313
5711 313 320 333 350 360 358 347 344 361 392 420 438 451 459 456 438 416 403 403 409 414 416 421 428 438 444 445 445 451 463 474 475 465 450 436 422 401 368 327 289 270 276 302 336
5694 336 364 377 378 379 389 400 402 394 390 399 409 407 389 368 355 353 358 364 368 371 378 395 422 451 475 486 481 467 456 456 462 468 471 471 467 456 439 423 413 405 400 401 407 413 413 402 383 359
5675 359 334 314 311 330 365 400 426 447 469 486 488 470 444 421 409 406 404 393 368 342 330 333 340 344 352 376 413 444 453 439 418 406 405 405 400 390 381 372 358 341 323 303
5658 303 281 262 256 265 283 304 326 345 356 362 370 384 394 388 369 348 330 314 301 300 316 344 375 401 416 422 424 430 436 436 426 406 378 345 315 294 283 276 269 263 258 252 239
5641B39k1k1rJ2L2L9L5K4Qoj6j6rmnrj1rjJ2K0K1J6J4J4J4QORJ3J0%j2k3k8k8k9l0k4qRJ9
5624B55J6QKJRK8M6M6K8R%mj5k8l0j7KJ3J4Lj3k5k5j6nLRJ0RPLkmjNNJjMJ1J2J0jj8l5l7k8
5605B64j5oJJ2K0J8J4PJmjJ0J3Mj3j9j1KJ3J7J3RRJ8K7K8J9J1Lmj1j1j2j3j3j5j7k3k3j8j8
5588B86k3k3pJ5K7K6K1K1K7L7M6M3K6Mj0j8k5l3l4k7j8qJPNlj3j8j8j4mKJmnmqj3j2j0j0r
5571B24%J6K9K9K4J4MLJ3K2K3J6J3J1%j3j5oKkj1j6j5j4rkjmnjOJ4J9K1J9J4Onj5j5jJ3J2
5554D17KmnmmMJ3J9J9K0J7Mj2j6nMJlJNM%jkopkNQLj0j7j7nOJ0Lkj0j7j5%K0K5J8J5K7M3N7
5535F06O7P8Q7R6J02Q8L8l6r3j06r0o8n5m6m3m3m2l5k5j3jONnrrj0j3j3rj4j9j2PK5K9L0L1
5519D86K6Nj8l1l1k5j3KPNKOOkqpnmLRLj3j7oQJ0PMnj8j8LK4L0L1L4L1J3nj0onmJ%j0j4qp
$$ plain form
5641 239 218 197 188 200 232 271 306 330 338 332 316 300 291 287 282 273 262 253 252 264 284 305 321 335 349 363 371 377 386 399 409 409 397 374 346 318 289 259 235 227 236 255
5624 255 271 279 281 282 291 319 365 411 439 448 448 444 429 401 371 354 356 369 383 386 373 348 323 307 302 305 314 324 333 340 343 341 337 336 341 346 347 346 350 361 373 383 382 364 329 292 264
5605 264 249 243 244 256 276 294 308 315 316 312 311 321 334 338 325 306 295 297 310 327 340 349 358 376 403 431 450 461 464 460 449 438 426 413 400 385 368 345 322 304 286
5588 286 263 240 233 248 275 301 322 343 370 407 453 496 522 526 516 498 473 440 406 379 361 353 354 361 366 363 350 332 314 300 296 298 299 295 290 286 278 265 253 243 233 224
5571 224 224 240 269 298 322 336 340 343 356 378 401 417 430 441 441 428 413 407 409 407 396 380 365 351 342 340 339 335 330 329 335 349 368 389 408 422 428 423 408 393 392 405 417
5554 417 419 415 410 406 402 406 419 438 457 477 494 498 486 470 465 469 470 467 468 473 477 477 476 474 468 461 459 464 472 475 465 448 431 426 432 442 445 443 433 416 401 401 421 446 464 479 506 549 606
5535 606 673 751 838 934 1036 1124 1162 1126 1033 927 837 769 714 668 625 582 540 505 480 467 466 472 477 472 463 454 444 431 418 409 395 376 364 371 396 425 455 486
5519 486 512 517 499 468 437 412 399 401 408 413 415 421 427 425 417 410 405 401 404 413 416 403 386 380 388 398 405 409 404 386 368 371 395 425 456 490 521 534 529 519 513 508 504 505 505 495 481 473 466
5500D66j6j8qOJ1J6K6K6Mj7k2j9k2j9lNqk4k8k8l4l0%L5M5M0L7L2J7PJ2J3nk1j2OPPL0N3M9
5483F16L6M0M8K9%rmj1j9lJ5Nj2KL1L6L8O4Q8P2N4P9J19J20J23J76K41K55K81M06N56O14O45
5470D731Q17J130J506K093L014L722L148R24j851l541l578k739j978j520j143p88n73m74l68
5462B532k51k07k09j77j19j07j24j06n9m8p2p5n6n0n6l5k%j9j8Jnl1l9k3k2l6l5j5JLPJ6Q
5449E72rj2lnj4j2%Lnqjmj3j2kKqj0nmqlJ0J2NKQQmj1qj0k3l5l6k9k0mQOmlJ4K7K4J3%j2j8
5429C59j0NJ3J2J1J1PJNK0K8K2J0ok5m1m3l2k3k4k5k1j7j4pQJ8K2K3K4J9J0PJ1Pnj0kOPOQ
5412C75Pkrojmj3j9j9j3KK0L2L0J9Qoj9k3k0j2p%J2K1K3K0J5PJ%Lkj2j3jJ2J3MJJNQJ4J6N
5394D73j7l6m6m5l1j0J0K1J6Jj6k2j4KJ4K1K3K1J0qj9j9j3kJ5K9L2J7LjJjKJ1K0J7Mnnllo
$$ plain form
5500 466 450 432 424 430 441 457 483 509 513 496 474 455 433 414 411 416 408 384 356 328 294 264 264 299 344 384 421 453 470 477 489 502 497 476 464 470 477 484 514 567 616
5483 616 652 692 740 769 769 760 756 745 726 723 738 743 731 733 764 800 838 902 990 1062 1116 1195 1314 1434 1557 1733 1974 2229 2510 2916 3472 4086 4731
5470 4731 5548 6678 8184 10277 13291 17013 20161 21085 19234 15693 12115 9376 7398 5878 4735 3947 3374 2900 2532
5462 2532 2281 2074 1865 1688 1569 1462 1338 1232 1173 1125 1053 978 922 872 816 781 779 779 760 742 743 738 707 668 645 623 587 552 537 538 541 548 564 572
5449 572 563 551 548 543 529 517 517 520 515 507 506 502 489 477 475 477 469 459 454 450 442 439 449 461 466 468 476 484 480 469 461 451 428 393 357 328 308 304 312 318 314 311 325 352 376 389 389 377 359
5429 359 349 354 367 379 390 401 408 409 414 434 462 484 494 488 463 422 379 347 324 300 275 254 237 223 216 224 242 264 287 311 330 340 347 358 365 360 350 348 354 361 367 375
5412 375 382 380 371 365 364 360 347 328 309 296 298 318 350 380 399 407 401 382 359 339 327 320 320 332 353 376 396 411 418 419 419 422 420 408 395 394 406 419 423 424 425 430 438 452 468 473
5394 473 456 420 374 329 298 288 298 319 335 336 320 298 284 286 300 321 344 365 375 367 348 329 316 314 329 358 390 407 410 409 410 409 411 422 442 459 463 458 453 450 447 441
5377D41rj0j1j2j5j8j5oKRJ6K2J7MnlLKkJNMnk0l0l0k1qkkKJ1J5R%KJ0J2Mj0k1k6k2j1jjm
5358B71%QJ6J5J1RJ5K2K7J6mk1k4j4kQJ3Q%n%O%j5k7k8k2j5nMJ0J6K0J9Qrk3k9k6j3QK6L6
5341C10L8M0M0L1J6PLkj3k2k2j5j2j3j5j2pJRRJqj3j7j8j7j4j2j2j1rkRK4L5L5K1Mpr%J0J4
5323C75J0PQJ0QKoj8l2l7k7j0kkkNJ1J4J8K4K1J0nj4k2k5k0j1onmLPQJ0K1L2L0J7Kj3k5l4
5306C33l4k2kJ5K0J1JLJ6K2J1qj9j5mNJ0POOOlj7k5j4NJ7K1K6L0K7J3JjKOQJ1J4J2Onj7k7
5288D58l3l5l4l0k4j5lJ5K9L0J6nk3l2l6l1j5MK0K7K9K6K1J4J1J8K6K3Kk3l6k6mJ2J2QPNj
5273D07j3k7l8m0k9nJ6K4J8NkjPK0K6K4J6J3J5J3J0M%pj5k3k9k8j9nLMMNPKkm%krj3j5j4j6
5255B87j3nOJ3J3J0OLjkkLJ0J8K3J8Opj2pKNLk%Jkrj2j0j0j2j6j4j2j0nKJ4K3K8K9K4J9J6
$$ plain form
5377 441 432 422 411 399 384 366 351 345 347 356 372 394 411 415 410 407 410 412 410 411 416 420 415 395 365 335 314 306 304 302 304 315 330 339 339 341 351 363 367 357 336 310 288 277 276 275 271
5358 271 271 279 295 310 321 330 345 367 394 410 406 385 361 347 345 353 366 374 374 369 369 375 375 360 333 305 283 268 263 267 277 293 313 332 340 331 308 279 253 240 248 274 310
5341 310 348 388 428 459 475 482 485 483 470 448 426 411 399 386 371 359 352 353 362 371 372 364 351 334 316 299 285 273 261 250 241 239 248 272 307 342 363 367 360 351 351 361 375
5323 375 385 392 400 410 418 420 414 396 364 327 300 290 288 286 284 289 300 314 332 356 377 387 382 368 346 321 301 290 284 279 275 278 285 293 303 324 356 386 403 405 392 367 333
5306 333 299 277 275 290 310 321 322 325 341 363 374 366 347 332 328 333 343 350 356 362 368 365 348 323 309 314 331 352 378 408 435 448 449 448 450 456 464 475 489 501 507 502 485 458
5288 458 425 390 356 326 302 287 284 299 328 358 374 369 346 314 278 247 232 236 256 283 312 338 359 373 384 402 428 451 453 430 394 368 364 376 388 396 403 408 407
5273 407 394 367 329 289 260 255 271 295 313 318 316 315 322 342 368 392 408 421 436 449 459 463 463 456 441 418 389 361 342 337 340 344 348 353 360 362 360 356 356 354 345 332 317 303 287
5255 287 274 269 275 288 301 311 317 320 319 317 315 318 328 346 369 387 393 386 374 367 369 374 377 375 375 376 374 365 353 343 333 321 305 291 279 269 264 266 280 303 331 360 384 403 419
5237D19J4J4Qjppnrj6k2j7oNJ4J6R%ppnnrqJJ1J1kj5j9j2m%mj3j5j2lNJ4J4Qoj6j6j1qmNJ9
5217B96L3L6K9J1qj4oJ2J9Rrk0j4lPRJ1Pmk3l1k2mN%pj0j3j3pPJ8J3jj1j2roKJ1J2MmqlLO
5198B98Kqj0jJ4K1J9J9K0J6Nj0j9k3k3j4lJmqlRJ4QjmMJ9L3L9L1J8LrpLJ3Pj0k1j8j1j0j0
5180C89ojlojRJ1Jj1j6j1poj1j4oRK0K2J9J7J3PMPJ0J0QRNj0k9l6k7j7qjJ1K2K6K4J8J2J0
5163D66J1R%j0j1m%lomjmj0j8k1j9j0oj1k2k6j9rmkLPRJ3J9K3J7Orj9k7k5j5%J5K2K1J0kq
5145C26ojNJ2J6J6J1J1J8K6K6K2J7Qnj9k4j8rknqj0pk%JLOQLlom%JKkpj2j5j5j4qjOQQPJn
5124C60plKL%LRJ3J0Lpj2pNJ7K1K0K0J6Opj0kOPJjLOKj1k3k9k8k0j2lJKJOJ1J0jrj0nmook
5104C39%%JLjprokKRJ9J9J0LQJ9K2J7J1Olj6k1j6%J5K5L0K8J9Kk2m3n4n0l8k5j4lJ0J7J2%
$$ plain form
5237 419 433 447 455 454 447 440 435 426 410 388 371 365 370 384 400 409 409 402 395 390 385 376 368 369 380 391 389 374 355 343 339 339 335 322 307 295 292 297 311 325 333 327 311 295 284 276 272 277 296
5217 296 329 365 394 405 397 383 377 389 408 417 408 388 374 371 378 387 398 405 401 378 347 325 321 326 326 319 309 296 283 276 283 301 314 313 302 290 281 275 277 288 300 304 300 292 289 292 298
5198 298 300 292 282 281 295 316 335 354 374 390 395 385 366 343 320 306 303 304 300 292 289 298 312 320 319 315 319 338 371 410 441 459 462 453 446 449 462 469 459 438 420 409 399 389
5180 389 383 382 379 373 372 381 392 393 382 366 355 348 342 331 317 311 320 340 362 381 398 411 418 422 429 439 449 457 466 471 461 432 396 369 352 344 343 354 376 402 426 444 456 466
5163 466 477 486 486 476 465 461 461 458 452 448 447 443 433 415 394 375 365 359 348 326 300 281 272 268 266 269 276 285 298 317 340 357 363 354 335 308 283 268 268 283 305 326 336 334 326
5145 326 320 319 324 336 352 368 379 390 408 434 460 482 499 507 502 483 459 441 432 430 425 417 407 400 398 398 399 402 408 416 419 416 410 406 406 407 409 407 400 388 373 358 344 336 335 341 349 357 364 365 360
5124 360 353 350 352 355 355 358 367 380 390 393 386 374 367 372 389 410 430 450 466 472 465 455 453 459 466 467 466 469 475 477 466 443 414 386 366 354 351 352 354 355 361 372 382 381 372 362 357 353 347 341 339
5104 339 339 339 340 343 342 335 326 320 318 320 329 348 367 377 380 388 407 429 446 457 463 460 444 423 407 407 422 447 477 505 524 526 504 461 407 357 319 294 280 277 287 304 316 316
5086C16j0j3j1ol%KOJ3K6L9M5M1K5Oj1j9k4k7k8j9JJ7J8Nrj1lPJ3J2Kj2k2j9qMJ8L1M5M9M5
5069E31L8L1J9Jj4k5l1l2l4l1k2j0JRQKnqnkKQJ0J0PPJ1J4J2Mlrj4j9k6k7j7mPRJ2J1Jj6l2
5051C79l6k7j1NJ6K2K5K6K4K0J8K1K1J3jj2j8k1k7l5l4k4j3n%KL%lm%LL%JKJmj1j1rolJQR
5033C08ONKmj3j4q%MQJ3J4QLLNKmnloj5j9j6rlLJ0J6K2K7L1K5J5Mmj2k3l5m0l6j8LK1K6K4
5014C21K4K8K8K2J4R%qoJQM%LJ0J2OmpolJK%rj8k0j0QJ9J6Jj0j3j0j0j4j0jRJ5J5J1QLmj4
4995D21k8l3k3nJ0RJm%QJ6J6J2Njm%LMnj4j6j1pj2j9k1j5j1rqnkjkmjNRJ1RJ0K0L2L2K1Pk
4976C98rj7j9rJ2K8K8J6Jj1j5j3poj0j3rJJ2J8J8J5Lj1j7j1LPM%LRJ0QKkopj0rnKN%poMOp
4956C77k1j6NK3K3J0nj4j5oOJ5J5J6J7J7J1NOJ7L0M3M5L3J1j0k2k4j8nJ2K2K2J8J7K4L3M1
$$ plain form
5086 316 306 293 282 276 273 273 275 281 294 320 359 404 445 470 476 465 446 422 395 367 348 349 366 384 389 380 369 366 373 386 398 400 388 366 347 339 343 361 392 437 486 531
5069 531 569 600 619 620 606 581 550 518 484 453 431 421 422 431 439 441 436 428 423 421 423 431 441 451 458 465 476 490 502 506 503 494 480 461 435 408 391 387 394 403 415 426 427 411 379
5051 379 343 316 305 310 326 348 373 399 423 443 461 482 503 516 515 503 485 464 437 402 368 344 331 326 326 328 331 331 328 324 324 327 330 330 331 333 334 330 319 308 299 293 290 291 299 308
5033 308 314 319 321 317 304 290 282 282 286 294 307 321 329 332 335 340 342 338 333 330 324 309 290 274 265 262 265 275 291 313 340 371 396 411 415 411 399 376 341 301 265 247 250 271 297 321
5014 321 345 373 401 423 437 446 446 438 432 433 441 445 445 448 458 470 476 472 465 459 456 457 459 459 450 432 412 402 410 429 445 446 436 423 413 403 389 379 378 387 402 417 428 436 439 435 421
4995 421 393 360 337 332 342 351 352 348 348 356 372 388 400 405 404 400 400 403 407 402 388 372 361 354 342 323 302 287 276 267 259 254 252 251 249 245 244 249 258 269 278 288 308 340 372 393 400 398
4976 398 389 372 353 344 356 384 412 428 429 418 403 390 383 377 367 354 345 346 358 376 394 409 412 401 384 373 376 383 387 387 390 399 409 417 419 417 411 404 394 385 380 382 387 387 380 374 378 384 377
4956 377 356 340 345 368 391 401 396 382 367 361 367 382 397 413 430 447 458 463 469 486 516 559 604 637 648 638 616 592 574 569 581 603 625 643 660 684 717 758
4941G58M1L1J6Kpj0qKJ2Q%NK7M4M6L9L6M0M2N0O7Q4R5J13J48J87K10K17K28K53K95L56M48
4928C875N72P27R24J171J461J792K138K379K243J495K27j110k015k312k175j880j571j282
4921F659j032q33o78n48m44l70l19k70k22j81j47j13q3o6n8n3n0m8m5m3m3m7m1k5j4j7k6k5
4909H18j9k3l2l4k0lQJ2RJrj7k1k6k5j5llrr%PMkJJ2K3K4J4ok5l4l5k9j8oKJpj0j1j8k7k7
4892D13j2RK1K3J8OooKRQJJNROjj0j0omj3k2k0jJ8K8K8K6K6K9L5L7K9J3mj7k6k8j9nOJ0J3
4874F19J6J5J4J3Nrk1j9qOJ8L4N1O0O4O5N7M0L8N6P1N9M8P1J20J69K39L56N06O85R50J279
4861E667J400R71L4q94j305j181q79o62n15l78k75k33j94j26p5o6n8k7rk0k8j6j8l8l7kK5
4850A061K4L1N2M5J7J8O1R5R8J08J17Q8M9P7J59K09K28L03M37N50O80R54J364J829K492L480
$$ plain form
4941 758 799 830 846 848 841 831 823 825 837 845 845 850 877 921 967 1006 1042 1082 1124 1174 1241 1325 1420 1533 1681 1868 2078 2295 2523 2776 3071 3427 3875
4928 3875 4447 5174 6098 7269 8730 10522 12660 15039 17282 18777 19004 17894 15879 13567 11392 9512 7941 6659
4921 6659 5627 4794 4116 3568 3124 2754 2435 2165 1943 1762 1615 1502 1419 1353 1295 1242 1192 1144 1099 1056 1013 966 925 900 886 869 843 818
4909 818 799 776 744 710 690 687 695 707 716 717 708 691 670 644 619 604 601 598 589 580 580 587 591 589 590 602 625 649 663 657 632 598 563 534 516 510 512 513 506 496 485 467 440 413
4892 413 401 410 431 454 472 478 472 466 468 477 485 486 487 492 501 507 506 496 486 480 476 463 441 421 420 438 466 494 520 546 575 610 647 676 689 685 668 642 614 595 590 596 606 619
4874 619 635 650 664 677 682 673 652 633 625 631 649 683 734 794 858 923 980 1020 1058 1114 1185 1244 1292 1363 1483 1652 1891 2247 2753 3438 4388 5667
4861 5667 7067 8038 8072 7178 5873 4692 3813 3151 2636 2258 1983 1750 1556 1430 1355 1289 1231 1204 1195 1175 1147 1131 1113 1075 1038 1036 1061
4850 1061 1085 1116 1168 1213 1230 1248 1309 1404 1502 1610 1727 1815 1864 1941 2100 2309 2537 2840 3277 3827 4507 5461 6825 8654 11146 14626
4840A4626M236L614J186j872l771l877l031k252j750j299q99o87n85m34k78k24k16j54q7r9
4832B147j27q8l9n1o0lM3J2k1K0O8N7N9J27J82J64J56K01K00J34J46K86L98M26N41Q03J032
4821F813J208J628K407L321M458O271Q236Q215M484j680o655q068o769n013l836k922k054
4814A0044j490j258j033p33n76n68m85l10k37k69k26j04o8j20j05l2l8q7m3M5L9j2M4J48J50
4804B676J09J74K65K36J92L00M52M74N09P65J104J330J692K486L532M698O501Q973J0158P382
4796E4008P12o142r361q656o532m921l833k799j975j569j306r52o87o39o01m28k95l08l00
4788C416j79j04j49j63p7l5r2j02k1Mn2l9P3J19P3Q7J80J93J34J85L40M01L90N42Q42J058
4778G024J273J821K688L636M938O980Q702P683K874l423p496p900o247m632l588k696j906
$$ plain form
4840 14626 18862 22476 23662 21790 18019 14142 11111 8859 7109 5810 4911 4224 3639 3205 2927 2703 2487 2333 2246 2147
4832 2147 2020 1932 1893 1842 1782 1779 1822 1834 1813 1833 1901 1958 2017 2144 2326 2490 2646 2847 3047 3181 3327 3613 4011 4437 4978 5781 6813
4821 6813 8021 9649 12056 15377 19835 26106 34342 42557 47041 45361 38706 30638 23869 18856 15020 12098 10044
4814 10044 8554 7296 6263 5530 4954 4386 3901 3591 3354 3085 2859 2755 2687 2567 2462 2430 2392 2305 2262 2307 2346 2334 2378 2526 2676
4804 2676 2785 2959 3224 3460 3652 3952 4404 4878 5387 6152 7256 8586 10278 12764 16296 20994 27495 36468 46626 54008
4796 54008 54720 48578 39217 30561 24029 19108 15275 12476 10501 8932 7626 6674 5987 5348 4747 4319 4024 3716 3416
4788 3416 3237 3133 2984 2821 2744 2709 2617 2515 2494 2498 2446 2407 2480 2599 2672 2759 2939 3132 3266 3451 3791 4192 4582 5124 5966 7024
4778 7024 8297 10118 12806 16442 21380 28360 37062 44745 47619 44196 36700 28800 22553 17921 14333 11637 9731
4771I731j458j245r75o82n58n33m28k92k63k76k05j16j26j74j47r1r6j12o4j8m0o2j2L8J7
4761A813LN8J01P3P1J55K21K10K35L71N00N74P67J170J647K203L100M143M247K445o83l286
4752B0138m088l460k549j931j484j075q01o72n49l91k93k75k50j94j63j63j30p1m8o8p3n2
4743A358m5m9l0Jkk8l0j4j2j7KK9L0K0K7L8L1M0J00J72K07K46L50M99O69R28J284J460J074
4732H338J30q55j341j273r80p38n72m24l03k34j93j48j12j00q8o4m6m4m1k3jJj3k8l8l8l0
4721G42j8j2j0n%pk4l2j8LRkj6k6l1l0k6k2k0j8j2pppmNJ1J2PKjpj1j2j1qpoKJ0J3J1ONPN
4703D33loJRJ2MmommnnJNL%OK4M0M4L6K4J4jj4k1j5jPLqj2qMJ4J2Morj3j9k3k0j4j7l1m0k4
4683C67RL9N0M2K6J1JKQJ4J4Nok0l5m2m0l3k6j8j2o%QJ8K1J6Ojoj3j4oLLkJJ2K0J5OQJ8K5
$$ plain form
4771 9731 8273 7028 6053 5371 4813 4280 3852 3560 3297 3021 2816 2700 2574 2400 2253 2162 2066 1954 1890 1872 1832 1770 1758 1796 1813
4761 1813 1816 1874 1975 2048 2119 2274 2495 2705 2940 3311 3811 4385 5152 6322 7969 10172 13272 17415 21662 24107 23424 20138
4752 20138 16050 12590 10041 8110 6626 5551 4750 4078 3529 3138 2845 2570 2320 2126 1963 1800 1670 1599 1551 1483 1410 1358
4743 1358 1313 1264 1234 1235 1233 1205 1175 1161 1149 1132 1134 1163 1193 1213 1240 1278 1309 1349 1449 1621 1828 2074 2424 2923 3592 4520 5804 7264 8338
4732 8338 8468 7613 6272 4999 4019 3281 2709 2285 1982 1748 1555 1407 1295 1195 1107 1043 997 953 912 889 888 889 876 848 810 772 742
4721 742 724 712 702 697 697 690 666 634 616 619 628 626 610 584 553 523 497 475 455 437 425 418 411 404 400 405 416 428 435 437 436 429 418 406 395 387 380 374 376 386 399 410 416 421 428 433
4703 433 430 424 425 434 446 450 446 440 436 432 427 422 423 428 431 431 437 461 501 545 581 605 619 618 604 583 568 567 574 577 569 557 549 553 567 579 583 577 568 555 536 513 493 479 462 431 391 367
4683 367 376 415 465 507 533 544 545 547 555 569 583 588 582 562 527 485 445 412 386 368 356 350 350 358 376 397 413 419 418 412 399 385 379 382 385 383 384 396 416 431 437 445 463 488
4666D88K3J3jj7k6k7k6k4k3j5jJ3K2K6K7K3K2K6L6M1L8L1K5J6Lj2k7l5l9l5k4j4rj5k5k8k2
4651D28rjLJ0J8K1J2qk2k1pRK1K2J4mk3l6l6k8j7rkJ1K4L7M2L5J8Kj1j7j7j8j9k1k4k0oJ4
4635C65L5M2L4J8Mkpj5k6l2l1k4j6j0polkj%PJ7K5K5J2j3l4l8k2MK1K2J4RRQNlpqonpj2j2
4617C27%J3J3KrkJ2K1J8RKpj7k2k6l4m4m4k8lJ6K6K9K8K4J7J2QJ0J7K6L1K5J4L%jnj4k0k1
4600D06j7j3qmMJ0J4J7J8J5Kj5l0l7l7l3k3qPJ6K0J8Oj0j9j2%OLJ%mqpKJ3K2K8L1K6J1mqn
4582C94jnj4j7oJ7L7M3L1Qj1j5roj3k6l3k3nOMkoorj7k3j9j0jKMJ2K3L3M1M7M2K2ql0l3k6
4565C92k0j4LK5M0L7K1Krj3qllj2j9j4lLjj1j7j5rljmlPK5L8L9K8J4L%kmolLOMJJLLjj0k3
4546D67k9k5j5onnnpj5j5lJ7L0L2K4J0nj9k5k6k2j5lRJ6J5J7J4Lj5k1j2KQJrj2rkNJ0J4J7
$$ plain form
4666 488 511 524 523 506 480 453 427 403 380 365 364 377 399 425 452 475 497 523 559 600 638 669 694 710 713 701 674 639 600 565 541 527 518 503 478 450 428
4651 428 419 418 421 431 449 470 482 474 452 431 424 433 454 476 490 486 463 427 391 363 346 337 335 346 370 407 449 484 502 504 493 476 459 441 422 401 377 357 351 365
4635 365 400 442 476 494 498 496 489 474 448 416 385 361 345 335 328 322 319 317 316 316 323 340 365 390 402 389 355 317 295 299 320 342 356 365 374 382 387 384 377 369 363 358 351 339 327
4617 327 327 340 353 355 346 344 356 377 395 404 406 399 382 360 334 300 256 212 184 181 197 223 252 280 304 321 333 341 351 368 394 425 450 464 467 467 466 461 447 427 406
4600 406 389 376 368 364 368 378 392 409 427 442 444 429 399 362 325 292 269 261 268 284 304 322 328 318 299 287 287 293 296 297 297 293 285 278 280 293 315 343 374 400 411 407 399 394
4582 394 393 388 374 357 351 368 405 448 479 487 476 461 452 446 433 407 374 351 346 352 356 354 348 342 333 316 293 274 264 263 265 269 281 304 337 378 425 467 489 481 451 418 392
4565 392 372 358 361 386 426 463 484 486 477 464 456 453 450 438 419 405 402 405 404 393 376 361 352 349 348 344 341 348 373 411 450 478 492 495 495 493 489 483 480 483 489 493 494 495 498 501 500 490 467
4546 467 438 413 398 392 387 382 377 370 355 340 337 354 384 416 440 450 445 426 401 375 353 338 335 344 360 375 392 406 409 394 373 361 363 371 372 363 351 342 340 345 355 369 386
4528C86J7Prj9j6mKjoplknnJJ1J7J7J2J1J2J0jj0j7j9j6pOJ6K0J7J3PJ0K3M2N4M5J9ok1k4
4511E77k2k2k1j8r%Mjprj0j1rnnrj2j1rj5k1j5omqqLJ2J4J1J2J2J0%pj1j1j4j7j5qjLMJ3K7
4493C51L2K0Jrqnl%MMlprj1j2oPJ4Qmj2j6j6oJ6L6L5K1Ojpj0oKOPJ0J0Lj3k4k2j1jOJ1J0R
4473D07RJ2J1Kpj3j9k5k7k3j4poonj%kppNK2L1K7J5QQN%oj4k0j9j0jkj3k0j4KJ5J8J2Njlk
4454C20KJ0J8K0J4Lmj0j4j2lJ1K8M6O0N5L1Lqopj8l4l5k4lJ3J7Oj0j6j0%Lknnqj5k3k6k1p
4437C34PJ4J4RQRONNPMlnmjJMPPK%QJ7J9Qqk4k7j8LK0K8K5J5Lqj6j4oKMkj1k0k5k2j8k1k8
4417C14l0k1kJ5K5L1L4L6L1J7KpmPJ6J9J6Ooj7k3k0j3oj%%konljj%%jnqopj3j4nJ0J7J2Kj
4398C82kljKONLjkpj1j2romlpj1j3oNJ6K0K1J5PJ%LORQMmj5j8j1MJ5J6Qnj8l0l3k5rJ0K6L2
$$ plain form
4528 386 403 410 401 382 366 362 364 363 357 350 347 345 340 335 336 347 364 381 393 404 416 426 425 415 398 379 363 356 362 378 398 415 428 435 445 468 510 564 609 628 622 601 577
4511 577 555 533 512 494 485 485 489 488 481 472 462 451 442 437 432 423 411 400 391 376 355 340 334 330 322 314 317 329 343 354 366 378 388 388 381 370 359 345 328 313 305 304 307 311 324 351
4493 351 383 403 404 395 387 382 379 379 383 387 384 377 368 357 345 339 346 360 368 364 352 336 320 314 330 366 401 422 428 427 420 410 404 406 412 419 429 439 442 429 405 383 372 371 377 388 398 407
4473 407 416 428 439 441 434 421 402 377 350 327 313 306 300 294 289 288 288 286 279 272 277 299 330 357 372 380 388 393 393 387 373 353 334 324 323 321 308 288 274 276 291 309 321 326 325 322 320
4454 320 322 332 350 370 384 387 383 373 359 347 344 355 383 429 489 544 575 578 570 564 557 539 505 470 446 443 456 473 479 469 453 443 443 446 444 439 434 426 411 388 362 341 334
4437 334 341 355 369 378 386 395 401 406 411 418 422 419 414 410 409 410 414 421 428 430 430 438 455 474 482 474 450 423 405 408 428 456 481 496 499 491 475 461 455 457 461 459 448 428 403 381 363 342 314
4417 314 284 263 261 276 301 332 366 402 433 450 452 445 441 448 464 483 499 505 499 482 459 439 426 420 419 419 419 417 411 406 403 402 401 401 401 400 395 387 381 374 361 347 342 352 369 381 383 382
4398 382 380 377 376 378 384 389 392 391 389 382 371 359 350 344 340 337 330 319 306 300 305 321 341 362 377 384 385 385 388 394 403 411 415 411 396 378 367 371 386 402 410 405 387 357 324 299 290 300 326 358
4378C58L2K7K2J6J2RO%kmoqj0j8k8l7l1j2Jjj2j6j1KJ2J9J9Qoj0mJNJ2K1K4J1nj3j2j5k0j8
4361C18j2nkjlrj3j0%J5K4K9L1K6J4lk1k6j4PJ8J3OJ0J9K0OopmmoJJ0J5J6K1K8L0K1Qkpj0
4343E41j1rmLRJ3J2Pnj7k2k0j3j2j5j8qPK1K0Rok3l3l4k0jJ4K0J8J2Okj1k1k9l0j7NK2K1P
4326C86rj2pjkolOJ5J7J3NJk%MPOLkoj0j4j0kPRNMMLqk1l1l3l0j8jJ4J9J5J0OLKLPJ1J3J4
4306C84J6J3RQLnj7k2j6qnqj2rlNJ4K1K1J5J2J3J0OJmj3k7m0m1l0j5jRJ8K9L7M2L9K8J1jk
4289D85jjnrnLJ0J0RQOkj8l3l4k2mPMrk2k7k4j8r%J1J8J6QJjkoj1pPJ9K5K3K2J6Nqj0lMjj5
4269D10k1j7p%lpj1j2j0j0j1j1j2qlNJ2J4PJ%QK2L0L0K2J4J0RJ0OKnj3j9k0j7j5j6j5qlko
4252C30qkKM%nqmPJ7K1J6J0N%ljOPjqqLJ5K0J7Qkj2j8k0k2k2j7j0nllknrpNK1K9K9K0Oj1k1
$$ plain form
4378 358 390 417 439 455 467 476 482 482 480 476 470 462 452 434 406 369 338 326 327 326 314 298 287 289 301 320 339 347 341 331 327 328 333 345 366 390 401 396 383 371 356 336 318
4361 318 306 301 299 298 295 286 273 263 263 278 302 331 362 388 402 399 378 352 338 345 363 376 382 392 411 431 437 431 424 420 416 410 411 421 436 452 473 501 531 552 560 558 551 541
4343 541 530 521 517 520 529 542 554 561 556 539 517 497 484 472 457 439 431 438 459 479 488 482 459 426 392 372 371 385 405 423 435 441 439 428 407 378 348 331 336 358 379 386
4326 386 377 365 358 357 355 349 346 352 367 384 397 402 403 401 401 405 412 418 421 419 413 403 389 379 377 384 393 398 402 406 409 401 380 349 316 286 268 267 281 300 315 325 331 334 336 339 346 357 370 384
4306 384 400 413 422 430 433 428 411 389 373 365 360 352 340 331 328 333 347 368 389 404 416 429 439 445 446 442 429 402 362 321 291 276 275 284 302 331 368 410 449 477 488 487 485
4289 485 484 483 478 469 464 467 477 487 496 504 510 508 490 457 423 401 397 404 408 399 377 350 326 308 299 299 310 328 344 352 353 352 350 344 333 326 333 352 377 400 422 438 443 435 425 422 426 425 410
4269 410 389 372 365 365 362 355 344 332 322 312 301 290 278 270 267 272 284 298 305 306 306 314 336 366 396 418 432 442 451 461 467 469 464 451 432 412 395 380 364 349 341 338 336 330
4252 330 322 320 322 326 326 321 313 309 316 333 354 370 380 385 385 382 381 387 394 393 385 377 380 395 415 432 440 438 426 408 388 366 344 327 317 312 309 306 304 299 290 283 288 309 338 367 387 393 382 361
4232C61k2j8j7j5pNJ3J3J5J8J8PpoJ0K6K8J5kj5k3k0pJ0K0J7J3J6J8J5Lj1k2k5j9qOJ8K5K4
4215D70J6Lmj2k0l1k9j6MJ7K2K0J0pj8j8rJPJ2J5R%nkJkqj0j0j4j7j6pJJnrjJ8L1L1J9Kj3
4197D27k1k3j6roqrponjRRnj8j9pKPJ8L4L8K3jj3oJ2L1M2M3L9K6Qrk1k4j4kMlj4j9j3lLOJ3
4179D92K4L2K7J4M%lpj1j4j8k3k4k2k0k2k2j5mMMkj2j7j8j2omJRJ5Qoj6j6pOJ6K7L3L7L4K4
4161D90Rqj8j7j7j7k0j9j5j1j0rqrj0qkNQQ%qj1qmLOQRJ0J6K0J7Kj1j6j6j4j1onj5k8l0j7
4143B13LK0K9K9K6K1J8J8J9K0K1K3J6MoqmJQJ1Rmj6k0j9j4j5j6j7j5j0ooj2j3kJ4K2J6J1J2
4127C81J6J5QNRJ0Kj4k5k5j5rj2j4qJM%ljJOJ1K0K5K6K8K8K2Qprqj1j7j8j3mJ0K5L1J5j5l2
4109D47k8j0KNOO%rqJQMqj4j6j2j1qnkJOQQPJ2J8J7NmlOJ4J5J5J5J0Kpj1j7k5k5j7kPPLJj
$$ plain form
4232 361 339 321 304 289 282 287 300 313 328 346 364 371 364 358 368 394 422 437 435 420 397 377 370 380 400 417 430 446 464 479 482 471 449 424 405 397 403 421 446 470
4215 470 486 489 485 473 453 422 393 377 381 398 420 440 450 443 425 407 398 399 406 418 433 442 442 437 435 436 434 426 416 406 392 375 359 352 353 354 349 340 339 357 388 419 438 440 427
4197 427 406 383 367 358 352 344 335 328 322 317 316 325 334 329 311 292 285 287 294 312 346 384 407 406 393 387 399 430 472 515 554 580 588 579 558 534 520 518 522 519 505 486 473 470 473 479 492
4179 492 516 548 575 589 593 593 590 583 572 558 540 517 493 471 451 429 407 392 388 392 396 394 382 365 347 335 329 325 326 335 350 358 352 336 320 313 319 335 362 395 432 466 490
4161 490 499 491 473 456 439 422 402 383 368 357 347 338 330 321 311 303 301 306 314 322 322 314 303 295 291 294 300 308 317 327 343 363 380 382 371 355 339 325 314 308 303 288 260 230 213
4143 213 216 236 265 294 320 341 359 377 396 416 437 460 476 480 474 466 462 463 471 482 491 487 471 451 432 418 403 387 370 355 345 339 333 321 308 306 320 342 358 369 381
4127 381 397 412 420 425 434 444 446 432 407 382 367 358 346 332 324 325 329 329 326 325 326 332 343 363 388 414 442 470 492 500 493 484 476 465 448 430 417 413 423 448 479 494 479 447
4109 447 419 409 411 416 422 428 428 419 411 412 420 424 416 402 386 374 363 355 350 348 349 355 363 371 378 390 408 425 430 426 423 429 443 458 473 488 498 500 493 482 465 440 415 398 396 403 410 413 414 413
4089D13%MJ3K1K1Rqk1k4j7lM%rj2rkOJ1J1Lpj3rJRPkj2j8k2k1j5lLlj7k3j6pnjJ2K8K8J6N
4070C26MMlj0mJ6L7M8M3L0K0J7J3%j3j9j2pj0j7k2k7l3l5k4mNJmKJ3J5J0QJ2J2%j5k1j5kJ2
4053C51K0K1J4Lnprj2j6k2k4k0j0%QJ2J6K0K1K1J6Mj1k3k2qOJ3J2J1J6K3K6K3J4Lqj6k5k8
4037D08k2j1JPJ4J6J1%j2j7j6j3lOR%j0j2j0j3k1j7mJ2J7J5J3J5J5J0Mkqj0j3k2l0l0k1qO
4021B54J8K4K5J6RQNlj2j8j3mPJ5J7J4J0J1J9K6K8K3Nk2m8n7n0l7k3r%NLNJ2J7J6J3J1Plj6
4004C08k6l0l2k8j6MK2L0K6J8J5K3L3M1M2L6L3K7J4j3m0n0l6rJ0J2OLJlj1k0k7l1k8j8kJ2
3989B96J9J9J2Jrj5j3qlJLOJ2K6L8M1L5K5J4Noj1pKROnk3m1n3n1l3j1RJ7J2%plKJpj5j4j2
3971B64j3rLJ6K0Qoj3j0pn%J1J9J6Lj0rKJ6K1K1J2jj4j9j2OJ9K1J1%pqmJ1K8M5N0M0J6rk4
$$ plain form
4089 413 413 417 430 451 472 481 473 452 428 411 408 412 412 403 391 382 380 386 397 408 411 404 391 382 383 392 399 397 385 367 345 324 309 306 309 306 289 266 250 243 238 237 249 277 305 321 326
4070 326 330 334 331 321 317 333 370 418 461 491 511 528 541 541 528 509 497 490 480 463 441 414 381 346 322 318 323 324 320 322 335 350 360 368 380 392 392 377 356 341 339 351
4053 351 371 392 406 409 404 397 388 376 360 338 314 294 284 284 292 304 320 340 361 382 398 402 391 368 346 338 344 357 369 380 396 419 445 468 482 485 477 461 436 408
4037 408 386 375 376 383 397 413 424 424 412 395 379 366 363 369 378 378 368 356 346 333 312 295 291 303 320 335 348 363 378 388 392 390 382 372 359 337 307 277 256 248 254
4021 254 272 296 321 337 346 354 359 356 344 326 313 309 316 331 348 362 372 383 402 428 456 479 484 462 414 357 307 270 247 238 238 243 246 251 263 280 296 309 320 327 324 308
4004 308 282 252 220 192 176 180 202 232 258 276 291 314 347 388 430 466 499 526 540 527 487 437 401 392 402 414 420 423 424 421 410 390 363 332 304 286 284 296
3989 296 315 334 346 347 338 323 310 302 299 300 303 309 321 347 385 426 461 486 500 505 499 488 481 483 492 498 493 470 429 376 325 292 281 290 307 319 319 312 309 311 312 305 290 276 264
3971 264 251 242 245 261 281 289 283 270 260 253 248 248 259 278 294 297 287 278 280 296 317 338 350 349 335 316 304 310 329 350 361 361 354 346 342 353 381 426 476 516 532 523 499
3953D99k3j4j0j4j5rlnj1j5j3qokKNOMMNLK%mnkMJ0RQJ3J5Rpk1k6j8oQJ7J5Nnpm%NJ7K8L3
3933D73K7J9RJj2k2k4j9j3j2j8l0m6o0o1l7LL8N0M5L0J8Nj1k2j8pPJ3J3J0Lnj2j5qNJ8K3K6
3917C84K9K7J4qk5k2oOPNLNMjj2k6l6l2j4QJ9K0J7J7K0K9M1M2K9Lj6k0j3j1j8k7k8j7LJ6J7
3901D33Qoj7j9j2lJOJ3K3K4J3jj0j1j4j6j3jOL%MJ0J0OQJ8K2J2lj2j4j7k1k3k1j9j8j3oJJ
3883C32nj4j9j3LJ3J2NNJ5K3J9QkpolKLJmj0j6j8j6j0nk%MPPRJ0N%LRJ5J6J8K0J7Lj2j8j6
3864C88j7j9j0OJ6J3%qj0j1j0ojLQJ0RMjqj3j7j6rKJ8L3M0K7OqpLLlrmOJ1QKMJ3J9J5Kopo
3845D63ookjqj7k3k3k0j9k0j7j1KJ2J5J0J1J7K0J2jqomoj4k2k4j6jJ2J6J3J0J1QJ%MJ1J5J3
3828D01J2J1RJpj7k4k6k4j5qmkl%PJ6K4K9K9K0Mj3k1k0j4j0kQJ6J7J5J6J6RLMJ2J1kk2l3l2
$$ plain form
3953 499 476 462 452 438 423 414 411 406 395 380 367 359 353 351 353 358 364 368 372 377 380 382 382 378 373 371 375 385 394 402 415 430 439 432 411 385 367 361 369 386 401 406 401 394 390 390 395 412 440 473
3933 473 500 519 528 529 517 495 471 452 439 427 409 379 333 273 212 175 178 216 266 311 341 359 364 353 331 313 306 313 326 339 349 352 347 335 320 312 317 335 358 384
3917 384 413 440 454 446 421 399 393 399 406 411 414 419 423 422 410 384 348 316 302 310 329 349 366 383 403 432 473 515 544 547 531 511 498 487 469 442 414 397 400 416 433
3901 433 441 435 418 399 387 384 385 391 404 427 451 464 463 453 442 428 412 399 398 404 407 407 411 421 431 437 445 463 485 497 494 482 468 451 430 407 386 367 349 336 330 331 332
3883 332 327 313 294 281 284 297 309 314 319 334 357 376 384 382 375 369 366 368 371 372 368 358 342 324 308 298 293 291 291 295 302 309 318 328 333 333 336 345 360 376 394 414 431 434 422 404 388
3864 388 371 352 342 348 364 377 377 369 359 348 338 332 331 334 342 352 361 365 364 356 343 326 310 301 303 321 354 394 421 427 419 412 415 418 415 406 402 408 419 427 429 433 446 465 480 482 476 469 463
3845 463 457 451 449 448 440 423 400 377 357 338 318 301 290 292 304 319 329 340 357 377 389 388 380 374 370 364 350 328 304 288 287 299 315 328 338 349 357 358 358 362 373 388 401
3828 401 413 424 433 434 427 410 386 360 336 321 313 309 307 304 304 311 327 351 380 409 429 433 420 399 379 365 355 353 361 377 394 409 425 441 450 453 457 469 480 478 456 423 391
3810C91j8JJ6K0J1mj9l0l8l8k7j1KRJ3J8K1K2J7J0QJ2K1K1Roj7k1k6k7k0nQJ2J0J0J2J3RK
3794C91mmMJ6J8J0mj8k7l2k9j8okkmkjlmpj2j6qPJ5J5J4K2K6J9PknqrpKOJ0J7K7K8J6%qrq
3775D11ooj0j0pJJj0j8j4%J1J3PJpj1rJJ3K2K3J0pk7l7l6k4nQJ2J0J4K0K5K0J0MLMOJ0Pjj0
3757D12rJJ5K2K5J9Pqj9j9j1lLJlqj2j2j3j3j2rpj3k0k0rQJ8J5Mrj9j8j0%QQNLNNOONMJkl
3737C25JRJ4J2Kj5k7l2k6k0j3pKJ2J8K0K5L2L5K5Pqj1ppqmLNKpj3j7j7qMJ6K1K2K3K1J1lj0
3720D07j0olklqj1rm%j%NJ0Nqj9k2k2k1k1j7nMMkjJ3L2M0L5K4J6J0Llqj7l1m2m5l3j1J2K1
3701B56J5%rrmjkJRJ8K3K0J1JopKJ7K8L1K5J6Mqj7j1LJ5J3NJNMpk2k9k6j7q%PJ5K2K8K6J8
3683D56J1J1J1P%jKOP%j2k2k6k5k3k9l6l8l5l1k6k3j3%J5K4K3J8J8K5L4L7L3K5J8J0Njno%
$$ plain form
3810 391 373 374 390 410 421 417 398 368 330 292 265 254 256 265 278 296 317 339 356 366 374 386 407 428 437 431 414 393 367 340 320 315 323 335 345 355 367 380 389 391
3794 391 387 383 387 403 421 431 427 409 382 350 321 303 297 295 293 289 287 286 283 279 272 260 244 236 243 258 273 287 309 335 354 361 359 354 346 337 330 332 338 348 365 392 420 436 436 428 419 411
3775 411 405 399 389 379 372 373 374 364 346 332 332 343 356 363 364 357 346 337 338 351 373 396 406 399 372 335 299 275 270 278 290 300 314 334 359 379 389 393 396 400 406 416 423 422 412
3757 412 403 404 419 441 466 485 492 484 465 446 435 432 435 436 433 425 413 401 388 375 363 354 347 334 314 294 285 293 311 326 330 321 302 284 274 274 282 290 295 298 303 308 314 320 325 329 330 328 325
3737 325 326 335 349 361 363 348 321 289 263 243 230 223 225 237 255 275 300 332 367 392 399 391 380 373 366 358 354 357 362 364 357 344 327 310 302 306 322 343 365 388 409 420 417 407
3720 407 397 391 388 386 383 375 364 355 351 351 350 350 355 365 370 362 343 321 299 278 257 240 235 239 243 241 240 253 285 325 360 384 400 410 413 410 402 385 354 312 267 234 223 235 256
3701 256 271 271 262 253 249 248 246 247 256 274 297 317 328 329 323 316 318 335 363 394 419 435 439 431 414 403 406 421 434 439 440 445 449 442 420 391 365 348 340 340 347 362 384 412 438 456
3683 456 467 478 489 496 496 495 497 503 510 510 498 476 450 425 402 373 337 299 264 233 207 184 171 171 186 210 233 251 269 294 328 365 398 423 441 451 456 455 450 444 444
3667D44J4K5K4J2mj7k4j9oJ0K1K1J2nk3l5l3k1p%Kmj4k6l0k4j1jNJ1J2J0Nkqj1rnjllMJ4J8
3649C18J1LKQJ2Q%mJJ3K2K1Pj3k3j7lM%rj5j4j0n%MPNkj0j6j2jJ2J4R%j0j8k4k0rOJ6K4K8
3630C20K6J7Kqj0nmqj2j1mKQJ7K2K0J3OLkj0j8j4m%lj3j8j8j5qJPJ1RLJQK1L2L2K2J0NKMO
3612D45PRJ1R%j8l2k6rjnj5k0k4k8k4rOPmj8k2j7oJ1K5K6J6L%LRJ1J1RO%j0j7j3JJ2J6J1P
3593C53NPJ2J3Mj1j9j3%OLJLMJqj5j9k0j5j2pmNJ8K4K2J6J5K1K3J7Jj5k1j7j5k0k5k0oQJ4
3576C14J5J1Kj4k4k2qNJ6K0K0J5Mnp%J0J5Qoj5j0%PRJ0J0QONNNNLlnkOJ1QL%mj8l2l0qJ8K9
3557C90K9K2J8J1Jpj1o%NKnj3j5j1nl%LPJ0Qkj5l0m0l9k6oPRPQJ6J6NppKNlj3j6rlKJ0J8K3
3537C42K7L7N0N2L4Nk3l7l9l8l4k9j9qLJ0QKnopqpjRJ0Lrj2nOJ3J7K0K1J3KlKJ1J2LnnOJ7
$$ plain form
3667 444 458 483 507 519 515 498 474 455 449 459 480 501 513 508 485 450 417 396 389 389 391 387 373 347 317 293 282 281 286 297 309 319 324 322 314 303 294 289 288 285 282 286 300 318
3649 318 329 332 334 342 354 362 362 358 359 372 394 415 422 409 386 369 366 370 370 361 346 332 322 317 317 321 328 333 331 321 305 293 292 304 318 327 327 317 299 275 255 246 252 268 292 320
3630 320 346 363 365 357 347 342 338 330 318 307 303 305 313 330 352 372 385 391 394 392 382 364 350 346 346 343 330 312 294 279 271 272 279 290 299 302 303 311 332 364 396 418 428 433 435 439 445
3612 445 452 461 472 481 481 463 431 405 396 395 390 375 355 331 303 279 270 276 283 279 261 239 222 216 227 252 278 294 297 297 300 309 320 331 340 346 346 336 319 306 307 319 335 346 353
3593 353 358 365 377 390 394 383 364 351 351 357 360 361 364 368 369 361 346 327 307 292 280 273 269 274 292 316 338 354 369 390 413 430 431 416 395 378 363 343 318 298 292 300 314
3576 314 329 340 342 328 304 282 274 279 295 315 335 350 354 349 342 342 352 367 375 369 354 344 344 351 360 370 380 388 394 399 404 409 414 417 414 409 407 413 424 432 435 435 431 413 381 351 343 361 390
3557 390 419 441 459 470 471 464 453 447 447 452 454 449 436 421 410 405 402 402 405 412 422 430 428 413 383 343 304 278 272 279 288 295 303 319 335 340 333 326 328 333 330 317 301 292 289 291 301 319 342
3537 342 369 406 456 508 542 547 524 487 448 410 376 347 328 320 323 333 341 343 338 332 325 317 310 309 318 328 331 322 310 305 311 324 341 361 382 395 397 394 396 407 419 422 417 412 418 435
3518D35K1J1lj3j5j1pqpmllljKKNJ4K2K1J4N%lkOJ3J1jj2j6j7j4rmkpj2j0jOLlpol%%MQJ0
3498D06%j9l1l1k2j3qJJ4K5K8K2J3Mmj1j6j9j7j1kNLoj4j5pKOLjOK1L4L7K7J4PKjkJKlj7l5
3479C78m4m0k5qOJ6K0K2K0J0kj4k0k0j1LK1L0K9K0RKlprj5k6m0m2l1j1RK3K8K5J6PPRJ0OK
3463C60JLNPRJ0Mlrj0rj0pMJ9K2Rrj1LJ6J5Mmmmj3k3k8k3j3onj2k1k3j4OK3L0K4J8J0M%kj
3444C42%KRK0K7K1ROJ5L2L8K8Nj5k3j9j1qrj5j9j8j2lJlj4j7nJ0J4%j7k9l0k5j8j0JJ4K0J7
3427C11Nnp%PJ3J5J2Mlj1j1j0rj0j3j5j1okmqmOJ4J5J1J5K5L2K6J0oj2pjMJnj5k4l3l1j6Q
3409B55K6L1K6J6Pjorokmrj1JK2L8L9K1KrpLJ3J7J3NjjJ%qj8k6k6j8lQJ1QMLKjprpolLPNj
3388C88okPJ5J1lk2l5l3j3J1K6K6J8Lj4k8l0j8ropkOQOJ0K4L5L4K8K7K7J8Kj3j3jJ0Poj7k2
$$ plain form
3518 435 456 467 464 451 436 425 418 410 403 399 396 393 390 389 391 393 398 412 434 455 469 474 474 471 469 475 488 499 498 486 470 453 439 430 426 424 417 405 395 394 400 403 400 393 387 384 384 384 388 396 406
3498 406 406 387 356 325 303 290 282 283 297 322 350 372 385 389 385 374 358 339 322 311 309 314 317 311 297 282 275 277 283 286 285 291 312 346 383 410 424 431 433 432 430 431 433 430 413 378
3479 378 334 294 269 261 267 283 303 325 345 355 353 339 319 299 288 291 312 342 371 391 400 402 399 392 383 368 342 302 260 229 218 227 250 278 303 319 326 333 342 352 358 360
3463 360 361 364 369 376 385 395 399 396 387 377 368 358 351 355 374 396 405 396 385 388 404 419 423 419 415 411 398 375 347 324 311 305 300 288 267 244 230 236 259 289 313 331 341 345 345 343 342
3444 342 342 344 353 373 400 421 430 436 451 483 521 549 554 539 516 497 486 478 469 454 435 417 405 402 403 400 386 369 364 374 388 388 371 342 312 287 269 259 260 274 294 311
3427 311 316 311 304 304 311 324 339 351 355 352 341 330 320 311 301 288 273 262 256 254 250 242 238 244 258 273 284 299 324 356 382 392 386 374 367 366 370 371 366 351 327 294 263 247 255
3409 255 281 312 338 354 361 360 354 345 339 337 333 324 313 314 336 374 413 434 436 427 420 423 436 453 466 471 470 469 470 470 462 444 418 392 374 371 379 390 398 402 405 407 406 399 390 383 377 374 377 384 389 388
3388 388 382 380 387 402 413 410 388 353 320 307 318 344 370 388 391 377 349 319 301 292 286 279 277 283 291 297 307 331 366 400 428 455 482 500 502 489 476 475 485 492 486 469 447
3371D47j7nJ0K4K9J9OJQJ2Lj6k9k8k2j6pMJ9K4J6%j2j0jLjj0j3j0prj7k9l9l6j9KJ4J4RQJ0
3353C29J0P%qj5j2kRJ1J0J2J6Qj2k9k6qJ0J6J4RNKMJ2K0J9J3NJjlJQJ1Mrj4j0oj0k1k4k0j1
3335C25rrpNK0K7K4K0J2Morqnrj2j6j7k1j5jJ6K3J7OjlkNJ6J6Mqj2qoj2k0k6k5j2KJ0OJMJ1
3316B95J1MLJ1J7J4PJNJ0J7K0J7J0Mlj2j7j3kOJ0J5K2K4J5%pnKPJ1J1Jj6k8k9k2j0kMKnpl
3298C95LNjqj2j1pKQJ0MjLJ8K7K3Kj7k3j7j4j8j8j0MJ3J3Npk0k2j2KJ0QLKOJ2J9K4K6J9Pm
3280D51j5k7m1m9m6l5k3j1LJ6K4K3K5K7K9K3J0oj7k0j6j1j0oKJ0J0JljJ0J6J7J2MnnMK1L2
3264D23L0J4pk3l1k8k2k0j6j0mmm%PNnj3j2lJ0K0K7K6K2K1J8J1KjKOMmj5k1k2j4l%pj9k3j8
3247B99j4rmjLNJ2K0K4K4J7Ppj5j9j8j7j0NJ8K1J3KKQJ5J4Kj3k4k4k2k4k8k2oJ0J5J6J5J5
$$ plain form
3371 447 430 425 435 459 488 507 513 514 522 534 537 521 492 464 442 426 419 423 442 466 482 482 470 460 459 462 461 451 438 428 421 412 395 366 327 291 272 274 288 302 311 319 329
3353 329 339 346 346 338 323 311 309 318 329 339 351 367 375 363 334 308 300 310 326 340 349 354 356 360 372 392 411 424 429 430 429 426 427 435 446 450 441 427 417 411 401 380 356 336 325
3335 325 316 307 300 305 325 352 376 396 408 412 406 397 389 384 375 363 347 330 309 294 293 309 332 349 355 354 351 349 354 370 386 390 382 370 362 356 344 324 298 273 261 263 273 279 280 284 295
3316 295 306 310 313 324 341 355 362 363 368 378 395 415 432 442 446 443 431 414 401 399 405 415 430 452 476 491 491 484 479 481 488 499 510 511 495 467 438 416 406 404 408 410 405 398 395
3298 395 398 403 402 394 382 371 364 366 374 384 388 387 390 408 435 458 460 443 420 403 389 371 353 343 347 360 373 378 371 351 329 317 319 329 337 340 342 348 360 379 403 429 448 455 451
3280 451 436 409 368 319 273 238 215 204 207 223 247 270 295 322 351 374 384 378 361 341 325 314 304 298 300 310 320 321 318 317 327 343 360 372 376 371 366 370 391 423
3264 423 453 467 460 437 406 378 356 336 320 310 306 302 298 298 305 310 305 292 280 277 287 307 334 360 382 403 421 432 434 433 435 441 445 441 426 405 383 369 366 366 359 340 317 299
3247 299 285 276 272 271 274 279 291 311 335 359 376 383 376 361 342 324 307 297 302 320 341 354 356 358 366 381 395 397 384 360 336 314 290 262 240 234 244 259 275 290 305
3230C05J2OKKMOJ0J6L1M8N6M3J5j1k0j5pkmqj4j8k0k2j9oPJ2OJj%jorj3j8j8rKJ1J2J1J2J4
3212D03J5J8J9J5MorkMROpk2l0k8j5%J3K3K6K8K5K1J4Nkrj5k1k1j5JJ5K2J9Pmnkkrk0k9l8
3194D01m2m2l4j5J3L2L2J4rk3k6k5k1j6porqJJ6K5K4J9J5J6K0K5L4L9L9K7J2jnkKKmqj1oJ
3177D89Mlj7k7k1rjLLORJ0J3J9K2J8Opj4j6j7k3l2l4k7j0PJ5J4QLJKOJ1J1Npj1qJQLpj0%J3
3159D09K1J8J3Nlj5k5k3j0NJ3J3ROjj6l4m1l1rOJ0PQJ5J4jj6k1j4qqp%QPj%PK2L3L7L2J7m
3141D47j8k0j7j3j1qprj7k3j8nJ3K8L6L3K3J1OJ1J8J7Qnj8l0l8l5k0jJ4K3K7K6J3qk5k9k2
3125C57j2norrmNJ5K5L2L1K1QL%nj2j2jOPJ%MJ0J4J5J3Qjj1k2k9k8j6l%qj8j7lJ6K7K3J3J0
3106D33J8K8K3Lj5k3k2k0j3JJ9K9K8J7Mk%OOkj1j1nLMMRRMmqmjnj7k7k8k3j5pKQR%j1k0k9
$$ plain form
3230 305 317 323 325 327 331 337 347 363 394 442 498 541 556 545 525 510 503 501 497 489 475 457 437 415 396 390 397 409 415 416 415 415 414 408 399 386 368 350 341 343 354 366 377 389 403
3212 403 418 436 455 470 474 468 459 457 461 470 476 469 447 417 389 374 374 387 410 436 464 489 510 524 529 527 518 503 482 461 446 447 462 484 503 510 506 501 499 497 488 468 439 401
3194 401 359 317 283 268 281 313 345 359 350 327 301 276 255 239 232 226 217 209 210 226 251 275 294 309 325 345 370 404 443 482 509 521 520 515 513 515 517 513 505 494 488 489
3177 489 493 490 473 446 425 416 415 418 421 427 436 446 459 478 500 518 524 517 503 487 470 447 415 381 354 344 351 366 380 388 391 392 394 400 411 422 427 420 409 401 402 410 413 406 396 396 409
3159 409 430 448 461 466 463 448 423 400 390 395 408 421 430 436 435 419 385 344 313 304 310 320 327 335 350 364 363 347 326 312 304 296 289 289 297 304 303 303 310 332 365 402 434 451 447
3141 447 429 409 392 379 368 360 353 344 327 304 286 281 294 322 358 391 414 425 431 442 460 477 485 480 462 432 394 359 339 338 352 375 402 428 441 433 408 379 357
3125 357 345 340 334 325 316 312 317 332 357 389 420 441 449 452 452 447 435 423 422 428 435 436 436 440 450 464 479 492 500 499 488 466 437 409 393 390 390 382 364 347 344 360 387 410 423 433
3106 433 451 479 502 505 490 467 445 425 412 413 432 461 489 506 510 508 508 514 520 518 507 496 491 494 498 502 511 520 524 520 512 508 507 502 485 458 430 407 392 385 387 395 404 404 393 373 344
3088C44l7l8l0j2QJ5J3Mlm%NMLJ0K3K8K4J1MMQQRJ1J7K3K6K4J3Lmj1k3l1k6pQRkj4j9j9j8
3070C61j0m%jJOP%rj6j3mRK3L4M0M0L6K7J4mj8k5k5k0j3j0j2j4j0llj2j6qOQJpnMJ0RQONO
3051C99J2K2K7K4Rnj1nJnk5m1m4l7l0k7j7jJ4K3L0L6L3J8%j1j5k1k8k6j9j0m%NJ2J4J0NKP
3035C21J8K1Qj1k3j9nRJ5J4J0OJ2K0K6K2J3RJ0P%njMjj8l5l7k5j0nqj4j6pPK2K4J2mj5j3q
3017C30%J2K9L9L3K3J7K2K4J8Mmppj2j9k2k0j1moj2j8j9j6j2o%%pj6j8j3mMNjj0j0MK5L5K3
3000C73Kj3j4nQJ7K0J4PKKL%nj5k4k9k5j6nRJ8J9Mj2j6pLPRJ4J8J4Njnnl%Joj8k5j7%J5K2
2981C40J9J4J3J8K0J6Nnj8k6k8j8nMLjKQJ2Omo%QJ0M%LQKj0j8j6oMJ1J0Jrr%NMkjlj0j8j7
2961C20rkLRJ4J0jj0j0pqj0pMJ5J7J1NJMQJ1J1P%qj6k2k6k5k0j2nmjNJ7K6K5J5lj8k0rMNp
$$ plain form
3088 344 307 269 239 227 235 250 263 267 264 260 260 265 269 272 282 305 333 357 368 372 376 384 392 401 412 429 452 478 502 515 518 514 503 480 449 423 416 424 433 431 417 398 379 361
3070 361 351 347 347 346 347 353 360 360 351 335 322 318 327 350 384 424 464 500 527 541 537 519 494 469 449 436 426 414 400 390 387 384 372 356 348 354 362 363 356 351 355 365 374 382 388 393 399
3051 399 411 433 460 484 493 488 477 472 473 468 443 402 358 321 291 264 247 246 260 283 313 349 382 400 400 389 374 353 325 299 280 270 266 266 271 283 297 307 312 314 321
3035 321 339 360 368 357 334 315 310 319 334 348 358 364 376 396 422 444 457 466 476 483 483 478 477 481 480 462 427 390 365 355 350 342 328 312 305 312 334 358 370 366 351 338 330
3017 330 330 342 371 410 443 466 483 505 529 547 551 547 540 533 521 502 480 460 449 445 439 427 409 390 374 362 356 356 356 349 333 315 302 298 302 307 306 296 286 290 315 350 373
3000 373 375 362 348 343 351 368 388 402 409 411 413 416 416 411 396 372 343 318 302 297 306 324 343 347 335 319 312 315 322 331 345 363 377 382 381 376 371 368 368 369 363 345 320 303 303 318 340
2981 340 359 373 386 404 424 440 445 440 422 396 368 350 345 349 352 351 353 361 373 379 375 369 369 377 387 391 391 394 402 404 394 376 360 354 358 369 379 380 371 362 362 367 371 369 368 365 355 337 320
2961 320 311 309 312 321 335 345 344 334 324 317 309 299 292 296 311 328 339 344 345 349 357 368 379 386 386 378 362 340 314 289 269 257 252 248 247 252 269 295 320 335 332 314 294 285 289 294 287
2943B87j7j6JK6M7N1L9K2J4J2RJjOJ4J6J5J1Npj9k4k1j5rjLMMNRPjrrkONoj6j9j1nqj5j8j4
2924C56n%K%JLOLln%OJ1J7K2J7Mrj3rj2k3l3l1j4QK1K3J8J3J4J2J0Nlj5k6l0k5j6j0rpjJ1
2906B84K6M0M1K5Jj6k1k2k3j7oKNQJ4K0J8RJlj0k0k4k1j3omoj0j1nOJ7K0J8J4RQJ3K2K6J6
2889D25Lmklj3j9j4l%opJOJolQJ4RJlqj3j5j0mlmmJNRJ3J4J0kj5k3k3j7j1j0rmJ1K4K0Lj2
2869C08j2%RQKjKNOOQJ5J9J9J5Noj6k1j9j2pnokNJ2J4RNMKkj1j6j2lNJopLJ4J5P%JQQ%j7l1
2848C28l5k8j6mJ1K5M0M3L5J7jj3k1k0j3%J0J4J6J7J9J8J4J2QJj0j4j3mLLlrj4j6j6j6j7j4
2832C37rnmqpKJ5K2J8J0PNmj5j8j0knrqknj8k8k0NK7L5K7K0J8K0J7Plj0j4k0k3j8nJ1K0K1
2814C74J7J8K0K1J7PlrlQJ4Qmj6k1k2k3j8qKPQQM%jMPJnjJ2K1J8Mj0k3l3l1k0nJlkOJ7K5K6
$$ plain form
2943 287 270 254 255 281 328 379 418 440 454 466 475 476 475 481 495 511 526 537 542 535 516 492 471 456 447 446 449 453 457 462 471 478 477 468 459 457 463 468 462 446 427 416 411 403 388 370 356
2924 356 351 351 353 353 354 357 363 366 363 358 358 364 375 392 414 431 435 426 413 404 392 369 336 305 291 299 320 343 361 374 388 400 410 415 412 397 371 341 316 300 290 281 274 273 284
2906 284 310 350 391 416 417 401 380 358 335 318 312 314 319 327 341 361 379 388 389 386 376 356 332 311 298 292 288 282 272 261 256 262 279 299 317 331 340 348 361 383 409 425
2889 425 428 424 422 419 406 387 373 370 370 364 357 358 364 365 359 356 364 378 387 388 385 377 364 349 339 335 332 328 324 325 330 339 352 366 376 374 359 336 313 296 285 275 266 262 273 297 317 320 308
2869 308 296 296 305 313 315 314 316 321 327 333 341 356 375 394 409 414 408 392 371 352 340 333 328 322 320 325 337 351 360 365 369 371 369 358 342 330 327 332 333 327 320 323 337 352 359 359 360 368 376 376 359 328
2848 328 293 265 249 245 256 281 321 364 399 416 415 402 381 361 348 348 358 372 388 405 424 442 456 468 476 477 467 453 440 436 439 442 439 430 416 400 384 368 351 337
2832 337 328 323 319 311 304 306 321 343 361 371 378 383 379 364 346 336 334 329 320 312 310 305 287 259 239 244 271 306 333 353 371 391 408 415 412 402 388 368 345 327 322 333 353 374
2814 374 391 409 429 450 467 474 471 462 459 467 481 489 485 469 448 426 403 385 377 379 386 394 402 406 406 405 409 416 417 412 411 423 444 462 466 456 433 400 369 349 344 345 342 340 346 363 388 414
2795D14K3J6QLMJ2K0K7K5J6Lrj8k7l3l5l2k8k0j0mmqoLRRkj2j5qPK0K3K2K7L2L0J3pk0k3k2
2778D23k2j6rLJ4K3K0Orj5j5j5j6j0KJ0OlnJJ1J6J8K1K4K3J0j1k5k3rNRJj2k2k3j6nkoj2j4
2761C31j1oMJ7K2J7J2J1J6J5P%JRJ5J4RMK%jjoj2j7j4mQK0K5K4J3nk2k7k3j8j5j2nOJ7K1J7
2743D58Nqj4j5qjLNMKMQJ3J4J0Kj1k4l0k6j8j3j1j2p%RJ0L%KJ1J9J4Jj5k8l0k3pKMJLJ1J5
2725C32J4N%orrlOMmj0pKRPNPJ0J0Mj0j7j5kRNj1k0j5prk0k7k0nJ1K3L4M5M8L9K0%j7k6k4
2706C56j6o%MQJ6J9J1mj4j1jJ0J4J0LJPJ8K8K1Kk0k9k4j3kNRJ0J2J3Oj3l8m9m2k9k0k0j9r
2689B04MJ9L3M2M0K9J3kj1j5j7j4nMJ0J1J5K8L8L2J4oj5j2mMJ3J8J1lj6k2k7l2l0k0j0rj3
2674B99j3j3j3j6j1jRJ3J5J5J2NMRQKlPK4L2K6J6POOPMok3m0m5l9k3nJ0K0K3K3K0J1Jqqnj
$$ plain form
2795 414 437 453 461 464 468 480 500 527 552 568 571 562 544 517 484 449 417 389 369 359 355 351 343 337 340 349 358 356 344 329 321 328 348 371 393 420 452 482 495 488 468 445 423
2778 423 401 385 376 379 393 416 436 442 433 418 403 388 372 362 364 374 380 377 372 373 384 400 418 439 463 486 496 485 460 437 428 433 442 443 431 409 386 370 365 363 357 345 331
2761 331 320 314 318 335 357 374 386 397 413 428 435 435 436 445 460 474 483 487 489 489 488 487 481 469 452 438 434 442 462 487 511 524 519 497 470 447 429 414 402 397 403 420 441 458
2743 458 463 455 441 426 418 417 420 425 429 431 435 443 456 470 480 482 471 447 417 391 373 360 349 337 330 330 339 349 352 352 354 365 384 398 399 384 356 326 303 296 298 302 303 306 317 332
2725 332 346 351 351 345 336 327 324 330 334 330 320 313 315 324 331 336 343 353 363 367 357 340 325 323 332 337 326 306 291 284 275 255 228 208 203 214 237 271 316 364 403 423 423 406 380 356
2706 356 340 334 334 338 346 362 381 392 388 374 363 362 372 386 396 399 400 407 425 453 474 476 456 427 403 390 388 393 402 412 424 437 443 430 392 343 301 272 252 232 213 204
2689 204 208 227 260 302 342 371 384 382 371 356 339 325 320 324 334 345 360 388 426 458 472 466 451 439 435 439 452 470 481 478 462 440 413 381 351 331 321 312 299
2674 299 286 273 260 244 233 232 241 254 269 284 296 301 305 314 322 324 321 328 352 384 410 426 433 439 445 452 456 450 427 387 342 303 280 275 285 305 328 351 371 382 383 375 367 362 361
2655C61KOJ0J5J9K3L1M0M5L7J3k1m8n4m4k8j4o%KNRPjqj0qqj3j3pQK1K6K4J6J2J4J5J2Mmm
2638D86%Klj3k3k9k9k6j6nQJ3J3J1J0J3J4J1MkopkQJ7J9Qpk0k4k1j5pjKjmkNJ1J1Ojrj5j8
2620C66j2%J6K5L1K9K3J7J4Rjj7l3l5k4pOJ3K2L1L5K4Lj6k1j9j6j8k2k1j5lQJ3J1QRPnj6j8
2603D01j0LJ0J7K0J8QmoJJ3J8J7Rkj4k6l3l0k0j2rponmkOJ5J8J4PLPJ1J5Qql1m7m7l4j6jR
2585B74J1Moj2rJJ3K6L8M5L6J8Jnmnj5k4k2j1ljlk%NJ1J6J5Nmpj0j7k4j6%J3J5J1J0Nmj4j7
2567C38j2pnmlmmlkoj5k2j9rLJ3J9J9J3OQJ4J5Mj4k4j7KJ7J9Qmpnmqj3j5j5j1pklj0j7k0j7
2548A70j6j5rLJ9L3M1M3L5J9Ll%MKjLJ2J7J3QJ0J6J4jk0l7m2m2l6k4rQK1K9K7J9J3J3J6J1
2532C67nk2k8k4j5mJ4L7N0M2J8lj1pjMMLmj2j8j6mJ1K2K6K0R%mpj4k3k4j7j1j0qmMJ1J5J8
$$ plain form
2655 361 363 369 379 394 413 436 467 507 552 589 602 581 533 479 435 407 393 387 387 389 394 403 410 409 401 391 383 375 362 349 342 350 371 397 421 437 449 463 478 490 494 490 486
2638 486 486 488 485 472 449 420 391 365 349 344 352 365 378 389 399 412 426 437 441 439 433 426 424 432 449 468 476 469 449 425 404 389 382 381 383 382 378 376 381 392 403 409 408 399 384 366
2620 366 354 354 370 395 426 455 478 495 509 518 517 500 467 432 408 401 407 420 442 473 508 532 535 519 498 479 463 445 423 402 387 384 392 405 416 424 433 440 435 419 401
2603 401 391 394 404 421 441 459 467 463 457 458 471 489 506 515 513 499 473 440 410 390 378 369 362 356 351 347 345 351 366 384 398 405 408 415 426 441 449 441 410 363 316 282 266 265 274
2585 274 285 289 283 271 262 263 276 302 340 385 421 439 440 435 431 426 411 387 365 354 351 350 347 345 345 350 361 377 392 397 393 386 376 359 335 319 319 332 347 358 368 373 369 355 338
2567 338 326 319 314 310 307 303 299 296 294 288 273 251 232 223 226 239 258 277 290 296 304 318 333 337 323 299 282 284 301 320 328 324 317 312 308 300 287 272 257 246 239 237 234 224 207 187 170
2548 170 154 139 130 133 152 185 226 269 304 323 326 323 323 327 329 328 331 343 360 373 381 391 407 421 420 400 363 321 279 243 219 210 218 239 268 295 314 327 340 356 367
2532 367 362 340 312 288 273 269 283 320 370 412 430 427 416 409 408 412 416 419 415 403 385 369 365 376 398 424 444 453 453 449 442 428 405 381 364 353 343 335 331 335 346 361 379
2514C79J8J7J7J6J1JpmNJ3J4J3J0OLjkoj0j3j3j0ooooLJ7K1J2nj2okqj8k4k2j8j1jJ0J6J9
2497D04K1K2J6J0PQMmj1j0npj3k0k0j0KJ1R%nJJ4J8Lk3m0l9k2lRJ1QRJ6K3K4J8Mj1k0k2k0
2480C67j8j4pKONJMJ3K0J9J5J0Loj5j7j2pprqJJ2K0K0J6PKKPNjj2j8j8j4rmjlqj4j9j9j6o
2461B75QJ7J9J0NMPLqj5qPJ8J4%j5k1j7j1njJjpj2j4j1q%J4K6K7J8Jrj1kJ2K2K3J6J1QJj0
2443C81j8k1j5oMJ3J7J3Jpj0nOJ6J9J4Kj2k3k7k5j7p%J0K1K8K0Lj1j2oJQJ2J1MmmkJjkmqj1
2424C47j5j8j6nJ8L6L5J7JkLRJ9L1L7K5ll1m3m6m0k9j5jPRQOJ%Jkj3k5k5j8j0oMJ7K6K9K8
2407C51K5J8RJ%MOJj0k3k6j1J7L7L6K2J6J6J2Lqj3j2j0lJ%oqnlnqonmjNRJ1J2J3Qlj3j8j9
2388D13k0j5%J4J6J2J1J3J3Lpj6j9k2k0j5j2j4j8j9j6j6j8j8j6nOJ1J2J2J5J4J0JkMJ2J3N
$$ plain form
2514 379 397 414 431 447 458 459 452 448 453 466 480 493 503 509 512 511 509 503 493 480 467 457 451 445 439 433 436 453 474 486 481 469 463 461 453 435 411 389 371 360 359 369 385 404
2497 404 425 447 463 473 480 488 492 488 477 467 462 455 442 422 402 392 394 405 414 414 409 410 424 442 445 422 382 343 321 318 327 338 346 355 371 394 418 436 440 429 409 387 367
2480 367 349 335 328 330 336 341 342 346 359 379 398 413 423 426 420 405 388 376 369 362 353 345 346 358 378 398 414 421 423 425 432 437 436 424 406 388 374 365 361 360 357 349 335 316 297 281 275
2461 275 283 300 319 329 334 338 345 348 340 325 317 324 342 356 356 341 320 303 292 287 286 287 286 279 267 253 242 234 234 248 274 301 319 320 311 300 298 310 332 355 371 382 390 391 381
2443 381 363 342 327 321 325 338 355 368 369 362 352 347 353 369 388 402 404 392 369 342 317 300 293 293 303 324 352 372 375 364 352 346 347 355 367 378 382 378 374 372 373 372 370 366 358 347
2424 347 332 314 298 293 311 347 382 399 400 398 401 410 429 460 497 522 519 488 445 399 359 330 315 314 321 330 338 344 345 345 346 344 331 306 281 263 253 247 251 268 294 323 351
2407 351 376 394 403 404 404 408 414 415 405 382 356 345 362 399 435 457 473 489 501 504 496 483 471 461 458 459 459 453 445 440 437 432 424 418 413 409 408 413 422 433 445 458 466 463 450 432 413
2388 413 393 378 378 392 408 420 431 444 457 460 453 437 418 396 376 361 349 335 317 298 282 266 248 230 214 209 215 226 238 250 265 279 289 290 288 292 304 317 322
2372C22kKJ7K8K7K0K2L1L5K4PKOJ1Mrj9k5k2k1j9j9j1kKoj6j7qLKqj9k3j4MK1K7J7Jj5k4k6
2355C10j8nLOJ1J8K3K4K1K1J7Qoj6k2k0j5pkkml%joj0j1qmKJ2J8K1J8J2Okj3k0j6mQJ2Lqj5
2337C36j8j6j6j8k1j8kK1L9L6K1LmmKRJ5J6J0%j3k3k6k0j2j0j3j6j3j3j5j7j1LJ6K6K9K5J5
2321C03Lmrj2j4j4j4j4j3lRJ3Q%%LJ0J9L3M2L7K1PKJJlnojJ0K3K6J6jj6j9rPJ9K1J4Mlnno
2302D76oppmj%kjKQRRPJppkok2l8l1lK1K4Qpj6k0k0j4n%%jorqkkrj3oRJ9J8J1OOPOjqj0lJ1
2280C54K5L4L4K4Nj6l0k9k3j7j4j3lJ3K8K9J9PJJlomNOql0m7n5n1l4pJ9L2L1K0PKjlqj2j1
2263B71qqoLJ4J9J4J2J7K3K0Nj2k2k3j5%J4K1K3K2K2J8QjrqnjjnlOJ7K2J7J1QMoj5j7j1mj
2245D30%JJmj5k3k0j0KQQQQQRNlj5k0j6njjKJ3K3K6K3J6Pnj3j0%J2J3QlqkQJ6J3Jrj6k3k4
$$ plain form
2372 322 320 322 339 367 394 414 436 467 502 526 533 535 541 552 556 547 528 503 481 460 441 422 411 409 411 405 389 372 364 367 369 361 342 319 305 309 330 357 374 375 360 336 310
2355 310 292 287 290 296 307 325 348 372 393 414 431 439 433 417 395 375 360 353 351 349 345 342 342 341 335 325 314 306 302 304 316 334 355 373 385 391 389 376 356 340 336 344 356 359 351 336
2337 336 318 302 286 268 247 229 227 248 287 323 344 347 343 339 341 350 365 381 391 391 378 355 329 309 297 287 274 258 245 232 217 200 189 192 208 234 263 288 303
2321 303 306 302 293 281 267 253 239 225 212 209 218 231 239 239 239 242 252 271 304 346 383 404 411 413 414 415 412 407 401 400 410 433 459 475 474 458 439 430 437 456 477 491 495 492 487 482 476
2302 476 470 463 456 452 451 451 449 448 450 458 467 476 483 484 477 470 468 462 440 402 371 368 389 413 421 414 398 378 358 344 339 339 339 338 332 323 315 313 311 302 289 283 292 311 329 340 346 352 359 365 364 356 346 343 354
2280 354 379 413 447 471 476 460 430 401 378 361 347 334 331 344 372 401 420 427 428 429 426 420 416 421 427 419 389 342 287 236 202 195 214 246 277 297 304 306 305 302 294 282 271
2263 271 263 255 249 252 266 285 299 311 328 351 371 376 364 342 319 304 304 318 339 362 384 406 424 432 431 422 414 409 408 407 402 399 405 422 444 461 472 480 484 478 463 446 435 431 430
2245 430 430 431 432 428 413 390 370 360 362 370 378 386 394 402 411 416 413 398 378 362 357 356 355 357 370 393 419 442 458 465 460 447 437 437 449 462 470 467 459 457 465 481 494 495 486 470 447 423
2225D23j7rj0j8j7kJ6K3J5Mqj8k0j8j0pokPJ6J5Moj0lRJ9J9J3Nkj0j9k3j8lJ4K4K7K7L0K8
2209D82J8Mj0k0k7l3l3k7j9j7j6qJPPMLJk%NQJj1k0j8nJ1K2K2J6Mqj8j9j0KOMjpj5k0j7kJ1
2190B56J2MlqqojKjnJJ4K2K3K0K0K0J7J1Kpj2qllj0j6j2njoj0q%OJ1J1QMJLQJ1RLloomLRO
2169C65krqj%nppon%PJ4J4J5K0K2J3oj6j3nnj4k3k4j9j2oMJ4K1J9J1PJ1J6J6Mj0j6j1JRJ2
2151C85J2J4Rlj5j5mRJ9K1J5Jj3j3%J1J3QMlj1j4j6j8k5l4l5k9j6OK7L3K0%rnlorqqj1j1k
2133B71J5K8K5Rrj8j2NK3L5L8K9J6MmqqjJ0J3Pjorj7k5k2j0kkpqpnnjNJ4K6L4L3K4J1kj2j7
2115D57j1MJ8K3K6K5J3pk2k3j3rj0j5j8k5k9k6j4%J5K0J6jj5j8j3pokPJ6K0J9J8J4Opk0l3
2099C73m1l9k5qQJ4J2OkprnLJ1J3QLOJ4J6J2ONRRJrj7j5nJ3L1L8L0Qj3k5k2j4rrj1j2j4j4
$$ plain form
2225 423 406 397 387 369 352 350 366 389 404 408 400 382 362 344 334 327 321 319 326 342 357 361 355 345 342 351 370 389 402 407 405 395 376 353 335 332 346 370 397 424 454 482
2209 482 500 504 494 474 447 414 381 354 335 318 302 294 295 302 309 313 316 317 315 315 320 328 329 318 298 280 275 286 308 330 346 350 342 324 305 295 297 303 307 306 299 284 264 247 245 256
2190 256 268 272 269 261 253 247 246 248 247 242 243 257 279 302 322 342 362 379 390 392 385 373 365 362 359 349 333 321 316 315 309 299 291 291 297 308 319 327 331 332 335 343 354 363 366 363 357 351 347 350 359 365
2169 365 363 354 346 345 345 340 333 326 320 315 315 322 336 350 365 385 407 420 414 398 385 380 375 361 338 314 295 283 277 281 295 316 335 346 353 364 380 396 400 390 374 363 364 373 385
2151 385 397 411 420 417 402 387 383 392 411 432 447 448 435 422 422 433 446 454 458 455 444 430 414 396 371 337 302 273 257 263 290 323 343 343 334 329 326 320 311 303 295 284 273 271
2133 271 286 314 339 348 339 321 309 314 337 372 410 439 455 459 455 447 439 438 448 461 468 467 461 452 435 410 388 378 376 374 367 359 352 347 342 341 346 360 386 420 453 477 488 486 474 457
2115 457 446 450 468 491 517 542 555 548 526 503 490 481 471 456 438 413 384 358 344 344 359 379 395 394 379 361 348 341 335 333 340 356 376 395 413 427 433 426 406 373
2099 373 332 293 268 260 268 282 294 300 298 291 282 277 280 291 304 312 315 321 335 351 363 369 374 383 392 393 384 367 352 347 360 391 429 459 467 454 429 407 393 384 375 364 352 338 324
2081C24j3pjjlJJ1K4K8K2Rkj0rmJJkj0j8k3j8JK0K0Kj7j8lK0L9M7M1K6J2J0J6J9J1kj3j7j7
2064D97j3nMJ5K3K6K2J4N%llmrk2l6l9k6nJ0J4RKlooojPJ0Mrk0k3j9j3omnrqmmppjMLJMJ5
2043C63K7L1K3Mj7l0k7j5mjjKJ1J9J7RLNQRJ0J5J9J1oj6j0KMjnlmj1j6j8j9j8j3qnj0j7k4
2025B93k3j4kN%%J0K7L9M1M0K9J0j0j2KJ8J8Qpj9k6k3rQK0J9Nj6l0k8j2PJ9K3K6K2J3Mknm
2009D64jLOKpk0l0l3k7j7j2j0nkmj3j7qJ0K4K9K6J3MNJ6K2J7Mmpqj0j3j5j0jRJ5K0L3M1L4
1991E23J3jPK5L1K1Mrk1k7k9k6k4j7j1j1k1k9k7j4jNQMmj2j2p%PJ4K0J7QMRJ6K0J2lj4j3p
1974D28lnlLJ1J5K1K3J2oj9j7j0mjK%KJ5L2M0L7M8Q2J34J84K05J60L5j10j87j65j08p8o0k1
1960F92K4L7L1L4L9K4RK7N7O0M9P1J20J60K16L24M69O18Q40J175J399J107K11q25j391j329
$$ plain form
2081 324 311 304 303 302 299 300 311 335 363 385 394 392 382 373 369 370 371 369 359 341 318 300 301 321 341 343 326 308 305 325 364 411 452 478 490 500 516 535 546 544 531 514 497
2064 497 484 479 483 498 521 547 569 583 588 588 585 582 578 569 547 511 472 446 441 451 465 474 476 473 467 461 455 454 461 471 475 466 446 423 404 391 385 381 376 367 359 355 351 344 337 336 340 343 344 348 363
2043 363 390 421 444 448 431 401 374 359 355 354 353 355 366 385 402 411 414 419 427 436 446 461 480 491 485 469 459 461 465 464 459 456 452 441 425 407 388 370 357 349 344 334 317 293
2025 293 270 256 254 259 259 259 269 296 335 376 416 445 455 445 433 435 453 471 479 472 453 427 404 395 403 423 442 447 431 401 373 361 368 387 410 436 458 471 475 473 468 464
2009 464 463 466 472 474 467 447 417 384 357 340 328 318 313 311 307 294 277 269 279 303 332 358 371 375 380 396 418 435 439 435 428 420 410 397 382 372 371 380 395 415 448 489 523
1991 523 536 535 542 567 598 619 623 614 593 566 537 511 487 470 459 448 427 398 371 357 356 361 369 373 369 357 345 338 338 345 359 379 396 404 408 417 433 453 465 462 448 435 428
1974 428 425 420 417 420 431 446 467 490 502 496 477 460 450 446 445 447 447 449 464 496 536 573 621 703 837 1021 1226 1386 1421 1311 1124 959 851 773 713 692
1960 692 716 753 784 818 857 881 890 917 974 1034 1083 1154 1274 1434 1650 1974 2443 3061 3901 5076 6475 7582 7793 6968 5577 4248
1949D248r75o82n03l52k23j62j46j17p8o4o6n3l0k3k7k2j1j4k0j0J0J6QPJ1NnjPMpnLjk1l8
1935F63m2l8l7l3k6k4k2j1NJ4J7J6J2LqnLkk2m0m2l2k4j8j6j2%J9K8K2QLQRK%KMMRK1K5J7
1917D60P%pj4j8j6j5k4k9k6j6rkRJ9J8Q%LJ1J9J7NqnPJ4%k2l5l0j8oKORJ1J2J0PNQJ4J8J8
1899D17Rlj5j5oPJ4K1L0L1J7pk5k5rJ3K4J6mk3l0k4j1MJ6J9J2LllNJ1Opk2k2j0KM%jlll%l
1881D04j1j5rj%mLJ6K7K7K2J2mk4l3k8j5j0j4j7j5rkKKNJ0J4Pj1k3k1rkorkJ1J6Nj4k7k6j7
1863B05pMJ5K3K3K2K3K2J7QLNJ0Qjj4k8l8l8k0NK4K7K1J1MKJ0K2K6J9Ooj6k9l6l0j5mkJJ2
1846B94K5K4J3OQJ3J3RMmj7l1l4l1k3j0PK6L6L2K5J7Rmj8k1rNJ0Jj1k2k8k9k5j6lPJ5K1K1
1830C05J4JqmQJ8K5K7K4J3%njLJorqnjLLjj2k6l2k5qQJ8K1K6K6K2J2NLok6m9n7m4k8j7rLK0
$$ plain form
1949 4248 3273 2591 2088 1736 1513 1351 1205 1088 1010 946 880 827 797 774 747 725 714 700 680 670 680 696 704 711 722 727 722 721 728 732 725 720 723 722 701 663
1935 663 621 583 546 513 487 463 441 430 435 449 466 482 494 497 489 484 487 485 463 423 381 349 325 307 291 279 279 298 326 348 356 359 367 376 378 378 380 384 388 397 418 443 460
1917 460 467 467 460 446 428 412 397 373 344 318 302 293 291 300 319 337 345 345 348 359 378 395 400 392 387 394 408 408 386 351 321 303 297 299 305 314 325 337 347 354 359 367 381 399 417
1899 417 426 423 408 393 387 394 408 429 459 490 507 500 475 450 441 454 478 494 490 467 437 413 402 406 422 441 453 456 453 450 455 466 472 465 443 421 411 413 417 417 416 413 410 407 407 404
1881 404 393 378 369 368 368 364 367 383 410 437 459 471 467 443 410 382 367 357 343 326 311 302 300 302 304 309 319 333 340 329 306 285 276 274 268 259 257 268 284 289 275 248 222 205
1863 205 198 202 217 240 263 285 308 330 347 355 358 363 373 381 380 366 338 300 262 242 247 271 298 319 330 334 336 346 368 394 413 419 413 397 368 332 302 287 283 281 282 294
1846 294 319 343 356 362 370 383 396 405 409 405 388 357 323 292 269 259 266 292 328 360 385 402 411 407 389 368 359 364 374 375 364 342 314 285 260 244 241 248 263 284 305
1830 305 319 320 312 308 316 334 359 386 410 423 423 418 417 420 421 415 406 398 393 392 395 398 397 385 359 327 302 294 302 320 341 367 393 415 427 432 435 429 403 354 297 253 225 208 199 202 222
1811B22L2L3K6K0J9K0J6Mj6l2m0l3j8%J6K7L2L1K7K4K4K3J7Olpj1j6k5k7j7OK7L1K3J0LJq
1795D67k1l1l1k5j6j0nKQJ1R%j1j3pNJ4J9J9J6J2PQJ3J1kj8k2rOQkj3j4lQJ2Nrj9k4k4j9r
1778C03PK5L5L5K5J1mj1rlknpppj0j1j2rpqrj2j3qJPLKRJ7J7QlpqpmQJ9J7Mrj3j2j3j5rMJ6
1758C19K2J9J6J6J8J4Npj2j0oonnmpj6k4k4j0PJ8J9J3POJ1J2Jk1l8l7j9nnrnQJ9K5K3J7J1
1740C51OLkj0j5j4qrj1q%PMLPJ4J6J0Jj0j6j7j1oJNRJ0OKNJ0Rjj3j4lJ4K7K9K0Pkm%LKkqj0
1720C87pjPOlj5j8j2ppj0mPJ4J3QMRK3L6L8K2%j5j9j8k1k2j5%J2J5Poj4j8j9j3lQJ1OJLL%
1702C73olORkj3rNJ9K8L2K6Ok1l5k9rOQKkLJ0J5Poj8k7l0k6j8j1j4k0k0j3mLJ1J7K1J6QKn
1684B92j0j0mQJ2J1QQJ0J1J0RRNlrrmlj0j7j8j3mMJ2J9K1J9J5J3J1Jj0j6j3nlornJLkonJQ
$$ plain form
1811 222 254 287 313 333 352 372 388 392 376 344 304 271 253 253 269 296 328 359 386 410 434 457 474 480 477 470 459 443 418 391 374 380 407 438 461 471 474 475 467
1795 467 446 415 384 359 343 333 328 330 338 349 358 358 347 334 327 332 346 365 384 400 412 419 427 440 451 449 431 409 400 406 414 412 399 385 382 390 402 407 398 379 355 331 312 303
1778 303 310 335 370 405 430 441 437 426 417 414 412 407 400 393 386 376 365 353 344 337 329 320 308 295 287 288 295 298 300 309 326 343 351 348 341 333 326 322 330 349 366 370 361 348 336 323 308 299 303 319
1758 319 341 360 376 392 410 424 429 422 410 400 394 388 383 378 374 367 351 327 303 293 300 318 337 350 357 363 374 386 387 366 328 291 272 267 262 253 248 256 275 300 323 340 351
1740 351 357 360 358 348 333 319 311 302 291 283 283 290 294 297 304 318 334 344 345 335 319 302 291 285 286 291 300 310 316 318 323 333 342 341 328 314 311 325 352 381 401 408 406 402 402 405 407 405 397 387
1720 387 380 379 386 392 389 374 356 344 337 330 320 316 323 337 350 358 362 371 394 430 468 490 490 475 456 438 417 395 380 380 392 407 414 408 394 376 357 344 341 349 360 366 367 370 373 373
1702 373 367 364 370 379 377 364 355 360 379 407 439 465 471 450 415 386 377 383 391 393 391 394 404 419 426 420 402 375 345 319 301 290 276 256 236 223 219 222 233 250 271 287 295 297 292
1684 292 282 272 268 276 288 299 307 315 325 336 346 355 364 369 366 357 348 344 341 331 314 296 283 279 283 295 314 335 354 369 382 393 394 384 368 355 350 347 341 332 327 328 331 329 323 318 319 327
1664C27J4K1K3J8J0RJ1Pmj5j7j5j4rkMOKoj5k1k2j0MJ4J9K5L2L7L4K1Lj2k1k4k5k4k4j9j5
1648C27j0jQJ1Pjoj0j2j4qKNLLRK0L1L9M2L2J2pj3rnj0j3j2oj%kl%L%j1k4l1l0k1j2lJ1K6
1630C16L5L0J5%ppommnm%OJ0PPJ2J9J6Jk3l8l5j5NJ1Olrj0p%J0J8J8J5J5J6J5J0mj8k8l0k3
1612C33j4mLRJ6J8J4PKJjrk1l2l4k5j0PK2L1L4K8K4J8J4Olj0j4j5j3nPJ4J2Kj1k0k1j9j3r
1595C19ojJ0K5M0M5L2J0rk3l0l2k4qLLklJKJJMLkoommKJ1J3QL%lj2k0j9j1jJ1K2L3L3K5J7
1576D51J1J0R%j6l6m8m3k4lJ4K5K8K3J4Mlqqlnj3k2j9nJ1K0K2K3K1J6RjqqnjjkMJ7K7K1Or
1558D95j8j4kQJ0LnmKN%jKNJj0k2k7k9k7k0j2onoKJ8L1L0J8J0M%j3k4k6j7lOQNOJ2K3K9K6
1540D68J7RJ0J0Kj2k0j7nLLjnqj4j4j0kRK0L0K8J0j2k5k5k3k2k0j1PK0K6K4K1J9J7J0mj8j9
$$ plain form
1664 327 341 362 385 403 413 422 433 440 436 421 404 389 375 366 364 368 374 376 370 355 334 312 302 306 320 339 364 396 433 467 488 491 479 458 434 409 385 361 342 327
1648 327 317 316 324 335 342 341 335 325 313 299 291 293 298 301 304 313 333 364 403 445 477 489 482 469 460 455 445 432 420 414 413 413 411 408 408 411 411 400 376 345 315 294 282 279 290 316
1630 316 351 381 396 396 389 382 376 372 368 363 359 359 365 375 382 389 401 420 436 437 414 376 341 326 331 342 348 345 336 326 319 319 329 347 365 380 395 411 426 436 432 414 386 356 333
1612 333 319 315 318 327 343 361 375 382 384 385 384 375 354 322 288 263 253 260 282 313 347 375 399 417 431 437 434 424 410 395 382 377 384 398 410 412 401 381 360 341 328 319
1595 319 313 312 322 347 387 432 464 474 465 442 412 380 356 348 351 354 352 349 350 352 353 354 358 361 359 353 347 343 339 341 352 365 373 376 376 373 361 341 322 311 310 321 343 376 409 434 451
1576 451 462 472 481 481 465 429 381 338 314 311 325 350 378 401 415 419 416 408 400 397 392 379 357 338 333 344 364 386 409 430 446 455 454 446 438 433 432 431 429 433 450 477 498 504 495
1558 495 477 463 461 469 479 482 477 473 475 480 480 479 481 486 487 477 455 428 399 372 352 340 334 329 323 325 343 374 404 422 432 436 436 423 399 373 356 353 359 367 372 378 390 413 442 468
1540 468 485 494 504 514 516 504 484 467 462 465 468 467 462 454 440 426 416 414 423 443 473 501 511 499 474 449 426 404 384 373 380 400 426 450 471 490 507 517 513 495 476
1523D76j2LJ5J6J0lj1j2mMJ0RLoj3j6j6j4qLRPlrmNJ0P%qj7k4k5j8nNN%opnpj0rlLOQPPPP
1502C67Nmj6k1j4%RRLJQJ8K5K2J0lj5k1k2j6nPJ3J0Nkpj2j4pJ3L5M8M4K4Pj%Knj7k6k2r%m
1484D22j0j2qpj1j5j5j2ql%mj4j9j5lOJ5K3K6J4rl1m2l5j3PJ4Lj1j4mJ0J8J9J7J1PORJ5J9
1467C46J9J1jj3j7j5j0jJ2K1J8Mj2k1k1j6qMJ6K4K4J9J5J7J8J1lj5j8j7j9j9j4kQK0K9L2K2
1451D48%j7j5jJ3J6Qjj1j8k4k2j1%Lmrj1rnLJ5J7PllJjqnMJ1ROLlj0j0noj1j9j8j5j6j8k4
1432B31k8k8k2oJ3L0M3M1K4%j3j3qnmkKNQQMqj5j2mLNNLMJ3K2K4J8J2J0QKkKMpk3l0k4j3o
1413B71mnnn%NJ3K0K7K7J9J0jrj2oQJ3O%LJ5K4K2J3%j0j2oklppqj0pKRNmj1qmklqj4rOK2K6
1393C84K0J2Mpj6k0j5mPJ5J1KonLPQOkj7k5k4j5q%MLkjRK1K7L2L9L9K7J0kpj4j9j9j6j8j6
$$ plain form
1523 476 464 467 482 498 508 505 494 482 478 482 492 501 504 498 485 469 453 439 431 434 443 450 447 438 434 439 449 456 456 448 431 407 382 364 359 364 369 369 363 356 351 344 334 325 322 325 331 339 346 353 360 367
1502 367 372 368 352 331 317 317 326 335 338 339 347 365 390 412 422 419 404 383 361 345 340 347 360 370 375 373 366 354 340 333 346 381 429 473 497 504 503 503 505 500 483 457 435 426 426 422
1484 422 412 400 392 385 374 359 344 332 324 321 321 317 303 284 269 266 272 287 310 336 350 341 310 268 233 220 227 241 244 233 219 215 225 243 262 279 290 297 303 312 327 346
1467 346 365 376 375 362 345 330 320 319 331 352 370 374 362 341 320 304 296 300 316 340 364 383 398 415 433 444 441 426 408 391 372 353 339 337 345 365 394 426 448
1451 448 448 431 416 415 428 444 452 451 440 422 398 376 365 365 368 364 355 344 335 330 333 348 365 372 369 366 367 366 358 353 357 368 377 383 386 383 373 363 358 352 341 322 304 289 273 255 231
1432 231 203 175 153 147 160 190 233 274 298 298 285 272 264 259 255 253 255 260 268 276 280 272 257 245 241 244 249 254 257 261 274 296 320 338 350 360 368 370 368 370 374 367 344 314 290 277 271
1413 271 267 262 257 252 252 257 270 290 317 344 363 373 372 363 351 345 353 366 372 372 375 390 414 436 449 449 439 427 421 419 416 409 402 394 384 377 379 388 393 389 378 370 366 364 361 353 339 330 336 358 384
1393 384 404 416 420 413 397 377 362 358 365 380 391 393 387 382 385 392 400 406 404 387 362 338 323 315 315 319 322 320 319 328 349 376 408 447 486 513 523 521 514 500 481 462 446 428 412
1375D12j0mj2k3k0qmprnMJ3K1K1J3J0K1L1K3J0J0J4OrpOJ3J2J5K2J8MkMRJ5K7L5K1KMK8M6
1358G70N4O4P1O2N4P7J13J23J17J42J91K23K43L02L98M94O33R06J313J814K492L379M030L581
1348B1646J614j126l226l868l377k574j916j404r81o93n26l84k40j56j62j99k20k34k36j98
1340A540j31q3o8n8m1m0n6n8l9k8l5l9k9k5l4l8k5j3qokpj8j4OJ5J0PJ5J6Lj1j4j8k9l3k3
1325E89qJJ1K0K0J0QK0L4M7P9J29J74K12K62L09K81J25j03k80l33k89k18j53j01o6m4l5k9
1313F72k6k3k2k0j5oPJ7J7J4J6K0K4K9L7L4J4k0m6n6n5m7l4k3j9k2k8k9k3j3JJ0J3J3J6K3
1299D50K3J5LkjLPO%nlQK2L1L1K5Qj1k8l0k0mLkonlj1k7l4k3nJ0J9K4K2J2krpnmpj3k1k7k8
1280C79l0l0k3pOJ0RJ2J4J1RJ5K3K0J0KMRJ0J2J1QjppjOOLmj1j1j1j9l3m5m6l5j5J1L2M1L5
$$ plain form
1375 412 402 398 386 363 343 335 331 324 315 310 314 327 348 369 382 392 413 444 467 477 487 501 507 498 491 497 510 522 537 559 577 581 579 583 592 607 634 669 690 692 696 724 770
1358 770 824 888 959 1021 1075 1152 1265 1388 1505 1647 1838 2061 2304 2606 3004 3498 4131 5037 6350 8164 10656 14035 18065 21646
1348 21646 23260 22134 18908 15040 11663 9089 7173 5769 4788 4095 3569 3185 2945 2789 2627 2428 2208 1974 1738 1540
1340 1540 1409 1326 1258 1200 1159 1119 1063 1005 966 938 903 864 835 810 776 738 713 700 692 686 684 677 659 645 651 666 676 683 698 714 717 706 692 674 645 612 589
1325 589 581 582 593 613 633 643 651 671 705 752 831 960 1134 1346 1608 1917 2198 2323 2220 1940 1607 1318 1100 947 846 780 736 701 672
1313 672 646 623 601 581 566 560 567 584 601 615 631 651 675 704 741 775 789 769 723 667 612 565 531 508 489 467 439 410 387 374 375 385 398 411 427 450
1299 450 473 488 491 489 488 491 498 504 504 499 496 504 526 557 588 613 621 610 582 552 532 528 531 529 523 518 515 504 477 443 420 415 425 444 468 490 502 500 491 484 479 475 468 455 434 407 379
1280 379 349 319 296 289 295 305 314 326 340 351 360 375 398 418 428 430 434 443 453 465 476 484 483 476 469 468 474 480 483 479 468 457 446 427 394 349 303 268 253 264 296 337 372
1263C72J8Kj1j5j3j2j4j5qQK3K9K6K0J3Lll%KK%pj5k0j7j1lLJ0J7K2J8J1jojJ2K3K5J6Nlr
1245D93ro%KjnolKMNK%Jkrk0k3j5mLJmj2j8k1j4JJ9K8K8K4K5L0L8L7K5Ppj3j6k5l9m7m2k3
1227C91lJ3J9J8J3LkKJ2J4J1ORJ7K0J6QKJlponmopj0j3j8k2k1j8j2ooj2k3k7k1q%MJklkLR
1207C25ROkj5l0l8k9j2kjjNJ4J5J1JnlJ0K2K6J4Llpj6k3j7%J3J9K2K5K7K3J6Onj6j8j1JQP
1190C74Kj%%%JJmj2k0k3j7rookMQOQJ8K9K8J7Kmll%OJ8K7K9K5J9J1%j7l4m0l3j9qorpkJrk3
1170C17l2k6j0LNJljQJ9K1K0J6J4J0Loj6j7oJ2K5K2Ppj0j0j3k0k3k0j7j7j9j6pJPJ0J5K1K4
1153B85K1J1J0J5K5K7K3K1K3K3J6Mmpnnlljkmj4k4k9k4j7j4j3rkPRPMLORJ2J0MJJJj%QK0L3
1134D58L5L0K0J3Nnk0l5m3m5m3l9l1j9jJ7L2L7L5K8K2J9J7J3Nkrj6j9k1j4kOOkj6k8l7m0l6
$$ plain form
1263 372 390 392 381 366 353 341 327 312 304 312 335 364 390 410 423 426 423 420 420 422 424 424 417 402 382 365 354 351 354 364 381 403 421 432 431 425 424 436 459 484 500 505 502 493
1245 493 484 478 478 480 479 474 468 465 467 471 476 478 478 479 477 468 448 425 410 406 409 410 406 394 376 355 341 342 361 389 417 441 466 496 534 571 596 603 596 583 567 542 503 456 414 391
1227 391 388 401 420 438 451 454 452 454 466 480 491 497 506 523 543 559 567 569 570 567 560 554 549 545 539 532 522 509 491 469 448 430 418 412 406 394 371 344 323 315 315 319 320 318 315 313 316 325
1207 325 334 340 338 323 293 255 226 214 212 211 210 215 229 244 255 256 251 248 258 280 306 320 323 320 313 297 274 257 257 270 289 311 336 363 386 402 408 403 387 369 358 359 367 374
1190 374 376 375 375 375 375 376 377 373 361 341 318 301 292 286 280 278 282 290 296 304 322 351 379 396 398 394 391 388 388 394 412 439 468 493 512 523 523 506 472 432 399 380 372 366 357 350 348 349 340 317
1170 317 285 259 249 252 257 258 255 254 262 281 302 322 338 352 362 365 359 343 326 320 332 357 379 386 379 369 359 346 326 303 283 266 249 230 214 207 208 215 225 240 261 285
1153 285 306 317 327 342 367 394 417 438 461 484 500 504 500 493 488 483 480 477 476 474 470 456 432 403 379 362 348 335 326 324 331 340 347 351 354 360 369 381 391 395 396 397 398 397 397 405 425 458
1134 458 493 523 543 556 561 556 536 501 458 413 370 331 300 281 280 297 329 366 401 429 451 470 487 500 505 503 494 478 459 438 424 422 428 434 432 416 388 351 311 275
1118B75k6j1MJ0OJNJ8K8K4Qoj2j1lJ0K3L0L0K7K5K5J8Pjmnj3k5l4l1j7%J2J7J8J6J1NK%LJ0
1100D69J9K1J8J1Loj6k3k2j3kJlj3k2k2j3kNMKNQQJqj6j9j5lJ3K8L5K9J3%pnJ%qj7j6j0nn
1082D03j1j5j5j1j2j4j8j4kJ0J6J6J3J2J4J4J3J0Krj4nJ2K6K5K0K0K4K7K1Pqk3l3l5k6j4m
1067D22mqj3j0njLJ2K1K2J0nj0lLPQPkj3k4k5j9j2rqj1j2j6k2k5j9mJ2K1K4K5K4J5MnpmJQ
1048C53J9K7K4J5LnqrqojMP%j1j6j2okMJ5K5K3Pj2k5l3l1k0lJ0Mj4l3l5k0LJ9K4J8QKjmqj4
1030B77j2JJ8K4K0J6J8K6K8K3J3Krj6k4l3l7k7mK0L5L9L4K5J7J3J3J0ok6l9m3m5m4l5j8mL
1015B53J0J9K4K2J4J1RKj0j8k1j8qOJ8K2K0J4Lj1k0j9j0mkLJ4K4L2L4K9J7Jnm%jpj2j4j2l
998D02QJ2Jj7k6k1pRK2K9K5Rpj6j2nlmprj3j7j3%J2J4Lqj2lRK0K3J6Mrj1nLQOMJMPOlj2j6
$$ plain form
1118 275 249 238 242 252 258 259 264 282 310 334 342 336 324 313 310 320 343 373 403 430 455 480 498 505 504 500 495 482 457 423 392 375 375 387 404 422 438 449 454 456 456 459 469
1100 469 488 509 527 538 541 535 519 496 474 461 459 460 457 444 422 400 387 385 390 394 396 401 409 417 418 410 394 375 360 357 370 398 433 462 475 475 468 463 464 464 456 439 423 413 408 403
1082 403 392 377 362 351 339 325 307 293 291 301 317 333 346 358 372 386 399 409 411 402 388 383 395 421 446 466 486 510 537 558 565 557 534 501 466 440 426 422
1067 422 418 410 397 387 382 381 384 396 417 439 449 444 434 431 434 441 449 456 454 441 417 392 373 361 352 344 333 321 305 283 258 239 235 247 268 292 317 341 356 360 355 348 344 345 353
1048 353 372 399 423 438 441 436 428 419 411 405 404 408 415 415 404 388 376 370 368 372 387 412 435 442 430 405 372 341 321 318 328 332 318 285 250 230 233 252 276 294 302 304 303 299 291 277
1030 277 265 266 284 308 328 344 362 388 416 439 452 454 445 429 405 372 335 308 304 324 359 398 432 457 474 487 500 510 504 478 439 396 351 307 272 254 250 253
1015 253 263 282 306 328 342 353 362 364 354 336 315 297 289 295 313 335 355 369 372 361 341 322 312 308 306 309 323 347 379 413 442 459 460 455 451 451 450 443 431 417 405 402
998 402 410 422 423 406 380 359 352 361 383 412 437 446 439 423 411 406 403 399 392 383 370 353 340 340 352 366 369 361 349 346 355 375 398 414 418 409 398 393 396 404 410 414 415 419 426 432 429 417 401
978D01j1qpkPJ2J1ONMjqoLPJrqJRPkj7k9l3k6j3%MJpj0oJNL%kmrnLJ4J8K1K4K4J5mj8k2j6
957C24pNJ4J6QjkLJ1J7J9J4O%%jmn%J0J2kk0l2k8j4NJ6J8J2Klmj%J%KRJ5J2LmlPJ0Kj1j6j4
937D01qJJ7K9K9J4JKRJ0Njoj4k4k8k3j3okKNOJj4l4m4l5rJ5K6K1J3OKjnpmQK3L3L1K2J0kj8
918D44k9l0k3qJ4L7N4N5M3K5Nj3k3k2j6j3j0mlj5l1m0l8l0k4j6rnJJ1K3K4J4ORJ9K1J6QL%
902D30JNJ3J8K3K3K0Qj1k8l4k5j2koj4j9k1k1j5ojlpmQJ3RJjkkJQJ0jj4j5rkJlrj8k3j7nM
883B46RJ2J6J5J1ONPOMKjnpqj0j4j6pQK2K4J5PLPJ3J8J8J4RRJ3J4Pqk1k6j8pjmrpLRjj7k6
863C39j8kPQMMJ0K0K9K9J7JomKQRRRPOKmj2k2k8k5j7onj4k3k0qJ0K0K3J6OJlrk0k3j0PJ5Q
844C47oj7k0rJ1K7K2Kj5j2jLlqj3j5k0j8j4oOK0K6K0PJJ%npmjklkjoj4j7j7j3j1oJJ0J7K4
$$ plain form
978 401 390 382 375 373 380 392 403 409 414 418 417 409 403 406 413 414 405 397 398 407 414 412 395 366 333 307 294 294 298 299 292 282 276 277 282 285 285 283 279 270 265 268 282 300 321 345 369 384 380 362 340 324
957 324 317 322 336 352 360 359 357 360 371 388 407 421 427 427 427 426 422 417 417 427 439 437 417 385 357 343 348 364 382 394 396 393 389 388 388 389 389 391 400 415 427 430 426 423 430 440 442 431 415 401
937 401 393 394 411 440 469 483 484 486 495 505 510 509 503 489 465 437 414 401 395 393 395 400 406 407 393 359 315 280 271 286 312 333 346 352 354 353 348 341 337 345 368 401 432 454 464 462 444
918 444 415 385 362 354 368 405 459 514 557 582 587 574 551 529 513 500 490 486 483 468 437 397 359 329 305 289 280 275 276 287 310 334 348 354 363 382 403 419 427 430 430
902 430 431 436 449 467 490 513 533 541 530 502 468 443 431 429 423 409 390 369 348 333 327 326 323 316 312 320 333 342 343 342 340 338 339 347 357 356 342 327 318 316 317 314 305 287 264 247 242 246
883 246 255 267 283 298 309 315 320 327 333 337 339 338 333 326 318 308 294 278 271 279 301 325 340 347 350 357 370 388 406 420 429 438 451 465 472 464 443 417 399 392 391 387 378 371 374 383 382 365 339
863 339 321 319 326 334 338 342 352 372 401 430 447 448 442 438 440 448 457 466 475 482 488 490 486 474 452 424 399 382 376 371 357 334 314 306 316 336 359 375 381 382 379 370 350 327 317 324 339 347
844 347 341 324 304 295 306 333 355 357 342 330 329 332 329 321 308 293 273 255 241 235 241 261 287 307 314 315 316 316 311 304 300 299 297 294 292 291 285 271 254 237 224 213 207 208 218 235 259
825B59K7K3J5OK%nj7k6k3qJ1K4K7K3J5Jj1j8k1k0k2k1j6qkMJ3K0K2K1K4L4M1L8K8J7Npj8j8
808D39j5j6k9l5k6nJ1J5J4J1J4J7J5Poj4j4j2rj0pMK2M1M7L5Pj9k8j7jJ1J5J6J7J7J7J7J3
793E59QJpj6k7l4l3k8k3j8qLPKpj3rlKkj0j7j8j5qjJlrqjQJ3J3J3J4J8K1K0J5NmrqkMKpj7
773C64j3LJ8J6QLOMpk1k5j9j4j4j6j1LJ2J5J4J8K5K6K4K3K0Mk4m8n1l7j8p%LQJ2J8K2J8Nq
756C59j6j7j3nQK3L1K6Roj2mOJ0Lqj5j8j7j7j7j1MK2L4L7L1J9Kj8l0k8j8p%RJ2J0JkLJ1J8
739D09K0K1J9J4J1J0Mj3l4m5m0k4pLRJ5J7J4J1QOJpj4j7j5j5j5j6j5j0JJ4K0J9RK%RK3L0K5
722D57Qj0j5j5j4j9k0j8j2qqqqrnJJ0J9K1J7RNNMkj4k2k7l3l5k4lK0L0L0K4J4jj2j9k4k7k3
705B39j0RK3K7K5K3K0J7J6J5J3Mj2k2k4j6KK0L0L1K6K3J9Qrk0j4NJ8K2J6Pj0l3m8m7l1j6q
$$ plain form
825 259 286 309 324 330 332 332 327 310 284 261 253 264 288 315 338 353 354 343 325 304 284 262 241 225 217 215 219 232 252 274 295 319 353 394 432 460 477 482 475 457 439
808 439 424 408 379 344 318 313 324 339 353 364 378 395 410 417 411 397 383 371 362 352 345 349 371 412 459 494 501 482 454 437 436 447 462 478 495 512 529 546 559
793 559 567 568 561 545 518 484 451 423 400 382 374 377 384 386 379 366 357 354 356 354 344 327 309 294 286 285 286 283 274 266 265 273 286 299 312 326 344 365 385 400 405 401 392 384 382 386 388 381 364
773 364 351 354 372 388 396 399 405 409 402 381 356 337 323 309 293 282 285 297 312 326 344 369 395 419 442 462 466 442 394 343 306 288 281 281 284 292 304 322 344 362 367 359
756 359 343 326 313 308 316 339 370 396 405 399 387 383 389 399 402 394 379 361 344 327 310 299 303 325 359 396 427 446 448 430 400 372 354 347 347 356 368 378 379 377 380 391 409
739 409 429 450 469 483 494 504 508 495 461 416 376 352 345 348 357 372 389 403 414 422 428 429 422 408 391 376 361 346 330 315 305 306 320 340 359 368 370 370 379 402 432 457
722 457 465 455 440 425 411 392 372 354 342 334 326 318 310 301 296 297 307 326 347 364 373 378 383 387 385 371 349 322 289 254 230 227 247 277 307 331 345 344 332 313 289 262 239
705 239 229 238 261 288 313 336 356 373 389 404 417 421 409 387 363 347 349 369 399 430 456 479 498 506 497 477 463 468 486 508 524 531 521 488 440 393 362 346 338
689C38mNJ6K5K5K1J3J0J4J9J8J2M%nj2k1k6k9k7k2j4mPK2L6L4J7lj2pJMPPPjrj0o%kmkOJ3
671D61J3J0J1Qmj9k6j8qml%MOORROKOJ8K4J7Olj1j6j8j4j0oprj6k8l5l3k1oQJ3J3J1J7K7L6
652D26L0J1qk0j8qjJlmkOJ6K1J2kj7k5l2l6l1j4MJ3J5J4Qpk3k6j5kKkopmKQJ0OJjLJ1K1K5
633C52J7LpmLOLnj2j7qPJ9J5O%JMRJ9L0L3K3Mj1k0k0j3mMOJnoLJ7L0L4K6Rj4l5m3l9k6j3J
614C83J1J1LjPJ6J3lj6j6oNJ6J7J2L%NQN%jKLPJ3J9J6Lj1j3nJJooPJ9K3J4Jj0k1l0k8j2QJ9
595D86J4Mj1k2k6k2qMJ0Plk0l7m4l3j3jLLPJ4J0mj6k1j7j5j1JJ7L3L4L0K5K5K2J3kj5k3k7
579C71k7k3qJ3L5M7M3K8Rpj5j6j1mJPRJ0QONM%mnJQRLpj4j4pKPOK%kj%jkllkkoj2j8k0j8j2
557C70jRJ5J3Lj5l0l7l0qJ5K9K8J6Mnj0j5j7j2n%MRJ7K4K6J8Plj3k2k8k5j5mmqnMJ1ROQJ5
$$ plain form
689 338 334 339 355 380 405 426 439 449 463 482 500 512 516 516 511 499 478 452 423 396 374 360 356 363 385 421 455 472 469 457 450 451 455 462 469 476 475 466 456 450 450 448 444 442 448 461
671 461 474 484 495 503 499 480 454 436 428 424 421 421 425 431 437 446 455 461 463 469 487 511 528 534 531 520 504 486 472 462 456 449 440 424 396 361 328 307 301 309 322 335 346 363 390 426
652 426 456 467 459 439 421 413 412 413 410 406 404 410 426 447 459 457 440 415 383 347 316 302 306 319 334 348 356 349 326 300 285 283 285 283 277 270 266 268 276 286 292 293 292 295 306 327 352
633 352 369 372 365 361 364 370 373 368 356 339 331 338 357 372 378 378 379 383 392 411 441 474 497 501 490 470 450 437 433 437 443 444 439 433 436 453 483 517 543 552 538 503 460 421 395 382 383
614 383 394 405 408 407 414 430 443 440 424 408 402 407 423 440 452 455 455 460 468 473 473 472 474 477 484 497 516 532 535 524 511 506 507 508 502 496 503 522 545 559 560 550 529 499 471 459 467 486
595 486 500 504 493 471 445 423 415 419 429 436 433 413 376 332 299 286 285 288 291 298 312 322 318 302 281 264 249 238 239 256 289 323 353 378 403 425 438 436 421 398 371
579 371 344 321 313 326 361 408 451 479 488 481 466 450 439 435 436 443 452 462 470 476 481 485 485 481 476 477 485 494 497 490 476 462 455 457 464 470 472 472 470 469 469 468 466 463 460 458 456 450 438 420 400 382 370
557 370 369 378 393 406 409 394 364 327 297 289 304 333 361 377 381 376 366 351 334 322 317 317 321 330 347 371 397 415 422 419 406 384 356 331 316 312 308 300 295 299 310 319 325 333 348
539C48J8J2Kmnnrj5k1j9j2mjqj8k1j3NK8M2M2L0J6J1J3J1jj7k3j7lJ0J6J7J2J0J0J0Ml%J1
522D59J9J3%j2j7j7j4oQJ5Qpj4nJ0J6Qqj8j9k4k7k5j2PK4L3L2K2Pqj6j8j8j6j2polLJ0Ooj1
505C54nNJ5K4K9K2%k4l5l0j8jRJ2LnmKJ1J8K5K7J9Lj1k1k8l2l6l4k9j6LJ6J8J3J4K0J8J0N
488C66J4K8L0K2Ork0k7k6k3k3k2j3QL6N6O0M7K6Qpj7k4k3j6pprromoonlklnqqqqrpKJ0J3J0
469C72Nkj2k5k6j1PJ9K2K2K1J4J0PMlj1j2mMLknjJ0K5M0M9M1K1nk3l1k9k6k4k3j9j1jPJ6K4
452D37K6J7jj8k8k9l0k8k2j5mKPQNjj1j8j6mJ0K0K6K6K1J2jj1j5j5rMJ9K6K6K1J3O%kJKjk
434D54%MKmj2j8k3k2j7qlkmpj1j5j5j2oJRJ2J4J8K2J8Pnqrj2j5oQJ7J4J0J0J3J3J3J1Mpj6
416D17j8j8j6qJ0K8L2K1Mrj4j3j0rnKRQLmrk0l1l4k0%QN%jjNJ5K5K4J5PKnj4j5j0pj0j1jR
$$ plain form
539 348 366 378 380 376 371 366 357 342 321 302 290 286 285 277 259 238 225 230 258 300 342 372 388 399 412 423 422 405 382 365 362 372 388 405 417 427 437 447 451 448 448 459
522 459 478 491 491 479 462 445 431 425 433 448 456 449 435 430 440 456 464 456 438 419 395 368 343 331 338 362 395 427 449 456 448 432 414 396 380 368 361 355 352 355 365 371 365 354
505 354 349 354 369 393 422 444 444 420 385 355 337 336 345 357 360 355 351 353 364 382 407 434 453 456 445 424 396 364 328 294 265 249 252 268 286 299 313 333 351 361 366
488 366 380 408 438 460 466 457 437 410 384 361 338 316 303 311 347 403 463 510 536 544 537 520 496 473 457 450 443 434 425 419 415 409 403 398 395 393 390 385 377 369 361 353 344 337 339 349 362 372
469 372 377 375 363 338 312 301 308 327 349 371 392 406 416 423 427 424 413 401 397 401 404 402 397 396 406 431 471 520 561 582 577 554 523 494 468 444 421 402 391 390 397 413 437
452 437 463 480 479 461 433 404 374 346 324 309 305 307 314 322 327 326 315 297 281 277 287 307 333 359 380 392 391 380 365 350 341 345 364 390 416 437 450 456 456 454 455 457 456 454
434 454 454 458 460 456 444 426 403 381 364 356 353 351 347 340 329 314 299 287 281 282 291 303 317 335 357 375 382 377 369 360 348 333 327 335 352 366 376 386 399 412 425 436 440 433 417
416 417 399 381 365 357 367 395 427 448 452 443 429 416 406 397 392 394 403 411 414 410 401 381 350 316 296 296 304 309 309 308 307 312 327 352 376 391 398 400 395 381 366 356 349 339 328 327 336
397C36J3J1J2K0K3J7Jj6k5k2j6j3j2mQJ9K1J2%rj0nNPKmoppojNJ1J3J5J1Nkj0k1l3m0l3j1
379B54J2L1L6K9K2J8J7Oj0j8pPJ0Ljkqk0k8j9JJ8K9L2K8K0J4J3J1RNPQOnj3j1mKkj3k6l3l6
362C92l4k7j7o%KMOLlopqj1pJ0L4N1N3M5L1J5kj8k7k8k6k1j0JMJjkoj6k4j8lOQJ0J4J9J4R
343D04QJ0Qlj0nRJ7J2nj8j9j2jOJ1J2QJnnKPQQJ0J4J9J8J4Nnj1j1j0nKPPkj1j7k0k0j5oK%
324D13oj1j3j1j1j1j5j7j4rnrj6j7oJ1K6L1L1K8L1L4L3J5j1l5m3l6k1oOJ3J4J2J5K4L1L2K3
308E00J2lj3j8j6rkj%joj5k6k4j1NJ0RQRQKnj3k1k8k8j5LJ3J3RRJ3J1LkKJ0R%j3j6r%QJ4J9
289D04K5K8K5J5%j6k7l3l2k5j3lOPLkmLJ4K6K6J4nj5j0jjj7l3l7k3NK5L2K0Lj0j3j4j5j6j1
272C05jJ0J9J9J3OQJ9K4J7kj6k6l2l9l7k4mQJ4J4J6J9K1J9J2N%LJ2K0K5J7jj7j9nJ4K1J6K
$$ plain form
397 336 349 360 372 392 415 432 433 417 392 370 354 341 329 325 333 352 373 385 385 376 366 361 366 373 375 371 365 358 351 345 344 349 360 373 388 399 404 402 392 371 338 298 265 254
379 254 266 297 333 362 384 402 419 425 415 397 390 397 407 410 409 407 399 379 351 332 333 351 380 412 440 460 474 487 498 507 512 519 527 533 528 515 504 500 502 500 487 461 428 392
362 392 358 331 314 308 308 310 314 320 323 320 314 307 299 288 281 291 325 376 429 474 505 520 518 500 473 445 419 398 388 389 393 394 393 391 385 369 345 327 324 330 338 348 362 381 395 404
343 404 412 422 430 427 417 412 421 438 450 445 427 408 396 395 401 412 424 432 433 428 423 425 432 440 448 458 472 491 509 523 528 523 512 501 491 486 488 495 502 500 489 472 452 432 417 411 413 413
324 413 407 396 383 372 361 350 335 318 304 295 290 281 265 248 242 253 279 310 341 369 400 434 467 482 471 436 393 357 336 330 336 349 363 375 390 414 445 477 500
308 500 512 509 496 478 462 453 451 450 450 449 443 428 402 378 367 372 382 391 399 408 416 418 413 400 379 351 323 308 311 324 337 346 355 368 379 382 380 382 392 401 401 388 372 363 363 371 385 404
289 404 429 457 482 497 497 481 454 421 389 364 351 348 354 361 364 362 358 361 375 401 427 441 436 421 411 410 409 392 359 322 299 304 329 361 381 384 374 361 347 332 316 305
272 305 304 314 333 352 365 371 379 398 422 439 437 421 395 363 324 287 263 259 267 281 295 311 330 351 370 382 387 387 390 402 422 447 464 463 446 427 422 436 457 473 475
256D75j4k6k9k0j0oj2j5j2o%PJ4J4Jj3j4mJ2K0J9J1NMQQPJmoonoqj1j1kOOqk7l8k7nJ5K4K1
237C33J5J0J0J2J7J8J6Qmj4k0j3jJ2J5J1%j1k0k0j2KJ6K2K5K2J5Jj1j4mJ0K5L0K9J8MpoMJ3
220E56J4NlljMQJ4J7Nj5k7k5j4lJLLLMLjj0j7k0j5j4j8k6k8k0kJ3K2K3J5Jj7l2l5l1k1qPK2
202C37K4J2mpJJ3J7J5Qlj0q%Mnj7k3k1j6j5j5qPK2K5J2pj5qNPJnonrj5k2k5k5j4NK5L4L1J9
184C16NopLJ4J9J7K0K9L8L8L2K8K2Rnj1j0j3k3l3k8pJ5K8K7J4%rpLJ0J1Lqk2l1l1k2j0kJ%
167D17jmj0j7k1j6okklj%jkJK%l%LJJQJ6J7QLQJ1Mqj5j9k2k0j2LJ6K0J8J7J6J7J7J9K4K2J0
147E14j0k4k7j7qmnmmnolKLNJ1J6J1rk8l2k3qJPJ1K0K2J8PKLQQNKLLOQQjj9l6m3l7k4qOJ5
127C40J8J7Rjj6k2j6jJ4K2K3J8Opj6j8j7j8j6j5j1pkMJ2K0K6K3J2mj5j5j0j1j3j2nNQQPPJ0
$$ plain form
256 475 461 435 406 386 376 370 358 343 331 325 325 332 346 360 361 348 334 330 342 362 381 392 397 401 409 417 424 425 421 415 409 404 398 390 379 368 366 372 378 370 343 305 278 273 288 312 333
237 333 348 358 368 380 397 415 431 439 435 421 401 388 387 399 414 425 425 414 394 374 362 364 380 402 427 449 464 465 454 440 436 446 471 501 530 548 552 545 539 543 556
220 556 570 575 572 569 568 572 580 594 611 616 601 574 549 535 532 533 536 539 542 546 549 548 538 521 501 486 472 454 428 400 380 378 391 413 436 451 452 435 403 368 337 316 308 315 337
202 337 361 373 369 362 363 376 393 408 416 413 403 395 395 399 394 377 354 333 317 302 287 279 286 308 333 345 338 323 315 320 327 328 323 317 312 303 288 266 241 216 202 207 232 266 297 316
184 316 321 315 308 311 325 344 361 381 410 448 486 518 546 568 577 572 561 551 538 515 482 454 447 462 490 517 531 531 522 515 518 528 539 542 534 512 481 450 428 418 416 417 417
167 417 416 412 402 385 364 348 342 340 338 335 334 334 333 331 332 334 334 331 331 334 335 336 344 360 377 385 388 396 407 411 403 388 369 347 327 315 318 334 354 372 389 405 422 439 458 482 504 514
147 514 504 480 453 436 428 424 419 415 411 406 400 397 399 402 407 418 434 445 436 408 376 353 345 346 353 364 384 406 424 431 433 436 444 452 457 459 462 465 471 479 487 486 467 431 388 351 327 319 325 340
127 340 358 375 384 383 367 345 329 328 342 364 387 405 411 404 388 370 353 335 319 304 293 286 284 288 300 320 346 369 381 377 362 347 337 326 313 301 296 301 309 317 324 331 341
110C41J7K4K0Qqk0k5k4j5KK3L8L7K5J2N%qk0l0l6l4k6j5jJ4K2K0J2KnlJQJ0RMLKkooJJ0J1
92C97QRJ7K6K5J7Lj2k1k2j3rj1j4qPJ8J9J3Kj1k1k0pRJ8K2K5K6J8Kj6l2m2l8k0kQQPRMnj2
74C81oNJ3J0LjJOOJqj2j2pjNJ0Plj4j8j6pKJ1J4J0J0J8L0L4K4J2QJ3J5J0mk1l0k9k3j4oJK
56D30knnnj3k4l4l1k2j4rollrj7k1k0j3lQJ6J7J2RJ2J6J6Q%mpqnQK4L1L0K7K3J6OknnnlNJ0
36D21J2J1J3J1Loj3j6k1k9l2k6j5kJ3K5K8K6K4K5K2J5PRJ3Prk0k1j4j2j6j9k3k4k0j2jQJ3
20C55J3Mj0k0j7mNNJlqj3j1mLJJQJ8J3lj2mJ3K4K1J1kj1rKJ1QLMJ4J8J1K%JjnJJ9L5L2J0j9
0E11l9m3l2j7jRJ4J6J2Lqj1pOJ6K0J4Jj2j4j2j0j5k0j7j0j0j7k3j6kJ0J6J9J8J2%j4k1j6m
-16C06QJ0QQRQJppnmnnjKPJ0J4J3RLmj1j6j1opj2j4pjkqj2j5j9j6nPJ6K0K5K8K5J9J0PJmj0
$$ plain form
110 341 358 382 402 410 402 382 357 333 318 320 343 381 418 443 455 460 460 452 432 402 366 332 306 291 290 304 326 346 358 360 355 352 353 361 371 380 384 387 389 387 381 375 376 386 397
92 397 405 414 431 457 482 499 502 490 469 447 434 425 414 400 392 399 417 436 449 451 440 419 399 392 401 419 441 466 492 510 512 496 464 422 384 364 362 370 378 385 394 398 393 381
74 381 375 380 393 403 406 405 406 412 418 419 411 399 387 380 379 384 394 401 398 384 366 350 343 345 356 370 380 390 408 438 472 496 508 516 529 544 554 550 529 499 470 447 433 427 428 430
56 430 428 423 418 413 400 376 342 311 289 275 266 260 257 254 245 228 207 187 174 171 179 195 212 224 233 245 261 277 285 285 281 274 266 261 269 293 324 354 381 404 420 426 424 419 414 409 406 411 421
36 421 433 444 457 468 471 465 452 436 415 386 354 328 313 311 324 349 377 403 427 452 474 489 496 505 518 525 516 496 475 461 449 433 414 391 367 347 335 334 342 355
20 355 368 372 362 342 325 321 326 331 332 329 321 308 297 293 296 297 298 306 324 337 334 322 318 331 355 376 387 385 374 365 367 378 386 389 393 407 425 436 438 438 439 438 433 434 453 488 520 530 511
0 511 472 429 397 380 379 388 402 418 430 433 425 414 407 413 429 449 463 464 452 438 426 416 401 381 364 354 344 327 304 288 286 296 312 331 349 361 361 347 326 310 306
-16 306 314 324 332 340 349 357 358 351 344 339 335 330 325 324 326 333 343 357 370 379 382 378 367 351 340 334 327 315 301 294 293 291 283 271 256 237 221 216 223 239 259 284 312 337 356 366 373 374 370 360
-36C60rpj0j8j7mJ2K2K0J1Lmqj1j1j4j8j8j0KON%kppKK2L5L5K7J6NlmOK2K7J8Jj2j5j0oj2
-54D20k2k5j2MPok2k9k2pQJ5J0K%KKnj3j4j3j2j4j1oJPJ1J1J1J5J7J6J1J0J3J5Rknnkmnqp
-73C46lJJjmljjJPJ5J6J0kqpmjnqromkMQJ0NJKMPJ2K1K9K9J8%j3j9j3pnj0nJ0K2J4ok1k1j2
-94C92LK1L0K2%j7j5pkjj%qj8j9j3omkjjKJ3K6K9K1RMPQNjlkJJkmmjknooqj0q%ORPKqj6j3
-116D04KK0K8K5J3%j4k3k4j7q%QJ5J1lj6k1j4m%nj2j3j1j0j1q%NMlkQK0K8L3L5K8J6Kopqr
-134D56j4k0k6l1l0k5j8rNK2L3L2K3J3RJ0J2J1Nkpprrj2j4j6j7j4j0o%PJ4J7J9K2K0J1%om
-151D35%Jlqrqrj1j4j3j2qlKJ1K0L0L2K5Pj3j9rRJ5Qjnqj2j2nMQPJ0J5K2K3J8Rlj5k5k8k2
-169D36j5j2j7k2j6LK3K5J5KJNROML%lqj4j6j3mQJ0Lj2k1j7qJLPQP%nomLRJ6J7J3QMLjnop
$$ plain form
-36 360 351 344 334 316 299 295 307 329 349 360 363 359 351 340 329 315 297 279 269 271 277 282 282 280 273 266 268 290 325 360 387 403 408 405 401 407 429 456 474 475 463 448 438 432 420
-54 420 398 373 361 365 372 366 344 315 293 286 294 309 319 321 321 323 325 320 307 293 280 268 254 243 237 238 245 256 267 278 293 310 326 337 347 360 375 384 382 377 372 370 366 361 353 346
-73 346 343 344 345 344 340 337 336 335 336 343 358 374 384 382 374 367 363 362 357 349 340 334 330 328 332 340 350 355 356 358 362 369 381 402 431 460 478 478 465 446 433 426 421 411 406 416 438 452 446 425 404 392
-94 392 395 416 446 468 468 451 436 429 427 426 425 425 417 399 380 367 361 357 355 354 353 355 368 394 423 444 453 457 464 472 477 476 473 471 472 473 471 467 463 462 460 455 449 443 435 425 417 417 423 432 439 441 433 417 404
-116 404 406 426 454 479 492 492 478 455 431 414 406 406 414 429 440 437 421 400 386 382 382 377 365 352 341 331 320 312 312 317 321 318 316 324 344 372 405 440 468 484 486 480 473 465 456
-134 456 442 422 396 365 335 310 292 283 288 310 343 375 398 411 420 430 442 453 458 456 449 442 433 424 412 398 382 365 351 341 335 335 342 356 373 392 414 434 445 445 439 435
-151 435 435 436 433 425 416 408 399 388 374 361 349 341 338 340 351 371 401 433 458 465 452 433 424 433 448 456 455 450 442 430 418 413 417 425 432 442 457 479 502 520 529 526 511 486 458 436
-169 436 421 409 392 370 354 357 380 405 420 422 423 428 437 443 447 450 450 447 439 425 409 396 392 400 410 413 401 380 363 355 356 359 366 374 381 381 376 370 366 369 378 394 411 424 432 436 439 438 433 427 420
-190D20rrmOJ1Ojj1j4j0KJ5J7Qmj1qkKLjpj2j3j7k4k4j6jRP%ookPJ3J4J1OQJ3J7J7Prk0j9
-209C59qMRQNNOJ1J3J3J3J2J3J1QKkrj5j7j1jMQQKj0k2l0l0k4j6pKPQRJ1J1J1J2J0jj3j5%
-227C64K0L1K8J7QJmrj4j6j1lMKpj9k3k1j8j4qMJ4J8J5RQPKpj3j5j3oJMjrqjNJrj0jJ0J5J9
-247C47K1K3J7OkkOJ4Roj9k1j2%OPQPOKlljLQJ1J1RLjkk%JKKjqj7j8j2kPJ4J5Rlqploj2j2
-268C91qkLONJlKJ0J3RJprnOJ9K3J4Kpj3j8k2k1k0k0j7oMO%mkOJ1J3J0OJmj1j2oOK1K7K4J3
-287D36lj6k3j9j3j4k6l8l4j4PJ5J3MJMJ3K5L1K7J5%qqlkoj4j3m%lj3j2JJ5K0J5J0Mmj7k2
-305C27j6mNNKkmloqrmPJ9K6K1Nqj0QL2M5M3K9J9J8K0J9Prk6l2k8j6jJ5K9L2K0mk5l4l4l0
-322D40k5j4kJ1K3L0L0K2J5J3J2Jj8l7m4l4j5LJ2J3Nnj0j0mMJ4K0K0J0mj4j4j4j6j8j3kOP
$$ plain form
-190 420 411 402 398 404 415 421 420 409 395 385 387 402 419 427 423 412 404 402 404 407 406 399 387 374 357 333 309 293 292 301 308 308 302 296 294 301 314 328 339 345 353 366 383 400 407 398 378 359
-209 359 351 355 364 372 377 382 388 399 412 425 438 450 463 474 482 484 482 473 458 441 430 429 433 441 449 451 441 419 389 359 335 319 312 314 321 329 338 349 360 371 383 393 392 379 364 364
-227 364 384 415 443 460 468 469 465 456 442 426 415 412 416 418 411 392 369 348 330 316 308 312 326 344 359 368 376 383 385 378 365 350 337 331 332 336 335 326 318 317 322 323 314 304 303 313 328 347
-247 347 368 391 408 414 412 410 416 430 439 433 414 393 381 381 387 394 402 409 415 417 414 411 410 413 421 432 443 452 455 454 452 450 450 451 453 455 454 446 429 411 399 397 404 418 433 442 439 431 424 421 415 403 391
-268 391 383 381 384 390 395 396 393 395 405 418 427 428 421 412 407 413 432 455 469 471 464 451 433 411 390 370 350 333 327 331 337 337 333 331 337 348 361 371 377 378 374 363 351 345 351 372 399 423 436
-287 436 433 417 394 375 362 348 322 284 250 236 243 258 271 275 276 280 293 318 349 376 391 391 383 375 372 370 364 350 337 333 333 330 317 305 306 321 341 356 366 370 366 349 327
-305 327 311 307 312 317 319 317 313 310 304 296 287 283 290 309 335 356 361 353 343 351 383 428 471 500 519 537 557 576 583 574 548 516 488 472 471 486 515 547 567 563 538 504 470 440
-322 440 415 401 399 410 433 463 493 515 530 543 555 556 538 501 457 423 408 411 423 436 441 436 426 416 412 416 430 450 470 480 476 462 448 434 418 400 387 385 391 398
-338C98PJ5K9L7L2J5mj9k5k5k3k5k8k5j7kOO%lmkklkLLlj2j3%K4M3M5K7Jk1k9k8k2j6o%KM
-357C38PJ1J3J1Okrj1nNJ3J4J0Jj1k1k3k1j7j4j0jQJ3J1PMJ1K2L3L2K1RMMMLOJ0J2RMLKJl
-375E14npqrj0qmMJ4K0K1J6J2J2J2J1Npk4l7l9k9j2%NPQKrj9k3k2j9j3rj1j2nJ0K4K6J7J0
$$ plain form
-338 398 405 420 449 486 518 533 529 510 485 460 437 412 384 359 342 340 346 352 352 349 345 343 341 338 336 339 342 339 327 314 314 338 381 426 453 454 433 404 376 354 338 332 332 334 338
-357 338 345 356 369 380 386 384 375 364 359 364 377 391 401 402 391 370 347 326 309 295 285 284 292 305 316 323 327 338 360 393 425 446 455 459 463 467 470 476 486 498 507 511 514 516 517 514
-375 514 509 502 494 485 475 467 463 467 481 501 522 538 550 562 574 585 590 583 559 522 483 454 442 442 447 454 462 464 455 436 413 391 372 359 350 339 327 322 332 356 382 399 409
$$ [...]
-2084D83
##END=	
##END=	
