##TITLE=	Sep09-2021.121.fid
TM-VI-090 13C

##JCAMP-DX=	6.0	$$ MestReNova 14.3.1-31739
##DATA TYPE=	LINK
##BLOCK_ID=	1
##BLOCKS=	2    
##ORIGIN=	Mestrelab Research S.L.
##OWNER=	hrzepa
##$MNOVA/LINK_BLOCK_TYPE=	ITEM	$$ NMR Spectrum
##$MNOVA/ITEM/POLYGON=	(XY..XY)
5321,5835
8722,5835
8722,8208
5321,8208
5321,5835
##$MNOVA/ITEM/Z=	0
##$MNOVA/ITEM/ANGLE=	0
##TITLE=	Sep09-2021.121.fid
##JCAMP-DX=	6.0	$$ MestReNova 14.3.1-31739
##BLOCK_ID=	2
##DATA TYPE=	MNOVA NMR VIEW DATA
##DATA CLASS=	MNOVA VIEW DATA
##$MNOVA/ITEM/ZOOM/X=	-31.150195598113686657,	251.15679998888273872
##$MNOVA/ITEM/ZOOM/Y=	-222.10395622253417969,	2326.7019500732421875
##END=	
##TITLE=	Sep09-2021.121.fid
##JCAMP-DX=	6.0	$$ MestReNova 14.3.1-31739
##BLOCK_ID=	3
##DATA TYPE=	NMR SPECTRUM
##DATA CLASS=	XYDATA
##NUMDIM=	1
##ORIGIN=	Bruker BioSpin GmbH
##OWNER=	nmr
##.OBSERVE FREQUENCY=	100.64143946071199309
##.OBSERVE NUCLEUS=	^13C
##.SOLVENT NAME=	CDCl3
##.PULSE SEQUENCE=	zgpg30
##LONGDATE=	2021/09/09 18:33:00.000
##.ACQUISITIONMODE=	SIMULTANEOUS (DQD)
##$ORIGINAL FORMAT=	Bruker XWIN-NMR
##$MNOVA/SCALES_VERSION=	9
##$PARAMETER FILE=	(acqus, ASCII, /private/var/folders/f6/rjf_tdyn2v98c5c0wvkgn4s80000gn/T/evC8Ya+QT5WHtswGcpPPaA/121/acqus, 0)
$$ ##TITLE= Parameter file, TOPSPIN		Version 3.2
$$ ##JCAMPDX= 5.0
$$ ##DATATYPE= Parameter Values
$$ ##NPOINTS= 11	$$ modification sequence number
$$ ##ORIGIN= Bruker BioSpin GmbH
$$ ##OWNER= nmr
$$ $$ 2021-09-09 18:33:19.482 +0100  nmr@CZC2439F63
$$ $$ /opt/topspin/data/agmb/nmr/Sep09-2021/121/acqus
$$ $$ process /opt/topspin3.2/prog/mod/shimcntl
$$ ##$ACQT0= -2.26890760309556
$$ ##$AMP= (0..31)
$$ 100 100 100 100 100 100 100 100 100 100 100 100 100 100 100 100 100 100
$$ 100 100 100 100 100 100 100 100 100 100 100 100 100 100
$$ ##$AMPCOIL= (0..19)
$$ 0 0 0 0 0 0 0 0 0 0 0 0 0 0 0 0 0 0 0 0
$$ ##$ANAVPT= -1
$$ ##$AQSEQ= 0
$$ ##$AQ_mod= 3
$$ ##$AUNM= <au_zg>
$$ ##$AUTOPOS= <58 >
$$ ##$BF1= 100.63037
$$ ##$BF2= 400.2
$$ ##$BF3= 100.63037
$$ ##$BF4= 100.63037
$$ ##$BF5= 100.63037
$$ ##$BF6= 100.63037
$$ ##$BF7= 100.63037
$$ ##$BF8= 100.63037
$$ ##$BYTORDA= 0
$$ ##$CAGPARS= (0..11)
$$ 0 0 0 0 0 0 0 0 0 0 0 0
$$ ##$CFDGTYP= 0
$$ ##$CFRGTYP= 9
$$ ##$CHEMSTR= <none>
$$ ##$CNST= (0..63)
$$ 1 1 145 1 1 1 1 1 1 1 1 1 1 1 1 1 1 1 1 1 1 1 1 1 1 1 1 1 1 1 1 1 1 1 1
$$ 1 1 1 1 1 1 1 1 1 1 1 1 1 1 1 1 1 1 1 1 1 1 1 1 1 1 1 1 1
$$ ##$CPDPRG= (0..8)
$$ <waltz16> <> <waltz16> <> <mlev> <mlev> <mlev> <mlev> <mlev>
$$ ##$D= (0..63)
$$ 0 1 0.00345 0 0 0 0 0 0 0.06 0 0.03 2e-05 3e-06 0 0 0.0002 0 0 0 0 0 0
$$ 0 0 0 0 0 0 0 0 0 0 0 0 0 0 0 0 0 0 0 0 0 0 0 0 0 0 0 0 0 0 0 0 0 0 0 0
$$ 0 0 0 0 0
$$ ##$DATE= 1631208798
$$ ##$DE= 6.5
$$ ##$DECBNUC= <off>
$$ ##$DECIM= 704
$$ ##$DECNUC= <off>
$$ ##$DECSTAT= 4
$$ ##$DIGMOD= 1
$$ ##$DIGTYP= 12
$$ ##$DQDMODE= 0
$$ ##$DR= 21
$$ ##$DS= 4
$$ ##$DSPFIRM= 0
$$ ##$DSPFVS= 20
$$ ##$DTYPA= 0
$$ ##$EXP= <c13q>
$$ ##$F1LIST= <111111111111111>
$$ ##$F2LIST= <222222222222222>
$$ ##$F3LIST= <333333333333333>
$$ ##$FCUCHAN= (0..9)
$$ [...]
$$ ##$Sgu3PowerLevels= (0..7)
$$ 0 0 0 0 0 0 0 0
$$ ##$Sgu4PowerLevels= (0..7)
$$ 0 0 0 0 0 0 0 0
$$ ##$Sgu5PowerLevels= (0..7)
$$ 0 0 0 0 0 0 0 0
$$ ##$Sgu6PowerLevels= (0..7)
$$ 0 0 0 0 0 0 0 0
$$ ##$Sgu7PowerLevels= (0..7)
$$ 0 0 0 0 0 0 0 0
$$ ##$Sgu8PowerLevels= (0..7)
$$ 0 0 0 0 0 0 0 0
$$ ##$SguType= 3
$$ ##$ShimPowMaxUA= (0..63)
$$ 130000 130000 130000 130000 130000 130000 130000 130000 130000 130000 130000
$$ 130000 130000 130000 130000 130000 130000 130000 130000 130000 0 0 0 0
$$ 0 0 0 0 0 0 0 0 0 0 0 0 0 0 0 0 0 0 0 0 0 0 0 0 0 0 0 0 0 0 0 0 0 0 0 0
$$ 0 0 0 0
$$ ##$ShimPowMaxUC= (0..63)
$$ 130000 130000 130000 130000 130000 130000 130000 130000 130000 130000 130000
$$ 130000 130000 130000 130000 130000 130000 130000 130000 130000 0 0 0 0
$$ 0 0 0 0 0 0 0 0 0 0 0 0 0 0 0 0 0 0 0 0 0 0 0 0 0 0 0 0 0 0 0 0 0 0 0 0
$$ 0 0 0 0
$$ ##$ShimPowMaxUG= (0..63)
$$ 524287 524287 524287 524287 524287 524287 524287 524287 524287 524287 524287
$$ 524287 524287 524287 524287 524287 524287 524287 524287 524287 0 0 0 0
$$ 0 0 0 0 0 0 0 0 0 0 0 0 0 0 0 0 0 0 0 0 0 0 0 0 0 0 0 0 0 0 0 0 0 0 0 0
$$ 0 0 0 0
$$ ##$ShimPowRcbType= 3
$$ ##$ShimPowRes= (0..63)
$$ 1e-20 1e-20 1e-20 1e-20 1e-20 1e-20 1e-20 1e-20 1e-20 1e-20 1e-20 1e-20
$$ 1e-20 1e-20 1e-20 1e-20 1e-20 1e-20 1e-20 1e-20 0 0 0 0 0 0 0 0 0 0 0 0
$$ 0 0 0 0 0 0 0 0 0 0 0 0 0 0 0 0 0 0 0 0 0 0 0 0 0 0 0 0 0 0 0 0
$$ ##$ShimPowRng0= (0..63)
$$ 1 1 1 1 1 1 1 1 1 1 1 1 1 1 1 1 1 1 1 1 0 0 0 0 0 0 0 0 0 0 0 0 0 0 0 0
$$ 0 0 0 0 0 0 0 0 0 0 0 0 0 0 0 0 0 0 0 0 0 0 0 0 0 0 0 0
$$ ##$ShimPowRng1= (0..63)
$$ 1 1 1 1 1 1 1 1 1 1 1 1 1 1 1 1 1 1 1 1 0 0 0 0 0 0 0 0 0 0 0 0 0 0 0 0
$$ 0 0 0 0 0 0 0 0 0 0 0 0 0 0 0 0 0 0 0 0 0 0 0 0 0 0 0 0
$$ ##$ShimPowRng2= (0..63)
$$ 1 1 1 1 1 1 1 1 1 1 1 1 1 1 1 1 1 1 1 1 0 0 0 0 0 0 0 0 0 0 0 0 0 0 0 0
$$ 0 0 0 0 0 0 0 0 0 0 0 0 0 0 0 0 0 0 0 0 0 0 0 0 0 0 0 0
$$ ##$ShimPowRng3= (0..63)
$$ 1 1 1 1 1 1 1 1 1 1 1 1 1 1 1 1 1 1 1 1 0 0 0 0 0 0 0 0 0 0 0 0 0 0 0 0
$$ 0 0 0 0 0 0 0 0 0 0 0 0 0 0 0 0 0 0 0 0 0 0 0 0 0 0 0 0
$$ ##$ShimSysFunc= (0..63)
$$ 1 2 3 4 5 7 9 11 15 16 8 10 12 14 6 17 13 18 19 20 0 0 0 0 0 0 0 0 0 0
$$ 0 0 0 0 0 0 0 0 0 0 0 0 0 0 0 0 0 0 0 0 0 0 0 0 0 0 0 0 0 0 0 0 0 0
$$ ##$ShimSysMatrix= 0
$$ ##$ShimSysType= 1
$$ ##$TFXNUM= 0
$$ ##$TRIPLO2= 0
$$ ##$VTU= 2
$$ ##$VTUETH= <149.236.99.20>
$$ ##$VTUTY= <no>
$$ ##$WBREFAM= (0..15)
$$ 135.5 97.7 100 100 100 100 100 100 100 100 100 100 100 100 100 100
$$ ##$WBREFLM= (0..15)
$$ 0 0 0 0 0 0 0 0 0 0 0 0 0 0 0 0
$$ ##$WBREFPH= (0..15)
$$ 72.26 -67.22 0 0 0 0 0 0 0 0 0 0 0 0 0 0
$$ ##$WBSGU= (0..15)
$$ 0 0 0 0 0 0 0 0 0 0 0 0 0 0 0 0
$$ ##$XFAC= 2
$$ ##END=
$$ 
##$DECIM=	704
##$DSPFVS=	20
##XUNITS=	HZ
##YUNITS=	ARBITRARY UNITS
##FIRSTX=	25274.001712016048259
##LASTX=	-3134.6557087493106337
##DELTAX=	-0.43348832563920586258
##XFACTOR=	1
##YFACTOR=	0.045171157197065978095
##FIRSTY=	-1.1286923885345458984
##MINY=	-10.585599899291992188
##MAXY=	2115.18359375
##NPOINTS=	65536
##XYDATA=	(X++(Y..Y))
$$ [...]
22038 62 42 19 -5 -32 -62 -95 -128 -159 -189 -217 -234 -225 -187 -134 -93 -76 -74 -69 -55 -36 -15 4 19 28 36 47 58 56 41 23 12 4 -5 -17 -23 -16 4 34 63 78
22021 78 79 77 78 74 54 18 -19 -43 -44 -24 0 10 0 -18 -22 -11 3 16 32 48 53 48 42 44 53 65 74 70 41 -2 -32 -31 -21 -30 -55 -66 -50 -29 -31 -56 -82 -95 -97
22002 -97 -94 -89 -76 -51 -19 5 11 2 -3 11 39 62 74 81 89 87 69 42 24 21 22 16 4 0 9 24 30 27 21 18 19 30 55 85 97 82 54 36 36 43 44 37 25 15 12 17 26
21982 26 30 17 -14 -58 -99 -125 -134 -139 -150 -163 -167 -162 -161 -159 -135 -75 0 56 73 60 32 -3 -44 -80 -98 -99 -89 -71 -41 -4 20 22 12 5 5 0 -14 -20 -10 7 16 20
21964 20 27 34 30 16 6 9 16 25 37 51 52 34 7 -16 -35 -50 -49 -18 31 78 106 124 136 132 104 59 18 -4 -4 13 39 56 46 11 -25 -39 -23 7 31 35
21947 35 26 13 0 -19 -50 -91 -138 -180 -205 -205 -188 -169 -157 -145 -123 -93 -67 -53 -45 -37 -22 -4 15 31 36 19 -14 -45 -49 -23 13 38 47 45 41 35 25 5 -27 -68
21929 -68 -102 -118 -123 -132 -150 -167 -166 -142 -105 -80 -85 -113 -128 -103 -49 -4 7 -1 -8 -9 -18 -38 -62 -81 -94 -105 -114 -125 -133 -127 -100 -65 -48 -60 -87 -104 -95 -64 -33 -27 -48
21911 -48 -76 -87 -73 -52 -42 -44 -47 -42 -30 -13 3 20 36 49 59 67 71 70 65 59 49 31 2 -28 -52 -65 -64 -48 -22 -6 -16 -50 -88 -115 -129 -132 -120 -96 -80 -82
21894 -82 -93 -91 -71 -46 -27 -11 6 22 34 40 42 39 35 38 48 59 63 59 52 40 18 -12 -36 -30 12 69 100 87 52 35 53 86 104 98 76 55 42 37 34 25 10 -9
21876 -9 -28 -39 -41 -35 -29 -35 -53 -78 -100 -111 -106 -79 -34 9 33 32 20 12 8 -5 -36 -68 -82 -72 -51 -37 -27 -10 19 56 87 102 100 95 103 126 142 132 103 72 45
21858 45 13 -17 -29 -16 4 20 35 54 64 58 47 46 52 51 42 37 41 48 47 40 30 15 0 -4 5 15 11 -3 -11 -1 12 11 -13 -48 -78 -99 -116 -126 -130 -134 -151 -177 -190
21839 -190 -177 -149 -128 -112 -83 -35 17 61 91 109 112 99 74 47 25 13 15 21 14 -11 -43 -62 -61 -51 -46 -49 -58 -66 -67 -56 -37 -12 20 55 82 94 95 90 77 55
21822 55 30 8 -8 -25 -39 -46 -49 -59 -77 -91 -86 -64 -34 -1 35 68 86 89 88 90 85 61 21 -17 -43 -60 -75 -88 -90 -79 -60 -41 -25 -16 -12 -6 6 24 42 56
21805 56 67 71 64 47 28 14 0 -20 -35 -32 -13 1 -5 -28 -43 -43 -38 -42 -54 -66 -78 -93 -104 -96 -72 -50 -46 -51 -43 -16 17 41 44 28 4 -12 -19 -26 -46 -73 -96 -109
21787 -109 -117 -120 -117 -111 -105 -97 -82 -62 -44 -29 -12 1 -4 -33 -71 -100 -117 -132 -142 -135 -114 -100 -105 -119 -125 -119 -112 -111 -106 -88 -61 -34 -14 4 17 16 -1 -27 -41 -37 -24 -15 -15
21768 -15 -17 -14 -9 -13 -34 -64 -86 -93 -95 -98 -99 -92 -82 -78 -79 -79 -78 -78 -73 -55 -31 -20 -29 -41 -42 -35 -32 -35 -36 -29 -19 -10 -4 6 28 55 72 65 44 25 10 -12 -41 -61 -61 -49 -39 -27
21747 -27 -9 9 22 36 55 73 75 57 28 0 -17 -17 0 18 24 20 18 15 4 -8 -6 8 9 -14 -47 -65 -61 -48 -39 -42 -54 -67 -69 -59 -46 -35 -17 12 49 83 106
21729 106 119 123 118 104 85 68 59 59 55 38 12 -10 -29 -50 -76 -93 -88 -60 -19 18 39 36 15 -7 -19 -19 -7 18 49 68 62 38 13 -2 -7 -9 -22 -51 -85 -98
21712 -98 -74 -25 22 46 39 8 -23 -27 -2 28 41 39 36 28 6 -27 -48 -45 -24 0 21 39 48 40 21 7 17 49 78 77 46 16 8 15 20 23 33 41 29 -1 -29 -34
21694 -34 -17 10 39 67 88 102 116 135 149 145 121 87 53 24 0 -25 -60 -99 -135 -158 -162 -140 -93 -43 -15 -18 -36 -45 -43 -41 -51 -72 -98 -115 -106 -68 -20 14
21677 14 31 38 35 16 -11 -29 -28 -18 -8 4 25 42 34 2 -33 -53 -56 -53 -47 -35 -23 -24 -38 -49 -42 -21 -4 0 0 4 12 22 38 60 82 92 86 72 57 44 33 25
21659 25 21 18 12 -2 -29 -64 -92 -101 -93 -79 -71 -64 -48 -25 -6 6 21 41 51 40 15 -1 3 22 37 34 11 -24 -57 -71 -56 -22 8 15 -8 -47 -71 -58 -20 8
21642 8 10 6 22 54 75 70 51 32 15 -1 -10 -3 15 37 60 81 90 84 81 95 117 124 111 95 87 79 67 68 91 121 128 103 65 32 7 -13 -25 -31 -34 -43 -54 -59 -60 -63 -69
21622 -69 -72 -67 -58 -45 -19 25 74 102 93 58 19 -1 0 8 5 -14 -35 -41 -29 -14 -4 6 24 40 46 50 68 96 110 95 61 30 7 -21 -60 -98 -115 -105 -83 -61
21605 -61 -45 -33 -26 -27 -30 -27 -15 -7 -16 -37 -55 -67 -78 -92 -100 -93 -74 -56 -52 -58 -67 -69 -63 -49 -30 -6 11 12 -6 -38 -70 -92 -104 -107 -107 -108 -103 -81 -44 -9 1 -11 -35 -54
21586 -54 -62 -60 -52 -44 -36 -23 -6 5 4 0 5 19 30 36 45 57 63 60 62 80 104 113 97 62 21 -6 -7 16 46 67 83 102 118 118 99 66 26 -15 -44 -56 -58 -63 -67 -57
21567 -57 -27 11 47 71 80 70 50 36 28 20 8 0 1 6 9 9 9 8 0 -20 -51 -83 -96 -75 -25 23 44 35 10 -18 -43 -60 -64 -58 -55 -58 -60 -52 -37 -25 -22 -22 -15 1 22
21547 22 38 40 30 12 -5 -12 -8 -1 -2 -10 -12 -3 3 -3 -19 -24 -5 23 39 27 -5 -32 -35 -11 21 43 46 35 22 19 29 49 65 69 66 58 45 28 15 11 8 0 0 19 55
21528 55 83 89 84 79 70 47 16 -6 -15 -19 -28 -41 -56 -67 -66 -55 -41 -36 -38 -36 -24 -9 0 1 -4 -16 -31 -44 -51 -54 -54 -50 -41 -31 -21 -10 2 12 8 -17 -62 -103 -114 -90 -51
21508 -51 -33 -50 -85 -112 -117 -114 -117 -128 -138 -143 -141 -132 -110 -79 -50 -32 -22 -11 4 25 47 63 66 57 50 60 83 101 96 74 45 16 -11 -33 -46 -50 -51 -45 -28 -4 12
21491 12 9 -3 -7 9 34 41 19 -19 -50 -61 -62 -66 -74 -79 -72 -53 -24 7 33 44 45 49 66 94 118 131 132 123 102 67 21 -21 -45 -46 -38 -35 -39 -40 -33 -18 3 37 78 105
21471 105 101 76 59 59 62 55 51 66 96 127 152 176 191 187 164 139 124 105 71 29 0 -14 -21 -28 -32 -31 -28 -27 -31 -43 -67 -95 -113 -115 -112 -113 -117 -115 -103 -87 -66 -38 -9
21453 -9 10 20 26 31 32 25 15 10 11 17 21 21 17 11 6 2 -1 -4 -3 4 21 44 64 68 56 43 45 62 82 90 80 47 0 -40 -47 -22 9 27 29 27 21 10 -4 -15 -23 -31 -40 -45 -49 -59
21431 -59 -71 -70 -46 -6 28 38 28 17 22 37 49 55 66 81 83 63 32 2 -22 -40 -32 16 84 124 111 67 32 19 18 16 13 14 15 6 -12 -28 -25 -9 0 -10 -30
21413 -30 -44 -51 -57 -61 -54 -40 -25 -7 21 51 57 34 2 -22 -44 -70 -85 -72 -44 -30 -39 -52 -54 -47 -42 -43 -46 -48 -40 -13 27 61 70 57 42 39 50 67 84 100 117 132
21395 132 138 125 95 57 20 -12 -43 -70 -89 -98 -100 -91 -69 -37 -3 22 37 44 46 38 17 -7 -21 -12 13 41 55 54 47 45 54 65 63 48 37 49 79 102 99 72 38
21377 38 17 19 41 67 82 81 75 71 65 53 36 21 8 -1 -9 -10 -2 13 30 36 25 0 -22 -36 -38 -28 0 42 83 101 90 64 38 26 31 42 44 28 1 -23 -43
21360 -43 -58 -67 -72 -83 -104 -125 -134 -132 -129 -124 -107 -78 -51 -33 -18 3 27 38 29 15 12 30 62 90 93 63 18 -13 -22 -25 -33 -38 -26 -2 13 13 12 21 38 54 60 57 49 48 58
21340 58 73 77 66 58 66 78 67 30 -10 -35 -41 -33 -15 2 12 16 28 46 46 13 -38 -69 -52 0 55 83 81 77 94 126 146 141 125 115 106 89 67 50 35 11
21323 11 -18 -41 -50 -51 -38 -4 44 83 91 75 53 36 25 15 5 1 9 33 57 62 49 44 59 79 85 80 77 76 66 45 19 -10 -42 -62 -55 -22 9 15 -7 -40 -60
21305 -60 -59 -42 -20 -1 17 40 63 70 53 23 -5 -21 -30 -39 -43 -33 -2 38 75 104 124 131 114 74 32 3 -13 -25 -29 -26 -28 -39 -44 -17 35 88 114 110 85 50
21288 50 17 -4 -23 -48 -69 -67 -41 -15 -7 -8 -4 0 -13 -39 -62 -78 -97 -126 -150 -153 -130 -97 -75 -71 -77 -76 -61 -39 -24 -17 -10 1 12 16 13 13 24 39 41 20 -10 -31
21269 -31 -38 -44 -52 -43 -9 29 44 29 6 -10 -19 -24 -26 -29 -34 -30 -8 14 11 -17 -47 -57 -56 -53 -40 -18 -8 -21 -38 -28 1 22 21 15 22 38 46 33 3 -33 -55 -49 -23 0
21250 0 14 32 62 96 125 149 167 169 145 100 49 2 -28 -31 -11 0 -21 -62 -87 -85 -71 -62 -53 -38 -26 -29 -36 -30 -10 9 20 23 23 27 39 55 65 55 27 -4 -30
21233 -30 -49 -63 -72 -74 -74 -76 -77 -70 -54 -37 -25 -23 -33 -57 -87 -110 -116 -109 -100 -95 -87 -74 -63 -67 -83 -92 -81 -57 -45 -58 -90 -125 -152 -170 -177 -176 -172 -174 -184 -196 -202 -196 -177 -152 -130
21213 -130 -117 -107 -84 -45 -8 8 9 14 30 48 59 67 75 71 50 23 2 -13 -32 -46 -38 -8 28 58 75 75 56 35 38 71 105 111 93 76 73 74 65 48 30 19
21196 19 18 18 5 -26 -62 -80 -78 -75 -76 -71 -60 -55 -65 -75 -69 -50 -31 -16 0 16 22 16 13 24 45 62 67 67 68 64 42 3 -32 -47 -42 -35 -33 -20 10 48 80 104 126 142
21177 142 151 159 171 176 160 131 113 112 111 97 78 66 57 40 14 -18 -49 -67 -58 -22 20 47 55 58 63 63 53 41 35 42 58 80 95 94 72 45 24 13 4 -6 -10 -5 -1
21158 -1 -9 -29 -48 -57 -60 -70 -90 -110 -122 -116 -91 -54 -21 -6 -14 -30 -37 -29 -18 -19 -41 -72 -91 -88 -78 -78 -91 -98 -89 -71 -61 -66 -80 -92 -88 -67 -39 -16 -2 11 32 45
21140 45 34 1 -28 -29 -4 20 18 -12 -52 -76 -78 -66 -57 -63 -81 -90 -68 -18 30 47 33 8 -16 -46 -74 -86 -81 -76 -79 -75 -48 -11 7 0 -22 -45 -61 -62 -49 -37 -36
21122 -36 -38 -32 -18 -4 18 60 105 121 101 74 59 44 17 -1 5 27 38 32 20 7 -14 -45 -66 -65 -51 -41 -52 -89 -136 -166 -154 -117 -89 -90 -96 -80 -46 -18
21106 -18 -15 -28 -37 -32 -19 -9 -14 -37 -63 -76 -72 -63 -60 -66 -68 -59 -40 -21 0 29 66 93 91 62 26 0 -16 -33 -52 -68 -69 -55 -37 -26 -23 -17 -6 -5 -28 -64 -91 -95 -83
21087 -83 -61 -33 -1 23 40 55 74 94 104 100 82 59 42 40 45 43 28 14 15 21 22 19 21 23 12 -13 -37 -55 -75 -99 -110 -97 -70 -53 -51 -48 -27 7 41 59 55
21069 55 33 5 -10 -5 10 17 6 -15 -28 -19 3 23 30 30 28 24 14 7 12 30 42 32 2 -23 -28 -18 -9 -11 -19 -27 -31 -29 -27 -33 -56 -89 -111 -112 -102 -94 -87 -73 -54 -38 -29 -21
21049 -21 -13 -12 -11 2 28 46 44 32 29 37 45 46 42 31 18 14 21 31 29 20 20 32 44 49 56 69 79 74 51 22 -5 -24 -30 -28 -29 -39 -52 -63 -72 -82 -89 -92 -92 -91 -79 -53 -22
21029 -22 -5 -2 -2 5 12 8 -3 -10 -1 18 32 24 -1 -22 -21 -6 -1 -16 -35 -46 -62 -99 -146 -170 -153 -116 -94 -101 -119 -124 -111 -94 -87 -87 -84 -78 -77 -87 -105 -128 -148 -154 -137 -100
21010 -100 -64 -39 -20 0 14 6 -24 -60 -88 -104 -107 -91 -57 -15 28 74 106 99 55 6 -22 -39 -67 -98 -105 -84 -58 -43 -31 -13 1 8 20 48 79 92 88
20994 88 89 101 113 111 92 56 5 -49 -84 -87 -66 -35 1 47 97 140 168 176 155 104 39 -9 -19 1 23 23 5 -14 -28 -35 -33 -15 13 35 33 12 -9 -26 -47
20977 -47 -81 -121 -149 -158 -147 -120 -88 -61 -45 -30 0 42 79 97 102 106 112 112 101 86 72 55 34 16 10 11 6 -8 -21 -17 -7 -9 -30 -57 -79 -97 -114 -117 -92 -49
20959 -49 -16 -10 -21 -30 -30 -33 -45 -59 -56 -34 -8 5 -2 -27 -56 -71 -57 -22 10 20 7 -9 -21 -30 -41 -58 -75 -87 -85 -65 -34 -4 18 32 33 14 -18 -50 -66
20943 -66 -65 -50 -26 1 24 33 26 7 -22 -53 -74 -83 -88 -91 -77 -42 -5 5 0 9 41 67 57 19 -16 -35 -42 -39 -18 20 59 78 72 56 46 48 54 52 42 35 38 42 27
20924 27 -8 -45 -55 -31 7 35 36 18 0 -6 -9 -14 -20 -15 1 20 37 59 88 110 110 94 80 78 82 81 73 58 37 17 0 -19 -47 -85 -123 -147 -148 -130 -106 -91 -97
20906 -97 -114 -119 -99 -68 -49 -50 -61 -74 -83 -81 -60 -20 21 51 61 57 45 36 35 36 25 0 -17 -10 17 42 55 64 74 75 56 19 -20 -52 -72 -83 -85 -78 -63 -44 -27
20888 -27 -15 -8 -6 -12 -30 -54 -76 -85 -77 -56 -31 -19 -25 -33 -24 5 37 54 64 78 97 109 112 118 134 148 145 127 111 109 111 96 54 -3 -51 -70 -67 -61 -68 -80 -78 -54 -18
20870 -18 10 24 19 -1 -35 -68 -83 -79 -68 -64 -73 -91 -107 -111 -98 -78 -61 -51 -41 -28 -19 -23 -40 -57 -65 -58 -40 -23 -14 -12 -7 2 3 -13 -34 -37 -15 14 39 62 85 100
20852 100 100 90 84 79 69 51 34 21 12 11 18 23 12 -13 -32 -27 -4 16 24 18 0 -28 -58 -82 -87 -66 -22 32 76 93 85 72 66 65 60 47 36 36 47 56 52 37 20
20833 20 13 18 31 50 69 83 82 64 37 8 -14 -36 -60 -82 -96 -97 -89 -88 -100 -123 -145 -154 -149 -138 -129 -124 -111 -78 -30 3 0 -30 -45 -24 10 22 8 -4 4 21 21
20815 21 0 -23 -34 -39 -55 -84 -113 -127 -119 -96 -69 -43 -17 6 19 16 4 -2 2 18 43 75 107 127 121 91 51 21 9 9 7 -2 -12 -4 21 49 59 49 37 41
20798 41 52 52 35 18 17 26 26 15 9 22 47 69 82 82 62 26 -6 -12 5 28 39 37 32 32 36 43 50 59 76 100 111 92 53 22 14 22 35 53 75 85 70 37 2
20779 2 -27 -58 -88 -106 -115 -129 -153 -173 -168 -139 -103 -81 -80 -94 -117 -143 -163 -168 -150 -121 -97 -81 -62 -37 -14 2 18 31 18 -30 -90 -122 -113 -85 -61 -44 -33 -35
20763 -35 -48 -57 -50 -29 -10 -2 -6 -26 -61 -93 -105 -89 -56 -27 -20 -39 -72 -96 -97 -75 -41 -4 27 48 61 70 76 70 49 27 20 27 28 11 -11 -20 -11 2 5 1 0 3 0 -10
20744 -10 -18 -12 -5 -20 -56 -85 -85 -67 -55 -57 -60 -58 -56 -66 -91 -127 -160 -174 -161 -129 -95 -67 -44 -24 -13 -9 -5 10 36 65 87 95 92 79 62 43 22 1 -17 -25 -15
20726 -15 9 34 49 53 54 47 14 -44 -104 -134 -129 -107 -84 -67 -57 -55 -57 -53 -41 -27 -10 12 39 58 65 69 81 98 109 108 96 81 64 47 31 28 43 68 81 69
20709 69 46 30 26 24 20 26 50 78 89 77 54 37 37 52 70 82 92 107 118 116 101 88 80 54 0 -59 -87 -71 -36 -8 7 18 24 22 17 21 40 69 92 92 64
20691 64 14 -35 -58 -46 -13 11 10 -9 -31 -49 -65 -77 -79 -69 -61 -66 -77 -73 -49 -16 9 21 19 7 -10 -32 -50 -57 -46 -24 -13 -25 -52 -72 -72 -60 -49 -43 -35 -22
20673 -22 -10 -2 4 19 39 58 68 61 37 0 -35 -45 -23 8 22 21 25 41 53 43 17 -8 -26 -34 -22 10 44 52 35 16 17 32 39 28 2 -22 -31 -17 12 43
20656 43 67 80 81 68 46 23 0 -22 -34 -24 -5 1 -12 -27 -24 -11 -5 -8 -15 -25 -44 -62 -64 -46 -20 3 26 42 43 33 32 51 70 68 47 30 26 25 22 25 40 58
20638 58 62 56 53 62 79 97 112 114 94 58 26 15 18 20 16 11 11 9 -1 -19 -32 -32 -20 -8 -6 -13 -19 -14 4 29 42 29 -11 -55 -67 -40 2 29 35 39 52 61 51 19
20619 19 -20 -55 -74 -73 -52 -24 -7 -11 -24 -24 -5 18 24 4 -25 -46 -51 -49 -50 -54 -59 -55 -33 5 42 56 49 41 48 67 84 89 85 84 92 109 124 121 100 68 31 -3 -24 -22
20600 -22 -2 8 -5 -36 -63 -75 -80 -81 -76 -66 -54 -40 -25 -13 -9 -11 -14 -25 -48 -72 -76 -51 -11 27 53 62 47 19 0 0 2 -13 -43 -67 -76 -82 -89 -94 -93 -93 -102 -113 -111 -96
20581 -96 -79 -69 -64 -61 -58 -58 -55 -44 -28 -17 -19 -34 -59 -91 -125 -152 -161 -152 -138 -129 -123 -106 -79 -59 -56 -68 -86 -106 -123 -125 -102 -57 -10 25 51 69 81 87 93 100 104 101 95 90
20562 90 86 77 64 54 49 46 45 48 49 39 14 -11 -25 -24 -15 -7 -5 -10 -21 -33 -43 -44 -26 12 57 83 85 75 66 50 18 -17 -37 -27 -2 11 0 -34 -75 -106 -117 -110 -95
20543 -95 -80 -73 -76 -83 -85 -83 -83 -91 -92 -73 -43 -24 -29 -47 -59 -62 -66 -73 -78 -76 -73 -75 -80 -81 -80 -83 -90 -87 -68 -44 -39 -55 -76 -83 -74 -52 -17 22 46 39 8 -21 -35 -39 -38 -32 -16 8 39
20522 39 72 98 111 110 98 75 38 0 -18 -11 6 15 19 34 68 108 132 126 95 56 26 9 -2 -21 -45 -67 -80 -84 -79 -63 -35 -3 21 29 23 18 26 41 47 38 21
20504 21 7 0 0 6 19 37 55 69 75 76 76 75 62 36 11 3 11 22 32 50 79 99 94 72 51 43 42 39 38 44 62 85 101 101 94 97 113 125 113 84 56 40 28 10
20485 10 -13 -42 -74 -101 -116 -115 -106 -96 -85 -67 -34 12 54 73 70 60 56 51 38 31 49 94 137 157 155 141 123 107 97 87 62 16 -35 -72 -90 -101 -109 -110 -105 -93
20467 -93 -69 -29 14 41 48 52 65 75 68 50 42 49 58 55 37 15 -4 -22 -42 -61 -74 -79 -79 -78 -72 -59 -47 -55 -82 -105 -103 -84 -81 -102 -125 -120 -91 -57 -24 13 52 73
20449 73 72 62 53 39 7 -35 -71 -88 -83 -59 -23 5 18 25 44 76 95 85 50 15 5 25 60 90 105 111 119 123 112 83 51 29 15 5 -4 -12 -19 -19 -12 -5 -15
20432 -15 -44 -72 -78 -69 -63 -62 -50 -25 -2 3 1 6 13 8 -8 -25 -32 -33 -30 -18 0 13 7 -18 -54 -86 -105 -101 -79 -56 -48 -52 -49 -29 0 28 48 56 52 49 59 82 97 85 55
20412 55 27 8 -7 -23 -30 -22 -4 11 20 24 24 25 23 10 -17 -46 -57 -44 -24 -13 -12 -16 -24 -31 -21 13 63 103 121 121 116 113 114 109 88 58 34 31 39 47 49 52 56 58 64 82 107
20392 107 124 119 93 54 10 -26 -43 -37 -23 -17 -22 -37 -59 -81 -94 -96 -92 -87 -79 -62 -37 -13 4 10 2 -16 -40 -64 -85 -98 -93 -67 -32 -9 -4 -2 5 11 8 -1 -4 4 15 13
20373 13 -3 -24 -36 -31 -15 1 6 -8 -38 -72 -93 -95 -86 -81 -86 -86 -59 -5 53 92 103 96 86 76 67 62 65 75 88 103 118 127 121 97 60 20 -11 -26 -20 -5 -3 -24
20354 -24 -56 -79 -86 -88 -100 -113 -106 -75 -34 -8 -3 -5 2 23 47 64 66 57 44 30 15 0 -4 8 35 58 62 49 37 36 42 43 32 20 20 39 71 103 125 129 109 63
20336 63 4 -49 -85 -102 -107 -97 -68 -26 10 27 23 3 -24 -53 -78 -91 -88 -75 -61 -51 -45 -32 -10 19 50 79 100 104 87 54 16 -17 -40 -37 -6 39 80 104
20320 104 114 107 84 52 34 33 36 25 13 25 64 105 128 133 132 125 110 92 81 80 78 65 44 23 3 -21 -49 -70 -74 -68 -66 -73 -78 -71 -53 -36 -27 -29 -37 -43 -37 -12 19 37
20301 37 28 1 -29 -51 -53 -30 14 62 88 88 68 34 -12 -62 -89 -77 -41 -15 -18 -45 -87 -140 -194 -228 -227 -197 -155 -109 -59 -7 34 55 52 25 -15 -48 -56 -40
20284 -40 -16 3 19 35 47 53 54 55 59 69 82 91 84 71 68 76 80 63 36 10 -14 -44 -74 -85 -73 -48 -23 0 20 29 22 4 -11 -16 -7 12 32 44 42 30 16 13
20266 13 28 53 70 72 71 77 81 62 18 -23 -38 -22 5 30 47 54 53 44 31 20 15 13 4 -15 -36 -42 -34 -28 -41 -64 -78 -69 -48 -33 -36 -53 -64 -57 -33 -4 14 19 15 20
20247 20 48 97 144 167 161 141 117 94 78 80 103 132 153 166 174 172 153 119 82 55 44 54 78 100 103 89 70 55 40 29 31 50 75 90 90 79 63 47
20230 47 34 26 20 12 3 -6 -21 -48 -85 -118 -128 -107 -61 -7 37 64 77 76 59 23 -18 -45 -44 -18 12 26 16 -3 -10 0 16 27 38 62 96 122 127 117 106
20213 106 103 114 135 156 160 146 127 110 91 66 42 33 33 23 3 -11 -7 5 8 1 -4 -2 5 21 40 55 52 31 4 -13 -12 5 32 52 53 35 12 -2 -2 12 32
20196 32 42 33 8 -15 -29 -36 -41 -44 -44 -41 -38 -27 -5 24 49 62 66 69 78 87 87 76 67 72 88 106 123 139 155 159 145 118 85 47 11 -10 -10 -4 -11 -29 -38 -25 1 24
20177 24 31 19 -10 -46 -75 -90 -96 -99 -89 -63 -36 -27 -36 -44 -34 -11 17 52 92 124 136 128 114 102 91 72 42 5 -32 -62 -76 -77 -77 -78 -74 -62 -55 -57 -57 -43 -28 -35
20158 -35 -62 -74 -49 -1 46 85 111 108 63 0 -38 -29 4 30 38 38 35 32 34 35 25 2 -12 0 27 43 33 16 12 20 29 35 39 36 18 -7 -26 -32 -32 -33 -31 -17 8 39
20139 39 63 76 76 65 47 27 16 15 24 38 56 75 86 80 54 22 0 0 8 14 5 -9 -18 -12 4 15 5 -16 -25 -9 15 21 1 -25 -31 -12 12 21 6 -15 -12 32
20121 32 100 152 164 141 100 46 -10 -49 -52 -33 -22 -28 -32 -19 0 16 26 32 26 0 -37 -63 -64 -46 -22 -5 -1 -8 -15 -16 -17 -23 -30 -30 -23 -20 -24 -26 -17 4 28 42 33 1 -42
20102 -42 -81 -105 -116 -120 -118 -103 -77 -46 -21 -4 10 21 21 7 -9 -10 10 38 49 37 18 6 4 0 -7 -16 -22 -26 -32 -35 -30 -14 1 8 6 6 10 11 10 18 40 61 64 54 44
20082 44 32 5 -39 -82 -107 -115 -109 -96 -86 -95 -121 -135 -112 -64 -26 -17 -22 -21 -9 0 0 -8 -19 -27 -31 -32 -33 -41 -64 -100 -132 -143 -130 -102 -73 -43 -15 2 2 -2 7 29 41
20063 41 24 -7 -25 -16 10 46 81 105 109 90 60 30 0 -30 -58 -72 -65 -39 -2 31 48 45 36 40 63 93 107 102 93 95 102 98 73 43 26 29 38 40 37 44 68 99 121
20045 121 121 106 90 83 78 65 46 35 44 66 82 79 60 40 28 26 29 33 32 24 14 8 12 23 37 46 51 56 61 62 51 33 18 11 14 22 33 44 46 34 14 -1 -4 2 12 23
20025 23 32 40 49 54 45 19 -11 -27 -24 -18 -26 -46 -62 -58 -38 -16 -12 -34 -77 -120 -142 -136 -106 -60 -9 34 63 77 80 68 41 12 -4 -7 -5 -2 14 49 86 105 102 91 77
20006 77 56 33 26 43 72 94 98 93 91 96 107 117 125 126 118 103 82 61 44 32 30 44 75 111 135 139 130 115 97 74 57 53 59 67 68 56 22 -34 -87 -101 -70 -28
19988 -28 -12 -25 -45 -53 -50 -44 -38 -30 -11 25 70 100 101 83 68 58 37 2 -28 -35 -24 -10 3 15 20 8 -18 -44 -58 -56 -42 -31 -38 -65 -89 -85 -53 -13 19 40
19971 40 42 17 -26 -69 -101 -127 -152 -172 -179 -179 -173 -155 -125 -104 -107 -125 -127 -107 -81 -68 -68 -75 -83 -81 -57 -16 13 15 -2 -17 -31 -56 -91 -112 -102 -69 -28 9 41 54
19953 54 42 17 5 17 38 50 53 57 63 59 40 24 28 42 40 15 -10 -8 17 37 27 -6 -37 -55 -63 -64 -56 -35 -15 -8 -16 -29 -42 -54 -62 -56 -30 6 45 83 125 161
19935 161 175 160 131 112 104 98 91 94 110 131 141 132 107 72 39 17 8 -2 -24 -52 -67 -60 -43 -32 -35 -48 -63 -74 -77 -65 -42 -16 6 24 34 33 22 10 9 16
19918 16 14 -12 -57 -92 -100 -86 -67 -53 -35 -2 42 85 115 131 138 136 123 103 87 85 94 98 86 56 20 -14 -47 -76 -93 -93 -83 -75 -71 -69 -68 -70 -80 -93 -98 -88 -64 -31
19900 -31 0 17 15 -3 -26 -44 -55 -62 -65 -57 -37 -11 8 14 9 0 -7 -7 -2 6 21 49 84 106 101 76 59 59 61 45 15 -3 0 4 -5 -22 -22 -3 10 3 -7 6 48 89
19881 89 106 107 110 117 109 83 57 55 72 88 87 71 53 39 27 14 -5 -26 -37 -30 -7 19 44 69 88 94 83 65 53 50 51 50 43 28 5 -19 -37 -45 -39 -19 9 36
19862 36 47 44 38 33 23 6 -7 -7 0 -5 -26 -42 -34 -9 3 -5 -18 -7 27 62 76 72 67 64 56 39 18 0 -20 -43 -65 -75 -67 -47 -27 -16 -13 -13 -15 -23 -35 -41 -34 -17
19843 -17 -1 7 14 22 30 39 47 46 34 18 8 6 -1 -21 -37 -33 -14 2 14 36 67 88 83 63 49 51 62 76 90 100 103 104 107 111 106 93 75 55 29 0 -25 -41 -45 -38
19824 -38 -26 -21 -29 -31 -5 50 107 136 137 128 118 105 86 69 65 80 105 121 115 90 63 57 76 117 169 219 250 255 235 196 145 86 32 -7 -31 -43 -44 -30 -7 19
19807 19 50 77 91 82 62 45 31 4 -35 -71 -88 -85 -74 -64 -61 -63 -61 -42 -11 15 25 17 2 -12 -21 -27 -38 -63 -100 -136 -158 -167 -163 -142 -106 -67 -36 -13 -5 -23
19790 -23 -63 -92 -87 -59 -40 -41 -43 -30 -6 19 42 63 77 82 71 37 -13 -53 -55 -23 6 14 14 23 34 30 10 -10 -23 -33 -41 -42 -33 -21 -11 -3 6 17 29 38 42 37 28 26
19770 26 37 56 70 71 62 51 41 28 9 -12 -35 -55 -67 -62 -33 15 69 109 129 130 121 111 106 101 91 74 57 45 34 27 36 66 107 136 139 124 109 104 102 96 86
19753 86 78 77 77 76 75 69 55 39 34 41 41 22 -2 -9 2 10 6 4 13 20 13 -1 -14 -25 -36 -47 -52 -55 -55 -50 -40 -38 -47 -51 -35 -10 -1 -12 -29 -39 -35 -12 29 67 75 49 13 -8
19732 -8 -9 5 26 35 26 8 -3 -8 -17 -28 -29 -18 -9 -10 -11 -3 15 41 68 83 70 38 13 11 16 14 9 6 -1 -21 -40 -42 -29 -20 -20 -19 -15 -11 -7 -1 2 0 -3 0 10 14 15 25 42 51 50
19710 50 46 46 41 26 16 22 44 70 90 92 74 49 41 53 59 40 18 23 52 74 74 69 74 80 77 66 58 50 38 24 21 30 41 42 23 -12 -48 -65 -56 -36 -28 -38 -58 -71 -70
19690 -70 -58 -40 -24 -15 -12 -11 -3 14 42 65 63 30 -16 -54 -74 -84 -93 -98 -100 -98 -89 -66 -35 -13 -10 -20 -36 -56 -79 -85 -55 6 73 122 151 164 163 145 114 74 28
19672 28 -18 -51 -58 -40 -14 3 5 0 -4 0 10 21 24 20 17 23 36 43 30 0 -30 -50 -57 -53 -42 -26 -11 -6 -14 -36 -68 -93 -90 -60 -35 -37 -52 -47 -11 32 65 87 95 79
19653 79 40 6 1 19 30 15 -9 -21 -8 24 61 84 90 97 120 148 156 130 84 47 42 71 118 155 164 146 113 81 60 54 55 46 16 -23 -51 -57 -47 -29 -2 32
19636 32 68 88 78 43 5 -9 1 13 6 -5 8 49 83 83 63 48 43 36 25 19 18 17 14 16 23 27 25 22 21 19 19 27 47 68 74 63 47 44 62 98 137 155 136 88
19617 88 42 33 62 100 115 105 88 76 60 38 16 0 -14 -33 -48 -55 -59 -66 -69 -56 -33 -18 -17 -20 -21 -23 -28 -30 -23 -4 21 41 45 30 11 3 6 6 -5 -22 -36 -54 -77
19598 -77 -100 -114 -118 -110 -88 -59 -39 -37 -47 -58 -67 -79 -93 -104 -108 -94 -59 -18 1 -6 -16 -3 31 61 70 62 43 16 -5 -10 2 15 12 -4 -23 -35 -38 -32 -27 -32 -39 -35 -17
19580 -17 0 6 13 29 48 59 65 77 92 98 93 86 89 99 110 113 99 68 33 10 4 5 9 20 36 49 57 66 82 103 124 143 157 157 145 130 121 117 114 117 128 140 138 119
19561 119 90 57 25 0 -14 -20 -24 -32 -40 -45 -45 -39 -28 -12 9 38 65 74 61 44 41 52 65 79 104 139 165 166 152 140 132 115 84 48 22 8 2 9 34 64 83
19543 83 91 107 144 190 215 208 179 144 111 89 85 96 98 75 35 4 -7 -9 -15 -20 -18 -10 -4 0 11 30 52 73 86 91 87 74 49 10 -35 -70 -81 -65 -35 -8 2
19525 2 -1 -10 -16 -18 -21 -27 -34 -44 -63 -85 -96 -87 -66 -47 -33 -16 7 28 29 7 -18 -22 0 34 59 75 89 98 96 85 74 63 45 24 15 21 23 12 -4 -17 -34 -57 -73
19506 -73 -66 -48 -36 -32 -21 -2 9 9 3 -4 -20 -35 -31 -8 15 22 20 28 47 67 79 81 71 46 12 -17 -39 -50 -53 -53 -61 -76 -79 -58 -21 8 22 25 24 22 26 40 58 63
19487 63 56 54 67 83 87 81 76 71 58 38 22 14 9 7 12 25 34 29 13 -3 -17 -26 -20 4 37 54 48 35 31 33 28 20 19 25 20 -4 -38 -60 -59 -45 -31 -25 -24 -23 -21 -20 -19 -14 0 16
19466 16 27 29 23 12 9 26 60 84 77 49 31 35 48 59 73 89 91 72 43 20 2 -19 -32 -23 -3 8 6 1 -3 -13 -21 -15 3 18 21 21 23 23 19 20 29 31 20 5 1
19446 1 5 9 12 15 7 -16 -45 -70 -92 -111 -115 -92 -56 -37 -49 -79 -107 -120 -119 -104 -82 -58 -33 -4 24 48 62 64 54 38 27 27 24 4 -29 -60 -75 -75 -64 -44 -19
19428 -19 0 14 26 38 44 43 49 65 79 74 55 42 39 33 9 -28 -66 -96 -113 -111 -91 -66 -51 -51 -54 -59 -77 -108 -135 -136 -112 -82 -60 -37 -4 24 27 -3 -46 -78 -93
19411 -93 -94 -83 -60 -25 13 50 77 90 88 79 69 62 61 65 68 62 42 14 -9 -22 -22 -15 -9 -8 -13 -22 -33 -39 -31 -5 26 50 57 54 46 29 3 -20 -27 -16 3 15 15 7 -6 -20
19391 -20 -32 -44 -53 -56 -52 -50 -57 -65 -58 -28 17 66 104 122 112 78 39 13 6 12 20 22 13 0 -7 0 20 43 65 83 92 90 82 77 74 66 54 51 74 121 170 197 190 161 124 88
19371 88 55 29 19 31 56 74 71 49 20 -6 -30 -51 -67 -71 -62 -49 -48 -57 -63 -50 -26 -11 -17 -32 -43 -49 -57 -69 -79 -84 -86 -77 -47 1 45 65 60 49 43 39 33 29 31 33
19352 33 24 9 8 28 54 55 23 -19 -44 -48 -46 -47 -47 -41 -40 -60 -105 -160 -203 -224 -218 -183 -125 -62 -12 16 25 21 14 8 1 -9 -22 -29 -26 -21 -24 -32 -29 -11 12 27 34 42 51 48 28
19331 28 0 -13 0 37 80 114 131 122 80 13 -49 -82 -82 -65 -47 -31 -14 2 19 38 59 76 81 78 75 79 89 100 105 92 60 24 3 1 6 11 20 37 51 50 38
19314 38 27 25 27 27 28 37 52 64 62 45 26 20 36 66 94 109 112 114 120 125 119 104 95 104 125 139 133 113 85 53 24 9 9 13 8 0 -2 5 15 22 32 49 68 77 71 54 36
19293 36 24 12 -10 -45 -78 -87 -61 -9 44 81 100 107 104 85 48 10 -8 0 23 44 53 49 35 18 12 20 34 37 26 10 -1 -1 15 49 86 111 115 100 72 46
19276 46 32 28 17 -3 -15 4 48 90 114 126 137 145 146 142 137 127 116 117 134 151 149 120 78 38 17 19 36 44 33 12 1 2 10 25 44 56 53 40 32 31 29 29 40
19257 40 61 77 81 81 82 75 57 37 32 37 37 22 0 -17 -19 -9 3 7 -1 -13 -20 -25 -37 -56 -71 -80 -86 -93 -98 -93 -79 -60 -43 -30 -23 -27 -41 -59 -74 -81 -79 -70 -55 -42 -40 -42 -40
19237 -40 -29 -21 -17 -9 8 16 4 -10 2 41 71 70 48 26 5 -10 -7 17 40 40 28 31 49 58 48 28 8 -16 -43 -57 -48 -29 -11 3 15 16 0 -21 -28 -21 -6
19219 -6 13 30 31 8 -20 -34 -27 -15 -6 3 17 32 48 73 106 126 118 84 35 -19 -70 -97 -92 -70 -56 -54 -50 -39 -38 -54 -69 -60 -30 -4 2 -1 3 28 69 113 138 130
19201 130 100 76 83 111 133 136 127 113 95 73 55 44 33 21 16 22 29 28 24 30 37 31 10 -3 2 21 37 46 48 38 14 -15 -35 -40 -31 -11 10 18 9 -4 -6 1 2 -12 -39
19181 -39 -72 -112 -148 -158 -134 -96 -73 -73 -88 -101 -101 -78 -33 13 38 35 16 -3 -16 -19 -9 2 6 5 16 49 84 96 81 60 57 73 94 109 114 119 133 156 174
19164 174 175 159 131 91 40 -11 -47 -59 -52 -41 -36 -39 -49 -61 -66 -57 -41 -25 -9 11 33 41 34 25 27 36 37 28 23 36 61 87 106 120 126 116 85 43 4 -24 -43 -50
19146 -50 -43 -28 -21 -28 -48 -72 -101 -136 -164 -168 -139 -93 -48 -5 39 80 98 93 85 89 92 80 54 26 -4 -44 -84 -105 -106 -107 -124 -148 -161 -156 -141 -122 -105 -86 -57 -11
19129 -11 39 68 61 36 14 -8 -48 -100 -139 -152 -153 -154 -153 -140 -116 -90 -63 -41 -27 -22 -17 -9 -8 -16 -21 -10 8 23 32 42 52 56 56 59 65 68 68 73 83 85 79 75 83 87 68 31
19109 31 0 -13 -10 4 33 62 62 18 -45 -87 -88 -63 -40 -30 -28 -21 -2 28 54 58 41 25 20 14 -9 -44 -65 -59 -36 -13 9 35 58 67 61 50 40 28 11 -14
19092 -14 -42 -62 -64 -43 -8 26 51 57 44 18 -9 -29 -41 -42 -28 -2 20 27 21 14 15 22 36 60 88 104 102 93 92 103 115 120 115 101 80 59 46 42 42 39 36 37 37 27
19073 27 6 -16 -34 -38 -17 33 100 151 162 134 85 35 -3 -28 -41 -49 -56 -55 -35 -3 24 35 29 15 -4 -26 -42 -44 -36 -31 -37 -57 -86 -116 -132 -126 -106 -96 -104 -120
19055 -120 -122 -105 -86 -80 -89 -96 -92 -90 -109 -146 -175 -175 -150 -114 -75 -40 -23 -36 -69 -96 -100 -88 -74 -65 -58 -52 -48 -48 -52 -57 -52 -29 1 21 19 8 2 -1 -17 -49 -81 -94 -82 -51
19036 -51 -15 10 17 7 -11 -32 -45 -43 -16 30 76 100 100 86 72 57 40 23 14 15 19 21 22 30 49 71 80 73 58 50 52 55 46 26 10 12 32 58 78 83 70 41 4
19017 4 -26 -42 -39 -24 -9 -5 -15 -29 -38 -41 -49 -74 -115 -158 -183 -183 -171 -167 -180 -196 -201 -194 -190 -187 -173 -140 -101 -69 -47 -30 -23 -34 -60 -92 -120 -140 -148 -134 -101 -61 -32 -21
18999 -21 -20 -14 3 20 19 0 -19 -27 -36 -61 -96 -116 -117 -109 -94 -63 -17 25 46 50 54 59 55 36 13 0 0 3 9 19 38 56 64 60 58 71 94 115 127 132 123 99 71 61
18980 61 66 67 57 54 74 96 93 71 53 48 39 21 4 -6 -24 -56 -89 -101 -86 -57 -25 6 39 72 98 109 106 98 95 88 60 14 -25 -42 -51 -73 -99 -102 -76 -45 -31
18962 -31 -25 -12 6 21 36 65 103 131 131 112 95 90 89 80 57 20 -23 -59 -77 -79 -71 -60 -50 -45 -47 -53 -56 -53 -49 -45 -40 -30 -18 -11 -12 -21 -35 -50 -53 -37 -6 21 33 30 23
18943 23 24 42 77 115 143 162 180 199 205 186 146 96 47 5 -23 -43 -69 -104 -133 -134 -114 -98 -97 -103 -108 -111 -102 -70 -25 0 -10 -40 -66 -82 -89 -82 -62 -50 -65 -93
18926 -93 -98 -66 -20 11 20 11 -10 -35 -52 -57 -55 -55 -53 -54 -63 -82 -93 -83 -59 -40 -34 -34 -30 -27 -33 -43 -53 -64 -74 -72 -39 19 73 84 50 -1 -41 -64 -82 -95 -93 -84 -85 -108
18906 -108 -135 -137 -106 -61 -30 -26 -30 -17 20 57 68 58 51 58 65 62 54 48 46 44 45 50 53 48 44 45 44 31 11 -5 -24 -52 -80 -85 -53 4 71 128 160 158 133 103 80 61
18887 61 45 32 27 28 33 37 34 20 7 4 8 1 -21 -52 -79 -97 -96 -68 -26 6 25 44 69 87 91 96 121 154 169 155 123 82 34 -13 -44 -49 -37 -26 -28 -46 -72
18870 -72 -89 -86 -67 -44 -22 -4 -1 -18 -50 -80 -100 -113 -118 -110 -95 -91 -103 -119 -123 -114 -96 -70 -43 -32 -43 -62 -66 -59 -64 -92 -124 -131 -106 -69 -36 -8 22 53 68 65 56
18852 56 58 68 70 57 39 28 20 6 -14 -36 -51 -55 -47 -35 -25 -20 -16 -9 -7 -23 -51 -69 -67 -54 -46 -44 -36 -22 -19 -40 -70 -86 -80 -62 -48 -46 -50 -47 -28 1 26 34 28 20 14 -1
18832 -1 -30 -59 -71 -65 -50 -29 -3 26 46 45 26 4 -8 -11 -5 6 23 37 40 31 26 41 67 79 61 27 -1 -17 -24 -25 -18 -1 21 36 34 15 -8 -20 -20 -24 -41 -57
18814 -57 -50 -15 30 69 85 67 24 -12 -17 5 28 40 49 57 48 14 -27 -46 -28 10 44 58 53 40 28 18 4 -10 -17 -18 -23 -37 -44 -31 -4 22 47 73 101 120
18796 120 126 118 95 63 40 39 49 51 42 34 36 33 16 -7 -18 -13 0 17 36 52 57 51 42 42 54 69 76 72 65 69 86 106 116 115 119 135 157 170 168 156 136 114 96 88 83
18777 83 69 43 17 1 -9 -20 -22 -2 37 75 103 126 142 131 84 24 -5 11 58 101 121 124 127 137 142 122 79 35 8 -9 -26 -37 -34 -30 -40 -58 -62 -51
18760 -51 -46 -56 -63 -50 -24 -1 13 23 18 -8 -47 -75 -84 -80 -70 -53 -33 -19 -20 -28 -27 -11 10 18 5 -15 -28 -27 -19 -9 0 0 -10 -24 -26 -12 7 27 50 71 74 52
18742 52 23 2 -10 -25 -45 -68 -96 -127 -151 -163 -173 -188 -193 -171 -125 -75 -31 6 29 20 -19 -64 -93 -102 -96 -82 -70 -74 -90 -98 -76 -29 24 65 74 44 -4 -36
18726 -36 -34 -20 -23 -36 -35 -14 6 12 15 29 49 56 42 14 -11 -17 -5 7 3 -10 -18 -11 0 10 28 60 89 94 78 61 55 53 41 20 0 -9 -10 -12 -25 -52 -76 -74 -39
18707 -39 12 54 75 81 83 84 80 68 57 58 66 65 50 32 29 38 40 23 -1 -15 -9 9 32 49 54 47 40 41 51 58 57 56 59 60 51 36 33 44 59 68 77 98 124 131 108 73 56
18687 56 62 67 57 41 32 29 20 5 0 1 -7 -41 -85 -114 -115 -99 -79 -65 -59 -54 -40 -9 31 63 77 79 76 67 50 31 30 52 81 100 107 114 126 129 112 87 78 99 131 147
18668 147 136 111 89 75 60 42 22 6 -2 -4 -4 -7 -21 -50 -82 -98 -90 -68 -49 -36 -21 -5 -2 -22 -51 -70 -70 -62 -63 -79 -108 -136 -153 -152 -140 -128 -119 -112 -99 -74
18650 -74 -40 -9 7 17 40 75 102 98 73 48 30 11 -7 -5 20 43 40 21 12 20 31 33 27 16 -1 -22 -33 -21 12 56 98 125 126 104 77 61 55 48 32 18
18633 18 16 24 26 11 -11 -25 -18 4 35 65 80 70 34 -7 -35 -46 -55 -69 -85 -89 -76 -42 5 55 89 98 92 89 92 92 84 72 65 67 71 77 85 91 92 83 67 48 25 0 -19
18613 -19 -27 -27 -31 -48 -74 -101 -121 -129 -125 -112 -90 -59 -20 17 44 57 67 81 95 101 102 105 107 100 83 72 69 57 21 -26 -57 -56 -32 -4 16 26 29 36 51 69 77 76 75
18595 75 79 74 60 55 72 96 93 52 -6 -56 -86 -99 -99 -85 -61 -33 -8 13 32 48 58 62 60 52 39 24 7 -4 -4 12 39 69 95 113 119 108 86 70 76 99
18577 99 121 127 121 119 128 136 130 112 100 106 121 129 121 109 107 123 149 165 159 139 121 114 111 102 90 81 72 58 39 17 -7 -35 -59 -72 -82 -99 -122 -139 -140 -123 -93 -56 -24
18559 -24 -13 -21 -34 -41 -47 -54 -57 -48 -30 -12 0 10 17 19 16 10 -1 -18 -32 -30 -16 -9 -23 -48 -62 -54 -30 -5 8 8 3 5 16 22 12 -8 -25 -32 -32 -26 -7 30 77 111 114
18539 114 86 42 -6 -52 -86 -95 -76 -42 -17 -13 -17 -13 1 16 26 30 28 19 7 7 18 18 -8 -54 -85 -84 -55 -16 21 42 34 -3 -48 -69 -52 -6 44 73 67 40
18522 40 26 43 77 104 121 142 171 190 184 157 125 99 82 74 72 77 92 114 129 123 99 76 67 70 82 106 140 164 160 138 116 100 82 59 42 34 29 20 9 2 -2
18504 -2 -10 -18 -16 -3 14 28 28 18 4 -10 -34 -70 -106 -124 -114 -80 -33 14 51 74 90 109 123 116 87 51 25 11 5 5 10 13 8 -5 -29 -57 -74 -61 -18 27
18487 27 49 45 31 19 6 -8 -16 -13 0 9 12 7 -1 -14 -32 -52 -67 -78 -90 -107 -117 -98 -46 13 52 63 64 72 90 114 143 165 164 134 93 61 42 27 12 4
18470 4 2 -4 -19 -33 -28 -6 20 39 53 67 86 109 132 151 162 165 164 157 142 125 116 117 114 92 53 10 -25 -51 -63 -62 -53 -47 -45 -43 -40 -41 -45 -45 -35 -22 -10 3 26 54
18450 54 75 83 82 77 70 61 51 42 37 35 35 29 16 9 23 54 77 70 36 0 -23 -38 -55 -75 -90 -98 -103 -95 -65 -24 -1 -13 -38 -44 -22 10 42 69 88 93 91 94 98 87 57
18431 57 29 20 23 22 16 12 10 6 -3 -18 -41 -69 -88 -95 -101 -112 -117 -103 -81 -70 -68 -58 -36 -18 -12 -2 22 53 78 97 113 118 103 79 63 60 60 59 56 57 61 68 75 76 72 74 86
18411 86 99 100 90 81 78 70 55 35 14 -14 -49 -77 -85 -76 -61 -42 -17 3 3 -13 -28 -21 4 40 76 99 95 63 21 -3 -4 3 4 -7 -27 -43 -45 -31 -13 -1 11
18393 11 35 60 64 44 27 30 42 42 33 28 28 22 7 -6 -24 -56 -102 -141 -150 -130 -99 -74 -61 -56 -53 -53 -58 -69 -78 -80 -74 -60 -35 -5 9 -7 -46 -79 -86 -72 -49 -25 -12
18374 -12 -23 -58 -97 -116 -109 -82 -49 -19 7 33 56 67 61 46 29 6 -20 -31 -6 34 54 44 35 52 85 115 143 172 194 198 188 175 162 149 147 161 170 150
18358 150 111 81 71 71 70 71 66 51 35 43 79 115 123 109 93 81 64 34 0 -21 -27 -24 -25 -33 -39 -29 -2 26 45 54 61 72 85 91 92 96 104 107 95 76 71 86 103 97
18339 97 72 50 44 48 48 43 39 36 29 21 20 38 71 99 102 85 70 74 80 68 36 3 -10 -3 13 25 13 -31 -94 -149 -181 -191 -181 -151 -102 -48 -4 18 20 8 5 27
18320 27 67 100 115 115 109 99 92 92 100 108 113 118 121 112 86 51 19 -7 -28 -45 -56 -60 -57 -47 -38 -33 -28 -12 8 26 37 47 50 28 -14 -47 -44 -20 -2 0 2 18 40 54
18301 54 61 66 72 79 84 84 81 81 92 113 133 134 106 55 7 -12 -2 13 13 -3 -20 -23 -13 7 35 66 92 108 111 107 107 111 107 78 31 -7 -23 -31 -50 -73 -81 -67 -43 -23
18282 -23 -12 -11 -20 -33 -41 -45 -48 -51 -48 -39 -26 -9 10 32 55 76 89 76 32 -12 -16 27 81 101 79 40 14 0 -23 -65 -107 -117 -91 -57 -49 -67 -82 -70 -32 13
18265 13 48 57 35 1 -19 -20 -16 -19 -21 -13 5 23 35 36 20 -8 -31 -30 -13 0 -2 -11 -15 -13 -7 6 27 40 27 -4 -28 -26 -11 0 8 33 76 109 106 73 42 38 60
18246 60 85 97 90 69 47 32 19 1 -15 -14 9 41 62 62 47 28 13 5 0 -1 4 19 37 54 68 77 74 52 20 -5 -23 -40 -56 -59 -45 -28 -20 -12 12 49 72
18229 72 66 39 14 5 11 18 12 -10 -45 -77 -89 -80 -61 -44 -28 -2 32 61 73 76 79 77 65 47 36 38 48 60 71 71 51 18 -7 -20 -26 -26 -17 -2 1 -3 1 28 58
18210 58 68 57 42 29 16 12 29 58 73 63 47 41 44 47 56 73 87 80 49 23 27 55 79 82 71 67 71 69 57 44 39 33 19 5 8 31 57 73 75 65 46 22
18192 22 2 -7 -11 -15 -23 -32 -31 -18 -5 -7 -24 -38 -34 -11 15 34 35 18 2 9 39 64 58 30 5 -7 -15 -23 -30 -35 -46 -57 -60 -56 -55 -52 -31 7 48 74 89 99 99 86 66
18172 66 54 48 41 29 15 2 -7 -4 19 53 75 73 49 19 -3 -17 -24 -24 -14 7 32 48 46 23 -6 -21 -4 35 64 58 25 -9 -27 -29 -21 -5 4 -8 -45 -82 -99
18154 -99 -100 -96 -85 -67 -54 -61 -85 -106 -116 -121 -130 -132 -112 -69 -14 32 60 67 59 43 25 8 -2 -7 -8 -7 -6 -5 -2 4 11 11 2 -6 -2 18 45 71 95 117 127 122 102 72 37
18135 37 7 0 20 43 44 27 12 9 12 17 24 26 14 -10 -29 -32 -24 -15 -5 9 23 25 15 0 -7 -3 10 26 40 54 72 87 88 72 56 52 53 43 19 -1 -3 7 12 2
18116 2 -16 -29 -28 -16 -2 8 13 10 0 -9 -8 3 19 36 53 69 77 77 78 85 93 89 71 53 47 55 68 81 87 82 58 20 -14 -28 -15 8 25 36 54 84 105 99 73
18097 73 55 61 77 81 70 63 67 68 56 36 24 26 34 40 39 27 1 -22 -28 -19 -14 -21 -24 -9 12 17 11 18 42 55 37 3 -13 -10 -10 -26 -45 -48 -35 -23 -25 -35 -41 -34 -19 -7
18077 -7 -10 -32 -65 -92 -107 -113 -121 -134 -138 -119 -76 -26 14 40 47 36 9 -23 -47 -51 -35 -8 14 18 7 -2 1 16 34 50 68 84 93 96 96 88 62 27 5 9 24 27 16
18059 16 11 21 36 47 52 54 49 35 16 0 -13 -34 -66 -96 -112 -108 -90 -65 -40 -18 4 26 42 40 18 -13 -43 -63 -73 -73 -61 -33 3 36 48 38 11 -26
18042 -26 -70 -107 -119 -108 -95 -101 -118 -124 -108 -80 -52 -23 7 31 47 62 81 94 89 69 51 36 14 -15 -35 -31 -17 -13 -24 -34 -36 -42 -63 -96 -127 -145 -152 -149 -134
18025 -134 -110 -79 -39 3 35 45 40 41 54 58 41 13 -1 0 3 1 2 11 21 25 21 18 21 29 34 24 -2 -27 -30 -11 10 27 40 48 37 11 0 18 47 49 21 -11 -24
18007 -24 -9 26 70 104 120 117 97 56 -2 -50 -54 -21 11 21 17 20 35 54 70 80 81 77 82 96 105 95 74 58 51 48 38 17 -14 -52 -85 -101 -95 -69 -27 19
17989 19 52 61 52 41 40 46 45 18 -40 -114 -170 -188 -181 -166 -144 -105 -55 -10 22 47 66 73 65 49 32 11 -14 -35 -42 -35 -28 -24 -20 -17 -22 -43 -68 -72 -41 11 52 59 43
17971 43 27 28 45 64 72 67 61 67 83 98 99 91 79 63 41 23 23 38 53 55 48 40 34 36 47 64 83 103 123 130 116 86 61 57 70 91 114 133 134 105 55 11 -5
17952 -5 8 40 68 82 83 81 80 80 82 89 102 114 123 127 131 136 146 155 149 119 74 40 29 28 19 0 -10 -5 6 11 6 1 5 18 35 57 81 104 117 112 95 82 89 113 137 143
17932 143 124 95 73 66 62 44 11 -25 -60 -89 -109 -114 -102 -87 -78 -71 -56 -30 0 25 35 18 -21 -62 -80 -70 -40 0 40 65 63 46 44 71 107 130 137 136 126
17915 126 103 77 64 67 74 78 88 110 137 153 153 144 131 114 92 66 42 23 10 1 -11 -31 -55 -69 -60 -24 19 41 23 -19 -57 -70 -64 -57 -54 -54 -58 -65 -70 -68 -59 -51 -46
17896 -46 -42 -40 -37 -28 -7 18 33 33 28 23 15 4 -1 0 0 -5 -3 16 41 53 52 54 67 73 54 8 -45 -82 -89 -64 -25 6 15 1 -23 -39 -36 -20 -9 -10 -17 -20 -16 -12 -12 -15 -20 -25 -20
17875 -20 7 49 82 89 69 33 -5 -30 -35 -32 -43 -74 -110 -136 -148 -150 -140 -118 -93 -73 -53 -23 6 21 27 49 97 147 168 158 141 138 146 145 126 93 54 14 -23
17858 -23 -52 -73 -89 -100 -97 -77 -48 -34 -47 -77 -102 -111 -101 -74 -34 9 41 50 43 36 42 56 66 67 69 87 117 136 130 110 96 88 74 50 31 31 44 50 38 12 -13
17841 -13 -30 -31 -19 0 10 8 -2 -7 4 25 41 42 27 4 -13 -17 -13 -14 -33 -61 -75 -61 -27 4 18 11 -10 -32 -40 -35 -25 -11 9 39 63 68 57 40 24 10
17823 10 2 3 15 32 50 71 90 103 111 121 132 134 120 93 62 39 35 50 71 82 78 68 58 46 26 2 -10 -5 13 23 8 -27 -60 -70 -60 -42 -21 0
17807 0 11 0 -22 -40 -51 -71 -102 -119 -103 -68 -44 -38 -35 -26 -12 2 21 41 51 44 28 16 15 20 30 44 60 69 56 16 -40 -89 -112 -105 -87 -77 -74 -65 -42 -17
17789 -17 -10 -19 -23 -17 -13 -22 -28 -10 26 63 90 116 143 157 149 130 114 103 95 90 87 84 78 68 52 21 -19 -49 -50 -25 2 18 16 2 -8 -3 16 31 23 1 -13 -13 -5 0 1
17770 1 0 0 8 34 77 121 149 158 154 139 107 54 -6 -46 -48 -25 -7 -7 -9 1 20 34 38 45 56 61 48 20 -11 -35 -46 -45 -38 -29 -16 -1 5 -8 -36 -58 -63 -60 -65 -82
17751 -82 -101 -112 -109 -97 -83 -72 -62 -46 -25 -8 -6 -20 -44 -64 -72 -63 -38 -5 28 54 70 70 53 23 -11 -37 -51 -58 -60 -50 -24 6 20 13 3 6 14 14 6 2 4 4
17733 4 3 9 27 47 61 72 84 95 100 95 82 64 41 21 11 12 22 34 40 34 19 4 -2 -4 -8 -17 -26 -19 9 45 64 55 25 -11 -44 -64 -65 -51 -35 -26 -23 -24 -37 -66
17714 -66 -97 -106 -81 -37 1 17 9 -4 -2 14 21 4 -14 -6 28 61 71 67 57 44 27 12 0 -17 -34 -39 -34 -39 -60 -79 -78 -65 -50 -35 -18 -4 4 21 48 64
17696 64 54 29 14 10 4 -12 -27 -28 -12 18 53 77 78 67 55 46 34 25 24 20 4 -11 -8 11 25 22 11 4 4 13 33 53 54 36 25 38 67 90 95 78 41 -2
17678 -2 -35 -51 -60 -68 -61 -33 -6 -5 -25 -39 -38 -40 -58 -81 -90 -85 -76 -61 -28 24 74 98 92 74 57 40 17 -6 -19 -15 -4 0 -6 -16 -20 -12 4 22 32 32 26 17 11 16 35
17658 35 58 70 67 59 54 44 18 -18 -52 -64 -56 -38 -26 -24 -23 -18 -10 -12 -32 -65 -97 -114 -115 -99 -75 -50 -32 -21 -17 -20 -25 -22 -5 16 29 27 20 11 0 -16 -34 -48 -55 -55
17639 -55 -37 2 51 86 101 106 116 125 122 109 100 101 101 94 84 77 70 65 66 69 59 31 5 7 40 80 107 120 125 119 103 88 83 86 93 105 128 157 185 202 201 179 149 130
17620 130 129 131 122 106 99 105 114 114 108 104 103 101 92 75 58 43 27 5 -15 -19 -3 19 34 37 36 36 39 45 51 54 63 85 116 136 128 103 77 57 38 19 1 -13 -30 -43 -41 -24
17600 -24 -7 0 -4 -13 -24 -28 -19 0 15 9 -15 -38 -41 -24 -3 5 -1 -10 -12 -9 -9 -14 -15 -9 2 19 47 84 118 131 121 99 81 69 56 34 10 -1 0 6 11 14 8 -14 -52
17581 -52 -81 -83 -63 -38 -16 0 0 -12 -21 -9 16 30 24 11 1 -8 -16 -17 -15 -23 -37 -39 -20 5 29 56 85 92 62 14 -17 -24 -23 -27 -35 -39 -40 -38 -33 -30 -26 -7 31 65 62 20
17561 20 -25 -51 -58 -63 -69 -69 -59 -43 -24 -7 -4 -18 -34 -39 -30 -14 8 50 106 156 175 152 107 71 62 70 69 51 32 33 55 83 106 119 114 87 48 16 0 -4 2 21
17543 21 37 26 -13 -50 -54 -32 -11 0 13 34 52 58 59 62 63 55 41 31 30 40 64 95 120 133 138 144 145 135 122 119 124 125 116 108 110 118 127 130 126 113 96 87 88 94 106 128
17523 128 157 183 196 197 182 146 92 37 0 -26 -45 -52 -36 -3 28 48 56 58 58 61 69 67 47 17 -6 -24 -49 -73 -75 -55 -39 -45 -52 -35 0 29 42 51 63 72 75
17505 75 82 92 95 84 74 79 92 93 77 58 53 61 75 91 110 131 145 149 151 160 169 167 149 123 97 79 76 91 108 98 51 0 -25 -24 -26 -40 -51 -48 -45 -55 -63 -44 5
17486 5 66 115 133 112 68 37 50 102 163 208 232 234 217 196 184 181 171 148 115 81 48 23 17 27 40 48 57 68 69 52 32 29 42 50 43 27 8 -9 -20 -17
17469 -17 0 21 36 35 16 -10 -26 -20 -1 16 24 21 5 -23 -52 -64 -50 -13 33 73 94 96 91 80 50 2 -36 -40 -17 0 -2 -10 -12 -19 -37 -58 -69 -71 -64 -39 11
17451 11 69 111 128 128 114 89 59 34 13 -4 -5 18 54 74 64 39 17 1 -15 -31 -37 -35 -33 -39 -47 -43 -25 -4 7 8 12 27 45 54 54 56 66 76 74 57 33 16
17433 16 11 13 16 22 38 56 61 50 40 45 51 42 26 28 52 67 54 30 28 48 65 60 42 36 46 59 59 46 37 43 63 88 104 104 79 34 -14 -44 -46 -27 -7 3 6 10
17414 10 18 28 33 34 32 32 36 44 52 48 22 -14 -36 -32 -19 -18 -25 -27 -25 -32 -43 -42 -24 -7 1 11 30 46 46 33 17 5 1 5 15 18 15 16 30 42 42 37 42 55 60 57 52 47 30 0
17392 0 -28 -39 -31 -13 4 17 28 41 55 61 61 69 92 114 113 97 91 105 117 109 88 73 72 80 91 104 118 137 161 184 187 157 111 80 80 98 114 121 121 109 76 28
17374 28 -13 -31 -29 -25 -30 -42 -54 -53 -31 11 51 64 44 17 4 5 6 -1 -12 -23 -30 -25 -8 11 22 30 48 75 98 113 125 134 124 88 45 21 16 10 -17 -57 -81
17356 -81 -80 -68 -67 -79 -79 -47 2 43 60 57 49 39 33 32 34 32 32 35 32 10 -26 -55 -62 -51 -27 6 44 63 55 36 30 35 35 28 30 46 61 65 66 67 61 44 29 29 43 55 64
17336 64 81 111 142 154 145 131 134 159 185 178 129 61 15 13 41 70 90 105 116 113 83 33 -14 -48 -68 -80 -77 -45 15 83 124 120 81 43 38 68 103 112 93
17319 93 65 40 17 -7 -23 -20 2 27 37 29 17 16 29 48 69 93 119 131 112 66 20 -3 -1 12 27 44 69 100 124 131 121 105 95 97 109 129 159 191
17303 191 211 207 178 138 103 77 56 37 24 23 31 41 49 58 70 78 74 56 32 13 3 3 8 16 20 24 32 48 72 100 130 156 168 162 139 111 88 74 66 60 57 64 78
17284 78 83 66 36 13 13 24 33 39 49 62 68 61 50 45 49 61 80 99 112 116 117 123 137 155 169 175 173 170 169 164 145 114 83 66 59 54 44 27 2 -28 -57 -73 -80 -85 -85
17264 -85 -67 -24 26 58 62 49 38 34 34 38 52 73 87 81 63 50 51 49 25 -14 -50 -68 -83 -103 -118 -111 -84 -52 -28 -11 1 14 35 65 88 85 59 39 49
17248 49 79 99 87 48 7 -12 -6 9 12 -8 -44 -77 -100 -117 -131 -140 -138 -121 -92 -58 -30 -15 -11 -11 -5 9 28 43 55 75 116 169 217 245 255 255 262 292 347
17231 347 402 415 370 291 214 151 101 64 45 44 51 59 66 62 36 -9 -52 -75 -72 -54 -36 -34 -55 -90 -124 -148 -161 -155 -124 -75 -37 -26 -27 -14 24 73 106 112 93
17214 93 70 61 65 64 46 20 2 -4 -3 0 6 8 5 9 32 64 88 98 104 112 115 114 121 143 161 152 123 94 69 34 -10 -44 -53 -49 -51 -56 -54 -45 -48 -65 -86 -95 -90 -70 -33 13 55
17193 55 81 92 91 71 34 -3 -23 -32 -46 -68 -85 -79 -51 -12 21 33 24 11 16 43 73 89 92 91 88 82 76 75 77 75 68 60 60 74 102 134 157 171 181 186 177 154 136 140
17174 140 158 166 154 136 127 122 109 90 84 103 132 144 125 93 73 73 81 80 74 77 93 113 124 127 121 104 66 11 -38 -59 -53 -41 -37 -37 -24 1 25 36 37 37 45 60 78
17156 78 97 118 140 151 135 100 77 87 115 124 100 66 46 43 52 72 101 122 124 114 110 119 130 132 118 92 61 37 25 18 8 -3 -13 -19 -25 -33 -42 -46 -37 -13 12 20
17137 20 12 7 18 31 28 18 15 16 11 4 11 32 48 46 38 35 39 43 47 54 60 57 40 16 2 8 22 22 1 -24 -39 -45 -50 -47 -23 11 38 52 67 85 99 105 110 109 96 82 88 115
17117 115 132 118 85 55 32 9 -6 -10 -2 13 46 90 121 117 88 66 69 91 117 131 123 95 68 60 64 64 55 47 38 25 16 26 53 77 80 64 40 24 24 45 77
17099 77 104 119 115 85 31 -21 -45 -41 -39 -52 -71 -81 -87 -97 -106 -105 -96 -89 -86 -88 -99 -115 -123 -115 -96 -79 -67 -59 -51 -40 -24 -9 -7 -16 -14 13 55 94 124 149 161 154 136 126
17080 126 127 119 92 53 14 -18 -42 -52 -46 -30 -18 -16 -28 -49 -65 -60 -30 12 45 59 51 28 3 -11 -16 -16 -16 -9 7 24 27 11 -7 -12 -2 16 37 62 89 113
17062 113 122 110 83 54 30 17 15 23 29 25 7 -16 -43 -71 -93 -106 -113 -121 -131 -134 -128 -116 -101 -79 -53 -33 -24 -15 0 14 17 14 25 48 62 48 9 -34 -63 -64 -35
17045 -35 10 47 61 53 38 16 -13 -44 -69 -87 -107 -125 -127 -107 -79 -57 -42 -28 -14 -6 -9 -20 -41 -70 -102 -123 -126 -115 -95 -67 -31 7 41 69 94 110 111 96
17028 96 81 83 98 109 102 86 71 56 30 -6 -39 -57 -60 -51 -28 0 15 6 -16 -25 -5 31 60 61 38 13 7 24 50 76 99 119 127 121 108 94 78 52 23 -2
17011 -2 -27 -54 -77 -82 -68 -44 -16 14 46 69 82 88 89 85 79 73 66 52 36 27 24 15 -3 -30 -57 -83 -102 -106 -91 -66 -35 2 42 66 69 67 76 98 119 138 157 171
16993 171 168 148 114 68 13 -32 -43 -18 12 21 2 -24 -35 -18 27 83 129 149 142 118 92 76 73 71 59 36 10 -12 -28 -31 -13 15 36 41 51 86 140 183
16976 183 192 175 160 164 180 198 220 250 281 293 273 235 206 192 180 165 157 158 153 127 87 54 39 35 37 48 60 59 38 12 -5 -19 -38 -57 -61 -44 -19 -3 0
16959 0 -7 -20 -31 -37 -39 -47 -61 -68 -62 -53 -51 -50 -33 -4 16 16 5 2 11 31 63 105 141 150 125 76 17 -35 -68 -71 -51 -26 -14 -17 -28 -44 -64 -77 -69 -34 14 55 79
16941 79 97 117 135 133 112 91 93 112 128 127 114 99 81 51 14 -11 -8 15 34 28 5 -13 -16 -10 0 13 27 28 14 -4 -9 1 24 59 96 118 118 110 119 141 154
16923 154 151 147 143 121 73 23 0 1 5 5 10 25 40 51 63 79 97 110 114 105 87 72 71 76 79 79 80 72 44 5 -19 -19 -7 6 23 49 73 87 93 88 56 -6 -73
16904 -73 -109 -111 -102 -96 -91 -87 -97 -119 -132 -122 -96 -74 -60 -46 -26 -3 15 23 18 4 -7 -9 -4 9 32 58 67 52 28 21 29 33 17 -15 -57 -92 -100 -66 -5 48 73 81
16886 81 83 74 46 17 10 24 37 38 40 41 28 -3 -33 -39 -27 -19 -21 -20 -9 0 -1 -7 -5 3 9 9 11 15 13 -1 -18 -21 -2 26 49 64 78 88 87 77 73 86 107 119 117 114 122 142
16865 142 162 174 176 175 172 160 132 96 68 58 59 55 38 12 -16 -39 -45 -31 -6 13 24 37 60 94 125 137 117 69 22 7 27 56 75 94 129 169 183
16849 183 163 133 116 110 101 84 68 54 37 17 0 -8 -13 -19 -22 -21 -16 -7 6 24 36 31 13 -4 -8 1 15 32 56 86 113 126 130 138 156 171 174 169 167 168 159 139 124 130
16830 130 149 163 165 173 201 245 281 284 245 175 96 28 -23 -59 -73 -55 -10 35 59 60 49 32 8 -20 -42 -48 -44 -35 -24 -12 -3 -1 4 24 55 83 98 103 102 97 85
16812 85 70 56 34 -3 -50 -76 -61 -16 31 65 87 100 93 63 23 -11 -36 -54 -62 -52 -29 -6 8 14 12 1 -7 -1 22 47 54 37 10 -6 -1 24 60 84 84
16795 84 64 38 25 33 57 77 77 57 35 28 33 31 14 -12 -33 -40 -38 -38 -43 -44 -34 -14 5 16 14 2 -7 -5 6 15 16 21 41 69 88 92 91 92 88 75 64 59 54 39 20 7
16775 7 5 8 15 31 51 68 77 80 77 69 57 39 11 -21 -45 -53 -50 -41 -30 -15 -5 -2 10 52 110 146 143 115 86 64 44 33 38 56 67 64 63 77 99 105 86 54 33
16757 33 33 42 42 30 13 -1 -11 -12 -8 -5 -8 -7 6 25 35 28 18 18 20 5 -32 -72 -88 -73 -52 -50 -66 -71 -50 -22 -12 -21 -25 -19 -12 -5 19 63 97 99 85 86 105 119 114
16737 114 97 73 41 6 -12 -9 -2 -23 -79 -149 -196 -199 -164 -123 -101 -97 -96 -85 -64 -36 -5 24 41 42 36 27 13 -9 -36 -57 -62 -49 -21 12 39 51 48 39 40 54
16720 54 76 93 102 113 132 151 158 149 126 94 59 34 26 24 16 9 26 66 105 124 128 134 144 147 141 131 122 115 109 111 118 126 129 125 119 115 108 88 52 13 -11 -17 -11 -2 11 30 44
16700 44 45 34 21 15 16 16 6 -13 -28 -19 16 63 105 131 130 102 67 48 45 43 40 52 81 109 121 129 142 156 166 179 189 176 140 119 139 181 207 209 206 214 249
16682 249 329 439 529 580 633 734 884 1087 1389 1827 2373 3047 3988 5238 6433 6937 6408 5164 3862 2906 2265 1774 1383
16672 1383 1110 914 740 589 490 432 383 347 339 344 340 334 336 320 257 167 98 60 26 -7 -14 20 70 103 113 116 117 109 94 82 78 80 78 73 73 80 86 83 78 83 102
16654 102 130 159 187 204 196 158 103 55 33 38 53 50 20 -19 -42 -41 -27 -5 25 55 65 53 35 23 7 -18 -49 -73 -89 -94 -78 -44 -11 7 18 34 51
16638 51 59 58 58 62 76 94 105 94 70 64 89 120 124 100 64 32 12 17 47 79 87 74 63 57 40 8 -26 -57 -82 -90 -72 -38 -8 10 24 26 2 -49 -108 -152
16621 -152 -171 -155 -98 -16 56 97 111 113 111 102 85 54 13 -22 -35 -29 -28 -46 -73 -91 -91 -73 -38 0 22 21 6 -15 -43 -65 -63 -35 -5 6 3 -3 -11 -16 -8 13 34
16603 34 44 46 44 31 7 -9 -12 -15 -32 -47 -41 -21 -10 -17 -32 -47 -62 -71 -63 -38 -8 20 47 66 73 79 98 119 124 109 88 63 28 -3 -7 21 52 59 42 15 -10
16585 -10 -28 -23 13 61 89 90 79 74 74 71 59 40 21 6 -10 -34 -62 -77 -70 -50 -32 -28 -38 -55 -69 -70 -54 -27 -2 16 31 51 77 95 86 46 -3 -41 -60
16568 -60 -71 -78 -71 -44 -4 32 58 71 74 73 74 77 76 70 59 47 40 46 64 75 64 41 39 65 93 97 85 79 80 73 54 34 25 19 14 12 12 5 -11 -31 -48 -62 -71 -73 -71 -77 -94
16548 -94 -108 -101 -68 -26 2 12 12 16 26 35 38 44 59 80 89 86 88 110 136 131 88 32 -5 -22 -35 -58 -83 -98 -101 -96 -84 -70 -66 -78 -102 -121 -123 -110 -91 -78 -72 -67 -54
16529 -54 -32 -12 -6 -18 -30 -26 -5 17 30 40 57 78 89 81 63 51 51 55 45 10 -38 -76 -85 -74 -65 -73 -85 -86 -75 -58 -35 0 40 69 78 81 99 136 168 169 135
16511 135 86 57 59 74 76 59 40 31 23 9 -4 -8 -1 8 17 27 31 20 0 -7 8 41 68 69 41 4 -19 -20 -9 0 6 13 15 7 -5 -12 -16 -28 -44 -53 -51 -51 -59 -67 -67 -57 -42
16491 -42 -25 -11 -6 -5 3 30 68 102 113 94 55 24 17 23 18 0 -4 15 39 45 39 35 28 3 -39 -89 -136 -176 -201 -199 -178 -156 -144 -134 -120 -101 -80 -57 -29 4 40
16473 40 68 80 77 73 76 81 77 69 64 56 34 7 -5 -4 -2 -10 -17 -14 -10 -14 -24 -27 -14 12 49 84 102 99 89 88 95 96 85 71 72 93 119 129 115 96 91 98 93 68 40 25 19
16453 19 11 5 12 24 23 11 7 19 30 26 17 20 34 46 49 53 59 58 46 32 24 17 5 -15 -37 -55 -64 -59 -42 -19 -2 10 29 56 83 96 97 93 92 92 82 56 19 -9 -14
16433 -14 -1 9 6 3 15 42 73 98 113 115 105 94 85 73 47 14 -9 -17 -16 -14 -11 -9 -9 -4 10 23 17 -5 -25 -28 -21 -18 -22 -31 -44 -57 -58 -42 -24 -26 -43 -54 -44 -24
16414 -24 -17 -24 -31 -29 -27 -34 -47 -55 -63 -78 -93 -88 -61 -40 -49 -74 -86 -74 -55 -45 -41 -32 -20 -9 5 23 39 40 20 -13 -46 -62 -55 -39 -33 -33 -20 12 47 64 64 60 54 40
16395 40 11 -29 -73 -109 -133 -148 -158 -159 -135 -83 -20 24 35 23 7 7 24 41 45 45 57 77 81 64 47 48 57 63 78 109 132 114 67 36 42 55 46 24 18 32
16378 32 49 58 65 76 87 93 89 73 47 21 3 -2 1 17 43 67 69 45 15 7 30 67 101 123 127 105 63 23 2 -7 -23 -37 -27 6 37 46 50 69 100 125 140
16360 140 152 154 135 103 81 80 88 97 107 115 111 94 77 67 56 35 11 -7 -28 -55 -80 -83 -60 -26 6 37 70 102 123 121 100 74 58 49 40 29 27 37 47 45
16343 45 30 18 19 30 47 66 86 97 89 62 32 12 -1 -19 -44 -63 -65 -51 -28 1 32 53 54 37 10 -19 -44 -51 -42 -38 -52 -69 -68 -46 -22 -5 15 39 56
16326 56 58 52 43 18 -26 -66 -71 -45 -20 -12 -7 22 81 142 171 159 121 85 66 65 76 84 72 36 -1 -15 -5 1 -7 -16 -4 23 46 58 71 93 119 135 130 107 83
16308 83 73 76 73 59 53 67 84 84 67 55 58 68 76 81 83 77 64 54 53 52 49 47 49 50 38 13 -14 -34 -47 -55 -55 -40 -11 11 9 -11 -23 -7 25 53 67 77 80 70
16289 70 55 52 64 77 81 90 116 150 168 165 155 149 141 123 103 93 94 96 94 93 93 86 66 45 37 43 56 76 108 150 189 213 219 208 183 146 109 75 46 30 41 70
16271 70 86 63 17 -17 -21 -4 13 14 -2 -18 -8 26 51 41 13 0 6 6 -6 -12 4 34 64 92 110 105 77 46 30 25 18 11 10 7 -5 -17 -15 -1 5 4 6 16
16253 16 20 7 -10 -15 -6 -2 -16 -44 -67 -67 -44 -8 33 80 129 167 177 154 115 79 58 48 42 34 17 -10 -42 -62 -64 -58 -52 -47 -32 -7 13 25 28 23 3 -31 -65
16235 -65 -78 -68 -41 -6 27 48 52 51 55 55 34 2 -13 -4 15 35 53 59 35 -9 -42 -37 -8 15 22 13 -9 -37 -49 -35 -11 1 4 17 45 75 98 111 112 100
16218 100 85 83 92 91 65 24 -8 -27 -39 -50 -56 -50 -37 -22 -9 9 33 50 51 41 37 47 61 75 89 104 109 95 72 54 46 41 35 30 25 17 4 -15 -42 -66 -74 -61
16199 -61 -42 -32 -25 -8 17 35 38 36 41 57 78 98 106 99 83 72 68 70 76 89 103 106 96 85 78 64 29 -20 -67 -93 -87 -52 -3 37 53 48 36 26 17 6 -3 -12 -20
16181 -20 -25 -21 -5 15 29 36 44 55 62 55 38 29 39 58 69 65 50 36 29 34 49 68 79 79 71 64 68 82 98 102 93 81 75 77 82 86 88 80 63 60 93 155 206 213 183 149 134
16160 134 139 148 146 128 105 97 109 122 107 55 -6 -44 -48 -32 -11 9 30 43 45 35 21 2 -19 -39 -43 -28 -2 24 48 68 81 83 78 72 73 85 106 120 115 96
16143 96 83 87 102 116 125 131 132 128 124 123 115 98 82 76 72 60 38 17 5 7 33 85 135 144 105 49 12 5 15 27 34 34 28 14 -10 -43 -69 -69 -43 -12 5 12 16 18 15
16123 15 8 -4 -25 -51 -73 -83 -77 -52 -14 23 45 47 41 35 31 31 39 49 52 47 45 56 73 85 93 104 119 133 143 146 141 122 93 62 40 37 52 73 84 82 73 64 61 66 74
16104 74 69 43 15 12 32 43 27 -3 -26 -40 -49 -54 -52 -54 -64 -69 -53 -21 1 -1 -17 -23 -18 -14 -21 -30 -27 -18 -20 -31 -30 -8 12 6 -16 -22 -1 33 67 103 131 130 95 51 24
16084 24 11 -3 -21 -34 -36 -30 -11 16 42 58 68 78 83 84 91 104 110 102 96 105 119 116 99 89 97 114 124 120 101 74 55 51 57 66 79 95 103 97 87 78 58 17 -30 -55
16065 -55 -46 -16 15 38 50 58 68 77 71 49 31 40 69 90 77 32 -17 -42 -37 -23 -15 -7 8 21 21 26 57 103 128 128 131 144 143 123 113 116 109 90 90 116 130 121 126 158
16046 158 179 168 168 204 239 252 291 379 453 478 522 642 784 916 1142 1554 2086 2739 3794 5431 7131 7863 7098 5394 3779
16035 3779 2749 2117 1608 1217 1000 869 733 622 584 565 508 445 420 401 352 297 273 259 229 203 212 238 248 243 233 203 149 102 93 107 119
16022 119 126 126 102 57 31 48 77 82 73 79 95 97 90 91 98 100 100 111 126 130 128 130 125 98 57 27 17 24 45 74 90 80 53 25 -8 -46 -72 -67 -43 -19 1 25 43
16003 43 46 50 68 91 103 115 148 187 195 161 111 64 21 -13 -19 5 33 43 39 39 46 50 43 21 -4 -17 -8 14 31 35 32 34 49 79 109 113 79 37 21 30 35 19 -2
15985 -2 -14 -18 -20 -15 3 28 45 53 54 46 26 1 -24 -42 -45 -25 11 39 44 32 18 5 -13 -41 -69 -88 -95 -92 -83 -77 -80 -91 -103 -106 -99 -85 -70 -54 -36 -23 -22 -36 -52
15966 -52 -62 -66 -69 -66 -50 -24 -1 7 7 8 18 31 38 36 32 35 45 51 51 46 35 10 -21 -36 -17 16 37 35 22 5 -11 -20 -9 14 27 25 19 20 20 15 19 36 54 57 50 46 45
15946 45 37 14 -21 -68 -113 -132 -122 -102 -98 -104 -104 -94 -87 -82 -64 -30 0 6 -10 -35 -58 -73 -73 -56 -36 -32 -49 -77 -106 -132 -141 -123 -84 -46 -21 -5 5 -1 -33 -71
15928 -71 -86 -77 -64 -59 -47 -20 -1 -11 -44 -65 -54 -19 15 36 40 29 12 -1 -6 0 17 47 77 91 87 77 70 66 60 51 41 29 24 39 77 115 122 86 31 -12 -35
15911 -35 -47 -60 -72 -74 -68 -59 -47 -22 12 43 56 54 45 32 12 -11 -28 -32 -17 20 73 119 135 117 77 29 -8 -22 -4 28 53 71 91 104 88 51 34 58
15894 58 90 91 61 39 42 55 60 55 46 31 9 -10 -20 -23 -28 -34 -31 -11 17 42 48 34 10 -7 -9 0 9 6 -6 -19 -18 -2 20 37 35 13 -22 -57 -78 -78 -63 -41 -21
15876 -21 -3 6 8 2 -4 -3 16 53 91 114 125 142 174 206 218 205 178 145 110 75 44 9 -31 -68 -88 -87 -73 -54 -33 -12 3 7 1 -9 -14 -5 13 32 36 26
15858 26 13 5 -1 -18 -48 -78 -95 -100 -106 -125 -153 -177 -188 -187 -177 -157 -130 -108 -97 -80 -42 9 43 38 5 -26 -39 -37 -37 -47 -67 -93 -117 -129 -116 -80 -36 -5 6
15841 6 14 36 75 114 137 143 138 128 113 100 97 106 110 91 49 9 1 26 59 73 70 67 72 74 65 46 29 16 2 -10 -13 0 26 43 42 31 25 33 44 45 29 6 -6 0
15822 0 23 39 32 6 -23 -49 -67 -72 -62 -52 -61 -89 -109 -102 -73 -41 -13 6 15 15 14 18 20 10 1 11 40 67 74 60 31 0 -17 -13 4 15 16 18 28 32 18 -9 -36
15804 -36 -54 -63 -57 -30 12 54 86 105 106 80 35 1 3 38 74 81 61 44 51 74 94 96 82 59 36 20 14 10 -5 -30 -45 -36 -14 0 -5 -18 -19 -2 20 31 25
15786 25 10 1 5 19 34 52 72 89 97 88 62 30 2 -15 -24 -29 -25 -11 10 29 43 61 87 112 125 115 87 53 31 27 35 40 35 30 33 45 57 59 50 40 39 48 51 36
15767 36 9 -17 -44 -74 -102 -115 -112 -111 -125 -145 -154 -145 -124 -100 -78 -61 -49 -35 -13 6 13 3 -10 -10 10 41 65 72 65 50 30 8 -7 -12 -11 -14 -19 -14 7 39 67
15749 67 84 87 74 56 46 47 44 30 14 11 18 28 39 52 58 49 32 24 34 55 80 104 120 121 111 101 96 92 84 78 74 67 55 45 38 29 14 10 33 74 99 84 39 -5
15730 -5 -29 -32 -26 -17 -4 14 40 74 108 129 125 96 56 22 4 8 32 60 73 63 38 15 5 16 40 62 72 71 68 64 54 39 33 45 67 92 111 118 111 101 103
15712 103 114 118 103 77 49 29 30 64 114 149 160 165 178 185 170 150 144 152 171 212 283 365 436 499 567 641 726 846 1017 1227 1479 1823 2308 2931
15697 2931 3713 4758 6104 7467 8275 8102 7050 5643 4375 3419 2714 2182 1786 1488 1234 1002 807 664 571 521 502 494
15688 494 478 449 410 364 317 274 240 213 190 179 186 200 201 178 138 99 75 66 63 63 69 84 97 96 80 68 77 104 135 165 198 229 244 236 217 200 185 156 113
15671 113 83 97 155 225 274 291 280 249 206 164 138 131 133 137 143 154 163 159 135 100 72 62 67 80 94 108 120 123 116 104 88 72 64 72 93 105 96 76 55 31
15654 31 3 -18 -18 0 16 17 11 6 -1 -14 -27 -33 -37 -45 -61 -78 -84 -67 -23 34 85 117 134 138 124 92 49 7 -27 -49 -55 -46 -33 -26 -29 -40 -55 -64 -65 -64 -76 -101 -125
15635 -125 -138 -137 -125 -100 -66 -40 -36 -50 -68 -81 -87 -82 -70 -64 -71 -76 -65 -38 -7 25 60 80 68 33 3 -5 -2 0 1 8 10 -4 -26 -36 -26 -2 18 25 12 -10 -21
15617 -21 -10 12 29 42 63 91 110 113 100 78 49 21 7 12 22 25 16 1 -17 -40 -67 -92 -100 -83 -40 14 70 121 169 200 196 155 102 65 48 45 48 52 46 23
15600 23 -3 -14 -2 13 13 0 -12 -13 0 25 58 92 116 124 114 85 41 1 -14 3 41 76 91 85 68 47 31 30 47 70 80 65 41 34 60 106 144 157
15583 157 146 122 99 89 96 113 124 122 113 112 125 145 160 163 154 138 117 93 71 55 45 38 32 22 4 -15 -28 -30 -33 -40 -39 -14 24 51 56 50 47 49 51 51 49 38 22 16
15564 16 25 32 24 11 9 17 26 41 67 89 85 55 29 25 30 29 23 25 36 48 59 70 75 65 48 43 54 67 73 80 101 129 137 113 77 57 65 79 80 64 48 37 26 11
15545 11 0 0 13 28 36 34 35 53 90 125 137 122 91 54 18 -9 -22 -21 -15 -11 -7 -2 -2 -15 -36 -50 -45 -25 -4 7 11 15 26 40 52 60 62 58 52 49 49 40 18 1 9
15526 9 34 49 43 31 30 36 36 27 14 -2 -24 -43 -52 -49 -41 -33 -27 -24 -23 -13 15 58 100 128 139 135 122 106 98 104 131 172 209 223 213 192 170 146 117 87 61 35 12
15507 12 7 24 41 32 3 -14 -4 12 10 -9 -23 -13 15 44 53 36 4 -18 -12 27 86 138 163 161 148 137 132 132 140 152 155 146 138 146 163 166 141 98 54 23 12 16
15489 16 22 16 -2 -26 -46 -61 -64 -51 -25 1 21 32 32 22 10 2 0 0 6 22 37 39 33 37 59 87 112 135 155 155 129 92 70 68 70 67 58 46 32 19 13 9 0 -17
15470 -17 -35 -47 -57 -72 -89 -100 -96 -77 -50 -23 1 27 54 76 91 100 105 108 114 128 141 141 131 119 107 80 39 2 -14 -17 -24 -36 -47 -63 -88 -100 -68 8 87
15453 87 123 113 80 40 -3 -47 -75 -74 -43 -1 23 20 1 -8 -5 -3 -18 -47 -77 -98 -108 -108 -101 -92 -83 -72 -60 -59 -76 -100 -107 -92 -74 -65 -62 -50 -29 -10 -4 -12 -26 -40
15435 -40 -50 -57 -65 -74 -79 -80 -79 -78 -72 -52 -22 9 33 49 55 45 16 -24 -66 -103 -128 -128 -95 -39 16 54 72 76 69 61 55 48 28 -5 -42 -69 -85 -88 -75 -47 -19 -4 1
15416 1 10 22 25 17 8 3 0 -4 0 17 37 45 39 31 28 25 15 7 13 39 74 98 95 69 41 27 28 27 20 12 6 -3 -18 -25 -10 18 40 41 33 33 46 64 81 91 90 75 56 47 53 70
15394 70 84 82 60 23 -10 -25 -16 6 26 40 54 69 83 87 81 65 40 14 0 7 24 30 15 -11 -35 -52 -65 -69 -60 -36 -6 21 50 80 110 136 153 158 142
15377 142 110 76 47 21 1 1 25 54 64 53 33 12 -5 -4 26 70 92 79 54 42 48 65 84 98 101 93 84 70 38 -12 -54 -62 -38 -5 20 33 30 15
15361 15 5 15 39 62 79 93 103 101 94 95 100 97 86 77 65 35 -7 -37 -40 -25 -13 -13 -29 -62 -104 -134 -143 -142 -139 -124 -89 -47 -19 -13 -18 -30 -50 -73 -86 -84 -71 -54
15343 -54 -37 -19 -2 13 20 10 -13 -27 -12 26 63 80 85 94 105 107 95 77 61 47 30 11 -5 -16 -20 -17 -11 -9 -15 -19 -5 33 76 99 94 78 68 65 62 58 53 44 32
15324 32 24 29 45 59 70 81 93 95 78 49 25 15 16 26 45 75 107 127 126 106 74 48 45 72 113 143 147 138 131 129 121 103 77 50 31 23 20 2 -36 -75 -90
15306 -90 -81 -67 -56 -39 -17 -5 -9 -19 -27 -39 -51 -45 -14 14 18 9 22 67 116 135 113 64 13 -13 -7 17 42 59 70 75 68 55 50 57 67 73 76 74 67 61 57 49 30 8
15287 8 2 13 21 15 -5 -36 -72 -93 -77 -30 13 28 22 17 15 6 -9 -21 -19 -4 18 45 70 88 103 112 107 85 66 64 69 54 17 -13 -14 10 40 62 80 95 104 108 107
15269 107 106 107 107 106 100 93 90 98 111 125 134 139 138 132 125 121 120 116 111 118 141 164 166 148 128 117 108 97 88 81 64 28 -12 -32 -23 -1 16 27 35 41 40 36 35 40 51 60 62 53 36 20
15247 20 9 5 5 8 8 -3 -25 -37 -21 17 53 65 60 61 79 104 115 109 100 97 90 70 49 41 47 51 44 30 17 8 10 25 44 49 39 35 55 92 126 153 173 174 148 103
15228 103 66 52 55 62 62 48 25 7 10 33 65 92 103 90 57 24 14 24 30 19 7 14 35 48 41 23 12 17 33 48 49 39 28 32 54 83 108 120 120 114
15211 114 106 99 92 86 78 74 83 110 139 150 136 112 96 85 72 61 57 55 42 23 14 23 39 51 57 60 62 62 63 60 52 46 54 75 92 97 91 82 68 53 46 51 64 82 110 146 173
15190 173 181 179 179 174 155 131 127 142 151 137 114 102 95 72 24 -29 -64 -69 -54 -33 -17 -10 -11 -21 -41 -63 -74 -62 -38 -22 -26 -36 -31 -9 15 31 40 54 76 94 94
15172 94 77 55 37 26 21 22 32 51 74 97 119 135 137 120 94 70 51 36 26 27 36 39 23 -6 -31 -40 -35 -28 -28 -37 -50 -55 -50 -47 -60 -81 -89 -82 -81 -106 -146 -174 -171 -146
15153 -146 -116 -94 -85 -87 -94 -98 -95 -79 -47 -13 1 -14 -49 -80 -100 -111 -107 -81 -44 -17 -9 -7 2 13 11 0 -6 0 5 0 -20 -43 -59 -65 -63 -62 -65 -70 -74 -79 -87 -93 -89 -79 -72 -71 -69 -63
15133 -63 -57 -61 -73 -84 -88 -87 -80 -70 -57 -52 -62 -85 -112 -131 -136 -126 -102 -71 -44 -26 -11 6 24 31 29 29 40 62 82 94 100 105 112 123 138 147 143 122 94 73 65 69 74 65
15113 65 36 -8 -49 -68 -63 -48 -35 -19 12 62 114 150 160 153 137 119 103 100 115 141 164 177 178 166 134 89 49 31 32 42 54 66 77 83 92 110 130 139 129
15097 129 110 86 54 16 -17 -38 -52 -60 -50 -12 40 79 89 76 55 35 15 -4 -27 -49 -59 -54 -41 -40 -53 -71 -79 -74 -52 -16 24 53 57 45 29 19 16 21
15080 21 30 39 48 64 84 90 79 65 70 92 113 121 116 100 71 38 16 9 4 -7 -14 -9 -3 -16 -44 -64 -58 -30 7 45 79 105 118 108 66 -3 -75 -115 -108 -70 -28 3
15062 3 29 55 79 97 107 108 101 85 60 33 18 29 62 91 90 60 24 3 0 2 12 30 48 58 61 76 112 160 199 207 178 119 53 4 -15 -14 -7 -8 -23 -41
15045 -41 -44 -27 -4 1 -14 -43 -71 -90 -92 -72 -43 -29 -36 -48 -45 -28 -14 -9 -7 -7 -11 -11 3 37 74 97 102 98 90 79 68 59 55 48 33 8 -19 -41 -49 -43 -27 -7 15 38
15025 38 68 107 149 180 191 182 161 131 93 56 35 38 57 75 81 80 82 91 100 100 91 81 76 68 53 41 47 72 94 93 67 35 13 6 12 30 55 74 80 74 66 62 58 48 30
15006 30 5 -27 -61 -84 -83 -59 -25 12 46 64 55 29 4 -4 -1 6 19 36 49 55 60 72 87 95 94 85 68 43 17 3 5 19 39 54 57 47 33 18 -2 -22 -25
14988 -25 -2 31 56 68 74 76 76 82 104 127 129 105 75 60 59 56 38 8 -19 -31 -25 -12 0 13 28 37 36 35 46 63 72 75 83 91 87 69 50 35 23 23 42 68 76 67
14969 67 71 96 117 110 84 60 43 32 25 16 -4 -29 -31 -5 18 11 -10 -15 -8 -16 -44 -69 -75 -69 -63 -64 -71 -74 -59 -18 27 50 45 26 6 -11 -19 -6 20 34 21 -8 -46
14950 -46 -89 -135 -173 -196 -204 -196 -171 -139 -116 -107 -93 -61 -18 17 44 65 82 100 123 155 182 185 160 120 80 50 35 33 38 45 52 57 58 55 50 42 37 40 51 59 56 46 44 51
14931 51 51 35 13 0 2 14 29 46 64 83 98 98 80 57 46 46 42 24 1 -17 -24 -15 15 62 105 124 111 69 13 -30 -37 -6 36 68 78 69 50 36 37 53
14914 53 72 90 104 104 80 45 32 55 82 83 60 42 37 30 6 -27 -59 -80 -88 -85 -80 -74 -57 -25 3 13 12 22 49 68 62 36 6 -15 -26 -27 -25 -29 -38 -37 -20 -1
14896 -1 6 1 -2 6 27 54 80 105 127 140 138 116 83 46 10 -14 -17 0 18 15 0 -7 9 31 39 27 8 -5 -9 -7 -7 -6 4 38 80 103 92 56 19 -6 -21 -25
14878 -25 -22 -17 -12 3 33 62 70 59 51 60 74 71 45 15 3 10 16 3 -29 -59 -62 -36 0 27 46 62 76 84 88 90 88 78 64 60 70 78 66 37 12 6 11 19 27 34 31 17
14858 17 5 8 23 34 33 24 22 33 56 85 115 140 159 169 169 166 170 182 183 157 106 55 28 29 47 66 80 88 90 84 66 45 33 38 49 49 35 14 0 -6 0 15 32
14839 32 40 38 35 34 38 50 73 93 95 77 56 50 57 68 73 66 46 21 11 19 29 28 23 30 51 70 72 60 48 45 53 72 94 114 125 123 103 66 18 -30 -65 -81 -74 -53
14820 -53 -26 0 24 49 65 61 42 17 -2 -22 -46 -71 -87 -90 -81 -62 -30 9 49 77 94 105 109 103 85 67 61 71 86 89 73 42 13 -1 -6 -13 -25 -32 -27 -12
14803 -12 2 16 27 31 25 14 5 -4 -21 -36 -34 -14 9 22 29 39 59 86 107 109 90 72 79 110 137 148 150 153 148 128 103 85 73 55 39 38 52 63 65 66 71 75 72
14784 72 66 57 32 -11 -57 -79 -65 -31 0 20 29 30 26 15 4 0 6 15 12 -7 -32 -40 -20 18 53 68 63 52 45 39 20 -17 -69 -119 -148 -145 -115 -81 -57 -44 -31 -19
14766 -19 -18 -30 -37 -23 3 16 0 -33 -61 -78 -86 -84 -65 -37 -20 -21 -20 -1 31 62 87 113 137 149 148 152 169 188 196 188 166 126 66 -1 -53 -77 -74 -56 -35 -16
14748 -16 3 29 54 62 48 21 -5 -29 -47 -49 -35 -28 -47 -83 -103 -87 -44 -2 21 20 5 -11 -27 -47 -68 -70 -42 1 33 44 39 27 11 -3 -12 -24 -45 -62
14732 -62 -53 -21 4 10 8 11 5 -27 -76 -115 -125 -111 -88 -68 -57 -56 -59 -61 -59 -61 -71 -86 -96 -82 -43 2 26 17 -8 -29 -43 -56 -71 -80 -77 -66 -56 -56 -66 -77 -74 -52
14714 -52 -17 14 32 36 38 51 73 92 90 67 34 3 -15 -23 -22 -20 -17 -13 -11 -22 -43 -53 -30 15 54 65 56 45 43 53 74 92 87 53 7 -33 -65 -86 -86 -63 -32
14696 -32 -11 0 14 31 44 53 62 63 38 -10 -62 -99 -121 -135 -144 -146 -130 -95 -48 -10 3 3 14 43 74 87 84 74 61 43 26 22 38 73 114 146 160 159 154 150
14679 150 144 134 119 98 71 47 34 31 26 7 -12 -6 33 87 126 136 131 131 142 156 163 160 144 114 77 53 53 63 55 18 -31 -67 -67 -35 8 44 62 66 63 54 43
14661 43 36 41 58 84 112 125 109 64 20 11 43 87 118 132 133 115 76 26 -11 -26 -23 -17 -21 -36 -49 -46 -27 -12 -19 -46 -73 -81 -70 -50 -31 -14 1 17 29 39
14644 39 43 38 30 29 44 72 97 105 93 71 51 40 42 51 56 47 26 -2 -38 -83 -130 -161 -162 -140 -119 -122 -149 -171 -162 -124 -88 -78 -87 -101 -112 -124 -134 -135 -134 -138 -139 -118 -75
14625 -75 -33 -8 2 10 13 13 18 32 46 48 38 30 29 34 42 45 37 22 13 17 21 6 -25 -50 -50 -32 -11 2 8 12 19 33 48 54 42 17 0 3 30 65 89 97 96 96 101 114 131
14605 131 145 147 138 127 121 114 96 75 64 69 74 66 52 46 54 68 77 76 66 50 35 26 26 32 47 71 92 96 81 65 57 53 43 28 17 16 25 44 69 85 87 90 113 149 162
14585 162 139 106 92 94 90 83 93 122 155 176 185 187 180 168 158 141 101 44 0 -15 -13 -12 -12 -7 -4 -14 -28 -26 -7 5 -5 -32 -50 -47 -32 -23 -27 -31 -16 16 47 65
14567 65 79 101 129 157 183 208 220 202 167 143 138 131 102 68 60 85 121 149 168 186 196 192 183 187 208 230 236 227 218 211 205 200 198 196 184 166 152 143 128 106 91 89 86
14548 86 65 35 20 26 47 74 106 142 174 198 209 196 163 128 108 96 73 36 7 2 15 34 57 78 89 92 104 133 162 170 161 153 154 155 151 140 120 87 57
14531 57 49 64 78 72 49 25 11 6 10 19 29 35 38 41 47 55 59 50 21 -19 -47 -45 -24 -8 -5 -5 0 6 12 25 46 64 70 71 73 72 63 56 65 88 107 111 112 118 122 116 106 106 113 114 105 99
14509 99 111 137 159 159 140 115 95 81 70 64 69 82 102 125 141 131 88 39 18 33 54 51 27 14 28 68 116 157 175 167 139 103 67 37 15 0 -7 -4
14492 -4 15 45 68 79 93 117 134 129 110 95 92 96 108 127 139 131 112 96 83 64 48 48 57 51 35 36 60 79 73 53 43 46 54 70 93 108 103 90 93 114 131 129
14474 129 115 105 107 111 102 78 56 57 75 76 44 0 -27 -30 -20 -2 24 48 51 37 28 40 61 67 55 36 22 10 -8 -35 -52 -39 -1 36 57 62 58 40 10 -5
14457 -5 18 75 130 151 139 112 91 82 77 63 40 17 -1 -22 -50 -73 -78 -72 -65 -58 -39 -16 -4 -8 -16 -21 -30 -46 -64 -78 -91 -102 -101 -86 -68 -51 -25 15 54 76 82
14439 82 83 75 52 20 0 -1 0 -6 -18 -22 -15 -1 20 49 72 74 64 66 86 103 100 84 73 66 48 22 8 11 18 23 41 78 114 126 120 109 95 74 53 46 46 40 25 12
14420 12 1 -12 -25 -25 -15 -10 -11 -7 5 23 53 100 150 174 166 156 162 169 161 149 147 149 137 115 95 71 35 -2 -18 -9 -3 -18 -41 -50 -36 -10 14 28 25 10 0 9
14402 9 40 78 104 109 97 80 71 72 83 97 110 118 120 117 117 125 142 155 148 123 98 88 81 62 39 33 52 75 82 76 64 45 19 -4 -15 -18 -24 -24 -4 34 67 74 59 39
14383 39 30 40 64 87 95 91 80 68 51 34 26 30 32 15 -19 -53 -66 -55 -28 2 31 55 72 75 61 39 21 5 -15 -38 -46 -24 19 54 60 37 3 -27 -49
14366 -49 -58 -48 -28 -18 -23 -26 -3 30 37 6 -32 -46 -39 -39 -48 -43 -16 15 33 37 37 41 45 49 50 49 53 67 83 83 63 38 27 26 21 7 -12 -35 -65 -99 -124 -128 -113 -91 -70
14346 -70 -52 -34 -15 5 29 55 81 102 111 112 114 127 142 144 129 113 115 130 139 132 117 109 110 110 100 79 45 4 -29 -39 -25 -8 0 9 30 55 68 61 43 20 -4
14328 -4 -27 -36 -24 6 51 108 162 192 187 161 136 120 101 73 41 16 3 4 22 58 92 102 86 65 57 52 30 -8 -41 -47 -33 -20 -20 -27 -35 -40 -42 -33 -14 7 23
14311 23 32 37 45 51 48 36 22 10 -1 -16 -32 -44 -51 -51 -36 -3 36 63 71 74 84 95 93 77 59 52 57 62 54 29 0 -11 -3 9 12 9 14 31 59 92 123 140 141 134 128
14291 128 123 120 121 123 109 71 33 27 51 78 91 96 104 113 113 106 93 71 43 24 26 47 73 94 111 124 136 145 147 132 98 59 36 31 28 14 3 14 49 81 87 71
14273 71 52 41 32 26 29 39 39 25 14 21 39 49 48 41 30 12 0 4 22 43 66 95 117 113 91 71 59 44 28 32 53 60 28 -24 -61 -73 -73 -67 -53 -33 -16
14255 -16 -5 3 9 7 5 11 31 63 102 136 147 122 70 20 -7 -10 -3 0 -6 -13 -14 -16 -33 -62 -85 -91 -89 -88 -80 -58 -30 -5 19 50 80 101 114 123 122 111 101 109 129 148
14236 148 161 171 174 168 157 155 163 170 168 153 121 80 49 45 58 60 41 13 -4 -10 -7 0 6 5 0 2 16 35 46 50 53 59 66 71 76 91 126 169 192 180 146 121 118 131 150
14217 150 169 182 188 196 217 242 247 222 173 119 76 55 56 66 67 63 68 86 102 101 82 49 9 -24 -40 -38 -32 -22 3 48 90 108 101 82 60 48 60 96 131 134
14199 134 107 77 68 85 119 153 172 169 151 138 143 161 179 183 167 139 112 101 114 142 169 177 165 145 131 126 124 123 122 118 108 97 94 100 106 108 106 101 90 76 69 71 69 52
14180 52 22 -2 -2 24 62 83 74 50 36 37 43 50 68 95 106 90 67 65 80 83 58 23 5 18 50 77 74 37 -9 -38 -43 -38 -30 -21 -14 -13 -11 0 19 25 5 -23 -35
14162 -35 -19 11 35 36 23 18 33 59 79 86 94 110 127 136 133 125 118 117 119 117 105 87 73 72 82 92 89 73 51 31 16 5 -2 -2 8 23 37 51 65 79 91 100 104
14143 104 102 89 68 47 34 32 36 41 49 63 77 81 73 67 77 97 115 123 122 109 83 57 47 51 48 29 7 -9 -31 -60 -82 -80 -58 -33 -14 4 26 49 74 97 107
14125 107 98 85 87 104 123 133 139 143 140 126 107 91 87 102 133 165 183 184 171 145 106 71 52 45 38 36 54 85 101 80 31 -14 -34 -23 9 41 52 42 27
14108 27 23 34 51 70 87 102 118 133 141 135 119 105 103 112 125 135 137 127 101 67 36 21 27 42 54 58 57 51 27 -11 -48 -67 -72 -76 -80 -83 -86 -86 -67 -23 28 59 63
14090 63 50 33 16 7 8 8 -4 -18 -9 14 22 0 -23 -11 35 92 131 143 132 106 77 47 18 2 8 27 36 28 18 16 9 -11 -31 -30 -6 21 39 50 58 62 61 57
14071 57 52 47 41 30 15 6 14 36 55 62 63 62 58 50 48 55 61 53 31 7 -11 -18 -14 -9 -15 -33 -47 -46 -37 -39 -52 -68 -73 -61 -31 10 49 72 82 83 76 63 52 52 61 69 82 109
14051 109 144 166 165 154 152 161 168 168 169 180 193 187 154 114 94 97 102 96 90 94 103 104 98 91 88 89 97 105 103 87 64 37 7 -27 -56 -75 -86 -86 -67 -32 -1 9 8 8 4 -4 -8 11
14030 11 47 77 94 108 123 134 141 146 146 139 134 148 177 202 211 208 201 194 189 188 180 158 125 98 77 45 -8 -68 -112 -130 -127 -113 -96 -77 -53 -19 20 53 72 75 62 36
14012 36 6 -21 -38 -36 -13 15 21 -4 -42 -60 -54 -44 -43 -41 -26 -6 0 -8 -16 -5 24 49 52 41 42 60 79 86 90 95 85 51 13 -1 2 3 0 4 12 5 -20 -45 -55 -57 -64
13992 -64 -79 -103 -131 -148 -136 -98 -57 -26 -3 14 21 18 16 22 26 26 29 37 40 34 22 8 -7 -22 -30 -34 -36 -23 8 39 35 0 -31 -41 -41 -42 -33 -6 21 33 36 48 64 69
13973 69 61 52 49 49 44 29 8 0 11 37 60 77 95 102 80 46 36 58 78 72 60 66 79 79 73 80 84 60 15 -23 -40 -43 -36 -14 17 43 53 45 21 -12 -37 -40 -22
13954 -22 0 13 15 8 0 3 26 61 100 135 152 139 105 77 73 80 83 86 95 102 95 84 83 87 80 67 58 49 30 10 9 36 77 113 131 126 104 83 72 64 53 48 60 78 88
13935 88 83 70 50 29 15 11 1 -20 -37 -34 -14 8 31 50 61 67 89 134 175 183 161 128 95 68 55 55 47 24 9 21 40 41 32 39 57 71 82 94 90 62
13917 62 38 50 94 140 189 243 276 257 210 185 188 179 145 107 70 22 -31 -59 -54 -34 -4 38 84 114 138 179 222 240 241 253 265 244 206 197 215 215 196 196
13901 196 218 216 186 181 224 284 339 405 474 518 548 606 679 712 714 754 844 931 1018 1171 1392 1621 1877 2251 2733 3246 3878 4874 6348 8294
13888 8294 10937 14581 18688 21508 21334 18198 13899 10272 7833 6130 4805 3854 3226 2714 2234 1871 1639 1434 1229
13880 1229 1102 1060 998 879 780 742 709 640 581 561 546 506 467 448 426 390 366 365 359 332 307 295 279 257 257 279 291 277 268 278 283 267 246 234 220
13865 220 197 183 182 176 155 143 150 159 153 145 149 155 159 171 193 209 216 236 274 301 299 289 297 309 297 257 214 182 161 151 156 170 181 182 170 147 125 118 120 112 89 71 72
13846 72 82 91 109 137 158 152 132 120 120 127 137 151 158 152 145 147 148 134 110 97 99 105 111 116 123 131 139 141 127 102 89 103 130 145 148 152 160 163 165 174 184 181 166 153 147 136 120
13826 120 114 124 138 140 131 118 100 75 45 19 7 17 45 71 74 54 32 24 24 29 46 83 122 138 124 100 96 116 140 149 146 147 157 165 159 142 125 113 104 97 100 111
13807 111 120 117 105 88 66 43 26 24 36 57 83 111 132 132 115 104 115 144 165 164 152 144 143 137 125 120 125 129 120 112 127 160 184 180 158 133 111 89 73 67 69 76 85
13789 85 89 75 41 3 -20 -25 -20 -9 13 42 60 59 52 51 54 44 18 -14 -44 -69 -82 -78 -55 -29 -12 1 24 52 63 48 27 24 38 46 36 22 15 10 -2 -12 -1
13771 -1 25 38 27 15 22 38 33 1 -35 -59 -73 -86 -100 -104 -95 -75 -53 -34 -26 -31 -41 -44 -28 12 66 109 121 99 64 34 10 -7 -10 12 52 84 92 81 71 72
13754 72 82 92 96 94 92 93 91 80 59 35 16 7 6 5 -2 -14 -16 0 25 35 22 4 -2 0 5 17 42 69 79 69 54 42 28 6 -13 -15 4 31 48 50 48 52 56 46
13735 46 21 0 -1 10 25 45 67 76 58 24 1 -7 -24 -52 -64 -44 -9 11 20 33 50 56 46 32 22 18 22 41 63 68 50 25 13 13 11 -1 -20 -38 -49 -51
13717 -51 -51 -59 -68 -65 -44 -11 27 64 87 90 78 70 71 65 43 14 -5 -15 -19 -12 8 31 38 29 17 9 0 -6 -2 12 28 37 42 47 49 45 38 30 16 -2 -18 -17 1 29 54 70 77
13697 77 84 90 82 46 -7 -48 -56 -34 0 41 84 124 153 175 191 196 185 162 141 127 115 105 100 97 89 79 73 73 73 74 83 97 98 67 12 -36 -55 -43 -15 12 30 30
13679 30 16 1 3 20 37 37 23 11 10 12 9 3 4 15 27 36 45 58 72 79 79 81 91 100 96 78 58 40 21 0 -13 -7 14 42 73 109 140 144 113 62 15 -17 -33
13660 -33 -29 -3 30 57 70 75 79 79 77 78 82 81 70 54 41 34 27 16 5 0 8 28 56 82 98 101 98 104 119 129 118 89 61 42 30 19 11 3 -5 -13 -9 8 32 49 56
13640 56 54 47 39 39 44 47 44 35 21 -1 -21 -11 33 81 94 76 60 59 61 57 59 70 81 85 89 97 94 73 44 24 16 16 24 43 65 76 74 64 52 42 38 43 55 70 84 92
13621 92 92 87 83 83 90 107 136 156 142 95 51 35 44 55 60 64 66 58 37 14 -1 -7 -9 -16 -32 -48 -48 -32 -15 -7 5 40 90 131 150 152 146 139 133 128 117 90 52 15 -12
13601 -12 -38 -63 -76 -67 -44 -23 -8 2 17 39 62 75 74 67 68 77 79 64 42 32 40 60 84 109 123 115 88 66 58 50 19 -32 -78 -95 -83 -61 -48 -52 -64 -70 -56
13583 -56 -28 -4 5 6 15 36 60 72 62 32 -2 -21 -15 5 22 29 25 16 8 12 34 61 78 85 93 100 96 80 68 65 60 43 30 33 46 51 48 48 54 57 58 57 53 46 46 63 89 107
13562 107 115 124 133 128 103 77 69 89 124 154 159 137 103 79 74 84 100 111 107 87 67 64 78 95 106 111 113 112 115 125 129 110 75 47 38 37 33 31 34 36 30 26 34 45 43 27
13543 27 9 6 22 55 92 117 117 95 64 35 5 -23 -46 -55 -48 -31 -9 19 60 102 122 115 104 116 148 174 180 175 170 157 130 97 70 46 23 9 12 29 42
13526 42 45 43 43 49 56 55 35 0 -37 -59 -60 -47 -25 -2 15 29 48 71 91 102 107 113 115 101 72 38 10 -4 -8 -11 -22 -38 -37 -12 21 38 31 14 2 0 3 12 25
13507 25 34 37 42 54 68 73 65 53 46 47 48 48 54 71 87 88 71 52 39 36 45 69 99 119 121 118 120 126 127 122 113 101 84 70 68 75 84 92 92 74 39 6 1 20 37 38 32 33 41 50
13485 50 58 65 72 78 86 99 113 123 125 119 115 121 138 160 174 172 153 124 97 80 68 52 32 21 27 41 53 59 66 73 73 60 36 7 -19 -33 -34 -33 -38 -51 -64 -79 -99 -116
13466 -116 -118 -112 -114 -129 -144 -142 -132 -132 -151 -177 -190 -174 -136 -93 -62 -41 -19 4 22 32 40 45 38 19 2 7 36 74 102 116 118 112 101 90 77 62 47 42 50 58 49 27
13448 27 12 18 35 41 32 18 8 6 13 32 54 64 63 70 90 105 98 78 62 52 35 9 -9 -10 11 51 89 101 74 27 -11 -31 -44 -50 -45 -29 -13 0 18 45
13431 45 66 68 54 38 25 14 3 -3 -1 6 8 -11 -51 -84 -88 -73 -68 -88 -115 -134 -148 -165 -175 -163 -129 -90 -59 -36 -13 13 36 48 47 39 33 26 17 10 10 19 34 53
13412 53 79 103 114 107 92 74 57 43 29 7 -21 -46 -59 -73 -96 -113 -103 -71 -44 -28 -10 14 24 10 -11 -23 -33 -50 -64 -59 -44 -39 -51 -68 -79 -80 -74
13396 -74 -64 -55 -40 -11 31 66 78 66 40 8 -21 -27 0 46 81 95 97 94 83 66 60 75 107 140 164 176 174 154 116 70 38 31 46 70 97 125 148 169
13380 169 195 229 255 259 251 245 233 195 143 114 125 151 160 152 142 131 113 92 74 52 20 -14 -34 -35 -19 13 57 98 131 161 184 180 141 92 65 57 45 19
13363 19 -2 -8 -4 5 15 18 16 22 40 51 34 0 -17 -11 7 32 74 126 159 160 146 144 156 171 178 174 158 138 127 128 133 130 121 108 93 76 60 48 44 44 38 14 -23 -56
13344 -56 -67 -57 -42 -31 -19 -7 -3 -8 -14 -14 -4 14 36 52 61 76 103 127 130 106 72 43 31 33 40 35 20 19 48 86 97 76 52 46 55 65 73 80 84 90 100 109 111 109
13325 109 108 102 87 70 61 52 36 25 34 53 57 45 41 55 68 74 85 104 117 118 118 116 96 61 40 49 67 70 62 56 49 33 18 24 53 92 129 154 158 143 125 117 115 115 123
13306 123 144 171 196 218 234 233 214 188 162 130 95 71 69 71 61 46 37 29 13 -6 -17 -17 -12 -8 -6 -1 13 44 78 94 89 84 92 95 78 47 15 -13 -31 -22 14 51
13288 51 60 50 45 53 69 84 94 91 78 70 74 73 55 34 23 16 5 1 16 40 59 80 106 120 104 78 74 88 95 95 109 133 137 115 92 87 91 91 91 92 82 55 30 30
13269 30 57 91 108 95 63 33 17 10 3 1 11 23 24 21 22 23 10 -9 -14 -1 20 44 68 73 38 -23 -73 -91 -93 -98 -105 -103 -99 -106 -119 -123 -107 -82 -68 -80 -103 -112 -98
13250 -98 -79 -70 -62 -44 -24 -12 0 21 35 24 6 9 35 57 68 86 117 148 171 193 207 197 171 153 145 121 71 26 8 2 -13 -29 -22 6 38 62 76 74
13233 74 53 23 0 -14 -16 -6 8 14 6 -3 -4 6 26 52 74 83 81 80 79 65 45 39 50 56 43 34 49 81 105 112 106 93 78 65 56 45 34 36 58 89 122 159 197
13215 197 223 227 223 226 229 218 189 151 115 88 74 67 57 42 31 29 28 22 15 9 1 -4 5 25 41 47 58 77 85 68 39 21 17 23 44 79 121 160 194 217 215 194 173
13196 173 156 122 65 11 -11 -10 -5 1 17 31 27 11 1 0 0 -1 5 10 -4 -35 -60 -62 -45 -23 -2 14 25 24 10 -11 -26 -35 -58 -106 -156 -170 -139 -97 -71 -51
13179 -51 -20 16 47 71 87 84 66 53 52 45 23 5 11 19 1 -37 -74 -103 -133 -159 -164 -146 -112 -65 -13 24 42 55 77 92 83 67 73 100 123 139 160 185 195
13162 195 187 177 173 163 143 125 125 144 165 167 141 101 65 33 -7 -40 -25 49 133 170 161 140 113 64 5 -30 -34 -29 -30 -28 -19 -16 -26 -43 -59 -64 -47 -5 42 72
13145 72 82 82 75 56 40 38 45 48 53 65 69 47 14 -1 -3 -12 -25 -18 10 47 83 113 117 83 37 17 20 12 -12 -29 -24 -10 7 41 87 120 127 123 122 129 146 173 194 187
13125 187 160 137 123 109 98 102 110 100 72 46 29 13 6 21 40 37 22 26 48 54 33 13 8 6 2 9 26 39 51 87 138 165 149 114 87 76 84 118 156 165
13108 165 148 140 153 168 179 203 234 242 219 195 183 162 126 103 113 143 179 212 221 187 140 124 136 125 77 35 28 42 72 130 199 227 203 173 170 173 164 159
13092 159 164 149 112 96 117 134 122 114 138 168 175 174 188 206 215 227 246 241 209 186 186 173 134 109 120 127 92 40 4 -28 -62 -66 -28 7 11 18 53 75 48 16
13074 16 32 74 96 107 141 184 205 214 235 250 233 204 187 165 122 87 88 102 104 120 167 209 213 206 216 222 204 199 229 256 250 258 318 373 364 318 290 265 210 162
13057 162 170 205 221 239 288 330 325 319 364 414 401 351 324 304 252 208 224 268 292 335 430 500 455 345 277 250 206 173 206 257 246 207 218 251 240
13042 240 226 285 365 375 359 412 485 472 416 430 486 475 432 469 552 570 562 633 718 679 579 588 673 673 616 657 759 764 724 818 982 1016 994 1145
13027 1145 1397 1500 1541 1825 2281 2592 2871 3536 4530 5460 6548 8482 11311 14762 19893 28456 39269 46825 45856 36998
13018 36998 26151 18315 13846 10721 8093 6372 5446 4600 3692 3130 2905 2592 2145 1895 1864 1742 1485 1350 1368 1307 1130
13009 1130 1032 1033 949 770 678 698 672 580 563 633 645 582 573 623 597 485 432 474 491 438 407 419 383 295 264 319 361 353 372 428 433 373 357 436 525
12994 525 548 534 515 472 416 405 434 436 413 445 549 631 628 579 532 476 410 374 380 391 393 405 411 371 305 280 289 264 201 178 224 274 289 301 327 330 298
12978 298 278 285 275 228 186 176 167 147 149 180 195 171 141 129 115 93 99 141 176 180 175 173 157 142 164 211 219 169 121 118 131 130 129 144 152 147 159 191 204 185 170
12960 170 181 187 168 151 151 147 132 142 184 205 176 132 111 99 77 69 95 122 121 111 119 132 129 122 123 119 101 87 82 67 42 42 78 106 93 57 29 10 -4 2 32
12943 32 48 31 5 -7 -16 -25 -6 42 82 83 69 62 45 4 -29 -20 24 76 124 157 154 122 102 117 134 131 127 143 156 141 116 102 82 43 12 18 39 44 39 45 58
12925 58 67 88 125 145 120 77 59 59 55 49 56 68 64 53 47 33 2 -19 0 50 94 124 147 150 123 88 74 77 77 70 65 59 54 67 90 87 46 9 16 51 78 104 149
12906 149 191 205 215 264 344 400 403 367 307 228 148 94 71 61 58 65 67 50 25 19 33 50 55 44 20 -3 -6 8 20 23 43 89 140 172 200 238 276 295
12890 295 298 286 256 218 201 205 201 176 151 141 136 139 172 219 230 195 165 174 191 190 199 232 253 245 243 269 288 285 300 352 392 387 379 399 414 414 456 559 670 772
12872 772 926 1128 1303 1495 1894 2552 3350 4391 6088 8425 10375 10624 8966 6540 4597 3425 2629 1970 1524 1281
12864 1281 1073 842 687 631 579 503 464 467 437 365 325 340 357 348 339 332 298 254 245 260 248 213 196 193 158 100 72 80 77 51 41 57 69 63 67 83 83 64
12847 64 53 55 46 22 10 19 29 34 45 53 39 14 1 -2 -19 -37 -25 12 43 61 84 108 108 86 72 64 40 6 -3 11 21 23 42 79 104 112 132 168 178 140
12830 140 87 59 57 66 80 95 98 83 62 46 38 36 41 37 17 -4 -6 4 9 17 45 79 87 68 55 61 62 47 29 14 -9 -37 -50 -46 -52 -74 -84 -60 -19 17 48 77
12812 77 96 106 113 113 94 63 49 61 77 79 74 67 57 52 65 86 94 89 97 120 136 137 145 164 171 151 125 112 103 82 58 39 28 27 46 75 83 63 42 38 33 17 7
12793 7 18 31 25 9 7 21 35 38 35 31 33 43 57 62 61 70 86 92 78 65 73 95 121 149 178 200 208 205 190 155 114 95 102 109 97 82 84 99 114 127 135 134 136 159 193
12773 193 210 206 208 224 220 175 127 115 127 125 107 96 94 86 76 80 87 70 33 7 11 33 63 100 138 166 175 169 147 108 62 28 11 4 0 -9 -22 -35 -44 -49 -63 -78
12755 -78 -73 -37 14 59 98 129 140 123 92 64 30 -12 -46 -47 -20 17 59 105 136 130 94 61 47 46 52 64 70 51 11 -20 -22 4 48 91 120 136 150 166
12739 166 170 150 119 93 68 37 14 18 37 49 47 46 47 35 11 -2 2 16 26 33 34 23 2 -17 -28 -28 -15 7 25 27 27 38 50 33 -17 -76 -117 -138 -149 -156
12721 -156 -155 -141 -115 -88 -79 -87 -87 -63 -24 8 36 77 120 143 145 150 171 192 198 183 147 94 45 18 9 -2 -18 -17 -5 -13 -48 -75 -63 -24 6 15 16 26 45 70
12704 70 89 93 78 53 32 23 35 74 127 171 190 185 165 135 107 90 82 71 63 71 95 117 128 137 148 150 133 107 88 77 66 55 49 51 61 75 85 80 65 63 87
12686 87 127 159 169 150 114 86 87 110 127 128 119 111 105 103 114 128 129 113 102 105 106 88 63 45 34 25 23 34 49 51 41 30 31 44 65 82 88 87 91 100 100 86 71 68
12667 68 66 53 36 40 71 113 146 161 160 159 166 173 168 153 138 122 90 49 26 32 43 39 28 31 42 46 46 52 62 72 87 116 150 171 175 167 146 111 76 62 68 70 57
12649 57 36 18 10 17 39 65 81 88 101 122 137 134 113 89 77 90 121 148 157 155 155 158 158 157 156 143 112 82 80 98 102 71 19 -21 -37 -35 -31 -36 -47 -60 -72 -85 -93
12630 -93 -80 -44 -2 25 38 34 5 -42 -83 -94 -84 -80 -87 -90 -85 -80 -78 -70 -57 -46 -34 -11 15 26 14 -10 -36 -60 -70 -55 -22 4 18 33 59 82 85 72 54
12613 54 46 63 108 162 206 240 279 315 319 285 243 221 207 174 125 86 82 116 170 220 247 250 241 228 210 201 212 229 218 173 125 107 108 104 94 89 88 82 75 77 76 55
12595 55 22 5 14 31 44 65 97 125 128 105 75 58 60 73 80 70 54 55 81 119 147 160 165 172 175 164 143 125 119 113 94 61 30 9 -3 -12 -11 3 21 34 43
12577 43 49 49 40 35 45 59 67 77 104 143 169 168 155 147 143 127 98 66 44 42 61 89 103 87 53 27 24 34 42 45 57 90 143 199 236 237 202 156 126 122 130 138 145
12558 145 152 146 115 69 28 7 -2 -11 -26 -49 -72 -84 -71 -37 2 34 52 51 31 13 22 63 105 123 119 110 93 58 14 -12 -10 13 36 46 35 7 -22 -38 -37
12542 -37 -26 -12 3 18 25 19 9 8 19 37 52 57 53 45 38 30 21 16 17 23 27 21 9 0 9 33 56 59 44 28 21 14 2 -6 -3 3 -2 -20 -28 -10 28 71 106 133 153 161 149
12521 149 121 95 90 103 116 118 114 113 112 107 99 97 100 106 114 119 110 84 49 17 -5 -18 -10 21 59 81 83 76 69 55 34 22 30 50 66 64 47 28 23 38 64 84 94 103 114
12502 114 122 128 146 175 196 193 172 157 160 169 168 151 125 106 105 120 134 128 96 55 30 37 70 108 132 139 142 149 148 123 75 28 10 24 46 57 57 62 80 105 130 151
12483 151 155 131 90 60 62 88 118 141 160 178 185 176 153 122 90 62 41 33 42 67 104 144 179 204 209 189 142 82 26 -11 -19 7 58 104 120 105 80 59
12467 59 50 54 69 81 73 50 31 25 23 17 21 50 101 144 154 133 101 80 74 74 75 88 123 171 208 220 205 170 128 95 79 76 81 94 120 150 166 163 153 141 124
12449 124 101 83 85 105 131 157 178 181 156 106 53 23 28 58 89 105 105 102 101 100 97 97 105 114 117 113 103 89 72 58 50 44 40 39 38 34 32 48 92 152 199 212 194 162
12430 162 136 122 111 92 61 23 -15 -44 -47 -17 30 65 68 51 36 30 26 22 23 34 55 85 118 142 150 140 117 93 79 85 111 144 173 195 210 213 206 196 194 198
12413 198 199 195 187 179 171 158 134 98 59 31 17 17 26 46 68 76 64 45 37 39 43 46 53 58 56 47 42 47 53 51 40 22 0 -20 -38 -49 -51 -42 -27 -9 8 29 45 43 29 25
12393 25 44 66 67 47 31 30 34 36 42 48 46 37 34 44 60 72 84 96 102 105 115 137 156 161 162 174 190 188 159 123 101 97 101 101 94 86 79 69 50 32 30 51 80 94 88 77
12373 77 71 73 79 93 117 142 147 121 74 33 18 32 57 76 90 110 142 179 208 225 234 234 216 176 128 93 77 71 63 56 58 66 74 83 104 136 166 179 174 157 129 88
12355 88 43 7 -7 -2 10 16 8 -1 -2 9 28 44 52 49 36 31 57 114 173 197 175 130 90 68 61 62 71 89 114 130 123 90 45 7 -17 -34 -43 -35 -2 42 80 96
12337 96 95 91 91 88 75 56 42 36 30 19 8 3 -2 -21 -51 -76 -76 -50 -10 27 51 48 16 -32 -70 -77 -56 -23 7 38 71 98 107 95 77 69 74 80 73 53 30 14 5
12318 5 5 14 34 56 74 83 88 89 87 84 79 72 69 75 89 103 107 95 75 52 30 15 11 17 35 64 96 109 89 51 30 41 65 73 60 34 8 -8 -8 11 36 53 62 62
12299 62 49 16 -22 -45 -40 -10 34 80 111 123 129 135 131 110 94 112 153 178 172 156 151 149 135 113 99 88 71 56 64 96 135 159 164 156 142 130 130 138 133 101 55
12281 55 26 32 57 71 68 65 74 80 62 25 -2 -3 15 35 46 47 38 29 29 36 43 46 54 73 91 92 77 59 47 35 22 11 7 10 12 15 26 52 85 102 96 82 86 111 139
12262 139 157 169 183 196 201 198 189 174 150 126 113 115 128 140 142 130 110 91 70 36 -11 -50 -58 -41 -23 -19 -21 -15 4 30 48 56 60 60 47 16 -22 -54 -76 -94
12244 -94 -108 -105 -85 -71 -79 -105 -127 -133 -124 -101 -67 -31 -1 16 20 7 -16 -36 -38 -26 -12 -3 1 12 35 72 114 142 147 139 133 127 112 88 64 42 24 13 13 25 41
12226 41 60 79 88 81 68 64 75 93 103 96 74 50 44 58 71 65 52 56 81 102 99 76 45 14 -7 -12 -4 3 2 -4 -10 -7 14 52 85 89 69 55 63 83 100 115 134
12208 134 152 159 154 142 127 112 97 75 42 8 -3 8 25 33 40 56 78 93 101 108 111 103 88 75 69 63 53 44 40 35 18 -12 -45 -63 -56 -33 -8 15 38 52 42
12190 42 10 -20 -26 -9 17 41 55 53 35 17 18 44 80 108 119 111 86 55 30 17 16 26 39 39 16 -16 -39 -45 -41 -35 -28 -21 -14 -6 0 -3 -19 -34 -27 7 46 68 73
12171 73 80 95 97 69 28 16 53 116 162 172 156 136 122 115 116 124 133 141 146 145 132 113 102 108 123 133 136 134 131 124 119 120 131 147 162 164 151 137 142 159 163 136 95 65
12152 65 48 37 33 47 77 106 123 135 146 152 146 130 106 82 69 79 102 115 99 66 36 25 40 79 132 177 196 186 163 147 144 150 152 143 123 95 66 48
12136 48 46 57 65 58 41 25 21 33 55 80 101 119 131 135 128 115 109 109 104 87 72 74 93 116 128 123 100 69 46 33 21 8 9 36 71 89 84 74 66 56 42 35
12118 35 45 67 89 103 104 90 67 48 39 37 38 40 44 50 57 65 69 64 56 53 62 82 111 141 157 150 133 128 139 144 129 109 113 145 178 183 157 124 113 130 153 161 153 146 148 151 141
12097 141 115 83 63 68 92 109 102 76 53 43 43 52 69 87 93 89 94 115 139 152 155 157 156 149 142 136 123 91 48 21 26 56 89 115 137 157 170 160 125 81 48
12079 48 26 3 -19 -24 -6 21 47 68 80 66 21 -31 -62 -68 -65 -59 -43 -21 -8 -9 -16 -20 -16 -3 17 37 42 32 18 18 38 69 97 113 116 111 103 96 96 107 122 129 117
12061 117 91 58 25 5 7 25 39 39 42 65 100 125 133 137 142 142 132 121 121 130 141 146 143 135 125 114 92 53 10 -12 -11 -1 0 -2 6 26 45 59 77 104 124 116 80
12042 80 41 21 24 35 45 58 78 102 127 149 161 158 138 110 82 59 47 49 59 70 80 97 118 129 127 121 116 102 72 38 10 -16 -47 -71 -77 -67 -54 -31
12026 -31 9 60 97 110 101 73 32 -1 -7 14 44 70 91 103 100 86 76 72 63 49 46 61 72 60 37 30 48 76 100 116 119 108 88 76 78 91 116 149 179
12009 179 194 192 188 187 180 156 116 77 54 48 48 47 39 24 8 -1 4 27 59 89 106 102 81 60 67 110 171 220 241 238 224 206 188 174 172 181 189 185 169 155 151 154 151 143 138
11989 138 138 133 121 109 100 77 36 -1 -17 -18 -29 -47 -52 -39 -25 -15 6 42 69 66 41 13 -5 -9 7 37 56 47 22 3 7 36 86 140 173 176 167 169 183 193
11972 193 186 155 103 49 22 25 31 13 -15 -20 5 35 48 51 62 84 110 133 147 150 147 150 162 177 187 190 186 178 180 191 197 183 159 152 168 183 180 169 174 194 208 200 175
11953 175 149 128 115 116 131 153 175 188 191 182 160 136 124 125 128 121 112 111 112 98 69 50 58 78 82 65 47 44 48 46 41 40 42 42 41 47 61 75 82 83 80 70 53 36 34 54
11933 54 84 104 101 78 48 24 12 4 -6 -19 -19 5 42 66 66 59 59 63 55 35 13 1 2 9 14 12 10 14 20 21 14 11 17 24 26 33 51 74 89 96 100 104 106 109 118 123 113 85 48
11912 48 11 -17 -29 -24 -11 4 30 79 134 168 165 137 104 81 74 83 97 101 94 86 81 75 72 80 103 126 140 144 148 153 156 154 146 134 127 133 143 141 117 83 54 39 39 58 97
11893 97 144 179 184 155 113 88 92 109 111 89 58 35 22 19 25 31 19 -6 -18 2 41 66 72 75 90 114 134 143 137 125 119 120 118 101 75 53 36 21 13 20 38 52
11874 52 56 57 61 63 60 55 52 42 20 1 9 50 99 121 106 77 62 69 77 65 36 10 -2 -7 -16 -27 -33 -34 -41 -55 -62 -48 -18 14 38 57 80 109 138 159 166 156 132
11856 132 100 65 35 20 29 58 86 95 80 55 34 20 6 -11 -23 -16 8 34 46 46 45 52 60 61 55 48 47 57 73 84 85 84 93 113 134 148 157 160 147 118 90 77
11838 77 73 65 53 46 38 21 4 6 29 50 55 55 66 89 111 122 121 115 106 97 84 67 54 52 51 33 -12 -64 -95 -98 -79 -49 -11 26 53 63 62 62 64 63 57 54 62 80 98
11818 98 107 97 68 31 12 26 53 58 36 20 28 39 31 23 47 93 120 109 86 81 97 121 142 153 157 167 195 229 236 210 172 142 119 97 83 88 105 123 141
11801 141 155 156 148 150 174 202 211 199 178 160 150 150 156 154 144 138 138 122 79 29 1 -8 -23 -40 -40 -16 15 41 63 84 99 110 126 145 154 144 125 110 107 115 125
11783 125 122 99 72 58 59 59 43 15 -13 -27 -18 9 34 40 37 44 64 80 86 97 117 132 130 125 132 144 145 130 110 99 97 95 91 89 98 125 165 208 237 240 222 201 198 211
11764 211 222 221 211 196 167 125 90 87 107 120 107 76 41 13 2 13 34 40 23 -2 -24 -34 -35 -26 -13 -7 -14 -29 -47 -62 -67 -54 -32 -21 -30 -42 -40 -25 -6
11747 -6 16 43 65 71 64 59 66 79 86 79 65 60 69 85 99 106 108 104 90 69 49 29 2 -31 -63 -84 -89 -80 -59 -30 0 31 59 79 85 75 58 43 40 52 74 94 100
11729 100 97 97 107 124 145 163 168 158 142 131 125 112 93 80 81 91 100 100 91 81 82 94 106 110 114 132 157 170 169 167 173 181 187 192 192 178 156 144 147 149 135 112 94 83
11710 83 79 81 93 107 116 117 112 105 97 83 58 24 0 2 22 40 51 64 74 65 33 0 -13 -8 2 15 25 31 35 46 63 76 83 88 91 80 53 18 -13 -39 -53 -49 -38
11691 -38 -41 -57 -65 -54 -38 -30 -23 -3 21 42 58 77 97 116 136 152 153 143 140 151 158 149 134 126 116 94 64 38 19 8 20 56 91 101 98 104 121 128 119 104 91
11673 91 75 60 57 69 91 120 154 183 194 182 159 138 122 102 67 21 -11 -12 6 11 -1 -2 26 58 62 37 9 -9 -20 -20 -6 11 14 -3 -37 -82 -126 -152
11657 -152 -147 -121 -90 -56 -6 58 128 189 223 209 162 121 113 116 101 77 70 79 84 81 87 100 101 89 83 88 95 106 132 167 185 175 151 128 112 105 108 115 117 112 102 84 61
11638 61 59 98 157 201 217 222 224 205 163 116 88 81 87 100 106 100 90 87 86 79 74 78 83 73 53 44 49 52 54 67 87 102 113 135 164 183 188 193 201 200 189 181 177 163 137 106
11618 106 72 24 -24 -49 -38 -6 25 48 48 19 -18 -34 -28 -24 -34 -46 -57 -68 -68 -35 21 65 85 98 114 121 112 103 100 93 82 84 101 111 110 116 130 130 106 87 93
11600 93 110 125 140 151 140 106 73 57 46 31 25 33 37 28 19 17 12 4 21 69 113 120 103 87 75 64 63 70 62 31 8 19 52 77 87 84 60 13 -24 -25 2 30
11582 30 43 46 46 52 76 108 114 88 65 73 100 123 145 168 178 174 178 191 180 127 67 41 41 41 43 59 77 79 77 82 75 37 -10 -36 -42 -47 -50 -46 -48 -61 -59 -21 26 54 68
11563 68 81 75 40 9 19 54 77 85 100 120 131 147 178 203 197 176 171 177 179 185 202 195 139 68 32 25 16 10 26 47 50 61 113 181 209 203 207 224 220 195 186 195 192 175
11544 175 171 179 166 134 112 101 83 70 87 115 111 80 63 69 68 49 22 -16 -72 -108 -85 -28 10 34 74 108 91 47 40 71 75 37 11 22 40 54 86 130
11527 130 147 141 157 191 201 188 192 214 212 186 181 199 195 172 182 227 258 262 276 297 288 257 259 288 293 277 306 382 441 470 512 557 534 446 382 372 363 342 368
11510 368 449 515 542 570 588 530 419 362 380 381 336 330 386 413 382 379 428 436 373 329 339 315 233 209 282 337 311 299 358 399 378 386 458 490 459 492
11495 492 620 691 660 690 843 952 943 988 1156 1262 1239 1316 1589 1812 1867 2027 2440 2832 3075 3540 4441 5425 6366 7875 10359
11484 10359 13430 17316 23772 33518 43011 46220 40688 30309 21075 15440 12007 9204 7073 5869 5028 4068 3258
11477 3258 2869 2603 2187 1837 1746 1691 1473 1269 1235 1202 1022 865 881 924 848 764 779 778 657 545 556 583 510 431 447 470 406 347 388
11464 388 442 405 351 378 428 406 366 392 429 391 320 295 283 231 188 209 235 201 165 195 245 235 205 225 271 283 288 341 410 438 450 481 487 426 357
11449 357 350 368 348 324 363 436 456 417 365 306 225 160 156 175 160 137 161 208 212 180 165 167 150 126 131 146 124 76 53 61 73 93 129 145 108 54 40
11433 40 52 41 21 39 83 106 112 137 172 176 160 169 202 218 220 245 285 289 256 232 232 230 217 212 212 193 162 154 170 179 175 182 194 185 160 147 142 112 59 16 -3 -13
11415 -13 -4 36 83 90 63 41 34 17 -1 8 37 42 22 22 63 123 180 239 287 297 274 250 232 197 154 140 161 181 191 220 271 301 290 266 258 250 223 185 158
11398 158 145 147 164 174 150 105 83 98 126 148 167 179 169 147 147 168 171 141 111 108 120 122 114 101 77 44 13 -15 -47 -66 -42 10 47 55 65 89 97 73
11381 73 44 38 40 35 37 60 86 95 95 96 93 87 95 116 114 79 41 27 21 3 -7 12 43 52 42 47 74 103 119 129 141 153 163 168 167 161 156 153 147 142 151 172 188 192 193 186 158
11361 158 119 100 109 117 101 75 53 32 11 10 40 76 88 84 84 90 92 92 93 89 78 79 102 127 133 126 128 140 151 156 157 149 131 114 102 86 65 51 48 45 45 65 106 141
11342 141 153 155 153 123 52 -16 -36 -13 12 20 18 9 -2 -6 0 -3 -33 -76 -107 -129 -150 -154 -121 -67 -26 -1 27 62 83 85 79 72 66 72 100 136 160 166 161 141 106 82
11323 82 94 130 153 157 161 168 159 129 91 54 12 -22 -27 -3 21 26 21 14 -1 -25 -40 -34 -15 4 20 30 32 30 36 53 78 108 139 156 155 153 169 192 195 171 141 121
11305 121 115 120 137 156 160 146 126 105 81 59 50 58 73 99 140 175 177 148 117 100 82 57 41 47 56 49 40 46 64 73 72 76 89 100 102 102 112 128 135 125 106 92 84
11287 84 74 65 67 82 99 110 124 139 136 104 65 47 53 67 81 98 109 102 79 53 22 -14 -37 -24 15 46 53 59 83 113 126 117 91 56 22 0 -8 -10 -6 14
11269 14 57 116 176 221 237 224 191 152 113 74 51 56 81 103 117 127 131 122 105 87 65 40 32 55 89 96 76 64 76 94 99 101 110 124 139 157 172 170 157
11252 157 155 172 195 213 227 230 208 170 144 140 135 115 97 95 93 77 61 61 72 87 111 142 157 149 140 149 160 144 111 91 92 102 114 126 133 129 120 113 101 76 51 33
11234 33 5 -46 -91 -84 -23 41 67 55 33 21 29 51 83 117 148 163 149 113 81 67 62 54 55 66 63 27 -20 -41 -25 1 22 35 38 25 4 -8 -15 -28 -48
11217 -48 -61 -58 -43 -17 17 54 80 89 87 79 73 80 104 130 141 141 140 140 133 126 137 158 165 151 129 108 87 66 63 81 101 99 68 17 -37 -76 -87 -72 -45 -12 24 58
11199 58 80 91 104 119 118 91 51 20 11 16 23 24 20 20 29 41 49 58 75 94 104 106 109 116 120 113 98 83 78 92 118 134 125 101 81 70 61 54 54 59 61 62 66 64 45 19 6
11179 6 10 19 24 25 22 7 -16 -40 -54 -54 -38 -10 12 12 -2 -12 -10 -9 -18 -28 -25 -5 28 64 87 91 89 97 116 136 154 170 176 162 140 129 135 145 148 140 117 78 43 41 70
11159 70 105 127 144 159 160 141 121 121 149 191 230 245 222 174 131 112 111 122 141 161 168 157 142 126 102 70 44 32 31 34 43 56 63 63 72 96 124 136 131 116
11142 116 104 112 144 175 172 135 102 98 105 97 85 90 108 113 101 82 65 45 24 9 0 -10 -20 -19 0 40 92 139 164 165 156 144 120 85 58 54 57 48 27 9 2 5
11124 5 23 52 74 72 53 40 40 47 56 63 57 35 9 0 7 22 41 64 81 80 71 73 91 110 120 119 110 96 87 86 89 84 70 52 34 16 5 10 30 57 76 72 41 0 -18
11104 -18 -8 9 18 25 34 37 32 32 44 51 39 26 34 54 62 58 62 77 89 92 90 72 24 -40 -83 -94 -97 -110 -119 -104 -73 -47 -38 -46 -65 -84 -89 -81 -72 -71 -76 -89 -108 -118 -97 -45
11084 -45 10 44 50 36 12 1 22 71 119 145 148 138 115 85 62 56 61 65 63 53 34 11 -2 -4 0 3 11 29 55 81 99 102 91 84 97 113 102 62 24 13 19
11066 19 19 12 11 22 36 42 36 14 -14 -31 -23 1 32 64 93 106 91 54 16 -6 -10 -3 -2 -18 -36 -37 -18 4 17 23 30 32 23 10 1 -5 -13 -17 -10 3 19 36 47 39 11
11047 11 -19 -34 -32 -25 -18 -9 3 15 22 18 0 -29 -58 -74 -75 -67 -56 -49 -45 -38 -19 0 11 16 30 57 82 95 110 142 181 204 195 156 107 68 49 44 46 61 93 127
11029 127 134 112 87 81 89 96 103 110 112 113 126 149 157 135 103 83 70 53 43 59 98 139 169 186 183 155 121 104 107 109 96 73 48 25 13 13 14 0 -20 -17 22 77
11011 77 112 114 98 89 99 117 124 112 92 78 67 48 21 -3 -21 -33 -40 -39 -30 -13 11 34 42 32 21 27 47 69 90 112 126 128 127 132 133 116 87 68 60 43 15
10993 15 -3 3 29 57 80 89 78 53 29 16 10 4 -4 -20 -42 -48 -17 40 92 117 125 128 121 99 74 67 86 123 164 198 212 204 182 159 142 136 139 141 133 121 118 126 131 129
10974 129 130 135 132 118 112 125 143 146 126 96 63 29 1 -12 -6 17 49 73 71 47 17 -5 -27 -49 -61 -54 -37 -18 2 33 66 85 84 73 65 69 77 82 84 92 106 113
10955 113 108 106 124 149 155 141 133 146 164 169 161 149 129 107 94 89 70 31 7 27 73 106 117 131 162 193 207 201 179 150 135 151 189 219 225 223 227 231 224 204 181
10938 181 164 157 160 158 131 77 19 -18 -31 -28 -10 20 47 57 56 66 92 116 125 126 134 147 152 148 149 164 184 193 182 157 120 78 42 24 24 33 44 53 55 48 39 43 64 89
10919 89 112 140 171 192 187 156 115 75 46 28 17 6 0 13 58 110 131 106 57 21 20 45 75 96 112 124 123 107 89 90 107 113 102 96 119 159 186 184 162
10902 162 133 109 97 93 86 72 61 69 91 112 123 123 113 99 90 90 87 77 71 81 100 110 109 106 97 73 43 29 37 50 55 61 82 113 144 162 159 133 98 70 53 39
10883 39 26 26 41 56 57 45 29 11 -9 -26 -28 -10 19 42 48 37 27 32 53 83 119 159 192 211 218 220 211 179 128 81 56 45 36 23 5 -16 -34 -39 -22 15
10866 15 67 124 165 173 151 124 105 85 59 40 46 73 103 125 138 148 158 174 192 204 199 180 156 136 123 116 108 92 77 70 64 42 5 -26 -35 -23 4 49 108
10849 108 161 187 183 162 134 105 80 65 56 43 29 22 25 32 38 38 38 45 62 80 75 44 8 -5 -2 -8 -31 -54 -54 -28 10 47 72 85 93 100 107 104 93 83 81 82 75 56
10830 56 29 1 -24 -42 -42 -23 5 27 41 58 84 109 117 112 113 124 128 115 103 109 128 132 113 90 81 83 81 75 74 78 71 44 8 -14 -15 -6 2 8 11 1 -21 -39 -31 2 40
10811 40 69 94 120 143 158 164 166 166 162 153 134 103 72 52 37 9 -24 -33 -3 46 87 110 122 121 103 76 57 42 18 -9 -26 -25 -14 -1 14 31 43 52 69
10794 69 103 143 172 186 190 191 196 202 199 171 119 64 35 44 76 104 116 116 114 110 104 103 119 144 160 161 165 177 183 170 151 144 143 132 113 106 122 149 167 164 143 120 116 133
10775 133 150 151 140 132 127 120 114 116 122 123 122 127 129 116 89 68 62 70 88 115 132 122 92 73 83 106 127 152 185 211 209 181 142 102 68 46 35 28 25 37 72 125
10756 125 179 224 257 267 251 217 187 174 179 194 206 207 202 194 177 141 93 61 59 70 74 74 95 143 192 213 196 158 129 126 142 159 164 164 167 165 152 134 127 136 154
10739 154 166 159 130 94 71 73 82 76 57 41 40 44 43 38 35 36 32 19 8 14 42 77 106 124 136 129 92 38 4 10 37 54 52 47 50 56 57 50 33 6 -17 -27 -24 -18 -14 -10
10719 -10 -2 7 16 23 21 7 -12 -29 -45 -71 -114 -164 -196 -189 -138 -61 6 44 69 110 175 234 257 242 213 191 178 161 132 87 34 -11 -31 -23 -3 10 15 21 30 33
10701 33 24 15 19 25 16 -2 -10 3 19 22 21 37 75 120 153 169 169 159 149 136 109 67 34 32 55 70 61 40 33 50 86 123 147 152 153 160 162 148 127 122 136 152 156 157
10682 157 167 179 178 166 155 151 155 164 179 188 179 158 142 140 141 134 120 108 105 109 116 125 133 136 129 117 109 110 118 123 122 119 119 119 107 78 44 28 37 54 56 45 40 46 49 40 30 38 56 66
10661 66 60 45 27 0 -35 -60 -63 -46 -21 7 39 68 80 65 31 -2 -20 -21 -17 -19 -23 -19 0 36 77 109 124 132 147 171 185 174 141 107 84 73 77 98 123
10644 123 131 116 92 78 78 90 105 116 114 104 94 86 75 58 45 45 57 73 91 107 121 130 135 133 120 103 98 115 143 166 175 170 160 149 142 139 138 139 146 155 162 159 146 127
10625 127 111 103 96 81 55 32 25 34 49 70 97 123 137 132 118 107 109 128 150 151 121 81 58 51 35 7 -11 -7 2 5 5 13 21 14 -3 -16 -12 14 62 113 140 134 120
10606 120 123 139 149 146 143 148 157 165 171 173 170 162 153 147 146 149 149 142 133 130 121 87 42 22 42 71 75 60 52 53 44 23 9 9 13 20 36 53 52 31 11 7 14 24 39 55 61 61 74 109
10584 109 148 169 168 154 133 105 80 62 51 42 34 31 33 39 50 61 63 58 56 58 51 23 -11 -28 -17 9 34 48 49 41 41 60 98 138 157 147 124 110 106 97 74 56
10566 56 67 98 121 122 113 109 108 110 116 123 118 104 104 130 165 188 197 198 181 141 102 90 101 107 90 58 28 7 3 22 54 73 66 39 11 -9 -24 -37 -53 -70 -74 -54
10548 -54 -24 -10 -18 -23 0 42 81 102 107 100 83 56 30 16 22 46 78 100 99 76 47 26 15 3 -16 -33 -34 -13 20 50 64 60 48 46 62 85 97 89 66 37
10531 37 8 -13 -16 2 33 64 90 103 94 65 38 31 36 34 23 23 40 49 33 4 -7 12 52 93 135 179 212 219 199 168 141 116 86 59 45 37 15 -23 -51
10514 -51 -44 -9 30 65 101 136 158 164 166 172 174 167 158 155 154 146 139 142 154 163 172 191 212 213 183 139 105 82 59 36 24 27 33 34 27 20 20 28 46 70 97 127 161 192 203 184
10494 184 146 114 100 100 99 94 92 102 127 155 170 171 166 163 159 143 117 87 58 27 1 -9 -2 8 16 32 69 118 153 155 134 117 120 135 146 149 153 161 165 157 141 127 111
10475 111 84 53 41 62 99 123 124 113 106 104 100 85 65 48 46 54 63 66 68 74 77 72 66 73 93 113 122 128 146 173 194 195 181 167 162 164 170 182 192 185 155 119 98 93 91 87
10455 87 92 107 114 101 84 86 105 122 127 123 117 103 77 47 27 30 58 100 132 140 126 103 79 56 34 13 -4 -16 -17 -8 3 16 33 48 47 31 15 10 5 -8 -15 1
10437 1 31 48 48 57 92 136 165 169 147 101 36 -32 -91 -129 -142 -124 -87 -50 -25 -7 10 31 52 68 72 65 62 83 119 147 158 169 191 215 233 248 269 284
10421 284 282 268 247 212 160 110 82 80 89 102 117 127 125 116 111 109 110 119 137 150 147 142 152 171 177 165 150 135 103 56 24 37 85 134 163 173 166 146 120 107 117
10403 117 146 175 188 178 157 138 124 104 75 44 22 6 -7 -19 -24 -21 -14 -7 -1 7 15 19 16 10 6 8 11 14 19 27 32 38 58 99 145 175 187 194 196 181 145 107 87 85 93
10383 93 109 136 164 178 170 146 118 94 80 75 73 66 56 47 45 56 79 105 121 124 120 110 89 59 28 5 -9 -13 1 36 74 98 102 93 74 49 31 29 38 43 42 47 67
10365 67 94 119 138 153 164 167 157 135 105 82 73 77 87 101 116 122 109 91 94 122 145 134 100 80 86 92 72 34 12 19 35 34 17 6 12 32 57 88 119 132
10347 132 122 107 109 127 134 114 79 50 34 28 30 34 28 7 -18 -29 -19 5 41 81 112 119 105 89 85 86 82 70 57 48 42 37 30 19 9 4 1 0 -2 0 7 11 15 26 43
10328 43 53 44 27 24 47 79 95 81 43 3 -17 -17 -7 7 34 77 125 156 166 167 174 181 171 140 98 65 46 30 1 -40 -72 -76 -59 -44 -33 -5 51 117
10311 117 157 161 143 119 92 63 36 16 5 1 9 29 57 87 113 133 142 134 115 90 65 42 24 15 21 39 56 57 28 -20 -63 -73 -47 -9 13 19 24 37 51
10294 51 60 61 59 48 26 -3 -36 -70 -97 -103 -83 -50 -21 0 25 54 76 91 112 135 142 125 106 105 115 117 106 94 84 66 38 13 0 -9 -19 -22 -9 13 30
10277 30 40 49 58 53 22 -21 -53 -59 -49 -39 -29 -12 14 35 38 27 14 11 18 29 36 36 39 55 86 117 134 131 110 78 49 36 39 39 23 3 1 20 46 65 72 67 55
10259 55 47 47 47 43 43 51 54 41 26 29 46 56 48 39 40 47 53 67 91 111 111 87 54 27 16 25 42 53 63 92 143 190 200 175 137 102 72 42 19 12 24 50 77
10240 77 98 118 141 163 167 146 114 96 101 122 137 128 98 77 94 142 181 183 165 157 169 187 195 188 173 158 158 175 198 209 206 191 170 151 149 169 200 230 251 261
10223 261 253 231 221 235 252 240 200 168 162 167 164 154 152 156 153 143 138 141 140 118 76 32 6 1 1 5 23 58 93 107 99 82 65 50 45 58 79 88 85 89 110 136 151
10204 151 156 159 159 154 149 152 162 165 156 139 122 108 91 72 60 65 85 104 110 107 102 89 64 39 29 31 33 35 46 63 69 60 56 67 82 84 77 69 70 83 108 132 137 120 99 94
10184 94 99 106 113 124 135 137 129 115 96 78 71 74 78 81 97 135 177 194 178 145 111 80 53 34 26 29 40 50 48 28 5 -1 16 44 71 90 106 117 120 115 111 122 149
10166 149 174 180 166 152 151 159 170 184 195 192 169 140 121 112 105 97 85 62 32 17 33 66 95 119 143 159 152 131 128 156 189 198 185 167 150 127 99 80 80 98
10148 98 117 128 133 141 149 151 146 149 167 182 175 145 111 84 60 40 32 39 47 43 34 37 57 88 113 119 109 100 112 140 164 171 169 164 148 116 82 63 66 82 100 110 109 103 106 122
10128 122 133 129 114 104 98 88 67 40 16 -1 -7 0 14 31 50 66 79 89 104 124 138 140 136 137 139 128 104 80 67 64 60 45 20 -8 -25 -12 29 82 120
10111 120 136 133 119 96 77 77 101 135 155 150 129 100 65 27 0 -7 1 15 33 55 73 76 64 59 72 95 110 111 100 78 47 21 13 21 28 25 18 13 4 -9 -15 6
10093 6 54 102 119 107 87 82 87 87 79 76 85 94 89 67 38 15 3 0 0 -3 -12 -18 -15 -3 11 21 25 36 71 128 186 222 233 229 222 209 187 155 114 71 38 31 48 72
10074 72 85 82 73 71 85 117 150 162 145 117 96 83 69 46 17 -6 -15 -7 12 28 34 34 32 26 15 3 -5 -15 -25 -30 -26 -18 -10 1 16 20 3 -19 -28 -17 0 14 28
10056 28 52 91 138 178 197 187 156 116 74 39 26 34 48 51 50 62 88 108 106 88 61 32 11 9 23 41 59 80 97 85 43 10 21 68 112 126 118 108
10039 108 100 93 90 95 99 97 86 69 47 22 6 12 44 89 130 154 157 138 105 79 82 113 150 171 165 137 94 53 35 50 82 108 114 102 78 49 33 42 69 93
10022 93 108 127 160 196 220 231 229 210 176 144 131 135 147 160 172 176 168 153 142 133 117 91 65 44 28 14 3 -2 -8 -13 -11 1 15 21 15 5 1 4 8 5 -1 -4 4 21
10003 21 39 50 49 35 13 -2 -4 -1 0 0 8 31 58 80 94 94 78 59 51 55 58 52 45 42 39 28 13 1 -9 -24 -33 -19 16 49 65 72 89 114 137 156 173 179 156
9984 156 107 60 40 44 48 37 23 18 24 41 70 107 137 146 135 121 118 122 119 101 70 34 7 4 32 78 116 127 119 112 121 141 151 141 110 67 24 -9 -28 -27 -4
9966 -4 35 76 97 97 89 89 92 87 70 50 36 32 43 73 114 145 151 134 107 81 63 57 68 93 121 145 163 169 164 149 126 100 79 74 93 120 131 119 105 111 138 159
9948 159 151 120 89 68 48 19 -11 -18 13 75 138 176 183 178 182 196 206 198 179 155 122 77 37 26 47 76 92 101 114 123 114 88 69 72 94 117 132 137 139 146 160
9930 160 172 168 145 111 85 78 87 95 87 63 30 -2 -24 -25 1 46 83 97 97 102 118 135 144 137 112 73 39 25 29 37 48 72 110 139 143 126 107 90 60 17 -14
9912 -14 -7 35 85 119 144 167 180 165 125 87 67 57 42 27 23 32 47 65 84 97 90 65 32 7 -4 0 14 28 26 1 -36 -74 -95 -92 -70 -38 1 45 81
9896 81 86 58 29 30 62 99 126 146 162 172 176 178 177 167 148 127 103 72 42 31 47 71 85 77 44 -9 -60 -79 -61 -40 -40 -54 -57 -48 -44 -47 -39 -13 12 20 14 12 23
9877 23 46 71 95 114 122 117 106 104 111 121 128 140 164 191 199 178 141 104 80 78 102 141 171 172 147 112 86 81 101 134 157 162 157 155 151 141 131 125 120 110 103 111 125 131
9858 131 128 129 136 132 109 73 38 16 17 46 91 121 115 78 40 17 10 13 25 43 60 61 39 10 -3 11 46 85 118 133 119 78 31 0 -13 -18 -23 -24 -20 -10 8
9840 8 40 82 119 142 154 160 164 171 183 194 193 176 156 142 129 106 77 52 35 22 13 12 18 25 31 41 55 66 69 67 71 84 100 112 112 102 85 70 65 70 79 85 87 88 89 92
9820 92 95 106 124 147 165 172 162 134 100 78 78 95 114 131 150 171 184 180 166 157 156 151 136 116 107 108 101 79 62 71 101 119 108 82 71 78 88 89 79 59 36 30
9802 30 52 89 112 107 90 80 86 100 115 117 99 71 56 65 86 103 113 119 116 99 80 79 96 112 113 108 112 120 116 97 79 83 111 142 158 162 171 194 219 234 244 260 279
9783 279 284 262 218 175 149 144 152 161 160 143 116 91 83 95 115 128 129 128 134 153 178 195 198 189 173 157 145 145 165 195 207 181 129 87 69 57 28 -10 -37 -44 -38 -31
9765 -31 -18 5 39 73 101 122 137 148 152 150 146 147 151 149 137 123 115 110 106 103 109 124 142 160 178 190 184 157 125 108 111 117 106 76 43 19 6 1 9 40 92 143 172
9746 172 174 160 142 125 117 119 124 121 104 80 67 74 96 117 122 114 105 99 93 85 84 90 89 71 43 30 43 74 113 154 191 220 232 224 198 166 145 141 150 164 186 213 233 227
9727 227 196 160 127 97 70 56 62 79 103 133 165 188 190 179 173 176 180 174 158 141 129 124 122 119 118 124 142 168 188 188 174 161 165 180 186 169 129 82 36 0 -22 -23
9709 -23 -6 16 36 53 62 51 23 -1 -7 1 14 33 69 117 147 140 111 89 81 70 42 10 0 19 50 70 70 63 66 82 104 121 128 124 116 108 104 101 91 75 67 78 101
9691 101 111 97 69 50 50 61 70 70 55 28 1 -9 -3 7 13 19 36 64 92 105 93 63 42 49 81 110 123 131 146 161 158 137 113 100 98 103 108 105 92 79 74 73
9672 73 71 75 97 132 159 166 163 156 148 143 146 153 150 139 140 161 181 183 175 171 165 142 107 80 64 51 42 51 72 87 88 89 96 90 60 26 10 7 2 0 14 42 63 66 60 49 34 33 66
9651 66 123 159 149 119 108 116 112 100 111 152 186 181 152 137 148 169 184 186 172 146 126 124 128 114 83 62 63 72 74 80 97 111 108 101 109 122 112 74 34 19 25 34 41
9632 41 52 72 93 101 93 80 72 67 51 23 3 8 33 56 65 63 52 29 -5 -39 -59 -61 -46 -16 16 36 37 35 46 63 74 80 91 106 119 126 135 150 166 179 192 204
9614 204 208 199 180 150 108 67 53 75 113 137 140 131 117 96 73 63 68 76 81 93 125 166 191 189 169 146 131 123 123 127 134 135 121 90 53 29 23 23 25 42 85 135 161
9596 161 157 147 147 140 112 85 85 109 123 104 66 40 43 71 105 120 103 61 17 -10 -13 14 75 150 202 211 194 179 170 149 105 51 10 -6 3 33 65 79 68
9579 68 48 41 44 47 51 69 97 117 117 111 124 157 187 194 178 149 113 70 27 0 -3 12 38 68 99 116 111 92 80 89 106 116 121 133 152 163 154 133 113 98 94 107
9560 107 134 157 163 157 152 149 139 123 112 112 112 103 91 87 102 140 186 218 223 204 170 122 59 0 -29 -28 -11 13 52 101 143 168 178 181 172 153 142 151 170 178 166 147
9542 147 136 142 161 181 191 195 207 231 257 273 272 253 221 192 181 178 165 142 133 144 154 146 135 143 162 172 172 179 203 231 253 264 261 243 218 199 186 177 172 177 186 186
9524 186 176 166 162 163 167 168 165 161 162 165 158 136 114 110 120 128 135 152 184 220 247 259 255 237 209 180 156 144 139 129 108 94 104 128 133 121 121 139 142 119 107 130 166
9505 166 184 201 237 269 268 253 265 303 343 390 454 517 573 657 784 909 1026 1231 1604 2099 2698 3584 4893 6248 6862 6277 4878
9494 4878 3482 2552 1994 1579 1258 1054 907 752 620 552 511 456 411 407 403 353 282 241 224 200 177 182 198 190 159 133 119 105 97 114 148 169
9480 169 173 181 206 241 274 297 298 272 231 195 176 180 207 243 262 247 206 159 118 94 98 124 144 144 143 159 180 183 172 166 163 141 95 45 14 10 30 59 80 86 87
9462 87 92 96 91 90 108 137 154 145 114 69 20 -11 -11 19 67 116 155 174 168 153 142 135 119 100 92 104 126 147 164 173 177 182 190 194 191 194 220 257 276 261 220 168 117
9443 117 84 83 105 127 138 151 174 191 181 148 113 94 94 104 114 118 112 95 66 30 4 5 29 54 64 66 77 98 120 136 155 182 208 221 213 189 159 128
9427 128 99 81 82 105 142 180 205 202 175 150 154 181 199 182 144 116 112 129 159 186 190 163 125 106 115 137 153 154 138 112 84 62 44 26 14 14 22 28 30 33 34
9409 34 26 19 24 38 53 67 79 78 57 30 25 46 69 76 71 63 51 36 30 40 56 64 62 62 69 76 79 80 84 95 109 124 146 179 219 242 228 181 126 83 63 77 126 189
9390 189 229 226 193 157 133 121 118 124 139 163 186 196 183 153 116 75 39 23 37 58 60 38 20 20 28 35 47 65 77 71 63 74 102 125 128 117 99 79 60 41
9373 41 26 22 37 65 90 104 117 138 162 181 201 228 248 243 216 184 156 129 104 94 103 128 160 185 189 168 138 121 124 138 154 168 174 167 155 151 155 151 133 112
9355 112 102 99 89 64 35 22 37 66 84 80 70 78 100 112 103 89 85 81 66 46 39 46 54 57 62 68 60 29 -7 -29 -35 -36 -31 -4 48 102 126 114 86 65 61 72 87
9337 87 92 84 70 58 45 25 7 10 35 66 92 116 137 143 128 105 84 63 42 34 45 65 84 105 130 140 116 74 50 58 81 95 99 102 110 121 129 132 132 137 146 154 156
9318 156 156 154 141 113 82 61 50 42 47 71 103 120 115 98 82 75 83 112 149 178 193 202 206 197 182 177 185 191 183 170 167 177 187 181 156 128 117 130 150 161 167 182 200
9300 200 203 190 175 169 165 164 179 207 225 220 205 194 175 140 99 71 58 50 51 70 98 113 102 75 49 36 32 25 8 -9 -10 10 43 82 128 170 185 166 135 112
9282 112 89 52 14 0 13 29 34 25 10 -2 2 30 65 90 115 150 184 192 174 154 136 108 74 65 95 142 172 186 193 191 166 124 88 69 59 52 54 70 89
9265 89 93 70 32 3 -1 9 17 15 18 35 55 65 65 61 55 42 29 25 32 35 20 -8 -36 -41 -15 38 100 151 175 164 119 58 8 -15 -20 -25 -39 -50 -48 -39 -33 -36 -43 -46 -43 -35
9245 -35 -21 -7 1 -3 -17 -25 -15 7 27 38 52 74 92 89 63 29 9 6 15 27 41 53 59 56 48 40 35 37 48 64 79 81 71 60 62 77 89 83 59 30 16 25 42
9227 42 47 34 13 -2 -13 -17 -11 0 6 -5 -25 -29 -8 21 33 20 -1 -8 11 59 117 163 179 163 129 96 78 78 90 103 106 93 70 53 50 61 72 82 99 130
9209 130 166 187 181 159 136 126 126 130 132 131 127 119 107 97 98 115 147 182 207 215 207 193 177 158 136 116 101 83 48 0 -36 -38 -8 28 54 66 70 69 67 66 66 72 91
9191 91 124 160 180 179 170 159 138 104 70 52 47 35 14 2 13 34 44 41 42 55 72 85 102 124 135 127 113 113 123 121 102 81 65 46 28 31 65 104 121 120
9173 120 123 140 165 196 235 272 282 255 205 155 116 93 84 89 101 119 140 152 142 112 72 29 -12 -38 -36 -13 5 13 22 41 55 49 32 29 52 92 129 153 158
9156 158 144 114 71 21 -15 -28 -18 -1 13 35 63 84 92 95 101 101 87 68 64 77 94 108 121 135 144 145 141 131 109 77 44 22 20 36 57 66 62 60 68 77 79 79 86
9138 86 94 88 68 49 40 35 27 18 12 13 24 45 62 57 33 17 31 68 105 128 141 154 167 174 169 153 132 105 76 49 35 36 50 73 106 138 152 134 100 75 70 79
9120 79 90 104 120 132 131 121 111 109 107 90 59 32 34 63 94 108 108 108 113 118 122 132 148 162 170 169 157 137 123 127 142 149 141 135 147 173 193 196 188 185 195 208 206 182 157
9100 157 150 160 168 165 161 162 158 140 112 91 93 117 155 188 202 201 196 198 201 194 175 151 133 127 135 151 165 173 172 157 129 97 74 66 65 63 57 46 24 -3 -29 -45 -56 -68 -76
9081 -76 -71 -60 -59 -73 -89 -87 -66 -44 -37 -39 -30 3 51 101 144 178 189 165 115 61 20 0 -1 18 49 67 61 45 41 53 73 90 101 103 98 89 73 47 18 5 20
9063 20 47 59 45 16 -11 -31 -50 -66 -75 -69 -49 -32 -32 -44 -49 -42 -35 -37 -30 0 37 52 46 47 76 121 160 188 210 220 208 177 146 129 121 115 116 131 149 147 119 87
9045 87 78 92 104 100 89 95 124 166 203 231 253 271 278 266 235 200 174 157 140 120 108 120 152 188 213 219 206 179 148 125 119 128 143 159 175 196 217 224 210
9028 210 186 169 158 142 122 120 142 168 179 175 168 156 137 121 124 139 142 126 111 115 129 135 128 118 115 120 127 128 124 123 128 133 126 106 81 63 52 50 53 56 49 30 3 -20 -31
9008 -31 -25 -5 15 26 27 20 1 -27 -54 -63 -52 -27 5 47 83 100 96 87 79 70 55 40 32 32 42 58 69 71 76 102 139 159 144 109 81 75 92 128 169 195 194 173
8990 173 147 123 100 86 92 117 142 148 131 102 80 74 80 88 94 96 87 63 36 21 21 27 38 61 94 119 128 133 140 136 109 71 43 33 31 35 42 41 21 -6 -16 -1 14 17
8971 17 12 9 2 -10 -21 -19 -5 19 58 107 146 156 146 146 175 214 236 226 199 174 162 163 171 180 185 183 176 169 161 146 114 67 20 -8 -6 18 47 61 63 65 79 99 117
8952 117 135 162 197 232 258 270 265 251 242 244 247 234 205 174 150 131 113 96 83 71 56 43 34 28 22 24 39 59 70 62 42 21 10 12 23 32 32 25 19 17 18 23 37
8934 37 68 114 157 178 174 156 135 112 87 69 70 81 79 46 -4 -43 -47 -20 12 34 48 69 97 112 102 83 82 101 120 125 126 132 138 129 103 78 68 77 95 106 105
8916 105 93 79 64 42 13 -6 -3 16 35 43 50 69 98 121 130 135 144 152 147 129 108 93 76 57 50 66 94 110 103 88 69 42 7 -14 -10 7 19 25 41 69 98
8898 98 116 120 115 103 87 72 60 48 45 61 94 125 140 150 170 195 205 191 169 159 166 172 165 137 91 38 -6 -25 -20 -8 -8 -22 -38 -50 -61 -71 -72 -57 -32 -5
8881 -5 23 58 99 133 142 123 89 62 52 49 44 40 41 47 53 60 75 91 96 84 66 52 45 41 41 40 33 23 25 47 76 95 97 89 76 51 18 -12 -27 -22 -5 5 0 -7 -1 21
8861 21 42 51 60 85 114 119 89 49 31 42 66 79 72 54 42 44 53 58 57 54 52 50 52 57 60 54 44 39 34 23 13 19 42 69 87 98 104 100 80 47 9 -25 -57 -88 -119
8841 -119 -144 -144 -112 -74 -67 -92 -109 -88 -40 7 50 96 138 162 168 168 161 140 112 99 105 113 108 99 98 99 90 76 69 75 87 98 104 101 88 74 72 81 91 91 84 78 78 88 108 131
8821 131 151 158 149 133 122 127 144 156 154 142 132 133 141 153 165 176 182 183 177 167 161 170 195 225 236 215 168 117 81 67 68 81 102 132 160 176 174 159 144 132 120
8804 120 103 81 59 39 20 8 13 38 75 105 120 121 113 100 83 74 80 96 100 80 44 15 4 1 -2 -2 15 48 75 75 51 25 16 27 53 85 116 138 146 140 130
8786 130 124 126 131 133 124 105 82 67 70 87 104 108 104 107 122 135 132 118 106 105 106 97 78 58 43 39 48 73 108 136 138 110 67 36 29 36 41 31 9 -4 5 38 72 92 107
8766 107 138 180 200 167 98 46 38 57 68 59 43 32 21 4 -14 -27 -26 -8 21 53 70 64 41 15 -2 -12 -16 -11 2 24 47 59 55 40 29 32 49 73 95
8749 95 110 116 117 125 142 159 159 142 124 117 116 114 108 94 73 51 49 71 99 111 114 129 154 161 138 114 114 127 121 95 74 74 78 67 46 30 25 24 28 43 65 82 81 65 48
8730 48 44 56 75 84 70 39 9 -2 14 53 94 120 122 106 86 73 68 68 66 55 30 0 -24 -29 -10 23 64 99 122 129 128 128 133 145 161 176 180 162 133 124 153 201
8712 201 227 216 189 168 149 117 80 59 57 57 50 48 58 69 62 41 24 22 32 43 52 58 66 82 107 134 156 166 163 149 131 127 144 177 209 229 241 242 223 174 109
8694 109 55 28 26 42 76 122 156 148 99 42 10 3 1 -8 -14 -8 6 27 55 91 126 151 168 181 187 187 184 177 159 128 104 107 132 155 164 169 185 208 222 216 190 148
8676 148 100 61 46 52 65 75 85 101 124 142 144 132 116 106 102 94 82 74 81 101 114 102 65 18 -18 -42 -61 -80 -94 -92 -75 -56 -47 -48 -50 -42 -20 17 63 101
8658 101 121 119 101 76 52 33 27 41 69 96 112 116 113 107 101 100 106 112 111 98 78 50 20 0 0 9 10 4 12 43 80 100 98 81 60 48 61 96 131 146 151 164 185
8640 185 190 175 159 156 157 156 155 161 164 156 146 143 140 122 89 61 53 66 89 112 130 134 118 87 52 32 37 63 86 85 61 37 34 49 67 83 101 119 120 98 74 74 92
8621 92 101 86 66 58 56 52 59 85 112 118 113 128 165 191 181 149 115 87 62 53 75 119 162 194 219 240 251 242 214 177 148 140 147 152 148 144 150 165 178 182 170 142 107
8602 107 85 89 110 126 130 127 121 106 85 63 46 40 49 77 115 150 180 206 224 223 209 195 181 155 115 78 60 55 53 56 70 89 100 101 102 106 105 96 87 90 106 125 137
8584 137 141 138 135 134 135 138 139 135 129 124 127 132 133 129 125 129 142 159 172 173 161 136 106 79 70 90 131 168 183 178 173 176 180 176 165 151 136 125 120 122 119 106 84 68 66 74 85 94 102 114
8562 114 126 128 106 65 24 4 3 6 1 -6 0 21 40 34 4 -24 -32 -17 7 35 65 91 108 119 129 138 137 123 106 98 102 113 128 142 147 143 134 127 123 118 110 98 79 56
8543 56 41 50 89 139 176 183 170 152 139 126 110 93 81 66 44 22 16 27 47 68 90 110 116 101 72 38 12 5 26 68 106 123 119 105 84 60 36 20
8527 20 15 25 56 100 138 151 139 120 110 117 133 147 143 124 106 100 93 71 43 32 41 53 54 45 34 26 23 28 37 43 53 80 113 122 95 65 77 129 177 186 170 166 186
8508 186 213 220 207 190 180 171 153 127 108 106 117 126 122 105 81 62 58 73 94 103 88 55 25 11 13 18 20 23 36 56 77 91 99 103 104 100 90 78 72 74 78 78 69 52 34
8488 34 22 23 36 53 67 81 93 98 89 74 67 66 57 34 13 8 8 -2 -16 -11 12 32 34 25 21 23 26 29 35 41 40 30 16 3 4 24 54 76 81 79 81 83 75 57 35 14 -3
8468 -3 -6 13 50 89 120 149 178 204 223 231 222 190 143 102 77 64 53 50 70 105 130 131 122 125 149 178 198 200 183 155 129 119 122 122 106 80 66 80 119 162 188
8450 188 198 204 214 212 179 121 70 50 52 59 66 89 126 159 168 160 158 171 189 202 210 220 229 233 228 218 204 186 165 147 136 127 113 96 81 70 60 57 66 89 108 112 111
8432 111 119 132 131 104 65 34 12 -10 -35 -54 -59 -47 -26 0 23 38 45 42 32 22 21 39 69 91 93 78 65 64 72 86 108 141 174 196 203 204 204 199 180 146 93
8414 93 28 -23 -36 -8 24 36 40 66 109 138 132 104 71 37 9 2 22 51 67 62 47 31 22 24 30 32 30 37 57 81 96 103 107 110 115 128 149 159 145 121 103 94 87
8395 87 91 112 133 126 94 62 49 49 54 64 73 70 59 55 64 71 66 63 75 92 102 102 102 104 105 109 115 119 120 132 163 203 236 264 296 324 331 317 301 290 273 238 193 152 116
8376 116 90 91 127 180 216 219 201 186 189 210 237 249 226 171 107 69 72 106 146 167 157 122 79 49 43 57 79 98 111 121 132 144 153 155 151 144 140 136 130 123 120 123
8358 123 129 135 141 143 140 134 132 137 143 142 129 104 72 41 20 15 24 42 67 94 110 103 82 72 85 111 135 153 169 174 158 129 110 110 119 127 137 152 166 172 181 207 243 265
8338 265 255 213 156 101 68 66 87 118 150 181 199 192 164 137 124 114 97 81 79 83 80 77 94 131 170 199 218 227 216 183 148 136 150 177 199 203 187 155 121
8322 121 99 94 96 98 99 99 102 100 89 70 58 66 93 123 139 137 120 91 59 36 33 39 38 24 9 8 29 73 138 209 258 265 234 186 137 95 73 87 133 171 167 126
8303 126 86 73 82 103 137 182 217 226 220 218 219 200 154 104 76 74 87 99 105 104 97 84 61 35 13 4 6 12 23 43 72 102 129 149 155 135 95 60 48 53 54 43
8285 43 29 19 15 14 14 15 21 31 41 46 57 86 125 148 140 111 88 82 88 102 117 126 122 103 73 34 -4 -28 -28 -12 3 19 45 81 106 103 78 58 59 75 90 99 111
8267 111 132 156 166 155 140 137 148 162 171 175 181 191 207 228 247 255 251 233 202 166 145 152 174 185 180 171 169 168 158 148 150 163 172 165 144 124 119 130 139 133 118 111 115 119 108
8247 108 83 55 35 35 63 109 151 173 180 187 193 186 163 135 111 94 80 71 67 62 50 40 42 62 87 99 97 95 105 121 130 123 106 82 53 29 27 53 91 117 126 127 127
8228 127 126 125 128 145 176 212 234 228 197 157 129 117 118 130 154 184 209 223 229 226 208 176 147 136 142 147 144 138 138 140 141 141 144 144 129 103 83 76 64 29 -21 -60 -72 -66
8209 -66 -47 -7 60 141 202 223 209 181 156 142 141 149 153 144 124 106 103 116 137 153 157 149 137 134 147 166 170 156 143 144 148 130 86 35 4 0 12 25 30 28 30 44 69
8191 69 95 120 139 140 120 91 78 79 71 43 6 -15 -18 -10 3 20 37 52 69 86 93 85 66 52 47 45 42 35 32 40 69 110 142 147 133 115 104 99 96 93 87 74 59 53 60
8171 60 80 110 134 133 105 72 53 44 31 17 14 24 38 50 64 70 57 29 6 -8 -30 -62 -74 -43 15 62 83 92 111 135 145 126 81 33 6 9 26 38
8155 38 45 58 83 107 127 150 182 216 238 243 243 242 231 202 160 120 89 63 48 65 118 184 234 263 283 291 269 215 152 102 65 31 5 -3 -4 -16 -36 -37 -9
8138 -9 30 57 60 50 38 36 46 60 61 40 13 4 17 38 57 69 76 73 66 67 82 104 124 139 146 135 98 50 16 3 -1 -9 -12 0 23 48 67 79 84 87 96 117 144
8119 144 166 178 180 172 159 154 167 186 192 180 165 152 135 104 71 55 60 73 78 71 54 28 -4 -35 -47 -31 6 37 43 28 17 22 35 43 39 24 7 -6 -10 0 27
8101 27 70 117 155 170 159 133 106 92 95 113 136 158 177 192 196 190 184 185 192 199 211 229 238 221 189 166 158 148 128 112 111 118 123 122 112 86 52 31 34 38 16 -21 -45
8083 -45 -43 -21 6 36 59 69 70 69 62 41 18 14 41 78 98 91 68 50 45 45 35 9 -18 -30 -24 -6 22 59 96 117 120 112 106 108 123 147 169 182 187 187 185 184 196 222
8064 222 240 225 183 143 122 116 116 122 135 146 148 150 153 155 149 137 123 107 90 73 56 38 21 13 18 29 48 76 102 112 107 104 110 106 87 75 91 121 137 128 107 85
8045 85 61 39 28 30 39 51 63 70 67 61 61 63 56 41 31 29 26 19 10 4 -1 -6 -2 15 41 64 81 89 88 82 74 62 40 21 25 54 82 92 92 104 124 131 120 100 81 55 17
8025 17 -21 -42 -39 -15 19 51 69 67 52 37 36 52 78 93 84 56 32 34 57 83 100 109 117 126 134 141 148 150 146 134 112 82 52 33 29 29 28 25 24 23 21 22 26 28 22 14 14 27
8004 27 43 46 30 0 -25 -31 -16 3 11 6 7 21 35 27 -4 -33 -27 18 77 118 127 117 107 102 99 98 104 122 150 176 181 156 115 88 89 105 114 121 143 179 211 230 242
7986 242 250 246 232 222 221 215 195 171 156 143 117 80 51 37 28 12 -6 -22 -25 -8 27 71 110 134 142 138 129 132 154 184 204 208 200 176 130 68 10 -29 -46 -31 15
7968 15 73 110 113 97 78 54 19 -12 -20 -6 8 20 45 85 111 91 33 -21 -42 -38 -32 -29 -18 2 22 35 44 46 33 9 -6 -2 5 0 -20 -39 -47 -47 -45 -44 -41 -28 1
7949 1 43 73 79 79 96 125 147 157 170 188 195 179 152 123 87 46 15 8 17 29 44 59 64 52 39 40 48 49 48 67 112 167 209 231 237 232 221 208 192 177 168 161 144
7931 144 106 55 14 -1 4 28 64 99 119 117 111 117 140 162 167 148 119 105 122 159 191 202 196 181 164 152 149 155 164 172 176 170 145 104 63 34 14 -4 -22 -31 -36 -44
7912 -44 -62 -83 -100 -112 -127 -142 -144 -115 -54 10 42 34 13 7 22 46 67 78 69 37 -2 -21 -13 7 26 44 68 85 85 73 72 86 103 109 101 84 64 50 46 46 42
7895 42 32 26 28 32 30 28 30 35 42 61 97 134 154 159 162 166 160 141 120 103 88 76 76 95 125 153 165 153 118 77 49 39 34 35 58 100 132 136 121 104 84 54 24
7876 24 8 2 -7 -14 -6 6 6 -2 5 33 65 87 114 150 178 179 157 129 104 86 79 80 77 65 52 50 52 43 25 13 16 24 27 31 42 59 73 77 77 81 98 120 136 139 134 127 123 127
7855 127 144 170 184 174 150 138 154 186 207 197 160 119 99 104 122 136 140 141 144 152 160 163 153 140 142 170 215 251 261 245 218 197 189 191 191 184 180 187 199 201 186 162
7837 162 138 118 99 85 73 59 36 9 -9 -6 15 47 78 105 127 138 136 130 137 156 177 190 196 198 192 177 166 167 176 179 174 169 166 155 130 102 89 97 116 133 141 139 133
7818 133 126 124 134 153 177 196 206 210 215 230 260 300 331 342 342 349 371 394 407 412 419 430 446 472 510 560 614 667 723 788 871 977 1103 1254 1442 1672
7803 1672 1939 2246 2628 3135 3813 4704 5845 7164 8355 8969 8714 7705 6358 5068 4001 3164 2536 2093 1777 1514 1279
7794 1279 1088 949 854 795 767 752 722 672 622 589 578 587 611 640 652 630 573 497 432 403 407 418 417 408 401 394 385 380 380 375 359 348 359 389 420 446 476 504
7777 504 520 527 540 567 606 657 720 790 862 946 1048 1167 1306 1485 1725 2020 2367 2790 3335 4046 4975 6159 7500 8662 9188 8815
7766 8815 7690 6242 4872 3766 2935 2328 1891 1568 1318 1123 983 891 834 793 755 719 688 659 619 564 519 507 522 533 522 491 447
7754 447 399 359 342 347 366 392 423 446 448 434 417 404 396 399 417 436 435 414 392 382 374 364 364 389 441 508 582 653 723 815 945 1099 1249 1396 1571 1798
7739 1798 2075 2417 2862 3440 4171 5107 6293 7612 8696 9099 8629 7488 6097 4809 3774 2990 2396 1937 1577 1304 1111
7729 1111 974 865 768 684 614 558 514 483 466 456 443 418 379 332 289 257 239 234 237 238 233 235 256 286 303 298 285 282 291 306 323 334 326 298 263 241 233 235 245
7713 245 262 277 276 260 245 234 221 201 187 188 201 210 210 208 212 213 203 181 162 151 140 120 93 75 76 96 129 166 192 193 170 142 127 125 123 113 105 108 129 161 193
7695 193 215 225 226 219 208 200 200 204 205 205 206 198 170 133 111 107 104 87 72 80 105 132 160 194 222 223 198 165 140 119 101 92 93 100 107 110 99 72 43 37 58 85 103 113
7676 113 121 118 95 56 21 6 17 40 59 68 81 110 144 156 147 143 158 174 163 129 98 87 89 92 88 79 74 82 99 103 83 53 40 53 75 88 91 96 111 136 161 173
7657 173 165 145 126 111 98 94 108 137 159 161 154 155 165 167 151 125 96 71 47 31 31 48 71 83 78 60 38 23 20 29 39 39 28 12 -5 -30 -56 -65 -43 1 53
7640 53 100 141 170 176 157 128 102 81 61 39 20 5 -4 -2 11 28 35 31 26 23 12 -6 -16 -2 31 58 66 64 61 54 42 34 40 51 53 48 47 53 57 58 68 90 109 110 98
7620 98 84 76 73 78 94 113 133 155 180 196 196 184 171 159 149 142 142 139 129 117 116 124 128 117 87 47 13 5 22 46 58 64 78 101 118 118 106 89 73 70 83 103
7602 103 113 110 101 96 97 102 108 105 83 49 18 -2 -20 -34 -43 -52 -69 -85 -75 -31 17 41 32 8 -15 -36 -50 -51 -36 -7 30 65 90 106 119 130 134 129 121 114 100 80
7584 80 66 68 74 72 62 54 48 37 24 25 41 59 68 65 47 13 -29 -57 -53 -21 15 43 59 72 87 103 115 115 100 77 53 42 46 55 54 39 24 28 48 72 87 91 87
7565 87 73 53 38 35 41 47 51 56 73 99 125 137 131 117 106 100 95 90 87 88 91 94 95 89 76 55 32 12 4 14 36 51 48 29 15 22 48 78 97 106 113 122 123 103 65 27
7545 27 6 6 20 36 49 63 89 124 151 151 135 128 136 143 141 145 167 193 200 191 179 170 157 145 143 148 145 126 99 76 57 39 22 7 -7 -18 -19 -5 15 34 43 42 29
7527 29 13 4 12 34 65 101 137 166 171 145 99 62 51 61 70 70 72 77 76 63 48 46 53 64 80 108 140 160 166 169 169 160 138 116 106 114 136 158 160 136 100 68 45
7508 45 26 24 51 96 132 151 168 189 195 175 144 124 116 115 123 136 136 108 69 43 40 47 59 81 106 118 109 84 54 26 2 -13 -17 -7 12 25 15 -19 -56 -71
7491 -71 -61 -41 -19 7 39 70 96 118 138 148 143 127 108 93 88 91 93 90 86 84 79 69 60 60 70 85 101 114 119 113 106 104 100 92 91 112 151 183 195 188 164 116 52 -7
7472 -7 -44 -56 -43 -6 41 76 84 76 76 92 118 139 149 149 158 185 216 215 167 98 46 27 28 41 67 105 138 153 149 133 108 79 59 56 65 69 65 61 63 65 61 48 35 25
7452 25 17 11 12 24 46 69 81 79 72 73 85 100 106 99 83 69 59 52 42 22 -2 -23 -27 -10 19 56 93 118 123 109 91 78 65 55 58 88 137 186 217 227 218 199
7434 199 184 176 165 140 111 100 118 153 181 188 170 142 127 138 157 162 146 127 112 88 45 -6 -47 -71 -78 -67 -34 9 44 57 54 51 60 82 105 118 116 107 101 97
7417 97 97 106 122 139 150 158 165 165 160 160 163 150 105 39 -24 -78 -123 -155 -162 -145 -117 -93 -73 -56 -43 -29 -6 22 45 58 68 83 100 109 107 100 90 86 94 109 123 131 137
7398 137 137 116 72 32 21 35 40 13 -31 -66 -78 -72 -60 -49 -39 -25 -3 24 43 40 19 0 -3 7 19 24 34 65 111 147 153 139 125 124 129 135 146 164 180 177
7381 177 155 131 120 120 122 117 103 79 40 -9 -50 -56 -23 21 43 34 19 22 43 62 70 76 92 114 127 123 102 75 53 43 46 52 51 40 23 6 -4 -3 11 32 50
7363 50 61 70 81 90 95 99 109 126 149 170 183 185 180 173 162 137 102 79 85 113 136 137 122 110 112 124 133 127 110 100 104 114 117 112 114 132 165 204 236 244 219 171 121 89
7344 89 74 70 76 95 117 133 140 141 137 122 101 91 100 119 131 129 123 125 141 168 191 195 177 149 127 117 115 115 114 110 96 76 62 68 90 110 116 117 125 141 151 150 141 135 133 134 131
7324 131 124 116 108 101 96 104 132 178 217 224 193 148 123 131 157 175 171 155 142 140 148 159 167 162 142 118 105 106 111 106 91 73 61 57 60 63 63 60 59 64 70 76 84 94 100 98 91 80 61
7302 61 35 18 22 43 65 80 94 107 106 89 76 93 136 176 188 174 148 117 81 47 25 14 -1 -29 -54 -58 -38 -13 6 21 34 42 45 61 96 132 142 124
7286 124 100 84 69 44 18 5 7 14 18 19 14 9 11 29 56 74 72 55 35 10 -16 -37 -32 5 57 98 119 137 167 204 231 233 214 184 154 132 119 106 85 56
7269 56 35 33 47 63 65 45 10 -26 -53 -66 -64 -48 -12 39 92 121 114 80 45 27 19 0 -39 -83 -101 -85 -49 -11 19 39 43 32 15 1 -5 -6 0 10 23 41
7251 41 67 93 102 89 71 65 72 78 78 80 94 115 129 129 116 91 56 17 -13 -20 -3 31 71 103 113 93 53 19 11 22 33 41 66 116 176 225 258 277 277 250 197
7234 197 142 114 123 149 160 143 116 110 128 152 167 173 175 171 161 149 130 95 52 23 15 11 -4 -14 7 58 107 137 157 180 204 221 224 209 182 159 149 144 130
7217 130 108 92 82 68 52 50 69 91 102 103 98 80 45 12 2 14 37 62 94 129 150 143 115 89 84 102 123 134 139 149 159 155 137 119 114 113 107 103 106 111 112 112
7198 112 120 134 141 139 128 107 72 31 6 7 31 62 90 108 119 125 130 133 135 145 170 202 220 208 171 132 109 107 121 146 178 208 225 224 213 197 176 147 115 92
7181 92 82 80 81 88 96 94 74 45 22 13 15 27 44 57 60 61 66 77 88 94 96 89 75 63 61 62 52 27 1 -8 0 8 7 -3 -15 -13 6 42 84 119 135 129 113 109 124 144
7161 144 152 145 131 111 79 42 16 9 17 31 47 61 68 68 64 58 37 0 -41 -67 -74 -70 -64 -61 -60 -66 -80 -93 -98 -92 -81 -69 -55 -42 -39 -52 -78 -101 -107 -95 -76 -60 -56 -63 -71
7142 -71 -66 -40 4 54 94 117 127 134 140 138 124 108 104 109 104 81 55 49 64 88 113 138 162 177 178 171 163 153 136 113 90 76 75 83 92 98 108 124 137 131 105 77 68 83
7123 83 107 118 108 87 80 97 126 150 167 187 209 216 194 147 95 49 20 16 36 64 81 86 90 100 111 120 139 174 213 234 229 212 196 177 145 106 84 84 90 86
7105 86 77 80 92 99 95 92 97 103 103 102 109 119 123 119 121 137 162 177 172 155 143 145 147 139 131 139 158 168 160 147 145 150 153 151 152 151 145 140 156 201 258 296 297 266 226 195 172 143 103 61
7084 61 35 29 38 53 65 71 74 87 102 99 68 35 36 76 121 142 143 146 155 160 158 157 165 173 169 151 131 121 121 123 129 144 167 181 172 143 105 68 33 5 -6 -1 14 33 49
7064 49 60 65 71 90 121 153 174 182 179 168 149 130 118 109 102 103 116 132 131 108 83 79 98 122 136 143 151 159 155 137 114 101 106 124 144 159 163 157 141 121 99 74 46
7045 46 25 20 31 43 42 25 1 -14 -11 12 44 69 75 62 43 30 29 38 55 75 88 86 68 44 21 0 -23 -43 -52 -48 -37 -16 28 92 150 178 179 173 173 174 169 162 152
7027 152 138 127 132 150 159 141 110 92 99 121 146 169 181 179 169 160 148 123 83 43 19 15 26 44 58 62 64 78 99 104 90 82 100 132 150 145 130 116 102 88
7009 88 78 74 72 75 83 91 93 93 104 124 139 140 131 113 81 35 -11 -42 -49 -36 -14 -6 -25 -62 -88 -86 -68 -51 -37 -15 14 45 76 110 144 169 181 180 170 159 158 167 177
6991 177 175 166 156 147 138 133 142 155 157 140 114 92 74 54 28 -8 -50 -82 -96 -92 -78 -57 -35 -24 -28 -40 -42 -31 -15 0 17 35 51 64 81 100 106 86 46 3
6973 3 -30 -49 -58 -56 -43 -20 -2 -2 -16 -16 19 77 122 131 119 111 116 126 133 133 123 105 78 43 3 -32 -54 -60 -55 -40 -19 3 22 37 50 63 73 79 82 78 62 42 38
6955 38 57 86 109 113 98 71 48 46 61 74 73 65 61 61 58 54 52 48 39 34 46 77 110 127 122 107 96 95 97 89 69 51 47 57 79 108 134 143 132 113 104 105 108 108 111 125 146
6934 146 162 162 156 163 186 204 196 166 140 130 125 114 101 89 75 68 87 133 177 195 193 184 166 131 91 69 71 87 112 145 174 184 177 167 160 149 139 141 156 169 167
6917 167 155 145 140 144 159 173 169 143 109 83 68 58 51 42 30 23 31 57 88 114 133 140 132 113 105 117 138 146 136 119 112 123 154 187 203 196 181 173 167 147 111 68
6898 68 36 23 29 47 66 82 92 92 83 78 90 116 137 142 138 143 157 164 148 112 73 55 65 87 99 102 116 145 165 155 123 100 93 80 42 -4 -25 -5 33 59
6881 59 63 63 75 93 102 95 83 73 63 55 56 66 74 72 68 75 96 117 128 130 136 157 188 206 187 134 82 63 74 91 98 100 109 131 159 172 153 109 68 59 81 115 142
6862 142 151 137 104 65 34 6 -21 -43 -47 -39 -35 -34 -17 17 45 50 39 28 27 37 66 108 142 146 129 109 97 87 80 91 121 149 148 119 87 74 79 79 62 36 23
6845 23 34 57 67 58 45 47 61 69 63 56 65 82 89 81 70 62 47 19 -2 -1 14 19 10 9 30 63 88 108 139 186 238 277 291 279 241 189 142 117 116 127 132 127 116
6826 116 111 117 129 138 134 124 120 123 123 114 103 99 98 88 67 46 31 19 11 15 36 68 99 125 135 119 82 48 41 64 103 144 183 209 209 182 150 133 139 161 184 196
6808 196 192 181 175 176 177 173 161 140 114 93 91 114 151 184 196 187 169 158 157 156 147 137 134 131 121 108 107 119 132 135 130 123 114 98 79 60 46 37 32 29 29 39 64 96 122
6788 122 139 153 171 186 191 187 177 166 155 146 132 113 94 88 95 107 115 118 119 123 131 143 157 170 186 203 211 194 157 120 106 123 157 186 187 159 127 118 131 149 157 162
6770 162 174 192 215 243 270 283 274 249 213 171 129 101 92 96 105 107 96 74 61 74 104 121 119 117 124 120 86 34 -10 -37 -44 -23 25 80 107 100 80 63 50 38
6753 38 31 28 28 31 41 56 69 80 97 119 131 127 115 104 86 59 37 46 91 145 166 139 90 51 26 1 -22 -19 27 89 127 128 114 104 99 97 101 109 112 111 121 146
6735 146 170 174 163 156 164 176 173 150 128 123 129 119 83 41 26 40 59 58 39 17 9 18 34 48 59 72 88 102 117 153 217 285 323 317 282 239 202 179 168 158
6717 158 140 116 99 92 91 103 131 165 181 170 142 114 86 60 43 41 51 65 73 68 53 51 80 131 173 192 198 196 176 141 115 117 133 141 136 131 124 98 50 2 -15
6699 -15 4 44 69 62 38 24 27 34 35 38 42 38 28 32 59 87 86 58 22 -16 -60 -93 -93 -67 -41 -23 3 50 102 138 150 138 109 76 61 73 98 119 126 123 112
6682 112 92 71 58 56 62 73 89 106 119 126 133 146 165 179 177 160 141 127 119 118 131 153 165 157 147 159 188 202 185 154 138 137 134 120 106 100 99 97 97 104 117 129
6663 129 129 124 123 126 124 109 83 56 42 51 86 131 159 159 147 150 175 199 201 176 128 66 3 -46 -74 -78 -62 -34 -5 13 22 32 49 71 89 99 102 102 105 108 109 100 83
6645 83 60 39 25 24 31 35 32 29 32 42 55 70 86 92 92 98 114 117 86 39 16 32 63 76 70 60 53 45 33 14 -9 -32 -40 -29 -11 -2 -4 -5 0 11 13 -1 -30 -54 -61
6625 -61 -61 -71 -89 -94 -72 -34 3 40 80 113 127 115 88 56 29 16 15 14 0 -20 -26 -4 40 86 117 126 117 96 75 65 69 77 77 69 63 67 75 81 95 127 163 181 182
6607 182 188 202 196 152 96 67 78 112 153 193 218 209 166 118 97 103 114 111 98 91 101 120 129 116 80 34 -6 -34 -47 -49 -51 -54 -45 -14 31 74 96 97 82 60 39
6589 39 24 17 20 31 42 47 48 51 52 40 13 -9 -10 10 35 57 85 123 161 185 186 163 124 84 62 66 87 111 126 127 121 121 130 139 131 105 81 72 77 84 93 105 120 125 118 102
6569 102 92 93 106 125 151 187 227 254 255 238 223 213 190 139 71 18 -1 3 11 11 7 5 2 0 8 31 60 75 70 55 42 31 22 16 15 11 0 -12 -17 -11 1 21 44
6550 44 67 94 129 164 166 120 51 -1 -26 -40 -53 -51 -28 0 23 49 81 103 96 69 50 55 77 106 130 142 137 122 114 120 133 137 126 104 86 81 81 73 53 36 30
6533 30 30 28 30 42 59 71 75 78 84 87 89 93 101 107 112 124 150 184 211 224 224 214 203 191 182 172 158 134 101 67 41 25 14 2 -9 -14 -10 0 14 25 30 28 21 14 8 6
6513 6 18 49 88 113 111 91 73 68 73 77 77 73 59 25 -20 -45 -31 0 7 -18 -39 -23 20 65 104 142 165 154 118 91 94 109 118 122 127 128 118 105 97 88 67 44 34
6494 34 40 45 39 30 27 34 47 63 78 86 88 97 120 156 198 235 257 260 250 243 242 238 222 198 182 180 182 183 184 184 179 160 136 114 92 63 30 11 12 22 24 14 4 5 14 23 31 46
6473 46 70 97 116 122 120 126 147 178 205 217 209 185 158 137 126 116 101 90 91 102 108 104 99 104 111 104 77 41 14 5 12 24 32 38 48 68 95 128 163 196 216 214 195
6455 195 174 158 140 115 97 99 118 133 135 131 135 146 158 169 187 206 215 206 184 160 138 122 112 109 113 122 136 153 165 165 154 142 143 158 172 168 143 117 105 103 95 78
6436 78 66 63 60 57 69 108 156 184 187 175 151 103 31 -41 -89 -109 -112 -107 -99 -87 -63 -22 29 73 90 78 47 9 -25 -50 -58 -45 -16 19 49 70 88 109 120
6419 120 112 91 79 84 94 100 108 122 128 116 93 76 69 65 60 57 55 55 63 86 115 134 143 149 149 125 78 35 22 31 35 24 9 2 4 12 24 34 38 36 27 10 -9 -17 -2 29 57
6399 57 68 70 72 73 65 53 47 48 49 45 41 46 60 76 85 85 80 75 80 97 120 136 129 105 82 81 100 122 139 159 194 234 258 256 235 210 188 174 168 164 146 113 81 65 61 58
6379 58 56 64 76 80 78 82 89 81 51 18 5 12 23 23 12 -6 -22 -22 -1 31 52 51 36 23 24 41 63 77 73 62 60 72 87 88 67 29 -11 -39 -38 -13 16 34 45
6360 45 62 97 142 177 187 183 183 201 226 242 239 217 180 140 110 101 111 131 149 157 153 138 123 112 103 90 72 49 19 -10 -22 -3 38 76 96 109 130 156 169
6344 169 160 137 117 108 107 102 86 69 63 77 105 133 148 146 128 102 73 46 26 17 14 9 2 2 12 26 32 35 42 51 51 44 42 50 63 74 85 92 87 77 85 119 159 180 177 157
6324 157 122 71 19 -5 4 24 30 19 8 4 0 -7 -15 -13 -4 5 11 16 23 26 17 0 -11 -4 13 30 47 74 107 127 127 125 138 161 177 174 153 118 72 26 -8 -28 -34 -28 -14
6304 -14 -3 -1 -4 -1 10 20 22 27 47 80 104 109 101 97 100 99 82 50 21 16 36 59 68 62 56 54 47 23 -16 -56 -80 -78 -59 -44 -44 -44 -25 11 49 73 89 104 116 125 140
6285 140 163 174 153 108 68 47 35 24 20 34 58 69 56 25 -6 -23 -21 -8 0 1 0 1 6 10 9 2 -3 -1 12 25 30 32 46 67 80 77 76 89 110 124 124 115 101 83
6266 83 65 50 29 4 -13 -10 5 18 29 55 93 125 137 140 151 170 182 182 174 161 141 115 96 93 112 143 174 192 194 184 173 162 148 126 103 92 101 117 120
6249 120 100 70 46 35 36 50 74 90 83 60 49 67 104 137 157 170 180 181 166 147 147 174 213 245 264 283 308 326 320 287 243 204 175 152 135 122 114 107
6232 107 98 83 69 67 76 81 72 56 50 54 57 52 47 45 44 46 56 67 61 39 18 17 26 26 13 0 -4 0 12 31 49 63 78 103 127 131 110 83 73 87 115 145 166 173 161
6213 161 141 129 137 161 183 190 179 159 137 114 89 66 45 23 9 16 50 99 145 184 221 248 253 233 201 170 149 140 141 145 142 139 146 162 171 168 159 152 143 134 139 168 217
6194 217 281 372 492 604 654 626 563 510 473 430 369 307 260 230 205 182 166 166 182 202 212 208 201 197 191 172 147 139 156 182 195 189 173 156 139 125 121 123
6178 123 111 73 18 -29 -52 -43 -7 44 91 113 110 101 103 116 125 125 122 122 123 115 102 93 93 94 86 73 69 80 98 111 116 124 145 179 207 209 182 148 133 140 147 135 108 81 61
6158 61 44 30 23 26 38 55 75 96 115 128 129 114 89 69 69 90 123 154 172 170 153 136 134 151 181 209 220 201 161 119 91 71 45 13 -13 -18 5 56 116
6141 116 157 170 171 177 180 164 134 112 100 83 56 28 13 9 15 31 49 60 67 77 85 78 63 67 99 136 157 166 172 173 163 154 162 181 196 205 217 227 220 191 154 130 133
6122 133 155 178 183 182 197 230 256 261 258 257 245 216 189 180 174 150 118 101 96 85 68 60 62 67 81 111 141 149 145 158 192 221 228 221 210 192 170 155 144 128 114 123 157
6104 157 191 211 217 207 177 146 140 160 183 202 225 246 245 229 227 242 251 247 253 277 295 297 301 310 306 288 290 321 355 378 412 459 486 482 479 496 517 534 577 659 746 826
6086 826 924 1040 1138 1234 1413 1705 2061 2477 3053 3823 4669 5497 6401 7555 9141 11487 14933 19114 22480 23168 20640 16234
6076 16234 11913 8716 6541 4988 3900 3196 2690 2245 1890 1650 1447 1222 1030 920 841 746 666 635 618 577 534 513 486 434
6066 434 388 371 359 327 294 275 248 202 173 175 174 148 132 156 190 199 201 222 240 227 205 214 244 258 258 268 279 264 228 204 202 207 214 224 225 202 170 157 165 178
6048 178 189 202 204 187 164 157 161 160 163 179 189 166 123 101 114 138 155 173 192 193 172 153 157 172 177 168 152 139 134 135 136 135 141 157 165 144 96 42 0 -21 -11 28
6030 28 66 70 55 59 88 107 87 43 7 -4 4 32 70 104 127 142 150 149 146 152 156 136 96 73 88 121 143 149 151 154 156 164 182 206 227 241 250 257 262 264 258 233 189 144
6011 144 117 113 128 153 174 179 169 163 178 213 251 271 258 217 174 153 149 140 117 95 86 86 85 81 71 51 35 40 54 44 -1 -48 -60 -44 -25 -9 13 37 47 51
5994 51 75 121 165 182 174 157 140 120 95 64 31 9 0 -4 -1 16 53 87 100 102 113 134 143 135 120 112 106 96 82 70 56 36 16 1 0 11 29 46 57 65 70
5976 70 66 48 22 0 -8 -5 11 30 38 33 35 57 87 105 111 126 150 162 149 124 103 93 91 92 92 82 63 44 31 17 7 15 54 107 144 150 135 117 107 106 115 129
5958 129 139 135 121 110 111 116 110 96 90 98 109 111 115 133 155 156 131 104 90 78 55 23 -3 -18 -20 -7 17 37 34 18 15 42 89 131 153 155 147 135 129 130 133 134 132 137 153
5938 153 170 182 188 198 214 229 231 216 180 129 83 60 60 64 58 49 46 46 46 55 80 110 126 131 144 173 195 192 164 127 98 91 103 117 122 124 139 162 172 160 147 150 163
5920 163 167 155 137 126 128 138 144 132 103 75 63 64 65 65 72 91 115 132 137 133 126 117 94 58 28 23 38 47 35 18 12 18 25 34 48 59 56 39 21 15 21 31 34 31 35 57
5900 57 94 123 129 125 133 159 186 193 176 151 136 135 136 126 108 93 76 47 11 -1 23 65 89 88 79 78 80 79 83 103 142 179 190 168 133 110 103 93 77 76 100 135
5881 135 152 150 144 147 155 169 194 221 230 211 179 160 167 194 225 241 241 238 238 235 220 202 195 195 183 155 127 116 117 115 102 81 54 28 10 5 13 20 17 8 8 29 65 102 134
5862 134 163 183 181 151 105 63 34 21 25 44 61 64 55 49 57 76 93 103 110 120 132 134 115 87 76 89 106 110 106 106 100 78 52 54 87 126 143 138 125 114 108 106 98
5843 98 78 53 36 30 28 28 40 66 88 98 104 117 135 143 133 113 99 101 115 126 126 117 109 102 88 69 56 66 98 140 170 176 166 163 175 182 163 122 92 88 97 92 62
5825 62 14 -39 -88 -125 -149 -154 -132 -79 -11 50 98 137 161 162 145 138 158 190 210 214 210 198 170 132 104 98 109 127 143 155 163 167 159 128 76 23 -6 -2 24 54
5807 54 69 67 56 46 36 31 37 56 73 73 61 53 63 85 114 149 181 199 202 200 197 182 159 140 132 122 104 90 97 117 135 150 166 175 164 134 106 94 97 115 146
5790 146 182 207 206 184 156 138 130 126 119 112 111 113 108 104 114 138 151 136 105 84 82 89 93 92 88 83 83 91 100 104 109 122 136 140 134 131 134 140 150 170 198 221 230 218 180 120 61 26
5769 26 13 2 -12 -17 -1 26 51 72 89 96 86 61 37 23 23 32 44 55 64 79 105 139 167 180 176 166 156 143 121 98 87 86 87 88 95 105 106 98 97 114 132 137
5751 137 134 140 153 160 159 161 174 190 202 204 191 169 151 152 164 171 168 167 170 165 141 104 62 21 -13 -34 -41 -35 -23 -5 14 37 66 96 116 123 125 128 122 107 99 115 142 151 140
5731 140 132 143 163 177 178 172 161 147 136 128 123 122 121 107 76 42 27 35 52 73 101 131 147 141 119 97 93 115 150 171 164 153 166 187 179 134 87 70 74 80 88 104
5713 104 119 124 124 128 136 140 134 121 105 93 87 78 61 55 77 113 126 108 92 101 116 106 79 63 70 90 117 152 193 226 242 242 227 206 186 167 146 128 127 146 165
5695 165 170 160 142 120 104 109 140 177 199 196 172 132 96 90 120 157 174 172 168 165 155 138 121 103 79 55 30 0 -36 -52 -34 1 27 39 48 60 73 84 87
5678 87 69 26 -15 -23 6 48 81 101 110 116 127 139 128 85 32 4 12 38 60 70 69 68 85 124 167 196 216 240 262 269 260 245 225 201 181 168 149 119 96
5661 96 101 127 147 159 177 201 214 208 195 179 159 136 117 107 101 105 118 132 137 141 149 147 125 98 87 86 78 66 68 82 96 111 133 155 164 170 191 215 214 186 159 150 156
5643 156 172 200 227 233 217 196 168 124 72 38 33 47 76 118 147 136 99 78 81 86 86 101 129 139 119 97 96 107 113 125 155 185 196 186 158 110 57 27
5626 27 31 52 68 83 100 112 119 129 136 125 101 93 106 113 95 71 57 44 23 15 35 72 107 133 148 148 143 154 175 175 146 117 112 125 143 164 174 156 120 102
5609 102 114 130 136 151 181 196 180 159 147 121 73 35 38 61 81 107 152 193 205 201 201 197 185 184 204 215 195 169 170 189 205 221 241 247 231 218 224 223 195 167
5591 167 165 171 167 166 175 165 125 98 119 157 175 189 221 238 205 154 132 125 104 84 98 127 136 139 161 181 179 188 238 292 309 313 333 340 312 296 334 379 374 357 383
5574 383 409 379 335 340 358 337 326 393 482 507 515 595 697 722 707 755 837 869 902 1020 1139 1140 1125 1265 1487 1618 1746 2079 2534 2908 3383
5560 3383 4329 5680 7244 9613 13706 18828 22156 21270 16835 11855 8499 6608 5150 3881 3092 2682 2277 1848 1609
5552 1609 1522 1376 1188 1122 1146 1088 953 883 873 807 705 685 731 725 662 639 658 630 556 518 523 497 439 418 439 435 397 386 413 428 428 454 496 500 467
5537 467 441 424 379 322 309 332 333 299 273 263 238 198 179 178 165 153 184 242 271 268 284 317 312 262 223 221 217 189 162 152 137 116 122 155 172 152 129 125 131
5520 131 139 162 183 168 121 90 90 88 74 80 116 144 146 155 188 212 207 200 218 237 234 232 249 261 243 219 229 263 283 274 254 237 228 227 225 208 184 177 192 201 194 193 212 234
5501 234 241 240 240 225 191 159 146 132 91 37 4 3 29 71 116 147 161 170 176 163 125 81 48 21 -3 -15 -4 17 37 54 69 70 55 37 31 31 27 19 10 0 -2
5483 -2 15 43 49 30 18 32 55 68 74 82 80 64 53 65 83 88 87 95 108 113 120 139 163 181 199 218 220 193 156 137 132 125 114 109 109 113 138 187 230 243 240 244 245 225 196
5464 196 184 184 170 145 136 145 144 123 102 93 85 69 51 34 15 -3 -12 -14 -19 -19 3 45 85 113 133 147 144 129 114 102 82 59 50 55 59 61 75 106 136 154 169 187
5445 187 195 184 155 120 94 94 125 165 178 162 147 154 169 173 162 139 105 69 48 45 46 48 62 94 125 139 134 118 97 85 103 143 176 179 162 149 143 140 143 153 160
5428 160 156 149 149 156 169 191 216 229 219 197 178 163 152 146 146 145 142 143 148 150 154 175 213 240 233 199 160 128 102 87 86 89 88 91 106 124 129 121 111 104 90 67 40 10 -15
5408 -15 -29 -22 -8 -6 -19 -30 -21 9 49 84 101 103 104 120 141 156 169 195 235 268 280 278 275 274 269 257 240 220 193 156 112 76 65 80 108 129 143 155 165 166
5391 166 161 159 158 147 122 98 95 118 152 176 187 192 199 201 180 140 110 115 152 190 202 189 166 150 148 153 153 147 146 157 168 164 140 112 91 81 88 118 161 193 192 166 136
5372 136 119 114 114 117 128 144 152 141 117 105 115 139 161 174 172 147 109 83 84 94 92 85 97 129 149 136 103 79 75 88 111 136 153 159 159 154 150 159 187 224 241 227
5354 227 198 172 153 131 110 96 87 74 63 62 72 83 92 107 130 155 170 173 170 164 157 145 132 120 117 123 129 125 110 95 91 105 131 157 172 172 166 162 162 161 159 164 180 203
5335 203 225 244 259 265 248 206 159 130 119 114 114 134 175 210 222 217 211 199 170 132 105 94 80 51 19 1 3 19 38 56 74 102 142 174 176 150 117 89
5318 89 57 19 -8 -17 -19 -24 -23 -2 32 62 84 100 105 100 98 114 136 145 138 132 128 114 86 61 52 43 24 6 12 43 78 97 95 81 63 44 29 31 62 115 164 181 166
5300 166 142 127 119 109 98 94 97 96 81 45 -5 -50 -64 -39 0 21 18 10 11 14 3 -22 -44 -39 -3 45 85 109 121 128 131 131 135 148 157 152 132 112 100 88 71 57
5282 57 59 75 85 74 51 38 45 66 85 99 111 120 119 105 87 76 75 78 82 95 119 143 156 162 171 185 196 203 216 236 249 242 215 181 152 138 145 165 183 183 170 155
5263 155 146 137 129 128 142 172 209 240 251 240 221 208 200 185 161 131 99 68 45 45 69 104 132 148 157 164 172 174 166 147 136 145 173 199 214 219 212 177 109 34 -10 -12
5245 -12 9 28 26 0 -31 -50 -44 -22 2 23 43 57 51 30 12 15 35 54 61 56 43 24 7 4 29 75 118 136 125 102 84 79 86 105 131 155 168 168 153 127
5228 127 101 97 116 135 132 114 108 116 121 112 103 108 127 150 171 186 189 180 167 162 160 152 136 118 103 93 93 112 151 193 212 198 165 134 108 81 61 64 94 126 137 133 132
5209 132 136 131 115 101 97 101 113 140 175 197 194 176 160 144 118 82 47 22 12 19 33 39 36 37 58 90 113 119 117 118 124 126 117 94 67 48 41 40 38 28 11 -6 -5 26
5190 26 73 98 90 73 75 89 90 78 70 68 61 55 72 117 160 167 143 121 124 147 175 202 227 245 243 209 153 105 86 93 107 114 113 111 107 101 97 97 100 101 100 94 87 82 77 64 43 25
5169 25 19 20 16 0 -28 -59 -80 -81 -59 -30 -8 10 37 68 92 109 127 140 131 105 90 106 136 160 173 184 189 176 148 121 106 100 96 90 75 53 34 34 58 91
5152 91 116 125 120 107 93 86 91 103 106 88 52 18 -1 -11 -20 -25 -15 10 37 54 63 73 86 100 117 131 135 127 116 114 117 110 89 61 44 55 99 156 195 204 197 193 189 178
5133 178 164 158 160 154 130 100 82 80 88 96 98 99 102 110 120 133 153 180 200 194 165 131 105 85 74 73 79 79 68 62 75 95 97 71 35 12 4 3 9 30 73 129 181 208
5114 208 196 148 88 44 28 34 47 62 68 55 24 2 10 37 55 61 68 78 70 36 0 -8 9 34 51 58 60 67 86 116 143 162 175 184 184 175 165 153 134 124 148
5096 148 204 244 237 206 190 188 179 165 169 183 178 150 124 114 105 92 89 100 104 94 94 117 142 141 116 89 72 66 71 83 92 96 109 143 192 243 285 303 289 264 258 270
5078 270 270 244 216 207 205 196 193 200 199 177 155 158 173 170 150 135 131 124 114 108 108 110 124 160 201 218 208 189 174 163 153 150 160 195 264 353 421 434 410 389 385 385 374
5059 374 352 330 316 319 331 329 305 281 278 287 290 294 310 324 321 315 328 352 357 343 325 309 291 285 303 329 348 379 442 514 559 589 636 692 721 730 754 796 841 909
5042 909 1035 1196 1349 1499 1680 1885 2102 2391 2818 3350 3955 4759 5934 7489 9422 11992 15404 18996 21186 20701 17832
5033 17832 14140 10987 8670 6876 5432 4381 3655 3081 2596 2247 2012 1797 1586 1429 1323 1205 1070 968 905 832 736 652
5023 652 596 549 515 519 544 541 505 474 464 453 431 420 421 414 398 394 403 400 379 366 378 400 413 415 402 378 358 366 391 408 409 408 404 387 364 356 357 342 309 286 279 264
5005 264 233 207 198 186 152 115 97 101 116 139 169 193 202 201 198 190 179 175 176 168 141 111 95 98 119 152 181 187 174 173 193 210 203 184 179 185 186 183 183 176 147 108 89 102
4986 102 127 137 128 107 80 45 4 -28 -41 -27 1 28 51 84 132 177 200 198 188 182 178 175 171 161 134 94 57 41 45 55 58 50 43 48 63 78 83 77 72 73 74 68 59 66
4967 66 97 127 122 82 49 59 100 138 161 180 200 211 214 219 228 231 227 224 223 202 152 84 19 -26 -44 -27 13 56 85 101 103 91 74 71 85 95 83 53 15 -26
4949 -26 -64 -79 -66 -48 -44 -41 -19 11 30 35 47 69 84 80 61 45 44 60 83 94 93 102 129 152 149 131 130 142 142 120 94 81 75 74 87 113 132 139 148 167 180 177 173
4931 173 184 200 204 203 218 252 278 278 259 245 244 251 255 251 242 228 204 167 130 105 96 89 80 78 90 110 125 135 149 166 176 169 146 119 98 84 70 59 61 80 106 129
4913 129 151 172 177 159 127 106 97 83 53 11 -30 -61 -68 -43 -4 22 29 32 47 66 74 68 52 30 12 13 37 71 95 106 105 92 67 46 40 47 51 45 35 35 59 108
4894 108 159 181 168 141 126 122 124 133 149 153 136 117 120 143 154 139 110 84 60 36 21 30 62 98 120 117 97 79 78 94 116 136 154 163 158 140 123 119 125 128 119 101
4876 101 82 74 84 104 119 123 120 119 119 117 110 97 82 69 64 66 69 69 68 69 72 69 54 26 -4 -30 -50 -74 -95 -99 -79 -55 -43 -42 -36 -21 -8 0 11 31 47 48 37 28 30 38
4856 38 40 27 4 -13 -20 -25 -35 -40 -23 12 44 52 38 19 8 12 34 63 85 93 97 101 101 92 74 55 40 34 45 69 95 111 117 116 110 105 100 93 75 52 44 62 92 106 95
4837 95 71 52 45 48 58 74 92 107 115 114 105 89 69 51 44 50 70 98 136 176 207 217 210 199 193 183 163 137 118 113 121 129 122 96 63 43 43 51 58 70 91 106 97 66
4818 66 32 20 33 62 90 107 113 119 129 142 149 145 132 113 100 106 137 176 204 208 188 150 107 85 99 132 153 151 144 148 156 150 130 110 103 113 139 166 177 164 140
4800 140 126 122 118 105 91 90 103 122 130 123 113 110 117 127 138 154 177 201 218 225 224 216 204 191 178 163 146 125 107 101 114 142 162 159 136 116 117 132 141 134 113 94
4782 94 91 107 131 151 164 178 195 204 202 199 205 207 194 174 173 198 228 233 202 146 93 65 63 71 77 84 104 131 145 142 143 164 195 214 213 194 158 112 73 62 79 104 119
4763 119 122 117 103 82 62 49 38 30 30 44 61 68 64 58 61 74 96 122 151 175 182 168 135 101 80 73 68 57 54 74 116 164 204 235 255 262 258 252 250 244 226 195 164
4744 164 143 124 100 76 66 74 87 88 76 66 65 64 55 39 28 24 29 46 77 112 135 138 127 111 97 95 108 128 140 143 145 145 133 114 111 130 151 149 130 112 100 86
4726 86 74 80 106 130 137 137 148 171 190 195 190 182 173 160 143 128 124 138 165 186 190 187 194 211 218 205 181 165 160 156 140 113 83 62 62 83 110 124 121 115 109 102 92 90 99 104
4706 104 90 64 50 59 80 97 108 112 107 90 59 16 -25 -43 -23 17 47 60 77 111 142 154 159 182 216 234 226 203 177 149 127 122 136 156 172 185 198 211
4690 211 224 241 253 248 226 202 185 173 163 160 167 177 184 189 190 182 169 169 181 182 158 125 104 83 40 -12 -35 -13 28 51 51 42 32 16 -1 -4 16 50 75 88 95
4672 95 97 85 54 16 -9 -19 -19 -10 10 32 32 2 -37 -66 -81 -90 -86 -62 -25 1 5 -6 -22 -31 -24 10 71 132 167 174 168 155 128 86 43 17 15 30 54 89 129
4654 129 155 147 108 73 69 95 117 109 67 11 -35 -55 -47 -16 23 57 75 74 61 50 47 51 53 49 40 31 28 36 51 69 85 98 101 87 59 34 26 34 40 35 23 18 28 49
4635 49 69 78 82 93 114 131 133 129 135 147 142 109 67 43 45 59 72 76 72 64 62 71 93 121 148 167 171 151 111 66 30 9 0 -2 -3 0 9 28 49 66 78 85 91 95 96 94 98
4615 98 122 167 211 230 220 199 185 181 175 158 135 115 105 101 92 75 54 38 34 50 91 154 213 241 233 205 175 147 123 111 121 147 171 179 171 155 137 122 111
4598 111 104 104 108 111 107 91 66 34 -1 -32 -48 -42 -19 3 14 15 21 44 83 119 135 133 126 118 101 73 50 48 59 67 65 60 53 42 31 32 46 58 62 62 62 54 33 10 -1
4578 -1 -6 -22 -46 -57 -42 -18 -14 -31 -49 -46 -29 -14 -7 1 19 42 65 92 129 166 190 194 183 165 140 108 77 55 45 43 49 65 90 112 122 120 118 118 113 99 82 71
4560 71 69 74 93 128 162 167 135 92 65 64 77 92 98 93 86 92 112 124 106 63 23 1 -2 7 31 56 59 38 16 8 8 6 7 19 32 28 14 6 9 3 -23 -49 -50 -21 15
4541 15 40 47 42 37 37 39 33 11 -16 -36 -41 -37 -29 -15 5 23 30 26 21 19 18 17 16 11 0 -10 0 35 76 103 110 110 115 125 141 158 170 173 169 162 151 136 129 141 163 170 154 121
4520 121 87 55 27 12 17 40 74 113 149 172 177 169 153 130 103 73 42 8 -18 -23 0 37 63 73 72 69 65 65 75 94 117 145 174 193 190 172 161 163 162 144
4503 144 111 77 48 27 20 34 64 98 124 132 119 92 67 51 38 21 8 9 27 50 74 103 132 147 146 145 159 178 178 156 137 139 152 154 136 104 63 18 -16
4486 -16 -21 1 30 46 57 84 129 177 210 215 192 153 121 108 107 102 92 88 91 90 82 84 105 134 148 139 122 109 103 104 112 127 146 165 179 183 176 165 151 128 92 56 36
4467 36 33 35 38 53 83 105 97 61 23 0 -2 10 33 52 50 27 5 9 38 67 78 74 69 68 66 56 40 23 6 -6 -14 -14 -9 -3 5 19 37 52 58 57 53 48 38 24 15 13
4447 13 12 10 11 18 20 2 -30 -51 -41 -5 37 77 109 126 125 121 128 143 149 139 135 149 171 176 159 138 123 113 107 118 154 203 236 235 204 164 128 106 103 122 157 195
4429 195 219 229 230 230 228 221 206 183 156 138 136 146 155 159 163 168 164 144 119 109 121 140 148 139 115 88 72 78 96 106 92 58 16 -20 -44 -54 -55 -53 -51 -38 -10 27 56
4410 56 67 61 47 33 25 22 14 -2 -17 -12 12 36 43 44 55 77 95 107 130 175 228 263 267 253 238 232 237 242 237 217 193 177 172 169 160 149 141 133 117 91 66 53 48 41 26
4391 26 13 15 35 58 63 48 24 12 16 20 6 -21 -44 -43 -21 0 8 7 2 -8 -18 -13 18 63 93 95 79 68 73 96 133 171 189 178 152 138 142 150 145 128 110 98
4372 98 92 85 77 67 55 37 16 -4 -22 -35 -36 -12 36 89 116 108 88 83 99 117 110 75 26 -12 -26 -23 -19 -25 -31 -19 10 41 54 53 54 64 81 99 121 150 173 174
4354 174 150 121 113 129 154 167 161 143 119 93 69 54 50 55 62 72 87 104 120 134 146 152 146 127 98 71 54 50 59 69 63 35 -4 -38 -52 -44 -23 -3 1 -10 -21
4337 -21 -12 13 29 17 -16 -49 -69 -72 -59 -35 -11 3 12 27 45 48 28 -3 -30 -40 -30 -5 22 36 36 40 64 95 101 75 42 33 52 78 89 84 74 73 87 110
4319 110 129 128 109 86 76 78 78 61 34 14 3 -3 -11 -8 11 35 45 39 32 38 58 76 74 46 4 -28 -37 -27 -9 14 45 78 98 100 98 109 136 171 199 210 200
4301 200 171 137 110 91 73 54 40 39 52 71 88 100 112 123 121 100 71 60 74 94 93 72 51 45 49 53 56 61 60 50 38 34 30 9 -31 -71 -88 -85 -81 -84 -79 -49
4283 -49 3 54 82 84 69 46 27 26 54 102 146 163 151 127 103 79 55 36 26 28 37 47 50 37 16 10 40 96 148 171 168 147 109 56 5 -24 -26 -9 13
4266 13 36 57 77 93 99 88 59 28 13 14 26 47 82 125 160 177 183 184 176 154 122 96 93 113 145 166 164 140 109 83 62 46 36 29 24 22 30 47 61 63 51
4249 51 31 13 8 17 28 26 8 -13 -27 -27 -16 2 18 24 29 45 68 74 49 9 -27 -60 -86 -88 -57 -14 15 33 60 97 124 135 149 171 182 163 130 116 125 141
4231 141 148 147 140 123 95 67 54 62 80 96 103 100 90 81 81 93 111 124 124 118 112 105 93 73 44 13 -12 -23 -19 -6 12 36 60 74 76 75 83 91 85 69 66 85 105 98 60
4212 60 17 -2 10 42 68 75 64 47 34 29 29 30 30 27 25 29 41 62 89 114 127 126 116 104 92 83 83 95 109 114 114 114 113 110 115 139 172 186 169 138 112 92 68 42
4193 42 27 32 56 83 97 99 104 129 174 224 270 308 329 320 287 253 231 217 207 202 207 217 230 254 287 317 335 342 339 320 288 266 261 257 239 216 212 225 238 241 242 246
4174 246 248 246 235 217 211 242 311 385 446 519 630 744 786 731 631 552 505 463 407 341 276 226 201 200 208 210 208 204 198 195 204 221 222 194 149 107 77 57 51 61
4157 61 79 90 90 84 75 68 72 83 79 45 -3 -31 -26 -10 -3 0 12 30 35 16 -13 -36 -47 -59 -78 -99 -110 -103 -83 -58 -39 -39 -69 -117 -150 -142 -103 -59 -28 -3 26 58
4139 58 82 88 78 63 51 47 48 54 66 81 93 97 91 72 43 16 4 2 -7 -32 -52 -46 -19 1 7 9 17 22 19 12 8 7 0 -16 -36 -45 -31 4 44 67 72 73 83 104 126 145
4119 145 157 161 162 161 157 140 108 71 44 27 16 7 6 15 24 21 4 -12 -15 -4 13 34 63 97 121 122 101 79 68 72 87 106 116 106 82 58 46 40 32 25 23 22 16 11
4100 11 21 50 82 95 88 87 115 168 218 236 225 201 180 164 155 151 150 149 151 159 170 173 162 140 113 87 66 49 30 5 -13 -12 12 50 87 116 129 116 79 37
4082 37 15 23 55 90 110 111 103 98 99 100 97 92 80 60 39 30 35 46 59 81 116 153 177 180 156 113 74 73 115 169 195 191 179 173 162 136 102 80 81 100 129 161 196
$$ [...]
-3135I5
##END=	
##END=	
