##TITLE=	Jul23-2022.20.fid
TM-VI-153, PMB-pyr, CD3OD

##JCAMP-DX=	6.0	$$ MestReNova 14.3.1-31739
##DATA TYPE=	LINK
##BLOCK_ID=	1
##BLOCKS=	2    
##ORIGIN=	Mestrelab Research S.L.
##OWNER=	hrzepa
##$MNOVA/LINK_BLOCK_TYPE=	ITEM	$$ NMR Spectrum
##$MNOVA/ITEM/POLYGON=	(XY..XY)
5321,5835
8722,5835
8722,8208
5321,8208
5321,5835
##$MNOVA/ITEM/Z=	0
##$MNOVA/ITEM/ANGLE=	0
##TITLE=	Jul23-2022.20.fid
##JCAMP-DX=	6.0	$$ MestReNova 14.3.1-31739
##BLOCK_ID=	2
##DATA TYPE=	MNOVA NMR VIEW DATA
##DATA CLASS=	MNOVA VIEW DATA
##$MNOVA/ITEM/ZOOM/X=	-4.005464102252559222,	16.005770000004368114
##$MNOVA/ITEM/ZOOM/Y=	-2158.1860966682434082,	23689.70751953125
##END=	
##TITLE=	Jul23-2022.20.fid
##JCAMP-DX=	6.0	$$ MestReNova 14.3.1-31739
##BLOCK_ID=	3
##DATA TYPE=	NMR SPECTRUM
##DATA CLASS=	XYDATA
##NUMDIM=	1
##ORIGIN=	Bruker BioSpin GmbH
##OWNER=	nmr
##.OBSERVE FREQUENCY=	400.4124024600000098
##.OBSERVE NUCLEUS=	^1H
##.SOLVENT NAME=	MeOD
##.PULSE SEQUENCE=	zg30
##LONGDATE=	2022/07/23 16:03:00.000
##.ACQUISITIONMODE=	SIMULTANEOUS (DQD)
##$ORIGINAL FORMAT=	Bruker XWIN-NMR
##$MNOVA/SCALES_VERSION=	9
##$PARAMETER FILE=	(acqus, ASCII, /private/var/folders/f6/rjf_tdyn2v98c5c0wvkgn4s80000gn/T/gSejTmf7QmqOBspwX2Xobw/20/acqus, 0)
$$ ##TITLE= Parameter file, TOPSPIN		Version 3.2
$$ ##JCAMPDX= 5.0
$$ ##DATATYPE= Parameter Values
$$ ##NPOINTS= 11	$$ modification sequence number
$$ ##ORIGIN= Bruker BioSpin GmbH
$$ ##OWNER= nmr
$$ $$ 2022-07-23 16:03:41.355 +0100  nmr@CZC10666PP
$$ $$ /opt/topspin/data/agmb/nmr/Jul23-2022/20/acqus
$$ $$ process /opt/topspin3.2/prog/mod/shimcntl
$$ ##$ACQT0= -2.36344537815126
$$ ##$AMP= (0..31)
$$ 100 100 100 100 100 100 100 100 100 100 100 100 100 100 100 100 100 100
$$ 100 100 100 100 100 100 100 100 100 100 100 100 100 100
$$ ##$AMPCOIL= (0..19)
$$ 0 0 0 0 0 0 0 0 0 0 0 0 0 0 0 0 0 0 0 0
$$ ##$ANAVPT= -1
$$ ##$AQSEQ= 0
$$ ##$AQ_mod= 3
$$ ##$AUNM= <au_zg>
$$ ##$AUTOPOS= <11 >
$$ ##$BF1= 400.41
$$ ##$BF2= 400.41
$$ ##$BF3= 400.41
$$ ##$BF4= 400.41
$$ ##$BF5= 400.41
$$ ##$BF6= 400.41
$$ ##$BF7= 400.41
$$ ##$BF8= 400.41
$$ ##$BYTORDA= 0
$$ ##$CAGPARS= (0..11)
$$ 0 0 0 0 0 0 0 0 0 0 0 0
$$ ##$CFDGTYP= 0
$$ ##$CFRGTYP= 9
$$ ##$CHEMSTR= <none>
$$ ##$CNST= (0..63)
$$ 1 1 145 1 1 1 1 1 1 1 1 1 1 1 1 1 1 1 1 1 1 1 1 1 1 1 1 1 1 1 1 1 1 1 1
$$ 1 1 1 1 1 1 1 1 1 1 1 1 1 1 1 1 1 1 1 1 1 1 1 1 1 1 1 1 1
$$ ##$CPDPRG= (0..8)
$$ <> <> <> <> <mlev> <mlev> <mlev> <mlev> <mlev>
$$ ##$D= (0..63)
$$ 0 1 0 0 0 0 0 0 0 0.06 0 0 0 0 0 0 0.0002 0 0 0 0 0 0 0 0 0 0 0 0 0 0 0
$$ 0 0 0 0 0 0 0 0 0 0 0 0 0 0 0 0 0 0 0 0 0 0 0 0 0 0 0 0 0 0 0 0
$$ ##$DATE= 1658588620
$$ ##$DE= 6.5
$$ ##$DECBNUC= <off>
$$ ##$DECIM= 2496
$$ ##$DECNUC= <off>
$$ ##$DECSTAT= 4
$$ ##$DIGMOD= 1
$$ ##$DIGTYP= 12
$$ ##$DQDMODE= 0
$$ ##$DR= 22
$$ ##$DS= 2
$$ ##$DSPFIRM= 0
$$ ##$DSPFVS= 20
$$ ##$DTYPA= 0
$$ ##$EXP= <proton>
$$ ##$F1LIST= <111111111111111>
$$ ##$F2LIST= <222222222222222>
$$ ##$F3LIST= <333333333333333>
$$ ##$FCUCHAN= (0..9)
$$ 0 2 0 0 0 0 0 0 0 0
$$ ##$FL1= 90
$$ ##$FL2= 90
$$ ##$FL3= 90
$$ [...]
$$ 90 74 58 42 26 10 0 0
$$ ##$Sgu3PowerLevels= (0..7)
$$ 0 0 0 0 0 0 0 0
$$ ##$Sgu4PowerLevels= (0..7)
$$ 0 0 0 0 0 0 0 0
$$ ##$Sgu5PowerLevels= (0..7)
$$ 0 0 0 0 0 0 0 0
$$ ##$Sgu6PowerLevels= (0..7)
$$ 0 0 0 0 0 0 0 0
$$ ##$Sgu7PowerLevels= (0..7)
$$ 0 0 0 0 0 0 0 0
$$ ##$Sgu8PowerLevels= (0..7)
$$ 0 0 0 0 0 0 0 0
$$ ##$SguType= 3
$$ ##$ShimPowMaxUA= (0..63)
$$ 130000 130000 130000 130000 130000 130000 130000 130000 130000 130000 130000
$$ 130000 130000 130000 130000 130000 130000 130000 130000 130000 0 0 0 0
$$ 0 0 0 0 0 0 0 0 0 0 0 0 0 0 0 0 0 0 0 0 0 0 0 0 0 0 0 0 0 0 0 0 0 0 0 0
$$ 0 0 0 0
$$ ##$ShimPowMaxUC= (0..63)
$$ 130000 130000 130000 130000 130000 130000 130000 130000 130000 130000 130000
$$ 130000 130000 130000 130000 130000 130000 130000 130000 130000 0 0 0 0
$$ 0 0 0 0 0 0 0 0 0 0 0 0 0 0 0 0 0 0 0 0 0 0 0 0 0 0 0 0 0 0 0 0 0 0 0 0
$$ 0 0 0 0
$$ ##$ShimPowMaxUG= (0..63)
$$ 524287 524287 524287 524287 524287 524287 524287 524287 524287 524287 524287
$$ 524287 524287 524287 524287 524287 524287 524287 524287 524287 0 0 0 0
$$ 0 0 0 0 0 0 0 0 0 0 0 0 0 0 0 0 0 0 0 0 0 0 0 0 0 0 0 0 0 0 0 0 0 0 0 0
$$ 0 0 0 0
$$ ##$ShimPowRcbType= 3
$$ ##$ShimPowRes= (0..63)
$$ 1e-20 1e-20 1e-20 1e-20 1e-20 1e-20 1e-20 1e-20 1e-20 1e-20 1e-20 1e-20
$$ 1e-20 1e-20 1e-20 1e-20 1e-20 1e-20 1e-20 1e-20 0 0 0 0 0 0 0 0 0 0 0 0
$$ 0 0 0 0 0 0 0 0 0 0 0 0 0 0 0 0 0 0 0 0 0 0 0 0 0 0 0 0 0 0 0 0
$$ ##$ShimPowRng0= (0..63)
$$ 1 1 1 1 1 1 1 1 1 1 1 1 1 1 1 1 1 1 1 1 0 0 0 0 0 0 0 0 0 0 0 0 0 0 0 0
$$ 0 0 0 0 0 0 0 0 0 0 0 0 0 0 0 0 0 0 0 0 0 0 0 0 0 0 0 0
$$ ##$ShimPowRng1= (0..63)
$$ 1 1 1 1 1 1 1 1 1 1 1 1 1 1 1 1 1 1 1 1 0 0 0 0 0 0 0 0 0 0 0 0 0 0 0 0
$$ 0 0 0 0 0 0 0 0 0 0 0 0 0 0 0 0 0 0 0 0 0 0 0 0 0 0 0 0
$$ ##$ShimPowRng2= (0..63)
$$ 1 1 1 1 1 1 1 1 1 1 1 1 1 1 1 1 1 1 1 1 0 0 0 0 0 0 0 0 0 0 0 0 0 0 0 0
$$ 0 0 0 0 0 0 0 0 0 0 0 0 0 0 0 0 0 0 0 0 0 0 0 0 0 0 0 0
$$ ##$ShimPowRng3= (0..63)
$$ 1 1 1 1 1 1 1 1 1 1 1 1 1 1 1 1 1 1 1 1 0 0 0 0 0 0 0 0 0 0 0 0 0 0 0 0
$$ 0 0 0 0 0 0 0 0 0 0 0 0 0 0 0 0 0 0 0 0 0 0 0 0 0 0 0 0
$$ ##$ShimSysFunc= (0..63)
$$ 1 2 3 4 5 7 9 11 15 16 8 10 12 14 6 17 13 18 19 20 0 0 0 0 0 0 0 0 0 0
$$ 0 0 0 0 0 0 0 0 0 0 0 0 0 0 0 0 0 0 0 0 0 0 0 0 0 0 0 0 0 0 0 0 0 0
$$ ##$ShimSysMatrix= 0
$$ ##$ShimSysType= 1
$$ ##$TFXNUM= 0
$$ ##$TRIPLO2= 0
$$ ##$VTU= 2
$$ ##$VTUETH= <149.236.99.20>
$$ ##$VTUTY= <no>
$$ ##$WBREFAM= (0..15)
$$ 135 116 100 100 100 100 100 100 100 100 100 100 100 100 100 100
$$ ##$WBREFLM= (0..15)
$$ 0 0 0 0 0 0 0 0 0 0 0 0 0 0 0 0
$$ ##$WBREFPH= (0..15)
$$ 71.66 -68.25 0 0 0 0 0 0 0 0 0 0 0 0 0 0
$$ ##$WBSGU= (0..15)
$$ 0 0 0 0 0 0 0 0 0 0 0 0 0 0 0 0
$$ ##$XFAC= 2
$$ ##END=
$$ 
##$DECIM=	2496
##$DSPFVS=	20
##XUNITS=	HZ
##YUNITS=	ARBITRARY UNITS
##FIRSTX=	6408.8703656999996383
##LASTX=	-1603.8278811825093726
##DELTAX=	-0.12226593800080123864
##XFACTOR=	1
##YFACTOR=	0.005775530336221345977
##FIRSTY=	7.4049201011657714844
##MINY=	-4.5762333869934082031
##MAXY=	21536.09765625
##NPOINTS=	65536
##XYDATA=	(X++(Y..Y))
$$ [...]
$$ plain form
2797 3752 3796 3876 3976 4070 4137 4166 4154 4101 4013 3896 3760 3612 3453 3280 3094 2900 2711 2534 2378 2245 2133 2035 1942 1853 1768 1686 1608 1534
2794 1534 1467 1409 1362 1326 1298 1273 1250 1236 1238 1255 1281 1307 1330 1344 1346 1336 1318 1299 1285 1276 1271 1263 1246 1220 1190 1168 1162 1175 1198 1216 1218 1206 1190 1179 1173 1166 1157 1151 1156 1170
2789 1170 1184 1196 1214 1241 1270 1287 1290 1289 1294 1305 1319 1334 1351 1373 1404 1446 1491 1522 1525 1508 1493 1490 1493 1486 1464 1432 1402 1377 1361 1355 1356 1358 1362 1374 1399 1426 1446 1462 1484 1511
2784 1511 1532 1540 1540 1539 1538 1536 1539 1550 1565 1582 1605 1640 1674 1691 1691 1685 1674 1654 1630 1624 1641 1664 1676 1679 1687 1703 1724 1752 1798 1854 1900 1925 1939 1958 1991 2037 2095 2157 2213 2262
2779 2262 2314 2378 2448 2511 2564 2620 2683 2746 2797 2836 2865 2888 2910 2941 2989 3051 3113 3165 3208 3248 3288 3327 3366 3403 3440 3486 3548 3627 3711 3791 3862 3918 3960 3996
2775 3996 4043 4100 4153 4193 4232 4284 4355 4441 4550 4698 4887 5098 5316 5534 5753 5974 6208 6469 6766 7086 7400 7686 7929 8133 8313 8485
2772 8485 8662 8854 9075 9339 9659 10042 10515 11114 11864 12763 13817 15058 16532 18252 20189 22285 24467 26623 28599 30232
2769 30232 31402 32056 32212 31937 31320 30451 29412 28279 27129 26029 25020 24122 23352 22730 22256 21895 21594 21308 21014 20692 20325
$$ packed form
2797C752M4Q0J00R4O7K9j2n3q8j17j36j48j59j73j86j94j89j77j56j33j12r8r3q9q5q2p8p4
2794A534o7n8m7l6k8k5k3j4KJ7K6K6K3J4Kj0j8j9j4rnqj7k6l0k2oJ3K3J8Kj2j6j1oproNJ4
2789A170J4J2J8K7K9J7LjNJ1J4J5J7K2L1M2M5L1Lj7j5lLpk2l2l0k5j6oJKMJ2K5K7K0J6K2K7
2784A511K1Q%jjkLJ1J5J7K3L5L4J7%oj1k0k4oJ7K3J2LQJ6K1K8M6N6M6K5J4J9L3M6N8O2N6M9
2779B262N2O4P0O3N3N6O3O3N1L9K9K3K2L1M8O2O2N2M3M0M0L9L9L7L7M6O2P9Q4Q0P1N6M2L6
2775C996M7N7N3M0L9N2P1Q6J09J48J89K11K18K18K19K21K34K61K97L20L14K86K43K04J80J72
2772H485J77J92K21K64L20L83M73N99P50Q99J054J241J474J720J937K096K182K156J976J633
2769C0232J170O54J56k75o17q69j039j133j150j100j009q98p70o22m74l61l01k86k94l22l67
$$ plain form
2767 20325 19916 19483 19049 18629 18238 17890 17592 17336 17124 16976 16909 16919 16990 17115 17302 17565 17910 18343 18858 19435 20053 20717 21449 22264
2764 22264 23166 24155 25238 26412 27666 28992 30395 31871 33408 34994 36637 38370 40241 42319 44696 47474 50740 54553
2762 54553 58961 64005 69722 76138 83255 91042 99428 108283 117400 126486 135186 143118 149926 155352 159342 162120 164166
2760 164166 166106 168596 172262 177692 185432 195987 209845 227533 249694 277124 310762 351588 400463 457885 523621
2758 523621 596254 672866 749068 819477 878553 921655 946070 951564 940103 914884 879359 836775 790119 742063
2756 742063 694763 649799 608350 571375 539511 512790 490480 471215 453339 435326 416128 395366 373268 350419
2754 350419 327486 305050 283541 263231 244248 226634 210410 195645 182462 170993 161318 153435 147278 142749
2753 142749 139743 138166 137945 139046 141484 145325 150696 157781 166813 178038 191657 207753 226190 246532 268006 289573
$$ packed form
2767B0325m09m33m34m20l91l48k98k56k12j48o7J0P1J25J87K63L45M33N15N77O18O64P32Q15
2764B2264R02R89J083J174J254J326J403J476J537J586J643J733J871K078K377K778L266L813
2762E4553M408N044N717O416P117P787Q386Q855R117R086Q700P932O808N426L990K778K046
2760A64166J940K490L666N430P740J0555J3858J7688K2161K7430L3638M0826M8875N7422O5736
2758E23621P2633P6612P6202P0409N9076M3102K4415N494j1461k5219l5525m2584m6656m8056
2756G42063m7300m4964m1449l6975l1864k6721k2310j9265j7876j8013j9198k0762k2098k2849
2754C50419k2933k2436k1509k0310j8983j7614j6224j4765j3183j1469r675p883o157m529
2753A42749l006j577k21J101K438L841N371P085R032J1225J3619J6096J8437K0342K1474K1567
$$ plain form
2751 289573 310102 328636 344668 358350 370518 382509 395844 411965 432111 457279 488146 524958 567415 614579
2749 614579 664746 715314 762817 803229 832493 847212 845434 827269 794924 751970 702233 648974 594670 541117
2747 541117 489545 440692 395002 352880 314830 281371 252855 229330 210526 195924 184861 176616 170435 165549
2746 165549 161216 156803 151865 146192 139802 132875 125646 118323 111052 103930 97016 90347 83968 77946 72347 67218 62585
2743 62585 58456 54805 51568 48681 46106 43813 41755 39878 38154 36577 35134 33800 32562 31420 30367 29382 28450 27573
2741 27573 26746 25954 25198 24494 23849 23246 22659 22084 21534 21012 20506 20005 19514 19041 18590 18153 17724 17307 16903 16513 16131 15758 15400
2738 15400 15059 14727 14399 14081 13783 13502 13232 12973 12732 12508 12288 12058 11816 11573 11339 11116 10901 10690 10491 10316 10163 10020 9869
2736 9869 9708 9546 9398 9273 9168 9061 8933 8786 8643 8518 8402 8286 8178 8090 8014 7935 7851 7767 7678 7568 7439 7311 7197 7095 7004
$$ packed form
2751B89573K0529J8534J6032J3682J2168J1991J3335J6121K0146K5168L0867L6812M2457M7164
2749F14579N0167N0568M7503M0412K9264J4719j778j8165l2345m2954m9737n3259n4304n3553
2747E41117n1572m8853m5690m2122l8050l3459k8516k3525j8804j4602j1063q245o181m886
2746A65549m333m413m938n673o390o927p229p323p271p122o914o669o379o022n599n129m633
2743F2585m129l651l237k887k575k293k058j877j724j577j443j334j238j142j053r85r32q77
2741B7573q27p92p56p04o45o03n87n75n50n22n06n01m91m73m51m37m29m17m04l90l82l73l58
2738A5400l41l32l28l18k98k81k70k59k41k24k20k30k42k43k34k23k15k11j99j75j53j43j51
2736I869j61j62j48j25j05j07j28j47j43j25j16j16j08q8p6p9q4q4q9j10j29j28j14j02r1
$$ plain form
2733 7004 6923 6842 6743 6627 6513 6414 6324 6234 6144 6055 5956 5848 5748 5667 5596 5520 5447 5396 5367 5337 5287 5224 5165 5122 5085 5033 4959 4875 4803 4752 4710 4668
2729 4668 4630 4597 4566 4534 4499 4456 4397 4327 4272 4245 4229 4202 4165 4135 4112 4079 4025 3963 3913 3882 3857 3823 3770 3713 3673 3656 3645 3622 3586 3549 3509 3458 3403 3362
2725 3362 3340 3321 3289 3249 3211 3180 3156 3136 3121 3112 3105 3094 3068 3024 2971 2925 2895 2875 2859 2851 2857 2866 2856 2818 2762 2707 2666 2639 2622 2612 2608 2606 2596 2573 2542 2515 2492 2467
2720 2467 2434 2397 2358 2310 2252 2193 2153 2138 2143 2153 2163 2177 2195 2212 2218 2206 2178 2141 2107 2085 2075 2069 2059 2045 2034 2027 2019 2011 2002 1989 1973 1963 1969 1982 1980 1953 1919 1894 1873
2715 1873 1851 1839 1848 1867 1875 1870 1868 1874 1873 1852 1819 1784 1750 1724 1719 1739 1761 1758 1726 1687 1661 1651 1641 1618 1585 1553 1525 1494 1454 1409 1372 1349 1333 1321 1315 1307 1288 1259 1236
2710 1236 1233 1244 1257 1266 1269 1267 1263 1262 1269 1282 1296 1304 1301 1286 1263 1245 1237 1233 1231 1231 1231 1225 1216 1208 1203 1187 1155 1119 1096 1087 1082 1079 1079 1073 1047 1005 966 942 928 921 927 942 947 930 904 892 903
2705 903 923 938 941 933 916 892 871 866 882 903 908 888 859 843 847 857 862 860 856 857 869 885 890 873 844 827 827 823 798 762 741 741 748 742 724 705 700 719 753 781 788 781 778 784 784
2699 784 767 743 725 716 710 709 721 742 755 748 727 710 710 726 750 773 790 793 774 741 713 707 722 744 762 776 788 794 791 782 769 746 713 682 672 688 711 730 750 773
$$ packed form
2733G004q1q1r9j16j14r9r0r0r0q9r9j08j00q1p1p6p3n1k9l0n0o3n9m3l7n2p4q4p2n1m2m2
2729D668l8l3l1l2l5m3n9p0n5k7j6k7l7l0k3l3n4o2n0l1k5l4n3n7m0j7j1k3l6l7m0n1n5m1
2725C362k2j9l2m0l8l1k4k0j5rpj1k6m4n3m6l0k0j6qORj0l8n6n5m1k7j7j0mkj0k3l1k7k3k5
2720B467l3l7l9m8n8n9m0j5NJ0J0J4J8J7Oj2k8l7l4k2j0oj0j4j1pqqrj3j6j0OJ3kk7l4k5k1
2715A873k2j2RJ9QnkOjk1l3l5l4k6nK0K2ll2l9k6j0j0k3l3l2k8l1m0m5l7k3j6j2oqj9k9k3
2710A236lJ1J3RLkmjPJ3J4Qlj5k3j8qmk%%orqnj6l2l6k3rnl%ok6m2l9k4j4pOJ5Nj7k6j2J1
2705I03K0J5Lqj7k4k1nJ6K1Nk0k9j6MJ0NkmJJ2J6Nj7k9j7%mk5l6k1%Poj8j9nJ9L4K8PplO%
2699G84j7k4j8rojJ2K1J3pk1j7%J6K4K3J7Lj9l3k8oJ5K2J8J4J2Olrj3k3l3l1j0J6K3J9K0K3
$$ plain form
2694 773 782 756 701 649 624 623 626 617 598 573 549 539 556 590 616 617 603 592 590 588 582 578 581 580 569 553 538 525 513 512 525 542 548 548 561 586 602 594 575 567 570 567 554 539
2689 539 531 526 520 511 506 512 534 563 579 566 537 520 526 543 550 538 513 488 470 460 458 466 485 506 513 498 473 456 451 446 441 444 459 474 486 498 507 510 513 532 571 606 612 590
2683 590 560 540 532 535 543 543 530 512 505 512 520 519 516 521 541 570 596 612 622 635 660 694 730 767 809 857 912 972 1028 1075 1114 1155 1212 1287 1375 1475 1586 1712
2679 1712 1858 2029 2225 2435 2646 2847 3024 3167 3271 3342 3393 3429 3440 3421 3378 3328 3289 3270 3266 3270 3280 3304 3347 3404 3461 3502 3515 3501 3469 3426 3362
2675 3362 3257 3105 2923 2734 2543 2354 2174 2013 1875 1765 1689 1643 1609 1574 1548 1545 1560 1568 1558 1536 1509 1474 1435 1402 1374 1340 1301 1280 1295 1338
2671 1338 1387 1436 1495 1576 1687 1832 2002 2181 2354 2522 2693 2868 3034 3179 3300 3400 3482 3542 3571 3555 3490 3383 3245 3091 2937 2793
2668 2793 2659 2530 2413 2323 2266 2233 2217 2226 2274 2359 2464 2579 2704 2834 2950 3030 3060 3036 2960 2843 2697 2537 2366 2184 1996 1812 1645
2665 1645 1498 1364 1236 1114 1003 903 813 739 686 650 617 574 522 471 429 403 396 403 411 417 427 443 459 462 451 431 410 392 378 366 353 343 341 342 328
$$ packed form
2694G73Rk6n5n2k5jLrj9k5k4j0J7L4K6Jj4j1kkomLjj1j6j5j3j2jJ3J7O%J3K5J6qj9qLlj3j5
2689E39qnornOK2K9J6j3k9j7OJ7Pj2k5k5j8j0kQJ9K1Pj5k5j7nnnLJ5J5J2J2RLLJ9L9L5Ok2
2683E90l0k0qLQ%j3j8pPQjlNK0K9K6J6J0J3K5L4L6L7M2M8N5O0N6M7L9M1N7P5Q8J00J11J26
2679A712J46J71J96K10K11K01J77J43J04P1N1L6J1j9m3n0l9j9mMJ0K4M3N7N7M1J3j4l2m3o4
2675C362j05j52j82j89j91j89j80j61j38j10p6m6l4l5k6lJ5Qj0k2k7l5l9l3k8l4l9k1J5M3
2671A338M9M9N9Q1J11J45J70J79J73J68J71J75J66J45J21J00Q2O0K9j6o5j07j38j54j54j44
2668B793j34j29j17r0n7l3j6RM8Q5J05J15J25J30J16Q0L0k4p6j17j46j60j71j82j88j84j67
2665A645j47j34j28j22j11j00r0p4n3l6l3m3n2n1m2k6pPQOJ0J6J6Lj1k0k1j8j4j2j3j0kJj4
$$ plain form
2661 328 302 281 277 275 260 247 265 314 363 386 386 378 367 350 333 318 301 279 262 256 252 235 202 168 151 157 183 216 240 246 240 232 225 210 184 154 130 112 97 89 92
2656 92 105 116 117 109 105 111 123 132 134 130 124 119 118 120 123 125 124 122 119 118 123 133 140 138 132 135 152 173 184 181 175 175 176 169 150 128 117 123 141 165 186 191 176 148 125 119 124 125 115 101 92 90
2649 90 87 78 66 61 70 87 101 106 104 99 91 83 77 68 51 29 17 23 41 55 59 62 71 84 97 105 108 109 111 116 123 127 124 114 103 100 107 118 123 117 103 87 73 68 77 91 96 91 93 108 125
2643 125 129 130 145 165 165 138 103 75 52 30 15 11 8 -5 -29 -56 -77 -88 -84 -71 -57 -50 -47 -47 -53 -60 -55 -38 -23 -23 -26 -18 -3 0 -7 -12 -6 -2 -8 -16 -14 -2 9 17 22 28 38 49
2637 49 60 66 61 45 23 0 -17 -28 -34 -40 -47 -53 -57 -59 -61 -60 -53 -39 -19 -3 1 -1 -2 8 29 43 43 30 11 -6 -17 -14 2 22 38 52 70 94 113 119 109 89 68 52
2632 52 42 42 45 45 38 30 29 37 47 50 46 44 45 42 32 22 26 43 56 49 28 13 14 18 15 11 17 31 43 43 35 23 12 4 4 10 16 17 13 6 1 10 39 81 115 132 134 127 111 88 61
2625 61 36 12 -3 -3 11 28 38 42 38 20 -15 -52 -70 -61 -36 -10 7 11 6 3 4 5 7 23 55 82 86 76 73 81 81 64 39 16 -4 -16 -6 21 44 46 35 27 21 13
2620 13 7 10 14 8 -8 -24 -32 -38 -46 -52 -47 -31 -10 8 23 35 44 50 54 60 73 89 94 86 76 73 73 64 43 23 12 12 17 26 38 42 28 0 -19 -16 0 9 6 7 28 60 82 86 83
$$ packed form
2661C28k6k1mkj5j3J8M9M9K3%qj1j7j7j5j7k2j7omj7l3l4j7OK6L3K4Ooqpj5k6l0k4j8j5qL
2656I2J3J1JqmOJ2RKmonjKLKjkljNJ0PkoLJ7K1J1lo%Jpj9k2j1OJ8K4K1Nj5k8k3oNJj0j4rk
2649I0lrj2nRJ7J4Nknqqorj7k2j2OJ8J4MLRJ3J3QLJKNPMlj0j1lPJ1Noj4j6j4nRJ4NnKJ5J7
2643A25MJJ5K0%k7l5k8k3k2j5mlj3k4k7k1j1MJ3J4PL%opNJ7J5%lQJ5LpnOMoqKJ2J1QNOJ0J1
2637D9J1Onj6k2k3j7j1oopomkkJPJ4K0J6MkjJ0K1J4%j3j9j7j1LJ6K0J6J4J8K4J9Oj0k0k1j6
2632E2j0%L%pqjQJ0LmkJlj0j0MJ7J3pk1j5JMlmOJ4J2%qj2j1q%OOJmpnRK9M2L4J7Kpj6k3k7
2625F1k5k4j5%J4J7J0Mmj8l5l7j8RK5K6J7MnlJJKJ6L2K7Mj0lQ%j7k5k3k0j2J0K7K3Kj1qoq
2620A3oLMoj6j6qoqoNJ6K1J8J5J2ROMOJ3J6Nqj0l%rk1k0j1%NRJ2Mj4k8j9LJ6RlJK1L2K2Ml
$$ plain form
2614 83 87 101 117 132 142 143 136 126 116 111 112 110 87 39 -12 -39 -40 -33 -29 -20 -2 11 13 15 30 54 72 81 86 94 105 117 125 118 97 79 76 80 69 45 26 23 31 35 31 26 30 51
2608 51 82 104 102 79 48 16 -13 -31 -28 -12 -3 -3 0 15 30 42 59 81 99 103 95 83 69 60 62 70 67 42 7 -23 -43 -52 -42 -17 7 20 25 32 38 38 38 44 46 36 22
2603 22 20 29 31 20 3 -12 -23 -21 3 44 76 81 69 54 40 28 26 38 58 71 74 73 74 71 65 55 43 29 21 27 43 52 47 38 37 46 61 81 109 140 160 160 148 134 118
2597 118 93 60 27 5 -3 -1 4 7 4 0 6 28 61 95 124 143 147 137 123 114 108 99 91 95 110 123 125 121 118 111 93 62 29 5 -3 1 15 35 58 83 107 120 114 89 58
2592 58 34 25 31 48 64 70 62 48 33 20 9 4 2 -4 -19 -33 -32 -13 11 29 38 42 50 65 82 89 79 52 25 12 20 40 58 58 38 11 -5 -12 -18 -29 -33 -19 8 37
2586 37 55 52 23 -18 -45 -37 -9 9 9 9 26 53 72 77 75 70 63 60 68 88 107 115 111 104 101 98 95 101 123 149 157 144 131 135 145 134 100 60 29 1 -27 -47 -50 -42 -32 -19
2581 -19 -1 9 2 -16 -32 -42 -52 -66 -78 -85 -87 -84 -70 -49 -30 -18 -12 -11 -13 -13 -4 12 31 46 58 61 46 22 10 23 51 73 78 72 57 34 5 -16 -22 -12 5 16
2576 16 11 -1 -7 3 20 25 12 -7 -19 -23 -24 -28 -33 -34 -25 -4 22 44 52 49 40 28 12 -3 -15 -23 -30 -35 -39 -38 -38 -42 -47 -39 -12 21 43 46 34 19 6 0 2 1 -12 -38 -52 -37
$$ packed form
2614H3MJ4J6J5J0Jpj0j0nJkk3m8n1k7jPMRJ8J3KKJ5K4J8RNQJ1J2Qpk1j8lMj1k4j9lQMmnMK1
2608E1L1K2kk3l1l2k9j8LJ6R%LJ5J5J2J7K2J8Mqj2j4rKQlk5l5l0k0rJ0K5K4J3NPO%%OKj0j4
2603B2kRKj1j7j5j1KK4M1L2Nj2j5j4j2kJ2K0J3LjJloj0j2j4qOJ6RnrjRJ5K0K8L1K0%j2j4j6
2597A18k5l3l3k2qKNLlmOK2L3L4K9J9Mj0j4rorqMJ5J3Kmlpj8l1l3k4qMJ4K0K3K5K4J3ok5l1
2592E8k4rOJ7J6Oqj4j5j3j1nkoj5j4JJ9K4J8RMQJ5J7Pj0k7k7j3QK0J8%k0k7j6poj1mJ4K7K9
2586C7J8lk9m1k7QK8J8%%J7K7J9NknplQK0J9QmplllOK2K6Qj3j3MJ0j1l4m0l1k8k8k0lQJ0J3
2581a9J8J0pj8j6j0j0j4j2pkLJ4K1J9J2OJk%RJ6J9J5J2Lj5k4j2J3K8K2Noj5k3k9k1oJ0J7J1
2576A6nj2oJ0J7Nj3j9j2mjmnjRK1K6K2Qlrj2j6j5j2qpnmJ%mnQK7L3K2Lj2j5j3oKjj3k6j4J5
$$ plain form
2570 -37 -6 11 8 6 22 49 63 56 41 28 20 14 10 9 10 13 15 14 12 16 31 47 51 43 33 24 11 -11 -36 -59 -75 -76 -51 -3 42 67 72 67 52 23 -5 -13 -1 9 6 1
2564 1 2 1 -13 -34 -51 -61 -69 -68 -49 -20 -2 -8 -31 -50 -55 -48 -34 -21 -7 15 51 90 116 120 110 97 86 77 70 67 70 76 76 69 65 75 92 93 71 39 17 5 -10 -35
2559 -35 -58 -72 -78 -77 -65 -42 -11 24 64 100 115 106 89 73 56 28 -3 -23 -27 -22 -15 -13 -18 -35 -56 -66 -57 -36 -18 -16 -31 -56 -73 -72 -53 -28 -7 10 22 29 34 42
2554 42 55 65 65 56 43 30 21 15 14 16 19 21 21 19 17 14 11 8 15 41 81 113 121 102 70 42 28 24 17 -3 -35 -58 -56 -27 6 26 26 14 0 -10 -9 6 33 57 67 70
2548 70 82 103 115 107 90 84 98 120 132 130 120 112 112 117 112 88 51 18 0 1 17 40 59 65 59 47 31 11 -6 -14 -9 2 12 18 21 29 48 77 105 117 110 92 75
2543 75 57 40 25 18 19 27 40 51 51 38 19 -1 -21 -38 -44 -38 -29 -20 -4 15 28 25 19 22 27 16 -9 -30 -31 -15 6 27 37 33 27 38 66 89 91 83 84 94 100 100 103 111
2537 111 114 107 93 76 66 71 92 116 132 141 146 134 100 61 44 48 45 22 0 -5 -4 -14 -30 -31 -15 2 11 16 20 14 -4 -27 -49 -66 -73 -65 -42 -17 -4 -4 -11 -14 -9 1 12
2532 12 17 19 20 24 28 36 55 86 119 140 143 130 107 84 71 69 73 81 94 113 133 150 161 158 135 96 60 45 49 58 62 63 68 76 84 85 75 58 45 41 42 37 21 -2 -24 -36
$$ packed form
2570c7L1J7lkJ6K7J4pj5j3qomjJLKjkMJ5J6Mqj0rj3k2k5k3j6jK5M8M5K5Nnj5k9k8qJ2J0ln
2564AJjj4k1j7j0qJJ9K9J8ok3j9nPJ4J3J4K2L6L9K6Mj0j3j1rplLO%pmJ0J7Jk2l2k2j2j5k5
2559c5k3j4oJJ2K3L1L5M0L6J5rj7j6j7k8l1k0mNPKnj7k1j0RK1J8Kj5k5j7JJ9K5K1J7J2PNQ
2554D2J3J0%rj3j3rojKLK%kklllPK6M0L2Qj9l2k8j4mpk0l2k3KK9L3K0%j2j4j0JJ5K7K4J0L
2548G0J2K1J2qj7oJ4K2J2kj0q%Nnk4l7l3j8JJ6K3J9Ooj2j6k0j7qNJ1J0OLQJ9K9K8J2pj8j7
2543G5j8j7j5pJQJ3J1%j3j9k0k0j7oORRJ6J9J3loLNj1k5k1jJ6K1K1J0moJ1K8K3KqJJ0O%LQ
2537A11Lpj4j7j0NK1K4J6RNj2l4l9j7Mlk3k2nJj0j6jJ6J7RNMoj8k3k2j7pQK3K5J3%plNJ0J1
2532A2NKJMMQJ9L1L3K1Lj3k3k3j3kMQJ3J9K0J7J1lk3l9l6j5MRMJNQQJj0j7j3mJnj6k3k2j2
$$ plain form
2526 -36 -39 -38 -43 -54 -56 -39 -6 20 27 20 13 9 0 -16 -31 -31 -11 15 29 24 11 7 18 32 41 46 51 51 42 28 17 11 4 -8 -23 -32 -34 -28 -16 0 11 15 12 5 -3 -8 -7 2 10 10 7
2520 7 8 10 6 2 20 70 130 170 176 162 143 125 108 91 78 68 57 39 12 -14 -26 -18 -5 -5 -11 -6 9 20 12 -12 -45 -84 -122 -141 -132 -108 -89 -74 -51 -22 -3
2515 -3 0 -3 0 15 40 69 90 95 89 84 81 69 46 24 18 31 52 71 79 75 63 51 41 28 10 -4 -3 17 50 77 88 81 62 42 27 23 35 61 84 91 82 68 55
2509 55 41 22 0 -19 -27 -11 26 66 82 68 44 24 10 0 1 15 26 18 -6 -31 -44 -46 -38 -18 5 22 30 35 40 36 20 6 14 45 82 104 109 103 89 62 28
2504 28 2 2 25 51 63 66 69 76 83 90 97 104 106 106 106 106 102 97 93 90 80 57 26 0 -11 -3 17 38 49 53 54 52 45 35 29 26 25 25 25 26 23 18 19 33 56 82 105 121 126 125 125 129
2498 129 134 138 145 160 175 175 155 126 105 97 96 90 79 68 62 62 62 54 28 -13 -51 -60 -31 11 35 29 11 0 -4 -6 -8 -4 2 1 -12 -26 -22 2 31 43 35 17 6 6 12 14 2
2492 2 -22 -47 -53 -34 0 43 87 130 161 171 160 137 107 75 42 14 -2 -2 10 25 27 13 -2 -9 -8 -5 0 9 18 17 11 14 27 34 23 3 -9 -9 1 18 40 56 55
2487 55 44 42 60 88 108 117 127 141 150 145 132 126 136 151 160 166 179 195 196 174 141 115 106 111 125 142 149 139 114 90 83 100 132 164 184 196 207 217 223 222 218 208 183
$$ packed form
2526c6lJnj1kJ7L3K6Pppmrj6j5%K0K6J4nj3mJ1J4RNN%rj4j1opj2j5rkOJ2J6J1MlpqnJRQ%l
2520GJKmmJ8N0O0M0Oj4j9j8j7j7j3j0j1j8k7k6j2QJ3%oNJ5J1qk4l3l9l8j9RK4J9J5K3K9J9
2515cLlLJ5K5K9K1Nonlj2k3k2oJ3K1J9Qmj2j2j0j3j8j4JK0L3K7J1pj9k0j5mJ2K6K3Prj4j3
2509E5j4j9k2j9qJ6L7M0J6j4k4k0j4j0JJ4J1qk4k5j3kQK0K3J7QNNmj6j4QL1L7K2Noj4k7l4
2504B8k6%K3K6J2LLPPPPPK%%%mnmlj0k3l1k6j1QK0K1J1MJkpj0olj%%JlnJJ4K3K6K3J6Nj%M
2498A29NMPJ5J5%k0k9k1qjoj1j1o%%qk6m1l8rK9M2K4oj8j1mkkMOjj3j4MK4K9J2qj8j1%OKj2
2492Bk4k5oJ9L4M3M4M3L1J0j1k3l0l2l3k8j6%J2J5Kj4j5pJLNRRjoLJ3Pj1k0j2%J0J7K2J6j
2487E5j1kJ8K8K0RJ0J4Rnj3oJ0J5ROJ3J6Jk2l3k6rNJ4J7Pj0k5k4pJ7L2L2K0J2J1J0Ojmj0k5
$$ plain form
2482 183 141 96 71 72 90 107 107 87 62 50 58 74 86 90 86 77 62 47 35 24 19 25 42 59 71 84 104 120 119 104 91 91 97 104 115 134 154 159 142 108 70
2477 70 43 35 42 56 71 87 103 115 124 129 129 120 110 111 131 160 189 208 214 200 166 125 94 81 87 106 128 134 117 92 82 95 115 122 112 98 85 70 51 39 42
2472 42 57 69 71 66 67 79 100 122 136 137 132 132 142 147 131 99 70 57 61 73 91 114 134 147 152 149 130 95 65 64 93 128 141 129 113 113 128 141 137 115 93 87
2467 87 97 108 103 82 54 31 20 21 33 44 49 52 65 86 101 93 69 51 54 70 81 80 77 85 108 133 145 137 117 105 110 126 142 147 133 98 50 9 -11 -11 0 16
2462 16 26 24 12 8 24 53 74 81 79 75 60 35 16 16 33 48 48 29 2 -14 -6 29 77 118 138 138 120 96 79 74 76 78 77 79 86 96 106 111 110 101 85 67 50 37
2456 37 29 24 21 19 21 23 17 4 -8 -13 -13 -8 1 16 28 30 30 44 68 89 100 107 120 138 153 159 157 149 136 118 89 50 8 -21 -33 -33 -28 -19 -1 25 53 70 77 86 106 132
2451 132 152 162 162 153 136 118 109 110 108 94 83 89 116 152 188 214 219 202 179 168 169 173 173 178 188 198 202 199 189 172 155 143 127 96 57 34 35 42 35 19 9 8 8 7
2445 7 6 8 14 28 52 75 85 84 79 76 74 70 65 53 34 19 17 26 36 45 54 66 79 98 122 142 146 138 136 143 144 130 112 104 103 98 90 85 88 97 115 139 158 162 158 160 166 159 130 95 71
$$ packed form
2482A83m2m5k5JJ8J7%k0k5j2QJ6J2Mmrj5j5j2j1nOJ7J7J2J3K0J6jj5j3%OPJ1J9K0Nj7l4l8
2477G0k7qPJ4J5J6J6J2RN%rj0JK0K9K9J9Oj4l4m1l1j3OJ9K2Oj7k5j0J3K0Pj0j4j3j5j9j2L
2472D2J5J2KnJJ2K1K2J4Jn%J0Nj6l2k9j3MJ2J8K3K0J3Nlj9l5l0jK9L5J3j2j6%J5J3mk2k2o
2467H7J0J1nk1k8k3j1JJ2J1NLJ3K1J5qk4j8LJ6J1jlQK3K5J2qk0j2NJ6J6Nj4l5m8m1k0%J1J6
2462A6J0kj2mJ6K9K1Pkmj5k5j9%J7J5%j9k7j6QL5M8M1K0%j8k4j7nKKjKPJ0J0Njrj6j8j7j3
2456C7qnlkKKoj3j2n%NRJ5J2K%J4K4K1J1PJ3J8J5Okqj3j8k9l9m2k9j2%NRJ8K6K8J7PRK0K6
2451A32K0J0%rj7j8rJkj4j1OK7L6L6K6Nj7k3j1JM%NJ0J0Mlj0j7j7j2j6l1l9k3JPpj6j0j%j
2445GjKOJ4K4K3J0jnlkmnj2j9j5kRJ0RRJ2J3J9K4K0MqkPJj4j8qjnqnLRJ8K4J9MmKOpk9l5k4
$$ plain form
2439 71 59 52 49 55 68 78 77 71 67 69 72 73 71 70 74 80 76 56 31 20 35 65 89 93 77 56 47 60 91 124 147 156 154 148 144 150 163 167 151 123 108 117 136 141 125 101 84
2433 84 81 91 105 107 87 49 14 -2 -3 8 29 54 73 79 80 95 125 154 163 151 127 105 96 105 127 153 172 183 188 185 173 155 139 127 114 98 89 97 118 138 147 139
2428 139 119 90 59 38 38 60 91 113 121 121 124 134 151 171 186 192 188 184 184 183 175 162 153 153 158 161 159 155 147 135 124 121 127 132 125 109 95 95 101 100 92 84 86 95 101 101 97 94 96 108 128
2422 128 152 172 188 198 200 183 150 116 95 90 92 89 73 47 20 8 19 42 65 83 101 121 131 121 93 65 53 56 57 46 36 48 82 108 105 83 66 63 67
2417 67 75 93 116 126 119 113 128 153 161 144 121 115 126 136 136 134 136 139 137 138 150 172 184 176 156 138 130 134 154 188 218 232 231 226 214 186 149 125 126 140 153 163 175 182
2412 182 172 142 106 74 44 14 -7 -8 13 47 74 88 95 104 113 121 128 137 147 159 176 198 215 217 204 191 187 190 196 201 202 194 177 161 148 135 118 98 78 59 47 48
2406 48 58 71 80 87 90 80 57 37 34 41 48 57 77 102 114 106 83 58 43 42 55 68 69 66 75 100 123 133 130 122 114 113 127 150 162 152 130 108 94 88 98 122 144 147
2401 147 137 134 148 170 183 187 189 189 182 167 152 139 125 113 110 117 126 128 124 122 121 114 103 100 114 132 141 143 150 159 160 149 141 143 147 147 147 160 186 209 217 206 186 169 157 147 136
$$ packed form
2439G1j2plOJ3J0jomKLJkjMOmk0k5j1J5L0K4Mj6k1rJ3L1L3K3RkomOJ3Mj6k8j5RJ9Nj6k4j7
2433H4lJ0J4Kk0l8l5j6jJ1K1K5J9OJJ5L0K9Rj2k4k2rRK2K6J9J1Nlj2j8j6j2j3j6rQK1K0Rq
2428A39k0k9l1k1%K2L1K2Q%LJ0J7K0J5Omm%jqj3r%NLkmqj2j1lONpj6j4%OjqqKRO%mlKJ2K0
2422A28K4K0J6J0Kj7l3l4k1nKlj6k6k7j2J1K3K3J8J8K0J0j0k8k8j2LJj1j0J2L4K6lk2j7lM
2417F7QJ8K3J0poJ5K5Qj7k3oJ1J0%kKLkJJ2K2J2qk0j8qMK0L4L0J4jnj2k8l7k4JJ4J3J0J2P
2412A82j0l0l6l2l0l0k1jK1L4K7J4PRRQPRJ0J2J7K2J7Kj3j3mLONJqj7j6j3j3j7k0k0j9j2J
2406D8J0J3RPLj0k3k0lPPRK0K5J2qk3k5j5jJ3J3JlRK5K3J0lqqjJ4K3J2j0k2k2j4oJ0K4K2L
2401A47j0lJ4K2J3MK%pj5j5j3j4j2lPRKmkjpj1lJ4J8RKPRJj1qKM%%J3K6K3Qj1k0j7j2j0j1
$$ plain form
2395 136 131 142 164 185 198 207 214 219 217 206 191 181 184 198 206 195 175 160 146 126 107 108 124 133 127 128 149 176 185 180 180 190 200 202 191 163 113 56 21 24 52 87 114
2390 114 127 127 119 116 120 120 109 93 85 89 104 124 140 141 124 95 71 69 90 116 130 131 134 145 153 146 127 109 98 92 87 81 70 53 44 60 99 144 178 200 206 197 177 162
2385 162 161 168 170 166 158 143 123 107 108 130 166 202 225 228 213 195 182 175 168 161 158 162 174 194 216 228 223 208 197 196 199 191 166 134 111 107 112 112 106 101 105 116 124 127 125 119 118 127 148
2379 148 173 190 192 183 171 163 158 155 151 148 141 123 96 77 82 105 124 124 111 100 97 97 98 100 109 127 152 173 181 172 152 124 90 62 51 56 64 68 77 95 107 105 99 110 135 158
2373 158 173 185 196 197 187 180 186 193 186 163 145 140 142 137 122 106 94 79 53 24 11 21 47 79 114 153 182 189 177 165 165 176 191 203 208 203 186 166 152 147 147 145
2368 145 137 127 127 148 184 214 217 193 158 129 121 134 163 191 202 193 175 161 150 138 123 110 112 128 147 157 156 153 161 179 198 209 211 206 194 178 166 167 179 186 180 163
2363 163 148 138 128 118 114 124 142 159 172 183 194 199 192 178 166 161 161 156 138 106 67 34 15 13 25 47 74 99 121 136 141 137 129 122 122 128 137 147 151 147 139 139 154 178
2357 178 201 217 230 239 243 240 235 234 241 248 245 226 197 177 177 192 202 189 156 117 90 79 85 100 116 121 116 118 140 178 207 216 212 212 221 236 254 269 274 264 245 224 205 195
$$ packed form
2395A36nJ1K2K1J3RPNkj1j5j0LJ4Qj1k0j5j4k0j9JJ6RoJK1K7Rn%J0J0Kj1k8n0n7l5LK8L5K7
2390A14J3%qlM%j1j6qMJ5K0J6Jj7k9k4kK1K6J4JLJ1Qpj9j8j1onoj1j7rJ6L9M5L4K2Ork0j5
2385A62jPKmqj5k0j6JK2L6L6K3Lj5j8j3ppplMJ2K0K2J2nj5j1jLqk5l2k3mN%onMJ1QLkojRK1
2379A48K5J7Krj2qnlmlpj8k7j9NK3J9%j3j1l%JKRJ8K5K1Qrk0k8l4k8j1NQMRJ8J2koJ1K5K3
2373A58J5J2J1Jj0pOPpk3j8nKnj5j6j2j5k6k9j3J0K6L2L5L9K9Pj2j2%J1J5J2Nnj7k0j4n%k
2368A45qj0%K1L6L0Lk4l5k9qJ3K9K8J1rj8j4j1j2j5j3KJ6J9J0jlQJ8J9J1Knj2j6j2JJ2Poj7
2363A63j5j0j0j0mJ0J8J7J3J1J1Npj4j2n%nj8l2l9l3j9kJ2K2K7K5K2J5Nmqp%ORJ0Mmq%J5K4
2357A78K3J6J3RMlnjPPlj9k9k0%J5J0j3l3l9k7j1OJ5J6NnKK2L8K9Rm%RJ5J8J5Nj0j9k1j9j0
$$ plain form
2352 195 201 228 260 275 270 267 277 285 268 226 184 162 166 186 209 227 232 220 191 157 135 130 130 127 127 142 168 183 180 173 184 211 238 255 263 263 256 246 245 258 276 288 285
2347 285 267 238 209 185 171 173 195 225 243 233 201 174 164 174 195 221 243 246 225 191 162 156 181 231 280 298 279 246 220 201 181 163 156 161 167 171 177 184 186 190
2342 190 206 233 259 273 283 291 294 290 289 292 284 259 234 229 236 235 227 231 250 265 267 268 273 271 256 243 245 252 248 231 217 212 208 202 198 201 212 222 224 214 201 197 209 229 249 266 281
2336 281 287 282 271 258 241 224 221 238 261 268 261 265 286 313 332 342 344 338 323 306 286 262 238 232 251 275 276 248 213 201 222 255 273 266 253 253 266 275 279 286 296 297 285
2331 285 270 259 247 226 205 192 185 180 185 204 220 221 213 208 204 191 171 163 176 202 232 263 289 299 293 287 293 310 328 342 352 358 365 381 400 400 369 319 278 264 268 276 284
2326 284 288 282 260 234 226 252 298 340 361 370 382 404 430 451 464 476 486 486 461 416 378 369 383 389 371 345 326 312 290 269 263 272 280 275 261 250 249 260 281 301 310
2321 310 305 288 259 223 198 198 220 242 249 241 226 217 220 240 271 302 324 330 318 297 285 290 300 299 294 304 331 354 361 362 370 385 395 392 376 346 314 300 314 334 334 312
2316 312 290 283 284 283 275 265 258 255 257 268 289 322 354 368 359 339 328 334 350 367 374 360 327 291 272 274 280 280 277 284 302 327 355 377 381 364 344 345 368 390 391 379 372 372 361
$$ packed form
2352A95OK7L2J5nlJ0Qj7m2m2k2MK0K3J8Nj2k9l4k2n%l%J5K6J5lpJ1K7K7J7Q%pj0jJ3J8J2l
2347B85j8k9k9k4j4KK2L0J8j0l2k7j0J0K1K6K2Lk1l4k9oK5N0M9J8j9l3k6j9k0j8pNOMOPKM
2342A90J6K7K6J4J0QLmjLqk5k5nPjqMJ9J5KJNkj5j3KPmj7j4nmomLJ1J0Kj0j3mJ2K0K0J7J5
2336B81Onj1j3j7j7lJ7K3PpMK1K7J9J0Koj5j7k0k4k4oJ9K4Jk8l5j2K1L3J8pj3%J3RMPJ0Jj2
2331B85j5j1j2k1k1j3pnNJ9J6Jqnmj3k0qJ3K6L0L1K6J0ooOJ7J8J4J0OPJ6J9%l1n0m1j4MQQ
2326B84Mok2k6qK6M6M2K1RJ2K2K6K1J3J2J0%k5m5l8rJ4Oj8k6j9j4k2k1oRQnj4j1jJ1K1K0R
2321C10nj7k9l6k5%K2K2Pqj5rLK0L1L1K2Oj2k1j2NJ0jnJ0K7K3PJQJ5J0lj6l0l2j4J4K0%k2
2316C12k2pJjqj0plKJ1K1L3L2J4rk0j1OJ6J7Pj4l3l6j9KO%lPJ8K5K8K2Mj7k0JK3K2Jj2p%j1
$$ plain form
2310 361 335 312 309 318 319 302 279 265 266 280 298 308 303 291 279 262 230 193 174 185 215 249 287 327 360 377 381 376 359 328 294 263 235 216 220 249 279 288 280 277
2305 277 287 300 310 313 301 272 238 223 231 246 256 262 271 283 299 315 320 304 275 251 247 259 276 289 294 290 285 288 294 294 290 294 312 333 347 358 368 372 368 362 358 355 351 348 342 324
2300 324 291 253 222 206 209 236 281 323 347 355 354 346 333 331 347 367 375 373 374 377 365 336 304 286 275 260 245 245 265 298 327 343 345 335 321 313 316 325 329 321 307 299 298 299
2294 299 300 306 313 314 308 306 315 330 340 340 330 306 272 242 233 239 244 247 257 277 298 318 338 349 342 321 308 312 319 317 311 310 309 305 308 318 322 308 295 307 333 335 305 272 265 275 276
2288 276 269 272 293 316 324 313 294 281 288 314 347 375 396 410 412 396 372 354 350 355 362 367 369 366 366 377 398 419 437 453 463 455 427 399 388 394 400 398 387 372 359 354 359 373
2283 373 389 407 424 437 441 440 442 445 446 440 429 413 395 384 382 384 380 376 377 380 371 348 325 310 297 283 271 266 262 261 274 307 355 404 450 488 505 491 455 421 401 389 376
2278 376 366 366 376 386 392 396 401 404 400 398 408 434 460 473 468 453 439 433 440 456 464 450 424 407 408 407 384 352 339 362 412 465 502 514 504 485 469 449 415 372 331
2273 331 301 280 266 266 285 315 342 360 373 387 404 417 421 414 406 402 402 396 383 371 365 360 351 346 354 375 395 402 401 399 398 392 383 382 391 403 409 415 430 454 469 459 423 378 345 339
$$ packed form
2310C61k6k3lRJj7k3j4JJ4J8J0nj2j2j7l2l7j9J1L0L4L8M0L3J7Mnj7l1l4l1k8j9MK9L0Rql
2305B77J0J3J0Lj2k9l4j5QJ5J0ORJ2J6J6Nj6k9k4mJ2J7J3NmnLO%mMJ8K1J4J1J0Mmomlmloj8
2300C24l3l8l1j6LK7M5M2K4Qjqj3kJ6K0QkJLj2k9l2j8j1j5j5%K0L3K9J6Kj0j4qLRMqj4qjJ
2294B99JOPJokRJ5J0%j0k4l4l0rONLJ0K0K1K0K0J1pk1j3MPkojjmLJ0Mj4j3J2K6Kl0l3pJ0J
2288B76pLK1K3Qj1j9j3PK6L3K8K1J4Kj6k4j8mNPNKl%J1K1K1J8J6J0qk8k8j1OOkj1j5j3nNJ4
2283C73J6J8J7J3MjKLJoj1j6j8j1kKmmJLrk3k3j5j3j4j2nmjJ3L3M8M9M6L8J7j4l6l4k0j2j3
2278C76j0%J0J0OMNLmkJ0K6K6J3nj5j4oPJ6Qj4k6j7Jjk3l2j3K3N0N3L7J2j0j9j6k0l4m3m1
2273C31l0k1j4%J9L0K7J8J3J4J7J3Mpqm%oj3j2onrnQK1K0PjkjorjRJ2OOJ5K4J5j0l6m5l3o
$$ plain form
2267 339 355 374 375 359 348 357 380 393 386 366 349 346 355 372 388 404 420 431 424 398 368 350 352 368 392 419 436 440 439 446 454 453 441 431 433 446 462 472 468 447 418 396
2262 396 383 367 343 326 330 351 376 397 412 423 430 434 436 437 442 451 463 473 486 504 514 502 470 438 421 417 417 416 409 387 353 326 318 325 336 354 385 420 442 448 452 466
2257 466 486 503 513 512 498 478 464 464 467 462 447 432 432 449 475 492 490 472 450 430 412 397 388 395 418 450 475 484 481 482 494 505 499 474 448 440 448 457 457 450 443 439 432 420 409
2251 409 410 422 439 456 473 487 497 509 528 544 537 508 486 495 522 536 531 531 549 569 572 563 562 576 592 598 588 564 533 503 482 472 467 464 462 459 455 455 465 486 505 513 510
2246 510 505 499 491 478 469 468 469 462 448 441 447 463 479 491 497 488 464 437 424 424 427 427 431 441 453 465 475 478 464 436 410 396 387 372 358 354 358 364 373 392 419 441 457 481 520
2241 520 566 597 608 601 582 554 525 505 493 478 458 445 449 464 481 503 534 566 582 577 569 573 587 598 604 606 606 596 580 565 555 546 535 523 511 496 477 459 447
2236 447 444 454 480 519 556 578 578 564 548 542 550 569 589 600 600 598 603 612 613 593 558 533 536 557 569 559 543 538 546 561 580 607 635 648 639 619 601 594 589 578 560 544
2231 544 538 543 557 578 601 621 631 633 629 619 602 584 576 584 602 621 633 637 633 624 610 602 612 645 686 712 711 689 663 642 629 627 629 624 607 589 587 604 628 647 657 656 645
$$ packed form
2267C39J6J9Jj6j1RK3J3pk0j7lRJ7J6J6J6J1pk6l0j8KJ6K4K7J7MjPQjj2j0KJ3J6J0mk1k9k2
2262C96j3j6k4j7MK1K5K1J5J1PMKJNRJ2J0J3J8J0j2l2l2j7m%jpk2l4k7qPJ1J8L1L5K2OMJ4
2257D66K0J7J0jj4k0j4%Lnj5j5%J7K6J7kj8k2k0j8j5rPK3L2K5RlJJ2J1ok5k6qQR%ppmpj2j1
2251D09JJ2J7J7J7J4J0J2J9J6pk9k2RK7J4n%J8K0LrjJ4J6Oj0k4l1l0k1j0nlklm%J0K1J9Ql
2246E10noqj3rjJpj4pOJ6J6J2Ork4k7j3%L%MJ0J2J2J0Lj4k8k6j4rj5j4mMORJ9K7K2J6K4L9
2241E20M6L1J1pj9k8k9k0j2j5k0j3MJ5J7K2L1L2J6nqMJ4J1OK%j0j6j5j0rj1j2j2j5j9j8j2
2236D47lJ0K6L9L7K2%j4j6oQJ9K0J1%kNRJk0l5k5LK1J2j0j6nQJ5J9K7K8J3rk0j8pnj1j8j6
2231E44oNJ4K1K3K0J0Kmj0j7j8qQJ8J9J2Mmrj4qJ0L3M1K6jk2k6k1j3kKnj7j8kJ7K4J9J0jj1
$$ plain form
2225 645 637 640 646 636 609 591 599 620 634 630 613 588 565 561 581 611 630 638 649 663 663 644 625 630 655 676 681 679 687 703 711 702 684 671 661 645 628 622 628 633 632 639 658 671
2220 671 661 641 634 645 661 680 708 739 750 734 711 696 688 680 675 675 672 663 656 659 669 683 700 717 722 705 677 656 644 634 623 613 612 625 653 685 706 706 696 694 700 704
2215 704 700 696 700 710 719 723 721 707 681 651 631 624 625 625 623 624 628 631 632 635 646 658 665 666 670 680 691 700 703 701 696 693 696 696 679 649 623 612 614 625 642 661 670 662 647 638 637 639 644 653 657 648
2209 648 627 608 601 608 630 663 687 685 662 643 645 660 677 692 708 720 724 720 711 698 681 671 680 710 748 781 801 807 808 814 823 824 811 794 786 791 799 807 818 824 812 782 754 749
2203 749 765 790 816 843 865 868 848 819 802 806 825 845 854 848 836 829 829 827 818 808 808 814 814 805 793 785 776 763 749 741 740 745 759 783 807 818 809 790 777 776 785 800 811 812 799
2198 799 778 767 780 813 848 869 877 882 885 882 870 855 842 831 822 817 818 822 823 817 807 800 798 796 786 766 747 737 738 741 740 743 759 783 807 829 851 869 871 857 839 830 827 825 828 842
2192 842 862 875 872 856 829 796 769 763 780 804 813 807 805 819 844 868 891 919 948 969 980 990 998 991 961 925 905 908 922 933 939 946 958 977 1003 1030 1042 1034 1015 1003
2187 1003 1002 1003 992 973 956 953 961 972 979 984 987 985 976 969 969 975 971 954 934 928 934 938 936 935 945 956 957 952 956 977 1001 1014 1011 999 982 964 950 941 933 926 927 941 958 961 960 972 1001 1020
$$ packed form
2225F45qLOj0k7j8QK1J4mj7k5k3mK0L0J9QJ1J4%j9j9NK5K1NkQJ6Qrj8j3j0j6j7oONjPJ9J3
2220F71j0k0pJ1J6J9K8L1J1j6k3j5qqn%lrpLJ0J4J7J7Nj7k8k1j2j0j1j0jJ3K8L2K1%j0kOM
2215G04mmMJ0RMkj4k6l0k0pJ%kJMLJLJ1J2PJMJ0J1RLknlL%j7l0k6j1KJ1J7J9Rqj5rjKNRMr
2209F48k1j9pPK2L3K4kk3j9KJ5J7J5J6J2Mmrj3j7j0RL0L8L3K0OJORJj3j7qNQQJ1Oj2l0k8n
2203G49J6K5K6K7K2Lk0k9j7MJ9K0Roj2p%krj0%O%rj2qrj3j4qjNJ4K4K4J1rj9j3jRJ5J1Jj3
2198G99k1j1J3L3L5K1QNLlj2j5j3j1rnJMJoj0pkkj0k0j9j0JLjLJ6K4K4K2K2J8Kj4j8rlkLJ4
2192H42K0J3lj6k7l3k7oJ7K4RokJ4K5K4K3K8K9K1J1J0Qpl0l6k0LJ4J1OPJ2J9K6K7J2qj9j2
2187A003jJj1j9j7lQJ1PNLkrp%Omj7k0oOMkjJ0J1JnMK1K4J3lj2j7j8j4rqpJJ4J7LjJ2K9J9
$$ plain form
2181 1020 1012 990 977 975 972 968 969 974 975 974 985 1014 1045 1064 1069 1059 1035 1011 1009 1039 1080 1100 1092 1068 1043 1021 1000 985 980 980 985 998 1028 1070 1108 1128 1130 1127 1125 1118 1098 1064 1031
2176 1031 1012 1015 1036 1064 1080 1078 1064 1050 1040 1028 1017 1019 1042 1078 1112 1137 1151 1153 1140 1119 1098 1083 1078 1084 1099 1119 1134 1137 1124 1099 1073 1058 1056 1060 1062 1064 1067 1065 1055 1045 1046
2171 1046 1055 1064 1071 1082 1100 1113 1112 1102 1096 1102 1123 1162 1210 1247 1252 1227 1203 1205 1231 1260 1280 1295 1306 1307 1287 1252 1218 1198 1194 1200 1207 1215 1229 1254 1288 1317 1332 1336 1338 1341 1340 1332 1323 1317
2166 1317 1319 1332 1351 1357 1337 1301 1274 1268 1272 1270 1264 1266 1275 1284 1289 1291 1290 1278 1254 1221 1187 1162 1160 1182 1212 1226 1222 1216 1224 1249 1279 1305 1313 1299 1268 1235 1219 1225 1244 1265 1280 1289 1301 1316
2160 1316 1325 1323 1314 1310 1312 1312 1309 1308 1314 1328 1343 1354 1358 1356 1353 1356 1362 1363 1357 1344 1324 1301 1287 1291 1310 1327 1334 1335 1337 1339 1335 1326 1310 1293 1289 1303 1326 1341 1344 1341 1338 1335 1339 1360 1394 1420 1429 1431 1441 1455
2154 1455 1459 1449 1433 1412 1391 1383 1398 1427 1445 1447 1443 1442 1443 1447 1461 1483 1499 1503 1501 1500 1495 1482 1471 1472 1483 1490 1486 1477 1472 1473 1475 1474 1466 1455 1448 1456 1482 1516 1543 1550 1542 1527 1512 1498 1487 1481 1481
2148 1481 1483 1482 1483 1491 1509 1527 1538 1543 1548 1555 1567 1582 1594 1602 1609 1616 1621 1615 1596 1572 1554 1544 1544 1558 1590 1630 1662 1673 1665 1653 1647 1645 1641 1630 1618 1613 1618 1627 1633 1639 1649 1661 1669 1677 1690 1710
2143 1710 1724 1721 1702 1677 1650 1623 1601 1597 1614 1639 1657 1663 1661 1652 1634 1606 1574 1546 1528 1525 1542 1575 1608 1625 1631 1641 1667 1702 1736 1761 1770 1758 1730 1707 1705 1720 1730 1724 1708
$$ packed form
2181A020qk2j3klmJNJjJ1K9L1J9Nj0k4k4kL0M1K0qk4k5k2k1j5n%NJ3L0M2L8K0Klkpk0l4l3
2176A031j9LK1K8J6kj4j4j0j2j1KK3L6L4K5J4Kj3k1k1j5nOJ5K0J5Lj3k5k6j5kMKKLkj0j0J
2171A046RRPJ1J8J3jj0oOK1L9M8L7Nk5k4KK6K9K0J5J1Jk0l5l4k0mOPQJ4K5L4K9J5MKLjqro
2166A317KJ3J9Ok0l6k7oMkoKRRNKjj2k4l3l4k5kK2L0J4moQK5L0K6Qj4l1l3j6OJ9K1J5RJ2J5
2160A316RkrmK%ljOJ4J5J1MklLOJoj3k0k3j4MJ9J7PJKKmrj6j7mJ4K3J5LlllMK1L4K6RKJ0J4
2154A455Mj0j6k1k1qJ5K9J8KmjJMJ4K2J6Mkjnj3j1JJ1PmrnJKjqj1pQK6L4K7Pqj5j5j4j1o%
2148A481KjJQJ8J8J1NNPJ2J5J2QPPNoj9k4j8j0%J4L2M0L2J1qj2okmj1j2nNROOJ0J2QQJ3K0
2143A710J4lj9k5k7k7k2mJ7K5J8Okrj8k8l2k8j8lJ7L3L3J7OJ0K6L5L4K5Rj2k8k3kJ5J0oj6
$$ plain form
2138 1708 1699 1703 1723 1754 1781 1791 1785 1779 1786 1794 1789 1772 1759 1763 1778 1799 1823 1848 1866 1876 1884 1892 1893 1880 1856 1831 1814 1809 1816 1829 1837 1837 1840 1859 1888 1909 1911 1903 1898 1899 1899 1894 1886 1879 1881 1896 1919
2132 1919 1940 1946 1941 1939 1952 1980 2016 2048 2062 2053 2030 2007 1995 1991 1984 1967 1944 1927 1925 1936 1952 1972 2002 2044 2085 2104 2096 2076 2058 2044 2028 2014 2014 2029 2046 2053 2055 2063 2077 2092
2127 2092 2106 2121 2136 2143 2137 2128 2124 2126 2130 2141 2157 2166 2159 2142 2133 2136 2137 2129 2124 2133 2153 2170 2182 2197 2219 2243 2259 2260 2246 2231 2229 2243 2257 2259 2255 2259 2272 2280 2276 2270 2276 2298 2320 2327 2316 2306
2122 2306 2314 2339 2355 2349 2334 2336 2361 2391 2403 2397 2384 2373 2366 2363 2365 2375 2391 2409 2418 2414 2406 2407 2418 2425 2422 2420 2429 2444 2450 2450 2451 2457 2462 2470 2496 2533 2556 2546 2514 2494 2502 2527 2548 2552 2541 2530
2116 2530 2529 2543 2570 2600 2622 2631 2623 2600 2575 2558 2552 2555 2567 2588 2612 2627 2631 2639 2667 2710 2746 2760 2759 2757 2761 2769 2773 2775 2782 2800 2828 2851 2857 2851 2853 2869 2882 2877 2856 2835 2825 2827 2840 2864
2111 2864 2895 2929 2962 2988 2998 2993 2986 2992 3006 3015 3020 3029 3042 3041 3015 2978 2950 2936 2937 2954 2988 3027 3061 3085 3104 3115 3114 3101 3092 3097 3117 3147 3174 3191 3193 3187 3186 3200 3228 3264 3305
2106 3305 3351 3400 3443 3470 3479 3483 3497 3523 3549 3568 3581 3598 3623 3653 3681 3704 3723 3742 3769 3813 3870 3938 4014 4097 4183 4272 4364 4463 4568 4682 4819 4998 5220
2102 5220 5468 5725 5993 6291 6641 7053 7525 8043 8590 9151 9727 10317 10912 11493 12035 12516 12911 13197 13361 13401 13326 13138 12836 12435
$$ packed form
2138A708rMK0L1K7J0ooPQnj7j3MJ5K1K4K5J8J0QQJj3k4k5j7nPJ3Q%LJ9K9K1KqnJ%nqpKJ5K3
2132A919K1OnkJ3K8L6L2J4rk3k3j2mpj7k3j7kJ1J6K0L0M2M1J9qk0j8j4j6j4%J5J7PKQJ4J5
2127B092J4J5J5PormKMJ1J6Rpj7rLJqnRK0J7J2J5K2K4J6Jj4j5kJ4J4KmMJ3QmoOK2K2Pj1j0
2122B306QK5J6oj5KK5L0J2oj3j1plKJ0J6J8RmqJJ1PlkRJ5O%JONQK6L7K3j0l2k0QK5K1Mj1j1
2116B530jJ4K7L0K2Rqk3k5j7oLJ2K1K4J5MQK8M3L6J4jkMQMKPJ8K8K3OoKJ6J3nk1k1j0KJ3K4
2111B864L1L4L3K6J0npOJ4RNRJ3jk6l7k8j4JJ7L4L9L4K4J9J1jj3rNK0L0K7J7KojJ4K8L6M1
2106C305M6M9M3K7RMJ4K6K6J9J3J7K5L0K8K3J9J9K7M4N7O8P6Q3Q6Q9R2R9J05J14J37J79K22
2102E220K48K57K68K98L50M12M72N18N47N61N76N90N95N81N42M81L95K86J64M0p5j88l02m01
$$ plain form
2099 12435 11960 11441 10897 10344 9797 9273 8780 8317 7887 7496 7151 6846 6574 6326 6102 5908 5748 5615 5489 5361 5236 5129 5041
2096 5041 4964 4897 4845 4804 4764 4718 4672 4631 4599 4578 4570 4562 4539 4506 4485 4493 4515 4529 4526 4512 4491 4462 4426 4394 4374 4368 4375 4390 4405 4417 4434 4457 4475 4475 4464 4465 4483 4505
2091 4505 4520 4533 4546 4550 4537 4518 4505 4503 4513 4538 4578 4624 4662 4689 4706 4721 4739 4767 4803 4836 4856 4863 4868 4878 4903 4940 4975 4993 4989 4978 4975 4984 4997 5004 5004 5002 5011 5039 5072 5088
2086 5088 5080 5069 5071 5080 5080 5071 5063 5061 5063 5072 5094 5122 5138 5136 5124 5118 5122 5135 5148 5151 5141 5135 5152 5190 5232 5263 5296 5342 5394 5431 5441 5435 5429 5435 5458 5493 5534 5576 5615 5643 5641 5602 5549
2081 5549 5519 5526 5550 5563 5565 5572 5593 5620 5638 5645 5651 5665 5687 5714 5743 5776 5809 5835 5848 5847 5848 5864 5896 5934 5965 5983 5993 6006 6031 6070 6114 6151 6179 6209 6248 6291 6329 6352
2076 6352 6359 6353 6348 6361 6400 6448 6484 6498 6501 6510 6524 6540 6561 6593 6636 6677 6706 6724 6742 6764 6794 6830 6863 6884 6892 6899 6911 6924 6931 6937 6954 6985 7014 7035 7054 7081 7113 7143 7175
2072 7175 7224 7285 7339 7372 7393 7423 7464 7510 7556 7600 7638 7662 7674 7682 7698 7726 7767 7817 7865 7902 7935 7970 8000 8011 8008 8013 8041 8075 8096 8106 8124 8151 8173 8185 8202 8236
2067 8236 8282 8322 8352 8382 8418 8455 8482 8501 8521 8548 8575 8600 8632 8685 8753 8814 8851 8875 8902 8939 8979 9019 9059 9097 9135 9180 9243 9321 9395 9453 9501 9551 9605 9656
$$ packed form
2099A2435m75n19n44n53n47n24m93m63m30l91l45l05k72k48k24j94j60j33j26j28j25j07q8
2096E041p7o7n2m1m0m6m6m1l2k1qqk3l3k1QK2J4lj4k1k9l6l2k0oPJ5J5J2J7K3J8%j1JJ8K2
2091D505J5J3J3Mj3j9j3kJ0K5M0M6L8K7J7J5J8K8L6L3K0PNJ0K5L7L5J8mj1lRJ3P%kRK8L3J6
2086E088qj1KR%rqkKRK2K8J6kj2oMJ3J3Lj0oJ7L8M2L1L3M6N2L7J0ooOK3L5M1M2L9K8kl9n3
2081E549l0PK4J3KPK1K7J8POJ4K2K7K9L3L3K6J3jJJ6L2L8L1J8J0J3K5L9M4L7K8L0L9M3L8K3
2076F352PonJ3L9M8L6J4LRJ4J6K1L2M3M1K9J8J8K2L0L6L3K1QPJ2J3POJ7L1K9K1J9K7L2L0L2
2072G175M9O1N4L3K1L0M1M6M6M4L8K4J2QJ6K8M1N0M8L7L3L5L0J1lNK8L4K1J0J8K7K2J2J7L4
2067H236M6M0L0L0L6L7K7J9K0K7K7K5L2N3O8O1L7K4K7L7M0M0M0L8L8M5O3P8P4N8M8N0N4N1
$$ plain form
2063 9656 9695 9722 9745 9773 9808 9849 9884 9914 9948 9995 10053 10106 10141 10160 10178 10209 10261 10326 10392 10452 10504 10552 10599 10653 10721 10800 10880 10951 11013 11071 11128 11184 11235 11276
2059 11276 11315 11362 11424 11501 11581 11655 11721 11780 11836 11893 11951 12017 12097 12196 12301 12393 12465 12521 12568 12605 12636 12680 12750 12833 12903 12958 13019 13098 13183 13258 13325 13398 13481
2055 13481 13562 13634 13696 13761 13836 13921 14009 14095 14183 14283 14398 14522 14646 14762 14868 14968 15078 15210 15358 15503 15635 15760 15882 15997 16100 16195
2052 16195 16284 16361 16424 16489 16576 16686 16806 16924 17046 17179 17318 17460 17602 17747 17895 18043 18191 18338 18481 18611 18722 18826 18945 19089
2049 19089 19245 19395 19528 19644 19744 19830 19914 20009 20106 20188 20257 20336 20440 20558 20675 20790 20908 21023 21134 21256 21403 21568 21737 21903 22080
2046 22080 22272 22472 22677 22886 23098 23321 23560 23812 24060 24291 24517 24757 25003 25237 25459 25692 25946 26207 26468 26733 27007 27281 27550
2043 27550 27821 28104 28402 28721 29065 29420 29763 30089 30425 30780 31132 31457 31764 32079 32405 32734 33074 33442 33842 34258 34681 35111 35546
2040 35546 35986 36448 36946 37469 37994 38519 39062 39628 40201 40779 41382 42028 42710 43422 44177 44995 45875 46803 47768 48771 49804 50862
$$ packed form
2063I656L9K7K3K8L5M1L5L0L4M7N8N3L5J9J8L1N2O5O6O0N2M8M7N4O8P9Q0P1O2N8N7N6N1M1
2059A1276L9M7O2P7Q0P4O6N9N6N7N8O6Q0R9J05R2P2N6M7L7L1M4P0Q3P0N5O1P9Q5P5O7P3Q3
2055A3481Q1P2O2O5P5Q5Q8Q6Q8J00J15J24J24J16J06J00J10J32J48J45J32J25J22J15J03R5
2052A6195Q9P7O3O5Q7J10J20J18J22J33J39J42J42J45J48J48J48J47J43J30J11J04J19J44
2049A9089J56J50J33J16J00Q6Q4R5R7Q2O9P9J04J18J17J15J18J15J11J22J47J65J69J66J77
2046B2080J92K00K05K09K12K23K39K52K48K31K26K40K46K34K22K33K54K61K61K65K74K74K69
2043B7550K71K83K98L19L44L55L43L26L36L55L52L25L07L15L26L29L40L68M00M16M23M30M35
2040C5546M40M62M98N23N25N25N43N66N73N78O03O46O82P12P55Q18Q80R28R65J003J033J058
$$ plain form
2037 50862 51950 53084 54273 55514 56803 58129 59483 60865 62284 63756 65287 66888 68584 70404 72366 74478 76756
2035 76756 79228 81921 84844 88006 91438 95188 99308 103833 108794 114236 120226 126848 134188 142336 151399 161515 172841
2033 172841 185547 199816 215876 234007 254541 277859 304414 334759 369557 409591 455768 509121 570769 641826
2032 641826 723268 815746 919349 1033358 1156066 1284725 1415651 1544428 1666188 1775903 1868728 1940381
2030 1940381 1987577 2008383 2002390 1970635 1915352 1839669 1747351 1642560 1529599 1412607 1295268 1180617 1070989
2029 1070989 968079 873027 786483 708651 639374 578241 524683 478015 437473 402248 371550 344663 320973
2027 320973 299969 281241 264461 249363 235723 223368 212167 202015 192807 184440 176825 169886 163555 157766 152463
2025 152463 147603 143142 139024 135203 131656 128376 125335 122493 119825 117335 115032 112905 110933 109110 107435 105904 104507
$$ packed form
2037E0862J088J134J189J241J289J326J354J382J419J472J531J601J696J820J962K112K278
2035G6756K472K693K923L162L432L750M120M525M961N442N990O622P340Q148R063J0116J1326
2033A72841J2706J4269J6060J8131K0534K3318K6555L0345L4798M0034M6177N3353O1648P1057
2032F41826Q1442R2478J03603J14009J22708J28659J30926J28777J21760J09715R2825P1653
2030A940381M7196K0806n993l1755n5283p5683r2318j04791j12961j16992j17339j14651j09628
2029A070989j02910r5052q6544p7832o9277o1133n3558m6668m0542l5225l0698k6887k3690
2027C20973k1004j8728j6780j5098j3640j2355j1201j0152r208q367p615o939o331n789n303
2025A52463m860m461m118l821l547l280l041k842k668k490k303k127j972j823j675j531j397
$$ plain form
2023 104507 103245 102120 101123 100226 99407 98667 98019 97463 96991 96592 96257 95978 95752 95582 95475 95442 95500 95670 95967 96399 96979 97734
2020 97734 98698 99897 101350 103080 105129 107534 110297 113371 116687 120168 123726 127241 130557 133515 135979 137838 139008
2018 139008 139440 139140 138159 136566 134445 131901 129073 126103 123101 120139 117273 114564 112069 109823 107836 106099 104598 103321
2016 103321 102251 101360 100625 100034 99581 99246 98993 98786 98619 98509 98471 98495 98555 98629 98717 98833 98989 99182 99398 99620 99845 100076 100317 100573
2013 100573 100848 101143 101446 101744 102036 102340 102669 103015 103357 103688 104021 104374 104752 105145 105541 105935 106325 106713 107105 107509 107923 108339
2010 108339 108754 109175 109601 110020 110412 110778 111136 111505 111881 112250 112604 112946 113281 113613 113939 114255 114562 114867 115180 115498 115805 116088
2008 116088 116351 116606 116865 117130 117397 117661 117918 118157 118371 118557 118726 118897 119080 119273 119463 119640 119799 119935 120050 120145 120229 120308 120384 120450
2005 120450 120496 120523 120540 120557 120566 120548 120496 120429 120375 120343 120316 120274 120210 120125 120016 119878 119724 119577 119445 119313 119152 118952 118734 118527 118344 118164 117960
$$ packed form
2023A04507j262j125r97q97q19p40o48n56m72l99l35k79k26j70j07l3N8J70K97M32N80P55
2020I7734R64J199J453J730K049K405K763L074L316L481L558L515L316K958K464J859J170
2018A39008M32l00r81j593k121k544k828k970l002k962k866k709k495k246j987j737j501j277
2016A03321j070q91p35n91m53l35k53k07j67j10l8K4O0P4Q8J16J56J93K16K22K25K31K41K56
2013A00573K75K95L03K98K92L04L29L46L42L31L33L53L78L93L96L94L90L88L92M04M14M16
2010A08339M15M21M26M19L92L66L58L69L76L69L54L42L35L32L26L16L07L05L13L18L07K83
2008A16088K63K55K59K65K67K64K57K39K14J86J69J71J83J93J90J77J59J36J15R5Q4P9P6O6
2005A20450M6K7J7J7Rj8n2o7n4l2k7m2o4q5j09j38j54j47j32j32j61k00k18k07j83j80k04
$$ plain form
2002 117960 117721 117460 117192 116917 116635 116349 116063 115766 115446 115113 114786 114466 114130 113762 113371 112986 112613 112234 111825 111383 110926 110474
1999 110474 110033 109602 109178 108757 108324 107869 107395 106915 106436 105951 105454 104954 104460 103967 103461 102937 102400 101857 101316 100782 100250 99708
1996 99708 99149 98582 98023 97470 96921 96379 95858 95352 94836 94289 93713 93127 92553 92002 91470 90943 90404 89846 89277 88703 88122 87535 86954
1993 86954 86391 85843 85295 84737 84166 83584 82996 82415 81857 81327 80813 80302 79785 79259 78722 78180 77642 77115 76603 76092 75566 75020 74467
1991 74467 73927 73407 72897 72386 71877 71373 70871 70368 69867 69373 68888 68413 67947 67485 67020 66549 66082 65622 65166 64712 64266 63830 63393
1988 63393 62941 62478 62017 61567 61123 60676 60227 59778 59337 58906 58489 58079 57670 57261 56857 56461 56069 55680 55296 54917 54539 54158 53778
1985 53778 53402 53027 52647 52263 51878 51493 51106 50722 50352 49999 49652 49295 48924 48555 48206 47880 47563 47250 46941 46635 46320 45991 45659
1982 45659 45336 45021 44708 44403 44120 43846 43555 43239 42918 42614 42327 42048 41781 41534 41294 41036 40748 40446 40149 39868 39595 39320 39037
$$ packed form
2002A17960k39k61k68k75k82k86k86k97l20l33l27l20l36l68l91l85l73l79m09m42m57m52
1999A10474m41m31m24m21m33m55m74m80m79m85m97n00m94m93n06n24n37n43n41n34n32n42
1996I9708n59n67n59n53n49n42n21n06n16n47n76n86n74n51n32n27n39n58n69n74n81n87n81
1993H6954n63n48n48n58n71n82n88n81n58n30n14n11n17n26n37n42n38n27n12n11n26n46n53
1991G4467n40n20n10n11n09n04n02n03n01m94m85m75m66m62m65m71m67m60m56m54m46m36m37
1988F3393m52m63m61m50m44m47m49m49m41m31m17m10m09m09m04l96l92l89l84l79l78l81l80
1985E3778l76l75l80l84l85l85l87l84l70l53l47l57l71l69l49l26l17l13l09l06l15l29l32
1982D5659l23l15l13l05k83k74k91l16l21l04k87k79k67k47k40k58k88l02k97k81k73k75k83
$$ plain form
1979 39037 38748 38462 38192 37940 37698 37457 37213 36965 36713 36459 36204 35951 35701 35455 35212 34969 34720 34469 34225 33998 33792 33603 33420
1976 33420 33230 33022 32794 32560 32341 32146 31962 31770 31572 31376 31187 30994 30790 30582 30381 30188 30000 29817 29639 29458 29269 29081 28910
1974 28910 28753 28587 28398 28194 27995 27812 27638 27471 27311 27160 27012 26860 26707 26557 26411 26268 26128 25987 25843 25697 25551 25405 25254
1971 25254 25103 24963 24839 24722 24596 24453 24301 24147 24000 23868 23750 23635 23512 23379 23245 23116 22990 22866 22743 22619 22487 22345 22204
1968 22204 22075 21953 21826 21693 21565 21447 21333 21222 21117 21017 20918 20821 20729 20641 20548 20444 20339 20242 20149 20049 19939 19824 19712 19606 19507
1965 19507 19415 19324 19232 19149 19081 19014 18928 18827 18736 18664 18598 18522 18442 18372 18305 18225 18139 18069 18028 18005 17986 17975 17984 18008 18032 18049 18070 18111 18177 18260 18359 18482 18644
1961 18644 18852 19099 19373 19671 20007 20393 20832 21313 21821 22342 22859 23349 23790 24161 24446 24626 24681 24607 24420 24141 23777 23331 22816
1958 22816 22253 21660 21042 20407 19777 19180 18626 18112 17634 17198 16807 16457 16132 15822 15533 15275 15056 14874 14723 14598 14487 14372 14242
$$ packed form
1979C9037k89k86k70k52k42k41k44k48k52k54k55k53k50k46k43k43k49k51k44k27k06j89j83
1976C3420j90k08k28k34k19j95j84j92j98j96j89j93k04k08k01j93j88j83j78j81j89j88j71
1974B8910j57j66j89k04j99j83j74j67j60j51j48j52j53j50j46j43j40j41j44j46j46j46j51
1971B5254j51j40j24j17j26j43j52j54j47j32j18j15j23j33j34j29j26j24j23j24j32j42j41
1968B2204j29j22j27j33j28j18j14j11j05j00r9r7r2q8r3j04j05r7r3j00j10j15j12j06r9
1965A9507r2r1r2q3o8o7q6j01r1p2o6p6q0p0o7q0q6p0m1k3j9j1RK4K4J7K1M1O6Q3R9J23J62
1961A8644K08K47K74K98L36L86M39M81N08N21N17M90M41L71K85J80N5p4j87k79l64m46n15
1958B2816n63n93o18o35o30n97n54n14m78m36l91l50l25l10k89k58k19j82j51j25j11j15j30
$$ plain form
1955 14242 14099 13954 13817 13693 13582 13480 13376 13264 13155 13068 13000 12927 12828 12711 12603 12517 12447 12383 12322 12263 12207 12149 12087 12019 11949 11883 11823 11769
1952 11769 11717 11665 11615 11572 11542 11520 11492 11447 11385 11314 11235 11149 11066 11000 10955 10919 10883 10848 10816 10784 10751 10719 10687 10646 10594 10541 10500 10465 10431 10406 10395 10389 10371 10339
1948 10339 10302 10263 10215 10163 10123 10100 10080 10052 10014 9969 9910 9835 9758 9696 9646 9598 9542 9480 9416 9351 9289 9236 9195 9167 9142 9108 9061 9010 8967 8937 8912 8882 8848 8810
1944 8810 8767 8719 8670 8623 8572 8517 8468 8437 8419 8401 8375 8349 8330 8314 8292 8254 8203 8151 8109 8080 8057 8038 8028 8028 8029 8011 7971 7927 7891 7861 7823 7775 7725 7686 7662
1939 7662 7652 7647 7638 7619 7594 7565 7532 7493 7452 7417 7388 7365 7343 7322 7303 7288 7280 7273 7255 7216 7161 7111 7087 7084 7083 7069 7040 7000 6948 6887 6833 6796 6774 6752 6731 6718 6715 6709
1935 6709 6694 6676 6664 6651 6626 6591 6565 6556 6551 6537 6519 6513 6519 6523 6509 6481 6447 6414 6385 6363 6347 6328 6300 6263 6227 6198 6172 6148 6129 6119 6107 6085 6049 6000 5942 5884 5841
1930 5841 5821 5814 5809 5807 5811 5809 5786 5747 5719 5713 5717 5712 5697 5680 5663 5644 5631 5634 5645 5653 5655 5649 5635 5612 5589 5576 5565 5541 5502 5463 5434 5412 5388 5363 5339 5316 5297 5284 5271 5240
1925 5240 5193 5151 5132 5123 5103 5079 5072 5088 5108 5117 5124 5138 5149 5139 5112 5083 5060 5033 4996 4954 4920 4894 4869 4840 4811 4789 4774 4765 4763 4768 4775 4775 4761 4740 4721 4703 4676 4633 4586
$$ packed form
1955A4242j43j45j37j24j11j02j04j12j09q7o8p3r9j17j08q6p0o4o1n9n6n8o2o8p0o6o0n4
1952A1769n2n2n0m3l0k2k8m5o2p1p9q6q3o6m5l6l6l5l2l2l3l2l2m1n2n3m1l5l4k5j1oj8l2
1948A0339l7l9m8n2m0k3k0k8l8m5n9p5p7o2n0m8n6o2o4o5o2n3m1k8k5l4m7n1m3l0k5l0l4l8
1944H810m3m8m9m7n1n5m9l1j8j8k6k6j9j6k2l8n1n2m2k9k3j9j0%Jj8m0m4l6l0l8m8n0l9k4
1939G662j0nrj9k5k9l3l9m1l5k9k3k2k1j9j5qpj8l9n5n0k4ljj4k9m0n2o1n4l7k2k2k1j3lo
1935F709j5j8j2j3k5l5k6rnj4j8oOMj4k8l4l3k9k2j6j9k8l7l6k9k6k4j9j0j2k2l6m9n8n8m3
1930E841k0pnkMkk3l9k8oMnj5j7j7j9j3LJ1QKoj4k3k3j3j1k4l9l9k9k2k4k5k4k3j9j3j3l1
1925E240m7m2j9rk0k4pJ6K0RPJ4J1j0k7k9k3k7l7m2l4k6k5k9k9k2j5rkNP%j4k1j9j8k7m3m7
$$ plain form
1920 4586 4550 4530 4512 4490 4474 4477 4496 4516 4523 4519 4510 4500 4489 4479 4474 4478 4486 4492 4489 4477 4467 4465 4471 4475 4469 4450 4420 4384 4349 4326 4324 4334 4341 4332 4307 4279 4261 4258 4260 4253 4233 4207 4192 4191
1915 4191 4189 4164 4113 4055 4016 4002 4003 4005 4005 4003 4002 4000 4002 4006 4010 4010 4005 3999 3996 4004 4024 4050 4068 4071 4068 4079 4107 4136 4146 4129 4096 4071 4067 4079 4085 4069 4037 4008 3996 3996 3996 3985 3956 3909 3861
1910 3861 3827 3809 3787 3748 3700 3658 3634 3628 3636 3645 3644 3631 3617 3607 3599 3586 3570 3555 3536 3511 3485 3467 3454 3443 3435 3431 3419 3397 3377 3370 3373 3368 3352 3333 3317 3302 3294 3301 3329 3367
1905 3367 3400 3421 3427 3422 3417 3422 3426 3408 3363 3309 3272 3253 3240 3225 3211 3203 3199 3198 3198 3198 3197 3192 3183 3174 3166 3160 3150 3135 3115 3098 3090 3094 3107 3115 3103 3075 3052 3044 3041 3032 3023 3030 3048 3057 3048 3036 3025
1899 3025 3003 2962 2920 2896 2892 2893 2891 2890 2893 2903 2921 2940 2952 2950 2943 2939 2938 2940 2947 2957 2959 2944 2919 2892 2864 2829 2795 2776 2770 2759 2734 2711 2711 2737 2772 2801 2823 2843 2863 2876 2877 2869
1894 2869 2860 2853 2849 2851 2862 2873 2866 2827 2762 2693 2644 2625 2626 2629 2626 2622 2626 2629 2619 2600 2597 2618 2647 2668 2678 2679 2667 2645 2629 2638 2664 2686 2696 2696 2687 2667 2645 2636 2641 2639 2616 2586 2567 2559
1888 2559 2554 2549 2551 2562 2570 2561 2535 2509 2497 2495 2488 2476 2476 2496 2516 2510 2483 2461 2457 2458 2448 2433 2424 2422 2419 2415 2411 2407 2404 2410 2430 2463 2505 2552 2598 2636 2667 2706 2765 2840 2917 2999 3095 3201
1883 3201 3291 3337 3329 3280 3212 3138 3058 2969 2872 2775 2688 2615 2552 2496 2442 2393 2354 2325 2302 2281 2259 2236 2205 2167 2140 2141 2170 2200 2217 2227 2244 2262 2269 2269 2277 2296 2316
$$ packed form
1920D586l6k0j8k2j6LJ9K0Pmrj0j1j0nMQOlj2j0kOMoj9l0l6l5k3kJ0Prk5k8j8lKpk0k6j5j
1915D191kk5n1n8l9j4JK%kjkKMM%nolQK0K6J8LlJ1K8K9J0j7l3k5mJ2Oj6l2k9j2%%j1k9m7m8
1910C861l4j8k2l9m8m2k4oQRjj3j4j0qj3j6j5j9k5k6j8j3j1qmj2k2k0pLnj6j9j6j5qPK8L8
1905C367L3K1OnnNMj8m5n4l7j9j3j5j4qmj%%jnrrqoj0j5k0j7qMJ3Qj2k8k3qlrrPJ8Rrj2j1
1899C025k2m1m2k4mJkjLJ0J8J9J2kpmjKPJ0Kj5k5k7k8l5l4j9oj1k5k3%K6L5K9K2K0K0J3Jq
1894B869rpmKJ1J1pl9o5o9m9j9JLlmMLj0j9lK1K9K1J0Jj2k2j6RK6K2J0%rk0k2rNkk3l0j9q
1888B559nnKJ1Qrk6k6j2kpj2%K0K0ok7k2mJj0j5rklmmmlOK0L3M2M7M6L8L1L9N9P5P7Q2R6J06
1883C201R0M6qm9o8p4q0q9r7r7q7p3o3n6n4m9l9k9k3k1k2k3l1l8k7JK9L0J7J0J7J8P%QJ9K0
$$ plain form
1879 2316 2328 2330 2319 2288 2244 2209 2199 2208 2217 2222 2226 2235 2246 2257 2269 2280 2283 2277 2273 2286 2321 2364 2399 2417 2419 2407 2387 2362 2336 2308 2275 2241 2212 2190 2170 2144 2122 2119 2140 2169
1874 2169 2186 2183 2171 2166 2163 2148 2113 2069 2031 2000 1973 1951 1938 1935 1933 1925 1914 1902 1885 1865 1849 1849 1866 1891 1917 1941 1955 1953 1938 1916 1894 1872 1852 1840 1845 1869 1903 1934 1947
1869 1947 1937 1908 1876 1856 1861 1882 1902 1908 1906 1910 1925 1942 1956 1968 1974 1969 1954 1942 1939 1934 1919 1899 1882 1863 1832 1801 1794 1820 1859 1886 1887 1864 1822 1772 1730 1708 1706 1710 1712 1711 1704 1691
1864 1691 1672 1651 1634 1624 1621 1625 1638 1663 1689 1700 1689 1671 1662 1667 1677 1689 1709 1739 1763 1766 1748 1721 1695 1669 1644 1622 1608 1603 1602 1600 1596 1595 1599 1607 1611 1606 1595 1581 1570 1561 1549 1527
1859 1527 1495 1468 1459 1470 1489 1501 1505 1507 1512 1512 1502 1490 1493 1518 1549 1560 1545 1521 1514 1526 1545 1563 1585 1611 1628 1628 1614 1602 1604 1620 1643 1667 1687 1705 1724 1745 1765 1783 1806
1854 1806 1841 1882 1917 1936 1942 1940 1935 1930 1927 1929 1933 1935 1934 1933 1936 1945 1961 1990 2030 2068 2086 2081 2067 2059 2050 2025 1978 1922 1873 1833 1800 1772 1745 1717 1690 1672 1661 1648 1621 1585 1553 1533
1849 1533 1524 1520 1512 1497 1478 1464 1467 1484 1503 1514 1515 1511 1504 1497 1500 1520 1549 1571 1572 1560 1552 1558 1564 1554 1523 1488 1467 1463 1462 1451 1437 1436 1449 1457 1443 1411 1382 1369 1370 1376 1380 1380 1379 1385 1399 1411
1843 1411 1408 1392 1378 1374 1372 1367 1366 1380 1404 1425 1435 1440 1444 1445 1441 1434 1432 1444 1468 1497 1520 1535 1553 1582 1624 1675 1733 1788 1830 1855 1869 1879 1887 1892 1903 1916 1919 1905 1880 1853 1823
$$ packed form
1879B316J2Kj1l1m4l5j0RRNMRJ1J1J2J1LomJ3L5M3L5J8Kj2k0k5k6k8l3l4k9k2k0k6k2lK1K9
1874B169J7lj2nlj5l5m4l8l1k7k2j3lkqj1j2j7k0j6%J7K5K6K4J4kj5k2k2k2k0j2NK4L4L1J3
1869A947j0k9l2k0NK1K0OkMJ5J7J4J2Onj5j2lnj5k0j7j9l1l1pK6L9K7Jk3m2n0m2k2kMKjpj3
1864A691j9k1j7j0lMJ3K5K6J1j1j8rNJ0J2K0L0K4Lj8k7k6k6k5k2j4njkmjMQMnj1j4j1rj2k2
1859A527l2k7rJ1J9J2MKN%j0j2LK5L1J1j5k4pJ2J9J8K2K6J7%j4j2KJ6K3K4K0J8J9K1K0J8K3
1854A806L5M1L5J9OknnlKMKjjLRJ6K9M0L8J8nj4qrk5m7n6m9m0l3k8k7k8k7j8j1j3k7l6l2k0
1849A533rmqj5j9j4LJ7J9J1JmppLK0K9K2Jj2qOOj0l1l5k1mjj1j4jJ3Qj4l2k9j3JOM%jOJ4J2
1843A411lj6j4mknjJ4K4K1J0NMJmpkJ2K4K9K3J5J8K9M2N1N8N5M2K5J4J0QNJ1J3Lj4k5k7l0
$$ plain form
1838 1823 1786 1753 1733 1713 1676 1624 1578 1544 1510 1473 1450 1445 1440 1423 1401 1388 1380 1368 1358 1354 1350 1330 1292 1245 1195 1157 1150 1172 1197 1200 1188 1188 1215 1257 1298 1329 1342 1334 1318
1833 1318 1308 1306 1301 1291 1276 1259 1236 1216 1210 1212 1203 1172 1134 1107 1094 1089 1083 1072 1059 1054 1073 1107 1132 1134 1121 1111 1109 1103 1091 1080 1080 1100 1135 1174 1199 1201 1189 1174 1161 1147 1135
1828 1135 1135 1150 1171 1181 1173 1151 1131 1133 1161 1203 1231 1230 1210 1192 1189 1196 1204 1212 1216 1207 1188 1170 1164 1157 1132 1092 1060 1043 1028 1009 1005 1029 1065 1082 1077 1065 1059 1053 1049 1061 1090 1118 1125
1823 1125 1117 1110 1109 1103 1085 1065 1056 1062 1072 1072 1056 1033 1016 1008 1003 999 999 1004 1009 1005 989 966 948 940 940 935 925 921 929 938 935 926 927 939 945 936 924 925 942 966 992 1017 1034 1040 1036 1028 1020 1011 997 980
1817 980 966 960 961 960 945 922 907 913 938 974 1013 1046 1066 1074 1076 1075 1068 1056 1042 1028 1013 997 984 977 972 964 958 957 965 984 1013 1041 1057 1063 1069 1075 1068 1044 1019 1003 995 988 987 992 990 973
1811 973 952 947 962 981 990 987 977 962 957 970 999 1029 1046 1046 1026 990 950 924 918 927 934 929 915 908 923 957 983 984 965 946 938 937 941 954 969 972 951 914 877 851 840 846 869
1806 869 902 935 954 955 945 936 929 918 902 896 900 899 878 845 829 840 864 883 894 907 933 968 990 986 965 951 955 966 965 950 932 919 912 919 940 960 962 951 945 946 938 914
1801 914 880 850 827 812 803 798 795 801 819 841 852 862 889 930 954 949 933 929 938 949 965 987 1000 990 970 971 1001 1039 1067 1092 1128 1169 1202 1225 1253 1304 1387 1494
$$ packed form
1838A823l7l3k0k0l7n2m6l4l4l7k3nnj7k2j3qj2j0mmk0l8m7n0l8pK2K5Lj2%K7M2M1L1J3qj6
1833A318j0knj0j5j7k3k0oKrl1l8k7j3noj1j3nJ9L4K5Kj3j0koj2j1%K0L5L9K5Kj2j5j3j4j2
1828A135%J5K1J0qk2k0KK8M2K8jk0j8lPQQMrj9j8opk5m0l2j7j5j9mK4L6J7nj2oomJ2K9K8P
1823A125qpjoj8k0rOJ0%j6k3j7qnm%NNmj6k3j8q%nj0mQRlrJJ2Orj2JJ7K4K6K5J7Omqqrj4j7
1817I80j4oJjj5k3j5OK5L6L9L3K0QKjpj2j4j4j5j6j3pnqojQJ9K9K8J6OOOpk4k5j6qpjNkj7
1811I73k1nJ5J9Rlj0j5nJ3K9L0J7%k0l6m0k6oRPnj4pJ5L4K6Jj9j9qjMJ3J5Lk1l7l7k6j1OK3
1806H69L3L3J9Jj0rpj1j6oMjk1l3j6J1K4J9J1J3K6L5K2mk1j4MJ1jj5j8j3pPK1K0Kj1oJqk4
1801I14l4l0k3j5rnlOJ8K2J1J0K7M1K4nj6mRJ1J6K2J3j0k0JL0L8K8K5L6M1L3K3K8N1Q3J07
$$ plain form
1796 1494 1614 1737 1867 2007 2149 2275 2370 2430 2459 2459 2428 2371 2301 2237 2188 2145 2095 2031 1947 1841 1716 1583 1460 1360 1291 1258 1255 1262 1253 1220 1177
1792 1177 1142 1119 1100 1084 1082 1100 1131 1160 1178 1188 1208 1247 1294 1328 1339 1347 1380 1452 1552 1658 1762 1870 1995 2141 2300 2472 2675 2940 3277 3668
1789 3668 4083 4496 4880 5209 5453 5591 5608 5505 5305 5050 4771 4480 4182 3890 3619 3365 3122 2891 2679 2489 2321 2178 2065
1786 2065 1975 1897 1829 1771 1715 1651 1583 1525 1485 1456 1430 1419 1434 1475 1528 1579 1621 1646 1650 1644 1648 1684 1751 1834 1917 1999 2088 2192 2315 2467 2664 2912 3199
1782 3199 3511 3838 4180 4534 4887 5211 5469 5627 5667 5590 5412 5154 4849 4538 4248 3977 3705 3431 3163 2910 2669 2445 2250 2090
1779 2090 1960 1854 1769 1697 1629 1566 1520 1495 1478 1454 1421 1392 1375 1366 1359 1344 1320 1299 1299 1325 1361 1384 1392 1395 1399 1404 1406 1413 1431 1461 1496 1537 1594 1668 1747 1818 1897 2015
1774 2015 2177 2346 2470 2533 2549 2537 2497 2425 2326 2209 2085 1965 1859 1763 1669 1580 1509 1456 1405 1346 1292 1259 1237 1200 1147 1102 1083 1083 1082 1073 1061 1050
1770 1050 1038 1027 1019 1010 1000 995 1003 1020 1027 1015 998 991 1001 1023 1053 1084 1098 1079 1034 988 959 942 925 909 906 911 909 894 876 869 873 883 894 897 888 869 854 850 853 856 862 870 874 864
$$ packed form
1796A494J20J23J30J40J42J26R5O0K9%l1n7p0o4m9m3n0o4q4j06j25j33j23j00o9l3lPrl3m3
1792A177l5k3j9j6kJ8L1K9J8J0K0L9M7L4J1QL3P2J00J06J04J08J25J46J59J72K03K65L37L91
1789C668M15M13L84L29K44J38J7j03k00k55k79k91k98k92k71k54k43k31k12j90j68j43j13
1786B065r0p8o8n8n6o4o8n8m0k9k6j1J5M1N3N1M2K5MoML6O7Q3Q3Q2Q9J04J23J52J97K48K87
1782C199L12L27L42L54L53L24K58J58M0p7j78k58l05l11k90k71k72k74k68k53k41k24j95j60
1779B090j30j06q5p2o8o3m6k5j7k4l3k9j7rpj5k4k1%K6L6K3QLMNKPJ8L0L5M1N7P4P9P1P9J18
1774B015J62J69J24O3J6j2m0p2r9j17j24j20j06r6r4q9p1n3n1n9n4l3k2l7n3m5j9%jrj2j1
1770A050j2j1qrj0nQJ7Pj2j7pJ0K2L0L1J4j9m5m6k9j7j7j6lNkj5j8pMJ0J1Lrj9j5mLLOQMj0
$$ plain form
1765 864 846 829 821 818 817 822 838 866 902 940 972 999 1024 1049 1071 1085 1085 1068 1040 1021 1026 1052 1075 1080 1075 1078 1091 1103 1105 1099 1083 1058 1028 1003 991 991 1002 1024 1054 1073 1064
1760 1064 1024 980 968 996 1039 1068 1078 1080 1082 1077 1063 1053 1051 1046 1031 1018 1019 1025 1017 1000 995 1007 1020 1020 1018 1034 1069 1102 1119 1126 1131 1142 1157 1173 1182 1179 1172 1178 1204 1238 1262 1277 1296
1755 1296 1319 1327 1312 1291 1286 1293 1291 1269 1242 1223 1212 1205 1208 1222 1239 1245 1236 1210 1170 1122 1081 1058 1050 1053 1073 1119 1183 1244 1288 1314 1328 1336 1344 1356 1368 1371 1366 1365 1373 1386 1397 1406 1414
1750 1414 1418 1422 1432 1452 1477 1495 1505 1509 1513 1522 1537 1553 1563 1562 1551 1533 1514 1508 1526 1564 1604 1629 1643 1655 1665 1668 1663 1658 1652 1646 1641 1645 1655 1664 1672 1687 1708 1722 1719 1709 1706 1718 1737
1744 1737 1759 1782 1808 1839 1878 1923 1968 2008 2047 2091 2137 2176 2207 2232 2243 2227 2189 2154 2140 2142 2149 2159 2175 2190 2192 2186 2185 2190 2190 2189 2202 2235 2270 2291 2304 2317 2324 2316 2305
1740 2305 2311 2333 2360 2384 2412 2448 2486 2520 2548 2573 2599 2630 2665 2702 2741 2785 2839 2898 2956 3011 3056 3086 3107 3139 3200 3286 3377 3461 3532 3589 3634 3676 3725 3772 3810
1735 3810 3850 3908 3976 4027 4054 4086 4141 4196 4219 4214 4216 4241 4278 4311 4349 4408 4487 4568 4632 4668 4679 4682 4695 4732 4788 4856 4930 5014 5114 5224 5330 5428 5530 5657
1731 5657 5811 5964 6094 6209 6342 6516 6721 6939 7160 7386 7616 7842 8065 8288 8514 8740 8964 9189 9417 9639 9847 10048 10252
$$ packed form
1765H64j8j7qljNJ6K8L6L8L2K7K5K5K2J4%j7k8j9NK6K3NnLJ3J2Koj6k5l0k5j2%J1K2L0J9r
1760A064m0m4j2K8M3K9J0KKnj4j0knj5j3JOqj7nJ2J3%kJ6L5L3J7PNJ1J5J6RlpOK6L4K4J5J9
1755A296K3Qj5k1nPkk2k7j9j1pLJ4J7Ork6m0m8m1k3qLK0M6O4O1M4K6J4QQJ2J2LnjQJ3J1RQ
1750A414MMJ0K0K5J8J0MMRJ5J6J0jj1j8j9oJ8L8M0K5J4J2J0LnnoonMJ0RQJ5K1J4lj0lJ2J9
1744A737K2K3K6L1L9M5M5M0L9M4M6L9L1K5J1j6l8l5j4KPJ0J6J5KojN%jJ3L3L5K1J3J3Pqj1
1740B305OK2K7K4K8L6L8L4K8K5K6L1L5L7L9M4N4N9N8N5M5L0K1L2O1Q6R1Q4P1N7M5M2M9M7L8
1735C810M0N8O8N1K7L2N5N5K3nKK5L7L3L8N9P9Q1O4L6J1LJ3L7N6O8P4Q4J00J10J06R8J02J27
1731E657J54J53J30J15J33J74K05K18K21K26K30K26K23K23K26K26K24K25K28K22K08K01K04
$$ plain form
1728 10252 10471 10704 10948 11211 11504 11831 12189 12576 12997 13458 13967 14521 15112 15742 16426 17180 18008 18902 19868 20933 22132 23482
1726 23482 24993 26694 28640 30893 33514 36579 40176 44401 49362 55188 62018 69981 79225 89982 102586 117405
1724 117405 134765 154888 177777 202963 229278 254830 277238 294060 303387 304510 298240 286505 271401 254444
1722 254444 236546 218368 200470 183157 166466 150446 135397 121783 109950 99990 91780 85096 79689 75358 71953
1720 71953 69339 67376 65958 65038 64581 64532 64861 65590 66743 68312 70307 72793 75846 79524 83915 89173 95444 102821 111434
1718 111434 121519 133362 147226 163437 182449 204731 230721 261049 296756 339134 389349 448253 516186 592248
1716 592248 673332 753802 826161 882309 915260 921427 902458 864614 815451 760511 702751 644116 586485 531035
1714 531035 477755 426374 377579 332925 293753 260481 232764 209889 191021 175397 162465 151810 143008 135683
$$ packed form
1728A0252K19K33K44K63K93L27L58L87M21M61N09N54N91O30O84P54Q28Q94R66J065J199J350
1726B3482J511J701J946K253K621L065L597M225M961N826O830P963R244J0757J2604J4819
1724A17405J7360K0123K2889K5186K6315K5552K2408J6822R327J123o270j1735j5104j6957
1722B54444j7898j8178j7898j7313j6691j6020j5049j3614j1833r960q210o684n407m331l405
1720G1953k614j963j418r20m57m9L29P29J153J569J995K486L053L678M391N258O271P377Q613
1718A11434J0085J1843J3864J6211J9012K2282K5990L0328L5707M2378N0215N8904O7933P6062
1716E92248Q1084Q0470P2359N6148L2951O167j8969l7844m9163n4940n7760n8635n7631n5450
1714E31035n3280n1381m8795m4654l9172l3272k7717k2875j8868j5624j2932j0655q802p325
$$ plain form
1713 135683 129622 124712 120788 117694 115402 113945 113278 113339 114186 115938 118647 122350 127189 133316 140729 149365 159282 170629
1710 170629 183530 198217 215216 235200 258731 286406 319216 358497 405484 461083 525794 599126 678517 758796
1709 758796 832728 892175 929628 940423 924970 888835 839768 783992 724974 664778 605322 548004 493035 440067
1707 440067 389474 342642 301055 265403 235494 210637 189986 172743 158277 146103 135801 127005 119462 113005
1705 113005 107478 102746 98732 95403 92713 90624 89149 88317 88118 88545 89653 91489 93982 96970 100301 103866 107563 111378
1703 111378 115502 120284 126064 133121 141796 152531 165750 181742 200641 222316 246090 270510 293420 312298 324740
1701 324740 329112 325202 314361 298803 280566 260969 240808 220717 201189 182412 164360 147114 131013 116488
1700 116488 103803 92963 83797 76069 69544 64011 59286 55208 51647 48523 45784 43377 41242 39343 37671 36220
$$ packed form
1713A35683o061m910l924l094k292j457o67O1Q47J752K709L703M839O127P413Q636R917J1347
1710A70629J2901J4687J6999J9984K3531K7675L2810L9281M6987N5599O4711P3332P9391Q0279
1709G58796P3932N9447L7453J0795j5453l6135m9067n5776n9018o0196n9456n7318n4969n2968
1707D40067n0593m6832m1587l5652k9909k4857k0651j7243j4466j2174j0302q796p543o457
1705A13005n527m732m014l329k690k089j475q32j99M27J108J836K493K988L331L565L697L815
1703A11378M124M782N780P057Q675J0735J3219J5992J8899K1675K3774K4420K2910J8878J2442
1701C24740M372l910j0841j5558j8237j9597k0161k0091j9528j8777j8052j7246j6101j4525
1700A16488j2685j0840r166p728o525n533m725m078l561l124k739k407k135j899j672j451
$$ plain form
1698 36220 34970 33899 32997 32253 31653 31197 30898 30748 30674 30568 30337 29934 29346 28575 27650 26629 25574 24529 23511 22523 21572
1695 21572 20676 19845 19074 18343 17644 16995 16422 15934 15518 15149 14805 14480 14177 13903 13654 13420 13194 12983 12790 12608 12421 12229 12037
1692 12037 11845 11653 11463 11277 11093 10909 10734 10592 10494 10425 10363 10300 10248 10231 10260 10330 10437 10594 10816 11099 11414 11733 12042 12316 12505
1689 12505 12555 12454 12233 11940 11609 11253 10881 10503 10130 9777 9450 9144 8852 8572 8310 8068 7847 7656 7500 7372 7262 7170 7094 7021
1686 7021 6939 6857 6798 6768 6741 6697 6643 6602 6588 6593 6599 6596 6587 6589 6616 6673 6754 6860 7001 7188 7428 7728 8093 8526 9036 9650 10403 11317 12389 13602
1683 13602 14912 16233 17431 18355 18885 18965 18629 17981 17149 16239 15311 14405 13546 12733 11945 11162 10391 9659 8999 8427 7939 7518
1680 7518 7144 6813 6531 6297 6093 5911 5756 5631 5526 5427 5331 5241 5160 5088 5031 4992 4971 4969 4990 5032 5087 5157 5247 5365 5507 5679 5901 6187
1676 6187 6539 6958 7462 8073 8810 9688 10734 11956 13305 14678 15952 17004 17711 17974 17774 17207 16423 15542 14623 13692 12774
$$ packed form
1698C6220j250j071r02p44o00m56k99j50p4j06k31m03n88p71r25j021j055j045j018r88r51
1695B1572q96q31p71p31o99o49n73m88m16l69l44l25l03k74k49k34k26k11j93j82j87j92j92
1692A2037j92j92j90j86j84j84j75j42r8o9o2o3n2j7K9P0J07J57K22K83L15L19L09K74J89
1689A2505N0j01k21k93l31l56l72l78l73l53l27l06k92k80k62k42k21j91j56j28j10r2p6p3
1686G021q2q2n9l0k7m4n4m1j4NOlrKK7N7Q1J06J41J87K40L00L65M33N10O14P53R14J072J213
1683A3602J310J321J198R24N30Q0l36o48q32r10r28r06q59q13p88p83p71p32o60n72m88m21
1680G518l74l31k82k34k04j82j55j25j05r9r6r0q1p2n7l9k1kK1M2N5P0R0J18J42J72K22K86
1676F187L52M19N04O11P37Q78J046J222J349J373J274J052P07K63k00n67p84q81r19r31r18
$$ plain form
1674 12774 11893 11054 10247 9466 8718 8023 7401 6858 6385 5967 5600 5290 5040 4833 4645 4466 4306 4173 4065 3977 3906 3843 3774 3695
1671 3695 3619 3560 3518 3491 3478 3474 3467 3452 3445 3469 3526 3602 3695 3813 3957 4112 4276 4472 4721 5032 5403 5828 6280 6714 7085 7363 7515 7508 7339
1667 7339 7054 6720 6386 6067 5762 5468 5180 4893 4607 4328 4071 3853 3682 3547 3423 3303 3198 3112 3030 2944 2865 2808 2766 2729 2701 2688
1664 2688 2676 2651 2621 2603 2600 2600 2596 2590 2580 2568 2561 2564 2565 2550 2520 2490 2468 2462 2485 2540 2604 2648 2672 2706 2759 2813 2849 2873 2906 2957 3020 3088 3159 3238 3330 3435 3547
1660 3547 3668 3816 4013 4257 4538 4855 5231 5688 6231 6862 7597 8461 9481 10687 12119 13824 15845 18204 20862 23705
1657 23705 26546 29150 31251 32597 33031 32573 31398 29744 27816 25766 23702 21686 19740 17871 16098 14455 12970 11660
1655 11660 10539 9612 8867 8282 7830 7486 7229 7041 6907 6807 6732 6683 6666 6672 6699 6762 6877 7035 7213 7419 7695 8068 8524 9045 9660
1652 9660 10429 11400 12592 14025 15745 17806 20248 23115 26480 30461 35218 40908 47631 55360 63868 72685 81100 88252
$$ packed form
1674A2774q81q39q07p81p48o95o22n43m73m18l67l10k50k07j88j79j60j33j08q8p1o3o9p9
1671C695p6n9m2k7j3mpj5pK4N7P6R3J18J44J55J64J96K49L11L71M25M52M34L71K78J52pj69
1667G339k85l34l34l19l05k94k88k87k86k79k57k18j71j35j24j20j05q6q2q6p9n7m2l7k8j3
1664B688j2k5l0j8l%moj0j2pLJj5l0l0k2oK3N5O4M4K4L4N3N4L6K4L3N1O3O8P1P9R2J05J12
1660C547J21J48J97K44K81L17L76M57N43O31P35Q64J020J206J432J705K021K359K658K843
1657B3705K841K604K101J346M34m58j175j654j928k050k064k016j946j869j773j643j485j310
1655A1660j121r27p45n85m52l44k57j88j34j00p5m9j7OK7O3J15J58J78K06K76L73M56N21O15
1652I660P69R71J192J433J720K061K442K867L365L981M757N690O723P729Q508Q817Q415P152
$$ plain form
1650 88252 93312 95704 95296 92434 87799 82126 75985 69723 63546 57581 51893 46493 41397 36678 32435 28740 25603
1648 25603 22988 20827 19038 17547 16299 15253 14366 13603 12948 12395 11936 11556 11243 10993 10803 10678 10625 10645 10729 10883 11130 11496
1645 11496 11994 12630 13430 14435 15684 17216 19070 21289 23920 27033 30736 35175 40503 46837 54204 62468 71261 79963
1643 79963 87760 93777 97294 97981 96008 91959 86575 80516 74248 68048 62061 56355 50951 45862 41122 36797 32957
1641 32957 29622 26749 24265 22111 20248 18640 17244 16018 14931 13951 13055 12238 11503 10856 10295 9819 9419 9078 8783 8536
1638 8536 8352 8238 8182 8168 8197 8279 8441 8708 9097 9607 10231 10977 11867 12935 14232 15828 17778 20091 22723 25583 28513 31264
1636 31264 33531 35051 35680 35419 34392 32813 30929 28944 26984 25110 23349 21707 20174 18740 17408 16179 15039 13973
1633 13973 12976 12052 11199 10403 9653 8952 8309 7726 7198 6712 6264 5859 5503 5190 4906 4640 4394 4179 3998 3846 3717 3605 3505
$$ packed form
1650H8252N060K392m08k862m635n673o141o262o177n965n688n400n096m719m243l695l137
1648B5603k615k161j789j491j248j046q87p63o55n53m59l80l13k50j90j25n3K0Q4J54K47L66
1645A1496M98O36Q00J005J249J532J854K219K631L113L703M439N328O334P367Q264Q793Q702
1643G9963P797O017L517O87j973m049n384o059o268o200n987n706n404n089m740m325l840
1641C2957l335k873k484k154j863j608j396j226j087r80q96q17p35o47n61m76m00l41k95k47
1638H536j84j14n6j4K9Q2J62K67L89N10O24P46Q90J068J297J596J950K313K632K860K930K751
1636C1264K267J520O29k61j027j579j884j985j960j874j761j642j533j434j332j229j140j066
1633A3973r97r24q53p96p50p01o43n83n28m86m48m05l56l13k84k66k46k15j81j52j29j12j00
$$ plain form
1631 3505 3406 3297 3181 3076 2993 2928 2862 2793 2734 2699 2684 2681 2682 2682 2672 2651 2631 2621 2622 2631 2651 2682 2714 2743 2785 2854 2936 3012 3083 3165 3252 3321 3360 3374 3366 3328
1626 3328 3262 3183 3101 3013 2918 2819 2718 2610 2507 2427 2373 2321 2253 2175 2098 2020 1936 1851 1781 1729 1694 1673 1657 1635 1605 1576 1552 1527 1498 1473 1459 1448 1427
1622 1427 1396 1368 1352 1353 1368 1388 1399 1395 1383 1373 1364 1354 1343 1332 1316 1298 1287 1286 1288 1275 1240 1191 1150 1137 1150 1174 1198 1226 1260 1280 1269 1239 1218 1212 1201 1175 1148
1618 1148 1134 1121 1098 1077 1068 1069 1066 1057 1047 1042 1047 1064 1075 1059 1018 983 973 971 955 934 926 930 928 919 915 911 899 885 888 911 938 958 974 986 996 1007 1027 1053 1069 1065 1047 1023
1612 1023 1001 988 987 988 977 955 929 904 884 870 861 852 841 843 861 876 869 846 828 821 815 806 801 797 786 766 745 724 703 689 690 698 698 693 700 723 744 753 761 778 797 811 826
1607 826 847 865 864 847 830 825 837 858 876 883 881 878 873 861 844 828 808 780 759 762 785 803 798 781 763 744 717 691 672 657 635 610 593 583 575 571 570 563 539 503 479
1602 479 483 514 555 589 607 614 618 619 611 596 585 584 591 604 620 634 634 616 600 605 631 666 696 716 725 726 726 727 723 705 673 637 608 590 578 567 555 551 565 593 623 640
1597 640 644 642 638 628 610 591 583 588 595 593 587 592 609 623 623 611 594 569 542 530 542 570 596 612 622 625 620 614 612 605 589 584 609 654 683 675 643 606 570 543 532 541 559 573
$$ packed form
1631C505r9j09j16j05q3o5o6o9n9l5j5lJ%j0k1k0j0JRK0L1L2K9M2O9Q2P6P1Q2Q7O9L9J4ql8
1626C328o6p9q2q8r5r9j01j08j03q0n4n2o8p8p7p8q4q5p0n2l5k1j6k2l0k9k4k5k9k5j4j1k1
1622A427l1k8j6JJ5K0J1mj2j0rj0j1j1j6j8j1jKj3l5m9m1j3J3K4K4K8L4K0j1l0k1oj1k6k7
1618A148j4j3k3k1rJlrj0nNJ7J1j6m1l5j0kj6k1qMkrmmj2j4LK3K7K0J6J2J0J1K0K6J6mj8k4
1612A023k2j3jJj1k2k6k5k0j4rrj1KJ8J5pk3j8pornmj1k0k1k1k1j4JQ%nPK3K1RQJ7J9J4J5
1607H26K1J8jj7j7nJ2K1J8Pklnj2j7j6k0k8k1LK3J8nj7j8j9k7k6j9j5k2k5j7j0qmjpk4l6k4
1602D79ML1M1L4J8PMJqj5j1jPJ3J6J4%j8j6NK6L5L0K0RJ%Jmj8l2l6k9j8j2j1j2mJ4K8L0J7
1597F40Mkmj0j8j9qNPkoNJ7J4%j2j7k5k7j2J2K8K6J6J0Lnokpj6nK5M5K9ql2l7l6k7j1RJ8J4
$$ plain form
1592 573 573 557 532 518 524 535 531 515 509 518 531 546 575 609 624 618 614 624 638 645 655 673 685 688 698 721 734 726 716 726 753 779 803 825 830 811 790 790 805 807 791
1587 791 772 760 758 768 790 813 830 851 888 931 967 1005 1057 1107 1133 1140 1155 1182 1198 1190 1167 1139 1109 1080 1062 1051 1036 1018 1004 998 997 1006 1034 1071 1098 1109 1113 1117 1123
1582 1123 1139 1170 1206 1227 1233 1245 1275 1316 1356 1398 1446 1498 1550 1604 1663 1731 1816 1929 2076 2267 2515 2825 3191 3606 4081 4642 5306 6083 6998
1578 6998 8091 9403 10946 12687 14536 16356 17976 19218 19922 20006 19523 18639 17534 16313 15026 13724 12460 11257 10104
1576 10104 9000 7972 7047 6239 5560 5021 4602 4260 3961 3700 3473 3267 3076 2906 2755 2610 2466 2325 2188 2050 1919 1811
1573 1811 1724 1640 1557 1498 1473 1462 1436 1387 1324 1255 1187 1137 1112 1102 1096 1087 1067 1034 999 975 962 948 931 926 936 946 942 926 907 891 885 898 922 943 958 984 1020
1569 1020 1046 1060 1084 1136 1201 1253 1289 1314 1321 1302 1269 1243 1230 1223 1218 1214 1205 1184 1148 1098 1041 991 958 934 903 872 860 869 872 856 835 829 834 839 851 872 890 897 904 921
1564 921 936 934 916 894 865 824 780 743 719 710 724 757 788 800 802 801 795 779 765 762 766 774 794 826 851 858 866 891 921 927 907 883 868 857 848 843 843 847 859 880 891 878
$$ packed form
1592E73%j6k5j4OJ1mj6oRJ3J5K9L4J5omJ0J4PJ0J8J2LJ0K3J3qj0J0K7K6K4K2Nj9k1%J5Kj6
1587G91j9j2kJ0K2K3J7K1L7M3L6L8N2N0K6PJ5K7J6qk3k8l0k9j8j1j5j8j4ojRK8L7K7J1MMO
1582A123J6L1L6K1OJ2L0M1M0M2M8N2N2N4N9O8Q5J13J47J91K48L10L66M15M75N61O64P77R15
1578F998J093J312J543J741J849J820J620J242P04Q4m83q84j105j221j287j302j264j203j153
1576A0104j104j028r25q08o79n39m19l42k99k61k27k06j91j70j51j45j44j41j37j38j31j08
1573A811q7q4q3n9k5j1k6m9o3o9o8n0k5j0ork0l3l5k4j3j4j7nJ0J0mj6j9j6oJ3K4K1J5K6L6
1569A020K6J4K4N2O5N2L6K5Pj9l3k6j3pnmrk1l6n0n7n0l3k4l1l1j2RLj6k1oNNJ2K1J8PPJ7
1564I21J5kj8k2k9m1m4l7k4rJ4L3L1J2Kjoj6j4lMQK0L2K5PQK5L0Ok0k4j5j1rn%MJ2K1J1j3
$$ plain form
1559 878 857 850 862 879 888 890 881 860 838 830 829 821 801 775 740 699 666 651 652 660 676 700 719 718 701 681 657 631 617 623 635 637 639 659 693 721 744 772 800 814 818 828
1554 828 844 861 887 929 970 985 980 978 987 996 1004 1023 1050 1068 1073 1069 1055 1027 994 975 972 971 970 976 977 961 935 921 925 938 954 974 987 979 968 981 1016 1053 1086 1129 1179 1219
1549 1219 1245 1268 1281 1274 1257 1256 1269 1273 1271 1291 1337 1385 1418 1447 1472 1481 1484 1512 1574 1640 1688 1729 1777 1820 1849 1878 1912 1929 1912 1870 1822 1774 1731 1705 1690 1660 1607
1544 1607 1558 1538 1538 1542 1544 1540 1513 1467 1431 1421 1422 1417 1414 1423 1427 1412 1387 1370 1361 1359 1370 1397 1424 1445 1472 1516 1563 1598 1621 1635 1636 1627 1627 1646 1679 1728 1798 1868 1897 1874 1842
1539 1842 1831 1822 1788 1739 1704 1683 1667 1667 1696 1744 1793 1842 1890 1921 1931 1943 1982 2040 2102 2174 2256 2324 2353 2358 2363 2371 2377 2395 2435 2477 2500 2513 2538 2566 2585 2609 2659
1534 2659 2727 2788 2834 2874 2910 2943 2988 3049 3099 3115 3107 3106 3119 3140 3166 3191 3196 3180 3167 3175 3181 3164 3137 3125 3118 3103 3101 3135 3191 3232 3262 3309 3379 3458 3543 3643 3744
1530 3744 3830 3912 4014 4133 4249 4367 4494 4606 4673 4704 4729 4754 4769 4787 4828 4878 4904 4913 4936 4982 5037 5097 5172 5247 5310 5378 5475 5588 5685 5774 5884
1526 5884 6011 6128 6232 6341 6444 6517 6572 6634 6694 6720 6728 6760 6818 6873 6918 6973 7038 7096 7161 7258 7368 7445 7491 7555 7650 7750 7855 7999 8190 8401
$$ packed form
1559H78k1pJ2J7RKrk1k2qjqk0k6l5m1l3j5JQJ6K4J9jj7k0k4k6j4OJ2KKK0L4K8K3K8K8J4MJ0
1554H28J6J7K6M2M1J5nkRRQJ9K7J8Nmj4k8l3j9ljjOJj6k6j4MJ3J6K0J3qj1J3L5L7L3M3N0M0
1549A219K6K3J3pj7jJ3MkK0M6M8L3K9K5RLK8O2O6M8M1M8M3K9K9L4J7j7m2m8m8m3k6j5l0n3
1544A607m9k0%MKmk7m6l6j0JnlRMj5k5j7rkJ1K7K7K1K7M4M7L5K3J4Jr%J9L3M9P0P0K9k3l2
1539A842j1rl4m9l5k1j6%K9M8M9M9M8L1J0J2L9N8O2P2Q2O8K9NNQOJ8M0M2K3J3K5K8J9K4N0
1534B659O8O1M6M0L6L3M5O1N0J6qjJ3K1K6K5Nj6j3QOj7k7j2pj5kL4N6M1L0M7P0P9Q5J00J01
1530C744Q6Q2J02J19J16J18J27J12O7L1K5K5J5J8M1N0K6RK3M6N5O0P5P5O3O8R7J13R7Q9J10
1526E884J27J17J04J09J03P3N5O2O0K6QL2N8N5M5N5O5N8O5R7J10P7M6O4R5J00J05J44J91K11
$$ plain form
1523 8401 8625 8881 9163 9442 9726 10048 10399 10729 11023 11307 11579 11797 11959 12108 12270 12421 12555 12695 12849 13001 13167 13392 13678
1520 13678 13976 14270 14588 14932 15270 15608 15999 16459 16948 17455 18017 18633 19246 19831 20416 21006 21552 22047 22553 23103 23664 24212 24788
1517 24788 25420 26088 26800 27608 28535 29547 30640 31878 33310 34937 36794 38989 41599 44633 48150 52308 57275 63166
1515 63166 70125 78329 87812 98327 109375 120248 129995 137527 141995 143170 141484 137758 132869 127464 121860 116187
1513 116187 110619 105358 100456 95846 91615 88072 85471 83818 83027 83062 83855 85248 87160 89665 92799 96455 100576 105269
1511 105269 110607 116509 122966 130169 138294 147349 157428 168861 181972 196903 213910 233566 256476 283068 313958
1509 313958 350260 393296 444369 505132 577782 664525 767351 889068 1034324 1209062 1419111 1669267
1507 1669267 1961773 2292562 2647036 2999283 3315579 3560169 3702859 3728851 3646214 3482731 3271542 3036976
$$ packed form
1523H401K24K56K82K79K84L22L51L30K94K84K72K18J62J49J62J51J34J40J54J52J66K25K86
1520A3678K98K94L18L44L38L38L91M60M89N07N62O16O13N85N85N90N46M95N06N50N61N48N76
1517B4788O32O68P12Q08R27J012J093J238J432J627J857K195K610L034L517M158M967N891
1515F3166O959Q204R483J0515J1048J0873R747P532M468J175j686l726m889n405n604n673
1513A16187n568n261m902m610m231l543k601j653p91L5P93J393J912K505L134L656M121M693
1511A05269N338N902O457P203Q125R055J0079J1433J3111J4931J7007J9656K2910K6592L0890
1509C13958L6302M3036N1073O0763P2650Q6743J02826J21717J45256J74738K10049K50156
1507A669267K92506L30789L54474L52247L16296K44590J42690K5992q2637j63483k11189k34566
$$ plain form
1506 3036976 2791830 2543850 2300264 2065835 1840648 1623177 1415388 1223587 1054561 911684 794098
1504 794098 698215 619641 554568 500243 454602 415814 382347 353177 327599 304927 284564 266187 249607 234543
1503 234543 220720 208044 196480 185857 175994 166899 158637 151110 144139 137673 131726 126193 120916 115865 111090 106558
1501 106558 102192 98011 94085 90388 86856 83517 80438 77590 74889 72342 70008 67859 65823 63906 62159 60551 59005
1499 59005 57525 56169 54911 53665 52415 51198 50007 48793 47570 46396 45266 44131 42994 41909 40874 39844 38819
1497 38819 37849 36944 36073 35239 34468 33738 32995 32248 31539 30860 30161 29450 28781 28167 27568 26981 26438 25935 25421 24884 24360 23862 23373
1494 23373 22900 22476 22097 21724 21355 21026 20731 20422 20087 19763 19468 19182 18903 18657 18439 18215 17981 17768 17581 17385 17170 16969 16788
1491 16788 16596 16383 16178 15993 15807 15606 15403 15200 14980 14752 14552 14381 14199 13989 13774 13570 13361 13139 12926 12730 12531 12311 12083
$$ packed form
1506C036976k45146k47980k43586k34429k25187k17471k07789j91801j69026j42877j17586
1504G94098r5883p8574o5073n4325m5641l8788l3467k9170k5578k2672k0363j8377j6580j5064
1503B34543j3823j2676j1564j0623r863r095q262p527o971o466n947n533n277n051m775m532
1501A06558m366m181l926l697l532l339l079k848k701k547k334k149k036j917j747j608j546
1499E9005j480j356j258j246j250j217j191j214j223j174j130j135j137j085j035j030j025
1497C8819r70r05q71q34p71p30p43p47p09o79o99p11o69o14n99n87n43n03n14n37n24m98m89
1494B3373m73m24l79l73l69l29k95l09l35l24k95k86k79k46k18k24k34k13j87j96k15k01j81
1491A6788j92k13k05j85j86k01k03k03k20k28k00j71j82k10k15k04k09k22k13j96j99k20k28
$$ plain form
1488 12083 11858 11640 11446 11291 11159 11015 10869 10755 10677 10595 10495 10406 10336 10257 10153 10045 9950 9852 9745 9648 9560 9451 9308 9160 9036 8932
1485 8932 8841 8774 8729 8680 8622 8575 8539 8487 8416 8358 8324 8278 8200 8113 8034 7941 7825 7718 7644 7580 7497 7410 7338 7269 7189 7114 7060 7001 6912 6806 6712 6626 6532
1481 6532 6440 6368 6302 6221 6130 6050 5977 5897 5816 5741 5664 5585 5531 5524 5544 5548 5523 5478 5421 5354 5298 5270 5252 5215 5161 5112 5070 5025 4974 4925 4878 4828 4786 4764 4756 4753
1477 4753 4759 4777 4783 4756 4710 4670 4641 4614 4597 4604 4630 4656 4679 4703 4712 4683 4626 4567 4511 4445 4373 4318 4283 4247 4202 4162 4138 4127 4121 4123 4130 4134 4127 4107 4076 4038 4005 3983 3960
1472 3960 3926 3896 3891 3906 3925 3935 3937 3932 3922 3920 3935 3949 3940 3916 3902 3905 3917 3937 3974 4020 4047 4045 4020 3975 3908 3820 3727 3641 3568 3515 3482 3450 3397 3330 3270 3224 3177 3127
1467 3127 3084 3050 3015 2975 2939 2910 2882 2853 2831 2817 2802 2787 2783 2788 2794 2803 2831 2885 2953 3026 3101 3171 3216 3231 3221 3196 3152 3091 3025 2963 2904 2842 2773 2700 2628 2566
1463 2566 2516 2467 2415 2371 2343 2319 2281 2242 2224 2217 2187 2128 2072 2044 2034 2027 2023 2026 2028 2025 2024 2035 2051 2065 2079 2099 2120 2138 2158 2183 2214 2254 2309 2382 2466 2557 2662
1458 2662 2790 2941 3115 3314 3536 3769 3990 4171 4273 4265 4160 4001 3825 3640 3445 3250 3061 2874 2686 2512 2362 2233 2114 2013
$$ packed form
1488A2083k25k18j94j55j32j44j46j14p8q2j00q9p0p9j04j08r5r8j07r7q8j09j43j48j24j04
1485H932r1o7m5m9n8m7l6n2p1n8l4m6p8q7p9r3j16j07p4o4q3q7p2o9q0p5n4n9q9j06r4q6r4
1481F532r2p2o6q1r1q0p3q0q1p5p7p9n4pK0Mk5m5n7o7n6k8j8l7n4m9m2m5n1m9m7n0m2k2ql
1477D753OJ8Ok7m6m0k9k7j7PK6K6K3K4Rk9n7n9n6o6p2n5l5l6m5m0k4j1oKPMpk0l1l8l3k2k3
1472C960l4l0nJ5J9J0Knj0kJ5J4rk4j4LJ2K0L7M6K7kk5m5o7q8r3q6p3n3l3l2n3o7o0m6m7n0
1467C127m3l4l5m0l6k9k8k9k2j4j5j5mNORK8N4O8P3P5P0M5J5j0k5m4o1o6o2n9o2o9p3p2o2
1463B566n0m9n2m4k8k4l8l9j8pl0n9n6k8j0pmLKljJ1J6J4J4K0K1J8K0K5L1M0N5P3Q4R1J05
1458B662J28J51J74J99K22K33K21J81J02qj05j59j76j85j95j95j89j87j88j74j50j29j19j01
$$ plain form
1455 2013 1938 1885 1840 1800 1763 1729 1699 1674 1648 1614 1574 1548 1541 1536 1522 1507 1510 1528 1547 1556 1556 1549 1538 1530 1536 1562 1609 1670 1732 1789 1853 1943 2062 2198 2352 2536
1451 2536 2748 2971 3193 3415 3617 3751 3783 3726 3615 3466 3281 3073 2866 2673 2498 2339 2195 2059 1929 1819 1741 1690 1655 1632 1618
1448 1618 1595 1553 1501 1460 1432 1411 1400 1401 1410 1415 1415 1412 1404 1391 1378 1372 1367 1354 1340 1340 1357 1387 1425 1468 1495 1494 1478 1475 1495 1533 1586 1660 1749 1839 1924 2009 2096 2172 2224 2239
1443 2239 2214 2152 2079 2020 1979 1940 1892 1841 1798 1772 1765 1771 1777 1773 1769 1777 1793 1804 1805 1798 1771 1717 1654 1614 1597 1574 1537 1506 1499 1493 1464 1419 1387 1380 1384 1384 1378 1373 1372 1378 1389 1403 1422
1438 1422 1453 1491 1527 1555 1587 1634 1696 1763 1831 1905 1993 2096 2209 2333 2475 2644 2841 3066 3336 3688 4144 4705 5360 6119 7014 8077
1434 8077 9337 10818 12512 14345 16176 17833 19142 19949 20165 19807 19008 17932 16707 15404 14077 12777 11538 10363
1432 10363 9238 8167 7185 6325 5597 4983 4465 4037 3689 3396 3138 2921 2751 2612 2473 2321 2173 2049 1953 1878 1814 1755 1697 1647
1429 1647 1614 1589 1553 1497 1434 1379 1342 1321 1308 1286 1241 1182 1135 1115 1113 1109 1099 1082 1060 1031 996 960 936 933 946 950 924 872 817 776 749 738 746 763 767 753 743
$$ packed form
1455B013p5n3m5m0l7l4l0k5k6l4m0k6pnj4j5LJ8J9R%pj1qOK6M7O1O2N7O4R0J19J36J54J84
1451B536K12K23K22K22K02J34L2n7j11j49j85k08k07j93j75j59j44j36j30j10p8n1l5k3j4
1448A618k3m2n2m1k8k1j1JRN%lqj3j3onj3j4%J7L0L8M3K7jj6lK0L8N3P4Q9R0Q5Q5Q7P6N2J5
1443B239k5o2p3n9m1l9m8n1m3k6pOOmmQJ6J1Jpk7n4o3m0j7k3l7l1pok9m5l2pM%onjOJ1J4J9
1438A422L1L8L6K8L2M7O2O7O8P4Q8J03J13J24J42J69J97K25K70L52M56N61O55P59Q95J063
1434H077J260J481J694J833J831J657J309Q07K16l58p99j076j225j303j327j300j239j175
1432A0363j125j071r82q60p28o14n18m28l48k93k58k17j70j39j39j52j48j24r6p5o4n9n8n0
1429A647l3k5l6n6o3n5l7k1j3k2m5n9m7k0kmj0j7k2k9l5l6k4lJ3Mk6n2n5m1k7j1QJ7Mj4j0
$$ plain form
1425 743 753 772 778 772 765 759 746 734 737 754 767 764 749 734 725 719 714 710 710 716 724 729 729 725 715 699 684 677 677 676 682 704 732 745 742 745 764 781 781 777 784 792 790 787 799 820 828 814 792
1419 792 775 767 769 779 783 764 725 690 680 692 711 724 726 721 716 711 699 677 656 647 648 651 652 649 636 609 581 567 572 586 599 608 610 604 596 590 589 594 605 616 619 612 602 594 586 575 566
1413 566 564 561 551 543 545 551 556 566 586 606 611 605 598 585 557 528 520 538 560 569 570 574 579 589 610 637 652 649 644 654 673 684 676 655 635 628 646 690 743 781 792 786 780 788 808
1408 808 826 834 836 835 830 817 802 796 800 807 819 842 871 895 911 924 931 928 918 913 914 918 932 960 995 1016 1021 1026 1039 1042 1018 980 949 934 927 921 916 917 924 934 940 931 904 869 837 811
1402 811 797 796 804 805 796 787 785 780 759 729 708 701 702 709 716 716 699 674 658 653 647 630 603 573 545 521 504 490 474 454 438 431 430 427 419 413 421 449 489 524 545 557 567 569 556
1396 556 532 510 498 495 494 492 492 502 525 553 571 576 574 574 573 564 544 522 510 514 531 544 539 520 501 492 489 483 471 459 460 478 504 522 526 525 522 510 483 455 445 454 464 473 490
1391 490 512 522 515 502 492 478 457 443 446 457 466 476 485 481 455 427 420 427 425 408 396 398 408 419 425 424 414 402 397 399 399 395 393 398 410 429 447 451 436 415 404 401 397 391 402
1385 402 440 491 528 536 519 499 494 506 521 525 522 522 520 503 464 413 370 348 351 364 367 355 339 329 327 334 354 385 411 420 422 431 441 440 431 428 431 431 432 443 456 453 434 418 421
$$ packed form
1425G43J0J9Oopoj3j2LJ7J3lj5j5ronm%OQN%mj0j6j5p%jOK2K8J3lLJ9J7%mPQklJ2K1Qj4k2
1419G92j7qKJ0Mj9l9l5j0J2J9J3Knnnj2k2k1rJLJlj3k7k8j4NJ4J3RKoqojNJ1J1Lpj0qqj1r
1413E66klj0qKONJ0K0K0Nopj3k8k9qJ8K2RJMNJ0K1K7J5lnJ0J9J1qk1k0pJ8M4N3L8J1ooQK0
1408H08J8QKjnj3j5oMPJ2K3K9K4J6J3Plj0nJMJ4K8L5K1NNJ3Lk4l8l1j5ponJPJ0Ork7l5l2k6
1402H11j4jQJrrknk1l0k1pJPP%j7k5j6noj7k7l0k8k4j7j4j6k0j6pjlqoQK8M0L5K1J2J0Kj3
1396E56k4k2j2ljk%J0K3K8J8Nk%jrk0k2j2MJ7J3nj9j9rloj2j2JJ8K6J8Mjlj2k7k8j0RJ0RJ7
1391D90K2J0pj3j0j4k1j4LJ1RJ0Rmk6k8pPkj7j2KJ0J1Ojj0j2nK%mkNJ2J9J8Mj5k1j1lmoJ1
1385D02L8N1L7Qj7k0nJ2J5Ml%kj7l9n1m3k2LJ3Lj2j6j0kPK0L1K6RKRJ0jrlL%JJ1J3lj9j6L
$$ plain form
1380 421 437 457 475 484 480 472 475 483 476 453 440 454 486 514 532 545 561 578 592 594 581 564 556 556 549 531 518 520 531 538 532 512 484 459 447 446 444 442 449 467 482 490 497 504 503
1374 503 492 480 471 457 439 433 445 454 440 414 402 415 444 472 485 474 451 443 469 513 543 546 533 520 514 521 541 563 574 570 553 532 515 511 519 526 527 536 565 608 644
1369 644 663 671 682 700 724 743 751 759 790 861 960 1070 1187 1310 1432 1543 1638 1715 1764 1779 1766 1741 1710 1668 1613 1544 1462 1373 1289 1218 1149 1075 1003 949
1365 949 914 889 869 857 845 823 796 783 787 792 783 768 762 767 777 783 778 764 751 748 759 779 800 810 806 791 777 771 767 760 756 762 774 786 801 823 845 857 863 875 892 901 898
1360 898 893 903 932 974 1018 1057 1091 1122 1146 1156 1160 1180 1226 1277 1308 1332 1379 1456 1544 1629 1710 1784 1843 1897 1966 2048 2131 2212 2313 2450 2618 2825 3093
1356 3093 3434 3838 4306 4861 5528 6319 7248 8362 9719 11364 13322 15595 18127 20778 23335 25545 27143 27901 27732 26758
1354 26758 25247 23457 21552 19618 17726 15923 14215 12590 11057 9657 8430 7391 6541 5877 5378 4997 4689 4434 4238
1351 4238 4099 4003 3942 3918 3937 3991 4059 4128 4195 4257 4305 4328 4321 4282 4222 4159 4104 4057 4010 3963 3923 3891 3870 3872 3913 3984 4062 4129 4187 4235 4261 4257 4228 4188 4143
$$ packed form
1380D21J6K0J8RmqLQpk3j3J4L2K8J8J3J6J7J4Kj3j7q%pj8j3KJ1Pok0k8k5j2jkkPJ8J5QPPj
1374E03j1j2rj4j8oJ2Rj4k6j2J3K9K8J3j1k3qK6M4L0Lj3j3oPK0K2J1mj7k1j7mQPJRK9M3L6
1369F44J9QJ1J8K4J9QQL1P1R9J10J17J23J22J11R5P7M9J5j3k5l1m2n5o9q2q9q4p1o9p4p2n4
1365I49l5k5k0j2j2k2k7j3MNrj5oNJ0Onj4j3lJ1K0K1J0mj5j4ompmOJ2J2J5K2K2J2OJ2J7Rl
1360H98nJ0K9M2M4L9L4L1K4J0MK0M6N1L1K4M7P7Q8Q5Q1P4N9N4O9Q2Q3Q1J01J37J68K07K68
1356C093L41M04M68N55O67P91R29J114J357J645J958K273K532K651K557K210J598P58j69r74
1354B6758j511j790j905j934j892j803j708j625j533j400j227j039q50o64m99l81l08k55j96
1351D238j39r6o1k4J9N4O8O9O7O2M8K3pl9o0o3n5m7m7m7m0l2k1KM1P1P8O7N8M8K6mk9m0m5
$$ plain form
1347 4143 4098 4060 4029 3999 3972 3966 3989 4027 4061 4095 4149 4230 4331 4436 4526 4585 4608 4603 4577 4534 4482 4436 4403 4381 4367 4375 4416 4488 4587 4723 4904 5114 5321
1343 5321 5507 5671 5815 5939 6045 6142 6240 6350 6486 6650 6828 7016 7229 7483 7774 8089 8437 8863 9404 10079 10905 11911 13119
1340 13119 14533 16165 18072 20342 23063 26312 30152 34612 39620 44963 50299 55202 59248 62162 64015 65277 66606
1338 66606 68520 71288 75089 80121 86438 93714 101270 108294 113990 117685 119129 118835 117944 117574 118333 120486 124334 130114
1336 130114 137544 145712 153423 159493 162804 162578 158966 153208 146920 141174 136369 132755 130656 130110 130586 131264 131423 130452
1334 130452 127776 123144 117007 110332 103962 98243 93257 89149 86027 83711 81767 79784 77486 74625 70978 66551 61670
1332 61670 56756 52050 47585 43368 39449 35843 32481 29299 26331 23675 21395 19482 17880 16529 15374 14374 13498
1329 13498 12726 12040 11432 10897 10424 9988 9575 9190 8838 8511 8199 7903 7632 7383 7139 6893 6655 6440 6253 6083 5915 5745 5584
$$ packed form
1347D143m5l8l1l0k7oK3L8L4L4N4Q1J01J05R0N9K3nk6m3n2m6l3k2j4QM1P2R9J36J81K10K07
1343E321J86J64J44J24J06R7R8J10J36J64J78J88K13K54K91L15L48M26N41O75Q26J006J208
1340A3119J414J632J907K270K721L249L840M460N008N343N336M903M046K914J853J262J329
1338F6606J914K768L801N032O317P276P556P024N696L695J444k94q91l70P59K153L848N780
1336A30114P430Q168P711O070L311k26l612n758o288n746m805l614k099n46M76O78J59r71
1334A30452k676m632o137o675o370n719m986m108l122k316j944j983k298k861l647m427m881
1332F1670m914m706m465m217l919l606l362l182k968k656k280j913j602j351j155j000q76
1329A3498p72o86o08n35m73m36m13l85l52l27l12k96k71k49k44k46k38k15j87j70j68j70j61
$$ plain form
1327 5584 5441 5314 5196 5080 4960 4836 4703 4566 4435 4317 4215 4124 4035 3937 3832 3735 3663 3612 3555 3472 3365 3258 3178 3131 3103 3067 3013
1323 3013 2947 2885 2834 2793 2759 2732 2706 2675 2642 2608 2563 2505 2447 2408 2381 2343 2295 2257 2240 2224 2192 2151 2118 2093 2064 2025 1984 1955 1951 1978 2020 2042 2025 1977 1921
1319 1921 1870 1834 1817 1814 1795 1746 1688 1657 1661 1678 1685 1675 1644 1596 1547 1512 1489 1468 1448 1438 1438 1431 1413 1394 1381 1368 1350 1332 1319 1302 1275 1246 1228 1224 1229 1232 1223 1198 1162
1314 1162 1129 1111 1109 1116 1121 1115 1102 1091 1087 1076 1054 1032 1027 1036 1045 1046 1046 1040 1023 998 984 983 981 969 961 968 981 988 992 997 997 984 963 945 932 919 906 896 887 878 877 888 898 895 884 881
1309 881 890 897 891 876 861 849 840 833 827 815 796 779 776 784 789 782 764 748 749 765 778 770 736 698 679 687 713 745 776 797 801 787 765 746 731 721 714 710 704 696 691 689 686 676 662
1303 662 651 643 626 600 577 575 596 630 661 675 672 666 669 674 662 635 617 630 663 690 701 702 694 679 663 658 656 645 625 611 607 604 597 594 602 609 602 587 574 568 563 557 548 539 529 520
1298 520 512 507 516 546 584 606 603 592 589 598 605 599 580 554 528 508 491 473 461 468 491 511 517 517 527 553 586 611 623 621 611 600 588 574 567 571 572 555 525 512 534 566
1292 566 578 568 558 555 552 545 537 528 513 499 493 492 483 460 433 413 410 421 439 452 455 455 461 471 481 499 533 568 574 540 482 433 407 402 408 412 415 422 438 456 465 468 477 495 513
$$ packed form
1327E584j43j27j18j16j20j24j33j37j31j18j02r1q9r8j05r7p2n1n7q3j07j07q0m7k8l6n4
1323C013o6o2n1m1l4k7k6l1l3l4m5n8n8l9k7l8m8l8j7j6l2m1l3k5k9l9m1k9mK7M2K2j7m8n6
1319A921n1l6j7lj9m9n8l1MJ7Pj0l1m8m9l5k3k1k0j0%pj8j9j3j3j8j8j3j7k7k9j8mNLrk5l6
1314A162l3j8kPNoj3j1mj1k2k2nRRJ%oj7k5j4jkj2qPJ3PMN%j3k1j8j3j3j3j0rrjJ1J0lj1l
1309H81RPoj5j5j2rpoj2j9j7lQNpj8j6JJ6J3ql4l8j9QK6L2L1K1Mj4k2j9j5j0pmoqnklj0j4
1303F62j1qj7k6k3kK1L4L1J4loLNj2k7j8J3L3K7J1Jqj5j6nkj1k0j4mlplQPpj5j3onorrj0r
1298E20qnRL0L8K2lj1lRPoj9k6k6k0j7j8j2PK3K0O%J0K6L3K5J2kj0j1j2j4pMJj7l0j3K2L2
1292E66J2j0j0llpqrj5j4ojrk3k7k0lJ1J8J3L%OJ0J0J8L4L5Ol4n8m9k6nOMLPJ6J8RLRJ8J8
$$ plain form
1287 513 525 530 529 518 502 491 489 486 479 477 483 483 465 436 412 395 375 351 338 344 356 356 344 335 335 334 327 319 317 316 310 301 301 316 336 349 350 347 344 336 322 310 308 317 330 342 352 362
1281 362 371 376 372 356 327 291 258 243 247 257 261 266 284 313 339 351 355 356 354 349 348 355 354 337 316 310 321 335 344 357 378 400 418 427 431 435 448 469 482 469 437 415 416 428
1276 428 429 417 403 398 404 417 423 413 393 378 379 385 385 380 375 369 361 360 369 377 370 350 328 312 298 283 274 276 289 304 308 300 289 290 304 319 320 310 303 304 310 316 326 343 359 364 359 349
1270 349 339 326 312 307 318 340 360 374 384 392 393 388 389 409 445 488 528 559 573 564 546 537 542 552 558 563 579 606 641 680 718 752 779 801 816 821 815 807 803 803 803 803 813
1265 813 835 852 844 805 753 713 690 679 680 705 748 782 785 767 745 722 691 661 651 660 664 648 624 607 599 587 563 530 497 480 480 478 455 421 409 427 450 453 435
1260 435 406 375 348 332 326 318 311 318 340 358 360 361 378 403 415 412 410 417 423 423 416 397 368 339 323 318 313 300 287 274 263 256 256 259 263 277 301 323 330 323 316 310 297 278 266 271
1254 271 287 307 321 322 320 332 362 383 376 353 345 352 353 340 330 333 337 330 319 316 318 317 312 302 290 279 275 273 264 250 244 248 249 243 245 258 272 275 274 276 279 282 295 324 354 367 365 359 353
1248 353 349 352 362 369 359 334 305 281 268 271 285 292 277 243 215 206 216 236 259 277 284 280 265 242 217 203 205 216 230 254 288 311 302 264 228 209 198 182 166 165
$$ packed form
1287E13J2Njj1j6j1klpkO%j8k9k4j7k0k4j3OJ2%j2r%jpqkjor%J5K0J3Jllqj4j2kRJ3J2J0J0
1281C62RNmj6k9l6l3j5MJ0MNJ8K9K6J2MJknjPjj7k1oJ1J4RJ3K1K2J8RMMJ3K1J3j3l2k2JJ2
1276D28Jj2j4nOJ3Oj0k0j5JO%nnoqjRQpk0k2j6j4j5rKJ3J5Mqj1JJ4J5Jj0pJOOJ0J7J6Nnj0
1270C49j0j3j4nJ1K2K0J4J0QJnJK0L6M3M0L1J4rj8rNJ0ONJ6K7L5L9L8L4K7K2J5Noqm%%%J0
1265H13K2J7ql9n2m0k3j1JK5M3L4Lj8k2k3l1l0j0RMj6k4j7qj2k4l3l3j7%kk3l4j2J8K3Lj8
1260D35k9l1k7j6oqpPK2J8KJJ7K5J2lkPO%pj9k9k9j6nnj3j3j3j1p%LMJ4K4K2Pppoj3j9j2N
1254B71J6K0J4JkJ2L0K1pk3qPJj3j0LMpj1lKjnj0j2j1mkrj4oMJoKJ3J4LjKLLJ3K9L0J3koo
1248C53mLJ0Pj0k5k9k4j3LJ4Pj5l4k8rJ0K0K3J8Pmj5k3k5j4KJ1J4K4L4K3rl8l6j9j1j6j6j
$$ plain form
1243 165 182 206 225 235 238 232 220 205 194 195 212 239 264 278 288 302 319 322 298 261 237 237 250 257 254 251 254 267 290 321 340 333 309 292 294 308 316 316 309 297 288 292 310
1238 310 327 332 326 319 318 323 335 343 335 313 295 292 294 291 293 307 320 312 285 262 255 255 253 247 241 237 232 223 211 202 204 221 245 263 270 263 242 212 186 174 176 182 187 192 197 207 227 253 271
1232 271 271 260 253 253 257 261 262 248 220 196 190 193 183 163 152 156 162 160 156 159 176 207 244 269 268 256 257 273 283 275 265 265 267 251 221 199 203 228 256 266 251 227 213 215 230
1227 230 253 283 313 326 321 314 313 309 291 268 256 259 271 285 298 302 299 299 308 316 316 310 307 307 306 305 305 296 275 250 237 237 234 222 210 210 226 248 266 271 265 259 261 266 260 238 210 189
1221 189 184 197 216 229 229 225 232 253 278 294 295 282 262 243 230 226 228 230 228 214 194 178 176 183 190 192 192 197 213 236 258 273 282 293 299 290 267 252 258 274 278 266 249 233 215
1215 215 201 205 228 252 263 263 260 254 246 244 253 269 276 270 254 229 198 168 159 182 226 265 281 273 258 246 239 233 221 200 172 151 148 167 199 233 260 273 269 248 220 190
1210 190 159 131 114 109 107 108 122 154 191 218 233 249 269 280 275 262 252 246 239 233 233 238 238 229 219 220 235 261 290 314 328 333 332 329 325 319 307 285 255 223 200 188 182 179
1205 179 179 181 181 181 191 212 226 213 171 125 99 97 108 124 140 145 136 119 106 104 112 136 177 221 249 256 257 263 268 266 261 258 256 251 243 238 232 222 210 210 227 254 277 280 261 232
$$ packed form
1243A65J7K4J9J0Loj2j5j1JJ7K7K5J4J0J4J7Lk4l7k4%J3PllLJ3K3L1J9pk4j7KJ4Q%pj2rMJ8
1238C10J7NopjNJ2Qqk2j8lKlKJ4J3qk7k3p%koomnrj2rKJ7K4J8Ppk1l0k6j2KONNNJ0K0K6J8
1232B71%j1p%MMJj4k8k4oLj0k0j1MOkmLJ7L1L7K5jj2JJ6J0qj0%Kj6l0k2MK5K8J0j5k4j4KJ5
1227B30K3L0L0J3npjmj8k3j2LJ2J4J3Ml%RQ%ol%jj%rk1k5j3%lj2j2%J6K2J8NooKNok2k8k1
1221A89nJ3J9J3%mPK1K5J6Jj3k0j9j3mKKkj4k0j6kPPK%NJ6K3K2J5RJ1Ork3j5OJ6Mj2j7j6j8
1215B15j4MK3K4J1%loqkRJ6Poj6k5l1l0rK3M4L9J6qj5j2poj2k1k8k1lJ9L2L4K7J3mk1k8l0
1210A90l1k8j7nkJJ4L2L7K7J5J6K0J1nj3j0opo%N%rj0JJ5K6K9K4J4Njlmoj2k2l0l2k3j2ol
1205A79%K%%J0K1J4j3m2m6k6kJ1J6J6Nrj7j3kQK4M1M4K8PJONknlknqnoj0j2%J7K7K3Lj9k9
$$ plain form
1199 232 208 192 181 174 178 189 195 188 173 160 148 138 139 154 170 173 170 175 189 196 189 178 178 193 212 224 222 211 201 196 190 175 153 137 136 147 158 163 161 156 154 159 164 164 158 155 158
1193 158 169 186 208 231 250 261 263 259 251 246 250 263 283 299 296 268 231 204 188 167 139 123 134 162 188 210 236 263 276 271 256 242 233 231 234 238 238 237 239 235 222 209
1188 209 209 221 231 233 227 209 184 169 176 194 196 185 182 194 205 204 200 199 196 191 198 223 252 268 276 285 296 300 296 287 266 233 199 177 168 169 173 177 173 161 150 142 129 109 102 124 174
1182 174 227 260 263 240 206 185 190 213 244 276 301 311 307 303 307 306 290 269 266 283 300 294 265 235 225 239 264 286 307 328 338 319 279 243 224 209 185 163 154
1178 154 145 125 106 106 118 120 108 99 108 127 144 153 153 146 135 122 101 70 40 29 38 54 65 70 72 77 90 111 130 139 144 155 168 181 198 228 260 279 284 284 282 265 239
1172 239 221 218 216 201 182 168 160 154 149 150 155 158 157 161 175 198 220 223 204 181 176 190 202 202 201 208 217 216 205 190 172 156 152 165 180 179 160 144 148 170 198 223 243 257 258
1167 258 246 230 226 243 266 278 274 266 262 259 247 224 194 166 152 154 165 175 181 183 177 160 149 161 190 211 210 201 200 206 206 194 176 158 144 140 145 153 158 160 159 158 170 207 258
1161 258 296 304 298 297 300 289 262 239 234 244 255 260 262 270 278 277 261 244 240 243 234 223 236 281 328 351 350 342 321 276 219 186 191 217 240 254 263 266 266 273 291 310 312 293 268
$$ packed form
1199B32k4j6j1pMJ1Opj5j3j2j0JJ5J6LlNJ4Ppj1%J5J9J2kj1j0noj5k2j6jJ1J1NknkNN%olL
1193A58J1J7K2K3J9J1KmqnMJ3K0J6lk8l7k7j6k1k8j6J1K8K6K2K6K7J3nj5j4rkLM%jKmj3j3
1188B09%J2J0Koj8k5j5PJ8Kj1lJ2J1jmjlnPK5K9J6QRJ1Mmrk1l3l4k2rJMMmj2j1qj3k0pK2N0
1182A74N3L3Lk3l4k1NK3L1L2K5J0mmMjj6k1lJ7J7ok9l0j0J4K5K2K1K1J0j9m0l6j9j5k4k2r
1178A54rk0j9%J2Kj2rRJ9J7R%pj1j3k1l1l0j1RJ6J1NKNJ3K1J9RNJ1J3J3J7L0L2J9N%kj7k6
1172B39j8lkj5j9j4qonJNLjMJ4K3K2Lj9k3nJ4J2%jPRjj1j5j8j6mJ3J5jj9j6MK2K8K5K0J4J
1167B58j2j6mJ7K3J2mqmlj2k3l0k8j4KJ1J0OKoj7j1J2K9K1jrjO%j2j8j8j4mNQNKjjJ2L7N1
1161B58L8QojLj1k7k3nJ0J1NKQQjj6j7mLrj1J3M5M7K3jqk1m5n7l3NK6K3J4RL%PJ8J9Kj9k5
$$ plain form
1156 268 256 261 269 260 229 185 147 121 106 97 94 102 122 152 178 188 181 171 172 180 185 181 171 161 150 136 122 115 116 123 125 118 117 135 166 184 177 162 162 177 189 190 187 188 192 194 197
1150 197 204 217 235 253 266 272 275 280 284 283 279 275 276 281 289 297 296 277 241 192 145 117 117 137 158 171 183 195 197 185 167 154 146 142 152 178 204 215 212 212 217 221 226 240 264 282
1144 282 289 291 292 288 278 273 280 294 300 296 283 264 236 203 176 164 168 174 172 167 171 189 207 215 218 224 226 213 189 172 164 152 135 129 146 174 192 193 192 196 203 205 204 208 225 246 259 260
1139 260 265 284 310 323 320 311 304 299 299 308 324 336 335 327 324 330 341 345 336 318 307 316 335 347 343 334 325 314 299 288 289 294 292 284 276 273 277 285 289 283 276 280 293 301 294 274 250 225 207 204 214
1132 214 229 246 270 291 291 265 234 221 221 218 211 209 217 226 228 228 232 244 263 287 305 311 305 295 288 287 296 314 341 371 397 410 405 381 351 324 303 292 292 299 298 283 260 230
1127 230 188 139 110 120 164 211 238 242 230 211 193 176 156 134 126 145 180 208 216 207 196 194 207 233 259 267 248 208 156 109 86 96 127 156 175 185 189 183 166
1122 166 144 125 107 91 81 83 93 101 101 96 92 101 127 164 186 175 134 92 78 88 101 103 108 131 163 184 187 187 192 189 166 131 105 97 99 106 117 126 131 132 135 138 136 125 114
1117 114 111 122 143 164 176 177 171 159 140 119 106 108 120 132 138 137 130 126 134 153 169 176 185 203 221 224 216 212 210 202 192 193 205 213 205 191 180 170 156 142 138 151 181 224 265
$$ packed form
1156B68j2NQrl1m4l8k6j5rlQK0L0K6J0pj0JQNmj0j0j1j4j4pJPKpjJ8L1J8pj5%J5J2JlJMKL
1150A97PJ3J8J8J3OLNMjmmJNQQjj9l6m9m7k8%K0K1J3J2J2Kj2j8j3qmJ0K6K6J1l%NMNJ4K4J8
1144B82PKJmj0nPJ4Omj3j9k8l3k7j2MOknMJ8J8QLOKj3k4j7qj2j7oJ7K8J8JjMPKjMJ7K1J3J
1139B60NJ9K6J3lrpn%RJ6J2jqlOJ1Mrj8j1RJ9J2mrrj1j5j1JNkqqlMQMopMJ3Qpk0k4k5j8lJ0
1132B14J5J7K4K1%k6l1j3%lpkQRK%MJ2J9K4J8Ooj0pjRJ8K7L0K6J3nk4l0k7k1j1%Pjj5k3l0
1127B30m2m9k9J0M4M7K7Mj2j9j8j7k0k2qJ9L5K8Qrj1kJ3K6K6Qj9m0n2m7k3J0L1K9J9J0Moj7
1122A66k2j9j8j6j0KJ0Q%nmRK6L7K2j1m1m2j4J0J3KNK3L2K1L%Nlk3l5k6qKPJ1RNJLLkj1j1
1117A14lJ1K1K1J2Joj2j9k1j3KJ2J2OjpmQJ9J6PRJ8J8Lqmkqj0JJ2Qqj4j1j0j4j4mJ3L0M3M1
$$ plain form
1111 265 288 289 280 278 287 302 316 326 331 334 333 323 299 270 250 243 240 229 212 194 179 163 147 136 133 140 154 171 191 214 236 249 246 226 201 179 167 163 163 164 170 181 193
1106 193 198 195 195 198 194 177 158 151 154 157 157 161 174 193 213 226 224 213 208 212 215 205 196 200 205 194 171 154 145 133 122 128 146 155 150 151 168 185 185 180 184 193 199 205 213 212 194 170 157 150
1100 150 136 120 119 136 159 179 196 212 230 248 265 275 273 265 255 237 208 180 164 161 161 153 142 141 157 185 207 211 200 183 162 131 98 85 96 115 132 155 192
1095 192 231 254 256 243 218 186 159 140 123 106 104 123 141 133 111 99 106 116 122 130 138 136 123 109 99 83 59 41 36 40 47 58 73 94 119 146 166 174 179 194 213
1090 213 215 198 183 183 183 170 152 150 168 190 198 187 166 146 136 139 147 155 160 169 183 199 209 210 205 206 214 219 214 209 217 238 260 270 266 249 222 192 167 146 128 118 117 119 119 123
1084 123 139 159 167 163 161 168 176 175 171 171 172 174 180 189 190 174 149 136 142 161 178 181 168 149 136 129 122 111 105 114 133 155 177 202 229 251 267 274 266 243 214 198 206 225 237 232
1079 232 224 227 238 243 238 231 226 211 183 154 137 130 126 131 157 194 215 205 175 140 111 95 98 117 136 144 147 153 163 174 183 186 179 162 147 147 165 193 213 218 209 198 193 198 207 221
1073 221 232 224 190 148 127 137 156 165 162 152 133 111 99 104 120 132 135 134 136 150 176 205 219 210 188 167 153 153 163 171 162 139 119 119 136 159 180 191 190 182 177 173 161
$$ packed form
1111B65K3JrkRJ5J4J0NLjj0k4k9k0plj1j7j8j5j6j6j1lPJ4J7K0K3K2J3lk0k5k2j2m%JOJ1J2
1106A93Nl%Lmj7j9pLL%MJ3J9K0J3kj1nMLj0rMNj1k3j7rj2j1OJ8RnJJ7J7%nMROOQjj8k4j3p
1100A50j4j6jJ7K3K0J7J6J8J8J7J0kqj0j8k9k8j6l%qj1jJ6K8K2Mj1j7k1l1l3j3J1J9J7K3L7
1095A92L9K3Kj3k5l2k7j9j7j7kJ9J8qk2j2PJ0OQQkj3j4j0j6k4j8nMPJ1J5K1K5K7K0QNJ5J9
1090B13Kj7j5%%j3j8kJ8K2Qj1k1k0j0LQQNRJ4J6J0JnJQNnnQK1K2J0mj7k7l0k5k1j8j0jK%M
1084A23J6K0QmkPQjm%JKORJj6k5j3OJ9J7Lj3j9j3ppj1oRJ9K2K2K5K7K2J6Pqk3k9j6QJ9J2n
1079B32qLJ1Nnpnj5k8k9j7pmNK6L7K1j0l0l5k9j6LJ9J9QLOJ0J1RLpj7j5%J8K8K0Nrj1nNRJ4
1073B21J1ql4m2k1J0J9Rlj0j9k2j2NJ6J2LjKJ4K6K9J4rk2k1j4%J0Qrk3k0%J7K3K1J1jqnmj2
$$ plain form
1068 161 144 141 151 157 148 142 154 170 166 140 113 104 113 131 149 162 175 194 211 209 177 135 105 94 95 104 119 132 135 127 110 89 73 75 100 131 151 156 151 142 136 141 160 185
1063 185 213 247 274 271 235 191 168 163 155 142 138 147 155 154 151 153 158 164 174 184 192 198 204 208 208 207 211 212 197 171 153 154 171 195 214 221 213 204 208 221 228 227 230 236 233 215 188 171 172 190
1056 190 214 227 218 193 168 152 142 133 122 109 103 115 147 181 200 206 210 211 206 205 224 258 283 288 276 260 244 237 244 259 269 271 271 269 261 254 258 270 273 259 237 213 187 162
1051 162 152 159 168 166 151 130 110 103 116 142 159 156 142 130 123 129 153 188 213 218 214 212 213 213 215 219 222 225 234 248 260 266 276 294 310 311 296 275 258 255 266 282 284 272 261
1046 261 256 247 227 206 193 181 162 140 127 119 110 105 113 133 153 164 165 158 153 152 146 130 112 105 111 124 145 192 261 319 338 321 291 263 244 241 256 278 286 273 244 211
1040 211 190 192 208 215 206 201 219 248 259 243 218 196 177 158 137 111 82 60 53 58 69 93 133 181 217 233 232 216 193 176 170 161 138 115 110 121 129 125 120 126 137 146
1035 146 155 170 189 202 203 197 196 213 243 268 280 287 301 317 324 319 307 290 267 250 251 264 266 245 208 171 146 135 133 130 122 121 138 171 208 240 262 266 248 220 197 186
1030 186 185 194 211 226 228 222 217 214 208 198 192 194 201 212 225 231 220 204 199 206 209 208 215 235 248 236 202 163 135 125 130 141 158 187 231 270 280 265 248 245 249 251 249 249 255 270
$$ packed form
1068A61j7lJ0OroJ2J6mk6k7rRJ8J8J3J3J9J7kl2m2l0j1JRJ5J3Lqj7k1j6KK5L1K0NnroNJ9K5
1063A85K8L4K7ll6m4k3nqj3mRQjlKNOJ0J0QOOM%jMJj5k6j8JJ7K4J9PqrMJ3PjLOlj8k7j7JJ8
1056A90K4J3rk5k5j6j0rj1j3oJ2L2L4J9OMJnjJ9L4K5Nj2j6j6pPJ5J0K%kqpMJ2Lj4k2k4k6k5
1051A62j0PRkj5k1k0pJ3K6J7lj4j2pOK4L5K5NmkJ%KMLLRJ4J2OJ0J8J6Jj5k1j7lJ1J6Kj2j1
1046B61nrk0k1j3j2j9k2j3qrnQK0K0J1Jpnjoj6j8pOJ3K1M7O9N8J9j7l0k8j9lJ5K2Qj3k9l3
1040B11k1KJ6PrnJ8K9J1j6k5k2j9j9k1k6k9k2pNJ1K4M0M8L6J6jj6k3j7ork3k3nJ1QmnOJ1R
1035A46RJ5J9J3JojJ7L0K5J2PJ4J6Pnj2j7k3j7JJ3Kk1l7l7k5j1klqjJ7L3L7L2K2Mj8k8k3j1
1030A86jRJ7J5Konloj0oKPJ1J3Oj1j6nPLjPK0J3j2l4l9k8j0NJ1J7K9M4L9J0j5j7lMKk%OJ5
$$ plain form
1025 270 290 303 304 302 310 323 328 326 331 340 334 310 289 280 274 259 242 233 231 232 235 241 246 251 258 260 249 231 226 243 267 282 291 301 310 314 310 298 277 252 236 231 232 239 261 287 291 260 215
1019 215 186 174 167 162 167 182 196 202 199 195 197 205 212 211 207 208 212 204 189 185 200 222 234 232 217 189 157 140 145 156 165 177 197 212 210 200 197 192 171 142 130 143 166 178 172 152
1013 152 132 122 126 131 130 127 135 158 187 213 224 216 189 156 130 112 101 97 97 93 84 78 77 71 65 76 117 174 218 234 223 196 170 160 168 178 173 156 141 135 138 146 153 148 129
1007 129 108 100 103 109 117 124 125 115 108 117 136 148 150 151 159 174 195 220 232 219 190 170 168 174 173 163 146 129 124 132 140 132 109 87 76 73 77 91 113 136 154 170 187 204 220
1002 220 231 233 225 213 202 191 178 171 177 189 196 193 181 165 151 153 169 178 166 153 162 188 204 199 188 180 166 143 128 135 165 212 264 305 320 311 289 261 231 212 216 233
997 233 243 239 232 224 206 180 160 154 154 156 161 167 164 154 156 178 214 247 272 285 283 271 260 252 237 219 211 214 215 206 192 179 164 146 135 137 148 161 173 178 174 168 171 180 183 179 180 181
991 181 169 143 118 100 72 33 3 1 17 36 59 92 127 147 157 172 195 212 214 197 166 132 113 111 115 114 117 126 136 140 147 161 170 162 144 132 124 110 93 83 87 101
986 101 123 142 144 126 109 113 135 157 171 179 183 178 172 173 184 196 208 220 229 229 230 243 267 284 287 285 285 279 262 242 229 218 194 154 112 81 67 70 88 118 156 191 210
$$ packed form
1025B70K0J3JkQJ3NkNRok4k1roj5j7rkJLONNPKj1j8nJ7K4J5RJ0RMmj2k1k5j6nJPK2K6Ml1m5
1019B15k9j2pnNJ5J4OlmKQPjmJMqj5mJ5K2J2kj5k8l2j7NJ1RJ2K0J5kj0lnk1k9j2J3K3J2ok0
1013A52k0j0MNjlQK3K9K6J1qk7l3k6j8j1m%mrojooJ1M1N7M4J6j1k7k6j0QJ0nj7j5oLQPnj9
1007A29k1qLOQPJj0pRJ9J2KJQJ5K1K5J2j3k9k0kOjj0j7j7nQQqk3k2j1lMJ4K2K3J8J6J7J7J6
1002B20J1Kqj2j1j1j3pOJ2Plj2j6j4KJ6Rj2j3RK6J6nj1qj4k3j5PL0M7N2M1J5rk2k8l0j9MJ7
997B33J0mpqj8k6k0o%KNOlj0KK2L6L3K5J3kj2j1qj5j8qLJrj4j3j5j8j1KJ1J3J2NmoLRLmJJ
991A81j2k6k5j8k8l9l0kJ6J9K3L3L5K0J0J5K3J7Kj7l1l4j9kMjLRJ0MPJ4Rqj8j2qj4j7j0MJ4
986A01K2J9Kj8j7MK2K2J4QMnoJJ1J2J2J2R%JJ3K4J7Lk%oj7k0j3j1k4m0m2l1j4LJ8L0L8L5J9
$$ plain form
981 210 202 169 128 101 100 118 137 152 170 192 206 206 204 210 218 215 207 207 216 221 220 224 236 238 227 215 207 190 165 152 157 163 153 139 138 146 146 144 155 173 183 184 190 207 223 226 214
975 214 195 183 191 217 246 265 276 278 264 233 201 181 164 144 131 137 151 158 157 162 174 184 194 211 232 245 251 259 267 266 252 229 198 162 133 121 120 121 127 144 161 164
970 164 152 137 126 117 116 128 144 151 152 152 145 126 113 122 146 163 173 190 210 216 209 209 224 238 238 226 205 177 151 141 144 147 151 167 185 184 159 135 125 121 116 112 115 119 123 130
964 130 137 140 147 168 190 189 170 161 176 189 182 165 155 148 138 127 123 124 129 140 151 151 145 155 179 187 162 124 99 82 65 60 82 118 141 143 140 137 127 109 90 77 72 79 96
958 96 113 121 124 131 143 152 157 161 165 175 195 218 232 235 238 243 238 220 199 174 138 101 88 102 119 123 129 145 153 131 97 74 69 72 88 117 141 141 132 142 169 185 177 154 132
953 132 122 127 139 141 124 101 89 89 92 105 136 169 184 182 183 198 214 219 212 193 168 150 148 147 132 111 102 112 126 137 148 160 165 160 155 155 156 151 149 157 173 182 171 136 98
947 98 85 104 132 145 146 149 154 148 130 113 107 110 120 137 159 179 187 182 167 154 154 164 166 155 148 160 182 194 188 166 129 83 44 33 48 74 104 133 151 150 142 143 156
942 156 174 191 202 200 182 171 183 209 223 220 209 194 176 169 180 196 199 191 190 190 175 148 137 151 176 199 226 253 269 266 249 222 186 153 136 135 137 144 165 191 197
$$ packed form
981B10ql3m1k7jJ8J9J5J8K2J4%kOQlq%RNjMJ2Kj1j2qj7k5j3NOj0j4jQ%kJ1J8J0JOJ7J6Lj2
975B14j9j2QK6K9J9J1Kj4l1l2k0j7k0j3OJ4PjNJ2J0J0J7K1J3OQQjj4k3l1l6k9j2jJOJ7J7L
970A64j2j5j1rjJ2J6PJ%pj9j3RK4J7J0J7K0Op%J5J4%j2k1k8k6j0LLMJ6J8jk5k4j0mnmLMMP
964A30PLPK1K2jj9rJ5J3pj7j0pj0j1mJNJ1J1%oJ0K4Qk5l8k5j7j7nK2L6K3Kllj0j8j9j3nPJ7
958I6J7QLPJ2RNMMJ0K0K3J4LLNnj8k1k5l6l7j3J4J7MOJ6Qk2l4k3nLJ6K9K4%rJ0K7J6qk3k2
953A32j0NJ2Kj7k3j2%LJ3L1L3J5kJJ5J6Npj9k5j8kjj5k1rJ0J4J1J1J2Nnn%JnkQJ6Rj1l5l8
947I8j3J9K8J3JLNoj8j7oLJ0J7K2K0Qnj5j3%J0Kj1pJ2K2J2ok2l7m6l9j1J5K6L0K9J8jqJJ3
942A56J8J7J1kj8j1J2K6J4lj1j5j8pJ1J6Lqj%j5k7j1J4K5K3K7K7J6lj7k7l6l3j7jKPK1K6O
$$ plain form
937 197 174 144 124 114 114 127 142 140 124 117 125 131 127 126 136 145 145 152 171 186 182 167 152 131 100 74 73 95 121 139 139 121 99 90 100 114 119 122 125 123 113 111 132 159 164
932 164 136 92 56 47 67 108 155 196 232 262 287 308 325 335 338 346 363 374 363 340 323 312 291 259 232 214 199 185 179 174 156 128 108 105 112 123 141 160 167
927 167 172 191 212 204 166 130 113 98 76 63 68 71 62 59 77 100 114 123 137 145 139 136 152 178 201 222 233 212 158 107 92 99 98 88 87 97 107 116 125 122 97 62 33
922 33 11 -2 1 28 51 48 33 33 50 68 84 109 139 161 171 174 162 133 106 100 117 142 169 194 205 202 208 235 260 256 227 197 171 140 115 118 145 175 198 217
917 217 229 229 225 227 227 217 208 213 222 215 201 198 199 187 173 177 190 183 155 132 124 112 92 81 91 108 123 141 165 189 209 222 224 209 190 179 165 131 87 60 56 60 69 90
911 90 112 109 82 59 49 40 30 33 49 60 65 83 117 141 142 134 134 135 135 145 164 174 168 162 162 151 120 89 78 78 74 71 74 77 75 83 109 137 151 154 161 169 168 157 146 140 141 145 146
905 146 140 139 155 181 200 208 214 218 214 202 191 183 173 168 177 192 198 202 215 230 231 223 223 221 191 145 120 128 141 139 138 149 161 166 173 181 180 177 189 211 209 180 155 148 137 113 104 125
900 125 148 147 143 160 180 179 169 175 189 187 172 162 157 149 145 161 189 212 228 239 241 232 224 224 220 207 202 216 229 223 207 199 199 196 197 203 201 183 166 158 143 115 102 122 146 138 109
$$ packed form
937A97k3l0k0j0%J3J5kj6pQOmjJ0R%PJ9J5mj5j5k1l1k6jK2K6J8%j8k2rJ0J4NLLkj0kK1K7N
932A64k8m4l6rK0M1M7M1L6L0K5K1J7J0LQJ7J1j1k3j7j1k1l2k7j8j5j4onj8k8k0lPJ1J8J9P
927A67NJ9K1ql8l6j7j5k2j3NLrlJ8K3J4RJ4QolJ6K6K3K1J1k1n4n1j5Pjj0jJ0J0RRlk5l5k9
922C3k2j3LK7K3lj5%J7J8J6K5L0K2J0Lj2k9k7oJ7K5K7K5J1lOK7K5mk9l0k6l1k5LK7L0K3J9
917B17J2%mK%j0rNRpj4lJj2j4MJ3pk8k3qj2k0j1J0J7J5J8K4K4K0J3Kj5j9j1j4l4m4k7mMRK1
911I0K2lk7k3j0rj0LJ6J1NJ8L4K4Jq%J%J0J9J0oo%j1l1l1j1%mlLLkQK6K8J4LPQjj1j1oJMJ
905A46ojJ6K6J9QOMmj2j1qj0nRJ5OMJ3J5Jq%kl0m6k5QJ3kjJ1J2NPQjlJ2K2kk9k5pj1k4rK1
900A25K3jmJ7K0jj0OJ4kj5j0nqmJ6K8K3J6J1Krq%mj3nJ4J3oj6q%lJOkj8j7qj5k8j3K0K4qk9
$$ plain form
894 109 94 103 120 144 177 200 198 182 174 167 146 124 125 138 139 129 133 149 156 151 153 165 172 165 154 142 127 121 129 135 124 108 112 135 155 165 168 155 121 90 91 112 121 124 147
888 147 187 211 202 184 175 171 169 173 182 184 182 191 207 214 207 201 201 199 194 196 210 233 258 281 293 285 272 273 284 284 266 239 211 191 191 216 244 260 271 285 288 269 250 252 260 249 230
883 230 227 232 220 200 203 229 251 267 299 343 363 353 341 340 334 325 334 363 381 379 378 387 386 366 347 338 323 299 289 301 314 320 333 360 384 396 414 446 474 488 505 539
877 539 587 649 733 834 932 1027 1142 1284 1440 1614 1824 2059 2265 2410 2502 2546 2522 2429 2302 2174 2033 1865 1690 1544 1433 1349 1287
874 1287 1235 1178 1119 1089 1098 1112 1098 1059 1018 984 967 977 1004 1026 1034 1052 1085 1104 1093 1084 1114 1179 1259 1348 1456 1588 1748 1948 2186 2445 2729 3069
870 3069 3494 4009 4636 5424 6402 7547 8811 10139 11437 12535 13251 13476 13226 12617 11810 10940 10056 9163 8279 7449 6679 5926
868 5926 5182 4503 3940 3486 3106 2794 2554 2364 2197 2052 1930 1813 1694 1599 1551 1526 1497 1464 1437 1402 1354 1313 1298 1295 1288 1287 1304 1318 1317 1326 1364
864 1364 1410 1441 1466 1499 1520 1511 1489 1469 1433 1365 1293 1244 1198 1128 1051 991 930 845 761 709 675 627 576 552 543 520 489 483 495 500 496 502 509 498 485 496 523 536
$$ packed form
894A09j5RJ7K4L3K3kj6qpk1k2JJ3Jj0MJ6PnKJ2Ppj1j2j5oQOj1j6MK3K0J0Lj3l4l1JK1RLK3
888A47M0K4rj8rmkMRKkRJ6Ppo%knKJ4K3K5K3J2qj3JJ1%j8k7k8k0%K5K8J6J1J4Lj9j9KQj1j9
883B30lNj2k0LK6K2J6L2M4K0j0j2jorRK9J8kjRjk0j9rj5k4j0J2J3OJ3K7K4J2J8L2K8J4J7L4
877E39M8O2Q4J01R8R5J15J42J56J74K10K35K06J45R2M4k4r3j27j28j41j68j75j46j11q4o2
874A287n2n7n9l0RJ4j4l9m1l4j7J0K7K2QJ8L3J9j1rL0O5Q0Q9J08J32J60K00K38K59K84L40
870C069M25N15O27P88R78J145J264J328J298J098P16K25k50o09q07q70q84q93q84q30p70p53
868E926p44o79n63m54l80l12k40j90j67j45j22j17j19r5m8k5k9l3k7l5m8m1j5lpjJ7J4jRL8
864A364M6L1K5L3K1rk2k0l6o8p2m9m6p0p7o0o1q5q4n2l4m8n1k4rk3l1oJ2NmOPj1j3J1K7J3
$$ plain form
859 536 535 539 539 519 494 489 488 465 435 436 460 471 469 477 491 490 480 484 493 484 474 496 540 570 583 599 604 572 526 518 549 573 576 577 577 553 512 493 500 509 518 552 599 621 612 606
853 606 611 604 585 587 611 629 638 660 690 696 683 693 735 772 791 809 827 814 770 732 716 703 688 687 691 670 631 616 629 633 620 620 635 633 612 607 628 635 616 610 629 642
848 642 637 651 697 738 749 750 754 742 714 706 725 731 707 689 701 713 706 703 717 723 710 705 721 726 710 706 736 774 797 813 824 806 765 752 786 824 836 842 858 859 842 846
843 846 884 913 903 883 877 859 823 814 850 879 862 838 843 849 824 798 809 835 837 820 804 785 762 772 828 878 877 856 864 896 922 943 969 980 970 970 996 1019 1016 1021
838 1021 1057 1095 1110 1127 1155 1154 1101 1048 1042 1053 1035 1010 1016 1045 1076 1128 1217 1298 1335 1359 1406 1441 1429 1406 1421 1450 1453 1448 1472 1507 1520 1532 1573 1616 1627 1635 1676 1723
834 1723 1736 1740 1773 1815 1834 1861 1929 2000 2030 2047 2089 2130 2134 2136 2181 2231 2243 2259 2333 2421 2456 2464 2514 2587 2614 2603 2615 2642 2636 2610 2608 2614 2579 2529 2520 2532 2509 2465 2455
829 2455 2464 2443 2422 2461 2533 2567 2585 2656 2756 2805 2815 2868 2966 3030 3051 3093 3175 3251 3318 3413 3512 3555 3562 3607 3680 3713 3716 3760 3844 3895 3916 3983 4106 4212 4286
825 4286 4373 4471 4525 4551 4621 4724 4783 4802 4858 4956 5019 5040 5084 5159 5201 5219 5287 5397 5464 5487 5554 5674 5767 5823 5914 6039 6115 6146 6230 6379 6510 6614
$$ packed form
859E36jM%k0k5njk3l0JK4J1kQJ4jj0MRrj0K2M4L0J3J6Nl2m6qL1K4LJ%k4m1j9PRRL4M7K2ro
853F06Npj9KK4J8RK2L0Oj3J0M2L7J9J8J8j3m4l8j6j3j5jMk1l9j5J3Mj3%J5kk1nK1Pj9oJ9J3
848F42nJ4M6M1J1JMj2k8qJ9Ok4j8J2J2plJ4Oj3nJ6Nj6mL0L8K3J6J1j8m1j3L4L8J2OJ6Jj7M
843H46L8K9j0k0oj8l6rL6K9j7k4NOk5k6J1K6Kj7j6j9k3J0N6N0jk1QL2K6K1K6J1j0%K6K3lN
838A021L6L8J5J7K8jn3n3oJ1j8k5OK9L1N2Q9Q1L7K4M7L5j2k3J5K9LnK4L5J3J2M1M3J1QM1M7
834A723J3ML3M2J9K7O8P1L0J7M2M1MKM5N0J2J6P4Q8L5QN0P3K7j1J2K7ok6kOl5n0rJ2k3m4j0
829B455Rk1k1L9P2L4J8P1J00M9J0N3R8O4K1M2Q2P6O7R5R9M3PM5P3L3LM4Q4N1K1O7J23J06P4
825D286Q7R8N4K6P0J03N9J9N6R8O3K1M4P5M2J8O8J10O7K3O7J20R3N6R1J25P6L1Q4J49J31J04
$$ plain form
821 6614 6773 6994 7181 7321 7504 7748 7964 8142 8369 8647 8868 9019 9203 9444 9650 9815 10061 10409 10737 11008 11324 11706 12031
818 12031 12258 12512 12845 13149 13381 13658 14042 14432 14787 15223 15791 16379 16932 17553 18295 19052 19790 20640 21673 22776 23891 25118
815 25118 26497 27896 29259 30719 32351 34064 35860 37963 40546 43595 47187 51619 57136 63777 71648 81081 92386
813 92386 105769 121669 140876 164141 191886 224296 261108 300863 340551 376199 403731 419652 422073 411872
811 411872 392498 367999 341198 313684 286631 260852 236436 213139 191131 171005 153316 138503 126948 118594
810 118594 112763 108783 106519 105933 106593 108110 110637 114349 118862 123747 129165 135368 142103 149247 157531 167857 180438
808 180438 195480 214145 237865 267287 302945 346277 398736 460757 533325 620054 725983 854898 1009608
806 1009608 1193459 1407440 1644145 1885987 2109056 2286721 2392456 2408519 2338474 2208535 2050902 1885085
$$ packed form
821F614J59K21J87J40J83K44K16J78K27K78K21J51J84K41K06J65K46L48L28K71L16L82L25
818A2031K27K54L33L04K32K77L84L90L55M36N68N88N53O21P42P57P38Q50J033J103J115J227
815B5118J379J399J363J460J632J713J796K103K583L049L592M432N517O641P871R433J1305
813I2386J3383J5900J9207K3265K7745L2410L6812L9755L9688L5648K7532J5921K421j0201
811D11872j9374k4499k6801k7514k7053k5779k4416k3297k2008k0126j7689j4813j1555q354
810A18594n831l980k264n86O60J517K527L712M513M885N418O203O735P144Q284J0326J2581
808A80438J5042J8665K3720K9422L5658M3332N2459O2021P2568Q6729J05929J28915J54710
806A009608J83851K13981K36705K41842K23069J77665J05735J6063p0045j29939j57633j65817
$$ plain form
805 1885085 1716465 1548130 1386497 1235173 1090739 949113 813218 691114 588403 505114 438419 385261
803 385261 342628 307784 279046 255484 235932 219153 204643 192339 181744 172099 163141 154904 147041 139078 131145
801 131145 123752 117006 110660 104741 99477 94755 90237 85903 81972 78396 74934 71598 68571 65775 62984 60256 57811
799 57811 55600 53398 51245 49361 47722 46120 44557 43204 42032 40857 39694 38698 37819 36872 35888 35051 34341 33572 32738
797 32738 31994 31327 30574 29743 28991 28325 27604 26834 26160 25580 24953 24284 23714 23239 22713 22138 21657 21278 20854 20360 19926 19577 19194
794 19194 18758 18378 18067 17710 17293 16933 16651 16338 15972 15653 15392 15086 14726 14437 14248 14052 13805 13591 13433 13243 12996 12778 12614
791 12614 12430 12211 12034 11907 11747 11549 11406 11332 11229 11067 10927 10835 10708 10527 10375 10278 10150 9963 9802 9706 9604 9468 9357 9285 9171
788 9171 8993 8835 8729 8603 8431 8297 8231 8150 8003 7853 7745 7630 7484 7369 7310 7244 7138 7055 7027 6984 6889 6808 6783 6759 6695 6637 6616 6582
$$ packed form
805A885085j68620j68335j61633j51324j44434j41626j35895j22104j02711q3289o6695n3158
803C85261m2633l4844k8738k3562j9552j6779j4510j2304j0595r645q958q237p863p963p933
801A31145p393o746o346n919n264m722m518m334l931l576l462l336l027k796k791k728k445
799E7811k211k202k153j884j639j602j563j353j172j175j163r96q79r47r84q37p10p69q34
797C2738p44o67p53q31p52o66p21p70o74n80o27o69n70m75n26n75m81l79m24m94m34l49l83
794A9194m36l80l11l57m17l60k82l13l66l19k61l06l60k89j89j96k47k14j58j90k47k18j64
791A2614j84k19j77j27j60j98j43p4j03j62j40r2j27j81j52r7j28j87j61r6j02j36j11p2j14
788I171j78j58j06j26j72j34o6q1j47j50j08j15j46j15n9o6j06q3k8m3r5q1k5k4o4n8k1l4
$$ plain form
785 6582 6504 6441 6430 6419 6376 6351 6377 6395 6363 6324 6311 6280 6203 6137 6111 6071 5976 5883 5842 5817 5768 5732 5736 5731 5689 5666 5706 5761 5781 5805 5864 5907 5882 5823 5773 5695
780 5695 5548 5379 5245 5117 4954 4792 4679 4591 4476 4349 4243 4139 4014 3904 3847 3815 3769 3734 3737 3741 3703 3653 3630 3613 3571 3538 3553 3588 3597 3591
777 3591 3593 3570 3499 3435 3434 3458 3443 3402 3385 3382 3352 3314 3309 3319 3293 3242 3207 3182 3132 3073 3045 3039 3022 3005 3022 3056 3066 3062 3077 3095 3076 3026 2982 2943 2890 2844 2832 2830
772 2830 2797 2745 2716 2704 2682 2661 2669 2684 2668 2633 2621 2625 2617 2605 2613 2619 2584 2528 2495 2483 2455 2417 2403 2401 2377 2345 2340 2347 2324 2276 2242 2218 2175 2130 2127 2147 2132 2075 2030
767 2030 2014 1997 1968 1948 1936 1901 1848 1817 1816 1808 1783 1766 1762 1745 1713 1691 1683 1672 1661 1668 1685 1682 1666 1663 1658 1620 1568 1552 1565 1554 1510 1478 1479 1484 1481 1488 1504 1494 1459 1443 1462
762 1462 1481 1478 1466 1456 1434 1405 1393 1393 1374 1339 1329 1346 1347 1315 1284 1274 1264 1240 1226 1234 1244 1244 1254 1278 1288 1273 1253 1234 1197 1142 1104 1096 1097 1092 1097 1115 1121 1113 1121 1152 1175
757 1175 1181 1197 1231 1244 1213 1165 1126 1088 1046 1020 1021 1030 1036 1049 1064 1059 1030 1009 1004 992 966 952 959 956 936 927 937 935 909 889 887 875 847 837 862 888 889 888 905 915 904
752 904 902 929 948 926 894 894 909 906 895 900 908 900 889 895 901 888 873 879 889 873 840 821 817 815 820 838 847 831 821 850 906 954 990 1033 1086 1142 1209 1294 1379 1457 1563
$$ packed form
785F582p8o3j1j1m3k5K6J8l2l9j3l1p7o6k6m0r5r3m1k5m9l6Mnm2k3M0N5K0K4N9M3k5n9n0p8
780E695j47j69j34j28j63j62j13q8j15j27j06j04j25j10n7l2m6l5LMl8n0k3j7m2l3J5L5Ro
777C591Kk3p1o4jK4j5m1j7ll0l8nJ0k6n1l5k5n0n9k8oj7j7J7L4J0mJ5J8j9n0m4l9n3m6j2k
772B830l3n2k9j2k2k1QJ5j6l5j2Mqj2QOl5n6l3j2k8l8j4kk4l2nPk3m8l4k4m3m5lK0j5n7m5
767B030j6j7k9k0j2l5n3l1jqk5j7mj7l2k2qj1j1PJ7lj6lnl8n2j6J3j1m4l2JNlPJ6j0l5j6J9
762A462J9lj2j0k2k9j2%j9l5j0J7Jl2l1j0j0k4j4QJ0%J0K4J0j5k0j9l7n5l8qJnNJ8OqQL1K3
757A175OJ6L4J3l1m8l9l8m2k6JROJ3J5nk9k1nj2k6j4Plk0rJ0kk6k0kj2k8j0K5K6JjJ7J0j1
752I04kK7J9k2l2%J5lj1NQqj1OOj3j5OJ0j6l3j9mkNJ8Rj6j0K9N6M8L6M3N3N6O7Q5Q5P8J06
$$ plain form
747 1563 1729 1934 2138 2335 2539 2733 2878 2958 2974 2915 2781 2606 2436 2283 2138 1997 1860 1714 1561 1432 1352 1302 1256 1226 1228 1241 1240
744 1240 1241 1271 1317 1344 1355 1367 1375 1365 1367 1418 1512 1616 1726 1864 2027 2200 2407 2691 3049 3445 3884 4416 5074 5863 6803 7917 9179
741 9179 10491 11734 12778 13464 13659 13359 12711 11891 10999 10069 9132 8232 7394 6608 5852 5119 4436 3849 3380 2997 2654 2350
738 2350 2117 1964 1861 1775 1693 1610 1526 1451 1396 1356 1316 1274 1234 1185 1123 1064 1027 998 953 896 854 841 841 844 848 839 812 783 771 761 729 684 651 630 602
734 602 571 567 591 613 617 614 618 627 639 653 659 652 648 660 667 640 598 578 577 557 518 497 504 509 500 499 509 504 475 456 468 491 501 505 511 507 496 499 524 542 537 520 503 479 454
728 454 454 482 505 503 499 509 518 507 491 490 496 500 504 506 487 442 398 375 362 345 337 347 356 351 341 340 334 312 290 287 298 309 325 355 379 382 376 378 382 376 366 363 355 331 304 295 302
722 302 310 321 340 358 361 353 345 338 331 324 315 295 266 249 254 265 263 258 262 266 258 245 244 250 253 259 277 305 328 343 349 341 326 323 344 370 382 389 401 416 422 420 408 376 329 290 275
717 275 271 267 270 280 277 254 242 261 288 296 294 298 298 288 295 344 409 443 442 434 429 418 404 400 398 375 344 336 357 376 378 374 370 357 332 307 290 277 272 277 279 267 250 246 254 259 260 263
$$ packed form
747A563J66K05K04J97K04J94J45Q0J6n9j34j75j70j53j45j41j37j46j53j29q0n0m6l0KJ3j
744A240JL0M6K7J1J2Qj0KN1R4J04J10J38J63J73K07K84L58L96M39N32O58P89R40J114J262
741I179J312J243J044O86J95l00o48q20q92r30r37r00q38p86p56p33o83n87m69l83l43l04
738B350k33j53j03q6q2q3q4p5n5m0m0m2m0m9o2n9l7k9m5n7m2j3%LMrk7k9j2j0l2m5l3k1k8
734F02l1mK4K2MlMRJ2J4OpmJ2Pk7m2k0jk0l9k1PNrjJ0nk9j9J2K3J0MOmj1LK5J8nj7j7k4k5
728D54%K8K3kmJ0Rj1j6jOMMKj9m5m4k3j3j7qJ0Rnj0jok2k2lJ1J1J6L0K4LoKMoj0lqk4k7rP
722C02QJ1J9J8Lqqppprk0k9j7NJ1knMMqj3jOLOJ8K8K3J5Oqj5lK1K6J2PJ2J5Okj2l2m7l9j5
717B75mmLJ0lk3j2J9K7QkM%j0PM9O5L4jqnj1j4mkk3l1qK1J9Kmmj3k5k5j7j3nNKj2j7mQNJL
$$ plain form
711 263 262 252 251 278 315 329 321 316 319 313 296 287 288 282 264 253 260 276 289 297 296 286 281 295 320 330 326 321 315 297 271 257 255 249 237 242 265 284 290 298 308 297 252 192 142 115
705 115 114 140 175 197 212 236 266 275 257 234 225 226 239 268 300 302 276 255 263 279 284 284 294 304 301 297 301 299 277 251 242 247 253 257 269 284 294 297 296 291 285 283 285 281 273 271 270 253
699 253 218 187 177 178 176 174 180 186 192 205 223 223 195 165 161 181 206 227 245 252 238 212 190 178 175 183 196 199 186 172 173 183 189 194 208 227 241 246 245 235 215 197 194 207
694 207 225 236 234 220 208 214 238 261 271 277 286 282 257 227 216 222 228 231 239 250 252 237 216 199 196 204 210 202 187 185 196 196 174 150 149 164 173 170 164 159 153 153 160 166 161 150 142 136 124
688 124 116 129 158 186 201 202 189 172 168 186 215 237 249 254 248 231 218 220 228 225 214 209 207 196 172 146 127 121 134 160 180 181 178 191 214 229 233 239 241 225 192 159 139
683 139 128 122 129 155 193 232 265 284 285 277 266 250 230 215 214 216 210 204 207 214 211 206 211 221 219 204 192 189 192 202 220 229 211 178 167 187 216 229 227 222 215 210 210 214 211 202 198 204 216
677 216 233 258 279 274 242 209 201 216 234 245 247 240 231 230 238 245 245 237 228 226 237 259 275 269 249 235 233 229 211 192 187 199 220 241 253 252 245 243 249 255 260 265 261 243 222 217 225 224 206
671 206 185 170 152 126 101 90 92 101 116 132 144 154 165 174 169 152 139 134 126 112 108 125 153 175 187 192 193 190 186 175 153 128 118 119 112 98 92 102 113 116 125 147 167
$$ packed form
711B63jj0jK7L7J4qnLoj7rJoj8j1PJ6J3Qjj0nJ4K5J0mnoj8k6j4koj2NK3J9OQJ0j1m5o0n0k7
705A15jK6L5K2J5K4L0Rj8k3rJJ3K9L2Kk6k1QJ6N%J0J0lmMkk2k6rNOMJ2J5J0LjnokKmqkjj7
699B53l5l1j0JkkOOOJ3J8%k8l0mK0K5K1J8Pj4k6k2j2lQJ3Lj3j4JJ0ONJ4J9J4Njj0k0j8lJ3
694B07J8J1kj4j2OK4K3J0ORmk5l0j1OOLQJ1Kj5k1j7lQOqj5kJ1%k2k4jJ5Rlono%POnj1qoj2
688A24qJ3K9K8J5Jj3j7mJ8K9K2J2Noj7j3KQlj1nkj1k4k6j9oJ3K6K0JlJ3K3J5MOKj6l3l3k0
683A39j1oPK6L8L9L3J9Jqj1j6k0j5jKooLPlnNJ0kj5j2lLJ0J8Rj8l3j1K0K9J3knpn%MlrmOJ2
677B16J7K5K1nl2l3qJ5J8J1KprjQP%qrkJ1K2J6ok0j4kmj8j9nJ2K1K1J2jpkOONNmj8k1nQjj8
671B06k1j5j8k6k5j1KRJ5J6J2J0J1Rnj7j3nqj4mJ7K8K2J2NJlmj1k2k5j0Jpj4oJ0J1LRK2K0
$$ plain form
665 167 173 177 188 194 182 156 129 104 81 69 76 90 98 103 115 132 149 174 214 257 286 295 293 287 278 269 264 263 268 287 307 305 273 241 235 244 235 200 157 123 99 86 86 94 102 105
660 105 105 95 75 59 59 72 82 83 79 69 52 36 30 31 34 47 75 111 140 166 202 243 269 275 275 276 271 258 252 261 271 264 238 207 181 163 149 139 129 116 97 78
655 78 69 82 110 135 141 135 133 141 147 141 125 110 105 115 133 145 148 148 151 158 165 169 169 162 156 159 170 174 169 171 188 210 220 219 213 198 173 152 150 157 154 144 142 150 157 155 151 151 155 164 178 194 209
648 209 226 242 244 226 208 211 228 234 221 207 204 205 208 217 223 213 187 161 149 144 143 155 182 210 227 238 253 261 249 219 191 179 180 180 166 142 120 111 106 95 84 89 109
643 109 131 147 160 173 180 184 196 219 234 226 204 186 179 178 184 197 212 218 214 212 220 238 254 265 274 283 288 279 264 266 294 330 348 343 339 356 390 420 434 435 438 457 485 503 499
637 499 488 493 511 525 533 550 583 616 626 606 569 530 509 513 525 518 477 418 366 342 348 369 375 352 316 296 297 300 295 292 295 297 295 298 311 322 323 324 332 340 338 326 311 289 263
632 263 247 251 267 286 314 361 415 454 467 468 475 491 505 505 491 475 470 474 480 486 489 480 455 430 431 451 457 432 391 355 327 310 309 325 337 334 323 311 291 266 259 280 303
627 303 297 268 251 259 272 271 255 235 221 226 251 282 307 324 335 330 302 268 249 239 220 195 183 191 199 196 196 211 232 238 229 217 210 206 202 199 200 205 206 197 181 171 176 192 209
$$ packed form
665A67OMJ1Oj2k6k7k5k3j2PJ4QNJ2J7J7K5M0M3K9RkorrnjNJ9K0kl2l2oRrl5m3l4k4j3%QQL
660A05%j0k0j6%J3J0Jmj0j7j6oJLJ3K8L6K9K6L6M1K6O%Jnj3oRJ0pk6l1k6j8j4j0j0j3j9j9
655G8rJ3K8K5OokQOoj6j5nJ0J8J2L%LPPM%poLJ1MnKJ7K2J0joj5k5k1kPlj0kQPkm%MRJ4J6J5
648B09J7J6Kj8j8LJ7Oj3j4lJLROj0k6k6j2njJ2K7K8J7J1J5Qj2l0k8j2J%j4k4k2rnj1j1NK0
643A09K2J6J3J3PMJ2K3J5qk2j8pjOJ3J5OmkQJ8J6J1RRNrj5KK8L6J8nmJ7L4L0J4JLJ9K8J8m
637D99j1NJ8J4QJ7L3L3J0k0l7l9k1MJ2pm1n9n2k4OK1Ok3l6k0JLnlLKkLJ3J1JJQQkj2j5k2k6
632B63j6MJ6J9K8M7N4L9J3JPJ6J4%j4j6nMOOLrk5k5JK0Ok5m1l6k8j7jJ6J2lj1j2k0k5pK1K3
627C03ok9j7QJ3jj6k0j4NK5L1K5J7J1nk8l4j9j0j9k5j2QQl%J5K1Orj2pmmlJNJrj6j0NJ6J7
$$ plain form
621 209 220 218 200 175 156 153 160 170 184 191 176 139 108 103 119 132 140 157 178 188 180 166 160 160 159 160 165 172 184 204 229 244 238 216 193 186 201 225 234 225 214 218 227 222 200
616 200 177 162 152 142 131 121 121 136 161 173 163 147 149 166 180 190 206 229 250 270 294 310 298 265 244 249 264 275 282 290 292 282 267 255 242 230 231 249 271
611 271 282 285 286 289 296 308 316 313 309 323 351 365 353 334 326 320 306 301 325 369 399 403 399 402 407 403 397 397 403 405 399 389 380 369 353 337 335 357 388 406 405 404 418 439 452 451 441 426
605 426 410 407 432 486 550 604 640 668 702 749 800 845 888 945 1028 1130 1244 1372 1525 1715 1954 2244 2577 2943 3345 3785 4240 4656 4986
601 4986 5204 5300 5262 5101 4853 4558 4238 3903 3569 3253 2956 2671 2400 2157 1949 1769 1615 1492 1405 1346 1309 1287 1271 1256 1242 1230 1218
598 1218 1205 1198 1201 1212 1224 1240 1272 1321 1380 1438 1492 1549 1617 1708 1823 1959 2112 2282 2475 2698 2973 3328 3776 4313 4932 5646 6456 7331 8210
595 8210 9025 9708 10184 10386 10300 9975 9496 8930 8313 7668 7020 6386 5766 5152 4547 3984 3504 3128 2844 2619 2426 2255 2106 1985
592 1985 1894 1821 1747 1670 1602 1559 1541 1536 1536 1535 1536 1541 1556 1580 1599 1607 1607 1607 1608 1621 1660 1725 1797 1860 1933 2043 2192 2365 2560 2804 3114 3483 3886 4302 4705
$$ packed form
621B09J1kj8k5j9lPJ0J4Pj5l7l1nJ6J3QJ7K1J0qj4o%jJNPJ2K0K5J5ok2k3pJ5K4Rrj1MRnk2
616B00k3j5j0j0j1j0%J5K5J2j0j6KJ7J4J0J6K3K1K0K4J6j2l3k1NJ5J1PQKj0j5j2j3j2JJ8K2
611B71J1LJLPJ2QlmJ4K8J4j2j9qoj4nK4M4L0MmLNmo%OKoj0rj1j6j6kK2L1J8jjJ4K1J3jj0j5
605D26j6lK5N4O4N4L6K8L4M7N1M5M3N7Q3J02J14J28J53J90K39K90L33L66M02M40M55M16L30
601D986K18R6l8j61k48k95l20l35l34l16k97k85k71k43k08j80j54j23q7n9l7k2j6j5j4j2j2
598A218j3pLJ1J2J6L2M9N9N8N4N7O8R1J15J36J53J70J93K23K75L55M48N37O19P14Q10Q75Q79
595H210Q15O83M76K02q6l25m79n66o17o45o48o34o20o14o05n63m80l76k84k25j93j71j49j21
592A985r1p3p4p7o8m3j8n%jJNJ5K4J9Q%%JJ3L9O5P2O3P3J10J49J73J95K44L10L69M03M16M03
$$ plain form
587 4705 5054 5306 5430 5415 5274 5044 4769 4473 4162 3840 3525 3230 2953 2687 2441 2222 2030 1858 1713 1604 1530 1474 1420 1362 1302
584 1302 1244 1196 1165 1155 1155 1157 1163 1179 1203 1221 1227 1227 1227 1220 1198 1169 1146 1128 1098 1053 1016 1000 993 976 947 917 889 864 845 833 818 796 787 810 854 885 887 875 871 879 891
579 891 901 903 896 893 911 951 998 1032 1049 1054 1051 1044 1034 1020 1003 988 986 997 1011 1018 1020 1026 1036 1047 1055 1054 1040 1019 1009 1025 1056 1083 1097 1112 1145 1189 1219 1215 1190 1171 1178 1203
574 1203 1223 1232 1235 1242 1254 1270 1287 1310 1340 1380 1428 1476 1526 1587 1667 1765 1872 1990 2126 2293 2495 2732 3003 3296 3603 3915 4219 4487 4693 4819
571 4819 4860 4821 4711 4549 4356 4146 3924 3697 3475 3270 3088 2922 2761 2607 2481 2395 2333 2266 2187 2114 2061 2020 1983 1957 1948 1946 1936 1925 1923 1921
567 1921 1907 1885 1871 1861 1843 1826 1827 1845 1856 1856 1864 1893 1930 1962 1997 2048 2112 2176 2240 2316 2411 2516 2617 2704 2782 2860 2938 2995 3007 2971 2903 2818 2723 2634 2570
563 2570 2532 2509 2494 2492 2504 2527 2564 2615 2670 2708 2723 2731 2739 2746 2755 2776 2802 2804 2776 2747 2746 2765 2780 2786 2798 2823 2854 2883 2913 2943 2971 2998 3028 3062 3093 3125 3167 3229 3308
558 3308 3390 3462 3527 3601 3694 3798 3894 3976 4052 4123 4182 4222 4242 4244 4235 4222 4215 4209 4198 4187 4191 4205 4211 4203 4195 4200 4218 4249 4303 4382 4473 4566 4667 4783 4908 5028 5137
$$ packed form
587D705L49K52J24j5j41k30k75k96l11l22l15k95k77k66k46k19j92j72j45j09p4n6n4n8o0
584A302n8m8l1j0%KOJ6K4J8O%%pk2k9k3j8l0m5l7j6pj7k9l0k8k5j9j2j5k2rK3M4L1Kj2mQJ2
579H91J0KplJ8M0M7L4J7Nlpj0j4j7j5kJ1J4PKOJ0J1Qjj4k1j0J6L1K7J4J5L3M4L0mk5j9PK5
574A203K0RLPJ2J6J7K3L0M0M8M8N0O1Q0R8J07J18J36J67K02K37K71K93L07L12L04K68K06J26
571D819M1l9j10j62j93k10k22k27k22k05j82j66j61j54j26q6o2o7p9p3n3m1l7k6rkj0j1kk
567A921j4k2j4j0j8j7JJ8J1%QK9L7L2L5N1O4O4O4P6R5J05J01Q7P8P8P8N7J2l6o8q5r5q9o4
563B570l8k3j5kJ2K3L7N1N5L8J5QQPRK1K6Kk8k9jJ9J5OJ2K5L1K9L0L0K8K7L0L4L1L2M2O2P9
558C308Q2P2O5P4R3J04R6Q2P6P1N9M0K0Krj3poj1j1MJ4OqqNJ8L1N4P9R1R3J01J16J25J20J09
$$ plain form
553 5137 5240 5342 5451 5569 5682 5770 5833 5899 5988 6089 6184 6272 6362 6458 6555 6651 6746 6837 6928 7030 7146 7258 7353 7438 7529 7631 7742 7862 7992
550 7992 8121 8247 8377 8522 8672 8811 8936 9057 9177 9297 9430 9587 9765 9949 10134 10332 10554 10801 11066 11346 11639 11950 12287
547 12287 12667 13099 13576 14080 14597 15131 15694 16292 16906 17504 18071 18612 19134 19639 20123 20589 21045 21501 21974 22476 23010 23577 24185
544 24185 24860 25623 26469 27382 28355 29395 30511 31704 32982 34370 35893 37562 39374 41343 43499 45867 48472 51356 54595
542 54595 58264 62421 67144 72556 78805 86038 94457 104349 116028 129793 145990 165077 187554 213916 244831 281342
540 281342 324774 376389 437164 507547 586753 671764 756922 834532 896142 934265 944707 928619 892165 843232
538 843232 787789 729032 669024 609813 552760 497913 444994 394782 349027 309232 275891 248678 226822 209322
536 209322 195252 184010 175180 168274 162852 158748 155946 154308 153674 154099 155708 158426 162100 166745 172411 178916 186046
$$ packed form
553E137J03J02J09J18J13Q8O3O6Q9J01R5Q8R0R6R7R6R5R1R1J02J16J12R5Q5R1J02J11J20J30
550G992J29J26J30J45J50J39J25J21J20J20J33J57J78J84J85J98K22K47K65K80K93L11L37
547A2287L80M32M77N04N17N34N63N98O14N98N67N41N22N05M84M66M56M56M73N02N34N67O08
544B4185O75P63Q46R13R73J040J116J193J278J388J523J669J812J969K156K368K605K884L239
542E4595L669M157M723N412O249P233Q419R892J1679J3765J6197J9087K2477K6362L0915L6511
540B81342M3432N1615O0775P0383P9206Q5011Q5158P7610O1610L8123J0442j6088l6454m8933
538H43232n5443n8757o0008n9211n7053n4847n2919n0212m5755l9795l3341k7213k1856j7500
536B09322j4070j1242q830o906n422m104k802j638o34M25J609K718L674M645N666O505P130
$$ plain form
534 186046 193929 202940 213395 225683 240545 258847 281203 308200 340832 380233 427226 482805 549046 628917
533 628917 725180 839980 974895 1129577 1299049 1472354 1633888 1765892 1851444 1879409 1850142 1776274
531 1776274 1675557 1561612 1441143 1317946 1196256 1079315 967233 858688 754495 658259 573747 502569
530 502569 444161 396834 358532 327322 301754 280786 263446 248881 236626 226528 218377 211897 207013 203811 202223
528 202223 201974 202795 204428 206431 208270 209658 210666 211572 212824 215068 218947 224854 233086 244142 258627 276950 299514
526 299514 327213 361431 403496 454370 514696 584375 661463 741439 817560 881839 926315 945091 936877 905914
524 905914 859704 805138 746438 685948 625614 567057 510845 456720 404834 356437 313234 276267 245521 220291
522 220291 199677 182809 168927 157418 147811 139730 132883 127103 122310 118438 115399 113130 111602 110749 110414 110385 110436 110321
$$ packed form
534A86046P883R011J0455J2288J4862J8302K2356K6997L2632L9401M6993N5579O6241P9871
533F28917R6263J14800J34915J54682J69472J73305J61534J32004Q5552K7965k9267p3868
531A776274j00717j13945j20469j23197j21690j16941j12082j08545j04193r6236q4512p1178
530E02569n8408m7327l8302l1210k5568k0968j7340j4565j2255j0098q151o480m884l202j588
528B02223k49Q21J633K003J839J388J008R06J252K244L879N907Q232J1056J4485J8323K2564
526B99514K7699L4218M2065N0874O0326O9679P7088P9976P6121O4279M4476J8776q214l0963
524I05914m6210n4566n8700o0490o0334n8557n6212n4125n1886m8397m3203l6967l0746k5230
522B20291k0614j6868j3882j1509r607q081o847n780m793l872l039k269j528q53l35k9N1j15
$$ plain form
520 110321 109767 108541 106532 103750 100277 96259 91906 87443 83021 78694 74483 70428 66574 62943 59550 56418 53567
518 53567 51001 48714 46687 44896 43304 41882 40600 39419 38299 37229 36222 35287 34417 33602 32844 32145 31496 30889 30319
516 30319 29784 29284 28830 28431 28084 27784 27540 27368 27269 27238 27293 27466 27769 28196 28757 29496 30468 31711 33262 35162 37431 40006
513 40006 42739 45402 47703 49306 49929 49499 48216 46427 44422 42338 40234 38182 36261 34480 32794 31196 29768 28618
511 28618 27802 27309 27109 27186 27536 28155 29033 30169 31578 33301 35389 37910 40990 44809 49562 55411 62497 70893 80450
509 80450 90645 100589 109163 115179 117676 116396 112066 106007 99320 92456 85523 78732 72345 66381 60668 55211 50304
506 50304 46263 43202 41081 39805 39205 39031 39037 39018 38765 38111 37067 35821 34541 33269 32010 30833 29799 28889 28077 27398
504 27398 26892 26564 26447 26635 27179 28040 29188 30687 32608 34965 37803 41264 45481 50507 56475 63721 72651 83575 96781
$$ packed form
520A10321n54j226k009k782l473m018m353m463m422m327m211m055l854l631l393l132k851
518E3567k566k287k027j791j592j422j282j181j120j070j007r35q70q15p58o99o49o07n70
516C0319n35n00m54l99l47l00k44j72r9l1N5J73L03M27N61P39R72J243J551J900K269K575
513D0006K733K663K301J603O23m30j283j789k005k084k104k052j921j781j686j598j428j150
511B8618q16m93k00P7L50O19Q78J136J409J723K088K521L080L819M753N849P086Q396R557
509H0450J0195R944Q574O016K497j280m330o059o687o864o933o791o387n964n713n457m907
506E0304m041l061k121j276o00j74Oj9k53o54j044j246j280j272j259j177j034r10q12o79
504B7398n06l28j17J88N44Q61J148J499J921K357K838L461M217N026N968P246Q930J0924J3206
$$ plain form
502 96781 112579 130959 151145 171554 190097 204433 212339 212608 205965 194793 181600 167735 153561 139403 125808
500 125808 113033 100812 88890 77538 67358 58764 51779 46204 41785 38251 35361 32971 30988 29302 27818 26511
498 26511 25393 24433 23571 22787 22097 21493 20952 20479 20107 19851 19703 19665 19748 19943 20249 20711 21387 22291 23421 24827 26598 28784
495 28784 31413 34591 38508 43354 49282 56437 64890 74421 84408 93912 101830 107021 108632 106590 101770 95467 88618
493 88618 81570 74457 67528 61004 54850 48889 43123 37796 33172 29348 26271 23819 21855 20250 18911 17777 16787 15893
491 15893 15079 14352 13699 13097 12541 12030 11551 11090 10663 10293 9974 9677 9398 9162 8980 8833 8709 8617 8566 8549 8559 8600 8674 8775 8887
488 8887 8989 9045 9019 8901 8709 8471 8209 7940 7675 7408 7141 6888 6658 6438 6215 6006 5834 5694 5558 5419 5297 5202 5117 5034 4961
485 4961 4904 4845 4772 4700 4648 4607 4560 4505 4456 4426 4410 4398 4384 4368 4354 4341 4327 4315 4313 4327 4357 4405 4480 4590 4723 4877 5074 5344 5695 6107 6558
$$ packed form
502I6781J5798J8380K0186K0409J8543J4336P906K69o643j1172j3193j3865j4174j4158j3595
500A25808j2775j2221j1922j1352j0180q594o985n575m419l534k890k390j983j686j484j307
498B6511j118r60q62p84o90o04n41m73l72k56j48l8Q3J95L06M62O76R04J130J406J771K186
495B8784K629L178L917M846N928P155Q453R531R987R504P918N191J611k042m820o303o849
493H8618p048p113o929o524o154n961n766n327m624l824l077k452j964j605j339j134r90q94
491A5893q14p27o53o02n56n11m79m61m27l70l19k97k79k36j82j47j24r2n1j7J0M1P4J01J12
488H887J02N6k6j18j92k38k62k69k65k67k67k53k30k20k23k09j72j40j36j39j22r5q5q3p3
485D961n7n9p3p2n2m1m7n5m9l0j6j2j4j6j4j3j4j2kJ4L0M8P5J10J33J54J97K70L51M12M51
$$ plain form
481 6558 7031 7493 7888 8159 8271 8207 7986 7662 7302 6941 6579 6216 5875 5568 5288 5022 4771 4545 4352 4198 4086 3996 3904 3807 3727
478 3727 3675 3634 3589 3546 3515 3491 3472 3476 3511 3559 3598 3634 3688 3770 3872 3992 4135 4302 4500 4745 5058 5441 5878 6348 6833 7312 7756 8129
475 8129 8389 8516 8530 8488 8432 8369 8283 8163 7992 7737 7385 6966 6541 6144 5774 5428 5116 4845 4602 4367 4137 3922 3737 3586 3462
472 3462 3358 3275 3220 3200 3205 3217 3230 3247 3269 3288 3302 3317 3346 3393 3455 3527 3610 3715 3860 4049 4280 4549 4867 5248 5708 6268 6953 7763 8669
468 8669 9611 10522 11325 11933 12266 12287 12026 11564 10982 10334 9650 8953 8275 7634 7019 6417 5834 5305 4851 4472 4153 3887 3666 3481
465 3481 3325 3197 3094 3002 2914 2839 2787 2755 2729 2710 2702 2705 2706 2700 2695 2701 2720 2740 2748 2738 2723 2726 2766 2846 2957 3086 3220 3357 3513 3712 3966 4269 4613
461 4613 4994 5401 5799 6145 6406 6558 6590 6502 6315 6051 5734 5393 5062 4753 4455 4153 3853 3570 3305 3057 2837 2656 2505 2367
458 2367 2240 2135 2056 1996 1948 1909 1873 1839 1812 1795 1782 1764 1742 1718 1685 1641 1599 1575 1563 1549 1536 1534 1535 1516 1474 1429 1395 1364 1331 1308 1306 1309 1297 1264 1225 1193
$$ packed form
481F558M73M62L95K71J12o4k21l24l60l61l62l63l41l07k80k66k51k26j93j54j12r0r2r7q0
478C727n2m1m5m3l1k4j9ML5M8L9L6N4Q2J02J20J43J67J98K45L13L83M37M70M85M79M44L73
475H129K60J27J4m2n6o3q6j20j71k55l52m19m25l97l70l46l12k71k43k35k30k15j85j51j24
472C462j04q3n5k0NJ2J3J7K2J9J4J5K9M7O2P2Q3J05J45J89K31K69L18L81M60N60O85Q10R06
468H669R42R11Q03O08L33K1k61m62n82o48o84o97o78o41o15o02n83n29m54l79l19k66k21j85
465C481j56j28j03r2q8p5n2l2k6j9qLJonOJ9K0Qj0j5LM0Q0J11J29J34J37J56J99K54L03L44
461D613L81M07L98L46K61J52L2q8j87k64l17l41l31l09k98l02l00k83k65k48k20j81j51j38
458B367j27j05p9o0m8l9l6l4k7j7j3j8k2k4l3m4m2k4j2j4j3kJj9m2m5l4l1l3k3kLj2l3l9l2
$$ plain form
454 1193 1176 1173 1177 1179 1174 1164 1147 1130 1122 1130 1140 1131 1103 1078 1074 1082 1086 1086 1091 1101 1104 1090 1060 1025 1003 1002 1009 1010 1007 1019 1048 1073 1074 1060 1048 1036 1013 981 960 963 981 994 995 992 998 1015
448 1015 1029 1021 990 951 926 914 899 872 842 832 847 874 891 889 874 862 865 889 925 959 977 980 982 994 1021 1060 1105 1148 1186 1227 1284 1353 1410 1440 1445 1435 1400 1338
443 1338 1267 1219 1198 1184 1160 1129 1090 1041 989 947 916 882 847 830 840 855 852 835 824 822 819 811 803 799 801 809 821 826 815 793 778 777 786 796 804 808 802 782 751 719 702 711
438 711 747 801 869 952 1050 1159 1272 1387 1498 1596 1671 1716 1726 1705 1664 1615 1558 1484 1393 1297 1209 1130 1055 985 927 887 862 845 823 789 749 721 711
434 711 706 699 697 703 709 704 698 708 728 739 735 727 721 702 666 629 614 623 640 654 669 692 723 748 761 766 774 787 799 808 826 860 906 952 995 1039 1084 1121 1135 1123 1094 1059
429 1059 1024 987 948 912 883 856 827 794 761 728 693 661 635 615 599 596 611 634 649 650 647 644 631 610 596 597 598 584 554 517 479 452 447 464 485 497 509 527
424 527 539 537 533 546 566 564 532 494 479 487 504 519 523 515 504 500 505 515 531 554 582 600 600 587 574 569 575 584 580 556 519 485 453 416 383 370 384 405 412 403 390 386 394 412
419 412 435 464 497 529 547 541 520 499 484 474 470 472 476 478 483 493 500 494 477 461 454 454 458 460 453 440 438 456 478 480 464 454 463 481 497 505 498 474 442 419 414 422 437 458 479
$$ packed form
454A193j7lMKnj0j7j7qQJ0rk8k5mQM%NJ0Lj4l0l5k2jPJlJ2K9K5Jj4j2j2k3l2k1LJ8J3JlOJ7
448A015J4ql1l9k5j2j5k7l0j0J5K7J7kj5j2LK4L6L4J8LKJ2K7L9M5M3L8M1N7O9N7L0Nj0l5o2
443A338p1m8k1j4k4l1l9m9n2m2l1l4l5j7J0J5lj7j1klqqmKQJ2Nj1k2j5jRJ0QMok0l1l2j7R
438G11L6N4O8Q3R8J09J13J15J11R8P5M5J0k1m1m9n7p4r1r6q8p9p5p0n8m0k5j7k2l4m0k8j0
434G11npkOOnoJ0K0J1mqoj9l6l7j5RJ7J4J5K3L1K5J3NQJ3J2RJ8L4M6M6M3M4M5L7J4j2k9l5
429A059l5l7l9l6k9k7k9l3l3l3l5l2k6k0j6lJ5K3J5Jllj3k1j4JJj4l0l7l8k7nJ7K1J2J2J8
424E27J2kmJ3K0kl2l8j5QJ7J5Mqj1mNJ0J6K3K8J8%j3j3nORmk4l7l4l2l7l3j3J4K1Prj3mQJ8
419D12K3K9L3L2J8ok1k1j5j0mKMKNJ0Poj7j6p%MKpj3kJ8K2Kj6j0RJ8J6Qpk4l2k3nQJ5K1K1
$$ plain form
414 479 485 472 447 423 403 391 396 413 423 418 405 398 400 412 437 470 492 483 446 396 355 336 343 359 369 371 380 400 418 424 430 448 471 483 482 471 455 440 430 428 428 423 422
408 422 432 450 467 479 484 483 479 472 454 415 367 338 339 351 357 359 373 392 401 402 409 423 430 418 397 378 365 361 371 393 413 421 412 394 373 358 357 371 394 416 427 424 412
403 412 404 408 421 436 450 457 457 457 461 459 436 396 366 367 388 406 419 442 472 489 484 467 451 437 425 424 436 451 455 451 445 443 446 450 452 453 457 463 464 447 415 389 390 421 462 486
397 486 483 466 457 460 462 452 439 436 438 435 424 416 415 415 412 412 418 429 442 449 443 421 395 383 391 410 423 422 403 374 352 347 354 361 363 364 363 356 344 335 334 339 346 353 357 353 341 330 332 357 395
391 395 429 443 443 443 452 457 449 436 431 436 444 447 440 417 372 320 284 271 272 274 276 284 300 327 364 403 434 454 468 476 470 447 417 391 374 366 364 357 336 310 295 306 336 366 380
386 380 376 367 368 384 402 406 396 382 367 354 345 348 357 369 384 406 430 447 456 462 462 457 460 477 494 497 490 491 501 501 488 478 481 482 478 478 486 487 469 447 435 435 441 448 450 433 400 374
380 374 374 387 396 404 413 415 404 396 409 435 456 468 477 484 478 460 440 426 420 426 440 449 439 422 420 438 465 489 507 517 518 516 518 518 512 511 526 551 568 575 588 619 656 686 705
374 705 714 718 729 755 784 801 807 820 844 866 874 873 870 864 861 867 878 878 860 840 833 834 828 816 806 800 793 782 768 748 725 709 709 712 698 668 646 651 680 715 746 772 793 805
$$ packed form
414D79Oj3k5k4k0j2NJ7J0nj3pKJ2K5L3K2rl7n0m1j9PJ6J0KRK0J8OOJ8K3J2jj1j6j5j0k%nj
408D22J0J8J7J2Njmpj8l9m8k9JJ2OKJ4J9RJPJ4Pj2k1j9j3mJ0K2K0Qrj8k1j5jJ4K3K2J1lj2
403D12qMJ3J5J4P%%Mkk3m0l0JK1J8J3K3L0J7nj7j6j4j2jJ2J5MmokLMKJMOJj7l2k6JL1M1K4
397D86lj7rLKj0j3lKlj1qj%l%OJ1J3Pok2k6j2QJ9J3jj9k9k2nPPKJjpj2rjNPPMmj2j1KK5L8
391C95L4J4%%RNqj3nNQLpk3m5n2l6j3JKKQJ6K7L7L9L1K0J4Qok3l0k6j7qkpk1k6j5J1L0L0J4
386C80mrJJ6J8Mj0j4j5j3rLRJ2J5K2K4J7RO%nLJ7J7LpJJ0%j3j0LJm%QJj8k2j2%OPKj7l3k6
380C74%J3RQRKj1qJ3K6K1J2RPoj8k0j4oOJ4Rj0j7kJ8K7K4J8J0JkK%ojJ5K5J7PJ3L1L7L0J9
374G05RMJ1K6K9J7OJ3K4K2QjlolOJ1%j8k0pJoj2j0opj1j4k0k3j6%Lj4l0k2NK9L5L1K6K1J2
$$ plain form
369 805 802 788 778 791 831 885 940 989 1040 1094 1149 1205 1271 1353 1435 1498 1528 1534 1527 1508 1471 1426 1391 1375 1364 1341 1298 1239 1159 1059 954 864 799 755 728 714
365 714 704 691 682 687 708 726 725 710 695 685 676 667 656 642 628 619 619 622 621 616 611 606 606 616 642 669 679 664 637 617 615 632 657 679 694 704 720 750 791 831 851 844 824
359 824 813 812 802 775 745 727 716 696 665 638 620 603 576 545 518 493 463 427 389 358 347 365 408 457 489 496 481 457 430 403 376 352 340 341 351 357 356 354
355 354 355 357 355 347 344 347 350 344 333 323 317 311 307 308 312 313 315 333 370 411 432 431 421 411 401 391 384 375 356 335 325 333 344 346 344 350 361 371 380 395 413 426 426 417 403 385 365 345
349 345 325 308 298 294 287 271 250 238 244 256 257 239 210 180 159 154 171 205 236 248 243 235 231 222 208 205 230 272 298 297 290 298 319 331 326 314 304 297 286 270 248 229 220
344 220 224 233 241 250 268 292 311 324 340 363 387 403 405 391 365 335 312 302 304 316 336 350 343 318 298 299 307 307 300 304 322 338 338 326 309 289 270 262 272 287 290 279 272
338 272 278 289 291 279 260 243 231 223 224 232 243 251 251 239 219 197 177 159 145 137 139 154 175 195 202 195 180 168 162 158 156 162 174 184 191 205 227 244 244 239 240 245 242 235 238 249 256
332 256 256 256 253 235 203 183 191 215 241 265 286 290 272 251 249 264 281 292 300 299 285 264 246 232 216 205 212 233 251 260 265 268 263 252 249 262 277 279 265 243 218 198 190
$$ packed form
369H05lj4j0J3M0N4N5M9N1N4N5N6O6Q2Q2O3L0Opj9l7m5l5j6j1k3m3n9q0j00j05r0o5m4k7j4
365G14j0j3rNK1J8jj5j5j0rrj1j4j4r%Ljnnn%J0K6K7J0j5k7k0kJ7K5K2J5J0J6L0M1M0K0pk0
359H24j1jj0k7l0j8j1k0l1k7j8j7k7l1k7k5l0l6l8l1j1J8M3M9L2Pj5k4k7k7k7k4j2JJ0Ojk
355C54JKkqlLLoj1j0oomJMJKJ8L7M1K1jj0j0j0j0prj9k1j0QJ1KkOJ1J0RJ5J8J3%rj4j8k0k0
349C45k0j7j0mpj6k1j2OJ2Jj8k9l0k1nJ7L4L1J2nqmrj4lK5M2K6jpQK1J2nj2j0pj1j6k2j9r
344B20MRQRJ8K4J9J3J6K3K4J6Kj4k6l0k3j0KJ2K0J4pk5k0JQ%pMJ8J6%j2j7k0j9qJ0J5Lj1p
338B72OJ1Kj2j9j7j2qJQJ1Q%j2k0k2k0j8j4qKJ5K1K0Ppj5j2omkOJ2J0PJ4K2J7%nJNlpLJ1P
332B56%%lj8l2k0QK4K6K4K1Mj8k1kJ5J7J1Qjj4k1j8j4j6j1PK1J8RNLnj1lJ3J5Kj4k2k5k0q
$$ plain form
327 190 200 222 244 257 262 264 259 241 208 169 139 125 128 142 157 171 183 201 234 274 305 316 320 332 351 358 339 301 265 248 250 257 254 240 226 218 209 201 203 215 220 207
322 207 191 191 200 198 184 176 187 204 211 204 187 166 148 141 141 143 147 158 166 159 142 128 122 113 102 107 131 152 153 151 164 187 197 188 172 160 153 151 158 172 187 198 203 200 194 193 200 204 199
316 199 196 203 211 201 175 154 151 157 158 149 138 131 134 150 173 186 179 162 153 157 164 163 160 162 167 162 143 124 113 107 96 87 90 108 129 147 164 177 182 189 206 232 252 259 261 261 245 214
310 214 187 178 178 171 162 166 178 183 177 170 166 158 144 132 131 134 133 127 128 147 189 240 279 288 271 241 214 202 211 236 254 248 223 204 202 208 204 194 192 203 214 212 200 196 211 232 240 238
304 238 241 254 265 266 260 251 237 219 211 219 228 224 214 212 216 212 202 197 192 180 166 169 181 180 157 138 146 173 195 206 212 218 219 216 210 207 211 221 228 218 187 153 136 138 145 140 125 117 124 136
298 136 134 114 98 101 117 123 113 95 82 74 69 68 62 42 16 4 7 12 12 18 42 75 101 120 134 139 131 117 111 117 129 146 168 188 195 191 182 182 195 223 253 267 256 235 216
293 216 204 191 175 158 138 117 106 108 110 103 95 104 128 148 150 140 133 132 134 129 114 96 87 94 109 117 113 106 106 113 121 128 132 136 142 150 161 174 184 181 163 145 143 156 168 167 160 156 151 140
287 140 128 119 108 94 90 111 147 176 189 199 209 211 201 192 194 202 210 219 232 240 230 206 183 168 162 162 165 164 154 135 119 117 123 129 130 129 132 141 156 174 192 211 229 240 236 218
$$ packed form
327A90J0K2K2J3NKnj8l3l9l0j4LJ4J5J4J2J8L3M0L1J1MJ2J9Pj9l8l6j7KPlj4j4qrqKJ2Nj3
322B07j6%Rkj4qJ1J7Ppj7k1j8p%KMJ1Qpj7j4orj1NK4K1JkJ3K3J0rj6j2pkPJ4J5J1NlojPMn
316A99lPQj0k6k1lOJrj1pLJ6K3J3pj7rMPjlKNnj9j9j1oj1rLJ8K1J8J7J3NPJ7K6K0PK%j6l1
310B14k7r%prMJ2Nopmqj4j2jLjoJJ9M2N1L9Rj7l0k7j2RK5J8ok5j9kOmj0kJ1J1kj2mJ5K1Qk
304B38LJ3J1Jorj4j8qQRmj0kMmj0nnj2j4LJ2jk3j9QK7K2J1OOJlolMJ0Pj0l1l4j7KPnj5qPJ2
298A36kk0j6LJ6Oj0j8j3qnjok0k6j2LN%OK4L3K6J9J4Nqj4oOJ2J7K2K0Pmr%J3K8L0J4j1k1j9
293B16j2j3j6j7k0k1j1KKpqRK4K0Kj0pjKnj5j8rPJ5Qmp%PQPMMOQJ1J3J0lj8j8kJ3J2jpmnj1
287A40j2rj1j4mK1L6K9J3J0J0Kj0rKQQRJ3Qj0k4k3j5o%Ljj0j9j6kOOJjLRJ5J8J8J9J8J1mj8
$$ plain form
281 218 200 199 214 228 221 200 180 173 174 177 183 195 207 215 218 222 228 234 234 220 192 163 144 135 125 116 120 140 163 180 193 203 199 177 153 138 125 105 91 104 129 136 119 104
276 104 106 118 124 131 149 175 193 198 193 187 185 192 206 220 224 216 194 165 142 136 139 139 132 130 136 143 146 152 161 164 162 167 183 194 186 173 178 201 225 243 260 269 252 207 158 124 105 95
270 95 95 108 125 137 147 164 185 198 191 165 128 94 72 61 58 60 65 71 70 59 50 52 66 78 81 77 77 90 116 141 153 149 144 151 167 179 184 190 197 196 185 178 186 199 194 174 158
264 158 165 189 208 207 187 157 135 132 143 145 131 113 107 110 111 111 123 144 157 149 128 114 112 116 119 124 140 165 186 193 191 194 213 238 254 253 239 220 202 188 175 157 134 113
259 113 103 99 92 86 90 102 110 112 119 132 140 131 116 105 101 93 82 76 81 93 110 131 150 164 172 180 188 193 193 185 171 155 142 136 135 137 139 136 125 108 98 105 130 163 192 217 233 236
253 236 221 193 167 157 163 175 185 196 209 217 215 207 200 192 180 167 166 176 188 200 217 240 259 271 283 298 307 301 284 264 244 225 214 209 200 183 174 185 210 230 243
248 243 251 249 227 190 151 116 85 67 68 80 84 78 85 114 148 161 152 135 124 123 129 135 131 123 123 144 176 198 195 171 140 121 122 136 143 133 114 102 106 120 133 142 147 155 168
242 168 180 186 188 193 201 204 201 194 189 184 183 194 216 234 233 211 184 162 147 140 140 147 152 153 148 135 114 92 76 71 73 76 78 78 74 70 75 91 112 124 120 102 80 67 73 100 131 146 141
$$ packed form
281B18j8jJ5J4pk1k0pJLOJ2J2QLMOO%j4k8k9j9rj0rMK0K3J7J3J0mk2k4j5j3k0j4J3K5Pj7j5
276A04KJ2OPJ8K6J8NnokPJ4J4Mqk2k9k3oL%pkOPLORLkNJ6J1qj3NK3K4J8J7Rj7m5m9l4j9j0
270I5%J3J7J2J0J7K1J3pk6l7l4k2j1lKNOjj1rKJ4J2Lm%J3K6K5J2mnPJ6J2NOPjj1pQJ3nk0j6
264A58PK4J9jk0l0k2lJ1Kj4j8oLJ%J2K1J3qk1j4kMLNJ6K5K1PkLJ9K5J6jj4j9j8j4j3j8k3k1
259A13j0mpoMJ2QKPJ3Qrj5j1mqj1oNJ2J7K1J9J4QQQN%qj4j6j3ojKKlj1j7j0PK5L3K9K5J6L
253B36j5k8k6j0OJ2J0J1J3Qkqpqj2j3jJ0J2J2J7K3J9J2J2J5Roj7k0k0j9j1nrj7rJ1K5K0J3
248B43Qkk2l7l9l5l1j8JJ2MoPK9L4J3rj7j1jOOmq%K1L2K2lk4l1j9JJ4Pj0j9j2MJ4J3RNQJ3
242A68J2OKNQLlpnnjJ1K2J8jk2k7k2j5p%PNJnj3k1k2j6nKLK%mmNJ6K1J2mj8k2j3OK7L1J5n
$$ plain form
236 141 132 135 143 141 129 123 135 153 165 178 195 209 206 191 183 188 194 193 189 190 197 210 229 246 250 241 234 236 239 232 216 201 189 174 156 135 113 92 77 76 89 106 120 128 129 123 112
231 112 100 88 80 75 71 62 51 49 60 84 111 132 139 131 114 103 106 117 128 139 154 168 172 163 145 119 89 59 40 31 29 30 34 44 62 81 95 98 90 81 80 90 104 114
225 114 112 101 90 94 112 132 140 141 144 149 152 151 153 159 159 145 123 107 106 113 116 112 108 117 139 166 186 195 190 171 142 115 97 89 88 95 109 124 132 137 143 149 151 149 149 151 151 148 146 143 136 130 131 144
219 144 161 166 152 130 122 136 162 175 165 152 155 173 189 189 179 164 142 111 74 45 37 50 71 85 86 87 98 122 150 173 187 190 184 180 183 191 194 193 196 206 217 222 218 211
213 211 202 195 190 180 159 136 128 140 157 163 156 139 120 105 105 118 133 139 140 140 137 133 137 153 164 150 120 103 113 141 167 184 187 174 154 141 143 154 162 171 183 187 173 145
208 145 120 114 122 128 123 114 117 137 160 164 142 109 84 71 61 49 36 28 28 37 56 76 86 77 57 37 24 15 2 -8 -10 3 27 50 69 83 92 93 87 86 97 111 112 99
202 99 85 81 85 88 89 95 106 115 116 114 108 98 84 69 58 53 57 76 102 122 131 133 134 134 137 150 172 184 171 136 102 87 90 105 123 136 138 128 112 99 95 103 113 115 107 101 103 107
197 107 100 82 64 62 86 131 179 202 194 175 171 184 197 199 193 185 175 158 136 113 94 87 97 117 132 133 126 115 99 81 77 88 100 100 94 99 116 129 129 119 103 85 71
$$ packed form
236A41rLQkj2oJ2J8J2J3J7J4lj5qNOjmJPJ3J9J7MrpKLpj6j5j2j5j8k1k2k1j5jJ3J7J4QJoj1
231A12j2j2qnmrj1kJ1K4K7K1Pqj7j1LJ1J1J1J5J4Mrj8k6l0l0j9rkJMJ0J8J9J4LqrjJ0J4J0
225A14kj1j1MJ8K0QJLNLjKO%j4k2j6jPLmmRK2K7K0Rnj9k9k7j8qjPJ4J5QNOOKk%K%lklpoJJ3
219A44J7Nj4k2qJ4K6J3j0j3LJ8J6%j0j5k2l1l7k9qJ3K1J4JJJ1K4K8K3J4LomLQLjLJ0J1Nmp
213B11rpnj0k1k3qJ2J7Opj7j9j5%J3J5OJ%lmMJ6J1j4l0j7J0K8K6J7Lj3k0j3KJ1QRJ2Mj4k8
208A45k5oQOnrLK0K3Mk2l3k5j3j0j2j3q%RJ9K0J0rk0k0j3rj3j0kJ3K4K3J9J4RJojJ1J4Jj3
202I9j4mMLJOJ1RJkoj0j4j5j1nMJ9K6K0RKJ%LJ3K2J2j3l5l4j5LJ5J8J3Kj0j6j3mQJ0KqoKM
197A07pj8j8kK4M5M8K3qj9mJ3J3Koqj0j7k2k3j9pJ0K0J5Jpj1j6j8mJ1J2%oNJ7J3%j0j6j8j4
$$ plain form
191 71 71 84 100 105 94 77 66 66 69 63 51 46 65 105 148 170 162 136 112 102 105 119 144 169 173 149 118 112 134 154 147 117 79 46 32 46 76 96 92 79 79 85 79
186 79 60 43 42 58 88 120 127 96 50 28 37 49 44 36 49 79 104 111 105 99 96 87 69 48 43 70 116 154 169 167 164 160 148 127 107 94 85 79 80 93 116 145 170 183
181 183 174 141 96 59 45 51 57 50 36 32 38 37 22 4 -3 -2 -7 -24 -43 -51 -42 -19 4 18 17 11 12 22 30 26 15 13 25 42 56 67 80 91 94 87 76 67 62 64 80 107 131
175 131 141 138 129 116 97 80 73 77 84 86 79 67 57 54 56 60 68 80 90 88 75 67 75 93 106 109 106 98 85 75 72 73 76 81 87 89 86 85 87 75 40 9 11 42 63 62 65 94 137 167
169 167 180 189 197 192 175 154 136 123 114 109 104 93 79 77 94 122 147 157 152 142 132 120 101 82 74 77 85 95 111 129 133 116 92 76 70 70 75 85 94 100 108 120 123 108 83
163 83 65 58 48 33 20 16 20 29 46 66 73 57 28 5 -3 -6 -10 -15 -20 -24 -30 -37 -34 -17 2 12 9 10 27 55 77 87 94 105 118 125 124 120 115 111 106 104 112 131 149 152 137 118 112
157 112 116 119 114 106 102 106 117 131 143 148 145 135 128 129 135 126 93 51 30 41 68 92 111 131 145 141 125 114 111 105 86 64 49 41 34 31 34 44 55 63 68 71 69 59 46 43 57
152 57 77 89 97 116 142 152 132 101 79 68 57 44 41 51 67 84 96 93 73 51 48 60 70 72 74 76 68 48 29 21 16 12 16 34 57 74 79 70 53 40 44 54 54 43
$$ packed form
191G1%J3J6Nj1j7j1%Loj2nJ9M0M3K2qk6k4j0LJ4K5K5Mk4l1oK2K0pl0l8l3j4J4L0K0mj3%Oo
186G9j9j7jJ6L0L2Pl1m6k2RJ2nqJ3L0K5Poolrj8k1nK7M6L8J5klmj2k1k0j3roJJ3K3K9K5J3
181A83rl3m5l7j4OOpj4mOjj5j8pJnj7j9qRK3K3J4joJJ0Qmj1kJ2J7J4J1J3J1Lpj1rnKJ6K7K4
175A31J0lrj3j9j7pMPKpj2j0lKMQJ2J0kj3qQJ8J3Llqj3j0lJLNOKljKj2l5l1KL1K1jLK9M3L0
169A67J3RQnj7k1j8j3rnnj1j4kJ7K8K5J0nj0j0j2j9j9qLQJ0J6J8Mj7k4j6o%NJ0ROQJ2Lj5k5
163H3j8pj0j5j3mMRJ7K0Pj6k9k3qlmnnmopLJ7J9J0lJJ7K8K2J0PJ1J3PjmnmnkQJ9J8Lj5j9o
157A12MLnqmMJ1J4J2Nlj0pJOrl3m2k1J1K7K4J9K0J4mj6j1loj9k2j5qplLJ0J1QNLkj0j3lJ4
152E7K0J2QJ9K6J0k0l1k2j1j1j3lJ0J6J7J2lk0k2lJ2J0KKKqk0j9qnmMJ8K3J7Nrj7j3MJ0%j1
$$ plain form
146 43 35 36 34 24 22 38 60 68 66 71 87 99 102 101 102 112 127 141 139 124 107 100 97 94 93 95 88 64 34 21 28 37 35 21 7 2 7 17 22 16 6 4 17 38 60 73 71 63 67 97
140 97 143 177 181 158 123 95 85 86 83 72 64 69 85 100 115 129 124 87 32 -3 -4 13 25 30 32 33 31 34 47 62 73 84 103 124 129 109 73 43 30 38 58 74 77
135 77 74 79 99 123 137 134 124 122 135 157 173 177 168 150 126 98 74 63 64 71 81 100 122 135 126 101 76 65 63 63 62 54 35 10 -3 8 42 79 106 125 135 127 101
130 101 72 55 54 59 59 55 52 56 69 85 93 96 100 109 119 127 135 137 123 95 74 79 105 128 140 144 145 141 135 133 133 129 126 133 154 175 184 179 174 179 193 207 208 187 152 118 98 91 92 99 108
123 108 113 115 111 102 88 76 69 67 71 88 119 148 157 150 149 154 145 109 68 52 67 94 115 125 126 118 109 108 123 146 166 169 153 125 96 76 67 66 70 78 87 96 101 98 91 87 84 74 51
117 51 28 25 46 72 88 95 100 100 90 79 75 77 77 73 65 55 44 38 46 65 85 95 88 72 58 60 77 95 102 100 94 85 68 52 50 58 60 49 37 37 45 48 38 16 -10 -33 -46
112 -46 -51 -51 -52 -56 -59 -50 -27 -2 7 0 -10 -4 11 20 15 5 2 2 2 7 23 47 68 73 62 43 22 0 -28 -58 -75 -68 -42 -17 -8 -13 -26 -44 -61 -63 -40 -1 30 42 39 39 47
106 47 54 47 27 5 -10 -17 -17 -13 -8 -9 -12 -6 17 49 73 80 73 62 56 58 73 100 131 151 149 130 111 104 105 102 90 79 83 97 102 89 61 35 17 8 3 0 0 -2 -8 -15 -16 -8 3 11
$$ packed form
146D3qJkj0kJ6K2QkNJ6J2LjJJ0J5J4kj5j7plljKpk4l0j3PRkj4j4nNJ0Noj0kJ3K1K2J3kqML0
140I7M6L4Mk3l5k8j0Jlj1qNJ6J5J5J4nl7n5l5jJ7J2NKJkLJ3J5J1J1J9K1Nk0l6l0j3QK0J6L
135G7lNK0K4J4lj0kJ3K2J6Mrj8k4k8k4j1JPJ0J9K2J3rk5k5j1k%jqj9k5j3J1L4L7K7J9J0qk6
130A01k9j7jN%mlMJ3J6QLMRJ0QQKj4k8k1NK6K3J2MJmok%mlPK1K1RnnNJ4J4Jk1l5l4k0pJPR
123A08NKmrj4j2pkMJ7L1K9RpjNrl6m1j6J5K7K1J0JqrjJ5K3K0Lj6k8k9k0rjMQRRNlpmlj0k3
117E1k3lK1K6J6PN%j0j1mK%mqj0j1oQJ9K0J0pj6j4KJ7J8Pkorj7j6kQKj1j2%QLj0k2k6k3j3
112d6n%jmlRK3K5Rpj0OJ5Rnj0l%%NJ6K4K1Nj1j9k1k2k8l0j7PK6K5Rnj3j8j7kK3L9L1J2l%Q
106D7Ppk0k2j5p%MNjlOK3L2K4Ppj1oKJ5K7L1K0kj9j9pJlj2j1MJ4Nj3k8k6j8rnl%kopjQJ1Q
$$ plain form
100 11 14 18 26 32 28 12 -8 -25 -30 -29 -30 -36 -38 -29 -15 -12 -26 -46 -53 -42 -23 -7 -1 1 14 42 73 86 74 52 40 39 45 57 75 96 113 123 124 108 81 63 65 74 64 34
94 34 5 -6 -5 2 18 38 51 51 45 42 34 14 -4 -6 9 27 34 28 20 15 14 17 24 35 46 53 54 54 55 53 40 23 16 24 40 51 54 57 70 91 108 110 98 79 60 39 26 33 63
$$ packed form
100A1LMQOmj6k0j7nJjokRJ4Lj4k0pJ1J9J6OKJ3K8L1J3j2k2j2jOJ2J8K1J7J0Jj6k7j8KRj0l0
94C4k9j1JPJ6K0J3%olqk0j8kJ5J8PoqnjLPJ1J1PJ%Jkj3j7pQJ6J1LLJ3K1J7Kj2j9j9k1j3PL0
$$ [...]
-1604G39
##END=	
##END=	
