##TITLE=	Nov08-2021.10.fid
TM-VI-151

##JCAMP-DX=	6.0	$$ MestReNova 14.3.1-31739
##DATA TYPE=	LINK
##BLOCK_ID=	1
##BLOCKS=	2    
##ORIGIN=	Mestrelab Research S.L.
##OWNER=	hrzepa
##$MNOVA/LINK_BLOCK_TYPE=	ITEM	$$ NMR Spectrum
##$MNOVA/ITEM/POLYGON=	(XY..XY)
5321,5835
8722,5835
8722,8208
5321,8208
5321,5835
##$MNOVA/ITEM/Z=	0
##$MNOVA/ITEM/ANGLE=	0
##TITLE=	Nov08-2021.10.fid
##JCAMP-DX=	6.0	$$ MestReNova 14.3.1-31739
##BLOCK_ID=	2
##DATA TYPE=	MNOVA NMR VIEW DATA
##DATA CLASS=	MNOVA VIEW DATA
##$MNOVA/ITEM/ZOOM/X=	-4.0107147498308073352,	16.011019999997905927
##$MNOVA/ITEM/ZOOM/Y=	-1175.8803625106811523,	12829.2376708984375
##END=	
##TITLE=	Nov08-2021.10.fid
##JCAMP-DX=	6.0	$$ MestReNova 14.3.1-31739
##BLOCK_ID=	3
##DATA TYPE=	NMR SPECTRUM
##DATA CLASS=	XYDATA
##NUMDIM=	1
##ORIGIN=	Bruker BioSpin GmbH
##OWNER=	nmr
##.OBSERVE FREQUENCY=	400.20240119999999706
##.OBSERVE NUCLEUS=	^1H
##.SOLVENT NAME=	CDCl3
##.PULSE SEQUENCE=	zg30
##LONGDATE=	2021/11/08 10:52:00.000
##.ACQUISITIONMODE=	SIMULTANEOUS (DQD)
##$ORIGINAL FORMAT=	Bruker XWIN-NMR
##$MNOVA/SCALES_VERSION=	9
##$PARAMETER FILE=	(acqus, ASCII, /private/var/folders/f6/rjf_tdyn2v98c5c0wvkgn4s80000gn/T/$SS4wg8rRfyVitXFWIdPjw/10/acqus, 0)
$$ ##TITLE= Parameter file, TOPSPIN		Version 3.2
$$ ##JCAMPDX= 5.0
$$ ##DATATYPE= Parameter Values
$$ ##NPOINTS= 11	$$ modification sequence number
$$ ##ORIGIN= Bruker BioSpin GmbH
$$ ##OWNER= nmr
$$ $$ 2021-11-08 10:52:16.619 +0000  nmr@CZC2439F63
$$ $$ /opt/topspin/data/agmb/nmr/Nov08-2021/10/acqus
$$ $$ process /opt/topspin3.2/prog/mod/shimcntl
$$ ##$ACQT0= -2.10084033613445
$$ ##$AMP= (0..31)
$$ 100 100 100 100 100 100 100 100 100 100 100 100 100 100 100 100 100 100
$$ 100 100 100 100 100 100 100 100 100 100 100 100 100 100
$$ ##$AMPCOIL= (0..19)
$$ 0 0 0 0 0 0 0 0 0 0 0 0 0 0 0 0 0 0 0 0
$$ ##$ANAVPT= -1
$$ ##$AQSEQ= 0
$$ ##$AQ_mod= 3
$$ ##$AUNM= <au_zg>
$$ ##$AUTOPOS= <44 >
$$ ##$BF1= 400.2
$$ ##$BF2= 400.2
$$ ##$BF3= 400.2
$$ ##$BF4= 400.2
$$ ##$BF5= 400.2
$$ ##$BF6= 400.2
$$ ##$BF7= 400.2
$$ ##$BF8= 400.2
$$ ##$BYTORDA= 0
$$ ##$CAGPARS= (0..11)
$$ 0 0 0 0 0 0 0 0 0 0 0 0
$$ ##$CFDGTYP= 0
$$ ##$CFRGTYP= 9
$$ ##$CHEMSTR= <none>
$$ ##$CNST= (0..63)
$$ 1 1 145 1 1 1 1 1 1 1 1 1 1 1 1 1 1 1 1 1 1 1 1 1 1 1 1 1 1 1 1 1 1 1 1
$$ 1 1 1 1 1 1 1 1 1 1 1 1 1 1 1 1 1 1 1 1 1 1 1 1 1 1 1 1 1
$$ ##$CPDPRG= (0..8)
$$ <> <> <> <> <mlev> <mlev> <mlev> <mlev> <mlev>
$$ ##$D= (0..63)
$$ 0 1 0 0 0 0 0 0 0 0.06 0 0 0 0 0 0 0.0002 0 0 0 0 0 0 0 0 0 0 0 0 0 0 0
$$ 0 0 0 0 0 0 0 0 0 0 0 0 0 0 0 0 0 0 0 0 0 0 0 0 0 0 0 0 0 0 0 0
$$ ##$DATE= 1636368735
$$ ##$DE= 6.5
$$ ##$DECBNUC= <off>
$$ ##$DECIM= 2496
$$ ##$DECNUC= <off>
$$ ##$DECSTAT= 4
$$ ##$DIGMOD= 1
$$ ##$DIGTYP= 12
$$ ##$DQDMODE= 0
$$ ##$DR= 22
$$ ##$DS= 2
$$ ##$DSPFIRM= 0
$$ ##$DSPFVS= 20
$$ ##$DTYPA= 0
$$ ##$EXP= <proton>
$$ ##$F1LIST= <111111111111111>
$$ ##$F2LIST= <222222222222222>
$$ ##$F3LIST= <333333333333333>
$$ ##$FCUCHAN= (0..9)
$$ 0 2 0 0 0 0 0 0 0 0
$$ ##$FL1= 90
$$ ##$FL2= 90
$$ ##$FL3= 90
$$ ##$FL4= 90
$$ [...]
$$ ##$Sgu3PowerLevels= (0..7)
$$ 0 0 0 0 0 0 0 0
$$ ##$Sgu4PowerLevels= (0..7)
$$ 0 0 0 0 0 0 0 0
$$ ##$Sgu5PowerLevels= (0..7)
$$ 0 0 0 0 0 0 0 0
$$ ##$Sgu6PowerLevels= (0..7)
$$ 0 0 0 0 0 0 0 0
$$ ##$Sgu7PowerLevels= (0..7)
$$ 0 0 0 0 0 0 0 0
$$ ##$Sgu8PowerLevels= (0..7)
$$ 0 0 0 0 0 0 0 0
$$ ##$SguType= 3
$$ ##$ShimPowMaxUA= (0..63)
$$ 130000 130000 130000 130000 130000 130000 130000 130000 130000 130000 130000
$$ 130000 130000 130000 130000 130000 130000 130000 130000 130000 0 0 0 0
$$ 0 0 0 0 0 0 0 0 0 0 0 0 0 0 0 0 0 0 0 0 0 0 0 0 0 0 0 0 0 0 0 0 0 0 0 0
$$ 0 0 0 0
$$ ##$ShimPowMaxUC= (0..63)
$$ 130000 130000 130000 130000 130000 130000 130000 130000 130000 130000 130000
$$ 130000 130000 130000 130000 130000 130000 130000 130000 130000 0 0 0 0
$$ 0 0 0 0 0 0 0 0 0 0 0 0 0 0 0 0 0 0 0 0 0 0 0 0 0 0 0 0 0 0 0 0 0 0 0 0
$$ 0 0 0 0
$$ ##$ShimPowMaxUG= (0..63)
$$ 524287 524287 524287 524287 524287 524287 524287 524287 524287 524287 524287
$$ 524287 524287 524287 524287 524287 524287 524287 524287 524287 0 0 0 0
$$ 0 0 0 0 0 0 0 0 0 0 0 0 0 0 0 0 0 0 0 0 0 0 0 0 0 0 0 0 0 0 0 0 0 0 0 0
$$ 0 0 0 0
$$ ##$ShimPowRcbType= 3
$$ ##$ShimPowRes= (0..63)
$$ 1e-20 1e-20 1e-20 1e-20 1e-20 1e-20 1e-20 1e-20 1e-20 1e-20 1e-20 1e-20
$$ 1e-20 1e-20 1e-20 1e-20 1e-20 1e-20 1e-20 1e-20 0 0 0 0 0 0 0 0 0 0 0 0
$$ 0 0 0 0 0 0 0 0 0 0 0 0 0 0 0 0 0 0 0 0 0 0 0 0 0 0 0 0 0 0 0 0
$$ ##$ShimPowRng0= (0..63)
$$ 1 1 1 1 1 1 1 1 1 1 1 1 1 1 1 1 1 1 1 1 0 0 0 0 0 0 0 0 0 0 0 0 0 0 0 0
$$ 0 0 0 0 0 0 0 0 0 0 0 0 0 0 0 0 0 0 0 0 0 0 0 0 0 0 0 0
$$ ##$ShimPowRng1= (0..63)
$$ 1 1 1 1 1 1 1 1 1 1 1 1 1 1 1 1 1 1 1 1 0 0 0 0 0 0 0 0 0 0 0 0 0 0 0 0
$$ 0 0 0 0 0 0 0 0 0 0 0 0 0 0 0 0 0 0 0 0 0 0 0 0 0 0 0 0
$$ ##$ShimPowRng2= (0..63)
$$ 1 1 1 1 1 1 1 1 1 1 1 1 1 1 1 1 1 1 1 1 0 0 0 0 0 0 0 0 0 0 0 0 0 0 0 0
$$ 0 0 0 0 0 0 0 0 0 0 0 0 0 0 0 0 0 0 0 0 0 0 0 0 0 0 0 0
$$ ##$ShimPowRng3= (0..63)
$$ 1 1 1 1 1 1 1 1 1 1 1 1 1 1 1 1 1 1 1 1 0 0 0 0 0 0 0 0 0 0 0 0 0 0 0 0
$$ 0 0 0 0 0 0 0 0 0 0 0 0 0 0 0 0 0 0 0 0 0 0 0 0 0 0 0 0
$$ ##$ShimSysFunc= (0..63)
$$ 1 2 3 4 5 7 9 11 15 16 8 10 12 14 6 17 13 18 19 20 0 0 0 0 0 0 0 0 0 0
$$ 0 0 0 0 0 0 0 0 0 0 0 0 0 0 0 0 0 0 0 0 0 0 0 0 0 0 0 0 0 0 0 0 0 0
$$ ##$ShimSysMatrix= 0
$$ ##$ShimSysType= 1
$$ ##$TFXNUM= 0
$$ ##$TRIPLO2= 0
$$ ##$VTU= 2
$$ ##$VTUETH= <149.236.99.20>
$$ ##$VTUTY= <no>
$$ ##$WBREFAM= (0..15)
$$ 135.5 97.7 100 100 100 100 100 100 100 100 100 100 100 100 100 100
$$ ##$WBREFLM= (0..15)
$$ 0 0 0 0 0 0 0 0 0 0 0 0 0 0 0 0
$$ ##$WBREFPH= (0..15)
$$ 72.26 -67.22 0 0 0 0 0 0 0 0 0 0 0 0 0 0
$$ ##$WBSGU= (0..15)
$$ 0 0 0 0 0 0 0 0 0 0 0 0 0 0 0 0
$$ ##$XFAC= 2
$$ ##END=
$$ 
##$DECIM=	2496
##$DSPFVS=	20
##XUNITS=	HZ
##YUNITS=	ARBITRARY UNITS
##FIRSTX=	6407.6102040000005218
##LASTX=	-1605.0880428824991668
##DELTAX=	-0.12226593800080109986
##XFACTOR=	1
##YFACTOR=	0.0069499429897815472729
##FIRSTY=	4.2627363204956054688
##MINY=	-9.5860509872436523438
##MAXY=	11662.943359375
##NPOINTS=	65536
##XYDATA=	(X++(Y..Y))
$$ [...]
2802F37J2QK4M0J7l6m9LN4L0l1l8J0L5%l2oM1N6L8K1Rj0k8k3lOJNK6M4M1K3QJoj1j1qj2k4
2797H62k4JK9J7k5l8JL5Rm5n2lL5K8J3J8J9pk6j0J8J8mk7l5k8RO3Q8O1K1J0K4J9jrqk0l3k0
2793I83K2N1N1L6K1OnQK9L2J3NJ9K9J3j0j8j0jRK2L4L6L4K4J1RK6L6J0l4m5j0K6K6J1LJKJ2
2788A517L4L4Oj4QL9L5J7K4N6P1N5L4J9pl1k4J6M3L5K4K7L2K4L2N9O8L6KJ6N4N6K7K3N1O0
2783B558K8MK4M7K5j2lM3N7K3%K7O5O2K9J7L8O0N6M0L2L5L0J5QK6N8P2N4K9M0P8R1N4QJ2N5
2779C885Q7Q1O9P0P2O1N2O0P6Q3Q6R1R9J01J07J15J14J02J09J50K06K37K38K39K64L04L33
2775G491L32L03K73K79L16L51L56L49L52L67L84M11M72N50O15O59P09P84Q87J027J223J471
2773A9961J721J928K059K100K045J914J749J588J442J314J224J182J176J170J126R99P55L87
$$ y = [637, 649, 657, 681, 721, 738, 702, 653, 656, 710, 740, 709, 671, 681, 716, 716, 684, 678, 719, 775, 813, 834, 843, 833, 805, 782, 779, 785, 786, 791, 817, 861, 902, 925, 933, 934, 928, 917, 906, 898, 886, 862, 838, 839, 868, 885, 860, 822, 823, 858, 867, 822, 770, 767, 802, 830, 843, 861, 880, 873, 847, 837, 855, 873, 869, 842, 807, 779, 788, 851, 939, 1000, 1021, 1031, 1055, 1074, 1073, 1064, 1056, 1036, 1003, 983, 1005, 1056, 1107, 1143, 1164, 1170, 1165, 1173, 1202, 1234, 1247, 1252, 1271, 1300, 1313, 1303, 1285, 1275, 1274, 1283, 1305, 1339, 1375, 1409, 1433, 1444, 1453, 1479, 1515, 1525, 1491, 1446, 1436, 1462, 1488, 1499, 1502, 1503, 1505, 1517, 1551, 1585, 1591, 1577, 1585, 1624, 1659, 1676, 1700, 1756, 1827, 1882, 1916, 1935, 1928, 1897, 1873, 1889, 1932, 1967, 1991, 2018, 2050, 2074, 2106, 2165, 2233, 2269, 2271, 2287, 2341, 2397, 2424, 2447, 2498, 2558, 2586, 2590, 2614, 2661, 2686, 2674, 2671, 2714, 2771, 2794, 2794, 2821, 2886, 2948, 2977, 2994, 3032, 3092, 3148, 3188, 3220, 3255, 3285, 3300, 3308, 3334, 3392, 3464, 3518, 3547, 3587, 3665, 3756, 3810, 3818, 3830, 3885, 3972, 4053, 4122, 4192, 4264, 4325, 4377, 4437, 4513, 4596, 4682, 4773, 4872, 4973, 5080, 5195, 5309, 5411, 5520, 5670, 5876, 6113, 6351, 6590, 6854, 7158, 7491, 7823, 8126, 8399, 8678, 8994, 9345, 9701, 10050, 10402, 10769, 11153, 11564, 12036, 12586, 13201, 13860, 14569, 15353, 16240, 17267, 18490, 19961, 21682, 23610, 25669, 27769, 29814, 31728, 33477, 35065, 36507, 37821, 39045, 40227, 41403, 42573, 43699, 44698, 45453, 45840]
2771D5840o5n51j022j422j708j872j939j926j823j638j417j207j015q34o89o12o00o23o67
2768B4210p29p89q16p98p45o68n68m60l58k53j42m2K8R3J94L28M46N32O08O78P08O88O65O88
2765B3498P47Q04Q57R37J056J191J330J467J595J701J771J790J730J593J423J265J125R88
2763D6868Q54P48O86O54O34O04N43M30K58K3k99o96j089j372j498j500j424j266j010o80l27
2761D1141J4L32O33R32J255J611J969K299K596K861L070L172L161L086L012K973K982L057
2758H0156L209L428L706M073M567N175N827O486P229Q203R546J1330J3555J6117J8757K1062
2756B22426K2602K3109K2580K1275J9569J7799J6158J4742J3651J2982J2733J2665J2324J1153
2755D55768Q674M708m67o175j1642j6299j9869k2224k3309k3188k2082k0291j8098j5744j3450
$$ y = [45840, 45775, 45224, 44202, 42780, 41072, 39200, 37261, 35335, 33512, 31874, 30457, 29250, 28235, 27401, 26712, 26100, 25500, 24877, 24210, 23481, 22692, 21876, 21078, 20333, 19665, 19097, 18637, 18279, 18026, 17884, 17842, 17870, 17963, 18157, 18485, 18931, 19463, 20071, 20749, 21457, 22145, 22810, 23498, 24245, 25049, 25906, 26843, 27899, 29090, 30420, 31887, 33482, 35183, 36954, 38744, 40474, 42067, 43490, 44755, 45880, 46868, 47722, 48470, 49156, 49810, 50444, 51048, 51591, 52021, 52279, 52302, 52003, 51307, 50218, 48846, 47348, 45848, 44424, 43158, 42148, 41468, 41141, 41155, 41487, 42120, 43052, 44307, 45918, 47887, 50186, 52782, 55643, 58713, 61885, 65046, 68132, 71144, 74117, 77099, 80156, 83365, 86793, 90499, 94572, 99139, 104314, 110141, 116627, 123856, 132059, 141605, 152935, 166490, 182607, 201364, 222426, 245028, 268137, 290717, 311992, 331561, 349360, 365518, 380260, 393911, 406893, 419626, 432291, 444615, 455768, 464442, 469150, 468683, 462508, 450866, 434567, 414698, 392474, 369165, 345977, 323895, 303604, 285506, 269762, 256312]
2753B56312j1417r793q693q184q256q772r503j0176j0546j0469r960r152q174p073n872m645
2751A15627l479k396j348l05P21J717K699L661M541N254N742N998O083O123O258O593P174
2749A70663Q019R136J0499J2055J3710J5304J6612J7428J7655J7295J6355J4832J2812J0560
2747C62935Q430O717N541M834M398M010L500K752J576l42l317p416j2315j7334k1661k4627
2745C17681k5944k5733k4373k2284j9817j7258j4837j2694j0878r378q148p134o295n607n037
2743A02264m527m054l673l466l438l523l652l793l895l880l729l513l309l103k848k557k294
2741D3010k080j876j667j498j390j309j209j101j014r50q89q29p78p27o75o41o28o10n69n27
2739B2043n14n13m90m48m17m01l70l29l09l20l26l02k68k43k27k19k27k51k59k41k25k19j93
$$ y = [256312, 244895, 235102, 226409, 218225, 209969, 201197, 191694, 181518, 170972, 160503, 150543, 141391, 133217, 126144, 120272, 115627, 112148, 109752, 108404, 108099, 108820, 110537, 113236, 116897, 121438, 126692, 132434, 138432, 144515, 150638, 156896, 163489, 170663, 178682, 187818, 198317, 210372, 224082, 239386, 255998, 273426, 291081, 308376, 324731, 339563, 352375, 362935, 371365, 378082, 383623, 388457, 392855, 396865, 400365, 403117, 404693, 404351, 401034, 393618, 381303, 363969, 342308, 317681, 291737, 266004, 241631, 219347, 199530, 182272, 167435, 154741, 143863, 134485, 126337, 119203, 112908, 107301, 102264, 97737, 93683, 90010, 86544, 83106, 79583, 75931, 72138, 68243, 64363, 60634, 57121, 53812, 50709, 47861, 45304, 43010, 40930, 39054, 37387, 35889, 34499, 33190, 31981, 30880, 29866, 28916, 28027, 27198, 26420, 25693, 25018, 24377, 23749, 23139, 22570, 22043, 21529, 21016, 20526, 20078, 19661, 19260, 18890, 18561, 18252, 17932, 17606, 17304, 17036, 16793, 16566, 16347, 16120, 15869, 15610, 15369, 15144, 14925, 14732]
2736A4732j43j10j29j53j29q5r6j59j92j53r5r0j33j64j53j15r0j00j30j41j14p8p5j07j34
2733A1664j38j26j12r5q1q3r0p9n7n2o7p3p1p7q3n7j7j8p1j11r8o9o8p5o6n5n4m1qlm8q9p9
2729I353o4r8j40j09k8po3j02o7j8k3n4o1n1o2q2p5m2k5l6m9m9m4m3m3m2m1m1m1m4m8m7m3
2725G571m5n7o8p6q0p8o9o3o5p2o6n5n5o7p3p0o4n7m7n1p5r4o8k1j4n9r3p1k6j1k4l1k3k2
2721E661l1l2j7lmk1l9m1k1jol2m7l3qOLj4l7m5k0J2Ok9l9nJ7qm0l3j0j9m9m4LM0L1mk7k4
2716D996ppl6o9o2k1jl0o1l9J3K9Lj8j5j4k3k3j4k2m3m6k5mK%j5m9q2p7l8j2j1pJ2K0Kk1k5
2711D160j8rLPqk6j5K1L7J1j7j8qrj6j6j8l0l4j7JOJ0K2K7J0j2j8j9k8m2m5l3qK8N4L8j1m2
2706C918l3j9k9m2l2k0l0l9k0QNj6j5J6L4K0j1m2o2n9l1mqm2o4o0l8j4J7M0M2J9rl2m4l9j2
$$ y = [14732, 14589, 14479, 14350, 14197, 14068, 13983, 13887, 13728, 13536, 13383, 13288, 13198, 13065, 12901, 12748, 12633, 12543, 12443, 12313, 12172, 12058, 11980, 11905, 11798, 11664, 11526, 11400, 11288, 11193, 11112, 11029, 10939, 10860, 10803, 10751, 10684, 10611, 10540, 10463, 10380, 10323, 10306, 10288, 10217, 10106, 10008, 9939, 9871, 9796, 9730, 9675, 9621, 9580, 9572, 9569, 9521, 9432, 9353, 9289, 9191, 9051, 8942, 8914, 8907, 8844, 8742, 8675, 8657, 8634, 8580, 8519, 8468, 8406, 8324, 8249, 8207, 8182, 8146, 8097, 8048, 8004, 7961, 7918, 7876, 7835, 7794, 7753, 7709, 7661, 7614, 7571, 7526, 7469, 7401, 7325, 7245, 7167, 7098, 7035, 6970, 6898, 6832, 6777, 6722, 6655, 6582, 6512, 6448, 6391, 6344, 6293, 6218, 6124, 6056, 6035, 6021, 5962, 5869, 5798, 5772, 5761, 5737, 5706, 5683, 5661, 5630, 5598, 5581, 5578, 5574, 5553, 5514, 5473, 5452, 5451, 5445, 5413, 5366, 5333, 5325, 5331, 5334, 5320, 5283, 5238, 5218, 5230, 5236, 5207, 5168, 5163, 5180, 5172, 5132, 5099, 5089, 5070, 5021, 4977, 4980, 5020, 5051, 5047, 5020, 4996, 4989, 4982, 4946, 4877, 4815, 4794, 4793, 4763, 4702, 4663, 4676, 4705, 4708, 4690, 4675, 4661, 4638, 4615, 4601, 4579, 4536, 4490, 4465, 4461, 4463, 4463, 4448, 4399, 4317, 4240, 4202, 4190, 4179, 4172, 4184, 4204, 4206, 4185, 4160, 4142, 4133, 4136, 4143, 4135, 4109, 4094, 4115, 4152, 4163, 4146, 4128, 4120, 4111, 4095, 4079, 4061, 4031, 3997, 3980, 3981, 3987, 3997, 4019, 4046, 4056, 4044, 4026, 4007, 3979, 3937, 3892, 3859, 3851, 3879, 3933, 3971, 3960, 3918, 3885, 3866, 3837, 3795, 3763, 3743, 3713, 3674, 3654, 3662, 3667, 3651, 3636, 3652, 3686, 3706, 3695, 3653, 3591, 3532, 3501, 3497, 3489, 3447, 3383, 3323, 3285, 3271, 3288, 3328, 3370, 3389, 3380, 3348, 3304, 3265, 3253]
2702C253J3J5OJ0J9J4LJ1L4L0j8o4n9j3K4K2%j0MK1K0kk7l6k8j5jOKj7l1k1PK9L3J7lj5j0
2697C223%ok8m2k7lNj4m0m9l3LK7J7j4k9j9j3j8JM7O3J6l9l3J2K1qj8NJ0k5m7k5Nkk6k3OL3
2692B913L5J7j5m1l9j6OJ8L0M2K7j0l1j1K0K7Mk3m2m7k6LJ1j1k6rRkk2j3J6J3l3p4o8k5J8
2688B625L0K1J3K2K8Ol0m0j4Pnk7k5j1rj4RN2P2M3pm1n0l9k6qJ1K9M0L3J7MLJj1k3j9rjJl
2683B655j3k5k5j5rq%J5J7JnK2N1M9K0nj3j9k8k4j1kLJ1J8J6%j8l1l3j0K4M2K6MJ0L2M2M2
2678B806O0R0R0N1J9M1Q7J00O5L2M5R2J13P9K6J3M5P8P1L7J0k%J4L2L4J2j2k3l5n9p3n6k2
2674C860j1k5l5l0k2j9j9k1l1m0n5q5j19j15o0j1j8o6q8p3n0m2l6k7k1j2NJ7PKK7M8K3k0j6
2669B822L6P6P8O7N7L5RJ8N9Q5Q8J04J21R2K8%J9J5l8o8k6K3J1k9l1k0m7q5o8j8j1n6q5o4
$$ y = [3253, 3266, 3281, 3287, 3297, 3316, 3330, 3333, 3344, 3378, 3408, 3390, 3326, 3267, 3254, 3278, 3300, 3300, 3290, 3294, 3315, 3335, 3333, 3306, 3270, 3242, 3227, 3226, 3232, 3234, 3217, 3186, 3165, 3172, 3201, 3234, 3251, 3248, 3233, 3223, 3223, 3217, 3189, 3147, 3120, 3117, 3122, 3108, 3068, 3019, 2986, 2989, 3016, 3033, 3019, 2990, 2971, 2958, 2940, 2941, 2988, 3051, 3067, 3028, 2995, 3007, 3028, 3020, 3002, 3007, 3017, 2992, 2945, 2920, 2925, 2923, 2897, 2874, 2880, 2913, 2948, 2965, 2950, 2909, 2870, 2854, 2860, 2878, 2908, 2950, 2977, 2967, 2936, 2925, 2945, 2972, 2976, 2953, 2911, 2864, 2838, 2841, 2852, 2841, 2815, 2806, 2815, 2813, 2791, 2778, 2794, 2807, 2774, 2700, 2632, 2607, 2625, 2655, 2676, 2689, 2711, 2739, 2745, 2715, 2675, 2661, 2668, 2663, 2636, 2611, 2600, 2591, 2577, 2586, 2638, 2710, 2753, 2746, 2705, 2655, 2616, 2590, 2582, 2593, 2622, 2662, 2695, 2712, 2716, 2719, 2720, 2709, 2686, 2667, 2658, 2657, 2658, 2655, 2642, 2617, 2592, 2577, 2568, 2560, 2560, 2575, 2592, 2593, 2588, 2610, 2661, 2710, 2730, 2725, 2712, 2693, 2665, 2641, 2630, 2628, 2631, 2642, 2660, 2676, 2676, 2658, 2627, 2594, 2584, 2608, 2650, 2676, 2680, 2690, 2722, 2764, 2806, 2866, 2956, 3046, 3097, 3116, 3157, 3244, 3344, 3409, 3441, 3486, 3578, 3691, 3770, 3796, 3809, 3854, 3932, 4003, 4040, 4050, 4048, 4048, 4062, 4094, 4128, 4140, 4128, 4105, 4070, 4011, 3938, 3882, 3860, 3849, 3824, 3789, 3759, 3737, 3718, 3699, 3678, 3647, 3607, 3552, 3467, 3348, 3233, 3173, 3162, 3144, 3078, 2990, 2917, 2867, 2825, 2789, 2762, 2741, 2729, 2734, 2751, 2758, 2760, 2787, 2835, 2858, 2838, 2822, 2858, 2934, 3012, 3079, 3136, 3171, 3180, 3198, 3257, 3342, 3430, 3534, 3655, 3747, 3775, 3775, 3794, 3809, 3771, 3703, 3677, 3700, 3711, 3682, 3651, 3631, 3584, 3499, 3431, 3413, 3402, 3346, 3261, 3197]
2665C197l1j0OJ6J4RJ2Rrj8%Pl6q9q4m2l3o5p9n8n0p6q7n2j5j9m5n6m6l1j3nj8m0m5l1k8l5
2661B024k5QK0lk5j6QK1J7Jk3l8k6rk4o0n9rL5L4Rmqj2oQjl3m2j6%j7k3J4M4J4l7l4J5L4%
2656A756k3LL8L6Jl6n8n8l9j4%J1L8N5L0k5n1j4L8O0M9L6K0j7o1p0l4jj1m3m5jL5K4rqK6M2
2651A680J6j6j1J5K4Ok2m9n7k6K6M4Km7m3lJ6PMPj7n4m0K3O5L9kj1nk0l2mL2K5pnK6L0j2m8
2646A556m1j7nMJ5J4nmL0N1K2k3k3J4K4j4o0o6m1oK4L7K4MJ0M0M9J2l5m0j3Mok4k5kK5L7Q
2641A554m2o7m1lNjJ3L5K9NNK3Rl2m1ML9J4k5j8K0K5ql6l2j4nqj7k5k4pPQMMKomJ3K2PpMK6
2636A414K5%j9j9j1lONj5l7l3j4lqj3qKK3M5M8K0qj0Knj8j4qk3l7j0M0N2J8j2rkj1j7rj1k7
2631A286l0oK9M8M7J6m3q5n8J2M3Pk9j3J6J1JJ9L8J2l1l2JK2K4M1O5M7j1m6l1rk1l9k5ORk3
$$ y = [3197, 3166, 3156, 3162, 3178, 3192, 3201, 3213, 3222, 3213, 3195, 3195, 3202, 3166, 3077, 2993, 2951, 2918, 2853, 2774, 2716, 2666, 2590, 2503, 2451, 2436, 2417, 2372, 2316, 2270, 2239, 2226, 2221, 2203, 2163, 2118, 2087, 2059, 2024, 1999, 2007, 2027, 2024, 1999, 1983, 1991, 2012, 2029, 2030, 2007, 1969, 1943, 1934, 1910, 1850, 1791, 1782, 1817, 1851, 1860, 1856, 1848, 1836, 1830, 1838, 1837, 1804, 1762, 1746, 1746, 1729, 1706, 1720, 1764, 1778, 1741, 1707, 1722, 1756, 1756, 1733, 1736, 1774, 1810, 1811, 1775, 1717, 1659, 1620, 1606, 1606, 1617, 1655, 1710, 1740, 1715, 1664, 1650, 1688, 1748, 1797, 1833, 1853, 1836, 1775, 1705, 1671, 1670, 1659, 1616, 1571, 1570, 1605, 1629, 1620, 1612, 1638, 1680, 1696, 1680, 1669, 1684, 1708, 1714, 1692, 1643, 1586, 1560, 1586, 1630, 1632, 1585, 1542, 1539, 1555, 1562, 1566, 1573, 1556, 1502, 1462, 1485, 1550, 1589, 1587, 1576, 1571, 1551, 1519, 1515, 1547, 1572, 1565, 1560, 1586, 1616, 1604, 1556, 1515, 1498, 1493, 1497, 1512, 1526, 1521, 1517, 1547, 1598, 1620, 1597, 1574, 1588, 1612, 1598, 1538, 1472, 1431, 1425, 1449, 1486, 1510, 1514, 1524, 1564, 1613, 1625, 1590, 1550, 1537, 1541, 1535, 1511, 1486, 1484, 1509, 1546, 1554, 1512, 1445, 1404, 1401, 1406, 1405, 1418, 1453, 1482, 1487, 1492, 1515, 1524, 1492, 1451, 1455, 1494, 1508, 1483, 1465, 1485, 1510, 1502, 1466, 1434, 1420, 1415, 1407, 1390, 1365, 1341, 1334, 1341, 1349, 1353, 1357, 1359, 1353, 1349, 1362, 1384, 1391, 1384, 1388, 1414, 1439, 1439, 1420, 1401, 1390, 1387, 1393, 1398, 1383, 1346, 1313, 1299, 1296, 1288, 1275, 1267, 1269, 1292, 1337, 1385, 1405, 1397, 1387, 1389, 1384, 1366, 1352, 1344, 1321, 1284, 1274, 1314, 1366, 1384, 1372, 1363, 1361, 1350, 1333, 1324, 1313, 1286, 1256, 1250, 1279, 1327, 1374, 1390, 1347, 1262, 1204, 1216, 1259, 1266, 1237, 1224, 1240, 1251, 1252, 1271, 1309, 1321, 1290, 1258, 1259, 1281, 1305, 1346, 1411, 1458, 1447, 1401, 1370, 1361, 1340, 1301, 1276, 1282, 1291, 1268]
2626A268m5k2K7M8L0J2K1K7nm7l9K0N8L3j1k5j5j5j5lNj4k5MM0L1nj2J5J7j8m1k3jmj3j3j2
2621A233k2j6J8M4K3k3m5k1J9L2Qk5m0l4k8k5kM6P7N9K0RK0Ll9m9j0J7pm2l4MJ8Jj6j8j6j3
2617A126lJ2J9K6L9M7L5J4Mkj9l9l2%J5j5n0m0J2L7jn9o1kM7L2j3j2L5O1K9k5m4j6K1L2Rk2
2612A197l3k0ppkK1L9K1k0m1k8oRK6L0Nk6j6K4K8k1n8l5MPrJK2K0OJ6L0J4k1j8J4J8j8m1j3
2607A112K0J6j4l1k0jJ2J6J5J3J0Jj5k8k7j9j6j8j7j1kJ9M4M3Ml4l5rQJ2J8J8ql3j2M1O2K3
2602A157k3l3j7jJ4K6J2k1l0mJ4ql1pL9M4J2j1lPkj5j1jPJ8K9L1Rk6n4o0m7k0KJ7K7K7J2j7
2598A062l3k4lJqj0%Jj3k5j5J4L6K7JrRK9J7j2k0OK7J3j4k1j2j1j4mJ6J8KrNK5K0rm4n5l8
2593I26JL6M1J4j4k0kOj0l6m2k0%NPK4L7J8j4k1%Mk6m8j7L4M5J3j1jRj0l2j9K5N1K8k2n8n8
$$ y = [1268, 1223, 1201, 1228, 1276, 1306, 1318, 1339, 1366, 1361, 1314, 1275, 1295, 1353, 1386, 1375, 1350, 1335, 1320, 1305, 1302, 1307, 1293, 1268, 1272, 1312, 1343, 1338, 1326, 1341, 1358, 1340, 1299, 1276, 1275, 1271, 1258, 1245, 1233, 1211, 1195, 1213, 1257, 1280, 1257, 1212, 1191, 1210, 1242, 1250, 1225, 1185, 1151, 1123, 1098, 1096, 1142, 1219, 1278, 1298, 1307, 1327, 1330, 1291, 1242, 1232, 1249, 1242, 1200, 1166, 1170, 1188, 1189, 1173, 1155, 1139, 1126, 1123, 1135, 1154, 1180, 1219, 1266, 1301, 1315, 1319, 1317, 1298, 1259, 1227, 1227, 1242, 1227, 1177, 1137, 1149, 1186, 1185, 1126, 1065, 1063, 1110, 1142, 1129, 1117, 1152, 1213, 1242, 1217, 1173, 1157, 1178, 1210, 1219, 1197, 1164, 1144, 1137, 1130, 1128, 1149, 1188, 1209, 1189, 1148, 1120, 1114, 1123, 1149, 1179, 1184, 1158, 1142, 1166, 1194, 1173, 1115, 1080, 1084, 1091, 1082, 1083, 1105, 1125, 1131, 1147, 1177, 1191, 1170, 1152, 1166, 1184, 1166, 1125, 1112, 1132, 1148, 1134, 1103, 1083, 1082, 1094, 1110, 1125, 1138, 1148, 1149, 1134, 1106, 1079, 1060, 1044, 1026, 1009, 998, 996, 1015, 1059, 1102, 1106, 1072, 1037, 1028, 1036, 1048, 1066, 1084, 1076, 1043, 1031, 1072, 1134, 1157, 1134, 1101, 1084, 1083, 1097, 1123, 1135, 1114, 1084, 1080, 1094, 1086, 1055, 1048, 1087, 1131, 1143, 1132, 1129, 1136, 1134, 1119, 1108, 1107, 1114, 1132, 1161, 1192, 1201, 1175, 1121, 1061, 1014, 994, 996, 1013, 1040, 1067, 1079, 1062, 1029, 1005, 1002, 1003, 995, 985, 985, 986, 973, 948, 933, 947, 983, 1010, 1011, 1002, 1011, 1040, 1057, 1045, 1025, 1031, 1058, 1071, 1057, 1036, 1024, 1013, 999, 995, 1011, 1029, 1031, 1022, 1027, 1052, 1072, 1063, 1019, 964, 926, 927, 963, 1004, 1018, 1004, 984, 982, 988, 978, 942, 900, 880, 880, 885, 892, 916, 953, 971, 957, 936, 936, 940, 914, 866, 849, 883, 928, 941, 930, 929, 938, 928, 896, 877, 902, 953, 981, 959, 901, 843]
2588H43l0OL7N3M4J2j3pK4M1K4lj2%J1J2Nj3l8n1l5kRj1k6%L9M3jl6j9K4K7k0n2k5K4M0K7
2583I51K9L9J1m5o8m5k8l6j8M6Q0K9m0k7M1N6mm4j3L1J9j8j8J0J8jj3oLjrqlkj4k7k5lK1J8
2578H86qk3rJ1J8Rmj6k0j7j0j5k2j8jJ0J8L3M9L7QkJ6L0J5mnmj8k7j0J4J4JlLMrk4m0m3k1
2573H03J7L0Rj0LJ8lk9k3lj3l9k6K1M6K3jOK1Qj8k5j4NK8N0M5J3j2j1kk2n1n6k8NK0J9Qpj8
2568G87j6nMPJ2J6J7Qj2l4m3l0nJ3J4J0MkoJK0L7L0Oj9l2l1j9kJ8L0K5jk9l2j1Jj3l4k6LJ3
2563F74jqMRj0k8j1K1L3J7OK2M8N0J8k3l6j2K1K9Rj6k9k7rJ9L5J7j7k7qPPRK2J8j7m3k9JJ3
2558G58RJ5J8kl0k9lJ6J7K0K2Mk8l0LK0j2m9l4J2L1Lk6j8J2K6K0J3J0ol5n0l5lK2L4M1M3K4
2553H03nj8j2oj6k2oJ7K1jl3n6n5k2K1L7J4j3j4qj4j3J7M9L4j3l1nK1J0qmJ3J2QJ5K7J7j3
$$ y = [843, 813, 819, 856, 909, 953, 965, 952, 945, 969, 1010, 1034, 1031, 1019, 1019, 1030, 1042, 1047, 1034, 996, 945, 910, 908, 917, 906, 880, 880, 919, 962, 961, 925, 906, 930, 957, 937, 885, 860, 884, 924, 951, 980, 1019, 1030, 985, 917, 872, 844, 808, 790, 836, 916, 945, 905, 878, 919, 975, 971, 927, 914, 945, 964, 946, 928, 938, 956, 955, 942, 936, 939, 938, 929, 921, 918, 916, 902, 875, 850, 847, 868, 886, 878, 855, 846, 857, 875, 884, 880, 864, 844, 827, 817, 802, 780, 762, 761, 771, 789, 822, 871, 908, 916, 914, 930, 960, 975, 971, 966, 962, 944, 917, 907, 921, 935, 936, 933, 936, 940, 931, 907, 867, 824, 803, 820, 850, 859, 849, 852, 870, 867, 838, 815, 812, 799, 760, 734, 755, 801, 824, 823, 829, 850, 858, 840, 815, 801, 806, 834, 884, 929, 942, 930, 919, 917, 895, 844, 788, 760, 765, 785, 804, 812, 805, 787, 771, 766, 770, 777, 789, 805, 822, 830, 818, 784, 741, 711, 706, 719, 733, 743, 747, 745, 739, 740, 760, 797, 827, 833, 814, 782, 751, 732, 730, 748, 778, 803, 802, 773, 741, 730, 731, 718, 684, 658, 661, 674, 673, 665, 669, 678, 668, 640, 629, 650, 683, 700, 706, 728, 776, 826, 844, 821, 785, 773, 794, 823, 832, 816, 787, 760, 751, 770, 805, 822, 805, 778, 770, 777, 784, 793, 815, 833, 816, 773, 744, 745, 758, 767, 782, 800, 798, 768, 739, 736, 752, 769, 789, 811, 815, 787, 757, 760, 780, 768, 719, 685, 697, 728, 731, 705, 687, 699, 725, 745, 758, 768, 762, 727, 677, 642, 639, 661, 695, 736, 779, 803, 798, 780, 768, 762, 746, 724, 718, 735, 756, 755, 722, 666, 611, 589, 610, 647, 661, 648, 634, 626, 612, 599, 616, 665, 699, 686, 655, 650, 671, 681, 673, 669, 682, 694, 702, 717, 744, 761, 748]
2548G48m0m3k1J6L7K8RJ6L6K0l7o7l4J4J6j3j5J1J4pj3J0K5J2LJ5J7qk1RM6L8j1n1m8k4pj
2544F79LRPnj6j3NK2K3J1LPQmj5j2%jj1j6mNmk6k6OM4M4Jm6m8oL7M4K2kj1j2j8k9l4j4K0M3
2538F70L1ol3k6LK6K5Mj7j9lJ5K0J7J3J6J6Rrl2m9l7OM4L5j2m4l0KRpj6mJ6K1J2JonnqnNJ2
2533F55%j7j4NJ3Lj0qnjJ7M0L1k3p9p8k6J8K9J7Nj0j9rJ2J4mj1OK1Rk0l9l4mL4N9M4jl6l7
2528E47j7okLJ2J2LKJ4L2L3J0k2l0qJ9K2Rjj1k7l1%L9L8Oj1lj8o5p9k7K9K7lkK0Rk0j4K5L3
2523E47Lj4OK9L2M2N3J8n7q5j6P3P9Mn9o3l4rQJ2%j1KK8L0Lk4k8j3RK6K7Qrj0%PJ1J2%k6l7
2517E74j5Nj4m2k8J8L7Ll4l2j0J1K1K4Pj8j0K6L6nm0j6L5L9nl3k0oj1j7oLJMK7M2K2j0k2k1
2513E20l0m7l4J3N5N6K9PMKqk3l1l9m3l7pL1N5M2Nk2k0KJ7RomNlk3j9K0M6J6m3o0j8K9L2Q
$$ y = [748, 708, 665, 644, 660, 697, 725, 734, 750, 786, 806, 769, 702, 668, 682, 698, 685, 670, 681, 695, 688, 675, 685, 710, 722, 725, 740, 757, 749, 728, 737, 783, 821, 810, 759, 711, 687, 680, 679, 682, 691, 698, 693, 677, 664, 669, 691, 714, 725, 728, 735, 743, 739, 724, 712, 712, 711, 700, 684, 680, 685, 681, 655, 629, 635, 679, 723, 724, 678, 630, 624, 661, 705, 727, 725, 714, 702, 684, 655, 621, 607, 627, 670, 701, 695, 662, 636, 639, 665, 690, 694, 677, 658, 655, 670, 690, 707, 720, 736, 752, 761, 752, 720, 671, 634, 640, 684, 719, 707, 663, 633, 635, 644, 637, 621, 617, 633, 654, 666, 667, 661, 656, 651, 643, 638, 643, 655, 655, 638, 624, 629, 642, 645, 635, 627, 622, 621, 638, 678, 709, 686, 607, 529, 503, 521, 550, 567, 572, 562, 543, 534, 546, 560, 556, 545, 551, 572, 581, 561, 522, 488, 484, 518, 577, 621, 620, 584, 547, 530, 524, 522, 525, 537, 549, 552, 554, 568, 600, 633, 643, 621, 591, 583, 602, 624, 633, 632, 621, 594, 563, 563, 602, 640, 646, 635, 632, 614, 549, 470, 443, 472, 499, 496, 494, 514, 523, 503, 489, 514, 547, 550, 536, 542, 571, 603, 645, 698, 716, 659, 574, 558, 631, 710, 714, 655, 592, 558, 549, 557, 569, 569, 558, 560, 588, 618, 621, 597, 569, 556, 565, 591, 618, 626, 617, 607, 607, 614, 625, 637, 637, 611, 574, 559, 564, 550, 508, 480, 498, 535, 538, 504, 472, 462, 473, 494, 518, 525, 507, 497, 523, 559, 554, 514, 498, 533, 572, 567, 534, 514, 508, 497, 480, 474, 477, 478, 482, 509, 551, 573, 563, 541, 520, 490, 443, 409, 422, 477, 533, 562, 569, 573, 575, 567, 544, 513, 474, 431, 394, 387, 418, 473, 515, 520, 498, 478, 480, 497, 506, 500, 496, 501, 498, 475, 456, 476, 522, 538, 495, 435, 417, 446, 478, 486]
2508D86jJ2K9K7Rj6l1k1LK2J4qk6l0j4J5L4J4l2n3j8L7N3K6nj1oloj1k0j7PL2L2J7J7K7J6
2503F00j5k6j1j5m8n7pN7N7Jm0l2qkLK5L7J4k1k2J0L1J5j8l6l4k5oK5N1N0J4k5l6j5J0J3p
2498E07k9k4%J6RlLK3K4%k8l4j7JJ4K0J6jk2l5l5j7J8N1N0J4j9j6J1K6K3J0pl4m5k0K6M1J7
2493E34j0j1rk5l8k8qmj6k0j2lRJ9J4pj9jK6K7J0MJ6K2Pj7l2l1j5%KonRJ3lj1KJ1j5m8l5J9
2488C15N4L8Lj0qpjJ2J2j4l6j5L3N8L9J3OPj3m1m1rJ2pk9nM7N2on7l9J0J7o%L2K9k0m5j4J7
2483C83ll1pM0L7j6m8j5L8N3J6k6k6PL1J1k9m0j3Rkj4jK1J7%KJ4J5QJ3K1Kk5k2OJ7mk5j9j
2478C94J6L0L2Pk5l5k2j7k7j7J5L4K4J3J4Lj9j3K7L6j8p6o6rK3J1oj1k0j6K6Q6R3L5k5l4q
2474D55J1J1ol7o3n2mL5L8L2L0J5k8n4l2J0J2k0l8k0NJ4J7K5K2%k3k9k2oK2N4N8K4k3m7m1
$$ y = [486, 485, 497, 526, 553, 562, 546, 515, 494, 497, 519, 533, 525, 499, 469, 455, 470, 504, 518, 486, 433, 415, 452, 505, 531, 526, 515, 509, 506, 500, 489, 469, 452, 459, 491, 523, 540, 557, 584, 600, 585, 559, 548, 533, 485, 428, 421, 478, 535, 536, 496, 464, 456, 454, 457, 482, 519, 533, 512, 490, 500, 531, 546, 528, 492, 458, 433, 427, 452, 503, 553, 567, 542, 506, 491, 501, 514, 507, 478, 454, 454, 470, 479, 476, 479, 502, 526, 526, 498, 464, 447, 448, 462, 482, 498, 497, 475, 440, 405, 388, 406, 457, 507, 521, 502, 486, 497, 523, 546, 556, 549, 515, 470, 450, 476, 517, 534, 524, 513, 504, 479, 441, 413, 405, 401, 385, 365, 353, 350, 359, 378, 392, 385, 366, 365, 391, 418, 428, 432, 448, 470, 477, 460, 428, 397, 382, 382, 384, 378, 373, 382, 395, 392, 381, 383, 394, 379, 331, 296, 315, 369, 407, 410, 400, 392, 385, 384, 396, 408, 394, 358, 343, 376, 434, 473, 486, 492, 499, 486, 445, 404, 395, 407, 400, 371, 366, 413, 465, 459, 402, 363, 373, 390, 384, 384, 416, 445, 425, 380, 366, 383, 380, 349, 342, 382, 419, 403, 355, 340, 378, 431, 447, 421, 395, 402, 433, 444, 415, 375, 362, 371, 369, 355, 354, 375, 392, 392, 394, 408, 423, 431, 444, 465, 467, 442, 420, 426, 443, 439, 414, 395, 394, 410, 440, 472, 479, 454, 419, 397, 380, 353, 336, 351, 385, 409, 422, 436, 439, 420, 407, 434, 470, 452, 376, 310, 301, 324, 335, 329, 318, 298, 282, 308, 394, 487, 522, 497, 463, 455, 466, 477, 471, 434, 371, 319, 315, 350, 388, 420, 450, 465, 437, 383, 351, 361, 373, 353, 315, 295, 300, 314, 331, 356, 378, 378, 355, 326, 304, 298, 320, 374, 432, 456, 433, 386, 345]
2469C45l1l2l2k1%K0L7M2L0Lj2lJ7K2Mj2pOJ0kj1qOJ3J2kk5m8n3k5K1N7N3J0k8l1oMj9m2k8
2464B34J0K9J8%kjjJ4L8L8ll9k8RJ6qk1%J6LrPK8On2q4n9kL6L7K7K7K8J7jlJ6K7Pl1l8nL1
2459C32K5rk4mJ9J6j4l5k5JJ4Lj2pJ5K7K0Kj5k7k5jK7K5j2m2l5nJ6K1K0J9J7K1K6Pl5o2l9
2454B45QL1K4J9J9nm8n5oL9L0j0k5lJ7K2J7Mk1l3lN1O8K7j9k5nlk3l0rJ7K3J5Mrl1m5l0J1
2449B53L9K4rk5j3%nj7j5pLJ3K8L2K4K0K5K6Oj5j6pj8l5j9K0L1Nj3MJ1k5n7k3M3N1j3o3l8
2444B25J8K6j2l2lL0K9Mj0j1j6k5j0K9N5L8ll3m1m5m5j9L2O1L6pj6J1K2mk6j5QOlJ7N2M8j2
2440C59o5m8J5N1K2l0m3j0K3J7j2k7j0J4K1Oj1j3oRK6K4ml8l6J7O9O2Km4k9K0L9Nm2n3k1J4
2435B73J3k2m4k3J2K1Jj0PK1J0pnNNKLJk1l8l1j1oj1OL0K1roL5N1Pl9k0L0M0Mk2nK6M3L2m
$$ y = [345, 314, 282, 250, 229, 229, 249, 286, 328, 358, 361, 349, 346, 363, 385, 389, 377, 370, 376, 386, 384, 373, 365, 371, 384, 396, 394, 369, 321, 268, 243, 264, 321, 374, 384, 356, 325, 319, 323, 304, 262, 234, 244, 273, 291, 291, 289, 288, 287, 301, 339, 377, 374, 335, 307, 316, 332, 324, 303, 303, 319, 322, 313, 320, 348, 354, 302, 218, 159, 157, 193, 230, 257, 284, 312, 329, 328, 325, 341, 368, 375, 344, 306, 301, 332, 357, 348, 324, 320, 339, 355, 341, 306, 281, 282, 296, 299, 287, 280, 295, 322, 342, 344, 329, 302, 277, 276, 303, 328, 316, 274, 239, 234, 250, 271, 291, 310, 327, 348, 374, 381, 346, 284, 245, 253, 284, 308, 327, 346, 341, 293, 238, 232, 271, 301, 291, 266, 263, 280, 302, 319, 323, 302, 269, 266, 317, 385, 412, 393, 368, 363, 360, 337, 307, 298, 315, 338, 353, 357, 348, 317, 272, 242, 253, 292, 316, 307, 282, 269, 269, 264, 247, 232, 225, 228, 241, 269, 301, 325, 345, 370, 396, 402, 387, 371, 364, 346, 311, 292, 312, 343, 348, 335, 339, 350, 325, 268, 245, 288, 339, 326, 263, 225, 243, 269, 257, 225, 222, 252, 281, 285, 275, 264, 248, 223, 213, 242, 297, 335, 332, 299, 258, 213, 168, 149, 181, 242, 278, 271, 255, 266, 288, 284, 258, 243, 251, 257, 254, 271, 323, 371, 359, 294, 246, 261, 312, 334, 304, 261, 251, 274, 291, 279, 252, 242, 256, 277, 283, 272, 259, 253, 262, 288, 312, 308, 270, 234, 251, 320, 382, 384, 340, 311, 331, 370, 375, 333, 280, 259, 273, 286, 264, 220, 197, 209, 230, 231, 221, 228, 249, 259, 252, 247, 252, 257, 259, 262, 263, 242, 204, 173, 162, 156, 145, 151, 181, 202, 193, 187, 222, 273, 280, 241, 221, 251, 291, 295, 273, 268, 294, 337, 369, 365]
2430C65n4p6m5NK1PPK4J7j6l4j5NjlJ6K9QqJ6M6K4l6o5m0%K0L0L6K9RkJol4m6k5NKk6l5rK0
2424A66K2lk7k6kK9L9K6QnpqJJ5K3J0j6k7j5RK3J2j6l6l0kK6L0J5PPjk3m4l3JK0Pj8k1KK6
2419A64K7Rj1j6j1qnjQK0K2J5jj3j6nJ0J8J0koOJ7J5Lrj6k0j8nOPPJ6K0ll4l1LJ4j6l5lL8
2414A70L1oj6OJ2q%L8L8k0o4k9L8M3pk4J6M3Nn7o9k8J7L3J9ql5l6lL6M1Ml5l4%K9K9RllMQ
2409A84J0%k7n2l8J3N5M5Nj6oKklJ0J6OqrnlmkkOL1M9K3l5n5k0J0j7n8l7K7N3J2k7j2K8L8
2404A85J8%pj0kJ1Pk2l8j0L0L4nl8l4j0NJ1J3PnpJ2L2L1Lk3k0LJ2j2m5m9j6Rol6l1PM5N3L4
2399A36J0j6l1k1J3M1M0J3k5n3n5k1K3L1jk6jM6O4M0Rkk%Jlj1j5%J3%k8l5j7noML3L6lm1k5
2393A10J8K9Pmkl3q7r2j0Q2R1K0l1j0L4L6qm9n0j4K6M2K7jrRK0Nj5rJ8K8Kk5k4pmk4m0l0o
$$ y = [365, 311, 235, 190, 195, 216, 223, 230, 254, 271, 255, 221, 206, 211, 210, 207, 223, 252, 260, 252, 268, 314, 338, 302, 237, 197, 197, 217, 247, 283, 312, 321, 319, 320, 314, 280, 234, 209, 214, 216, 190, 155, 146, 166, 188, 185, 158, 132, 130, 159, 198, 224, 232, 227, 220, 212, 213, 228, 251, 261, 245, 218, 203, 212, 235, 247, 231, 195, 165, 163, 189, 219, 234, 241, 248, 247, 224, 180, 147, 148, 168, 175, 157, 136, 138, 164, 191, 200, 189, 173, 162, 154, 149, 148, 156, 176, 198, 213, 212, 199, 183, 178, 188, 206, 216, 214, 208, 214, 231, 246, 249, 240, 224, 204, 186, 181, 187, 194, 201, 217, 237, 234, 200, 169, 172, 186, 170, 135, 132, 170, 201, 195, 179, 185, 197, 189, 189, 227, 265, 245, 181, 152, 190, 233, 226, 202, 218, 261, 266, 209, 140, 112, 129, 162, 181, 173, 138, 102, 99, 135, 176, 180, 145, 111, 111, 140, 169, 178, 175, 172, 176, 184, 194, 194, 167, 115, 77, 90, 145, 190, 195, 179, 173, 175, 173, 170, 180, 196, 202, 194, 185, 180, 177, 173, 171, 169, 175, 206, 255, 278, 243, 188, 168, 178, 161, 103, 66, 93, 146, 158, 131, 119, 147, 185, 203, 203, 196, 186, 184, 195, 202, 180, 142, 132, 162, 196, 191, 153, 119, 109, 114, 125, 138, 145, 140, 133, 145, 177, 208, 211, 188, 168, 171, 183, 171, 126, 77, 61, 70, 64, 28, -3, 4, 49, 102, 136, 146, 130, 99, 78, 91, 132, 172, 185, 160, 107, 52, 31, 54, 85, 84, 58, 57, 103, 167, 207, 216, 214, 212, 212, 213, 210, 199, 184, 184, 197, 197, 169, 134, 117, 112, 106, 110, 143, 179, 176, 135, 110, 128, 157, 164, 160, 158, 125, 38, -54, -64, 18, 109, 129, 98, 88, 122, 158, 150, 101, 51, 37, 63, 105, 132, 131, 122, 131, 151, 156, 141, 132, 150, 178, 180, 155, 131, 124, 120, 96, 56, 26, 20]
2388B0J2K7L8L2%m0n1k5J5L7L9L2K3J5RMkq%J5J6j1m6o0m2oK2K9J6jqjLpk1k6k5k1oK2M8M4
2383A11J8NOlk8l8j5J1Nk1k2QM0M6K8Mj3j6nQJ1MKQJ1Kj3k6k5j3LPjj3j5oPJ5J7J1QK0K9Q
2378A80l4n6k9J4K3LpLPoj3NL0L8K8Rj5l7l9k0qj1j1RK5J2j9l2j5PJ2NJKRJ6J7Lj7k5qK6M6
2373A28L3jj8qLnj9j3Lnl7m3rK3K3QJ6L5L2Pj1j7k5l5k3KRpj9qJ0J6J1J1J7K5K4Qk1m6m2j5
2367A7J3K6L1K8J1j1j8j0KJ0J7J5rl0k5KJ4L%J4Ql2n8k8K5M7K1oqNJ1J5J3Kj3j2JNpj7j5j0
2362D7j8k6lL6O3M1ql9k6RK1Kj7j5%kk0l5k5NM2O0M0pm3m1mK4K5Kj6j8j1jPRLqj5jK4K6kk3
2357F2JM3N1Pm0m2j1J4J5M%NJ6J7ql9m2j8j1l9o1k6L5M6jk9PO5Q2M4%j6oOmk6l6j6J7K4Mj3
2352H1qPJ1OOQMjRK7K6%k8k2KJ0j2k5kK9K7kj0J7K8Jk5j2J5J2j6k3rJQL0N1L1k2n2l8qJ2L4
$$ y = [20, 32, 59, 97, 129, 129, 89, 38, 13, 28, 65, 104, 136, 159, 174, 183, 187, 185, 177, 177, 192, 208, 197, 151, 91, 49, 43, 65, 94, 110, 109, 101, 100, 103, 96, 75, 49, 24, 3, -3, 19, 67, 111, 129, 134, 140, 137, 109, 71, 56, 67, 72, 51, 29, 37, 77, 123, 151, 155, 142, 126, 121, 129, 140, 144, 146, 154, 165, 167, 154, 128, 103, 90, 93, 100, 99, 86, 71, 65, 72, 87, 104, 115, 123, 143, 172, 180, 146, 90, 61, 75, 98, 101, 94, 97, 104, 98, 85, 90, 120, 158, 186, 195, 180, 143, 104, 84, 76, 65, 54, 63, 88, 100, 81, 49, 34, 41, 53, 58, 59, 61, 70, 86, 103, 106, 89, 64, 56, 82, 128, 161, 160, 142, 134, 137, 132, 113, 100, 103, 98, 61, 18, 9, 32, 55, 63, 79, 114, 146, 153, 142, 125, 100, 65, 42, 44, 53, 46, 27, 19, 29, 45, 56, 67, 84, 109, 133, 141, 120, 74, 32, 17, 30, 56, 87, 115, 126, 115, 97, 87, 89, 99, 116, 131, 122, 92, 67, 69, 83, 86, 86, 100, 108, 76, 18, -10, 15, 62, 83, 77, 69, 74, 85, 100, 113, 115, 102, 90, 91, 96, 89, 72, 57, 47, 29, 3, 0, 36, 99, 140, 132, 93, 67, 76, 97, 99, 82, 67, 67, 65, 45, 10, -15, -10, 32, 92, 132, 125, 82, 41, 37, 61, 86, 88, 72, 54, 43, 42, 49, 58, 61, 53, 38, 37, 61, 87, 85, 62, 63, 106, 157, 164, 124, 82, 71, 85, 100, 104, 104, 109, 125, 142, 134, 95, 53, 35, 24, -15, -76, -102, -67, -21, -22, -51, -44, 21, 103, 147, 147, 131, 125, 131, 127, 101, 65, 49, 66, 90, 94, 81, 73, 80, 91, 97, 103, 111, 115, 114, 123, 150, 176, 176, 148, 126, 128, 138, 126, 101, 99, 128, 155, 153, 143, 160, 188, 189, 164, 152, 167, 179, 163, 140, 131, 132, 140, 170, 221, 252, 230, 178, 140, 132, 144, 178]
2346A78M5J1n4q2m4OJ1qLL7M9K0j6l0k0opk6l6j1K7K9j1l9j7K1K8J7J8J4j8n0l1K8O3M4Lk4
2342A22k8k2j4qQM2P0M8k4o3j2O4O6Mk2J9N3K6j7k4j3j8k5j4lj7l1k0JLj0j6j3nJ6M1L3k2
2337A75p2n8mK0Kj3kJ2J0ORjk7m3k7OK4J8nj4JK8K8j2n2m0J1N1N7M4L7K5nk7k7j1oqkQRkj3
2332A10j0LJ9K3J0j6m1m3k8nJ5K4J6nk1j8nmj7j6J0M4M7J7j6k4j4nLJ3J4j4m7m0J7O6N2rm7
2327E8l8j2noLK0K3K2L0L9K2j4l6k5mnk5l3j7jkj2rJ2L7N2N1L8J2j3k4j9oJJNJ1J4Plqppj7
2322A10k8k7j2mrj7j2jmj6j9j7j8k2pJ5J4j9l9j1L1L7J9J5K8K0pj2J6M2K4j1k1rjnj0j2lK1
2317A9O1O4J1n2n5%M1L0mj8j1rj5j0%Llj2k3l3l5j7QJ3MpmJMLkpNK7L2Rk0k5j2j1k5k7j3j
2311a16LJ4K4Ml5l9J6O6N2Jj4QQk8m3j3J7Lk9l3oK9N0N1J8k5l4J8O9N1k3o9n2rJ0JqoJJ6K9
$$ y = [178, 223, 234, 180, 98, 54, 60, 71, 63, 66, 103, 152, 172, 156, 126, 106, 100, 93, 67, 31, 20, 47, 76, 65, 26, 9, 30, 58, 75, 93, 107, 89, 39, 8, 36, 99, 143, 146, 122, 94, 72, 58, 50, 58, 100, 170, 218, 194, 131, 119, 183, 249, 253, 231, 250, 303, 329, 312, 288, 275, 257, 232, 218, 215, 198, 167, 147, 148, 151, 141, 125, 112, 107, 123, 164, 197, 175, 103, 45, 41, 61, 63, 50, 48, 60, 70, 76, 85, 84, 57, 14, -13, -7, 17, 35, 30, 16, 17, 45, 73, 61, 9, -31, -20, 31, 88, 132, 169, 194, 189, 162, 135, 124, 118, 110, 108, 116, 125, 123, 110, 100, 103, 122, 145, 155, 139, 98, 55, 27, 22, 37, 61, 77, 72, 51, 33, 28, 24, 7, -9, 1, 45, 92, 109, 93, 69, 55, 50, 53, 66, 80, 66, 19, -21, -4, 62, 114, 105, 58, 20, 8, 3, -3, 0, 20, 43, 65, 95, 134, 156, 142, 106, 81, 77, 72, 47, 14, -3, -4, -6, -18, -27, -15, 22, 74, 125, 163, 175, 162, 138, 119, 113, 114, 115, 120, 131, 145, 152, 149, 141, 134, 127, 110, 82, 55, 43, 39, 30, 13, 1, 0, -4, -20, -39, -56, -74, -96, -103, -88, -74, -93, -132, -143, -112, -75, -56, -41, -13, 7, 0, -12, 4, 46, 70, 59, 38, 29, 28, 23, 13, 1, -2, 19, 80, 144, 155, 103, 48, 48, 89, 119, 115, 97, 86, 77, 62, 52, 52, 55, 52, 40, 17, -16, -51, -68, -60, -47, -43, -50, -54, -53, -49, -46, -48, -55, -50, -23, 9, 18, -2, -27, -39, -50, -75, -102, -115, -116, -113, -99, -75, -71, -106, -145, -129, -63, -11, -10, -24, -16, -8, -36, -79, -92, -75, -72, -101, -134, -140, -111, -61, -10, 8, -17, -51, -33, 36, 87, 64, -5, -57, -66, -56, -55, -63, -69, -68, -52, -23]
2306b3K5Oj1rjmj4j2KJ2Poj0jQMj3k4j5Jjj9k7k0k0l1k6J6O5P4L8jj3rj3k1j6%Mrk6k6%K9
2301a30L9K7Pmnj0k4l2k1JRmk0j7%J3MrpJ5L5L2J0JK0L4Rm5p1l6K4M9L1J1J8L0K5J0Lql6o4
2296h6o0k1J8K9J8Pkj3k5k7oK6M1K9Jj1j0j6l6m2j0K8L2Pj0rj4l3l0ML5L2J5J8K9J2k5l8j2
2291a55J3Lk2k5lJ3J9K4K8J3j2j6QJ4j8m6k4J9J7k8m4kL8K2j7k1KMj5j8KJ8J6J0jj7k1LL3
2286a86K5jjK6L3Lk3k2l0n0l4L1Q6P0J4j2LJ7Oj3k9m0l4j1QRJ4L0K7j2m3j7L5M0om0l3j5j5
2282a90j4KJ7J5M%KJ2L1M7K5k6o1n3k6j2j1nQK0K2J1nrJ1M0M7L1J7Qj3m4n3k9mj1l2l4oK5
2277b43L6K9J8K0L0K5Kk0k0pmoLJ2lk0mL7M2%l6k3Lkl2l7j2J2J3%lJ1L1L6Rk7m3l3k4k1nK8
2272b28M5L9L7M8L2j7n4l8j0j4k5mK9J6k4k8PK2pl6k2OJ8K0L3M2K8Lj5k7l5k4J3M1L3%j2O
$$ y = [-23, 2, 8, -3, -12, -13, -17, -31, -43, -41, -29, -22, -28, -38, -39, -31, -27, -40, -64, -79, -78, -79, -98, -125, -145, -165, -196, -222, -206, -141, -67, -29, -30, -43, -52, -65, -86, -102, -102, -98, -107, -133, -159, -159, -130, -91, -64, -57, -61, -66, -76, -100, -132, -153, -152, -143, -147, -167, -184, -184, -171, -167, -176, -183, -168, -133, -101, -91, -90, -70, -36, -27, -72, -143, -179, -155, -106, -75, -64, -46, -16, 9, 19, 22, 14, -22, -86, -146, -167, -149, -120, -102, -95, -97, -110, -135, -162, -168, -142, -101, -72, -71, -82, -92, -108, -144, -186, -196, -168, -136, -129, -139, -148, -162, -195, -225, -221, -186, -154, -139, -121, -92, -80, -105, -143, -155, -142, -139, -161, -186, -189, -176, -157, -133, -105, -92, -104, -120, -112, -98, -116, -162, -186, -167, -150, -178, -222, -224, -186, -164, -181, -202, -200, -196, -211, -229, -227, -209, -193, -183, -184, -201, -222, -219, -186, -161, -162, -163, -137, -104, -101, -124, -146, -176, -226, -260, -229, -143, -73, -59, -71, -68, -51, -45, -58, -87, -127, -161, -172, -164, -155, -141, -111, -84, -96, -139, -156, -121, -81, -87, -127, -160, -175, -190, -204, -202, -185, -170, -166, -166, -164, -152, -121, -74, -49, -75, -136, -189, -215, -227, -238, -243, -235, -215, -193, -182, -187, -196, -185, -145, -98, -67, -50, -42, -55, -99, -152, -181, -185, -196, -228, -262, -268, -243, -207, -178, -160, -140, -110, -85, -83, -103, -123, -130, -134, -140, -137, -125, -128, -148, -152, -115, -73, -73, -109, -132, -129, -131, -163, -200, -212, -200, -187, -187, -190, -179, -148, -112, -103, -130, -173, -206, -230, -251, -256, -228, -183, -144, -107, -59, -27, -44, -98, -136, -146, -160, -185, -189, -160, -144, -168, -196, -189, -167, -174, -210, -232, -226, -208, -188, -155, -113, -85, -82, -97, -124, -159, -183, -170, -129, -96, -96, -108, -102]
2267a02K3Qk8m2j5K3K8ol8l8j8rr%J6K0QjLOJoqorj2k0k5k5j7j2nJ3L5L0pk8OO1P0K9mpj2
2262a29l4l6%K9J2k7l7j5MPKj0k1j5J2K6Qj5j0J0Mk6l3lL1L6J2j4k7k8j4J3L9M6K7lj5ML4
2257a56L9Nl6m9l0nQQJj1k0j8kJ5K0RnLL4N2J8m7p6l2M6Q5N0k8q5q0k0M0M9J1k3k2qlJ6O4
2252a83R2N1l4p9n5j4Jmlnj3rJ2J8rk6%M4M9J8qj3j7k0jL4L1k0o2m0J2K7lk3nJ5Pp%J7J7J
2247b07j0j3j5j6nJ1K0K1J6Pj1k2j5j3l5n9m5JK3Kj7QM4L9kl1k7j6j7j3QK5K0RJ6L8M1J3j7
2242b44j7J1K2ol9l3NK8J6jjMqj7mJ5Ll1m3k2OJ2J3K5L6K5NLK4L6J7j6l0j7jMMPMj3l1l4k4
2237c07oJ1J7%l3m0%N6P2M1Lk1m1n1k4K5M1Rj7rLj5k6ML7K5JJ6M1J8l0k8K4M4nm4rO2Q7M8
2232b1kk2j0Llk9m4k4NMj9j9J0J9j3l8k2jj9n2m5lK6K0M%JNK2L8L0ll3l3j4nj5k5k2rrk2k5
$$ y = [-102, -79, -71, -99, -141, -156, -133, -105, -111, -149, -187, -205, -214, -223, -223, -207, -187, -179, -180, -177, -171, -170, -176, -184, -190, -199, -211, -231, -256, -281, -298, -310, -315, -302, -267, -237, -244, -272, -266, -205, -135, -106, -110, -117, -129, -163, -199, -199, -170, -158, -185, -222, -237, -233, -226, -224, -234, -255, -270, -258, -232, -224, -239, -249, -239, -235, -261, -294, -297, -266, -230, -218, -232, -259, -287, -301, -288, -249, -203, -176, -179, -194, -190, -156, -117, -112, -148, -197, -227, -232, -224, -216, -215, -226, -246, -264, -266, -251, -231, -222, -227, -224, -190, -138, -120, -167, -243, -275, -229, -144, -94, -122, -207, -287, -307, -267, -218, -207, -230, -252, -260, -263, -247, -183, -91, -40, -74, -153, -208, -222, -221, -225, -228, -233, -246, -255, -243, -225, -234, -260, -260, -216, -167, -149, -157, -170, -187, -207, -208, -174, -143, -163, -225, -265, -253, -226, -229, -252, -257, -242, -235, -242, -242, -225, -208, -207, -217, -230, -245, -261, -266, -255, -235, -214, -198, -191, -202, -224, -239, -252, -287, -346, -391, -390, -367, -365, -382, -374, -330, -291, -293, -324, -351, -367, -384, -397, -389, -364, -344, -335, -319, -281, -240, -227, -244, -261, -250, -228, -234, -273, -306, -301, -273, -257, -258, -259, -255, -263, -280, -284, -269, -266, -297, -340, -362, -356, -344, -331, -306, -270, -245, -240, -237, -213, -177, -160, -176, -206, -223, -224, -220, -216, -209, -205, -218, -249, -283, -307, -313, -302, -285, -285, -318, -358, -358, -302, -230, -189, -186, -207, -248, -299, -323, -298, -257, -248, -265, -274, -271, -286, -312, -308, -271, -246, -245, -229, -188, -170, -200, -228, -204, -160, -165, -209, -218, -156, -69, -21, -23, -45, -55, -52, -55, -84, -128, -152, -147, -143, -162, -181, -171, -152, -165, -203, -225, -226, -245, -297, -342, -345, -319, -299, -295, -295, -294, -289, -267, -229, -199, -202, -235, -268, -282, -287, -302, -327, -349, -358, -367, -389, -414]
2227d14LM3N4L0Lpj7l2l2pK0J7j2l8m2k6%K3L4L9M7M7K1k1l9k1Jok7k5mJ1Jj5j4J3M7N2J3
2222b80l2l5lJ5mk0j1nk6m4k6J6M3N4N2K1l5o7m1Jkl0k6RL0K7L9N6M2LoK2L0j3n0l6QK9K1
2217b74Mj5l5l7j9j%%J6K3RnJ4M1L6kl4l4k0j1j2k1k5j1J5K2Mj8j1RJ4LRL4M3Pm9o3j4N2P0
2212b86K7k6m2l0k3k6j1K3M2K7OJ3L7M0Pl4m4j9RJ4lj1KJ0mk0j8nklJ4L0J5j2j0L0N8M5J3
2207a67j4m4p2p0l0RK3K8M2L8km6m4oK3K0ml0l8j4K4K8j0l3kM4M1ol3j1K5L7J9j5l9l1jJ6
2203c45lj9mJ4jk5j3J6J1j6j8PJ6JNL2K9j5m0j4J6J5J0L0L7Kl6k0J1kn1o4k0K8L4J5joMK9
2198c51N1M3Ll2l2j0Jrl0m0k3J1L7L2RpqKJ0J1ml3m3j4L5N4K6j6l6l5k8j7RL8N4N3M0J9j3
2193b43m4n7m2j3J1J7RlpkLlj5j3MJ5Oj1j0J1K5J8MMJ7K2J2j1k9l8l0j5oJJ4K1Qk2k8JK9J3
$$ y = [-414, -411, -368, -314, -284, -281, -288, -305, -337, -369, -376, -356, -339, -351, -389, -431, -457, -457, -434, -400, -361, -314, -267, -246, -267, -306, -327, -326, -332, -359, -384, -388, -377, -376, -391, -405, -392, -345, -293, -280, -312, -347, -350, -335, -339, -359, -370, -375, -401, -445, -471, -455, -412, -358, -306, -285, -320, -387, -428, -427, -429, -459, -485, -476, -446, -419, -380, -324, -282, -279, -285, -263, -233, -246, -296, -332, -324, -295, -274, -270, -285, -320, -357, -376, -377, -377, -377, -361, -338, -329, -334, -320, -279, -243, -245, -279, -313, -333, -344, -356, -377, -402, -413, -398, -376, -372, -390, -401, -392, -378, -375, -366, -332, -289, -282, -331, -394, -408, -356, -286, -259, -285, -327, -357, -380, -406, -417, -394, -352, -325, -319, -306, -269, -229, -222, -256, -300, -319, -310, -296, -299, -310, -308, -298, -302, -322, -340, -345, -347, -350, -336, -306, -291, -303, -313, -283, -225, -180, -167, -181, -225, -297, -367, -397, -388, -365, -337, -295, -257, -259, -305, -349, -355, -332, -312, -316, -346, -384, -398, -374, -346, -356, -389, -391, -347, -306, -312, -345, -356, -331, -294, -275, -290, -329, -360, -361, -345, -348, -367, -371, -357, -358, -383, -396, -380, -369, -385, -403, -396, -380, -379, -374, -342, -313, -328, -368, -382, -366, -351, -341, -311, -274, -272, -308, -328, -317, -319, -370, -434, -454, -426, -392, -377, -378, -384, -380, -351, -300, -257, -254, -286, -318, -328, -327, -336, -366, -406, -429, -418, -381, -349, -340, -347, -355, -353, -343, -332, -336, -369, -412, -426, -391, -337, -311, -327, -363, -398, -426, -443, -434, -396, -342, -289, -249, -230, -243, -287, -344, -386, -399, -388, -371, -362, -365, -372, -374, -371, -374, -389, -402, -398, -383, -377, -388, -398, -387, -362, -344, -340, -336, -319, -297, -285, -296, -325, -363, -393, -408, -414, -413, -399, -378, -370, -392, -420, -419, -390, -377]
2188c77j6jM2M5j1n6l2J9K2k2m2j0K7J7k3l7pK5K1oj6JJ6Mj9k4lJ7K5K2J4Nlnklk%%JJ0L1
2183c53L1j0n9o5k5J3J7Kj3k1j6J2L9K8j0k2J2L4Rk0JM3M2kk4lJ9Kk8l3j1Ojk5l9k5jNqj3
2178e12J1L2K1nj0NJ1QOOnpJ4L6K5j0k8j9j5k1j1J8L9L6K9J5k0n5m5NL5J0k4k8j3nJ0L0K0
2173d11k2l7J0N9L9j8k7J9M5J4k2k4j0j5k3j7lNNKllJ1K8K0ok4l1m9o1k9M1P2L3k2k8%OqK
2168d82L5M5J8j1j6j3j1PL8L4j6n2k2L7M1j5n7l6J1K5Oj6k3j7KL0M2J4l4m7j0L5M3J8LJ6L2
2164c46J8j9m4l6nJ2jj7qK1K6j3n5n2pL1L3J2pk6m9n9l1J6M2L2QKPLj2j8j0lklPK1K4Qj5j7
2159e32J2M6M1qm7k9K1L9J5kJ2L0J6qj0j2l8o1l2K9N4K4kOJ9Jk2j6%j3m3m0KL6L5J5%rj9k3
2154e13j7j1j1j3pOJ7K3K4J8Lj3j5KJ6J1rj1J1K8K0%kJj9n2n1j1J5JqK1M7J6m8o1qM3M2J9
$$ y = [-377, -393, -394, -352, -307, -318, -374, -406, -387, -365, -387, -429, -439, -412, -395, -418, -455, -462, -437, -416, -422, -438, -437, -421, -417, -436, -460, -463, -446, -421, -399, -385, -380, -383, -388, -390, -393, -395, -395, -395, -394, -384, -353, -322, -332, -391, -456, -481, -468, -451, -449, -462, -483, -499, -487, -448, -420, -430, -452, -440, -406, -397, -417, -416, -373, -331, -333, -357, -360, -341, -339, -367, -400, -411, -405, -406, -431, -470, -495, -496, -491, -499, -512, -501, -469, -448, -453, -463, -458, -447, -439, -433, -427, -432, -439, -425, -389, -364, -374, -402, -421, -436, -457, -468, -450, -411, -375, -346, -331, -351, -406, -451, -446, -411, -401, -425, -453, -466, -471, -461, -431, -411, -433, -470, -460, -401, -362, -380, -407, -388, -343, -329, -351, -375, -385, -400, -423, -440, -443, -438, -433, -431, -434, -437, -426, -398, -378, -384, -408, -439, -488, -549, -578, -537, -465, -432, -454, -482, -482, -476, -484, -482, -447, -402, -384, -395, -411, -424, -435, -428, -390, -356, -372, -424, -446, -409, -368, -383, -440, -476, -465, -440, -434, -450, -473, -490, -488, -458, -416, -402, -436, -483, -493, -458, -415, -397, -394, -378, -346, -328, -347, -391, -427, -432, -420, -421, -438, -446, -425, -399, -412, -467, -519, -526, -495, -462, -450, -457, -483, -532, -591, -622, -606, -564, -532, -524, -522, -515, -512, -524, -542, -552, -555, -557, -560, -553, -532, -508, -500, -515, -532, -520, -474, -433, -441, -488, -517, -496, -457, -442, -444, -432, -402, -386, -394, -404, -416, -454, -515, -547, -518, -464, -440, -442, -436, -417, -416, -438, -454, -454, -467, -510, -550, -548, -512, -477, -462, -462, -471, -490, -513, -530, -541, -552, -565, -572, -566, -549, -526, -502, -484, -481, -494, -509, -507, -491, -480, -489, -500, -489, -461, -441, -441, -443, -442, -461, -513, -564, -575, -560, -559, -567, -546, -499, -483, -531, -592, -600, -557, -515, -496]
2149d96J8K9J2l5o7n4mM8O8M6Nk3j8%Oqk3k3pJ2K2K5K4J7pm3o4n1j8OJ4K7M4M4J7pKK6K6j4
2144d24n5m8J0O6O8K5j0p%j8m1k5J8L0Kj8KK3lm9n1JN6O4K5k0l8j5K6M5K2j7l2j8lmj3j0P
2139d29K6L2K0j0l2k6NK9K7Lk1k7j4J2L1L3J6kj1j0kKj1m2o6n3nM0N1K9%j1%K4L1J0k6m4l2
2134d53j2j2j9mK7L6Ll5l2KJ7jj6ML3K6j5l5j4J7K0Mpj1j9j5RL0J8j3j1L0O1M1Jj6j3j9l1
2130d24j6J5K3%k1j1J0J1pk6l1k1PL9N2L6J2lj4k8k6LL0K1j0k4j1nj0JK3J5k1k8K2P2N6Nq
2125b92J5J4k2l8oL0K4ok1j8j6j4jJ1Lj9l5k9j2LMmmK2N8N3Rk7j1J6J0j6j2J8K1k3o1m9%L9
2120c86M6K3rk9k3JRj0l5l4%M4P8Q3O2L4K3K5K7K1K6M0M6K3rj4J6N6P9P3M3J5NK3N5Q7J04
2115F18R8O5L3L5Q0J40J87K16K29K23K13K19K42K53K29J95J89K19K39K18J68J32J28J31J11
$$ y = [-496, -478, -449, -437, -472, -539, -593, -597, -549, -481, -435, -430, -453, -471, -471, -465, -473, -496, -519, -526, -514, -492, -467, -443, -426, -433, -476, -540, -591, -609, -603, -589, -562, -518, -474, -457, -464, -462, -436, -410, -424, -479, -527, -517, -451, -383, -358, -368, -375, -375, -393, -434, -459, -441, -411, -409, -427, -425, -402, -405, -454, -505, -504, -448, -384, -359, -379, -417, -432, -406, -361, -339, -356, -388, -406, -409, -413, -426, -436, -429, -403, -371, -351, -361, -393, -419, -414, -385, -358, -355, -376, -403, -417, -405, -374, -341, -325, -327, -338, -348, -350, -348, -359, -401, -467, -520, -525, -485, -434, -405, -405, -416, -416, -392, -361, -351, -377, -421, -453, -465, -477, -496, -500, -473, -437, -434, -469, -501, -499, -482, -483, -499, -495, -462, -436, -451, -486, -500, -483, -463, -459, -466, -477, -496, -511, -502, -472, -454, -467, -478, -448, -387, -346, -345, -361, -374, -393, -424, -440, -425, -402, -402, -423, -434, -424, -413, -420, -446, -477, -498, -491, -452, -400, -364, -352, -355, -369, -397, -423, -420, -390, -369, -379, -403, -414, -419, -429, -428, -405, -390, -411, -439, -417, -345, -289, -284, -292, -277, -263, -285, -323, -329, -299, -275, -281, -302, -320, -336, -350, -351, -340, -337, -356, -391, -420, -432, -429, -425, -429, -433, -411, -353, -300, -291, -318, -329, -313, -303, -319, -331, -313, -292, -315, -376, -425, -425, -386, -340, -317, -326, -355, -378, -377, -368, -378, -413, -447, -447, -403, -325, -242, -180, -146, -123, -98, -71, -50, -24, 16, 62, 85, 76, 62, 78, 134, 213, 286, 329, 344, 349, 372, 427, 514, 618, 716, 781, 814, 849, 929, 1069, 1256, 1472, 1701, 1924, 2137, 2356, 2598, 2851, 3080, 3275, 3464, 3683, 3922, 4140, 4308, 4440, 4568, 4699, 4810]
2112D810N9Lm0q1j36j88k10k12k29k66k94k86k68k69k83k67k04j31r0r5j15j19j06r7j04j09
2109F73r7p8o2m8k5rk2m8m9k6j8m3o3n1j8OK0K2j1o6q6l6L6M9Rk5k0ppmRRj3l5l7k6j2J1M3
2104a55N8M3J9QLj4l2l6l0l2l7l1j0J1J6Rj%J0J6J6J5J3ml3n1l6nJ9K6L6M0K6PJ1K5J1k9m0
2100a38MM7L8kj9lJ2J7K9L9K9LoJ5L9M6K9Lk0j7J5M8N1L3K3L0L3K7K3K6J8K%J4K6K7L0L6J9
2095F26k0n0m0j8j4j8NL6K8k6o6m7KJ7j2l6k0Mpm1n8m2k3k4k6j4kj4k8j7J2K0OJK5M4L1On
2090A95MJ2K1L6M1K3j4l5k4MK5L3L6L8M0L8K4kk0j1K3M9L3k0n7m1J3M8L4O%J1Oj3j4J0K5P
2085E84j9k7j1QK7L9L2QroPOKRK0K8L3M3L4Kj8J2O2O6J8k2j3J1J0j%Kj4j8J7O6P0K8oML0L8
2080A152K5J1ORJ0J0J0K6N7P8N4%l2j6K2L6L1L3M4L8J0nJ5M2L2pl2j3L2O7P4N9K3j4k7kL8
$$ y = [4810, 4869, 4872, 4832, 4751, 4615, 4427, 4217, 4005, 3776, 3510, 3216, 2930, 2662, 2393, 2110, 1843, 1639, 1508, 1418, 1323, 1208, 1089, 983, 886, 782, 673, 576, 498, 436, 388, 363, 354, 332, 284, 235, 209, 191, 148, 85, 34, 16, 22, 42, 64, 53, -13, -99, -135, -99, -50, -41, -66, -86, -93, -100, -104, -95, -86, -99, -134, -171, -197, -209, -198, -155, -97, -54, -35, -27, -24, -38, -70, -106, -136, -168, -205, -236, -246, -235, -219, -210, -211, -211, -201, -185, -169, -154, -141, -145, -178, -229, -265, -270, -251, -225, -189, -149, -123, -116, -105, -80, -69, -98, -138, -134, -87, -49, -51, -70, -73, -61, -44, -15, 24, 53, 56, 50, 65, 104, 150, 179, 182, 162, 145, 160, 208, 259, 292, 315, 345, 378, 405, 428, 454, 472, 474, 474, 488, 514, 541, 571, 607, 626, 606, 556, 516, 498, 484, 466, 471, 507, 535, 509, 443, 396, 398, 415, 403, 367, 347, 351, 344, 303, 245, 203, 180, 156, 130, 116, 114, 100, 72, 55, 67, 87, 93, 94, 119, 163, 194, 200, 195, 199, 211, 232, 268, 309, 332, 318, 283, 259, 263, 288, 321, 357, 395, 435, 473, 497, 495, 475, 464, 487, 536, 569, 549, 492, 451, 464, 512, 546, 552, 552, 563, 569, 556, 542, 552, 577, 584, 565, 538, 527, 535, 562, 601, 633, 641, 632, 626, 633, 639, 641, 650, 670, 698, 731, 774, 808, 810, 792, 804, 866, 932, 950, 928, 915, 926, 936, 935, 935, 937, 923, 905, 922, 988, 1058, 1086, 1080, 1084, 1114, 1152, 1177, 1188, 1194, 1203, 1213, 1223, 1233, 1259, 1316, 1394, 1448, 1448, 1416, 1400, 1422, 1458, 1489, 1522, 1566, 1604, 1614, 1609, 1624, 1666, 1698, 1691, 1659, 1646, 1678, 1745, 1819, 1878, 1901, 1887, 1860, 1858, 1896]
2076A896N8N5N3O6O9L5j6m7m2k3j0%K0N2P9Q2N9L3K7L8M4L6K7L1L9L4K7L7O1P4N6K7Lrj0N
2071B966L8O5O9N2M3M6M5L6L1L3L5L2L9O0P2M9Mk1qJ4K0K4M7P9Q6N8K7K1L4M0L1K3L7P2J04
2067D403J03O3J6NL5P6R0P5N1L3K1K5M3O1N6L3J7K8M9N7M6L4L8N9P7O9L2nj7LL7P2R5R1O9
2063F040N7P7J08J16J08J05J14J09Q8P6Q0P9O4O7J06J43J45J22J06J00R0Q5J02J23J19J03
2060H632J15J47J54J25J04J22J49J52J43J48J65J70J57J41J43J77K29K59K30J68J47J97K61
2057A2435K69K30K10K30K59K66K57K53K61K67K54K20J91K08K76L41L56L37L37L67L91L99M14
2054A9028M42M51M31M15M31M48M43M40M68N11N23N00M73M63M69M89N13N26N14M97N09N35N41
2051C0060N26N26N63O10O43O66O98P38P83Q40R06R64J009J076J185J306J389J446J536J682
$$ y = [1896, 1954, 2009, 2062, 2128, 2197, 2232, 2216, 2169, 2127, 2104, 2094, 2094, 2114, 2166, 2245, 2327, 2386, 2419, 2446, 2484, 2528, 2564, 2591, 2622, 2661, 2695, 2722, 2759, 2820, 2894, 2950, 2977, 2980, 2971, 2961, 2966, 3004, 3069, 3138, 3190, 3233, 3279, 3324, 3360, 3391, 3424, 3459, 3491, 3530, 3590, 3662, 3711, 3715, 3694, 3686, 3700, 3720, 3744, 3791, 3870, 3956, 4014, 4041, 4062, 4096, 4136, 4167, 4190, 4227, 4299, 4403, 4506, 4569, 4585, 4590, 4625, 4701, 4791, 4866, 4917, 4950, 4971, 4996, 5039, 5100, 5156, 5189, 5206, 5234, 5283, 5340, 5386, 5420, 5458, 5517, 5594, 5663, 5695, 5690, 5673, 5676, 5713, 5785, 5880, 5971, 6040, 6097, 6174, 6282, 6398, 6506, 6611, 6725, 6834, 6922, 6998, 7078, 7157, 7221, 7288, 7394, 7537, 7682, 7804, 7910, 8010, 8100, 8185, 8287, 8410, 8529, 8632, 8747, 8894, 9048, 9173, 9277, 9399, 9548, 9700, 9843, 9991, 10156, 10326, 10483, 10624, 10767, 10944, 11173, 11432, 11662, 11830, 11977, 12174, 12435, 12704, 12934, 13144, 13374, 13633, 13899, 14156, 14409, 14670, 14937, 15191, 15411, 15602, 15810, 16086, 16427, 16783, 17120, 17457, 17824, 18215, 18614, 19028, 19470, 19921, 20352, 20767, 21198, 21646, 22089, 22529, 22997, 23508, 24031, 24531, 25004, 25467, 25936, 26425, 26938, 27464, 27978, 28475, 28984, 29519, 30060, 30586, 31112, 31675, 32285, 32928, 33594, 34292, 35030, 35813, 36653, 37559, 38523, 39532, 40608, 41793, 43099, 44488, 45934, 47470, 49152]
2049D9152J848J987K111K265K464K687K913L152L427L745M094M457M842N273N760O304O901
2047A13382P584Q406R399J0564J1922J3544J5519J7900K0687K3883K7487L1429L5530L9546
2045C86782M3233M6377M8769N0229N0652N0023M8391M5886M2736L9224L5558L1764K7720K3279
2043I70623J8330J2760O403q74r053j7877k6902l5587m3399m9888n4730n7729n8828n8119
2041E95130n5843n2364m8102m3464l8788l4322l0221k6571k3396k0685j8392j6455j4799j3353
2040A58375j2075j0953r964r054q184p361o618n958n352m793m314l922l572l233k931k712
2038E7379k542k346k114j914j804j747j677j583j505j454j396j309j210j135j093j072j052
2036C0426j032j000r52q83q10p48p00o58o15n81n49n08m47l91l66l69l65l46l28l14k83k34
$$ y = [49152, 51000, 52987, 55098, 57363, 59827, 62514, 65427, 68579, 72006, 75751, 79845, 84302, 89144, 94417, 100177, 106481, 113382, 120966, 129372, 138771, 149335, 161257, 174801, 190320, 208220, 228907, 252790, 280277, 311706, 347236, 386782, 430015, 476392, 525161, 575390, 626042, 676065, 724456, 770342, 813078, 852302, 887860, 919624, 947344, 970623, 988953, 1001713, 1008116, 1007242, 998189, 980312, 953410, 917823, 874424, 824536, 769806, 712077, 653249, 595130, 539287, 486923, 438821, 395357, 356569, 322247, 292026, 265455, 242059, 221374, 202982, 186527, 171728, 158375, 146300, 135347, 125383, 116329, 108145, 100784, 94166, 88208, 82856, 78063, 73749, 69827, 66255, 63022, 60091, 57379, 54837, 52491, 50377, 48463, 46659, 44912, 43235, 41652, 40147, 38693, 37297, 35988, 34778, 33643, 32550, 31478, 30426, 29394, 28394, 27442, 26559, 25749, 25001, 24301, 23643, 23028, 22447, 21898, 21390, 20943, 20552, 20186, 19817, 19452, 19106, 18778, 18464, 18181, 17947]
2033A7947k04k07k09j83j52j55j75j54q6k9k9p2j09j07p7m4m1o6q9q1n0l0j8RM8P2O8O3P5
2030A5915R5J06J08J12J15J22J44J83K22K61L14L76M17M24M38M89N75O72P74Q83R95J128J331
2027B6199J623J958K271K559K863L181L481L745L980M157M212M143M006L846L640L356L027
2025H2247K700K361J961J485R70M31j57q18j530k252k958l626m203m621m844m909m871m748
2022E2618m521m197l825l449l072k695k356k092j882j680j483j331j237j149j030r07q22p69
2020A4121p14o37n64n14m78m36l80l28l02k96k82k52k20k13k14j95j55j27j31j45j50j49j39
2017G100j11p7o8j00j35j39j16j00r8r3q0o1l9k3l3p0r4p0k7k6p2j13r8m1MNl1o4p1o2n1m7
2013D899k9mJk6n5o0n1m4l1JK7J5k5m4l6l1l6k9mJ2Ork8n9p6m1K9N8J1n7p8n5l7l2k5j3j2
$$ y = [17947, 17743, 17536, 17327, 17144, 16992, 16837, 16662, 16508, 16422, 16393, 16364, 16292, 16183, 16076, 15999, 15955, 15914, 15848, 15759, 15678, 15628, 15598, 15580, 15589, 15637, 15709, 15777, 15840, 15915, 16010, 16116, 16224, 16336, 16451, 16573, 16717, 16900, 17122, 17383, 17697, 18073, 18490, 18914, 19352, 19841, 20416, 21088, 21862, 22745, 23740, 24868, 26199, 27822, 29780, 32051, 34610, 37473, 40654, 44135, 47880, 51860, 56017, 60229, 64372, 68378, 72224, 75864, 79220, 82247, 84947, 87308, 89269, 90754, 91724, 92155, 91998, 91180, 89650, 87398, 84440, 80814, 76611, 71990, 67146, 62237, 57366, 52618, 48097, 43900, 40075, 36626, 33554, 30859, 28503, 26411, 24529, 22849, 21366, 20035, 18798, 17649, 16619, 15712, 14890, 14121, 13407, 12770, 12206, 11692, 11214, 10778, 10398, 10070, 9768, 9472, 9190, 8938, 8718, 8505, 8291, 8096, 7941, 7814, 7683, 7538, 7388, 7239, 7100, 6989, 6912, 6844, 6744, 6609, 6470, 6354, 6254, 6156, 6063, 5983, 5922, 5883, 5860, 5827, 5757, 5663, 5593, 5566, 5540, 5468, 5355, 5257, 5216, 5220, 5225, 5194, 5130, 5059, 4997, 4946, 4899, 4870, 4866, 4867, 4841, 4786, 4726, 4675, 4631, 4600, 4601, 4628, 4643, 4618, 4574, 4538, 4507, 4471, 4442, 4438, 4450, 4456, 4447, 4419, 4360, 4284, 4243, 4272, 4330, 4341, 4284, 4206, 4151, 4114, 4082, 4057, 4044, 4032]
2009D032j0KKl0o7o8l3rj2k0k4l7n8n3k4j4l8n4k6J0Qk0k1J0K3rm2l9k4l0l6oM4N1mn2l4K2
2004C310M5K4LJ6L4K5mk6l4k8PO5J03P9J3l4k4J3M2N0M5K3j3m0k9LJ1k6o9p4m7l5m5m3j6o
2000C318m5r2q1j3L6J6l6o3n0k6j1j1k5l6k4LJ1j5l8k5Jml4m3k0Kjj6k3l3m2l6j0J2J0qk2
1995B526k8k7j4PJ9J4PLj8o0q7o7k1nl0n4l5J2M1L1mk5j4J1J6j5n9p3m6mJ6Jk3l0j0J3J7N
1991A990j2j8j8j7j2onj1j1MK3K7J7QJ3K7M1N2N3L9K1J4K1K7K2J1J5L8O2O3K6k8o2n0j0J4
1986B368QnLJ6Ml6o6n9k9poj1j1nnj4k2j9lRkk9n2n3m1k9k2j8k1k4j4J5L5K3j1l0k9j8mOk
1981A790l4o3m5LK5PpJ0K7Rj5j3kj0k3mK8K2k0l3QN0M1pl4k3J1L9N3M9K7%j2mJ6K1NpJ9O8
1976A972Q4M7J0K0M8M0OJ1N3P1M4L2O7J00R6J01J59K18K17J82J88K33K42J99J67J92K41K60
$$ y = [4032, 4022, 4024, 4026, 3996, 3929, 3861, 3828, 3819, 3807, 3787, 3763, 3726, 3668, 3615, 3591, 3577, 3539, 3485, 3459, 3469, 3477, 3457, 3436, 3446, 3469, 3460, 3418, 3379, 3355, 3325, 3289, 3283, 3327, 3378, 3374, 3322, 3288, 3310, 3355, 3379, 3382, 3398, 3432, 3457, 3453, 3427, 3393, 3365, 3372, 3437, 3540, 3619, 3632, 3598, 3574, 3587, 3629, 3679, 3724, 3747, 3734, 3694, 3665, 3668, 3679, 3653, 3584, 3510, 3463, 3428, 3383, 3340, 3324, 3318, 3273, 3181, 3100, 3087, 3123, 3139, 3103, 3040, 2990, 2964, 2953, 2942, 2917, 2881, 2857, 2860, 2871, 2856, 2818, 2793, 2794, 2790, 2756, 2713, 2693, 2695, 2694, 2678, 2655, 2622, 2580, 2544, 2534, 2546, 2556, 2548, 2526, 2498, 2471, 2457, 2464, 2483, 2497, 2504, 2507, 2489, 2429, 2342, 2275, 2254, 2249, 2219, 2165, 2130, 2142, 2183, 2214, 2210, 2185, 2171, 2182, 2198, 2183, 2124, 2051, 2005, 2001, 2017, 2018, 1995, 1965, 1955, 1968, 1985, 1990, 1978, 1960, 1942, 1925, 1913, 1907, 1902, 1891, 1880, 1884, 1907, 1934, 1951, 1959, 1972, 1999, 2040, 2092, 2145, 2184, 2205, 2219, 2240, 2267, 2289, 2300, 2315, 2353, 2415, 2478, 2504, 2476, 2414, 2364, 2354, 2368, 2376, 2371, 2374, 2390, 2394, 2358, 2292, 2233, 2204, 2197, 2191, 2180, 2169, 2164, 2159, 2145, 2123, 2104, 2101, 2110, 2108, 2079, 2027, 1974, 1933, 1904, 1882, 1864, 1843, 1819, 1805, 1820, 1855, 1878, 1867, 1837, 1808, 1790, 1786, 1792, 1790, 1756, 1693, 1648, 1651, 1676, 1683, 1676, 1686, 1713, 1722, 1707, 1694, 1692, 1682, 1659, 1655, 1683, 1705, 1685, 1652, 1660, 1710, 1751, 1744, 1710, 1687, 1698, 1737, 1790, 1839, 1866, 1866, 1854, 1850, 1866, 1887, 1892, 1885, 1904, 1972, 2056, 2103, 2113, 2133, 2181, 2221, 2227, 2238, 2291, 2362, 2406, 2438, 2505, 2605, 2701, 2802, 2961, 3179, 3396, 3578, 3766, 3999, 4241, 4440, 4607, 4799, 5040, 5300]
1973E300K36J94J60J45J41J26Q5M2K3Rm6j33j91j92j84k12k66l03l03k84k70k66k63k37j91
1970C120j52j48j59j44j07r4j22j50j37r2m7k4l0o5r2o7LN0K9k0l7k3j6k0qJ1J3ok0j7j7k5
1966A387k8k1j5j1KQnk1j0K0K6kk0nJ1jk2k2j0j9l0j1K2J6l5o6l0K7K9k7p2n7nL1L6K2jk9
1961A062m5l5lJ9J5%j4k6l2k1kjk1l1rK4M2M6N1L7j3o4n8pK0nl7k9l%j0LL5M3J6j1qPJ7K2
1957I74K8L6L2K1Qnj6j3JJ3J7K0K8L1J8mj1mJ0K0K6K6J5J2L3P1Q4N0j0m5l7j1%loOK0K5J7
1952A477Oj0k4l6l8k1OK9L9L7L3K6J1j6l6k9mJ4J6J5K3K5J0qjK2L3K8K8L3J2m0p6o8m8n4o2
1947A352k8J9J6m0p4m4LJ4LQJ8%m9q3p9m4mK7L6L2K9K4km8p3n0oQrk5l4m5l8PO0O5K0j9k2
1942I25k3m5m7nM0L2j7m3k9nkj3j7rLRJk3m0k9kJ0mk8l1j2QMk4m7l3J6O5P8N0Nk2pK2K2j4
$$ y = [5300, 5536, 5730, 5890, 6035, 6176, 6302, 6387, 6429, 6452, 6461, 6415, 6282, 6091, 5899, 5715, 5503, 5237, 4934, 4631, 4347, 4077, 3811, 3548, 3311, 3120, 2968, 2820, 2661, 2517, 2410, 2316, 2194, 2044, 1907, 1815, 1768, 1744, 1714, 1649, 1557, 1490, 1493, 1543, 1572, 1552, 1515, 1492, 1476, 1456, 1448, 1459, 1472, 1466, 1446, 1429, 1412, 1387, 1359, 1338, 1323, 1312, 1314, 1322, 1317, 1296, 1286, 1306, 1332, 1330, 1310, 1305, 1316, 1315, 1293, 1271, 1261, 1242, 1212, 1201, 1223, 1239, 1204, 1138, 1108, 1135, 1164, 1137, 1065, 1008, 1003, 1034, 1070, 1092, 1091, 1062, 1017, 982, 979, 998, 1013, 1013, 999, 973, 941, 920, 918, 917, 896, 865, 856, 880, 922, 968, 1019, 1056, 1043, 979, 921, 914, 934, 929, 892, 863, 860, 860, 850, 853, 888, 931, 947, 936, 928, 935, 952, 974, 1002, 1038, 1070, 1091, 1099, 1094, 1078, 1065, 1066, 1079, 1096, 1116, 1144, 1175, 1193, 1189, 1178, 1174, 1184, 1204, 1230, 1256, 1271, 1283, 1316, 1387, 1471, 1521, 1511, 1466, 1429, 1418, 1418, 1415, 1409, 1415, 1435, 1460, 1477, 1483, 1473, 1449, 1413, 1375, 1354, 1360, 1389, 1428, 1465, 1498, 1524, 1535, 1519, 1483, 1454, 1450, 1464, 1480, 1495, 1518, 1543, 1553, 1545, 1544, 1566, 1599, 1627, 1655, 1688, 1700, 1660, 1584, 1516, 1468, 1414, 1352, 1324, 1343, 1359, 1319, 1245, 1201, 1204, 1218, 1221, 1229, 1247, 1247, 1198, 1115, 1036, 992, 988, 1015, 1051, 1083, 1112, 1136, 1134, 1086, 1013, 963, 957, 965, 956, 931, 897, 852, 814, 821, 881, 946, 966, 947, 925, 902, 857, 810, 805, 845, 877, 860, 817, 788, 783, 781, 768, 751, 742, 745, 754, 755, 732, 692, 663, 661, 671, 667, 639, 608, 596, 604, 608, 584, 537, 504, 520, 585, 663, 713, 718, 696, 689, 711, 733, 719]
1937G19l8qM0M7J3j5k0l1m7l1J9M2Rk7k0Jj3l8k5J6L5K0J0J1Pprj0k5l3pL2L6RmPOj1nJ9J8
1932F92j8l9j4J7J3qj2moj7k2j5J2N1O6K2m9p1k4K5J9j0pJ5J0k1l5k1pqj6j7mK6N7N5J1l0
1928F16k5J0K5RkOJ5J3RJ5K6M1M8L0pl1k4rj3k3qJ7K2%k1k6j6LL1M1J2l3n0k8LK2K3J0j2j9
1923G00nMj7n0m8j8jj4k4j2NJ2J6J7PmLK5L0RqnKknJJ2J4J0kj3oK4M5L1LPL2K6j5k5J9O1N2
1918H93J4oj1j8j5J2K4ml4j6L6O0M6K5J8RjOJ6%m3o6m0JJ0j9m1k4K2M8K5k1l2JL1J9opJ3J9
1913I44PkjjMK0L5K7Pmqk5m4l5nQoj5l%k5n3m9j9Lmk7m6m8l3j1KKj2k3k1mJ2Nj2j3NJ5lk1
1907E23j4PQrj9k3l5m1j7K4L7J2j4j8j2rLJ8J3orJ4K0pl8l7j7JJ7K3nn2n5OO7O5K4PJ1qm2
1902D13l6K1N9L5k2n0l9pK2K5pm4l7RL6J5j5j0J3J8J0J8K9J3k0k3RL2J7j5k7j9j1j2k0k4j7
$$ y = [719, 681, 673, 713, 760, 773, 758, 738, 707, 660, 629, 648, 690, 699, 672, 652, 653, 640, 602, 577, 593, 628, 648, 658, 669, 676, 669, 660, 650, 625, 592, 585, 617, 653, 662, 658, 665, 671, 660, 655, 674, 692, 674, 635, 621, 638, 651, 643, 631, 627, 621, 604, 582, 567, 579, 630, 696, 718, 669, 598, 574, 599, 618, 608, 601, 616, 626, 605, 570, 549, 542, 534, 518, 501, 497, 523, 580, 635, 646, 616, 591, 601, 626, 635, 633, 639, 654, 667, 676, 691, 717, 758, 806, 836, 829, 798, 774, 765, 752, 729, 721, 738, 760, 760, 739, 713, 697, 700, 731, 772, 784, 751, 701, 673, 676, 698, 721, 731, 719, 700, 695, 699, 682, 632, 584, 566, 565, 551, 527, 515, 520, 532, 548, 565, 572, 568, 571, 596, 626, 635, 627, 622, 624, 622, 617, 618, 630, 644, 654, 652, 639, 633, 657, 702, 733, 736, 743, 775, 801, 786, 761, 780, 841, 893, 907, 901, 890, 872, 857, 869, 893, 889, 855, 839, 875, 935, 981, 1006, 1024, 1033, 1032, 1038, 1054, 1054, 1011, 945, 905, 906, 916, 897, 856, 832, 854, 902, 927, 906, 874, 875, 906, 925, 919, 912, 925, 944, 951, 949, 948, 947, 951, 971, 1006, 1033, 1040, 1036, 1028, 1003, 959, 924, 919, 927, 921, 906, 903, 903, 878, 825, 776, 757, 760, 756, 729, 683, 635, 602, 591, 593, 595, 583, 560, 539, 535, 547, 552, 540, 527, 532, 547, 544, 523, 509, 516, 524, 515, 496, 473, 438, 397, 380, 404, 441, 453, 439, 421, 409, 400, 403, 421, 434, 428, 419, 433, 453, 446, 408, 371, 354, 355, 372, 395, 390, 338, 283, 289, 356, 421, 445, 452, 463, 455, 413, 377, 398, 457, 492, 470, 420, 381, 374, 396, 421, 414, 370, 333, 342, 378, 393, 378, 368, 381, 399, 409, 427, 456, 469, 449, 426, 435, 467, 484, 469, 442, 423, 412, 400, 380, 356, 339]
1898C39kJ4K0K2L1M3K6j7m8l1J4L4J2k6m4l4rJ3J9Jk3k4jJ7J2J0K9M5K3k7n4l8pMrk4l1j9
1893B60J0L6L6J1nLJ6J0oj2j1k4m3l5%L5M2K8J1ql3n2m5j5J6K5RqpJ0J3mj1J5M8K9m4r5n9
1888A46L4Q7O2Qj8j3j3k6k9j5mmkJ3K2J0j9l9l1jL3L9J4j5j6J0K8J9Jkj1l6m9j2M4N1km7k6
1883A91K9M9K2pr%mj5j7qMJ2J2Opj4rLQnk2j0L4O8M8j1m5k8knj2J0M2L7Mj1MPj4k8rK0K2M
1878C44jJ3L6M9L7%k9j5L2O4N1K2J3J2kqJ4M3L5lj7%J0jNM8P8M4j9m2j3J2%j9j1Lj6n5o5l1
1873F18Ljk7l8k0nj0k1k0j4k3l7l1KK7K1lj5j3j3k7l7l2k1j1KJ3Rj2k3j3qk8m5j1N3P9L1l4
1868B65m7j4J0Kj1kJ2Rj2k8k0NJ6%k8l0jK2Qj8j4J7K8Oj8j9qQL1N3M1jl1k1j1l1n3k8L4O6
1863A87M8J7J0J2LpNK8L4K3J4K2K6Qk0k9j1J7K9K4Rnk2k5lK3J7k3m6k5Nj0m6m6kK3om5l7N
$$ y = [339, 337, 351, 371, 393, 424, 467, 493, 476, 428, 397, 411, 445, 457, 431, 387, 353, 344, 357, 376, 377, 354, 330, 329, 346, 358, 368, 397, 442, 465, 438, 384, 346, 339, 343, 334, 310, 279, 260, 270, 306, 342, 353, 348, 351, 367, 377, 371, 359, 348, 324, 281, 246, 246, 281, 323, 351, 362, 354, 321, 269, 224, 209, 225, 250, 259, 251, 244, 254, 267, 263, 252, 267, 315, 344, 300, 205, 146, 180, 267, 329, 337, 319, 306, 293, 267, 238, 223, 219, 215, 213, 226, 248, 258, 239, 200, 169, 168, 201, 240, 254, 239, 223, 233, 261, 280, 281, 279, 268, 232, 183, 171, 215, 266, 264, 217, 191, 220, 269, 291, 284, 275, 275, 271, 256, 239, 231, 235, 247, 259, 265, 258, 244, 235, 238, 246, 241, 219, 209, 243, 311, 359, 348, 303, 275, 273, 268, 256, 266, 308, 345, 349, 338, 342, 349, 335, 307, 298, 318, 340, 344, 343, 356, 392, 441, 478, 478, 449, 434, 466, 530, 581, 603, 616, 628, 626, 618, 632, 675, 710, 707, 690, 690, 700, 699, 704, 752, 830, 874, 855, 813, 800, 812, 812, 793, 782, 785, 769, 714, 649, 618, 621, 620, 593, 555, 535, 530, 520, 499, 479, 465, 442, 405, 374, 376, 403, 424, 421, 406, 393, 380, 353, 316, 284, 263, 252, 254, 267, 276, 264, 241, 228, 220, 192, 147, 136, 189, 268, 299, 265, 218, 204, 214, 216, 205, 203, 215, 224, 212, 184, 164, 169, 185, 185, 157, 127, 126, 148, 156, 138, 124, 141, 169, 175, 157, 138, 130, 138, 169, 222, 263, 262, 231, 210, 199, 168, 115, 87, 121, 187, 235, 252, 262, 274, 277, 270, 275, 303, 337, 360, 374, 396, 422, 430, 410, 381, 370, 387, 416, 440, 449, 444, 422, 397, 394, 417, 434, 411, 365, 340, 345, 335, 289, 243, 241, 264, 258, 213, 176, 181]
1859A81L0K4Qkj7l0j7J7L0Kl1k6LJ2jlK6N5M9J2l0n1m3j3J5J9MkJ3K5J2mQL5M3K7K2L9N5M7
1854E43K9J9J4Komqk6l9l0pKjnj5m2o3m6mJ7%k4l2l1k8j7JNj4l1k1JQnk0k1j1oonQL3M3K0
1848A77j9k8LL3K5klJ9K9Ok0k0kNj1k8k4OL4L8J5j5k8k3oPOkLK6M8M3J9LJ3L9N6N8L8nn4o0
1843C99j6K8J7l6o5n0k5j5rONj9l6j5J0Mk4l6k2j5j5oJ0kl3l1J6M1Jm8k6L6N0om1oM2K7j9
1838G6k0K5M3J0l0m3m5m3k2K2L8Km1k5L6P6O1J4k2l8l0JL8M8K2j5l6m0l2j1J3K4Qj5j1J5K7
1834H0Ll5m8k8JJ7J8J7J4J3J4J5Nj6k8j7PJ4KmMJ0kj8k1j5j7k6k4mJ9K6Rj5k2oJ6J0j9l7j9
1829a07J9L4J4j9k8lL4M6K1rnK4M0J1l2m3j6J8L5L9L5L3L0K3Kk6m4l5j3MJ6K1J2nnK5N0L8
1824B34kk3j7oj0k2l0l5k8lJ2lk1qK3J6k7m2LM5K9k4m8k7KJ2PKJ6N8R3O9on3k4K8K6k0m2k4
$$ y = [181, 211, 235, 243, 241, 224, 194, 177, 194, 224, 226, 195, 169, 172, 184, 183, 180, 206, 261, 310, 322, 292, 241, 198, 185, 200, 219, 223, 221, 234, 259, 271, 267, 275, 310, 353, 380, 402, 441, 496, 543, 572, 591, 605, 607, 601, 597, 589, 563, 524, 494, 487, 489, 488, 483, 468, 426, 363, 317, 313, 330, 330, 306, 274, 243, 215, 198, 199, 204, 190, 159, 138, 139, 147, 142, 122, 101, 90, 84, 78, 73, 81, 114, 157, 177, 158, 130, 133, 166, 191, 189, 186, 205, 234, 240, 220, 200, 198, 203, 192, 164, 140, 146, 180, 218, 233, 218, 190, 167, 161, 168, 174, 172, 175, 201, 249, 292, 311, 314, 327, 366, 422, 480, 518, 513, 459, 399, 383, 411, 428, 392, 327, 277, 252, 237, 228, 234, 239, 220, 184, 169, 179, 183, 159, 123, 101, 86, 71, 65, 75, 73, 40, 9, 25, 66, 67, 19, -7, 29, 79, 73, 32, 26, 68, 95, 76, 56, 81, 124, 134, 104, 61, 16, -27, -49, -27, 11, 13, -28, -53, -17, 59, 120, 134, 112, 74, 44, 45, 83, 131, 153, 138, 102, 62, 30, 19, 32, 56, 64, 49, 38, 53, 80, 83, 48, 0, -28, -27, -10, 8, 25, 39, 52, 66, 81, 86, 70, 42, 25, 32, 46, 48, 44, 48, 58, 56, 38, 17, 2, -15, -41, -65, -69, -50, -24, -15, -30, -52, -58, -42, -32, -51, -88, -107, -88, -54, -40, -59, -87, -90, -56, -10, 11, 2, -3, 21, 61, 72, 40, -3, -19, -1, 34, 73, 108, 141, 171, 194, 196, 170, 126, 91, 78, 82, 98, 119, 131, 126, 121, 146, 196, 234, 232, 209, 192, 186, 176, 154, 124, 89, 61, 58, 70, 67, 46, 38, 61, 77, 50, 8, 11, 56, 85, 61, 13, -14, -12, 0, 7, 9, 25, 83, 176, 245, 239, 186, 162, 190, 216, 196, 154, 130]
1819A30j2k2j0L5O7M6Lj6pOJ7K6K7J8J1Nj6n2o2j1O1Q7N4K6N0R8J00M9OJ5M4L2k4n1j0N4P1
1815H45L0j1j3kpk5l2k3k1l6n8p2o8n7m9l9j0L7O7M9nm2m3j9JJ1Prj7jL0M4L7M2O9Q0M9J2
1810G51J1M4P4Q5Q5P9P4Q3J11J30J22J15J34J44J04M7L4O1P1M4L1M9N4J2l4m9o4j10j62j72
1806A958j56j58j77j79j54j17o9j9Lk3n3l4QPl9o1l4j3l2m9k1K0K7J7L2P1R3P9N4M1M7O9Q3
1802A221P4O1Q3J37J63J29Q9R7J25J14Q0P7J04R4L6kJ0K2om2m6m9r8j64j89j65j38j34j34
1799A549j25j17j12r7p4n6m6l5l0m2n9o3n0m1k5J1M5M3Qj4mJ0PKJ2J7KmK1M6L3LJ4O7J01P5
1795A072L0J4K0J0j3j6J1L2L3L4M8N4K0l4o3n5l8m0n5p1p6o0l1j9m1p2o3k2pl3l9OM8J9m5
1790E58n9j3K1QrJOrkM3P5M7KmJ5J0%K7P1O2Nk3NL0K1K3N8O2no7l2N4O8nn7k5K7K0k5m1j9
$$ y = [130, 118, 96, 86, 121, 188, 234, 237, 221, 214, 220, 237, 263, 290, 308, 319, 324, 308, 256, 194, 183, 244, 331, 385, 411, 461, 559, 659, 708, 714, 729, 773, 805, 781, 730, 720, 774, 845, 875, 864, 851, 849, 842, 817, 785, 762, 741, 705, 647, 575, 507, 450, 401, 362, 352, 389, 456, 505, 500, 458, 415, 396, 397, 408, 415, 406, 389, 388, 418, 462, 499, 541, 610, 690, 739, 751, 762, 806, 880, 965, 1050, 1129, 1203, 1286, 1397, 1527, 1649, 1764, 1898, 2042, 2146, 2193, 2227, 2288, 2359, 2403, 2434, 2483, 2537, 2549, 2515, 2466, 2402, 2292, 2130, 1958, 1802, 1644, 1467, 1288, 1134, 1017, 948, 929, 932, 909, 856, 822, 830, 837, 798, 737, 703, 690, 658, 609, 588, 608, 635, 652, 684, 755, 848, 927, 981, 1022, 1069, 1138, 1221, 1295, 1356, 1439, 1576, 1739, 1868, 1957, 2054, 2179, 2293, 2373, 2450, 2554, 2648, 2684, 2682, 2692, 2714, 2708, 2666, 2620, 2571, 2473, 2309, 2120, 1955, 1817, 1683, 1549, 1424, 1307, 1195, 1098, 1024, 968, 922, 887, 857, 815, 756, 693, 643, 602, 577, 588, 633, 676, 684, 670, 666, 676, 683, 685, 697, 714, 716, 712, 733, 779, 812, 815, 829, 896, 997, 1072, 1102, 1116, 1136, 1146, 1133, 1117, 1128, 1160, 1193, 1227, 1275, 1329, 1349, 1315, 1252, 1197, 1159, 1119, 1064, 993, 917, 857, 826, 807, 766, 694, 631, 609, 602, 569, 530, 536, 584, 603, 558, 499, 486, 507, 515, 506, 507, 513, 504, 502, 545, 620, 667, 669, 665, 680, 690, 690, 717, 788, 850, 855, 832, 837, 867, 888, 911, 969, 1031, 1026, 959, 927, 981, 1049, 1044, 987, 962, 989, 1009, 984, 943, 924]
1785I24LRJ4J0j5m9n7l7j9k3l0k6j8j8j9j6lJ4L1L3J3j1j2RK7K4J1JJJ4K9K6lk2kL5L6MoK6
1780I08N3L5LOL0L4J3NJ1Mj7k1jJ2KrnOJ2J7K5K0ml1l7k0QK3J0k0l1qJ7J1lJ0L4K6njL3M0
1775A195%k2J6O2N9K3RJ7K3K6L8L3pm5k6L7Q3Q3O4M5K0oj2lKJ1L5N3K9k0l6kM0N3M2K3lj5
1771A924ML0J9k2l2JK3%k4qK0K0NJ4L2L0J9K5L5K2OK6O6O8K4j6j1J8M1M9M0K0JJ1L9M8K1m
1766B584QM3O2M7K4J9L4M8M3K4J6L3N7O1L9J8J7L7N5N7M1K1J4K3L4L5L9N5O3M2jk2nL2N7N5
1762C809K9NQL6N9M9K2J6L6N1M5L6M0M4L3J7J9M6P5Q2O0L2L1O5R9R0N1L7P2J08R5N6M2N7O0
1757E512L7K7N8R7R8N4QOM9J01J22R6N5L9O1Q1P4N3N7Q7J05R0O8P6J08J28J14R0R0J15J33
1753G889J28J11J11J28J37J23J00R6J12J15R4P4Q4J16J33J30J30J49J59J40J10J00J15J33
$$ y = [924, 927, 936, 950, 960, 945, 896, 839, 802, 783, 760, 730, 704, 686, 668, 649, 633, 630, 644, 675, 708, 721, 710, 698, 707, 734, 758, 769, 770, 771, 785, 814, 840, 837, 815, 813, 848, 884, 888, 882, 908, 961, 996, 999, 1005, 1035, 1069, 1082, 1087, 1098, 1102, 1085, 1064, 1063, 1075, 1077, 1068, 1063, 1069, 1081, 1098, 1123, 1143, 1139, 1108, 1071, 1051, 1059, 1082, 1092, 1072, 1041, 1033, 1050, 1061, 1058, 1068, 1102, 1128, 1123, 1122, 1155, 1195, 1195, 1173, 1189, 1251, 1310, 1333, 1342, 1359, 1382, 1408, 1446, 1479, 1472, 1427, 1401, 1438, 1521, 1604, 1668, 1713, 1733, 1727, 1715, 1712, 1714, 1725, 1760, 1813, 1842, 1822, 1786, 1784, 1824, 1877, 1919, 1942, 1939, 1924, 1928, 1958, 1977, 1955, 1923, 1924, 1947, 1947, 1923, 1915, 1935, 1955, 1960, 1974, 2006, 2036, 2055, 2080, 2115, 2137, 2143, 2169, 2235, 2303, 2327, 2311, 2300, 2318, 2359, 2408, 2448, 2468, 2469, 2480, 2519, 2567, 2588, 2584, 2592, 2635, 2697, 2744, 2768, 2787, 2821, 2869, 2912, 2936, 2952, 2985, 3042, 3103, 3142, 3160, 3177, 3214, 3269, 3326, 3367, 3388, 3402, 3425, 3459, 3494, 3533, 3588, 3651, 3693, 3692, 3670, 3665, 3697, 3754, 3809, 3838, 3843, 3851, 3887, 3946, 3995, 4017, 4033, 4069, 4120, 4165, 4201, 4241, 4285, 4318, 4335, 4354, 4400, 4475, 4557, 4617, 4649, 4680, 4745, 4844, 4934, 4985, 5022, 5094, 5202, 5297, 5353, 5395, 5452, 5512, 5549, 5576, 5634, 5731, 5829, 5883, 5891, 5897, 5946, 6047, 6169, 6265, 6320, 6359, 6420, 6501, 6575, 6628, 6685, 6772, 6877, 6967, 7035, 7111, 7219, 7347, 7461, 7551, 7641, 7756, 7889, 8017, 8128, 8239, 8367, 8504, 8627, 8727, 8823, 8935, 9050, 9144, 9218, 9302, 9418, 9551, 9681, 9811, 9960, 10119, 10259, 10369, 10469, 10584, 10717]
1751A0717J50J60J57J32J14J26J52J56J44J59K03K26K04J77J98K56K89K73K40K33K58K91L17
1748A5332L36L51L60L72L97M40M86N12N18N34N85O45O77O84P20Q02Q90R45R94J090J222J345
1745C0237J455J601J821K106K444K858L377L984M646N352O122O948P734Q267Q314P791O862
1743A11919N834M954M290L801L454L222L088L031L003K799K066N18j763m310o561q146q975
1741A22224r125q760q060p177o202n210m287l494k826k232j696j234q57n49k85l7K29N50R11
1739F1883J266J598J939K331K777L262L810M480N324O344P531Q909J0547J2497J4753J7279
1737A66530K0019K2771K4985K5837K4760K2004J8575J5524J3290J1700J0467R501Q886Q684
1735D03533Q786Q670P291L491l100j1461j9598k5718k9103l0078k9369k7589k5132k2295j9358
$$ y = [10717, 10867, 11027, 11184, 11316, 11430, 11556, 11708, 11864, 12008, 12167, 12370, 12596, 12800, 12977, 13175, 13431, 13720, 13993, 14233, 14466, 14724, 15015, 15332, 15668, 16019, 16379, 16751, 17148, 17588, 18074, 18586, 19104, 19638, 20223, 20868, 21545, 22229, 22949, 23751, 24641, 25586, 26580, 27670, 28892, 30237, 31692, 33293, 35114, 37220, 39664, 42522, 45899, 49883, 54529, 59881, 66003, 72951, 80685, 88952, 97266, 105057, 111919, 117753, 122707, 126997, 130798, 134252, 137474, 140562, 143593, 146596, 149395, 151461, 151979, 150216, 145906, 139345, 131199, 122224, 113099, 104339, 96279, 89102, 82900, 77690, 73403, 69909, 67083, 64851, 63155, 61921, 61064, 60515, 60230, 60193, 60422, 60972, 61883, 63149, 64747, 66686, 69017, 71794, 75056, 78866, 83346, 88670, 95014, 102545, 111454, 122001, 134498, 149251, 166530, 186549, 209320, 234305, 260142, 284902, 306906, 325481, 341005, 354295, 365995, 376462, 385963, 394849, 403533, 412319, 420989, 428280, 431771, 428671, 417210, 397612, 371894, 342791, 312713, 283344, 255755, 230623, 208328, 188970]
1733A88970j6562j4073j1979j0280q887p678o571n582m752m051l386k697k014j374p65j46
1731H8173M85J113J762K467L240M088N083O315P809R532J1476J3672J6147J8881K1742K4318
1729B36303K5851K5596K3455K0216J7012J4553J2887J1718J0797J0035R491R257R114Q201
1727D44486N233n73q666j7252k4342k8774l0528l0295k8888k6889k4607k2194j9757j7414
1726A69540j5288j3458j1918j0570r316q159p154o307n541m806m123l511k943k393j902j499
1724F0652j117o84k20K15O47J155J739K338K971L741M668N657O626P543Q263Q491Q077P236
1722A27998O373N721N269M950M726M525M251L911L573L142K254N70j883m657p133q849r667
1719A45074r770r510r179q890q614q296p891p378o774o148n559n011m472l939l437k996k621
$$ y = [188970, 172408, 158335, 146356, 136076, 127189, 119511, 112940, 107358, 102606, 98555, 95169, 92472, 90458, 89084, 88319, 88173, 88658, 89771, 91533, 94000, 97240, 101328, 106411, 112726, 120535, 130067, 141543, 155215, 171362, 190243, 211985, 236303, 262154, 287750, 311205, 331421, 348433, 362986, 375873, 387591, 398388, 408423, 417914, 427171, 436285, 444486, 449719, 449146, 440480, 423228, 398886, 370112, 339584, 309289, 280401, 253512, 228905, 206711, 186954, 169540, 154252, 140794, 128876, 118306, 108990, 100831, 93677, 87370, 81829, 77023, 72900, 69389, 66446, 64053, 62151, 60652, 59535, 58851, 58631, 58846, 59493, 60648, 62387, 64725, 67696, 71437, 76105, 81762, 88388, 95931, 104194, 112685, 120762, 127998, 134371, 140092, 145361, 150311, 155037, 159562, 163813, 167724, 171297, 174439, 176693, 177263, 175380, 170723, 163590, 154741, 145074, 135304, 125794, 116615, 107725, 99111, 90815, 82924, 75546, 68772, 62624, 57065, 52054, 47582, 43643, 40206, 37210, 34589]
1717C4589k308k041j802j592j426j289j147r90q47p61p11o56n75m88m22l80l47l04k44j72
1715A6087j02k9N3J34J98K58L41M34M98N15N00M56L71K62J92J76J65J18P0O8Q8P8L2n6k28
1712B0679n05p95r77j032j040j043j004r10q03p09o06m95m22m06l94l37k63k25k16k00j74
1709H123j63j61j43j14r9r8q4m6j6j3j8NN7J00J08J07J33J81J97J66J37J44J56J22O4L6M3
1706H924M8M4N5P9P5L2j6o8j54k63l27l24l10l24l24k73k21k27k64k59k02j39r6p0o9r6j04
1703E127o2mRk5n5n6n6n5l4mPLK4O6Q5P1P0J11J55J62J40J32J54J99K39K44J98J44J28J47
1699G264J50J21R8R6R0O4M1L2%p6j65k25k66l07l39l40l21k99k63k04j48j35j50j46j10p5
1696D387p0q7j01r9q0n0l1l5m8m7k8kJ9K7J4rj9lJ9K3J9L0M8M6L1L8P0Q8O2K5J8L9N0M0L3
$$ y = [34589, 32281, 30240, 28438, 26846, 25420, 24131, 22984, 21994, 21147, 20386, 19675, 19019, 18444, 17956, 17534, 17154, 16807, 16503, 16259, 16087, 15985, 15956, 16009, 16143, 16341, 16599, 16940, 17374, 17872, 18387, 18887, 19343, 19714, 19976, 20168, 20344, 20509, 20627, 20697, 20765, 20853, 20931, 20963, 20907, 20679, 20174, 19379, 18402, 17370, 16330, 15287, 14283, 13373, 12570, 11861, 11255, 10760, 10338, 9932, 9538, 9201, 8938, 8713, 8497, 8297, 8123, 7960, 7799, 7656, 7542, 7443, 7345, 7261, 7215, 7199, 7186, 7168, 7173, 7230, 7330, 7438, 7545, 7678, 7859, 8056, 8222, 8359, 8503, 8659, 8781, 8845, 8881, 8924, 8972, 9016, 9071, 9150, 9225, 9257, 9241, 9173, 9019, 8756, 8429, 8105, 7795, 7471, 7147, 6874, 6653, 6426, 6162, 5903, 5701, 5562, 5466, 5396, 5327, 5231, 5127, 5065, 5061, 5070, 5045, 4990, 4934, 4878, 4823, 4789, 4785, 4792, 4795, 4819, 4885, 4970, 5041, 5111, 5222, 5377, 5539, 5679, 5811, 5965, 6164, 6403, 6647, 6845, 6989, 7117, 7264, 7414, 7535, 7633, 7729, 7819, 7883, 7924, 7956, 7956, 7880, 7715, 7490, 7224, 6917, 6578, 6238, 5917, 5618, 5355, 5151, 5003, 4868, 4718, 4572, 4462, 4387, 4317, 4230, 4129, 4030, 3950, 3900, 3869, 3834, 3786, 3739, 3711, 3709, 3728, 3755, 3769, 3760, 3741, 3738, 3757, 3780, 3799, 3829, 3877, 3923, 3954, 3992, 4062, 4150, 4212, 4237, 4255, 4294, 4344, 4384, 4417]
1692D417L5L3K0J4K8L9J5m1r7j31j41j38j33j31j33j20q2n0n3q0q2m6j7k9n1m2kK3J5nk1l2
1688B982l2j8llj1roj8l6m5m7n6o1l8kJ5Qjj1l7o0m6kK8K6K0J2j7n6o6n0m7o0m6oNk4k6K1
1683B177M7Nm7m2j2j1j7J5M7K4k5k8PJ1j6j7QMl4m1MM0L5J6Qj3m7m6jL7K5nj9j8k1j6LRj6
1678B030m5o0p4q1n9lL2J7j6k8k2j4lJ1Lk5k5J9M9J3m8o5l2nKJ4M0M4J4k3l5j8J1K4J0j1L
1674A644M8O6J8n3p2k9J8K7Mj7k3j2ORqk5k2o%jJKlnNJ9K2J7J8J9K2M0O5N9J2k0QN0M5J4K5
1669A987P3Q7M6ONK1K8L7M8K9j7l8j9nk9n9m9j5qk7m8n7o0n1l3k5l9n2m2k6k3k1JK7L1K0J2
1664A715J1jqJ6N5O7M0J1J3L4N6Q1J16J39J27R3P3Q0J01J17J35J59J76J61J26J12J35J46R5
1661D181Mn7n8m5n7p7p3n8n3n5m9o2j15j78j95j65j43j55j65j41r8o7m8l0k7n4q4p8l6oj4
$$ y = [4417, 4452, 4485, 4505, 4519, 4547, 4586, 4601, 4560, 4463, 4332, 4191, 4053, 3920, 3789, 3656, 3536, 3454, 3404, 3351, 3271, 3189, 3143, 3126, 3097, 3046, 3004, 3002, 3025, 3040, 3035, 3014, 2982, 2950, 2932, 2929, 2926, 2915, 2906, 2900, 2882, 2846, 2801, 2754, 2698, 2637, 2599, 2597, 2612, 2620, 2619, 2608, 2571, 2511, 2465, 2463, 2491, 2517, 2537, 2549, 2532, 2476, 2410, 2360, 2313, 2253, 2207, 2201, 2206, 2182, 2156, 2177, 2224, 2229, 2182, 2140, 2128, 2117, 2100, 2115, 2162, 2186, 2161, 2133, 2140, 2151, 2135, 2118, 2126, 2130, 2096, 2055, 2059, 2099, 2134, 2150, 2158, 2145, 2098, 2052, 2051, 2088, 2113, 2108, 2089, 2071, 2050, 2034, 2037, 2046, 2030, 1985, 1925, 1851, 1770, 1711, 1708, 1740, 1757, 1741, 1713, 1691, 1677, 1674, 1685, 1688, 1663, 1638, 1657, 1706, 1719, 1671, 1606, 1574, 1569, 1571, 1585, 1625, 1669, 1683, 1660, 1625, 1607, 1618, 1642, 1652, 1641, 1644, 1692, 1758, 1776, 1723, 1651, 1622, 1640, 1667, 1671, 1654, 1631, 1619, 1625, 1634, 1626, 1601, 1579, 1573, 1573, 1572, 1573, 1575, 1572, 1567, 1572, 1591, 1613, 1630, 1648, 1667, 1689, 1729, 1794, 1853, 1865, 1845, 1853, 1903, 1948, 1962, 1987, 2060, 2147, 2193, 2199, 2204, 2225, 2253, 2290, 2338, 2367, 2350, 2312, 2293, 2288, 2259, 2200, 2151, 2136, 2128, 2101, 2053, 1996, 1936, 1885, 1852, 1827, 1788, 1736, 1694, 1668, 1645, 1624, 1625, 1652, 1683, 1703, 1715, 1726, 1725, 1717, 1733, 1788, 1855, 1895, 1906, 1919, 1953, 2009, 2090, 2206, 2345, 2472, 2565, 2638, 2718, 2819, 2936, 3071, 3230, 3406, 3567, 3693, 3805, 3940, 4086, 4181, 4185, 4128, 4070, 4025, 3968, 3891, 3818, 3760, 3707, 3652, 3603, 3541, 3426, 3248, 3053, 2888, 2745, 2590, 2425, 2284, 2186, 2119, 2071, 2041, 2014, 1960, 1876, 1798, 1762, 1756, 1742]
1657A742l5k5J6N1M3J4J3N7J14J35J16Q8P5P3P4P8R6J19J36J45J42J34J25J26J30J17P8K7
1653D004nj3j9l7n5m9k1ql6r7j50j65j55j44j50j57j54j48j45j46j35j10q9q6r8r9p2k6J0
1650A445J8Kk2l7k9PM4M3pn7n1jM2M4L0K8M0M7M4M2M1L6K5K0K6L4M0M3M0K6Lj7j0J8L8K8p
1645B056l5m1m6o2p0m6nJ0j7n3o5n4n3o3o4m3j2%j8n6q9r0n4j4mk7n1m7j9RK6L3K7Kl5n3k8
1641H49J4L3J4nJ1M4N1K0qML9N6M4K7K1K0J5J6K3K0pm4m9j3K8J8m0q8p3k8j7o0r0n1J5K6k4
1636H11n9k6L2M8J6j6k0j5k1l0k5mJ8L6M5M7M0J6k4o1o4k6J9L7L7M7O4N3J4j8j6KMrj1LJ9
1632I63K2Nj9k9j4Jpl2l7k1j8l8m6j1K5J7k0l3j0J0Ork2l9m8l4kK2K6L0K8km4n0nL9L9J4k
1627F55lrj2lJj5l4l4j8mJ1L0L5Rk9l2kK3K0QLlj9l2k3NK4J5j3l0j7RJ8J2J5L0L3Rj1JK5K9
$$ y = [1742, 1707, 1682, 1698, 1749, 1792, 1806, 1819, 1876, 1990, 2125, 2241, 2329, 2404, 2477, 2551, 2629, 2725, 2844, 2980, 3125, 3267, 3401, 3526, 3652, 3782, 3899, 3977, 4004, 3999, 3986, 3967, 3930, 3875, 3826, 3805, 3797, 3761, 3664, 3514, 3349, 3194, 3050, 2900, 2743, 2589, 2441, 2296, 2150, 2015, 1905, 1816, 1730, 1632, 1533, 1461, 1435, 1445, 1463, 1465, 1443, 1406, 1377, 1384, 1428, 1471, 1464, 1407, 1356, 1355, 1397, 1441, 1471, 1499, 1539, 1586, 1630, 1672, 1713, 1749, 1774, 1794, 1820, 1854, 1894, 1937, 1977, 2003, 2006, 1989, 1979, 1997, 2035, 2063, 2056, 2021, 1980, 1934, 1872, 1802, 1756, 1751, 1761, 1744, 1691, 1626, 1572, 1519, 1456, 1392, 1349, 1337, 1337, 1319, 1263, 1174, 1084, 1030, 1016, 1012, 985, 934, 887, 868, 877, 903, 936, 963, 965, 930, 877, 849, 863, 896, 910, 905, 916, 960, 1011, 1031, 1023, 1027, 1066, 1122, 1166, 1193, 1214, 1234, 1249, 1265, 1288, 1308, 1301, 1257, 1208, 1195, 1223, 1241, 1201, 1113, 1040, 1012, 995, 935, 845, 794, 809, 835, 811, 752, 726, 758, 806, 822, 806, 786, 771, 750, 720, 695, 691, 709, 745, 790, 837, 877, 893, 869, 808, 744, 718, 737, 774, 811, 858, 922, 975, 989, 971, 955, 957, 961, 952, 941, 944, 963, 985, 990, 971, 942, 928, 929, 922, 890, 853, 832, 814, 776, 730, 719, 744, 761, 741, 708, 698, 708, 714, 705, 683, 644, 596, 562, 560, 582, 608, 638, 666, 664, 620, 570, 565, 604, 643, 657, 655, 652, 643, 631, 628, 629, 614, 580, 546, 528, 524, 535, 565, 600, 609, 580, 548, 546, 569, 589, 597, 600, 597, 578, 546, 523, 528, 552, 567, 554, 524, 507, 516, 534, 546, 561, 591, 624, 633, 622, 623, 648, 677]
1622F77Pk1m2n6n4k8kKMJ7K5Kk4rL5N5L4PRK4K5Pj8m0m1j1K3L0J6J0J4Lj3JL1K7k0n0l1mn
1617F16qPJ5pj5K1N3K4k8l2RK2ok2mOj3k7pJ6Ll0m6k8OL5L9Ol3m2j3J4J4NJ1K3K2QNJ5K2J4
1612F70oj6rLom0n3j3N0P0L3j2k2j0kMK7N2M3Ll3l7j5J1J8Oj2j9qKKlpj0j1RM3N4J3m7p2m8
1606F02k3k4k0J4N4N3J7qlLrk6k3jK0L8O0P7P4N7L9K2MkJ7M3M6K8K9N7P6N3J5l%NJ8M0N4L6
1602A509QNK3K2jk1k2l1n5o7n8m1m3n9p3p3n1j7Qml3m1j6J1K0K7L8L3Nj9j5j1k4l6j8J4K0
1597I14lk1j5JJ1J8K5L1L9M4K5j4m3k7K4O3O9N2M1M2M8M9L5J0qoJ8M5O4O4M3J8J6L7N3N2N1
1593A865P6J09J24J23J34J59J85K06K33K80L50M36N13N55N55N36N02M31L26K43K17K17J94
1590H569J60J57J76J78J52J03nk02m28n74o20o45o80o70n81m77m23l92l35k73k46k30j81j13
$$ y = [677, 684, 663, 621, 565, 511, 483, 481, 483, 487, 504, 529, 531, 507, 498, 533, 588, 622, 629, 638, 662, 687, 694, 676, 636, 595, 584, 607, 637, 653, 663, 677, 680, 667, 668, 699, 726, 706, 656, 625, 621, 616, 608, 615, 630, 623, 608, 629, 682, 706, 678, 646, 655, 677, 671, 649, 645, 651, 638, 611, 604, 620, 623, 593, 547, 519, 525, 560, 599, 605, 572, 530, 517, 531, 545, 550, 561, 584, 606, 614, 619, 634, 656, 670, 664, 648, 639, 642, 636, 596, 543, 530, 580, 650, 683, 671, 649, 639, 637, 641, 668, 720, 763, 766, 733, 696, 681, 692, 710, 716, 704, 685, 677, 679, 681, 678, 671, 661, 650, 659, 702, 756, 769, 722, 650, 602, 579, 555, 535, 549, 603, 656, 673, 665, 662, 665, 656, 630, 607, 606, 626, 664, 724, 801, 875, 932, 971, 993, 997, 995, 1012, 1055, 1101, 1129, 1158, 1215, 1291, 1344, 1359, 1356, 1356, 1361, 1379, 1419, 1473, 1509, 1517, 1522, 1545, 1567, 1566, 1545, 1523, 1492, 1437, 1370, 1312, 1271, 1228, 1169, 1096, 1023, 972, 955, 963, 959, 926, 885, 869, 880, 900, 927, 965, 998, 1003, 984, 969, 958, 934, 898, 880, 894, 914, 911, 890, 875, 876, 887, 905, 930, 961, 1000, 1044, 1069, 1055, 1012, 985, 1009, 1072, 1141, 1193, 1234, 1276, 1324, 1373, 1408, 1418, 1410, 1404, 1422, 1467, 1531, 1595, 1638, 1656, 1672, 1709, 1762, 1814, 1865, 1941, 2050, 2174, 2297, 2431, 2590, 2775, 2981, 3214, 3494, 3844, 4280, 4793, 5348, 5903, 6439, 6941, 7372, 7698, 7941, 8158, 8375, 8569, 8729, 8886, 9062, 9240, 9392, 9495, 9490, 9288, 8860, 8286, 7666, 7021, 6341, 5671, 5090, 4613, 4190, 3798, 3463, 3190, 2944, 2714, 2533, 2420]
1587B420q9j10j17r1o2n6o0o4p5q8q1n5l1j2J1J8om4m9j5J7K1Qrk6l4j3K1K7nl9l7qK2L6K7
1582A352j0n4o8m2lJ7J3nl1m3k2J8L4J6JJ3K3Jk3j5Mpl6l0J6M6L2Mqj1k4l7l7l2l2k5lJ9K0
1578A031PRL1N2N0L0Np%K1L8L8K1JnKJ0MoJJ8K4Kj8jL5M1Jl7k7J3L0J1%K6O3O6L0rj8qKRK2
1572A608M2M2J6nQM5O6N4L3L0L4K0rk6j5J2K7J5j6m5m5j4K2L1Qk2k7lK7L3Ok5l1j0MJmLml8
1567A848n8k1M0O1L3J2K4K5ql2qK7L3L2O8J10Q6J0l6qL8M9L5L2L8M1N8R1R5M3j5j3L8O7M6
1563B881J8K2M3M4K2lk0j8ML2L3Lj2J2M8M8Ql2m2l1j9j0JJ5K9L1J9K%J4K8K3LkJ3L5M9N5O4
1558C410P3P4O6N5M8N0N8O3N2K6POK1L9N0N6N5M9L4J3kNL1N2M6K3J3K6M5N8P4R4R4N8J8J8
1554D958N3O9M5K1L8P9R2O1K1J2K5K8RlJ7O1Q6P0L8K0K3L2M5O3O1K3k5k4L8R4R6N7K7K3L1
$$ y = [2420, 2331, 2221, 2104, 2013, 1951, 1895, 1835, 1771, 1696, 1608, 1527, 1472, 1441, 1429, 1440, 1458, 1452, 1408, 1359, 1344, 1361, 1382, 1390, 1381, 1355, 1321, 1308, 1329, 1356, 1351, 1312, 1275, 1267, 1289, 1325, 1352, 1342, 1288, 1220, 1178, 1175, 1192, 1205, 1200, 1169, 1126, 1104, 1122, 1156, 1172, 1173, 1186, 1209, 1210, 1187, 1172, 1176, 1169, 1133, 1103, 1119, 1165, 1197, 1201, 1193, 1182, 1158, 1121, 1084, 1052, 1020, 995, 992, 1011, 1031, 1038, 1047, 1078, 1130, 1180, 1210, 1215, 1208, 1208, 1229, 1267, 1305, 1326, 1327, 1322, 1324, 1334, 1338, 1332, 1333, 1351, 1375, 1377, 1359, 1358, 1393, 1434, 1435, 1398, 1371, 1384, 1414, 1425, 1425, 1451, 1514, 1580, 1610, 1601, 1583, 1575, 1577, 1586, 1608, 1650, 1692, 1708, 1703, 1711, 1756, 1822, 1876, 1909, 1939, 1973, 1993, 1984, 1958, 1943, 1955, 1982, 1997, 1981, 1936, 1891, 1877, 1899, 1930, 1938, 1916, 1889, 1886, 1913, 1946, 1952, 1927, 1896, 1886, 1890, 1891, 1887, 1890, 1886, 1848, 1790, 1769, 1809, 1870, 1903, 1915, 1939, 1964, 1956, 1924, 1916, 1943, 1976, 2008, 2076, 2186, 2272, 2282, 2246, 2238, 2276, 2325, 2360, 2392, 2430, 2471, 2529, 2620, 2715, 2758, 2743, 2730, 2768, 2835, 2881, 2899, 2921, 2964, 3008, 3030, 3027, 3007, 2989, 2993, 3025, 3058, 3061, 3049, 3061, 3109, 3157, 3165, 3133, 3091, 3060, 3041, 3031, 3032, 3047, 3076, 3107, 3126, 3128, 3128, 3142, 3170, 3193, 3196, 3194, 3207, 3242, 3291, 3346, 3410, 3483, 3557, 3623, 3678, 3726, 3776, 3834, 3897, 3949, 3975, 3982, 3988, 4009, 4048, 4098, 4154, 4209, 4258, 4292, 4305, 4303, 4308, 4339, 4391, 4437, 4460, 4473, 4499, 4544, 4602, 4676, 4770, 4864, 4922, 4940, 4958, 5011, 5080, 5125, 5146, 5184, 5263, 5355, 5416, 5437, 5449, 5474, 5502, 5511, 5508, 5525, 5586, 5672, 5742, 5780, 5800, 5823, 5855, 5900, 5963, 6024, 6047, 6022, 5998, 6036, 6130, 6226, 6283, 6310, 6333, 6364]
1550F364N1Q7J09R8Q0R6J34J34Q9N5P8J19J30J06Q3O4M3L2N6R5J10R5Q2R1J13J30J38J37J16
1546I115R5R8J24J35J08P6P4J01J14J00Q4Q5R1Q2O9O7P5P5O2M5L7L5L5L9N0O0O4P0R0J15J31
1542A1601J37J41J49J53J51J47J51J51J42J19R4P1N8O7J03J43J59J38J07J01J23J45J40J20
1539A4611J20J50J81J82J58J38J45J72J97K02J88J76J83K17K47K47K23K12K38K94L47L75L60
1537A9563L21K95L18L75M13M15M13M43M88N05M91M91N36O10O77P18P49P88Q37Q99R73J054
1534C2372J143J241J361J512J703J945K260K663L148L713M373N160O076P099Q177R179R840
1532A02965R842R083P821O513N467M710M137L705L445L375L470L618L537K773R56j867n140
1530A68410q086j0130j1111j1201j0676r757q604p354o135n023m048l242k623k155j764j424
$$ y = [6364, 6415, 6502, 6611, 6709, 6789, 6885, 7019, 7153, 7242, 7297, 7375, 7494, 7624, 7730, 7813, 7877, 7920, 7952, 8008, 8103, 8213, 8308, 8390, 8481, 8594, 8724, 8862, 8999, 9115, 9210, 9308, 9432, 9567, 9675, 9751, 9825, 9926, 10040, 10140, 10224, 10309, 10400, 10482, 10551, 10618, 10693, 10768, 10830, 10875, 10912, 10947, 10982, 11021, 11071, 11131, 11195, 11265, 11355, 11470, 11601, 11738, 11879, 12028, 12181, 12332, 12479, 12630, 12781, 12923, 13042, 13136, 13207, 13265, 13332, 13435, 13578, 13737, 13875, 13982, 14083, 14206, 14351, 14491, 14611, 14731, 14881, 15062, 15244, 15402, 15540, 15685, 15857, 16054, 16256, 16444, 16620, 16803, 17020, 17267, 17514, 17737, 17949, 18187, 18481, 18828, 19203, 19563, 19884, 20179, 20497, 20872, 21285, 21700, 22113, 22556, 23044, 23549, 24040, 24531, 25067, 25677, 26354, 27072, 27821, 28609, 29446, 30345, 31318, 32372, 33515, 34756, 36117, 37629, 39332, 41277, 43537, 46200, 49348, 53061, 57434, 62594, 68670, 75769, 83946, 93125, 102965, 112807, 121890, 129711, 136224, 141691, 146401, 150538, 154243, 157688, 161063, 164533, 168151, 171688, 174461, 175417, 173550, 168410, 160324, 150194, 139083, 127882, 117206, 107449, 98845, 91491, 85356, 80333, 76285, 73043, 70420, 68265, 66501, 65077]
1528F5077j176j028r13p64n93m50l31k04o1P1J96L18M05M22M06M35N34O61P79Q86R91J102
1525F6763J241J399J534J612J674J795J980K182K367K551K749K967L214L494L788M083M404
1523A09797M758N102N426N807O316O932P619Q424R395J0458J1544J2759J4309J6300J8789
1521B53735K1983K6162L1436L7759M5207N4000O4227P5785Q8284J00332J08816J09917J01960
1520A119603Q7382P1283N7877M8389M1918L7352L4321L3078L3954L6219L6658K9695J0406
1518A678135k1354n9544r4973j20316j33177j35433j30467j20984j08626r4681q0560o7579
1516E10441n6556m7660m0609l4966l0390k6733k3896k1645j9654j7743j5956j4344j2838j1358
1515A36093r971q778p769o858o043n374m840m370l942l584l286k999k717k477k285k122j989
$$ y = [65077, 63901, 62873, 61960, 61196, 60603, 60153, 59822, 59618, 59557, 59628, 59824, 60142, 60547, 60969, 61375, 61810, 62344, 63005, 63784, 64670, 65661, 66763, 68004, 69403, 70937, 72549, 74223, 76018, 77998, 80180, 82547, 85098, 87847, 90814, 94028, 97522, 101310, 105393, 109797, 114555, 119657, 125083, 130890, 137206, 144138, 151757, 160181, 169576, 180034, 191578, 204337, 218646, 234946, 253735, 275718, 301880, 333316, 371075, 416282, 470282, 534509, 610294, 698578, 798910, 907726, 1017643, 1119603, 1206985, 1278268, 1336145, 1384534, 1426452, 1463804, 1498125, 1531203, 1565157, 1601376, 1638034, 1667729, 1678135, 1656781, 1597237, 1502264, 1381948, 1248771, 1113338, 982871, 861887, 753261, 658580, 578020, 510441, 453885, 406225, 365616, 330650, 300260, 273527, 249631, 227986, 208332, 190589, 174633, 160289, 147451, 136093, 126122, 117344, 109575, 102717, 96674, 91300, 86460, 82090, 78148, 74564, 71278, 68279, 65562, 63085, 60800, 58678, 56689]
1513E6689j898j819j717j617j573j579j573j526j453j381j318j276j261j246j215j196j207
1511C1834j199j127j035j003j013r70q54p45o94o63o00n37n18n29n29n19n20n15m73l92l08
1508A7091k50k16j87j44r8p7r4j24j41j53j80k17k40k44k39k10j61j31j52j78j50j02j10j66
1505A3127j88j53j24j32j28q6o6j11j68j71j39j29j28j03p8r7j46j67j52j38j38j30j18j24
1502A0013j39j29j03r9j23j40j37j28j18r4o6o7r0q8n3l4o4j08j18r6p9p9p6o1m1l2k6k1k1
1499G583l5n7p0o2m4l8n8r2j23j42j44j34j27j34j48j47j32j19j06q1n2n7r9j22q6k6ok6m0
1495E076l6m6q0r7p4l3qmj7m0n5l4OJ5k7p3p0l0j6l8n6m6l0l6n0l6mJ1j3m6m7j0L0M2K4lj8
1491D031j8j7k7m8n9m4j3RJ6J7J3pl7m8k8oqk1k2j6l1n3m6oK8K0j6l9l4j6oj6m1o4p2o3m2
$$ y = [56689, 54791, 52972, 51255, 49638, 48065, 46486, 44913, 43387, 41934, 40553, 39235, 37959, 36698, 35452, 34237, 33041, 31834, 30635, 29508, 28473, 27470, 26457, 25487, 24633, 23888, 23194, 22531, 21931, 21394, 20876, 20347, 19818, 19299, 18779, 18264, 17791, 17399, 17091, 16841, 16625, 16438, 16294, 16196, 16119, 16025, 15901, 15760, 15607, 15427, 15210, 14970, 14726, 14487, 14277, 14116, 13985, 13833, 13655, 13505, 13403, 13293, 13127, 12939, 12786, 12662, 12530, 12402, 12316, 12250, 12139, 11971, 11800, 11661, 11532, 11404, 11301, 11223, 11126, 10980, 10813, 10661, 10523, 10385, 10255, 10137, 10013, 9874, 9745, 9642, 9543, 9420, 9280, 9143, 9015, 8897, 8803, 8737, 8670, 8580, 8492, 8439, 8405, 8341, 8233, 8115, 8019, 7940, 7861, 7785, 7724, 7683, 7651, 7625, 7604, 7583, 7548, 7491, 7421, 7359, 7315, 7277, 7219, 7127, 7004, 6862, 6718, 6584, 6457, 6323, 6175, 6028, 5896, 5777, 5671, 5590, 5538, 5481, 5382, 5260, 5174, 5148, 5142, 5116, 5076, 5040, 4994, 4914, 4817, 4743, 4710, 4702, 4698, 4681, 4641, 4586, 4552, 4558, 4573, 4546, 4473, 4403, 4373, 4357, 4319, 4263, 4217, 4187, 4151, 4101, 4065, 4061, 4072, 4059, 4013, 3966, 3956, 3986, 4028, 4052, 4049, 4031, 4013, 3996, 3969, 3921, 3862, 3818, 3805, 3814, 3830, 3847, 3860, 3853, 3816, 3768, 3740, 3734, 3726, 3705, 3683, 3667, 3636, 3583, 3537, 3531, 3559, 3579, 3563, 3524, 3490, 3474, 3468, 3452, 3411, 3347, 3275, 3212, 3170]
1486C170j5lj2l7m4k4pj5l4l2j7j1k3l3l4l9l9j6J2J9%oPJ2lpJ1K2Lk1j5RK1K1J7Qj7l5k2
1481B771OPk3m9m9l0pJ2J7jk3k0RK8K0MJ2L1L3Mk9l4rJ8K6J2pj9j7KK4K0k1o4n7nL2J2l6n5
1476B545l6j6j3j9j6j3j4j3j9m3o5n1ML8J1n3q8o9k2RJ4MokJ3K6J9JrJJ7J8Nj1k4l2j6L0P6
1472B181P8L6LJ2L6K4j9m9m7l2k0j2qpjK0K4j8p7q2k3K2Kl9l4RL0K0Nrl8o6n6k5k6n7o1k2
1467A674Lj9m2j9J7Qk5j9K2L5mm3k9J7M0L0PopNK3L1K0NRL9O0M8J7JJ2K0Jk9l3%L7M1J5k0
1462A942l3k2l%j5j9PL5K1l0n6l8j0rj1J2K9Ok7j4L9O2L4J0K4L9J6mK0N8M9J2J4O4R7O0kk5
1457B332KL5N4M7Rn1r1p8l6k5n3p5n9l3k1rJ3K3on1o9n1k5j8j9j9j8k2k8l3l3j7RK2Jk5j5
1453A567K3L3Kk1lJ9Jk5pM7O0J2l0j4K6K5pk2lRoj3J6N5N8K3oRM6O0M4K4L0N5P1P5Q8J16J45
$$ y = [3170, 3155, 3152, 3140, 3103, 3059, 3035, 3028, 3013, 2979, 2947, 2930, 2919, 2896, 2863, 2829, 2790, 2751, 2735, 2747, 2766, 2766, 2760, 2767, 2779, 2776, 2769, 2780, 2802, 2805, 2784, 2769, 2778, 2799, 2820, 2837, 2845, 2828, 2793, 2771, 2777, 2784, 2761, 2712, 2663, 2633, 2626, 2638, 2655, 2654, 2631, 2611, 2620, 2648, 2668, 2672, 2684, 2715, 2748, 2752, 2723, 2689, 2680, 2698, 2724, 2736, 2729, 2710, 2693, 2695, 2719, 2739, 2718, 2654, 2597, 2592, 2624, 2636, 2600, 2545, 2509, 2493, 2480, 2461, 2445, 2432, 2418, 2405, 2386, 2343, 2278, 2227, 2231, 2269, 2280, 2227, 2139, 2070, 2048, 2057, 2071, 2075, 2069, 2067, 2080, 2106, 2125, 2126, 2117, 2118, 2135, 2153, 2158, 2147, 2123, 2091, 2075, 2105, 2181, 2259, 2295, 2298, 2310, 2346, 2370, 2351, 2302, 2255, 2223, 2203, 2191, 2183, 2176, 2175, 2195, 2219, 2201, 2124, 2042, 2019, 2041, 2043, 2004, 1970, 1979, 2009, 2029, 2034, 2025, 1987, 1921, 1865, 1840, 1814, 1757, 1696, 1674, 1677, 1658, 1616, 1597, 1614, 1622, 1597, 1578, 1600, 1635, 1631, 1588, 1559, 1576, 1616, 1646, 1653, 1647, 1640, 1645, 1668, 1699, 1719, 1724, 1733, 1772, 1832, 1880, 1897, 1898, 1910, 1930, 1931, 1902, 1869, 1869, 1906, 1947, 1962, 1942, 1909, 1887, 1884, 1884, 1869, 1850, 1857, 1892, 1913, 1883, 1827, 1789, 1779, 1770, 1759, 1771, 1800, 1806, 1779, 1765, 1804, 1866, 1900, 1910, 1934, 1973, 1989, 1985, 2005, 2063, 2112, 2124, 2138, 2202, 2299, 2359, 2357, 2332, 2334, 2369, 2423, 2470, 2479, 2428, 2337, 2259, 2223, 2198, 2145, 2070, 2011, 1978, 1957, 1948, 1961, 1984, 1978, 1927, 1858, 1807, 1782, 1764, 1745, 1726, 1708, 1686, 1658, 1625, 1592, 1575, 1584, 1606, 1607, 1582, 1567, 1590, 1623, 1625, 1604, 1601, 1620, 1621, 1596, 1589, 1636, 1696, 1708, 1678, 1664, 1690, 1715, 1708, 1686, 1683, 1692, 1686, 1673, 1689, 1744, 1802, 1825, 1819, 1828, 1874, 1934, 1978, 2002, 2032, 2087, 2158, 2233, 2321, 2437, 2582]
1448B582J58J71K05K48K68K68L02L96N13N78N70N15M50L79L13K72K56K37J94J57J49J54J34
1445I469Q6J7r3k64m59o00o59o70o61o08n07m15l83l74l27k47j95j82j62j20r7j20j42j13
1442B174n8l3n4q8j07j04q0m5j6j1j8k2j6j0lKJj0j3njqlL0M9Ro4r7o5k7k2k3NL5K0k6m6k5
1438A225nj7l5k5KPk1n5o2l4J3N4N8K5j4l2l0k8k7j0J6K4nl4k5J1J9k1o0m0K5O5M4%j2PJ0
1433A013k2n0k7L4P1M4j1k8JK3ll8l0J3L6K2J0K1K4ol7k5J9L7Mm4o7o3m8k9nJ4J9J3RJ2J5
1429I21J0jkJ1K0Qk2m0l2j1OJ7K4K0%qJ2M1M7K6Jj5k9l6k8k0k9l4LP3J11P6Lm5l9ON4O6K1
1424A186m9p9m9kNj4k4k0k1k4j3%j2l9m6k2J0L7M9L3j3o1o6l0J1K7K7J7OMK4M1K7pj7MJ6m
1419I12k8k7j7k4l2j7J5L2K5Qqj8k4k6k8k4kK7M4L5J9Q%rj2j3j7j8kK1J7j6l7k1NJ3J3K7L8
$$ y = [2582, 2740, 2911, 3116, 3364, 3632, 3900, 4202, 4598, 5111, 5689, 6259, 6774, 7224, 7603, 7916, 8188, 8444, 8681, 8875, 9032, 9181, 9335, 9469, 9555, 9572, 9479, 9215, 8756, 8156, 7497, 6827, 6166, 5558, 5051, 4636, 4253, 3879, 3552, 3305, 3110, 2928, 2766, 2646, 2549, 2429, 2287, 2174, 2116, 2083, 2029, 1941, 1834, 1730, 1650, 1605, 1589, 1578, 1560, 1538, 1522, 1512, 1509, 1511, 1512, 1502, 1489, 1484, 1483, 1475, 1472, 1502, 1551, 1560, 1496, 1399, 1334, 1307, 1285, 1262, 1267, 1302, 1322, 1296, 1250, 1225, 1220, 1203, 1168, 1143, 1145, 1152, 1131, 1076, 1014, 980, 993, 1047, 1105, 1130, 1116, 1084, 1054, 1026, 999, 989, 1005, 1029, 1024, 990, 965, 976, 995, 974, 914, 874, 899, 964, 1008, 1008, 996, 1003, 1013, 991, 941, 914, 948, 1019, 1063, 1052, 1024, 1025, 1048, 1045, 1007, 977, 990, 1026, 1048, 1058, 1079, 1103, 1097, 1060, 1035, 1054, 1091, 1095, 1051, 984, 921, 873, 844, 839, 853, 872, 885, 894, 906, 921, 931, 930, 928, 939, 959, 967, 945, 905, 873, 862, 868, 885, 909, 929, 929, 921, 933, 974, 1021, 1047, 1048, 1033, 1004, 968, 940, 920, 891, 857, 860, 933, 1044, 1120, 1123, 1078, 1039, 1045, 1099, 1165, 1186, 1137, 1058, 1009, 1007, 1012, 998, 974, 954, 933, 909, 896, 896, 884, 845, 799, 777, 787, 824, 873, 906, 893, 832, 766, 736, 747, 774, 801, 818, 824, 828, 852, 893, 920, 913, 896, 900, 916, 912, 884, 857, 840, 816, 784, 767, 782, 814, 839, 847, 839, 821, 797, 771, 743, 719, 717, 744, 788, 823, 842, 850, 850, 841, 829, 816, 799, 781, 779, 800, 817, 801, 764, 743, 748, 761, 774, 801, 839]
1415H39L0K1K2J7j0l3k8j2j5k0jK0Lk5j0L2L6pl4j3J3PkJ1K4Rj1mMk0n3m7oK1J7RJ7L0K4J4
1410H69J4J9J2oj9j9qlmJJ6K7J4j4l3k8rMKj7l2j3L4N9K9l0n7l4lRRPnk2k4j6k8n6o2k9JO
1404E61J7N4P7M0k5m6j8J7K9L4L5K3PJ0K2J0j7j7J3K5rn3n8k3J4J9ml2l9j9J3K4J5jpmPK3
1400G17K7Nk1j9RK1Pqppk0l2k5kJ9K9K4J1nj3j3j3kK0L1Rk5k1J7L1lm1l6%K1J8kl1m6k0L5
1395F39N8J7l8l7NL2K7K6L4K7Mork7m9l3J2K2j4l1J6P2N7j2n5l9j2m%J4K5J3KNJ1nl0k9nJ3
1390F96J0NQPoj2QK3Nl0l4rKj5k1J3M4L3KLK5J4l6o5l9NK6J9Jj3pK8O6N2pm3j1M1L7k0o2n0
1385F93j6kpkJ6L2L4K6K1K2K0Nj3rJ6K7km1m6j9KOQJ9J2j6l1qK2K3RJ8M3N0K8OPK0J6jj2j3
1380I63rpqj7l7m8k7K1O0N5K3jLJ9K0J0JllLJ6K1PnQL6M7L8M0N4M7Qj5K3Q5R7M7RK5O5P5N8
$$ y = [839, 869, 890, 912, 929, 919, 886, 858, 846, 831, 811, 810, 830, 833, 808, 798, 830, 866, 859, 825, 812, 825, 832, 830, 841, 865, 874, 863, 859, 863, 843, 790, 743, 737, 758, 775, 784, 801, 831, 855, 869, 883, 902, 914, 908, 889, 870, 862, 859, 855, 856, 872, 899, 913, 899, 866, 838, 829, 833, 835, 818, 786, 773, 807, 866, 895, 865, 808, 774, 771, 780, 789, 796, 791, 769, 745, 729, 701, 645, 583, 554, 555, 561, 578, 632, 709, 749, 724, 678, 660, 677, 706, 740, 775, 798, 805, 815, 837, 847, 830, 813, 826, 851, 842, 789, 731, 708, 722, 741, 737, 705, 666, 647, 660, 684, 699, 698, 691, 687, 694, 717, 744, 749, 728, 709, 718, 739, 746, 738, 731, 724, 704, 672, 647, 645, 664, 693, 717, 728, 723, 710, 697, 684, 682, 702, 733, 742, 717, 696, 713, 744, 741, 700, 664, 664, 685, 703, 701, 670, 624, 604, 639, 697, 714, 676, 639, 644, 676, 703, 729, 763, 790, 794, 788, 779, 752, 703, 670, 682, 704, 690, 659, 675, 747, 804, 792, 737, 698, 686, 682, 682, 696, 721, 734, 736, 741, 752, 747, 717, 688, 683, 696, 706, 711, 719, 726, 720, 708, 716, 739, 744, 714, 680, 671, 673, 658, 637, 650, 694, 727, 729, 732, 757, 771, 735, 670, 631, 636, 662, 681, 682, 669, 662, 690, 756, 808, 801, 758, 747, 788, 825, 805, 743, 693, 677, 675, 668, 666, 682, 714, 748, 774, 795, 817, 837, 842, 829, 820, 836, 863, 861, 820, 774, 755, 757, 763, 771, 790, 802, 786, 755, 747, 769, 792, 801, 819, 862, 912, 940, 946, 953, 973, 989, 988, 976, 963, 954, 947, 939, 922, 885, 837, 810, 831, 891, 946, 969, 968, 971, 990, 1010, 1020, 1021, 1018, 1015, 1018, 1034, 1055, 1062, 1057, 1065, 1101, 1148, 1186, 1226, 1280, 1327, 1335, 1320, 1343, 1428, 1525, 1572, 1581, 1606, 1671, 1746, 1804]
1375A804N0O1P6Q6J05J22J16R5R9J49K16K69L19L87M65N21N58O12O88P42P35O71N84M91L95
1371A0416L16K68K41K14J97K12K32J80K1j89l79n33o78q07q82q94q62q01p16o19n26m32l37
1369C642k76k70k80k38j58j19j44j61j19o2n3p2o3l9m8p6o4j1K0on3p6p6o0l2j9m4p1m4K1
1365I49L5k3p2m5Lnm8m6%J8j1l5j3K1J9rk8l0k4j8j4j2j5j9k5k0OL9L8ll6j8K9L8Nk5k5j1
1360E70OK4L2Qk2rL4M3Mk4lK4J3j2rPOLL0N9L5k4n4l0MJ4J3J7K1K2J9Pj1j0J8L9J4k9m3k9
1355G77l1n0m5k0j0j0K2O5M2n1j08o1Lj3o1l7N3R4M9prJ0Jj7rK0M1L8K3%k0j6QJ4rl6l7k4
1351E79j9j5PL3L5J2j4l1l3j8J0K5J3j1j1J2K0ll4l9j8QK1J4rl5m3k3J9N4N8K5k1m8m5k3M
1346D56K8M3L8Rj7j6KLk5n0m0lK3K1LlJOPJ2K2K7J4oj3okj0j0RK9K3rl3k8mQjj9l1l7k9kL7
$$ y = [1804, 1854, 1915, 1991, 2077, 2182, 2304, 2420, 2515, 2614, 2763, 2979, 3248, 3567, 3954, 4419, 4940, 5498, 6110, 6798, 7540, 8275, 8946, 9530, 10021, 10416, 10732, 11000, 11241, 11455, 11652, 11864, 12096, 12276, 12297, 12108, 11729, 11196, 10518, 9711, 8829, 7935, 7073, 6272, 5556, 4937, 4411, 3979, 3642, 3366, 3096, 2816, 2578, 2420, 2301, 2157, 1996, 1877, 1815, 1762, 1690, 1627, 1588, 1540, 1464, 1400, 1389, 1409, 1403, 1350, 1274, 1198, 1138, 1106, 1087, 1043, 972, 928, 949, 984, 961, 889, 844, 847, 842, 794, 748, 748, 766, 755, 720, 707, 728, 747, 738, 710, 680, 656, 638, 624, 612, 597, 578, 553, 533, 539, 578, 616, 613, 577, 559, 588, 626, 631, 606, 581, 570, 576, 600, 632, 640, 618, 609, 643, 686, 690, 666, 663, 687, 700, 688, 679, 686, 692, 695, 725, 784, 819, 795, 741, 711, 715, 729, 742, 759, 780, 802, 821, 828, 817, 807, 825, 864, 878, 849, 806, 777, 746, 696, 651, 631, 621, 611, 633, 698, 740, 689, 581, 520, 523, 510, 449, 412, 465, 559, 608, 601, 592, 602, 603, 586, 577, 597, 638, 676, 699, 699, 679, 663, 671, 685, 676, 640, 603, 579, 560, 545, 552, 585, 620, 632, 618, 587, 554, 536, 546, 571, 584, 573, 562, 574, 594, 591, 557, 518, 500, 508, 529, 543, 534, 499, 456, 433, 452, 506, 564, 589, 568, 520, 475, 452, 456, 484, 527, 565, 574, 557, 541, 543, 546, 521, 471, 431, 428, 451, 472, 475, 472, 473, 479, 486, 498, 520, 547, 561, 555, 542, 536, 534, 524, 514, 523, 552, 575, 566, 533, 505, 501, 509, 508, 489, 458, 421, 392, 390, 427]
1341D27N6L5j0l2j6RMk1l4k4j2oNK4K7Mj3lJ8J4qj6omj3j3MJ4jj7j0J7L3K9J0pk0k4k2k0q
1336C70K2N3N5K0k4l7j7QJ7Qnj3j4j6j8j1J3L6L0Lj4oKok0j9qOK3L7K2k0m8l0QJ3j2k6pJ8
1331C93L1K8J1j5j7K1O5N6%l6k7j7l3l9pK3J3oQL5K2k1l6qJ2lj8mK0J5qk0j0J2L0L9L9K2p
1326E63l4l9j9J2K1jk8k6kJ0nk4k9j8pjKPJ4J6Oj1qJ8L5J7j1j1Mqm4n2j2L1L1J4K2L8J2m8
1321D35q1n0J3M9L9RlJ3L7L5Nk9l6k1qnjJ1K7M1M5L6J6NJ0J6jl0l9j4J9K6Pj2j0MPok1k0q
1316E10oj8k3pRll2m7l7k0j3qNJ3kk8l3mL2L5Nk0j2J2J1k0l6nM3N6L1%j1j3j3nQJ3J0J6K2
1311D15Ml8n7k2L4M9J5k3k4jJ1ql6m3j7J7J9j2l7k2K1M4L1KrRL7M8J9l4o0m1pMJJ7M0L7Oj4
1306C75roj8k1jJ8J7J9L7L8%m1k9K2M1Lm1l5J2M8L9kl5l0J0L6J5k6l7j8qk2k6jK2J1rpJ4K5
$$ y = [427, 483, 518, 508, 476, 460, 469, 473, 452, 418, 394, 382, 376, 381, 405, 432, 436, 423, 420, 438, 452, 444, 428, 422, 418, 405, 392, 396, 410, 409, 392, 382, 399, 432, 461, 471, 464, 444, 420, 398, 378, 370, 392, 445, 500, 520, 496, 459, 442, 450, 467, 475, 470, 457, 443, 427, 409, 398, 411, 447, 477, 480, 466, 460, 462, 456, 436, 417, 409, 415, 438, 475, 497, 477, 429, 399, 407, 420, 408, 382, 375, 393, 424, 452, 463, 448, 431, 452, 517, 573, 573, 537, 510, 493, 460, 421, 414, 437, 450, 444, 452, 487, 509, 488, 452, 444, 456, 453, 435, 431, 451, 466, 458, 438, 428, 440, 470, 509, 548, 570, 563, 529, 490, 471, 483, 504, 503, 475, 449, 447, 457, 452, 428, 399, 381, 374, 373, 375, 382, 396, 412, 418, 407, 399, 417, 452, 469, 458, 447, 451, 443, 399, 347, 335, 366, 397, 411, 433, 471, 483, 435, 354, 304, 317, 366, 405, 414, 411, 424, 461, 496, 501, 472, 436, 415, 407, 402, 401, 412, 439, 480, 525, 561, 577, 582, 592, 608, 607, 577, 538, 524, 543, 569, 576, 564, 554, 558, 565, 559, 538, 518, 510, 504, 486, 463, 456, 465, 462, 430, 383, 346, 326, 313, 305, 310, 323, 321, 293, 260, 256, 288, 323, 328, 308, 296, 308, 319, 299, 263, 258, 301, 357, 388, 388, 377, 364, 351, 346, 354, 367, 377, 393, 415, 419, 381, 324, 302, 336, 385, 400, 377, 353, 352, 363, 355, 319, 276, 259, 276, 295, 283, 246, 224, 245, 289, 320, 322, 313, 322, 359, 407, 426, 392, 332, 291, 284, 288, 289, 306, 346, 383, 389, 375, 366, 360, 342, 321, 320, 338, 355, 374, 411, 449, 449, 408, 379, 401, 442, 445, 404, 369, 381, 429, 468, 466, 431, 401, 411, 447, 462, 436, 399, 381, 373, 351, 325, 324, 346, 357, 348, 341, 355, 380]
1302C80K4K3J4k1n4m5LL4K3knJ0J5Kj0j4rKQNj0k3j8KK0K3Kl4n2l5NL0K1nj5LK3K4NrlJ2J2
1296C61mj5kK0K4J0%PQqk4k3j2qpMK1K1Nj5j7lJ1J0pk5k6pOlj9j6JMpkL3O1L6l6q8p2nM1L7
1291B70J2QK4K9Rj5k1j7k0k6k5j3NK0L3L7K0j8n8p1l2L4P3N1%k1%J8J0JJ1J8Mj5oK0K6J3L
1286C91%j1k7k0J0L6L5K1Pnj3j4j4l2m8k9J7L5Pk1qJ9J1k4m1k4nnnQJ7QprQK4K5Pj6k4mK5
1281C05K6nl2k6KJ2lj6nJ3K0J1lj5k2j5LJ5J0knLRQNJj2k6k3mKk0l2lN0P2L7j8m6m0k0j1j1
1276A89jK1M4M2J0j9k2rKPK2L2K1oj9pJ0J3Q%j2k6l2k8k1j6nJ2J5PJ1K6K9Oj4j0NQjqj3j7
1270B54pJ6K1ok9j0L4N1K8%j0rmMRMoqnj0k1j6MJ5J0lrj0nLLrj5LK9K9jk1pJ9K6J2kj0qPL3
1265C73M4K9nl0l5k8k2j7j0mj0k8l7j2K6L2ol9k6J3K5J1QK5L4J9jj3k4k8j3QJ1opJ4K3J0L
$$ y = [380, 404, 427, 441, 420, 366, 321, 324, 358, 381, 379, 374, 384, 399, 401, 391, 377, 368, 370, 378, 383, 373, 350, 332, 334, 354, 377, 379, 345, 293, 258, 263, 293, 314, 309, 294, 297, 320, 344, 349, 340, 337, 349, 361, 357, 342, 340, 360, 384, 394, 394, 401, 409, 401, 377, 354, 342, 334, 327, 331, 352, 373, 378, 363, 346, 343, 354, 364, 357, 332, 306, 299, 305, 302, 283, 267, 268, 272, 265, 263, 296, 357, 393, 357, 269, 197, 192, 233, 270, 282, 290, 314, 343, 352, 337, 316, 299, 279, 253, 228, 215, 220, 240, 273, 310, 330, 312, 254, 183, 151, 185, 258, 309, 309, 288, 288, 306, 316, 317, 328, 346, 350, 335, 329, 349, 375, 388, 391, 391, 380, 353, 333, 343, 379, 414, 435, 442, 437, 424, 410, 396, 364, 316, 287, 304, 339, 346, 325, 317, 336, 347, 323, 282, 258, 253, 248, 243, 251, 268, 276, 269, 260, 268, 292, 317, 324, 308, 284, 280, 305, 331, 326, 294, 268, 270, 282, 279, 263, 258, 271, 291, 302, 299, 284, 262, 247, 250, 265, 275, 273, 268, 271, 280, 288, 293, 294, 282, 256, 233, 229, 231, 211, 179, 176, 226, 298, 335, 317, 271, 231, 211, 200, 189, 188, 209, 253, 295, 305, 286, 264, 255, 257, 264, 286, 318, 339, 333, 314, 307, 317, 330, 338, 338, 326, 300, 268, 240, 219, 203, 198, 210, 225, 232, 243, 269, 298, 304, 290, 280, 285, 293, 292, 284, 271, 254, 247, 263, 284, 278, 249, 239, 273, 324, 352, 352, 342, 333, 329, 333, 342, 346, 340, 332, 327, 317, 296, 280, 284, 299, 309, 306, 297, 287, 282, 285, 288, 279, 264, 267, 296, 325, 324, 303, 296, 315, 341, 353, 351, 341, 333, 340, 373, 417, 446, 441, 411, 376, 348, 326, 309, 299, 295, 285, 257, 220, 208, 234, 266, 260, 221, 195, 208, 233, 244, 252, 277, 311, 330, 329, 316, 292, 264, 251, 259, 270, 264, 257, 271, 294, 304, 307]
1260C07J6J9rm3m9l4j8QM3N7K4j5j5J2J8nk3k1j7k0j1J2K8J5j2k8k6rJ1J9J4PLpk0rL5P2N9
1255C88Nl1k6%Qnk3k9j3QPk7n8m2J4M8L2kj0NJ2pk4j4J6L4K2LQK7J8k4n5l5OK4J1mj1j6pK4
1250B57M8K6l2o3m0KK9L9L6Ol9n3j8K6L4RoQL3L7J6j0j7pql3n4l1J7L2PrMJ3kpK0L7%m5l1
1245B31L2O0J5m1m8j0K3K2Jj6j7oPJ9K6K4Pj2rJ2K1nl3k2J9L8Kn2o1j5L4K8k5o1l8J0K2LN
1240A90L0K2k9n0JN8M9RJ2M3L0l0n1j6Kl6o9m3LPj4qJ9L1K3J7J0j4l4j9J7K6Pn%KpnRJ0j0
1235A87j4J8M9L9Nj4j2j3k2j5J0K8K1MlOJ9K5J9ll0m0k5l%j3j6oJ%NK5L4J0k3j9K1M7J8l8
1230B82o8n2j2J6K0QjpplJ1L0L9L0J1kmoqqj4l0l9k6KJ7J6K4M1L6nm4m4j6M%j2k2j7J0M5M7
1225B42Pk1MM5L1k7m8j4J2k1n5k9K8M2Qj2QJ9kk5qK7L2J2%PLk7m6j9L1N0J8k2k5jJ7Pj2j6
$$ y = [307, 323, 342, 333, 290, 241, 207, 189, 197, 240, 297, 321, 306, 291, 303, 321, 316, 293, 272, 255, 235, 224, 236, 264, 279, 267, 239, 213, 204, 215, 234, 248, 255, 258, 251, 231, 222, 257, 329, 388, 393, 362, 336, 336, 344, 339, 316, 287, 274, 282, 289, 262, 204, 162, 176, 224, 256, 254, 244, 249, 261, 254, 230, 216, 232, 266, 288, 291, 299, 326, 344, 320, 265, 230, 236, 260, 271, 267, 256, 240, 233, 257, 305, 331, 299, 236, 196, 198, 227, 266, 302, 308, 269, 216, 198, 224, 258, 267, 261, 269, 302, 339, 355, 345, 328, 321, 313, 280, 226, 195, 212, 244, 251, 242, 246, 259, 257, 250, 270, 307, 307, 262, 231, 263, 323, 338, 297, 249, 239, 262, 284, 285, 269, 252, 246, 253, 272, 298, 322, 329, 317, 308, 320, 341, 336, 303, 281, 300, 338, 340, 288, 227, 212, 246, 274, 249, 188, 150, 160, 182, 185, 190, 220, 242, 213, 163, 164, 222, 271, 280, 292, 335, 365, 335, 284, 268, 270, 234, 165, 122, 125, 132, 118, 110, 129, 160, 183, 200, 210, 196, 162, 143, 160, 186, 193, 188, 188, 190, 183, 178, 187, 197, 187, 173, 191, 240, 279, 284, 270, 258, 245, 223, 208, 218, 246, 267, 271, 268, 274, 293, 318, 337, 334, 304, 264, 239, 236, 236, 223, 207, 201, 202, 202, 207, 232, 266, 276, 253, 234, 255, 302, 320, 282, 214, 162, 150, 166, 186, 194, 193, 186, 179, 176, 187, 217, 256, 286, 297, 295, 291, 285, 277, 269, 255, 225, 186, 160, 162, 179, 195, 219, 260, 296, 291, 247, 203, 187, 191, 191, 179, 157, 140, 150, 195, 242, 249, 228, 232, 277, 308, 281, 233, 219, 231, 210, 155, 126, 154, 196, 204, 192, 200, 219, 217, 192, 184, 211, 243, 255, 255, 262, 265, 238, 192, 173, 204, 254, 272, 250, 225, 224, 241, 248, 236, 220]
1220B20qjlqnRJ6Jk8m1j5K5L1%k8k2kkj5nK3L7J8poQmm3p1m8J4O7O9L1pj8kJ5J9J3J3J4Kk4
1215B32m1k0K7N1K5k0l4j4Jpj2MK3K2J0J3K4K0pk3j1J8L3K0nj9j1Nml8n6k7J2Rl1m8j1L2L6
1210A78J3knj3j7OM1M7J4j7j5PJ7Orj2j2j6j8mL0O1M7j2o4m8K7Q2N8k5q4p3j8K2K0rk7k2%
1205A54K3L6L3Pk7n0n4m2k0J4N5P5O1K9jk2m0m4k8oNJ2K2K4ll3k0K5M6J7k0k7j9k3k5pJ4J3
1201A54LRJ7Lj5jL4M3J8%RJ8Kk1l2l2l7l2qJ5J8NmmKJ2L0L9K8Lj8k6k2lJ7K1PkKN%%K2M3K9
1195C51j6n0n1k6NK2J7jmJ1J9%k4j7QOl4o5m4PL9K9jk4k4%K8L2Nj8nK6L0lk9j1K6L0nk7mK9
1190B37K2k0m2j5J6Ol6m8rL7M3J3j1j0qj5j6RL9M0J3JJ9L5J3k8l4JK4%m3o0m5k5j3MK5M4M7
1185B10L6J3j6l5l0j1M%j3k4l1k2KK9L6K2Nmrj0JJ5J9QJNMj4k6j2J9K9Ll2m2k8rJRK7M9N2
$$ y = [220, 212, 211, 208, 200, 195, 204, 220, 221, 193, 152, 137, 162, 193, 193, 165, 143, 141, 139, 124, 119, 142, 179, 197, 190, 184, 192, 188, 145, 74, 26, 40, 107, 176, 207, 200, 182, 180, 195, 214, 227, 240, 254, 256, 232, 191, 171, 198, 249, 274, 254, 220, 206, 207, 200, 188, 192, 215, 237, 247, 260, 284, 304, 297, 274, 263, 281, 314, 334, 329, 310, 299, 304, 300, 262, 206, 179, 191, 200, 169, 121, 110, 142, 178, 191, 189, 184, 171, 154, 160, 201, 248, 262, 245, 230, 237, 254, 260, 251, 239, 227, 211, 193, 189, 219, 280, 327, 315, 251, 203, 230, 312, 370, 345, 261, 188, 170, 192, 212, 203, 176, 154, 154, 177, 213, 246, 253, 226, 176, 122, 80, 60, 74, 129, 204, 265, 294, 293, 271, 231, 187, 159, 153, 158, 170, 192, 216, 213, 180, 160, 185, 231, 248, 228, 201, 182, 159, 134, 127, 141, 154, 157, 166, 183, 186, 171, 170, 204, 247, 265, 265, 274, 292, 294, 273, 241, 209, 172, 140, 132, 147, 165, 170, 166, 162, 164, 176, 206, 245, 273, 276, 258, 232, 210, 207, 224, 245, 252, 250, 252, 257, 257, 257, 279, 322, 351, 335, 285, 234, 208, 213, 235, 252, 251, 247, 258, 277, 277, 253, 236, 244, 250, 216, 151, 107, 114, 153, 182, 181, 157, 133, 133, 161, 193, 198, 180, 175, 201, 231, 228, 199, 188, 214, 244, 239, 212, 208, 237, 259, 239, 197, 182, 198, 204, 168, 120, 111, 148, 191, 204, 193, 183, 175, 160, 144, 153, 192, 232, 245, 246, 265, 300, 313, 285, 251, 252, 276, 276, 233, 173, 128, 103, 90, 94, 119, 163, 210, 246, 259, 243, 208, 178, 167, 171, 171, 158, 134, 103, 81, 83, 112, 148, 170, 175, 171, 162, 152, 153, 168, 187, 195, 196, 201, 205, 191, 165, 153, 172, 201, 204, 172, 130, 102, 93, 94, 103, 130, 179, 231]
1180B31J8l4n9l1J9M4K8OLRnl5m8l2nJ0J7K4J8ok4j1J9J7j7l4mL3K8j1l0j3J1J4JqqkJ5L2
1175A80L1Ll6n5m6j4J7L3L2L0K7Qk8m6k1K4L1%k1pJ1J4J4K5K9QoJ0K9J2k6l5oK4K9J7mk8l5
1171B24j3J3Rj1%M7O3J7l5k9J0J4l1o5m6mJ7K4L9N4M5Pk6l0j0J0J6J2OJ2K9L8J7k5m7k4J5
1166C42K7J2MJ6J2k3n1l5lkk7l2kK3J9J2K8L7Ln4p1l1J5K4RQK8L5K0Kkol0n3m6pK7K6O%K8
1161B88O5Q0N3on4m9LM1K4k0l2JL2L1J4PNqk1j7MJ7J7J7J7Mk1k5%K0lm7n3%N8N8Mm5m7j7J3
1156D08K9L6K5kl4n5n9m7k1OJ3lj4OL5L4Lk6k5j0KJ3K0J1j5l4k7j2j0j4qPK0K0J5O%RL5N1
1151C88L6MqRJ9Nj3oJ8K8Qk4m4m3k2NJ9Kl1l6mK8J9j3j9KPj9l9j6J7J2j3j0K1K3j2k9JL3O
1146C09m4n3j1J7Lj8j6qj8l2k1OJ8J3J2K1K0kk6k8j1J0K3K5J1j0j3J0L3K3j1k2pll0m6k0J6
$$ y = [231, 249, 215, 156, 125, 144, 188, 216, 222, 225, 234, 229, 194, 146, 114, 109, 119, 136, 160, 178, 172, 148, 137, 156, 173, 156, 122, 118, 151, 179, 168, 138, 125, 136, 150, 151, 143, 135, 133, 148, 180, 211, 214, 178, 123, 77, 63, 80, 113, 145, 175, 202, 210, 182, 136, 115, 139, 170, 170, 149, 142, 153, 167, 181, 206, 235, 243, 237, 247, 276, 288, 262, 227, 221, 245, 274, 291, 287, 259, 224, 211, 224, 233, 222, 222, 269, 332, 349, 314, 285, 295, 309, 278, 213, 167, 163, 180, 204, 243, 297, 342, 349, 323, 293, 283, 293, 309, 321, 327, 339, 368, 406, 423, 398, 351, 327, 342, 369, 381, 385, 401, 413, 390, 339, 304, 301, 299, 272, 240, 238, 261, 280, 292, 320, 357, 360, 306, 235, 204, 219, 243, 252, 260, 288, 323, 343, 345, 343, 337, 307, 254, 208, 201, 228, 254, 260, 260, 288, 353, 433, 486, 480, 426, 377, 380, 421, 445, 425, 393, 394, 426, 457, 471, 478, 483, 475, 454, 437, 441, 458, 475, 492, 509, 513, 492, 467, 467, 487, 484, 437, 384, 384, 442, 500, 504, 459, 412, 395, 408, 437, 473, 498, 496, 462, 407, 348, 301, 280, 286, 299, 296, 282, 288, 323, 357, 360, 334, 309, 299, 301, 314, 334, 345, 330, 296, 269, 257, 247, 233, 225, 232, 252, 272, 287, 293, 293, 302, 337, 388, 424, 428, 420, 429, 448, 453, 440, 434, 452, 480, 488, 464, 420, 377, 355, 360, 379, 381, 350, 314, 310, 338, 357, 344, 325, 327, 334, 315, 276, 260, 277, 289, 276, 266, 287, 310, 298, 269, 270, 303, 309, 265, 212, 201, 218, 221, 203, 187, 179, 161, 129, 108, 114, 132, 145, 157, 178, 198, 196, 170, 142, 131, 141, 164, 189, 200, 190, 177, 187, 220, 243, 232, 210, 203, 200, 170, 124, 104, 120]
1141A20Qk3k4J4M0L3K1K1km9o3j7L4K9npJ9J6j9l2nJ0j8m4k5J7L1K3J6J5jj6rJ0J0qk0qMJ
1137I7LK2L7K4j2l5k6OK9K8J5PJ0J0nk1k2kRj0l7l5lJ7Oj4mK0K4LqJ0K7K5K2L1K3k1o7o4k3
1132I6%j3k1kJ6NnJ7M6M3Pj8j2LN%MOol4n5n3k5J2L6K6ql4k5%Pj3k3ML7K8k0l8ON4M1j3l5
1126D6qJ5QJJ8K8RqPK8Om6o7l7J2M0M0K0j1k7j9jOJ2K8L5Ol5k8L0O5L7j0j6J0J5j2k8j1J7
1121A75K1Jk2l1j8NJ3ok9l1j6ooJ2N0O6L3k1m8l6mK6M4L6Nk3j9OJ8J1J2J9Kl9n9k9QKl8n4
1117C0l3rNJ9L9L5Nj7qMpk0oJ3Oj8j9J3L9L2Qj5k3rK3N1M6J3pojj2k2j7rnKJ2%l2m1qK6J2
1111H9k6k7J5L7J7%K7N6K9l1n4k3J8K6J8J5Qj4l5l2mK4L5J8k0m8l9%K6J7MJ0J8Mj8j8j7m1
1107F4o1k9M4Q2M6j4m0l2j4J0M0M3Qj9kK8J2l5m9rL2L5Qj7l9n4m5j5J1PqJL4O0M7J0j8j7n
$$ y = [120, 128, 105, 81, 95, 135, 168, 189, 210, 208, 159, 96, 79, 113, 142, 137, 130, 149, 165, 146, 114, 109, 119, 101, 57, 32, 49, 80, 103, 119, 134, 133, 117, 108, 118, 128, 120, 100, 92, 96, 97, 100, 122, 159, 183, 171, 136, 110, 116, 145, 173, 188, 195, 205, 215, 210, 189, 167, 165, 174, 164, 127, 92, 89, 106, 112, 98, 94, 114, 138, 141, 133, 143, 170, 195, 217, 248, 271, 250, 183, 119, 96, 96, 83, 62, 60, 76, 81, 76, 93, 139, 182, 189, 171, 159, 162, 167, 167, 171, 177, 171, 137, 82, 29, 4, 16, 52, 78, 70, 36, 11, 11, 18, 5, -18, -14, 23, 51, 31, -7, -1, 53, 94, 81, 46, 38, 53, 61, 62, 80, 108, 117, 109, 116, 144, 150, 104, 37, 0, 12, 52, 92, 112, 101, 74, 55, 54, 60, 72, 100, 135, 141, 106, 78, 108, 173, 210, 200, 184, 194, 209, 197, 169, 158, 175, 196, 197, 175, 144, 126, 131, 144, 138, 109, 78, 62, 56, 50, 62, 112, 178, 211, 190, 142, 106, 102, 128, 172, 208, 213, 190, 171, 177, 195, 206, 218, 237, 239, 200, 141, 112, 120, 122, 84, 30, -3, -12, -7, 12, 51, 86, 91, 74, 66, 70, 63, 43, 37, 50, 56, 38, 19, 32, 71, 103, 111, 96, 73, 64, 87, 138, 184, 197, 190, 184, 183, 171, 149, 132, 123, 118, 120, 132, 132, 100, 59, 51, 77, 89, 63, 36, 51, 88, 105, 105, 132, 188, 217, 186, 132, 109, 127, 153, 171, 186, 194, 180, 145, 113, 109, 133, 168, 186, 166, 118, 79, 79, 105, 122, 126, 136, 154, 158, 140, 122, 105, 64, 3, -26, 18, 100, 146, 132, 92, 60, 46, 56, 96, 139, 147, 128, 126, 154, 166, 131, 82, 73, 105, 140, 148, 131, 92, 38, -7, -22, -11, -4, -12, -11, 23, 83, 130, 140, 122, 105, 100]
1102A00mj1ML4L8Mk6j1J8Kn0p0k3L9O2M1J3ljP%l4o0l0L9O5J5m2m0jQk1l1mK6L1K9K9K1nk2
1097A36j7NK1K8K5J3ok7n0o9o2k1K8M3J8jJ1L3L8K3R%LJ4J6j7o0n9OO6M9k2n9k7J6K1ONJ0
1092A46jj7nK1J6k0l2KM1K9k4o0m8qK0J7mj1J3M0K9k1n8m6j1J1J8L1L5J0k0mM4N5J3k5j1J9
1087A84J4j3j9%Kj3j1J4K6Ll0l6j4J0J4OnmOJ2Lrj5qRK3J5k3n2l5J5L3Lk1NL9K2k9m0%L0J3
1082A24j9l2k3lJ8L0J2j5j7QK0MoJ1K5Pj7j6mj2k8j6J3K2J0J1L2L8J2k1k9j5rk3m4n2l9j1
1078e4J7K7J8QJ1K3K5Nk3k7kK2K7K6L3K9kk9k1J1K0NMK3J5k6n3k7J1J3opjj1k0KL8L9J5PK3
1073A88K1ql3l3l5m2k8J4L8K3pj4j3j6j0J9M2L3QMKk9o7n6NN1L1j5k7lJ3Lj0oPJ1J3J4Rnj6
1068G6j1JMlpKJ6K2J1j2k6j2K0L5J5rlJ8J0k4m4l0j2rjJ6J9nj2K3O1M6j0n0m9k8JL7N5L5p
$$ y = [100, 96, 85, 89, 123, 161, 165, 139, 128, 146, 148, 98, 28, 5, 44, 106, 147, 160, 157, 156, 163, 163, 129, 69, 39, 78, 143, 158, 116, 76, 75, 83, 62, 31, 27, 53, 84, 113, 142, 163, 158, 136, 119, 124, 145, 173, 198, 211, 205, 178, 128, 59, -3, -24, 4, 47, 65, 64, 75, 108, 146, 169, 178, 178, 181, 195, 211, 194, 134, 75, 81, 147, 196, 174, 115, 88, 104, 125, 131, 136, 146, 145, 128, 123, 144, 160, 140, 108, 110, 151, 180, 156, 96, 48, 40, 60, 77, 73, 62, 75, 115, 144, 123, 65, 19, 8, 19, 37, 68, 103, 113, 93, 89, 133, 188, 201, 176, 165, 184, 198, 185, 166, 166, 168, 155, 144, 158, 184, 187, 157, 121, 107, 117, 131, 137, 132, 128, 134, 146, 149, 140, 125, 117, 126, 149, 164, 141, 89, 54, 69, 102, 105, 84, 89, 128, 150, 121, 81, 81, 111, 124, 105, 73, 50, 47, 65, 95, 107, 92, 75, 83, 103, 107, 101, 112, 137, 144, 127, 111, 107, 95, 67, 51, 64, 86, 96, 107, 139, 177, 189, 168, 139, 124, 115, 92, 48, -4, -43, -54, -37, -10, 8, 16, 27, 50, 75, 80, 57, 30, 28, 50, 77, 103, 136, 165, 163, 134, 113, 124, 144, 149, 153, 176, 191, 165, 112, 85, 96, 109, 103, 96, 95, 84, 64, 66, 104, 143, 158, 165, 188, 209, 201, 168, 135, 100, 58, 30, 44, 82, 105, 98, 84, 71, 55, 45, 64, 106, 139, 147, 151, 153, 124, 57, 1, 6, 57, 88, 73, 46, 43, 56, 59, 49, 43, 50, 61, 74, 88, 97, 92, 76, 65, 66, 70, 67, 60, 62, 78, 100, 111, 99, 73, 61, 81, 116, 131, 122, 119, 137, 147, 123, 79, 49, 37, 28, 27, 43, 62, 57, 45, 68, 129, 175, 165, 115, 66, 38, 39, 76, 131, 166, 159]
1063A59k9k4j3jK4M4K5j3j8J6L8J7j0j6k1m0m3j0K8L6K5J6Kk1k6j0j1m0m5ON9M4mmM5N7J0
1058B52l2k0J8L7M7N6M1ml5k6kkrNK9L2J9J1Oj1k3j1J2J0j3l4m2m2k7QL2J3k7l8j2Nj0k1j0
1053A82kk6m4j4L8M9J2k2j5J2K6K2Ok1m9m7qL9N9M6K0%j3j1NK3K7K5K3K3K2K4L7M2K2qk1j7
1049D66j1qpj5l0k7J8O0M5rk9J2M1Lo1p0l4qj2j0Klk5k8qpl9n7k9J1J5j4l2j9MK0K4K3J6L
1044A71j2l2m3l3JK4J8JMK6L6K2J1J9L2K7Lj4j2MJ1%k0k2ML9M5Rl2m3k0lnpRK1Rrrnl6p7o4
1038D8PN7K6k9k8J6K7pl0qJ4%j6%K5K2nk8m2m9l7LL8L4OpQK0J5Lqj7j9jK2K5Mj6j7kJ3J4m
1033G7l0l4rK0K3J6K2L5K7nk6k3j2qmjj4k7j7RK2J0OJ9J9nk2jK8K6Jj2lKpj4j2qOK7L4%m9
1028H6n6j2L6L9Qj9k1rjj%J3L0L2J0j9l3k5j0KJ5K4K1Pm%J1J6J2PJ0K3L6L1lm7o7m8j7oj8
$$ y = [159, 130, 106, 93, 92, 116, 160, 185, 172, 154, 170, 208, 225, 215, 199, 178, 138, 95, 85, 113, 149, 174, 190, 192, 171, 145, 135, 124, 84, 39, 45, 104, 148, 144, 140, 185, 242, 252, 220, 200, 218, 255, 302, 358, 399, 395, 360, 334, 332, 330, 321, 326, 355, 387, 406, 417, 423, 412, 389, 378, 390, 400, 387, 353, 311, 269, 242, 250, 282, 295, 268, 230, 218, 223, 213, 192, 182, 180, 154, 110, 96, 134, 183, 195, 173, 158, 170, 196, 218, 224, 203, 154, 107, 99, 138, 197, 243, 263, 263, 250, 239, 244, 267, 294, 319, 342, 365, 387, 411, 448, 490, 512, 504, 483, 466, 455, 447, 440, 425, 395, 368, 386, 446, 491, 482, 453, 465, 506, 509, 448, 378, 344, 336, 324, 314, 316, 313, 288, 260, 252, 245, 206, 149, 120, 131, 146, 132, 100, 81, 85, 105, 129, 152, 168, 171, 159, 127, 84, 51, 52, 76, 94, 95, 99, 125, 161, 183, 194, 213, 245, 272, 275, 261, 249, 253, 264, 264, 244, 222, 226, 265, 310, 319, 287, 244, 224, 221, 216, 209, 218, 239, 248, 239, 230, 225, 189, 112, 48, 55, 112, 138, 109, 81, 97, 124, 117, 87, 79, 93, 93, 77, 77, 102, 124, 119, 91, 49, 0, -37, -34, 4, 38, 44, 37, 45, 65, 80, 83, 75, 58, 39, 38, 60, 85, 89, 73, 56, 54, 67, 81, 77, 47, 13, 4, 24, 47, 63, 85, 120, 147, 142, 116, 93, 81, 73, 69, 68, 54, 27, 10, 19, 41, 51, 57, 76, 95, 90, 68, 67, 95, 121, 122, 110, 107, 109, 102, 88, 76, 68, 74, 101, 135, 135, 86, 30, 18, 54, 93, 101, 82, 61, 52, 51, 50, 50, 63, 93, 125, 135, 116, 83, 58, 48, 50, 65, 89, 110, 117, 113, 113, 124, 140, 152, 159, 169, 192, 228, 259, 256, 209, 142, 94, 77, 71, 53]
1023E3j8J1M5M6Rk7l0j1%jLJ3J7Lj1j3nJ6M7O4K3o0j08o5J4L9%k7kK8J2k9l8j2J7K4J3KmN
1018D3L1N5M4jm4n1k3Krl3k4K0M8K1j8lM9N1j6o7m2J2J9qlL2L6pl5k0kj7l3j0K1J9j2k1RL6
1013D9K5%mJ6K7J7kj0mNMj2m3o3l7K2N8L6j3j8K4M5J1k8k3PRj7l0k5j7qJ8L5J7j1KM3L8k4
1008A19o7l7J4J8j3k1lQLOJ7J0mjJ8J7qk6j7jkpLK2K6Lk3k2RK7oo0o8qO5Q0M2Lj1j5j7j1j
1003F1jrlJ8K5J0rk0k1j7lJ4K2K3K2J4qk3j6lj3l2k0J5K7MrJ1K6Qj6j3PJ6J7K2K1Kj3j0nj1
998A10j1J2K9Ql4m4j8J6L1L1K0%j2j6k4m0m3j5J0K0K8N1N4Rl8l2MJ2qmK3K0j8l1pKk0j7K6
993H4N0J7j2J5M8J9l4k8K0L3jj9LJ5loK0K7j4n0l2RJ0j5j8QJ8nk6j8jRJ5J9J0kkOj4o0q2l7
988b4L2O0L2MRK1Nk1k8j7j0qnmmLK2K7%k5rK9L6Jk0%K2Rj5j2Lnk4j3K3M1K6J1J4J6nk6j9P
$$ y = [53, 35, 46, 91, 137, 146, 119, 89, 78, 78, 77, 80, 93, 110, 113, 102, 89, 84, 100, 147, 211, 234, 174, 66, 1, 15, 54, 54, 27, 25, 53, 65, 36, -2, -14, 3, 27, 40, 42, 38, 43, 74, 129, 173, 172, 128, 77, 54, 56, 47, 14, -10, 10, 58, 79, 61, 58, 107, 158, 142, 75, 33, 45, 64, 56, 53, 85, 121, 114, 79, 59, 57, 40, 7, -3, 18, 37, 25, 4, 13, 49, 74, 74, 70, 86, 113, 130, 128, 118, 114, 119, 123, 111, 68, 5, -32, -10, 48, 84, 71, 53, 77, 122, 133, 105, 82, 89, 98, 81, 51, 26, 9, 1, 19, 54, 71, 60, 62, 105, 143, 119, 52, 15, 29, 47, 34, 13, 10, 18, 21, 27, 44, 54, 50, 49, 67, 84, 76, 50, 33, 32, 30, 23, 26, 48, 74, 77, 54, 32, 41, 68, 62, 2, -66, -74, -9, 71, 113, 116, 105, 90, 73, 62, 61, 60, 51, 48, 66, 91, 101, 92, 72, 51, 34, 31, 45, 67, 90, 112, 126, 118, 95, 79, 76, 63, 31, 11, 26, 53, 57, 48, 59, 85, 93, 77, 64, 71, 87, 104, 126, 147, 149, 136, 126, 121, 110, 99, 111, 140, 148, 114, 70, 52, 68, 99, 130, 150, 150, 138, 122, 98, 58, 15, 0, 10, 30, 58, 109, 163, 172, 134, 102, 106, 118, 110, 106, 129, 149, 131, 100, 93, 95, 75, 58, 84, 134, 151, 139, 154, 202, 221, 187, 159, 179, 212, 211, 192, 195, 210, 207, 201, 221, 248, 234, 184, 152, 161, 171, 156, 138, 146, 164, 159, 133, 115, 114, 123, 138, 157, 167, 165, 163, 169, 155, 95, 13, -24, 8, 68, 100, 104, 113, 134, 139, 118, 90, 73, 63, 55, 50, 46, 42, 45, 67, 94, 94, 69, 60, 89, 125, 126, 106, 106, 128, 137, 122, 110, 113, 108, 84, 71, 94, 135, 161, 172, 186, 202, 197, 171, 152, 159]
983A59J5mk9l8k9j8j5k1k9l8l7k2J2M9O6N2J3j5j8mKjomjkoML1N7M7km9n4l1j4j7j1J7M9M9
978A07J9j1j7rnj2j8j2MJ3J1L%%lkNPqk7k6oLlnJ2L3L2J6J4K0Rk1m4l6j7j1rJ2L9L1rl5k2
972B2Jj0l5l2%J1ooL8P2M3k1l7KL3J2j7j6OJ3RJ6K0jl0k4J3L0jm2l7RL9J9k4m4k5%QJnmrj1
967b0%K5M4K4k4n6l8J9N8M2j3m0nM9N7Om2m0LL7L7J9OKNQRKnnoj7l0l0rO%j5k0j3ppJJ6J9
961E2MlJ4L3J9j2j3J8K8qm2k3J9J9k1l9j2J2LrPK3RrLK3Km6n6j4K8K9kl0m6m7j4M7P9N5J1
956I1MK7K8nk8j1Rrm4m3KM7M8J5j8k6j9rmlkJKkrj3oJ3L3M7N1L6Pk2l4l0k2j0J1L2L4J5jJ
951A84J1Mk0l8l4j8m%OK0L6L4Nk3k0J1K6Jl7m5k4omkJ4L1K9Pk4m1k7PK5J2j1j1%jj1JL0L4
946A27jm2n0l0pOJ4RljJ9K9J4mJJ5Qj4k5j9j7k0pK3L9K9Nj4k3j7NK9K9Qj0rqj2nK7N3M1j2
$$ y = [159, 174, 170, 141, 103, 74, 56, 41, 20, -9, -47, -84, -106, -94, -45, 21, 73, 86, 71, 53, 49, 51, 50, 44, 40, 39, 37, 31, 35, 66, 123, 170, 168, 119, 65, 34, 20, 3, -8, 9, 58, 107, 126, 115, 98, 89, 84, 72, 54, 42, 46, 59, 70, 73, 73, 73, 70, 68, 73, 80, 72, 45, 19, 13, 16, 13, 8, 20, 53, 85, 101, 115, 135, 144, 123, 79, 43, 26, 15, 6, 18, 57, 88, 79, 44, 22, 23, 13, -22, -54, -54, -43, -49, -55, -17, 55, 98, 77, 40, 42, 75, 87, 70, 54, 60, 73, 82, 98, 118, 117, 87, 63, 76, 106, 105, 63, 26, 35, 74, 93, 69, 25, 0, 0, 8, 9, 4, 0, -9, -20, -20, 5, 49, 73, 49, -7, -45, -26, 32, 74, 61, 21, 16, 65, 122, 128, 86, 46, 49, 86, 123, 142, 148, 150, 155, 163, 172, 174, 169, 164, 158, 141, 111, 81, 72, 78, 78, 63, 43, 30, 23, 16, 17, 33, 52, 56, 53, 67, 100, 119, 107, 94, 112, 140, 132, 90, 67, 86, 105, 84, 45, 33, 45, 48, 39, 46, 69, 78, 69, 72, 95, 97, 51, -5, -19, 9, 38, 36, 6, -40, -87, -101, -54, 25, 80, 91, 95, 122, 150, 145, 117, 106, 115, 106, 62, 19, 21, 68, 116, 131, 113, 87, 68, 59, 55, 52, 50, 51, 53, 51, 42, 29, 23, 36, 69, 116, 167, 203, 210, 188, 154, 124, 102, 92, 103, 135, 169, 184, 183, 184, 195, 199, 179, 141, 107, 89, 85, 85, 91, 111, 147, 181, 186, 163, 143, 154, 180, 181, 144, 99, 75, 69, 65, 63, 77, 108, 137, 144, 120, 79, 52, 59, 84, 96, 85, 74, 74, 73, 62, 63, 93, 127, 126, 84, 34, 4, -3, 3, 17, 26, 23, 22, 41, 70, 84, 80, 81, 96, 104, 90, 65, 46, 29, 9, 2, 25, 64, 93, 98, 84, 61, 44, 49, 78, 107, 115, 105, 96, 88, 76, 71, 98, 151, 192, 180]
940A80o5p8m4QN1N2J7k5m4l4pK3M0L7K3J2KnQM1O2L0l9o8l0J1on0m7%K2rl3mL7L8RKK2L0O
935A75j9j0K6N6M7ln5o1j9K6L0RKJ8K0mk8l1j4LJ7J7lk5j8J3K8Kl2m3l1j7KJ8Pl7o5k5M9P8
931A03M1oj6nLJ8M4M4jn5o0l0rj1lJ3Qk1l5j0K8L8K1POQMnj4j9j3LJ6J6J1J1RMmj1k2m1n0
925A5l3nJ2J2J6K4K2Lj5j4kjj4k0rK1M7M2Ok8k4J4L7J7j7j4K3M5K8J0J8K8J0j6j3J4K9K4K2
921C14K6J1j7j4K7M7jo6p0j3K7J5j5j7qj8k7kL2K5k1m9k6Nnm6o1j6M6O7L5nk3k3l1l8k4QK2
916G1Lj5pPlk5j9J1L0K6K6L3J9k3m4j4K3J6j7k3PK1Lj0KJ5J1PK1L2J0k8m4k8mJ8K8K6Lk4l6
911A05l7l9l5j8PJ8J4J1J2RNJ1K0J9J2K0L3J9k5n7m3oJ4RJLKllJ0K3J7rl0k5J0L8K3j5k9k
906H9K8K0poK4M1K6Kl%rk1k3j7j8k0nK5L8K0kpmj3k2lL2M3K3J4M0O8N4J9NJ5J5jqjMPK5N2
$$ y = [180, 115, 37, -7, 1, 52, 104, 121, 96, 52, 18, 11, 34, 74, 111, 134, 146, 148, 143, 151, 192, 254, 284, 245, 177, 147, 158, 152, 102, 55, 55, 77, 68, 35, 31, 68, 106, 115, 117, 139, 169, 175, 156, 146, 172, 228, 275, 272, 217, 156, 137, 163, 193, 202, 204, 222, 242, 238, 210, 179, 165, 168, 185, 202, 199, 174, 156, 169, 197, 199, 167, 124, 93, 76, 78, 96, 103, 66, 1, -24, 25, 103, 144, 138, 122, 117, 120, 138, 182, 226, 225, 170, 110, 80, 71, 60, 57, 70, 78, 57, 22, 12, 40, 78, 99, 106, 112, 120, 124, 119, 105, 86, 73, 76, 92, 108, 119, 130, 139, 143, 139, 128, 106, 65, 15, -18, -23, -11, 1, 17, 41, 63, 66, 51, 37, 35, 34, 20, 0, -9, 12, 59, 101, 107, 79, 55, 69, 106, 123, 106, 92, 115, 160, 188, 198, 216, 244, 254, 238, 225, 239, 268, 292, 314, 340, 351, 334, 320, 347, 394, 393, 327, 257, 244, 271, 286, 271, 254, 246, 228, 201, 199, 231, 256, 235, 186, 160, 165, 160, 114, 53, 37, 83, 150, 185, 180, 157, 134, 103, 65, 41, 49, 71, 74, 59, 52, 59, 56, 31, 12, 23, 53, 79, 105, 138, 157, 134, 90, 76, 99, 115, 98, 75, 82, 103, 106, 96, 98, 113, 124, 131, 152, 184, 194, 166, 122, 94, 90, 108, 136, 162, 165, 141, 105, 68, 29, -6, -24, -17, 1, 15, 26, 38, 47, 52, 63, 83, 102, 114, 134, 167, 186, 161, 104, 61, 55, 69, 78, 79, 82, 84, 81, 78, 88, 111, 128, 119, 89, 64, 74, 112, 135, 120, 91, 89, 117, 137, 130, 124, 148, 189, 215, 217, 214, 214, 205, 184, 161, 144, 126, 106, 101, 126, 164, 184, 182, 175, 171, 158, 136, 133, 165, 208, 231, 245, 285, 353, 407, 426, 431, 446, 461, 460, 452, 451, 455, 462, 487, 539]
900E39N4K5OJ1Pj7l1j1Qj8o4q7q3p0m4kK2lm5m5j2lj9j2K2M0K0MMrl8l8%K6J2kJ3K1j4m5k4
895I8J9J4k2j9K8N9M2J1pk6m4l7rPLPK0Jn2p0k1M2M9J3jK2M0K3j0k7k9k1qMLkNK5L5K4%j4
890A75j0RK8L3J9%j2j7k5l2l0j4QK1K0Mj8j5J7M6L2j5m1k8j6l3m8j4M5N5J1k6qK7K9J1J0K3
886B21J1l1n6m0j0OQRJ0KlOK2L4K9Pk5m6m1k1j0lJ4L0J7k0l0J1N2M6J6J3L0K4j2l3k7j9j3
881A78J9P0Q7L6m1q1p5m3NN3O6L2rj6kj5m6n0j9NNJ2M3N5J6l7m2pJ3JnJ6L1Rk7l6j6LJ7L3
876B38L9Om6o5m1j4j7k3nK1K0lj2NK3K2Lk5m4l1J4N2M5Qj3nJj4k7k4j2oPL1L9J6j8l7l6l1
871D1j3K4N2L6j3m2k0K8M9K5orJ2J3j9n1m0nJ0nj0J4L5K3LjMmrPK6K6J5J8K2mm3m8j5J5Qj3
866A36j6lKpj1%J9K2on2p4m3K3O9O4J0m4n5j6L1L7Pj1J3L6J2l2l4KK1om2m9k6QM3P1O1J4k7
$$ y = [539, 593, 618, 624, 635, 642, 625, 594, 583, 591, 573, 509, 422, 339, 269, 225, 223, 245, 242, 197, 152, 140, 137, 118, 106, 128, 168, 188, 192, 196, 187, 149, 111, 111, 137, 149, 147, 160, 181, 167, 122, 98, 117, 131, 109, 90, 118, 177, 219, 230, 223, 197, 153, 116, 107, 114, 117, 124, 144, 145, 93, 23, 2, 44, 93, 106, 105, 127, 167, 190, 180, 153, 124, 103, 95, 99, 102, 100, 105, 130, 165, 189, 189, 175, 165, 174, 202, 235, 254, 254, 242, 225, 200, 168, 138, 124, 132, 153, 173, 177, 159, 144, 161, 207, 239, 224, 183, 155, 139, 106, 58, 44, 89, 144, 155, 129, 121, 148, 177, 188, 198, 221, 232, 201, 145, 105, 95, 101, 109, 118, 128, 130, 127, 133, 155, 189, 218, 225, 200, 154, 113, 92, 82, 79, 93, 123, 140, 120, 90, 101, 153, 199, 215, 228, 258, 282, 270, 237, 210, 191, 178, 197, 267, 354, 390, 349, 268, 193, 150, 155, 208, 274, 306, 297, 281, 279, 264, 218, 168, 149, 154, 159, 171, 214, 269, 285, 248, 206, 199, 212, 213, 208, 224, 255, 264, 237, 201, 185, 188, 205, 238, 277, 283, 237, 172, 131, 117, 100, 77, 72, 93, 113, 110, 98, 103, 126, 148, 151, 126, 82, 51, 65, 117, 162, 170, 157, 152, 153, 139, 112, 88, 76, 70, 77, 108, 147, 163, 145, 108, 72, 41, 28, 52, 104, 140, 127, 85, 65, 93, 142, 167, 161, 152, 164, 177, 158, 107, 67, 62, 72, 67, 57, 71, 106, 129, 132, 131, 135, 131, 122, 129, 155, 181, 196, 214, 236, 232, 189, 141, 126, 141, 149, 136, 120, 117, 119, 112, 101, 101, 120, 142, 136, 84, 10, -33, -10, 59, 123, 133, 89, 34, 18, 49, 86, 93, 82, 95, 131, 143, 111, 77, 79, 100, 94, 52, 3, -23, -15, 28, 99, 160, 174, 147]
861A47k8lJ0Kj0j0NL0M1K2j5m5n5n6m5j3K6L9K0J0K9M2K3rj5jPok3l0k1QL1Qm8o7rP5R7M9
856B12ORK6J4j8m3m0j2K7M9L6Qpmqj7j1NJk4l3jM1N8N0K8j6p3j00o2QN5N3L4J7Nno%jj6l2
851B13l9l2j1J8L1J3j5j6J2L8L3J8J6K0J3%JJ2Rj8l7k1J9M4L0ol7l6j4OMmPL9N0K3qoJ9J7
846D05j3k4KL3L6K4K2K5K6K9L5K4rk3OM6N5M1M3N7N3L8N7R6J07Q5R2J46J88J79J74K37L34
842B626L75L35K64K10J69J35J21J30J39J27J00Q0Q4R8P6k0j75l07l61l59l58l68l64l33k91
839B133k49k04j74j69j58j10n6n4r1r4l6J3Pj8oJ3j2o2o2rK1j0n1l9QK9Qj4oJ3J4mj0MJ7J0
835E92omNj2n5p2l4K1K8mj1L4P8O2Jl5k1J4L0J9MJRK2L0L0K1J5K2M4O4N8K8LJ2M5P1O8N6O0
830A293P6P4N2M9R4J69K12K08K02K44L16L51L17K65K51K51K08J12L6K6N7P2P1Q7J08Q0k5j56
$$ y = [147, 119, 116, 126, 128, 118, 108, 113, 143, 184, 206, 191, 146, 91, 35, -10, -23, 3, 42, 62, 72, 101, 143, 166, 157, 142, 141, 148, 142, 119, 89, 68, 76, 107, 115, 67, 0, -9, 66, 163, 212, 218, 227, 253, 267, 249, 206, 166, 154, 181, 230, 266, 274, 267, 263, 255, 238, 227, 232, 233, 209, 176, 175, 216, 274, 324, 352, 336, 263, 163, 101, 109, 164, 217, 251, 268, 273, 268, 262, 262, 261, 245, 213, 174, 142, 131, 149, 180, 193, 178, 162, 174, 212, 245, 263, 279, 299, 312, 312, 313, 325, 334, 316, 279, 258, 277, 321, 351, 345, 308, 272, 258, 264, 268, 264, 271, 310, 360, 383, 375, 369, 388, 405, 392, 368, 370, 403, 439, 463, 485, 510, 536, 565, 600, 624, 615, 592, 598, 644, 699, 740, 783, 840, 893, 931, 988, 1084, 1191, 1276, 1368, 1514, 1702, 1881, 2055, 2292, 2626, 3001, 3336, 3600, 3810, 3979, 4114, 4235, 4365, 4504, 4631, 4731, 4811, 4895, 4993, 5069, 5049, 4874, 4567, 4206, 3847, 3489, 3121, 2757, 2424, 2133, 1884, 1680, 1506, 1337, 1179, 1069, 1013, 959, 868, 774, 738, 751, 758, 740, 734, 747, 735, 673, 611, 602, 623, 613, 562, 523, 531, 560, 568, 554, 548, 561, 575, 571, 561, 565, 582, 592, 586, 582, 587, 575, 520, 448, 414, 435, 463, 459, 448, 482, 560, 622, 623, 588, 567, 581, 611, 630, 634, 635, 644, 666, 696, 726, 747, 762, 784, 828, 892, 950, 978, 981, 993, 1038, 1109, 1177, 1233, 1293, 1369, 1443, 1495, 1544, 1638, 1807, 2019, 2227, 2429, 2673, 2989, 3340, 3657, 3922, 4173, 4424, 4632, 4744, 4780, 4806, 4863, 4935, 5006, 5093, 5201, 5281, 5256, 5100]
826E100k49k98l55m33m83m58l77l02k56k18j67j24j09j03p1k3ll0o4o8m6l0k6k3k0k0k0rJ3
823G28K6J7oj8rJ3K3J2mLK9L5Ll5l8j6lppmj8l8l2OK8J2j7k0j6l3o0n4j2K1J2j6l5l0rJ5K5
818D71J3qj6nMN%nj4j6pLj0l4l1J0M2K5k5n3l4%J6Pmj0j0qnnnJJ6L0K9J2lnlj8m7n6l0QK6
812B51K1J2kk9n1l3J5M0K0qlJ2om5n0rK8L0Qnpj6k9k8j9j5j3KK4L3J6nj0LJ3J2J2K2K7Ql0
807A96o2o5m2j3J3L5N2M5Mm4n8j7M4O3K3k9m2j5OKNK8M4J7l8o3l3J5L1Pk3k1%J4%k3l2k2n
802cPK0K3J6RJ1J2pl3l6j3%j4l0j9LJ7K9M6M5Rk2j3K1L2K3K0J7j0m9m6PN5N5J8k7o1o4k7J6
798C7J4k0k1J7L6Mk5kL7L9J4P%l0n0k2K5K8KMK6Qn3p7l3J9J8mnJ2J6J1K0L2L2K7L6M1J7k4
793B13n1n1l9k6nK2M0L9K2ql3l3j4mj3rK3N0L2j4l3j7KLLJ3J0j6m3l4ML8M1K2LLPrl9m1NO2
$$ y = [5100, 4851, 4553, 4198, 3765, 3282, 2824, 2447, 2145, 1889, 1671, 1504, 1380, 1271, 1168, 1097, 1074, 1071, 1041, 977, 909, 863, 833, 807, 784, 764, 744, 724, 715, 728, 754, 771, 765, 747, 738, 751, 774, 786, 782, 785, 814, 849, 852, 817, 779, 763, 760, 753, 746, 742, 724, 686, 654, 660, 688, 700, 683, 663, 647, 614, 554, 500, 488, 509, 521, 505, 470, 440, 431, 446, 471, 484, 476, 460, 455, 459, 464, 464, 459, 445, 429, 422, 425, 415, 381, 350, 360, 402, 427, 402, 349, 315, 315, 331, 338, 334, 324, 314, 306, 301, 296, 291, 292, 308, 338, 367, 379, 376, 371, 368, 350, 303, 247, 217, 225, 251, 272, 284, 282, 253, 202, 169, 184, 224, 244, 236, 233, 245, 239, 194, 144, 135, 163, 193, 201, 196, 189, 173, 144, 116, 97, 82, 69, 71, 95, 128, 144, 139, 129, 132, 145, 157, 169, 191, 218, 226, 196, 134, 69, 27, 14, 27, 62, 114, 159, 163, 119, 61, 44, 88, 151, 174, 145, 103, 88, 94, 96, 101, 129, 173, 190, 152, 89, 56, 71, 102, 109, 86, 65, 65, 79, 79, 56, 24, 2, -3, 4, 24, 47, 63, 72, 83, 95, 88, 55, 19, 6, 6, -8, -38, -57, -54, -37, -8, 38, 83, 92, 70, 57, 78, 110, 133, 153, 170, 160, 111, 65, 72, 127, 182, 200, 173, 112, 48, 21, 37, 51, 31, 10, 27, 63, 67, 42, 40, 77, 116, 130, 137, 137, 107, 57, 35, 60, 88, 90, 94, 120, 128, 75, -2, -35, -16, 2, -2, -7, 5, 21, 32, 52, 84, 116, 143, 179, 220, 237, 213, 162, 111, 72, 46, 41, 63, 103, 142, 164, 156, 123, 90, 76, 72, 59, 50, 73, 123, 155, 141, 108, 91, 93, 96, 99, 112, 122, 106, 63, 29, 33, 71, 112, 134, 137, 140, 147, 138, 99, 58, 63, 125]
788A25P1K8j6k3j8k8l6j8J6K4%k3k1pjnm%KK%nj3k0j9j1%J5K6J7j1k8j1K4L4Pk7l0j3jJJ0
782A3K0Rj5j6PJ9NpJ0K7Ol0k8PL0J7KOJ0knJ9L5Om1m8j2J0rk4PN8P5M8J4rl2n8n7k1K1K8M
777I9rmlk2l2j0K7L6J7jnj2k4j9J5L5J2k6l0KK3J2LK1L6J4k2k4OK3J0kkj1l3m5k2J0K3K0K2
772A08K1Kj7pJ8J6j3k6oJ2jj9j5oj6l6k8%J9J7J0J6K8L5L4K6Ml0n7n5k5J0K4Nj5qJ9K8Rrk
767G0J2NkQJ7nk7mL6K6l1m6QN6K3m0m5JK2nl3l0j1J4N1P6N1pl9j9jj8l2mL6L3ok4JK3J1j8
762A33k3ML6M1J5k1l8j6K1M3L0ol0k7nMrj9kK5K9PrjJ2J0KKjk2l9l1j1nnQJ9Pk1k6pMJJ1L7
756A27M4J7j3k4l0l8k9OK5jl3k0K0K4j0k9pJ6Mj7j2J1J8OJJ1K6K6Pk2m3m2j1K3L6K2%j0oo
752F7j6k2pJ9L3L0K6K7J8j0k5nJ6ro1o6j0M7M9J6qj2j0pRJ9J0prkmj5j5onnJ1L1L1Rpooj3
$$ y = [125, 196, 224, 208, 185, 167, 139, 103, 85, 101, 125, 125, 102, 81, 74, 73, 68, 64, 64, 66, 68, 68, 63, 50, 30, 11, 0, 0, 15, 41, 58, 47, 19, 8, 32, 66, 73, 46, 16, 3, 2, 3, 13, 33, 42, 27, 11, 18, 37, 42, 35, 45, 72, 78, 48, 20, 27, 57, 74, 76, 82, 92, 90, 85, 104, 139, 145, 104, 56, 44, 54, 45, 21, 28, 86, 161, 209, 223, 214, 182, 124, 67, 46, 67, 95, 99, 90, 86, 83, 61, 29, 19, 46, 82, 99, 98, 93, 81, 57, 38, 53, 88, 100, 74, 44, 46, 69, 81, 84, 105, 141, 155, 133, 109, 115, 138, 148, 146, 144, 133, 100, 55, 33, 43, 66, 86, 108, 129, 131, 114, 107, 125, 141, 128, 102, 96, 108, 107, 88, 73, 67, 51, 15, -13, -13, 6, 23, 33, 49, 77, 112, 146, 172, 176, 146, 89, 34, 9, 19, 43, 48, 33, 25, 44, 72, 81, 72, 70, 82, 87, 85, 93, 110, 105, 78, 74, 110, 136, 105, 59, 67, 123, 146, 106, 61, 62, 84, 79, 46, 16, 5, 19, 70, 146, 197, 190, 151, 132, 131, 113, 81, 77, 113, 146, 140, 116, 117, 140, 151, 133, 110, 114, 150, 191, 206, 185, 147, 131, 152, 195, 225, 219, 189, 162, 157, 161, 152, 133, 131, 156, 185, 192, 183, 182, 194, 204, 206, 208, 207, 185, 146, 115, 104, 99, 94, 102, 121, 128, 107, 81, 74, 78, 79, 90, 127, 171, 188, 175, 151, 121, 83, 54, 60, 85, 84, 51, 31, 51, 75, 65, 36, 29, 45, 49, 32, 20, 31, 49, 55, 56, 67, 93, 119, 126, 104, 61, 19, 8, 31, 67, 89, 89, 79, 73, 67, 51, 29, 22, 41, 74, 104, 130, 157, 175, 165, 140, 135, 151, 142, 81, 15, 5, 52, 101, 117, 109, 97, 87, 80, 89, 108, 118, 111, 102, 100, 96, 81, 66, 60, 55, 50, 61, 92, 123, 132, 125, 119, 113, 100]
746A00j5qlpqlnj3lK1K9Rj0pNM%PJ3Kk0k3j4j2j9rK0M1K6qk3mL2M0J7j2j6KJ1kj0OL1L2Mk5
741A73l1j8qj8m1m8j7K5M2L1K5M4N6K9j8m4l7j9lJ4K3Ok3l1nK3K3Kj4j3kPNoj5j0JPN%mj1
735A05j4j2orj9j5KJ8J7J0QJ3J1lk4l5j8J4L3K4J1K2L5J9j4j4K1L4ll6j4K7K3k4l6OM3J9l0
731A89l5RM6L4rl7l4k1k1l0k3J5O1O7J6m9n9jO1N3j7p1n7nK1PpPK5J7moJ4K7J4j0k0nJ6K6
726B04K0J4J7J6kl4n2m3j5J1K9L8L0mm3n3k1K2K9%k4j1J3J1j5k1MJ2k0m6j9L3M1ol9k2RJ6
721G9J9L9M8J6k3k3QK2Pnjkj6k1oJ3K3J7nl3l4ML9K0k6l7kK6J9ONqm1m7lM0K9noK0K3LOL2
716B19L5Kk8k6j6j8j7kJ2Jj5j3llpPK8K6kk4j6J4L5L2Pk8n1m5pL3M6L6K6K4J2j8l8k7MK1J8
711B34J5J2nl4m1j5R%k1j5PQj5k1J0N2O3L8%k5k1NK8K3j2m1l4OM4M2jn1n6j0M5N9L0ORK0J0
$$ y = [100, 85, 77, 74, 67, 59, 56, 51, 38, 35, 56, 85, 94, 84, 77, 82, 86, 86, 93, 106, 108, 88, 65, 51, 39, 20, 11, 31, 72, 98, 90, 67, 63, 95, 135, 152, 140, 124, 126, 137, 135, 125, 131, 162, 194, 198, 173, 142, 124, 116, 98, 57, 9, -8, 17, 59, 90, 115, 159, 215, 244, 226, 182, 145, 126, 123, 137, 160, 166, 143, 112, 107, 130, 153, 155, 141, 128, 126, 133, 138, 132, 117, 107, 108, 115, 120, 120, 116, 105, 91, 79, 73, 64, 45, 30, 32, 50, 67, 77, 85, 98, 109, 106, 82, 47, 29, 43, 76, 100, 111, 133, 168, 187, 173, 159, 180, 214, 211, 175, 161, 188, 211, 187, 151, 157, 200, 219, 189, 154, 163, 209, 243, 234, 197, 163, 142, 121, 91, 68, 83, 144, 211, 227, 178, 119, 118, 179, 232, 215, 144, 87, 82, 103, 110, 103, 110, 135, 152, 148, 142, 156, 183, 197, 187, 167, 162, 178, 204, 224, 238, 255, 271, 269, 235, 183, 140, 125, 136, 165, 203, 233, 229, 186, 133, 112, 134, 163, 163, 139, 128, 141, 152, 137, 116, 120, 132, 112, 66, 47, 80, 121, 115, 76, 54, 63, 79, 98, 137, 185, 201, 178, 155, 163, 185, 192, 187, 186, 184, 168, 147, 141, 154, 177, 194, 189, 156, 122, 126, 165, 185, 159, 122, 120, 146, 165, 171, 176, 168, 127, 80, 77, 117, 146, 141, 135, 155, 178, 181, 187, 219, 254, 256, 228, 202, 186, 168, 151, 149, 161, 162, 147, 134, 131, 128, 121, 128, 156, 182, 180, 156, 140, 154, 189, 221, 228, 200, 149, 104, 97, 130, 176, 212, 238, 262, 274, 256, 218, 191, 195, 216, 234, 249, 261, 256, 222, 181, 166, 175, 175, 154, 139, 146, 154, 139, 118, 128, 180, 243, 281, 281, 256, 235, 240, 268, 291, 279, 238, 204, 210, 254, 296, 295, 244, 188, 178, 223, 282, 312, 318, 327, 347, 357]
706C57k2n1o6o0l5JK7K8J8J1J0J1J5K9L7J2m0p3n4LL6J6k9l9kL8L8Oj1OL0K7Kj4rMJ1J5J9
701C02J9Oj5k9k6j6qmKJ0J2Nnj6k5k4j5jkj6k5nL2N1L0j4l8k1K0M2J9k0k7OL5K2j4l0j7ko
696A92rNK7L1K1J0RJ4J5J3J2J4J7J1qk9l5k6j7j1%K0L4L3K2J5Oqk7m3n4n1k2J7L6K9J8K5K7
691C33Ll2m2k2JJ3J9J6ll1k9PM6M8J6j9l6l7k3jJ4J0oj3lJ5K5K7J9Lj7k5j6lj0l0l0PN3O4
686C11K9j5l0j1Mrm1m8j2M4O2L2oj1M%j6j5PJ5%JK7M4K4JJ6L9J7m4p1l4K7M6J9j4k0ML2L3
681D41%l5l9j2J2J7J4Oj3l5l5j2Moj6lJ9K8K3J9J6RNOnk9l8j0K5K8QRK9K5j4m4l0jlk4k5%
676C14K0J8QNjrj2lKJNK2L1K1JpppNL9P1O5J5l4m8l4k1j7j0JJ1J3kk1k2PL9L3kj6J2L2Lm0
671D81l5J8N0K0l8n8k3L5P0N7J4k7m5m6l4lL9M7Ql6k3K5L7ll8k7NJ3NNJ1RQJ3J6QKJj3l6l1
$$ y = [357, 335, 284, 218, 158, 123, 124, 151, 179, 197, 208, 218, 229, 244, 273, 310, 322, 282, 209, 155, 158, 194, 210, 181, 142, 140, 178, 216, 222, 211, 217, 247, 274, 276, 262, 253, 257, 268, 283, 302, 321, 327, 312, 283, 257, 241, 233, 229, 231, 241, 253, 258, 253, 237, 212, 188, 173, 172, 170, 154, 129, 124, 156, 207, 237, 223, 185, 164, 184, 226, 245, 225, 198, 204, 239, 261, 247, 217, 200, 198, 192, 183, 188, 215, 246, 267, 277, 286, 300, 315, 328, 340, 354, 371, 382, 374, 345, 310, 284, 267, 256, 256, 276, 310, 343, 365, 380, 386, 378, 351, 308, 254, 203, 181, 198, 234, 263, 281, 306, 333, 336, 304, 262, 240, 241, 254, 273, 289, 286, 255, 226, 233, 279, 327, 343, 324, 288, 251, 228, 227, 241, 251, 245, 232, 229, 244, 269, 296, 315, 318, 301, 276, 260, 257, 247, 217, 187, 194, 247, 311, 340, 325, 295, 284, 288, 279, 238, 190, 178, 222, 284, 316, 310, 299, 303, 303, 287, 272, 279, 294, 294, 295, 322, 366, 390, 391, 407, 446, 463, 419, 348, 314, 341, 387, 406, 392, 372, 376, 408, 441, 441, 406, 367, 355, 367, 384, 398, 404, 391, 356, 321, 309, 313, 307, 291, 288, 307, 335, 358, 377, 393, 402, 407, 413, 408, 379, 341, 331, 356, 384, 392, 401, 430, 455, 441, 397, 367, 366, 363, 339, 314, 314, 334, 352, 360, 365, 364, 355, 343, 340, 342, 343, 348, 370, 401, 422, 423, 416, 409, 402, 407, 446, 517, 582, 597, 563, 515, 481, 460, 443, 433, 434, 445, 458, 456, 435, 413, 420, 459, 492, 490, 474, 486, 518, 521, 481, 446, 464, 514, 534, 496, 438, 415, 450, 520, 577, 591, 564, 519, 473, 439, 436, 475, 522, 530, 494, 471, 496, 533, 530, 492, 465, 470, 483, 488, 493, 504, 513, 521, 534, 550, 558, 560, 561, 548, 512, 481]
666D81K1P6Q2M9K0Nk1n2n1j2K5K7Lj4j8j5nJ2K6L5L3K5J4J2K1K6J2qmJ5K0%k1j7oj1k6k5n
661G29mk8m6j8L9P3N7J9j5m1o1m6J1P0P7M4K0J8Ok4l3j2Jj6k5jL1K9RMJ1PPK7M4K4j4k9j5
656I29KJ2L4M6K1k6l3J1N6M9Ml2l0PM2L1k0o0m1NK2J0J6M1L8kl1j9Lol2m6l1LL9M7J3k6j7
652A029K0K5KJ0N5O2Qm1k5R%k2rJ5kk7qM0M9J6lJ1J6NjMol6m2j4J6J7kk0k3nK2K4j3m0pN3
646A162N9jm9l2J4K9Mk6l7k4NK5J7j0j3OJ4JjL1O5N8J6j2j0%j5m3m7mN7P1K7k2j7J5J9j1k2
642A299LK4J3j2k6l2l0pK0J1l2n2j4L8M6J5qj1j8k9k4JK4K7J3mj4j0kmj3rNKk1k9lK7K3K%
637A189J3J1j0j6lO%pLJ2Nrj5pRK1L1L8L8K1j0l8m0j6J2K3J4rl9o0n6m0l1k4QN6P2L3j8j9
632A148K1M3K0j5j4K0N4N3K7NQJ7RlKRpl6k6K0M7K4j2k0j3j7j7MJ5pk4NN0N5K5QK1K5RjJ0
$$ y = [481, 502, 578, 660, 709, 729, 734, 713, 661, 610, 598, 623, 650, 653, 639, 621, 606, 601, 613, 639, 674, 707, 732, 746, 758, 779, 805, 817, 809, 805, 820, 840, 840, 819, 802, 796, 785, 759, 734, 729, 725, 697, 651, 633, 672, 745, 802, 821, 806, 765, 704, 658, 669, 739, 816, 860, 880, 898, 904, 880, 847, 835, 836, 820, 795, 794, 825, 854, 863, 867, 878, 885, 892, 919, 963, 987, 973, 944, 929, 931, 943, 977, 1023, 1044, 1018, 985, 996, 1052, 1101, 1105, 1073, 1043, 1050, 1092, 1123, 1103, 1043, 1002, 1007, 1029, 1039, 1055, 1096, 1134, 1132, 1101, 1082, 1085, 1079, 1047, 1001, 970, 973, 1012, 1059, 1072, 1046, 1029, 1049, 1074, 1076, 1086, 1141, 1203, 1211, 1170, 1145, 1154, 1154, 1132, 1123, 1138, 1136, 1109, 1101, 1141, 1190, 1206, 1203, 1214, 1230, 1235, 1234, 1238, 1232, 1196, 1154, 1140, 1156, 1173, 1171, 1151, 1128, 1123, 1145, 1169, 1156, 1116, 1109, 1162, 1221, 1220, 1171, 1139, 1153, 1182, 1186, 1160, 1123, 1099, 1104, 1129, 1146, 1136, 1123, 1129, 1143, 1144, 1143, 1174, 1239, 1297, 1313, 1301, 1291, 1291, 1276, 1233, 1186, 1182, 1239, 1310, 1337, 1315, 1298, 1313, 1332, 1321, 1299, 1302, 1326, 1339, 1327, 1301, 1269, 1239, 1232, 1252, 1263, 1231, 1179, 1165, 1203, 1249, 1264, 1256, 1245, 1227, 1198, 1174, 1175, 1199, 1226, 1239, 1235, 1221, 1211, 1209, 1205, 1192, 1183, 1188, 1190, 1169, 1140, 1137, 1164, 1187, 1189, 1189, 1202, 1213, 1203, 1187, 1184, 1190, 1190, 1183, 1186, 1198, 1203, 1194, 1179, 1172, 1181, 1202, 1233, 1271, 1309, 1330, 1320, 1282, 1242, 1226, 1238, 1261, 1275, 1266, 1227, 1167, 1111, 1071, 1040, 1016, 1024, 1080, 1152, 1185, 1167, 1148, 1169, 1212, 1232, 1217, 1203, 1223, 1277, 1330, 1357, 1362, 1370, 1387, 1396, 1393, 1395, 1404, 1397, 1361, 1335, 1355, 1402, 1426, 1414, 1394, 1381, 1364, 1347, 1351, 1366, 1359, 1335, 1340, 1390, 1445, 1470, 1478, 1499, 1524, 1533, 1532, 1542]
627A542K1J4ok1k4mK5K4j9m6nO2P0J1l1pL5L9J3JOKj5k4oK7N0L2j4l5MN9N7%l6j4K0K0MOJ6
622A853J5RJ9L9M9M8M6M1K1qk9k8nJ8J6kMM8Q0M9j1k5J5M5L2J7K6L3K1K0M0M5J9J2N0Q6P4
617B782N6Q9J56J90J75J56J44J25J04J00J10J03P4M1K3J9L2N4N0Rl8o4q6j24j54j43j11q5
614C787n7j8on2j00q3k1Kk3k2K7O3M4Lk6m7o0l6K0M5J7j5jM2O5O7P3Q9J04J28J67K14K52K88
610D930L05K85K43K19K20J97J34R0J01J28J16R3J04J17N9n9j45j73k04k74l37l43l14k88k53
607D951j91j30j19j36j30r6p2q1r2q3p1o6m8j6ql6m6OP1N9k4p4l5L0M4K0J6M3O8Q6J13J29
603D082J11Q5R5J31J33R1M9L8L5K9N1R8J11O5NoPj1o4j06j13j04r8r2q6q9r4q0m6j0J1Pj6
599D219m4n8m8k2%QKppJNj4l9m1j6jj9m2l4jJ9J2oj5j7j8j8mK3M4K4k5m0J2O9M8l5p8l3L1
$$ y = [1542, 1563, 1577, 1571, 1550, 1526, 1522, 1547, 1571, 1552, 1506, 1501, 1563, 1633, 1644, 1613, 1606, 1641, 1680, 1693, 1694, 1700, 1702, 1687, 1663, 1657, 1684, 1734, 1766, 1752, 1717, 1721, 1780, 1837, 1837, 1801, 1787, 1807, 1827, 1831, 1837, 1853, 1868, 1877, 1896, 1935, 1984, 2032, 2078, 2119, 2140, 2132, 2103, 2075, 2070, 2088, 2104, 2102, 2106, 2154, 2234, 2283, 2272, 2247, 2262, 2307, 2339, 2356, 2382, 2415, 2436, 2456, 2496, 2541, 2560, 2572, 2622, 2708, 2782, 2838, 2927, 3083, 3273, 3448, 3604, 3748, 3873, 3977, 4077, 4187, 4290, 4364, 4405, 4428, 4447, 4479, 4533, 4583, 4592, 4554, 4490, 4404, 4280, 4126, 3983, 3872, 3787, 3730, 3712, 3706, 3654, 3554, 3471, 3450, 3452, 3429, 3407, 3434, 3497, 3541, 3544, 3518, 3471, 3411, 3375, 3395, 3440, 3457, 3442, 3441, 3483, 3548, 3615, 3688, 3777, 3881, 4009, 4176, 4390, 4642, 4930, 5235, 5520, 5763, 5982, 6202, 6399, 6533, 6623, 6724, 6852, 6968, 7061, 7165, 7282, 7341, 7282, 7137, 6964, 6760, 6486, 6149, 5806, 5492, 5204, 4951, 4760, 4630, 4511, 4375, 4245, 4149, 4077, 3996, 3904, 3821, 3750, 3684, 3636, 3620, 3612, 3576, 3530, 3536, 3607, 3666, 3642, 3568, 3533, 3563, 3607, 3627, 3643, 3686, 3754, 3840, 3953, 4082, 4193, 4278, 4373, 4504, 4637, 4728, 4777, 4815, 4850, 4879, 4930, 5028, 5139, 5204, 5209, 5203, 5210, 5199, 5135, 5029, 4916, 4812, 4714, 4622, 4536, 4447, 4353, 4273, 4227, 4217, 4228, 4235, 4219, 4175, 4117, 4069, 4047, 4047, 4055, 4057, 4050, 4043, 4044, 4049, 4035, 3996, 3955, 3939, 3938, 3919, 3877, 3843, 3842, 3861, 3873, 3867, 3852, 3835, 3817, 3799, 3795, 3818, 3862, 3886, 3861, 3821, 3833, 3902, 3950, 3915, 3837, 3804, 3835]
594C835M6K9L4N0M8M2N6O2L5PK9P6Q2N1M1O8Q2O0M4N7O5M1J5J2K0J0nkJ3L3N6O6L8j7n1k9
589E099J8M6M4K9J1LK1N1M8Qk5j0L4N7M1J3opK0N9P8N9L3L0M0M0L5M9P0P2N8N9P8Q7P2N9O7
585F540R0J06J02Q3O4O9J10J58J72J46J21J26J44J54J68K03K43K57K55K80L41M09M57M95N50
582A1843O10O37O07N37M64M08L75L47L06K62K34K28K18J80J25O6k2j73l75n47o33o41o18n92
579A3846n61n13m41l55k82k54k52k23j57j07j16j44j25o9l8n0o4m8j9mjmnJK8O0P3O3N0M5
575A0334M3M8O4P2O0N8R2J27J06M9L6P7R6N1J0L9R4R6M7K2N0Q7R6P4N2N6R5J44J57J21P8P2
571A2703Q8R8J03J13J24J27J30J38J22Q3O9J07J49J40J04R8J21J33J34J59J88J71J22J02J23
568A5749J33J19J21J56J71J42J16J38J79J91J79J71J74J73J73J83J92J89J92K08K20K15K07
$$ y = [3835, 3881, 3910, 3944, 3994, 4042, 4084, 4140, 4202, 4237, 4244, 4273, 4349, 4431, 4482, 4523, 4591, 4673, 4733, 4777, 4834, 4899, 4940, 4955, 4967, 4987, 4997, 4992, 4990, 5003, 5036, 5092, 5158, 5196, 5179, 5128, 5099, 5117, 5163, 5207, 5236, 5247, 5250, 5271, 5322, 5370, 5378, 5353, 5343, 5377, 5434, 5475, 5488, 5482, 5475, 5495, 5554, 5632, 5691, 5724, 5754, 5794, 5834, 5869, 5918, 5988, 6060, 6118, 6177, 6255, 6342, 6414, 6473, 6540, 6630, 6736, 6838, 6921, 6985, 7054, 7164, 7322, 7494, 7640, 7761, 7887, 8031, 8185, 8353, 8556, 8799, 9056, 9311, 9591, 9932, 10341, 10798, 11293, 11843, 12453, 13090, 13697, 14234, 14698, 15106, 15481, 15828, 16134, 16396, 16630, 16858, 17076, 17256, 17381, 17447, 17425, 17252, 16877, 16330, 15697, 15056, 14438, 13846, 13285, 12772, 12331, 11976, 11694, 11440, 11188, 10965, 10808, 10701, 10585, 10441, 10316, 10247, 10209, 10159, 10095, 10047, 10028, 10024, 10023, 10019, 10014, 10015, 10043, 10103, 10176, 10239, 10289, 10334, 10377, 10425, 10489, 10561, 10621, 10679, 10771, 10898, 11004, 11053, 11089, 11166, 11262, 11313, 11323, 11362, 11456, 11552, 11599, 11621, 11671, 11758, 11854, 11928, 11980, 12036, 12131, 12275, 12432, 12553, 12631, 12703, 12791, 12889, 12992, 13105, 13229, 13356, 13486, 13624, 13746, 13829, 13898, 14005, 14154, 14294, 14398, 14496, 14617, 14750, 14884, 15043, 15231, 15402, 15524, 15626, 15749, 15882, 16001, 16122, 16278, 16449, 16591, 16707, 16845, 17024, 17215, 17394, 17565, 17739, 17912, 18085, 18268, 18460, 18649, 18841, 19049, 19269, 19484, 19691]
565A9691K15K26K24K11K05K10K23K47K68K71K62K63K78K87K95L23L59L64L32L11L32L58L47
563B6102L22L39L92M34M38M30M37M63M83M68M23L88L98M31M41M30M45M89N09M85M69M92N12
560C6220N01N02N54O03N85N47N67O31O60O60P04P99Q71Q96R32J010J081J120J179J290J412
557E3324J510J610J745J883J999K121K281K461K644K869L164L487L809M181M678N302O044
555A05112O961Q137R567J1214J3101J5291J7787K0509K3274K5609K6692K5800K3003J9288
553C51345J5838J3230J1372R991Q967Q299Q016Q085Q148P229M021k169j0597j9288k6167l0156
551C66164l1405l0707k8793k6061k2776j9285j5970j3063j0610q580o925n548m334l245k334
550A36528j597r29k38M84J229K035K908L765M578N458O533P811R280J1053J3281J5993J9170
$$ y = [19691, 19906, 20132, 20356, 20567, 20772, 20982, 21205, 21452, 21720, 21991, 22253, 22516, 22794, 23081, 23376, 23699, 24058, 24422, 24754, 25065, 25397, 25755, 26102, 26424, 26763, 27155, 27589, 28027, 28457, 28894, 29357, 29840, 30308, 30731, 31119, 31517, 31948, 32389, 32819, 33264, 33753, 34262, 34747, 35216, 35708, 36220, 36721, 37223, 37777, 38380, 38965, 39512, 40079, 40710, 41370, 42030, 42734, 43533, 44404, 45300, 46232, 47242, 48323, 49443, 50622, 51912, 53324, 54834, 56444, 58189, 60072, 62071, 64192, 66473, 68934, 71578, 74447, 77611, 81098, 84907, 89088, 93766, 99068, 105112, 112073, 120210, 129777, 140991, 154092, 169383, 187170, 207679, 230953, 256562, 283254, 309054, 332057, 351345, 367183, 380413, 391785, 401776, 410743, 419042, 427058, 435143, 443291, 450520, 454541, 452372, 441775, 422487, 396320, 366164, 334759, 304052, 275259, 249198, 226422, 207137, 191167, 178104, 167494, 158914, 151989, 146441, 142107, 138862, 136528, 134931, 134002, 133764, 134248, 135477, 137512, 140420, 144185, 148763, 154221, 160754, 168565, 177845, 188898, 202179, 218172, 237342]
548B37342K2886K7222L2132L7543M3359M8938N2585N2274M7408L9699L1946K5967K1876J8972
546G40149J6775J5229J4494J4752J5668J5541J1403Q65j5599l4247n0211o0295o4174o3424
544E56926n9840n4535m8127m1244l4619k8810k4007k0124j6984j4420j2291j0508r009p722
542A74686o586n649n019m703m552m373m068l591k898j985r36J97J481K995M701O529Q532J0803
540A65564J3314J5968J8741K1513K3709K4383K2960J9860J6238J3117J0842R251Q104P279
538C90843O765O637O854O902N636J837m785j3048k0847k6392k9037k9160k7535k4861k1700
537B28109j8505j5601j3130j1116r503q177p013n971n092m375l717l062k575k559l196m357
535A10160n665o720p291p358p063o576n991n324m604l909l332k899k581k333k129j948j773
$$ y = [237342, 260228, 287450, 319582, 357125, 400484, 449422, 502007, 554281, 601689, 641388, 673334, 699301, 721177, 740149, 756924, 772153, 786647, 801399, 817067, 832608, 844011, 844876, 829277, 795030, 744819, 684524, 620350, 556926, 497086, 442551, 394424, 353180, 318561, 289751, 265744, 245620, 228636, 214216, 201925, 191417, 182408, 174686, 168100, 162451, 157432, 152729, 148177, 143804, 139736, 136145, 133247, 131262, 130326, 130523, 132004, 134999, 139700, 146229, 154761, 165564, 178878, 194846, 213587, 235100, 258809, 283192, 306152, 326012, 342250, 355367, 366209, 375460, 383564, 390843, 397608, 404245, 411099, 418001, 423637, 425474, 420689, 407641, 386794, 360402, 331365, 302205, 274670, 249809, 228109, 209604, 194003, 180873, 169757, 160254, 152077, 145064, 139093, 134001, 129626, 125909, 122847, 120272, 117713, 114517, 110160, 104495, 97775, 90484, 83126, 76063, 69487, 63496, 58172, 53568, 49659, 46327, 43428, 40847, 38514, 36385, 34437, 32664]
533C2664j595j436j316j216j094r37p81o64n83n00m01l00k01r4J7J10J92L20N32P94J051J288
530B5850J534J784J974K028J920J691J423J189J022R14Q57Q52Q89R40R90J012R13N39j64j027
527D7130j770k240k471k552k492k294k016j732j468j245j130j145j215j229j178j126j086
525A8741j011q87p71o80n77m46l44l22l37l20k65k15j86j57j27j14j23j30j24j29j55j82j83
523A0956j56j21r7q6p7n7k8KK5N4J06J80K50K93K99K74K48K37K34K10J57J09R7J12J30J36
519A3487J31J08N3k6j10j89k67l35l80l92l78l38k69j97j58j52j35q7l7k1k5jO4J26J47J40
516A0759J53J88K12K03J94K26K87L27L26L20L37L64L84M12M66N21N43N48N75O29O76O99P26
513B0075P62P75P39O76O22N80N27M52L58K58J63Q2Qp1j52k36l48n07o95q59r71j040j084j103
$$ y = [32664, 31069, 29633, 28317, 27101, 26007, 25070, 24289, 23625, 23042, 22542, 22141, 21841, 21640, 21546, 21563, 21673, 21865, 22185, 22717, 23511, 24562, 25850, 27384, 29168, 31142, 33170, 35090, 36781, 38204, 39393, 40415, 41329, 42186, 43038, 43927, 44867, 45857, 46869, 47782, 48321, 48157, 47130, 45360, 43120, 40649, 38097, 35605, 33311, 31295, 29563, 28095, 26850, 25720, 24575, 23360, 22131, 20953, 19827, 18741, 17730, 16843, 16072, 15392, 14815, 14369, 14025, 13703, 13366, 13046, 12781, 12566, 12380, 12223, 12096, 11982, 11859, 11729, 11605, 11476, 11321, 11139, 10956, 10800, 10679, 10582, 10496, 10419, 10362, 10334, 10336, 10361, 10415, 10521, 10701, 10951, 11244, 11543, 11817, 12065, 12302, 12536, 12746, 12903, 13012, 13109, 13221, 13351, 13487, 13618, 13726, 13779, 13753, 13643, 13454, 13187, 12852, 12472, 12080, 11702, 11364, 11095, 10898, 10740, 10588, 10453, 10366, 10329, 10308, 10283, 10282, 10346, 10472, 10619, 10759, 10912, 11100, 11312, 11515, 11709, 11935, 12222, 12549, 12875, 13195, 13532, 13896, 14280, 14692, 15158, 15679, 16222, 16770, 17345, 17974, 18650, 19349, 20075, 20837, 21612, 22351, 23027, 23649, 24229, 24756, 25208, 25566, 25824, 25987, 26069, 26077, 26006, 25854, 25618, 25270, 24763, 24068, 23209, 22238, 21198, 20114, 19011]
510A9011j118j142j154j111j018r40q97q53p79p04o54n96n09m38m23m23l81l10k63k50k35
508D813k21k23k16j56p4m4p3r8q9p7p7n7j2K1K8L8N3K6m3p2k3K7%o7q2m2k2l8m6l1l8q3j18
504B884j10r0j04j44j69j60j22q4o9q6r8o9j1J7j1n6p2n4l4l2m1n0n3n0l7k1mQJ3Pnj5j6j7
500A045j8j1NJ9K0Rj1k8l2k2lJ1K1L5M9M6K3j1k8k5j3j0k2l6m2l0rJ5K5J2k0m6l9j1Kj5l4
495H21k6lKj5k2rlk3n0n5l4j6j8k2nL6O4N0Jm3n8m5j3L1O7O9L6LJJ9L3L2K5J4J2L5P1P2K8
490A062MN7J41J57R5N2Q8J44J47J10R1J02R5N3Lj6lK5M1L3J2kk3q0j54j89j64j38j63k05j95
487A180j33q3p0o5n2m7m9l9k2k0l6l6k3k5l9k2K9O5N2L0M7P4O3K5J4N0J05J48J70J66J55J69
483A781K23K71K70K46K47K54K10J23P9R8J13P3K9M5Q5P8K2l6q6j65k68l48l79l86l74l31k61
$$ y = [19011, 17893, 16751, 15597, 14486, 13468, 12528, 11631, 10778, 9999, 9295, 8641, 8045, 7536, 7098, 6675, 6252, 5871, 5561, 5298, 5048, 4813, 4592, 4369, 4153, 3997, 3923, 3879, 3806, 3708, 3619, 3542, 3465, 3408, 3396, 3417, 3445, 3483, 3536, 3562, 3519, 3447, 3424, 3451, 3451, 3384, 3302, 3260, 3238, 3200, 3154, 3123, 3085, 3002, 2884, 2774, 2684, 2580, 2436, 2267, 2107, 1985, 1901, 1832, 1746, 1648, 1579, 1568, 1585, 1574, 1518, 1446, 1392, 1358, 1326, 1285, 1235, 1182, 1132, 1095, 1074, 1070, 1078, 1091, 1098, 1093, 1078, 1062, 1045, 1027, 1016, 1021, 1040, 1060, 1069, 1058, 1030, 998, 976, 973, 984, 1005, 1040, 1089, 1135, 1158, 1147, 1119, 1094, 1081, 1071, 1049, 1013, 971, 941, 932, 947, 972, 984, 964, 918, 879, 868, 870, 855, 821, 795, 792, 794, 779, 757, 748, 745, 722, 672, 617, 583, 567, 549, 527, 522, 558, 622, 672, 673, 630, 572, 527, 514, 545, 612, 681, 717, 720, 721, 740, 773, 805, 830, 844, 856, 891, 962, 1034, 1062, 1066, 1123, 1264, 1421, 1516, 1568, 1656, 1800, 1947, 2057, 2148, 2250, 2345, 2398, 2401, 2385, 2382, 2407, 2448, 2481, 2493, 2491, 2468, 2388, 2234, 2045, 1881, 1743, 1580, 1375, 1180, 1047, 964, 894, 829, 777, 730, 681, 642, 620, 600, 564, 528, 505, 480, 441, 419, 448, 513, 565, 595, 642, 716, 779, 804, 818, 868, 973, 1121, 1291, 1457, 1612, 1781, 2004, 2275, 2545, 2791, 3038, 3292, 3502, 3625, 3704, 3802, 3915, 3988, 4017, 4062, 4147, 4225, 4247, 4211, 4125, 3960, 3692, 3344, 2965, 2579, 2205, 1874, 1613]
479A613k06j85j64j16p2o7p9p0m3k8l4l8m5n8n7k5J5J9oj0J6L0J0j0MK9L4K9M2O8Q9J11J43
475I39J63J42J01Q4Q9P3L8K8N5P0L6qpL0M4Lo5j15j34j38j41j47j42j23j02j00j05r0n7m3
472C78o5q0n4nJ6QLll5p5o7rK5nm2l2%j3n9p0k6K3L7K4Pj7m3l9%L1J3l4n9l7J4N1L7j8o1m5
467c26J5N5M3J1jok4l6j4K3L4J2rmRJ5K3M4N5L2j2m0k7RK6jl8l3J5M8K2l3n2k2N%j1jJ5Qj8
462a89l3k8k0j9j9j1JJ2K2K7J7pk4j6J5L4J9j3k1JJ7Mj8j8LJ3J0Llj5k0pJ5J7KqpolJ3K7J2
457b21k6l9j7Jj0l0k7j1orj0oJJ7K6Nl4l9OL7Om4m8rJ1MPL7N1K2k0k9KM6P4O4J8l0m0j6QJ4
452b64RMMJ1K0Qk9m8k5Kj3m0j7M0M2k3p0l8J4K0jJJ5kl0k2Jrm1k9L4O6K7k5l4k2l7n8k7M1
447e45P2L6j5k3kKj4j1K0L4mm9m6ML3J5j2j0J2J6MnMJ6K3J7%j9j9JJ3Jj0jRj2l5j6L1L8nm4
$$ y = [1613, 1407, 1222, 1058, 942, 870, 803, 724, 654, 611, 583, 549, 511, 466, 408, 351, 326, 341, 360, 354, 344, 360, 390, 400, 390, 394, 423, 457, 486, 528, 596, 685, 796, 939, 1102, 1244, 1345, 1429, 1518, 1591, 1629, 1657, 1712, 1782, 1818, 1810, 1803, 1833, 1877, 1880, 1815, 1700, 1566, 1428, 1287, 1140, 998, 875, 773, 673, 568, 478, 421, 378, 313, 233, 179, 174, 190, 198, 201, 198, 163, 88, 21, 12, 37, 32, -10, -42, -42, -55, -114, -184, -210, -187, -150, -126, -119, -136, -179, -218, -218, -187, -174, -208, -267, -304, -290, -239, -202, -220, -281, -326, -311, -256, -213, -202, -203, -209, -233, -269, -283, -260, -226, -214, -223, -227, -218, -203, -180, -136, -81, -49, -61, -101, -128, -119, -93, -94, -132, -165, -150, -102, -80, -113, -165, -187, -182, -182, -193, -194, -179, -171, -189, -222, -250, -270, -289, -308, -319, -318, -306, -284, -257, -240, -247, -271, -287, -272, -238, -219, -232, -253, -252, -235, -231, -249, -267, -264, -251, -241, -238, -241, -256, -276, -283, -268, -251, -249, -257, -264, -270, -273, -260, -233, -221, -247, -286, -303, -302, -312, -342, -369, -380, -386, -395, -405, -411, -410, -393, -367, -362, -396, -435, -429, -392, -386, -430, -478, -487, -476, -472, -465, -428, -377, -355, -375, -404, -402, -356, -282, -218, -200, -230, -270, -286, -278, -264, -255, -251, -247, -236, -216, -208, -237, -285, -310, -308, -321, -361, -378, -338, -296, -319, -389, -427, -413, -393, -394, -393, -378, -380, -410, -432, -431, -440, -481, -510, -476, -410, -383, -408, -442, -464, -501, -559, -586, -545, -473, -437, -452, -475, -477, -475, -489, -500, -480, -446, -450, -499, -545, -541, -508, -493, -505, -515, -503, -487, -483, -488, -484, -468, -445, -428, -428, -447, -466, -465, -452, -451, -461, -462, -453, -465, -500, -516, -485, -447, -452, -496]
442d96l2JOqmJ4J7Jj0nnj6j8mMnj7j0J2K8L2L6K9km3n3k2J4J9RJ7L7L8J2j3k1k6k3ON2O3J4
436c72m5n6k3KjnNJ8J6Jj9k9j4J7L4J8j2k9l5m0l2KL1K0j3j4J9L1QjK2L2rm6k2K9L0j9m5j9
431e65Mj8m4k0L8O8M8J5%mj3j8mJ9K3Jj9j1K1M4M2J8rl3m1k7KK7L5L1J4j0k6j6OQj4k5rMk0
426d78n4n4j8OLJJ9K7Mj9nL1M2J0k9l5rJ8J7kj6j1MQnj9k2j0J1L5M5L5J7RJ1ml7n4k7K1M5
421d89L1J1J0J8J2jj0j1j4j8j3jORK1L7K8j1m9m2J0N1L9j4m4j9J9J4k9m8k0J5J3mJ5N4N1l
417c76m8m0j2nj2KL1L6J1j8l3l0j0K3L5J3j9j7PJ1oj2nj1k5j2K0K3j3l1LL5J9k0k5LJ9J1l
412d81j5k9k0K8P9Q1L2k0m7n1l1J2M6L9Lj7k4m0n1k1L8O0K2k4l2k0j7j0J4K5ml6k5J2K2j0
408e12l9k3K4N5M8J5k1l4k3kJ4J9J3%qkO%j0rK%j3j5jJ0QJ1L0L5J3j2k1k8m4m5j4J2jk3JN0
$$ y = [-496, -528, -527, -521, -529, -533, -519, -502, -501, -511, -516, -521, -537, -555, -559, -555, -560, -577, -587, -575, -547, -515, -479, -450, -452, -495, -548, -570, -556, -537, -528, -511, -474, -436, -424, -437, -458, -484, -507, -501, -449, -386, -372, -417, -473, -496, -494, -495, -500, -495, -477, -461, -460, -479, -508, -522, -505, -471, -453, -465, -494, -529, -569, -601, -599, -568, -548, -561, -575, -556, -525, -517, -518, -496, -464, -473, -519, -541, -512, -482, -501, -546, -565, -561, -579, -623, -643, -605, -537, -489, -474, -474, -478, -491, -509, -513, -494, -471, -470, -489, -500, -479, -435, -393, -375, -384, -417, -458, -485, -483, -456, -421, -390, -376, -386, -412, -428, -422, -414, -428, -453, -462, -458, -478, -532, -586, -604, -598, -595, -594, -575, -548, -544, -563, -568, -537, -495, -485, -514, -549, -558, -540, -523, -525, -541, -552, -548, -540, -545, -564, -586, -596, -585, -550, -505, -470, -453, -444, -433, -437, -474, -528, -555, -534, -489, -458, -447, -437, -419, -407, -408, -418, -429, -443, -461, -474, -475, -469, -460, -439, -402, -374, -385, -434, -476, -466, -415, -376, -390, -434, -453, -434, -420, -449, -497, -517, -502, -489, -493, -478, -424, -373, -376, -424, -464, -476, -481, -493, -491, -460, -424, -413, -431, -464, -494, -504, -481, -446, -433, -452, -469, -462, -451, -457, -469, -474, -485, -510, -522, -502, -479, -492, -523, -520, -485, -466, -486, -511, -508, -489, -478, -481, -496, -525, -545, -517, -438, -357, -325, -345, -392, -443, -474, -462, -416, -377, -374, -391, -415, -455, -506, -527, -489, -429, -407, -431, -463, -483, -500, -510, -496, -471, -475, -511, -536, -524, -502, -512, -551, -574, -550, -495, -447, -432, -453, -487, -510, -512, -498, -479, -466, -466, -474, -476, -470, -470, -480, -489, -487, -487, -500, -515, -516, -506, -498, -487, -457, -422, -409, -421, -442, -470, -514, -559, -573, -561, -562, -585, -584, -534]
403e34N6J0k5j6Ljj0KJ8J2qj2oj1k4k3JK5L0J4pj0NJ9Mk9m2j7J7K5Mk4l5k4J3N5N8J3l3l2
398e39NK0ol6l0q%polm%L1P0O5J2l1j7K2K7lk0j0rl4m5j3L1L2jk1lK6L7K8J4NJ1L1M1K0j0
392c28j7pk0n5o4k4K3L0J7K2L3J1l4n3k4J7L4K7J4mk5l1j6kj0k3j5PJ9J3J6L7N0L0ql8n1n4
388e03m2j0K9M2K6%k2m1n4m2j3RRJ3K8L1kl2k0J9L3J5J1K7K1j3k8LL6K1j1j2J3J1j4k0NK6
383d51J9Kj0k4l2pM4O7L4k0l7j4J0J5J4J6J4Jj0j0JP%j7k7j2K5M0J1l6m4mL3K3j5k8NL9L0
378c48j1l4j5J9K9Rj4k3j8pJ8M6N7L6Oj4k3l9n1l8KK7K0PK0M2L2oj9J1M3K3k9n0k6JNOK2K9
374b55Lk3j1K5K8jj5QL3L0K0K6L2J8llQKj5j3J3L6L6K6K5K5L0M9O6N1Oj9J1N8P1M6K7K9K7
369E07Mj2NM2O2N4L8L2L2K5J1MLO%j1k0k1j9j9j9j1PK3J9kk2k4j5j3k7m4m2j4J7K3lk3kM8
$$ y = [-534, -478, -468, -493, -509, -506, -507, -517, -515, -497, -485, -493, -505, -511, -522, -546, -569, -568, -543, -513, -499, -506, -516, -511, -492, -488, -517, -559, -576, -559, -534, -530, -554, -589, -613, -600, -545, -487, -474, -507, -539, -534, -514, -520, -556, -586, -594, -594, -601, -607, -610, -614, -614, -583, -513, -448, -436, -467, -484, -462, -435, -438, -458, -468, -477, -511, -556, -569, -538, -506, -507, -528, -531, -505, -468, -440, -426, -421, -410, -379, -338, -318, -328, -345, -352, -372, -427, -491, -515, -492, -462, -445, -423, -390, -379, -413, -466, -490, -473, -439, -412, -398, -402, -427, -458, -474, -476, -486, -509, -524, -517, -498, -485, -469, -432, -382, -352, -360, -398, -449, -503, -545, -555, -526, -484, -458, -458, -480, -521, -575, -617, -630, -621, -612, -599, -571, -540, -542, -574, -594, -575, -542, -527, -516, -489, -468, -481, -509, -506, -470, -449, -460, -472, -459, -448, -462, -482, -477, -451, -432, -430, -440, -464, -496, -503, -459, -392, -358, -378, -415, -429, -419, -404, -390, -374, -360, -359, -369, -379, -378, -371, -371, -388, -415, -427, -402, -362, -351, -387, -431, -435, -402, -379, -394, -422, -417, -378, -348, -359, -393, -408, -389, -360, -351, -365, -388, -406, -413, -395, -349, -292, -256, -250, -264, -287, -326, -377, -415, -413, -386, -366, -359, -339, -297, -265, -271, -290, -279, -236, -213, -242, -292, -318, -317, -312, -306, -284, -255, -252, -275, -286, -261, -233, -234, -249, -241, -208, -178, -158, -132, -100, -82, -85, -88, -80, -78, -93, -106, -93, -57, -21, 5, 30, 55, 85, 134, 200, 251, 257, 238, 249, 307, 378, 424, 451, 480, 507, 511, 499, 504, 546, 608, 662, 700, 732, 764, 789, 800, 804, 807, 813, 813, 802, 782, 761, 742, 723, 704, 693, 700, 723, 742, 740, 718, 694, 679, 666, 639, 595, 553, 539, 556, 579, 576, 553, 551, 599]
364E99P7O1K9K3M2O4P9R9J15J02P1O8J00J20R1M3K8M5N2L1J0J5L6M6L4Ok5m6n8p8j17j56j64
360A442j32r2p3q4j05j16r9n9k6k5m6n2l3j6k0k7j8MJ8J2mj5oK8N8N2J2k0qK4L6K3J8L3N1
356G35N1L6K9M7P8Q8M9j0l1jK7Pk7j6L3M6Jn1n9l4j6j2j6l0n2o0m2k7l6n3m5j5NKqj3k4l4
351E22k6pmk1k9nL1L9J4j6j7J4M6M8J9j7l3k1KJ6Mk1l5j2L4O6N3Rl0m1j8K2M9L4j6n9o2m5
346D87m3m6j5M4O6K7k3l1ojk3k9jL7M5K2j7m2l4LL5L5K1K5L4J1l6n2j3K7J9j6k2kMoOM1N0
342E81J6j6j2Mpl4l9k2j4j5oPrm3n0k1QNoopj7j7J1L5J8k1m0k6j9k9l2j3RJ2MORkk2k4QN4
336B18O9L8j5l8k2NNj3j9oJ2L1L4Pn1r3o7JL8J6k0k4mO%mj4k8l4k0pj3k2jL4L7Jm1m9k4OJ6
331e5Oj5k7k6j9nJ4K5Nl8n6k2K4L2Lj4KK3K4J3%qoPJ7%k2j7J5K8jm9p8p2l6PK0j4n3l9J6M0
$$ y = [599, 676, 737, 766, 789, 831, 895, 974, 1073, 1188, 1290, 1361, 1429, 1529, 1649, 1740, 1783, 1811, 1856, 1908, 1939, 1949, 1964, 2000, 2046, 2080, 2086, 2061, 2015, 1957, 1879, 1762, 1606, 1442, 1310, 1218, 1145, 1061, 956, 840, 741, 682, 656, 631, 585, 533, 500, 484, 464, 437, 419, 423, 441, 453, 449, 434, 428, 456, 514, 566, 578, 558, 550, 574, 610, 633, 651, 684, 735, 786, 822, 851, 898, 976, 1064, 1113, 1103, 1072, 1071, 1098, 1105, 1078, 1062, 1095, 1141, 1142, 1091, 1032, 998, 982, 970, 954, 924, 872, 812, 770, 743, 707, 654, 609, 594, 599, 601, 593, 580, 556, 522, 496, 489, 485, 464, 435, 430, 461, 500, 514, 498, 481, 495, 541, 589, 608, 591, 558, 537, 539, 555, 559, 538, 503, 491, 525, 591, 644, 653, 623, 582, 564, 586, 635, 669, 653, 594, 532, 487, 444, 398, 383, 427, 493, 520, 497, 466, 460, 459, 436, 407, 406, 443, 488, 510, 493, 451, 417, 420, 455, 490, 511, 536, 570, 581, 545, 493, 480, 507, 526, 510, 488, 486, 490, 484, 490, 531, 581, 597, 581, 569, 573, 566, 532, 493, 471, 457, 442, 436, 443, 434, 391, 341, 320, 328, 333, 327, 321, 314, 297, 280, 291, 326, 344, 323, 283, 257, 238, 209, 177, 164, 173, 185, 189, 195, 204, 202, 180, 156, 164, 218, 287, 325, 310, 272, 250, 255, 260, 247, 228, 222, 234, 265, 299, 306, 255, 162, 95, 96, 134, 150, 130, 106, 102, 108, 108, 104, 90, 62, 28, 8, 1, -12, -34, -35, -1, 36, 37, -4, -53, -77, -71, -55, -49, -64, -91, -117, -136, -141, -127, -102, -97, -135, -191, -213, -189, -157, -154, -168, -166, -143, -119, -106, -106, -114, -120, -113, -96, -96, -118, -135, -120, -92, -93, -142, -220, -292, -328, -321, -301, -315, -368, -407, -391, -351]
326c51Ok9j7J4J3orLKoJJ4%l3m5k6rj3k7l8m4l7jM0M8J9j2j5%J3K1K1Jk8m1l1j7mJ9L8J7l7
321e86n9j6L1K1k5l6KK8J1j5pK0L3K5J3kj5j2K1N2M2jk6pK7K8kk7k3mJ1J8J9Oj4k7k3j5j4
316e48j6pJ3L1M5M3J5l7p0n0kJ8KnK1L8Rl6l9%K4Mk4k7j6j9j8K1P6Q7L2l6n1k5rk5l3qJ9J4
311e89qj2JJoQL6M4J5j2j0K%ojQRMpl4p1p1k2K9L7K3K9M2J3l6m1RM5K5j5k7k2k4k7j4LkrO
306f77L3L8K2J1J1PJOJ9J6j0l6m3l0qJ0J2lk1k3pJ4K7J9j7n9n5PO9P1K5npj2k8j9J2J6k0m0
301f74j0K3Rj6PM7L0l7o4j9K8K1pKL0K4j0j7J3L4J7j0j3orj3MK3J6j7k9JL9L5j1m5l2MK2J3
296e97LPJ2Nrj4j1kJ6L0J9j3l1j1K5L8J8oj5j2j6k0j6lJ2J6Qoj7j5nKOQPMKRJ3Nrj2nkrj3
290f04pLJ2J4Pj2l1l1j4NJ6L0L3Rl0l6MM3L7Npnj5l8l5qJ1MMK0K5%l2l5j2RK3L1K6%k8l3k0
$$ y = [-351, -345, -374, -391, -377, -364, -370, -379, -376, -374, -380, -379, -365, -365, -398, -443, -469, -478, -491, -518, -556, -600, -637, -638, -598, -550, -531, -543, -558, -558, -545, -524, -503, -502, -530, -571, -602, -619, -623, -604, -566, -549, -586, -645, -661, -630, -609, -634, -670, -668, -640, -629, -644, -651, -631, -598, -573, -560, -562, -577, -589, -568, -516, -474, -475, -501, -508, -481, -453, -455, -482, -505, -509, -498, -480, -461, -455, -469, -496, -519, -534, -548, -564, -571, -558, -527, -482, -439, -424, -461, -531, -581, -583, -565, -563, -568, -547, -509, -500, -536, -575, -575, -551, -547, -571, -598, -614, -633, -651, -630, -554, -467, -435, -471, -522, -547, -556, -581, -614, -622, -603, -589, -597, -609, -608, -607, -613, -605, -569, -525, -510, -522, -532, -530, -530, -536, -537, -529, -520, -516, -523, -557, -628, -699, -721, -692, -655, -632, -603, -561, -548, -584, -625, -616, -571, -546, -561, -588, -610, -634, -661, -675, -672, -674, -683, -677, -644, -606, -584, -573, -562, -555, -554, -548, -529, -513, -523, -559, -602, -632, -640, -630, -618, -621, -642, -665, -672, -658, -631, -612, -629, -688, -743, -736, -667, -596, -571, -576, -583, -595, -623, -642, -630, -614, -634, -674, -684, -661, -652, -668, -661, -614, -584, -621, -685, -704, -676, -655, -662, -660, -630, -606, -616, -633, -620, -586, -569, -579, -592, -598, -607, -620, -616, -593, -577, -594, -623, -622, -583, -548, -559, -604, -636, -632, -610, -597, -594, -587, -575, -570, -579, -593, -604, -606, -590, -560, -541, -554, -585, -596, -571, -533, -515, -521, -536, -548, -564, -584, -600, -603, -591, -575, -567, -573, -590, -605, -610, -608, -602, -594, -587, -583, -581, -572, -559, -554, -563, -575, -580, -582, -591, -604, -611, -608, -596, -582, -575, -587, -618, -649, -663, -658, -642, -612, -579, -570, -600, -636, -632, -589, -552, -547, -554, -559, -574, -612, -647, -655, -644, -640, -636, -616, -591, -591, -623, -658, -670, -661, -638, -607, -581, -581, -609, -642, -662]
285f62j5j1RL4K6j4l4lL8L2qj7J5L4J1j9j4%j3l3j6K2K4j5l1kJ9pk6PN4M1j2l3oJ5NKJ9J8
280e66j7l9j5K1J0l0m7k0J9M4N0M3K2nk7l9m0k2OK2J7PLlj3j2JLj5l0j6LLj1j1pj3j8PM4N1
275f40K3%%Jo%J7J8lj8pJ6L7N4N2J6l7n3k1J5J0k2m3m6m3k9pMmnJ6L3J7pML5L5ml1k4m%OL4
270f11O3N5Om4n5k7OK0J1kj1j5j6j0nj3k5j4J4K1pk4KL4J7k9l9lJ9nk7pK6K2rj7J6M1K5j5
265f32m1l1KK2J8jrKJ4J2Jqj1pJ1M5O4M5kl8m3l0j6r%PRQMnj9k0rJ0K0J7J0J0J7K6K7J9Jj7
260e27k7k6j2J2L2L8K0rl5m7m7l3rQMj6k3rLjJL2N9L1l8p0k2M6N8J6k1l0l5m2k3K0M0J5k5
255f92k6J2N2O0L1j7m6k4K5M4Nm2m5j3MmrPK1J8Omj0j2pnrmK3M5K2l0n3k4J5K0J5K4L4J7m
250e80J3M3K9k9n9k8J6J4j9l0j1LJ1K6K9%l7k6J8K7j7m8j8K6K2j2j1K7N0L3Nj7l6m2k0J7K8
$$ y = [-662, -677, -688, -679, -645, -619, -633, -667, -670, -632, -600, -608, -625, -610, -576, -565, -584, -598, -598, -611, -644, -660, -638, -614, -629, -660, -662, -643, -650, -676, -669, -615, -574, -586, -619, -625, -610, -605, -603, -584, -566, -583, -622, -637, -616, -606, -636, -683, -703, -684, -640, -590, -547, -525, -530, -557, -596, -636, -658, -652, -630, -613, -606, -603, -606, -619, -631, -630, -627, -642, -672, -688, -685, -682, -693, -704, -711, -724, -742, -735, -691, -640, -617, -617, -617, -616, -622, -622, -605, -587, -590, -608, -615, -599, -562, -508, -456, -440, -477, -530, -551, -536, -526, -548, -591, -637, -680, -709, -716, -712, -716, -721, -705, -672, -655, -662, -658, -623, -588, -592, -623, -647, -651, -651, -645, -611, -548, -493, -487, -531, -586, -613, -607, -587, -576, -578, -589, -604, -620, -630, -635, -648, -673, -687, -673, -652, -659, -683, -681, -647, -630, -659, -698, -701, -682, -687, -714, -721, -695, -673, -682, -699, -683, -642, -617, -632, -673, -704, -702, -680, -662, -663, -672, -670, -656, -644, -643, -651, -662, -669, -658, -613, -549, -504, -506, -544, -587, -617, -633, -642, -642, -635, -626, -618, -614, -619, -638, -658, -667, -657, -637, -620, -610, -600, -583, -557, -530, -511, -510, -527, -554, -580, -592, -580, -548, -510, -490, -499, -534, -581, -628, -661, -670, -662, -658, -674, -697, -706, -703, -704, -703, -671, -612, -581, -619, -689, -711, -665, -607, -591, -612, -642, -677, -719, -742, -722, -682, -667, -692, -718, -706, -654, -594, -563, -580, -626, -650, -625, -581, -576, -618, -663, -676, -672, -676, -685, -678, -657, -639, -633, -637, -647, -659, -666, -671, -680, -684, -661, -616, -594, -624, -677, -701, -686, -666, -651, -627, -593, -576, -580, -567, -524, -495, -524, -583, -611, -595, -581, -600, -630, -641, -638, -627, -601, -572, -572, -609, -635, -617, -590, -607, -655, -673, -647, -625, -637, -648, -621, -571, -538, -533, -550, -586, -628, -648, -631, -603]
245f03J5J2K0Jm5m9J4P6O4Jm5n2m3k3J7N0L4j4m4l5j3NK4L3Rk9l4pJ1pl2l2j3NK2L5K8J2J1
241f21K6L0Oj6j2koj4j2j4k5k0J4L9K0j1pJ9J6k1l4QN9O4K7j2l0l0j8jPlk3k6j2NOmj0rj8
236f65l0k0K2N1K9k2l1J3L9Mm3m0JJ6OJ5M6M2rn4m1OL6L7K8J3qj2NJ6ml0k2MOj7l0j5pk5m1
230g31k1K0L9K5KjJ2J9Qj6l3k3J4M8M8J8j1j1MPj0k5k5j9pJ1L4M3K5OQK3J3k8p4q8o8l2NL8
226g53N9N4K6jML0L2j1n7n0KL5J3k8l1nQ%JK1K8J3nj6k5k7nL1L6QpJ6L1Ml2k8OJ8Noj1l2n9
220g08n3j1J8Ok1j9J3M1M7L2J6J5K1J2j5l4j4K4L2Kk2j2Jrk1nK4L2J3oj2k0l7m2j4L4N7L3
216f02rk8j5NJ0Jllrj3jK0K4RkLOjj0nNPJj2l2m7l7KL5M0K6J9K6L2L0J3k6o1n5jM6L8kk2j2
210f10jkkKqk3qK6L7Nl0l1oJ2J4J4J4Ojjpj7j8jJ6QlRK8K1j2l2j4J2J1rj4MJ4j1m3l7J1M3
$$ y = [-603, -588, -576, -556, -555, -600, -649, -635, -559, -495, -494, -539, -591, -634, -657, -640, -590, -556, -570, -614, -649, -662, -657, -633, -600, -591, -620, -654, -661, -650, -657, -689, -721, -734, -729, -707, -672, -644, -632, -621, -595, -565, -559, -575, -587, -589, -595, -609, -621, -635, -660, -680, -666, -627, -607, -618, -625, -606, -590, -611, -645, -637, -578, -514, -487, -499, -529, -559, -577, -578, -571, -574, -597, -623, -635, -630, -624, -628, -638, -647, -665, -695, -715, -693, -642, -613, -635, -666, -653, -614, -610, -653, -693, -692, -676, -670, -655, -609, -567, -576, -630, -671, -665, -629, -592, -564, -551, -559, -571, -566, -550, -554, -584, -606, -602, -596, -613, -643, -658, -665, -690, -731, -752, -732, -693, -668, -666, -667, -655, -636, -628, -644, -677, -700, -686, -638, -590, -572, -583, -594, -590, -583, -593, -618, -643, -662, -669, -658, -624, -581, -556, -550, -542, -519, -506, -534, -608, -696, -764, -796, -791, -753, -694, -640, -614, -615, -611, -581, -549, -560, -617, -667, -665, -630, -617, -645, -676, -681, -673, -673, -672, -651, -623, -610, -615, -631, -656, -683, -688, -657, -621, -613, -620, -604, -573, -569, -601, -629, -623, -605, -600, -606, -617, -649, -708, -761, -772, -754, -748, -769, -788, -775, -734, -687, -655, -639, -624, -603, -591, -606, -640, -654, -630, -598, -596, -618, -630, -629, -638, -659, -664, -640, -608, -595, -601, -613, -633, -670, -712, -726, -692, -635, -602, -611, -639, -654, -649, -639, -638, -641, -644, -653, -666, -667, -647, -623, -614, -616, -613, -607, -608, -618, -623, -618, -611, -610, -622, -654, -701, -738, -736, -701, -661, -635, -616, -590, -558, -528, -515, -541, -602, -657, -658, -612, -574, -576, -598, -610, -611, -613, -615, -613, -621, -644, -652, -626, -589, -584, -614, -645, -651, -639, -625, -611, -597, -591, -592, -593, -600, -617, -635, -636, -620, -612, -615, -606, -578, -557, -569, -601, -615, -603, -592, -601, -615, -611, -597, -608, -651, -688, -677, -634]
205f34J6m5o6k5K4L2K3L1N1M3J2ojrl3m0j4J0Kj8rK1L7K7J4Rmk2k3nNnj4OL2K8qm1m2k7k2
200f90k2qK6M8K8j7l5lM9O1K5j7j9LMk8n1l1J1L1J4j2j3KJ0OMJ0Oj4l5l8k1JJ8L1L5K3NkP
195e98K0J4rk6j9NK3J7mk1k2j6j2j0ppnKJ6K6K6J4%j1j2lJ3J7Jk3k9j8plQK0J1k0l4qL5N1
190f05K4j7m0l7k0jJ3K2L5M2K4j5m0l1ojolPJj7j4J0K1Jk1j3J3L1K7Qj8k8nL7N4K0l0n2l9
185f69k0j2qOK4M0L9Pl5m7j0K6J8j7k3J2M8M5K0lj6k3k4j9j6j9k3j5QL3M6L5Pj7j5OK6L0K4
180e31J2mj3j2rj3j9rJ3K0J1%kjkMR%j3oJ9K1j0m1m1k5k4k7mL2M3J6k5m9m5j6K1L5J0k7l6
175g38j7mj8l0j4K1M3M1J9koJ1L0K9Nk2k8j0J8K7J0j5j0K3M8K7j4l2j9oj1j3LK1J9Lj0j6k2
170f59k0nJ4J8J1LNPJj5l1k7MM6N8L3pk3j4JKkkJlj5j8rQPmoJ7L6K4j7m7m8m0l8l4oL6N8M2
$$ y = [-634, -618, -663, -729, -754, -730, -698, -675, -644, -593, -550, -538, -544, -545, -554, -587, -627, -641, -631, -629, -647, -656, -635, -598, -571, -557, -548, -552, -574, -597, -602, -597, -602, -616, -610, -578, -550, -558, -599, -641, -668, -690, -712, -720, -694, -646, -618, -635, -670, -673, -624, -563, -538, -555, -574, -571, -567, -595, -646, -677, -666, -635, -621, -633, -646, -644, -634, -628, -624, -614, -608, -622, -657, -695, -716, -715, -697, -666, -631, -608, -603, -605, -598, -578, -564, -573, -599, -618, -613, -590, -573, -577, -598, -620, -636, -648, -658, -665, -672, -677, -675, -659, -633, -607, -593, -593, -604, -616, -619, -606, -589, -588, -611, -640, -658, -665, -668, -660, -640, -629, -649, -683, -691, -656, -605, -581, -598, -638, -675, -695, -696, -683, -661, -626, -584, -560, -575, -615, -646, -652, -653, -659, -662, -655, -654, -671, -685, -675, -654, -653, -674, -687, -674, -643, -616, -608, -626, -654, -659, -622, -568, -548, -578, -630, -669, -689, -701, -709, -703, -679, -639, -600, -593, -628, -675, -685, -659, -641, -658, -681, -669, -621, -576, -556, -559, -575, -598, -622, -641, -657, -676, -699, -714, -706, -673, -627, -592, -585, -602, -617, -611, -585, -555, -531, -519, -523, -536, -548, -557, -570, -589, -598, -585, -565, -554, -554, -556, -557, -559, -555, -546, -546, -559, -565, -546, -525, -535, -576, -617, -642, -666, -693, -697, -665, -622, -606, -631, -680, -725, -741, -720, -685, -675, -702, -738, -755, -759, -777, -807, -821, -800, -757, -716, -697, -699, -705, -694, -664, -635, -630, -652, -680, -690, -672, -645, -635, -650, -660, -637, -589, -562, -576, -608, -627, -633, -644, -657, -654, -633, -614, -611, -621, -637, -659, -679, -684, -670, -652, -641, -638, -633, -626, -625, -640, -671, -698, -694, -648, -590, -557, -564, -587, -601, -600, -598, -600, -602, -601, -604, -619, -637, -646, -638, -631, -635, -641, -624, -588, -564, -581, -628, -676, -716, -754, -788, -794, -758, -700, -658]
165f58Qj7j3LJ4K1L4N5N6K9LLKl4p9p0lM3J8k9k8RK2lj6jJ1jpJ1K0ml4k9J0M1L9J3j9m2m1
160f63j3K0L2K2J2Qmk8l8j2K9M8K7pk6k6j6kJ5K1Nk0l2k3lJ5K4J6qk4oL1L7nm1k4K5N3M1J3
155e27j0l3n0m4j4NjqPL2L2Oj5j2JNpk1k4j3NJ5Oj1k2j6JJ2Oj1j3MK4K3Jj9k7l0k5pJ5L0K6
150g04J7J5K2L6N1M6Om5n1JN5N0j0n9n7j6J5Qk1l6j2K5L7Qk3k4p%qoPQoj1J0L4L2%k9k9lK2
144f52K2nk4j2K7N6N4K5j2m8o5m9jM0L5rl7k3QJ7OOK2K5%k6j8NOj8k7rRLqLK4L0J9QLj0k4
139f24k3rjkNK2K7Rj3j6j0okRJ5RMJ2K1Mk8m2k4KJ3P%lmnrj2pKJ0PloJ1L3L5Rk7m7m6l7l1
133g71k2LL3M8L4Jk1j4J1K8K0jpmj5m5n9j9M8P5M5mk0jJ4J0oj7j3QL1L1Oj7k0j2rnMJ0NJ2
128f25M0M8ko7p3j2L8K3j8k4PK7J8mj5j3JJ4Nk2l4lM3N7K8j0k9l1k0NL0L1%k9k2K0O2N3rq0
$$ y = [-658, -650, -667, -680, -677, -663, -642, -608, -553, -497, -468, -465, -462, -460, -494, -573, -643, -646, -603, -585, -614, -642, -633, -611, -614, -630, -631, -620, -621, -628, -617, -597, -601, -635, -664, -654, -613, -574, -561, -580, -622, -663, -676, -656, -624, -602, -590, -582, -586, -614, -652, -664, -635, -587, -560, -567, -593, -619, -635, -637, -622, -601, -596, -616, -648, -671, -674, -659, -635, -619, -627, -651, -657, -626, -589, -594, -635, -659, -634, -581, -540, -527, -537, -570, -620, -664, -678, -673, -674, -682, -675, -643, -611, -605, -620, -632, -631, -626, -633, -654, -678, -691, -686, -671, -665, -676, -698, -714, -713, -701, -695, -706, -719, -715, -691, -668, -667, -686, -713, -743, -768, -775, -760, -730, -704, -687, -672, -650, -614, -563, -517, -511, -556, -607, -606, -551, -501, -511, -570, -627, -643, -628, -620, -641, -677, -689, -664, -627, -619, -642, -666, -673, -673, -681, -687, -680, -672, -678, -689, -679, -645, -613, -613, -642, -671, -674, -652, -630, -635, -659, -671, -644, -588, -534, -509, -521, -569, -634, -683, -684, -644, -609, -618, -655, -678, -670, -653, -647, -641, -619, -594, -594, -620, -638, -633, -627, -645, -672, -681, -672, -669, -677, -674, -650, -620, -601, -593, -590, -600, -624, -647, -656, -657, -659, -654, -632, -605, -596, -609, -625, -635, -641, -643, -634, -619, -610, -606, -594, -573, -569, -597, -639, -663, -661, -648, -641, -641, -644, -648, -653, -662, -674, -681, -679, -669, -662, -665, -671, -660, -627, -592, -583, -610, -657, -703, -740, -771, -793, -790, -757, -709, -675, -674, -695, -709, -698, -670, -650, -651, -658, -662, -677, -722, -781, -800, -752, -677, -632, -636, -656, -657, -643, -633, -639, -656, -669, -661, -630, -599, -593, -610, -630, -642, -651, -656, -652, -642, -637, -625, -585, -537, -539, -606, -679, -691, -653, -630, -648, -672, -665, -638, -620, -624, -639, -652, -651, -637, -632, -654, -688, -691, -648, -591, -563, -573, -602, -633, -653, -648, -618, -587, -587, -616, -638, -618, -556, -503, -512, -592]
123e92r2l5K8M0J6OK2K5J2RJ3qm9n6pL2J7j5pJ5nm6l5K7N7J7k4rK8L1J5J9K9jn5o6k4J0Po
118f57RK4J2j4j6J0K3J5OJ3J5pl1k1J4K9Mk6l0k0l0m9l4K1O3N1J2lJ1J9J3KjomJ6L9K7j4l9
114e54j9J8K2j3n2o0l7rlj5j6J0L2J1l9n3j3L0K2j0pL1M8J3l4l7NN1N6K8lj3rj4k7k3KK1P
109f53j6j4QJ9J2NRQnj6j9k3k3j1J2J7LmJ2L1L2J7%j5j9lJ8J4j6k8PM4K8l1o4l8PK4J1jml
$$ y = [-592, -684, -719, -691, -651, -635, -629, -607, -582, -570, -561, -548, -556, -605, -661, -668, -636, -619, -634, -641, -626, -631, -677, -712, -685, -628, -611, -635, -644, -616, -585, -570, -551, -522, -523, -578, -644, -668, -658, -651, -657, -648, -624, -612, -626, -642, -632, -609, -594, -588, -575, -560, -567, -598, -619, -605, -576, -572, -598, -628, -648, -678, -727, -761, -740, -677, -626, -614, -617, -606, -587, -574, -572, -573, -579, -583, -567, -528, -501, -515, -554, -573, -555, -533, -546, -598, -658, -695, -704, -707, -722, -738, -728, -696, -685, -724, -777, -790, -760, -738, -748, -755, -724, -676, -663, -697, -734, -729, -678, -622, -594, -597, -610, -619, -633, -660, -683, -681, -660, -653, -669, -683, -675, -656, -644, -639, -630, -622, -627, -643, -662, -685, -708, -719, -707, -690, -687, -691, -679, -648, -616, -599, -599, -614, -633, -636, -618, -604, -620, -648, -641, -597, -569, -600, -664, -702, -695, -671, -660, -661, -665, -668]
$$ [...]
-1605C00
##END=	
##END=	
