##TITLE=	+eMzYEmZSMqB6fU6tim$zg.33.ser
TM-VI-084mfr hmbc

##JCAMP-DX=	6.0	$$ MestReNova 14.3.1-31739
##DATA TYPE=	LINK
##BLOCK_ID=	1
##BLOCKS=	2    
##ORIGIN=	Mestrelab Research S.L.
##OWNER=	hrzepa
##$MNOVA/LINK_BLOCK_TYPE=	ITEM	$$ NMR Spectrum
##$MNOVA/ITEM/POLYGON=	(XY..XY)
5321,5835
8722,5835
8722,8208
5321,8208
5321,5835
##$MNOVA/ITEM/Z=	0
##$MNOVA/ITEM/ANGLE=	0
##TITLE=	+eMzYEmZSMqB6fU6tim$zg.33.ser
##JCAMP-DX=	6.0	$$ MestReNova 14.3.1-31739
##BLOCK_ID=	2
##DATA TYPE=	MNOVA NMR VIEW DATA
##DATA CLASS=	MNOVA VIEW DATA
##$MNOVA/2D/THRESHOLD=	25.614288330078125
##$MNOVA/ITEM/ZOOM/X=	-0.47501081208716700033,	14.504330000039219684
##$MNOVA/ITEM/ZOOM/Y=	-9.5107036222489718114,	249.98529999918474687
##END=	
##TITLE=	+eMzYEmZSMqB6fU6tim$zg.33.ser
##JCAMP-DX=	6.0	$$ MestReNova 14.3.1-31739
##BLOCK_ID=	3
##DATA TYPE=	nD NMR SPECTRUM
##DATA CLASS=	NTUPLES
##NUMDIM=	2
##ORIGIN=	Bruker BioSpin GmbH
##OWNER=	nmr
##.OBSERVE FREQUENCY=	400.41280287000000726
##.OBSERVE NUCLEUS=	^1H
##.SOLVENT NAME=	CDCl3
##.PULSE SEQUENCE=	hmbcgplpndqf
##LONGDATE=	2021/09/06 23:14:30.000
##.ACQUISITIONMODE=	SIMULTANEOUS (DQD)
##$ORIGINAL FORMAT=	Bruker XWIN-NMR
##$MNOVA/SCALES_VERSION=	9
##$PARAMETER FILE=	(acqu2s, ASCII, /private/var/folders/f6/rjf_tdyn2v98c5c0wvkgn4s80000gn/T/+eMzYEmZSMqB6fU6tim$zg/33/acqu2s, 0)
$$ ##TITLE= Parameter file, TOPSPIN		Version 3.2
$$ ##JCAMPDX= 5.0
$$ ##DATATYPE= Parameter Values
$$ ##NPOINTS= 129	$$ modification sequence number
$$ ##ORIGIN= Bruker BioSpin GmbH
$$ ##OWNER= nmr
$$ $$ 2021-09-06 23:34:06.963 +0100  nmr@CZC10666PP
$$ $$ /opt/topspin/data/agmb/nmr/Sep06-2021/33/acqu2s
$$ $$ process /opt/topspin3.2/prog/mod/go
$$ ##$ACQT0= 0
$$ ##$BF1= 100.683175
$$ ##$FnMODE= 1
$$ ##$NUC1= <13C>
$$ ##$NusJSP= 0
$$ ##$NusT2= 1
$$ ##$NusTD= 128
$$ ##$O1= 12080.308799824
$$ ##$SFO1= 100.6952553088
$$ ##$SW= 259.972631192251
$$ ##$SW_h= 26178.0104712042
$$ ##$TD= 128
$$ ##END=
$$ 
##$PARAMETER FILE=	(acqus, ASCII, /private/var/folders/f6/rjf_tdyn2v98c5c0wvkgn4s80000gn/T/+eMzYEmZSMqB6fU6tim$zg/33/acqus, 0)
$$ ##TITLE= Parameter file, TOPSPIN		Version 3.2
$$ ##JCAMPDX= 5.0
$$ ##DATATYPE= Parameter Values
$$ ##NPOINTS= 12	$$ modification sequence number
$$ ##ORIGIN= Bruker BioSpin GmbH
$$ ##OWNER= nmr
$$ $$ 2021-09-06 23:34:10.797 +0100  nmr@CZC10666PP
$$ $$ /opt/topspin/data/agmb/nmr/Sep06-2021/33/acqus
$$ $$ process /opt/topspin3.2/prog/mod/shimcntl
$$ ##$ACQT0= 1000000
$$ ##$AMP= (0..31)
$$ 100 100 100 100 100 100 100 100 100 100 100 100 100 100 100 100 100 100
$$ 100 100 100 100 100 100 100 100 100 100 100 100 100 100
$$ ##$AMPCOIL= (0..19)
$$ 0 0 0 0 0 0 0 0 0 0 0 0 0 0 0 0 0 0 0 0
$$ ##$ANAVPT= -1
$$ ##$AQSEQ= 0
$$ ##$AQ_mod= 3
$$ ##$AUNM= <au_zg>
$$ ##$AUTOPOS= <53 >
$$ ##$BF1= 400.41
$$ ##$BF2= 100.683175
$$ ##$BF3= 400.41
$$ ##$BF4= 400.41
$$ ##$BF5= 400.41
$$ ##$BF6= 400.41
$$ ##$BF7= 400.41
$$ ##$BF8= 400.41
$$ ##$BYTORDA= 0
$$ ##$CAGPARS= (0..11)
$$ 0 0 0 0 0 0 0 0 0 0 0 0
$$ ##$CFDGTYP= 0
$$ ##$CFRGTYP= 9
$$ ##$CHEMSTR= <none>
$$ [...]
$$ 0 0 0 0
$$ ##$ShimPowMaxUC= (0..63)
$$ 130000 130000 130000 130000 130000 130000 130000 130000 130000 130000 130000
$$ 130000 130000 130000 130000 130000 130000 130000 130000 130000 0 0 0 0
$$ 0 0 0 0 0 0 0 0 0 0 0 0 0 0 0 0 0 0 0 0 0 0 0 0 0 0 0 0 0 0 0 0 0 0 0 0
$$ 0 0 0 0
$$ ##$ShimPowMaxUG= (0..63)
$$ 524287 524287 524287 524287 524287 524287 524287 524287 524287 524287 524287
$$ 524287 524287 524287 524287 524287 524287 524287 524287 524287 0 0 0 0
$$ 0 0 0 0 0 0 0 0 0 0 0 0 0 0 0 0 0 0 0 0 0 0 0 0 0 0 0 0 0 0 0 0 0 0 0 0
$$ 0 0 0 0
$$ ##$ShimPowRcbType= 3
$$ ##$ShimPowRes= (0..63)
$$ 1e-20 1e-20 1e-20 1e-20 1e-20 1e-20 1e-20 1e-20 1e-20 1e-20 1e-20 1e-20
$$ 1e-20 1e-20 1e-20 1e-20 1e-20 1e-20 1e-20 1e-20 0 0 0 0 0 0 0 0 0 0 0 0
$$ 0 0 0 0 0 0 0 0 0 0 0 0 0 0 0 0 0 0 0 0 0 0 0 0 0 0 0 0 0 0 0 0
$$ ##$ShimPowRng0= (0..63)
$$ 1 1 1 1 1 1 1 1 1 1 1 1 1 1 1 1 1 1 1 1 0 0 0 0 0 0 0 0 0 0 0 0 0 0 0 0
$$ 0 0 0 0 0 0 0 0 0 0 0 0 0 0 0 0 0 0 0 0 0 0 0 0 0 0 0 0
$$ ##$ShimPowRng1= (0..63)
$$ 1 1 1 1 1 1 1 1 1 1 1 1 1 1 1 1 1 1 1 1 0 0 0 0 0 0 0 0 0 0 0 0 0 0 0 0
$$ 0 0 0 0 0 0 0 0 0 0 0 0 0 0 0 0 0 0 0 0 0 0 0 0 0 0 0 0
$$ ##$ShimPowRng2= (0..63)
$$ 1 1 1 1 1 1 1 1 1 1 1 1 1 1 1 1 1 1 1 1 0 0 0 0 0 0 0 0 0 0 0 0 0 0 0 0
$$ 0 0 0 0 0 0 0 0 0 0 0 0 0 0 0 0 0 0 0 0 0 0 0 0 0 0 0 0
$$ ##$ShimPowRng3= (0..63)
$$ 1 1 1 1 1 1 1 1 1 1 1 1 1 1 1 1 1 1 1 1 0 0 0 0 0 0 0 0 0 0 0 0 0 0 0 0
$$ 0 0 0 0 0 0 0 0 0 0 0 0 0 0 0 0 0 0 0 0 0 0 0 0 0 0 0 0
$$ ##$ShimSysFunc= (0..63)
$$ 1 2 3 4 5 7 9 11 15 16 8 10 12 14 6 17 13 18 19 20 0 0 0 0 0 0 0 0 0 0
$$ 0 0 0 0 0 0 0 0 0 0 0 0 0 0 0 0 0 0 0 0 0 0 0 0 0 0 0 0 0 0 0 0 0 0
$$ ##$ShimSysMatrix= 0
$$ ##$ShimSysType= 1
$$ ##$TFXNUM= 0
$$ ##$TRIPLO2= 0
$$ ##$VTU= 2
$$ ##$VTUETH= <149.236.99.20>
$$ ##$VTUTY= <no>
$$ ##$WBREFAM= (0..15)
$$ 135 116 100 100 100 100 100 100 100 100 100 100 100 100 100 100
$$ ##$WBREFLM= (0..15)
$$ 0 0 0 0 0 0 0 0 0 0 0 0 0 0 0 0
$$ ##$WBREFPH= (0..15)
$$ 71.66 -68.25 0 0 0 0 0 0 0 0 0 0 0 0 0 0
$$ ##$WBSGU= (0..15)
$$ 0 0 0 0 0 0 0 0 0 0 0 0 0 0 0 0
$$ ##$XFAC= 2
$$ ##END=
$$ 
##$DECIM=	3328
##$DSPFVS=	20
##.ACQUISITIONSCHEME=	NOT PHASESENSITIVE
##NTUPLES=	nD NMR SPECTRUM
##VAR_NAME=	FREQUENCY1,	FREQUENCY2,	SPECTRUM
##SYMBOL=	F1,	F2,	Y
##.NUCLEUS=	13C,	1H
##.OBSERVE FREQUENCY=	100.69525530880000019,	400.41280287000000726
##VAR_TYPE=	INDEPENDENT,	INDEPENDENT,	DEPENDENT
##VAR_FORM=	AFFN,	AFFN,	ASDF
##VAR_DIM=	512,	512,	262144
##UNITS=	HZ,	HZ,	ARBITRARY UNITS
##FIRST=	25169.313707327481097,	5807.6787752999953227,	0.3951613008975982666
##LAST=	-957.56783717514929322,	-190.19907926730809322,	0.21852535009384155273
##MIN=	-957.56783717514929322,	-190.19907926730809322,	0.00039818781078793108463
##MAX=	25169.313707327481097,	5807.6787752999953227,	1001.03765869140625
##FACTOR=	1,	1,	0.0036057888654941277172
##PAGE=	F1=25169.3
##FIRST=	25169.313707327481097,	5807.6787752999953227,	0.3951613008975982666
##DATA TABLE=	(F2++(Y..Y)), PROFILE
$$ [...]
##PAGE=	F1=4513.23
##FIRST=	25169.313707327481097,	5807.6787752999953227,	0.18654224276542663574
##DATA TABLE=	(F2++(Y..Y)), PROFILE
4951 182 132 87 17 23 71 185 167 95 51 73 118 246 186 81 180 201 136 190 178 177 108 122 119 105 112 206 180 23 51 98 55 37 58 81 75
4540 75 64 72 60 36 37 109 111 69 89 82 36 162 177 97 178 126 172 139 140 148 187 153 87 121 206 212 41 54 74 42 166 104 51 86 121 167 154
4106 154 224 198 163 87 148 67 96 61 218 315 161 129 125 77 341 90 198 95 93 207 186 142 93 126 59 63 71 136 110 53 131 125 154 185
3707 185 163 151 149 89 39 180 26 94 52 57 75 49 79 105 77 188 148 67 93 12 48 195 173 10 97 72 106 100 126 87 98 66 99 60
3308 60 206 121 149 82 146 59 52 107 169 88 121 104 349 232 101 1 211 111 84 967 1780 679 197 39 281 53 85 164
2979 164 514 348 204 153 87 356 825 957 473 145 153 141 187 99 315 148 109 114 74 128 105 242 62 43 95 96 2 114 235
2639 235 186 98 156 162 230 168 25 73 144 36 197 78 176 132 106 7 117 79 43 176 193 141 20 163 64 174 238 114 65 79
2286 79 160 178 136 80 55 90 105 132 33 53 64 43 123 140 77 65 37 261 294 253 727 1388 949 219 81 146 236 40 54 11 35 84
1911 84 168 100 50 25 93 90 30 78 223 238 155 68 46 162 164 131 257 245 213 149 133 18 17 72 40 129 204 223 146 264 208 279 89 364
1512 364 1354 1927 685 204 307 64 302 196 74 73 180 30 90 48 17 57 68 85 9 7 85 128 171 354 259 32 77 137 164
1171 164 154 84 58 14 71 207 108 42 125 201 169 71 98 138 99 67 95 155 193 76 176 159 96 97 18 22 114 137 142 139 103 139 151 156 60 90
749 90 19 173 66 52 57 99 26 82 189 122 74 40 76 106 89 111 106 545 1028 931 288 152 84 171 127 165 231 101 127 73 151 73 94
361 94 78 72 203 82 109 221 77 103 18 125 162 159 103 136 79 41 91 212 81 105 74 82 233 132 66 201 218 270 149 61 85 61
-14 61 64 44 32 67 62 115 108 47 73 38 110 251 116 105 131
-190A31
##PAGE=	F1=4410.97
##FIRST=	25169.313707327481097,	5807.6787752999953227,	0.23604050278663635254
##DATA TABLE=	(F2++(Y..Y)), PROFILE
5808 32 22 61 83 69 72 82 46 19 51 110 38 213 230 60 63 78 188 195 154 134 107 184 184 159 94 193 321 55 152 65 184 162 174 222
5409 222 127 96 126 106 176 87 126 14 52 146 118 34 59 64 104 47 58 59 50 29 65 65 63 153 117 143 45 124 214 129 102 129 82 143 101 31 10
4974 10 115 211 177 66 26 38 99 165 202 121 76 99 123 275 198 43 138 188 122 192 165 201 88 121 101 86 110 247 193 41 40 86
4599 86 90 67 53 89 76 63 81 47 25 55 101 100 108 113 107 48 151 176 119 209 132 172 140 107 124 160 119 55 57 221 195 22 65 43 100 227
4176 227 128 62 70 114 158 135 199 173 112 65 132 75 78 51 221 288 177 169 122 64 313 73 211 48 65 196 176 148 111 171 100 128 85
3789 85 117 83 55 138 118 171 193 144 141 104 101 52 190 18 100 61 87 105 84 95 159 122 211 141 25 90 31 72 206 120 93 123 81 111
3390 111 88 138 121 127 66 56 82 216 81 135 118 187 106 23 127 164 80 153 160 481 266 62 13 212 12 115 373 751 366 177
3038 177 113 167 80 89 227 739 430 257 196 54 326 648 797 379 164 180 144 199 201 418 179 110 153 109 258 441 110 36
2709 36 63 95 69 13 86 302 180 124 186 168 258 161 29 62 143 18 169 66 172 111 98 14 101 66 72 147 215 145 38 177 86
2345 86 173 245 105 57 93 132 147 103 60 78 107 110 198 70 16 76 13 96 118 86 133 101 228 245 121 603 613 563 202 91 177 184 33
1958 33 100 17 69 44 131 113 33 51 92 97 25 57 166 202 127 75 66 170 138 120 213 222 180 147 78 27 78 90 58 163 197 157 103 246 174
1547 174 288 121 225 1279 1862 550 182 260 125 283 138 67 72 152 47 114 48 21 66 117 69 11 31 105 108 157 364 263
1218 263 5 49 125 138 148 58 58 32 74 161 72 59 125 254 179 48 104 160 150 98 121 147 223 71 138 129 115 67 47 36 115 175 83 58
819 58 142 149 181 188 78 39 34 137 33 67 53 124 16 78 145 123 55 40 80 102 137 85 84 524 1193 1145 359 149 123 178 140 134 258 128
420 128 125 65 165 53 62 83 56 163 87 77 200 76 59 12 95 134 156 106 145 73 38 85 187 28 155 81 52 233 119 62 159
56 159 197 277 165 58 73 59 75 46 21 90 127 118 116 16 62 33 150 243 90 115 112
-190A12
##PAGE=	F1=4308.71
##FIRST=	25169.313707327481097,	5807.6787752999953227,	0.32806193828582763672
##DATA TABLE=	(F2++(Y..Y)), PROFILE
5808 53 30 38 69 82 63 78 44 32 65 103 46 183 198 58 58 42 181 198 164 114 87 166 160 133 69 183 330 19 175 58 177 155
5432 155 177 192 131 120 104 89 210 91 136 62 41 94 63 37 91 64 117 59 70 90 77 60 92 69 57 153 130 171 65 122 177 115 58
5045 58 105 63 137 129 48 22 122 219 182 52 34 48 134 141 238 136 90 112 115 261 176 20 129 194 111 165 135 214 75 96 84 68 127
4657 127 269 178 48 24 63 116 104 62 92 89 65 72 46 14 76 78 78 145 138 123 49 130 161 116 215 135 160 132 81 114 139 78 30 15 225 166
4235 166 10 81 24 151 262 139 66 64 113 156 111 160 134 66 59 110 81 50 53 225 247 182 183 103 66 274 70 202 14 57 165 141
3859 141 142 119 208 138 211 129 105 54 59 129 105 177 193 126 117 42 103 63 186 21 99 81 109 130 116 92 185 132 191 120 24 77 58 95 206
3448 206 75 138 145 93 110 87 147 139 123 62 43 118 228 52 115 150 215 142 29 123 155 66 157 363 788 297 13 29 200 128 128 406
3073 406 722 520 163 182 170 151 113 307 1008 518 302 222 97 358 320 201 172 170 185 164 190 265 454 186 115 179 132 314 677
2732 677 281 103 70 97 57 33 66 344 182 148 224 161 261 175 44 59 141 24 120 68 151 96 83 38 69 65 95 113 228 145 81
2369 81 195 100 164 237 83 59 94 97 106 73 50 109 130 115 259 141 72 74 34 67 103 95 211 177 204 172 26 884 1228 450 210 75
1993 75 225 112 24 140 55 78 27 98 129 26 75 89 86 56 42 110 154 95 114 88 171 107 97 113 166 138 126 50 51 125 114 59 176 174
1594 174 102 104 197 96 265 218 74 660 1104 284 80 177 147 261 94 46 46 112 62 149 25 67 55 162 56 22 39 96 99 147
1242 147 352 238 46 80 95 110 146 35 62 64 75 103 32 74 107 284 182 66 91 164 181 120 139 132 240 75 109 115 117 45 79 65
866 65 94 188 85 36 183 155 194 206 90 38 59 111 22 83 35 144 22 101 68 121 75 55 64 108 169 70 65 491 1268 1262 397 141 162
479 162 174 156 75 248 140 114 83 176 63 18 75 46 116 102 35 161 71 20 39 75 103 149 96 140 55 33 75 168 34 200 109 63
103 63 202 81 62 114 171 279 183 68 76 79 61 57 69 143 161 112 121 24 77 100 191 210 63 113 86
-190H6
##PAGE=	F1=4206.45
##FIRST=	25169.313707327481097,	5807.6787752999953227,	0.41774129867553710938
##DATA TABLE=	(F2++(Y..Y)), PROFILE
5808 69 38 20 64 81 56 68 41 39 69 97 57 150 156 42 76 41 170 219 161 72 61 139 123 106 42 157 312 33 189 59 154 143 158
5420 158 162 143 133 81 88 242 115 150 128 95 60 46 86 105 57 117 72 77 114 91 85 103 77 49 141 121 181 76 113 124 112 27 71 45 129
5010 129 143 59 28 128 208 150 41 35 52 165 113 265 139 95 108 93 211 129 27 143 213 113 114 107 211 73 54 73 53 141 266
4646 266 144 53 33 34 125 148 87 95 111 68 43 70 5 93 45 44 172 161 133 42 105 131 88 186 122 138 118 93 142 128 37 24 79 218 134
4235 134 13 96 21 179 269 135 60 71 122 156 89 117 93 82 82 92 90 12 103 230 200 167 166 64 73 232 70 169 56 73 123 90 127
3848 127 117 224 164 274 184 97 41 69 105 86 172 184 109 90 31 92 75 163 34 85 102 121 150 134 75 183 104 133 87 70 54 71 112
3460 112 195 69 140 149 107 96 84 156 141 88 59 55 160 240 44 83 165 226 160 74 87 143 36 117 354 711 248 45 32 186 209
3096 209 107 743 1246 697 142 222 223 207 110 264 889 456 320 224 138 446 676 498 179 153 173 181 160 275 428 169 115 184
2768 184 145 277 638 268 120 71 92 55 60 41 348 188 174 269 141 230 196 69 67 135 31 70 62 104 91 62 71 36 68 107 95 222
2392 222 137 112 208 103 144 212 56 69 81 57 56 53 71 137 151 125 297 213 114 55 39 37 88 87 272 247 197 116 119 1098 1857 652 229
2005 229 48 244 57 47 159 86 63 74 98 127 37 89 84 58 76 38 81 116 72 158 102 165 79 84 67 129 100 97 46 77 155 129 53 166
1606 166 145 103 118 132 44 231 307 295 327 998 481 68 124 140 252 96 30 14 78 62 175 29 106 44 186 56 33 25 62 94
1254 94 142 320 197 79 129 63 91 152 39 70 90 71 77 62 88 82 289 173 88 64 153 192 127 143 115 242 89 97 114 102 30 106 105
866 105 72 171 133 118 206 161 190 201 90 78 81 111 55 90 18 145 40 151 44 111 126 69 37 100 153 63 48 468 1256 1260 398 135
491 135 187 161 164 32 203 143 97 104 185 79 35 64 44 85 132 32 111 64 49 61 65 76 146 77 123 24 31 62 158 81 225 144 102 151 35
80 35 63 71 143 279 199 89 90 119 30 86 103 174 159 100 126 46 103 155 221 164 64 99 64
-190F4
##PAGE=	F1=4104.2
##FIRST=	25169.313707327481097,	5807.6787752999953227,	0.45719245076179504395
##DATA TABLE=	(F2++(Y..Y)), PROFILE
5808 77 44 31 76 68 46 57 45 41 60 95 74 122 122 56 103 84 164 246 142 30 42 106 86 81 16 112 265 46 183 64 118 129 126 142 157
5397 157 137 64 105 267 158 181 179 140 56 74 122 91 47 109 83 67 112 89 104 98 91 44 122 92 169 77 94 62 121 32 34 30 116 143 63 17
4974 17 137 186 95 47 25 52 184 87 272 134 89 94 61 153 97 46 160 229 124 58 112 193 82 11 66 43 138 236 106 70 63 12
4599 12 119 191 122 103 132 76 5 105 3 98 31 11 183 181 143 27 87 96 39 126 87 110 104 138 195 128 10 20 123 205 108 30 102
4211 102 23 188 257 120 45 85 136 154 74 82 68 121 109 89 103 31 174 235 157 133 119 13 77 193 59 118 105 85 82 36 107 111 211
3824 211 169 303 234 95 47 92 79 60 158 163 89 72 93 70 89 125 46 69 116 125 168 133 51 158 56 52 49 101 22 63 120 178 100 109 134
3413 134 119 69 67 168 134 32 72 60 200 245 50 41 160 215 158 122 29 126 13 56 80 122 89 113 15 172 226 90 729 1151 612
3049 612 104 225 224 239 102 98 270 212 303 200 157 500 1032 953 292 117 161 185 114 254 367 134 113 175 184 183 355 55 89 79
2697 79 77 58 92 8 308 180 207 314 110 166 207 104 92 125 24 56 55 52 104 64 110 55 69 107 113 197 120 126 209 95 113 179 45 94
2298 94 58 31 6 51 103 154 162 142 301 271 126 26 12 6 62 56 298 292 217 103 120 931 1632 534 194 49 215 60 103 152 92
1934 92 39 124 144 108 56 90 80 29 74 38 101 104 67 194 104 155 64 87 132 133 75 76 49 92 169 123 51 134 117 114 106 69 101 197 332 386 797
1500 797 1444 666 150 105 115 232 118 57 48 67 46 181 69 126 58 180 60 40 8 26 78 141 273 156 91 163 60 90 161
1160 161 60 78 104 65 97 109 103 60 271 148 97 29 134 191 122 133 100 232 106 104 122 74 21 121 148 71 134 169 177 201 168 178 170
772 170 77 100 97 122 100 81 14 118 55 199 140 92 174 74 32 68 80 51 19 462 1167 1145 365 136 194 145 155 101 141 145 79 116 193
385 193 91 86 67 46 96 173 86 62 61 84 72 58 52 149 53 100 19 35 48 154 114 224 168 130 96 56 62 40 114 276 209 121 104 154 38
-26 38 126 120 174 124 85 138 73 119 186 232 120 90 77 62
-190F2
##PAGE=	F1=4001.94
##FIRST=	25169.313707327481097,	5807.6787752999953227,	0.38836789131164550781
##DATA TABLE=	(F2++(Y..Y)), PROFILE
5808 75 52 47 92 52 29 48 58 41 51 99 94 105 125 109 127 116 167 260 112 54 45 79 62 62 23 52 193 41 156 67 76 118 93 137 169 133
5385 133 60 126 279 202 219 207 164 67 109 140 51 62 104 86 39 87 76 116 76 107 44 100 50 138 69 72 26 137 61 39 19 103 135 61
4986 61 42 148 166 58 80 9 48 184 65 253 123 77 78 29 127 133 69 171 227 130 63 145 164 93 50 63 41 116 185 87 99 91 31
4599 31 107 224 157 115 142 85 48 135 12 91 70 57 179 195 157 9 86 70 21 49 36 86 95 188 246 132 33 17 143 187 96 57 95
4211 95 26 183 234 99 27 98 146 148 66 76 63 138 125 105 120 72 239 238 121 85 67 70 82 154 37 57 156 81 44 27 96 112 170 148
3812 148 296 266 96 51 124 72 33 137 133 62 73 139 44 102 82 55 77 124 125 183 113 35 120 33 34 14 109 19 36 118 160 132 60 108 126
3401 126 35 39 183 132 29 97 49 225 235 58 18 137 184 139 162 46 109 69 121 367 801 179 183 20 150 188 146 495 639
3061 639 341 97 199 178 249 164 270 663 324 265 159 165 455 1023 993 274 102 158 176 63 234 311 90 110 164 238 127 244
2732 244 234 52 86 57 70 124 54 229 150 241 352 76 79 203 145 128 111 19 87 71 98 144 97 152 98 65 98 148 165 95 126 192 78
2345 78 78 154 62 131 47 56 69 68 132 156 159 158 270 299 113 30 45 36 52 48 284 300 271 132 44 434 649 111 91 74 155 80 168 125 67
1934 67 22 164 208 80 74 79 83 41 48 44 146 120 69 218 100 145 64 75 168 153 63 76 53 85 177 96 53 88 94 93 56 23 145 174 279
1523 279 283 778 1222 548 183 64 79 180 136 105 92 90 29 164 100 124 83 148 73 48 28 60 44 143 219 130 79 174 75 95 167 81
1148 81 83 103 71 116 138 119 45 233 108 93 4 116 187 114 112 88 210 124 120 134 37 18 121 184 85 94 181 202 167 173 169 122 63 96 101 126
725 126 156 87 32 64 64 227 223 72 206 65 60 36 40 22 26 464 1022 946 308 142 186 131 126 171 100 154 69 117 203 104 133 95 47 126
326 126 212 137 35 67 109 69 54 27 147 26 75 69 46 41 152 130 199 168 133 56 104 55 32 84 266 209 158 115 168 84 165 121 146 69
-73 69 68 157 109 116 189 223 96 108 61 77
-190G7
##PAGE=	F1=3899.68
##FIRST=	25169.313707327481097,	5807.6787752999953227,	0.2540969550609588623
##DATA TABLE=	(F2++(Y..Y)), PROFILE
5808 64 62 53 99 52 8 41 71 43 66 111 109 91 160 170 145 126 176 250 87 91 62 77 58 52 49 26 108 24 113 68 33 112 73 141 175 126 70 139
5362 139 271 231 245 207 166 72 137 137 25 111 107 81 30 75 66 118 38 126 47 82 14 93 58 86 80 154 94 73 19 97 129 53 90 154 154 83
4939 83 117 29 38 159 43 206 103 63 68 11 145 188 96 172 208 125 108 168 133 101 87 64 53 83 124 93 129 107 54 101 235 180 125
4552 125 137 89 86 153 27 75 115 104 168 199 175 43 104 58 80 48 24 73 92 227 280 139 59 39 143 169 100 80 71 32 171 210 77
4164 77 13 105 145 135 62 95 62 131 122 122 130 101 282 237 96 35 83 141 90 117 42 13 205 71 9 61 103 125 111 103 257 271 99 52
3765 52 154 82 11 111 99 31 85 161 25 109 63 66 113 127 125 191 80 39 80 65 99 18 94 68 8 112 148 154 21 82 126 35 42 203
3366 203 145 82 118 24 228 209 65 52 116 136 115 187 104 98 118 207 706 1507 371 219 49 108 133 218 340 380 107 133 158 120
3014 120 239 234 491 1372 628 226 120 177 315 690 674 193 137 166 156 36 234 281 49 100 164 266 103 471 417 67 80
2697 80 46 89 145 118 129 100 270 376 45 24 185 184 166 99 44 122 101 181 192 127 194 135 61 87 176 142 68 115 157 57 69 151 87
2310 87 168 67 93 136 98 157 145 146 164 213 290 104 60 110 71 87 108 241 274 331 185 95 307 674 558 70 100 112 90 223 95
1946 95 21 15 190 263 55 86 70 97 73 20 75 192 144 62 224 96 134 80 48 176 183 63 96 58 60 187 55 61 43 87 47 27 6
1559 6 168 185 180 49 281 338 249 204 9 38 95 157 158 136 127 37 133 115 107 105 102 100 69 49 105 33 146 166 123 48 163 76 94 166 98 84
1136 84 92 100 118 143 129 36 185 61 80 30 103 186 118 83 78 181 137 133 145 19 17 106 211 97 71 175 189 112 173 171 74 73 65 89 117 219
714 219 168 76 31 68 223 274 54 213 49 88 55 128 33 75 458 848 714 242 147 173 121 80 211 112 166 73 109 211 121 172
361 172 138 43 147 236 169 51 75 126 56 53 13 126 6 57 119 63 46 150 132 160 145 111 54 137 44 44 53 242 194 193 124 152 122 190
-38 190 111 99 15 54 178 146 95 174 200 90 108 64 90
-190I0
##PAGE=	F1=3797.42
##FIRST=	25169.313707327481097,	5807.6787752999953227,	0.17057767510414123535
##DATA TABLE=	(F2++(Y..Y)), PROFILE
5808 46 75 54 100 74 24 33 78 47 105 127 118 77 197 228 156 120 183 214 84 108 73 98 61 48 70 86 54 9 70 65 6 113 61 145 175
5397 175 115 81 136 239 233 241 183 150 69 146 116 90 169 117 67 70 114 76 110 20 145 51 70 37 47 50 145 142 167 124 98 24 108 136 44 136
4974 136 150 149 112 142 57 27 112 23 140 71 51 70 26 162 217 124 163 179 113 135 163 106 103 102 71 85 59 66 102 149 109 71 101 221 185
4564 185 127 118 83 107 161 47 70 152 137 157 191 197 89 128 52 126 117 83 73 88 249 291 143 81 71 133 151 113 89 30 45 158 188 58
4164 58 12 104 130 114 59 112 58 120 95 125 125 115 294 231 89 14 138 196 97 91 85 50 245 76 25 82 119 145 55 50 199 247 101 70
3765 70 173 89 22 85 69 7 101 158 24 103 79 83 154 128 127 190 48 51 47 84 134 33 64 121 52 111 144 162 34 66 121 68 77 222 169
3355 169 117 120 12 208 174 74 73 120 83 101 190 136 101 142 230 649 1442 373 180 59 42 102 259 323 508 152 144 112 84 205
3002 205 229 479 1327 595 169 103 192 134 261 287 266 183 177 131 55 257 274 17 81 170 241 12 482 362 73 61 45 114 146 180
2650 180 48 54 287 382 21 92 163 210 196 96 75 149 117 242 226 134 228 162 65 88 183 133 49 101 110 38 103 161 115 197 92 122 192
2263 192 135 178 126 125 148 145 245 120 76 160 94 124 172 181 226 356 232 170 640 1419 890 157 142 110 99 250 85 39 7 201 295
1899 295 46 87 76 115 101 59 121 225 162 41 208 101 122 105 76 180 211 77 123 59 45 188 13 75 31 103 16 107 28 183
1547 183 215 102 195 413 715 410 240 77 5 8 188 207 179 155 43 106 114 95 119 65 131 102 64 139 85 146 121 118 28 138 59 90
1171 90 157 112 78 78 140 106 125 128 35 136 32 62 44 92 184 135 55 68 148 145 131 154 60 19 84 230 110 62 159 144 54 164 178 58
772 58 104 16 66 107 282 296 138 106 72 190 289 44 193 43 102 81 154 82 114 430 677 498 176 148 164 114 31 212 132 177
420 177 85 101 217 142 201 185 33 147 234 176 72 82 137 45 51 41 84 30 57 160 82 55 149 128 126 110 71 70 149 34 68 23 205
33 205 168 222 134 111 139 193 103 44 41 45 191 172 63 158 174 88 91 76 91
-190I1
##PAGE=	F1=3695.16
##FIRST=	25169.313707327481097,	5807.6787752999953227,	0.20432499051094055176
##DATA TABLE=	(F2++(Y..Y)), PROFILE
5808 35 95 65 105 101 50 35 75 53 146 143 127 71 223 278 163 113 179 159 97 101 74 123 59 48 78 134 102 31 78 59 37 120 43 146 168
5397 168 102 87 117 182 201 199 143 124 57 131 81 154 221 128 46 103 170 104 90 73 164 56 70 58 31 54 218 197 173 142 106 25 136 153
4998 153 46 168 135 142 115 144 79 38 53 40 69 30 51 84 45 157 210 152 140 159 102 133 126 91 96 94 86 127 68 22 98 157 100 83 98 189
4575 189 170 119 90 69 113 162 72 82 176 152 148 175 217 135 150 61 151 164 128 79 79 252 279 139 96 99 129 138 125 81 22 65 147 167 48
4164 48 28 96 103 88 55 117 57 142 47 114 106 116 277 217 103 36 173 221 96 99 131 82 269 95 50 86 133 161 52 53 134 198 102 112
3765 112 178 84 37 74 50 36 120 140 33 86 91 103 188 129 129 177 55 63 31 85 133 31 55 172 97 124 145 157 47 68 112 93 107 238
3366 238 192 128 100 39 176 148 87 73 147 46 101 174 132 118 129 174 133 325 117 49 55 55 97 261 212 314 103 113 74 84 152 124
2991 124 142 240 96 67 123 203 23 314 508 416 205 181 106 71 282 265 19 75 164 177 227 449 214 32 68 41 137 121 225
2650 225 78 67 291 369 27 137 144 216 212 103 97 166 104 261 227 113 247 180 80 108 166 120 49 90 79 21 147 168 150 210 105
2286 105 140 224 175 192 102 102 106 82 178 145 71 176 100 140 216 125 172 325 248 156 554 1221 735 166 206 104 120 239 104 79 46
1923 46 195 296 57 81 88 134 120 104 163 236 163 38 170 112 106 131 142 172 208 93 149 50 73 173 23 89 50 129 43 166 50
1559 50 185 220 90 337 865 1373 696 248 109 15 84 209 238 214 162 29 101 103 102 124 48 150 134 75 162 135 144 90 105 56 105
1195 105 53 92 142 123 66 69 176 90 94 117 44 95 56 53 50 81 172 150 35 62 117 144 105 159 102 21 75 252 141 53 140 78 54 144 178
784 178 68 139 62 65 114 333 430 202 182 81 138 269 38 153 62 99 118 91 126 128 376 537 336 119 144 162 104 19 174 124
432 124 178 99 99 220 164 224 227 33 125 198 156 87 85 143 40 45 72 33 55 77 186 96 61 149 126 104 72 26 81 142 33 105 15 154
33 154 143 239 143 61 135 174 108 5 69 44 186 177 31 153 154 86 73 83 81
-190H1
##PAGE=	F1=3592.91
##FIRST=	25169.313707327481097,	5807.6787752999953227,	0.32366096973419189453
##DATA TABLE=	(F2++(Y..Y)), PROFILE
5808 55 121 96 120 120 71 60 63 56 174 154 149 86 235 314 165 112 156 97 106 76 63 141 50 46 69 155 159 51 129 50 61 130 10 142 155 84
5385 84 87 94 104 135 122 94 97 41 90 52 201 258 140 29 109 213 136 58 126 185 61 77 60 47 74 285 241 170 142 99 22 168 169 59
4986 59 180 109 127 91 122 90 62 58 74 34 35 68 108 64 134 171 175 105 162 98 108 66 91 80 70 104 169 93 1 78 150 86 95 93 151 143 101 60
4540 60 68 115 162 98 101 182 146 138 155 226 170 158 89 152 182 151 86 66 237 251 124 101 115 134 131 130 68 79 92 139 142 50 51 83 69 61 49 106
4094 106 65 195 17 110 94 110 241 199 127 35 172 212 86 134 168 103 270 110 60 78 137 163 83 102 74 131 102 163 174 69 48
3730 48 86 42 67 139 123 51 71 86 120 212 132 129 155 89 75 33 84 100 21 84 212 135 150 141 143 50 81 99 99 122 244 201 119 65 62 154 148
3296 148 102 60 177 51 108 155 98 139 85 127 1049 1672 404 163 91 159 99 236 175 199 69 92 81 105 122 142 437 1634 836
2955 836 152 178 216 116 537 826 503 195 169 92 76 284 235 40 104 142 131 456 764 480 47 113 32 152 79 239 116
2639 116 99 283 341 58 151 127 198 208 114 104 170 67 230 190 78 246 187 99 136 132 91 59 86 100 8 183 165 195 207 100 146
2275 146 225 212 197 83 90 53 48 120 159 53 154 93 142 235 124 127 245 226 57 159 143 201 164 270 89 153 198 133 101 95 177 268
1899 268 81 80 92 151 129 136 188 222 148 79 117 126 81 149 199 146 157 106 169 36 106 147 55 96 68 149 56 182 68 160 181 88 333 887
1500 887 1366 773 196 90 31 132 203 244 236 147 18 110 89 117 124 40 148 152 85 178 171 141 83 87 83 70 88 106 119 130 48 65 194 73
1101 73 58 110 73 66 87 67 60 68 145 152 28 61 93 134 54 158 136 22 96 280 187 55 118 31 99 119 165 65 171 139 118 141 359
714 359 536 247 239 98 87 226 35 106 86 81 177 55 150 111 300 437 242 76 137 166 93 53 105 90 171 107 108 221 184 242 256
350 256 55 84 135 116 94 86 143 32 34 96 51 76 102 192 103 66 152 128 86 39 8 83 126 44 146 39 96 136 241 142 37 117 146
-38 146 128 39 76 51 159 159 16 158 144 96 85 78 63
-190F3
##PAGE=	F1=3490.65
##FIRST=	25169.313707327481097,	5807.6787752999953227,	0.47841671109199523926
##DATA TABLE=	(F2++(Y..Y)), PROFILE
5808 89 150 136 137 129 85 99 55 55 183 154 183 114 235 332 163 105 112 43 102 44 46 150 34 44 43 144 192 66 179 40 76 144 40
5420 40 133 137 61 85 92 26 48 49 49 74 21 29 68 224 275 152 50 84 232 167 19 171 204 66 85 47 55 101 330 269 159 122 85 22
5021 22 194 179 73 173 83 104 53 91 91 78 125 103 69 76 94 133 77 115 126 186 59 180 95 75 4 100 59 52 121 199 116 12 48 132
4622 132 74 117 100 124 111 76 31 93 129 158 124 113 170 125 127 138 220 183 143 117 130 176 147 92 53 209 213 98 99 119 142 132 126 76 128 119
4200 119 133 112 58 73 70 41 43 45 84 78 252 94 150 124 103 202 179 151 16 138 170 74 174 192 117 248 110 51 61 128 148 103 140
3812 140 26 57 104 206 168 57 59 113 35 93 154 122 77 74 74 127 224 139 128 125 118 89 43 94 57 43 114 231 164 180 128 127 63 92 81 87
3390 87 119 232 193 103 37 77 154 172 117 54 199 51 116 148 47 150 37 204 2040 3519 861 353 155 250 109 200 369
3073 369 670 245 143 121 115 145 330 980 3391 1673 325 231 232 138 592 940 496 163 139 98 71 237 184 52 133 110 139
2756 139 569 1003 686 119 152 35 151 34 215 114 110 264 301 91 148 106 158 186 120 98 157 41 154 129 59 226 184 111
2427 111 161 102 44 69 88 139 9 202 155 241 193 81 144 199 237 196 77 101 67 73 108 156 55 103 88 147 231 179 93 151 182 124 690
2040 690 1354 730 267 310 110 183 144 157 115 136 153 222 103 94 89 162 128 149 190 188 130 125 64 141 44 149 229 135 75 116 181 29 120
1653 120 141 88 92 83 153 58 146 77 109 116 94 229 537 929 687 119 45 61 142 168 227 245 119 58 115 75 123 121 28 124 149 93 189 191
1254 191 142 103 79 95 48 133 122 89 131 33 60 186 51 29 124 120 48 108 94 83 58 107 137 30 63 76 115 30 154 157 19 132 307
866 307 230 81 95 84 137 97 143 51 205 211 193 176 354 585 255 268 123 81 177 32 78 100 55 214 165 145 76 221 371 204
514 204 51 122 167 85 78 25 85 159 108 128 222 198 255 264 83 33 67 74 96 90 141 11 32 112 99 91 121 176 101 76 159 129 61 22 21 77 109
80 109 58 184 63 49 148 227 129 50 98 128 153 57 70 59 110 130 20 161 142 124 116 61 47
-190D7
##PAGE=	F1=3388.39
##FIRST=	25169.313707327481097,	5807.6787752999953227,	0.60068023204803466797
##DATA TABLE=	(F2++(Y..Y)), PROFILE
5808 119 178 175 142 126 91 145 66 48 170 143 221 140 229 322 161 85 64 26 86 22 32 154 13 45 18 105 201 76 216 36 84 165
5432 165 99 118 113 38 82 124 83 54 110 44 59 10 49 114 224 270 165 93 35 225 194 34 201 221 72 86 42 50 131 346 278 143
5056 143 82 81 37 209 177 78 148 73 82 26 71 85 81 188 120 93 102 117 150 82 117 108 183 17 193 83 64 64 108 39 64 134 209 136 36
4646 36 28 111 71 150 126 115 86 51 8 126 147 148 143 117 141 98 116 128 196 167 97 128 96 152 117 99 48 176 174 71 97 115 141 137 116 97
4223 97 157 140 131 91 61 90 66 36 41 44 55 90 294 172 220 183 97 170 162 167 29 83 107 69 205 203 130 207 98 34 41 106 119 108 155 12
3801 12 16 108 230 168 58 78 141 23 110 160 137 107 96 77 121 225 152 125 93 131 104 56 107 62 85 125 221 183 204 101 114 84 97
3413 97 58 71 104 200 170 93 47 90 157 202 132 71 200 12 114 140 10 133 27 217 2221 3851 918 409 180 295 124
3096 124 160 450 866 313 191 147 85 125 395 1063 3659 1783 386 226 235 112 488 802 404 123 93 114 54 129 134 43 125
2779 125 77 141 477 820 563 168 154 47 143 13 155 75 98 235 251 115 141 84 102 150 109 85 127 80 52 73 63 192 170 110
2427 110 178 98 12 86 93 158 32 200 144 274 176 48 132 158 241 192 84 122 125 120 121 142 79 45 103 161 211 224 59 87 134 241 1113
2040 1113 2277 1216 351 307 140 192 103 162 140 152 128 171 110 109 83 166 115 145 176 141 124 157 57 157 9 131 231 173 73
1700 73 121 184 36 112 160 119 82 87 134 67 75 75 74 90 127 165 340 918 587 138 68 94 119 112 192 243 91 91 108 58 118 115 18 80 123 96
1277 96 191 202 149 130 91 96 60 164 130 50 121 40 47 152 27 21 155 173 39 117 118 115 60 66 111 29 61 65 87 102 150 166 7 162 317
866 317 254 111 87 137 164 92 117 65 245 271 265 208 315 565 220 270 153 131 134 31 94 101 50 180 189 118 50 163 321 185 52
502 52 93 156 93 96 61 147 152 104 154 224 204 260 251 104 48 80 65 93 102 139 27 47 118 122 102 127 141 88 92 169 124 37 51 13 70 99 74 209
56 209 87 60 165 197 101 55 86 132 169 64 58 65 45 107 22 158 143 156 136 37 41
-190D1
##PAGE=	F1=3286.13
##FIRST=	25169.313707327481097,	5807.6787752999953227,	0.65047097206115722656
##DATA TABLE=	(F2++(Y..Y)), PROFILE
5808 134 198 203 129 117 91 192 90 35 142 125 248 159 219 280 161 84 89 49 68 39 41 154 11 47 48 48 192 83 235 47 81 192
5432 192 160 97 87 23 84 165 157 139 198 83 53 30 125 163 206 246 177 143 38 198 215 76 215 232 79 77 67 45 162 329 269 124
5056 124 30 96 55 214 166 72 110 80 72 36 73 79 81 234 127 91 103 133 152 78 129 124 161 60 186 63 80 104 111 42 84 145 200 157
4657 157 71 40 98 83 182 153 112 76 32 31 154 155 132 154 117 102 72 109 119 160 122 21 116 63 123 67 110 58 143 136 55 108 109 125 141 105
4235 105 101 161 146 135 102 57 94 74 48 43 47 28 104 314 243 289 237 84 146 151 174 66 40 41 75 218 205 141 155 93 55 23 71 80 106 148
3812 148 37 68 116 226 174 73 109 163 13 111 152 157 135 118 95 102 213 171 123 65 127 122 79 107 113 123 112 180 186 211 58 114 97 106 38
3401 38 78 95 146 142 105 58 113 142 221 151 113 165 83 84 101 82 68 83 29 817 1236 210 239 156 265 156 107 371 683 227 187 143
3026 143 88 56 217 273 1060 487 209 126 200 116 287 415 246 105 81 115 65 49 112 32 66 41 119 218 434 431 208 112 50 150
2674 150 25 75 35 75 197 196 127 127 96 43 117 73 74 90 118 86 82 48 153 147 93 193 112 60 121 98 146 67 177 137 276 162 4
2286 4 112 120 221 193 94 129 163 173 114 129 95 7 142 171 184 224 25 69 84 263 1040 2133 1124 304 253 133 174 86 139 169
1934 169 141 103 127 96 110 81 159 90 128 162 90 126 166 92 170 61 99 206 222 149 116 171 43 83 174 140 73 70 91 93 104 62 111 120 142
1523 142 196 631 1267 521 209 114 115 75 49 148 229 72 99 90 33 113 105 11 27 75 89 183 215 164 149 106 96 88 171 124 5 98 64 27
1124 27 98 21 27 178 214 36 116 130 145 74 32 84 23 49 54 49 173 157 162 13 177 302 246 126 105 167 180 107 99 109 290 310 316 228
725 228 249 485 145 251 185 195 105 50 124 96 85 154 164 159 78 150 276 146 73 54 128 118 110 118 219 160 99 181 225 197 256 217 113
338 113 111 142 92 89 117 138 68 71 119 113 108 120 92 65 106 179 107 54 93 12 75 98 87 216 112 96 173 154 64 57 84 142 165 78 45 66 23
-96 23 103 29 151 142 177 132 29 38
-190C8
##PAGE=	F1=3183.88
##FIRST=	25169.313707327481097,	5807.6787752999953227,	0.57075285911560058594
##DATA TABLE=	(F2++(Y..Y)), PROFILE
5808 129 206 217 98 109 89 237 112 18 106 118 255 171 205 207 163 144 164 70 59 69 68 152 38 47 82 13 176 89 238 80 66 219
5432 219 215 72 63 26 88 194 203 197 261 127 58 48 192 207 180 202 188 188 95 155 229 109 213 235 85 61 101 54 191 286 244 106 39
5045 39 119 65 213 148 56 62 86 73 51 76 80 104 259 125 71 77 138 136 70 134 142 122 120 157 48 94 118 108 73 91 156 179 181 108 51 99 104
4610 104 201 165 104 83 28 64 170 143 113 152 115 65 54 103 99 126 55 81 89 43 98 15 122 77 117 98 52 132 102 96 138 105 74 140 135 144
4188 144 136 50 87 89 58 32 53 9 121 312 298 330 267 61 125 147 171 96 60 42 95 210 200 148 100 112 100 7 30 41 111 126 63 105
3789 105 130 194 182 91 151 173 35 92 129 177 162 129 114 77 186 195 120 63 108 144 117 89 164 145 84 126 167 202 5 130 87 141 32
3401 32 118 116 73 125 152 66 152 127 222 188 191 80 230 24 99 195 60 258 479 2655 5202 1585 439 304 162 255 18 287
3073 287 409 58 122 144 269 378 414 1731 5384 2670 292 205 159 249 366 394 41 162 174 85 159 227 142 97 90 14 132
2756 132 311 989 955 267 37 56 186 75 38 91 60 157 139 129 93 148 66 119 14 78 79 128 196 120 11 122 115 67 221 122 101
2392 101 171 100 103 112 144 138 241 148 60 84 98 183 204 102 111 168 229 76 136 89 24 188 173 168 184 56 107 88 208 829 1712 833 162
2005 162 168 94 139 91 95 185 107 80 93 63 92 86 143 55 105 162 46 120 151 121 178 113 65 168 263 198 96 138 46 45 157 153 70 30 39 128
1582 128 221 43 163 130 113 196 713 1230 404 235 137 122 29 16 98 202 78 77 66 12 121 90 11 51 19 70 169 235 181 152 109
1218 109 104 118 154 106 51 65 89 6 40 36 38 178 231 32 104 127 166 87 11 68 15 32 47 16 226 180 148 45 175 265 206 119 134 170
819 170 184 130 89 150 330 325 336 233 169 372 51 223 213 248 87 91 146 96 132 361 400 306 161 196 261 72 98 61 86 145 118 143
444 143 271 179 98 203 223 176 241 170 110 170 183 119 89 130 133 102 96 121 72 110 103 39 35 114 186 79 89 133 41 93 104 95 203 136 118 167
21 167 103 26 85 94 142 139 104 30 60 83 104 50 141 136 180 101 55 28
-190B8
##PAGE=	F1=3081.62
##FIRST=	25169.313707327481097,	5807.6787752999953227,	0.3041528165340423584
##DATA TABLE=	(F2++(Y..Y)), PROFILE
5808 106 199 216 57 113 90 277 125 3 75 131 239 181 190 113 164 225 230 87 64 103 98 144 66 41 98 66 160 92 229 131 39 237
5432 237 253 55 48 40 96 204 212 213 292 164 71 56 241 243 150 145 198 220 135 104 230 124 196 225 84 53 130 72 216 230 213 92 95 137
5033 137 63 210 128 35 14 79 70 69 68 85 153 261 121 61 32 135 113 65 125 144 75 179 110 48 93 119 102 115 80 172 157 201 139 43
4634 43 112 124 199 156 88 104 43 95 174 109 99 142 104 50 44 95 64 101 28 189 61 43 82 65 134 94 103 61 51 161 87 66 123 117 26
4223 26 101 108 155 162 53 70 101 61 6 66 3 136 291 328 328 266 28 100 148 163 111 83 86 128 182 187 148 46 141 139 12 51 22 137 97
3812 97 96 123 151 147 190 101 197 168 73 58 95 198 187 119 134 65 143 218 123 101 83 174 165 57 206 142 91 125 125 182 84 163 52 203 46
3401 46 177 168 43 135 234 118 205 191 205 255 303 74 419 138 276 359 247 548 1248 8115 15277 4331 1293 697 217
3108 217 423 132 381 729 266 83 222 523 878 1275 4823 15393 7583 1105 597 249 458 727 1094 196 292 316
2850 316 23 299 392 214 189 244 73 187 602 1528 1388 318 66 107 223 168 93 166 76 129 97 124 38 207 146 155 66 98 119
2509 119 108 281 139 82 103 78 58 270 123 141 221 94 44 160 138 147 178 127 127 53 96 136 219 111 79 147 281 25 172 71
2157 71 24 226 174 182 157 109 191 171 226 1410 3009 1496 285 132 89 106 115 52 174 65 73 71 30 62 99 125 22 89 173 27
1805 27 101 118 137 180 149 46 135 307 214 67 79 50 31 109 165 77 29 66 156 311 19 194 104 50 164 550 750 258 211 141
1453 141 121 51 69 47 166 111 36 44 44 145 76 39 113 67 40 155 263 196 137 91 124 148 124 80 100 35 112 11 19 46 64 144 217 18
1054 18 82 114 171 92 7 66 20 39 62 59 256 209 126 83 161 217 143 93 162 150 170 150 84 172 355 315 317 222 90 265 74 195 232
667 232 274 75 142 156 97 174 616 737 473 298 293 315 50 117 126 50 161 122 133 290 197 99 219 213 139 213 117 97 218 191 132 96
291 96 132 121 119 117 125 17 106 83 36 5 115 185 50 111 159 65 113 115 95 171 155 119 155 54 11 122 115 127 97 130 8 47 124 94 81
-120 81 129 126 160 52 83 15
-190A5
##PAGE=	F1=2979.36
##FIRST=	25169.313707327481097,	5807.6787752999953227,	0.11018364876508712769
##DATA TABLE=	(F2++(Y..Y)), PROFILE
5808 72 177 202 25 135 95 311 122 23 55 149 202 194 177 47 158 289 268 103 78 138 124 134 93 25 92 103 146 92 211 194 14
5444 14 236 268 64 53 60 104 196 184 185 297 189 89 52 266 268 122 81 209 231 148 49 217 120 168 202 73 73 144 85 231 177 181
5068 181 82 144 145 54 210 110 25 48 57 57 98 50 91 204 243 115 95 21 122 106 69 106 130 44 229 54 52 76 131 102 162 62 194
4681 194 143 212 160 25 131 135 176 129 61 131 75 120 170 63 95 131 78 66 37 87 12 83 103 287 49 62 79 121 145 104 104 48 46 182
4282 182 62 57 98 134 76 58 76 162 161 71 51 108 59 43 83 20 142 261 332 281 235 23 75 152 150 117 78 116 170 138 166 136 14 164
3883 164 162 34 110 44 187 70 143 129 180 129 193 94 237 144 119 49 56 221 211 85 165 93 88 235 140 157 67 213 214 49 239 114
3507 114 152 199 65 167 174 207 35 274 85 250 229 127 177 337 212 267 324 200 345 432 249 622 322 525 557 473 913
3190 913 2188 14818 27596 7687 2369 1212 507 625 338 490 1117 514 212 362 792 1468 2344 8631 27677
2967 27677 13609 2129 1087 453 691 930 1649 450 456 467 64 446 495 297 272 410 136 226 683 1387 1318 310 148
2697 148 194 232 283 131 227 129 128 102 114 54 249 226 193 142 125 174 79 324 134 168 98 69 77 326 121 185 258 79 59 199 172 153
2322 153 131 99 186 35 107 102 230 115 74 127 317 67 216 79 17 240 169 206 196 136 261 239 320 2015 4326 2207 476
2005 476 206 111 90 143 28 138 28 83 67 36 43 120 114 30 101 188 42 85 80 148 178 157 51 123 345 207 55 21 55 74 50 185
1629 185 91 76 129 155 334 9 206 54 48 176 465 346 299 166 132 118 91 108 8 129 150 19 48 74 175 81 72 165 140 7
1277 7 147 294 201 110 60 161 172 112 53 133 30 132 20 37 44 104 77 179 31 59 103 158 92 24 69 35 72 93 109 265 231 96
901 96 119 150 177 89 56 184 117 135 161 74 169 358 284 266 201 32 191 154 175 244 258 70 193 154 84 192 729 923 587 476
549 476 416 423 163 122 189 53 159 125 97 273 205 96 229 193 94 176 69 85 247 168 131 110 120 98 117 131 126 63 91 63 82 24
174 24 114 174 60 112 166 78 124 126 88 137 164 101 146 13 34 144 139 102 63 147 17 34 144 70 119 115 120 122 53 99 40
-190D0
##PAGE=	F1=2877.1
##FIRST=	25169.313707327481097,	5807.6787752999953227,	0.27568981051445007324
##DATA TABLE=	(F2++(Y..Y)), PROFILE
5808 47 143 180 29 169 102 336 105 41 48 157 152 208 168 109 140 315 268 118 100 167 139 132 117 9 69 127 135 86 188 258 41 215
5432 215 254 93 77 86 114 179 128 120 288 199 109 39 264 277 95 28 218 218 135 4 188 95 133 163 58 104 146 89 233 142 153 76
5056 76 175 143 73 213 98 36 94 30 54 127 28 93 237 209 110 147 63 101 128 83 82 107 60 262 15 49 51 164 111 209 60 217
4681 217 131 212 170 52 155 133 142 96 25 154 120 140 160 27 103 130 35 90 27 88 46 60 161 356 46 97 87 163 153 114 115 87
4305 87 38 184 40 72 72 148 151 23 63 162 125 94 37 116 54 96 99 53 139 229 308 195 183 61 62 153 135 119 45 129 210 87 146 108
3906 108 66 170 169 60 166 67 248 51 200 128 216 179 187 72 257 102 166 95 24 244 233 33 205 142 40 240 176 212 79
3566 79 256 248 100 259 69 226 277 51 168 262 252 95 334 145 325 281 211 237 439 318 329 468 247 432 547 430 805
3249 805 525 778 754 702 1277 3117 21490 39794 11010 3442 1737 836 816 567 575 1229 728 365 508 1021 2031 3399
2991 3399 12444 39914 19611 3169 1576 679 903 732 1734 714 614 589 154 564 529 356 320 549 187 252 511
2744 511 581 913 223 213 292 196 392 144 266 206 148 144 98 132 268 293 215 199 149 219 81 319 117 235 103 111 100 366 123
2404 123 230 275 55 129 220 215 148 158 72 224 49 120 96 226 105 108 137 327 126 240 123 29 223 139 206 247 120 265 244
2063 244 322 1873 4043 2092 480 283 81 125 150 51 87 68 93 99 65 44 143 117 46 139 202 77 101 60 167 175 135 67 122 351
1711 351 188 77 98 55 127 21 205 109 102 176 121 288 36 205 22 101 200 582 643 402 137 103 113 113 120 50 97 173 51 78
1359 78 88 200 105 96 196 206 29 145 321 194 77 51 215 183 140 34 139 29 150 21 33 33 148 40 128 76 63 110 132
1019 132 92 48 76 49 105 127 147 260 237 65 146 156 158 119 38 203 93 83 160 58 139 337 241 194 179 40 140 197 171 256 194
655 194 66 234 145 41 172 544 801 623 661 526 526 264 115 227 64 137 133 64 223 195 83 233 161 72 131 52 85 254
326 254 129 112 131 96 64 106 130 118 119 64 44 121 40 119 153 105 90 154 88 123 131 96 132 159 80 141 22 51 138 155 77 75 154 40 29
-85 29 148 43 161 98 125 72 115 99 82
-190H2
##PAGE=	F1=2774.84
##FIRST=	25169.313707327481097,	5807.6787752999953227,	0.28017881512641906738
##DATA TABLE=	(F2++(Y..Y)), PROFILE
5808 54 100 155 37 203 108 348 79 53 46 148 102 221 164 172 107 294 234 134 129 183 140 146 136 33 56 143 132 79 159 310 72 174
5432 174 215 121 112 112 123 161 69 47 278 194 129 38 237 266 73 41 218 185 106 53 146 55 99 111 64 130 143 88 219 126 126 73 185
5045 185 135 122 218 93 48 126 23 83 142 7 84 240 166 112 194 88 75 153 99 58 85 80 271 52 44 24 201 126 250 83 233
4681 233 110 198 168 98 179 121 113 72 21 162 165 154 144 47 119 139 40 115 16 110 105 28 188 386 43 138 102 183 158 132 130 136 33 164
4282 164 54 87 56 148 202 5 77 154 63 115 33 133 46 144 110 95 130 207 264 89 128 94 70 152 116 120 10 131 236 43 150
3918 150 62 118 158 167 84 203 78 301 43 257 129 254 254 166 62 248 48 204 143 8 261 251 26 241 192 63 231
3601 231 216 249 104 289 259 165 263 27 283 323 116 181 329 286 160 364 213 387 305 273 291 516 404 383 581 335 490
3284 490 617 576 927 703 976 901 887 1556 3826 26658 49170 13556 4272 2149 1113 959 766 736 1066 903 483
3038 483 620 1159 2440 4203 15431 49410 24266 4002 1959 876 1062 307 1224 975 728 649 225 624 541 379
2803 379 319 641 218 302 220 1056 1216 103 261 375 124 467 139 282 286 175 181 77 195 266 334 215 226 159 243 111 270
2486 270 104 262 114 165 112 372 124 263 270 40 189 220 240 125 215 61 229 73 126 107 201 78 141 168 311 164 227 168
2157 168 61 178 78 166 265 63 185 193 179 846 1853 1006 276 310 27 226 127 142 53 158 100 168 98 42 170 132 45 186
1829 186 209 128 144 69 199 175 96 85 113 309 159 106 182 54 181 40 211 122 98 194 71 209 56 193 70 122 176 575
1500 575 715 372 144 86 103 120 97 86 72 174 65 109 80 213 133 101 204 257 59 148 339 175 45 96 274 172 176 29
1171 29 114 13 167 18 45 18 184 134 87 123 94 127 106 102 70 88 56 127 152 166 250 224 48 155 177 147 191 66 223 93 52
807 52 155 45 88 297 196 124 174 63 99 191 184 273 97 57 264 139 54 137 78 803 699 814 579 581 324 110 228 49 100
467 100 148 79 147 165 59 226 123 105 85 78 100 239 87 76 153 67 20 103 112 95 152 31 38 147 38 136 125 148 51 128 98 107 128
80 128 135 170 138 83 136 43 66 101 155 62 107 159 50 30 145 29 196 79 138 23 170 82 124
-190A24
##PAGE=	F1=2672.59
##FIRST=	25169.313707327481097,	5807.6787752999953227,	0.32216671109199523926
##DATA TABLE=	(F2++(Y..Y)), PROFILE
5808 68 52 133 29 226 113 341 63 60 46 130 68 227 158 200 60 232 179 151 162 178 126 169 146 62 79 160 143 78 123 336 92
5444 92 122 158 138 149 128 129 149 74 81 268 176 150 67 186 236 54 66 205 140 71 95 104 7 76 47 102 142 144 87 191 115 97 71 172
5045 172 128 175 222 96 52 142 34 120 135 29 63 215 121 121 223 89 55 158 106 36 70 80 257 82 54 8 220 140 277 108
4693 108 234 78 170 152 135 198 104 107 70 74 151 198 157 123 72 135 144 101 140 16 145 153 16 180 372 53 173 120 179 161 161 144 173
4305 173 45 127 84 91 56 132 209 15 91 138 45 128 41 155 39 172 113 133 119 195 206 14 87 113 85 145 98 114 71 128 238 20
3930 20 188 13 162 133 163 102 210 76 331 52 298 136 285 312 127 95 207 20 226 171 6 266 263 80 256 232 108
3613 108 205 243 254 126 297 242 220 244 43 309 321 177 195 360 299 207 352 271 417 289 303 316 546 445 417 634 418 498
3284 498 619 654 956 815 1066 958 988 1674 4146 29096 53492 14714 4664 2345 1265 1021 881 940 773 1016 539
3038 539 668 1174 2595 4568 16881 53893 26455 4431 2147 1001 1147 1126 363 1165 768 629 262 615 591 384
2803 384 274 676 230 374 128 2033 1844 52 289 424 39 489 119 279 344 199 192 57 229 250 345 199 218 152 245
2509 245 134 190 113 241 128 205 115 342 111 272 251 68 230 203 240 92 249 61 203 92 127 113 162 38 156 190 278
2193 278 182 179 191 102 122 32 109 256 23 51 162 85 786 1574 791 219 282 136 346 83 258 63 254 109 254 131 33
1876 33 197 143 34 226 199 177 192 81 236 173 83 93 100 233 125 127 244 57 226 41 195 117 76 187 35 155 54 164
1547 164 128 117 123 373 420 204 174 154 91 115 49 106 48 161 60 123 55 210 153 83 198 288 84 155 345 150 21 148 318
1207 318 140 190 26 74 43 183 23 88 5 202 226 73 161 124 141 100 117 84 105 52 132 162 164 235 196 65 142 194 126 250 106
843 106 240 97 101 162 52 25 244 165 80 192 74 121 141 204 295 85 37 289 150 167 206 1031 1939 1041 904 551 562 337
514 337 127 193 29 58 170 111 58 118 29 203 98 150 44 113 116 203 56 26 172 41 28 112 80 58 153 28 57 161 24 164
162 164 95 168 35 107 104 81 117 190 218 106 109 126 54 81 48 136 59 124 166 41 29 140 31 219 60 150 41 202 55 158
-190A58
##PAGE=	F1=2570.33
##FIRST=	25169.313707327481097,	5807.6787752999953227,	0.37946462631225585938
##DATA TABLE=	(F2++(Y..Y)), PROFILE
5808 70 3 117 15 228 121 313 71 67 50 121 64 218 146 189 19 153 126 172 191 149 101 187 148 87 112 174 163 94 81 329 96
5444 96 76 98 139 178 129 133 139 126 147 251 151 171 105 119 193 39 70 175 96 41 126 93 48 74 28 151 145 157 92 151 104 63 67 135 128
5033 128 211 224 102 45 144 36 143 112 69 35 170 81 129 227 69 57 135 92 16 64 57 222 94 76 24 210 150 283 125 222
4681 222 53 131 122 149 208 83 115 88 128 120 206 142 102 77 142 134 156 163 35 180 189 46 138 319 78 197 136 154 160 190 153 186 76
4294 76 89 105 90 61 103 167 39 91 120 114 137 62 166 34 172 111 152 105 188 145 94 75 112 93 133 84 102 124 121 216 14 242 74
3906 74 190 104 160 108 181 64 325 75 313 152 302 333 75 141 139 76 226 169 26 255 265 113 246 254 137 165 248 221 134
3566 134 272 199 251 199 65 300 274 213 202 343 287 226 295 305 407 232 295 296 519 426 426 614 463 448 546 648 879 836 1023 903
3214 903 983 1596 3993 28203 51695 14189 4528 2273 1248 987 879 1048 529 1019 522 641 1062 2460 4409 16418
2979 16418 52224 25614 4353 2090 1019 1124 1976 657 1159 724 532 261 546 649 391 203 654 231 429 112
2744 112 2094 1812 14 284 434 34 453 88 264 361 218 169 36 233 225 329 173 184 131 227 137 100 139 179 141 227 126
2427 126 287 81 257 224 113 253 180 224 67 244 47 157 106 126 103 119 18 155 183 243 188 112 183 132 89 82 98 238 67
2087 67 83 177 253 1980 4108 2017 444 255 202 424 43 353 61 324 110 324 149 32 214 133 37 247 163 204 233
1793 233 81 261 163 111 76 102 166 101 137 270 52 254 29 162 84 75 163 35 180 42 118 186 114 118 236 111 37 195 250
1453 250 85 100 68 107 16 148 46 113 27 187 159 58 194 296 103 162 338 123 25 184 331 105 173 17 80 97 195 40
1124 40 125 5 194 288 79 182 135 144 112 123 88 118 36 125 158 143 209 160 93 113 191 87 275 148 251 84 163 193 69 51 187
761 187 156 71 218 80 209 60 221 311 202 24 313 186 300 381 2280 3688 1633 926 449 470 310 166 134 93 30
467 30 192 125 44 63 21 157 108 179 37 144 122 154 41 41 186 24 78 119 57 12 126 59 84 165 54 198 65 159 81 117 93
103 93 58 103 240 249 78 133 107 54 94 35 106 64 121 171 14 34 130 38 223 44 151 79 207 27 178
-190A78
##PAGE=	F1=2468.07
##FIRST=	25169.313707327481097,	5807.6787752999953227,	0.44561538100242614746
##DATA TABLE=	(F2++(Y..Y)), PROFILE
5808 58 41 111 41 205 131 265 85 77 62 130 82 190 126 149 58 116 100 194 205 98 71 194 142 105 138 179 186 123 35 288 89 71
5432 71 65 127 194 115 138 126 165 179 217 123 189 137 54 150 30 56 133 67 21 144 122 93 83 94 197 146 176 102 110 94 25 57 82 130 223
5021 223 222 104 29 135 35 142 89 107 42 118 54 126 206 36 69 91 56 17 65 38 180 94 96 44 171 153 262 132 210 67 95
4657 95 79 139 207 53 120 114 176 75 185 103 83 61 135 106 190 183 61 208 212 66 72 240 100 205 145 116 153 203 154 171 114 79 113
4270 113 93 64 78 84 70 81 110 170 142 91 156 37 141 103 144 85 177 90 139 77 92 91 120 85 94 158 111 174 24 287 142 203 83
3883 83 153 103 118 49 281 102 295 172 297 309 20 173 68 126 203 144 63 228 256 118 213 253 144 116 230 155 127 213 141
3542 141 252 131 68 262 197 222 199 277 252 213 202 307 359 142 254 230 440 345 409 525 453 348 409 566 704 763 858 740 876
3202 876 1338 3401 24206 44228 12108 3901 1948 1054 855 767 983 450 888 439 545 845 2067 3772 14131
2979 14131 44767 21925 3787 1792 910 932 2117 868 834 610 383 229 437 625 375 150 582 229 447 365 1058
2732 1058 933 134 242 416 68 373 75 245 335 226 118 21 219 193 298 145 137 106 193 124 51 171 94 145 235 161 227 40
2404 40 224 186 149 267 165 200 67 207 21 112 118 124 74 85 58 146 139 210 195 48 143 138 105 96 125 217 69 142 123 241 2059 4239
2028 4239 2010 455 318 158 417 68 380 21 335 91 348 142 49 212 91 52 239 95 196 256 75 262 145
1758 145 133 28 120 131 96 134 257 37 258 26 123 21 107 143 130 308 96 60 233 133 129 367 366 180 178 314 94 84 149
1418 149 101 30 138 44 77 31 145 152 64 203 281 114 165 321 98 52 195 306 101 140 35 130 147 202 61 131 14 158 309
1077 309 84 188 120 140 117 112 85 119 9 118 143 114 165 126 111 79 162 36 260 188 253 48 203 241 78 116 137 160 79 236
725 236 86 294 29 233 310 306 49 337 236 424 573 3566 5545 2288 895 338 328 265 210 89 179 44 205 113 119 21
420 21 47 89 141 183 59 164 114 96 53 95 194 22 124 112 88 45 83 81 103 160 115 228 36 122 131 155 59 62 91 269 252 75 139
33 139 85 43 103 82 90 75 103 163 34 61 108 53 213 42 136 102 184 24 182
-190A82
##PAGE=	F1=2365.81
##FIRST=	25169.313707327481097,	5807.6787752999953227,	0.48709630966186523438
##DATA TABLE=	(F2++(Y..Y)), PROFILE
5808 38 79 113 77 161 137 205 84 92 85 142 112 145 105 105 103 152 107 212 197 31 45 189 130 117 154 170 207 156 21 221 76 109 77 110
5409 110 191 96 147 103 182 168 162 98 196 158 74 130 27 29 84 52 26 151 156 127 90 150 232 152 190 110 82 94 25 48 23 131 215 219 98
4998 98 14 121 52 118 84 132 81 73 43 107 164 9 73 43 38 34 68 69 144 90 105 62 112 147 215 138 213 99 90 44 112 197 15 118 139
4587 139 210 28 150 50 67 30 115 67 197 199 87 223 227 73 21 152 106 203 141 74 139 193 147 136 143 95 119 102 72 85 22 100
4211 100 78 110 195 148 122 125 48 92 91 106 56 158 51 145 74 58 80 107 101 100 167 96 124 69 310 195 205 83 139 97 33 36 207 122
3812 122 246 192 268 245 31 181 69 163 163 126 103 192 233 95 168 229 133 64 203 74 105 132 81 220 53 61 213 121 207 184 176
3448 176 205 178 93 281 293 41 191 132 328 219 373 383 391 222 241 435 466 619 613 504 697 963 2510 18077 32900 8971
3143 8971 2939 1451 722 667 587 776 536 655 315 401 569 1511 2813 10549 33298 16262 2869 1318 682 531
2909 531 1264 717 206 453 224 180 318 473 307 161 471 231 426 845 907 747 341 187 386 65 273 108 222 277
2627 277 231 51 48 197 156 266 117 93 84 151 111 82 201 24 136 240 212 185 31 186 137 160 282 162 172 79 156 64 87 132
2275 132 117 29 57 101 137 62 169 210 6 95 128 149 46 139 199 109 106 58 51 690 1338 512 384 431 64 314 165 316 84 278
1923 278 72 309 123 79 188 29 65 205 23 156 255 87 232 140 123 52 142 102 101 115 220 76 235 41 93 63 140 153
1594 153 265 486 178 10 256 160 98 375 350 219 109 318 115 102 219 112 84 123 64 35 55 91 139 100 219 245 112 162
1265 162 300 76 86 181 243 128 146 89 163 178 205 80 101 32 96 288 87 185 81 135 100 83 80 101 29 127 125 103 107 101 114 66 111
878 111 44 209 220 250 22 213 288 73 167 103 161 100 238 94 339 105 239 289 370 76 355 287 517 725 4614 7072 2823
561 2823 837 335 178 223 247 105 255 64 202 90 167 51 72 25 173 166 76 169 101 44 81 133 199 35 158 92 140 99 52
221 52 87 107 146 178 245 24 78 166 191 10 90 85 269 227 90 126 71 30 102 120 121 95 81 137 82 106 71 73 197 52 104 104 143 47 169
-190A69
##PAGE=	F1=2263.55
##FIRST=	25169.313707327481097,	5807.6787752999953227,	0.3516528010368347168
##DATA TABLE=	(F2++(Y..Y)), PROFILE
5808 17 105 118 106 107 134 141 58 108 115 145 143 95 98 93 133 194 120 218 170 44 31 183 121 125 166 147 222 182 67 141 68 149 98 105 174 95 161 71
5362 71 180 118 100 80 187 164 143 145 30 1 43 36 49 154 172 146 89 187 253 160 193 108 79 100 70 52 47 124 208 220 81 38 108 80
4963 80 83 87 134 116 45 45 85 111 44 74 36 91 46 71 110 119 90 106 74 47 134 148 151 232 122 117 67 94 178 41 115 154 227 27 135 49
4540 49 51 17 88 44 180 213 109 227 237 81 91 81 93 192 120 44 117 160 131 103 149 102 134 113 94 118 121 118 88 114 188 156 147 81 68
4129 68 60 73 46 35 129 37 122 65 38 68 96 119 108 149 79 77 127 304 222 200 97 116 109 59 27 121 126 175 207 219 154 60 167 124 187 116
3707 116 148 137 156 199 59 124 185 115 17 186 35 73 48 29 165 32 72 179 87 182 156 76 159 132 54 238 241 57 119 37 209
3343 209 87 331 217 292 106 91 291 218 443 349 251 490 562 1521 11230 20313 5498 1862 898 330 520 400 553 696
3061 696 427 192 243 294 917 1749 6489 20453 9932 1812 775 383 196 1128 2128 653 290 120 129 214 266 230 195
2791 195 344 232 349 1141 2187 1741 479 147 343 43 175 138 192 210 239 29 86 173 120 243 92 63 63 108 110 104 221 75
2462 75 112 244 258 166 71 157 81 140 300 165 140 83 105 131 84 142 113 17 32 139 130 44 115 227 48 96 149 198 64 155 225 241
2087 241 62 314 473 1713 4059 2416 771 471 273 156 286 184 189 173 119 217 136 121 163 73 78 160 105 115 230 114 179
1770 179 165 83 134 152 57 108 85 191 156 192 69 84 146 167 186 369 598 227 51 257 182 116 191 91 155 42 258 139 155
1430 155 260 144 136 93 95 67 77 56 126 131 230 195 93 154 281 57 120 146 157 149 212 158 158 187 206 92 67 61 19 235 90 178 24
1042 24 126 59 51 75 63 67 148 110 136 76 86 104 81 57 98 135 235 246 76 195 317 59 201 92 146 132 224 103 331 151 240
678 240 254 385 84 359 324 562 796 5186 7901 3096 767 431 89 205 275 136 301 75 182 93 179 83 91 93 194 141
373 141 81 153 97 42 106 147 206 53 177 70 181 145 65 77 94 119 224 243 43 86 179 207 54 117 89 242 184 97 107 82 34
9 34 91 142 181 129 67 98 122 157 29 87 179 60 64 84 99 75 143
-190A43
##PAGE=	F1=2161.3
##FIRST=	25169.313707327481097,	5807.6787752999953227,	0.1198940277099609375
##DATA TABLE=	(F2++(Y..Y)), PROFILE
5808 11 114 122 123 57 116 84 12 119 146 136 163 69 114 115 144 203 123 208 151 118 35 188 122 133 177 117 232 193 111 62 70 175 108 120 150
5397 150 121 173 30 168 47 84 70 165 161 196 177 36 36 36 11 71 158 161 148 77 198 257 162 183 92 87 107 114 67 96 111 222 228 57 76
4986 76 101 98 54 78 110 134 35 51 87 62 81 89 54 146 47 72 138 99 92 102 76 24 116 78 177 249 129 142 112 103 153 88 117 153 225 52
4564 52 165 105 36 60 71 56 148 224 122 221 239 101 155 67 66 174 83 37 90 113 110 107 123 88 156 123 120 148 194 121 95 111 156 164 162 48
4141 48 92 79 57 35 54 96 36 89 52 68 61 86 127 96 116 62 47 179 271 216 187 110 88 141 141 15 53 111 98 210 164 59 64 136 162
3730 162 202 71 193 157 125 160 45 90 132 98 22 180 81 46 24 25 101 82 105 175 98 159 126 112 126 93 130 192 223 120 53 77 112
3343 112 92 297 65 178 59 100 167 63 279 128 114 299 222 636 5084 9056 2403 886 411 25 483 263 441 816
3061 816 372 134 110 95 404 794 2811 8939 4280 842 318 103 687 2919 3758 1257 170 129 93 143 220 243 188 223
2779 223 206 199 953 2092 1609 414 102 260 30 86 126 152 148 253 82 111 147 93 226 72 54 34 70 121 99 224 123 79
2451 79 236 280 162 107 136 34 94 308 161 123 82 58 181 92 131 121 46 30 160 126 124 62 227 86 125 198 221 155 184 281 363
2087 363 132 531 868 3830 8631 4786 1157 348 461 46 379 62 259 72 180 109 175 163 159 130 89 129 184 119 187 119
1782 119 117 193 32 190 140 17 110 54 195 225 144 106 84 202 188 213 361 521 193 91 245 192 232 148 396 64 137 156 151 204
1430 204 268 175 169 59 127 132 97 86 119 144 234 146 52 141 263 37 143 98 67 152 285 228 118 181 207 91 115 99 64 168 97 167
1054 167 36 103 14 62 67 17 100 165 105 192 124 79 93 98 55 139 70 226 240 131 158 321 43 217 95 112 160 201 115 276 161
690 161 229 222 360 68 351 338 551 766 5154 7829 3032 676 502 130 212 291 137 305 75 147 126 154 99 107 166 203 118
373 118 83 114 112 82 111 137 214 66 177 57 199 180 83 56 66 82 238 219 64 138 175 195 99 128 102 195 134 87 101 103 47 73 153
-14 153 245 180 66 56 140 205 44 89 158 60 44 45 75 106 108
-190A08
##PAGE=	F1=2059.04
##FIRST=	25169.313707327481097,	5807.6787752999953227,	0.16096141934394836426
##DATA TABLE=	(F2++(Y..Y)), PROFILE
5808 27 107 123 125 30 86 47 49 125 168 121 162 88 143 136 137 174 118 187 180 181 52 201 139 143 185 88 237 186 148 14 83 184 107 147 130 158
5385 158 177 16 154 38 137 68 147 158 222 202 38 75 52 23 88 162 125 136 59 181 245 153 161 61 87 113 148 80 124 97 250 241
5010 241 28 116 99 95 41 55 68 132 39 60 120 41 117 118 55 174 35 69 147 74 87 98 64 65 97 60 210 245 126 150 146 119 118 122 120 135
4587 135 208 57 211 145 41 101 70 65 116 226 119 209 228 128 196 90 38 146 41 45 61 62 89 145 65 57 172 130 141 164 223 107
4211 107 83 96 115 171 166 50 115 103 63 97 93 68 34 66 33 106 63 78 118 57 90 48 42 211 218 176 162 114 62 177 199 6 56 80 31
3801 31 200 127 51 48 100 169 212 38 226 159 98 126 69 72 81 87 43 171 114 62 61 61 49 102 140 187 101 147 124 200 110 71 183 154 224 143
3378 143 20 128 69 177 273 107 74 77 162 86 164 158 39 217 159 20 66 658 988 219 168 101 220 433 197 405 833 457
3049 457 145 59 126 58 103 260 842 366 144 250 99 995 3766 4115 1287 153 150 66 76 227 241 128 135 138 170 463 428
2732 428 247 166 100 122 47 40 60 106 90 261 125 107 131 81 208 55 67 22 36 127 90 202 153 47 206 260 160 139 110 14 54
2369 54 284 137 132 91 7 193 110 84 131 39 37 147 135 164 50 195 107 112 214 188 178 177 279 392 105 566 953 4256 9531
2028 9531 5205 1071 72 480 44 382 90 250 33 186 57 182 188 153 139 84 119 216 142 146 73 64 188 7 197 113 27
1711 27 102 32 207 246 110 133 82 210 205 216 194 218 74 126 240 181 335 345 652 42 226 44 141 219 252 185 174 64 146 190
1359 190 117 136 112 136 231 129 14 127 242 10 146 48 7 139 327 278 63 171 206 79 193 145 136 113 107 150 88 62 56 97
1007 97 53 46 123 166 110 244 186 73 91 102 90 154 87 192 227 171 117 300 32 222 99 62 171 180 129 191 141 202 208 309 37 335
631 335 326 489 641 4537 6878 2645 546 494 190 237 291 96 263 70 107 155 103 97 125 207 204 97 99 63 129 113 90 119 216 68
279 68 162 52 190 198 82 40 25 43 213 178 82 181 169 160 114 116 119 143 92 71 115 118 53 52 159 296 241 79 30 130 242 94 76 126
-120 126 48 63 9 76 130 69
-190F9
##PAGE=	F1=1956.78
##FIRST=	25169.313707327481097,	5807.6787752999953227,	0.24374464154243469238
##DATA TABLE=	(F2++(Y..Y)), PROFILE
5808 48 85 119 113 44 47 55 109 129 176 103 139 110 168 141 118 116 109 173 246 231 79 211 164 156 182 67 238 159 176 59 99 180 103 178 123 186
5385 186 175 61 141 94 194 73 157 163 217 213 37 117 61 55 97 163 75 113 41 139 221 136 131 26 71 114 164 82 126 87 264 252 15
4998 15 151 100 69 28 43 36 108 46 74 157 55 152 145 40 169 30 62 141 52 70 99 42 89 79 103 241 212 129 141 161 120 74 132
4610 132 116 108 187 41 244 153 62 131 77 51 97 213 99 195 201 147 211 102 38 111 43 55 36 20 77 182 12 21 170 133 149 163
4235 163 207 78 50 70 76 174 158 59 131 101 91 145 139 66 30 64 13 134 72 74 88 37 103 46 53 213 155 111 125 108 46 200 229 23
3836 23 72 48 26 180 137 112 41 66 150 218 23 230 147 68 113 92 68 54 84 51 147 141 109 65 91 41 85 166 198 83 149 162 256 104
3437 104 58 201 131 215 129 47 137 76 217 261 210 72 70 171 60 213 92 76 292 85 93 352 1671 3230 962 238 131
3120 131 296 201 173 338 759 508 144 81 174 126 303 1176 3386 1665 233 354 199 853 2559 2264 626 172 132 33
2838 33 75 31 116 170 131 76 399 1235 3149 2706 478 252 56 94 138 46 93 49 247 157 73 142 114 180 43 91 72 35 116 106
2486 106 160 176 37 155 194 149 171 67 22 72 221 94 145 131 60 156 140 8 119 12 49 92 185 152 72 150 112 52 161 123
2134 123 85 96 166 312 131 343 569 2312 5080 2803 375 315 295 86 267 74 184 63 106 62 130 197 114 112 52 127 187
1817 187 149 120 37 38 147 22 159 133 91 90 15 190 203 101 133 88 164 209 205 115 363 187 163 254 153 373 374 606 127 270 56
1453 56 121 188 226 171 151 102 149 232 138 184 104 117 220 153 95 115 213 25 129 26 51 123 326 291 20 157 201 64 249 192 187
1089 187 100 124 132 122 28 98 118 37 88 132 152 122 274 225 63 101 97 110 143 136 153 204 191 89 261 19 225 99 12 159 166 144 105
702 105 108 163 208 249 46 315 290 391 454 3494 5288 2026 376 413 238 268 274 26 182 63 73 156 45 82 145 208 198 68
373 68 134 60 131 128 48 114 205 66 140 54 155 198 59 48 28 41 155 128 103 199 177 125 90 80 136 105 67 74 135 116 52 40 159 321
-26 321 299 99 33 93 259 139 54 83 29 83 68 77 139 33
-190C3
##PAGE=	F1=1854.52
##FIRST=	25169.313707327481097,	5807.6787752999953227,	0.21447363495826721191
##DATA TABLE=	(F2++(Y..Y)), PROFILE
5808 70 54 110 94 75 9 89 156 135 168 82 109 113 178 137 91 46 102 186 312 263 107 207 186 170 164 57 235 117 193 90 114 178 103
5420 103 208 133 193 178 103 131 124 225 79 190 177 192 214 32 152 63 80 99 157 42 83 36 79 191 117 97 35 41 107 161 74 104
5045 104 92 249 249 33 174 101 33 14 67 57 68 46 90 183 68 180 159 32 137 56 53 133 58 41 108 31 95 62 137 258 158
4681 158 150 123 156 104 38 118 101 88 171 8 256 129 78 146 77 25 92 183 70 182 157 152 201 94 59 72 80 67 22 8 80 207 92
4294 92 8 147 133 143 147 154 45 5 44 46 171 141 54 137 73 118 174 190 84 34 69 41 145 81 79 40 113 143 59 61 185 93 48 87 95
3883 95 49 200 235 39 61 47 49 156 175 150 70 39 114 218 34 206 126 35 126 106 69 57 98 48 111 181 164 49 106 54 40 182
3507 182 198 53 160 209 268 98 46 192 125 187 91 73 115 86 210 266 278 148 32 135 72 185 69 69 296 65 88 424 2150
3167 2150 4044 1178 365 133 553 381 158 229 650 485 101 78 160 143 419 1301 3859 1798 268 305 465 631 1053
2897 1053 2195 1068 127 134 71 269 443 354 340 191 147 538 2125 5842 4885 898 398 206 148 231 159 148 77 203 174
2603 174 29 167 179 142 48 117 126 77 83 133 130 201 60 103 92 121 202 16 71 100 127 89 137 191 134 94 177 102 88 97 109 33 276 130
2204 130 115 185 144 136 89 212 119 131 147 288 507 242 347 3293 6347 3135 630 549 309 340 167 103 261 183 66 52 84
1887 84 212 88 171 42 179 104 152 115 187 71 134 32 130 222 204 98 39 143 128 117 100 113 78 192 201 413 803 369 188
1547 188 278 145 338 220 282 307 277 115 127 123 202 152 118 131 142 250 149 232 95 110 204 183 182 106 179 61 107 61 64 118 282 263
1171 263 37 133 193 67 264 235 212 122 148 125 142 83 116 115 30 110 129 135 131 276 236 50 115 94 109 107 164 143 178 193 85 215 34
784 34 234 95 45 129 162 157 47 79 133 204 191 92 293 235 276 249 2274 3438 1317 186 309 275 301 242 84 79 57 47 130 24
432 24 78 166 167 183 29 177 127 113 122 8 126 176 84 126 70 103 179 49 75 88 73 79 79 132 193 201 127 34 34 148 102 59 98 149 100 57
9 57 48 152 313 336 117 41 39 252 173 30 53 16 86 119 63 125 8
-190H
##PAGE=	F1=1752.27
##FIRST=	25169.313707327481097,	5807.6787752999953227,	0.10887750238180160522
##DATA TABLE=	(F2++(Y..Y)), PROFILE
5808 92 22 102 75 116 21 124 182 140 144 53 97 97 169 136 65 36 100 217 354 277 132 185 196 180 130 52 226 72 198 108 122 188 113
5420 113 237 161 175 198 137 123 125 224 80 221 193 162 214 29 170 67 91 98 150 64 51 48 22 164 107 65 62 5 82 141 61 68 114 210
5021 210 225 49 183 99 60 51 95 86 25 37 101 192 73 196 158 44 101 84 44 132 85 12 125 58 86 44 144 255 96 184 113
4657 113 134 79 58 89 78 91 169 32 251 82 80 146 68 49 90 139 59 169 102 142 173 74 74 38 103 78 20 29 93 220 152 15 106
4270 106 131 125 121 83 37 50 51 27 160 117 38 134 31 128 186 238 102 46 72 80 142 79 87 24 199 184 78 61 135 49 75 61 81 66 177
3859 177 225 47 33 67 52 132 206 166 101 19 73 206 59 162 104 31 154 117 65 65 121 42 79 226 218 62 98 61 16 193 185 27
3484 27 169 240 240 82 36 171 129 147 57 100 84 92 175 284 310 209 39 80 91 110 70 86 254 69 72 332 1467 2726 821
3143 821 315 73 1144 1161 137 110 540 416 47 49 118 79 360 708 2188 879 137 136 947 1455 5180 6789 2312 73
2862 73 196 145 488 949 779 458 215 194 438 2212 6033 4962 975 413 266 181 265 244 239 101 123 161 56 171 239 115
2556 115 75 132 167 110 39 141 149 224 94 84 42 75 218 67 131 103 52 162 110 241 195 114 208 188 92 181 196 96 364 179 173
2193 173 285 210 273 166 373 359 312 392 461 904 709 1220 7952 16486 8361 1163 940 740 631 374 287 454 333 241 113
1899 113 176 240 161 305 100 262 7 167 110 340 129 207 53 140 323 328 124 88 93 141 149 51 132 14 155 200 513 841 367
1559 367 178 286 185 254 114 153 501 270 137 157 53 184 154 102 140 143 236 139 279 92 126 189 193 253 98 145 87 116 95 54
1207 54 125 214 217 143 126 182 84 239 263 216 140 173 139 160 140 110 95 32 104 117 128 130 253 227 59 121 98 96 58 166 172 159 178 104 169
796 169 80 252 85 79 98 167 165 39 59 130 184 138 127 264 174 164 80 1137 1730 664 31 264 300 330 199 178 25 49 35 88
444 88 55 112 185 101 155 13 212 191 91 99 51 137 133 127 127 92 51 144 90 107 145 103 26 40 161 172 219 164 49 56 151 121 52 118 153 80
21 80 78 69 138 270 339 119 50 47 220 188 10 67 26 74 150 34 91 23
-190B3
##PAGE=	F1=1650.01
##FIRST=	25169.313707327481097,	5807.6787752999953227,	0.28839898109436035156
##DATA TABLE=	(F2++(Y..Y)), PROFILE
5808 108 8 97 66 156 42 145 186 137 111 20 112 71 142 147 57 77 102 241 363 272 146 152 187 182 85 46 209 49 193 119 118 210
5432 210 128 264 203 138 227 159 119 107 192 70 232 198 144 216 33 160 76 90 93 144 87 24 67 51 145 113 35 66 33 35 115 50 56 152
5033 152 169 176 56 174 93 116 99 108 102 34 34 97 183 74 196 147 51 85 95 37 137 110 41 144 99 67 23 123 229 46 216 125
4657 125 103 62 93 61 61 110 173 69 237 29 71 133 51 91 89 90 95 149 45 123 140 50 78 20 100 86 20 49 108 225 177 18 53 118
4258 118 100 93 32 69 88 82 19 142 92 25 126 10 117 190 270 111 57 72 111 130 66 91 83 272 216 95 48 79 61 130 47 74 86
3871 86 137 207 44 32 71 41 110 215 170 113 5 48 177 85 107 89 67 183 124 52 65 137 40 57 250 269 106 65 74 68 200 156
3495 156 15 162 244 186 53 38 154 130 106 62 131 73 103 144 298 315 238 93 53 115 58 74 133 205 98 106 200 425 749 303
3143 303 202 111 1902 2087 127 64 452 351 108 22 109 64 243 185 685 258 253 67 1497 2464 7607 9064 2518 292
2862 292 226 181 624 1195 1013 408 156 145 213 1334 2504 1944 518 223 187 196 206 285 348 70 18 104 90 135 259 125 115
2545 115 126 194 104 27 117 181 230 119 82 124 33 197 123 166 92 71 230 106 245 212 186 207 212 126 215 263 130 388 239 194 337
2181 337 243 333 225 438 516 394 537 551 1081 950 1673 9976 20808 10508 390 2524 1143 814 562 428 553 413
1923 413 350 180 247 229 221 399 129 315 92 156 70 436 177 268 45 104 427 417 140 121 62 200 176 27 108 71 115 154 255
1582 255 281 60 153 242 236 159 314 464 613 254 127 167 23 166 176 99 128 154 186 94 312 102 141 182 186 287 86 122 89 156
1230 156 120 38 135 141 214 322 200 164 94 187 270 210 134 188 179 192 168 88 75 24 74 97 127 111 213 216 99 109 99 82 14 147 200 145
831 145 150 136 137 130 276 70 97 76 183 165 42 38 140 143 93 138 229 128 78 86 283 471 177 133 316 323 344 153 244 113 39 56 59
444 59 76 165 197 55 113 47 230 231 100 69 76 135 98 177 132 103 47 99 144 144 187 123 58 18 181 153 214 198 127 113 144 137 41 120 150 69
21 69 107 94 118 202 304 100 68 99 167 180 15 83 39 59 153 24 51 41
-190D1
##PAGE=	F1=1547.75
##FIRST=	25169.313707327481097,	5807.6787752999953227,	0.59768503904342651367
##DATA TABLE=	(F2++(Y..Y)), PROFILE
5808 118 16 97 71 181 61 145 173 121 74 30 137 48 114 163 78 87 106 235 342 253 147 118 157 172 43 35 188 60 187 130
5456 130 104 234 140 285 243 110 247 169 121 84 136 43 219 188 147 214 52 123 83 80 88 138 83 21 89 85 132 136 4 43 61 31 99
5068 99 49 84 197 152 108 58 154 84 162 139 104 106 65 58 72 161 76 182 137 40 75 80 38 144 127 73 158 141 44 6 77 182 23 234
4669 234 156 75 57 113 50 70 134 170 94 218 28 73 116 30 114 95 57 147 119 5 98 111 43 70 21 71 96 17 71 127 227 159 50
4282 50 7 86 74 72 65 104 102 110 27 119 77 25 122 34 90 191 276 108 59 66 125 121 64 86 133 323 235 105 25 32 104 162 23 83 98 96 180
3848 180 37 50 53 25 86 202 172 101 7 57 131 105 59 81 104 202 121 46 60 135 49 34 235 312 144 15 101 104 202 117 22 131 221
3460 221 122 29 47 151 118 80 97 163 77 122 129 289 298 231 133 78 144 99 72 151 180 151 134 143 345 740 137 113 172 2635 2972 198
3085 198 221 462 333 191 22 142 110 178 355 1267 655 414 167 1960 3184 4928 5577 1441 573 162 171 560 833 732
2803 732 182 175 216 658 1698 4185 3603 435 218 39 252 58 283 462 27 115 67 95 61 224 150 169 90 222 45 36
2498 36 77 169 213 129 60 159 69 125 156 134 119 60 251 167 182 154 211 146 144 124 151 263 108 289 238 127 262 198 239 121 299 466
2122 466 242 427 343 805 631 1135 5999 11984 5922 3453 5563 1587 788 536 425 424 335 294 182 199 118 173 370 110
1840 110 276 133 73 50 426 194 239 58 171 591 452 148 110 74 201 172 13 34 62 180 87 895 1907 869 281 125
1535 125 262 88 430 559 579 224 101 135 9 144 200 102 104 152 101 51 314 136 130 174 185 265 71 113 61 190 141 35 134
1195 134 91 276 546 332 130 92 133 251 205 95 186 246 233 153 66 67 5 27 69 112 76 173 206 158 69 84 71 51 121 197 117 112 163
807 163 139 167 297 49 110 56 212 159 36 48 129 90 65 125 199 127 65 145 207 202 99 207 402 360 334 110 262 171 32 100 59
444 59 98 211 203 93 68 57 225 238 136 61 71 119 101 221 127 92 78 59 184 187 199 134 68 16 182 147 178 214 187 155 126 135 47 104
45 104 141 66 135 114 92 135 242 61 87 131 98 147 32 77 42 61 123 53 44 60
-190F0
##PAGE=	F1=1445.49
##FIRST=	25169.313707327481097,	5807.6787752999953227,	0.7080834507942199707
##DATA TABLE=	(F2++(Y..Y)), PROFILE
5808 121 29 100 85 182 85 120 150 100 41 50 167 37 122 170 105 59 110 195 303 235 138 97 111 149 39 28 181 70 194 144 85 261
5432 261 141 294 266 134 247 167 127 67 68 11 187 168 166 196 86 71 81 67 100 126 49 43 112 91 118 170 31 15 78 110 100 68 113
5045 113 238 154 35 60 135 76 185 165 93 104 75 86 24 138 79 160 137 20 38 41 45 150 144 95 159 182 33 25 18 121 24 229 197
4657 197 60 53 115 49 105 160 151 100 202 52 105 104 30 113 109 55 194 88 44 66 93 65 60 19 24 111 20 88 150 227 107 89 68 29 62
4247 62 73 95 133 90 126 47 98 83 43 125 50 77 196 253 99 47 56 123 128 109 70 163 351 241 106 31 32 149 165 21 103 100 75 134
3848 134 39 45 34 18 59 183 175 74 21 82 88 115 54 82 136 202 105 85 61 111 65 62 180 343 159 48 137 127 197 94 40 74 181
3460 181 62 60 63 163 97 71 142 186 79 145 108 245 266 191 151 116 173 131 79 122 177 213 147 153 562 1197 211 77 170 3163 3623
3096 3623 339 386 562 367 246 21 182 104 194 144 544 268 398 226 2266 4405 5664 8081 5349 823 276 293
2838 293 249 407 347 512 428 499 1151 3493 10846 9156 1456 669 283 341 133 245 541 169 227 213 104 46 152 158 248 42
2533 42 268 123 21 134 83 200 157 118 145 155 37 187 29 213 44 240 287 150 2 180 82 110 149 47 197 241 39
2216 39 277 185 105 276 156 223 180 232 274 377 452 406 717 1280 7425 16630 9636 9874 9873 2450 746 283 431 151 265
1923 265 82 250 161 172 72 172 220 102 196 148 252 312 212 83 259 569 879 489 212 109 241 294 113 65 177 108
1617 108 388 315 2520 4933 2251 579 154 272 52 433 597 401 219 107 111 72 112 227 150 99 130 42 159 269 194
1324 194 85 153 221 183 76 114 56 191 174 59 119 96 341 769 473 86 98 99 213 213 38 159 333 273 93 76 58 57 53 41
972 41 70 44 151 180 224 18 44 62 93 103 158 62 69 166 189 180 310 29 137 24 252 154 30 109 85 58 66 107 194 173 103 159 345
584 345 336 182 230 476 398 288 86 224 197 30 146 57 130 234 207 134 70 35 195 210 164 87 44 100 132 251 102 63 95 62
232 62 199 235 173 134 42 29 169 156 117 209 219 171 106 109 84 75 133 61 163 122 69 125 183 53 96 130 38 94 45 75 37 83 70 77 67
-178 67 83
-190H3
##PAGE=	F1=1343.23
##FIRST=	25169.313707327481097,	5807.6787752999953227,	0.54329597949981689453
##DATA TABLE=	(F2++(Y..Y)), PROFILE
5808 117 67 104 103 157 113 84 127 101 19 47 209 34 172 158 120 13 113 129 261 241 124 91 64 121 62 43 208 62 223 161
5456 161 72 296 132 288 258 191 224 157 137 59 30 65 151 157 195 154 131 61 67 54 144 106 16 74 133 67 98 208 71 76 80 188 106 105
5056 105 122 264 147 67 70 138 72 182 177 90 101 62 102 39 141 85 138 152 31 33 36 60 160 168 108 145 215 52 48 62 57 57 203 239 61
4646 61 49 113 51 147 188 114 89 198 54 151 105 60 111 126 65 231 91 68 31 89 101 71 9 56 131 37 97 179 221 68 118 130 50
4258 50 79 94 101 151 71 128 77 90 103 81 131 80 109 211 209 89 21 54 123 151 174 48 167 361 235 98 72 68 190 151 80 127 92
3871 92 78 65 58 33 70 21 42 181 179 71 42 102 106 115 97 91 162 180 82 154 72 81 88 152 106 359 148 93 175 152 187 123 58 37 140 17
3448 17 109 94 180 93 69 189 192 84 160 57 173 218 139 150 159 188 124 116 52 179 268 160 156 306 729 68 105 124 3350 3890 499
3085 499 483 625 433 269 70 233 56 253 1432 2466 1730 198 538 2537 7644 24898 29789 13191 980 733
2850 733 627 575 2505 2282 1189 672 734 1224 3906 12703 10716 1926 963 476 376 288 181 538 322 295 414 214 158
2580 158 171 185 367 145 329 333 122 291 90 262 268 291 220 290 216 289 208 363 240 322 468 373 252 255 300 381 364 369 281 574 372
2216 372 573 569 478 678 652 792 824 706 1082 1230 1539 1804 2628 4679 28015 61635 32973 18715 14901 3846 1289
1970 1289 668 918 790 773 541 604 534 569 434 213 525 232 400 442 549 312 335 195 575 1159 1277 621 361 272 531
1676 531 654 53 217 425 320 686 695 4687 8847 4035 960 449 322 88 388 876 166 312 183 219 202 78 283
1406 283 259 152 128 155 316 178 270 43 126 288 80 119 130 142 152 225 115 107 145 358 938 586 97 146 91 176 233 91 114
1066 114 419 301 19 115 28 128 126 60 51 76 161 123 291 104 34 76 131 106 98 47 26 134 263 166 308 34 181 25 297 161
714 161 25 181 14 107 84 122 220 238 135 148 258 116 137 227 521 412 202 108 142 203 50 180 60 163 232 217 146 120 20
373 20 147 155 166 116 54 92 160 271 58 67 96 104 186 286 112 123 52 55 157 174 69 196 221 162 99 61 128 46 136 56 193 119 85
-14 85 171 179 116 87 97 88 46 51 137 35 113 51 88 75 113
-190A13
##PAGE=	F1=1240.98
##FIRST=	25169.313707327481097,	5807.6787752999953227,	0.3237984776496887207
##DATA TABLE=	(F2++(Y..Y)), PROFILE
5808 108 122 109 119 114 134 92 109 130 19 30 261 37 229 129 115 90 115 66 229 277 113 89 53 99 72 71 262 35 268 173 76
5444 76 342 120 264 217 240 186 150 150 72 85 132 131 178 227 92 177 110 55 43 204 86 92 109 143 35 76 237 114 142 69 251 108
5068 108 150 109 268 126 132 91 168 72 160 181 111 102 43 103 107 187 93 126 181 61 127 89 83 170 196 118 114 233 82 69 133 38 109 162 272
4657 272 62 61 125 70 184 212 64 65 213 34 191 113 95 143 137 70 256 135 77 21 101 141 105 7 123 148 63 103 209 206 126 124
4282 124 186 136 110 119 82 158 79 122 116 101 120 131 137 129 160 237 160 82 34 77 144 180 232 29 144 360 222 82 114 115 220 149 139 148 82
3871 82 79 27 84 81 120 22 62 208 185 113 71 113 172 109 140 110 183 136 68 237 91 79 117 261 72 355 110 109 210 182 175 182 67
3484 67 122 123 20 158 138 197 125 68 229 175 104 154 32 97 161 120 136 207 182 83 171 49 181 303 165 155 286 172 244 196 165
3120 165 3149 3716 642 460 616 513 291 174 314 157 370 3272 6277 4033 375 1108 3043 12831 51025 58797
2885 58797 22889 1031 1320 1054 1492 5235 4948 1843 734 718 860 1690 4598 4103 1128 863 608 419 396 282
2650 282 459 480 340 648 441 308 350 336 538 347 400 593 314 503 344 408 464 523 450 479 459 487 488 567 507 563 705 708 576
2310 576 527 629 736 698 780 611 1000 869 1043 1085 1045 1236 1325 1514 1661 1607 2120 2445 2925 3755 5117 9144 54240 118705
2028 118705 62438 28500 19723 5443 2282 1589 1728 1688 1541 1219 1135 1066 1054 931 702 922 660 710 789 905 620 565
1770 565 548 965 1843 1702 833 540 525 891 1163 227 423 710 603 1032 1135 7074 13083 5964 1347 793 441 194 371
1500 371 1287 213 467 291 388 360 74 376 387 247 196 279 470 60 352 110 148 360 163 179 166 247 78 279 191 138 207
1183 207 309 1014 645 185 222 104 176 260 194 79 480 315 108 162 30 206 200 112 137 133 192 34 347 210 112 118 170 127 92
843 92 145 17 66 336 137 289 63 230 78 336 188 21 243 76 182 101 173 264 304 150 130 122 237 47 231 531 389
526 389 86 160 87 203 90 191 107 180 211 239 133 167 88 105 87 149 130 112 100 170 288 6 132 91 148 149 332 31 108 126 87
162 87 162 192 106 183 207 141 114 26 161 42 158 68 222 117 139 212 227 187 62 50 170 66 46 231 56 140 119 92 60 146
-190A46
##PAGE=	F1=1138.72
##FIRST=	25169.313707327481097,	5807.6787752999953227,	0.2169803231954574585
##DATA TABLE=	(F2++(Y..Y)), PROFILE
5808 95 178 118 130 76 138 157 94 162 35 66 309 54 265 89 90 178 112 85 213 320 112 83 88 95 63 97 316 13 310 176 91
5444 91 390 115 226 158 261 148 157 165 109 134 192 138 223 249 31 214 153 75 37 262 78 177 145 138 73 61 247 152 191 49 288
5080 288 106 195 81 249 123 175 120 210 70 131 182 148 120 76 92 163 250 103 126 217 83 220 126 118 174 219 133 75 225 111
4728 111 85 189 82 162 129 285 54 86 151 103 210 220 20 46 232 12 211 119 121 202 136 73 268 180 79 50 128 177 144 26
4376 26 180 154 90 115 233 181 207 106 227 209 141 138 49 153 109 110 157 125 128 180 137 179 206 266 125 80 90 112 180 205 263 14 102
3988 102 350 210 64 145 170 235 181 181 156 91 64 128 112 154 157 26 98 244 194 164 104 116 230 102 170 139 197 77 78 324 109
3624 109 114 151 364 105 330 53 90 242 204 169 239 66 220 131 33 207 186 210 167 82 249 137 139 130 136 54 112 164 128 254 168
3261 168 54 232 142 190 319 135 173 654 922 488 304 307 2611 3151 753 327 687 591 359 316 423 362 554 5235 10161
2967 10161 6390 911 1787 3866 18789 79572 89736 32510 1039 1889 1454 2504 8081 7939 2269 520 387
2768 387 2040 5849 16826 13681 1433 711 1034 862 665 679 559 703 505 926 780 546 607 612 775 623 500 872
2509 872 575 758 657 605 709 781 754 702 726 747 789 815 800 880 970 1060 923 878 993 1096 1067 1207 1025 1437 1372 1555 1632 1647 1824
2169 1824 2029 2255 2511 2574 3191 3721 4316 5750 7666 13734 80884 176673 92094 37087 23235 6752 3327 2600
1958 2600 2590 2578 2345 1922 1713 1612 1526 1449 1216 1324 1120 1042 1116 1258 996 825 902 1358 2493 2051 1021 685 786 1242 1687
1664 1687 457 637 976 893 1365 1557 9263 16912 7697 1656 1111 585 322 422 1627 405 608 392 543 507 111
1418 111 483 493 353 288 382 583 103 426 189 232 419 318 233 217 337 33 319 268 204 259 202 985 636 282 294 130 216
1101 216 284 285 112 494 315 202 200 101 280 262 159 240 181 223 77 381 300 196 161 211 149 162 243 57 28 386 123 252 98
761 98 267 122 357 226 42 284 153 252 111 230 308 358 149 110 158 506 21 253 507 353 41 209 166 208 142 176 178 171
432 171 192 266 122 192 161 118 37 142 124 170 118 164 309 55 208 95 182 96 364 71 109 196 114 177 203 168 174 190 136 137 77 171
56 171 62 194 91 243 134 196 226 275 240 31 59 244 104 34 318 96 153 189 97 30 177
-190A77
##PAGE=	F1=1036.46
##FIRST=	25169.313707327481097,	5807.6787752999953227,	0.15692906081676483154
##DATA TABLE=	(F2++(Y..Y)), PROFILE
5808 79 218 132 134 77 121 225 78 172 56 133 341 76 267 58 54 252 104 137 213 343 117 69 121 108 35 113 351 47 335
5467 335 167 109 423 116 177 132 251 118 180 177 153 159 231 158 268 249 75 230 169 116 45 300 79 255 174 118 129 61 233 178
5115 178 214 31 293 107 228 55 210 164 187 149 247 62 113 179 185 155 137 84 195 301 109 136 248 93 287 130 160 163 233
4775 233 150 38 187 141 93 219 121 201 126 270 40 108 173 133 220 207 48 58 236 38 203 119 130 251 122 78 268 204 77
4434 77 75 158 202 168 47 219 147 114 135 243 155 266 73 245 249 160 141 26 136 126 99 198 148 125 217 132 215 239 282 107 85 151
4059 151 144 212 219 260 9 50 330 206 52 161 226 229 233 197 145 132 37 227 141 218 168 47 131 270 206 202 139 115 256 100 180 176 201
3671 201 28 105 402 119 156 186 439 128 286 16 58 268 201 181 284 74 306 139 40 255 228 227 197 125 250 105 174 123
3343 123 244 57 122 233 148 297 187 113 293 224 213 334 96 223 762 1190 612 401 451 1874 2341 831 223 951 645
3049 645 482 476 541 612 773 6858 13093 8215 1451 2415 4758 24062 104505 115926 39882 1096 2291 1723 3393
2826 3393 10417 10695 2330 536 906 4836 16073 51314 42075 5789 1962 1995 1736 1274 1266 1052 1072 885 1262 1212 893
2580 893 931 966 1071 958 672 1140 879 1037 998 829 972 1034 1071 931 989 1026 1061 1076 1073 1197 1224 1366 1236 1223 1339 1400 1397 1572 1426
2239 1426 1806 1787 1994 2102 2174 2322 2630 2864 3208 3396 4073 4790 5416 7356 9734 17464 102210 223059 115473 42259
2005 42259 24438 7350 4149 3481 3287 3260 3004 2495 2206 2052 1880 1874 1645 1640 1516 1316 1351 1541 1296 1040 1175 1670 2972
1735 2972 2240 1101 739 982 1498 2100 685 808 1170 1128 1621 1880 10841 19618 8896 1815 1333 696 424 534 1814
1488 1814 524 686 461 642 610 145 570 546 444 349 446 629 220 476 233 317 451 440 263 264 389 116 325 322 265 284 66
1171 66 870 565 349 342 161 258 293 342 177 457 300 266 218 173 333 297 184 322 205 237 176 386 352 264 183 251 158 232 309 92
819 92 125 401 138 204 134 281 144 350 262 73 299 199 304 114 268 343 389 132 83 206 591 33 280 460 340 155
514 155 234 257 212 189 136 234 134 189 287 136 194 218 172 64 172 99 210 134 146 330 102 271 109 201 38 374 144 137 238
174 238 127 186 200 209 162 181 157 150 126 154 82 231 104 250 168 237 211 294 265 33 110 297 121 27 374 143 147 237 106 25 200
-190B00
##PAGE=	F1=934.202
##FIRST=	25169.313707327481097,	5807.6787752999953227,	0.25112435221672058105
##DATA TABLE=	(F2++(Y..Y)), PROFILE
5808 62 232 146 130 106 90 270 62 153 78 193 350 93 230 64 18 296 95 167 220 335 125 48 139 124 10 123 355 79
5479 79 335 151 125 426 112 131 176 215 98 204 182 186 158 236 175 293 223 137 221 157 156 62 309 79 316 188 87 165 66 194
5127 194 188 205 41 270 116 245 62 159 217 170 172 267 55 112 170 208 194 191 93 195 322 108 149 265 91 309 100 204 137
4787 137 236 161 43 125 175 87 217 145 216 151 226 36 116 177 147 218 172 83 87 213 64 165 112 118 267 105 85 255 198 73 99
4423 99 174 215 167 68 235 131 126 154 232 139 289 60 235 245 165 127 60 109 115 91 236 161 116 233 122 229 258 275 91 93 208
4059 208 163 224 215 223 35 14 304 207 63 159 275 202 283 182 117 194 13 310 169 253 152 78 154 276 222 224 170 121 241 104
3707 104 172 213 194 62 143 455 113 193 216 472 124 227 88 98 286 164 221 316 105 365 129 67 296 259 254 205 184 245 131
3366 131 201 182 335 59 183 296 196 339 245 196 352 287 248 368 176 303 594 963 610 478 554 1133 1487 882 334 1260
3061 1260 653 625 629 642 873 983 7783 14416 9116 1865 2844 5372 27286 119967 131156 43204 1215 2408 1801
2838 1801 3969 11684 12645 2052 1457 2288 8359 28460 94230 77426 11380 3989 3315 2846 2130 1953 1740 1576
2627 1576 1405 1639 1687 1314 1310 1342 1397 1310 927 1372 1188 1312 1324 1062 1218 1253 1352 1135 1216 1280 1269 1312 1288 1457 1431 1581 1469 1494
2298 1494 1617 1607 1631 1807 1739 2048 2046 2275 2404 2533 2638 3022 3228 3623 3909 4593 5441 6006 8233 10894 19552 113640 247852
2028 247852 127511 42424 22766 7078 4597 4074 3668 3590 3380 2818 2506 2297 2041 2114 1897 1803 1766 1468 1446 1697 1445
1782 1445 1152 1307 1831 3172 2223 1042 667 1053 1592 2302 866 895 1253 1255 1745 2045 11504 20689 9317 1782 1407
1535 1407 731 460 620 1823 574 680 485 659 647 148 610 533 499 351 459 594 296 493 225 361 449 499 259 291
1254 291 391 183 292 335 294 270 87 713 451 366 352 180 275 279 349 226 375 267 286 209 229 356 292 181 364 200 228 241
925 241 358 351 302 170 281 147 272 325 118 200 375 156 159 169 266 138 312 281 95 290 203 331 111 274 365 388 101 51
596 51 183 491 8 294 403 350 235 224 302 202 217 82 253 79 200 289 160 177 248 219 98 215 64 227 140 121 340
279 340 131 310 119 203 16 359 187 172 244 117 176 175 221 138 175 185 142 150 116 97 260 96 239 200 248 176 283 256 55 145
-73 145 319 113 27 389 189 119 254 116 55 210
-190B10
##PAGE=	F1=831.945
##FIRST=	25169.313707327481097,	5807.6787752999953227,	0.34718877077102661133
##DATA TABLE=	(F2++(Y..Y)), PROFILE
5808 53 213 157 118 132 69 280 54 109 97 229 337 101 160 84 6 302 92 165 226 294 127 34 141 133 47 132 326 98 310
5467 310 134 142 394 93 99 235 164 82 215 178 197 134 207 181 291 174 182 186 123 181 78 288 84 352 185 56 171 66 140
5127 140 180 170 69 228 126 245 88 105 251 130 181 263 66 114 154 209 222 224 110 162 304 98 160 262 82 282 61 243
4798 243 101 235 158 75 73 218 68 185 153 212 178 156 56 106 158 140 208 125 101 112 165 75 112 108 86 240 101 90 229 169 66
4434 66 131 167 217 140 88 227 115 123 160 198 139 272 88 196 196 161 95 102 74 76 86 268 156 109 228 106 224 266 241 68 104 252
4059 252 168 211 196 164 74 46 274 205 96 143 310 156 316 144 86 263 28 367 193 251 116 109 167 262 239 227 190 141 199 110
3707 110 152 241 180 106 189 468 89 226 232 458 111 163 156 177 291 100 279 338 145 389 103 121 317 280 288 191 239 253 198 211
3355 211 273 396 79 247 341 248 375 304 269 400 332 281 415 317 389 355 587 544 538 598 630 825 907 468 1444 611 749 745 702 1102
3002 1102 1146 7841 13961 8967 2069 2973 5462 27566 122112 131625 41611 1300 2206 1710 4128 11563 13365 1734
2791 1734 2642 3905 11984 40389 137333 112947 17147 6178 4699 3961 3038 2621 2429 2115 1946 1999 2125 1730 1699
2568 1699 1674 1695 1620 1221 1541 1456 1545 1589 1280 1415 1414 1556 1294 1380 1473 1394 1482 1424 1625 1572 1679 1598 1648 1793 1702 1751 1886 1915 2145
2228 2145 2133 2360 2497 2678 2731 3161 3307 3710 4048 4682 5591 6033 8245 10982 19680 113304 246899 126298 37195
2005 37195 18331 6214 4675 4313 3685 3535 3411 2849 2559 2315 1985 2129 1931 1788 1826 1474 1396 1700 1423 1132 1277 1803
1746 1803 3054 2012 883 470 978 1495 2247 963 885 1210 1249 1711 2028 11144 19952 8881 1562 1319 674 416 567
1500 567 1641 581 595 458 592 616 116 585 459 504 294 415 485 315 471 169 346 411 488 223 285 342 215 225 300 278
1195 278 219 189 553 325 328 323 173 259 240 303 243 271 212 263 175 256 343 244 152 357 169 196 255 301 299 302 122 297 113 277 287 127
819 127 234 314 151 136 200 229 110 249 274 96 265 165 328 108 244 369 357 63 30 145 285 78 286 346 345 274 183 288
491 288 176 210 29 222 36 210 271 168 152 247 236 112 238 38 224 129 94 328 140 318 118 189 60 321 192 193 218
174 218 87 149 129 210 97 167 199 113 148 70 103 273 67 210 212 229 131 251 216 64 151 304 86 21 368 226 81 240 120
-167 120 75 203
-190B03
##PAGE=	F1=729.687
##FIRST=	25169.313707327481097,	5807.6787752999953227,	0.27435162663459777832
##DATA TABLE=	(F2++(Y..Y)), PROFILE
5808 53 165 162 99 145 83 253 66 53 106 233 307 99 72 89 22 270 96 143 225 230 120 45 129 129 84 149 271 105 264 128 160
5444 160 329 61 88 270 112 73 205 164 182 106 149 178 260 120 206 134 81 185 87 241 109 359 164 37 149 62 83 158
5115 158 120 96 182 132 231 107 53 254 78 172 234 92 107 136 186 230 228 123 107 250 81 164 239 70 218 87 269 76 232
4775 232 137 106 108 263 48 138 146 200 199 74 79 84 119 115 194 82 100 128 108 70 93 113 48 176 117 96 194 134 51 172 132 216 101 103 201
4364 201 105 103 144 151 140 220 118 137 125 158 53 132 42 31 84 289 129 110 202 83 209 267 187 40 115 274 159 176 166 98 116
4000 116 73 245 191 135 122 326 101 326 96 92 328 42 391 210 215 80 128 171 231 254 214 194 171 168 115 133 252 168 133 231 433
3636 433 50 258 229 405 123 110 210 244 284 32 339 353 174 373 90 185 306 293 317 163 275 278 262 199 353 421 130 294
3308 294 356 286 397 330 319 424 359 298 450 437 447 357 627 472 580 582 558 586 899 506 1443 540 822 798 704 1250 1242 7082 12008
2967 12008 7900 2034 2775 4953 24754 110359 117186 35466 1263 1754 1559 3885 10080 12702 1874 3749 5395
2768 5395 15078 49055 170963 140707 21806 8009 5822 4825 3779 3136 2958 2556 2383 2258 2429 2046 2021 1901
2556 1901 1902 1822 1481 1621 1640 1694 1747 1441 1536 1494 1655 1389 1457 1576 1436 1559 1469 1683 1639 1662 1625 1670 1852 1690 1769 1821 1939 2111
2228 2111 2077 2267 2400 2615 2622 3071 3145 3509 3859 4398 5294 5620 7502 10142 18097 102708 223396 113806 27643 12090
1993 12090 5546 4520 4239 3416 3184 3131 2634 2386 2144 1756 1941 1765 1624 1701 1354 1235 1564 1266 993 1115 1594 2650
1735 2650 1670 735 191 780 1235 1961 960 796 1060 1120 1527 1842 9868 17607 7694 1205 1092 536 328 320 1315 560
1477 560 465 389 457 532 68 494 347 460 212 321 329 279 414 104 271 338 418 170 243 257 214 138 222 219 151 242 397 217 247 269
1124 269 136 213 183 217 224 175 134 206 134 252 299 161 113 305 123 151 219 227 210 270 60 296 71 249 203 114 219 231 114 139
772 139 222 183 79 172 239 75 233 98 299 110 182 356 308 36 29 152 123 144 256 291 306 282 133 222 137 164 18 145 68
432 68 214 238 147 130 223 220 107 226 46 208 101 65 287 132 297 108 163 91 267 167 188 172 49 111 68 188 46 155
103 155 192 70 125 46 102 271 51 171 195 188 85 219 155 56 130 253 53 14 328 246 60 201 116 75 180
-190A80
##PAGE=	F1=627.429
##FIRST=	25169.313707327481097,	5807.6787752999953227,	0.045131769031286239624
##DATA TABLE=	(F2++(Y..Y)), PROFILE
5808 53 97 161 74 147 108 198 90 19 103 209 264 94 27 75 48 211 107 120 215 162 103 66 107 111 117 171 200 111 209 141 181 243 40
5420 40 87 269 69 75 176 141 146 107 83 169 210 90 208 91 61 169 83 181 147 338 129 32 109 62 38 126 67 118 146 127 207 114
5045 114 20 229 26 144 186 117 84 118 146 217 207 126 43 174 62 164 203 58 145 145 279 86 226 101 129 174 296 57 107
4704 107 127 193 210 38 95 60 69 80 177 56 87 133 64 61 138 129 40 94 139 108 154 112 27 214 83 218 90 111 165 105 75 106 120
4317 120 131 145 131 69 85 164 30 147 33 57 80 290 82 117 163 57 189 259 127 18 123 270 140 127 136 41 151 95 220
3977 220 165 169 106 318 47 313 56 130 376 49 382 216 156 68 127 169 188 260 189 182 202 186 118 127 244 163 138 255 353 11 280
3613 280 203 329 154 93 246 278 264 76 382 356 182 319 120 237 262 297 330 131 281 298 303 166 397 415 180 317 336 297
3284 297 391 309 337 414 365 287 448 496 451 419 809 415 600 514 618 615 849 438 1294 481 831 775 645 1285 1265 5732 9130
2967 9130 6224 1788 2306 3950 19491 87596 91403 26249 1089 1235 1479 3367 7603 10810 2413 4504 6408
2768 6408 17132 52322 186963 154008 24235 9034 6403 5225 4159 3382 3204 2776 2611 2342 2524 2181 2199 1974
2556 1974 1960 1867 1640 1587 1705 1726 1767 1504 1556 1476 1633 1406 1436 1571 1397 1532 1422 1629 1630 1547 1565 1568 1794 1588 1711 1657 1821 1972
2228 1972 1934 2052 2174 2388 2369 2816 2836 3120 3465 3891 4711 5008 6317 8763 15508 86167 186732 95205 16320 6533
1993 6533 5815 4288 3948 3014 2713 2653 2286 2068 1868 1451 1631 1465 1381 1444 1160 1024 1338 1048 785 886 1253 2060 1301 712
1711 712 122 541 881 1527 861 673 846 904 1233 1534 7959 14159 6011 792 787 351 287 96 1057 516 347 293 286 419
1430 419 87 350 228 378 196 192 161 204 330 123 159 242 315 136 175 154 196 54 125 134 111 246 216 151 151 213 76 153 128 111 180
1066 180 120 61 136 115 224 236 61 97 225 75 105 153 149 111 220 68 278 64 200 95 79 162 143 52 148 232 149 74 98 182
714 182 40 201 23 252 117 103 326 260 48 23 166 186 181 213 244 251 279 134 124 102 85 27 47 108 216 204 101 115 194 185 90
350 90 181 64 186 63 38 220 117 257 98 129 110 210 127 157 123 43 75 9 169 43 143 167 28 100 59 100 255 88 126
9 126 154 146 55 205 93 40 91 176 28 47 293 245 69 152 104 56 145
-190A45
##PAGE=	F1=525.171
##FIRST=	25169.313707327481097,	5807.6787752999953227,	0.16826190054416656494
##DATA TABLE=	(F2++(Y..Y)), PROFILE
5808 42 38 155 52 143 116 126 111 47 87 167 216 96 102 47 90 141 120 118 198 107 79 77 82 79 148 193 134 126 158 167 205 152 71 84 235 40 83
5373 83 132 112 101 143 64 158 154 94 186 96 88 137 68 124 176 294 87 29 71 71 13 92 23 133 121 109 177 108 50 190 23 102 135 129 45
4963 45 101 105 187 168 119 29 106 45 163 159 46 108 182 270 117 214 58 147 217 304 89 126 97 192 214 100 98 45 25 42 155 43 69
4575 69 132 46 77 191 142 70 41 153 123 117 110 8 244 64 223 129 107 127 115 71 57 139 115 63 126 15 121 174 59 143 47 98
4200 98 75 267 25 125 117 39 162 239 76 9 124 239 117 82 121 21 170 122 199 134 189 98 281 5 281 62 161 396
3871 396 62 342 207 89 79 104 163 140 249 152 157 223 230 128 140 219 163 126 250 240 37 284 160 249 174 113 261 274 234 137
3519 137 399 344 168 234 167 260 193 290 319 107 258 296 314 121 395 386 204 318 282 280 348 243 320 366 348 250 401 483 401 326 808
3155 808 379 582 412 573 578 751 292 1101 446 774 677 539 1195 1214 4116 5993 4319 1410 1682 2696 12998 59239
2897 59239 60404 16084 845 923 1486 2757 4746 8096 2858 4722 6695 17878 49447 181295 149529 23831
2709 23831 8998 6290 5056 4075 3292 3115 2708 2573 2212 2376 2092 2179 1875 1842 1735 1652 1430 1635 1626 1638 1440 1465 1354 1490
2427 1490 1330 1316 1457 1276 1411 1280 1467 1541 1355 1435 1369 1627 1410 1587 1445 1592 1750 1747 1772 1894 2055 2040 2465 2468 2645 2989
2122 2989 3323 4011 4404 5068 7281 12731 68957 148572 76613 8516 7241 6632 4018 3527 2612 2291 2120 1921 1709
1899 1709 1575 1178 1294 1124 1139 1131 950 823 1084 841 585 671 856 1413 1003 774 352 395 528 1060 691 556 626 660 888
1606 888 1167 5795 10270 4162 416 484 166 329 507 1112 459 298 193 121 304 157 182 130 282 273 60 20 120 234
1324 234 196 62 141 213 145 99 56 183 38 71 53 137 241 37 175 99 183 17 97 103 46 139 113 103 88 128 186 177 41 113 144 40
948 40 71 106 84 45 182 128 247 109 141 23 31 98 71 19 145 226 135 97 52 114 26 168 50 201 124 38 286 230 75 26 150
584 150 249 182 175 214 212 289 194 26 97 49 4 93 130 221 189 42 104 182 160 68 120 70 158 26 48 140 112 208 91 92 114 162 94 118 77
174 77 66 54 55 161 97 134 132 33 90 78 111 231 132 89 105 123 77 214 73 38 50 89 23 94 277 225 74 108 91 21 104
-190A04
##PAGE=	F1=422.913
##FIRST=	25169.313707327481097,	5807.6787752999953227,	0.18788069486618041992
##DATA TABLE=	(F2++(Y..Y)), PROFILE
5808 16 69 148 58 134 101 52 120 65 65 121 169 104 158 16 135 76 134 132 172 77 51 73 56 40 177 208 103 145 120 196 226 70 111 74
5409 74 182 27 88 86 78 59 183 111 147 108 102 141 130 135 102 44 85 181 235 44 33 44 83 2 62 18 143 99 79 142 92 81 158 52
5010 52 56 97 122 9 84 81 145 123 103 73 93 35 166 116 36 116 185 243 146 196 30 162 225 280 119 168 62 191 210 146 91 47 48
4622 48 23 129 20 60 127 29 115 216 146 92 77 153 132 90 109 31 255 96 228 174 87 98 131 108 44 180 118 35 107 52 158
4258 158 182 86 126 56 113 71 218 45 127 71 50 125 206 47 16 116 182 92 83 121 45 169 159 179 108 191 93 217 29 238 102
3894 102 167 378 86 280 182 34 87 62 155 93 217 106 126 226 254 153 165 181 157 101 219 115 64 265 115 179 169 135 255
3554 255 237 200 172 386 316 137 135 202 244 123 268 285 106 213 262 294 91 351 345 196 299 205 239 270 152 272 288 310 195
3214 195 317 410 316 117 724 371 514 294 442 436 610 99 958 402 667 528 405 999 1090 2562 3180 2533 1015 1047 1498
2920 1498 6688 31522 30954 7092 661 927 1463 2209 2311 5108 2927 4362 6188 17308 41371 155381 128418
2721 128418 20709 7921 5505 4353 3542 2874 2721 2355 2280 1883 2008 1792 1955 1618 1561 1449 1508 1161 1440 1405 1382 1246
2462 1246 1272 1137 1244 1158 1114 1247 1073 1218 1050 1216 1363 1108 1242 1110 1367 1168 1388 1217 1287 1454 1522 1459 1599 1658 1676 2051
2157 2051 2072 2143 2487 2773 3286 3834 3996 5940 10257 54558 116877 61680 11108 11172 7088 3616 3002 2229 1959 1642
1923 1642 1587 1381 1303 985 999 817 936 833 755 654 847 670 463 523 481 836 809 791 468 416 280 672 489 459 451 448 558 799
1594 799 3741 6581 2460 174 274 19 364 805 1274 407 301 109 44 205 215 26 71 193 348 83 68 77 142 243
1312 243 91 86 145 167 55 28 181 71 122 61 171 295 331 305 125 175 65 64 117 103 137 122 189 103 146 156 145 111 133 98 19 55
937 55 129 50 64 175 167 211 155 82 106 38 100 32 83 125 205 122 118 58 51 51 136 96 156 126 62 243 213 97 74 131 259 155 177 212 216 323
514 323 255 59 127 140 52 193 131 225 197 38 98 203 172 48 84 63 126 2 95 87 127 164 80 54 103 130 89 109 55 74 49 91 162
127 162 141 122 97 51 97 105 143 201 156 79 74 119 120 236 109 54 22 23 34 141 272 190 54 86 88 26 66
-190F6
##PAGE=	F1=320.655
##FIRST=	25169.313707327481097,	5807.6787752999953227,	0.06820478290319442749
##DATA TABLE=	(F2++(Y..Y)), PROFILE
5808 29 120 141 90 124 70 13 112 75 42 85 128 110 190 7 169 30 145 137 140 70 29 62 34 25 203 215 115 161 99 218 238 9 139
5420 139 59 126 30 87 48 50 31 208 155 134 80 100 86 155 182 79 16 74 158 175 7 48 23 92 11 41 46 153 76 40 102 70 96 147
5021 147 67 29 70 102 64 67 81 100 83 82 99 119 33 172 88 41 127 156 201 164 173 49 177 200 225 134 199 35 190 199 160 78 57 89
4622 89 51 101 21 66 121 12 152 206 137 96 101 140 127 76 101 52 248 120 236 198 53 82 148 156 86 209 145 84 81 82 162 179 98 101
4223 101 50 99 79 154 98 125 33 72 83 163 44 40 97 109 73 120 124 67 152 199 166 91 175 84 133 45 191 142 143 324 110 206 142 20
3824 20 84 19 147 62 168 54 94 209 243 189 184 133 140 69 175 24 77 224 87 124 136 144 232 185 169 175 348 274 101 40 214 192
3448 192 92 230 238 126 157 205 252 101 281 303 170 263 124 188 169 71 206 195 261 136 215 302 230 105 683 362 397 180 304
3108 304 257 442 112 891 317 535 359 271 738 895 1317 1073 1127 727 531 691 1754 9647 8664 1124 614 970 1311
2838 1311 1759 1600 2386 2573 3534 5015 15614 30497 115654 95914 15661 6086 4238 3283 2694 2203 2123 1792 1801 1418
2603 1418 1499 1345 1569 1254 1167 1065 1237 823 1154 1096 1044 954 1005 854 932 907 858 974 804 986 754 906 1102 831 991 827
2298 827 1042 882 1109 980 945 1094 1249 1117 1291 1229 1292 1584 1636 1623 1944 2224 2540 3186 3092 4702 8040 42787 91513
2028 91513 49493 15054 13462 6702 2987 2372 1794 1628 1247 1252 1093 1035 832 751 572 758 585 572 505 642 502 414 428
1758 428 183 412 663 697 449 459 200 424 297 364 339 313 308 475 2066 3563 1127 156 218 70 328 880 1236 379 290
1465 290 64 107 133 248 109 59 125 373 164 93 95 69 245 134 130 131 169 78 84 179 77 169 108 175 418 663 493 156 162 106 60
1101 60 138 146 166 133 255 139 150 147 144 150 136 100 5 59 170 61 88 189 177 176 189 31 159 87 146 27 124 98 174 93 128 76 23 65
702 65 104 117 124 121 93 205 191 113 141 148 259 116 227 240 268 372 287 98 165 222 129 262 118 223 211 85 108 247 205 35 105
338 105 56 88 10 150 117 156 134 59 22 82 114 104 141 96 53 49 100 161 163 106 68 54 110 147 185 169 152 101 75 114 154 259 150 70 14
-73 14 66 63 179 261 152 21 84 109 77 38
-190C8
##PAGE=	F1=218.397
##FIRST=	25169.313707327481097,	5807.6787752999953227,	0.059369124472141265869
##DATA TABLE=	(F2++(Y..Y)), PROFILE
5808 78 148 133 123 112 56 61 86 93 26 80 93 105 205 19 184 16 148 122 98 69 25 73 26 60 224 216 134 163 93 225 238 27 147
5420 147 40 83 41 83 40 53 20 211 185 116 60 108 94 156 220 79 10 75 112 123 21 63 33 93 29 36 77 165 66 3 55 47 92 152
5021 152 66 39 39 88 121 49 83 66 56 57 104 133 39 177 88 71 127 116 148 169 151 75 193 154 149 131 210 46 195 186 142 72 72 119 85
4610 85 78 70 80 116 57 171 165 118 88 89 120 107 74 93 62 224 110 249 199 20 75 156 191 126 212 172 111 54 90 134 166 96 72 31 70
4200 70 99 94 137 128 6 85 65 117 58 76 73 36 76 150 112 86 126 234 167 81 147 71 51 51 148 169 99 243 126 129 93 32 85 57 139 64
3777 64 113 11 63 174 203 218 182 83 107 37 137 96 88 172 82 85 84 137 199 143 149 149 293 225 74 39 206 117 109 184 188 149 101 138 197 125
3355 125 202 263 155 215 56 140 70 85 134 108 212 86 113 190 167 216 598 305 250 93 211 112 274 307 861 214 402 208
3026 208 157 466 646 498 205 372 607 244 560 1307 3945 5780 2754 613 861 1019 1347 2199 539 1911 2462 3462
2768 3462 13090 20055 71479 59648 9895 3942 2781 2094 1733 1412 1455 1144 1245 911 961 849 1103 849 736 659 899
2521 899 481 827 753 687 620 708 554 602 613 588 680 503 751 430 580 783 556 695 554 692 584 771 733 608 703 933 751
2204 751 960 800 903 1079 1154 1094 1344 1636 1762 2378 2218 3428 5806 31437 67478 37102 15538 13293 5482 2151
1970 2151 1662 1263 1220 899 877 815 743 657 517 380 572 385 390 352 458 306 371 340 28 168 502 500 322 424 180 282 146
1653 146 251 261 250 203 218 895 1442 259 174 219 98 226 729 945 379 233 61 135 105 256 178 81 77 339 197 66 112
1336 112 23 203 132 189 161 142 103 119 168 56 181 139 141 564 973 689 166 124 115 71 146 152 191 147 286 158 139 155 149 158 125 109 42
948 42 76 186 86 96 199 161 147 207 16 174 122 168 24 136 81 141 61 126 88 42 59 75 118 100 115 95 176 164 127 213 193 271
573 271 78 295 289 352 411 280 95 191 267 206 293 98 209 217 116 131 294 231 33 139 69 44 12 201 170 185 111 29 48 68 107
209 107 119 176 162 7 47 83 149 157 90 47 58 125 196 222 136 125 126 79 101 165 274 176 79 12 105 104 205 241 126 52 83 144 126 19
-190A9
##PAGE=	F1=116.14
##FIRST=	25169.313707327481097,	5807.6787752999953227,	0.070799149572849273682
##DATA TABLE=	(F2++(Y..Y)), PROFILE
5808 120 148 126 144 98 83 94 49 117 21 107 58 88 209 31 176 42 142 90 50 70 35 114 49 93 234 212 131 148 95 212 224
5444 224 41 136 18 61 51 80 58 83 25 199 205 91 30 148 173 132 242 92 27 71 57 82 48 69 79 85 40 50 111 178 84 44
5068 44 12 43 82 156 53 40 8 101 167 35 75 63 50 32 92 123 49 177 112 113 133 97 90 159 132 91 208 107 69 111 197 74 205
4681 205 177 104 80 94 134 114 61 120 97 107 104 167 108 96 90 56 97 82 77 96 62 190 61 267 186 59 71 148 202 157 193 177 107 31
4282 31 80 86 146 90 42 2 62 122 71 158 141 15 80 83 76 91 112 52 59 102 158 80 100 98 261 185 71 115 59 67 51 114 175 65 155 130
3859 130 59 42 32 100 105 134 85 69 53 39 129 155 223 149 50 62 29 115 146 106 121 79 75 30 123 161 129 141 101 230 176 71 83 185
3460 185 42 128 140 147 162 57 80 138 133 131 226 162 158 18 109 61 142 69 60 172 48 38 97 123 196 370 187 103 57 151 36 131 444
3073 444 811 169 283 104 82 236 380 110 726 529 567 206 584 2308 8688 9560 3228 545 608 648 924 2389 1189
2803 1189 1141 1407 1878 10065 13147 32287 27235 4655 1964 1439 1029 870 654 844 546 724 460 514 413 652 474
2556 474 352 302 562 231 518 437 371 309 429 294 304 328 343 413 221 545 129 289 449 314 388 321 367 316 421 489 327 337
2228 337 609 395 623 424 538 586 664 597 731 1028 998 1464 1327 2111 3513 19589 42402 23541 12784 11053 3761
1981 3761 1247 952 682 753 571 481 537 434 448 284 236 376 226 217 196 290 93 302 246 129 79 320 251 149 309 123 165
1664 165 55 130 185 210 211 94 221 198 193 143 192 88 97 455 599 391 140 80 136 126 246 187 107 43 261 185 50 105 6 136
1312 136 97 225 210 94 110 135 158 23 162 159 73 687 1206 844 168 63 92 87 141 127 196 159 280 153 122 168 143 154 112 101
960 101 87 95 172 107 107 195 133 127 215 53 157 135 151 17 122 86 120 95 111 100 53 38 53 112 74 113 78 150 147 140 278 237 275 49 353
549 353 342 442 425 240 60 191 266 263 285 74 181 211 127 153 329 238 42 159 99 4 29 238 202 199 82 9 95 87 103 125 189
185 189 221 56 49 54 117 130 87 33 82 146 236 244 111 88 135 72 101 149 277 185 84 20 125 151 217 214 119 100 76 177 163 5
-190E
##PAGE=	F1=13.8818
##FIRST=	25169.313707327481097,	5807.6787752999953227,	0.10351209342479705811
##DATA TABLE=	(F2++(Y..Y)), PROFILE
5808 145 120 121 149 81 115 118 26 132 23 136 32 66 210 53 149 92 135 56 10 75 51 163 87 116 231 205 105 118 105 178 199
5444 199 38 115 9 59 59 79 75 114 41 182 218 59 27 200 255 91 240 103 37 60 13 42 82 65 126 69 39 84 143 185 109 78
5068 78 56 66 98 149 37 19 60 127 196 34 59 79 59 12 68 96 61 170 141 156 156 109 36 136 115 95 215 77 29 77 165 94 209
4681 209 170 64 102 118 135 131 51 159 114 95 135 143 53 76 119 65 76 74 87 108 60 147 16 281 179 109 66 124 186 179 168 154 85 15
4282 15 59 41 124 91 12 32 83 137 80 164 162 40 59 99 47 137 141 47 114 134 148 30 108 69 280 211 60 84 50 122 52 91 157 89
3883 89 100 131 19 10 33 123 140 131 102 60 100 60 86 124 195 82 76 27 58 100 158 130 83 67 108 49 123 125 135 136 46 168 133 90 92 158 29
3448 29 130 109 120 160 51 44 83 119 75 186 171 99 16 95 124 185 31 72 143 20 62 36 76 91 47 43 32 61 93 38 53 491 699
3061 699 198 176 64 70 98 143 123 746 616 498 201 418 1909 7322 7398 2081 394 309 290 512 2047 1683 462 587
2779 587 569 6890 10396 6367 4084 887 527 443 266 280 121 390 155 322 139 284 173 311 179 136 58 290 206 282
2498 282 208 143 82 209 146 81 99 160 214 79 387 121 85 153 137 113 144 120 118 126 275 191 113 328 122 326 211 240 184 236 199
2134 199 206 477 364 598 532 917 1458 8645 19136 10623 8266 7643 2003 490 362 157 332 284 167 288 148 242 77
1864 77 176 209 154 91 57 151 98 226 178 182 90 166 13 47 156 54 51 18 44 116 162 212 170 114 355 315 93 143 67 46 264 584
1488 584 382 56 109 135 161 224 146 117 31 176 141 110 83 11 69 77 232 256 40 109 137 159 10 128 174 23 753 1320 918 177
1136 177 17 47 102 129 92 183 158 246 129 108 176 126 159 111 83 127 107 140 120 123 178 108 117 215 87 120 126 99 14 93 100 116 167 85 117
725 117 54 13 44 107 42 112 70 119 153 151 324 273 249 33 383 382 522 419 193 15 162 224 282 251 48 142 194 124 163 342 231
361 231 59 164 129 50 49 253 208 190 43 34 139 122 100 119 172 257 123 62 42 70 111 98 26 115 168 253 246 98 61 118 69 135 113
-26 113 270 176 88 36 129 192 222 187 122 129 64 193 183 30
-190C0
##PAGE=	F1=-88.3761
##FIRST=	25169.313707327481097,	5807.6787752999953227,	0.23970167338848114014
##DATA TABLE=	(F2++(Y..Y)), PROFILE
5808 146 70 118 141 62 128 136 56 128 25 144 42 48 211 77 111 154 140 56 54 87 70 204 129 128 216 193 63 78 121 129 165 27 94
5420 94 26 71 66 74 81 136 59 174 224 45 82 242 312 43 215 108 50 42 15 26 126 53 157 50 44 134 167 182 121 101 111 98 134
5033 134 131 30 22 108 144 203 49 43 88 63 16 37 68 70 160 164 190 181 119 8 101 101 89 207 71 59 33 119 100 192 156 42 130 141 123
4622 123 136 48 182 126 83 142 108 22 59 161 126 57 88 103 118 67 99 101 282 190 144 60 91 145 187 152 106 85 23 39 42 104 91 21
4223 21 64 97 138 83 159 181 72 32 93 35 187 161 52 144 154 135 29 114 36 296 233 52 57 45 149 57 78 116 134 113 136 55
3848 55 45 43 141 159 131 108 74 141 104 68 113 136 8 123 63 91 74 141 146 66 56 157 99 155 98 139 129 53 111 104 114 72 128 59 123
3437 123 98 102 150 79 33 49 93 30 142 165 54 18 87 164 211 43 85 119 37 108 20 34 99 265 103 82 60 53 67 75 460 547 207
3049 207 90 62 104 87 21 202 556 503 377 165 144 865 3109 2702 506 201 104 35 184 1434 1627 12 163 283 3943
2756 3943 8712 11516 8010 1249 385 180 182 203 329 202 239 76 90 271 209 181 22 203 125 128 264 168 132 70 64 76 142
2439 142 79 56 71 104 190 283 262 86 77 38 95 35 86 48 106 120 218 204 133 170 145 240 72 140 68 79 226 82 224 78 257 182
2063 182 577 3204 7418 3333 3694 4091 634 288 156 208 183 103 216 111 66 92 77 188 133 205 82 46 76 226 179 172
1758 172 204 129 127 161 112 14 65 73 36 69 97 112 181 230 178 478 262 57 104 54 104 299 768 338 83 142 142 182 192 79 102 57
1383 57 139 89 168 57 30 49 107 207 284 39 113 128 164 30 96 179 112 747 1296 890 195 68 24 108 114 76 164 139 198 98 102
1019 102 177 104 179 122 63 151 106 105 122 132 155 92 115 209 117 80 98 35 21 67 105 125 229 67 137 58 11 44 109 33 105 96 80 166 156
608 156 341 287 188 43 382 398 587 429 171 30 109 158 253 203 25 96 169 119 156 330 220 80 159 146 88 60 240 189 158
268 158 31 56 171 150 98 102 131 264 183 84 58 63 135 111 32 133 186 240 229 91 60 79 99 187 71 256 152 90 45 124 220 221 168
-120 168 121 134 61 187 184 64
-190F4
##PAGE=	F1=-190.634
##FIRST=	25169.313707327481097,	5807.6787752999953227,	0.36504533886909484863
##DATA TABLE=	(F2++(Y..Y)), PROFILE
5808 125 10 113 131 42 119 151 88 106 24 122 63 46 207 88 71 216 159 81 96 106 87 229 169 133 192 178 45 38 141 77 128
5444 128 17 84 34 90 75 63 79 148 71 171 217 69 139 254 332 4 174 105 76 29 27 87 172 42 161 35 82 191 180 169
5092 169 112 115 162 125 164 101 37 74 137 141 187 67 32 79 55 31 21 55 75 148 179 211 190 108 27 71 86 78 181 68 74 16 73 94 153
4681 153 130 34 162 156 106 131 49 188 131 82 127 82 32 41 200 185 38 102 123 120 81 51 174 260 208 158 54 65 88 175 141 53 136
4294 136 46 39 72 82 81 43 91 84 120 68 146 191 106 38 69 40 229 169 56 145 153 130 86 126 11 311 239 50 35 44 141 68 69 64 165
3883 165 143 147 89 79 55 144 164 131 105 85 170 140 80 98 58 104 161 109 117 35 109 144 75 58 200 137 209 84 128 127 118 63 92 138 36
3472 36 92 66 117 101 86 141 119 45 59 79 16 96 145 66 34 74 174 223 62 77 94 74 143 28 58 189 428 185 83 51 67 88
3096 88 103 417 487 181 97 65 138 87 93 270 385 311 237 129 133 135 954 1509 717 41 154 128 83 822 1260 180 160 653 1616
2756 1616 6100 13690 10436 1691 573 341 295 256 417 236 305 45 146 265 227 204 120 253 181 92 260 154 142 110 82
2462 82 59 142 136 111 74 77 246 224 306 114 201 31 210 59 141 63 194 47 241 260 44 252 125 267 108 235 207 151 388
2122 388 149 388 416 461 467 1107 5762 12582 6398 698 1233 367 425 281 356 267 117 305 36 179 47 141 182 125 267
1829 267 102 99 72 271 165 190 202 154 148 249 112 88 92 132 82 80 126 78 142 233 148 405 150 36 94 48 128 342 823 280 129
1465 129 171 144 178 155 36 63 93 163 52 194 40 51 76 142 158 284 86 121 113 154 34 77 165 192 669 1140 764 212 99
1124 99 61 95 98 91 149 107 154 76 109 172 85 198 133 46 149 92 83 114 128 130 87 119 198 138 69 61 58 42 62 97 131 261 88 152 69 37
702 37 46 116 77 87 130 43 164 150 327 264 94 72 356 390 646 476 175 50 48 95 182 158 20 51 140 119 132 296 214 98 147
338 147 145 110 54 200 158 108 78 79 184 161 99 77 78 246 226 109 69 126 189 110 46 125 192 202 198 78 67 47 156 236 52 248 118
-49 118 86 38 111 229 216 156 111 116 71 159 166 97
-190I7
##PAGE=	F1=-292.892
##FIRST=	25169.313707327481097,	5807.6787752999953227,	0.32565629482269287109
##DATA TABLE=	(F2++(Y..Y)), PROFILE
5808 101 52 105 132 21 91 159 107 75 17 78 64 53 191 76 42 263 180 97 125 125 94 236 197 134 166 158 79 10 159 47 90 15
5432 15 80 26 112 83 46 79 150 72 161 198 100 186 231 313 31 130 96 112 47 57 161 206 42 139 31 134 242 181 149 83 128 203
5056 203 142 168 64 42 123 140 121 154 76 31 54 34 45 41 56 78 137 187 218 179 78 31 80 78 63 144 57 63 63 69 78 108 101 19 193 161 91
4622 91 123 47 184 125 99 104 79 50 25 223 228 19 101 143 116 91 18 218 216 221 150 46 58 34 136 120 47 199 75 48 98 54 60 52
4223 52 109 53 86 50 129 187 134 69 54 59 255 169 66 120 129 121 128 144 56 321 226 51 16 50 108 78 63 24 176 150 153 115 111 68 131 159
3801 159 130 99 90 182 152 95 65 24 188 184 136 129 18 76 123 106 67 225 158 262 84 104 147 182 25 90 156 6 61 67 121 108 69
3413 69 137 163 76 90 89 49 54 122 110 56 55 161 223 71 58 63 105 168 27 100 234 430 204 42 47 87 84 120 415 578 163 167 66
3026 66 153 52 83 259 269 156 131 85 284 650 2997 3315 1041 118 174 161 118 380 817 164 89 649 597 3058 9038 6987
2721 6987 1154 403 265 246 189 302 231 252 63 148 217 173 196 166 243 181 86 203 148 121 128 53 67 101 138 99 95 103 237 202 268 85
2345 85 242 62 238 99 134 66 192 48 214 233 35 239 111 208 129 199 206 105 367 183 369 474 434 482 1091 5788 12738
2028 12738 6764 1532 514 572 358 255 307 251 132 268 23 194 32 130 132 92 292 96 112 71 240 148 190 179 151 130
1723 130 255 49 136 90 151 128 49 150 67 125 190 100 294 69 55 102 43 129 330 723 255 135 190 133 152 122 65 20 129 189
1371 189 46 185 38 63 95 157 98 259 127 126 97 120 24 70 134 246 539 887 568 222 94 85 63 82 111 140 74 125 66 123
1019 123 166 75 200 136 32 121 72 74 101 108 107 89 126 180 149 97 36 112 69 73 82 124 258 132 154 82 74 52 124 130 65 151 50 143 128 282
596 282 196 32 109 317 369 703 542 179 51 23 82 86 137 33 21 107 124 97 250 212 108 128 125 110 32 141 124 62 122 111 177
232 177 153 104 51 35 218 246 132 62 187 233 92 62 91 183 145 164 58 63 91 223 272 67 248 82 75 24 95 218 205 150 96
-132 96 86 85 117 134 119
-190A19
##PAGE=	F1=-395.15
##FIRST=	25169.313707327481097,	5807.6787752999953227,	0.074341624975204467773
##DATA TABLE=	(F2++(Y..Y)), PROFILE
5808 101 98 92 145 6 54 155 110 49 16 67 40 60 157 42 47 285 189 93 138 137 87 224 206 132 144 135 112 25 168 62 59 21 69 12
5409 12 134 88 28 90 145 62 135 168 117 213 175 264 43 99 83 151 87 103 227 218 54 102 33 180 275 170 132 42 149 229 145 138 24
5021 24 43 157 122 92 110 70 47 21 21 56 61 57 79 125 190 214 157 37 38 126 94 50 122 54 42 103 111 56 104 98 42 218 152 83 119 54 178
4587 178 111 125 85 87 74 27 224 248 18 84 154 108 93 27 222 158 221 128 35 67 36 73 79 84 248 107 49 121 29 57 45 119 62 50
4188 50 60 110 175 150 95 79 82 263 161 90 77 85 91 149 161 101 317 196 56 13 64 63 79 62 45 166 127 147 132 142 87 104 147 125
3789 125 104 95 170 135 100 20 85 244 192 138 125 55 53 93 139 70 227 162 299 89 79 192 236 23 88 163 31 58 84 134 114 55
3413 55 129 207 117 121 105 80 34 102 148 69 46 134 208 72 57 40 123 186 20 126 256 358 179 20 72 95 56 129 413 640 168
3049 168 218 66 145 5 43 144 111 93 96 43 313 633 2798 2793 699 173 122 128 66 187 455 43 79 452 945 1343 2566
2732 2566 1844 320 107 95 173 83 90 158 140 59 138 169 109 149 183 220 156 75 127 132 78 136 109 70 43 110 53 126 159 191 202 184 29
2345 29 229 107 201 118 97 104 138 80 154 179 68 172 56 92 111 98 118 60 232 125 225 336 238 236 607 3245 7371 4076
2016 4076 1564 1100 442 147 131 155 145 99 149 78 147 37 84 54 20 281 95 101 62 167 115 164 144 139 78 208 36 142 90
1676 90 147 159 26 153 67 128 124 75 209 83 101 113 46 123 306 548 279 105 199 120 119 101 78 30 157 189 51 147 51 57 103 152
1300 152 72 221 158 122 79 67 21 76 94 266 389 587 349 222 55 86 19 66 125 133 62 110 61 130 162 75 178 127 19 81 68
937 68 66 89 79 86 95 133 159 146 138 57 145 92 92 76 99 224 166 138 91 121 70 127 177 61 155 86 117 94 216 94 153 146 277 352 756 597
514 597 174 55 52 106 50 147 55 27 75 126 58 203 204 105 99 90 90 11 75 96 60 146 145 157 134 105 35 40 193 242 144 40 219 248 59
103 59 79 40 158 84 137 52 50 155 292 291 83 250 55 58 42 89 193 185 142 81 61 94 70 95 123
-190A23
##PAGE=	F1=-497.407
##FIRST=	25169.313707327481097,	5807.6787752999953227,	0.24445936083793640137
##DATA TABLE=	(F2++(Y..Y)), PROFILE
5808 122 122 77 157 36 29 132 101 44 38 124 22 65 109 7 72 277 180 71 136 134 66 196 192 127 129 104 126 37 163 85 59 33 48 35
5409 35 153 88 17 104 140 49 94 135 116 215 98 198 42 80 69 183 132 146 272 202 73 74 31 206 281 153 128 10 177 238
5056 238 133 80 21 39 168 98 72 70 51 72 18 46 66 68 53 82 109 189 205 134 4 68 175 135 39 152 87 37 132 153 34 142
4681 142 123 93 232 131 78 126 94 182 92 149 78 91 104 51 203 248 44 61 152 99 86 36 189 97 211 118 19 78 63 4 23 109
4305 109 275 135 35 147 53 96 22 123 123 57 86 91 160 154 115 113 98 252 141 122 37 38 34 143 173 130 294 158 63 34 76 22 73
3918 73 70 67 140 84 122 142 165 111 66 131 116 127 98 132 90 91 28 117 262 191 113 106 86 43 70 160 64 208 149 306 88 68 243 271 52
3507 52 78 152 40 77 105 148 121 45 105 237 155 152 107 104 62 78 170 68 66 101 183 67 81 55 129 200 32 134 274 319 139 74 131
3120 131 102 29 121 354 558 155 232 83 121 70 89 43 130 75 88 112 258 273 1284 1183 318 175 71 80 31 187 221 79 207
2779 207 249 876 1725 2387 1916 366 131 67 150 42 121 77 30 67 128 143 100 93 181 218 125 84 66 132 76 146 193 103 18 77 32
2416 32 161 212 136 197 98 26 202 143 135 111 69 156 87 127 95 165 119 123 94 28 82 108 33 141 113 119 72 150 141 140 182 832 1955 1073
2016 1073 758 873 248 78 82 155 35 54 68 152 101 99 77 28 66 254 105 83 56 103 85 123 121 136 38 152 98 129 113 149 171 72
1641 72 141 75 132 73 71 151 119 138 117 63 107 249 363 324 52 199 127 104 88 58 41 173 162 54 98 73 34 104 136 105 188 178 111
1254 111 56 22 35 93 72 252 255 296 171 207 8 74 31 52 131 128 73 104 72 123 165 75 134 106 8 67 94 55 84 53 66 98 138 138 130
843 130 173 88 152 106 117 88 58 172 174 104 93 169 98 121 214 82 142 109 106 59 141 24 259 173 233 356 794 626 174 83 58 112
467 112 127 178 93 27 49 119 23 160 186 88 69 50 60 41 26 77 81 147 169 143 112 98 32 58 174 215 142 27 213 222 29 96 13 120
68 120 35 121 79 41 205 352 294 86 243 46 41 80 102 161 154 127 70 53 95 27 66 106
-190A06
##PAGE=	F1=-599.665
##FIRST=	25169.313707327481097,	5807.6787752999953227,	0.36075070500373840332
##DATA TABLE=	(F2++(Y..Y)), PROFILE
5808 137 124 66 159 71 47 93 84 57 68 184 70 67 72 55 92 242 153 42 125 113 35 157 155 118 119 65 125 43 143 98 86 48 48 71 167
5397 167 87 20 103 141 42 49 106 99 194 33 132 39 59 60 206 176 171 286 162 93 78 25 204 261 141 138 34 202 231 107 14 58 35
5010 35 155 88 68 57 23 93 46 70 74 61 49 87 86 184 196 124 25 108 208 183 33 215 146 59 144 179 19 174 148 140 230 97 66
4622 66 142 155 200 78 166 72 86 131 81 161 230 71 47 134 90 76 47 130 49 199 137 11 91 70 67 42 117 276 154 25 180 98
4247 98 139 14 124 185 97 105 74 150 150 130 139 100 226 109 149 57 50 52 115 175 133 249 130 68 58 81 16 64 87 68 104 53 82 145 175
3836 175 131 23 114 108 160 95 69 29 75 64 118 245 186 68 80 104 44 64 156 52 174 118 278 78 72 281 282 79 71 122 31 87
3460 87 109 154 140 32 58 239 182 186 90 123 109 46 171 53 97 70 153 57 104 83 125 206 66 130 273 294 106 123 209 116 23 94
3085 94 256 349 109 213 126 114 130 145 238 369 109 57 194 195 169 1037 1412 569 157 96 48 110 159 77 142 268 186 462 1525
2744 1525 3743 3097 572 227 134 131 80 189 63 56 77 107 118 109 48 160 220 95 103 50 151 116 167 246 155 25 56 65 183 234
2392 234 89 164 65 57 189 156 73 77 61 184 83 164 64 182 162 137 172 111 74 180 82 180 155 169 93 116 257 354 542 2646
2040 2646 5531 2627 466 294 275 211 145 280 53 31 141 199 128 142 114 74 137 234 98 64 44 92 94 90 125 131 53 138 115 110 136
1676 136 158 168 102 124 94 136 68 52 104 144 145 107 93 95 116 266 380 29 195 155 114 86 19 22 173 121 60 65 95 25 99 121 144 172
1277 172 186 97 34 55 52 111 83 212 160 66 129 171 82 66 73 41 133 129 94 106 110 105 174 65 79 78 5 102 128 46 90 51 46 104 140 125 103
843 103 197 107 140 114 146 112 24 122 153 58 88 206 125 102 236 106 122 112 106 50 67 121 325 184 184 378 800 624 186 115 45 85
467 85 178 210 147 13 35 103 23 127 162 61 59 34 49 71 45 64 82 126 175 146 94 82 32 64 151 170 126 48 184 158 50 109 56 75
68 75 38 111 109 56 230 393 283 77 218 43 28 114 121 128 114 105 65 57 87 14 72 71
-190G1
##PAGE=	F1=-701.923
##FIRST=	25169.313707327481097,	5807.6787752999953227,	0.22731095552444458008
##DATA TABLE=	(F2++(Y..Y)), PROFILE
5808 128 114 69 150 109 75 49 65 76 95 220 116 66 93 92 100 193 112 33 113 78 13 112 100 105 105 36 126 51 113 99 113 64 86 103 176 89
5385 89 24 79 145 49 27 84 77 157 80 80 48 26 64 216 214 172 270 108 108 93 16 174 224 150 155 49 214 213 77 70 92 35 120 98 72 73
4963 73 9 101 68 79 81 46 49 94 55 170 190 133 41 142 218 221 33 279 208 84 141 183 26 179 155 169 214 55 46 164 220 227 71
4575 71 173 65 77 150 109 106 200 89 49 104 81 72 80 61 31 189 170 30 104 59 109 92 116 259 159 55 216 135 163 41 123 231
4200 231 130 109 65 143 144 146 153 86 192 66 163 101 94 135 74 167 107 186 129 67 79 81 27 60 106 53 62 86 36 143 168 141 39 97 102 186
3777 186 83 25 48 61 81 92 200 179 14 53 115 48 62 124 44 133 78 217 59 70 293 266 100 86 76 14 80 86 151 174 7
3413 7 16 205 195 219 56 140 156 38 153 31 127 46 126 41 109 99 116 200 108 122 257 250 79 178 284 138 21 54 191 121 61
3049 61 176 178 137 177 166 379 557 180 15 236 177 416 1861 2055 582 157 120 37 141 29 111 132 260 196 139 658 2551
2732 2551 2216 417 212 140 95 112 114 27 102 80 94 86 89 12 122 199 69 115 64 167 146 200 252 202 6 62 89 184 213 53 102
2369 102 87 64 192 145 45 26 57 178 99 176 66 180 191 160 211 141 111 193 99 147 190 176 122 148 273 410 684 3147 6742
2028 6742 3229 940 285 289 219 147 332 67 37 176 203 182 146 143 98 175 231 67 43 12 101 129 100 141 105 63 170 102 83 141
1676 141 163 160 100 106 120 153 72 12 75 157 121 93 128 120 112 430 446 89 187 183 124 108 62 42 161 82 75 78 110 69 86 111 167 167 188 85 41
1242 41 82 73 120 105 164 104 96 165 115 152 74 103 35 134 143 120 113 157 92 186 48 45 61 30 137 152 55 103 71 23 117 143 126 69 202 110
819 110 116 126 174 135 64 99 107 13 74 224 145 73 243 124 109 96 95 65 13 185 341 179 131 395 745 578 191 132 43 25 186
455 186 232 202 40 29 80 49 111 143 39 79 56 76 93 68 61 56 95 164 160 80 70 26 60 116 116 99 70 165 70 84 115 77 50 57 98 125 81
21 81 229 406 261 54 172 37 20 136 128 94 67 77 65 60 72 38 98 39
-190C9
##PAGE=	F1=-804.181
##FIRST=	25169.313707327481097,	5807.6787752999953227,	0.076858878135681152344
##DATA TABLE=	(F2++(Y..Y)), PROFILE
5808 97 110 88 137 141 97 57 50 99 114 226 139 70 137 106 96 152 66 56 102 33 38 65 40 89 85 68 141 61 85 96 130 81 124 127 178 93 30
5373 30 34 141 62 43 70 65 111 136 56 65 20 76 215 241 157 234 57 115 97 5 126 187 181 170 52 205 189 60 126 119 40 75 113 75
4974 75 92 37 93 82 70 91 38 54 100 29 147 185 159 70 158 202 238 40 325 256 106 127 167 43 157 146 173 188 10 28 185
4610 185 269 251 73 170 62 67 157 135 44 162 95 51 66 69 73 128 3 35 185 195 50 109 41 119 118 111 233 152 93 245 153 157 60 122
4211 122 252 146 98 71 131 141 160 162 63 158 38 159 136 125 206 40 150 59 121 142 54 91 84 34 61 120 28 20 138 38 138 144
3836 144 143 92 82 98 194 67 102 107 64 78 52 143 169 34 36 125 51 55 69 55 94 74 140 44 57 275 225 119 122 29 29 72 36 149 214
3425 214 32 94 143 192 244 21 158 187 76 120 21 149 32 111 23 93 96 102 180 149 113 272 301 57 246 337 168 68 40 163
3073 163 51 70 139 221 160 204 151 429 652 227 52 217 167 421 1686 1579 242 177 117 56 124 188 295 73 219 175 244
2756 244 385 516 662 113 171 116 70 158 235 88 127 77 119 73 39 21 76 144 53 118 74 168 155 231 223 227 33 92 98 171 155 30 24
2369 24 115 58 197 127 44 27 65 146 116 160 76 148 208 165 198 125 160 149 65 72 165 139 116 116 175 315 561 2157 4775 2199 904
2005 904 533 168 134 95 299 117 62 148 171 225 115 167 127 179 236 47 39 33 96 157 142 152 67 72 208 116 47 128 161 152 70 86 147
1617 147 176 58 78 91 153 74 106 155 166 338 676 505 148 174 193 117 144 120 106 144 63 101 111 111 115 64 101 174 165 186 74 68 80 105
1218 105 113 122 132 66 156 161 58 204 85 119 34 144 171 150 119 192 100 194 56 79 76 68 150 156 80 116 88 21 135 147 140 35 187 100
819 100 89 142 194 150 112 106 51 37 51 220 154 40 236 138 115 69 66 71 56 206 315 164 90 389 617 474 168 126 74 56 156
455 156 234 240 89 19 62 77 118 140 58 102 76 106 107 71 69 13 65 148 164 67 89 17 57 73 62 69 80 181 38 107 108 76 72 61 77 123 105
21 105 208 385 234 23 110 34 22 143 117 54 25 49 66 59 54 54 114 58
-190E8
##PAGE=	F1=-906.439
##FIRST=	25169.313707327481097,	5807.6787752999953227,	0.075664691627025604248
##DATA TABLE=	(F2++(Y..Y)), PROFILE
5808 53 122 113 130 161 111 107 40 126 119 207 130 90 165 98 86 145 25 80 91 23 63 22 37 74 64 113 162 71 74 97 134 100 143 138 176 98 54
5373 54 51 119 76 51 63 65 67 167 60 80 60 88 203 256 148 194 29 112 87 11 74 167 219 182 54 172 165 61 155 138 53 29 124
4986 124 83 103 66 70 90 52 108 49 57 105 52 115 179 190 118 153 160 230 52 344 277 126 108 135 58 124 134 158 163 33 39 198 289 263 80
4575 80 156 68 60 154 154 21 120 87 45 29 54 77 174 46 44 184 198 66 97 39 107 116 109 206 136 121 257 147 121 61 120 250 142 79
4176 79 90 104 140 172 167 54 141 64 138 153 135 248 51 124 44 91 149 32 91 96 52 58 123 15 23 180 84 130 119 155 141 69 87 179
3777 179 64 177 148 82 61 23 85 155 66 33 139 47 49 7 87 63 134 99 57 43 228 164 136 159 48 55 83 29 172 244 82 174
3401 174 90 178 248 58 178 195 109 90 47 163 30 103 25 59 77 85 148 180 102 324 438 64 313 354 198 137 82 98 45 129 117
3038 117 244 160 204 112 391 648 227 88 143 122 237 751 455 324 190 102 100 84 414 482 5 175 137 153 764 852 563 177
2709 177 166 83 67 225 512 239 139 61 163 87 25 52 34 66 46 118 73 154 151 243 184 225 76 134 96 154 76 26 63 153 51 198
2333 198 121 48 65 87 102 131 126 83 104 211 164 146 88 187 96 22 64 139 107 141 103 60 164 355 1234 2749 1380 455 469 56
1981 56 62 55 216 218 84 85 120 244 73 187 173 163 233 75 68 74 81 169 179 157 78 112 234 159 41 111 155 143 40 60 168 183 56
1594 56 156 125 125 33 144 165 197 517 846 536 198 152 178 91 170 161 163 126 65 132 138 99 148 40 87 171 164 186 66 88 53 146 92 133
1195 133 125 35 142 112 78 232 84 125 41 173 209 180 117 200 119 195 98 119 105 114 137 137 106 123 90 51 147 155 164 22 152 81 65 153
796 153 202 157 144 124 29 62 21 198 153 10 216 152 130 44 45 58 99 190 272 147 83 361 463 320 121 101 111 144 102 215 249
432 249 136 5 58 103 138 148 96 111 85 124 121 61 88 52 49 141 148 55 132 27 56 34 36 42 78 211 116 114 87 65 99 47 50 110 123 173 336
-2 336 208 30 42 46 37 136 92 22 46 26 60 56 37 61 112 100
-190A00
##PAGE=	F1=-1008.7
##FIRST=	25169.313707327481097,	5807.6787752999953227,	0
##DATA TABLE=	(F2++(Y..Y)), PROFILE
5808 13 142 139 128 164 114 147 36 157 111 176 88 124 169 74 79 164 4 98 74 66 80 18 88 64 66 143 172 74 85 109 128 124 136 137 167 102
5385 102 94 123 74 92 44 59 67 33 173 71 89 83 93 179 256 161 166 38 103 72 27 43 162 249 197 61 119 146 63 156 148 67 9 121
4986 121 99 110 92 39 89 58 132 67 56 107 92 80 169 214 174 127 101 198 66 335 262 145 94 97 68 106 136 136 151 66 62 197 276 255
4587 255 86 131 73 58 141 163 74 78 66 33 13 36 79 204 69 67 184 177 73 68 55 105 90 108 185 120 132 247 117 66 43 115 228
4200 228 123 65 109 55 140 181 164 80 150 94 102 149 122 255 80 95 97 123 136 14 77 113 77 47 115 32 58 202 125 122 112 188 178 60
3801 60 63 143 85 231 162 102 39 51 40 140 75 41 156 36 60 63 124 45 202 141 90 49 165 96 149 182 88 74 110 99 220 254 133
3413 133 239 115 159 225 115 195 176 121 84 85 165 41 96 50 27 50 74 117 191 91 359 521 106 357 331 217 198 129 49 149
3061 149 214 109 241 131 178 70 299 569 202 103 39 50 38 541 965 695 176 96 151 61 546 575 69 138 109 109 640 1094
2732 1094 830 327 190 44 82 280 670 335 139 33 199 100 79 76 14 20 51 117 65 133 146 224 163 200 106 176 92 135 4 42
2380 42 126 202 49 196 131 57 78 103 65 138 88 85 66 193 161 75 58 176 93 74 113 169 109 178 157 118 94 282 2009 4134 2342
2016 2342 163 201 208 107 67 126 302 86 31 66 237 59 193 216 153 209 95 102 98 70 164 196 165 132 164 244 181 86 108 146 128
1653 128 72 37 180 163 95 211 146 71 67 175 151 206 604 885 530 236 123 136 58 172 177 191 109 71 157 152 82 165 36 64 162
1289 162 161 188 64 94 23 187 64 143 127 29 82 44 138 234 68 126 61 217 249 200 108 178 134 185 141 140 132 159 110 102 124 119 80 80 143
878 143 164 191 43 104 64 44 148 197 157 157 138 59 67 25 166 146 13 185 167 136 31 73 44 129 152 241 137 97 329 418 193 98
502 98 76 140 217 46 175 222 169 15 69 121 157 155 133 102 88 130 140 53 111 97 47 144 115 52 176 56 52 29 57 20 67 219 168 106
103 106 59 58 109 21 34 109 138 133 272 185 75 35 65 59 121 66 53 85 25 50 54 24 57 93 133
-190A33
##PAGE=	F1=-1110.95
##FIRST=	25169.313707327481097,	5807.6787752999953227,	0
##DATA TABLE=	(F2++(Y..Y)), PROFILE
5808 31 154 163 121 149 103 163 38 188 91 150 27 161 157 49 79 185 8 112 50 102 86 48 128 63 96 149 164 68 102 126 116 153
5432 153 105 124 150 100 138 189 19 107 30 55 64 14 159 83 93 81 90 147 241 182 154 52 92 72 42 57 154 262 218 67 58 131 63 136
5033 136 151 79 30 101 113 118 111 6 77 97 156 80 52 109 125 54 159 219 225 86 34 153 78 302 217 165 92 64 75 110 149 120 154 83
4634 83 79 180 233 229 86 99 68 57 122 158 115 43 40 27 30 15 76 210 74 97 184 137 71 41 74 137 49 103 173 109 127 217 71 42 9
4223 9 107 195 100 75 121 11 137 186 151 115 176 103 57 121 89 234 101 68 140 170 103 39 55 124 99 33 100 43 85 202 153 112 123
3836 123 229 197 59 29 91 116 258 148 116 25 92 24 126 66 60 174 24 87 117 152 41 249 198 119 58 99 50 150 185 111
3484 111 86 134 157 265 240 173 281 167 140 175 169 205 145 109 104 128 155 60 81 71 58 26 82 96 184 79 342 496 156 364 279 217
3108 217 226 165 129 287 281 112 210 86 136 42 202 461 199 113 95 43 235 1269 1619 794 133 102 193 81 501 485 134 102
2779 102 106 347 278 864 835 412 217 30 127 267 571 291 130 5 224 104 117 87 36 83 63 116 68 117 147 179 157 165 120 211
2427 211 97 113 57 73 168 244 55 196 140 68 64 107 49 126 56 86 43 153 144 21 44 131 105 118 128 202 110 180 188 151 101 268 2399
2040 2399 4875 2740 488 108 281 121 60 72 331 75 36 18 200 76 171 235 161 162 86 127 102 60 152 189 179 174 201 236 158
1700 158 129 130 136 109 126 64 183 120 141 225 153 11 114 184 114 199 605 808 498 258 102 76 56 153 165 182 105 77 168 149 78 165
1324 165 60 33 143 147 187 69 94 60 220 41 152 125 47 7 32 178 209 55 123 92 265 283 203 101 130 142 165 165 141 153 193
960 193 84 61 130 106 76 100 125 175 218 66 58 57 29 132 178 149 152 147 73 64 65 131 138 21 147 176 123 40 109 69 147 113 234 138 104 309
538 309 534 242 137 74 159 260 23 127 166 183 28 80 126 162 155 159 75 93 130 164 61 135 121 49 145 73 59 208 88 41 43 84
162 84 8 51 193 179 89 36 56 100 10 53 128 154 91 205 164 119 93 79 85 107 60 90 110 48 46 53 20 47 73 150
-190A50
##PAGE=	F1=-1213.21
##FIRST=	25169.313707327481097,	5807.6787752999953227,	0
##DATA TABLE=	(F2++(Y..Y)), PROFILE
5808 47 153 187 102 121 79 150 46 213 72 140 50 186 146 44 80 193 5 127 22 125 82 72 154 79 135 129 140 57 113 138
5456 138 101 183 63 100 121 91 176 237 66 117 14 51 58 13 137 93 93 53 84 108 212 190 149 61 84 90 52 83 132 256 243 63 49
5068 49 118 83 111 151 86 36 62 112 127 115 19 53 143 175 88 45 111 147 51 153 202 261 46 26 106 83 253 158 187 105 41 80 114 158
4669 158 112 165 81 85 147 177 190 76 62 50 56 99 135 139 30 13 32 40 5 70 188 68 120 181 88 64 68 92 178 14 91 166 105 114 176
4258 176 22 89 35 95 160 84 105 125 88 133 186 131 144 199 89 19 73 46 199 108 67 153 204 58 70 35 123 113 28 82 40 104 184
3871 184 169 98 130 255 198 64 44 33 147 259 114 123 31 132 40 113 61 91 186 24 119 155 160 46 258 228 133 50 42 66 134 169
3495 169 121 90 149 194 284 206 194 295 190 118 106 211 203 125 79 127 174 135 81 58 79 103 19 104 85 163 66 285 389 189 329 210
3120 210 206 213 190 130 288 276 125 156 64 90 38 139 377 228 152 205 101 377 1558 1729 695 84 115 216 119 288 254 210
2791 210 52 127 512 79 1197 1292 501 222 73 215 166 238 133 121 33 241 108 136 84 61 116 65 115 85 112 157 121 144 130
2451 130 124 232 109 83 82 111 195 260 72 198 136 67 35 109 54 97 38 91 31 101 109 40 34 71 92 132 125 191 91 148 176 106 57 174
2052 174 1834 3619 2051 525 313 254 102 58 84 302 81 42 44 139 84 122 223 173 101 65 138 108 46 150 168 193 190 209 211
1711 211 99 156 161 123 98 177 122 176 72 174 197 159 71 146 167 68 188 558 661 454 263 107 13 96 132 131 140 128 81 156 131 103
1336 103 158 87 22 115 119 177 77 104 110 236 43 155 120 68 58 71 185 163 74 116 126 306 300 184 102 72 146 138 163 129 171 210 73
948 73 26 121 91 96 109 103 185 240 85 51 61 24 122 148 131 135 153 66 82 101 100 129 23 106 176 92 76 122 108 152 88 235 148 98 289 655
526 655 348 184 89 167 264 31 94 95 177 34 87 115 154 150 174 37 105 129 190 74 155 117 57 134 42 68 221 113 22 46 104 11
150 11 29 140 152 67 37 50 86 38 82 153 166 48 143 142 152 136 82 111 105 73 106 116 80 61 53 25 35 68 148
-190A48
##PAGE=	F1=-1315.47
##FIRST=	25169.313707327481097,	5807.6787752999953227,	0
##DATA TABLE=	(F2++(Y..Y)), PROFILE
5808 48 142 208 70 90 45 112 57 226 74 143 112 193 146 58 78 189 31 141 3 131 70 92 166 107 169 95 109 50 112 137 86
5444 86 207 52 71 82 75 198 261 127 121 3 47 52 18 120 102 88 24 86 72 173 174 145 67 81 109 56 106 99 235 267 53 109 103 133
5045 133 101 149 90 25 26 92 130 100 36 21 178 186 95 40 114 159 61 157 166 275 38 70 69 79 193 113 211 126 30 86 103 155 103 175 63
4634 63 80 102 132 151 61 33 33 55 76 97 142 40 10 46 40 21 66 143 55 126 174 43 53 113 113 206 39 68 164 105 100 137 18 131 80
4223 80 80 134 81 136 125 160 130 178 111 162 208 60 35 12 59 172 104 108 132 218 17 92 33 108 114 35 67 23 111 152 171 78 119 252 185
3812 185 75 99 27 176 241 86 122 40 162 54 101 84 126 191 35 152 178 143 56 228 224 127 18 15 94 102 137 127 90 157 204 268
3437 268 166 196 283 179 87 34 234 186 130 42 141 215 119 100 28 71 134 25 124 71 137 53 221 272 187 255 140 191 174 200 96
3073 96 83 179 144 106 102 48 46 114 324 248 216 293 131 454 1599 1744 681 96 131 214 147 265 439 290 24 160 698 554
2744 554 2405 2345 607 210 130 331 168 491 319 125 58 251 121 142 73 83 113 57 114 104 115 171 70 114 107 123 235 117
2416 117 51 78 146 216 244 95 202 113 47 51 123 66 62 34 99 46 59 70 49 37 38 66 114 140 135 64 121 145 19 44 106 732 1217 758
2016 758 310 365 172 127 111 114 238 100 48 90 72 81 63 189 169 76 72 136 132 25 165 144 198 178 191 168 47 166 182 102 106 216
1641 216 179 160 43 184 140 172 113 154 131 58 181 509 492 405 249 131 40 138 136 87 84 167 85 121 103 139 148 109 60 92 84 150 82 127
1242 127 153 234 60 149 113 89 98 82 159 101 113 105 156 328 293 150 110 29 147 105 139 113 190 208 68 17 103 80 127 112 87 191 253
854 253 100 73 69 26 140 111 103 118 157 53 121 124 77 115 36 77 166 57 131 109 134 144 79 230 162 80 253 687 395 203 97 162
479 162 232 27 89 46 160 30 92 99 139 145 178 20 119 132 210 77 170 89 75 116 42 73 214 121 9 43 117 17 6 74 96 48
103 48 45 37 85 57 105 166 167 13 86 116 170 161 74 134 122 83 93 102 114 83 56 36 26 70 131
-190A31
##PAGE=	F1=-1417.73
##FIRST=	25169.313707327481097,	5807.6787752999953227,	0
##DATA TABLE=	(F2++(Y..Y)), PROFILE
5808 39 133 226 30 67 29 53 68 222 101 150 152 181 152 76 73 180 58 151 19 122 52 111 170 139 194 71 82 53 99 117 70 215
5432 215 82 47 49 58 200 261 166 120 27 46 51 19 122 108 75 62 103 56 131 136 139 71 82 115 60 127 73 204 281 57 164 82 190 110
5033 110 146 94 1 52 56 120 67 43 26 194 192 105 40 116 165 66 169 124 267 58 92 49 64 129 106 228 148 37 92 79 138 88 180
4646 180 37 69 53 121 124 55 40 43 60 55 56 125 50 31 67 30 30 71 88 38 112 159 11 45 145 137 211 69 39 161 103 92 108 40 148
4235 148 118 71 118 84 156 120 214 134 162 100 169 196 40 55 47 126 168 92 167 86 212 29 104 41 82 104 48 56 30 107 115 159 50 89
3836 89 217 169 88 149 79 202 217 97 115 41 176 59 97 116 161 186 45 177 187 112 66 173 197 103 30 50 104 62 97 137 86
3472 86 163 187 223 136 182 249 149 48 28 232 159 139 29 139 242 119 112 8 49 142 32 127 46 107 40 179 183 137 153 85 176
3108 176 143 192 295 295 74 156 112 147 23 60 116 259 237 269 343 129 460 1527 1815 753 134 141 179 139 536 758 326 66
2779 66 164 816 1112 3696 3299 662 208 166 411 344 956 570 149 77 249 134 133 62 95 87 57 113 117 113 182 51 72 103 118 224
2427 224 115 21 63 171 230 200 112 199 77 26 104 155 79 32 42 102 68 59 78 39 55 68 66 71 160 52 45 126 124 60 116 187 269 937 400
2016 400 23 287 101 174 163 123 181 96 82 123 35 83 24 150 140 129 100 124 161 10 181 129 186 148 153 110 81 164 178 70 131 237
1641 237 217 135 41 174 69 180 114 140 88 100 176 484 331 352 215 147 73 168 158 42 52 199 82 74 79 170 133 121 99 88 83 107
1265 107 77 155 183 216 75 135 101 106 109 69 108 33 149 93 174 328 259 116 116 38 136 67 104 100 205 189 57 30 89 77 151 121 78 189
866 189 252 111 84 80 23 172 80 70 109 159 63 161 127 71 94 65 75 148 55 190 80 137 129 74 212 173 56 209 628 371 192
502 192 92 144 176 51 94 67 144 24 100 96 131 145 175 48 126 137 215 70 177 52 98 106 57 76 189 105 36 54 131 20 29 15
127 15 28 35 43 29 102 67 123 163 150 48 36 91 170 168 57 153 155 84 55 71 146 98 61 60 18 60 103
-190A03
##PAGE=	F1=-1519.99
##FIRST=	25169.313707327481097,	5807.6787752999953227,	0
##DATA TABLE=	(F2++(Y..Y)), PROFILE
5808 26 139 237 9 56 61 18 79 202 135 151 166 156 154 93 66 171 75 153 29 104 43 133 171 163 210 78 69 62 75 81 56 201 106 50 57
5397 57 53 183 241 177 122 60 50 55 18 141 105 57 109 128 76 92 84 134 84 85 103 74 148 71 171 281 86 201 57 235 120 144 102
5010 102 41 80 12 97 24 42 63 185 197 124 47 117 168 62 182 91 241 68 92 42 40 68 108 230 164 60 94 51 113 69 173
4646 173 15 55 23 139 111 66 66 66 71 44 48 93 59 55 94 22 30 86 60 27 84 134 9 44 157 165 196 92 9 154 90 82 87 40 140 144
4223 144 77 104 86 155 105 237 143 140 101 169 163 51 57 94 192 186 80 224 51 192 40 105 41 56 86 66 49 81 94 82 132 20 44
3836 44 157 159 95 180 123 224 199 128 105 31 170 56 112 133 188 171 52 185 186 96 74 127 172 83 82 98 95 25 56 147 85 169 147 169
3437 169 126 162 196 128 46 61 201 128 133 53 122 248 128 111 16 22 125 45 105 22 68 29 169 105 51 37 80 148 140 166 523 669 181
3049 181 147 150 169 50 88 132 144 209 287 331 114 353 1077 1423 571 126 133 113 92 575 682 251 25 83 499 1160 3127 2559
2721 2559 492 185 109 350 383 992 554 180 74 225 124 98 60 83 72 71 111 130 99 180 73 55 108 102 206 113 19 58 189
2380 189 222 143 113 179 38 47 160 198 94 19 54 100 74 83 120 39 64 112 81 26 153 28 56 143 116 93 144 205 665 1816 887
2016 887 166 158 86 184 182 99 164 60 123 145 54 110 33 127 93 193 116 107 173 30 178 127 155 108 108 49 122 156 148 26 161 233 229 107
1617 107 34 150 12 170 79 106 51 141 181 482 205 295 163 138 85 176 169 14 68 209 69 57 72 184 110 122 127 93 131 52 61
1254 61 178 203 189 82 118 73 110 97 43 58 44 173 85 174 300 206 104 117 47 109 30 84 88 210 160 45 48 96 77 159 142 68 181
866 181 238 117 75 93 11 197 77 37 111 160 86 184 109 77 65 100 93 123 90 238 61 114 109 60 187 174 41 181 528 309 164
502 164 72 114 114 107 93 93 141 38 109 113 129 149 168 67 116 144 198 58 177 30 120 114 76 82 155 64 64 82 145 31 56 30 44 29 30 33 123
68 123 76 141 148 113 90 46 77 157 162 35 168 195 81 28 42 173 100 70 94 33 36 79
-190G9
##PAGE=	F1=-1622.24
##FIRST=	25169.313707327481097,	5807.6787752999953227,	0
##DATA TABLE=	(F2++(Y..Y)), PROFILE
5808 10 163 236 35 42 101 87 91 173 161 140 154 129 147 116 59 166 72 143 36 86 60 157 173 171 218 96 70 69 46 42 52 159 108 74 87
5397 87 67 160 208 161 133 96 58 60 30 168 91 40 141 155 109 59 44 134 115 83 78 99 165 78 144 265 121 213 48 256 121 148 112
5010 112 90 81 31 74 17 35 97 151 205 150 58 112 167 53 190 79 200 61 77 40 11 18 90 208 165 90 93 32 86 49 153 10
4634 10 43 58 160 99 85 89 85 85 37 78 58 80 87 122 40 26 102 98 40 66 99 32 51 149 191 167 109 13 142 66 63 81 26 112 156 95 81
4200 81 88 129 74 229 151 116 112 164 115 64 42 114 239 212 72 265 91 161 28 98 27 52 76 89 48 148 71 60 94 48 3 92 159
3812 159 87 186 153 239 194 150 95 30 144 55 147 126 201 152 58 166 172 113 89 131 171 111 121 158 78 7 18 144 93 174 91 139 128 146
3413 146 130 125 101 65 140 101 124 79 101 233 121 95 15 29 92 67 59 44 54 36 194 132 53 90 136 96 140 137 635 873 239 105 166
3026 166 151 103 140 131 90 198 283 233 190 128 658 855 281 133 136 192 112 209 312 133 185 201 671 645 1672 1862 378 295 118
2685 118 73 109 320 357 211 39 184 70 35 84 31 94 70 110 160 88 155 116 99 95 73 187 130 49 55 204 181 96 92 136 17 75
2310 75 215 240 110 30 55 107 57 100 158 53 60 156 97 58 106 76 98 153 125 74 119 124 414 1251 646 179 119 115 146 168 46 175
1934 175 77 154 166 66 152 52 133 61 234 113 88 159 54 150 135 111 62 64 15 141 144 100 23 186 206 216 88 32 123 56 146 41
1559 41 69 31 163 199 480 173 243 99 103 80 164 156 21 79 195 45 110 76 178 77 113 140 86 186 36 34 191 213 159 80 103
1195 103 25 94 72 19 68 101 182 85 157 248 149 118 111 33 68 27 96 73 198 130 43 73 124 77 149 172 52 166 210 117 55 102 25 201
796 201 104 10 123 156 100 182 77 86 33 133 112 91 127 264 83 73 89 33 158 162 57 185 451 249 137 43 74 58 171 104
444 104 99 149 69 117 129 122 150 163 68 84 152 154 56 174 43 129 129 103 91 122 23 89 119 155 53 74 60 99 32 13 33 141 97 163 129
33 129 62 128 96 81 139 153 10 179 233 80 78 61 193 88 77 132 74 33 83
-190H3
##PAGE=	F1=-1724.5
##FIRST=	25169.313707327481097,	5807.6787752999953227,	0
##DATA TABLE=	(F2++(Y..Y)), PROFILE
5808 14 195 224 47 17 136 149 104 148 173 115 126 105 136 147 52 164 48 123 41 76 86 178 176 158 218 101 81 71 33 64 62 96 89 102
5409 102 105 84 145 168 126 153 128 69 66 59 192 70 38 154 177 140 28 65 139 155 75 54 130 173 73 137 237 151 198 74 250 112
5033 112 160 120 142 52 66 72 46 24 118 96 210 178 73 100 160 48 190 75 150 39 61 40 29 46 44 158 149 119 86 23 61 31 119
4646 119 18 48 101 175 80 104 104 95 97 25 101 56 122 125 146 72 32 109 144 59 84 58 62 59 131 209 128 119 26 121 50 37 92 35 81 153 115 55
4200 55 90 82 28 193 155 96 124 156 69 58 24 103 257 236 69 277 146 121 10 90 5 75 92 115 49 221 41 53 61 99 44 59
3824 59 162 61 166 163 244 202 154 88 61 107 67 189 92 198 137 67 116 146 140 127 161 187 175 136 221 74 39 27 120 114 186 29 144
3437 144 128 148 73 116 160 60 55 80 151 101 109 202 92 63 46 54 78 100 12 79 137 77 235 262 124 209 217 17 118 141 569 823 186
3049 186 79 163 103 186 223 96 276 236 332 37 410 495 2662 3043 1325 347 254 484 259 963 1865 561 595 654 2761
2756 2761 3516 12076 10774 1618 820 559 565 594 1412 1282 254 112 194 84 130 157 86 143 48 132 217 136 103 175 172 43 67
2439 67 175 180 91 34 223 108 83 57 84 43 89 267 268 135 63 35 131 46 103 186 47 76 184 136 109 36 76 147 157 166 35 56 15
2052 15 315 435 418 136 207 159 92 144 19 187 172 173 192 65 193 91 154 84 243 101 73 127 77 100 144 63 13 30 46 147
1700 147 128 57 63 200 168 193 99 68 103 95 122 74 64 25 168 225 462 242 212 51 59 68 135 122 26 71 164 27 179 73 155 43
1324 43 99 137 59 225 82 25 197 213 134 67 91 35 58 45 10 107 138 177 92 129 179 111 137 101 5 33 57 124 53 168 108 50 100
937 100 154 80 124 199 38 148 167 110 52 99 61 183 136 18 139 146 101 152 46 89 17 158 123 56 160 262 118 26 75 11 127
573 127 137 90 207 425 212 122 19 30 22 229 146 88 155 104 116 128 96 141 161 52 46 157 91 70 170 64 118 138 132 108 102 82 108
185 108 156 151 79 77 92 137 40 18 35 158 129 187 113 24 159 138 100 124 147 17 189 261 85 129 110 206 65 78 167 123 73 110
-190A10
##PAGE=	F1=-1826.76
##FIRST=	25169.313707327481097,	5807.6787752999953227,	0
##DATA TABLE=	(F2++(Y..Y)), PROFILE
5808 47 225 201 42 28 164 197 115 141 170 77 102 86 127 183 48 158 24 96 45 75 111 192 177 129 209 90 94 73 57 124 81 54
5432 54 57 128 101 91 145 130 81 178 147 82 73 93 206 59 46 155 194 165 1 106 146 189 61 52 158 166 50 155 201 169 157 106 221
5045 221 104 177 125 189 32 89 86 61 27 123 32 204 200 92 80 144 53 184 66 96 27 58 43 62 91 39 84 119 141 78 13 39 19
4657 19 73 55 87 137 181 64 122 114 102 102 11 105 92 175 164 163 103 52 103 169 67 114 30 89 69 118 209 81 119 28 94 87 20 110 69 70
4235 70 140 130 54 89 51 38 143 161 82 133 147 70 33 33 61 241 252 70 259 184 76 51 84 36 104 125 137 47 291 8 58 72
3859 72 151 76 87 161 44 126 153 237 214 153 85 102 69 88 227 41 178 137 82 51 109 158 185 178 194 239 127 279 91 82 62 77 142
3472 142 213 42 167 120 175 97 87 208 90 60 59 217 119 157 168 62 23 109 75 117 145 83 109 249 140 265 356 142 313 307
3120 307 82 100 188 354 634 234 190 202 125 310 333 107 481 324 486 244 729 1233 5643 6470 2790 693 485 885
2838 885 437 2526 4263 1226 1183 1284 5626 8421 27811 23959 3502 1651 1183 1413 1674 3824 2882 331 286 331
2603 331 262 307 273 243 222 105 200 295 237 41 248 259 49 133 183 263 143 30 249 73 101 81 105 81 103 314 269 172 115 15
2251 15 165 103 90 212 35 136 180 204 153 45 32 190 148 221 63 29 105 838 1564 903 256 289 186 80 136 75 196 264
1923 264 183 214 69 224 145 168 113 218 94 81 99 101 43 146 30 58 27 68 156 107 53 91 206 146 181 127 115 89 120 122 116 95 15
1535 15 165 250 427 332 214 82 67 55 96 79 19 64 128 56 241 59 126 33 89 118 17 243 117 72 196 202 119 40 84 94 9
1171 9 31 15 127 144 164 103 97 108 100 145 89 36 53 82 151 37 124 103 50 120 175 92 94 214 41 128 112 98 78 80 96 149 157 45 156
761 156 132 101 101 60 88 35 172 125 54 188 237 146 23 70 58 99 105 124 240 432 193 121 42 20 39 271 203 72 151 134 106 107 49
373 49 121 162 48 83 156 49 92 166 85 88 135 154 134 98 153 120 189 127 104 64 130 158 52 42 59 176 158 209 104 60 184 167 122
-14 122 116 144 40 200 273 93 161 161 213 37 75 187 166 112 137
-190A37
##PAGE=	F1=-1929.02
##FIRST=	25169.313707327481097,	5807.6787752999953227,	0
##DATA TABLE=	(F2++(Y..Y)), PROFILE
5808 88 246 170 33 74 183 226 122 152 154 32 106 71 125 215 47 143 52 71 45 80 127 193 171 100 190 72 97 85 89 180 96 119 37
5420 37 150 75 83 150 99 40 206 152 95 80 121 210 75 49 154 205 183 27 138 153 207 47 67 175 142 22 188 161 176 94 124
5056 124 182 108 188 128 224 86 100 93 71 51 111 40 186 213 113 62 118 65 173 44 51 62 65 51 88 133 113 19 99 154 72 23 24 26 24
4646 24 113 146 165 184 72 139 120 109 101 52 91 129 227 197 173 125 81 84 164 60 134 44 102 84 117 186 35 108 34 73 147 42 120 99
4247 99 85 125 135 88 83 104 97 97 174 74 132 140 106 14 55 6 196 257 75 220 197 30 93 84 78 128 157 153 41 347 32 70 113 197 101
3836 101 125 152 93 77 138 217 222 163 84 139 64 104 250 65 144 154 104 69 67 166 250 179 178 286 106 322 112 132 100 42 167 253 100
3448 100 194 104 220 163 41 240 149 168 40 292 133 219 142 94 51 182 96 174 196 151 135 356 214 278 360 98 392 392 183
3108 183 151 243 101 611 469 346 304 247 458 455 224 660 437 691 567 1088 2131 8988 10231 4321 1083 765 1320 610
2826 610 4387 7012 1965 1849 1986 8739 14314 46353 39210 5649 2626 1885 2375 2975 6633 4716 435 494 530
2603 530 477 499 409 424 329 226 301 376 351 88 323 346 167 228 226 367 198 93 277 161 129 166 205 124 138 351 240 218 177 89
2251 89 196 187 68 239 109 216 139 274 194 101 59 229 118 271 105 131 131 989 1972 1037 363 341 171 95 157 110 204 325
1923 325 188 222 91 241 197 162 119 164 87 123 95 124 53 137 27 127 48 91 172 81 69 117 203 161 192 150 159 73 136 155 134 128 7
1535 7 169 270 389 386 224 136 117 51 57 47 9 81 99 97 285 39 103 54 86 87 27 245 125 127 193 175 113 5 88 135 42 36 32 117 116
1124 116 158 109 74 66 96 146 78 70 84 102 176 49 93 111 38 129 179 112 78 211 63 110 50 87 103 52 122 110 161 77 173 116 118 39 102
714 102 92 48 173 118 95 213 198 165 51 78 111 84 84 151 275 439 184 130 68 62 76 291 253 64 135 156 87 84 24 90 164 78 163
326 163 145 104 114 161 106 72 119 159 169 99 210 126 215 87 124 44 165 165 63 70 96 194 172 228 97 95 203 182 140 112 138 61 211
-61 211 265 98 167 207 216 13 78 184 192 139 149
-190A49
##PAGE=	F1=-2031.28
##FIRST=	25169.313707327481097,	5807.6787752999953227,	0
##DATA TABLE=	(F2++(Y..Y)), PROFILE
5808 128 251 136 45 119 193 235 123 171 131 11 139 62 130 230 46 115 80 68 46 93 136 181 156 104 164 54 87 112 115 215 99
5444 99 201 55 167 34 59 149 75 49 231 144 106 83 137 203 104 41 160 207 195 49 156 155 204 37 81 175 106 45 218 122 172
5080 172 21 119 142 129 187 127 242 141 101 85 88 80 85 93 158 213 134 68 89 75 160 18 53 107 77 62 104 167 184 101 130 159 74 45 35
4669 35 40 25 180 211 181 186 92 152 126 117 97 106 69 154 264 214 177 131 110 55 129 46 136 65 92 115 125 138 38 90 48 75 202 72 117
4258 117 113 98 114 129 121 70 176 145 69 193 68 115 136 132 54 73 66 136 250 86 183 186 26 120 88 121 144 174 162 34 379 70 85
3871 85 150 235 126 152 136 166 41 148 186 217 187 83 164 108 104 255 143 104 179 134 142 26 173 303 181 138 306 98 346 126
3519 126 175 138 73 180 294 146 224 84 266 216 25 252 210 267 38 352 141 272 131 152 112 246 125 220 243 198 159 432
3190 432 283 290 272 74 432 451 267 241 276 66 718 660 486 419 376 590 565 357 793 546 874 869 1406 3026 12055 13569
2885 13569 5607 1428 1028 1697 755 6161 9530 2613 2446 2607 11401 19878 63645 53152 7571 3528 2510 3246
2674 3246 4227 9256 6382 533 688 723 675 665 532 592 441 349 406 437 444 174 386 413 282 322 290 468 245 161 301 258 152
2357 152 256 310 166 188 373 192 260 232 177 215 266 60 263 215 288 70 321 231 128 145 271 69 310 133 243 123 803
2040 803 1503 657 376 358 132 86 198 123 210 341 190 215 119 245 230 131 104 97 76 185 108 147 108 118 31 196 64 130 184 56
1688 56 70 149 194 192 210 151 192 57 141 200 125 148 31 189 288 353 372 218 176 160 81 21 41 4 109 78 129 300 25 98 77 82 65
1300 65 64 242 105 176 189 132 112 44 107 146 87 41 60 76 59 181 107 72 84 78 148 67 95 101 120 199 77 115 122 25 126 167 133 97 187
890 187 93 97 32 82 116 59 131 78 146 109 189 104 148 21 145 106 51 163 105 140 234 161 178 62 98 153 86 96 172 290 419 173
514 173 145 78 99 112 285 280 66 111 165 65 85 83 49 164 119 238 127 171 128 152 116 116 92 144 209 96 242 127 230 46 138
150 138 48 181 161 70 100 124 207 167 247 92 110 217 187 152 104 122 74 221 238 97 147 243 215 34 102 155 192 150 144
-190A44
##PAGE=	F1=-2133.53
##FIRST=	25169.313707327481097,	5807.6787752999953227,	0
##DATA TABLE=	(F2++(Y..Y)), PROFILE
5808 160 236 102 70 149 191 228 118 184 112 45 179 62 136 220 40 71 84 91 48 108 139 161 133 140 133 44 69 147 133 223 87 262 79
5420 79 176 13 30 137 52 93 247 131 110 74 137 192 125 23 171 200 200 62 160 149 183 32 89 151 82 87 232 84 157 59 93
5056 93 111 161 176 122 246 175 92 66 108 103 54 125 132 202 150 100 70 78 147 33 85 145 91 72 111 189 239 183 193 157 83 59 57 49 58 242 271
4622 271 187 189 105 153 130 123 96 159 54 160 275 209 175 121 136 30 76 60 121 73 61 160 135 74 76 69 58 96 238 103 108 111 96 107 114
4211 114 137 58 235 174 59 206 58 85 131 130 92 92 120 80 227 105 169 161 65 125 95 156 153 176 169 30 380 101 96 175 262 155 169
3824 169 118 233 59 186 147 195 213 78 174 163 85 243 217 68 202 166 195 15 183 332 195 82 297 110 347 129 199
3507 199 175 120 173 323 175 251 63 297 237 56 244 257 340 49 386 143 301 132 191 169 285 162 241 274 212 178 462 335
3178 335 313 133 184 428 469 316 323 272 152 666 694 575 501 465 662 637 451 863 619 981 1086 1603 3711 14153 15743
2885 15743 6368 1643 1204 1923 853 7439 11222 3014 2821 2993 12956 23728 75371 62288 8779 4128 2900
2685 2900 3822 5138 11089 7486 588 816 857 806 764 612 705 528 438 485 459 490 241 421 443 360 394 345 541 273 209 312
2380 312 323 163 323 390 194 225 374 147 282 265 259 213 324 70 274 314 332 23 327 251 128 211 314 23 335 155 337
2063 337 188 888 1331 396 353 353 134 74 247 122 208 317 188 202 138 236 238 79 96 29 77 251 121 168 150 94 35 252 71
1723 71 179 183 37 56 180 179 208 219 129 210 62 133 235 95 155 52 219 308 313 315 203 195 184 137 31 50 6 130 61 144 281 17
1347 17 104 98 66 99 94 249 72 208 191 77 113 91 136 126 114 37 93 30 38 230 92 95 111 44 151 59 106 103 140 217 104 172 129 33
948 33 115 142 147 135 146 124 92 83 84 113 104 121 58 117 135 204 97 171 66 180 125 53 142 87 175 251 137 188 59 124 170 99 133 187 267
538 267 349 137 160 66 125 139 252 280 72 84 163 50 108 135 4 160 147 288 108 215 129 137 107 182 61 115 247 84 247
197 247 126 234 44 149 86 169 148 71 123 129 209 143 272 90 103 226 188 158 91 96 78 227 196 88 108 262 207 72 145 103 166
-167 166 152 125
-190A25
##PAGE=	F1=-2235.79
##FIRST=	25169.313707327481097,	5807.6787752999953227,	0
##DATA TABLE=	(F2++(Y..Y)), PROFILE
5808 178 199 70 89 159 176 210 112 184 106 65 212 65 136 185 29 19 62 123 44 117 139 137 105 174 102 40 70 178 140 201 59 286
5432 286 92 173 51 36 119 35 132 248 118 103 46 123 181 129 2 180 184 195 68 152 136 153 33 99 101 105 122 223 52 131 122 53
5056 53 93 195 163 114 239 182 72 51 116 115 28 132 115 180 161 134 76 72 132 67 114 170 106 78 111 195 271 243 252 152 94 54 71 46
4657 46 79 285 313 183 190 101 138 132 121 105 197 56 145 254 182 167 96 155 34 67 103 100 70 21 210 143 25 104 53 53 115 248 133
4270 133 109 99 74 100 95 133 56 270 181 55 198 41 46 122 95 118 116 148 51 191 127 177 134 98 109 104 176 154 166 176 35 348 119
3883 119 99 186 281 188 175 111 278 94 225 106 155 229 69 172 211 52 219 270 52 214 193 213 43 191 329 208 31
3566 31 263 124 327 121 196 203 153 144 334 185 261 45 306 226 67 216 286 376 56 392 137 298 141 194 212 287 196 235 280
3225 280 192 185 442 359 333 64 300 377 437 322 373 235 357 500 559 593 526 491 644 650 483 852 633 981 1170 1621 4000 14735
2897 14735 16216 6432 1670 1244 1938 885 7903 11660 3062 2873 3036 13010 24864 78435 64196 8945 4266
2697 4266 2953 3964 5484 11693 7755 576 846 899 833 776 625 734 560 466 517 431 473 269 418 424 380 431 369 561 274
2404 274 225 303 341 155 352 425 197 229 354 131 278 264 317 185 352 75 264 377 337 73 291 239 112 236 338 35
2099 35 336 172 380 271 1310 2112 912 366 340 180 106 283 116 193 267 179 192 139 215 222 30 125 28 106 307 131 186 171
1770 171 79 59 288 69 223 169 26 35 188 158 198 211 85 209 91 104 250 55 153 59 250 329 269 325 223 195 188 198 79
1430 79 63 19 143 40 136 227 11 110 115 36 163 119 267 84 217 201 21 114 131 159 97 118 21 124 78 116 284 67 134 121
1077 121 6 149 54 104 93 165 229 120 223 128 48 99 111 146 169 96 147 91 117 88 100 145 99 50 84 149 213 91 170 86 203 137
702 137 64 112 67 196 267 135 198 55 148 153 119 174 196 200 225 65 166 35 133 148 198 256 79 61 155 53 129 162 40 150 154 302
326 302 96 230 113 114 74 231 39 96 277 65 230 124 225 61 156 130 131 127 64 128 111 200 108 300 95 81 231 189 159 78
-26 78 63 75 225 152 74 60 260 190 113 192 39 123 149 97
-190I7
##PAGE=	F1=-2338.05
##FIRST=	25169.313707327481097,	5807.6787752999953227,	0
##DATA TABLE=	(F2++(Y..Y)), PROFILE
5808 180 144 43 93 147 150 187 109 169 109 69 232 73 125 132 15 45 51 155 38 112 133 115 74 188 75 44 98 195 135 158 21 269
5432 269 92 154 74 76 112 51 154 228 113 84 5 103 175 114 23 182 160 176 68 135 117 123 44 112 29 146 144 193 31 95 163 20
5056 20 89 219 156 108 231 167 45 51 100 117 19 117 108 151 163 153 95 59 114 98 133 178 119 80 110 182 281 276 285 143 100 27 69 31 95
4646 95 302 332 176 182 86 109 131 113 119 211 63 112 205 141 153 61 167 54 136 153 91 78 40 251 144 63 121 53 30 123 232 162
4270 162 122 94 41 87 74 113 63 276 174 51 162 20 30 105 33 127 137 147 41 145 147 185 118 119 81 113 177 150 152 181 45 288
3894 288 120 93 188 290 221 173 127 293 122 238 69 99 234 68 163 239 11 188 292 55 211 208 194 67 190 294 203
3578 203 42 214 126 290 107 166 219 164 95 326 176 246 31 291 191 68 175 296 372 63 373 122 262 150 161 233
3272 233 256 216 205 259 145 173 382 352 325 153 373 290 359 288 382 184 650 583 338 542 497 450 539 598 448 752 582 873 1107
2932 1107 1448 3801 13595 14829 5782 1500 1134 1736 837 7426 10724 2741 2586 2718 11560 23010 72031 58366
2721 58366 8024 3904 2655 3643 5180 10927 7123 493 771 838 749 700 568 672 524 427 492 359 396 256 377 358
2462 358 338 426 349 519 245 206 272 313 127 335 406 175 194 317 135 245 228 338 134 348 63 228 388 301 98 221 190
2146 190 90 213 330 53 299 178 350 290 1495 2491 1149 363 320 204 152 291 113 165 207 163 187 121 184 192 66 170
1840 170 77 148 340 141 195 173 84 98 298 66 247 149 24 41 159 133 165 189 35 185 119 56 241 8 146 46 268 337
1512 337 238 421 276 181 175 246 130 81 43 149 18 107 148 41 115 123 15 224 143 285 152 201 220 39 112 156 169 116 100 8
1160 8 149 146 186 318 47 179 117 51 135 53 93 76 193 232 122 248 116 52 87 80 131 188 51 154 91 124 87 84 165 81 44 62
784 62 150 210 84 140 77 209 132 80 76 46 202 279 154 207 63 162 102 151 205 200 107 83 48 165 11 121 138 134 216 85 48 145 68
397 68 135 161 76 132 137 279 97 216 90 82 37 248 32 118 298 45 200 126 206 58 160 165 75 100 51 109 85 183 80 324 109
33 109 53 231 194 160 77 36 80 219 117 64 14 232 161 149 228 29 78 144 67
-190F7
##PAGE=	F1=-2440.31
##FIRST=	25169.313707327481097,	5807.6787752999953227,	0
##DATA TABLE=	(F2++(Y..Y)), PROFILE
5808 169 78 26 83 120 116 165 109 141 113 60 239 94 101 83 7 93 94 185 62 90 118 98 42 177 55 56 125 189 119 110 25 214 81 119
5409 119 79 116 127 88 157 191 111 57 59 82 175 82 36 176 132 141 69 114 97 102 62 126 58 173 153 149 28 52 174 30 97 222 154 106
5010 106 225 141 18 57 57 121 29 89 99 116 157 150 104 42 93 118 146 169 125 82 110 153 272 278 282 129 96 22 47 12 115 295 326 176
4610 176 156 72 71 129 100 127 197 63 69 141 107 137 28 170 70 209 194 102 112 78 271 134 95 134 73 13 121 199 185 133 106 39
4235 39 67 56 88 66 255 165 47 103 34 59 83 54 121 142 119 19 96 163 181 116 127 56 117 157 142 139 173 57 209 101 79 184
3859 184 287 245 165 154 278 140 217 41 51 231 91 155 237 30 152 276 58 192 205 153 85 175 237 170 71 163 111 241 94
3519 94 120 217 156 33 300 154 203 18 261 151 87 133 291 336 83 334 103 201 151 103 228 208 215 160 218 85 139 301 314
3178 314 281 202 383 184 249 225 350 156 860 773 185 444 431 355 384 491 365 572 479 680 920 1127 3159 10971 11885 4566
2873 4566 1173 901 1368 708 6119 8639 2132 2032 2118 8985 18690 57893 46358 6261 3136 2085 2950 4307
2662 4307 8993 5752 360 613 692 576 560 453 538 426 334 414 259 275 205 309 259 254 385 287 422 189 159 224 253 88 276
2345 276 335 134 130 270 135 190 168 320 72 321 37 172 346 237 86 138 114 71 156 287 56 223 169 256 226 1256 2030
2028 2030 921 273 280 190 176 259 116 141 151 144 183 86 147 157 116 203 121 183 340 152 191 161 103 137 285 79 240 132 32 78
1676 78 92 102 131 161 43 140 132 8 212 43 139 12 268 319 249 496 313 158 144 273 173 98 72 149 20 64 66 85 120 116 57
1312 57 266 161 292 228 172 239 79 105 163 161 177 65 41 165 195 228 317 61 216 104 90 102 56 74 55 222 225 108 237 95
960 95 43 88 56 102 188 37 137 86 101 79 70 155 83 33 69 141 189 74 89 48 198 110 93 40 26 198 285 184 212 77 159 54
584 54 188 218 200 26 130 154 161 46 93 110 87 171 88 38 132 82 125 138 95 104 106 229 102 179 91 44 58 228 22 169 309 31
209 31 171 130 179 32 166 185 48 69 39 64 94 163 74 333 127 28 225 207 164 96 39 104 215 102 73 37 182 122 174 242 74
-155 74 57 136 41
-190D1
##PAGE=	F1=-2542.56
##FIRST=	25169.313707327481097,	5807.6787752999953227,	0
##DATA TABLE=	(F2++(Y..Y)), PROFILE
5808 150 20 23 65 86 87 146 110 112 112 44 233 123 73 77 13 121 145 210 117 63 94 92 39 142 43 71 136 157 91 79 73 134 64 72 76 147 157
5373 157 124 143 143 106 32 116 64 177 42 34 161 109 95 78 93 81 94 77 137 139 174 148 103 37 15 157 42 110 200 152 108 216 117
4986 117 21 59 7 140 58 67 84 83 141 128 94 24 70 123 155 145 124 85 113 115 248 257 242 109 80 76 9 35 142 271 300 184 112 68
4587 68 33 135 86 123 158 62 48 83 102 118 26 165 80 262 219 125 160 99 262 109 99 148 99 59 116 160 197 130 125 76 43 44 70 59
4188 59 213 160 42 38 67 84 73 139 108 123 79 21 61 170 168 117 121 48 112 120 131 127 145 65 127 69 62 173 268 256 156 179 243 147 168 30
3765 30 74 223 135 159 207 59 111 227 54 159 182 109 93 148 174 116 84 115 88 186 85 82 198 133 29 261 124 142 6 226
3413 226 124 122 107 276 286 118 281 88 130 138 43 199 173 190 112 173 33 100 228 256 212 197 336 81 133 151 286 179 873
3073 873 751 218 331 355 231 234 352 261 345 351 447 660 739 2237 7485 8067 3056 768 608 928 514 4293 5909 1385
2791 1385 1349 1382 5917 13021 39645 31225 4106 2153 1390 2062 3089 6370 3976 208 419 501 364 394 310 368 287
2545 287 218 304 158 140 134 231 149 172 322 198 294 119 100 168 179 49 192 232 86 59 218 120 128 111 271 59 284 19 102 265
2193 265 164 47 79 50 60 98 226 58 124 151 130 110 727 999 402 106 211 157 170 193 127 142 107 122 179 42 112 127 146 207
1840 207 159 201 306 163 175 144 121 168 251 119 200 123 48 120 34 69 131 136 87 79 124 59 168 99 129 35 246 270 332 536 308 133
1465 133 100 276 201 106 100 141 41 22 63 129 121 94 93 280 163 282 292 150 249 101 90 152 138 232 36 79 172 214 233 279 99 234
1089 234 90 111 60 63 51 44 248 210 81 190 68 33 104 41 65 171 54 95 83 54 64 64 119 100 31 91 125 151 64 57 51 176 78
702 78 96 17 15 185 280 212 207 85 137 111 218 209 195 74 252 246 159 71 57 75 93 133 86 20 118 87 103 109 94 64 81 173 102 131 128 36
279 36 101 175 18 221 311 30 149 131 148 35 173 186 97 40 40 2 140 144 81 322 143 25 213 225 170 124 60 140 217 99 102
-85 102 74 121 82 183 231 92 66 120 21
-190B1
##PAGE=	F1=-2644.82
##FIRST=	25169.313707327481097,	5807.6787752999953227,	0
##DATA TABLE=	(F2++(Y..Y)), PROFILE
5808 129 50 28 54 57 79 128 107 96 111 27 214 142 56 108 32 120 171 228 178 49 65 100 76 94 37 82 124 101 57 78 119 62 48 49 82
5397 82 167 187 147 121 95 89 23 157 54 176 4 15 144 98 67 98 75 76 102 81 141 202 151 136 69 43 37 119 39 117 152 152 109 197 102
4986 102 37 65 79 174 99 71 64 57 120 98 65 12 47 114 158 111 115 86 114 82 216 221 176 80 56 128 40 70 169 240 262 194 56 77 15 151
4564 151 70 109 107 78 80 62 113 96 38 153 84 284 221 148 207 101 225 66 82 158 122 103 114 125 197 112 139 109 19 40 60 51 158
4176 158 156 42 45 94 93 95 215 105 81 53 69 54 165 151 110 100 45 98 72 118 118 96 63 60 60 51 154 231 250 148 188 203 147 106 41 127
3754 127 204 186 181 154 75 64 150 45 115 141 81 88 111 126 65 87 71 65 134 83 79 166 102 79 211 96 83 8 193 108 145 104 254 246 150
3343 150 219 92 89 111 38 157 169 147 73 139 20 104 184 187 134 155 257 3 59 83 205 225 698 596 313 230 290 107 131 208 165
2979 165 122 229 227 395 386 1267 3945 4225 1571 375 333 514 289 2362 3150 672 692 679 3029 7330 21549 16464 2062
2709 2062 1179 728 1183 1814 3660 2196 75 244 312 185 237 175 209 135 111 186 82 22 58 159 52 147 253 102 167 68
2404 68 44 112 116 32 102 129 43 16 159 99 79 93 205 111 250 27 32 169 99 8 93 74 57 90 167 59 61 135 26 14 223 103
2028 103 155 90 126 139 142 111 132 168 80 101 175 13 84 109 151 174 187 200 244 171 155 128 125 182 205 171 132 117 64 158 110 34 166 119 121
1617 121 27 96 95 114 153 117 88 214 205 469 632 266 113 58 262 208 100 120 126 57 36 116 159 110 60 112 264 142 253 331 158
1254 158 244 107 69 128 110 256 59 115 168 199 203 212 138 229 77 108 59 78 24 52 267 186 45 118 48 46 125 33 29 144 68 41 95
866 95 18 43 71 65 115 50 109 108 104 57 98 102 154 62 93 24 31 161 261 227 190 83 105 193 232 180 185 118 329 305 160 81 49 68 124 106
444 106 77 9 104 80 75 96 73 15 90 131 89 82 171 77 125 105 65 259 306 47 133 124 118 90 184 168 149 46 53 67 182 131 83 288 156
33 156 36 197 242 177 149 75 172 220 98 136 107 77 61 173 195 79 81 97 12
-190A2
##PAGE=	F1=-2747.08
$$ [...]
-190F0
##END NTUPLES=	nD NMR SPECTRUM
##END=	
##END=	
