##TITLE=	XgyeD2VdSwuszc9WfmXLjQ.32.ser
TM-VI-084mfr hmqc

##JCAMP-DX=	6.0	$$ MestReNova 14.3.1-31739
##DATA TYPE=	LINK
##BLOCK_ID=	1
##BLOCKS=	2    
##ORIGIN=	Mestrelab Research S.L.
##OWNER=	hrzepa
##$MNOVA/LINK_BLOCK_TYPE=	ITEM	$$ NMR Spectrum
##$MNOVA/ITEM/POLYGON=	(XY..XY)
5321,5835
8722,5835
8722,8208
5321,8208
5321,5835
##$MNOVA/ITEM/Z=	0
##$MNOVA/ITEM/ANGLE=	0
##TITLE=	XgyeD2VdSwuszc9WfmXLjQ.32.ser
##JCAMP-DX=	6.0	$$ MestReNova 14.3.1-31739
##BLOCK_ID=	2
##DATA TYPE=	MNOVA NMR VIEW DATA
##DATA CLASS=	MNOVA VIEW DATA
##$MNOVA/2D/THRESHOLD=	38.520534515380859375
##$MNOVA/ITEM/ZOOM/X=	-0.98001264966690615488,	11.003459999979801509
##$MNOVA/ITEM/ZOOM/Y=	-9.7479769829748601495,	190.10579999390242278
##END=	
##TITLE=	XgyeD2VdSwuszc9WfmXLjQ.32.ser
##JCAMP-DX=	6.0	$$ MestReNova 14.3.1-31739
##BLOCK_ID=	3
##DATA TYPE=	nD NMR SPECTRUM
##DATA CLASS=	NTUPLES
##NUMDIM=	2
##ORIGIN=	Bruker BioSpin GmbH
##OWNER=	nmr
##.OBSERVE FREQUENCY=	400.41200205000001233
##.OBSERVE NUCLEUS=	^1H
##.SOLVENT NAME=	CDCl3
##.PULSE SEQUENCE=	hmqcgpqf
##LONGDATE=	2021/09/06 16:50:17.000
##.ACQUISITIONMODE=	SIMULTANEOUS (DQD)
##$ORIGINAL FORMAT=	Bruker XWIN-NMR
##$MNOVA/SCALES_VERSION=	9
##$PARAMETER FILE=	(acqu2s, ASCII, /private/var/folders/f6/rjf_tdyn2v98c5c0wvkgn4s80000gn/T/XgyeD2VdSwuszc9WfmXLjQ/32/acqu2s, 0)
$$ ##TITLE= Parameter file, TOPSPIN		Version 3.2
$$ ##JCAMPDX= 5.0
$$ ##DATATYPE= Parameter Values
$$ ##NPOINTS= 129	$$ modification sequence number
$$ ##ORIGIN= Bruker BioSpin GmbH
$$ ##OWNER= nmr
$$ $$ 2021-09-06 16:59:47.253 +0100  nmr@CZC10666PP
$$ $$ /opt/topspin/data/agmb/nmr/Sep06-2021/32/acqu2s
$$ $$ process /opt/topspin3.2/prog/mod/go
$$ ##$ACQT0= 0
$$ ##$BF1= 100.683175
$$ ##$FnMODE= 1
$$ ##$NUC1= <13C>
$$ ##$NusJSP= 0
$$ ##$NusT2= 1
$$ ##$NusTD= 128
$$ ##$O1= 9059.81359838393
$$ ##$SFO1= 100.692234813598
$$ ##$SW= 200.226863172749
$$ ##$SW_h= 20161.2903225806
$$ ##$TD= 128
$$ ##END=
$$ 
##$PARAMETER FILE=	(acqus, ASCII, /private/var/folders/f6/rjf_tdyn2v98c5c0wvkgn4s80000gn/T/XgyeD2VdSwuszc9WfmXLjQ/32/acqus, 0)
$$ ##TITLE= Parameter file, TOPSPIN		Version 3.2
$$ ##JCAMPDX= 5.0
$$ ##DATATYPE= Parameter Values
$$ ##NPOINTS= 12	$$ modification sequence number
$$ ##ORIGIN= Bruker BioSpin GmbH
$$ ##OWNER= nmr
$$ $$ 2021-09-06 16:59:50.602 +0100  nmr@CZC10666PP
$$ $$ /opt/topspin/data/agmb/nmr/Sep06-2021/32/acqus
$$ $$ process /opt/topspin3.2/prog/mod/shimcntl
$$ ##$ACQT0= 1000000
$$ ##$AMP= (0..31)
$$ 100 100 100 100 100 100 100 100 100 100 100 100 100 100 100 100 100 100
$$ 100 100 100 100 100 100 100 100 100 100 100 100 100 100
$$ ##$AMPCOIL= (0..19)
$$ 0 0 0 0 0 0 0 0 0 0 0 0 0 0 0 0 0 0 0 0
$$ ##$ANAVPT= -1
$$ ##$AQSEQ= 0
$$ ##$AQ_mod= 3
$$ ##$AUNM= <au_zg>
$$ ##$AUTOPOS= <53 >
$$ ##$BF1= 400.41
$$ ##$BF2= 100.683175
$$ ##$BF3= 400.41
$$ ##$BF4= 400.41
$$ ##$BF5= 400.41
$$ ##$BF6= 400.41
$$ ##$BF7= 400.41
$$ ##$BF8= 400.41
$$ ##$BYTORDA= 0
$$ ##$CAGPARS= (0..11)
$$ 0 0 0 0 0 0 0 0 0 0 0 0
$$ ##$CFDGTYP= 0
$$ ##$CFRGTYP= 9
$$ ##$CHEMSTR= <none>
$$ [...]
$$ 0 0 0 0
$$ ##$ShimPowMaxUC= (0..63)
$$ 130000 130000 130000 130000 130000 130000 130000 130000 130000 130000 130000
$$ 130000 130000 130000 130000 130000 130000 130000 130000 130000 0 0 0 0
$$ 0 0 0 0 0 0 0 0 0 0 0 0 0 0 0 0 0 0 0 0 0 0 0 0 0 0 0 0 0 0 0 0 0 0 0 0
$$ 0 0 0 0
$$ ##$ShimPowMaxUG= (0..63)
$$ 524287 524287 524287 524287 524287 524287 524287 524287 524287 524287 524287
$$ 524287 524287 524287 524287 524287 524287 524287 524287 524287 0 0 0 0
$$ 0 0 0 0 0 0 0 0 0 0 0 0 0 0 0 0 0 0 0 0 0 0 0 0 0 0 0 0 0 0 0 0 0 0 0 0
$$ 0 0 0 0
$$ ##$ShimPowRcbType= 3
$$ ##$ShimPowRes= (0..63)
$$ 1e-20 1e-20 1e-20 1e-20 1e-20 1e-20 1e-20 1e-20 1e-20 1e-20 1e-20 1e-20
$$ 1e-20 1e-20 1e-20 1e-20 1e-20 1e-20 1e-20 1e-20 0 0 0 0 0 0 0 0 0 0 0 0
$$ 0 0 0 0 0 0 0 0 0 0 0 0 0 0 0 0 0 0 0 0 0 0 0 0 0 0 0 0 0 0 0 0
$$ ##$ShimPowRng0= (0..63)
$$ 1 1 1 1 1 1 1 1 1 1 1 1 1 1 1 1 1 1 1 1 0 0 0 0 0 0 0 0 0 0 0 0 0 0 0 0
$$ 0 0 0 0 0 0 0 0 0 0 0 0 0 0 0 0 0 0 0 0 0 0 0 0 0 0 0 0
$$ ##$ShimPowRng1= (0..63)
$$ 1 1 1 1 1 1 1 1 1 1 1 1 1 1 1 1 1 1 1 1 0 0 0 0 0 0 0 0 0 0 0 0 0 0 0 0
$$ 0 0 0 0 0 0 0 0 0 0 0 0 0 0 0 0 0 0 0 0 0 0 0 0 0 0 0 0
$$ ##$ShimPowRng2= (0..63)
$$ 1 1 1 1 1 1 1 1 1 1 1 1 1 1 1 1 1 1 1 1 0 0 0 0 0 0 0 0 0 0 0 0 0 0 0 0
$$ 0 0 0 0 0 0 0 0 0 0 0 0 0 0 0 0 0 0 0 0 0 0 0 0 0 0 0 0
$$ ##$ShimPowRng3= (0..63)
$$ 1 1 1 1 1 1 1 1 1 1 1 1 1 1 1 1 1 1 1 1 0 0 0 0 0 0 0 0 0 0 0 0 0 0 0 0
$$ 0 0 0 0 0 0 0 0 0 0 0 0 0 0 0 0 0 0 0 0 0 0 0 0 0 0 0 0
$$ ##$ShimSysFunc= (0..63)
$$ 1 2 3 4 5 7 9 11 15 16 8 10 12 14 6 17 13 18 19 20 0 0 0 0 0 0 0 0 0 0
$$ 0 0 0 0 0 0 0 0 0 0 0 0 0 0 0 0 0 0 0 0 0 0 0 0 0 0 0 0 0 0 0 0 0 0
$$ ##$ShimSysMatrix= 0
$$ ##$ShimSysType= 1
$$ ##$TFXNUM= 0
$$ ##$TRIPLO2= 0
$$ ##$VTU= 2
$$ ##$VTUETH= <149.236.99.20>
$$ ##$VTUTY= <no>
$$ ##$WBREFAM= (0..15)
$$ 135 116 100 100 100 100 100 100 100 100 100 100 100 100 100 100
$$ ##$WBREFLM= (0..15)
$$ 0 0 0 0 0 0 0 0 0 0 0 0 0 0 0 0
$$ ##$WBREFPH= (0..15)
$$ 71.66 -68.25 0 0 0 0 0 0 0 0 0 0 0 0 0 0
$$ ##$WBSGU= (0..15)
$$ 0 0 0 0 0 0 0 0 0 0 0 0 0 0 0 0
$$ ##$XFAC= 2
$$ ##END=
$$ 
##$DECIM=	4160
##$DSPFVS=	20
##.ACQUISITIONSCHEME=	NOT PHASESENSITIVE
##NTUPLES=	nD NMR SPECTRUM
##VAR_NAME=	FREQUENCY1,	FREQUENCY2,	SPECTRUM
##SYMBOL=	F1,	F2,	Y
##.NUCLEUS=	13C,	1H
##.OBSERVE FREQUENCY=	100.69223481359800587,	400.41200205000001233
##VAR_TYPE=	INDEPENDENT,	INDEPENDENT,	DEPENDENT
##VAR_FORM=	AFFN,	AFFN,	ASDF
##VAR_DIM=	512,	512,	262144
##UNITS=	HZ,	HZ,	ARBITRARY UNITS
##FIRST=	19140.455529915001534,	4405.895418600002813,	0.23660117387771606445
##LAST=	-981.45727250430979893,	-392.40686505384644533,	0.18176899850368499756
##MIN=	-981.45727250430979893,	-392.40686505384644533,	0.00063546816818416118622
##MAX=	19140.455529915001534,	4405.895418600002813,	1942.0299072265625
##FACTOR=	1,	1,	0.007834354908090987793
##PAGE=	F1=19140.5
##FIRST=	19140.455529915001534,	4405.895418600002813,	0.23660117387771606445
##DATA TABLE=	(F2++(Y..Y)), PROFILE
$$ [...]
##PAGE=	F1=-6454.93
##FIRST=	19140.455529915001534,	4405.895418600002813,	0
##DATA TABLE=	(F2++(Y..Y)), PROFILE
$$ plain form
1185 459 396 271 411 385 401 397 390 346 237 262 270 371 317 290 303 307 313 299 309 279 242 286 229 243 233 274 233 310 270 243 289 226 236 202 245
856 245 222 196 216 191 198 199 221 259 231 190 178 192 169 230 206 167 221 201 136 152 202 230 147 168 204 172 201 209 324 343 241 388 540 1017
537 1017 1812 1954 1431 743 525 396 344 273 232 213 217 278 262 180 228 192 193 201 153 217 197 199 154 194 148 182 187 196 109 152 172 163 117 169 190
209 190 122 75 140 146 136 101 119 153 94 187 69 203 195 145 143 157 138 172 178 151 114 95 124 146 140 149 177 150 128 131 103 78 135 174 191 81 121
-139 121 148 46 122 138 122 113 121 94 88 111 113 95 80 54 68 95 82 118 67 67 116 128 197 88 123 55 11
$$ packed form
1185D59o3j25J40k6J6mpm4j09K5QJ01n4k7J3MOj4J0l0l7M4n7J4j0M1m1P7m0k7M6o3J0l4M3
856B45k3k6K0k5PJK2L8k8m1j2J4k3O1k4l9N4k0o5J6N0K8q3K1L6l2K9QJ15J9j02J47J52M77
537A017P95J42n23o88k18j29n2p1m1j9MO1j6q2M8l6JQm8O4k0Km5M0m6L4NRq7M3K0rm6N2K1
209A90o8m7O5Oj0l5J8L4n9R3j18J34qn0kJ4j9L4Ok7l7j9K9K2oRK8k7k2Lk8k5N7L9J7j10M0
-139A21K7j02P6J6j6rQk7oK3Kj8j5k6J4K7j3L6n1%M9J2O9j09L5o8m4
-392A1
##PAGE=	F1=-6533.69
##FIRST=	19140.455529915001534,	4405.895418600002813,	0
##DATA TABLE=	(F2++(Y..Y)), PROFILE
$$ plain form
4406 27 25 20 7 92 164 57 82 48 155 100 114 81 76 51 114 124 85 121 48 83 92 78 163 48 81 108 114 166 86 145 43 44 105 107 75 147 53
4058 53 70 134 45 91 95 59 107 122 86 117 74 175 86 106 89 128 30 97 149 117 85 154 159 118 146 96 149 140 92 176 174 104 122 38 177 139
3720 139 124 131 78 173 168 178 270 196 70 114 122 130 92 124 130 95 170 128 81 183 141 203 237 280 293 189 41 31 49 42 42 94 147 95 184 207
3382 207 173 104 171 151 184 164 180 226 389 426 342 183 50 97 14 110 53 38 131 226 296 208 88 145 104 124 95 51 117 379 645 696
3082 696 515 286 358 312 252 187 249 208 204 385 462 415 345 290 323 372 391 286 591 770 749 381 234 245 201 153 217 198 156 228 394
2791 394 371 378 452 540 588 814 800 658 346 184 133 147 96 136 141 182 136 156 181 259 303 250 135 247 134 251 185 180 95 147 223 208
2490 208 196 211 188 243 222 186 247 214 248 244 266 270 302 231 188 201 294 262 194 318 405 361 313 321 361 278 293 318 383 317 269 306 330 282 292 312
2152 312 257 298 322 402 407 291 174 36 85 281 670 2008 6086 6038 3253 2724 749 1032 1137 1135 1234 1133 1193 1227 1281 1269 1119
$$ packed form
4406B7knj3Q5P2j07K5l4J07n5J4l3nk5O3J0l9L6p3L5Rj4Q5j15L3K7ON2q0N9j02JO1Kl2P2r4
4058E3J7O4q9M6Ml6M8J5l6L1m3J01q9K0j7L9r8O7N2l2l2O9Nm1K8n0N3rm8Q4kp0J8q4J39l8
3720A39j5Pn3R5nJ0R2p4j26M4QQl8L2Ol5P5m2m7J02m2O2L4M3J3j04j48j0J8p%N2N3n2Q9K3
3382B07l4o9O7k0L3k0J6M6J63L7q4j59j33M7q3R6n7j5R3R5P0q8j20N7m1K0k9m4O6K62K66N1
3082F96j81k29P2m6o0o5O2m1mJ81P7m7p0n5L3M9J9j05L05J79k1l68j47J1m4m8O4j9m2P2J66
2791C94k3PP4Q8M8K26j4j42l12j62n1J4n1M0NM1m6K0K5P8M4n3j15J12j13J17o6nq5N2P6j5
2490B08j2J5k3N5k1l6O1l3L4mK2ML2p1m3J3R3l2o8J24Q7m4m8QM0q3J5K5O5o6m8L7K4m8J0K0
2152C12n5M1K4Q0Nj16j17j38M9J96L89J338M078m8k785n29j975K83J05kR9j01O0L4N4j2j50
$$ plain form
1899 1119 1282 1385 1382 1467 1553 1649 1745 1913 2066 2266 2385 2604 3019 3534 4154 5142 6817 10860 18245 23111 20725 13740 8679
1683 8679 6335 5324 4664 3716 3042 2383 2028 1926 1800 1636 1285 2315 2344 2223 2262 2722 3537 5533 9107 18054 19299
1486 19299 6963 3951 2884 2277 1969 1665 1444 1297 1197 1151 1081 968 974 861 806 818 730 766 655 716 686 608 635 609 616 606 471
1232 471 508 489 521 584 531 488 334 427 463 444 449 462 434 300 307 309 410 382 322 342 344 350 330 370 332 317 327 282 266 291 311 274 328 342 282 330
894 330 290 280 235 280 268 222 252 221 228 216 244 276 252 222 204 235 198 248 247 206 248 236 184 179 210 257 182 196 240 218 246 227 320 386 227 395
556 395 568 1015 1836 2038 1495 792 562 435 384 303 251 245 234 294 285 225 250 213 209 225 179 231 230 222 179 192 166 201 184 229 144 175 200 206
237 206 127 191 228 146 105 139 182 142 133 123 177 101 196 82 174 200 184 169 160 147 171 177 179 144 99 109 157 143 162 182 172 132 150 139 92 130 174
-111 174 212 104 129 168 68 134 166 142 128 146 137 130 130 136 124 119 76 80 101 80 129 104 61 129 125 226 126 130 76 20
$$ packed form
1899A119J63J03lQ5Q6R6R6J68J53K00J19K19M15N15O20R88J675M043P385M866k386o985n061
1683H679k344j011o60r48o74o59l55j02j26j64l51J030K9j21L9M60Q15J996L574Q947J245
1486A9299j2336l012j067o07l08l04k21j47j00m6p0j13Oj13n5J2q8L6j11O1l0p8K7k6Pj0j35
1232D71L7j9L2O3n3m3j54R3L6j9NJ3k8j34PKJ01k8o0K0KOk0M0l8j5J0m5j6K5K0l7N4J4o0M8
894C30m0j0m5M5j2m6L0l1Pj2K8L2k4l0j8L1l7N0jm1M2j2n2nL1M7p5J4M4k2K8j9R3O6j59J68
556C95J73M47Q21K02n43p03k30j27n1q1n2oj1O0ro0K5l7mJ6m6N2jqm3J3k6L5j7M5q5L1K5O
237B06p9O4L7q2m1L4M3m0rj0N4p6R5j14R2K6j6j5rj3K4OKl5m5J0M8j4J9K0j0m0J8j1m7L8M4
-111A74L8j08K5L9j00O6L2k4j4J8rp%Oj2nm3MK1k1M9k5m3O8mJ01j00Mn4n6
-392B0
##PAGE=	F1=-6612.44
##FIRST=	19140.455529915001534,	4405.895418600002813,	0
##DATA TABLE=	(F2++(Y..Y)), PROFILE
$$ plain form
4406 17 9 20 25 73 166 77 96 60 144 109 140 100 108 60 109 146 122 136 79 97 93 99 194 83 110 128 135 187 112 184 36 61 105 128 104 176 86
4058 86 86 156 67 133 123 83 127 134 112 157 80 209 128 123 125 146 79 120 141 152 106 162 181 160 167 144 178 183 125 212 210 157 157 84 174 178 165 154 103
3692 103 186 186 205 311 243 97 153 170 169 125 170 181 129 206 170 118 204 162 218 269 317 336 202 14 80 105 94 36 90 189 133 213 251 245
3373 245 164 204 199 236 229 228 265 449 460 339 119 65 68 45 64 73 55 55 161 269 235 114 168 163 190 94 15 71 314 568 656 510 234
3063 234 385 349 284 236 254 243 169 374 468 427 360 311 347 384 372 296 576 648 517 227 219 280 291 230 262 271 207 203 396 410 422 494 573
2753 573 597 748 691 691 516 330 93 118 131 120 170 253 206 182 211 281 344 350 207 320 225 333 294 274 184 206 268 271 254 300 283 333 303
2443 303 290 305 308 308 311 357 341 398 345 321 279 373 370 299 341 466 458 420 426 468 405 405 424 493 451 384 385 466 395 417 444 403 419 436 517 554 446 335
2087 335 148 145 106 509 1910 6288 6375 3546 3002 885 1271 1407 1377 1506 1426 1511 1553 1648 1631 1461 1605 1756 1795 1903 2025 2143
$$ packed form
4406A7qJ1NM8R3q9J9l6Q4l5L1m0Qm8M9L7k4J4n7J8mOR5j11K7J8PN2p5P2j48K5M4K3k4P2r0
4058H6%P0q9O6j0m0M4Pk2M5p7J29q1nKK1o7M1K1J1m6N6J9k1Pk3L4Nn8Q7kn3%p3R0Mj3j1n1
3692A03Q3%J9J06o8j46N6J7jm4M5J1n2P7l6n2Q6m2N6N1M8J9j34j88O6K5j1n8N4R9n6Q0L8o
3373B45q1M0nL7pjL7J84J1j21k20n4Lk3J9Rj8%J06J08l4j21N4nK7r6p9N6K43K54Q8j46k76
3063B34J51l6o5m8J8j1p4K05R4m1o7m9L6L7j2p6K80P2j31k90qO1J1o1L2Ro4mJ93J4J2P2P9
2753E73K4J51n7%j75j86k37K5J3j1N0Q3m7k4K9P0O3Oj43J13r5J08l9k0r0K2O2Lj7M6j7N0l0
2443C03j3J5L%LM6j6N7n3k4m2R4lp1M2J25ql8OM2o3%J9O9m2o7JQ1p1K2K7m1J6J7Q1L7j08j11
2087C35j87ll9M03J401M378Q7k829n44k117L86J36l0J29q0Q5M2R5j7j70J44J51L9J08J22J18
$$ plain form
1842 2143 2279 2462 2678 2966 3159 3462 3966 4632 5503 6783 9031 14247 23713 30160 27310 18230 11499 8320 6857 5897
1655 5897 4759 3911 3219 2741 2538 2339 2138 1655 2641 2743 2581 2569 2938 3775 5861 9842 19017 20516 7487 4330 3151
1457 3151 2549 2185 1879 1667 1478 1408 1328 1268 1150 1160 1056 971 966 908 916 813 875 854 723 763 739 719 743 596 627 594 630 705 648 631
1176 631 465 506 574 549 545 576 560 416 420 397 501 494 409 438 425 432 399 460 430 430 419 384 331 375 395 363 377 442 365 405 398 361 324 360 352 294 327
828 327 291 303 270 311 333 306 278 263 302 266 287 317 273 301 303 246 254 262 301 249 243 296 291 314 301 349 459 240 427 618 1036 1866 2117 1561
509 1561 848 608 483 434 344 288 289 276 327 309 288 297 250 252 269 237 263 281 268 237 218 206 235 205 269 202 217 251 273 168 227 282 188 161
190 161 147 228 169 184 145 214 153 222 135 165 214 232 227 195 182 203 190 217 195 137 110 174 160 189 204 204 145 185 187 142 143 184 238 137 145 189 110
-158 110 150 200 172 155 169 186 180 170 165 165 169 125 118 132 113 143 143 83 152 137 251 172 151 96 32
$$ packed form
1842B143J36J83K16K88J93L03N04O66Q71J280K248N216R466O447k850r080o731l179j463r60
1655E897j138q48o92m78k03j99k01m83R86J02j62j2L69Q37K086L981R175J499j3029l157j179
1457C151o02l64l06k12j89p0q0o0j18J0j04q5nn8Qj03O2k1j31M0k4k0K4j47L1l3L6P5n7j7
1176F31j66M1O8k5mL1j6j44Mk3J04pq5K9j3Pl3O1l0%j1l5n3M4K0l2J4O5p7M0pl7l7L6qn8L3
828C27l6J2l3M1K2k7k8j5L9l6K1L0m4K8Kn7QQL9n2oN3nK3j3M8J10k19J87J91M18Q30K51n56
509A561p13k40j25m9r0n6Jj3N1j8k1Rm7KJ7l2K6J8j3l1j9j2K9l0O4o7J5L4K2j05N9N5r4k7
190A61j4Q1n9J5l9O9o1O9q7L0M9J8nl2j3K1j3K7k2n8k7O4j4K9J5%n9M0Km5JM1N4j01QM4p9
-158A10M0N0k8j7J4J7oj0n%Mm4pJ4j9L0%o0O9j5J14p9k1n5o4
-392C2
##PAGE=	F1=-6691.2
##FIRST=	19140.455529915001534,	4405.895418600002813,	0
##DATA TABLE=	(F2++(Y..Y)), PROFILE
$$ plain form
4406 10 11 23 47 66 174 104 122 106 147 125 175 128 150 110 112 175 165 166 114 131 112 127 222 131 161 166 173 206 146 225 59 110 130 164 148 219 127
4058 127 118 189 106 197 182 127 168 168 145 214 119 251 178 166 176 179 141 184 155 193 161 191 222 217 198 200 219 235 181 268 251 228 203 141 185 222 222
3711 222 206 149 216 215 241 357 289 131 198 230 218 170 227 243 184 256 220 181 236 201 236 301 346 367 218 80 145 178 161 104 120 250 209
3401 209 268 311 320 253 257 265 296 297 286 304 490 458 304 31 80 113 125 69 152 137 48 117 270 285 186 226 250 264 101 109 80 196 429 572
3082 572 498 193 447 405 339 308 298 306 161 369 480 449 389 349 383 412 370 330 577 578 313 268 332 388 411 352 368 375 316 266 434 468
2781 468 483 548 587 609 686 642 803 698 525 281 273 289 234 279 395 350 314 332 382 441 489 351 447 370 474 442 427 328 353 401 402 375
2481 375 443 453 492 455 467 453 470 459 451 515 491 552 519 516 472 538 562 500 499 612 632 598 613 646 611 615 632 700 665 598 563 675 606 652 671 657
2143 657 662 687 745 793 703 613 464 457 246 266 1689 6665 6988 4012 3357 1059 1674 1861 1816 1950 1920 2022 2104 2244 2224 2035 2185
$$ packed form
4406A0JJ2K4J9J08p0J8j6M1k2N0m7K2m0KO3j0Jn2J7j9J5R5r1L0NPL3o0P9j66N1K0L4j6P1r2
4058A27rP1q3R1j5n5M1%k3O9r5J32p3j2J0Ll8M3k9L8l2L0L1nj9KJ9J6n4Q7j7k3k5o2M4L7%
3711B22j6n7O7jK6J16o8j58O7L2j2m8N7J6n9P2l6l9N5l5L5O5M5K1j49j38O5L3j7n7J6J30m1
3401B09N9M3Ro7MQL1Jj1J8J86l2j54k73M9L3J2n6Q3j5q9O9J53J5r9M0K4J4j63Qk9J16K33J43
3082E72p4l05K54m2o6l1j0Qj45K08J11l1o0m0L4K9m2m0K47Jk65m5O4N6K3n9J6Pn9n0J68L4
2781D68J5O5L9K2P7m4J61j05j73k44qJ6n5M5J16m5l6J8N0N9M8j38R6p7J04l2j5r9K5M8Jk7
2481C75O8J0L9l7J2j4J7j1qO4k4O1l3lm4O6K4o2jJ13K0l4J5L3l5MJ7O8l5o7l5J12o9M6J9j4
2143F57NK5N8M8r0r0j49pk11K0J423M976L23k976o55k298O15J87m5J34l0J02Q2J40k0j89J50
$$ plain form
1889 2185 2380 2481 2644 2827 2997 3207 3441 3743 4166 4496 4972 5682 6606 7910 9771 13081 20653 33953 43040 39313
1702 39313 26619 16943 12325 9974 8332 6716 5546 4726 4100 3776 3462 3173 2579 3518 3636 3406 3380 3602 4449 6644
1514 6644 11070 20705 22010 7984 4677 3412 2822 2417 2100 1895 1695 1672 1558 1499 1382 1398 1302 1203 1184 1155 1132 1033 1104 1077
1288 1077 911 953 932 887 931 773 804 763 802 876 812 812 649 660 730 713 691 735 720 580 601 545 654 653 551 597 565 569 518 589 576 583 563
979 563 529 462 498 524 495 486 573 496 519 542 486 463 485 476 417 453 407 429 378 425 441 409 377 365 407 383 376 425 375 397 406 343 371 369 386 356 335 391
622 391 407 421 432 455 568 322 510 706 1132 1942 2190 1598 888 640 520 476 382 334 336 336 376 335 356 355 297 309 327 311 318 339 332 306
321 306 271 267 284 259 318 277 276 322 354 233 281 347 247 223 183 283 218 245 189 262 226 269 212 195 243 288 302 253 241 263 225 266 258 191 154
-7 154 208 199 234 244 248 176 232 246 212 187 220 275 179 178 213 164 192 244 216 198 203 238 238 226 196 213 220 187 167 188 171 181 185 141 188 177 276 213 181
$$ packed form
1889B185J95J01J63J83J70K10K34L02M23L30M76P10R24J304J861L310P572J3300R087l727
1702C9313j2694r676m618k351j642j616j170q20o26l24l14k89n94R39J18k30k6K22Q47K195
1514F644M426R635J305j4026l307j265n90m05l17k05k00k3j14n9j17J6r6r9j9k9k3r9P1k7
1288A077j66M2k1m5M4j58L1m1L9P4o4%j63J1P0j7k2M4j5j40K1n6J09jj02M6l2Mn1P1j3Pk0
979E63l4o7L6K6k9rQ7p7K3K3n6k3K2rn9L6m6K2n1M7J6l2l2j2M2k4pM9n0K2Ro3K8kJ7l0k1N6
622C91J6J4J1K3J13k46J88J96M26Q10K48n92p10k48j20m4r4m8K%M0m1K1jn8J2J8j6PK1pk6
321C06l5mJ7k5N9m1jM6L2j21M8O6j00k4m0J00o5K7n6P3l6M3n7j7M8M5J4m9j2K2l8M1qo7l7
-7A54N4rL5J0Mp2N6J4l4k5L3N5r6jL5m9K8N2k8j8NL5%j2l0J7Pl3k0K1j7J0Mm4M7j1R9o3l2
$$ plain form
-374 181 112 38
$$ packed form
-374A81o9p4
-392C8
##PAGE=	F1=-6769.95
##FIRST=	19140.455529915001534,	4405.895418600002813,	0
##DATA TABLE=	(F2++(Y..Y)), PROFILE
$$ plain form
4406 12 29 28 71 90 193 134 163 168 167 149 220 162 197 175 136 210 211 207 150 174 151 165 245 186 224 215 223 222 182 262 117 171 182 211 204 270 176 161 226
4040 226 155 269 251 177 225 222 181 279 181 296 224 225 234 222 208 258 198 239 229 240 277 284 245 261 267 286 246 332 293 300 251 202 222 263 282 268 207
3692 207 263 253 286 403 326 168 249 292 267 222 284 306 246 311 274 252 273 250 259 335 369 385 244 160 210 257 232 188 184 326 300 339 377 389
3373 389 344 321 334 357 358 344 341 509 422 258 91 113 218 215 160 257 232 167 183 323 351 282 309 348 335 151 224 184 76 299 507 512
3073 512 176 545 476 412 395 378 382 252 412 516 491 437 408 440 459 396 395 610 590 291 484 498 527 526 471 493 478 431 380 507 531 544
2772 544 591 557 561 612 723 1023 891 723 504 494 481 417 443 576 527 496 502 539 587 647 526 609 545 648 605 604 498 542 587 575 546 622
2472 622 663 691 645 683 657 668 663 647 715 697 749 730 745 717 763 799 752 758 830 865 826 851 870 862 887 910 967 928 871 823 936 888 968 972 987 996 1043
2124 1043 1079 1113 1052 995 922 937 784 658 1688 7291 7742 4494 3598 1215 2178 2404 2355 2487 2513 2637 2771 2954 2936 2726 2905
$$ packed form
4406A2J7jM3J9J03n9K9Njj8P1n8L5k2l9P4Jmn7K4k3J4Q0n9L8rQjm0Q0j45N4J1K9pO6r4j5O5
4040B26p1J14j8p4M8lm1R8r8J15p2JRj2j4N0o0M1j0J1L7Pl9J6OJ9m0Q6l9Pm9m9K0M1J9j4o1
3692B07N6j0L3J17p7j58Q1M3k5m5O2K2o0O5l7k2K1k3RP6L4J6j41q4N0M7k5m4mJ42k6L9L8J2
3373C89m5k3J3K3Jj4lJ68q7j64j67K2J05ln5R7k5o5J6J40K8o9K7L9j3j84P3m0j08K23K08N
3073E12l36L69o9o4j7j7Mj30J60J04k5n4k9L2J9o3jK15k0k99J93J4K9jn5K2j5m7n1J27K4J3
2772E44M7l4MN1J11L00j32j68k19j0j3o4K6J33m9l1OL7M8O0j21Q3o4J03m3jj06M4M5j2k9P6
2472F22M1K8m6L8k6J1nj6O8j8N2j9J5k8M6L6m7OP2L5l9K5J9qK5K3N7l9n7m8J13m8Q0MJ5RM7
2124A043L6L4o1n7p3J5j53j26J030N603M51l248q96k383R63K26m9J32K6J24J34J83j8k10J79
$$ plain form
1889 2905 3141 3314 3551 3804 4049 4349 4666 5080 5649 6160 6865 7867 9132 10972 13621 18329 29108 47475 59850
1711 59850 54855 37583 24262 17887 14418 11769 9352 7750 6729 5947 5495 5057 4656 3982 5016 5009 4693 4681 4817 5663
1523 5663 8010 12772 22998 23405 8136 4711 3432 2880 2490 2173 1990 1819 1867 1737 1674 1569 1599 1509 1409 1398 1391 1345 1248
1307 1248 1334 1278 1103 1148 1130 1072 1117 951 987 950 989 1055 985 991 841 838 901 885 851 901 876 753 804 720 831 824 710 777 734 727 662 739 737 747
988 747 724 683 622 646 665 636 631 712 647 646 692 628 616 621 611 558 603 541 577 515 558 572 535 502 493 535 523 499 554 497 521 524 469 506 501 500 482 463 514
622 514 550 559 592 616 696 452 637 826 1280 2030 2201 1542 859 613 514 479 395 366 368 388 420 353 409 402 343 362 380 381 380 388 394 366 329 330 332
293 332 325 372 354 339 397 431 300 342 403 308 275 243 337 275 303 239 308 296 324 292 250 282 347 375 313 305 328 272 316 319 243 223 256 249 286 287 295 219
-64 219 283 312 282 246 275 317 219 222 238 222 260 291 265 246 249 293 295 287 225 261 263 250 214 255 230 235 229 213 232 233 298 238 208 119 36
$$ packed form
1889B905K36J73K37K53K45L00L17M14N69N11P05J002J265J840K649M708J0779J8367J2375
1711E9850m995j7272j3321o375l469k649k417j602j021p82m52m38m01o74J034pl16j2J36Q46
1523E663K347M762J0226M07j5269l425j279n52l90l17j83j71M8j30o3j05L0r0j00j1pm6r7
1307A248Q6n6j75M5j8n8M5j66L6l7L9O6p0Oj50lO3j6l4N0k5j23N1q4J11pj14O7m3po5P7kJ0
988G47k3m1o1K4J9k9nQ1o5jM6o4j2Nj0n3M5o2L6o2M3J4l7l3rM2j2k4N5n7K4Ln5L7njj8j9N1
622E14L6RL3K4Q0k44J85J89M54P50J71o59o83k46r9l5q4k9KK0L2o7N6pn9J9J8JjQOk8l7JK
293C32pM7j8j5N8L4j31M2O1r5l3l2R4o2K8o4O9j2K8l2m2L2O5K8o2qK3n6M4Lp6k0L3pL7JQp6
-64B19O4K9l0l6K9M2r8LJ6j6L8L1k6j9LM4Kqo2L6Kj3l6M1k5Noj6J9JO5o0l0q9q3
-392C6
##PAGE=	F1=-6848.71
##FIRST=	19140.455529915001534,	4405.895418600002813,	0
##DATA TABLE=	(F2++(Y..Y)), PROFILE
$$ plain form
4406 19 42 35 96 129 212 163 207 226 190 173 265 196 238 236 175 244 253 247 183 215 200 213 260 241 286 257 271 231 215 287 193 230 245 260 262 315 224 205
4049 205 261 209 333 311 224 283 279 217 338 245 336 259 284 287 262 269 320 250 283 291 294 334 350 296 317 309 324 307 388 325 360 289 255 270 295 333 323
3702 323 264 308 287 332 437 348 202 300 347 305 272 332 361 301 357 322 313 304 296 281 367 382 391 279 241 272 334 299 269 261 399 383 405 435 445
3373 445 418 380 392 410 404 390 368 505 369 245 207 178 331 303 264 364 323 288 301 405 416 380 395 437 388 239 341 307 182 307
3091 307 520 565 184 655 543 484 478 468 454 388 496 570 542 494 476 507 513 448 482 676 648 399 686 639 645 609 555 596 553 521 488 583
2791 583 576 583 596 464 416 553 919 1293 1070 889 700 706 658 600 613 749 693 673 664 696 738 792 692 765 713 813 751 762 662 726 772
2500 772 746 727 801 867 879 827 889 859 858 862 848 910 905 945 937 968 955 993 1028 1002 1032 1059 1096 1054 1083 1087 1107 1161 1195 1228 1185 1145 1103 1198 1184 1300 1290
2152 1290 1330 1354 1425 1449 1458 1441 1428 1455 1512 1439 1442 2356 8123 8263 4720 3496 1376 2646 2875 2822 2953 3032 3186 3367 3586 3568 3344
$$ packed form
4406A9K3pO1L3Q3m9M4J9l6j7R2o9M2ko1O9Roo4L2j5J3M7j9M5k9J4m0j6P2r4L7J5J5KN3r1j9
4049B05N6n2J24k2q7N9mo2J21r3R1p7K5Lk5PN1p0L3QLM0J6n4K1qJ5j7Q1o3L5p1l4J5K5L8j0
3702C23n9M4k1M5J05q9j46R8M7m2l3O0K9o0N6l5rrqj5Q6J5Rj12l8L1O2l5l0qJ38j6K2L0J0
3373D45k7l8J2J8oj4k2J37j36j24l8k9J53k8l9J00m1l5J3J04J1l6J5M2m9j49J02l4j25J25
3091C07K13M5l81M71j12n9oj0j4o6J08P4k8m8j8L1Oo5L4J94k8k49K87m7Ol6n4M1m3l2l3R5
2791E83pPJ3j32m8J37L66L74k23j81j89Om8n8J3J36n6k0rL2M2N4j00P3n2J00o2J1j00O4M6
2500G72k6j9P4O6J2n2O2l0jMj4O2nM0qL1j3L8L5k6L0K7L7m2K9MK0N4L4L3m3m0m2R5j4J16j0
2152A290M0K4P1K4Rj7j3K7N7p3LR14N767J40l543j224k120J270K29n3J31P9J54J81K19j8k24
$$ plain form
1899 3344 3561 3832 4074 4382 4700 5021 5409 5809 6341 7037 7727 8668 9963 11570 13923 17367 23475 37508 60920 76431
1711 76431 70071 48396 31689 23708 19197 15445 12059 9997 8774 7854 7288 6743 6245 5547 6761 6498 6111 6123 6266
1533 6266 7117 9637 14478 25081 24037 7636 4161 2957 2507 2211 1938 1820 1728 1869 1749 1693 1621 1673 1587 1503 1520 1532 1472
1317 1472 1384 1482 1379 1225 1275 1261 1205 1241 1077 1119 1096 1130 1180 1115 1120 990 981 1041 1014 978 1024 984 895 979 872 982 962 840 928 878 858 788
1016 788 871 873 879 855 808 762 781 781 749 767 823 776 748 809 747 743 728 720 675 736 655 710 642 671 681 646 615 610 654 649 613 667 606 639 622 593 625 616 609
650 609 592 593 635 683 690 739 772 804 579 762 943 1395 2032 2072 1341 719 496 445 421 369 369 372 414 436 354 436 421 378 397 416 431 425 414 436
331 436 401 374 379 367 382 420 417 392 459 482 350 392 435 355 308 307 380 321 347 281 341 350 367 362 299 320 397 427 356 353 377 312 356 365 282 289 304 294 332
-36 332 316 332 261 327 373 332 300 329 350 247 265 259 277 332 328 309 289 300 341 341 337 244 301 290 301 250 315 275 285 269 281 273 283 313 244 220 114
$$ packed form
1899C344K17K71K42L08L18L21L88M00N32O96O90R41J295J607K353L444O108J4033K3412J5511
1711G6431o360k1675j6707p981m511l752l386k062j223r20n66n45m98o98J214k63l87J2J43
1533F266Q51K520M841J0603j044j6401l475j204m50k96k73j18r2J41j20n6p2N2q6q4J7J2o0
1317A472q8R8j03j54N0j4n6L6j64M2k3L4N0o5Nj30rO0k7l6M6m0q9Q4j07J10k0j22Q8n0k0p0
1016G88Q3KOk4m7m6J9%l2J8N6m7k8O1o2mj5qm5O1q1N5o8K9J0l5l1nM4nl6N4o1L3j7k9L2rp
650F09j7JM2M8PM9L3L2k25J83J81M52O37M0p31o22k23n1k4n2%LM2K2q2Q2j5m3J9J9J5oj1K2
331D36l5k7Nj2J5L8lk5O7K3j32M2M3q0m7jP3n9K6o6O0RJ7no3K1P7L0p1lK4o5M4Rq3PJ5j0L8
-36C32j6J6p1O6M6m1l2K9K1j03J8oJ8N5mj9k0J1M1%mr3N7j1J1n1O5m0J0j6J2qJ0L0o9k4j06
$$ plain form
-383 114 31
$$ packed form
-383A14q3
-392C1
##PAGE=	F1=-6927.46
##FIRST=	19140.455529915001534,	4405.895418600002813,	0
##DATA TABLE=	(F2++(Y..Y)), PROFILE
$$ plain form
4406 30 47 43 117 165 222 186 245 267 201 193 301 223 267 281 213 270 282 274 208 242 245 258 265 290 333 283 302 230 243 298 272 277 299 302 308 341 262 238 283
4040 283 255 378 347 260 326 321 249 379 294 357 274 328 322 291 315 357 291 316 333 334 377 400 337 357 331 344 349 420 340 396 310 293 305 309 362 358 307
3692 307 337 308 369 448 350 229 341 385 323 310 361 396 338 383 357 355 321 327 295 390 384 390 317 313 322 396 351 332 330 453 440 448 469 479 462 419 425 441
3335 441 427 416 380 480 321 288 310 260 423 375 356 452 395 390 410 481 465 460 464 501 418 338 442 419 338 424 591 639 200 743 583 537
3035 537 537 543 507 512 578 611 581 542 532 568 559 511 568 754 697 471 814 718 711 641 590 655 586 570 563 634 591 592 560 326 214 601 1148 1522
2716 1522 1197 994 832 859 782 736 746 870 810 804 775 806 850 889 810 874 836 926 847 867 785 863 909 874 873 942 1020 1012 958 1039 1007 998 1009 1004 1054
2387 1054 1060 1095 1094 1138 1133 1170 1194 1196 1250 1237 1266 1226 1255 1244 1294 1377 1418 1418 1378 1361 1335 1405 1430 1576 1554 1618 1656 1746 1770 1756 1792 1827 1963 2068 2081
2058 2081 2266 3424 8935 8185 4466 2926 1657 2941 3130 3067 3198 3319 3505 3717 3963 3943 3719 3964 4259 4557 4915 5278
$$ packed form
4406C0J7mP4M8N7l6N9K2o6qJ08p8M4J4o8N7J2qo6L4LJ3PK5M3n0J9p2J3N5k6NK2LOL3p9k4M5
4040B83k8J23l1q7O6np2J30q5O3q3N4ol1K4M2o6K5J7JM3K3o3K0k6J3NP1q0N6q6j7J2MN3mn1
3692C07L0k9O1P9r8j21J12M4o2j3N1L5n8M5k6kl4Ol2R5oOp3mRP4m5j9kJ23j3QK1J0j7m3OJ6
3335D41j4j1l6J00j59l3K2n0J63m8j9R6n7nK0P1j6nML7q3q0J04k3q1Q6J67M8m39N43j60m6
3035E37%Ol6NO6L3l0l9j0L6rm8N7J86n7k26L43r6pp0n1O5o9j6pP1m3Jl2k34j12L87N47L74
2716A522l25k03j62K7p7m6J0J24o0ok9L1M4L9p9O4l8R0p9K0q2P8M6l5jO9P8qn4Q1l2rJ1nN0
2387A054OL5jM4nL7K4KN4j3K9m0K9j1N0Q3M1%m0j7k6P0K5J46k2O4L8R0K4j4L6L5J36J05J3
2058B081J85J158N511p50l719j540j269J284J89o3J31J21J86K12K46k0k24K45K95K98L58L63
$$ plain form
1852 5278 5654 6106 6562 7188 7963 8787 9917 11425 13281 15997 20036 27189 43676 70780 88455 80990 56249 37326
1683 37326 28339 23151 18469 14177 11720 10356 9348 8706 8093 7548 6919 8290 7671 7261 7306 7524 8395 11081 15747 26448
1495 26448 23978 6706 3094 1908 1618 1500 1344 1359 1409 1649 1554 1533 1519 1594 1510 1455 1514 1535 1470 1400 1498 1347 1244 1299 1287 1244
1251 1244 1269 1120 1168 1163 1185 1211 1170 1168 1064 1051 1111 1067 1040 1069 1018 976 1088 968 1067 1032 911 1012 958 926 866 952 949 945 921 875 845 866 838
941 838 809 855 875 847 797 867 811 814 778 774 740 818 721 796 725 736 737 713 683 684 734 729 680 734 672 715 669 681 699 681 679 656 687 715 765 774 829 868 848
575 848 660 837 1010 1402 1870 1766 995 462 297 326 320 323 355 356 416 418 346 437 412 404 413 432 457 442 417 452 412 401 405 384 420 452 457 422 495
246 495 495 375 420 431 378 322 358 403 346 371 307 353 380 389 410 328 349 429 449 375 375 401 337 379 390 305 341 342 325 359 324 353 291 356 420 354 336
-101 336 367 364 257 295 273 321 387 346 336 317 341 374 365 362 249 328 298 332 273 357 299 314 301 334 302 312 311 231 215 102 34
$$ packed form
1852E278L76M52M56O26P75Q24J130J508J856K716M039P153J6487K7104J7675p465k4741j8923
1683C7326q987n188m682m292k457j364j008o42o13n45o29J371o19m10M5K18Q71K686M666J0701
1495B6448k470j7272l612j186k90j18j56J5N0K40r5k1j4P5q4n5N9K1o5p0R8j51j03N5j2m3
1251A244K5j49M8nK2K6m1kj04j3O0m4k7K9n1m2J12j20R9l5j21J01n4l2o0Q6lmk4m6l0K1k8
941H38k9M6K0k8n0P0n6Ll6ml4P8r7P5p1J1Jk4l0JN0nm9N4o2M3m6J2J8j8kk3L1K8N0RN5L9k0
575H48j88J77J73L92M68j04p71n33j65K9oLL2JO0Kp2R1k5qRJ9K5j5k5L5m0j1Mk1L6L2Nl5P3
246D95%j20M5J1n3n6L6M5n7K5o4M6K7RK1q2K1Q0K0p4%K6o4M2J1q5L6Jj7L4l5K9o2O5O4o6j8
-101C36L1lj07L8k2M8O6m1j0j9K4L3rlj13P9l0L4n9Q4n8J5j3L3l2J0jq0j6j13o8
-392C4
##PAGE=	F1=-7006.22
##FIRST=	19140.455529915001534,	4405.895418600002813,	0
##DATA TABLE=	(F2++(Y..Y)), PROFILE
$$ plain form
4406 42 44 52 131 188 214 202 268 281 193 206 319 239 277 302 241 279 294 281 221 250 279 291 258 324 356 287 308 218 259 294 336 305 332 328 333 340 284
4058 284 252 288 285 394 350 277 345 337 271 394 317 353 269 345 331 301 337 364 309 329 347 349 396 425 357 370 328 341 365 418 333 404 309 309 314 304
3720 304 363 365 327 343 310 388 430 334 249 364 401 319 331 364 406 351 385 375 371 319 338 297 398 372 384 349 366 358 434 383 367 378 474 460 460 472
3382 472 486 471 429 427 447 427 417 377 438 300 355 384 332 476 422 417 506 437 458 485 526 487 506 501 528 422 420 507 497 454 523 651 700 207
3063 207 779 582 556 560 585 532 591 620 615 592 565 558 601 581 562 624 809 702 462 846 719 712 621 576 664 577 577 599 647 576 579 504 240 250
2744 250 776 1331 1634 1232 1018 877 921 829 795 811 911 852 862 812 842 891 915 857 905 885 960 872 897 842 925 968 931 953 1013 1090 1058
2453 1058 1010 1101 1069 1059 1074 1079 1114 1126 1161 1169 1219 1215 1252 1261 1294 1364 1320 1332 1303 1327 1304 1383 1488 1528 1491 1464 1474 1468 1511 1568 1732 1705 1787 1836 1934 1964
2115 1964 1936 2023 2104 2335 2483 2568 2935 4431 9497 7407 3682 1935 2091 2985 3093 3014 3142 3290 3501 3725 3980 3957 3752
$$ packed form
4406D2KQP9N7K6j2O6J3q8J3J13q0L8K5o1L8J5j3o0K9K9J2l3O6L2o9K1r0M1L5M2l1K7mNPn6
4058B84l2L6lJ09m4p3O8qo6J23p7L6q4P6j4l0L6K7n5K0J8KM7K9o8J3m2J3K4N3q5P1r5%Nj0
3720C04N9Kl8J6l3P8M2r6q5J15L7q2J2L3M2n5L4j0mn2J9m1J01k6J2l5J7qP6n1j6J1R6j4%J2
3382D72J4j5m2kK0k0j0m0O1j38N5K9n2J44n4nQ9o9K1K7M1l9J9nK7j06kQ7j0m3O9J28M9m93
3063B07N72j97k6MK5n3N9K9nk3k7pM3k0j9O2J85j07k40L84j27pr1m5Q8q7%K2M8p1Lp5k64J0
2744B50N26N55L03m02k14j41M4r2l4J6J00n9J0n0L0M9K4n8M8k0P5q8K5n5Q3M3l7K2O0P7l2
2453A058m8R1l2j0J5NL5J2L5QN0mL7RL3P0m4J2k9K4k3P9J05M0l7k7J0oM3N7J64k7Q2M9R8L0
2115A964k8Q7Q1K31J48Q5L67J496N066k090l725j747J56Q94J08p9J28J48K11K24K55k3k05
$$ plain form
1899 3752 4003 4306 4635 5010 5391 5783 6260 6728 7399 8187 9066 10293 11875 13819 16658 20933 28503 45997 74454 92731
1711 92731 84708 59055 39693 30595 25291 20097 15181 12477 11074 10051 9390 8761 8235 7781 9235 8198 7822 7916
1542 7916 8247 9161 12007 16408 27304 24292 6438 2455 770 321 491 614 843 1072 1335 1256 1298 1359 1435 1344 1327 1417
1335 1417 1426 1362 1319 1393 1219 1189 1235 1222 1197 1213 1091 1140 1151 1157 1148 1151 1140 1058 1045 1105 1043 1032 1032 983 993 1118 994 1073 1024 912 1015 958 920 884
1016 884 967 954 932 909 872 853 883 826 807 876 856 844 784 858 809 817 763 764 744 831 725 819 747 737 728 721 688 701 756 744 682 735 678 727 655 713
678 713 707 678 688 656 719 731 771 782 835 870 804 668 831 996 1272 1540 1330 596 143 145 239 258 314 358 345 413 381 353 425 396 427 419 436
368 436 465 435 408 446 409 416 413 387 439 463 472 430 503 473 379 422 399 381 323 389 404 349 374 315 347 387 392 432 334 368 437 441 371 371 401 347 386 395 316
2 316 372 361 335 365 311 356 309 369 446 348 350 383 355 253 308 281 350 411 341 345 328 364 385 365 358 242 340 288 340 282 373 299 316 321 363 310 313 290
$$ packed form
1899C752K51L03L29L75L81L92M77M68O71P88Q79J227J582J944K839M275P570J7494K8457J8277
1711I2731q023k5653j9362r098n304n194m916k704j403j023o61o29n26m54J454j037l76R4
1542G916L31R14K846M401J0896l012j7854l983j685m49J70J23K29K29K63p9M2O1P6r1j7R0
1335A417Ro4m3P4j74l0M6j3k5J6j22M9J1OrLj1q2j3O0o2j1%m9J0J25j24P9m9j12J03n7l8l6
1016H84Q3j3k2k3l7j9L0n7j9O9k0j2o0P4m9Qn4Jk0Q7j06R4p2j0rpl3J3N5j2o2N3n7M9p2N8
678G13ok9J0l2O3J2M0J1N3L5o6j36J63J65K76K68k10p34m53KR4J9N6M4j3O8l2k8P2k9L1qJ7
368D36K9l0k7L8l7Plk6N2K4Rm2P3l0r4M3k3j8n8O6J5n5K5n9L2M0NM0r8L4O9Mp0%L0n4L9Rp9
2C16N6j1k6L0n4M5m7O0P7r8KL3k8j02N5k7O9O1p0Mj7L6K1k0pj16R8n2N2n8R1p4J7NM2n3Lk3
$$ plain form
-355 290 204 196 90 47
$$ packed form
-355B90q6qj06m3
-392D7
##PAGE=	F1=-7084.97
##FIRST=	19140.455529915001534,	4405.895418600002813,	0
##DATA TABLE=	(F2++(Y..Y)), PROFILE
$$ plain form
4406 53 36 61 135 193 188 207 271 268 167 210 315 240 268 297 252 271 288 264 221 240 295 303 240 338 353 271 290 197 263 276 372 311 339 333 334 313 285
4058 285 245 274 291 380 322 276 336 326 280 383 310 324 247 333 313 291 333 343 303 320 335 339 388 420 352 355 298 316 352 384 306 384 289 303 294 284
3720 284 337 347 322 325 295 384 389 305 260 364 392 295 331 343 388 338 364 375 364 302 327 286 386 344 375 365 393 375 441 391 372 396 459 440 441
3392 441 441 468 446 408 399 425 406 396 358 386 302 403 418 373 479 436 439 519 443 481 513 528 477 512 500 516 401 468 524 530 511 557 658 726 197
3063 197 751 538 538 542 585 526 614 607 575 566 554 544 597 569 578 629 810 646 383 794 652 657 559 524 629 538 549 600 628 541 555 462 322
2753 322 501 974 1414 1592 1163 956 835 884 794 765 799 864 812 840 771 799 852 866 824 853 854 911 826 849 825 905 939 910 951 999 1065 1012
2453 1012 976 1067 1034 1030 1048 1060 1080 1089 1132 1149 1196 1190 1223 1217 1280 1354 1291 1282 1268 1285 1256 1357 1472 1504 1433 1425 1462 1474 1496 1569 1738 1709 1803 1854 1948 1991
2115 1991 1957 2081 2196 2492 2668 2797 3304 5083 9747 6263 2553 875 2564 2777 2781 2683 2800 2957 3177 3391 3641 3614 3447
$$ packed form
4406E3j7K5P4N8nJ9O4lj01M3J05p5K8K9m5J9J7k4m3J9N5Qo3R8J5q2J9r3O6J3R6o1K8oJk1k8
4058B85m0K9J7Q9n8m6O0j0m6J03p3J4p7Q6k0k2M2J0m0J7J5MM9L2o8Ln7J8L6L2p8P8r5J4rj0
3720B84N3J0k5Ll0Q9Nq4m5J04K8r7L6J2M5n0K6J1j1o2K5m1J00m2L1j0K8j8O6n0j9K4O3j9J
3392D41%K7k2l8rK6j9j0l8K8q4J01J5m5J06m3LQ0p6L8L2J5n1L5j2J6j15O7N6Oj9M6J01O8n29
3063A97N54k13%MM3n9Q8pl2rj2j0N3k8RN1J81j64k63M11j42Nr8l5J05r1J1N1K8q7J4r3j40
2753C22J79M73M40J78m29k07j21M9r0k9L4O5n2K8o9K8N3J4m2K9JN7q5K3k4Q0L4k9M1M8O6n3
2453A012l6R1l3mJ8J2K0RM3J7M7oL3oO3P4o3rj4J7k9J01J15L2p1qL7J2K2P3J69k9R4N1R4M3
2115A991l4J24J15K96J76J29N07J779M664l484l710j678J689K13Mr8J17J57K20K14K50k7j67
$$ plain form
1899 3447 3678 3969 4294 4649 5019 5384 5841 6274 6927 7660 8506 9713 11209 13054 15746 19832 27082 43868 70965 88100
1711 88100 80198 56030 38137 29873 25066 19925 14827 12075 10743 9780 9161 8568 8123 7924 9391 7939 7639 7794
1542 7794 8247 9224 12214 16446 27961 25713 7641 3469 1783 1131 884 962 1022 1172 1236 1132 1217 1311 1347 1236 1246 1324 1291
1326 1291 1229 1213 1233 1096 1132 1141 1126 1111 1121 1034 1076 1092 1079 1035 1091 1067 997 989 1045 972 976 938 908 959 1080 962 1014 954 859 949 891 855 851 922 897
997 897 852 834 812 795 837 756 757 833 777 775 724 793 749 760 694 702 695 782 676 783 711 683 663 678 633 662 721 697 622 677 628 677 586 684 650 610
659 610 636 594 684 680 698 713 755 778 676 604 740 896 1038 1131 927 422 231 319 301 325 368 396 360 424 357 385 414 393 452 422 435 463
359 463 417 402 432 400 423 410 384 440 456 466 418 487 429 373 406 352 370 322 398 388 335 363 311 329 373 382 428 324 376 423 410 352 347 387 347 380
21 380 389 321 381 362 327 350 288 343 315 369 450 321 345 377 330 242 304 284 360 399 320 335 321 364 373 343 325 229 339 268 328 281 363 281 294 328
$$ packed form
1899C447K31K91L25L55L70L65M57M33O53P33Q46J207J496J845K692M086P250J6786K7097J7135
1711H8100p902k4168j7893q264m807n141n098k752j332r63o19n93m45j99J467j452l00J55
1542G794M53R77K990M232J1515k248j8072m172j686o52k47P8O0J50O4j04Q5R4L6j11J0P8l3
1326A291o2j6K0j37L6Rj5j5J0q7M2J6j3m4N6k4p0qN6p3Ml8l0N1J21j18N2o0r5R0n8l6mP1k5
997H97m5j8k2j7M2q1JP6n6kn1O9m4J1o6QpQ7j06J07p2k8k0J5m5K9N9k4p5N5m9M9r1R8l4m0
659F10K6m2R0mJ8J5M2K3j02p2J36J56J42R3k04n05j91Q8j8K4M3K8l6O4o7K8K9k1N9l0J3K8
359D63m6j5L0l2K3j3k6N6J6J0m8O9n8n6L3n4J8m8P6j0n3K8n2J8M4RM6j04N2M7j3n8nM0m0L3
21C80Ro8O0j9l5K3o2N5k8N4Q1j29K4L2m7q8O2k0P6L9p9J5j4M3Rl0j8r6J10p1O0m7Q2q2J3L4
$$ plain form
-317 328 367 298 289 255 175 171 85 60
$$ packed form
-317C28L9o9rl4q0mq6k5
-392F0
##PAGE=	F1=-7163.73
##FIRST=	19140.455529915001534,	4405.895418600002813,	0
##DATA TABLE=	(F2++(Y..Y)), PROFILE
$$ plain form
4406 59 29 68 129 182 149 203 258 235 132 205 293 227 245 270 246 247 268 230 207 215 293 291 215 330 328 243 254 172 252 245 375 296 321 319 315 269 267 221
4049 221 244 274 342 271 258 304 291 276 351 278 275 215 295 272 266 305 304 276 289 304 305 358 393 327 315 251 277 317 327 265 343 256 279 254 255 292 308
3702 308 295 292 268 361 334 270 261 342 361 258 314 303 349 305 326 359 340 274 299 263 357 305 364 362 393 374 420 378 350 385 413 388 397 387 428 397
3364 397 363 348 384 371 359 325 334 304 416 413 373 436 420 423 491 417 458 495 491 440 480 466 469 364 473 493 518 508 523 606 704 177 665 463
3044 463 489 490 547 492 585 543 497 506 510 490 553 524 551 577 744 531 266 685 543 569 476 454 568 484 499 576 586 498 525 441 454 710 1110
2734 1110 1385 1405 1006 824 728 767 696 664 721 748 707 752 671 693 750 757 729 731 755 795 724 743 745 814 837 821 874 909 962 891 870 951 919 926 947
2406 947 961 965 965 1017 1046 1082 1071 1098 1082 1164 1234 1165 1134 1137 1146 1116 1229 1342 1361 1267 1277 1337 1360 1368 1438 1600 1571 1669 1714 1794 1853 1820 1960 2089 2412
2077 2412 2600 2742 3320 5263 9770 5502 1663 1311 2956 2393 2291 2176 2272 2419 2629 2813 3043 3015 2896 3086 3349 3637
$$ packed form
4406E9l0L9O1N3l3N4N5k3j03P3Q8o6J8K5k4JK1l8k3QP8kp6J15kq5J1q2Q0pJ30p9K5kmm6km6
4049B21K3L0O8p1j3M6j3j5P5p3lo0Q0k3oL9jk8J3J5JN3L5o6j2o4K6M0J0o2P8q7K3k5JL7J6
3702C08j3lk4R3k7o4rQ1J9j03N6j1M6m4K1L3j9o6K5l6R4n2N9kL1j9M6m2k8L5K8k5Rj0M1l1
3364C97l4j5L6j3j2l4Rl0J12lm0O3j6LO8p4M1L7mn1M0j4Lj05J09K0K5j0J5Q3R8n27M88k02
3044D63K6JN7n5R3m2m6RMk0O3k9K7K6J67k13k65M19j42K6r3k2J14q4J5P7J0q8K7q4J3K56M00
2734A110K75K0l99j82r6L9p1l2N7K7m1M5q1K2N7Pk8KK4M0p1J9KO9K3j6N3L5N3p1k1Q1l2PK1
2406I47J4M%N2K9L6j1K7j6Q2P0o9l1LRl0J13J13J9r4J0O0K3QP0J62k9R8M5Q0N9l3J40J29L23
2077B412J88J42N78J943M507m268l839l52J645n63j02j15R6J47K10J84K30k8j19J90K63K88
$$ plain form
1871 3637 3939 4272 4576 4972 5333 5908 6529 7266 8347 9620 11202 13517 17039 23314 37863 61233 75755 68600 47920
1692 47920 33021 26333 22525 18008 13226 10630 9458 8617 8089 7570 7244 7328 8761 6992 6781 7009 7569 8629 11755
1514 11755 16021 28567 27833 9568 5121 3342 2478 1996 1868 1712 1656 1498 1345 1395 1442 1418 1282 1293 1315 1220 1157 1157 1107 1072
1288 1072 1130 1080 1063 1043 1050 990 1017 1027 998 930 1029 988 915 918 967 892 905 829 829 900 999 897 921 855 779 846 789 762 790 839 804 738 727 720 699 750
950 750 655 683 749 666 665 647 700 658 669 600 612 619 692 595 706 637 596 568 603 539 589 645 608 525 580 540 583 487 611 549 502 543 492 599 578
622 578 570 587 610 618 494 486 591 739 788 827 814 642 504 519 423 436 440 443 387 442 355 424 406 401 467 422 433 453 401 401 418 388 421 400 374 426
284 426 431 442 393 457 379 363 377 309 353 318 389 363 312 341 299 307 345 364 402 307 373 391 368 328 313 366 340 364 376 323 373 350 307 320 262 317
-54 317 311 359 436 284 326 356 298 230 286 280 352 358 291 312 299 343 341 305 274 214 326 243 302 273 331 252 257 322 349 272 249 214 153 150 87 68
$$ packed form
1871C637L02L33L04L96L61N75O21P37J081J273J582K315L522O275J4549K3370J4522p155k0680
1692D7920j4899o688l808m517m782k596j172q41n28n19l26Q4J433j769k11K28N60J060L126
1514A1755M266J2546p34j8265m447j779q64m82j28j56n6j58j53N0M7k4j36J1K2r5o3%n0l5
1288A072N8n0j7k0Po0K7J0k9o8R9m1p3LM9p5J3p6%P1R9j02K4o6p6O7n7k7K8M9l5o6j1pk1N1
950G50r5K8O6q3jj8N3m2J1o9J2PP3r7J11o9m1k8L5o4N0N6l7q3N5m0M3r6J24o2m7M1n1J07k1
622E78qJ7K3Qj24qJ05J48M9L9j3j72j38J5r6J3MLn6N5q7O9j8nO6m5J1K0n2%J7l0L3k1k6N2
284D26NJ1m9O4p8j6J4o8M4l5P1k6n1K9m2QL8J9L8r5O6J8k3m0j5N3k6K4J2n3N0k3m3J3n8N5
-54C17oM8P7j52M2L0n8o8N6oP2Oo7K1j3M4kl6l1o0J12q3N9k9N8p9NO5K7p7k3l5o1lo3j9
-392F8
##PAGE=	F1=-7242.48
##FIRST=	19140.455529915001534,	4405.895418600002813,	0
##DATA TABLE=	(F2++(Y..Y)), PROFILE
$$ plain form
4406 60 26 74 119 163 104 189 232 194 95 193 258 204 213 230 226 215 241 188 182 181 275 260 185 305 289 212 213 149 230 209 346 265 286 288 283 223 236 189
4049 189 206 241 291 213 228 259 244 258 310 234 217 182 239 219 230 262 258 237 246 263 259 314 353 290 263 196 233 270 262 218 290 217 246 206 225 238 259
3702 259 254 253 234 324 277 236 253 304 315 216 286 255 297 258 280 333 308 241 263 231 313 257 347 342 371 358 377 351 315 356 352 321 343 324 374 338 305
3354 305 286 331 330 316 284 287 292 393 383 339 363 380 380 436 370 402 446 431 384 420 411 402 320 443 425 473 464 444 513 639 167 544 374 424 417 483
3016 483 437 524 454 404 424 444 408 480 458 486 482 628 377 159 557 422 473 392 382 495 425 436 534 530 450 483 422 539 826 1160 1278
2725 1278 1128 804 655 592 609 568 523 604 599 567 627 547 557 615 620 602 574 618 644 593 608 627 682 693 694 748 770 811 733 725 790 757 777 805 813
2396 813 805 793 847 893 910 896 913 894 982 1045 981 933 949 952 925 1040 1136 1142 1043 1063 1137 1167 1169 1220 1363 1336 1433 1463 1525 1598 1574 1708 1831 2143
2077 2143 2335 2469 3043 5027 9708 5711 1944 2559 3232 1948 1756 1628 1696 1815 2001 2142 2342 2317 2249 2386 2610 2839
$$ packed form
4406F0l4M8M5M4n9Q5M3l8r9R8O5n4RJ7mj1K6n3ojR4j5p5J20j6p7Jo4Q1k1J37q1K1Kno0J3m7
4049A89J7L5N0p8J5L1j5J4N2p6j7l5N7k0J1L2mk1RJ7mN5L9o3k7o7L7L7qm4P2p3K9m0J9J3K1
3702B59njj9R0m7m1J7N1J1r9P0l1M2l9K2N3k5o7K2l2Q2n6R0nK9j3J9k6l6M1ml1K2j9N0l6l3
3354C05j9M5jj4l2LNJ01j0m4K4J7%N6o6L2M4j5m7L6rrq2J23j8M8rk0O9J26m72L77j70N0pO6
3016D83m6Q7p0n0K0K0l6P2k2K8mJ46k51k18L98j35N1q1j0J13p0J1R8mq0L3o1J17K87L34J18
2725A278j50l24j49o3J7m1m5Q1nl2O0q0J0N8Nj8k8M4K6n1J5J9N5J1JN4K2M1p8qO5l3K0K8Q
2396H13qj2N4M6J7j4J7j9Q8O3o4m8J6Lk7J15R6Or9K0P4L0KN1J43k7R7L0O2P3k4J34J23L12
2077B143J92J34N74J984M681l997l767O15O73j284j92j28O8J19J86J41K00k5o8J37K24K29
$$ plain form
1871 2839 3067 3346 3573 3881 4154 4610 5088 5674 6558 7529 8752 10561 13289 18190 29558 47789 58887 52894 36789
1692 36789 25637 20861 18317 14860 10830 8560 7601 6921 6516 6090 5898 6252 7663 5735 5616 5948 6624 7845 11238
1514 11238 15955 30152 30767 11582 6668 4695 3607 2936 2656 2368 2160 1889 1698 1686 1646 1587 1425 1420 1380 1232 1164 1169 1061
1298 1061 1140 1178 1070 1055 1016 1022 973 984 981 941 868 983 931 843 855 899 828 842 741 768 836 903 823 826 759 699 737 685 670 722 745 705 627 619 625
969 625 596 652 555 607 650 555 550 580 608 565 573 511 524 540 590 507 614 550 506 472 521 433 506 552 506 423 473 443 474 390 520 435 386 436 380
640 380 493 457 421 439 440 437 304 349 422 572 647 819 989 891 683 641 511 514 482 467 406 449 361 444 392 403 463 411 424 431 392 397 408 368
321 368 408 384 360 398 394 406 361 417 335 351 346 277 331 310 366 335 285 313 284 284 306 340 362 284 357 348 325 303 276 343 329 342 362 322 351 328 282
-26 282 283 235 284 297 339 409 247 299 328 268 219 261 267 333 301 260 285 269 306 297 261 218 201 304 219 266 261 288 222 215 304 318 240 203 178 142 137
$$ packed form
1871B839K28K79K27L08K73M56M78N86Q84R71J223J809K728M901J1368J8231J1098n993j6105
1692C6789j1152m776k544l457m030k270r59o80m05m26j92L54J411j928j19L32O76J221L393
1514A1238M717J4197O15j9185m914j973j088o71k80k88k08k71j91j2m0n9j62nm0j48o8Nj08
1298A061P9L8j08j5l9Om9J1lm0p3J15n2q8J2M4p1J4j01K7O8O7q0Lo7o0L8n2j5N2K3m0p8qO
969F25k9N6r7N2M3r5nL0K8m3Qo2J3J6N0q3J07o4m4l4M9q8P3M6m6q3N0l0L1q4J30q5m9N0n6
640C80J13l6l6J8Jlj33M5P3J50P5J72J70r8k08m2j30Ll2j5o1M3q8Q3n2J1O0n2J3Pl9NJ1m0
321C68M0k4k4L8mJ2m5N6q2J6no9N4k1N6l1n0K8k9%K2L4K2p8P3rk3k2k7O7j4J3K0m0K9k3m6
-26B82Jm8M9J3M2P0j62N2K9o0m9M2OO6l2m1K5j6L7rl6m3j7J03q5M7nK7o6pQ9J4p8l7k5l6n
$$ plain form
-374 137 91 70
$$ packed form
-374A37m6k1
-392G0
##PAGE=	F1=-7321.24
##FIRST=	19140.455529915001534,	4405.895418600002813,	0
##DATA TABLE=	(F2++(Y..Y)), PROFILE
$$ plain form
4406 57 28 75 110 148 63 170 202 160 64 174 223 177 181 188 198 182 217 150 153 143 246 219 152 266 243 183 178 129 208 173 296 228 246 248 247 187
4068 187 203 158 168 203 240 163 191 214 198 232 270 194 162 154 181 165 191 214 215 197 199 223 210 267 312 256 213 145 192 222 202 172 234 182 213 162
3730 162 201 188 207 207 215 198 279 229 206 240 261 265 176 254 214 243 207 230 301 278 212 229 195 263 208 327 315 337 335 324 319 279 323 295 256 292 270
3382 270 319 282 250 225 278 292 278 241 250 266 349 342 290 283 329 329 372 317 330 383 365 326 351 351 331 280 396 342 412 402 354 408 549 169 421
3054 421 287 360 342 413 376 456 370 320 337 373 323 396 389 408 377 500 215 117 443 316 391 322 319 423 374 368 483 472 405 432 384 556
2753 556 853 1144 1159 838 606 487 459 453 446 383 480 457 429 499 432 424 482 487 480 421 479 495 463 479 504 545 542 563 608 619 653 577 579 629 594 621
2415 621 661 661 646 620 664 731 730 712 717 702 781 840 787 732 756 755 733 840 912 910 822 839 920 954 955 983 1096 1075 1168 1176 1220 1306 1295 1420 1520 1795
2077 1795 1992 2126 2645 4595 9727 6583 2830 3626 3400 1541 1284 1154 1196 1276 1427 1525 1690 1670 1648 1735 1919 2083 2236
$$ packed form
4406E7k9M7L5L8q5J07L2m2r6J10M9m6MPJ0j6L5o7Lj0J03k7o7J14k3o0nm9P9l5J23o8J8Kjo0
4068A87J6m5J0L5L7p7K8K3j6L4L8p6l2qK7j6K6K3Jj8KK4j3N7M5n6m3o8M7L0k0l0O2n2L1n1
3730A62L9j3J9%Qj7Q1n0k3L4K1Mq9P8m0K9l6K3P1k3o6J7l4O8n5J19j2K2kj1nm0M4k8l9L6k2
3382B70M9l7l2k5N3J4j4l7RJ6Q3pn2pM6%M3n5J3N3j8l9K5%k0n1J16n4P0j0m8N4J41l80K52
3054D21j34P3j8P1l7Q0q6n0J7L6n0P3pJ9l1J23k85r8L26j27P5o9lJ04m9oJ15j1o7K7m8J72
2753E56K97K91J5l21k32j19k8opo3R7k3k8P0o7qN8Npn9N8J6l2J6K5M1lK1M5J1L4p6KN0l5K7
2415F21M0%j5k6M4O7jj8Nj5P9N9n3n5K4jk2J07P2kq8J7Q1L4JK8J13k1R3QM4Q6j1J25J00K75
2077A795J97J34N19J950N132l144l753P96k26j859k57j30M2Q0J51R8J65k0k2Q7J84J64J53
$$ plain form
1861 2236 2455 2609 2828 3014 3342 3674 4108 4783 5448 6310 7611 9523 13005 21074 34052 41783 37095 25487 17872
1683 17872 14862 13536 11327 8330 6502 5773 5282 5024 4705 4654 5308 6945 4873 4830 5327 6184 7723 11719 17533 34523
1495 34523 35765 13827 8140 5877 4567 3721 3300 2911 2583 2249 2028 1967 1834 1768 1581 1553 1471 1286 1210 1214 1079 1234 1243 1091
1270 1091 1082 1017 1027 977 975 959 913 849 955 898 796 809 853 789 795 689 727 782 816 759 751 686 636 650 602 599 662 664 620 544 532 548 508 563 478 543
932 543 559 469 453 535 535 491 494 444 453 475 502 432 527 473 436 397 450 342 435 464 417 341 382 360 376 317 436 335 291 342 285 394 345 285 306
603 306 283 272 154 222 270 436 666 1005 1204 1055 772 689 549 546 488 460 406 438 359 436 369 388 434 389 404 396 384 382 401 344 385 361 344
293 344 360 351 362 327 375 302 336 317 256 308 295 338 310 258 281 266 262 267 311 316 256 331 302 285 281 241 314 312 312 348 317 326 304 260 248 212 245 276 309
-73 309 377 219 269 299 246 212 233 245 309 248 231 261 239 258 252 218 165 187 275 201 228 248 243 196 177 275 282 211 162 152 135 128 95 68
$$ packed form
1861B236K19J54K19J86L28L32M34O75O65Q62J301J912L482Q069J2978P731m688j1608p615
1683A7872l010j326k209k997j828p29m91k58l19n1O54J637k072m3M97Q57J539L996N814J6990
1495C4523J242k1938n687k263j310q46m21l89l28l34k21o1j33o6j87k8q2j85p6Mj35J55Rj52
1270A091ro5J0n0kj6m6o4J06n7j02J3M4o4Oj06L8N5L4n7qo5n0J4m8lO3Km4p6j2J6m0N5q5O5
932E43J6r0j6Q2%m4Ln0RK2K7p0R5n4l7l9N3j08R3K9m7p6M1k2J6n9J19j01m4N1n7J09m9o0K1
603C06k3j1j18O8M8J66K30L39J99j49k83q3j40ln8k8n4L2p9P7o7J9M6m5J5qj2kJ9n7M1k4j7
293C44J6rJ1l5M8p3L4j9o1N2j3M3k8n2K3j5mNM4No0P5k9j7mm0P3k%L6l1Rk2m4j2l6L3L1L3
-73C09O8j58N0L0n3l4K1J2O4o1j7L0k2J9ol4n3K2Q8p4K7K0nm7j9R8Pp1m9j0j7pl3k7
-392F8
##PAGE=	F1=-7399.99
##FIRST=	19140.455529915001534,	4405.895418600002813,	0
##DATA TABLE=	(F2++(Y..Y)), PROFILE
$$ plain form
4406 54 31 74 104 143 34 151 174 140 42 151 196 151 155 154 170 155 205 130 129 105 217 184 118 221 199 157 155 111 195 149 245 191 211 206 210 166
4068 166 180 137 138 173 197 136 156 177 161 205 239 172 120 136 138 120 154 168 181 164 161 191 167 223 279 237 182 104 162 186 158 135 184 153 186 132
3730 132 187 154 163 164 183 169 234 193 184 226 227 222 143 225 192 201 160 180 265 253 193 205 165 216 161 306 288 303 313 275 285 251 299 256 207 254 240
3382 240 274 244 212 178 231 262 256 208 227 240 303 308 250 217 279 287 318 275 263 322 312 280 292 302 269 256 359 272 353 348 282 321 454 168 330
3054 330 215 308 280 354 319 398 315 269 266 314 259 320 338 345 294 406 85 141 363 237 331 275 272 363 336 306 431 420 375 383 334 514 816
2744 816 1092 1074 615 450 353 349 332 352 274 373 355 318 391 350 322 378 382 392 307 367 376 357 380 403 435 415 459 488 487 520 455 461 502 469 489 546
2406 546 541 526 494 509 596 587 565 556 548 610 666 625 573 602 598 580 680 724 718 655 663 741 780 781 798 873 865 954 937 966 1058 1066 1196 1273 1506 1710 1880
2058 1880 2340 4257 9971 7545 3602 4359 3466 1215 918 799 830 870 989 1056 1183 1172 1186 1234 1390 1506 1599 1761 1863 2015
$$ packed form
4406E4k3M3L0L9j09J17K3l4r8J09M5m5MjJ6j5N0p5jk4J12l3o6J03k2m2km4Q4m6R6n4K0nMm4
4068A66J4m3JL5K4o1K0K1j6M4L4o7n2J6Kj8L4J4J3j7lL0k4N6N6m2n5p8N8K4k8k3M9l1L3n4
3730A32N5l3RJJ9j4O5m1rM2Jnp9Q2l3Rm1K0Q5j2o0J2m0N1n5J45j8J5J0l8J0l4M8m3m9M7j4
3382B40L4l0l2l4N3L1om8J9J3O3Nn8l3O2QL1m3j2N9j0l2J2J0l3j3J03q7Q1no6L9J33k86J62
3054C30j15R3k8P4l5P9q3m6lM8n5O1J8Pn1J12l21N6K22j26R4n6lR1k7l0J25j1m5Qm9J80L02
2744H16K76j8m59j65r7mj7K0p8R9j8l7P3m1k8N6MJ0q5O0Rj9K3K3L2k0M4K9jL3o5OM1l3K0N7
2406E46nj5l2J5Q7rk2rqO2N6m1n2K9mj8J00M4oo3QP8L9JJ7P5qQ9j7K9R2QJ30P7K33K04J70
2058A880M60J917N714k426l943P57q93k251k97j19L1M0J19O7J27j1J4M8J56J16R3J62J02J52
$$ plain form
1833 2015 2131 2361 2565 2885 3399 3825 4412 5325 6612 8984 14471 23365 28626 25160 16928 11762 9917 9439 8341 6413
1645 6413 5077 4570 4284 4187 3985 4078 5136 7659 5133 4974 5610 6666 8565 13364 20592 41179 42485 16255 9557
1467 9557 6910 5391 4387 3833 3358 2928 2539 2293 2202 1984 1925 1720 1662 1559 1344 1258 1262 1123 1313 1300 1124 1117 1029 1042 992 980
1223 980 958 912 855 939 884 778 777 828 772 768 669 704 746 752 711 706 646 597 596 549 552 620 613 561 500 473 496 450 493 434 494 489 414 383 510 487 445 444
866 444 407 406 433 440 378 458 417 394 352 401 275 386 396 355 293 320 303 303 276 376 268 234 275 222 319 262 184 208 168 145 107 129 149 350
547 350 756 1211 1370 1152 808 698 555 555 479 434 397 417 350 412 345 360 388 359 375 353 375 358 392 325 361 335 334 324 313 317 296 336 280
237 280 320 295 247 287 276 311 295 239 253 247 243 239 282 278 223 301 261 247 260 212 279 292 277 334 313 305 281 248 222 196 206 252 275 344 201 245 274
-111 274 237 215 213 215 286 214 203 246 220 209 215 180 124 175 239 189 193 235 206 177 149 243 249 192 129 138 125 119 95 67
$$ packed form
1833B015J16K30K04L20N14M26N87R13J287K372N487Q894N261l466q232n166j845m78j098j928
1645F413j336n07k86r7k02R3J058K523k526j59O36J056J899M799P228K0587J306k6230o698
1467I557k647j519j004n54m75m30l89k46r1k18n9k05n8j03k15q6Mj39J90j3j76pq8J3n0j2
1223I80k2m6n7Q4n5j06jN1n6mr9L5M2Om1no0m9jm7LO8pn2o1k7K3m6M3n9O0np5l1J27k3m2j
866D44l7jK7Po2Q0m1k3m2M9j26J11J0m1o2K7j7%k7J00j08l4M1n3R7n7p8K4m0k3l8K2K0K01
547C50M06M55J59k18l44j10j43%p6m5l7K0o7O2o7J5K8k9J6k2K2j7L4o7L6k6jj0j1Mk1M0n6
237B80M0k5m8M0j1L5j6n6J4ommM3mn5P8m0j4J3m8O7J3j5N7k1qk4l3k6k6J0M6K3O9j43M4K9
-111B74l7k2kKP1p2j1M3k6j1Ol5n6N1O4n0MM2k9k9k8R4On7o3Rj3ok4k8
-392F7
##PAGE=	F1=-7478.75
##FIRST=	19140.455529915001534,	4405.895418600002813,	0
##DATA TABLE=	(F2++(Y..Y)), PROFILE
$$ plain form
4406 54 35 71 99 147 30 138 155 133 41 123 181 136 137 135 149 134 204 135 126 72 196 172 87 177 165 131 145 94 193 141 211 164 193 170 174 156
4068 156 171 129 125 156 168 136 127 153 139 187 219 169 101 127 128 90 129 131 160 145 137 169 139 185 256 238 179 75 143 169 134 118 148 137 167 118 187
3720 187 146 138 133 161 155 195 171 173 215 213 200 122 197 191 182 136 133 228 230 190 195 153 184 120 286 270 279 298 242 253 233 285 238 176 234 238 248 227 200 156
3345 156 195 242 254 197 218 228 277 288 237 183 239 266 288 257 220 274 279 256 258 271 225 251 347 242 310 315 245 274 381 154 289 169 274
3035 274 244 319 279 356 292 256 232 277 235 270 314 320 257 366 75 173 328 191 295 256 248 324 319 265 391 388 373 358 306 437 749 1022
2734 1022 1023 510 345 274 272 261 296 215 296 305 251 320 307 266 318 320 349 256 304 306 289 320 344 375 335 397 412 397 430 382 389 424 407 407 475 470 464 438
2378 438 418 511 511 484 461 454 504 554 523 481 511 510 491 590 611 599 563 572 640 682 681 709 739 759 841 802 819 905 933 1089 1159 1368 1561 1792 2236
2049 2236 4145 10389 8369 4244 5060 3726 1067 674 563 604 612 706 768 856 859 898 917 1063 1162 1224 1346 1417 1539 1609 1794 1912
$$ packed form
4406E4j9L6K8M8j17J08J7k2r2Q2N8m5JkJ4j5P0o9rn4J24k4q5R0j2l4J4n1R9n2P0m7K9k3Mj8
4068A56J5m2mL1J2l2rK6j4M8L2n0o8K6Jl8L9KK9j5qL2l0M6P1j8n9j04O8K6l5j6L0j1L0m9O9
3720A87m1qnK8oM0k4KM2kj3p8P5orm6lR5Km0Nm2L1o4J66j6RJ9n6J1k0N2m7o2N8MJ0k1k7m4
3345A56L9M7J2n7K1J0M9J1n1n4N6K7K2l1l7N4Nk3KJ3m6K6R6j05O8Np0K9J07k27J35j20J05
3035B74l0P5m0P7o4l6k4M5m2L5M4Oo3J09k91R8J55j37J04l9qP6nn4J26lj5j5n2J31L12K73
2734A022Jn13j65p1kj1L5q1Q1Rn4O9j3m1N2KK9r3M8Kj7L1K4L1m0O2J5j5L3m8PL5j7%O8nok6
2378D38k0R3%k7k3pN0N0l1m2L0jj9R9K1j2l6RO8M2jK8L0K0Q2l9J7Q6K8J56P0K09J93K31M44
2049B236J909O244k020m125Q16j334k659l93j11M1QR4O2Q8LL9J9J46R9O2J22P1J22P0J85J18
$$ plain form
1805 1912 2165 2587 2885 3322 4022 5000 6761 10863 17522 21543 19044 12683 8616 7157 6925 6446 5294 4372 4024 3900
1617 3900 3915 3789 3965 5470 9615 6424 5787 6403 7571 9699 15159 23498 47300 48551 18281 10689 7677 6008
1448 6008 4891 4238 3699 3194 2759 2486 2381 2103 2044 1844 1745 1641 1396 1299 1298 1174 1377 1344 1166 1149 1051 1056 1015 995 977 935 886 938
1185 938 885 795 767 821 780 761 675 702 736 725 689 694 639 590 581 532 533 601 600 536 498 449 472 432 446 425 465 450 392 340 499 463 426 426 399 384 418
838 418 408 354 413 383 382 339 383 236 360 355 321 281 290 274 257 262 343 238 220 238 194 274 218 126 155 106 67 145 94 62 298 830 1384 1501
518 1501 1218 828 704 553 565 483 415 395 405 346 396 332 340 346 335 344 317 363 338 379 324 346 314 335 303 297 280 275 306 268 306 280 252 280 257
190 257 294 296 238 243 229 233 233 262 264 192 277 235 217 242 198 243 269 242 317 311 297 265 249 211 200 175 231 242 313 192 229 255 242 234 213 191 268 209
-167 209 178 244 226 169 196 153 98 169 199 181 168 222 183 165 132 216 223 184 112 134 109 109 90 67
$$ packed form
1805A912K53M22K98M37P00R78J761M102O659M021k499o361m067j459k32m79j152r22l48j24
1617C900J5j26J76J505M145l191o37O16J168K128N460Q339K3802J251l0270p592l012j669
1448F008j117o53n39n05m35k73j05k78n9k00r9j04k45r7jj24K03l3j78j7r8Nm1k0j8m2m9N2
1185I38n3r0k8N4m1j9q6K7L4j1l6Nn5m9rm9JO8jo4l8m9K3m0J4k1M0j5n8n2J59l6l7%k7j5L4
838D18j0n4N9l0jm3M4j47J24nl4m0Rj6j7NQ1j05j8J8m4Q0n6r2K9m9l9P8n1l2K36N32N54J17
518A501k83l90j24j51J2q2o8k0J0n9N0o4QOj1Rk7M6k5M1n5K2l2K1l2oj7nL1l8L8k6k8K8k3
190B57L7Kn8Nj4M%K9Kp2Q5m2j8K5m4M5K6k7P5oj4l2j6l8j1k5N6J1P1j21L7K6j3qk1k2P7n9
-167B09l1O6j8n7K7m3n5P1L0j8j3N4l9j8l3Q4Pl9p2K2k5%j9k3
-392F7
##PAGE=	F1=-7557.5
##FIRST=	19140.455529915001534,	4405.895418600002813,	0
##DATA TABLE=	(F2++(Y..Y)), PROFILE
$$ plain form
4406 56 41 73 95 155 43 139 153 138 72 97 178 141 133 134 146 122 212 158 155 65 190 194 79 150 154 111 144 83 196 148 206 160 197 156 146 152
4068 152 177 139 133 154 156 158 120 141 135 189 213 183 113 130 155 85 131 116 153 148 134 164 141 158 242 256 202 70 139 174 131 130 136 139 162 122 203 165
3711 165 144 132 159 165 172 168 184 209 222 208 129 173 207 197 153 108 199 213 202 200 165 182 94 272 270 279 297 242 232 228 283 243 165 231 261 252 237 214
3354 214 169 178 235 272 218 229 241 289 285 255 190 221 272 292 274 221 251 270 262 261 268 212 265 366 263 298 311 250 271 358 143 298 168 263 241
3026 241 318 269 339 291 277 252 274 252 256 322 336 262 362 107 197 346 193 286 273 262 327 335 272 377 392 406 382 342 368 681 947 975
2725 975 486 286 254 238 242 285 208 260 301 240 295 305 264 310 308 349 268 301 297 278 307 336 379 319 388 401 362 395 366 367 396 412 389 461 456 459 451
2378 451 416 489 507 480 448 432 481 516 494 458 493 497 475 579 584 560 543 571 629 667 661 711 698 756 826 773 780 848 889 1070 1144 1351 1502 1766
2058 1766 2220 4108 10728 9136 5083 6630 5085 1471 752 547 577 563 618 706 748 765 820 812 949 1063 1117 1227 1273 1396
$$ packed form
4406E6j5L2K2O0j12R6J4j5o6K5Q1l7qJJ2k4R0n4lr0J25Mj15P1Mm3L3o1J13m8N8m6L7m1j0O
4068A52K5l8oK1KKl8K1oN4K4l0p0J7K5p0M6j5L7nj4L0k3J7Q4J4n4j32O9L5m3jOLK3m0Q1l8
3711A65k1j2K7OPmJ6K5J3j4p9M4L4j0m4m5R1J4j1kl5J7q8J78kRJ8n5j0mN5m0p8O6L0rj5k3
3354B14m5RN7L7n4J1J2M8ml0o5L1N1K0j8n3L0J9qjPn6N3J01j03L5J3o1K1Q7k15J55j30R5k2
3026B41P7m9P0m8j4k5K2k2MO6J4p4J00k55R0J49j53R3j3j1O5Qo3J05J5J4k4m0K6L13K66K8
2725I75m89k00l2j6MM3p7N2M1o1N5J0m1M6kM1q1L3mj9K9K9M3o0O9J3l9L3k9JK9J6k3P2nLq
2378D51l5P3J8k7l2j6M9L5k2l6L5Mk2J04Nk4j7K8N8L8oN0j3N8P0n3PO8M1J81P4K07J51K64
2058A766M54J888O620j592m053J547j545l614p19k05L0j4N5Q8M2J7N5qJ37J14N4J10M6J23
$$ plain form
1833 1396 1440 1620 1703 1921 2287 2533 2903 3498 4379 5877 9419 15079 18455 16449 10999 7434 6047 5711 5346 4548 3873
1636 3873 3590 3543 3585 3446 3551 5353 11662 8328 7020 7502 8743 11041 17129 26461 53445 54895 20439 11929 8508
1457 8508 6686 5462 4724 4124 3553 3078 2763 2639 2327 2232 2065 1911 1817 1534 1420 1393 1287 1516 1449 1286 1233 1152 1124 1097 1070
1223 1070 1054 1023 993 1010 948 886 832 869 854 819 736 757 786 771 731 743 696 646 632 586 573 633 653 581 561 496 502 481 459 476 486 472 425 347 524
894 524 486 449 456 439 411 452 428 389 419 393 411 379 420 252 367 367 328 320 310 295 255 278 350 255 259 243 216 272 227 124 153 101 66 190 113
565 113 39 239 837 1499 1621 1289 866 737 571 600 523 437 421 428 369 421 353 354 344 341 330 317 357 348 371 353 357 318 351 313 321 276 278 306 277
237 277 310 280 283 304 256 297 318 268 275 230 242 260 266 292 191 276 245 208 240 214 229 258 224 302 321 312 269 269 221 235 177 221 231 297 199 230 252
-111 252 262 277 243 203 262 236 170 258 264 163 209 156 102 180 174 181 166 219 183 167 133 206 212 193 123 144 105 106 79 66
$$ packed form
1833A396M4J80Q3K18L66K46L70N95Q81J498L542N660L376k006n450l565j387l36l65p98o75
1636C873k83m7M2j39J05J802O309l334j308M82J241K298O088R332K6984J450l4456q510l421
1457H508j822j224p38o00n71m75l15j24l12r5j67j54r4k83j14k7j06K29o7j63n3q1k8k7k7
1223A070j6l1l0J7o2o2n4L7j5l5q3K1K9j5m0J2m7n0j4m6j3O0K0p2k0o5Ok1k2J7J0j4m7p8J77
894E24l8l7Pj7k8M1k4l9L0k6J8l2M1j68J15%l9qj0j5m0K3P2r5Mj6k7N6m5j03K9n2l5J24p7
565A13p4K00N98O62J22l32m23j29j66K9p7q6j6Pn9N2o8Jj0lj1j3M0rK3j8Ml9L3l8Qm5KK8k9
237B77L3l0LK1m8M1K1n0Pm5J2J8OK6j01Q5l1l7L2k6J5K9l4P8J9rm3%m8J4n8M4J0O6r8L1K2
-111B52J0J5l4m0N9k6o6Q8Oj01M6n3n4P8oPj5N3l6j6l4P3Oj9p0K1l9Jk7j3
-392F6
##PAGE=	F1=-7636.26
##FIRST=	19140.455529915001534,	4405.895418600002813,	0
##DATA TABLE=	(F2++(Y..Y)), PROFILE
$$ plain form
4406 63 47 84 97 167 62 160 174 157 126 106 193 175 156 156 170 131 231 193 211 107 205 242 119 162 180 122 155 101 207 171 228 189 229
4096 229 184 145 158 198 170 168 171 168 199 151 146 153 217 228 210 149 152 207 111 170 141 169 184 159 183 180 159 245 290 243 108 158 206 153 175 163 169 185
3739 185 152 242 211 181 169 195 209 189 193 232 224 259 249 180 168 239 245 212 145 204 219 238 231 204 222 113 277 298 316 326 285 241 253 299 275 180
3401 180 251 310 293 277 254 220 201 253 312 276 270 281 340 311 299 233 240 309 336 333 271 268 293 300 305 301 238 304 415 321 332 342 294 306 392 147 348
3054 348 231 293 279 355 305 359 310 325 319 315 303 288 366 383 295 363 82 244 427 270 322 335 329 391 402 345 414 448 483 463 450 385 653
2744 653 885 903 454 258 282 258 273 325 247 280 340 289 332 349 320 363 355 393 328 363 356 341 350 388 448 378 444 465 395 421 415 407 420 475 444 515
2406 515 505 508 519 497 539 567 546 511 482 540 551 540 500 546 553 532 643 633 586 587 644 699 722 713 771 724 814 871 806 806 854 899 1077 1143 1340 1422
2068 1422 1660 2104 3924 10898 10164 6434 9651 8006 2552 1333 945 889 845 833 937 942 953 1018 976 1087 1221 1272 1391 1409
$$ packed form
4406F3j6L7J3P0j05R8J4j7l1k0Q7j8j9%J4l9J00l8J8j04R8L7j23M3J8n8L3n4J06l6N7l9M0
4096B29m5l9J3M0k8kLlL1m8nPO4J1j8o1LN5r6N9k9K8J5k5K4lk1Q6M5m7j35N0M8n3K2j2OJ6
3739A85l3R0l1l0j2K6J4k0ML9qL5j0o9j2P1Ol3o7N9J5J9pk7J8j09J64K1J8J0m1m4J2M6k4r5
3401A80P1N9j7j6k3l4j9N2N9l6oJ1N9k9j2o6PO9K7lo2lK5PNmo3O6J11r4J1J0m8J2Q6k45K01
3054C48j17O2j4P6n0N4m9J5omj2j5P8J7q8O8k81J62J83j57N2J3oO2J1n7O9L4L5k0j3o5K68
2744F53K32J8m49j96K4k4J5N2p8L3O0n1M3J7k9M3qL8o5L5pj5RL8O0p0O6K1p0K6oqJ3N5l1P1
2406E15j0LJ1k2M2K8k1l5k9N8J1j1m0M6Pk1J11j0m7JN7N5K3rN8m7R0N7o5%M8M5J78O6J97Q2
2068A422K38M44J820O974p34l730L217j645n454j219l88n6m4j2J04NJ1O5m2J11J34N1J19J8
$$ plain form
1842 1409 1532 1565 1737 1819 2021 2330 2521 2829 3335 4129 5409 8491 13288 15884 14006 9297 6309 5154 4846 4551 3969
1645 3969 3496 3259 3252 3270 3059 2775 4154 12998 10827 9174 9716 11317 14247 22010 34094 68493 70825 26229 15333
1467 15333 10900 8569 7036 6082 5316 4583 4010 3613 3414 3054 2852 2706 2482 2368 2028 1874 1784 1665 1984 1847 1681 1563
1260 1563 1509 1426 1396 1362 1326 1303 1313 1300 1200 1156 1097 1093 1106 1054 956 971 988 974 932 932 897 844 817 781 752 794 826 767 749 682 654 649 607 637 631 616
922 616 566 471 666 623 572 584 576 544 586 548 531 532 501 523 516 557 372 449 475 412 442 422 410 346 362 434 347 371 332 324 353 315 209 221 177 148
584 148 282 203 130 112 752 1554 1770 1416 967 831 645 687 619 531 507 521 454 520 443 436 432 415 376 390 395 426 407 434 422 387 406 381 397
274 397 341 332 369 336 364 322 354 379 308 346 376 344 365 283 296 333 314 370 261 328 311 257 286 280 283 295 265 316 362 369 318 325 268 313 241 252 271
-73 271 323 239 265 284 309 353 315 278 293 297 213 304 340 220 264 210 149 228 208 212 210 250 220 202 171 237 234 229 175 181 147 135 80 73
$$ packed form
1842A409J23L3J72Q2K02L09J91L08N06P94J280L082M797K596j878m709k988j155l08k95n82
1645C969m73k37pJ8k11k84J379Q844k171j653N42J601K930P763J2084L4399K332m4596j0896
1467A5333m433k331j533r54p66p33n73l97j99l60k02j46k24j14l40j54r0j19L19j37j66j18
1260A563n4q3l0l4l6k3J0j3j00m4n9mJ3n2r8J5J7j4m2%l5n3k7l6k9M2L2n9j8o7k8nm2L0oj5
922F16n0r5J95m3n1J2ql2M2l8j7Jl1K2pM1j85P7K6o3L0k0j2o4J6P2q7K4l9qK9l8j06J2m4k9
584A48J34p9p3j8O40Q02K16l54m49j36j86M2o8q8k4J4o7O6p7pmj7l9J4NL1j9K7j2l5J9k5J6
274C97n6rL7l3K8m2L2K5p1L8L0l2K1q2J3L7j9N6j09O7j7n4K9oLJ2l0N1M6Pn1Pn7M5p2J1J9
-73B71N2q4K6J9K5M4l8l7J5Mq4R1L6j20M4n4o1P9k0MkM0l0j8l1O6lnn4Ol4j2n5p
-392G3
##PAGE=	F1=-7715.01
##FIRST=	19140.455529915001534,	4405.895418600002813,	0
##DATA TABLE=	(F2++(Y..Y)), PROFILE
$$ plain form
4406 77 51 101 111 185 88 200 213 191 197 171 231 236 212 200 223 170 269 237 284 178 247 301 191 216 234 180 190 162 237 211 268 245 286 245 185
4077 185 184 232 219 229 211 211 257 214 176 196 271 263 252 205 201 274 162 240 198 216 252 208 233 249 202 275 340 294 180 205 267 199 245 222 228 247
3739 247 213 311 279 244 236 272 284 252 250 316 281 319 312 265 209 291 319 297 233 264 267 300 293 273 296 180 319 362 391 389 361 293 318 339 332 227 299
3392 299 384 368 346 316 299 271 311 376 365 347 350 419 369 359 304 302 376 416 424 355 328 352 371 381 369 302 373 488 397 403 402 367 367 463 153 436
3054 436 346 373 358 426 383 416 352 401 417 397 378 358 441 447 338 349 75 381 568 413 419 444 447 514 525 473 511 552 599 589 599 505 690
2744 690 836 782 357 268 358 333 359 416 326 364 421 395 429 443 432 475 459 482 428 483 475 473 455 500 571 503 563 594 490 507 525 509 496 587
2425 587 562 639 618 610 634 636 652 676 665 631 599 661 645 645 598 665 667 659 773 739 661 694 774 831 833 821 865 790 900 939 856 854 890 929 1070 1098 1237
2077 1237 1227 1378 1769 3538 11255 11745 8201 13603 11916 4063 2261 1670 1507 1412 1333 1429 1414 1409 1479 1398 1481 1616 1652 1785
$$ packed form
4406G7k6N0J0P4r7J12J3k2Ok6O0Nk4j2K3n3R9l2M7j06O9N4j10K5J8n4J0k8P5k6N7k3M1m1o0
4077A85jM8j3J0j8%M6m3l8K0P5qj1m7mP3j12P8m2J8L6m4K5J6m7P3O5m6j14K5O2o8M6k3OJ9
3739B47l4R8l2l5qL6J2l2kO6l5L8pm7n6Q2K8k2o4L1LL3pk0K3j16J39M3K9kk8o8K5K1pj05P2
3392B99Q5j6k2l0j7k8M0O5j1j8LO9n0j0n5kP4M0Qo9k7K4J9J0j2o7P1J15r1Ojl5%R6l10K83
3054D36r0K7j5O8m3L3o4M9J6k0j9k0Q3Oj09J1k74L06J87j55OK5LO7J1n2L8M1M7j0J0r4J85
2744F90J46n4m25q9R0k5K6N7r0L8N7k6L4J4j1M3j6K3n4N5qkj8M5P1o8O0L1j04J7J8j6j3R1
2425E87k5P7k1qK4KJ6K4j1l4l2O2j6%m7O7KqJ14l4p8L3Q0N7Kj2M4p5J10L9q3kL6L9J41K8J39
2077A237j0J51L91J769P717M90l544N402j687p853j802n91j63r5p9R6j5nP0q1Q3J35L6J33
$$ plain form
1852 1785 1773 1884 1915 2053 2138 2335 2583 2668 2894 3282 3918 4896 7356 11047 12759 11150 7512 5205 4527 4491 4529 4313 4147
1636 4147 4076 4159 4225 4091 3437 2202 13537 14000 12701 13776 16287 20756 32194 50402 100536 104453 38618 22588
1467 22588 16064 12577 10358 8924 7790 6712 5903 5364 5014 4533 4173 3979 3668 3466 3040 2807 2634 2452 2938 2696 2472
1270 2472 2285 2225 2083 2025 1977 1900 1861 1924 1885 1727 1669 1620 1575 1597 1526 1403 1409 1397 1379 1339 1314 1285 1224 1174 1145 1110 1131 1149 1115 1090 1025 961 954
960 954 917 934 933 902 839 735 978 913 835 839 842 810 847 793 794 772 733 751 770 808 604 647 691 598 666 641 636 551 551 622 531 566 527 531 544 494 389
612 389 384 360 337 486 403 327 135 658 1637 2010 1627 1155 997 793 838 770 692 658 687 610 691 606 586 603 567 505 537 511 579 524 576
321 576 551 534 520 513 525 478 451 500 461 490 427 476 507 427 457 484 468 507 403 408 451 417 491 398 441 428 372 393 398 411 407 376 395 455 474 418 425
-26 425 357 432 356 345 371 403 328 344 363 394 465 423 401 371 388 316 396 449 325 355 309 232 323 308 292 303 333 298 282 255 320 298 297 262 255 238
$$ packed form
1852A785j2J11L1J38Q5J97K48Q5K26L88O36R78K460L691J712j609l638k307o78l6L8k16j66
1636D147p1Q3O6j34o54j235J1335M63j299J075K511M469J1438J8208N0134L917o5835j6030
1467B2588o524l487k219j434j134j078q09n39l50m81l60j94l11k02m26k33j73j82M86k42k24
1270B472j87o0j42n8m8p7l9O3l9j58n8m9m5K2p1j23Oj2j8m0k5k9o1n0k9l5K1J8l4k5o5o4p
960I54l7J7jl1o3j04K43o5p8MLl2L7n4Jk2l9J8J9L8k04M3M4r3O8k5nq5%P1r1L5l9MJ3n0j05
612C89nk4k3J49q3p6j92N23R79L73l83m72j58k04M5o8p8l4K9p7Q1q5k0J7l6o2L2k6O8n5N2
321E76k5j7j4pJ2m7k7M9l9K9o3M9L1q0L0K7j6L9j04NM3l4P4r3M3j3n6K1NJ3ml1J9O0J9n6P
-26D25o8P5p6j1K6L2p5J6J9L1P1m2k2l0J7p2Q0N3j24L0m6p7R1j5j6J1L0l5j6k7O5k2jl5pj7
$$ plain form
-364 238 204 114 97
$$ packed form
-364B38l4r0j7
-392I7
##PAGE=	F1=-7793.77
##FIRST=	19140.455529915001534,	4405.895418600002813,	0
##DATA TABLE=	(F2++(Y..Y)), PROFILE
$$ plain form
4406 98 49 116 134 206 121 251 261 238 278 259 288 311 285 260 292 232 325 287 361 259 309 362 273 287 298 265 245 247 291 267 314 312 355 317 249
4077 249 233 279 280 303 268 275 330 290 229 259 337 307 304 272 268 350 229 325 268 290 339 274 306 330 277 331 402 349 271 278 346 266 332 299 307 337 300
3730 300 405 361 319 316 376 377 342 329 419 374 393 383 363 290 364 407 394 340 358 346 382 377 362 383 272 399 450 486 474 448 372 410 398 403 301
3401 301 372 476 463 433 390 392 370 404 460 469 449 434 501 447 420 392 394 463 517 531 450 411 433 458 474 456 389 466 570 474 488 475 458 439 541
3073 541 169 557 490 484 465 515 482 492 414 496 531 499 468 452 532 509 381 323 261 623 750 592 560 581 596 668 677 626 643 675 728 725 743
2763 743 645 754 755 581 258 369 492 461 499 552 446 502 545 545 573 579 587 634 605 608 562 645 637 649 606 658 729 670 725 759 625 636 683 660
2443 660 616 735 722 810 776 756 788 809 805 814 819 788 765 825 779 792 743 836 824 844 951 884 780 863 950 1006 982 968 982 888 1006 1014 909 917 955
2115 955 982 1047 996 991 852 862 1204 3148 12283 13712 9894 17422 15887 5709 3349 2572 2301 2141 1999 2082 2053 2034 2101 1983
$$ packed form
4406I8m9O7J8P2q5J30J0k3M0j9K9K3k6k5L2o0R3l8P4j02N0N3q9J4J1l3k0KM4k4M7kM3l8o8
4077B49j6M6JK3l5PN5m0o1L0P8l0ll2mQ2j21R6n7K2M9o5L2K4n3N4P1n3p8PO8q0O6l3QL0l7
3730C00J05m4m2lO0Jl5j3R0m5J9j0k0p3P4M3j3n4J8j2L6nj5K1j11J27N1L6j2k6p6L8j2Nj02
3401C01P1J04j3l0m3Kk2L4N6Rk0j5O7n4k7k8KO9N4J4q1l9K2K5J6j8o7P7J04r6J4j3j7j9J02
3073E41l72L88o7oj9N0l3J0p8Q2L5l2l1j6Q0k3j28n8o2L62J27j58l2K1J5P2Rn1J7L2N3lJ8
2763G43r8J09Jj74l23J11J23l1L8N3j06N6M3%K8OQM7k9Lm6Q3qJ2m3N2P1n9N5L4j34J1M7k3
2443F60m4J19j3Q8l4k0L2K1mRNl1k3O0m6J3m9R3j2K0J07o7j04Q3Q7N6k4j4J4r4J18Qj05QL8
2115I55K7O5n1nj39J0L42J944R135J429l818P528j535j0178k360p77k71j60j42Q3k9j9O7j18
$$ plain form
1889 1983 2050 2165 2181 2319 2285 2379 2412 2494 2575 2761 2938 2867 2999 3228 3615 4175 5865 8391 9782 9391 7409 5556 5368 5576
1664 5576 5906 5985 6063 6197 6410 6626 6696 6181 3293 13890 17569 17160 19119 22924 29561 46100 72796 144913 150764
1486 150764 55702 32568 23184 18089 14924 12820 11169 9612 8459 7733 7186 6517 5991 5692 5272 4940 4403 4063 3806
1307 3806 3538 4226 3859 3534 3288 3184 2985 2889 2820 2697 2622 2738 2671 2447 2352 2314 2241 2250 2157 2014 2003 1949 1922 1884 1833 1807 1732 1651 1625
1035 1625 1590 1591 1581 1567 1541 1471 1373 1356 1329 1328 1342 1284 1205 1094 1409 1305 1203 1188 1204 1167 1197 1126 1138 1093 1052 1069 1106 1135 912 934 978 864
734 864 967 937 942 837 829 891 792 829 802 814 821 748 649 638 635 632 793 702 633 508 845 1902 2356 1864 1377 1187 971 1018 937 874 840 887
434 887 804 893 803 769 808 759 685 718 682 771 696 754 715 722 679 681 683 647 612 667 630 659 578 636 663 584 610 625 621 675 560 560 595 556 631 564 590
86 590 568 527 537 544 575 562 523 531 588 611 549 553 473 574 491 481 505 516 451 455 474 510 599 553 537 478 494 454 523 577 446 463 431 333 450 436
$$ packed form
1889A983O7J15J6J38l4R4L3Q2Q1J86J77p1J32K29L87N60J690K526J391l91j982j853j88K08
1664E576L30P9P8J34K13K16P0n15k888J0597L679m09J959L805O637J6539K6696P2117N851
1486A50764r5062k3134r384n095l165k104j651j557j153p26n47o69n26k99m20l32n37l40k57
1307C806k68O88l67l25k46j04j99r6o9j23p5J16o7k24r5l8p3Rr3j43j1n4k7l8n1k6p5q1k6
1035A625l5Jj0j4k6p0r8j7k7jJ4n8p9j11L15j04j02j5J6l7L0p1J2m5m1J7L7K9k23K2M4j14
734H64J03l0Nj05qO2r9L7k7J2Pp3r9j1llJ61r1o9j25L37J057M54m92m87j90k16M7q1o3l4M7
434H87q3Q9r0l4L9m9p4L3l6Q9p5N8l9Pm3KKl6l5N5l7K9q1N8K7p9K6J5mN4j15%L5l9P5o7K6
86E90k2m1J0PL1j3l9QN7K3o2Mq0J01q3j0K4J1o5MJ9L6Q9m6j6n9J6m0O9N4j31J7l2r8J17j4
$$ plain form
-252 436 406 424 451 401 391 373 438 391 391 369 353 353 291 169 133
$$ packed form
-252D36l0J8K7n0j0j8O5m7%k2j6%o2j22l6
-392A33
##PAGE=	F1=-7872.52
##FIRST=	19140.455529915001534,	4405.895418600002813,	0
##DATA TABLE=	(F2++(Y..Y)), PROFILE
$$ plain form
4406 119 43 126 158 225 159 302 306 291 356 343 351 384 356 321 360 300 385 335 430 339 375 413 348 355 357 354 307 333 356 325 356 375 419 381 317 294 331
4058 331 341 375 326 346 406 363 295 330 402 347 357 340 340 424 302 410 336 378 428 344 383 407 356 399 464 399 367 360 429 343 419 375 389 432 400
3730 400 506 440 392 394 482 469 435 410 517 476 463 447 455 380 444 491 487 442 455 431 464 462 455 463 370 491 539 573 554 524 453 505 459 472 386 453
3392 453 567 555 520 461 483 474 505 546 568 552 513 565 524 469 485 493 550 618 630 535 494 517 542 564 539 479 564 640 540 561 543 554 512 602 255
3063 255 694 637 599 578 598 575 565 488 599 640 599 560 553 621 558 431 328 525 918 933 770 707 715 743 814 822 768 769 781 832 830 841 731
2753 731 778 586 321 433 572 674 634 679 713 597 670 700 718 739 738 762 815 771 751 717 825 818 840 780 835 894 851 900 930 774 788 864
2453 864 832 764 901 899 996 952 929 962 994 971 960 988 964 960 1010 939 968 925 1039 1010 1066 1153 1057 951 1081 1155 1205 1156 1142 1126 1033 1149 1112
2143 1112 999 1039 1096 1116 1076 924 662 331 134 790 3216 14018 15470 10934 20031 18959 7154 4379 3466 3103 2878
$$ packed form
4406A19p6Q3L2O7o6J43Mj5O5j3QL3k8l5L9o0Q5n0R5r1L6L8o5PKlm7K6K3l1L1J9M4l8o4k3L7
4058C31J0L4m9K0O0m3o8L5P2n5J0j7%Q4j22J08p4M2N0q4L9K4n1M3O5o5l2pO9q6P6m4J4M3l2
3730D00J06o6m8KQ8j3l4k5J07m1j3j6Qp5O4M7mm5J3k4L3kpQr3J21M8L4j9l0p1N2m6J3q6O7
3392D53J14j2l5n9K2rL1M1K2j6l9N2m1n5J6QN7O8J2r5m1K3K5K2k5o0Q5P6j00K1j8J1m2R0l47
3063B55M39n7l8k1K0k3j0p7J11M1m1l9pO8o3j27j03J97L93J5j63o3QK8P1Qn4JJ2N1kJ1j10
2753G31M7j92k65J12J39J02m0M5L4j16P3L0J8K1jK4N3m4k0l4J08pK2o0N5N9m3M9L0j56J4P6
2453H64l2o8J37kR7m4k3L3L2k3j1K8k4mN0p1K9m3J14k9N6Q7r6j06J30P4N0m9j4j6r3J16l7
2143A112j13M0N7K0m0j52k62l31j97O56K426J0802J452m536R097j072j1805k775r13l63k25
$$ plain form
1946 2878 2685 2756 2716 2689 2743 2598 2658 2746 2745 2875 2835 2923 2955 2978 3056 3219 3306 3068 3120 3162 3207 3184 3924 5623 8230 10005 9303 7336
1683 7336 7293 7549 7904 8071 8289 8591 8940 9337 9614 9373 6870 14826 20847 21483 24396 29523 38366 60082 95389 190073
1495 190073 197829 73065 42712 30432 23700 19582 16792 14609 12564 11054 10144 9395 8526 7858 7436 6907 6441 5798
1326 5798 5348 5016 4669 5541 5052 4623 4333 4165 3912 3780 3690 3528 3409 3572 3472 3190 3055 3020 2932 2917 2802 2652 2615 2512 2478
1091 2478 2439 2370 2347 2256 2146 2121 2086 2067 2026 2027 2010 1928 1801 1773 1754 1740 1763 1678 1586 1473 1859 1710 1592 1558 1586 1540 1560 1475 1491 1423 1387 1412
791 1412 1455 1471 1239 1249 1274 1157 1288 1249 1267 1148 1138 1183 1084 1114 1103 1124 1132 1035 948 942 957 987 1140 1047 1005 958 1348 2370 2715 2004 1533
500 1533 1317 1106 1163 1065 1021 997 1062 982 1071 978 932 992 935 860 883 857 949 864 922 868 901 840 841 837 805 776 825 798 825 735 798 810 735 765 766
171 766 773 832 713 714 732 698 759 722 736 697 685 678 688 732 715 664 682 724 744 676 678 587 710 615 622 635 625 578 566 587 631 727 677 654 581 592 592
$$ packed form
1946B878j93P1m0k7N4j45O0Q8jJ30m0Q8L2K3P8J63Q7k38N2M2M5k3P40J699K607J775p02j967
1683G336m3K56L55J67K18L02L49L97K77k41k503P956O021O36K913N127Q843K1716L5307R4684
1495A90073P756j24764l0353j2280o732m118k790k183k045j510r10p49q69o68m22n29m66o43
1326E798m50l32l47Q72m89m29k90j68k53j32r0j62j19J63j00k82j35l5q8j5j15j50l7j03l4
1091B478l9o9k3r1j10k5l5j9m1Jj7q2j27k8j9j4K3q5r2j13L86j49j18l4K8m6K0q5J6o8l6K5
791A412M3J6k32J0K5j17J31l9J8j19j0M5r9L0j1K1Qr7q7oJ5L0J53r3m2m7L90J022L45p11m71
500A533k16k11N7r8m4k4O5q0Q9r3m6O0n7p5K3k6R2q5N8n4L3o1Jml2k9M9k7K7r0O3J2p5L0J
171G66PN9j19JJ8l4O1l7J4l9j2pJ0M4j7n1J8M2K0o8Kr1J23r5PJ3j0m7j2K1M4R6n0k3p3J1%
$$ plain form
-176 592 653 696 557 565 548 433 582 557 525 543 572 505 503 498 557 486 489 478 453 466 372 224 168
$$ packed form
-176E92O1M3j39Qj7j15J49k5l2J8K9o7knN9p1Lj1k5J3r4j48n6
-392A68
##PAGE=	F1=-7951.28
##FIRST=	19140.455529915001534,	4405.895418600002813,	0
##DATA TABLE=	(F2++(Y..Y)), PROFILE
$$ plain form
4406 134 35 127 174 233 197 338 339 338 417 402 401 440 406 370 414 356 430 370 476 402 425 446 402 404 399 426 360 402 409 368 385 421 461 424 372 349 375
4058 375 390 430 371 406 469 416 357 395 448 370 401 396 399 483 369 478 389 460 501 401 443 461 421 458 510 437 449 433 497 416 489 434 459 512
3739 512 491 590 499 447 455 569 540 511 473 589 557 511 489 522 455 515 554 557 517 528 496 525 527 529 517 456 568 605 630 605 572 516 577 503 524
3411 524 466 520 634 623 588 514 555 559 587 612 640 628 563 597 582 499 568 576 619 697 701 591 557 585 602 633 597 556 643 677 585 610 595 640 574
3082 574 637 413 821 757 687 673 655 645 622 560 689 727 679 639 644 691 596 509 415 807 1196 1071 905 818 812 853 917 919 865 852 839 880 874
2772 874 862 726 721 322 355 786 819 867 819 863 868 754 836 858 880 895 887 925 981 925 882 867 990 985 1008 942 995 1036 1013 1052 1073 910 934 1036
2453 1036 994 912 1056 1062 1159 1113 1099 1132 1162 1121 1093 1148 1138 1154 1193 1107 1152 1123 1245 1199 1294 1350 1243 1170 1316 1364 1404 1340 1327 1304 1236 1342
2152 1342 1263 1181 1269 1356 1391 1270 1088 700 684 933 1589 4157 16195 16543 10944 20670 20364 8067 5109 4137 3715 3442
$$ packed form
4406A34r9R2M7N9l6J41JjP9j5jL9l4l6M4n8P4o0J06p4K3K1m4KnK7o6M2Pm1J7L6M0l7n2k3K6
4058C75J5M0n9L5O3n3n9L8N3p8L1nLQ4j14J09q9P1M1j00M2J8m0L7N2p3J2j6O4q1P3n5K5N3
3739E12k1R9r1n2QJ14k9k9l8J16l2m6k2L3o7O0L9Lm0J1l2K9KKj2o1J12L7K5k5l3n6O1p4K1
3411E24n8N4J14j1l5p4M1MK8K5K8j2o5L4j5q3O9QM3P8Mj10l4K8J7L1l6m1Q7L4r2K5j5M5o6
3082E74O3k24M08o4p0j4j8j0k3o2J29L8m8m0NM7r5q7r4L92L89j25j66q7oM1O4Kn4j3j3M1o
2772H74j2j36nl99L3M31L3M8m8M4Nj14Q2K2K2J5qL8N6n6m3j5J23nK3o6N3M1k3L9K1j63K4J02
2453A036m2q2J44OR7m6j4L3L0m1k8N5j0J6L9q6M5k9J22m6R5N6j07p3J46M8M0o4j3k3o8J06
2152A342p9q2Q8Q7L5j21j82l88j6K49O56K568J2038L48n599R726l06j2297k958r72m22k73
$$ plain form
1946 3442 3218 3285 3235 3207 3238 3085 3146 3209 3205 3313 3289 3386 3412 3391 3478 3615 3609 3259 3284 3177 2884 2181 1568 3890 8907 11966 11465
1692 11465 9097 9006 9236 9490 9657 9976 10409 10874 11433 11890 11933 10153 16326 23000 24518 28193 34320 44828 70429 112212
1504 112212 224071 233317 86164 50377 35924 27950 23131 19818 17227 14812 13032 11990 11078 10059 9300 8778
1354 8778 8162 7597 6883 6348 5961 5565 6559 5976 5470 5159 4931 4633 4477 4372 4186 4026 4223 4093 3772 3611 3570 3476 3433 3303
1129 3303 3164 3092 2944 2912 2869 2793 2774 2673 2540 2517 2482 2444 2379 2388 2387 2293 2145 2112 2094 2073 2098 1995 1897 1787 2219 2030 1910 1860 1899 1841
847 1841 1851 1760 1773 1684 1659 1699 1739 1739 1516 1514 1508 1408 1556 1507 1540 1412 1404 1431 1344 1361 1362 1395 1408 1293 1220 1232 1256 1324 1445 1363 1364 1397 1910 2862
528 2862 2938 1937 1533 1315 1139 1214 1105 1086 1086 1160 1096 1175 1085 1028 1108 1049 984 989 984 1070 979 1037 966 1024 956 949 951 912 900 936 920 941 856 923
209 923 911 842 882 867 887 942 824 831 830 804 845 834 842 783 807 778 794 845 823 766 801 827 839 769 769 669 809 700 731 730 699 680 649 672 723 815
$$ packed form
1946C442k24O7n0k8L1j53O1O3mJ08k4R7K6k1Q7J37ol50K5j07k93p03o13K322N017L059n01
1692A1465k368r1K30K54J67L19M33M65N59M57M3j780O173O674J518L675O127J0508K5601M1783
1504A12212J11859R246j47153l5787j4453p974m819l313k591k415j780j042r12j019p59n22
1354H778o16n65p14n35l87l96R94n83n06l11k28k98j56j05j86j60J97j30l21j61m1r4m3j30
1129C303j39p2j48l2m3p6j9j01j33k3l5l8o5Rjr4j48l3j8k1K5j03r8j10M32j89j20n0L9n8
847A841J0r1J3q9k5M0M0%k23koj00J48m9L3j28qK7q7J7JL3J3j15p3J2K4O8J21q2JL3N13R52
528B862P6j001m04k18j76P5j09j9%P4o4P9r0n7Q0n9o5NnQ6r1N8p1N8o8pKl9j2L6j6K1q5O7
209I23j2o9M0j5K0N5j18Pjk6M1j1Qn9K4k9J6N1k2n7L5K6J2p0%j00J40j09L1jl1j9l1K3N1R2
$$ plain form
-129 815 767 724 649 660 697 753 778 632 638 635 512 687 641 617 635 665 587 592 605 648 559 569 565 532 554 426 262 194
$$ packed form
-129H15m8m3p5J1L7N6K5j46Olj23J75m6k4J8L0p8NJ3M3q9J0ml3K2j28j64o8
-392A94
##PAGE=	F1=-8030.03
##FIRST=	19140.455529915001534,	4405.895418600002813,	0
##DATA TABLE=	(F2++(Y..Y)), PROFILE
$$ plain form
4406 136 25 119 178 227 227 350 352 367 445 424 426 465 424 395 442 388 445 383 489 436 446 455 426 425 417 468 388 439 434 383 393 440 471 439 404 385 403
4058 403 415 454 394 442 504 437 403 437 464 371 426 428 432 517 417 517 421 519 545 433 470 480 454 491 528 454 500 481 535 469 528 465 501 558
3739 558 550 639 524 471 486 615 574 553 503 617 595 526 500 550 496 556 580 591 548 559 523 550 558 566 533 513 608 630 638 612 584 547 609 521 550
3411 550 524 554 656 649 621 538 592 607 629 640 668 659 572 591 608 510 624 625 655 737 729 607 590 621 624 667 617 606 685 674 604 626 624 701 613 640
3073 640 591 907 823 729 728 672 677 654 617 748 774 725 693 708 728 628 612 556 1043 1387 1125 965 862 846 897 951 945 894 869 835 857 846
2772 846 801 636 591 241 754 1133 1036 1020 970 1007 978 876 959 981 995 1002 993 1040 1095 1033 972 980 1103 1101 1117 1058 1102 1123 1122 1149 1161 1008 1041 1159
2453 1159 1110 1030 1166 1177 1265 1227 1230 1262 1280 1227 1188 1270 1277 1308 1337 1252 1308 1298 1412 1357 1483 1506 1413 1394 1517 1541 1572 1505 1496 1495 1468 1563 1463 1443
2134 1443 1572 1694 1763 1630 1516 1285 1566 2035 2919 5763 18620 16962 9928 19134 19749 8220 5345 4402 3965 3674
$$ packed form
4406A36j11R4N9M9%J23KJ5P8k1KL9m1k9M7n4N7o2J06n3J0Rk9jqN1q0N1nn1J0M7L1l2l5j9J8
4058D03J2L9o0M8O2o7l4L4K7r3N5KMQ5j00J00r6R8K6j12L7J0k6L7L7p4M6j9N4o6N9o3L6N7
3739E58qQ9j15n3J5J29m1k1n0J14k2o9k6N0n4O0K4J1m3J1l6K7QQl3k0R5K2Qk6k8l7O2q8K9
3411E50k6L0J02pk8q3N4J5K2J1K8rq7J9J7r8J14JL0Q2qj22j7L1LM3n0j1P9j1p0K2kP7q8K7
3073F40m9L16q4r4jn6Nk3l7J31K6m9l2J5K0j00j6n6M87L44k62j60j03j6N1N4on1k5l4K2j1
2772H46m5j65m5l50N13L79r7j6n0L7k9j02Q3K2J4PrM7N5o2o1QJ23kJ6n9M4K1jK7J2j53L3J18
2453A159m9q0J36J1Q8l8LL2J8n3l9Q2PL1K9q5N6j0J14n5J26K3r3j9J23K4L1o7rjk7R5j00k0
2134A443J29J22O9j33j14k31K81M69Q84K844J2857j658p034R206O15j1529k875r43m37k91
$$ plain form
1946 3674 3445 3517 3461 3435 3439 3300 3366 3415 3422 3500 3511 3631 3643 3603 3710 3829 3760 3392 3458 3317 2898 2014 908 5020 10843 13691 12722
1692 12722 9993 9785 9953 10069 10212 10613 11131 11670 12332 12917 13197 12207 17506 23369 25416 29475 36023 47224 74395
1514 74395 118828 237895 247886 91566 53558 38229 29730 24646 21113 18342 15772 13884 12798 11800 10724 9949
1364 9949 9374 8716 8113 7385 6810 6402 6000 7021 6395 5860 5558 5289 4965 4803 4694 4504 4315 4525 4376 4046 3878 3826 3733
1148 3733 3667 3535 3420 3312 3131 3109 3062 2991 2982 2879 2734 2714 2679 2625 2548 2559 2577 2476 2319 2287 2266 2245 2264 2158 2060 1959 2397 2184 2077
875 2077 2019 2063 1997 1997 1909 1914 1811 1800 1856 1886 1872 1679 1663 1624 1557 1704 1645 1693 1565 1562 1570 1507 1508 1517 1561 1582 1461 1401 1436 1460 1558 1625 1573 1622 1719
547 1719 2334 3177 2921 1626 1342 1159 1052 1144 1041 1051 1081 1154 1118 1178 1094 1028 1129 1073 1024 1010 1029 1104 1007 1068 984 1060 997 978 997 941
265 941 952 973 962 978 909 977 942 881 930 900 936 978 866 882 863 848 867 875 882 803 867 814 836 885 860 804 856 867 870 803 804 698 846 729 782
$$ packed form
1946C674k29P2n6k6Mj39O6M9PP8J1J20J2m0J07J19o9l68O6j41m19q84j106M112N823K848r69
1692A2722k729k08J68J16J43M01N18N39O62N85K80r90N299N863K047M059O548J1201K7171
1514G4395M4433J19067R991j56320l8008j5329q499n084l533k771k570j888j086r98j076p75
1364I949n75o58o03p28n75m08m02J021o26n35l02k69l24j62j09j90j89K10j49l30j68n2r3
1148C733o6j32j15j08j81k2m7p1rj03j45k0l5n4p7J1J8j01j57l2k1k1J9j06r8j01M38k13j07
875B077n8M4o6%q8Nj03j1N6L0j4j93j6l9o7J47n9M8j28lQo3JRM4K1j21o0L5K4R8O7n2M9R7
547A719O15Q43k56j295k84j83j07R2j03J0L0P3l6O0q4o6J01n6m9j4J9P5r7O1q4P6o3j9J9n6
265I41J1K1j1J6o9O8l5o1M9l0L6M2j12J6j9j5J9QPp9O4n3K2M9k5n6N2J1Lo7Jj06J48j17N3
$$ plain form
-64 782 765 718 729 679 707 761 840 803 728 665 681 745 798 804 658 666 671 552 739 671 662 677 706 629 637 668 686 588 611 610 570 598 439 275 202
$$ packed form
-64G82j7m7J1n0K8N4P9l7p5o3J6O4N3Oj46QNj19J87o8rJ5K9p7QL1J8r8K3jm0K8j59j64p3
-392B02
##PAGE=	F1=-8108.79
##FIRST=	19140.455529915001534,	4405.895418600002813,	0
##DATA TABLE=	(F2++(Y..Y)), PROFILE
$$ plain form
4406 126 17 105 168 206 241 333 340 369 435 405 418 453 404 389 438 387 421 368 465 435 433 437 416 415 406 471 385 438 423 367 381 426 447 426 404 390 404
4058 404 409 442 390 445 500 421 421 448 444 348 425 426 431 516 434 518 424 543 551 432 455 457 449 490 510 445 507 493 533 489 525 458 506 561 561 638 507 457
3702 457 480 611 562 554 493 595 580 503 476 534 495 556 562 582 530 539 505 533 545 556 505 530 599 608 595 573 559 538 594 506 545 546 543 625 627 610 525
3354 525 586 609 624 623 644 638 537 551 600 504 638 629 649 727 709 579 585 615 601 659 594 619 678 632 595 609 624 721 618 608 735 926 820
3044 820 715 729 644 666 655 643 759 771 727 707 728 720 649 711 681 1179 1444 1079 934 827 809 865 907 893 850 815 770 771 758 681 508 453
2744 453 572 1150 1381 1164 1091 1043 1069 1010 930 1006 1034 1030 1034 1025 1077 1128 1066 996 1024 1136 1136 1140 1101 1128 1133 1151 1168 1172 1045 1081 1200 1152 1087 1202
2425 1202 1218 1285 1264 1287 1320 1319 1265 1220 1322 1347 1382 1407 1336 1397 1404 1501 1444 1587 1584 1522 1559 1631 1640 1666 1610 1604 1650 1663 1749 1652 1698 1849 2004 2112
2105 2112 2020 2002 1943 2396 3045 4204 7477 20966 17103 8310 15853 17293 7570 5012 4177 3771 3496 3284 3369 3309 3288 3269
$$ packed form
4406A26j09Q8O3L8L5R2PK9O6l0J3L5m9j5M9n1L4n3R7l0kMk1jrO5q6N3j5n6J4M5K1k1k2j4J4
4058D04NL3n2N5N5p9%K7mr6P7JNQ5q2Q4r4J19Qj19K3KqM1K0o5O2j4M0m4L6o7M8N5%P7j31n0
3702D57K3J31m9qo1J02j5p7k7N8l9O1OK0n2Rl4K8J2J1n1K5O9Rj3k2j4k1N6q8L9JlQ2Kj7q5
3354E25O1K3J5jK1oj01J4M9r6J34rK0P8j8j30OL0j4N8o5K5N9m6l7J4J5R7j03j0J27J91j06
3044H20j05J4q5K2j1j2J16J2m4k0K1qp1O2l0M98K65l65j45j07j8N6M2j4m3l5m5Jj3p7j73n5
2744D53J19N78K31k17p3m8K6n9q0P6K8mMrN2N1o2p0K8J12%Ml9K7NJ8J7Mj27L6J19m8o5J15
2425A202J6O7k1K3L3jn4m5J02K5L5K5p1O1PR7n7J43lo2L7P2RK6n6oM6J3Q6r7M6J51J55J08
2105B112r2j8n9M53O49J159L273J3489l863q793P543J440r723k558q35m06k75k12Q5o0k1j9
$$ plain form
1899 3269 3160 3232 3279 3311 3356 3408 3556 3545 3514 3644 3756 3669 3369 3512 3445 3146 2746 2996 7126 12495 14333 12668 9778 9431
1673 9431 9500 9475 9588 10042 10588 11143 11828 12469 12897 12606 17457 21725 23884 27867 34155 44904 70924 113496 227853
1495 227853 237683 87858 51423 36746 28571 23733 20339 17661 15193 13386 12359 11371 10348 9635 9069 8427 7855
1335 7855 7175 6619 6225 5860 6808 6198 5694 5429 5148 4825 4672 4573 4400 4200 4398 4247 3941 3786 3722 3635 3554 3437 3357 3217 3021
1101 3021 3017 2965 2911 2913 2820 2674 2659 2625 2564 2487 2497 2529 2432 2279 2254 2227 2211 2219 2125 2036 1948 2347 2132 2047 1993 2037 1968 1962 1885 1879 1770 1772 1843 1857 1835
772 1835 1687 1659 1589 1565 1694 1628 1687 1567 1568 1562 1530 1518 1526 1579 1609 1496 1442 1502 1519 1630 1635 1623 1714 1849 2504 3204 2664 1143 993 879
490 879 868 970 888 927 989 1046 1046 1080 1007 930 1053 1002 972 941 983 1044 944 1010 916 1003 954 920 965 886 920 928 914 926 881 947 893 843 897 854 907
162 907 929 831 853 823 818 822 835 847 754 848 774 804 843 817 772 833 832 827 772 772 667 811 696 762 733 678 713 650 685 735 792 776 668 626 647 725
$$ packed form
1899C269j09P2M7L2M5N2J48j1l1J30J12q7l00J43o7k99m00K50M130N369J838j665k890l47
1673I431O9k5J13M54N46N55O85O41M28k91M851M268K159L983O288J0749K6020M2572J14357
1495B27853R830j49825l6435j4677q175m838l394k678k468j807j027r88j023p13n66o42n72
1335G855o80n56l94l65R48o10n04k65k81l23j53r9j73k00J98j51l06j55o4q7q1j17q0j40j96
1101C021mn2n4Kr3j46j5l4o1p7J0L2r7j53k5k7j6Qr4q9q8L99k15q5n4M4o9op7oj09KP1J4k2
772A835j48k8p0k4J29o6N9j20Jol2j2QN3L0j13n4O0J7J11Nj2R1J35O55P00n40j521j50j14
490H79j1J02q2L9O2N7%L4p3p7J23n1l0l1M2O1j00O6r4Q7m9l4M5p9L4Qj4J2m5O6n4n0N4m3N3
162I07K2r8K2l0nMJ3J2r3R4p4L0L9k6m5O1jnn5%j05J44j15O6k9n5L5o3L5N0N7j6j08m2K1P8
$$ plain form
-176 725 774 767 631 642 650 544 725 639 650 662 687 622 627 675 663 566 603 604 559 590 410 260 193
$$ packed form
-176G25M9pj36J1Qj06J81q6J1J2K5o5NM8j2r7L7Jm5L1j80j50o7
-392A93
##PAGE=	F1=-8187.54
##FIRST=	19140.455529915001534,	4405.895418600002813,	0
##DATA TABLE=	(F2++(Y..Y)), PROFILE
$$ plain form
4406 105 11 89 149 172 235 290 305 341 389 352 379 405 352 353 403 354 363 325 410 399 388 395 376 375 366 437 349 400 377 323 349 382 393 386 372 365 378 372 396
4040 396 359 413 458 373 407 424 393 304 398 390 396 480 413 483 397 527 523 401 403 396 408 454 460 408 469 464 491 473 482 415 472 519 521 591 454 408 437 558
3683 558 509 516 449 529 519 446 421 477 454 514 502 533 468 475 445 479 492 503 439 503 544 542 508 494 503 492 532 463 509 528 488 544 561 557 478 538 566
3335 566 572 562 574 568 464 486 558 481 604 586 602 669 646 513 543 569 538 609 533 589 623 560 557 560 589 691 584 541 808 875 750 648 678
3026 678 575 613 621 626 717 715 681 676 695 665 640 768 741 1188 1357 947 821 722 709 767 797 776 745 707 664 645 639 541 415 392 888 1422 1487
2716 1487 1177 1065 1020 1033 955 897 962 999 976 978 973 1029 1072 1015 947 986 1078 1080 1072 1061 1068 1061 1091 1104 1103 1009 1040 1146 1108 1065 1151 1175 1212 1215 1252 1288 1269
2368 1269 1221 1176 1286 1323 1354 1379 1334 1389 1412 1488 1436 1579 1561 1537 1615 1624 1635 1660 1621 1615 1711 1759 1835 1757 1852 2006 2187 2323 2301 2366 2448 2996
2068 2996 3776 5156 8808 22663 17196 6760 11763 13694 6306 4205 3518 3176 2946 2758 2863 2802 2786 2751 2680 2756 2807
$$ packed form
4406A05r4P8O0K3O3N5J5L6M8l7K7K6n3JN0m9Rl8Q5j1j1Pj9jrP1q8N1k3n4K6L3J1pj4pJ3oK4
4040C96l7N4M5q5L4J7l1q9R4qOQ4o7P0q6J30mj22KpJ2M6On2O1nK7j8Ro7N7M7KP0j37m6K9J21
3683E58m9Po7Q0j0p3k5N6k3O0j2L1o5Pl0L4J3J1o4O4M1kl4j4Rj1M0o9M6J9m0N6J7mp9O0K8
3335E66Oj0J2oj04K2P2p7J23j8J6O7k3j33L0K6l1P1p6N6L4o3lLK9J02j07m3K67O7j25j02L0
3026F78j03L8QNR1kl4nJ9l0k5J28k7M47J69m10j26r9j3N8L0k1l1l8m3j9or8j26k3M96N34O5
2716A487l10j12m5J3p8n8O5L7k3KnN6M3n7o8L9R2Kqj1PpL0J3jr4L1J06l8m3Q6K4L7LL7L6j9
2368A269m8m5J10L7L1K5m5N5K3P6n2J43j8k4P8RJ1K5l9oR6M8P6p8R5J54J81J36k2O5Q2N48
2068B996P80J380L652J3855n467j0436N003J931p388k101o87l42k30j88J05o1j6l5p1P6N1
$$ plain form
1871 2807 2872 2891 2976 3142 3106 3101 3249 3359 3295 3105 3317 3360 3276 3386 4326 8373 12967 13656 11390 8594 8132 8077 7912 7983 8446
1636 8446 8962 9477 10101 10726 11200 11402 15830 18368 20279 23771 29193 38476 60942 97666 196628 205437 76052 44549
1467 44549 31880 24787 20638 17709 15367 13229 11670 10793 9907 9029 8444 7944 7372 6893 6312 5830 5480 5186 5977 5440
1279 5440 5013 4811 4547 4253 4122 4042 3903 3714 3875 3739 3485 3359 3289 3211 3125 3035 2995 2835 2643 2655 2603 2569 2584 2512 2372 2366 2336 2279
1016 2279 2210 2216 2255 2173 2037 2020 1989 1979 1975 1906 1832 1760 2081 1888 1828 1790 1827 1765 1755 1695 1678 1572 1582 1661 1661 1635 1542 1504 1412 1430 1528 1459 1525 1419
697 1419 1423 1410 1404 1389 1389 1445 1484 1391 1336 1416 1423 1528 1476 1510 1626 1772 2400 2960 2286 712 571 554 648 739 691 750 838 867 903 908 848 757 899
387 899 858 843 801 860 908 807 879 778 868 838 791 861 760 810 811 790 802 780 840 775 741 791 740 808 808 728 753 718 721 720 726 745 646 759 670 705
49 705 729 705 680 739 730 720 683 682 584 713 609 679 641 587 636 568 610 651 681 692 559 541 565 641 688 675 557 571 576 489 648 554 586 592 611
$$ packed form
1871B807O5J9Q5J66l6nJ48J10o4j90K12M3q4J10R40M047M594O89k266k796m62n5j65P1M63
1636H446N16N15O24O25M74K02M428K538J911L492N422R283K2466L6724R8962Q809j29385l1503
1467D4549j2669p093m149k929k342k138j559q77q86q78n85n00n72m79n81m82l50k94P91n37
1279E440m27k02k64k94j31q0j39j89J61j36k54j26p0p8q6r0m0j60j92J2n2l4J5p2j40ol0n7
1016B279o9OL9q2j36j7l1j0mo9p4p2L21j93o0l8L7o2j0o0j7j06J0P9%k6r3l8r2J8R8o9O6j06
697A419Mj3oj5%N6L9r3n5Q0PJ05n2L4J16J46O28N60o74j574j41j7R4R1m8N9Q8K9L6No0r1J42
387H99m1j5m2N9M8j01P2j01R0l0m7P0j01N0Jk1J2k2O0o5l4N0n1O8%q0K5l5LjOJ9r9J13q9L5
49G05K4k4k5N9rj0l7jr8J29j04P0l8n4M9o8M2M1L0J1j33j8K4P6M7j3j18J4Nq7J59r4L2OJ9
$$ plain form
-280 611 567 566 626 585 497 543 546 504 536 349 224 169
$$ packed form
-280F11m4jO0m1q8M6Lm2L2j87j25n5
-392A69
##PAGE=	F1=-8266.3
##FIRST=	19140.455529915001534,	4405.895418600002813,	0
##DATA TABLE=	(F2++(Y..Y)), PROFILE
$$ plain form
4406 80 9 73 125 133 212 230 252 290 319 280 318 333 279 295 345 300 283 262 333 337 322 335 320 315 306 376 291 339 311 261 305 318 323 330 314 315 328 309 329
4040 329 306 356 388 303 365 375 324 246 350 331 335 418 357 422 346 477 475 349 332 311 341 390 388 350 396 403 420 425 412 348 410 444 436 509 376 337
3702 337 368 471 429 450 386 436 430 367 348 393 385 442 415 457 382 381 355 402 411 420 347 439 459 450 398 393 425 422 439 398 451 476 403 430 463 475 408 458
3345 458 493 488 474 472 469 370 405 492 440 531 507 523 576 554 422 473 491 449 530 445 524 531 473 492 489 521 619 519 448 796 771 634 545 590 479
3016 479 529 558 571 632 620 598 606 615 572 588 764 726 1084 1157 769 659 579 575 628 649 626 604 572 539 509 517 422 392 404 1075 1521 1459 1090
2706 1090 962 916 916 831 792 842 888 851 852 852 910 946 898 839 881 948 950 936 952 943 924 957 977 971 911 930 1010 992 974 1027 1062 1066 1090 1135 1176 1147 1109
2359 1109 1064 1171 1213 1233 1260 1249 1289 1326 1380 1341 1470 1447 1460 1552 1504 1531 1559 1539 1523 1663 1739 1808 1752 1873 2015 2213 2363 2420 2540 2740
2077 2740 3317 4183 5713 9652 23617 17397 5900 8059 10045 4867 3216 2650 2368 2199 2011 2133 2073 2057 2014 1974 2047
$$ packed form
4406H0p1O4N2QP9J8K2L8K9l9L8J5n4J6N0m5j7k1P1Mj5J3j5nrP0q5M8k8n0M4J3NPj6JJ3j9K0
4040C29k3N0L2q5O2J0n1p8J04j9MQ3o1O5p6J31kj26j7k1L0M9kl8M6PJ7Nj3o4O2L4qP3j33l9
3702C37L1J03m2K1o4N0oo3j9M5qN7k7M2p5jk6M7RRp3R2K0rn2nL2lJ7m1N3K5p3K7L3J2o7N0
3345D58L5nj4klr9L5Q7n2R1k4J6N3k2j32N1J8m2Q1q5P9Pn8J9lL2R8j00p1L48k5j37q9M5j11
3016D79N0K9J3O1j2k2QRm3J6J76l8L58P3l88j10q0mN3K1k3k2l2l3l0Qr5l0J2O71M46o2l69
2706A090j28m6%q5l9N0M6l7J%N8L6m8n9M2O7Kj4J6rj9L3K0oo0J9Q0j8j8N3L5MK4M5M1k9l8
2359A109m5J07M2K0K7j1M0L7N4l9J29k3J3R2m8K7K8k0j6J40P6O9n6J21J42J98J50N7J20K00
2077B740N77Q66J530L939J3965o220j1497K159J986n178j651n66k82j69j88J22o0j6m3m0P3
$$ plain form
1880 2047 2104 2198 2204 2304 2473 2414 2440 2595 2701 2683 2602 2850 2982 3088 3544 4803 8367 12143 11964 9371 6871 6347 6187 5870
1655 5870 5874 6286 6724 7155 7658 8206 8637 9084 12939 14066 15507 18245 22433 29635 47098 75562 152539 159700 59297
1476 59297 34771 24929 19383 16184 13925 12069 10403 9192 8518 7799 7115 6693 6302 5833 5481 5028 4657 4369 4160 4752
1288 4752 4320 3999 3871 3650 3403 3302 3244 3148 2991 3102 2988 2805 2711 2644 2575 2491 2436 2434 2273 2097 2116 2071 2054 2080 2037 1907 1909 1885 1848
1016 1848 1790 1792 1826 1770 1659 1648 1620 1612 1599 1559 1507 1453 1674 1518 1479 1463 1491 1444 1434 1396 1371 1273 1285 1360 1352 1325 1287 1248 1144 1193 1258 1186 1254 1167
697 1167 1172 1157 1166 1158 1150 1198 1246 1182 1123 1212 1214 1298 1208 1280 1404 1547 2102 2574 1974 716 225 301 465 513 505 566 667 659 728 705 661 551 705
387 705 677 671 623 691 730 631 710 607 689 682 622 713 596 650 651 621 636 633 684 617 602 640 584 663 645 586 610 575 583 585 578 604 507 624 528 564 571 551
30 551 551 599 588 572 557 555 472 574 490 556 514 469 516 455 502 531 534 572 428 433 450 515 557 551 456 473 470 400 528 434 487 486 498 479 468 537 476 398
$$ packed form
1880B047N7R4OJ00J69n9K6J55J06j8q1K48J32J06M56J259L564L776j79k593k500n24j60l17
1655E870MM12M38M31N03N48M31M47L855J127J441K738M188P202J7463K8464P6977P161j00403
1476E9297k4526r842n546l199k259j856j666j211o74p19o84m22l91m69l52m53l71k88k09N92
1288D752m32l21j28k21k47j01n8r6j57J11j14j83r4o7o9q4n5kj61j76J9m5j7K6m3j30Kk4l7
1016A848n8KL4n6j11j1k8qj3m0n2n4K21j56l9j6K8m7j0l8k5r8J2P5qk7l8l9j04M9O5p2O8q7
697A167Nj5RqqM8M8o4n9Q9KQ4r0P2J24J43N55M72o00j258m91P6J64M8qO1J01qO9k3m4j10J54
387G05k8om8O8L9r9P9j03Q2po0R1j17N4Jl0J5lN1o7j5L8n6P9j8n9K4l5QKpK6r7J17r6L6Pk0
30E51%M8j1j6j5kq3J02q4O6m2m5M7o1M7K9LL8j44NJ7O5M2or5J7lp0J28r4N3jJ2j9j1O9o1p8
$$ plain form
-327 398 444 450 419 450 273 175 137
$$ packed form
-327C98M6Ol1L1j77r8l8
-392A37
##PAGE=	F1=-8345.05
##FIRST=	19140.455529915001534,	4405.895418600002813,	0
##DATA TABLE=	(F2++(Y..Y)), PROFILE
$$ plain form
4406 56 12 59 104 96 183 171 193 228 243 208 253 254 204 232 279 245 202 191 249 264 251 268 262 250 235 304 225 274 241 195 258 251 251 270 248 255 271 236
4049 236 256 244 288 311 228 305 315 256 183 293 265 262 350 280 351 282 408 423 299 269 225 267 314 313 288 310 328 340 365 336 276 337 363 332
3730 332 414 296 264 289 373 343 370 326 346 340 287 276 304 308 366 322 377 302 283 258 321 325 333 249 358 365 358 289 288 338 345 337 322 386 409 316 312 355 381
3364 381 330 366 410 396 386 364 365 276 318 414 386 441 414 434 475 457 332 390 399 356 441 356 446 427 388 413 412 434 525 446 355 712 654 501 431
3035 431 490 381 432 480 498 531 513 499 522 512 471 496 708 665 925 910 599 493 437 439 486 498 477 461 442 423 390 414 344 403 415 1114
2734 1114 1464 1353 951 831 780 769 684 658 688 740 696 694 698 758 790 756 708 748 787 790 775 807 801 768 790 827 815 785 795 838 841 850 871 919 894
2406 894 932 979 1024 1000 970 927 1018 1062 1069 1093 1117 1143 1192 1221 1206 1316 1291 1345 1425 1332 1380 1415 1414 1380 1547 1651 1718 1686 1810 1939 2145 2304
2105 2304 2444 2597 2913 3493 4432 6115 10464 24986 18425 6095 5915 7619 3913 2556 1998 1712 1589 1326 1440 1372
$$ packed form
4406E6m4M7M5qQ7j2K2L5J5l5M5Jn0K8M7l4m3j1N8J5j3J7oj2j5O9p9M9l3m6O3p%J9k2PJ6l5
4049B36K0j2M4K3q3P7J0n9p3J10k8lQ8p0P1o9J26J5j24l0m4M2M7jk5K2J8J2K5k9o0O1K6l1
3730C32Q2j18l2K5Q4l0K7m4K0on3j1K8MN8m4N5p5j9k5O3MQq4J09Ppo9jN0Pqj5O4K3r3mM3K6
3364C81n1L6M4j4j0k2Jq9M2R6k8N5k7K0M1j8j25N8Rm3Q5q5R0j9l9K5jK2R1p9r1L57n8j53p0
3035D31N9j09N1M8J8L3j8j4K3j0m1K5K12m3K60j5l11j06n6KM7J2k1j6j9j9l3K4p0N9J2O99
2734A114L50j11m02j20n1j1q5k6L0N2m4kMO0L2l4m8M0L9Lj5L2ol3K2L7j2l0J0M3LRK1M8k5
2406H94L8M7M5k4l0m3R1M4PK4K4K6M9K9j5J10k5N4Q0r3M8L5jl4J67J04O7l2J24J29K06J59
2105B304J40J53L16N80R39J683M349J4522o561j2330j80J704l706j357n58k86j23k63J14o8
$$ plain form
1918 1372 1336 1283 1244 1300 1355 1458 1476 1565 1718 1641 1689 1842 1939 1967 1969 2220 2394 2623 3272 4680 7493 10584 10008 7386 5221 4681
1673 4681 4522 4005 3897 4187 4508 4836 5190 5624 5965 6428 9612 9872 10792 12738 15654 20712 33056 53061 107347 112566
1486 112566 42038 24682 17741 13791 11547 9991 8645 7464 6611 6143 5608 5109 4843 4577 4219 3997 3666 3418 3195
1307 3195 3063 3465 3136 2918 2862 2697 2505 2434 2393 2338 2232 2296 2194 2086 2017 1967 1906 1825 1801 1832 1693 1534 1544 1515 1500 1533 1524 1406 1411
1035 1411 1391 1385 1338 1343 1359 1333 1249 1242 1221 1210 1192 1176 1153 1125 1242 1124 1095 1102 1120 1097 1088 1074 1046 959 968 1025 1017 987 995 970 860 925 967 890 955 890 891
687 891 879 889 894 884 913 970 940 880 961 973 1027 925 1022 1142 1295 1770 2229 1846 987 270 253 360 344 367 412 511 467 558 516 492 357
396 357 510 501 498 445 516 552 459 541 442 504 523 452 556 435 479 483 452 469 478 519 455 461 486 423 508 478 443 461 429 436 450 432 456 370 483 384
58 384 417 410 389 415 451 439 418 422 421 358 431 369 424 382 353 381 339 385 408 387 441 309 327 327 380 411 426 351 372 362 301 400 307 379 370 374 382 358 435
$$ packed form
1918A372l6n3l9N6N5J03J8Q9J53p7M8J53R7K8KK51J74K29O49J408K813L091n76k622k165n40
1673D681j59n17j08K90L21L28L54M34L41M63L184K60R20J946K916N058J2344K0005N4286N219
1486A12566p0528j7356o941l950k244j556j346j181q53m68n35m99k66k66l58k22l31k48k23
1307C195j32M02l29k18n6j65j92p1m1n5j06O4j02j08o9n0o1q1k4L1j39j59J0k9j5L3rj18N
1035A411k0om7NJ6k6q4pk1j1j8j6k3k8J17j18k9PJ8k3rj4k8q7RN7ql0Qk5j10O5M2p7O5o5J
687H91j2J0Nj0K9N7l0o0Q1J2N4j02R7J20J53M75M59l83q59p17j7J07j6K3M5R9m4R1m2k4j35
396C57J53rln3P1L6r3Q2r9O2J9p1J04j21M4Ml1J7RM1o4OK5o3Q5l0l5J8l2PJ4j8K4q6J13r9
58C84L3pk1K6L6j2k1Mjo3P3o2N5m2k9K8m2M6K3k1N4j32J8%N3L1J5p5K1j0o1R9r3P2rMQk4P7
$$ plain form
-308 435 365 297 327 340 325 355 202 126 104
$$ packed form
-308D35p0o8L0J3j5L0j53p6k2
-392A04
##PAGE=	F1=-8423.81
##FIRST=	19140.455529915001534,	4405.895418600002813,	0
##DATA TABLE=	(F2++(Y..Y)), PROFILE
$$ plain form
4406 39 18 49 91 72 161 135 148 177 185 155 205 193 144 179 221 211 149 133 176 200 189 208 218 202 170 240 167 219 190 139 219 201 191 227 196 203
4068 203 226 173 197 185 225 248 170 244 263 206 127 243 213 197 298 203 283 223 335 380 268 235 167 206 246 255 242 237 264 271 312 280 223 276
3749 276 306 243 328 233 211 221 289 274 294 285 286 277 227 227 236 243 312 251 314 259 215 176 252 261 267 172 282 286 296 213 202 258 281 256 250 332 355 255 223
3382 223 258 296 266 285 339 320 325 279 283 209 236 343 333 364 330 358 393 379 275 317 316 284 364 293 383 342 326 340 350 359 438 397 308 585 571
3054 571 383 338 406 307 343 413 435 449 432 412 457 423 401 394 630 613 787 690 477 369 331 337 381 381 364 349 345 338 309 340 302 417 419 1049
2734 1049 1319 1231 819 722 675 655 567 552 564 608 567 553 564 620 652 640 598 640 649 653 640 674 695 645 643 700 686 677 689 687 709 744 738 794 756 796
2396 796 844 888 883 854 825 891 933 934 946 996 1019 1077 1078 1093 1194 1161 1269 1321 1197 1253 1305 1324 1272 1445 1578 1654 1648 1763 1895 2094 2272 2492
2096 2492 2676 3115 3727 4761 6683 11764 28070 20968 7246 5650 6997 3858 2608 1982 1619 1490 1125 1155 1056 975
$$ packed form
4406C9k1L1M2j9Q9k6J3K9Ql0N0j2m9L5M2j0o2j6M3K4j1J9J0j6l2P0p3N2k9n1Q0j8j0L6l1P
4068B03K3n3K4j2M0K3p8P4J9n7p9J16l0j6J01r5Q0o0J12M5j12l3o8L9M0Rj3nK7PM1l2n7N3
3749B76L0o3Q5r5k2J0O8j5K0rJrn0%RPO9o1O3n5m4l9P6ROr5J10MJ0q3j1N6K3k5oQ2K3j00l2
3382B23L5L8l0J9N4j9Nm6Mp4K7J07j0L1l4K8L5j4j04M2jl2Q0p1R0m1j6J4J0RP9m1q9K77j4
3054E71j88m5O8r9L6P0K2J4j7k0M5l4k2pK36j7J74r7k13j08l8OM4%j7j5mpk9L1l8J15KO30
2734A049K70q8m12r7m7k0q8j5J2M4m1j4J1N6L2j2m2M2RMj3L4K1n0kN7j4rJ2kK2L5oN6l8M0
2396G96M8M4nk9k9O6M2JJ2N0K3N8JJ5J01l3J08N2j24N6N2J9n2J73J33P6oJ15J32J99J78K20
2096B492J84M39O12J034J922N081J6306p102j3722j596J347l139j250o26l63j29l65L0r9q1
$$ plain form
1908 975 893 795 802 831 884 935 982 1113 1021 1048 1194 1277 1332 1382 1625 1789 2078 2815 4383 6551 9155 8607 6162 4198 3640 3658
1664 3658 2955 2700 2800 2969 3188 3408 3711 3970 4285 6878 6829 7345 8691 10638 14056 22507 36095 73133 76453 28790
1476 28790 16934 12199 9475 7934 6932 5993 5179 4604 4290 3912 3532 3369 3218 2949 2825 2587 2434 2275 2189 2462 2201
1279 2201 2052 2048 1936 1792 1749 1708 1679 1635 1683 1568 1522 1466 1440 1386 1308 1296 1352 1257 1111 1095 1089 1055 1091 1113 1011 1003 977 1005 973 991 977 980 919
969 919 915 902 885 865 857 859 877 913 815 782 804 810 816 806 818 794 721 729 752 753 713 748 751 641 706 748 661 710 678 670 661 665 674 674 679 742 738 696 747 786 808 720
575 720 832 946 1141 1564 2050 1860 1183 424 316 314 245 283 304 392 325 426 377 379 220 347 364 366 301 375 409 327 407 326 353 400 319
284 319 431 318 343 341 322 334 356 385 325 350 372 291 376 344 333 343 317 318 339 330 338 269 378 279 307 291 253 298 331 320 294 309 307 270 316 273
-54 273 318 276 275 261 244 283 312 278 325 230 248 229 270 280 323 266 298 284 220 303 196 287 274 266 297 264 346 282 228 217 240 241 273 148 85 73
$$ packed form
1908I75q2r8PK9N3N1M7J31r2K7J46Q3N5N0K43J64K89P37J568K168K604n48k445j964n58J8
1664C658p03k55J00J69K19K20L03K59L15K593m9N16J346J947L418Q451J3588L7038L320m7663
1476B8790j1856m735k724j541j002r39q14n75l14l78l80j63j51k69j24k38j53j59q6K73k61
1279B201j49mj12j44m3m1k9m4M8j15m6n6k6n4p8j2N6r5j46j6ol4L6K2j02qk6K8l2J8j4Lo1
969I19mj3j7k0qKJ8L6r8l3K2OOj0J2k4p3QK3Jm0L5Lj10O5M2q7M9l2qrMR%NO3mm2N1L9K2q8
575G20J12J14J95M23M86j90o77p59j08ko9L8K1Q8o7J01m9Kj59J27J7Ko5P4L4q2Q0q1K7M7q1
284C19J12j13K5kj9J2K2K9o0K5K2q1Q5l2j1J0k6JK1rQo9J09r9K8j6l8M5L3j1k6J5kl7M6m3
-54B73M5m2jj4j7L9K9l4M7r5J8j9M1J0M3n7L2j4o4Q3j07R1j3qL1l3Q2o4n4j1K3JL2j25o3j2
-392G3
##PAGE=	F1=-8502.56
##FIRST=	19140.455529915001534,	4405.895418600002813,	0
##DATA TABLE=	(F2++(Y..Y)), PROFILE
$$ plain form
4406 30 25 42 86 65 152 128 132 147 153 126 189 170 116 148 183 200 138 107 128 161 147 169 193 184 133 195 134 182 168 100 193 177 153 211 176 169 208 137
4049 137 165 145 179 208 142 196 226 182 91 207 183 150 269 155 226 182 271 345 259 224 154 172 203 221 224 194 227 230 280 254 203 239 292 209
3730 209 266 197 188 182 234 237 232 260 264 250 198 208 205 203 292 222 278 257 200 136 206 237 236 143 232 233 276 188 160 197 240 218 193 296 327 238 190 191 233
3364 233 230 232 289 274 304 240 235 190 173 292 292 319 274 311 340 328 265 271 258 243 306 269 351 300 300 293 315 319 377 384 331 453 542 301 283 350 274 278
3007 278 369 402 407 402 360 430 377 383 324 559 602 715 555 405 307 267 287 334 313 303 287 291 291 271 301 288 443 463 970 1183 1134 726 653
2697 653 627 608 510 507 513 534 502 466 487 528 557 576 537 590 571 576 563 586 644 587 554 625 615 618 641 600 632 689 663 716 685 718 771 804 824 786 788
2349 788 826 870 874 867 922 957 1020 994 1034 1144 1094 1263 1293 1147 1189 1269 1303 1251 1411 1563 1657 1675 1782 1931 2109 2323 2599 2825 3364 4046
2068 4046 5175 7374 13306 32058 24166 8692 6149 7200 4224 2988 2321 1895 1722 1348 1287 1156 1059 949 804 763
$$ packed form
4406C0nJ7M4k1Q7k4MJ5Ok7O3j9n4L2L5J7o2l1K1L3j4K2K4rn1O2o1M8j4o8R3j6k4N8l5pL9p1
4049A37K8k0L4K9o6N4L0m4r1J16k4l3J19j14P1m4Q9P4q6l5p0J8L1J8Ll0L3LN0k6n1L6N3q3
3730B09N7o9roN2LnK8Mj4n2J0lkQ9p0N6k1n7o4P0L1jr3Q9JM3q8k8L7M3k2k5J03L1q9m8JM2
3364B33lKN7j5L0o4nm5j7J19%K7m5L7K9j2o3Oj3j5O3l7Q2n1%pK2MN8Pn3J22Q9k41j8O7p6M
3007B78R1L3Nnm2P0n3On9K35M3J13j60j50r8m0K0M7k1j0j6M%k0L0j3J55K0N07K13m9m08p3
2697F53k6j9r8lOK1l2l6K1M1K9J9l9N3j9Nj3K3N8n7l3P1j0LK3m1L2N7k6N3l1L3N3L3K0l8K
2349G88L8M4MpN5L5O3k6M0J10n0J69L0j46M2Q0L4n2J60J52R4J8J07J49J78K14K76K26N39O82
2068D046J129K199N932J8752p892j5474k543J051k976j236o67m26j73l74o1j31r7j10j45m1
$$ plain form
1880 763 745 695 745 745 860 760 696 818 887 930 999 1234 1358 1655 2405 4171 6126 8348 7964 5744 3841 3213 3457 2741 2410
1645 2410 2365 2395 2520 2656 2840 3072 3207 5402 5378 5700 6762 8235 10827 17291 27671 56274 58175 21953 12948 9321
1457 9321 7238 6021 5303 4604 3967 3546 3301 3020 2695 2549 2472 2258 2183 1997 1881 1778 1705 1932 1699 1572 1580 1501 1394 1371 1317
1223 1317 1289 1292 1363 1231 1213 1165 1154 1110 1043 1018 1081 1039 907 865 876 814 851 884 816 773 731 766 762 804 760 774 735 735 721 702 685 664 671 748 755 652
885 652 610 630 622 647 636 669 654 600 620 604 613 564 593 630 521 584 640 552 567 572 557 545 558 546 558 555 614 616 613 622 690 684 617 744 859 1109 1531
537 1531 2033 1929 1279 504 367 298 198 237 241 320 246 342 300 328 173 237 281 302 210 290 320 254 324 277 260 332 242 356 266 274 249 248
237 248 249 291 307 252 286 323 214 289 262 270 278 259 252 266 284 272 215 329 238 260 243 176 220 264 255 225 239 230 220 252 221 255 211 251 189 186 212 255
-120 255 229 243 195 206 178 207 188 254 214 261 248 177 267 126 228 225 194 242 204 287 239 208 144 175 174 216 111 59 46
$$ packed form
1880G63j8n0N0%J15j00o4J22O9M3O9K35J24K97P50J766J955K222l84k220j903o28K44p16l31
1645B410m5L0J25J36J84K32J35K195k4L22J062J473K592O464J0380K8603J901l6222r005l627
1457I321k083j217p18o99o37m21k45k81l25j46p7k14p5j86j16j03p3K27k33j27Qp9j07k3n4
1223A317k8LP1j32j8m8j1m4o7k5O3m2j32m2J1o2L7L3o8m3m2L5mM2m4J4l9%j4j9j7k1PP7Pj03
885F52m2K0qK5j1L3j5n4K0j6Rm9K9L7j09O3N6q8J5Nj5j2J3j2J2lN9KlRO8oo7J27J15K50M22
537A531N02j04o50p75j37o9j00L9MP9p4R6m2K8j55O4M4K1r2Q0L0o6P0m7j7P2r0J14r0Qk5j
237B48JM2J6n5L4L7j09P5k7QQj9pJ4J8j2n7J14r1K2j7o7M4M4rl0J4rj0L2l1L4m4M0o2lK6M3
-120B55k6J4m8J1k8K9j9O6m0M7j3p1R0j41J02ll1M8l8Q3m8l1o4L1jM2j05n2j3
-392D6
##PAGE=	F1=-8581.32
##FIRST=	19140.455529915001534,	4405.895418600002813,	0
##DATA TABLE=	(F2++(Y..Y)), PROFILE
$$ plain form
4406 32 33 37 85 68 153 133 141 136 142 115 196 178 119 133 169 197 151 115 115 152 127 153 178 191 134 175 130 157 171 82 177 173 133 213 185 151 214 136 161
4040 161 129 156 185 140 167 204 174 84 184 171 122 253 151 186 159 221 313 259 215 167 161 189 204 221 180 215 213 265 249 204 224 303 229 236 186
3711 186 187 173 210 231 187 241 259 249 193 209 205 188 291 228 264 270 224 145 178 244 230 160 212 203 282 201 167 171 220 218 165 275 325 249 206 162 194
3364 194 218 208 260 250 306 243 215 208 148 265 268 303 251 291 312 300 285 257 235 226 261 270 343 299 304 279 301 316 337 390 385 340 550 261 268 318 276
3016 276 238 341 389 394 413 339 425 378 394 312 507 615 692 503 362 293 236 276 331 290 286 274 270 278 265 297 292 481 553 950 1128 1069 674
2706 674 611 617 612 501 506 525 524 502 440 472 492 507 555 519 589 555 561 541 558 631 586 531 598 599 612 640 580 612 684 645 689 672 698 760 777 816 764
2359 764 803 818 868 880 863 901 955 1017 977 1024 1152 1091 1301 1332 1170 1186 1300 1339 1311 1449 1604 1721 1758 1860 2026 2179 2437 2747 3016
2087 3016 3617 4377 5573 8001 14651 35586 26879 9886 6534 7275 4501 3269 2591 2132 1902 1556 1435 1275 1181 1050
$$ packed form
4406C2JMM8j7Q5k0QnOk7Q1j8n9J4L6K8m6l6%L7k5K6K5J3n7M1m5K7J4q9R5mm0Q0k8l4O3p8K5
4040A61l2K7K9m5K7L7l0r0J00j3m9J31j02L5k7O2R2n4m4m8oK8J5J7m1L5kN2j6m5K0P9p4Pn0
3711A86Jj4L7K1m4N4J8j0n6J6mj7J03o3L6Om6p9L3O6j4p0N2rP9q1l4MM9kn3J10N0p6m3m4L2
3364A94K4j0N2j0N6o3k8po0J17LL5n2M0K1j2j5k8k2rL5RP3m4Nk5K2J5K1N3nm5K10k89PN0m2
3016B76l8J03M8NJ9p4Q6m7J6q2J95J08P7j89j41o9n7M0N5m1mj2mQj3L2nJ89P2L97J78n9l95
2706F74o3Onj11NJ9jk2o2L2K0J5M8l6P0l4Ok0J7P3m5n5O7JJ3K8o0L2P2l9M4j7K6O2J7L9n2
2359G64L9J5N0J2j7L8N4O2m0M7J28o1K10L1j62J6J14L9k8J38J55J17L7J02J66J53K58L10K69
2087C016O01P60J196K428O650K0935q707j6993l352P41k774j232o78m59k30l46j21j60r4j31
$$ plain form
1899 1050 899 852 804 728 713 702 826 722 570 648 703 711 786 1010 1108 1380 2083 3950 6030 7890 7579 5543 3694 2948 3289
1664 3289 2701 2360 2280 2249 2316 2413 2532 2773 2835 4794 4795 5045 6004 7319 9600 15265 24418 50059 51372 19247 11399 8194
1457 8194 6380 5277 4639 4064 3490 3136 2906 2668 2391 2214 2165 1978 1920 1765 1637 1572 1503 1724 1520 1391 1380 1310 1228 1212 1149
1223 1149 1111 1121 1220 1100 1081 1048 1033 997 955 911 959 958 841 797 808 735 774 793 773 695 638 639 667 733 677 680 666 667 644 633 623 584 566 685 708
894 708 593 553 559 543 557 556 592 586 553 593 555 564 520 514 578 467 535 600 532 503 533 524 497 542 501 503 519 570 560 590 573 653 627 559 712 839 1123
547 1123 1580 2091 2023 1353 557 420 318 190 221 213 287 220 298 269 312 190 184 242 291 176 255 275 231 283 272 230 308 212 320 256 265
256 265 209 216 208 270 275 231 258 319 192 243 224 235 251 239 233 223 272 253 191 315 240 261 244 170 185 239 235 207 217 191 195 234 207 230 184 258 177
-92 177 159 173 224 222 201 183 191 173 179 146 211 193 248 242 168 275 112 198 221 165 216 177 254 226 218 127 162 120 187 83 48 22
$$ packed form
1899A050j51m7m8p6j5j1J24j04j52P8N5QP5K24R8K72P03J867K080J860l11k036j849p46L41
1664C289n88l41q0l1O7R7J19K41O2J959JK50R59J315K281N665R153K5641J313l2125p848l205
1457H194j814j103o38n75n74l54k30k38k77j77m9j87n8j55j28o5o9K21k04j29j1p0q2j6o3
1223A149l8J0R9j20j9l3j5l6m2m4M8jj17m4J1p3L9J9k0p8n7JK8O6n6Lj4Jk3j1j0l9j8J19K3
894G08j15m0Oj6J4jL6ol3M0l8Rm4oO4j11O8O5o8k9L0rk7M5m1KJ6N1j0L0j7Q0k6o8J53J27K84
547A123M57N11o8o70p96j37j02j28L1qP4o7P8k9M3j22oN8M9j15P9K0m4N2j1m2P8r6J08o4R
256B65n6PqO2Nm4K7O1j27N1j9J1J6j2oj0M9j9o2J24p5K1j7p4J5N4mk8J0k6ML9k7K3m6P4q1
-92A77j8J4N1kk1j8Qj8Ol3O5j8N5op4J07j63Q6K3n6N1l9P7k8qr1L5m2O7j04l5k6
-392B2
##PAGE=	F1=-8660.07
##FIRST=	19140.455529915001534,	4405.895418600002813,	0
##DATA TABLE=	(F2++(Y..Y)), PROFILE
$$ plain form
4406 41 41 37 87 79 156 141 162 136 141 110 210 200 141 128 174 193 167 143 127 164 130 160 170 205 163 181 149 145 186 91 174 182 130 220 211 147 234 163
4049 163 178 140 165 179 153 162 199 178 107 170 175 116 241 172 177 147 193 285 265 206 184 162 200 201 222 183 212 213 259 253 213 224 320 271 238 194 199 192
3692 192 210 250 171 228 256 263 205 219 223 200 296 257 273 286 264 184 172 268 241 199 220 195 300 230 206 191 225 238 180 269 344 275 248 173 187
3364 187 227 216 255 243 318 275 220 241 182 266 270 313 261 300 312 296 320 275 255 237 231 278 348 326 335 302 311 341 324 401 445 274 575 273 289
3035 289 312 307 238 322 391 399 451 350 434 418 422 357 489 636 694 503 343 310 239 293 358 309 306 307 274 301 277 325 309 516 653 1009 1178
2725 1178 1055 672 599 632 646 532 531 572 568 558 478 509 522 517 573 544 632 597 606 576 609 657 638 582 629 639 664 691 632 657 742 696 731 722 746
2396 746 820 829 875 819 879 880 944 963 950 968 1035 1098 1066 1103 1243 1196 1414 1485 1287 1293 1441 1484 1501 1630 1788 1932 2000 2119 2290 2444 2759
2105 2759 3128 3468 4155 5056 6415 9202 17007 41654 31470 11725 7278 7596 4995 3705 2981 2485 2169 1827 1636
$$ packed form
4406D1%mN0qP7j5K1k6Nl1J00j0n9j3M6J9k6k4j6L7l4L0J0L5m2J8l2mM1r5Q3Qn2R0ro4Q7p1
4049A63J5l8K5J4k6RL7k1p1O3Nn9J25o9Nl0M6R2k0n9k2k2L8JK1l9K9JM6om0J1R6m9l3m4Np
3692A92J8M0p9N7K8Pn8J4Mk3R6l9J6J3k2q0j2R6k7m2K1k5J05p0k4j5L4J3n8Q9P5o9k7p5J4
3364A87M0j1L9j2P5m3n5K1n9Q4MM3n2L9J2j6K4m5k0j8oM7P0k2Rl3RL0j7P7M4j71L01l02J6
3035B89K3no9Q4O9QN2j01Q4j6Mo5J32J47N8j91j60l3p1N4O5m9lJl3K7k4M8j6K07J37L56J69
2725A178j23l83p3L3J4j14jM1mj0q0L1J3nN6k9Q8l5Rl0L3M8j9n6M7J0K5K7n9K5Q5m6L5rK4
2396G46P4RM6n6O0JO4J9j3J8O7O3l2L7J40m7K18P1j98OJ48M3J7J29J58J44O8J19J71J54L15
2105B759L69L40O87R01J359K787P805K4647j0184j9745m447L18k601j290p24m96l16l42j91
$$ plain form
1927 1636 1434 1314 1158 992 943 839 791 683 643 805 706 489 480 513 481 536 742 847 1092 1721 3511 5755 7323 7037 5207
1692 5207 3514 2651 2922 2530 2186 2099 2047 2061 2117 2194 2438 2473 4262 4245 4409 5261 6449 8468 13459 21593 44641 45871
1486 45871 17076 10174 7327 5737 4750 4160 3677 3161 2858 2643 2422 2212 2012 1972 1802 1761 1636 1492 1438 1378 1584 1429
1279 1429 1304 1277 1205 1143 1120 1063 1019 1008 1109 1028 996 989 959 927 913 867 888 910 807 775 773 714 751 749 777 687 622 570 620 695 652 631 645 641 614
950 614 609 614 564 508 634 688 570 540 534 522 500 519 544 540 526 586 547 546 522 478 555 439 514 578 542 482 509 519 469 551 500 470 512 561 541 585
612 585 562 639 604 505 689 834 1126 1621 2138 2111 1438 621 485 377 225 234 211 281 227 278 261 304 223 173 229 303 183 246 261 236
331 236 267 281 244 308 213 303 259 278 207 205 191 265 262 240 251 331 208 231 214 211 242 234 238 201 267 259 181 308 253 277 258 202 189 236 239 215 232 182
-26 182 183 240 216 227 180 275 208 159 159 208 227 197 180 190 192 167 140 182 191 242 249 175 294 139 184 244 171 213 172 237 228 233 148 188 80 180 66
$$ packed form
1927A636k02j20j56j66m9j04m8j08m0J62r9k17rL3l2N5K06J05K45O29J790K244J568k86j830
1692E207j693q63K71l92l44q7n2J4N6P7K44L5J789j7J64Q52J188K019M991Q134K3048J230
1486D5871k8795o902k847j590r87n90m83n16l03k15k21k10k00m0j70m1j25j44n4o0K06j55
1279A429j25k7p2o2k3n7m4j1J01q1l2pl0l2j4m6K1K2j03l2kn9L7kK8r0o5n2N0P5m3k1J4mk7
950F14nNn0n6J26N4j18l0oj2k2J9K5mj4O0l9jk4m4P7j16P5O4l6o0K7J0n0Q2n1l0M2M9k0M4
612E85k3P7l5r9J84J45K92M95N17k7o73q17j36j08j52Rk3P0n4N1j7M3q1n0N6P4j20O3J5k5
331B36L1J4l7O4r5R0m4J9p1kj4P4lk2J1Q0j23K3j7lL1qMl7O6qp8J27n5K4j9n6j3M7Lk4J7n0
-26A82JN7k4J1m7R5o7m9%M9J9l0j7J0Kk5k7M2RN1Pp4J19j55M5O0p3M2m1O5rNq5M0j08J00j14
$$ plain form
-374 66 48 3
$$ packed form
-374F6j8m5
-392C
##PAGE=	F1=-8738.83
##FIRST=	19140.455529915001534,	4405.895418600002813,	0
##DATA TABLE=	(F2++(Y..Y)), PROFILE
$$ plain form
4406 52 49 48 98 100 168 161 189 153 154 114 229 229 178 141 202 197 184 183 154 193 158 188 180 224 206 211 184 160 211 127 202 208 154 235 250 163 263 209 214 177
4030 177 208 203 186 190 222 201 152 177 201 149 241 205 210 152 201 279 288 214 208 185 237 224 233 208 218 232 272 269 235 244 340 315 268 225 227 239 234 293 202 240
3655 240 264 294 238 243 253 246 315 303 314 318 316 243 199 312 274 255 258 224 330 274 266 256 268 281 245 295 394 321 312 223 228 265 264 293 270 350 331 257
3298 257 289 265 309 319 355 311 348 360 335 378 333 323 291 257 308 381 382 404 376 366 406 365 430 523 303 611 340 350 360 380 311 343 430 437
2979 437 518 415 475 506 484 461 546 696 734 533 356 360 302 351 421 381 377 398 327 386 332 409 374 570 766 1144 1326 1110 732 646 692
2688 692 719 616 601 657 667 672 592 605 637 619 661 641 740 712 726 691 763 768 766 728 755 770 805 833 787 804 903 862 891 885 909 996 1017 1062 1023 1078
2349 1078 1078 1163 1185 1184 1204 1276 1348 1338 1373 1517 1516 1733 1888 1586 1626 1806 1869 1947 2106 2302 2489 2618 2808 2986 3205 3624 4145 4657
2087 4657 5586 6837 8723 12477 23240 57698 43936 16635 10086 9440 6573 5028 4126 3515 3063 2630 2353 2087
$$ packed form
4406E2ljN0KO8pK8l6Jm0J15%n1l7O1nj3jk9L9l5L0qM4j8Nk7k4N1q4P5On4Q1J5q7J00n4Nl7
4030A77L1nj7ML2k1m9K5K4n2R2l6Nn8M9P8Rp4ok3N2j3Rk5J0J4M0ll4RR6k5m7m3KJ2nN9r1L8
3655B40K4L0n6NJ0pO9j2J1Mkp3m4J13l8j9Ll4J06n6qj0J2J3l6N0R9p3rq9NL7jK9k3Q0j9p4
3298B57L2k4M4J0L6m4L7J2k5M3m5j0l2l4N1P3JK2k8j0M0m1O5R3k20L08k71J0J0K0o9L2Q7P
2979D37Q1j03O0L1k2k3Q5J50L8k01j77Mn8M9P0m0mK1p1N9n4P7l5J96J96L78J82k16l78q6M6
2688F92K7j03j5N6J0Nq0J3L2j8M2k0R9k8J4l5P2Nkl8K7J5L5K8m6J7R9m1K9oK4Q7K1M5l9N5
2349A078%Q5K2jK0P2P2j0L5J44jK17J55l02M0J80O3P8J59J96J87J29J90J78K19M19N21N12
2087D657R29J251J886L754J0763L4458j3762k7301o549o46k867j545r02o11m52m33k77k66
$$ plain form
1918 2087 1881 1686 1473 1394 1209 1154 979 832 1019 1031 764 620 570 478 308 365 465 650 1207 2790 5132 6618 6432 4879
1692 4879 3440 2546 2593 2405 2064 1957 1900 1843 1846 1856 2075 2048 3664 3689 3748 4440 5488 7200 11448 18513 38400 39686 14707
1476 14707 8816 6382 5033 4193 3672 3269 2828 2580 2397 2178 2035 1839 1800 1642 1626 1535 1394 1331 1277 1445 1349 1245 1210 1143
1251 1143 1093 1060 1013 971 938 1012 976 930 950 905 872 881 851 848 876 789 769 746 714 745 726 786 712 642 549 604 671 655 611 649 638 613 607 630 582 500
913 500 601 675 567 545 530 538 471 514 524 513 511 583 557 546 541 480 553 433 510 566 559 497 495 529 460 557 520 458 512 566 551 588 571 637 609 452
575 452 668 830 1114 1620 2114 2130 1501 699 553 467 306 290 248 307 265 287 281 310 267 196 237 328 223 262 277 268 280 299 289 334 248
284 248 308 277 303 236 218 200 273 264 268 268 353 248 254 235 201 250 241 257 203 269 282 188 306 272 300 276 247 228 252 261 239 272 202 185 261 243 243 198
-73 198 298 256 192 171 213 241 227 193 209 231 172 158 167 208 242 270 194 314 183 184 280 206 232 190 240 245 254 177 228 78 190 70 57 23
$$ packed form
1918B087k06j95k13p9j85n5j75j47J87J2k67j44n0r2j70N7J00J85N57J583K342J486j86j553
1692D879j439q94M7j88l41j07n7n7LJ0K19k7J616K5N9O92J048J712M248P065J9887J286k4979
1476A4707n891k434j349q40n21m03m41k48j83k19j43j96l9j58j6r1j41o3n4J68r6j04l5o7
1251A143n0l3m7m2l3P4l6m6K0m5l3Rl0lK8q7k0k3l2L1j9O0p4p0r3N5O7j6m4L8j1k5oK3m8q2
913E00J01P4j08k2j5Qo7M3J0j1kP2k6j1no1P3j20P7N6po2kL4o9R7l7o2N4N4j5L7j7O6k8j57
575D52K16J62K84N06M94J6o29q02j46q6j61j6m2N9m2K2oK9m3p1M1R1j05L9J5rJ2J9j0M5q6
284B48O0l1K6o7j8j8P3rM%Q5j05Oj9l4M9rJ6n4O6J3r4J18l4K8k4k9j9K4Rk2L3p0j7P6j8%m5
-73A98J00m2o4k1M2K8j4l4J6K2n9j4RM1L4K8p6J20j31JR6p4K6m2N0NRp7N1j50J12j20j3l4
-392B3
##PAGE=	F1=-8817.58
##FIRST=	19140.455529915001534,	4405.895418600002813,	0
##DATA TABLE=	(F2++(Y..Y)), PROFILE
$$ plain form
4406 60 57 69 120 131 196 200 224 190 185 135 256 262 223 180 247 220 207 231 192 235 205 234 220 249 255 253 228 202 247 178 265 252 207 268 300 204 303 263
4049 263 265 234 270 258 242 250 270 249 209 211 247 219 274 248 270 191 244 309 336 248 246 238 298 282 272 257 240 273 313 298 274 287 373 359 314 272 272 310
3692 310 280 354 268 285 296 341 294 289 295 317 358 366 388 374 378 315 263 379 332 326 325 287 380 333 342 349 343 350 340 363 477 387 389 302 306 334 348 376 342 416
3317 416 408 327 357 375 395 418 429 396 434 456 422 467 428 421 386 352 378 462 469 513 497 467 516 464 494 630 425 658 434 446 462 493 445 430
2997 430 525 522 621 533 566 635 591 614 688 818 819 572 397 439 418 462 528 501 500 547 444 541 460 566 528 707 930 1359 1533 1208 827
2706 827 745 802 827 744 724 779 806 829 761 752 817 797 826 815 917 897 912 885 1001 975 970 957 975 996 1027 1068 1036 1052 1166 1141 1165 1164 1190 1292
2387 1292 1335 1380 1375 1417 1424 1532 1555 1564 1610 1691 1778 1787 1843 2000 2050 2302 2564 2082 2190 2411 2512 2658 2887 3162 3412 3631 3943 4153 4493
2115 4493 5077 5848 6657 8009 9844 12655 18122 33935 85247 65578 25229 15475 13073 9372 7367 6146 5309
$$ packed form
4406F0lJ2N1J1O5MK4l4nn0J21Ol9m3O7k7j3K4l9M3l0K9j4K9Okk5k6M5o9Q7j3m5O1L2r6R9m0
4049B63Kl1L6j2j6QK0k1m0KL6k8N5k6K2p9N3O5K7q8kqO0j6j0j5j7L3M0j5k4J3Q6j4m5m2%L8
3692C10l0P4q6J7J1M5m7nOK2M1QK2j4Mo3n2J16m7ojl8R3m7RPoPj0K3J14r0Kq7MK8J4K8l4P4
3317D16qq1L0J8K0K3J1l3L8K2l4M5l9pl5l4K6Q4PM4j6l0M9n2L0J36k05K33k24J2J6L1m8j5
2997D30R5lR9q8L3O9m4K3P4J30Jk47j75M2k1M4O6k7jM7j03R7q1J06l8J79K23M29J74l25l81
2706H27q2N7K5q3k0N5K7K3o8rO5k0K9j1J02k0J5k7J16k6nj3J8K1L1M1l2J6J14k5K4jK6J02
2387A292M3M5nM2PJ08K3RM6Q1Q7RN6J57N0K52K62m82J08K21J01J46K29K75K50K19L12K10L40
2115D493N84P71Q09J352J835K811N467J5813N1312j9669m0349r754k402l701k005j221q37
$$ plain form
1955 5309 4673 4051 3684 3320 3000 2737 2445 2315 2060 1942 1724 1475 1667 1845 1500 1313 1212 1099 831 652 555 364 649
1739 649 1968 4443 6167 6150 4851 3652 2846 2669 2574 2247 2123 2084 1972 1951 1879 2034 1920 3357 3473 3469 3987 4947 6407
1523 6407 10089 16455 33822 35061 12880 7717 5604 4436 3720 3274 2919 2550 2345 2207 1979 1881 1707 1664 1514 1526 1464
1326 1464 1345 1274 1213 1330 1281 1208 1176 1115 1074 1038 996 956 922 959 950 892 935 873 838 861 855 840 861 792 777 731 730 751 724 792 751 670 568 617
1007 617 665 674 621 668 654 634 621 657 621 533 605 669 582 558 538 568 471 531 537 510 513 587 578 558 563 510 566 448 522 565 571 531 494 546 472 555 536
659 536 462 511 567 571 592 576 628 613 397 643 811 1083 1572 2008 2066 1537 800 635 586 433 401 339 378 342 348 342 348 331 256 276 369 292
359 292 307 323 331 332 336 357 389 313 347 316 341 286 256 244 304 285 311 316 388 305 308 283 218 279 270 291 234 287 319 219 321 301 334 301 297 290 289 298 277
-7 277 328 241 211 294 285 275 235 333 309 250 208 240 267 279 223 254 290 203 192 171 246 255 304 230 336 231 205 325 259 268 228 265 275 283 206 265
$$ packed form
1955E309o36o22l67l64l20k63k92j30k55j18k18k49J92J78l45j87j01j13k68j79r7j91K85
1739F49J319K475J724j7j299j199q06j77r5l27j24l9j12k1p2J55j14J437J16mN18R60J460
1523F407L682O366J7367J239k2181n163k113j168p16m46l55l69k05j38k28r8j74m3j50J2o2
1326A464j19p1o1J17m9p3l2o1m1l6m2m0l4L7rn8M3o2l5K3oj5K1o9j5m6jK1k7O8m1q1j02M9
1007F17M8Rn3M7j4k0j3L6l6q8P2O4q7k4k0L0r7O0Ok7LP4rk0Nn3N6j18P4M3Om0l7N2p4Q3j9
659E36p4M9N6MK1j6N2j5k16K46J68K72M89M36N8n29p37j65m9j53l2o2L9l6OoOj7p5K0R3p7
359B92J5J6QJMK1L2p6L4l1K5n5l0j2O0j9K6NP2q3Lk5o5O1rK1n7N3L2j00J02k0L3l3mpjRk1
-7B77N1q7l0Q3rj0m0R8k4n9m2L2K7J2n6L1L6q7j1k1P5RM9p4J06j05k6J20o6Rm0L7J0Qp7N9
$$ plain form
-345 265 117 208 83 75 44
$$ packed form
-345B65j48R1j25ql1
-392D4
##PAGE=	F1=-8896.34
##FIRST=	19140.455529915001534,	4405.895418600002813,	0
##DATA TABLE=	(F2++(Y..Y)), PROFILE
$$ plain form
4406 62 68 96 145 164 236 246 262 232 222 172 289 295 268 232 297 256 234 281 234 280 256 289 278 279 299 294 270 251 283 230 342 301 275 318 346 256
4068 256 343 310 318 293 330 322 307 323 323 308 264 258 295 303 332 294 328 253 300 360 394 292 291 308 369 353 332 317 275 326 372 332 322 341 419 393 356
3720 356 321 326 386 335 416 337 344 345 393 358 347 343 390 418 433 472 445 440 387 344 455 396 400 400 362 443 396 422 444 424 431 438 452 569 459 460 391 390 415
3354 415 442 476 438 506 491 407 437 487 496 533 506 490 534 565 527 568 534 519 491 472 478 572 568 636 630 583 642 578 581 748 576 700 523 551 585
3026 585 620 596 555 649 632 737 667 683 768 711 779 860 965 907 592 448 533 558 608 661 640 649 720 599 728 639 769 747 930 1152 1621
2734 1621 1731 1274 897 845 925 935 874 863 909 946 989 940 915 1011 988 1020 1020 1120 1103 1115 1107 1260 1217 1197 1208 1230 1259 1272 1332 1313 1339 1463
2434 1463 1457 1479 1485 1518 1631 1695 1746 1776 1811 1831 1958 1982 1998 2076 2173 2275 2294 2390 2570 2662 2987 3349 2652 2839 3109 3257 3471 3785 4152
2162 4152 4476 4794 5250 5512 5989 6770 7827 8998 10850 13366 17266 24792 46578 117879 91349 35551 22102 17383
$$ packed form
4406F2OK8M9J9P2J0J6l0j0n0J17Ok7l6O5m1k2M7m7M6k4L3j1JK0nk4j9L2n3J12m1k6M3K8r0
4068B56Q7l3Qk5L7qj5J6%j5m4oL7QK9l8L4p5M7O0L4j02jJ7O1j6k1j5m2N1M6m0j0J9P8k6l7
3720C56l5NO0n1Q1p9PJM8l5j1mM7K8J5L9k7nn3m3J11n9M%l8Q1m7K6K2k0PPJ4J17j10Jo9jK5
3354D15K7L4l8O8j5q4L0N0RL7k7j6M4L1l8M1l4j5k8j9OR4mO8om7N9o4LJ67j72J24j77K8L4
3026E85L5k4m1R4j7J05p0J6Q5n7O8Q1J05n8l15j44Q5K5N0N3k1RP1j21J29q9J30k2J83K22M69
2734A621J10m57l77n2Q0J0o1j1M6L7M3m9k5R6k3L2%J00j7J2qJ53m3k0J1K2K9J3O0j9K6J24
2434A463oK2OL3J13O4N1L0L5K0J27K4J6P8R7J02J9R6J80R2L25L62o97J87K70J48K14L14L67
2162D152L24L18M56K62M77P81J057J171J852K516L900P526K1786P1301k6530n5798j3449m719
$$ plain form
1993 17383 12643 10119 8532 7420 6579 5731 5276 4796 4358 4010 3631 3443 3124 2930 2655 2324 2530 2880 2425 2214 2082
1795 2082 1939 1655 1477 1339 1089 933 1689 4250 6349 6393 5152 4059 3366 3106 2965 2653 2530 2520 2399 2396 2287 2383 2231
1579 2231 3523 3669 3664 4047 4973 6280 9616 15607 31442 32334 11642 6882 4953 3894 3268 2901 2571 2259 2089 2001
1392 2001 1766 1695 1553 1500 1359 1407 1366 1276 1217 1139 1202 1179 1148 1123 1064 1035 1008 961 922 906 916 915 853 909 830 794 826 843 828 835 786 772 706 730
1072 730 747 713 770 763 670 583 630 658 675 636 674 662 646 628 667 644 557 623 649 590 554 535 576 473 541 557 510 513 581 585 558 566 532 570 457 530
734 530 555 558 542 484 546 479 532 516 449 490 536 561 566 539 575 563 311 586 743 1005 1493 1905 2027 1618 948 753 724 585 544 468 483
443 483 442 449 431 413 409 338 343 421 376 370 385 413 408 389 432 459 389 407 365 384 338 304 310 352 321 357 384 430 363 369 339 253 320 317 330 282 318 357 263
77 263 355 337 369 331 345 354 333 339 322 384 282 249 330 333 308 274 374 354 314 255 275 301 333 258 312 349 245 232 188 296 280 339 276 356 272
$$ packed form
1993A7383m740k524j587j112q41q48m55m80m38l48l79j88l19j94k75l31K06L50m55k11j32
1795B082j43k84j78j38k50j56P56K561K099M4j241j093o93k60j41l12j23j0j21lj09R6j52
1579B231J292J46nL83R26J307L336N991J5835Q92k0692m760j929j059o26l67l30l12j70q8
1392B001k35p1j42n3j41M8m1r0n9p8O3k3l1k5n9k9k7m7l9j6J0jo2N6p9l6L2J7j5Pm9j4o6K4
1072G30J7l4N7pr3q7M7K8J7l9L8j2j6j8L9k3q7O6K6n9l6j9M1j03O8J6m7LO8Mk7Ql4L8j13P3
734E30K5Lj6n8O2o7N3j6o7M1M6K5Nk7L6j2k52K75J57K62M88M12J22m09o70j95k9j39m1p6J5
443D83m1Pj8j8mp1NP8m5oJ5K8nj9M3K7p0J8m2J9m6l4OM2l1L6K7M6o7Ol0q6O7lJ3m8L6L9r4
77B63R2j8L2l8J4Rk1Oj7O2j02l3Q1Lk5l4J00k0m0n9K0K6L2p5N4L7j04j3m4J08j6N9o3Q0q4
$$ plain form
-252 272 240 367 314 304 271 302 309 316 228 284 161 223 92 99 60
$$ packed form
-252B72l2J27n3j0l3L1PPq8N6j23O2j31Pl9
-392F0
##PAGE=	F1=-8975.09
##FIRST=	19140.455529915001534,	4405.895418600002813,	0
##DATA TABLE=	(F2++(Y..Y)), PROFILE
$$ plain form
4406 58 79 122 166 189 273 285 293 262 254 213 316 315 301 277 335 286 259 320 271 313 296 335 330 302 328 320 300 289 309 270 406 337 336 365 374 299 369 336
4049 336 359 337 369 370 361 385 358 357 303 296 326 376 389 329 364 313 346 404 441 324 328 373 429 412 388 367 307 370 422 355 361 383 458 407 380 357 374
3702 374 449 383 459 387 392 385 432 406 398 381 442 471 487 539 506 485 443 419 516 446 457 457 425 500 448 492 516 481 499 513 529 638 512 506 465 453
3364 453 481 516 560 523 588 554 472 510 574 577 624 556 564 616 650 613 649 618 584 572 572 572 670 651 732 732 673 742 658 652 837 700 714 579 634 685
3026 685 725 719 664 753 721 830 770 780 861 800 907 993 1070 941 571 497 623 687 752 786 762 784 874 747 897 815 960 962 1161 1366 1847
2734 1847 1831 1233 890 897 1009 997 961 968 1007 1042 1112 1081 1048 1163 1133 1181 1191 1287 1273 1278 1297 1473 1416 1379 1411 1442 1479 1466 1543 1537 1583 1708 1721
2425 1721 1742 1754 1795 1913 1991 2050 2110 2146 2176 2315 2340 2360 2465 2579 2694 2715 2854 3059 3178 3586 4022 3128 3387 3701 3891 4165 4551
2171 4551 4993 5387 5790 6376 6688 7279 8240 9549 11055 13346 16460 21324 30696 57799 146976 114477 44910 28157
$$ packed form
4406E8K1M3M4K3Q4J2Ql1qm1J03jj4k4N8m9k7O1m9M2j7L9nk8K6qk0j1K0l9J36o9jK9Rp5P0l3
4049C36K3k2L2JrK4k7jn4pL0N0J3o0L5n1L3N8L7j17MM5N6j7k4k1o0O3N2o7OK2P5n1k7k3J7
3702C74P5o6P6p2NpM7k6qj7O1K9J6N2l3k1m2k4R7p0J1%l2P5n2M4K4l5J8J4J6J09j26om1j2
3364D53K8L5M4l7O5l4q2L8O4LM7o8QN2L4l7L6l1l4j2%%R8j9Q1%n9O9q4oJ85j37J4j35N5N1
3026F85M0on5Q9l2J09o0J0Q1o1J07Q6P7j29l70p4J26O4O5L4k4K2R0j27J50q2J45KJ99K05M81
2734A847j6n98l43PJ12j2l6PL9L5P0l1l3J15l0M8J0R6j4NJ9J76n7l7L2L1L7j3P7oM6J25J3
2425A721K1J2M1J18P8N9O0L6L0J39K5K0J05J14J15K1J39K05J19M08M36q94K59L14J90K74L86
2171D551M42L94M03N86L12N91R61J309J506K291L114M864R372K7103Q9177l2499o9567j6753
$$ plain form
2002 28157 21040 15472 12538 10649 9297 8275 7232 6709 6127 5590 5166 4717 4483 4112 3853 3519 3129 3342 3862 3308
1814 3308 3081 2927 2756 2479 2337 2208 1992 1845 2425 4806 7026 6903 5500 4399 3785 3538 3310 3016 2907 2928 2824 2846
1608 2846 2747 2816 2685 3885 3973 3997 4299 5198 6401 9446 14975 29471 29750 10347 5949 4159 3194 2649 2372 2077 1818
1410 1818 1687 1646 1424 1384 1278 1217 1095 1184 1159 1104 1075 983 994 988 1006 990 925 923 909 855 816 825 817 822 768 827 733 704 743 774 761 763 734 714 640
1082 640 683 700 659 694 718 615 561 608 621 628 618 638 633 620 602 631 619 533 612 586 564 507 504 536 446 520 550 491 489 547 555 522 532 516 538 438
744 438 514 512 505 501 442 507 453 472 442 391 431 458 492 481 436 452 423 176 471 599 856 1427 1960 2177 1801 1128 893 847 724 674 589
453 589 581 530 550 515 477 479 416 413 466 450 426 438 492 477 439 494 518 449 459 402 413 375 341 376 394 353 392 447 460 408 412 382 284 355 361 359 326 346
96 346 382 302 388 369 392 354 382 399 365 368 358 422 308 281 356 367 327 301 405 381 365 291 299 333 370 285 362 389 278 263 208 339 302 358 315
$$ packed form
2002B8157p117n568k934j889j352j022j043n23n82n37m24m49k34l71k59l34l90K13N20n54
1814C308k27j54j71k77j42j29k16j47N80K381K220j23j403j101o14k47k28k94j09K1j04K2
1608B846r9O9j31J200Q8K4L02Q99J203L045N529J4496K79j9403m398j790r65n45k77k95k59
1410A818j31m1k22m0j06o1j22Q9k5n5k9r2J1oJ8j6o5kj4n4l9RqNn4N9r4k9L9L1j3Kk9k0p4
1082F40M3J7m1L5K4j03n4M7J3Pj0K0nj3j8K9j2q6P9k6k2n7lL2r0P4L0n9kN8Ql3J0j6K2j00
744D38P6kpmn9O5n4J9l0n1M0K7L4j1m5J6k9k47K95J28K57N71N33K17l76o73k35m6j23n0q5
453E89qn1K0l5l8Ko3lN3j6k4J2N4j5l8N5K4o9J0n7J1l8l4L5J8m1L9N5J3n2Ml0r8P1Okl3K0
96C46L6q0Q6j9K3l8K8J7l4Lj0O4j14k7P5J1m0k6J04k4j6p4QL4L7q5P7K7j11j5n5J31l7N6m3
$$ plain form
-233 315 365 295 275 396 351 321 299 331 333 337 234 280 195 226 92 125 71
$$ packed form
-233C15N0p0k0J21m5l0k2L2KMj03M6q5L1j34L3n4
-392G1
##PAGE=	F1=-9053.85
##FIRST=	19140.455529915001534,	4405.895418600002813,	0
##DATA TABLE=	(F2++(Y..Y)), PROFILE
$$ plain form
4406 48 92 140 176 200 294 301 307 269 270 245 322 315 313 303 348 294 273 340 291 323 314 360 359 307 331 322 310 304 315 288 436 347 376 390 371 320 369 334 376
4040 376 353 378 389 389 420 365 382 314 310 331 422 419 338 369 351 366 420 456 332 343 414 460 439 415 391 318 390 441 355 374 398 470 393 378 370 402
3702 402 483 409 470 401 409 396 444 422 426 398 458 496 516 567 538 496 468 468 543 463 482 476 457 529 471 533 548 497 535 544 569 662 530 513 506 477 510
3354 510 548 603 569 634 579 503 551 614 611 660 559 598 655 686 654 682 654 599 606 620 628 718 688 766 767 706 782 673 676 860 764 683 587 673 735 780
3016 780 782 718 798 754 866 810 818 881 823 962 1040 1083 893 517 533 685 778 857 867 834 869 967 844 1001 933 1082 1106 1310 1487 1941
2734 1941 1767 1054 795 877 1019 987 977 1001 1039 1065 1169 1152 1116 1231 1190 1263 1281 1368 1361 1356 1405 1583 1510 1461 1511 1551 1594 1550 1637 1647 1715 1828
2434 1828 1858 1882 1894 1943 2054 2137 2203 2283 2322 2357 2500 2523 2549 2669 2791 2912 2934 3105 3324 3455 3923 4395 3370 3680 4017 4234 4550
2180 4550 4973 5453 5891 6350 7020 7360 8015 9089 10549 12282 14831 18301 23751 34263 64624 164882 128907 50864
$$ packed form
4406D8M4M8L6K4R4POl8Jk5P7pkj0M5n4k1O7m9L2rM6jn2K4rj2oJ1k7J48q9K9J4j9n1M9l5M2
4040C76k3K5J1%L1n5J7o8mK1R1lq1L1j8J5N4L6j24J1P1M6k1k4k4p3P2N1q6J9K4P2p7j5qL2
3702D02Q1p4O1o9Qj3M8k2Mk8O0L8K0N1k9m2k8%P5q0J9oj9P2n8O2J5n1L8RK5R3j32j7pk9L3
3354E10L8N5l4O5n5p6M8O3lM9j01L9N7L1l2K8k8n5PJ4QR0l0P8Jo1P6j09LJ84r6q1r6Q6O2M5
3016G80Ko4Q0m4J12n6QO3n8J39P8M3j90l76J6J52R3P9J0l3L5R8j23J57o8J49K4K04J77M54
2734A941j74p13k59Q2J42l2j0K4L8K6J04j7l6J15m1P3J8Q7pnM9J78p3m9N0M0M3m4Q7J0O8J13
2434A828L0K4J2M9J11Q3O6Q0L9L5J43K3K6J20J22J21K2J71K19J31M68M72j025L10L37K17L16
2180D550M23M80M38M59O70L40O55J074J460J733K549L470N450J0512L0361J00258l5975p8043
$$ plain form
2011 50864 32014 22997 17104 13991 11946 10456 9328 8171 7619 6977 6380 5914 5434 5175 4777 4477 4103 3690 3890 4549
1824 4549 3944 3714 3548 3365 3116 3032 2932 2775 2718 3451 5666 7680 7226 5586 4453 3896 3696 3404 3147 3063 3114 3040 3079 3015
1598 3015 3086 3016 4127 4115 4177 4440 5296 6417 9170 14032 26996 26658 8848 4875 3214 2326 1855 1657 1419 1201 1113
1401 1113 1113 924 930 862 798 709 844 833 816 825 724 691 710 777 767 697 737 730 671 637 669 645 662 628 681 584 566 614 647 630 644 633 600 538 587
1072 587 604 553 568 617 515 508 548 548 535 561 557 564 557 539 549 542 459 554 481 506 422 448 453 393 475 512 451 436 485 485 447 465 458 471 395 467 434 416 411
706 411 373 431 392 380 324 299 342 344 373 339 275 266 199 80 298 385 652 1424 2212 2512 2035 1283 1004 913 807 745 661 632 572 612 563
415 563 511 515 462 459 482 492 449 459 543 513 463 523 543 472 475 408 414 386 354 420 409 362 402 481 462 424 421 396 295 367 383 365 351 356 381 323 403 385
58 385 391 360 399 409 368 370 372 430 307 292 361 374 320 304 409 383 389 301 302 351 378 293 389 392 288 277 220 360 306 350 332 352 295 293 399 359 312
$$ packed form
2011E0864j8850r017n893l113k045j490j128j157n52o42n97m66m80k59l98l00l74m13K00O59
1824D549o05k30j66j83k49q4j00j57n7P33K215K014m54j640j133n57k00k92k57q4N1p4L9o4
1598C015P1p0J111j2O2K63Q56J121K753M862J2964l38j7810l973j661q88m71j98k38k18q8
1401A113%j89Oo8o4q9J35j1j7Rj01l3J9O7j0p0M0pn9l4L2k4J7l4N3r7j8M8L3j7J4j1l3o2M9
1072E87J7n1J5M9j02pM0%j3K6mPpj8J0pq3R5p3K5q4K6No0Q2L7o1j5M9%l8J8pJ3p6P2l3j8n
706D11l8N8l9j2n6k5M3KK9l4o4ro7j19K18Q7K67P72P88L00m77p52k79r1j06o2q4k9o0M0m9
415E63n2Mn3lK3J0m3J0Q4l0n0O0K0p1Lo7Ok8l2O6j1m7M0P9j9l8lk5j01P2J6j8j4NK5n8Q0j8
58C85Ol1L9J0m1KKN8j23j5O9J3n4j6J05k6Oq8JM9K7q5R6Lj04j1n7J40n4M4j8K0n7kJ06m0m7
$$ plain form
-289 312 300 337 337 334 222 250 214 212 88 146 75
$$ packed form
-289C12j2L7%lj12K8l6kj24N8p1
-392G5
##PAGE=	F1=-9132.6
##FIRST=	19140.455529915001534,	4405.895418600002813,	0
##DATA TABLE=	(F2++(Y..Y)), PROFILE
$$ plain form
4406 35 101 146 171 194 291 289 297 253 267 260 302 291 300 299 329 276 270 336 287 306 303 357 354 289 305 298 294 293 298 279 421 326 381 379 333 310 338 302 365 337 355
4021 355 373 380 418 339 372 295 293 307 428 409 318 342 356 356 401 434 311 331 419 453 424 403 380 301 378 420 326 354 378 444 348 350 359 401 482 404
3683 404 442 378 386 368 423 399 420 386 430 484 510 547 529 467 456 478 526 442 466 450 449 518 457 535 533 465 528 522 562 631 508 479 504 455 492 530
3345 530 594 561 626 556 492 545 598 587 631 513 580 642 665 641 653 632 555 582 604 625 697 665 716 715 666 745 617 636 803 761 600 546 656
3035 656 723 771 773 700 767 714 828 775 780 817 772 929 988 994 773 455 541 699 807 896 884 839 881 975 862 1012 959 1101 1139 1323 1459
2744 1459 1855 1527 747 635 794 948 902 919 951 994 1009 1149 1140 1100 1198 1147 1243 1263 1340 1345 1329 1408 1564 1473 1413 1481 1525 1568 1495 1586 1614
2453 1614 1698 1788 1830 1861 1865 1922 2013 2093 2160 2248 2288 2322 2460 2474 2508 2630 2745 2868 2887 3072 3287 3416 3900 4362 3304 3635 3966 4186
2190 4186 4515 4929 5401 5846 6319 7010 7347 7995 9083 10560 12352 14906 18395 23905 34541 65240 166870 130861
$$ packed form
4406C5O6M5K5K3R7kQm4J4pM2j1RjL0n3oO6m9J9lN4lo5J6pmjNj9J42r5N5km6k3K8l6O3k8J8
4021C55J8PL8p9L3p7kJ4J21j9r1K4J4%M5L3j23K0Q8L4k9k1k3p9P7M2r4K8K4O6r6KRM2Q1p8
3683D04L8o4Qj8N5k4K1l4M4N4K6L7j8o2j1K2M8q4K4j6jO9o1P8ko8O3oM0O9j23k9K5m9L7L8
3345E30O4l3O5p0o4N3N3j1M4j18O7O2K3k4J2k1p7K7K2K1P2l2N1jm9P9j28J9J67m2j61n4J10
3035F56O7M8Kp3O7n3J14n3NL7m5J57N9Ok21l18Q6J58J08Q9j2m5M2R4j13J50n3J42L8J84J36
2744A459L96l28p80j12J59J54m6J7L2M3J5J40rm0R8n1R6K0P7Nj6P9J56r1o0O8M4M3p3R1K8
2453A614Q4R0M2L1MN7R1Q0O7Q8M0L4J38J4L4J22J15J23J9J85K15J29M84M62j058L31L31K20
2190D186L29M14M72M45M73O91L37O48J088J477J792K554L489N510J0636L0699J01630l6009
$$ plain form
2021 130861 51858 32647 22696 17105 14098 12087 10598 9468 8307 7776 7134 6530 6066 5602 5346 4959 4646 4263 3871
1842 3871 4037 4776 4183 3964 3801 3627 3422 3406 3346 3263 3312 4224 6278 7873 7048 5237 4123 3629 3479 3163 2969 2924 3000 2963
1617 2963 3002 2985 3077 3097 4101 3976 4078 4338 5140 6204 8728 12922 24524 23931 7669 4070 2510 1637 1190 970 809
1420 809 556 481 493 343 409 372 312 283 461 457 489 521 413 362 431 523 507 444 539 523 464 441 486 442 481 481 507 434 431 480 502 472 514 514 462
1091 462 436 477 488 423 430 499 412 460 479 462 428 482 453 481 483 460 446 437 365 465 371 440 329 399 362 346 435 460 409 370 412 401 359 395 383
763 383 392 356 405 346 318 307 312 348 323 285 207 233 265 246 248 187 131 95 78 237 111 168 480 1484 2511 2849 2202 1356 1042 897 808
471 808 733 657 613 548 612 556 497 502 460 464 460 489 429 437 551 502 449 509 521 452 445 377 379 365 337 427 390 341 381 474 432 408 390 378 280 348 372 342
115 342 346 341 349 321 387 376 360 344 389 380 338 342 360 403 279 275 340 347 287 281 379 361 381 279 282 347 352 280 386 355 270 268 220 350 287 310 318 312 270 285
$$ packed form
2021A30861p9003j9211r951n591l007k011j489j130j161n31o42o04m64m64k56l87l13l83l92
1842C871J66P39n93k19j63j74k05j6o0q3M9R12K054J595q25j811j114m94j50l16j94m5P6l7
1617B963L9j7R2K0J004j25J02K60Q02J064K524M194J1602n93j6262l599j560q73m47k20j61
1420H09k53p5J2j50O6l7o0k9J78mL2L2j08n1O9R2j6o3R5j6n9k3M5m4L9%K6p3lM9K2l0M2%n2
1091D62k6M1J1o5PO9q7M8J9j7l4N4k9K8Kk3j4rp2J00r4O9j11P0l7j6Q9K5n1l9M2j1m2L6j2
763C83Rl6M9n9k8j1NL6k5l8p8K6L2j9Ko1n6l6j7J59j26N7L12J004J027L38o47q46l14j45q9
471H08p5p6m4o5O4n6n9Nm2MmK9o0QJ14m9n3O0J2o9po8Kj4k8R0l7m9M0R3m2k4j8j2r8O8K4l0
115C42MnQk8O6j1j6j6M5rm2MJ8M3j24mO5Po0oR8j8K0j02LO5Np2J06l1q5km8J30o3K3Qom2J5
$$ plain form
-261 285 373 333 275 271 316 318 302 192 201 215 184 86 159 73
$$ packed form
-261B85Q8m0n8mM5Kj6j10RJ4l1r8P3q6
-392G3
##PAGE=	F1=-9211.36
##FIRST=	19140.455529915001534,	4405.895418600002813,	0
##DATA TABLE=	(F2++(Y..Y)), PROFILE
$$ plain form
4406 23 105 138 152 172 266 252 264 216 247 254 257 246 263 268 281 233 250 310 258 266 266 325 315 250 254 254 256 259 263 246 363 276 351 332 268 271 279 248 326 292 307
4021 307 325 336 380 289 332 248 248 261 395 361 271 289 326 316 351 377 268 290 387 407 372 352 338 257 336 362 273 303 326 380 278 303 328 374
3702 374 446 371 380 322 330 302 372 339 382 348 364 436 470 484 479 404 409 447 465 388 414 384 401 466 407 494 475 391 480 451 507 551 450 410 460 395
3364 395 430 465 536 502 563 486 441 492 530 508 543 429 515 579 596 581 566 558 465 506 527 562 609 582 586 579 561 639 500 539 675 699 477 463
3044 463 585 653 698 695 613 666 607 718 674 671 679 659 821 855 828 626 411 504 655 769 858 830 775 818 897 794 926 886 1011 1052 1197
2753 1197 1282 1605 1170 364 470 672 811 761 800 827 879 886 1062 1054 1004 1071 1015 1127 1141 1209 1231 1204 1308 1421 1315 1245 1326 1368 1407 1313
2472 1313 1398 1443 1532 1593 1643 1682 1671 1734 1797 1866 1926 2013 2048 2075 2200 2201 2242 2355 2447 2569 2582 2757 2950 3064 3516 3926 2939 3258 3549
2199 3549 3750 4061 4423 4842 5254 5696 6343 6648 7219 8217 9572 11241 13546 16711 21740 31449 59476 152423 119864
$$ packed form
4406B3Q2L3J4K0R4j4J2m8L1PLj1J7NJ3m8J7O0n2Q%N9j0o5M%KLMj7J17q7P5j9o4LQl1P8l4J5
4021C07J8J1M4r1M3q4%J3J34l4r0J8L7j0L5K6j09K2R7K0l5k0j4q1P9K6q9L0K3N4j02K5K5M6
3702C74P2p5Rn8Qk8P0l3M3l4J6P2L4J4np5NL8J8p7K6l0J7O5n9Q7j9q4Q9k9N6M4j01m0N0o5
3364C95L5L5P1l4O1p7m5N1L8k2L5j14Q6O4J7j5j5qr3M1K1L5M7k7Mpj8P8j39L9J36K4k22j4
3044D63J22O8M5lq2N3n9J11m4lQk0J62L4k7k02k15R3J51J14Q9k8n5M3P9j03J32m0J25M1J45
2753A197Q5L23m35q06J06K02J39n0L9K7N2PJ76qn0O7n6J12J4O8K2k7J04J13j06p0Q1M2L9r4
2472A313Q5M5Q9O1N0L9j1O3O3O9O0Q7L5K7J25JM1J13R2J22J3J75J93J14M52M10r87L19K91
2199C549K01L11L62M19M12M42O47L05N71R98J355J669K305L165N029R709K8027R2947l2559
$$ plain form
2021 119864 47666 29920 20193 15463 12828 11036 9688 8664 7610 7147 6569 6009 5591 5186 4959 4623 4322 3966 3635
1842 3635 3754 4495 3976 3782 3636 3494 3336 3388 3370 3360 3506 4522 6362 7459 6320 4473 3448 3032 2925 2624 2506 2512 2603
1626 2603 2601 2627 2650 2773 2892 3779 3558 3688 3963 4704 5725 8103 11792 22510 22166 7179 3853 2430 1589 1162 814
1429 814 737 445 303 178 196 113 87 143 227 252 242 302 295 209 254 344 371 324 306 424 383 336 335 365 305 355 400 374 362 365 394 400 353 425 421
1101 421 354 382 398 394 315 342 417 358 444 430 395 353 410 363 418 424 390 355 339 300 378 306 395 272 379 302 335 421 418 380 306 351 332 287 348
772 348 325 331 342 349 285 245 244 297 293 281 227 171 259 248 231 197 160 204 210 321 397 138 214 468 1548 2683 3023 2225 1324 993 802 729
471 729 641 579 523 458 542 493 436 439 410 420 399 439 366 372 513 447 394 454 453 394 373 313 313 315 292 393 338 290 330 426 371 359 324 331 243 302 329
124 329 293 313 301 293 297 343 342 304 309 353 316 279 286 320 345 228 234 295 290 233 236 317 321 345 230 245 321 296 245 352 286 228 238 206 308 247 246 276
$$ packed form
2021A19864p2198j7746r727m730k635j792j348j024j054m63n78n60m18m05k27l36l01l56l31
1842C635J19P41n19j94j46j42j58N2j8j0J46J016J840J097j139j847j025m16j07l01j18OR1
1626B603kK6K3J23J19Q87k21J30K75P41J021K378L689J0718l44j4987l326j423q41m27l48
1429H14p7k92j42j25J8q3k6N6Q4K5j0O0pq6M5R0K7m7j8J18m1m7jL0o0N0M5k6j2LK9Om7P2m
1101D21o7K8J6mp9K7P5n9Q6j4l5m2N7m7N5Ol4l5j6l9P8p2Q9j23J07p7L3Q6ll8p4M5j9m5O1
772C48k3OJ1Po4m0jN3mj2n4n6Q8j1j7l4l7M4OJ11P6k59P6K54J080J135L40p98r01l31j91p3
471G29q8o2n6o5Q4m9n7Lk9J0k1M0p3OJ41o6n3O0jn9k1o0%Kk3J01n5m8M0R6n5j2l5Pq8N9K7
124C29l6K0j2qMM6jl8NM4l7l7PL4K5j17OO1nn7LQ1MK4j15J5P6k5n1J07o6n8J0l2J02o1jL0
$$ plain form
-233 276 249 224 250 321 278 219 219 271 276 247 152 142 202 146 87 161 66
$$ packed form
-233B76k7k5K6P1m3n9%N2Nk9r5j0O0n6n9P4r5
-392F6
##PAGE=	F1=-9290.11
##FIRST=	19140.455529915001534,	4405.895418600002813,	0
##DATA TABLE=	(F2++(Y..Y)), PROFILE
$$ plain form
4406 23 102 119 123 141 225 198 214 169 214 230 199 190 210 214 215 177 216 272 211 212 210 273 251 196 190 197 200 212 218 196 277 206 292 259 188 211 203 182 269 228 245
4021 245 255 265 315 226 270 186 186 203 330 284 210 223 271 257 282 298 212 228 325 331 296 276 274 196 274 280 207 232 252 291 196 246 286 326 386 318
3683 318 300 250 252 212 301 256 319 292 274 363 403 391 400 317 336 383 375 313 339 294 323 383 330 419 389 289 403 344 421 441 370 321 386 311 340
3354 340 368 443 407 459 383 361 402 428 394 419 328 417 482 498 497 443 450 353 397 410 455 475 461 407 382 409 485 349 405 504 602 333 353 474
3035 474 544 579 571 481 520 459 558 531 516 495 514 667 676 632 504 390 417 556 670 755 722 664 701 758 661 769 736 839 881 979 1013 1286
2734 1286 842 82 371 539 636 594 645 655 717 723 928 916 849 878 824 942 943 1002 1044 1011 1134 1194 1076 994 1081 1118 1147 1043 1117 1173 1255
2443 1255 1288 1339 1389 1355 1423 1458 1512 1555 1634 1660 1674 1784 1765 1813 1909 1965 2085 2092 2233 2393 2483 2861 3195 2360 2638 2865 3026 3293 3574
2171 3574 3908 4253 4630 5185 5438 5882 6705 7832 9234 11099 13680 17818 25793 48841 125369 98877 39455 24629
$$ packed form
4406B3P9J7MJ8Q4k7J6m5M5J6l1rK0MJl8L9N6o1JkO3k2n5oPLJ2Ok2Q1p1Q6l3p1K3qk1Q7m1J7
4021B45J0J0N0q9M4q4%J7J27m6p4J3M8j4K5J6q6J6R7Ol5k0kp8P8Op3K5K0L9r5N0M0M0O0o8
3683C18j8n0Km0Q9m5O3k7j8Q9M0j2Rq3J9M7qo2K6m5K9O0n3Q9l0j00J14n9P7K0p1m9O5p5K9
3354C40K8P5l6N2p6k2M1K6l4K5r1Q9O5J6jn4Pr7M4J3M5K0j4n4k5K7P6j36N6R9R8k69K0J21
3035D74P0L5qr0L9o1R9k7j5k1J9J53Rm4j28j14K7J39J14Q5l3n8L7N7r7J08l3J03M2R8L4K73
2734A286m44p60K89J68R7m2N1J0O2OK05j2o7K9n4J18JN9M2l3J23O0j18q2Q7L7K9j04P4N6Q2
2443A255L3N1N0l4O8L5N4M3P9K6J4J10j9M8R6N6J20PJ41J60R0L78L34q35K78K27J61K67K81
2171C574L34L45L77N55K53M44Q23J127J402J865K581M138P975K3048P6528k6492n9422j4826
$$ plain form
2002 24629 16123 12595 10513 9074 7966 7134 6270 5910 5442 4969 4628 4308 4128 3875 3607 3299 3058 3131 3794 3399 3240
1805 3240 3118 3026 2909 3016 3036 3087 3306 4336 5938 6602 5274 3505 2600 2263 2186 1925 1869 1936 2027 2059 2064 2098 2250 2459 3233
1570 3233 2961 3101 3388 4064 5034 7301 10634 20803 20945 7073 3955 2691 1913 1511 1126 1048 827 685 570 591 450
1373 450 421 476 496 390 388 382 309 307 431 458 391 330 353 418 366 342 362 357 305 325 400 328 377 369 364 366 314 387 367 311 372 363 345 264 325 388 355 445
1016 445 407 356 322 352 306 384 384 337 293 275 279 319 299 373 259 379 282 348 421 393 363 252 303 289 243 325 294 296 340 307 263 206 236 313 271
687 271 271 215 209 320 278 271 221 246 332 354 500 496 271 387 584 1557 2647 2971 2098 1206 881 661 601 504 454 388 323 418 387 342 342
396 342 324 338 311 355 275 276 437 361 313 368 356 314 276 231 229 247 227 325 266 218 259 346 292 289 240 264 190 237 261 228 256 244 222 255 277 290
58 290 233 260 303 235 203 213 262 270 163 178 236 213 166 178 234 271 291 165 198 277 220 196 299 204 170 193 182 244 194 170 213 173 167 194 249
$$ packed form
2002B4629q506l528k082j439j108q32q64l60m68m73l41l20j80k53k68l08k41P3O63l95j59
1805C240j22r2j17J07K0N1K19J030J602O64j328j769r05l37p7k61n6O7R1L2NL4J52K09P74
1570C233k72J40K87O76R70K267L333J0169J42j3872l118j264p78m02l85p8k21j42j15K1j41
1373D50k9N5K0j06kop3kJ24K7o7o1K3O5n2k4K0nn2K0P5p2M9qnKn2P3k0n6O1rj8q1O1O3l3R0
1016D45l8n1l4L0m6P8%m7m4j8MM0k0P4j14J20r7O6P3k8l0j11N1j4m6Q2l1KM4l3m4n7L0P7m2
687B71%n6oJ11m2pn0K5Q6K2J46mk25J16J97R73J090L24q73q92l25k20o0r7n0o6o5R5l1m5%
396C42j8J4k7M4q0JJ61p6m8N5j2m2l8m5kJ8k0R8n9m8M1Q7n4lm9K4p4M7K4l3K8j2k2L3K2J3
58B90n7K7M3o8l2J0M9Qj07J5N8k3m7J2N6L7K0j26L3P9n7k4J03r5l4K3j1O2n0k4M3m0oK7N5
$$ plain form
-270 249 206 157 155 211 219 180 112 85 176 106 87 152 56
$$ packed form
-270B49m3m9kN6Ql9o8k7R1p0j9O5r6
-392E6
##PAGE=	F1=-9368.87
##FIRST=	19140.455529915001534,	4405.895418600002813,	0
##DATA TABLE=	(F2++(Y..Y)), PROFILE
$$ plain form
4406 31 90 95 91 106 182 141 155 122 177 197 142 135 152 151 142 120 175 230 161 157 149 215 180 139 128 139 137 159 174 141 191 130 219 178 108 141 127 118 202 156
4030 156 181 177 180 236 161 206 120 121 144 251 197 149 156 201 191 211 216 154 157 248 240 212 192 202 129 205 195 139 154 170 196 116 189 241 272 317 261 220
3673 220 181 174 115 221 167 244 229 179 281 324 289 308 226 254 302 275 235 262 203 229 285 241 323 296 181 314 226 321 325 287 232 300 224 245
3354 245 258 339 299 343 269 272 295 318 269 290 231 307 373 397 418 317 339 250 288 283 335 337 340 251 162 243 315 193 260 328 498 195 233 344
3035 344 419 440 433 334 364 300 378 377 347 300 370 502 496 456 439 389 293 419 534 614 586 535 567 602 505 586 558 642 687 752 750 1037 745 381
2716 381 360 414 454 431 479 467 535 549 772 759 669 659 611 728 713 763 825 790 929 944 822 722 800 834 853 749 805 865 932 941 988 1050
2415 1050 991 1062 1076 1116 1134 1203 1219 1216 1311 1271 1320 1400 1412 1532 1536 1626 1747 1812 2092 2350 1703 1924 2079 2186 2397 2589 2824 3082 3372
2143 3372 3814 4015 4319 4923 5776 6847 8192 10078 13153 19039 36104 92809 73468 29458 18269 11521 9231
$$ packed form
4406C1N9NmJ5P6m1J4l3N5K0n5pJ7jrk2N5N5o9mqO6l5m1j1J1kK2J5l3N0o1Q9m1p0L3j4rQ4m6
4030A56K5mLN6p5M5q6JK3J07n4m8PM5j0K0No2LR1qk8k0J0p3P6j0n6J5J6K6q0P3N2L1M5n6m1
3673B20l9pn9J06n4P7j5n0J02M3l5J9q2K8M8k7m0K7n9K6N6m4Q2k7j15J33q8R5Ml8n5O8p6K1
3354B45J3Q1m0M4p4LK3K3m9K1n9P6O6K4K1j01K2q9L8nN2KLq9q9Q1P2j22O7O8J70l03L8J11
3035C44P5K1pr9L0o4P8jl0m7P0J32om0j7n0r6J26J15Q0k8n1L2L5r7Q1k8Q4M5O5kK87k92l64
2716C81k1N4M0k3M8j2O8J4K23j3r0j0m8J17j5N0O2l5J39J5j22j00P8L4J9j04N6O0O7RM7O2
2415A050n9P1J4M0J8O9J6lR5m0M9Q0J2J20MR0J21O5K80K58o47K21J55J07K11J92K35K58K90
2143C372M42K01L04O04Q53J071J345J886L075N886J7065N6705j9341m4010j1189o748k290
$$ plain form
1983 9231 7755 6723 5890 5287 4647 4403 4070 3702 3452 3219 3089 2937 2715 2459 2310 2351 2882 2633 2513 2415 2383 2295 2433 2488
1758 2488 2581 2846 3832 5254 5684 4336 2688 1857 1565 1493 1276 1231 1359 1444 1506 1504 1504 1665 1948 2635 2375 2515 2796 3414 4334
1523 4334 6500 9588 19350 19875 6962 4001 2869 2149 1753 1373 1258 1079 923 807 802 645 601 658 648 513 528 481 397
1307 397 425 565 549 449 405 418 434 388 383 416 391 348 329 415 328 402 379 347 361 313 362 327 299 359 339 321 248 328 378 359 435 389 329 307
988 307 302 267 356 348 290 249 238 271 285 303 357 254 373 271 352 413 379 352 206 255 259 205 302 271 268 326 271 257 176 238 318 257 267 212 229
659 229 348 302 296 233 292 401 426 584 524 344 495 693 1501 2433 2734 1879 1050 752 525 472 376 332 255 180 266 260 238 236 224 236
378 236 215 261 182 167 338 268 226 273 249 234 174 152 143 176 152 237 191 142 180 253 210 213 154 190 134 168 181 160 187 180 151 208 205 229 161 210 254
30 254 167 126 137 196 198 95 121 180 135 99 117 146 220 237 107 150 225 144 138 239 137 108 141 153 173 139 101 143 95 109 129 170 130 101 93
$$ packed form
1983I231j476j032q33o03o40k44l33l68k50k33j30j52k22k56j49M1N31k49j20r8l2q8J38N5
1758B488R3K65R86J422M30j348j648q31k92p2k17m5J28Q5O2k%J61K83O87k60J40K81O18R20
1523D334K166L088R762N25j2913k961j132p20l96l80j15j79j56j16nj57m4N7j0j35J5m7q4
1307C97K8J40j6j00m4J3J6m6nL3k5m3j9Q6q7P4k3l2J4m8M9l5k8O0k0j8p3Q0N0j9P6m6o0k2
988C07nl5Q9qn8m1j1L3J4J8N4j03J19j02Q1O1l4k7j46M9Mn4R7l1lN8n5j4q1O2Q0o1J0n5J7
659B29J19m6oo3N9J09K5J58o0j80J51J98Q08R32L01q55q29k98k27n3r6m4p7p5Q6ok2kj2J2
378B36k1M6p9j5J71p0m2M7k4j5o0k2rL3k4Q5m6m9L8P3m3Ln9L6n6L4J3k1K7pk9N7lK4o8M9M4
30B54q7m1J1N9Kj03K6N9m5l6J8K9P4J7j30M3P5q1oJ01j02k9L3J2K0l4l8M2m8J4K0M1m0k9q
$$ plain form
-299 93 147 155 114 77 40 143 69 84 136 46
$$ packed form
-299I3N4Qm1l7l7J03p4J5N2r0
-392D6
##PAGE=	F1=-9447.62
##FIRST=	19140.455529915001534,	4405.895418600002813,	0
##DATA TABLE=	(F2++(Y..Y)), PROFILE
$$ plain form
4406 38 72 73 62 75 145 99 97 82 144 166 103 92 103 93 78 71 133 194 129 113 99 165 125 90 86 91 79 110 140 102 138 66 149 115 44 79 68 67
4049 67 139 90 126 109 98 157 105 157 63 66 92 176 117 97 103 134 128 152 147 109 89 176 153 136 119 137 69 146 128 83 88 94 115 51 139 199 222 251
3692 251 214 159 130 123 46 146 89 170 171 96 206 248 199 221 150 178 225 181 167 201 143 136 193 160 227 214 86 232 124 225 224 217 160 222
3373 222 151 175 159 246 207 249 165 193 195 225 158 182 156 209 269 310 366 230 256 188 217 190 245 248 268 248 83 111 160 59 133 190 411 104
3054 104 120 215 300 307 309 205 233 166 208 239 201 124 256 357 348 341 430 418 168 273 388 469 452 420 460 477 382 431 408 478 536 591 581 942
2734 942 851 606 372 303 287 290 324 289 360 388 616 612 503 461 416 525 498 535 614 582 741 731 620 505 547 584 595 500 532 588 640 629
2434 629 668 747 666 729 739 772 760 826 831 815 897 837 879 951 918 1034 1050 1083 1165 1216 1392 1599 1125 1289 1389 1433 1591 1704 1854 2019
2152 2019 2215 2555 2719 2916 3309 3906 4685 5569 6821 8942 12932 24569 63253 50331 20369 12624 7551 6232
$$ packed form
4406C8L4Jj1J3P0m6kj5O2K2o3j1J1j0j5pO2O1o5j6j4O6m0l5mNj2L1L0l8L6p2Q3l4p1L5j1j
4049F7P2m9L6j7j1N9n2N2r4LK6Q4n9k0OL1oK4nl8k0Q7k3j7j7J8o8P7j8m5NOK1o4Q8O0K3K9
3692B51l7n5k9pp7J00n7Q1Jp5J10M2m9K2p1K8M7m4j4L4n8pN7l3O7j3j28J46j08J01jpn7O2
3373B22p1K4j6Q7l9M2q4K8KL0o7K4k6N3O0M1N6j36K6o8K9k7N5LK0k0j65K8M9j01P4N7K21l07
3054A04J6R5Q5PKj04K8o7M2L1l8p7J32J01rpQ9j2k50J05J15Q1j7l2M0J7r5M9k3P0N8N5j0L61
2734I42r1k45k34o9j6LL4l5P1K8K28mj09m2m5J09k7L7P9l2J59j0j11j15M2L7J1r5L2N6N2j1
2434F29L9P9q1O3J0L3j2O6Nj6Q2o0M2P2l3J16J6L3Q2N1J76K07m74J64J00M4J58J13J50J65
2152B019J96L40J64J97L93N97P79Q84J252K121L990J1637L8684j2922k9962p745n073j319
$$ plain form
1983 6232 5277 4611 4021 3619 3177 3036 2837 2569 2401 2236 2143 2082 1922 1704 1614 1645 2027 1917 1835 1754 1781 1712 1852 1941 2058 2343
1739 2343 3284 4638 5064 3847 2306 1494 1185 1092 905 794 951 1036 1121 1154 1082 1207 1548 2196 1986 2130 2396 2969 3861 5948
1514 5948 8902 18389 19093 6805 3914 2867 2206 1820 1460 1308 1166 1003 882 853 701 645 707 685 536 564 501 422 456 605
1288 605 564 454 441 425 418 377 381 427 406 361 310 401 318 394 366 312 347 301 321 278 277 321 300 293 231 307 352 340 402 364 304 289 256 228 318 305
950 305 244 205 210 244 254 281 331 235 350 250 335 387 365 350 188 203 232 160 261 242 234 294 237 249 143 219 296 234 251 203 210 326 303 297
631 297 214 272 402 432 583 502 355 528 749 1429 2167 2429 1665 909 654 436 385 305 271 199 100 118 137 144 150 136 140 127 183 117 68
340 68 234 186 151 194 157 173 89 101 69 114 83 149 126 78 108 169 138 150 88 120 85 115 104 104 121 118 90 165 142 168 102 165 221 139 67 75 136
-7 136 154 37 75 143 78 40 65 67 175 196 85 108 180 99 83 183 115 54 93 126 118 93 68 80 28 58 69 95 62 59 44 91 94 62 53 18
$$ packed form
1983F232r55o66n90m02m42j41j99k68j68j65r3o1j60k18r0L1L82j10q2q1K7o9J40Q9J17K85
1739B343R41J354M26j217j541q12l09r3j87j11J57Q5Q5L3p2J25L41O48k10J44K66N73Q92K087
1514E948K954R487P04j2288k891j047o61l86l60j52j42j63j21k9j52n6O2k2j49K8o3p9L4J49
1288F05m1j10j3j6pm1MM6k1m5n1R1q3P6k8n4L5m6K0m3jM4k1po2P6M5j2O2l8o0j5l3k8R0j3
950C05o1l9NL4J0K7N0r6J15j00Q5N2k2j5j62J5K9p2J01j9qO0n7J2j06P6P7o2J7m8PJ16k3o
631B97q3N8J30L0J51q1j47J73K21O80P38K62p64p56k55k18n1q0l4p2r9J8J9POj4Mj3N6o6m9
340F8J66m8l5M3l7J6q4J2l2M5l1O6k3m8L0O1l1J2o2L2l5L0j1%J7lk8P5k3K6o6O3N6q2p2QO1
-7A36J8j17L8O8o5l8K5KJ08K1j11K3P2q1j6J00o8o1L9L3qk5k5J2n2L0J1K6l3lj5M7Ll2rl5
$$ plain form
-345 18 108 41 75 116 38
$$ packed form
-345A8R0o7L4M1p8
-392C8
##PAGE=	F1=-9526.38
##FIRST=	19140.455529915001534,	4405.895418600002813,	0
##DATA TABLE=	(F2++(Y..Y)), PROFILE
$$ plain form
4406 41 49 55 39 49 119 84 50 53 119 147 92 67 77 58 38 39 98 163 119 87 74 136 103 59 75 66 41 72 114 91 136 47 107 98 32 45 48 39 85
4040 85 36 84 71 37 88 61 132 19 33 51 119 66 59 75 83 77 115 105 85 37 127 90 77 70 94 23 107 94 50 58 34 65 22 103 165 184 197
3692 197 186 123 103 111 73 83 40 109 125 39 147 188 138 155 102 118 172 107 115 167 130 62 125 101 153 153 37 167 76 145 146 166 119 165 102
3364 102 143 86 178 145 201 94 142 124 168 83 106 109 143 183 246 336 201 212 168 203 170 215 232 261 348 236 121 44 39 53 133 355 105
3054 105 27 106 202 199 217 119 154 92 73 136 110 16 188 251 244 295 454 479 131 154 257 345 338 330 398 405 327 339 320 379 453 501 503 917 934
2725 934 703 355 205 152 181 193 142 210 255 475 496 380 320 265 364 334 354 442 415 595 586 508 400 378 426 432 355 355 401 454 416 447 543
2415 543 460 492 513 551 515 584 582 565 634 571 592 665 604 696 745 741 782 835 926 1115 760 878 964 954 1071 1127 1236 1320 1422 1684 1827 1995
2115 1995 2237 2644 3262 3864 4691 6194 8966 17052 43981 35178 14442 9123 5147 4334 3697 3269 2847 2559 2236 2156
$$ packed form
4406D1QOj6J0P0l5l4LO6K8n5k5J0j9k0JN9O5m4l2j3O2l3m4J6rk5L1M2k3M5q9O0ro6J3LrM6
4040H5m9M8j3l4N1k7P1j13J4J8O8n3pJ6QoL8j0k0m8R0l7j3pK4p1Q4j3m4Qk4L1m3Q1O2J9J3
3692A97j1o3k0Ql8J0m3O9J6q6J08M1n0J7n3J6N4o5QN2l7o8O3k4N2%j16J30r1O9JK0m7M6o3
3364A02M1n7R2l3N6j07M8j8M4q5K3LL4M0O3R0j35J1m4L5l3M5J7K9Q7j12j15p7nJ4Q0K22k50
3054A05p8P9R6lJ8r8L5o2j9O3k6r4J72O3pN1J59K5l48K3J03Q8pqO8Pp8J2j9N9P4M8KM14J7
2725I34k31l48j50n3K9J2n1O8M5K20K1j16o0n5R9l0K0Q8k7J80rp8j08k2M8Op7%M6N3l8L1R6
2415E43q3L2K1L8l6O9kj7O9o3K1P3o1R2M9mM1N3R1J89l55J18Q6j0J17N6J09Q4J02K62J43J68
2115A995K42M07O18O02Q27J503K772Q086K6929q803k0736n319l976q13o37m28m22k88l23q0
$$ plain form
1927 2156 2058 1861 1756 1633 1556 1537 1452 1270 1177 1209 1473 1450 1404 1333 1401 1352 1467 1580 1711 1990 2912 4278 4800 3739 2254 1468
1683 1468 1129 1022 850 670 765 866 950 1046 939 981 1345 1998 1813 1963 2225 2753 3635 5653 8552 17827 18628 6669 3772
1467 3772 2754 2150 1782 1445 1269 1153 994 874 815 673 613 676 662 502 527 468 390 419 582 531 415 434 390 376 336 337 395 397 351
1195 351 273 360 293 364 341 270 324 284 277 230 240 272 249 255 207 258 306 301 353 335 284 275 227 189 274 268 208 156 189 202 222 234 296 208 316 223 304
847 304 352 351 359 213 162 222 131 212 215 203 260 212 243 127 191 257 215 232 206 180 278 293 298 201 217 364 404 543 471 333 517 766 1420
537 1420 2017 2203 1545 824 606 407 348 285 270 238 139 37 62 67 101 82 83 58 136 98 23 140 121 98 146 98 137 45 85 20 70 35
237 35 79 78 42 53 110 85 116 63 61 48 87 39 68 74 65 45 138 105 114 67 128 204 141 50 51 94 143 14 49 134 69 7 34 10 140 171 96 75
-120 75 152 106 36 137 124 20 55 105 101 58 80 46 29 21 35 32 26 34 15 52 43 35 37 26 75 24 63 95 34
$$ packed form
1927B156r8j97j05j23p7j9q5j82r3L2K64k3m6p1O8m9J15J13J31K79R22J366N22j061j485p86
1683A468l39j07j72j80R5J01Q4R6j07M2L64O53j85J50K62N28Q82K018K899R275Q01j1959k897
1467C772j018o04l68l37j76j16j59j20n9j42o0O3j4j60K5n9p8K9J63n1j16J9m4j4m0JN8Km6
1195C51p8Q7o7P1k3p1N4m0pm7J0L2k3Om8N1M8nN2j8n1rm8l8Q5oo0n2L3J3K0J2O2q8J08r3Q1
847C04M8jQj46n1O0r1Q1Lj2N7m8L1j16O4O6m2J7k6k6R8J5Nr7J6J47M0J39p2j38J84K49O54
537A420N97J86o58p21k18j99n9o3j5l2r9j02K5NL4j9Jk5P8l8p5J17j9k3M8m8L9r2M0o5N0l5
237C5M4jl6J1N7k5L1n3kj3L9m8K9Ork0R3l3Rm7O1P6o3r1JM3M9j29L5Q5o5o2K7k4J30L1p5k1
-120G5P7m6p0J01j3j04L5N0mm3K2l4j7qJ4loQj9L7rqKj1M9n1L9L2o1
-392C4
##PAGE=	F1=-9605.13
##FIRST=	19140.455529915001534,	4405.895418600002813,	0
##DATA TABLE=	(F2++(Y..Y)), PROFILE
$$ plain form
4406 40 25 41 26 30 99 84 29 33 101 138 97 58 74 58 41 34 72 135 115 71 70 126 100 47 76 62 44 46 90 100 150 69 102 115 56 52 58 33 46
4040 46 15 52 68 44 36 32 121 13 24 21 81 58 39 70 60 41 95 88 80 20 110 76 38 42 78 12 86 85 42 68 22 48 33 80 138 155 154 168 99
3673 99 87 112 114 40 29 65 92 9 109 147 108 118 79 77 149 59 77 148 139 39 87 68 115 111 60 119 88 85 89 132 102 124 67 132 48 136 105
3326 105 183 64 120 93 142 59 56 88 114 116 197 304 195 189 158 213 189 217 240 271 419 338 193 38 96 70 154 334 140 37 42 130
3026 130 123 155 79 123 82 25 71 94 101 162 187 182 297 486 546 191 108 152 251 246 254 360 359 312 294 275 316 396 420 423 841 893 683 299 121
2697 121 52 102 93 34 93 159 354 408 304 248 173 258 236 234 317 292 487 487 457 379 306 357 361 305 282 321 387 319 343 443 393 375 403 446 409
2368 409 479 470 469 525 480 478 550 497 537 620 621 631 685 735 911 626 705 818 787 880 898 1020 1058 1091 1282 1393 1592 1772 2064 2635 3150
2077 3150 3796 5021 7316 13889 35850 28700 11866 7698 4245 3591 3069 2723 2401 2144 1858 1785 1735 1570 1502 1414 1343
$$ packed form
4406D0j5J6j5MO9j5n5MO8L7m1l9J6j6j7pL8O3k0m4jN6k6n3K9j4j8KM4J0N0q1L3J3n9mOk5J3
4040D6l1L7J6k4qmQ9j08J1lO0k3j9L1j0j9N4pqo0R0l4l8ML6o6P4jm3K6m6K6j5M7N8J7jJ4o9
3673I9j2K5Kp4j1L6K7q3J00L8l9J0l9kP2r0J8P1rj00M8j9M7mn1N9l1lMM3l0K2n7O5q4Q8l1
3326A05P8j19N6k7M9q3lL2K6KQ1J07j09ol1N5k4K8K3L1J48q1j45j55N8k6Q4J80j94j03NQ8
3026A30pL2p6M4m1n7M6K3PO1K5nJ15J89O0l55q3M4R9nQJ06jm7j8j9M1Q0K4LM18N2k10l84j78
2697A21o9N0rn9N9O6J95N4j04n6p5Q5k2kQ3k5J95%l0p8p3N1Mn6k3L9O6o8K4J00n0j8K8M3l7
2368D09P0rjN6m5kP2n3M0Q3JJ0N4N0J76k85P9J13l1R3J8J22L8L3J91J11J99J80K92N71N15
2077C150O46J225K295O573K1961p150j6834m168l453o54n22l46l22k57k86p3n0j65o8q8p1
$$ plain form
1880 1343 1304 1279 1154 1026 1042 1258 1244 1225 1162 1239 1220 1308 1420 1563 1821 2729 4120 4695 3722 2240 1496 1145 1038 877 692
1645 692 692 806 864 1001 921 894 1236 1928 1718 1858 2134 2610 3468 5400 8249 17175 18144 6529 3632 2608 2050 1712 1393
1429 1393 1214 1104 960 862 773 622 569 622 632 474 470 429 351 356 536 494 370 413 357 336 302 283 339 374 342 246 313 267 333 321 242 308
1129 308 289 255 205 210 240 207 221 192 203 260 256 299 309 276 273 227 164 246 251 193 116 181 169 198 180 258 189 283 203 269 317 332 366 255 152 236
791 236 150 177 203 190 241 208 248 149 184 227 215 222 228 183 243 288 322 229 197 328 388 516 462 322 507 772 1501 2068 2144 1545 807 602
490 602 422 336 279 276 290 190 102 102 19 76 70 80 22 111 102 62 62 69 63 124 75 114 51 78 13 43 27 55 43 32 21 82 53 107 66 16 26 76
133 76 22 50 58 25 25 127 95 70 53 95 189 139 57 57 73 146 42 48 137 80 34 30 34 115 152 107 55 140 129 11 101 126 25 34 91 110 35
-214 35 95 54 62 11 34 13 50 36 9 42 16 28 25 34 49 20 51 75 32
$$ packed form
1880A343l9k5j25j28J6K16j4j9o3P7j9Q8J12J43K58R08J391N75r73j482p44l51j07j61j85
1645F92%J14N8J37q0k7L42O92k10J40K76M76Q58J932K849Q926R69j1615k897j024n58l38l19
1429A393j79j10j44r8q9j51n3N3J0j58mm1p8NJ80m2j24M3n6k1l4j9N6L5l2r6O7m6O6j2p9O6
1129C08j9l4n0NL0l3J4k9J1N7mM3J0l3lm6o3Q2Nn8p7O5j2K9j8P8o9R4q0O6M8J5L4j11j03Q4
791B36q6K7K6j3N1l3M0r9L5M3j2POm5O0M5L4r3l2J31O0J28n4j40J85K65P29N67P6n99p38k05
490F02j80q6n7lJ4j00q8%q3N7oJ0n8Q9rm0%PoO1m9L9o3K7o5L0j6K8j2j1j1O1k9N4m1n0J0N0
133G6n4K8Ql3%J02l2k5j7M2R4n0q2%J6P3j04OQ9n7m6mMQ1L7m5n2Q5j1j18R0K5j01RN7J9p5
-214C5O0m1Qn1K3k1L7j4k7L3k6J2lRJ5k9L1K4m3
-392C2
##PAGE=	F1=-9683.89
##FIRST=	19140.455529915001534,	4405.895418600002813,	0
##DATA TABLE=	(F2++(Y..Y)), PROFILE
$$ plain form
4406 36 9 28 21 17 78 82 39 18 87 132 104 50 81 73 59 49 51 106 102 55 66 123 92 43 72 64 58 33 66 107 154 83 110 131 71 65 67 33 21 37
4030 37 25 71 70 10 20 112 37 20 3 52 64 42 70 55 33 83 78 78 29 109 92 34 18 75 38 72 77 41 83 50 36 36 68 116 129 115 147 73
3673 73 70 104 133 36 30 38 68 20 89 116 90 103 66 49 143 48 44 127 141 62 68 50 106 83 83 77 101 41 45 105 92 89 35 117 35 106 68 164 54
3307 54 110 84 128 70 17 80 102 65 152 257 174 161 133 211 199 209 227 260 428 371 235 68 117 101 194 342 162 72 62 81 71 107
3007 107 58 103 80 67 42 102 143 151 154 152 313 502 586 241 120 75 176 165 176 314 306 289 254 234 246 320 303 293 681 741 582 219
2706 219 59 17 51 28 35 18 105 250 333 251 212 130 195 183 164 231 199 393 392 407 364 278 320 320 281 248 288 368 276 299 388 381 332 344 383
2378 383 362 424 408 423 469 446 430 500 469 465 555 577 581 617 664 812 577 622 758 739 817 809 951 986 995 1126 1183 1395 1558 1786 2317 2819
2077 2819 3388 4450 6545 12404 31955 25575 10546 6915 3772 3256 2788 2452 2194 1963 1686 1599 1564 1411 1352 1312 1247
$$ packed form
4406C6k7J9pmO1Mm3k1O9M5k8n4L1qj4j0KN5mm7J1N7l1m9K9qok5L3M1M7p1K7K1o0oKl4j2J6
4030C7j2M6jo0J0R2p5j7j7M9J2k2K8j5k2N0n%m9Q0j7n8j6N7l7L4Nl6M2l3j4%L2M8J3j4L2p4
3673G3lL4K9r7oQL0m8O9K7k6J3l7j7R4r5mQ3J4p9Oj8N6k3%oK4o0MO0j3ln4Q2q2P1l8R6j10
3307E4N6k6M4n8n3O3K2l7Q7J05q3j3k8P8j2J0J8L3J68n7j36j67M9j6R3J48j80r0j0J9j0L6
3007A07m9M5k3j3k5O0M1QLkJ61J89Q4l45j21m5J01j1J1J38qj7l5k0J2P4j7j0L88O0j59l63
2706B19j60m2L4k3Pj7Q7J45Q3q2l9q2O5j2j9O7l2J94jJ5m3q6M2%l9l3M0Q0r2K3Q9pm9J2L9
2378C83k1O2j6J5M6k3j6P0l1mR0K2ML6M7J48k35M5J36j9P8qJ42L5RJ31N7K12J63K28N31N02
2077B819N69J062K095N859J9551o380j5029l631l143n16m68l36k58k31k77q7l5j53n9m0o5
$$ plain form
1880 1247 1178 1176 1111 978 965 1178 1134 1134 1074 1142 1154 1238 1331 1484 1727 2607 4013 4602 3671 2175 1464 1126 1013 872 712 649 750
1626 750 779 913 886 826 1104 1862 1618 1729 2018 2443 3253 5068 7851 16179 17412 6333 3511 2477 1944 1644 1338 1173
1420 1173 1053 925 872 772 586 545 577 612 477 437 410 337 304 490 474 350 396 349 312 295 257 285 341 339 239 278 248 311 306 230 298
1129 298 312 264 207 202 239 193 202 195 166 234 215 248 282 273 274 242 156 240 255 194 98 180 162 193 143 217 181 255 191 236 285 303 354 281 161 254 189
781 189 172 204 189 236 216 258 179 201 219 230 222 250 219 249 289 359 277 244 325 402 526 475 341 517 780 1623 2248 2216 1607 835 625
490 625 460 336 279 261 323 219 150 157 64 47 73 90 52 87 104 81 4 38 38 104 63 92 68 60 17 26 32 67 23 22 16 69 41 105 69 16 14 62
133 62 53 42 59 24 43 123 97 35 47 65 164 119 56 57 62 144 62 64 138 82 48 34 54 95 127 104 51 131 140 25 70 110 33 32 77 117 22 96
-223 96 70 80 27 33 39 73 55 17 50 30 20 20 38 31 20 41 56 33
$$ packed form
1880A247o9ko5j33j3K13m4%o0O8J2Q4R3J53K43Q80J406N89r31j496p11l38j13j41j60o3J01
1626G50K9J34k7o0K78P58k44J11K89M25Q10J815K783Q328J233j1079k822j034n33l00l06j65
1420A173j20j28n3j00j86m1L2L5j35m0k7p3l3J86j6j24M6m7l7j7l8K8N6kj00L9l0O3np6O8
1129B98J4m8n7nL7m6Rpk9O8j9L3L4rJl2q6Q4J5o1r6Q2j8L1n0P4l6P4o4M5M9J8N1p3j20R3o5
781A89j7L2j5M7k0M2p9K2J8J1qK8l1L0M0P0q2l3Q1P7J24n1j34J76K63Q43O25l2o09p72k10
490F25j65j24n7j8O2j04o9Pr3j7K6J7l8L5J7k3p7L4%O6m1K9k4qm3ROL5m4joN3k8O4l6n3kM8
133F2rj1J7l5J9Q0k6o2J2J8R9m5o3JNQ2q2KP4n6l4j4K0M1L2k3n3Q0Rj15M5M0p7jM5M0r5P4
-223I6k6J0n3OOL4j8l8L3k0j0%J8pj1K1J5k3
-392C3
##PAGE=	F1=-9762.64
##FIRST=	19140.455529915001534,	4405.895418600002813,	0
##DATA TABLE=	(F2++(Y..Y)), PROFILE
$$ plain form
4406 31 28 18 22 12 54 70 50 8 72 124 110 40 90 86 74 68 33 75 77 38 53 116 75 40 62 59 64 25 47 106 146 82 111 133 77 74 72 28 13 53
4030 53 8 64 83 32 19 104 56 11 23 22 58 56 67 52 48 71 65 71 28 108 107 55 10 71 60 57 60 37 89 70 19 29 60 96 102 76 121 44 51 84
3655 84 133 56 32 24 53 43 77 86 69 98 52 26 138 64 18 100 132 81 60 30 104 68 95 35 98 16 10 77 80 56 16 92 27 77 24 128
3317 128 38 98 73 116 84 22 75 88 29 107 193 132 119 96 188 189 176 184 221 383 348 245 71 113 111 232 368 175 82 87 50 37 63 34
2997 34 75 63 75 31 95 147 136 132 136 320 486 586 263 133 29 116 96 96 250 234 240 200 185 160 224 160 133 482 541 450 133 50 53
2688 53 37 33 73 51 90 161 259 197 181 105 156 151 118 172 125 299 287 332 325 244 275 270 245 208 249 338 237 257 329 356 309 288 313 316 359 338 362
$$ packed form
4406C1lj0Mj0M2J6k0m2O4N2j4p0N0mj2ol5M2Kl9J5O3m1l5K2lNl9K2N9M0o4K9K2n6lkm4j5M0
4030E3m5N6J9n1j3Q5m8m5J2jL6kJ1j5mK3oOm3Q0jn2m5O1j1lLk3N2j9n1J0L1L6Ok6M5p7PL3
3655H4M9p7k4qK9j0L4Rj7K9m6k6J12p4m6Q2L2n1k1l0P4l6K7o0O3q2oO7Lk4m0P6o5N0n3J04
3317A28r0O0k5M3l2o2N3J3n9P8Q6o1j3k3R2Jj3QL7J62l5j03j74M2kJ21J36j93r3Nl7j3K6k9
2997C4M1j2J2m4O4N2j1mMJ84J66J00l23j30j04Q7k0%J54j6Om0j5k5O4o4k7L49N9r1l17q3L
2688E3j6mM0k2L9P1R8o2j6p6N1nl3N4m7J74j2M5pq1L1nk5l7M1Q9j01K0P2K7m7k1K5LM3k1K4
$$ [...]
-392B3
##END NTUPLES=	nD NMR SPECTRUM
##END=	
##END=	
