##TITLE=	Jan13-2022.13.fid
TM-VI-221 13C

##JCAMP-DX=	6.0	$$ MestReNova 14.3.1-31739
##DATA TYPE=	LINK
##BLOCK_ID=	1
##BLOCKS=	2    
##ORIGIN=	Mestrelab Research S.L.
##OWNER=	hrzepa
##$MNOVA/LINK_BLOCK_TYPE=	ITEM	$$ NMR Spectrum
##$MNOVA/ITEM/POLYGON=	(XY..XY)
5321,5835
8722,5835
8722,8208
5321,8208
5321,5835
##$MNOVA/ITEM/Z=	0
##$MNOVA/ITEM/ANGLE=	0
##TITLE=	Jan13-2022.13.fid
##JCAMP-DX=	6.0	$$ MestReNova 14.3.1-31739
##BLOCK_ID=	2
##DATA TYPE=	MNOVA NMR VIEW DATA
##DATA CLASS=	MNOVA VIEW DATA
##$MNOVA/ITEM/ZOOM/X=	-31.107771267257835035,	251.11459999734066173
##$MNOVA/ITEM/ZOOM/Y=	-901.84881591796875,	9495.513671875
##END=	
##TITLE=	Jan13-2022.13.fid
##JCAMP-DX=	6.0	$$ MestReNova 14.3.1-31739
##BLOCK_ID=	3
##DATA TYPE=	NMR SPECTRUM
##DATA CLASS=	XYDATA
##NUMDIM=	1
##ORIGIN=	Bruker BioSpin GmbH
##OWNER=	nmr
##.OBSERVE FREQUENCY=	100.67161678785400625
##.OBSERVE NUCLEUS=	^13C
##.SOLVENT NAME=	CDCl3
##.PULSE SEQUENCE=	zgpg30
##LONGDATE=	2022/01/13 22:22:00.000
##.ACQUISITIONMODE=	SIMULTANEOUS (DQD)
##$ORIGINAL FORMAT=	Bruker XWIN-NMR
##$MNOVA/SCALES_VERSION=	9
##$PARAMETER FILE=	(acqus, ASCII, /private/var/folders/f6/rjf_tdyn2v98c5c0wvkgn4s80000gn/T/NADrRAMXTCOu9IDfIK8r3g/13/acqus, 0)
$$ ##TITLE= Parameter file, TOPSPIN		Version 3.2
$$ ##JCAMPDX= 5.0
$$ ##DATATYPE= Parameter Values
$$ ##NPOINTS= 11	$$ modification sequence number
$$ ##ORIGIN= Bruker BioSpin GmbH
$$ ##OWNER= nmr
$$ $$ 2022-01-13 22:22:13.543 +0000  nmr@CZC2524DW0
$$ $$ /opt/topspin/data/agmb/nmr/Jan13-2022/13/acqus
$$ $$ process /opt/topspin3.2/prog/mod/shimcntl
$$ ##$ACQT0= -2.05882356948211
$$ ##$AMP= (0..31)
$$ 100 100 100 100 100 100 100 100 100 100 100 100 100 100 100 100 100 100
$$ 100 100 100 100 100 100 100 100 100 100 100 100 100 100
$$ ##$AMPCOIL= (0..19)
$$ 0 0 0 0 0 0 0 0 0 0 0 0 0 0 0 0 0 0 0 0
$$ ##$ANAVPT= -1
$$ ##$AQSEQ= 0
$$ ##$AQ_mod= 3
$$ ##$AUNM= <au_zg>
$$ ##$AUTOPOS= <51 >
$$ ##$BF1= 100.660544
$$ ##$BF2= 400.32
$$ ##$BF3= 100.660544
$$ ##$BF4= 100.660544
$$ ##$BF5= 100.660544
$$ ##$BF6= 100.660544
$$ ##$BF7= 100.660544
$$ ##$BF8= 100.660544
$$ ##$BYTORDA= 0
$$ ##$CAGPARS= (0..11)
$$ 0 0 0 0 0 0 0 0 0 0 0 0
$$ ##$CFDGTYP= 0
$$ ##$CFRGTYP= 9
$$ ##$CHEMSTR= <none>
$$ ##$CNST= (0..63)
$$ 1 1 145 1 1 1 1 1 1 1 1 1 1 1 1 1 1 1 1 1 1 1 1 1 1 1 1 1 1 1 1 1 1 1 1
$$ 1 1 1 1 1 1 1 1 1 1 1 1 1 1 1 1 1 1 1 1 1 1 1 1 1 1 1 1 1
$$ ##$CPDPRG= (0..8)
$$ <waltz16> <> <waltz16> <> <mlev> <mlev> <mlev> <mlev> <mlev>
$$ ##$D= (0..63)
$$ 0 1 0.00345 0 0 0 0 0 0 0.06 0 0.03 2e-05 3e-06 0 0 0.0002 0 0 0 0 0 0
$$ 0 0 0 0 0 0 0 0 0 0 0 0 0 0 0 0 0 0 0 0 0 0 0 0 0 0 0 0 0 0 0 0 0 0 0 0
$$ 0 0 0 0 0
$$ ##$DATE= 1642112532
$$ ##$DE= 6.5
$$ ##$DECBNUC= <off>
$$ ##$DECIM= 704
$$ ##$DECNUC= <off>
$$ ##$DECSTAT= 4
$$ ##$DIGMOD= 1
$$ ##$DIGTYP= 12
$$ ##$DQDMODE= 0
$$ ##$DR= 21
$$ ##$DS= 4
$$ ##$DSPFIRM= 0
$$ ##$DSPFVS= 20
$$ ##$DTYPA= 0
$$ ##$EXP= <c13>
$$ ##$F1LIST= <111111111111111>
$$ ##$F2LIST= <222222222222222>
$$ ##$F3LIST= <333333333333333>
$$ ##$FCUCHAN= (0..9)
$$ [...]
$$ 90 74 58 42 26 10 0 0
$$ ##$Sgu3PowerLevels= (0..7)
$$ 0 0 0 0 0 0 0 0
$$ ##$Sgu4PowerLevels= (0..7)
$$ 0 0 0 0 0 0 0 0
$$ ##$Sgu5PowerLevels= (0..7)
$$ 0 0 0 0 0 0 0 0
$$ ##$Sgu6PowerLevels= (0..7)
$$ 0 0 0 0 0 0 0 0
$$ ##$Sgu7PowerLevels= (0..7)
$$ 0 0 0 0 0 0 0 0
$$ ##$Sgu8PowerLevels= (0..7)
$$ 0 0 0 0 0 0 0 0
$$ ##$SguType= 3
$$ ##$ShimPowMaxUA= (0..63)
$$ 130000 130000 130000 130000 130000 130000 130000 130000 130000 130000 130000
$$ 130000 130000 130000 130000 130000 130000 130000 130000 130000 0 0 0 0
$$ 0 0 0 0 0 0 0 0 0 0 0 0 0 0 0 0 0 0 0 0 0 0 0 0 0 0 0 0 0 0 0 0 0 0 0 0
$$ 0 0 0 0
$$ ##$ShimPowMaxUC= (0..63)
$$ 130000 130000 130000 130000 130000 130000 130000 130000 130000 130000 130000
$$ 130000 130000 130000 130000 130000 130000 130000 130000 130000 0 0 0 0
$$ 0 0 0 0 0 0 0 0 0 0 0 0 0 0 0 0 0 0 0 0 0 0 0 0 0 0 0 0 0 0 0 0 0 0 0 0
$$ 0 0 0 0
$$ ##$ShimPowMaxUG= (0..63)
$$ 524287 524287 524287 524287 524287 524287 524287 524287 524287 524287 524287
$$ 524287 524287 524287 524287 524287 524287 524287 524287 524287 0 0 0 0
$$ 0 0 0 0 0 0 0 0 0 0 0 0 0 0 0 0 0 0 0 0 0 0 0 0 0 0 0 0 0 0 0 0 0 0 0 0
$$ 0 0 0 0
$$ ##$ShimPowRcbType= 3
$$ ##$ShimPowRes= (0..63)
$$ 1e-20 1e-20 1e-20 1e-20 1e-20 1e-20 1e-20 1e-20 1e-20 1e-20 1e-20 1e-20
$$ 1e-20 1e-20 1e-20 1e-20 1e-20 1e-20 1e-20 1e-20 0 0 0 0 0 0 0 0 0 0 0 0
$$ 0 0 0 0 0 0 0 0 0 0 0 0 0 0 0 0 0 0 0 0 0 0 0 0 0 0 0 0 0 0 0 0
$$ ##$ShimPowRng0= (0..63)
$$ 1 1 1 1 1 1 1 1 1 1 1 1 1 1 1 1 1 1 1 1 0 0 0 0 0 0 0 0 0 0 0 0 0 0 0 0
$$ 0 0 0 0 0 0 0 0 0 0 0 0 0 0 0 0 0 0 0 0 0 0 0 0 0 0 0 0
$$ ##$ShimPowRng1= (0..63)
$$ 1 1 1 1 1 1 1 1 1 1 1 1 1 1 1 1 1 1 1 1 0 0 0 0 0 0 0 0 0 0 0 0 0 0 0 0
$$ 0 0 0 0 0 0 0 0 0 0 0 0 0 0 0 0 0 0 0 0 0 0 0 0 0 0 0 0
$$ ##$ShimPowRng2= (0..63)
$$ 1 1 1 1 1 1 1 1 1 1 1 1 1 1 1 1 1 1 1 1 0 0 0 0 0 0 0 0 0 0 0 0 0 0 0 0
$$ 0 0 0 0 0 0 0 0 0 0 0 0 0 0 0 0 0 0 0 0 0 0 0 0 0 0 0 0
$$ ##$ShimPowRng3= (0..63)
$$ 1 1 1 1 1 1 1 1 1 1 1 1 1 1 1 1 1 1 1 1 0 0 0 0 0 0 0 0 0 0 0 0 0 0 0 0
$$ 0 0 0 0 0 0 0 0 0 0 0 0 0 0 0 0 0 0 0 0 0 0 0 0 0 0 0 0
$$ ##$ShimSysFunc= (0..63)
$$ 1 2 3 4 5 7 9 11 15 16 8 10 12 14 6 17 13 18 19 20 0 0 0 0 0 0 0 0 0 0
$$ 0 0 0 0 0 0 0 0 0 0 0 0 0 0 0 0 0 0 0 0 0 0 0 0 0 0 0 0 0 0 0 0 0 0
$$ ##$ShimSysMatrix= 0
$$ ##$ShimSysType= 1
$$ ##$TFXNUM= 0
$$ ##$TRIPLO2= 0
$$ ##$VTU= 2
$$ ##$VTUETH= <149.236.99.20>
$$ ##$VTUTY= <no>
$$ ##$WBREFAM= (0..15)
$$ 132.2 106.2 100 100 100 100 100 100 100 100 100 100 100 100 100 100
$$ ##$WBREFLM= (0..15)
$$ 0 0 0 0 0 0 0 0 0 0 0 0 0 0 0 0
$$ ##$WBREFPH= (0..15)
$$ 77.55 -65.76 0 0 0 0 0 0 0 0 0 0 0 0 0 0
$$ ##$WBSGU= (0..15)
$$ 0 0 0 0 0 0 0 0 0 0 0 0 0 0 0 0
$$ ##$XFAC= 2
$$ ##END=
$$ 
##$DECIM=	704
##$DSPFVS=	20
##XUNITS=	HZ
##YUNITS=	ARBITRARY UNITS
##FIRSTX=	25277.332242342450627
##LASTX=	-3131.3251784229105397
##DELTAX=	-0.43348832563920591809
##XFACTOR=	1
##YFACTOR=	0.085773564614865724365
##FIRSTY=	4.9776067733764648438
##MINY=	-38.62030029296875
##MAXY=	8632.28515625
##NPOINTS=	65536
##XYDATA=	(X++(Y..Y))
$$ [...]
18133 -50 -48 -69 -97 -104 -81 -49 -27 -14 -1 8 6 -5 -20 -34 -53 -77 -99 -118 -136 -155 -175 -195 -208 -212 -207 -204 -205 -201 -182 -155 -133 -121 -113 -104 -94 -85 -74 -65 -69 -92 -126 -152
18114 -152 -161 -158 -151 -146 -145 -140 -121 -85 -45 -19 -13 -10 0 7 -7 -48 -92 -118 -119 -109 -101 -102 -120 -152 -184 -195 -176 -137 -101 -80 -72 -68 -69 -78 -100 -126 -144 -149 -142 -129 -111 -94 -90 -103
18095 -103 -124 -140 -147 -156 -171 -184 -180 -158 -127 -103 -95 -105 -130 -163 -200 -228 -235 -216 -183 -151 -127 -105 -84 -70 -71 -84 -97 -98 -85 -66 -52 -51 -64 -83 -98 -106 -114 -120 -110 -74
18078 -74 -23 14 20 4 -13 -29 -54 -87 -112 -116 -102 -83 -66 -54 -54 -68 -89 -106 -122 -141 -153 -150 -134 -121 -119 -127 -141 -158 -172 -175 -170 -167 -168 -168 -166 -168 -177 -186 -196 -210 -223 -223 -204
18059 -204 -182 -168 -158 -142 -128 -126 -133 -130 -113 -92 -78 -68 -54 -35 -14 -1 2 1 9 22 22 -5 -46 -73 -80 -86 -104 -128 -143 -135 -100 -46 6 33 24 -8 -49 -85 -106 -105
18042 -105 -92 -86 -95 -107 -111 -111 -113 -112 -102 -90 -80 -69 -50 -21 9 33 42 27 -6 -29 -17 17 43 43 32 25 17 -1 -23 -42 -61 -89 -119 -142 -159 -178 -191 -188 -168 -147
18025 -147 -140 -143 -155 -175 -199 -211 -198 -168 -140 -123 -109 -89 -68 -56 -58 -70 -85 -100 -113 -118 -109 -91 -78 -81 -92 -99 -96 -89 -89 -98 -116 -138 -156 -166 -169 -172 -179 -187 -187 -173 -146 -113
18006 -113 -87 -77 -78 -77 -71 -74 -103 -155 -213 -260 -286 -284 -262 -242 -244 -263 -276 -271 -256 -241 -227 -214 -207 -208 -208 -196 -176 -157 -141 -127 -116 -107 -92 -68 -46 -44 -66 -91 -95 -74 -45
17989 -45 -26 -21 -24 -28 -30 -41 -63 -86 -94 -87 -76 -67 -56 -38 -18 -8 -11 -21 -33 -40 -39 -28 -14 -9 -23 -56 -103 -151 -187 -198 -184 -160 -137 -120 -105 -93 -87 -87 -89 -88 -88 -95 -113
17970 -113 -140 -169 -189 -185 -157 -122 -98 -91 -92 -99 -116 -139 -154 -158 -166 -189 -211 -213 -194 -174 -168 -169 -167 -162 -154 -145 -136 -134 -144 -158 -164 -160 -159 -169 -183 -188 -177 -158 -152 -166 -181 -177 -157 -145 -148
17951 -148 -150 -135 -114 -107 -114 -115 -102 -88 -82 -77 -59 -30 -13 -21 -48 -67 -61 -38 -23 -27 -39 -43 -40 -41 -40 -27 -7 4 0 -16 -48 -100 -162 -203 -202 -176 -149 -133 -117 -92 -58 -24
17932 -24 -7 -18 -51 -80 -92 -101 -121 -138 -129 -95 -60 -35 -8 26 49 46 31 25 22 2 -39 -83 -113 -131 -140 -141 -133 -121 -112 -107 -103 -94 -82 -76 -84 -102 -114 -108 -91 -82 -89 -102 -110 -109
17913 -109 -99 -80 -62 -50 -49 -52 -57 -54 -33 3 33 30 -4 -40 -52 -48 -48 -56 -63 -64 -66 -69 -66 -53 -42 -42 -52 -59 -58 -46 -27 -13 -10 -15 -17 -11 -9 -24 -61 -105 -140 -159 -166 -169 -172 -171 -164
17893 -164 -154 -143 -130 -117 -109 -109 -109 -109 -118 -144 -181 -214 -231 -229 -205 -159 -109 -79 -85 -112 -126 -108 -64 -26 -19 -38 -55 -51 -34 -23 -19 -11 -5 -21 -55 -76 -64 -38 -28 -38
17876 -38 -55 -68 -75 -73 -58 -40 -31 -26 -15 -4 -14 -43 -64 -63 -56 -62 -79 -91 -90 -83 -78 -74 -67 -59 -53 -55 -69 -87 -98 -97 -91 -89 -92 -95 -99 -102 -105 -106 -106 -105 -104 -104 -107 -104 -90 -74 -69 -69 -61 -46 -48 -77
17853 -77 -115 -140 -155 -170 -182 -175 -152 -130 -117 -111 -115 -133 -156 -166 -161 -155 -158 -168 -178 -192 -205 -208 -197 -176 -149 -111 -66 -40 -50 -84 -113 -121 -118 -114 -111 -110 -114 -119 -118 -117 -127 -149 -168
17834 -168 -175 -177 -185 -197 -203 -198 -189 -179 -161 -130 -94 -72 -73 -90 -107 -109 -98 -85 -79 -79 -81 -82 -94 -120 -150 -161 -146 -119 -101 -95 -88 -82 -87 -108 -130 -142 -152 -169 -184 -184 -172 -169 -181
17816 -181 -197 -202 -195 -182 -168 -159 -162 -177 -196 -211 -220 -217 -195 -156 -113 -77 -45 -19 -14 -39 -72 -80 -60 -39 -35 -47 -63 -84 -109 -132 -142 -144 -139 -126 -107 -99 -108 -121 -121 -111 -102 -88
17797 -88 -55 -11 14 4 -27 -56 -69 -64 -41 -9 16 22 8 -19 -56 -99 -140 -168 -178 -170 -145 -115 -95 -92 -96 -92 -81 -82 -108 -154 -197 -216 -205 -174 -143 -126 -120 -115 -110 -112
17780 -112 -125 -137 -133 -111 -77 -44 -20 -11 -10 -10 -10 -13 -19 -26 -32 -40 -44 -39 -26 -20 -35 -68 -104 -132 -152 -168 -180 -183 -174 -149 -112 -72 -42 -28 -21 -15 -12 -24 -48 -64 -54 -32 -27 -49
17761 -49 -77 -85 -72 -62 -67 -78 -81 -74 -67 -70 -84 -101 -112 -117 -120 -126 -139 -157 -176 -186 -175 -142 -107 -89 -90 -95 -101 -117 -150 -187 -211 -214 -197 -166 -136 -127 -139 -145 -126 -91 -66 -60 -65
17742 -65 -75 -95 -116 -120 -101 -80 -80 -98 -115 -119 -116 -117 -124 -132 -138 -139 -134 -117 -88 -52 -32 -49 -97 -140 -154 -145 -141 -143 -127 -82 -32 -3 7 27 63 95 103 88 62 24 -22 -67
17724 -67 -91 -94 -97 -112 -127 -126 -109 -93 -89 -94 -100 -103 -103 -100 -89 -74 -60 -55 -61 -74 -84 -89 -92 -95 -94 -79 -47 -11 15 29 38 47 57 64 65 59 48 38 32 20 -13 -68 -123 -155 -159 -152
17704 -152 -144 -132 -118 -115 -128 -137 -120 -80 -49 -51 -76 -100 -103 -83 -49 -11 20 43 60 66 56 28 -3 -26 -40 -53 -68 -82 -90 -93 -90 -87 -96 -119 -141 -149 -147 -155 -178 -204 -222
17687 -222 -231 -231 -216 -186 -150 -121 -100 -88 -88 -94 -95 -90 -96 -120 -150 -165 -161 -154 -152 -149 -137 -123 -115 -116 -124 -134 -146 -161 -182 -206 -221 -218 -205 -201 -209 -212 -190 -142 -92 -66 -70 -90 -101 -90
17667 -90 -68 -52 -51 -65 -90 -117 -129 -114 -87 -73 -81 -94 -93 -77 -57 -43 -37 -43 -63 -88 -110 -124 -130 -127 -116 -103 -89 -80 -81 -95 -108 -104 -89 -83 -95 -106 -102 -94 -102 -124 -141 -145
17649 -145 -148 -160 -181 -203 -217 -211 -178 -130 -95 -82 -81 -83 -90 -101 -102 -90 -80 -88 -108 -126 -141 -154 -163 -162 -156 -153 -153 -151 -149 -146 -138 -124 -113 -118 -132 -140 -137 -130 -122 -113 -102 -100 -107 -113 -117 -130 -157
17629 -157 -182 -188 -178 -171 -176 -189 -196 -191 -177 -162 -153 -147 -139 -132 -132 -134 -127 -112 -103 -107 -117 -113 -92 -65 -50 -51 -56 -40 5 70 123 149 159 167 171 160 139 130 146 182 222 248 244 205 141
17609 141 71 10 -37 -74 -96 -103 -99 -92 -97 -126 -171 -208 -212 -187 -158 -142 -136 -135 -140 -147 -135 -91 -32 4 4 -26 -65 -97 -118 -128 -135 -143 -145 -137 -122 -114 -120 -136 -159 -188 -213 -214 -185
17591 -185 -143 -104 -69 -35 -11 -9 -25 -41 -48 -51 -60 -74 -86 -95 -108 -128 -156 -188 -213 -219 -212 -209 -215 -209 -174 -130 -110 -127 -159 -180 -186 -176 -146 -101 -68 -66 -78 -73 -51 -34 -36
17573 -36 -42 -37 -27 -27 -37 -49 -53 -51 -43 -35 -35 -42 -52 -64 -84 -108 -119 -107 -82 -61 -52 -52 -58 -60 -46 -19 -5 -25 -67 -92 -86 -71 -73 -96 -129 -169 -207 -226 -212 -179 -154 -145 -144
17554 -144 -141 -141 -145 -144 -129 -112 -116 -146 -182 -196 -179 -145 -121 -124 -154 -191 -216 -222 -216 -208 -203 -203 -208 -217 -221 -215 -198 -168 -130 -92 -70 -67 -68 -57 -32 -7 1 -3 -17 -37 -62 -81 -86 -83 -89
17535 -89 -113 -148 -176 -190 -190 -187 -187 -190 -189 -179 -158 -131 -107 -89 -80 -76 -71 -59 -47 -47 -68 -105 -137 -148 -136 -115 -95 -76 -55 -36 -34 -52 -79 -92 -86 -69 -60 -64 -75 -80 -74 -61
17517 -61 -52 -57 -79 -110 -140 -159 -164 -153 -128 -99 -79 -78 -87 -94 -100 -120 -153 -173 -157 -114 -78 -72 -87 -106 -117 -125 -136 -153 -176 -194 -199 -192 -187 -187 -184 -169 -149 -132 -117 -100 -86 -86
17498 -86 -99 -118 -139 -160 -175 -175 -164 -153 -149 -148 -148 -150 -152 -143 -126 -113 -114 -128 -143 -149 -143 -132 -127 -129 -127 -114 -103 -105 -111 -102 -80 -70 -83 -103 -111 -106 -91 -70 -50 -49 -70 -94 -107 -116 -125
17479 -125 -115 -72 -22 -3 -13 -22 -18 -20 -41 -56 -48 -29 -27 -44 -59 -60 -52 -44 -36 -32 -40 -65 -99 -130 -147 -147 -137 -124 -113 -106 -103 -105 -111 -118 -126 -142 -169 -202 -227 -226 -192 -136 -87 -64
17460 -64 -70 -98 -142 -192 -229 -236 -222 -210 -205 -198 -185 -178 -182 -186 -172 -145 -121 -106 -97 -96 -101 -97 -71 -24 17 31 10 -26 -50 -40 0 41 59 50 26 0 -21 -30 -25 -13 -10 -27
17442 -27 -58 -90 -109 -108 -92 -73 -60 -48 -29 -6 9 14 12 0 -29 -71 -107 -127 -137 -148 -158 -162 -161 -160 -156 -145 -129 -108 -81 -53 -44 -67 -103 -122 -111 -83 -56 -38 -38
17425 -38 -68 -125 -178 -194 -170 -134 -109 -97 -82 -58 -26 1 13 -3 -42 -84 -110 -116 -107 -92 -70 -39 -2 28 37 27 13 9 8 -12 -56 -97 -108 -89 -59 -30 -3
17409 -3 16 17 -1 -22 -26 -12 1 2 -9 -24 -33 -30 -14 11 34 46 44 33 24 33 65 103 120 105 70 45 43 49 50 44 45 45 26 -21 -71 -91 -78 -53 -34 -18 -5 -5 -21
17390 -21 -38 -45 -55 -84 -125 -156 -174 -193 -211 -209 -181 -150 -143 -158 -177 -184 -180 -167 -153 -150 -159 -161 -138 -100 -75 -71 -68 -50 -32 -36 -65 -102 -125 -124 -98 -56 -17 0 -9 -40 -78
17372 -78 -112 -133 -145 -155 -170 -189 -205 -217 -223 -218 -197 -167 -145 -143 -159 -180 -198 -205 -189 -147 -99 -73 -81 -107 -134 -157 -177 -183 -165 -136 -120 -128 -147 -162 -174 -189 -194 -176 -138
17355 -138 -103 -82 -63 -34 2 30 41 42 38 30 9 -26 -70 -107 -127 -134 -140 -148 -155 -160 -169 -182 -190 -184 -166 -146 -127 -107 -87 -74 -69 -65 -55 -42 -34 -34 -39 -43 -47 -58 -80 -110 -138
17337 -138 -156 -163 -163 -160 -154 -144 -133 -123 -122 -139 -172 -206 -219 -195 -145 -91 -53 -33 -17 4 24 25 3 -25 -41 -44 -44 -49 -55 -63 -76 -97 -124 -156 -191 -215 -210 -182 -159 -160 -169
17319 -169 -159 -131 -107 -99 -97 -94 -98 -115 -137 -152 -160 -169 -181 -190 -193 -188 -178 -163 -151 -141 -123 -91 -57 -41 -48 -59 -65 -75 -98 -122 -128 -114 -99 -100 -116 -138 -163 -182 -182 -158 -128
17301 -128 -119 -140 -171 -193 -203 -203 -187 -155 -123 -110 -114 -118 -110 -96 -86 -81 -81 -84 -86 -75 -49 -23 -15 -26 -44 -58 -63 -58 -45 -27 -11 0 -2 -28 -73 -115 -139 -152 -170 -187 -185
17283 -185 -163 -139 -125 -118 -110 -102 -99 -100 -112 -143 -186 -210 -198 -166 -140 -122 -99 -75 -61 -55 -36 -3 18 12 -13 -34 -42 -46 -51 -51 -38 -14 8 20 13 -8 -31 -38 -21 11 49
17266 49 78 94 102 100 81 44 2 -22 -24 -16 -17 -27 -41 -57 -78 -99 -106 -94 -75 -67 -72 -79 -82 -82 -82 -79 -74 -75 -87 -105 -115 -116 -117 -122 -128 -128 -128 -133 -141 -138 -115 -76 -31 8 35 43 33
17245 33 13 -1 -9 -16 -35 -69 -115 -161 -202 -231 -239 -218 -178 -150 -155 -179 -191 -179 -162 -152 -142 -121 -99 -95 -108 -122 -133 -149 -174 -196 -210 -224 -240 -252 -249 -234 -216 -202
17229 -202 -191 -189 -192 -190 -174 -148 -125 -109 -97 -94 -104 -122 -135 -136 -133 -132 -128 -114 -93 -77 -74 -82 -95 -108 -123 -142 -161 -171 -161 -133 -102 -84 -91 -119 -151 -165 -153 -127 -102 -79
17211 -79 -49 -12 20 38 40 31 16 1 -11 -29 -64 -115 -160 -184 -197 -214 -229 -220 -182 -142 -127 -132 -135 -125 -109 -102 -109 -131 -162 -189 -197 -187 -175 -171 -173 -172 -164 -150 -126 -91 -55
17194 -55 -33 -32 -47 -65 -78 -82 -76 -62 -50 -45 -46 -44 -42 -50 -69 -82 -76 -54 -38 -45 -74 -109 -133 -137 -121 -103 -104 -127 -158 -179 -193 -210 -230 -242 -240 -231 -224 -220 -213 -204 -191 -170 -139 -108
17175 -108 -92 -89 -82 -62 -41 -31 -35 -43 -51 -65 -91 -118 -128 -114 -90 -78 -85 -98 -102 -99 -100 -108 -112 -106 -101 -105 -109 -99 -81 -72 -83 -104 -121 -128 -126 -115 -98 -88 -92 -104 -116 -120 -114 -99 -79
17155 -79 -72 -86 -116 -145 -166 -184 -198 -201 -195 -187 -182 -168 -142 -115 -105 -115 -123 -111 -79 -47 -40 -63 -101 -124 -121 -99 -73 -53 -36 -29 -38 -65 -99 -126 -140 -143 -143 -150 -160 -162 -144 -108
17137 -108 -64 -21 12 21 -1 -42 -68 -60 -28 3 28 53 83 106 114 105 89 71 54 42 31 10 -28 -80 -125 -147 -140 -116 -92 -82 -90 -106 -118 -118 -109 -95 -86 -88 -105
17120 -105 -130 -153 -167 -169 -160 -144 -125 -110 -102 -100 -102 -112 -133 -165 -199 -219 -214 -193 -175 -174 -176 -160 -124 -87 -69 -65 -58 -46 -36 -31 -23 -10 -3 -9 -23 -32 -32 -26 -21 -22 -31 -44 -51 -50 -48 -57
17100 -57 -73 -89 -99 -99 -83 -55 -31 -35 -73 -123 -157 -162 -149 -136 -134 -140 -143 -140 -132 -126 -125 -133 -150 -167 -169 -148 -113 -82 -62 -53 -52 -59 -69 -77 -85 -96 -106 -106 -94 -80 -75 -77 -76 -67 -59 -60 -76
17080 -76 -98 -113 -110 -94 -78 -71 -75 -83 -81 -62 -40 -38 -65 -98 -106 -90 -84 -105 -134 -149 -151 -163 -185 -197 -188 -167 -142 -109 -65 -30 -24 -50 -90 -124 -146 -152 -144 -128 -120 -130 -147 -155
17061 -155 -158 -169 -191 -205 -194 -170 -162 -173 -183 -174 -160 -155 -155 -144 -127 -120 -121 -110 -77 -37 -9 6 17 14 -12 -56 -95 -119 -133 -140 -139 -136 -141 -153 -163 -170 -182 -202 -215 -201 -170
17044 -170 -146 -145 -162 -185 -209 -229 -233 -217 -190 -167 -158 -157 -163 -173 -180 -177 -167 -158 -157 -156 -151 -148 -154 -166 -171 -160 -141 -127 -120 -119 -121 -129 -142 -155 -161 -158 -146 -134 -123 -120 -126 -138 -148 -145 -134 -126
17024 -126 -127 -134 -140 -145 -148 -145 -135 -128 -127 -126 -111 -87 -72 -78 -97 -115 -125 -126 -119 -108 -104 -113 -128 -139 -149 -166 -184 -183 -154 -121 -108 -112 -111 -92 -68 -55 -51 -45 -39 -39 -44 -50 -57 -72 -92 -105
17004 -105 -113 -129 -153 -165 -155 -136 -128 -130 -128 -120 -115 -109 -93 -71 -59 -60 -54 -34 -24 -44 -84 -120 -143 -159 -170 -172 -165 -164 -173 -182 -187 -198 -221 -248 -267 -272 -265 -248 -229 -223 -236 -258 -266 -253
16985 -253 -229 -215 -214 -217 -215 -211 -215 -229 -239 -236 -223 -218 -225 -233 -233 -228 -230 -237 -239 -222 -180 -118 -52 -6 7 -6 -31 -57 -79 -94 -98 -94 -90 -96 -107 -113 -117 -122 -130 -134 -128 -118 -110 -108 -112 -123 -143 -173
16964 -173 -209 -242 -266 -276 -279 -284 -293 -298 -291 -268 -235 -196 -157 -126 -108 -103 -104 -105 -99 -83 -66 -67 -96 -136 -163 -170 -173 -177 -169 -141 -105 -77 -59 -49 -56 -90 -134 -148 -118 -79 -74 -110
16946 -110 -152 -173 -172 -164 -155 -140 -122 -114 -123 -137 -136 -114 -85 -76 -98 -144 -193 -232 -259 -275 -279 -267 -241 -212 -188 -178 -183 -199 -214 -215 -204 -197 -206 -223 -228 -209 -172 -133 -106 -100 -110
16928 -110 -129 -152 -183 -230 -280 -309 -303 -274 -245 -225 -212 -206 -208 -214 -215 -209 -199 -181 -153 -121 -98 -89 -90 -98 -113 -130 -139 -138 -135 -134 -133 -127 -122 -123 -123 -117 -111 -118 -137 -157 -170 -174 -171 -161 -150 -146
16908 -146 -151 -155 -147 -124 -100 -87 -88 -93 -97 -103 -118 -136 -145 -134 -107 -73 -42 -20 -14 -24 -38 -48 -56 -71 -95 -115 -120 -108 -81 -48 -22 -13 -22 -34 -38 -41 -56 -84 -111 -124 -125 -126 -131
16889 -131 -138 -144 -155 -166 -167 -148 -119 -100 -105 -125 -143 -148 -142 -134 -128 -129 -142 -166 -192 -207 -206 -192 -177 -169 -168 -166 -152 -118 -67 -14 23 37 33 14 -14 -44 -58 -53 -40 -35 -43 -53 -68
16871 -68 -95 -133 -160 -161 -148 -145 -164 -192 -209 -208 -201 -201 -206 -206 -191 -171 -159 -160 -168 -181 -203 -221 -213 -174 -131 -113 -118 -127 -131 -134 -139 -139 -135 -134 -143 -157 -173 -186 -192 -184 -161 -120 -55 33 122
16851 122 172 167 125 73 32 9 1 0 -6 -16 -23 -29 -41 -60 -78 -95 -124 -169 -212 -234 -239 -236 -222 -194 -165 -156 -169 -190 -207 -218 -219 -216 -221 -240 -251 -231 -196 -184 -205 -227
16834 -227 -219 -196 -186 -193 -201 -206 -217 -232 -241 -239 -235 -232 -222 -206 -194 -193 -187 -164 -136 -132 -161 -201 -214 -183 -126 -74 -45 -34 -34 -48 -82 -124 -158 -185 -216 -246 -254 -235 -216 -221 -241
16816 -241 -251 -245 -237 -235 -226 -198 -160 -128 -117 -133 -166 -196 -206 -199 -192 -193 -192 -180 -163 -147 -133 -118 -106 -101 -98 -98 -106 -121 -132 -125 -106 -89 -88 -103 -123 -135 -131 -118 -115 -125 -135 -132 -125
16797 -125 -128 -135 -127 -103 -86 -94 -114 -126 -129 -133 -148 -168 -188 -204 -218 -231 -248 -264 -267 -252 -226 -205 -192 -185 -180 -179 -182 -187 -185 -174 -161 -153 -152 -147 -130 -109 -103 -123 -153 -173 -183 -199 -235
16779 -235 -277 -299 -292 -273 -256 -244 -222 -188 -154 -134 -129 -134 -149 -173 -199 -221 -236 -247 -254 -251 -240 -225 -205 -176 -143 -121 -116 -123 -133 -140 -142 -141 -141 -147 -156 -156 -146 -132 -122 -107 -81
16761 -81 -55 -48 -62 -79 -88 -95 -117 -153 -186 -200 -199 -201 -216 -230 -221 -182 -129 -89 -78 -92 -118 -141 -155 -156 -145 -125 -102 -84 -80 -89 -103 -118 -137 -162 -186 -196 -185 -159 -135
16744 -135 -125 -129 -134 -132 -126 -125 -126 -121 -111 -101 -95 -90 -90 -100 -116 -121 -109 -90 -76 -67 -60 -63 -85 -113 -124 -115 -99 -93 -93 -83 -59 -24 7 28 36 30 10 -22 -53 -60 -43 -27 -27 -34 -29 -16
16724 -16 -14 -32 -54 -67 -73 -85 -116 -170 -230 -270 -276 -259 -236 -211 -179 -145 -125 -121 -119 -105 -78 -43 -11 0 -23 -67 -104 -118 -121 -126 -133 -134 -136 -143 -144 -130 -110 -98 -99 -110 -127
16706 -127 -151 -180 -204 -223 -236 -247 -258 -266 -256 -213 -146 -86 -61 -68 -91 -118 -146 -169 -182 -195 -216 -240 -253 -253 -249 -238 -205 -152 -106 -93 -112 -133 -134 -115 -92 -76 -63
16690 -63 -49 -39 -42 -58 -83 -118 -160 -194 -206 -200 -202 -225 -249 -252 -229 -198 -172 -161 -168 -192 -215 -222 -214 -205 -194 -172 -141 -117 -113 -120 -127 -133 -139 -142 -140 -135 -137 -149 -167 -177 -174 -160 -147 -138
16671 -138 -123 -92 -54 -27 -14 -9 -6 -7 -11 -20 -41 -86 -142 -179 -182 -169 -165 -169 -165 -151 -137 -132 -133 -134 -139 -155 -176 -187 -175 -143 -108 -87 -86 -99 -116 -131 -138 -136 -131 -130 -137 -144 -133 -97
16652 -97 -48 -4 21 28 25 23 21 13 -11 -55 -109 -159 -195 -221 -241 -255 -257 -245 -221 -186 -147 -121 -126 -158 -183 -174 -140 -116 -118 -134 -147 -157 -172 -189 -198 -194 -185 -180 -185 -190 -179 -145
16634 -145 -103 -79 -81 -97 -110 -117 -122 -131 -143 -160 -175 -183 -184 -178 -158 -118 -69 -36 -32 -48 -67 -90 -111 -111 -77 -30 -5 -4 -3 17 42 45 23 -6 -26 -35 -43 -55 -72 -90 -103
16616 -103 -110 -110 -107 -105 -105 -103 -93 -73 -55 -47 -50 -54 -49 -36 -30 -42 -66 -88 -105 -122 -142 -154 -148 -132 -118 -107 -95 -88 -99 -122 -133 -121 -96 -70 -36 3 27 10 -39 -85 -104
16598 -104 -107 -114 -129 -150 -176 -202 -216 -208 -180 -148 -131 -139 -162 -182 -185 -178 -170 -161 -145 -125 -122 -141 -167 -183 -184 -174 -155 -128 -97 -73 -58 -47 -40 -38 -43 -52 -59 -61 -55 -38 -15 5 16
16580 16 20 18 8 -19 -67 -119 -151 -149 -123 -87 -56 -38 -37 -42 -41 -30 -21 -19 -13 9 37 40 14 -17 -29 -25 -24 -34 -43 -38 -18 3 18 24 38 82 158 247 319 361 375 361
16562 361 317 246 168 103 60 38 34 40 41 23 -13 -48 -65 -64 -62 -67 -73 -80 -96 -123 -147 -154 -151 -152 -155 -151 -144 -148 -163 -178 -181 -177 -169 -153 -127 -104 -97 -104 -115 -126 -134 -138 -137 -138 -145 -149 -140 -127
16541 -127 -126 -142 -163 -177 -186 -192 -188 -167 -135 -107 -97 -110 -144 -189 -231 -256 -267 -278 -293 -304 -298 -278 -256 -236 -218 -200 -184 -164 -138 -113 -103 -108 -112 -102 -91 -95 -114 -133
16524 -133 -140 -138 -130 -116 -103 -97 -95 -89 -77 -63 -49 -33 -18 -18 -31 -42 -38 -27 -25 -41 -71 -108 -144 -174 -202 -235 -275 -303 -306 -288 -261 -232 -200 -168 -146 -139 -147 -167 -191 -214
16507 -214 -228 -233 -232 -223 -207 -188 -172 -157 -144 -135 -128 -114 -88 -63 -56 -62 -63 -54 -53 -77 -116 -147 -158 -160 -164 -167 -161 -145 -134 -139 -156 -175 -196 -221 -243 -246 -227 -199 -174 -148 -123 -112
16489 -112 -127 -148 -150 -132 -118 -125 -143 -149 -138 -116 -98 -93 -101 -110 -108 -100 -101 -113 -129 -145 -167 -189 -196 -177 -144 -110 -82 -61 -57 -76 -99 -105 -92 -76 -65 -55 -44 -38 -49 -80 -126
16471 -126 -175 -214 -231 -229 -223 -224 -232 -237 -235 -225 -206 -180 -155 -147 -166 -197 -211 -187 -143 -112 -109 -116 -115 -113 -133 -177 -220 -237 -227 -206 -188 -180 -179 -178 -167 -143 -114 -95 -88 -89 -97 -115 -137
16452 -137 -144 -127 -104 -97 -102 -98 -79 -68 -83 -111 -130 -139 -158 -185 -194 -174 -146 -139 -155 -174 -178 -165 -138 -101 -67 -52 -58 -74 -87 -91 -89 -75 -45 -5 31 48 35 -1 -44 -73
16435 -73 -80 -79 -91 -122 -152 -157 -132 -96 -71 -64 -75 -99 -132 -164 -183 -186 -179 -169 -155 -138 -127 -128 -138 -142 -129 -98 -58 -26 -15 -34 -76 -128 -170 -189 -191 -188 -185 -175 -158 -146
16418 -146 -147 -155 -152 -136 -119 -112 -120 -141 -171 -202 -221 -224 -214 -194 -163 -127 -97 -82 -83 -99 -126 -144 -135 -104 -76 -70 -76 -77 -69 -58 -46 -36 -38 -56 -73 -72 -60 -64 -96 -132 -142 -124
16399 -124 -98 -84 -80 -73 -56 -35 -19 -16 -24 -33 -32 -16 4 21 28 32 38 44 40 26 4 -21 -51 -78 -97 -111 -134 -169 -204 -226 -238 -240 -227 -199 -173 -167 -177 -190 -205 -227 -249
16382 -249 -257 -254 -260 -280 -290 -267 -213 -156 -120 -111 -120 -136 -153 -167 -176 -177 -168 -152 -131 -103 -73 -56 -54 -56 -44 -26 -25 -45 -65 -65 -51 -39 -37 -38 -38 -40 -42 -37 -25 -9 7 23 31 19
16363 19 -12 -51 -84 -101 -99 -80 -56 -46 -60 -90 -123 -153 -175 -187 -188 -184 -184 -186 -185 -173 -156 -142 -139 -146 -153 -149 -135 -123 -126 -138 -147 -145 -140 -139 -140 -138 -136 -141 -157 -175 -183 -172 -144 -115 -105
16343 -105 -118 -137 -139 -127 -120 -128 -142 -149 -150 -149 -150 -150 -147 -138 -126 -120 -125 -137 -139 -128 -121 -131 -153 -171 -175 -173 -178 -199 -226 -237 -216 -178 -157 -169 -192 -198 -183 -163 -149 -137 -125 -113 -94
16324 -94 -63 -25 4 19 15 -7 -43 -72 -79 -68 -48 -21 16 60 116 211 361 559 817 1183 1653 2071 2201 1945 1454 983 668 481 345
16312 345 231 139 61 -8 -57 -78 -86 -101 -123 -150 -184 -217 -225 -195 -157 -150 -175 -198 -199 -193 -204 -223 -228 -212 -193 -183 -176 -161 -135 -105 -75 -46 -17 9 27 25 0 -28
16295 -28 -28 5 34 22 -23 -63 -75 -72 -72 -73 -69 -65 -61 -47 -22 -12 -43 -105 -158 -180 -179 -172 -171 -172 -168 -153 -131 -116 -117 -122 -120 -113 -117 -140 -170 -190 -194 -186 -173 -161 -150 -139 -129 -126 -133
16276 -133 -146 -157 -162 -159 -143 -111 -73 -44 -33 -37 -46 -51 -50 -50 -60 -79 -89 -83 -74 -81 -106 -134 -156 -169 -173 -165 -151 -146 -151 -154 -144 -123 -102 -88 -81 -82 -89 -102 -114 -125 -137 -153 -168
16257 -168 -173 -168 -163 -165 -162 -143 -114 -97 -97 -93 -72 -52 -60 -91 -117 -119 -105 -97 -111 -153 -209 -250 -255 -229 -196 -170 -148 -128 -117 -121 -132 -144 -154 -159 -159 -157 -162 -175 -188 -191 -179 -154 -126
16239 -126 -108 -107 -113 -119 -125 -137 -146 -147 -154 -184 -226 -242 -215 -171 -143 -132 -122 -111 -112 -129 -142 -131 -105 -85 -82 -91 -103 -115 -130 -140 -142 -140 -153 -180 -195 -182 -157 -147 -149 -144 -123
16221 -123 -101 -88 -77 -65 -60 -67 -71 -59 -42 -37 -47 -59 -66 -70 -83 -109 -142 -165 -168 -159 -150 -141 -131 -128 -145 -172 -182 -169 -151 -144 -141 -136 -139 -157 -172 -170 -156 -147 -141 -127 -104 -89 -94 -118
16202 -118 -149 -171 -177 -170 -161 -160 -165 -174 -186 -202 -219 -236 -251 -256 -243 -219 -203 -198 -186 -162 -140 -130 -126 -117 -114 -125 -142 -149 -144 -134 -114 -84 -60 -62 -87 -114 -128 -121 -95 -64 -52 -75
16184 -75 -117 -153 -177 -197 -215 -225 -231 -242 -256 -261 -252 -230 -198 -159 -128 -112 -109 -110 -112 -116 -112 -97 -85 -84 -89 -85 -79 -85 -96 -90 -62 -32 -19 -26 -49 -79 -103 -119 -134 -146 -136 -95
16165 -95 -52 -39 -50 -55 -51 -59 -86 -107 -113 -121 -137 -144 -129 -103 -82 -66 -54 -54 -70 -87 -92 -90 -96 -118 -151 -186 -206 -196 -167 -144 -141 -142 -127 -96 -61 -37 -27 -25 -23 -17 -16 -32 -54
16147 -54 -66 -67 -80 -108 -136 -151 -155 -150 -128 -95 -69 -63 -63 -50 -23 12 53 86 100 98 93 84 54 8 -27 -37 -40 -58 -85 -103 -105 -98 -80 -54 -31 -25 -36 -50 -62 -68 -64 -53
16129 -53 -40 -31 -23 -25 -41 -58 -54 -32 -15 -10 -3 6 -1 -36 -74 -91 -93 -99 -104 -96 -81 -65 -41 1 55 107 158 200 204 149 51 -49 -126 -169 -170 -139 -109 -102 -108 -101 -77 -46 -18
16110 -18 1 4 -3 4 45 90 104 80 43 10 -15 -30 -28 -23 -28 -44 -64 -89 -117 -134 -131 -118 -104 -82 -48 -25 -31 -53 -71 -87 -109 -129 -134 -135 -138 -122 -67 14 91 148
16093 148 180 173 130 86 72 73 64 55 66 81 73 55 51 53 38 21 28 44 41 27 31 39 8 -61 -121 -143 -135 -104 -53 -17 -29 -68 -88 -83 -77 -67 -32 5 10 3 30 84
16074 84 119 138 177 227 248 257 307 389 452 510 635 834 1054 1311 1673 2112 2478 2671 2713 2662 2591 2631 2872 3225 3575 4061 4969 6383
16062 6383 8302 11101 15214 19960 23224 23101 19840 15595 12243 9984 8098 6291 4846 3901 3232 2658 2226 1978 1818
16054 1818 1683 1629 1700 1858 2048 2209 2228 2029 1690 1377 1154 969 792 658 568 475 373 316 316 316 286 252 234 218 204 229 317 459
16042 459 634 801 868 771 569 400 328 299 256 211 186 169 156 173 214 231 202 169 172 190 195 203 236 272 276 260 256 266 271 263 251 229 192 155 136 140
16026 140 163 200 230 225 182 143 146 179 206 211 197 169 131 99 87 89 96 109 132 149 146 129 113 95 70 43 23 7 -3 0 18 16 -24 -76 -95 -79 -59 -44
16010 -44 -15 28 62 71 71 75 78 77 84 100 105 84 53 32 19 5 -3 -1 -3 -21 -40 -33 1 44 85 126 164 184 186 189 203 228 266 326 402 473 519 539 549 578 657
15992 657 785 938 1094 1262 1457 1667 1892 2180 2596 3150 3835 4717 5924 7551 9676 12420 15746 19051 21145 20997 18621
15983 18621 15098 11695 9038 7097 5661 4617 3887 3383 3052 2860 2705 2457 2097 1730 1441 1213 1008 841 729 644 557
15974 557 481 435 408 385 378 400 426 425 398 363 330 297 271 244 192 110 29 -11 -9 17 59 110 145 142 104 47 -13 -65 -91 -87 -75 -71 -64 -45 -25 -21 -22 -10 10
15957 10 12 -10 -42 -63 -67 -58 -50 -65 -103 -135 -140 -129 -123 -119 -101 -77 -65 -59 -30 22 66 72 56 39 26 8 -5 -1 18 36 38 28 19 7 -16 -51 -80 -85 -68 -51 -48 -56
15939 -56 -63 -61 -42 -4 44 80 90 81 65 46 33 35 49 49 23 0 5 28 34 18 2 0 8 31 90 187 311 478 707 956 1107 1074 897 687 517
15924 517 382 262 162 91 41 5 -11 -7 5 19 36 56 62 52 49 73 118 188 331 578 855 1008 942 718 477 306 198 118 61 33
15911 33 34 53 77 88 67 26 2 19 65 121 179 237 272 263 220 166 116 74 49 45 42 15 -30 -62 -59 -30 9 58 122 199 279 343 367 335 259 179 133
15894 133 130 161 215 281 347 406 460 508 536 524 467 384 307 264 254 253 238 204 157 105 55 20 9 8 0 -20 -41 -55 -62 -59 -42 -16 1 3 -7 -27 -53 -80
15878 -80 -93 -88 -73 -59 -46 -37 -40 -51 -57 -48 -30 -13 6 30 45 33 -6 -58 -106 -143 -170 -190 -202 -200 -180 -144 -103 -66 -34 -16 -27 -63 -101 -123 -128 -128 -122 -107 -93
15861 -93 -96 -119 -143 -152 -138 -108 -69 -38 -28 -37 -53 -63 -66 -67 -64 -57 -44 -28 -12 -5 -16 -47 -85 -109 -101 -71 -42 -33 -36 -38 -43 -62 -93 -121 -133 -133 -127 -116 -100 -89 -90 -100 -116
15842 -116 -138 -163 -183 -192 -195 -192 -186 -181 -179 -176 -160 -135 -113 -100 -91 -85 -92 -110 -117 -105 -88 -83 -85 -85 -93 -113 -129 -124 -109 -105 -101 -78 -38 -6 9 24 42 46 35 30 37 37 19 2 3 11
15823 11 0 -41 -94 -140 -169 -178 -169 -149 -127 -110 -103 -107 -115 -121 -128 -146 -168 -177 -169 -161 -160 -158 -142 -122 -112 -107 -91 -62 -37 -27 -32 -44 -63 -87 -112 -133 -156 -180 -201 -206 -187 -151
15804 -151 -115 -98 -101 -110 -110 -96 -79 -73 -83 -97 -101 -94 -84 -79 -72 -67 -82 -125 -174 -191 -172 -144 -130 -124 -114 -106 -109 -118 -124 -128 -133 -133 -124 -115 -116 -121 -118 -107 -98 -95 -93 -88 -85 -89 -99 -108 -118 -132 -156
15783 -156 -189 -224 -241 -229 -191 -145 -114 -106 -117 -137 -160 -180 -192 -188 -166 -142 -141 -165 -196 -210 -205 -194 -190 -189 -185 -173 -159 -147 -140 -129 -114 -104 -109 -130 -155 -172 -179 -173 -151 -125
15766 -125 -114 -128 -154 -174 -179 -174 -174 -197 -248 -310 -348 -349 -327 -301 -272 -235 -201 -184 -185 -196 -213 -230 -233 -208 -168 -130 -101 -80 -77 -108 -162 -207 -229 -242 -260 -274 -267 -244
15749 -244 -220 -201 -186 -178 -185 -201 -210 -200 -186 -186 -203 -214 -201 -170 -145 -139 -147 -161 -178 -200 -213 -201 -164 -122 -98 -99 -125 -159 -176 -161 -125 -99 -98 -114 -127 -130 -129 -127 -124 -120 -118
15731 -118 -121 -132 -151 -174 -188 -181 -151 -109 -75 -59 -60 -70 -90 -120 -146 -153 -143 -139 -151 -165 -169 -172 -183 -184 -151 -97 -61 -59 -69 -68 -63 -66 -69 -57 -31 -3 13 11 -11 -44 -66
15714 -66 -76 -87 -106 -125 -135 -145 -164 -189 -206 -213 -211 -197 -168 -144 -142 -160 -178 -179 -160 -128 -98 -91 -108 -128 -132 -121 -112 -105 -91 -72 -67 -78 -87 -81 -66 -53 -45 -44 -57 -81 -103
15696 -103 -112 -110 -107 -108 -116 -127 -137 -139 -137 -140 -152 -167 -175 -183 -195 -206 -200 -175 -144 -123 -117 -122 -132 -140 -140 -124 -96 -71 -70 -97 -134 -159 -166 -163 -154 -137 -113 -92 -83 -86 -93 -102 -117 -143 -180 -216
15676 -216 -241 -249 -243 -231 -221 -214 -210 -203 -188 -169 -152 -141 -138 -141 -152 -170 -191 -209 -223 -236 -244 -242 -234 -221 -199 -159 -106 -58 -36 -45 -71 -99 -121 -136 -145 -146 -138 -130 -131 -142 -143 -117 -75
15657 -75 -48 -47 -58 -64 -63 -67 -73 -70 -51 -28 -19 -31 -59 -92 -117 -126 -121 -109 -103 -112 -133 -153 -158 -145 -126 -114 -111 -107 -97 -89 -90 -99 -104 -98 -84 -76 -84 -108 -145 -184 -219 -245 -262 -277 -291
15638 -291 -293 -277 -245 -210 -178 -152 -128 -101 -67 -32 -13 -21 -45 -61 -66 -78 -107 -141 -162 -165 -158 -142 -119 -100 -97 -100 -90 -71 -68 -97 -141 -171 -183 -192 -205 -212 -204 -188 -180 -190
15621 -190 -210 -231 -246 -254 -256 -253 -251 -252 -260 -265 -259 -236 -206 -186 -188 -205 -221 -225 -223 -224 -227 -226 -215 -195 -167 -126 -77 -38 -23 -33 -54 -71 -77 -78 -83 -98 -118 -131 -131 -124 -121 -125 -126 -113 -90
15601 -90 -74 -86 -125 -171 -198 -197 -177 -155 -140 -137 -139 -134 -122 -116 -129 -149 -149 -128 -112 -119 -139 -146 -140 -143 -163 -188 -205 -214 -219 -219 -212 -200 -191 -185 -180 -176 -176 -181 -185 -180 -156 -115 -72 -51 -63 -96
15581 -96 -125 -138 -134 -124 -122 -136 -160 -176 -170 -151 -138 -143 -160 -178 -192 -200 -200 -192 -181 -179 -189 -207 -223 -233 -236 -236 -230 -215 -190 -158 -133 -129 -155 -200 -244 -269 -279 -287 -296 -295 -275 -243
15563 -243 -211 -183 -155 -123 -91 -68 -65 -85 -121 -152 -160 -148 -134 -129 -123 -108 -97 -100 -110 -106 -89 -77 -79 -84 -81 -83 -104 -133 -146 -140 -134 -140 -148 -147 -146 -154 -167 -174 -170 -161 -151 -141 -138 -146 -162
15543 -162 -178 -194 -214 -235 -251 -267 -285 -299 -296 -282 -272 -275 -276 -258 -225 -197 -190 -202 -212 -207 -188 -175 -176 -176 -153 -114 -90 -102 -133 -157 -163 -158 -151 -149 -165 -199 -237 -257 -260 -258 -254
15526 -254 -241 -222 -211 -213 -216 -211 -204 -205 -211 -219 -229 -240 -242 -225 -203 -196 -205 -207 -195 -184 -198 -238 -286 -322 -340 -340 -330 -320 -315 -308 -293 -268 -238 -203 -167 -137 -124 -125 -132 -140 -148 -145 -123 -94
15507 -94 -79 -90 -111 -116 -101 -78 -62 -56 -60 -71 -83 -84 -76 -70 -82 -112 -151 -184 -204 -211 -212 -208 -200 -196 -203 -209 -194 -155 -118 -110 -131 -154 -162 -158 -149 -139 -133 -134 -133 -119 -97 -86 -97 -119 -129
15487 -129 -116 -85 -51 -36 -53 -94 -132 -144 -127 -92 -56 -33 -31 -44 -55 -57 -56 -57 -57 -50 -45 -52 -71 -99 -131 -161 -175 -174 -174 -189 -207 -209 -195 -186 -195 -213 -229 -243 -253 -250 -229
15469 -229 -199 -181 -183 -194 -199 -191 -175 -165 -171 -190 -210 -219 -210 -184 -148 -109 -73 -47 -38 -51 -79 -108 -127 -132 -132 -138 -155 -174 -176 -154 -126 -118 -134 -154 -158 -151 -151 -162 -172 -177 -178 -178 -180 -187
15450 -187 -205 -228 -242 -240 -230 -220 -217 -223 -232 -232 -220 -212 -220 -227 -205 -157 -112 -88 -68 -38 -14 -20 -60 -112 -156 -179 -179 -163 -150 -145 -138 -120 -100 -90 -83 -71 -65 -83 -122 -156 -167
15432 -167 -159 -144 -124 -100 -80 -74 -79 -86 -91 -93 -93 -88 -77 -64 -55 -60 -87 -128 -163 -172 -155 -125 -105 -104 -118 -129 -126 -116 -121 -147 -176 -186 -178 -175 -197 -241 -284 -305 -300 -283 -269 -267 -274 -282
15413 -282 -286 -276 -253 -226 -209 -209 -216 -216 -200 -177 -161 -159 -164 -163 -151 -132 -115 -100 -92 -102 -129 -162 -185 -197 -203 -199 -182 -167 -174 -198 -213 -206 -193 -190 -191 -186 -183 -195 -216 -224 -205 -172 -144
15395 -144 -129 -129 -138 -147 -146 -140 -145 -163 -181 -187 -184 -188 -208 -237 -256 -252 -217 -164 -113 -79 -62 -55 -56 -68 -90 -111 -121 -124 -127 -131 -126 -111 -98 -97 -103 -103 -100 -114 -151 -192 -216 -212 -188 -154 -123
15375 -123 -107 -111 -126 -134 -131 -124 -118 -117 -121 -127 -125 -106 -79 -68 -82 -111 -136 -151 -160 -167 -174 -181 -187 -191 -193 -194 -189 -169 -137 -114 -115 -135 -156 -171 -174 -154 -103 -36 7 4 -32 -75 -107 -128 -138
15356 -138 -138 -135 -143 -167 -194 -208 -203 -184 -159 -134 -115 -98 -79 -61 -62 -91 -134 -166 -177 -184 -202 -229 -247 -247 -238 -233 -239 -251 -257 -248 -228 -211 -207 -217 -238 -267 -300 -322 -317 -287 -252
15338 -252 -232 -233 -238 -234 -214 -188 -172 -177 -197 -214 -217 -215 -223 -239 -253 -262 -270 -275 -261 -221 -168 -121 -93 -81 -74 -68 -55 -32 -1 18 15 -9 -43 -73 -93 -105 -111 -118 -136 -169 -203 -228
15320 -228 -239 -245 -247 -239 -229 -230 -249 -270 -273 -255 -233 -218 -210 -207 -209 -217 -224 -228 -232 -238 -233 -205 -161 -122 -97 -82 -69 -58 -53 -51 -51 -57 -70 -90 -112 -133 -145 -141 -117 -86 -66 -64 -73 -78 -74 -67
15300 -67 -71 -89 -112 -124 -118 -103 -96 -102 -116 -134 -152 -163 -165 -162 -166 -178 -187 -186 -183 -195 -226 -259 -272 -254 -214 -168 -137 -130 -146 -170 -179 -161 -122 -82 -61 -65 -89 -122 -152 -165 -160 -150
15282 -150 -154 -176 -198 -204 -201 -205 -221 -235 -238 -238 -250 -279 -308 -322 -316 -298 -282 -275 -273 -264 -237 -194 -156 -139 -146 -161 -174 -184 -187 -175 -138 -86 -39 -11 -3 -10 -30 -56 -82 -105 -132
15264 -132 -161 -179 -175 -151 -121 -94 -71 -59 -62 -77 -94 -104 -113 -133 -168 -211 -249 -262 -246 -214 -195 -198 -206 -196 -165 -139 -140 -167 -197 -206 -192 -168 -150 -138 -126 -117 -120 -140 -170
15247 -170 -200 -228 -255 -274 -278 -266 -249 -239 -238 -242 -251 -268 -290 -306 -304 -284 -255 -234 -227 -229 -233 -227 -209 -181 -153 -134 -128 -138 -163 -201 -239 -269 -284 -284 -269 -245 -221 -203 -186 -162
15230 -162 -134 -118 -119 -127 -134 -148 -177 -206 -215 -201 -186 -183 -187 -185 -182 -190 -210 -232 -247 -255 -258 -262 -269 -279 -288 -285 -263 -231 -206 -203 -220 -237 -236 -216 -195 -190 -202 -221 -233 -226 -196 -150 -106 -80
15210 -80 -75 -80 -85 -93 -112 -142 -175 -197 -200 -189 -177 -174 -179 -181 -178 -181 -201 -231 -247 -242 -231 -230 -240 -244 -230 -205 -180 -159 -144 -137 -140 -147 -152 -151 -139 -114 -80 -48 -29 -16 -6 -6 -29 -67
15191 -67 -95 -101 -98 -98 -97 -87 -74 -71 -76 -82 -96 -135 -189 -226 -221 -190 -166 -161 -164 -156 -136 -116 -108 -116 -131 -142 -142 -135 -127 -118 -107 -108 -130 -163 -181 -171 -147 -129 -126 -133 -148 -168 -181 -173 -152
15172 -152 -142 -159 -187 -206 -211 -212 -214 -205 -186 -175 -184 -205 -216 -210 -196 -183 -173 -165 -158 -148 -129 -102 -84 -87 -111 -148 -191 -236 -280 -317 -342 -341 -303 -235 -167 -129 -128 -148 -176 -208
15155 -208 -237 -241 -216 -184 -174 -189 -209 -218 -213 -204 -198 -200 -208 -215 -212 -195 -172 -148 -134 -136 -146 -153 -151 -147 -148 -150 -147 -147 -167 -202 -226 -222 -194 -161 -137 -125 -121 -118 -109 -98 -99 -119 -144 -161 -166 -164
15135 -164 -153 -128 -92 -55 -29 -21 -37 -73 -112 -133 -129 -114 -103 -98 -96 -95 -96 -100 -106 -112 -113 -107 -96 -80 -62 -44 -35 -41 -63 -92 -125 -160 -188 -193 -173 -138 -104 -83 -76 -82 -98 -122
15116 -122 -154 -193 -228 -243 -234 -216 -208 -216 -235 -258 -276 -279 -266 -247 -242 -258 -287 -311 -317 -307 -290 -280 -278 -280 -272 -243 -192 -129 -75 -50 -64 -112 -173 -220 -230 -207 -177 -162 -167
15099 -167 -186 -214 -244 -260 -251 -227 -212 -215 -222 -226 -238 -260 -270 -243 -185 -127 -92 -84 -95 -114 -123 -116 -110 -121 -142 -146 -130 -114 -113 -115 -112 -113 -135 -167 -191 -201 -209 -217 -215 -203 -194 -200 -215
15081 -215 -231 -249 -270 -284 -279 -254 -222 -191 -161 -136 -121 -117 -119 -123 -129 -137 -144 -149 -157 -172 -185 -189 -187 -189 -193 -186 -161 -137 -133 -152 -178 -196 -196 -176 -141 -107 -91 -89 -84 -66 -42 -26 -19 -19
15062 -19 -24 -38 -59 -82 -105 -128 -151 -167 -168 -150 -117 -82 -59 -54 -60 -68 -77 -87 -97 -105 -112 -117 -117 -111 -103 -105 -116 -130 -141 -152 -166 -181 -186 -173 -143 -111 -87 -69 -51 -38 -48 -82
15044 -82 -121 -141 -138 -129 -122 -120 -131 -159 -191 -198 -165 -115 -79 -68 -69 -74 -87 -112 -143 -173 -200 -222 -231 -223 -209 -204 -210 -216 -215 -203 -183 -157 -135 -127 -130 -135 -134 -134 -146 -168 -184 -180 -159 -132
15024 -132 -108 -90 -80 -90 -125 -174 -215 -227 -213 -189 -170 -157 -150 -154 -174 -204 -227 -233 -219 -188 -147 -116 -115 -143 -177 -190 -176 -141 -94 -47 -18 -24 -59 -107 -151 -184 -206
15008 -206 -222 -238 -250 -245 -211 -162 -134 -149 -192 -224 -220 -190 -158 -137 -128 -126 -131 -141 -154 -167 -181 -193 -199 -195 -183 -170 -162 -160 -163 -171 -187 -213 -249 -290 -316 -309 -270 -221 -183 -155
14991 -155 -131 -119 -127 -146 -155 -154 -157 -177 -201 -213 -211 -207 -209 -213 -217 -215 -209 -206 -218 -240 -254 -242 -209 -175 -152 -142 -142 -152 -168 -177 -177 -173 -169 -168 -172 -188 -213 -232 -237 -236 -240 -247 -242 -216 -180 -148
14971 -148 -126 -114 -114 -131 -161 -195 -220 -239 -251 -252 -234 -203 -181 -185 -207 -228 -238 -241 -245 -248 -245 -240 -238 -236 -229 -215 -196 -179 -170 -169 -170 -166 -157 -154 -166 -188 -205 -206 -195 -182 -173 -164 -154 -151 -162
14952 -162 -181 -187 -169 -140 -124 -136 -167 -200 -224 -237 -239 -234 -229 -232 -242 -250 -249 -239 -225 -205 -178 -148 -126 -118 -129 -159 -196 -221 -222 -207 -195 -192 -184 -160 -131 -112 -99 -79 -55 -44
14934 -44 -53 -64 -60 -52 -63 -96 -129 -139 -128 -114 -115 -134 -163 -186 -194 -190 -184 -179 -169 -151 -135 -131 -137 -150 -166 -176 -167 -136 -98 -74 -62 -48 -26 -13 -24 -54 -87 -112 -130 -144
14917 -144 -153 -153 -149 -147 -151 -162 -172 -171 -156 -137 -131 -143 -161 -168 -157 -136 -115 -106 -116 -141 -174 -204 -223 -226 -212 -183 -146 -118 -112 -129 -154 -171 -171 -157 -138 -120 -104 -92 -81 -68
14900 -68 -55 -43 -35 -28 -18 -9 -11 -21 -26 -17 -9 -28 -79 -139 -177 -182 -164 -143 -129 -121 -114 -107 -103 -100 -92 -85 -90 -118 -159 -194 -212 -222 -239 -262 -283 -294 -291 -275 -250 -229 -226 -238 -248 -240
14881 -240 -215 -189 -172 -165 -168 -179 -195 -207 -208 -209 -223 -246 -258 -246 -221 -205 -199 -192 -182 -185 -208 -234 -240 -228 -220 -227 -242 -252 -257 -264 -274 -280 -273 -247 -212 -185 -175 -172 -166 -160 -158 -155 -134 -99
14861 -99 -68 -54 -50 -49 -55 -75 -98 -111 -117 -124 -128 -120 -113 -132 -179 -221 -231 -218 -207 -210 -216 -210 -190 -164 -147 -149 -166 -179 -174 -161 -163 -187 -219 -247 -267 -275 -260 -225 -190 -171 -164 -155 -147 -150
14842 -150 -164 -167 -147 -114 -83 -62 -49 -48 -62 -86 -106 -118 -123 -125 -127 -135 -154 -177 -191 -181 -150 -118 -103 -113 -139 -162 -165 -148 -123 -107 -107 -124 -151 -179 -210 -240 -263 -267 -250
14825 -250 -224 -211 -216 -230 -238 -231 -213 -195 -187 -187 -183 -166 -137 -109 -95 -96 -108 -124 -144 -171 -203 -234 -259 -275 -281 -272 -247 -219 -208 -217 -224 -205 -164 -128 -114 -115 -117 -110 -94 -75 -66 -74
14807 -74 -97 -122 -143 -164 -192 -219 -231 -229 -221 -217 -213 -201 -174 -137 -100 -73 -65 -77 -105 -146 -192 -229 -247 -242 -222 -199 -178 -158 -143 -134 -131 -126 -114 -97 -86 -81 -74 -63 -70 -109 -159
14790 -159 -182 -165 -129 -99 -75 -47 -23 -12 -4 19 52 66 55 36 26 19 3 -9 -6 5 8 0 0 17 38 50 54 60 63 51 23 0 1 35 85 127 147 149 144 142 143
14772 143 145 140 121 88 55 40 45 55 49 29 7 -2 -1 10 33 63 83 76 42 5 -11 -7 2 9 13 18 15 -7 -47 -83 -99 -96 -92 -100 -115 -123 -119 -118 -136 -173 -211 -229 -225 -216 -226
14752 -226 -259 -301 -332 -346 -344 -327 -293 -248 -207 -182 -175 -179 -188 -194 -193 -184 -169 -147 -112 -70 -42 -40 -58 -79 -99 -128 -165 -195 -209 -213 -216 -220 -218 -213 -207 -202 -195 -188 -187 -192 -196 -192 -180 -164 -145
14733 -145 -125 -107 -103 -118 -146 -173 -185 -178 -161 -143 -132 -130 -133 -139 -149 -163 -176 -180 -179 -186 -196 -189 -151 -101 -71 -73 -91 -111 -133 -159 -186 -206 -219 -229 -235 -230 -213 -184 -143 -98
14715 -98 -61 -41 -35 -38 -49 -63 -78 -95 -119 -149 -175 -191 -204 -221 -240 -256 -276 -305 -331 -334 -311 -276 -243 -215 -192 -181 -184 -192 -192 -182 -167 -152 -136 -116 -89 -59 -30 -14
14699 -14 -19 -43 -71 -91 -99 -107 -124 -150 -173 -184 -184 -179 -168 -152 -135 -124 -120 -115 -102 -85 -72 -69 -75 -84 -86 -76 -60 -52 -55 -64 -66 -59 -48 -48 -67 -100 -127 -133 -118 -104 -104 -116 -126 -132 -141
14679 -141 -160 -182 -190 -178 -153 -134 -133 -145 -158 -169 -175 -168 -146 -120 -116 -140 -176 -197 -193 -175 -161 -165 -191 -230 -261 -269 -261 -252 -250 -246 -234 -216 -196 -177 -159 -145 -140 -145 -158 -171 -176 -168
14661 -168 -145 -112 -72 -27 17 57 84 88 65 23 -11 -23 -20 -20 -23 -16 -2 -6 -41 -88 -118 -138 -174 -228 -268 -264 -235 -223 -245 -280 -297 -285 -255 -222 -196 -180 -179 -188 -195
14644 -195 -187 -163 -135 -116 -109 -107 -104 -102 -108 -120 -131 -137 -140 -143 -146 -157 -179 -206 -220 -213 -202 -206 -223 -234 -232 -229 -238 -253 -258 -241 -204 -154 -105 -76 -82 -110 -141 -167 -199 -237 -264 -266 -254
14626 -254 -243 -234 -210 -176 -154 -158 -172 -178 -178 -194 -228 -258 -272 -278 -288 -293 -272 -230 -193 -181 -184 -184 -176 -173 -179 -187 -183 -165 -144 -132 -137 -155 -174 -181 -177 -171 -179 -200 -230 -255 -269 -265 -247 -228
14607 -228 -230 -262 -318 -368 -389 -371 -333 -302 -292 -292 -283 -260 -244 -254 -286 -312 -317 -310 -302 -290 -264 -224 -189 -174 -177 -183 -180 -169 -163 -170 -184 -187 -172 -152 -142 -143 -144 -141 -141 -149 -169 -193 -213
14588 -213 -218 -211 -206 -217 -241 -260 -262 -250 -234 -216 -194 -169 -145 -127 -119 -124 -134 -139 -132 -118 -103 -93 -99 -129 -177 -222 -250 -257 -246 -213 -169 -139 -137 -147 -148 -141 -142 -151 -155 -144 -134 -136 -146
14569 -146 -158 -172 -190 -205 -212 -209 -199 -181 -164 -165 -189 -221 -233 -214 -178 -152 -154 -181 -210 -216 -194 -161 -135 -119 -108 -105 -117 -139 -160 -175 -188 -203 -217 -227 -231 -226 -208 -186
14553 -186 -172 -167 -157 -131 -102 -89 -96 -111 -126 -140 -147 -138 -115 -101 -112 -140 -156 -149 -135 -130 -132 -129 -122 -118 -123 -137 -158 -179 -191 -188 -179 -179 -194 -217 -239 -249 -240 -210 -177 -161 -166 -181
14535 -181 -194 -196 -184 -160 -141 -148 -178 -204 -198 -165 -130 -109 -99 -93 -96 -110 -125 -128 -118 -103 -90 -74 -52 -34 -36 -61 -94 -117 -131 -150 -181 -213 -228 -219 -200 -197 -222 -258 -270
14518 -270 -246 -205 -172 -147 -117 -82 -63 -68 -86 -104 -120 -133 -133 -124 -124 -140 -159 -164 -159 -160 -166 -168 -170 -189 -223 -250 -256 -251 -248 -247 -243 -244 -254 -254 -228 -181 -136 -109 -100 -101 -110 -125 -134 -132 -124 -117
14498 -117 -117 -124 -142 -172 -202 -211 -190 -151 -118 -103 -96 -88 -75 -60 -45 -36 -35 -41 -54 -77 -114 -158 -188 -192 -180 -169 -159 -144 -132 -137 -157 -175 -178 -174 -173 -177 -178 -177 -173 -160 -141 -130 -139
14479 -139 -157 -164 -156 -143 -131 -117 -107 -112 -136 -161 -167 -150 -121 -95 -79 -80 -97 -122 -151 -178 -198 -200 -189 -184 -199 -217 -217 -202 -198 -217 -242 -260 -276 -290 -287 -254 -210 -179 -163
14462 -163 -144 -120 -104 -99 -92 -81 -84 -113 -153 -184 -200 -207 -203 -185 -160 -137 -117 -95 -78 -72 -75 -74 -65 -50 -38 -38 -68 -128 -190 -220 -212 -195 -193 -205 -219 -230 -245 -271 -304 -332
14445 -332 -337 -314 -282 -261 -248 -226 -197 -179 -186 -206 -223 -238 -256 -271 -269 -246 -212 -182 -164 -160 -160 -150 -132 -126 -145 -182 -212 -224 -225 -226 -224 -219 -218 -234 -267 -296 -301 -277 -243 -216
14428 -216 -201 -194 -195 -200 -200 -188 -172 -165 -166 -162 -153 -150 -148 -131 -94 -61 -58 -89 -133 -175 -210 -236 -255 -278 -307 -327 -319 -282 -239 -206 -186 -175 -175 -182 -188 -183 -168 -147 -126 -111 -112 -129 -154
14409 -154 -173 -184 -197 -213 -228 -225 -201 -165 -135 -118 -108 -97 -87 -83 -87 -100 -122 -148 -167 -172 -169 -166 -168 -171 -173 -170 -159 -144 -135 -138 -143 -138 -124 -110 -102 -97 -91 -91 -101 -120 -147 -175 -191
14390 -191 -188 -173 -159 -147 -130 -113 -108 -113 -119 -118 -113 -103 -83 -56 -40 -50 -83 -129 -177 -216 -232 -227 -214 -202 -187 -167 -160 -183 -230 -278 -306 -309 -294 -272 -254 -239 -221 -198 -179
14373 -179 -168 -159 -147 -136 -127 -116 -103 -99 -113 -136 -153 -160 -168 -180 -193 -208 -228 -253 -275 -288 -283 -254 -205 -159 -142 -150 -162 -165 -160 -156 -153 -151 -145 -125 -90 -54 -44 -62 -87 -98 -96
14356 -96 -97 -111 -134 -154 -156 -134 -103 -90 -102 -125 -138 -136 -129 -126 -125 -124 -123 -120 -114 -108 -114 -137 -163 -168 -138 -85 -40 -20 -15 -7 7 18 17 9 -5 -28 -57 -80 -98 -117 -134 -137 -122 -106
14337 -106 -112 -136 -159 -168 -171 -176 -183 -184 -171 -146 -124 -120 -137 -163 -186 -198 -197 -181 -157 -139 -140 -152 -165 -176 -191 -204 -198 -164 -115 -80 -69 -74 -76 -72 -70 -82 -107 -132 -148 -156 -162 -169 -181
14318 -181 -198 -221 -243 -261 -279 -297 -308 -302 -284 -268 -256 -235 -195 -147 -108 -90 -96 -125 -168 -206 -227 -235 -243 -258 -271 -271 -254 -225 -193 -168 -154 -144 -130 -116 -112 -119 -132 -143
14301 -143 -149 -146 -125 -87 -50 -34 -48 -80 -111 -124 -117 -99 -78 -61 -53 -63 -89 -117 -135 -143 -151 -156 -150 -131 -118 -124 -147 -173 -193 -204 -200 -186 -176 -180 -192 -201 -209 -221 -233 -229 -203
14284 -203 -168 -137 -118 -110 -108 -110 -116 -131 -153 -172 -181 -192 -212 -228 -217 -188 -172 -187 -210 -210 -188 -163 -150 -140 -122 -92 -54 -28 -33 -69 -112 -136 -149 -166 -183 -178 -149 -121
14267 -121 -119 -143 -175 -196 -197 -184 -173 -179 -196 -209 -205 -189 -171 -153 -131 -101 -67 -40 -28 -34 -52 -74 -100 -124 -141 -148 -160 -183 -206 -210 -191 -165 -143 -131 -130 -134 -128 -104 -80
14250 -80 -79 -98 -110 -106 -106 -127 -158 -179 -188 -191 -183 -166 -156 -166 -182 -174 -140 -102 -82 -81 -94 -118 -149 -177 -194 -201 -201 -195 -193 -206 -229 -244 -233 -203 -175 -164 -162 -151 -128 -106 -95
14232 -95 -93 -87 -82 -90 -114 -138 -146 -136 -116 -92 -66 -44 -35 -37 -52 -80 -118 -156 -188 -215 -235 -239 -225 -209 -201 -199 -194 -188 -188 -186 -173 -160 -169 -199 -222 -220 -201 -182 -171 -165 -162 -154 -140 -130
14213 -130 -134 -147 -148 -126 -96 -72 -56 -49 -58 -80 -101 -116 -138 -173 -206 -219 -220 -231 -251 -260 -248 -225 -200 -175 -154 -150 -163 -180 -190 -200 -220 -247 -266 -271 -262 -245 -225 -210 -209
14197 -209 -222 -237 -246 -246 -242 -234 -217 -192 -173 -169 -171 -162 -140 -121 -114 -115 -116 -121 -136 -151 -155 -153 -158 -172 -185 -188 -186 -186 -190 -199 -212 -222 -220 -208 -206 -222 -245 -255 -244 -218 -189 -171 -171 -189 -217
14177 -217 -242 -256 -259 -247 -220 -186 -156 -138 -132 -140 -168 -214 -256 -273 -262 -243 -230 -229 -237 -253 -274 -287 -274 -234 -187 -164 -175 -210 -242 -255 -252 -244 -231 -209 -179 -153 -137 -123
14161 -123 -98 -67 -48 -47 -54 -58 -55 -51 -47 -46 -47 -49 -47 -41 -35 -35 -41 -54 -78 -113 -149 -172 -184 -191 -199 -207 -215 -223 -228 -226 -217 -208 -203 -198 -187 -167 -143 -117 -95 -83 -85 -99 -117 -131 -139 -144 -150 -156 -161 -165
14139 -165 -170 -172 -167 -156 -153 -169 -192 -203 -195 -182 -179 -184 -187 -188 -193 -207 -228 -244 -247 -234 -214 -206 -216 -230 -233 -221 -206 -196 -188 -181 -176 -167 -146 -121 -116 -141 -177 -194 -188 -177 -168 -149 -122 -111
14120 -111 -135 -182 -224 -248 -258 -255 -237 -207 -177 -153 -132 -113 -100 -93 -85 -74 -65 -64 -71 -89 -119 -161 -204 -234 -242 -227 -194 -158 -131 -121 -115 -101 -78 -57 -46 -45 -53 -67 -81
14103 -81 -86 -80 -76 -88 -113 -131 -126 -108 -101 -111 -121 -114 -96 -83 -75 -60 -42 -40 -57 -79 -92 -103 -125 -152 -167 -166 -155 -138 -119 -109 -116 -136 -153 -154 -147 -141 -141 -146 -149 -148 -146 -152 -168 -187
14084 -187 -198 -205 -213 -223 -232 -245 -270 -299 -311 -297 -268 -240 -221 -217 -229 -248 -257 -250 -239 -238 -243 -239 -224 -209 -201 -191 -169 -135 -100 -78 -74 -85 -99 -104 -99 -95 -102 -119 -131 -127 -112 -105 -114
14065 -114 -129 -140 -151 -166 -181 -188 -189 -195 -208 -217 -215 -203 -183 -160 -139 -127 -124 -118 -109 -107 -122 -141 -150 -145 -138 -140 -152 -168 -179 -180 -174 -168 -167 -170 -178 -195 -222 -252 -275 -280 -263 -226 -184 -162
14046 -162 -166 -177 -177 -170 -177 -204 -233 -243 -233 -214 -194 -181 -179 -191 -203 -204 -192 -177 -168 -170 -184 -210 -241 -272 -299 -317 -320 -306 -279 -249 -219 -194 -179 -173 -164 -142 -110 -84 -76 -78 -79
14028 -79 -75 -75 -92 -126 -163 -187 -198 -209 -229 -250 -250 -222 -175 -129 -93 -74 -74 -83 -85 -73 -61 -65 -81 -91 -89 -83 -86 -93 -95 -81 -44 19 98 169 213 230 220 179 113 51 17
14011 17 4 -11 -36 -56 -63 -70 -84 -105 -126 -150 -168 -165 -135 -99 -79 -75 -81 -93 -112 -133 -147 -156 -167 -179 -182 -170 -149 -132 -128 -136 -140 -124 -92 -67 -63 -67 -65 -61 -64 -74 -81 -85 -97
13992 -97 -113 -119 -113 -109 -116 -127 -133 -134 -134 -135 -139 -147 -162 -187 -217 -239 -236 -208 -172 -137 -102 -66 -54 -78 -113 -121 -108 -114 -154 -194 -204 -191 -184 -187 -194 -204 -216 -219 -206 -194 -205 -231 -248
13973 -248 -247 -241 -229 -202 -167 -155 -177 -214 -239 -243 -231 -211 -198 -214 -258 -299 -306 -283 -246 -198 -134 -71 -41 -59 -100 -126 -129 -121 -119 -127 -139 -147 -147 -142 -146 -165 -190 -204 -204 -196 -191 -188
13955 -188 -191 -201 -210 -198 -160 -117 -99 -110 -134 -146 -137 -107 -60 -18 -4 -26 -63 -88 -99 -108 -126 -145 -152 -144 -127 -111 -107 -119 -139 -156 -163 -159 -148 -133 -120 -116 -120 -127 -136 -146 -155
13937 -155 -153 -128 -89 -59 -53 -65 -76 -75 -73 -84 -108 -130 -136 -127 -112 -95 -76 -57 -40 -37 -58 -100 -142 -160 -154 -144 -145 -149 -144 -129 -115 -108 -105 -102 -102 -110 -127 -151 -169 -172 -161 -149 -141
13919 -141 -134 -131 -139 -152 -153 -132 -113 -123 -153 -167 -150 -128 -133 -166 -196 -204 -198 -192 -189 -182 -170 -157 -155 -169 -197 -222 -237 -251 -279 -317 -345 -345 -320 -290 -262 -235 -210 -195 -192 -191 -178
13901 -178 -162 -161 -185 -225 -265 -296 -311 -314 -310 -311 -319 -329 -333 -330 -322 -305 -283 -262 -246 -224 -186 -139 -102 -90 -101 -121 -139 -149 -155 -166 -185 -204 -209 -202 -197 -205 -223 -235 -230 -209 -187
13883 -187 -176 -176 -174 -167 -172 -203 -250 -285 -300 -309 -324 -331 -315 -283 -255 -236 -215 -184 -153 -127 -105 -80 -53 -34 -25 -27 -39 -59 -76 -77 -61 -42 -36 -48 -74 -109 -150 -186 -205
13866 -205 -208 -208 -211 -213 -216 -231 -259 -284 -285 -261 -225 -194 -177 -179 -194 -208 -202 -183 -168 -172 -185 -197 -205 -210 -209 -195 -171 -142 -111 -82 -62 -53 -54 -63 -78 -90 -92 -87 -92 -116 -146 -163 -166 -167
13847 -167 -171 -175 -179 -183 -187 -186 -177 -167 -161 -153 -134 -100 -64 -47 -51 -68 -86 -111 -148 -193 -234 -262 -274 -268 -243 -213 -196 -194 -187 -164 -133 -112 -102 -98 -101 -115 -135 -157 -181 -205 -212 -195
13829 -195 -173 -167 -176 -183 -184 -190 -199 -190 -158 -123 -104 -99 -93 -86 -85 -84 -70 -46 -24 -9 1 6 2 -11 -27 -37 -34 -22 -12 -26 -67 -115 -143 -145 -140 -143 -149 -148 -144 -148 -166 -187 -201 -198 -170 -115
13809 -115 -36 55 149 239 329 430 549 676 775 807 764 666 540 405 276 167 87 32 -9 -42 -60 -57 -39 -21 -19 -38 -72 -105 -123 -128 -124 -120 -119 -124
13794 -124 -133 -137 -133 -125 -120 -113 -97 -83 -86 -108 -129 -130 -115 -106 -107 -109 -107 -111 -126 -146 -159 -168 -182 -201 -217 -226 -227 -221 -205 -181 -163 -154 -146 -129 -105 -86 -71 -51 -25 -6 -11 -40 -85 -136
13775 -136 -184 -218 -229 -214 -187 -161 -143 -134 -131 -133 -138 -144 -147 -148 -153 -169 -193 -213 -221 -218 -207 -183 -143 -101 -77 -69 -63 -52 -45 -50 -57 -62 -78 -108 -134 -136 -126 -127 -143 -151 -138 -110 -87 -78
13756 -78 -84 -105 -128 -136 -124 -105 -102 -122 -149 -167 -169 -158 -142 -129 -123 -126 -132 -128 -109 -84 -70 -74 -94 -125 -162 -197 -219 -227 -231 -239 -244 -235 -216 -200 -190 -181 -168 -147 -112 -72 -50 -65
13738 -65 -98 -116 -107 -87 -73 -63 -58 -70 -104 -150 -193 -226 -243 -234 -203 -170 -159 -166 -178 -187 -197 -208 -214 -217 -216 -209 -195 -183 -181 -192 -212 -237 -266 -288 -300 -302 -304 -304 -302 -300 -299 -294 -280
13719 -280 -265 -255 -245 -223 -199 -191 -207 -231 -245 -245 -236 -224 -215 -209 -198 -174 -142 -126 -135 -158 -172 -172 -167 -167 -171 -174 -169 -151 -125 -109 -112 -128 -134 -123 -107 -103 -109 -109 -98 -92 -108 -142 -172
13701 -172 -179 -164 -138 -108 -80 -59 -47 -45 -53 -77 -116 -158 -189 -203 -206 -201 -191 -184 -189 -208 -225 -225 -210 -196 -189 -180 -158 -130 -106 -90 -72 -48 -32 -41 -70 -98 -116 -136 -164 -186
13683 -186 -187 -176 -178 -202 -232 -244 -235 -208 -172 -138 -120 -124 -136 -133 -111 -89 -86 -104 -134 -165 -185 -186 -168 -142 -118 -96 -79 -72 -84 -106 -123 -124 -117 -112 -111 -108 -108 -116 -128 -134 -131 -129 -133 -136
13664 -136 -133 -129 -130 -135 -143 -158 -181 -200 -206 -207 -215 -228 -227 -207 -185 -181 -194 -200 -184 -149 -113 -97 -101 -115 -132 -150 -169 -183 -183 -169 -155 -156 -172 -193 -207 -213 -218 -229 -237 -235 -223 -210 -198
13646 -198 -181 -159 -142 -136 -127 -100 -59 -25 -15 -26 -44 -56 -56 -50 -44 -41 -38 -40 -53 -78 -101 -110 -114 -126 -146 -157 -148 -129 -118 -128 -158 -194 -215 -213 -201 -189 -171 -139 -112 -115 -144
13628 -144 -164 -153 -130 -122 -129 -129 -115 -99 -94 -103 -128 -170 -224 -269 -286 -272 -245 -225 -215 -205 -191 -184 -197 -222 -235 -227 -215 -210 -207 -197 -191 -201 -221 -231 -220 -196 -174 -159 -149
13611 -149 -136 -116 -101 -105 -128 -150 -157 -161 -179 -208 -226 -228 -221 -214 -195 -157 -105 -58 -25 -10 -11 -26 -48 -72 -97 -127 -158 -180 -187 -186 -191 -202 -202 -183 -153 -127 -114 -110 -113 -121 -126 -113
13593 -113 -86 -62 -55 -64 -78 -93 -104 -107 -102 -100 -109 -125 -143 -165 -193 -217 -219 -197 -163 -132 -120 -134 -164 -188 -193 -191 -196 -204 -205 -197 -187 -175 -152 -128 -117 -115 -104 -80 -63 -64 -75 -81
13574 -81 -82 -90 -104 -121 -144 -174 -196 -194 -171 -145 -131 -133 -144 -160 -174 -181 -178 -169 -162 -158 -160 -164 -165 -157 -138 -113 -94 -89 -99 -117 -135 -155 -183 -217 -243 -254 -254 -254 -255 -250 -237 -222 -210 -199
13555 -199 -188 -186 -207 -251 -292 -302 -279 -247 -227 -218 -212 -208 -208 -198 -168 -128 -98 -83 -72 -48 -9 38 83 106 100 78 63 58 58 67 96 134 146 119 79 65 76 87 84
13538 84 80 89 111 134 150 155 151 143 140 142 144 143 144 154 170 184 190 192 205 241 300 370 434 489 540 595 653 712 769 835 917 1009 1095 1172 1256 1367 1511 1685 1890
13522 1890 2136 2427 2776 3212 3764 4445 5268 6277 7557 9207 11325 13995 17201 20683 23875 26066 26724 25737 23435
13513 23435 20387 17158 14146 11556 9448 7787 6489 5454 4607 3912 3353 2906 2547 2261 2041 1868 1714 1561 1405 1252
13505 1252 1113 1000 919 856 789 707 621 548 499 473 459 440 406 361 316 278 245 224 222 238 255 256 239 205 157 103 61 45 55 82 116 143 148 123
13490 123 80 49 41 43 31 1 -28 -43 -46 -47 -50 -42 -21 0 6 -5 -26 -47 -67 -82 -89 -94 -105 -123 -140 -149 -152 -159 -167 -163 -141 -103 -64 -31 -12 -6 -8 -8 0 7 2 -17 -42 -64
13471 -64 -83 -99 -108 -115 -127 -138 -131 -101 -71 -72 -103 -139 -162 -169 -160 -137 -110 -93 -80 -53 -15 7 1 -17 -26 -23 -23 -34 -49 -67 -86 -100 -109 -117 -124 -121 -107 -93 -86 -74 -47 -23
13453 -23 -30 -66 -105 -130 -144 -147 -136 -110 -85 -74 -80 -95 -113 -125 -128 -132 -148 -172 -191 -205 -217 -224 -215 -198 -189 -198 -216 -233 -242 -234 -203 -161 -133 -125 -124 -118 -115 -120 -121 -107 -90 -91 -106 -117
13434 -117 -115 -111 -114 -122 -133 -148 -168 -186 -195 -187 -163 -136 -126 -140 -167 -183 -179 -162 -144 -132 -126 -130 -147 -173 -193 -200 -196 -189 -182 -169 -151 -141 -146 -160 -170 -183 -203 -219 -211 -183 -156 -146
13415 -146 -145 -145 -144 -140 -134 -131 -145 -172 -195 -203 -199 -189 -170 -153 -149 -156 -152 -136 -132 -156 -181 -170 -126 -85 -69 -68 -73 -88 -119 -151 -166 -155 -126 -94 -69 -50 -32 -20 -13 1 42 105
13397 105 158 176 172 186 242 341 477 643 819 969 1058 1066 990 850 694 568 486 427 366 291 211 147 121 135 158 151 104 49 19 17 22 16 -5 -35
13382 -35 -58 -63 -54 -49 -60 -75 -74 -52 -30 -32 -61 -94 -103 -81 -41 -5 17 30 37 43 48 51 54 67 91 110 101 63 26 15 27 40 44 44 41 26 -2 -37 -62 -75 -79 -80 -86 -97
13363 -97 -108 -114 -112 -104 -89 -70 -58 -56 -49 -24 16 52 68 65 46 19 -6 -19 -19 -20 -32 -48 -58 -62 -67 -79 -90 -85 -57 -9 48 106 157 189 190 161 123 94 67 29 -13
13346 -13 -40 -50 -56 -66 -68 -55 -37 -24 -14 -8 -22 -67 -121 -154 -156 -137 -106 -67 -29 -14 -32 -72 -106 -115 -107 -106 -126 -151 -157 -140 -120 -113 -111 -103 -93 -99 -125 -162 -200 -238 -265
13328 -265 -266 -239 -207 -194 -202 -206 -192 -170 -157 -155 -145 -125 -112 -124 -151 -173 -181 -186 -196 -209 -219 -228 -235 -232 -218 -193 -165 -139 -124 -127 -148 -179 -219 -266 -310 -336 -336 -323 -309 -296
13310 -296 -277 -243 -196 -145 -106 -95 -112 -142 -165 -168 -152 -131 -124 -138 -161 -171 -168 -163 -160 -159 -167 -193 -231 -253 -247 -226 -204 -187 -175 -171 -170 -154 -120 -91 -91 -107 -115 -106 -93 -85 -81 -92
13292 -92 -132 -190 -227 -220 -176 -121 -68 -26 -6 -11 -32 -51 -59 -61 -65 -74 -95 -128 -167 -197 -206 -201 -195 -196 -196 -190 -185 -185 -190 -188 -178 -164 -148 -129 -108 -91 -77 -65 -61 -72 -88 -94 -96 -112
13273 -112 -142 -162 -153 -127 -111 -116 -133 -149 -155 -144 -120 -100 -98 -108 -113 -104 -88 -74 -71 -83 -104 -117 -106 -76 -47 -25 7 65 134 186 214 237 280 358 475 638 854
13257 854 1124 1425 1719 1960 2106 2137 2071 1944 1792 1626 1454 1291 1144 1002 850 700 579 491 415 340 272 218 166 106 49 7 -22
13245 -22 -46 -56 -51 -42 -43 -54 -68 -87 -112 -131 -126 -103 -76 -51 -28 -13 -24 -58 -95 -120 -129 -126 -105 -67 -29 -9 -9 -10 -5 -4 -12 -19 -11 -2 -16 -43 -32 50 188 361 586
13228 586 858 1083 1125 957 692 462 308 201 123 75 35 -15 -65 -92 -107 -134 -163 -164 -134 -107 -94 -85 -79 -92 -123 -145 -140 -117 -87 -48 -5 22 24
13213 24 7 -23 -66 -106 -124 -122 -125 -142 -158 -167 -180 -203 -218 -215 -202 -195 -189 -176 -153 -125 -101 -95 -111 -134 -149 -160 -176 -190 -178 -142 -106 -84 -68 -57 -68 -99 -123 -126 -121
13196 -121 -129 -145 -157 -171 -193 -213 -219 -209 -182 -145 -115 -113 -134 -148 -139 -127 -134 -154 -168 -173 -175 -175 -173 -178 -191 -196 -183 -155 -124 -99 -85 -90 -112 -139 -157 -160 -148 -124 -104 -103 -109 -92
13178 -92 -54 -31 -50 -92 -122 -132 -134 -134 -131 -122 -108 -89 -80 -94 -120 -131 -113 -87 -76 -85 -110 -144 -172 -172 -151 -137 -144 -152 -152 -162 -197 -231 -234 -206 -169 -134 -110 -112 -137 -159 -165
13160 -165 -171 -187 -193 -175 -160 -179 -216 -228 -207 -181 -166 -156 -146 -145 -152 -159 -161 -158 -143 -119 -103 -108 -125 -131 -122 -110 -96 -81 -76 -82 -89 -84 -81 -91 -107 -121 -142 -177 -208 -216 -216 -222 -222 -190
13141 -190 -135 -86 -47 -9 20 21 3 0 19 49 71 83 80 63 39 18 -3 -35 -70 -103 -136 -162 -158 -119 -81 -79 -98 -99 -82 -70 -62 -42 -19 -21 -46 -68 -80 -95
13125 -95 -109 -97 -56 -19 -6 -5 0 7 11 9 -1 -22 -43 -58 -71 -79 -70 -48 -42 -62 -70 -30 35 87 117 139 140 106 62 52 67 72 62 61 72 77 83 117 176 231 274 325
13107 325 386 452 542 678 835 959 1032 1069 1070 1020 940 870 809 729 634 562 520 482 452 460 497 522 530 561 620 677 730 821 973 1185 1472 1875
13093 1875 2416 3095 3886 4639 5058 4906 4255 3447 2767 2277 1927 1699 1575 1492 1404 1327 1282 1260 1283 1401 1596 1769 1849 1845 1763 1582
13082 1582 1342 1143 1022 924 819 750 730 690 605 544 545 560 560 589 655 691 677 686 748 792 786 802 875 933 943 991 1115 1225 1269 1318 1416 1490 1507
13067 1507 1563 1698 1820 1907 2076 2362 2618 2792 3048 3476 3934 4358 4924 5726 6598 7516 8792 10620 12849 15560 19402 24953
13058 24953 32431 42539 56399 72872 86401 89883 80965 64536 48184 36059 27769 21669 17168 14122 11941
13051 11941 10115 8743 7985 7577 7281 7268 7637 7969 7751 6967 5970 5010 4166 3526 3118 2813 2482 2175 1974 1824 1639 1466
13042 1466 1374 1322 1248 1191 1194 1202 1159 1111 1111 1111 1057 995 984 981 928 864 852 866 848 802 767 728 668 631 660 719 755 787 868 992 1114 1211 1274 1283 1253 1259
13026 1259 1356 1510 1653 1781 1947 2204 2597 3185 4027 5141 6449 7699 8453 8309 7258 5769 4419 3474 2849 2384 2024
13017 2024 1771 1594 1460 1383 1389 1463 1580 1761 2065 2513 3107 3954 5250 6962 8514 9037 8136 6327 4566 3393 2684 2134
13007 2134 1672 1359 1148 943 752 630 549 453 368 348 364 356 328 321 318 282 234 217 220 212 218 259 290 261 204 179 170 126 65 39 39 21 0 22 73
12992 73 98 97 120 168 193 187 180 175 141 90 69 85 97 93 93 95 76 48 48 64 50 10 0 36 81 112 150 197 217 189 139 90 39 -12 -49 -70 -89 -95 -60
12975 -60 13 92 164 244 323 361 350 320 291 250 203 178 183 182 153 112 79 44 3 -25 -31 -26 -14 22 97 192 284 374 490 667 898 1104 1162 1024
12961 1024 777 554 410 317 253 215 179 110 24 -27 -43 -72 -120 -140 -109 -70 -51 -34 0 31 41 44 47 28 -12 -39 -36 -29 -36 -35 -20 -27 -73 -116 -113 -79
12945 -79 -60 -61 -68 -78 -93 -88 -48 7 44 56 51 26 -13 -42 -44 -34 -34 -40 -41 -41 -40 -25 2 16 6 -3 1 3 -11 -22 -11 -1 -9 -16 3 35 47 36 21 0 -28 -44
12927 -44 -31 -11 -12 -27 -29 -11 4 8 1 -15 -35 -37 -13 10 6 -15 -28 -27 -22 -15 -6 -18 -63 -117 -143 -133 -104 -71 -36 -8 3 15 38 54 43 13 -5 -4 4 13 27
12909 27 41 51 53 46 16 -31 -68 -75 -69 -73 -81 -73 -57 -54 -65 -76 -88 -110 -138 -165 -203 -257 -298 -306 -299 -305 -310 -285 -241 -213 -203 -185 -152 -124 -106 -85 -68 -76 -100 -105 -85 -65
12891 -65 -57 -46 -31 -34 -63 -92 -103 -104 -94 -56 8 76 133 189 251 308 371 487 683 902 1033 1010 858 665 507 401 324 248 170 99 35 -29
12877 -29 -91 -135 -157 -157 -140 -113 -96 -96 -97 -80 -57 -55 -77 -102 -120 -137 -148 -147 -142 -140 -130 -98 -63 -51 -54 -45 -28 -27 -45 -57 -63 -92 -144 -184 -187 -167 -138 -97 -52 -25 -11
12859 -11 30 114 223 366 584 861 1070 1086 914 676 475 329 220 142 96 64 26 -22 -72 -102 -98 -66 -36 -29 -36 -41 -46 -58 -72 -75 -72 -77 -88 -96
12844 -96 -111 -147 -190 -211 -196 -155 -102 -42 5 23 24 37 64 80 88 137 256 415 614 948 1481 2054 2331 2114 1561 1014 662 458 304
12832 304 191 139 113 73 39 39 56 61 68 99 124 107 69 50 42 11 -35 -59 -54 -39 -12 35 77 88 93 130 183 216 250 333 473 662 926 1249 1469
12817 1469 1406 1083 731 525 439 377 331 325 332 322 327 384 454 482 471 450 410 344 284 257 242 218 207 227 242 218 185 175 168 136 96 70 41 4
12802 4 3 52 100 112 128 182 236 253 275 341 404 419 429 480 536 564 623 761 902 980 1069 1265 1518 1749 2027 2453 2983 3584 4441 5782
12789 5782 7625 10059 13549 18302 23162 25826 24752 20656 15757 11752 8908 6808 5240 4185 3483 2915 2433 2086
12781 2086 1822 1553 1298 1122 1010 901 805 771 792 819 834 825 755 611 454 357 319 300 291 307 326 311 265 230 226 244 284 354 455 578
12768 578 726 912 1125 1318 1417 1359 1141 845 594 448 374 310 238 172 118 72 40 25 14 -3 -18 -19 -18 -28 -45 -58 -72 -91 -103 -96 -86 -97
12754 -97 -117 -115 -79 -31 1 14 9 -9 -31 -36 -18 6 25 44 80 138 199 230 213 162 105 55 -1 -77 -154 -204 -215 -198 -171 -148 -131 -115 -96 -79 -77 -90 -100
12738 -100 -94 -79 -71 -78 -92 -106 -109 -94 -69 -54 -66 -96 -126 -152 -178 -199 -203 -191 -174 -163 -152 -134 -117 -112 -121 -134 -149 -170 -194 -204 -185 -148 -118 -112 -119 -123 -128 -145 -169 -183
12721 -183 -183 -183 -197 -217 -230 -232 -225 -212 -196 -186 -189 -202 -216 -227 -228 -217 -200 -190 -190 -197 -209 -226 -239 -233 -206 -181 -174 -177 -166 -142 -120 -106 -90 -68 -52 -56 -74 -95 -113 -125
12704 -125 -123 -106 -84 -63 -41 -19 -8 -25 -70 -122 -165 -197 -226 -245 -247 -235 -228 -238 -256 -267 -265 -259 -254 -251 -251 -254 -260 -262 -260 -253 -238 -210 -175 -147 -134 -133 -134 -131 -122 -109 -100 -107 -122 -130
12684 -130 -125 -118 -115 -107 -80 -43 -17 -14 -25 -40 -59 -83 -107 -129 -150 -165 -165 -148 -127 -115 -118 -132 -147 -151 -136 -109 -87 -85 -102 -125 -138 -131 -107 -80 -67 -74 -87 -94 -95 -98 -106 -110
12666 -110 -105 -91 -74 -63 -67 -91 -127 -150 -148 -129 -112 -107 -111 -122 -140 -163 -173 -155 -116 -79 -65 -73 -89 -101 -106 -109 -112 -111 -95 -68 -49 -53 -75 -95 -102 -106 -123 -155 -191 -225 -255
12649 -255 -277 -288 -287 -280 -272 -266 -262 -259 -257 -257 -254 -246 -232 -215 -205 -211 -233 -260 -276 -271 -250 -227 -214 -214 -216 -211 -194 -175 -165 -169 -183 -195 -197 -194 -197 -205 -208 -199 -187 -182 -186 -187 -182 -174 -170 -170 -176 -194 -219
12627 -219 -232 -222 -196 -169 -147 -126 -109 -103 -105 -101 -83 -61 -47 -46 -55 -72 -87 -86 -62 -31 -10 -2 1 0 -7 -14 -5 9 6 -25 -67 -96 -107 -112 -115 -123 -148 -189 -221 -223 -206 -198 -208
12609 -208 -219 -226 -237 -254 -266 -274 -292 -319 -332 -314 -287 -283 -308 -337 -349 -341 -321 -290 -254 -221 -199 -188 -181 -178 -177 -177 -174 -165 -154 -145 -138 -135 -142 -162 -188 -204 -196 -175 -161 -164 -174 -177 -174
12590 -174 -170 -170 -171 -170 -165 -158 -158 -176 -210 -242 -259 -264 -256 -232 -194 -160 -144 -144 -143 -135 -125 -118 -107 -91 -83 -102 -152 -221 -286 -330 -353 -360 -351 -322 -281 -247 -231 -223 -209 -194 -198 -227 -267
12571 -267 -300 -321 -337 -350 -358 -363 -365 -363 -344 -306 -257 -216 -194 -187 -179 -165 -155 -158 -172 -184 -184 -175 -169 -175 -189 -195 -183 -160 -143 -136 -129 -116 -111 -130 -167 -203 -225 -239 -253 -268 -276 -272 -254
12553 -254 -231 -217 -224 -251 -287 -309 -300 -262 -220 -197 -193 -184 -161 -142 -148 -172 -188 -184 -169 -159 -156 -157 -158 -153 -142 -126 -107 -89 -76 -67 -48 -2 63 112 113 75 29 -14 -62 -112
12535 -112 -145 -151 -141 -135 -144 -161 -176 -178 -157 -122 -89 -71 -74 -91 -113 -125 -123 -118 -128 -149 -162 -157 -148 -154 -176 -202 -223 -232 -218 -180 -140 -128 -150 -186 -210 -213 -201 -184 -164 -137
12518 -137 -101 -66 -50 -60 -89 -118 -133 -127 -110 -93 -86 -88 -94 -104 -117 -126 -123 -108 -95 -94 -107 -126 -145 -155 -154 -147 -148 -161 -181 -201 -216 -219 -209 -197 -194 -200 -200 -186 -161 -135 -116
12500 -116 -107 -110 -120 -130 -141 -161 -186 -201 -194 -173 -157 -154 -164 -180 -199 -211 -213 -208 -200 -192 -179 -158 -131 -107 -96 -99 -102 -96 -85 -81 -91 -107 -119 -124 -119 -107 -98 -110 -144 -186 -216 -226
12482 -226 -214 -185 -155 -144 -155 -165 -152 -129 -117 -121 -127 -130 -131 -124 -102 -72 -60 -79 -120 -160 -189 -208 -223 -240 -261 -275 -272 -251 -222 -193 -172 -167 -181 -197 -193 -168 -148 -157 -192
12465 -192 -226 -240 -233 -218 -207 -203 -200 -187 -160 -125 -89 -61 -47 -48 -55 -57 -48 -32 -16 -7 -9 -27 -62 -110 -159 -196 -216 -222 -226 -231 -229 -218 -213 -225 -245 -245 -212 -161 -119 -98 -92 -91 -91
12447 -91 -98 -111 -128 -144 -159 -177 -197 -204 -190 -165 -149 -147 -141 -115 -89 -91 -127 -164 -171 -154 -141 -143 -145 -135 -119 -117 -134 -155 -166 -167 -164 -161 -157 -156 -161 -168 -171 -165 -158 -162 -175 -181 -164 -128 -102
12427 -102 -107 -135 -161 -175 -181 -188 -190 -186 -182 -184 -185 -184 -187 -203 -223 -231 -224 -211 -204 -212 -234 -261 -278 -279 -273 -268 -266 -267 -266 -251 -219 -186 -179 -194 -194 -164 -133 -138 -173 -207 -226 -241 -252 -252 -249 -262 -292
12407 -292 -312 -310 -300 -294 -284 -257 -228 -215 -224 -242 -257 -258 -239 -206 -177 -161 -156 -154 -157 -168 -187 -209 -231 -244 -239 -214 -187 -172 -173 -174 -160 -123 -80 -62 -89 -144 -195 -225 -240
12390 -240 -249 -253 -256 -266 -272 -254 -211 -168 -151 -155 -165 -173 -178 -169 -144 -117 -109 -119 -137 -154 -168 -179 -181 -180 -184 -195 -208 -222 -234 -240 -231 -207 -181 -170 -181 -207 -224 -211 -180 -164 -181
12372 -181 -210 -215 -191 -163 -151 -153 -153 -137 -106 -78 -67 -69 -70 -72 -84 -103 -114 -114 -121 -146 -170 -174 -166 -168 -180 -187 -185 -186 -190 -189 -185 -188 -193 -182 -153 -132 -132 -143 -144 -138 -137 -148 -168 -195 -223 -237
12352 -237 -236 -229 -228 -230 -231 -231 -239 -247 -244 -232 -230 -246 -270 -282 -275 -255 -235 -222 -211 -196 -167 -131 -106 -106 -123 -135 -129 -117 -120 -137 -152 -157 -158 -166 -179 -189 -194 -195 -188 -178 -175 -185 -204 -224 -242
12333 -242 -251 -237 -194 -144 -108 -97 -106 -135 -180 -218 -229 -220 -209 -201 -188 -170 -159 -158 -161 -168 -183 -196 -194 -182 -185 -209 -230 -222 -193 -166 -152 -145 -137 -128 -121 -121 -133 -156 -185 -213 -231 -235
12314 -235 -228 -225 -240 -267 -286 -285 -274 -260 -242 -223 -222 -245 -274 -287 -284 -283 -288 -292 -290 -282 -267 -247 -228 -219 -214 -201 -179 -154 -129 -103 -81 -76 -93 -118 -138 -151 -162 -175 -187 -194 -191 -180
12296 -180 -166 -156 -154 -155 -151 -140 -131 -133 -141 -145 -136 -123 -120 -135 -163 -192 -214 -223 -216 -202 -196 -206 -222 -227 -214 -197 -190 -192 -191 -176 -151 -125 -101 -78 -56 -46 -52 -70 -87 -96 -101 -109 -120 -130
12277 -130 -137 -140 -145 -157 -170 -170 -158 -150 -160 -181 -201 -217 -233 -240 -228 -202 -188 -197 -222 -253 -285 -304 -294 -258 -220 -201 -201 -210 -222 -232 -237 -244 -264 -290 -298 -276 -243 -223 -217 -214 -208 -203
12259 -203 -198 -194 -192 -189 -173 -143 -117 -109 -109 -109 -123 -170 -237 -293 -321 -324 -311 -296 -293 -303 -304 -274 -228 -201 -204 -220 -234 -246 -260 -266 -256 -232 -198 -159 -128 -119 -129 -139 -143 -146 -148 -141 -129
12240 -129 -127 -144 -163 -173 -185 -211 -240 -250 -239 -226 -225 -233 -237 -234 -231 -233 -233 -224 -208 -197 -199 -205 -205 -199 -197 -208 -228 -249 -259 -240 -193 -145 -131 -152 -180 -194 -200 -203 -189 -152 -116 -111 -132
12222 -132 -148 -140 -118 -98 -84 -74 -76 -106 -156 -198 -204 -176 -141 -121 -119 -123 -127 -133 -146 -167 -197 -231 -257 -271 -279 -288 -295 -292 -285 -285 -297 -311 -322 -331 -337 -333 -324 -319 -318 -309 -284 -260 -253 -259 -263 -258
12202 -258 -247 -234 -225 -229 -250 -281 -306 -317 -318 -310 -300 -296 -298 -295 -278 -251 -229 -212 -189 -154 -114 -89 -85 -94 -97 -85 -70 -76 -111 -162 -201 -210 -192 -169 -168 -202 -252 -282 -277 -263 -265 -279
12183 -279 -283 -279 -292 -329 -360 -356 -322 -290 -279 -277 -261 -229 -194 -171 -165 -174 -197 -231 -257 -258 -231 -192 -160 -146 -147 -160 -177 -190 -197 -201 -209 -214 -205 -179 -149 -135 -152 -188 -220 -232 -232
12166 -232 -244 -275 -314 -347 -367 -369 -351 -316 -283 -259 -236 -206 -180 -170 -175 -182 -193 -214 -239 -253 -253 -250 -250 -245 -229 -208 -193 -187 -189 -197 -200 -186 -155 -122 -105 -104 -113 -132 -160 -188 -203
12148 -203 -210 -229 -264 -288 -277 -238 -203 -193 -201 -205 -201 -198 -208 -232 -261 -279 -273 -245 -214 -197 -198 -206 -216 -231 -245 -253 -258 -271 -288 -294 -282 -270 -272 -280 -281 -276 -277 -282 -283 -277 -274 -276 -272 -256 -238
12128 -238 -228 -226 -223 -208 -183 -156 -136 -130 -137 -152 -173 -199 -221 -225 -201 -159 -119 -89 -66 -46 -39 -53 -76 -84 -78 -80 -107 -144 -169 -186 -217 -261 -285 -268 -225 -180 -136 -90 -56
12111 -56 -53 -74 -96 -107 -106 -97 -83 -77 -90 -114 -135 -153 -181 -215 -234 -230 -212 -191 -168 -148 -145 -165 -193 -212 -222 -229 -231 -227 -223 -232 -252 -265 -255 -230 -206 -198 -202 -205 -194 -177 -171 -188
12093 -188 -214 -228 -224 -206 -180 -151 -124 -114 -129 -161 -191 -204 -200 -196 -202 -217 -228 -227 -218 -211 -208 -202 -186 -164 -146 -141 -144 -145 -143 -150 -172 -197 -208 -198 -180 -162 -149 -143 -145 -152 -156 -158 -157 -147
12074 -147 -124 -99 -92 -107 -131 -152 -169 -182 -184 -175 -166 -160 -146 -116 -89 -84 -94 -98 -91 -89 -102 -119 -124 -116 -101 -86 -78 -87 -116 -151 -176 -193 -209 -222 -221 -207 -200 -214 -236 -243 -228 -202
12056 -202 -176 -155 -145 -154 -171 -175 -162 -158 -184 -229 -258 -257 -243 -238 -245 -252 -249 -233 -207 -180 -157 -145 -146 -152 -153 -139 -123 -125 -155 -193 -217 -227 -241 -266 -289 -295 -291 -289 -296 -306 -310 -303 -288
12037 -288 -276 -269 -261 -244 -227 -223 -232 -241 -245 -251 -260 -263 -258 -252 -250 -249 -251 -260 -265 -243 -197 -162 -169 -208 -245 -267 -277 -276 -263 -247 -245 -258 -275 -289 -305 -319 -320 -306 -287 -274 -266 -263 -264 -261 -235 -182
12017 -182 -125 -100 -120 -166 -208 -230 -230 -215 -194 -185 -194 -209 -206 -186 -176 -195 -226 -246 -259 -287 -329 -357 -352 -323 -284 -241 -206 -198 -221 -251 -263 -257 -251 -253 -256 -250 -231 -203 -178 -167
12000 -167 -165 -162 -160 -167 -179 -181 -173 -175 -194 -210 -208 -206 -221 -241 -243 -232 -225 -223 -216 -203 -196 -195 -193 -194 -204 -213 -212 -206 -203 -194 -165 -129 -113 -120 -130 -131 -133 -142 -146 -138 -124 -110 -97 -91 -102 -121 -131 -127 -125 -134
11978 -134 -143 -144 -146 -159 -182 -205 -220 -221 -207 -195 -201 -222 -236 -232 -221 -213 -200 -173 -145 -139 -159 -197 -239 -276 -295 -293 -279 -269 -268 -267 -251 -214 -164 -121 -101 -98 -96 -89 -89 -105 -128 -146
11960 -146 -156 -162 -167 -174 -185 -195 -193 -179 -165 -154 -141 -130 -138 -164 -183 -171 -136 -111 -115 -138 -157 -160 -150 -139 -137 -138 -133 -124 -119 -120 -118 -108 -100 -99 -104 -108 -110 -116 -125 -139 -161 -186 -205 -213 -209 -197
11940 -197 -184 -180 -193 -214 -226 -221 -201 -173 -138 -104 -88 -96 -118 -141 -159 -175 -190 -205 -215 -205 -173 -135 -117 -122 -133 -138 -143 -147 -141 -125 -117 -122 -129 -127 -122 -120 -113 -102 -108 -143 -188 -209
11922 -209 -191 -148 -106 -90 -116 -169 -215 -232 -230 -228 -228 -226 -224 -219 -205 -178 -152 -137 -123 -104 -88 -83 -81 -74 -74 -93 -123 -150 -169 -186 -194 -193 -190 -189 -176 -149 -129 -130 -134 -116 -86 -69
11904 -69 -74 -86 -97 -106 -105 -91 -80 -88 -105 -102 -82 -69 -71 -72 -67 -71 -89 -100 -89 -66 -46 -33 -28 -34 -52 -73 -94 -119 -147 -168 -183 -196 -200 -189 -175 -176 -188 -187 -165 -142 -137 -139 -134
11885 -134 -124 -112 -101 -95 -100 -109 -99 -67 -38 -39 -69 -107 -139 -165 -181 -180 -160 -131 -107 -103 -126 -160 -189 -207 -222 -234 -234 -227 -228 -241 -247 -231 -204 -179 -158 -141 -135 -153 -195 -243
11868 -243 -277 -283 -261 -232 -221 -239 -268 -284 -277 -256 -236 -227 -231 -235 -233 -229 -231 -233 -228 -222 -230 -253 -275 -283 -281 -275 -276 -295 -327 -353 -355 -340 -333 -336 -329 -305 -279 -261 -251 -251 -266 -287 -297 -298 -308
11848 -308 -324 -317 -273 -211 -157 -117 -95 -93 -104 -110 -105 -109 -128 -146 -154 -162 -179 -191 -191 -189 -191 -183 -158 -137 -135 -136 -127 -125 -148 -175 -173 -147 -131 -143 -167 -188 -205 -213 -210 -204 -202 -198 -179 -152 -135
11829 -135 -130 -130 -134 -148 -162 -161 -148 -136 -128 -121 -122 -135 -147 -138 -107 -80 -75 -93 -127 -165 -190 -191 -182 -183 -193 -194 -176 -148 -118 -85 -54 -35 -29 -37 -66 -113 -156 -170 -159 -153 -159 -163 -154 -148
11810 -148 -160 -189 -224 -256 -277 -282 -279 -284 -304 -327 -341 -345 -343 -336 -328 -317 -301 -278 -261 -260 -267 -267 -259 -257 -258 -242 -204 -168 -155 -160 -160 -145 -126 -114 -112 -111 -102 -90 -88 -105 -125 -131 -125 -125 -140
11790 -140 -161 -175 -179 -173 -161 -158 -172 -195 -209 -212 -211 -212 -214 -222 -236 -241 -222 -192 -181 -193 -203 -195 -183 -183 -186 -178 -168 -170 -183 -196 -202 -204 -195 -171 -137 -112 -110 -130 -154 -168 -167 -160 -157 -161 -175
11771 -175 -196 -217 -224 -216 -212 -225 -245 -256 -254 -252 -252 -246 -235 -231 -238 -247 -254 -254 -242 -221 -200 -189 -178 -162 -151 -157 -170 -169 -161 -164 -172 -163 -140 -135 -159 -188 -197 -195 -201 -216 -235 -252 -260 -252 -235 -229 -235
11750 -235 -239 -231 -220 -210 -191 -162 -147 -152 -164 -167 -172 -189 -213 -234 -254 -278 -296 -299 -287 -264 -230 -192 -164 -153 -152 -160 -179 -201 -207 -198 -196 -211 -228 -235 -243 -255 -254 -231 -206 -197 -192 -175
11732 -175 -150 -129 -107 -79 -61 -71 -101 -128 -142 -142 -127 -104 -98 -120 -156 -186 -210 -223 -207 -166 -143 -176 -237 -273 -266 -242 -219 -195 -177 -180 -196 -200 -185 -167 -158 -150 -141 -141 -148
11715 -148 -149 -140 -134 -139 -154 -181 -218 -253 -267 -263 -260 -269 -282 -294 -307 -325 -340 -348 -350 -340 -319 -294 -278 -270 -262 -250 -231 -203 -166 -141 -143 -166 -184 -182 -168 -149 -135 -138 -157 -173 -172 -166
11697 -166 -171 -177 -164 -137 -122 -130 -145 -153 -154 -150 -142 -143 -163 -194 -211 -203 -189 -185 -194 -209 -222 -225 -212 -186 -161 -142 -134 -137 -150 -163 -164 -158 -149 -130 -106 -95 -105 -112 -95 -65 -50 -49 -47 -50 -80
11678 -80 -132 -180 -212 -246 -284 -313 -324 -322 -303 -257 -206 -185 -196 -202 -184 -167 -181 -214 -237 -242 -241 -243 -248 -252 -251 -242 -231 -224 -213 -179 -133 -104 -108 -127 -128 -102 -56 -11 7 -7 -34
11660 -34 -44 -36 -33 -39 -40 -37 -53 -93 -129 -144 -154 -172 -189 -199 -210 -223 -218 -184 -135 -89 -39 13 43 34 4 -19 -40 -73 -119 -161 -189 -199 -186 -155 -132 -132 -142 -140 -130
11643 -130 -131 -150 -179 -206 -224 -226 -214 -198 -180 -154 -128 -120 -133 -147 -143 -128 -116 -117 -130 -151 -163 -156 -144 -153 -180 -191 -173 -157 -168 -192 -198 -179 -151 -124 -109 -114 -138 -163 -172
11626 -172 -170 -171 -174 -173 -170 -163 -151 -143 -153 -170 -163 -122 -75 -52 -56 -72 -93 -111 -116 -116 -135 -173 -196 -185 -162 -152 -146 -127 -103 -90 -84 -80 -82 -88 -80 -53 -38 -59 -100 -134 -165 -204 -234
11607 -234 -232 -208 -194 -199 -207 -210 -213 -216 -219 -229 -243 -243 -218 -189 -178 -180 -181 -188 -205 -214 -202 -188 -192 -195 -172 -132 -112 -115 -119 -115 -116 -125 -135 -147 -165 -177 -168 -146 -125 -109 -98 -99 -107 -102 -76 -56
11587 -56 -70 -107 -143 -176 -212 -227 -198 -143 -98 -72 -54 -51 -71 -99 -110 -111 -118 -122 -108 -91 -93 -101 -94 -87 -104 -130 -137 -132 -145 -173 -187 -185 -186 -183 -153 -112 -93 -97 -95 -81 -74 -78 -79 -80
11568 -80 -91 -98 -83 -59 -49 -35 10 66 81 52 17 -16 -64 -107 -103 -64 -42 -53 -63 -54 -48 -49 -37 -10 0 -18 -41 -58 -81 -99 -90 -65 -59 -68 -60 -35 -26 -27 -5 30
11551 30 37 11 -4 -1 -14 -41 -35 11 57 91 151 244 333 430 609 869 1086 1137 1019 819 613 446 340 280 225 168 140 145 144 126 124 149 165 165
11536 165 183 222 236 211 196 211 228 246 312 426 543 665 857 1096 1228 1146 918 681 493 348 259 229 211 176 163 197 230 216 182
11524 182 163 141 100 81 115 165 196 230 283 312 294 278 301 328 335 367 445 512 544 609 730 810 772 684 639 624 602 623 733 860 913 906 893 847
11509 847 746 662 664 697 680 644 640 627 564 523 575 652 671 688 784 896 932 957 1078 1242 1332 1370 1452 1555 1608 1664 1825 2055 2265 2520 2952
11495 2952 3525 4119 4814 5904 7557 9506 11060 11461 10515 8940 7795 7451 7438 7393 7599 8304 9156 9885 10957 12875 15410
11486 15410 18354 22418 28300 35598 44208 56097 72851 90682 100640 96251 80129 61303 46775 37376 30775
11480 30775 25512 21333 17850 14643 11933 10073 8778 7555 6446 5719 5233 4670 4097 3762 3586 3327 3021 2857 2775 2587
11471 2587 2336 2204 2173 2095 1987 1984 2082 2188 2342 2684 3260 3998 4759 5265 5170 4426 3444 2682 2205 1821 1485 1287 1193 1065 907
11460 907 835 846 831 776 757 776 765 747 799 915 1026 1135 1266 1341 1268 1111 1012 999 1019 1097 1274 1446 1437 1245 1039 912 826 766 790 880
11447 880 916 839 724 643 587 536 502 474 414 337 297 297 284 248 231 239 229 201 192 200 181 141 126 131 111 76 74 98 92 58 60 109 139 119 91 76 48 12
11431 12 9 35 30 -21 -68 -84 -101 -133 -145 -127 -115 -123 -116 -82 -54 -46 -33 -12 -10 -21 -5 29 28 -17 -50 -46 -49 -81 -101 -82 -65 -79 -101 -104 -109 -133 -151 -149 -150 -163 -157 -128
11413 -128 -118 -150 -185 -185 -166 -159 -160 -159 -174 -204 -218 -201 -178 -167 -155 -139 -148 -180 -191 -154 -112 -106 -122 -127 -122 -112 -89 -56 -43 -56 -56 -21 10 8 -8 -7 0 -12 -40 -64
11395 -64 -90 -116 -127 -123 -134 -168 -188 -177 -171 -199 -231 -235 -224 -224 -220 -191 -153 -129 -105 -63 -32 -45 -82 -100 -98 -100 -107 -106 -108 -126 -142 -139 -132 -143 -160 -160 -152 -160 -171 -161 -137 -129 -135
11377 -135 -134 -131 -145 -174 -194 -195 -182 -149 -100 -59 -49 -52 -42 -33 -49 -82 -100 -100 -101 -112 -126 -147 -173 -184 -163 -133 -122 -122 -111 -97 -107 -131 -133 -108 -84 -78 -80 -88 -103 -110 -95
11359 -95 -74 -76 -98 -114 -123 -149 -191 -222 -229 -226 -227 -222 -211 -202 -196 -182 -166 -166 -181 -197 -210 -231 -251 -246 -213 -178 -153 -126 -94 -71 -61 -51 -34 -27 -39 -52 -49 -34 -22 -23 -36
11341 -36 -52 -58 -44 -27 -28 -54 -94 -138 -180 -218 -242 -254 -255 -242 -220 -206 -210 -214 -199 -171 -147 -127 -102 -86 -104 -150 -187 -193 -176 -158 -150 -162 -189 -213 -215 -207 -205 -206 -191 -167
11324 -167 -155 -159 -167 -173 -185 -196 -195 -189 -194 -203 -190 -151 -108 -75 -52 -48 -75 -119 -142 -132 -112 -101 -105 -127 -168 -208 -223 -223 -234 -253 -251 -223 -199 -197 -204 -212 -238 -279 -303 -286 -246
11306 -246 -215 -198 -190 -191 -198 -191 -163 -127 -94 -62 -38 -42 -71 -94 -90 -81 -98 -135 -166 -180 -178 -161 -134 -111 -100 -88 -68 -56 -65 -88 -107 -112 -105 -88 -69 -65 -76 -89 -95 -104 -117
11288 -117 -123 -120 -121 -130 -134 -134 -150 -181 -195 -178 -159 -167 -185 -180 -152 -124 -106 -97 -103 -133 -173 -199 -204 -192 -167 -135 -113 -113 -121 -119 -108 -101 -99 -96 -93 -91 -83 -72 -73 -96 -128 -151 -160 -155 -133 -106
11268 -106 -100 -121 -143 -146 -141 -141 -136 -114 -89 -80 -79 -70 -67 -93 -134 -159 -156 -145 -134 -119 -99 -88 -89 -99 -121 -156 -183 -185 -176 -181 -198 -210 -217 -234 -259 -274 -270 -260 -253 -245 -239 -241 -242 -231 -214
11249 -214 -209 -214 -212 -201 -203 -224 -246 -257 -264 -276 -285 -285 -280 -272 -259 -240 -221 -207 -200 -207 -224 -237 -230 -212 -204 -212 -222 -227 -231 -234 -227 -218 -218 -225 -223 -215 -218 -233 -238 -225 -207 -201 -202 -205 -213 -223 -222 -207 -190
11228 -190 -181 -174 -154 -123 -97 -93 -112 -139 -158 -163 -166 -176 -180 -172 -174 -208 -260 -291 -288 -268 -241 -207 -176 -170 -187 -205 -219 -240 -266 -266 -232 -196 -189 -199 -201 -191 -181 -181 -190 -218 -263 -312
11209 -312 -349 -373 -383 -371 -335 -290 -253 -222 -197 -187 -202 -231 -253 -256 -237 -201 -168 -163 -191 -230 -261 -287 -314 -332 -334 -335 -347 -359 -350 -323 -293 -263 -229 -196 -173 -159 -146
11193 -146 -138 -145 -167 -192 -207 -205 -183 -146 -112 -92 -80 -64 -51 -56 -78 -98 -103 -89 -57 -19 -2 -21 -66 -111 -139 -149 -148 -138 -128 -122 -117 -113 -117 -134 -150 -154 -153 -155 -150 -128 -102
11176 -102 -101 -128 -162 -189 -218 -253 -278 -281 -269 -250 -223 -184 -140 -115 -116 -129 -134 -124 -109 -105 -114 -124 -134 -151 -178 -203 -215 -224 -241 -262 -270 -260 -240 -221 -204 -191 -185 -184 -177 -157
11158 -157 -133 -115 -105 -103 -101 -93 -82 -76 -85 -99 -108 -107 -102 -100 -104 -120 -147 -178 -203 -222 -240 -257 -262 -255 -241 -226 -215 -216 -229 -246 -249 -239 -232 -237 -244 -236 -214 -190 -176 -170 -165 -159 -158 -163 -164 -150
11138 -150 -125 -101 -82 -63 -43 -29 -26 -27 -26 -25 -30 -33 -28 -21 -24 -36 -46 -51 -63 -87 -111 -118 -104 -76 -49 -33 -20 -9 -14 -52 -114 -166 -186 -189 -192 -187 -162 -129 -109 -106 -100 -88 -86
11120 -86 -103 -131 -157 -174 -177 -164 -148 -152 -176 -198 -199 -185 -175 -178 -189 -199 -205 -215 -234 -256 -265 -258 -246 -241 -243 -247 -254 -263 -264 -246 -217 -191 -167 -138 -113 -106 -122 -146 -172 -198 -224 -242
11101 -242 -251 -250 -233 -194 -152 -130 -127 -121 -100 -80 -71 -66 -53 -46 -64 -105 -147 -172 -183 -195 -213 -223 -211 -177 -141 -125 -132 -156 -191 -223 -233 -216 -193 -187 -190 -180 -155 -143 -159
11084 -159 -191 -215 -228 -236 -241 -235 -210 -170 -133 -131 -173 -228 -257 -250 -225 -198 -176 -170 -179 -184 -167 -143 -144 -165 -164 -121 -64 -23 2 23 40 58 92 144 215 343 571 859
11068 859 1052 1016 777 488 262 104 -25 -126 -177 -186 -187 -202 -229 -258 -274 -271 -260 -255 -257 -256 -241 -219 -199 -189 -192 -202 -205 -183 -140 -100 -88 -105 -130 -146 -147
11053 -147 -143 -143 -146 -141 -120 -90 -63 -49 -51 -69 -98 -125 -142 -155 -165 -161 -135 -102 -83 -82 -87 -91 -102 -128 -157 -177 -184 -182 -176 -171 -170 -172 -180 -191 -201 -201 -197 -203 -220 -231 -214 -173 -134 -113
11034 -113 -113 -124 -137 -140 -131 -119 -112 -113 -118 -122 -119 -105 -89 -90 -112 -136 -145 -151 -166 -176 -166 -150 -154 -173 -174 -151 -128 -121 -121 -122 -134 -162 -193 -212 -221 -228 -227 -211 -188 -173 -168 -168 -170 -174 -180 -190
11014 -190 -208 -233 -255 -264 -262 -256 -254 -262 -278 -287 -280 -260 -240 -222 -193 -151 -113 -96 -97 -101 -105 -111 -122 -138 -157 -179 -200 -214 -218 -212 -202 -200 -213 -234 -253 -269 -282 -285 -273 -255 -242 -232
10996 -232 -222 -222 -242 -269 -278 -266 -253 -246 -233 -208 -190 -189 -197 -208 -229 -255 -263 -242 -218 -220 -240 -258 -270 -282 -291 -285 -271 -264 -259 -243 -218 -205 -211 -224 -234 -237 -236 -232 -238 -260 -287 -298
10977 -298 -288 -270 -258 -258 -270 -292 -305 -289 -247 -207 -190 -198 -221 -255 -292 -319 -324 -306 -274 -236 -206 -189 -177 -162 -143 -130 -127 -129 -134 -146 -166 -184 -191 -192 -193 -192 -185 -167 -142 -110
10960 -110 -73 -39 -16 -13 -29 -57 -80 -86 -79 -70 -65 -59 -57 -68 -94 -122 -135 -127 -109 -95 -97 -113 -135 -147 -147 -141 -136 -129 -116 -104 -111 -139 -170 -181 -171 -157 -154 -162 -164 -156 -151 -164 -193 -216
10941 -216 -220 -205 -190 -187 -193 -195 -183 -161 -142 -134 -139 -150 -157 -156 -151 -149 -152 -155 -152 -149 -156 -168 -170 -152 -124 -99 -84 -77 -78 -81 -87 -102 -134 -175 -200 -199 -189 -201 -234 -266 -283 -294 -311 -321 -304
10921 -304 -262 -220 -199 -199 -199 -188 -173 -167 -169 -171 -174 -186 -204 -219 -228 -243 -268 -289 -295 -297 -306 -310 -288 -242 -193 -151 -109 -71 -55 -72 -105 -138 -169 -207 -245 -260 -237 -185 -131 -100
10904 -100 -103 -127 -150 -155 -142 -124 -113 -114 -126 -144 -164 -179 -186 -183 -174 -177 -201 -241 -282 -316 -337 -338 -314 -269 -221 -183 -166 -175 -203 -231 -240 -227 -207 -189 -173 -163 -161 -163 -162 -158 -155 -148
10886 -148 -131 -111 -108 -128 -156 -180 -204 -227 -232 -207 -168 -140 -132 -136 -144 -153 -153 -142 -133 -143 -171 -197 -208 -201 -182 -155 -128 -118 -135 -175 -213 -228 -212 -168 -113 -64 -29 5 58
10869 58 124 169 154 82 0 -47 -58 -59 -71 -90 -107 -120 -128 -130 -135 -152 -178 -197 -198 -189 -181 -175 -172 -179 -192 -197 -188 -179 -181 -180 -158 -119 -93 -95 -113 -125 -125 -121 -124 -136 -147 -142 -116 -83 -58
10850 -58 -41 -18 6 17 5 -9 -7 9 13 -16 -70 -124 -159 -177 -187 -192 -191 -183 -176 -174 -174 -173 -175 -179 -186 -189 -184 -166 -135 -98 -64 -43 -36 -47 -75 -113 -146 -164 -169 -163 -146 -123 -107
10831 -107 -104 -114 -131 -154 -179 -197 -206 -215 -241 -279 -312 -324 -306 -267 -222 -189 -176 -173 -166 -152 -137 -129 -128 -133 -137 -139 -148 -176 -216 -247 -254 -246 -231 -207 -166 -124 -106 -113 -126 -132 -141 -166
10813 -166 -196 -210 -198 -170 -141 -118 -103 -97 -105 -131 -165 -186 -183 -164 -144 -136 -143 -167 -202 -234 -251 -245 -222 -187 -154 -133 -125 -119 -107 -96 -94 -103 -119 -141 -160 -158 -129 -96 -89 -115
10795 -115 -152 -179 -186 -174 -150 -128 -117 -116 -118 -123 -135 -155 -175 -194 -204 -193 -163 -140 -146 -175 -200 -206 -198 -182 -156 -132 -126 -140 -156 -173 -200 -235 -253 -237 -204 -183 -183 -193 -200
10778 -200 -194 -174 -151 -142 -148 -155 -153 -151 -158 -166 -165 -161 -162 -167 -173 -181 -188 -184 -174 -177 -200 -224 -225 -208 -193 -186 -178 -166 -158 -161 -168 -175 -176 -166 -147 -134 -137 -153 -175 -199 -221 -230 -220 -202 -188 -179 -165 -148
10758 -148 -131 -107 -73 -52 -67 -116 -165 -188 -189 -183 -183 -194 -217 -241 -251 -244 -229 -216 -206 -198 -191 -183 -172 -167 -184 -215 -231 -220 -194 -179 -185 -203 -221 -231 -231 -225 -221 -221 -227 -243 -271
10740 -271 -297 -304 -289 -265 -241 -208 -171 -145 -142 -147 -138 -118 -107 -119 -151 -188 -214 -215 -185 -135 -87 -60 -65 -93 -121 -128 -111 -95 -99 -124 -154 -175 -184 -181 -171 -165 -172 -182 -183 -173 -164
10722 -164 -174 -203 -240 -268 -279 -280 -289 -310 -331 -334 -316 -280 -231 -175 -128 -100 -92 -101 -126 -157 -172 -162 -143 -139 -155 -171 -182 -198 -224 -247 -256 -256 -249 -232 -207 -190 -190 -193 -184 -166
10705 -166 -153 -148 -145 -142 -138 -127 -107 -90 -84 -85 -85 -93 -115 -132 -123 -95 -76 -71 -63 -44 -21 17 94 211 356 551 828 1135 1310 1225 925 587 346 208 120
10690 120 59 25 6 -15 -35 -41 -46 -67 -105 -149 -193 -234 -261 -266 -264 -275 -289 -279 -245 -217 -218 -241 -262 -277 -299 -332 -362 -368 -350 -327 -318 -324 -329 -320 -296 -258 -210 -165 -132
10673 -132 -116 -111 -116 -128 -141 -146 -142 -139 -135 -119 -97 -89 -106 -133 -160 -189 -220 -237 -234 -230 -245 -267 -270 -251 -227 -203 -172 -143 -137 -158 -185 -202 -209 -208 -200 -190 -188 -190 -183 -171 -162 -148 -105
10654 -105 -44 -10 -36 -97 -146 -165 -168 -163 -154 -151 -167 -198 -226 -239 -240 -232 -216 -195 -176 -162 -153 -154 -166 -180 -186 -187 -190 -203 -225 -254 -275 -269 -231 -182 -145 -118 -81 -32 1 1 -25
10636 -25 -56 -84 -112 -136 -150 -154 -160 -179 -200 -210 -202 -188 -174 -158 -130 -95 -67 -56 -57 -61 -65 -68 -71 -73 -71 -66 -63 -69 -78 -73 -43 -5 8 -11 -49 -93 -142 -198 -245 -268 -267 -251 -218
10618 -218 -171 -128 -114 -137 -176 -213 -239 -252 -256 -252 -243 -227 -207 -192 -192 -204 -219 -232 -236 -226 -209 -204 -221 -247 -256 -241 -219 -206 -205 -213 -226 -231 -219 -198 -185 -188 -196 -205 -227 -271 -321
10600 -321 -348 -341 -307 -263 -228 -209 -197 -176 -142 -120 -132 -172 -219 -258 -294 -327 -347 -337 -304 -268 -248 -240 -229 -209 -188 -173 -166 -159 -152 -141 -127 -113 -116 -140 -175 -207 -228
10584 -228 -236 -231 -211 -179 -143 -107 -82 -82 -104 -122 -116 -101 -112 -151 -191 -215 -231 -246 -248 -235 -227 -239 -249 -235 -200 -172 -156 -143 -136 -149 -179 -202 -206 -201 -203 -214 -231 -251 -266
10567 -266 -270 -265 -270 -292 -317 -319 -294 -257 -227 -215 -221 -240 -263 -279 -278 -253 -210 -172 -164 -194 -239 -269 -273 -264 -257 -255 -257 -263 -270 -267 -250 -232 -230 -239 -236 -213 -186 -173 -171 -173 -185 -216 -256 -279
10548 -279 -277 -264 -263 -265 -246 -194 -134 -109 -140 -200 -243 -245 -227 -217 -218 -219 -221 -237 -263 -279 -278 -273 -273 -268 -255 -250 -275 -321 -360 -374 -369 -358 -349 -340 -324 -292 -238 -174 -120 -96 -103 -130
10530 -130 -165 -199 -228 -247 -247 -225 -192 -165 -147 -127 -102 -84 -88 -108 -132 -154 -177 -194 -191 -163 -124 -100 -104 -134 -168 -189 -194 -198 -209 -221 -221 -208 -190 -179 -184 -207 -239 -261
10513 -261 -261 -244 -225 -213 -208 -211 -223 -242 -259 -271 -274 -265 -246 -229 -225 -230 -229 -218 -200 -177 -146 -111 -88 -86 -99 -116 -130 -143 -152 -154 -157 -169 -193 -223 -254 -278 -284 -264 -222 -175 -140
10495 -140 -125 -128 -144 -164 -177 -179 -180 -189 -199 -190 -162 -140 -151 -185 -202 -178 -133 -108 -118 -146 -162 -157 -142 -129 -129 -140 -157 -171 -182 -189 -194 -193 -179 -149 -118 -112 -141 -181 -197 -182
10478 -182 -164 -166 -181 -194 -205 -222 -243 -248 -232 -205 -184 -180 -198 -234 -273 -296 -299 -293 -283 -272 -262 -256 -253 -249 -248 -256 -265 -258 -229 -194 -172 -170 -176 -177 -172 -170 -184 -210 -229 -233 -235 -249 -265 -266
10459 -266 -252 -242 -245 -252 -255 -259 -268 -274 -269 -256 -242 -229 -218 -215 -218 -211 -187 -159 -141 -132 -123 -116 -123 -146 -176 -200 -210 -202 -179 -153 -138 -137 -139 -138 -135 -139 -153 -181 -216 -244 -247 -220 -179 -148 -138
10439 -138 -144 -154 -159 -166 -182 -208 -233 -251 -262 -267 -264 -249 -230 -217 -212 -210 -202 -184 -162 -151 -162 -192 -226 -256 -282 -306 -323 -330 -330 -325 -314 -295 -275 -266 -269 -287 -318 -358 -390 -394 -360
10422 -360 -296 -224 -164 -128 -114 -112 -114 -113 -107 -97 -91 -101 -119 -132 -133 -141 -171 -213 -243 -247 -229 -198 -160 -122 -97 -90 -95 -95 -80 -54 -31 -29 -48 -77 -105 -135 -167 -192 -197 -186 -171
10404 -171 -157 -146 -143 -145 -141 -119 -91 -85 -111 -149 -175 -187 -191 -189 -178 -167 -168 -187 -218 -251 -283 -305 -314 -311 -305 -299 -290 -271 -241 -213 -201 -217 -257 -306 -343 -359 -359 -356 -358 -353 -324 -275
10386 -275 -235 -230 -250 -260 -241 -207 -180 -164 -147 -129 -128 -152 -184 -196 -181 -150 -124 -107 -99 -103 -124 -158 -194 -218 -227 -218 -196 -173 -160 -157 -155 -157 -174 -205 -224 -211 -180 -164 -173
10369 -173 -189 -195 -189 -180 -176 -190 -222 -259 -277 -274 -259 -244 -229 -216 -214 -230 -259 -293 -323 -334 -322 -296 -272 -254 -236 -225 -238 -271 -296 -295 -279 -268 -259 -239 -209 -182 -164 -151
10352 -151 -141 -136 -132 -130 -136 -150 -158 -150 -141 -154 -187 -211 -207 -184 -162 -153 -161 -180 -201 -212 -214 -210 -204 -193 -182 -177 -180 -185 -189 -195 -206 -216 -229 -249 -276 -297 -301 -291 -276 -263 -253 -252 -265 -287
10333 -287 -302 -300 -285 -273 -269 -271 -270 -262 -249 -232 -213 -192 -170 -148 -121 -87 -51 -26 -19 -31 -56 -83 -103 -111 -109 -107 -105 -101 -91 -79 -66 -59 -65 -90 -132 -174 -200 -210 -216 -225 -239 -260
10315 -260 -283 -293 -270 -217 -165 -141 -146 -161 -176 -192 -203 -193 -161 -127 -110 -112 -127 -151 -181 -203 -206 -196 -190 -189 -183 -165 -142 -118 -91 -62 -38 -24 -20 -31 -55 -79 -89 -88
10299 -88 -95 -114 -131 -135 -138 -154 -180 -205 -225 -240 -248 -252 -267 -297 -320 -308 -260 -206 -183 -199 -236 -267 -279 -286 -307 -339 -356 -336 -292 -251 -228 -221 -220 -210 -177 -123 -73 -48 -51
10282 -51 -70 -100 -135 -153 -144 -127 -134 -166 -195 -206 -210 -218 -227 -229 -227 -225 -220 -212 -206 -207 -210 -213 -214 -214 -210 -209 -214 -214 -196 -170 -164 -188 -217 -224 -209 -191 -185 -190 -199 -207 -214 -223 -245 -279 -310 -328 -329 -310 -270
10260 -270 -215 -168 -140 -128 -119 -108 -96 -86 -86 -105 -137 -163 -177 -192 -220 -254 -279 -290 -294 -299 -309 -329 -351 -361 -352 -339 -331 -323 -308 -290 -277 -257 -223 -190 -176 -173 -160 -141
10244 -141 -138 -159 -184 -199 -209 -226 -251 -274 -288 -284 -254 -208 -176 -179 -212 -250 -277 -290 -291 -283 -265 -235 -198 -172 -168 -179 -184 -171 -152 -144 -150 -159 -160 -147 -123 -104 -105 -121 -134 -136 -134
10226 -134 -134 -123 -96 -64 -46 -49 -68 -100 -139 -172 -185 -192 -216 -262 -301 -307 -280 -238 -198 -170 -158 -153 -135 -97 -54 -37 -49 -71 -85 -96 -114 -131 -137 -138 -153 -183 -204 -200
10210 -200 -185 -181 -192 -204 -214 -228 -244 -247 -230 -211 -211 -229 -243 -234 -202 -156 -112 -84 -82 -99 -118 -125 -120 -113 -114 -119 -117 -105 -100 -117 -148 -170 -167 -148 -133 -133 -148 -174 -201 -213 -208 -199
10192 -199 -204 -221 -236 -239 -237 -235 -227 -207 -182 -167 -164 -163 -164 -177 -210 -250 -278 -286 -280 -267 -248 -231 -229 -247 -270 -272 -250 -221 -203 -200 -202 -199 -184 -153 -117 -90 -79 -75 -67 -65 -83 -125 -175
10173 -175 -211 -226 -223 -211 -205 -217 -250 -289 -316 -326 -326 -325 -320 -309 -288 -258 -221 -189 -177 -189 -212 -224 -217 -199 -179 -158 -137 -122 -119 -126 -140 -164 -195 -219 -217 -191 -161 -136 -112
10156 -112 -83 -55 -35 -24 -22 -33 -63 -107 -150 -180 -191 -192 -199 -225 -260 -283 -285 -281 -285 -292 -286 -269 -258 -265 -279 -287 -282 -267 -245 -217 -192 -179 -179 -189 -201 -207 -205 -189 -157 -109 -63
10138 -63 -41 -54 -92 -142 -197 -253 -294 -303 -289 -272 -261 -249 -232 -223 -229 -239 -237 -224 -213 -208 -208 -221 -250 -276 -267 -218 -162 -133 -137 -153 -166 -173 -176 -172 -164 -161 -168 -180 -189 -193 -195 -194 -184 -166
10119 -166 -150 -153 -176 -203 -215 -207 -192 -180 -166 -143 -114 -97 -97 -105 -112 -124 -147 -180 -208 -226 -239 -252 -264 -278 -296 -313 -314 -294 -262 -237 -223 -209 -192 -183 -191 -208 -221 -227 -230
10102 -230 -232 -224 -202 -176 -166 -177 -199 -220 -235 -246 -249 -245 -242 -244 -243 -227 -199 -174 -158 -144 -129 -128 -149 -179 -198 -201 -197 -192 -185 -182 -186 -195 -199 -197 -197 -198 -195 -190 -197 -211 -204 -167 -130 -133 -176 -217
10082 -217 -227 -214 -204 -204 -202 -194 -187 -190 -198 -201 -196 -185 -170 -150 -129 -119 -125 -138 -142 -134 -125 -129 -138 -139 -132 -125 -123 -129 -146 -179 -219 -247 -258 -271 -302 -333 -334 -301 -266 -255 -256 -237 -199 -174 -188
10063 -188 -229 -266 -281 -280 -276 -277 -284 -296 -303 -300 -289 -285 -295 -314 -333 -346 -354 -356 -348 -328 -305 -289 -286 -292 -298 -295 -277 -247 -214 -183 -160 -151 -161 -187 -213 -227 -230 -231 -231 -225 -207 -182 -158 -140
10044 -140 -132 -139 -157 -167 -153 -121 -93 -87 -102 -125 -143 -147 -136 -120 -110 -111 -120 -134 -159 -188 -208 -211 -205 -203 -203 -197 -186 -177 -177 -182 -190 -194 -189 -173 -160 -160 -172 -186 -197 -202 -197 -175 -151 -146 -166
10024 -166 -199 -234 -270 -299 -301 -265 -212 -172 -160 -166 -179 -194 -208 -214 -207 -190 -172 -157 -148 -146 -150 -153 -152 -145 -134 -118 -101 -95 -109 -132 -142 -128 -100 -75 -63 -63 -81 -124 -182 -225
10007 -225 -232 -209 -179 -153 -133 -122 -122 -120 -103 -78 -72 -95 -130 -151 -147 -127 -105 -99 -124 -173 -212 -210 -174 -134 -112 -103 -97 -98 -115 -151 -193 -223 -236 -239 -245 -256 -264 -261 -257 -265 -281 -288 -281
9988 -281 -268 -259 -252 -245 -239 -233 -218 -194 -178 -186 -209 -227 -229 -224 -219 -211 -194 -173 -158 -152 -154 -162 -172 -176 -170 -161 -158 -159 -161 -167 -187 -224 -267 -296 -299 -275 -240 -208 -192 -190 -199 -213 -229 -244 -256 -266
9968 -266 -273 -274 -269 -265 -275 -297 -313 -309 -290 -276 -273 -268 -244 -207 -173 -153 -142 -132 -127 -141 -180 -230 -266 -274 -258 -232 -210 -205 -232 -288 -350 -387 -391 -376 -360 -341 -314 -280 -249 -225
9951 -225 -217 -229 -261 -294 -313 -313 -300 -277 -251 -235 -238 -250 -256 -254 -258 -272 -280 -269 -246 -228 -219 -216 -218 -225 -235 -239 -235 -226 -215 -202 -191 -188 -197 -213 -229 -237 -235 -225 -216 -214 -215 -211 -198 -185 -183 -195
9931 -195 -215 -230 -239 -248 -262 -276 -283 -284 -289 -299 -309 -315 -317 -315 -300 -273 -251 -254 -277 -292 -277 -238 -195 -164 -144 -123 -91 -52 -24 -20 -31 -37 -35 -33 -39 -47 -54 -66 -84 -92 -82 -69 -79
9912 -79 -114 -150 -176 -196 -215 -223 -216 -209 -210 -209 -195 -174 -169 -178 -182 -174 -167 -171 -177 -175 -171 -175 -189 -204 -221 -240 -257 -265 -260 -249 -241 -246 -273 -313 -338 -329 -293 -255 -231 -220 -206 -182 -150 -120 -105
9893 -105 -110 -127 -144 -156 -165 -168 -162 -148 -134 -126 -129 -148 -186 -231 -262 -264 -240 -203 -173 -162 -173 -190 -193 -179 -163 -162 -174 -188 -197 -205 -216 -229 -234 -229 -215 -201 -187 -166 -140 -134 -164 -213
9875 -213 -243 -239 -224 -223 -229 -224 -210 -207 -225 -249 -267 -276 -278 -269 -246 -219 -196 -180 -167 -158 -161 -180 -211 -234 -238 -234 -245 -280 -316 -325 -307 -276 -240 -193 -139 -101 -95 -108 -117 -108 -88 -71 -62
9856 -62 -59 -53 -35 -8 16 23 3 -33 -72 -99 -105 -95 -85 -91 -121 -164 -201 -219 -221 -216 -214 -220 -231 -238 -228 -197 -157 -125 -114 -127 -161 -210 -258 -291 -299 -285 -260 -236 -220 -214 -211 -202
9838 -202 -183 -167 -164 -174 -187 -197 -206 -219 -235 -249 -256 -252 -235 -206 -175 -155 -157 -175 -187 -176 -147 -124 -125 -147 -174 -192 -192 -176 -155 -146 -155 -166 -168 -165 -167 -173 -178 -183 -191 -195 -178 -142 -107
9819 -107 -91 -91 -98 -107 -116 -123 -128 -139 -162 -190 -209 -214 -208 -191 -166 -144 -139 -152 -170 -180 -181 -180 -182 -188 -200 -217 -240 -262 -281 -294 -302 -301 -286 -255 -218 -184 -163 -160 -173 -193 -214 -239 -273
9800 -273 -305 -316 -296 -262 -231 -206 -185 -173 -171 -171 -161 -154 -168 -194 -200 -179 -160 -169 -197 -214 -204 -184 -175 -183 -197 -202 -191 -173 -163 -170 -191 -214 -227 -220 -195 -167 -151 -148 -154 -169 -194
9783 -194 -213 -211 -200 -211 -245 -275 -282 -279 -278 -271 -243 -208 -187 -181 -185 -197 -221 -247 -261 -268 -281 -296 -289 -254 -209 -171 -145 -133 -136 -149 -161 -171 -183 -194 -198 -196 -197 -198 -191 -173 -155 -146 -152
9764 -152 -177 -222 -269 -296 -294 -271 -237 -187 -130 -92 -93 -119 -143 -153 -163 -185 -217 -244 -256 -255 -252 -251 -248 -234 -221 -226 -250 -279 -302 -318 -321 -297 -252 -216 -213 -232 -243 -236 -226 -228
9747 -228 -246 -276 -307 -318 -295 -246 -202 -181 -183 -191 -196 -190 -176 -156 -131 -101 -68 -47 -50 -73 -102 -132 -160 -183 -198 -211 -225 -232 -225 -207 -192 -185 -178 -174 -184 -206 -232 -255 -284 -318
9729 -318 -340 -333 -307 -288 -288 -302 -317 -326 -324 -307 -279 -245 -210 -178 -155 -145 -148 -160 -180 -208 -238 -263 -275 -272 -257 -239 -227 -225 -225 -220 -214 -211 -205 -189 -171 -165 -169 -161 -129 -89 -69 -80
9711 -80 -109 -137 -159 -180 -200 -211 -205 -179 -141 -107 -99 -124 -175 -233 -272 -274 -234 -171 -116 -91 -98 -124 -150 -163 -166 -173 -193 -221 -240 -244 -241 -241 -240 -228 -205 -192 -198 -213 -214 -190 -153
9693 -153 -126 -124 -141 -160 -166 -161 -155 -159 -174 -194 -205 -198 -179 -168 -179 -206 -226 -229 -224 -222 -220 -214 -214 -228 -248 -260 -257 -243 -216 -172 -124 -102 -121 -156 -170 -159 -154 -178 -219 -246 -248 -240 -241
9675 -241 -253 -270 -290 -313 -329 -324 -296 -262 -243 -241 -246 -255 -271 -288 -294 -286 -278 -280 -285 -282 -275 -280 -303 -326 -339 -345 -358 -372 -368 -341 -301 -272 -269 -295 -342 -387 -409 -399 -372 -346 -329 -316
9657 -316 -309 -313 -319 -308 -273 -230 -205 -201 -207 -216 -235 -259 -273 -269 -261 -265 -278 -283 -273 -263 -264 -274 -279 -273 -261 -250 -247 -253 -263 -272 -281 -298 -321 -333 -322 -294 -262 -234 -212 -202 -214 -246 -284
9638 -284 -312 -323 -315 -291 -257 -226 -212 -215 -228 -246 -264 -272 -258 -228 -200 -194 -204 -207 -188 -157 -138 -145 -160 -160 -136 -99 -62 -23 24 80 136 180 199 193 179 170 155 113 41
9621 41 -26 -55 -40 -6 25 48 56 41 10 -19 -46 -78 -123 -166 -191 -199 -201 -208 -219 -225 -218 -201 -188 -189 -195 -192 -176 -160 -152 -144 -125 -105 -98 -107 -120 -126 -126 -131 -150 -191 -250 -305 -335
9602 -335 -336 -323 -311 -304 -295 -279 -262 -255 -261 -270 -271 -266 -264 -273 -285 -289 -285 -275 -260 -238 -211 -180 -144 -114 -102 -115 -138 -151 -154 -162 -186 -214 -229 -223 -210 -204 -209 -214 -210 -199 -190 -187 -182 -178 -184 -206 -230
9582 -230 -239 -241 -250 -261 -258 -233 -202 -184 -180 -181 -183 -188 -197 -208 -214 -209 -190 -168 -155 -151 -146 -137 -142 -173 -222 -264 -282 -275 -253 -235 -232 -239 -240 -220 -187 -159 -153 -170 -204 -234 -240 -219 -191 -182 -194 -208
9562 -208 -206 -196 -199 -222 -248 -258 -255 -252 -254 -256 -256 -261 -274 -283 -278 -266 -262 -263 -259 -246 -234 -220 -190 -140 -90 -63 -65 -89 -128 -176 -215 -236 -244 -252 -257 -250 -228 -205 -189 -183 -183 -186 -191 -198 -205 -208 -204 -192
9541 -192 -182 -183 -192 -197 -191 -170 -141 -116 -105 -111 -122 -132 -142 -156 -165 -168 -179 -211 -254 -275 -259 -224 -206 -220 -251 -275 -283 -289 -305 -324 -332 -321 -300 -278 -255 -233 -218 -211 -202 -189 -181
9523 -181 -186 -192 -190 -186 -194 -208 -209 -192 -175 -179 -206 -245 -281 -300 -300 -294 -297 -301 -290 -262 -238 -231 -234 -232 -226 -225 -224 -211 -182 -145 -113 -93 -89 -100 -119 -132 -132 -122 -108 -97 -87 -82 -90 -114 -147
9504 -147 -175 -192 -213 -249 -292 -323 -335 -333 -319 -291 -259 -240 -236 -230 -216 -210 -230 -269 -304 -322 -328 -329 -332 -341 -349 -338 -294 -228 -173 -151 -161 -187 -221 -256 -285 -302 -307 -304 -294 -277
9487 -277 -262 -260 -277 -303 -328 -346 -358 -366 -363 -347 -326 -314 -318 -332 -343 -350 -362 -389 -426 -450 -441 -406 -367 -338 -313 -283 -258 -248 -244 -223 -185 -152 -140 -144 -149 -159 -180 -200 -202 -182
9469 -182 -155 -141 -146 -165 -188 -207 -222 -238 -264 -292 -308 -306 -288 -263 -234 -207 -190 -191 -203 -214 -211 -192 -175 -174 -192 -214 -225 -221 -211 -205 -209 -220 -238 -255 -262 -256 -244 -242 -258 -286
9452 -286 -307 -312 -303 -290 -282 -284 -298 -318 -325 -313 -291 -270 -243 -208 -181 -178 -195 -209 -212 -214 -218 -212 -198 -195 -210 -221 -208 -185 -178 -190 -202 -203 -206 -219 -234 -239 -227 -202 -172 -154 -161 -192 -235
9433 -235 -278 -310 -319 -300 -267 -237 -217 -198 -180 -175 -189 -212 -223 -211 -180 -148 -131 -136 -153 -172 -184 -183 -161 -118 -72 -47 -49 -65 -83 -99 -108 -111 -115 -131 -150 -161 -166 -185 -215
9416 -215 -232 -224 -205 -204 -228 -263 -295 -316 -320 -312 -302 -298 -291 -273 -254 -251 -263 -272 -271 -266 -267 -270 -265 -251 -239 -232 -230 -228 -229 -236 -243 -236 -212 -190 -189 -207 -221 -220 -208 -193 -175 -154 -144 -155 -175 -182
9396 -182 -169 -153 -151 -159 -163 -154 -141 -136 -144 -160 -171 -177 -184 -204 -233 -260 -273 -270 -256 -239 -226 -211 -191 -164 -141 -131 -132 -134 -124 -95 -49 5 66 131 196 240 239 190 117 48 2
9379 2 -20 -22 -13 -11 -24 -47 -68 -86 -110 -139 -167 -196 -229 -260 -274 -266 -247 -230 -224 -229 -244 -260 -265 -255 -235 -217 -200 -182 -162 -148 -145 -149 -153 -153 -151 -152 -155 -152 -140 -127 -117 -108 -97 -97
9360 -97 -119 -159 -191 -199 -189 -180 -178 -172 -153 -124 -97 -85 -94 -118 -145 -165 -173 -176 -177 -176 -169 -154 -140 -142 -166 -205 -246 -277 -295 -300 -295 -281 -259 -225 -183 -150 -138 -140 -138 -126 -123 -146 -188
9341 -188 -222 -229 -217 -209 -213 -221 -216 -196 -172 -157 -157 -168 -180 -184 -181 -179 -179 -170 -145 -121 -125 -161 -203 -222 -219 -211 -209 -207 -198 -181 -159 -139 -128 -132 -146 -161 -176 -199 -226 -242 -236 -215 -195 -185
9322 -185 -178 -168 -154 -145 -148 -159 -164 -154 -137 -128 -127 -120 -101 -82 -82 -104 -135 -157 -162 -157 -161 -184 -217 -239 -244 -246 -255 -270 -284 -295 -301 -296 -280 -261 -246 -234 -224 -224 -235 -241 -229 -207 -200 -221
9303 -221 -264 -309 -341 -354 -349 -336 -323 -313 -302 -286 -269 -254 -240 -225 -207 -190 -182 -193 -224 -262 -297 -324 -343 -345 -325 -295 -271 -251 -220 -174 -129 -101 -88 -77 -62 -54 -60
9287 -60 -80 -102 -118 -129 -139 -149 -158 -169 -185 -204 -217 -225 -227 -221 -202 -182 -184 -216 -252 -262 -247 -236 -238 -234 -206 -163 -126 -100 -79 -54 -35 -37 -63 -96 -113 -109 -98 -92 -83 -63 -39
9269 -39 -32 -52 -90 -130 -162 -176 -174 -171 -185 -217 -243 -242 -223 -202 -184 -164 -145 -139 -146 -152 -145 -134 -135 -158 -197 -233 -253 -256 -250 -240 -223 -197 -169 -149 -143 -143 -138 -119 -98 -95 -117 -144 -149
9250 -149 -133 -124 -147 -192 -234 -262 -279 -282 -264 -234 -222 -240 -273 -294 -295 -286 -275 -261 -247 -243 -250 -262 -269 -272 -277 -280 -276 -263 -246 -234 -228 -229 -238 -256 -281 -302 -307 -289 -248 -197 -150 -117
9232 -117 -101 -99 -108 -122 -138 -147 -149 -150 -161 -187 -217 -235 -236 -225 -213 -201 -183 -155 -118 -82 -58 -60 -88 -129 -163 -178 -170 -149 -124 -107 -106 -120 -141 -158 -157 -138 -109 -90 -98 -133
9215 -133 -174 -193 -184 -162 -149 -151 -153 -146 -135 -132 -136 -130 -106 -77 -60 -53 -42 -25 -18 -28 -41 -44 -41 -43 -41 -20 23 73 121 171 229 301 391 511 666 868 1142 1518 1964
9198 1964 2359 2550 2462 2150 1749 1374 1077 857 694 564 448 340 248 185 151 132 117 103 87 60 11 -50 -105 -139 -155 -159 -149 -122 -86
9185 -86 -57 -42 -38 -42 -56 -84 -121 -146 -141 -105 -58 -19 10 38 68 88 94 93 97 106 110 105 101 102 103 98 93 104 130 151 146 121 109 128 165 189 182 146 99 57 33 34 57 92
9166 92 125 148 160 169 185 211 236 247 245 243 248 249 236 219 224 260 311 358 400 447 500 544 578 616 668 729 792 862 953 1065 1189 1332 1514 1736 1983
9151 1983 2254 2570 2945 3379 3884 4495 5242 6130 7189 8515 10214 12348 14939 17944 21084 23691 24917 24273 22004 18906
9142 18906 15776 13036 10766 8923 7452 6291 5369 4633 4044 3558 3133 2746 2398 2092 1827 1606 1427 1279 1151 1036 933
9133 933 842 758 678 598 525 474 452 443 423 392 373 377 385 375 344 301 252 201 153 111 76 52 46 51 52 46 54 83 107 89 29 -31 -58 -50 -33 -26 -36 -59 -86 -105
9116 -105 -110 -103 -91 -84 -91 -105 -116 -116 -106 -83 -46 -6 13 2 -17 -20 3 38 69 87 92 82 67 50 30 7 -14 -29 -47 -83 -132 -173 -188 -183 -167 -149 -132 -125 -125 -123
9099 -123 -113 -98 -89 -90 -100 -115 -127 -129 -125 -122 -129 -146 -171 -197 -217 -225 -226 -226 -221 -200 -171 -152 -153 -161 -169 -179 -196 -208 -209 -206 -213 -226 -227 -213 -188 -159 -126 -94 -73 -67 -66 -68 -77 -92 -100 -97
9079 -97 -91 -98 -119 -144 -162 -173 -178 -176 -167 -154 -143 -146 -165 -190 -204 -201 -193 -194 -207 -223 -227 -212 -179 -140 -110 -101 -111 -128 -138 -136 -122 -104 -89 -78 -71 -73 -85 -103 -110 -97 -77 -69 -79
9060 -79 -97 -113 -131 -155 -184 -200 -198 -184 -180 -195 -222 -238 -228 -196 -156 -121 -95 -81 -80 -81 -71 -48 -24 -16 -38 -84 -135 -168 -177 -174 -167 -153 -130 -111 -114 -140 -166 -175 -176 -186 -203
9042 -203 -211 -199 -175 -151 -140 -148 -171 -197 -214 -221 -223 -222 -219 -221 -238 -268 -292 -290 -261 -223 -197 -195 -209 -224 -234 -244 -257 -268 -270 -264 -262 -268 -275 -275 -267 -259 -264 -282 -303 -313 -306 -293 -285 -286 -287 -285
9022 -285 -280 -266 -237 -198 -163 -139 -129 -135 -161 -195 -215 -213 -201 -191 -176 -148 -117 -101 -97 -89 -76 -75 -97 -131 -163 -187 -210 -230 -241 -237 -225 -209 -191 -177 -179 -196 -217 -222 -212
9005 -212 -201 -204 -213 -211 -198 -188 -193 -206 -217 -221 -217 -202 -180 -156 -137 -124 -121 -134 -159 -183 -201 -222 -256 -289 -297 -280 -262 -262 -276 -283 -273 -249 -224 -210 -203 -195 -177 -158 -150 -153 -156 -148 -139
8987 -139 -144 -170 -209 -243 -259 -256 -240 -218 -191 -164 -151 -165 -204 -247 -278 -288 -278 -253 -232 -226 -234 -237 -222 -192 -158 -133 -123 -132 -155 -183 -205 -215 -212 -211 -235 -288 -350 -391 -402
8970 -402 -392 -364 -320 -270 -233 -218 -221 -239 -274 -315 -330 -305 -257 -219 -205 -207 -214 -223 -231 -234 -236 -245 -262 -282 -298 -308 -313 -317 -321 -318 -296 -256 -209 -164 -124 -99 -102 -132 -161 -167 -156 -142
8952 -142 -134 -138 -166 -216 -261 -276 -266 -260 -267 -276 -277 -271 -260 -250 -251 -275 -309 -330 -328 -311 -287 -260 -239 -240 -262 -282 -283 -272 -261 -255 -260 -285 -321 -348 -354 -344 -328 -299 -250 -192 -135 -84
8934 -84 -49 -49 -84 -128 -155 -166 -176 -186 -186 -187 -203 -228 -230 -197 -153 -134 -151 -184 -207 -203 -182 -163 -157 -158 -159 -165 -183 -202 -208 -196 -184 -187 -204 -226 -248 -267 -282 -291 -291 -278 -255 -231
8915 -231 -213 -200 -187 -177 -172 -165 -146 -126 -125 -143 -163 -172 -179 -192 -204 -201 -189 -178 -170 -157 -146 -148 -161 -167 -155 -140 -137 -142 -140 -136 -153 -206 -275 -329 -350 -348 -334 -314 -294 -283 -287 -292 -282
8897 -282 -250 -206 -166 -147 -159 -193 -224 -231 -223 -218 -219 -214 -196 -180 -174 -164 -136 -100 -81 -87 -102 -107 -106 -116 -144 -181 -208 -218 -216 -216 -221 -228 -235 -239 -239 -229 -210 -185 -154 -119 -87 -73 -84
8878 -84 -104 -110 -88 -51 -24 -23 -45 -73 -93 -110 -134 -162 -181 -184 -174 -161 -149 -147 -165 -200 -231 -247 -254 -264 -274 -272 -252 -225 -198 -178 -174 -193 -226 -253 -261 -251 -223 -179 -130
8861 -130 -105 -115 -143 -161 -166 -175 -199 -228 -245 -248 -243 -237 -231 -227 -228 -238 -249 -255 -254 -251 -250 -257 -269 -276 -271 -262 -270 -301 -330 -325 -285 -243 -230 -241 -256 -265 -271 -272 -261 -239 -221 -218 -227 -233 -229 -212 -186
8841 -186 -163 -158 -171 -189 -198 -200 -204 -214 -227 -243 -262 -280 -294 -308 -320 -323 -308 -284 -265 -254 -251 -253 -257 -252 -227 -190 -162 -150 -149 -154 -168 -183 -185 -166 -137 -115 -111 -126 -159 -201 -238
8823 -238 -257 -259 -252 -240 -233 -235 -242 -242 -237 -241 -258 -267 -249 -215 -192 -189 -187 -175 -164 -166 -179 -188 -184 -163 -131 -96 -71 -68 -86 -124 -169 -202 -206 -182 -147 -116 -97 -94 -110 -136 -160 -178 -200
8804 -200 -224 -234 -228 -221 -231 -249 -258 -258 -257 -254 -237 -218 -216 -236 -249 -231 -188 -143 -107 -79 -63 -68 -96 -135 -167 -187 -197 -201 -203 -207 -212 -215 -212 -206 -203 -208 -210 -198 -173 -153 -152 -170 -195 -219
8785 -219 -238 -246 -243 -236 -235 -242 -247 -244 -239 -234 -230 -229 -234 -246 -265 -294 -333 -369 -380 -360 -328 -300 -280 -262 -251 -254 -267 -276 -277 -279 -288 -303 -316 -323 -319 -304 -282 -259 -236 -215 -201 -202 -213 -220 -211 -192
8765 -192 -174 -166 -168 -174 -176 -167 -145 -117 -99 -102 -129 -172 -211 -226 -217 -200 -202 -225 -250 -252 -232 -208 -196 -191 -185 -185 -202 -234 -258 -259 -246 -228 -209 -185 -165 -166 -183 -195 -189 -174 -167 -168 -171 -178
8746 -178 -197 -230 -264 -283 -279 -253 -219 -198 -200 -221 -245 -267 -291 -314 -321 -307 -290 -293 -322 -353 -367 -367 -368 -379 -394 -398 -385 -362 -340 -318 -288 -252 -223 -207 -196 -176 -151 -133
8730 -133 -133 -147 -171 -200 -227 -237 -226 -208 -196 -184 -169 -158 -169 -198 -225 -235 -237 -240 -244 -246 -246 -241 -228 -209 -195 -191 -191 -188 -187 -184 -168 -138 -114 -123 -166 -213 -240 -247 -242 -230 -212 -199
8712 -199 -199 -209 -219 -227 -241 -263 -284 -291 -284 -277 -278 -285 -285 -275 -263 -257 -259 -268 -280 -287 -284 -270 -254 -242 -238 -240 -241 -237 -222 -204 -199 -216 -239 -245 -233 -218 -211 -207 -199 -185 -166 -146 -129 -121 -117 -118 -130
8691 -130 -163 -206 -243 -267 -291 -318 -338 -344 -343 -345 -343 -324 -290 -255 -232 -217 -205 -194 -188 -189 -201 -218 -227 -229 -238 -260 -280 -277 -253 -228 -211 -194 -172 -155 -161 -188 -224 -256 -273 -273 -263
8673 -263 -251 -238 -216 -190 -173 -177 -196 -219 -238 -245 -234 -204 -167 -136 -116 -107 -109 -126 -141 -140 -125 -113 -114 -119 -122 -134 -165 -199 -211 -202 -195 -200 -200 -184 -169 -174 -192 -200 -192 -184 -187 -195 -203 -214
8654 -214 -224 -215 -177 -133 -113 -123 -145 -168 -195 -224 -244 -256 -270 -281 -273 -239 -199 -176 -171 -170 -168 -166 -169 -172 -178 -189 -205 -227 -254 -278 -289 -282 -273 -272 -270 -252 -226 -209 -209 -212 -209 -213 -232
8636 -232 -254 -257 -237 -211 -194 -190 -190 -182 -161 -134 -116 -119 -141 -168 -194 -215 -230 -240 -251 -263 -270 -258 -227 -194 -181 -189 -202 -200 -182 -169 -182 -216 -249 -268 -277 -286 -293 -286 -264 -238 -223
8618 -223 -224 -238 -251 -255 -251 -250 -258 -267 -270 -266 -261 -255 -242 -222 -205 -192 -178 -159 -143 -144 -162 -185 -197 -188 -161 -135 -128 -141 -156 -158 -148 -135 -130 -136 -151 -166 -172 -171 -175 -193 -213 -222 -225 -241 -275
8598 -275 -312 -336 -342 -335 -320 -312 -318 -331 -331 -318 -317 -340 -374 -395 -400 -399 -391 -367 -330 -299 -281 -266 -242 -214 -194 -190 -200 -212 -215 -205 -198 -208 -231 -247 -242 -222 -201 -192 -199 -220 -244 -251 -242
8580 -242 -233 -237 -244 -231 -204 -189 -204 -235 -257 -263 -263 -269 -281 -293 -299 -298 -290 -276 -256 -235 -210 -182 -153 -138 -143 -162 -173 -171 -173 -202 -248 -278 -275 -252 -233 -224 -215 -203 -189 -172 -148 -129
8562 -129 -127 -145 -163 -168 -165 -167 -177 -189 -202 -214 -218 -201 -167 -132 -107 -93 -93 -111 -140 -157 -148 -125 -111 -115 -125 -131 -137 -151 -170 -182 -190 -201 -219 -236 -241 -237 -234 -239 -242 -232 -208 -180 -164
8543 -164 -165 -170 -166 -150 -132 -124 -121 -118 -115 -122 -132 -125 -89 -41 -17 -30 -59 -82 -97 -116 -137 -145 -133 -120 -122 -139 -162 -184 -200 -207 -202 -202 -223 -258 -288 -303 -318 -345 -374 -386 -377 -363
8525 -363 -353 -344 -335 -327 -314 -285 -241 -200 -180 -175 -167 -159 -167 -192 -210 -201 -172 -152 -158 -185 -213 -227 -223 -208 -195 -191 -192 -191 -180 -161 -142 -130 -125 -123 -123 -130 -148 -168 -184 -195 -210 -219 -209 -177
8506 -177 -141 -115 -99 -90 -98 -126 -159 -176 -176 -173 -177 -189 -208 -238 -273 -293 -289 -264 -230 -193 -162 -147 -143 -136 -123 -115 -124 -144 -169 -200 -234 -254 -249 -229 -212 -199 -184 -171 -176 -206 -248
8488 -248 -280 -286 -260 -211 -169 -157 -173 -195 -214 -242 -285 -327 -340 -317 -273 -230 -202 -195 -208 -235 -268 -300 -322 -321 -300 -277 -269 -266 -251 -224 -202 -198 -205 -205 -192 -171 -147 -122 -103
8471 -103 -103 -126 -157 -175 -175 -176 -194 -228 -259 -270 -260 -236 -202 -159 -122 -110 -133 -182 -228 -251 -247 -229 -211 -200 -193 -179 -153 -129 -125 -142 -160 -165 -164 -176 -190 -182 -146 -106 -86
8454 -86 -81 -75 -66 -66 -73 -82 -90 -104 -118 -123 -121 -122 -130 -136 -139 -149 -169 -186 -191 -185 -179 -177 -190 -220 -254 -263 -236 -194 -155 -120 -80 -45 -28 -27 -30 -35 -43 -52 -59 -76 -119 -172 -207 -217 -223 -234 -239 -236 -242
8433 -242 -269 -295 -292 -267 -249 -248 -246 -230 -212 -211 -234 -273 -311 -338 -350 -355 -365 -378 -378 -362 -348 -347 -345 -318 -268 -226 -220 -240 -258 -259 -252 -253 -261 -269 -275 -281 -281 -266 -245 -235 -247 -266 -273 -265
8414 -265 -258 -265 -280 -294 -303 -315 -333 -352 -360 -354 -340 -326 -313 -293 -267 -244 -236 -246 -264 -275 -272 -255 -231 -208 -191 -188 -198 -216 -225 -216 -197 -189 -201 -216 -212 -182 -135 -94 -75 -78 -92
8396 -92 -107 -127 -163 -209 -249 -273 -289 -302 -310 -309 -303 -293 -275 -253 -245 -262 -285 -291 -276 -254 -240 -239 -260 -306 -360 -390 -385 -359 -330 -307 -293 -296 -316 -336 -338 -318 -286 -252 -226 -212
8379 -212 -203 -189 -174 -173 -190 -207 -205 -185 -162 -148 -143 -150 -169 -188 -193 -181 -160 -139 -126 -124 -125 -120 -111 -111 -125 -145 -165 -189 -214 -222 -206 -186 -191 -214 -219 -192 -156 -143 -153 -167 -174 -174 -173
8360 -173 -175 -183 -192 -192 -185 -177 -173 -170 -170 -181 -201 -217 -224 -234 -256 -278 -282 -270 -256 -248 -248 -260 -280 -291 -281 -259 -245 -236 -213 -171 -127 -105 -109 -130 -158 -184 -205 -223 -245 -266 -275 -271 -263 -252
8341 -252 -237 -218 -205 -201 -205 -211 -220 -235 -253 -266 -271 -263 -241 -212 -192 -191 -205 -225 -239 -236 -218 -196 -184 -186 -197 -213 -229 -237 -234 -232 -248 -273 -278 -244 -193 -156 -145 -149 -158 -165 -166 -163 -170 -202
8322 -202 -256 -310 -344 -350 -330 -292 -252 -225 -213 -201 -181 -152 -121 -97 -88 -90 -94 -97 -108 -139 -187 -234 -255 -241 -203 -167 -154 -165 -182 -192 -203 -230 -262 -274 -258 -228 -202
8306 -202 -185 -175 -181 -208 -247 -278 -295 -301 -298 -287 -265 -235 -205 -182 -169 -157 -138 -121 -128 -171 -231 -277 -293 -286 -270 -255 -246 -243 -246 -251 -261 -278 -293 -289 -259 -214 -179 -165 -168 -174 -174
8288 -174 -169 -169 -185 -217 -259 -292 -302 -294 -287 -293 -299 -282 -238 -191 -174 -197 -243 -288 -313 -310 -286 -258 -247 -258 -278 -292 -298 -301 -305 -305 -294 -274 -256 -255 -261 -259 -244 -235 -245 -265 -276 -279 -285
8269 -285 -287 -272 -237 -207 -194 -192 -185 -178 -182 -202 -228 -256 -278 -284 -266 -233 -201 -178 -163 -159 -168 -183 -191 -191 -192 -194 -187 -166 -147 -149 -173 -201 -219 -216 -193 -156 -118 -97 -100 -126 -168 -212 -235
8251 -235 -222 -182 -143 -120 -111 -111 -125 -155 -194 -232 -267 -299 -319 -313 -285 -257 -251 -262 -268 -255 -232 -214 -210 -216 -221 -222 -226 -242 -269 -295 -305 -296 -276 -265 -270 -283 -290 -286 -275 -258 -235 -212
8233 -212 -205 -223 -252 -264 -242 -197 -154 -132 -128 -126 -109 -80 -58 -59 -82 -108 -118 -115 -113 -128 -156 -184 -203 -213 -223 -229 -222 -203 -184 -172 -158 -131 -100 -87 -97 -115 -124 -129 -142 -166
8215 -166 -192 -216 -237 -251 -259 -264 -270 -272 -266 -253 -243 -242 -249 -258 -261 -251 -228 -204 -195 -205 -226 -244 -253 -254 -252 -251 -254 -253 -244 -226 -206 -188 -176 -177 -193 -211 -211 -193 -178 -182 -201 -219 -228 -230 -223 -208
8195 -208 -202 -218 -249 -270 -267 -248 -223 -197 -174 -170 -192 -226 -253 -271 -293 -315 -316 -285 -235 -187 -149 -124 -117 -131 -158 -186 -214 -248 -278 -288 -278 -266 -264 -265 -266 -278 -304 -329 -339
8178 -339 -336 -331 -323 -305 -281 -264 -253 -239 -223 -219 -232 -250 -262 -276 -300 -325 -337 -332 -319 -305 -285 -252 -213 -185 -179 -190 -199 -192 -174 -161 -162 -170 -173 -170 -168 -172 -181 -185 -176 -163 -163 -186 -221 -248
8159 -248 -258 -260 -265 -269 -261 -239 -214 -197 -191 -190 -189 -186 -185 -186 -188 -197 -220 -253 -280 -290 -292 -302 -315 -312 -285 -254 -239 -243 -253 -259 -260 -256 -250 -251 -263 -274 -265 -236 -203 -181 -166 -150 -132 -118 -109 -101
8139 -101 -94 -92 -103 -128 -167 -206 -229 -228 -209 -186 -171 -164 -161 -161 -170 -185 -196 -192 -181 -180 -194 -206 -202 -188 -176 -160 -131 -99 -93 -126 -175 -210 -226 -244 -268 -280 -266 -236 -214 -211 -218
8122 -218 -223 -222 -221 -220 -217 -210 -201 -194 -191 -190 -195 -208 -227 -242 -248 -250 -262 -285 -310 -324 -323 -309 -283 -246 -205 -176 -171 -188 -212 -226 -222 -205 -188 -183 -188 -197 -203 -206 -209 -211 -213 -214 -216 -215 -213 -217 -234 -261 -285
8100 -285 -302 -309 -305 -289 -267 -252 -247 -245 -236 -219 -196 -167 -143 -138 -160 -191 -209 -212 -213 -220 -228 -235 -239 -239 -228 -207 -191 -189 -197 -203 -207 -215 -230 -244 -251 -253 -262 -282 -306 -319 -317 -309 -308 -314 -322 -327 -335 -347 -355
8079 -355 -349 -324 -294 -281 -289 -301 -292 -255 -208 -169 -141 -123 -119 -137 -170 -191 -190 -179 -185 -219 -269 -303 -299 -259 -204 -161 -144 -156 -197 -254 -306 -332 -331 -318 -305 -292 -276 -264 -261
8062 -261 -262 -260 -249 -231 -206 -181 -161 -146 -131 -118 -109 -104 -104 -116 -147 -185 -207 -201 -180 -159 -146 -145 -163 -194 -219 -222 -209 -199 -203 -218 -239 -261 -279 -286 -288 -293 -299 -299 -294 -287 -276 -261 -248
8044 -248 -252 -270 -283 -274 -250 -234 -237 -248 -248 -232 -215 -217 -235 -251 -252 -244 -241 -242 -235 -217 -199 -186 -175 -162 -155 -157 -159 -154 -143 -136 -137 -137 -134 -133 -143 -165 -195 -232 -270 -300 -314 -318 -321 -320 -307 -287
8024 -287 -271 -261 -242 -210 -178 -160 -151 -135 -116 -105 -108 -117 -135 -168 -208 -231 -232 -226 -224 -218 -205 -198 -208 -225 -234 -244 -270 -304 -322 -313 -284 -247 -206 -171 -146 -127 -104 -85 -86 -108
8006 -108 -134 -148 -153 -156 -156 -154 -154 -159 -167 -179 -195 -213 -229 -242 -257 -269 -267 -254 -245 -247 -254 -258 -262 -265 -259 -238 -215 -205 -208 -207 -192 -164 -129 -89 -60 -61 -90 -121 -133 -127 -121 -120 -112 -91 -79 -99
7986 -99 -147 -192 -215 -227 -238 -236 -204 -155 -122 -116 -121 -121 -116 -116 -120 -134 -167 -213 -254 -283 -310 -341 -357 -342 -308 -277 -260 -250 -244 -239 -225 -191 -152 -128 -122 -120 -126 -155 -205 -248 -260
7969 -260 -247 -234 -229 -226 -227 -237 -252 -260 -251 -238 -238 -251 -262 -251 -221 -195 -192 -212 -234 -238 -217 -179 -141 -118 -116 -130 -150 -163 -162 -148 -128 -113 -109 -114 -123 -135 -148 -165 -191 -224 -250
7951 -250 -254 -239 -227 -228 -231 -220 -200 -185 -177 -171 -173 -194 -233 -278 -316 -341 -346 -321 -279 -245 -238 -252 -271 -287 -299 -304 -297 -276 -250 -234 -242 -268 -291 -295 -282 -277 -285 -291 -276 -245 -212 -192
7933 -192 -188 -197 -218 -246 -268 -277 -266 -239 -206 -185 -191 -224 -273 -314 -328 -309 -270 -234 -218 -220 -235 -250 -255 -247 -238 -244 -269 -298 -317 -328 -343 -358 -360 -343 -312 -278 -245 -212 -184 -168
7915 -168 -168 -172 -167 -148 -129 -125 -131 -133 -129 -134 -161 -200 -230 -238 -230 -216 -199 -180 -168 -176 -206 -239 -252 -245 -237 -240 -246 -245 -248 -264 -283 -287 -275 -263 -256 -244 -229 -226 -240 -258 -270 -285 -304 -313 -297
7896 -297 -271 -260 -264 -268 -263 -251 -236 -213 -191 -177 -171 -165 -158 -159 -171 -187 -208 -231 -248 -253 -249 -249 -250 -240 -215 -189 -170 -155 -139 -129 -129 -133 -131 -125 -125 -140 -172 -213 -251 -273 -279 -280 -280 -275 -262
7876 -262 -247 -238 -234 -234 -234 -224 -196 -162 -149 -166 -195 -210 -212 -212 -211 -203 -192 -189 -196 -194 -179 -165 -166 -179 -181 -163 -132 -102 -86 -92 -120 -156 -178 -177 -165 -164 -181 -200 -205 -196 -183 -175 -174 -183 -205
7857 -205 -236 -265 -286 -301 -309 -305 -284 -252 -225 -215 -220 -230 -229 -216 -200 -190 -186 -183 -178 -178 -184 -186 -176 -159 -145 -139 -142 -148 -154 -155 -151 -147 -147 -154 -167 -183 -198 -200 -178 -138 -100 -82 -83 -81 -63 -36
7837 -36 -19 -20 -33 -53 -82 -118 -144 -148 -137 -121 -97 -61 -27 -19 -31 -33 -12 10 15 13 21 35 39 40 54 82 113 143 180 223 258 281 304 339 386 442 505 577 655 745
7819 745 849 963 1082 1210 1361 1547 1778 2071 2445 2905 3476 4225 5251 6660 8591 11209 14534 18170 21272 22947 22803
7810 22803 21139 18639 15924 13342 11040 9075 7458 6159 5131 4325 3691 3182 2762 2406 2099 1835 1624 1472 1368 1299
7802 1299 1268 1284 1338 1392 1405 1362 1269 1143 1001 860 733 631 560 519 504 508 516 510 483 449 436 452 480 510 549 596 632 629 594 558 551 583 657 765
7787 765 892 1028 1187 1385 1610 1844 2103 2429 2859 3426 4195 5255 6697 8659 11338 14803 18656 21969 23749 23572 21782
7778 21782 19123 16243 13504 11077 9033 7372 6046 5000 4189 3555 3040 2608 2251 1957 1703 1482 1299 1152 1032 935
7769 935 861 793 708 610 526 470 431 389 345 310 290 280 271 257 248 260 300 354 398 417 416 409 410 420 428 418 403 415 471 551 631 715 819 940 1064 1195
7754 1195 1353 1550 1784 2070 2432 2882 3446 4195 5234 6668 8620 11255 14607 18289 21440 23143 22995 21303 18758 15981
7745 15981 13331 10969 8964 7325 6014 4979 4166 3524 3003 2577 2233 1960 1735 1545 1380 1224 1063 905 779 697 638
7736 638 576 511 457 413 363 297 234 202 203 215 215 200 181 168 163 163 160 146 119 91 72 61 46 22 -9 -46 -91 -140 -187 -225 -249 -251 -222 -165 -98 -35 16 54
7719 54 68 54 20 -22 -68 -111 -138 -139 -127 -122 -130 -136 -133 -130 -136 -142 -137 -127 -127 -136 -134 -110 -78 -62 -66 -77 -78 -68 -63 -80 -117 -159 -189 -203 -203 -194 -187 -191 -205 -216 -205 -168 -123 -86 -64
7700 -64 -51 -45 -46 -53 -65 -82 -107 -135 -157 -170 -175 -179 -192 -219 -250 -263 -254 -242 -253 -276 -278 -244 -197 -167 -158 -153 -144 -143 -158 -183 -205 -215 -213 -205 -202 -210 -225 -235 -233 -220 -200 -178 -162
7681 -162 -164 -189 -227 -267 -305 -335 -346 -330 -289 -238 -187 -145 -125 -135 -171 -216 -255 -277 -276 -251 -219 -198 -190 -178 -157 -140 -141 -150 -152 -155 -182 -233 -281 -298 -284 -262 -255 -272 -304
7664 -304 -327 -330 -321 -313 -298 -256 -190 -134 -115 -130 -158 -183 -206 -225 -239 -250 -258 -257 -243 -227 -224 -236 -255 -277 -297 -307 -294 -270 -262 -286 -326 -351 -345 -316 -282 -260 -257 -270 -289
7647 -289 -306 -312 -308 -301 -299 -305 -307 -295 -269 -243 -222 -202 -183 -168 -162 -166 -181 -208 -236 -241 -213 -173 -154 -166 -195 -220 -239 -257 -275 -292 -307 -322 -334 -337 -327 -305 -276 -249 -230 -224
7630 -224 -236 -259 -281 -292 -290 -277 -257 -237 -221 -207 -194 -187 -196 -224 -260 -289 -305 -307 -294 -267 -239 -220 -211 -207 -210 -224 -246 -261 -269 -277 -279 -265 -233 -201 -181 -162 -133 -96 -58 -23
7613 -23 2 1 -37 -97 -147 -166 -163 -153 -151 -164 -189 -217 -238 -252 -259 -257 -251 -255 -276 -299 -302 -278 -245 -221 -217 -232 -258 -280 -297 -321 -358 -394 -407 -397 -377 -349 -315 -284 -274 -282
7595 -282 -284 -273 -268 -283 -308 -326 -331 -325 -309 -287 -269 -252 -225 -188 -161 -157 -159 -147 -133 -143 -174 -201 -207 -206 -218 -238 -249 -235 -207 -186 -195 -230 -271 -306 -339 -372 -387 -359 -300
7578 -300 -248 -232 -243 -259 -272 -287 -304 -314 -310 -297 -286 -285 -298 -318 -339 -355 -361 -357 -347 -340 -337 -324 -290 -251 -231 -241 -266 -287 -300 -301 -286 -250 -210 -191 -202 -227 -239 -228
7562 -228 -201 -172 -151 -143 -151 -171 -189 -192 -179 -163 -156 -159 -169 -184 -207 -226 -227 -204 -169 -143 -138 -149 -165 -184 -212 -252 -292 -312 -302 -274 -251 -246 -249 -243 -218 -189 -190 -239 -308 -348
7545 -348 -338 -306 -285 -280 -275 -270 -275 -288 -292 -281 -262 -236 -200 -163 -149 -166 -189 -197 -192 -190 -190 -182 -172 -176 -196 -214 -215 -202 -184 -164 -139 -116 -99 -92 -98 -121 -160 -208 -250 -277 -285 -276 -250
7526 -250 -211 -167 -127 -103 -102 -117 -132 -138 -145 -167 -204 -230 -225 -195 -170 -169 -186 -206 -217 -223 -225 -225 -226 -229 -235 -240 -242 -243 -241 -235 -227 -221 -216 -211 -210 -217 -226 -222 -200 -175 -168 -184 -208 -223 -232 -244 -260 -264
7505 -264 -245 -222 -220 -245 -266 -261 -239 -226 -229 -227 -210 -191 -191 -203 -207 -199 -195 -209 -238 -263 -271 -262 -246 -232 -227 -229 -236 -240 -239 -231 -222 -214 -211 -224 -263 -322 -373 -384 -350 -299 -263 -252 -263 -286
7486 -286 -313 -333 -335 -320 -294 -270 -259 -265 -280 -287 -284 -278 -275 -268 -257 -250 -255 -266 -272 -273 -273 -266 -246 -217 -193 -183 -184 -191 -196 -199 -207 -228 -261 -288 -294 -285 -276 -276 -279 -282 -292 -304 -306 -293 -273 -260 -256 -252
7465 -252 -246 -238 -227 -215 -208 -208 -217 -228 -242 -256 -267 -274 -281 -292 -311 -337 -364 -380 -377 -364 -349 -334 -311 -282 -259 -248 -242 -236 -227 -219 -212 -209 -216 -232 -245 -246 -234 -219 -213 -226 -261 -300 -308 -275
7446 -275 -229 -201 -195 -190 -180 -174 -175 -172 -161 -157 -175 -204 -214 -189 -143 -106 -98 -115 -137 -148 -154 -162 -169 -162 -144 -130 -135 -157 -190 -229 -272 -313 -345 -356 -341 -304 -268 -253 -258 -259 -243 -220
7428 -220 -205 -195 -177 -158 -151 -157 -161 -156 -153 -157 -163 -161 -157 -164 -184 -204 -217 -226 -239 -257 -273 -277 -270 -256 -244 -238 -241 -248 -253 -248 -235 -221 -216 -214 -200 -174 -154 -155 -173 -190 -196 -193 -190 -195 -213 -243 -273
7408 -273 -289 -299 -318 -351 -374 -366 -332 -292 -261 -240 -231 -238 -254 -269 -278 -285 -279 -245 -190 -148 -149 -190 -240 -282 -313 -338 -358 -374 -381 -368 -328 -270 -222 -200 -202 -215 -232 -244 -241 -223
7390 -223 -200 -180 -162 -146 -142 -155 -179 -197 -206 -209 -209 -207 -209 -224 -246 -255 -242 -221 -210 -211 -211 -199 -179 -163 -160 -167 -177 -187 -196 -202 -192 -155 -103 -66 -62 -86 -118 -147 -173 -191 -190 -176
7372 -176 -164 -168 -183 -196 -197 -183 -161 -146 -156 -190 -230 -263 -292 -323 -354 -371 -365 -341 -307 -272 -238 -211 -196 -199 -220 -249 -270 -271 -258 -246 -243 -246 -246 -241 -227 -210 -199 -206 -234 -272
7355 -272 -307 -332 -347 -354 -351 -341 -332 -330 -332 -329 -316 -300 -295 -306 -322 -330 -324 -310 -295 -289 -296 -317 -340 -352 -351 -338 -315 -279 -236 -202 -187 -181 -169 -150 -143 -162 -193 -212 -212 -201 -185 -159
7337 -159 -123 -96 -97 -123 -156 -189 -234 -288 -327 -326 -301 -281 -279 -274 -248 -206 -166 -142 -136 -148 -172 -193 -203 -206 -209 -210 -204 -193 -185 -188 -203 -228 -248 -248 -222 -183 -155 -146 -150 -157 -169 -192
7318 -192 -233 -289 -348 -389 -397 -370 -319 -259 -203 -160 -137 -136 -152 -168 -171 -162 -150 -142 -138 -140 -160 -201 -240 -249 -229 -206 -199 -195 -175 -140 -119 -131 -165 -201 -223 -233 -237 -244 -258 -280 -300
7301 -300 -306 -292 -266 -243 -231 -225 -217 -201 -178 -156 -152 -177 -225 -272 -302 -316 -325 -329 -321 -307 -300 -300 -295 -280 -272 -275 -272 -248 -217 -209 -228 -246 -247 -239 -239 -245 -244 -232 -216 -200 -179 -149 -112 -84
7281 -84 -79 -106 -164 -240 -308 -346 -342 -311 -275 -248 -225 -199 -176 -166 -169 -179 -186 -189 -188 -188 -201 -229 -257 -267 -260 -248 -240 -229 -208 -179 -151 -133 -132 -149 -173 -190 -191 -179 -162 -146 -142
7264 -142 -158 -186 -213 -237 -264 -288 -290 -267 -239 -221 -206 -184 -167 -175 -206 -231 -233 -223 -213 -204 -190 -178 -184 -211 -244 -261 -254 -230 -199 -164 -129 -104 -100 -113 -130 -145 -163 -188
7247 -188 -204 -195 -171 -153 -153 -165 -183 -210 -241 -259 -258 -250 -256 -272 -277 -263 -241 -228 -224 -224 -225 -232 -239 -234 -216 -199 -200 -221 -253 -290 -325 -345 -340 -313 -274 -229 -181 -142 -127 -136 -146 -140 -127
7229 -127 -125 -136 -148 -156 -163 -166 -157 -137 -118 -108 -107 -114 -130 -154 -178 -193 -199 -202 -207 -221 -245 -275 -303 -330 -361 -391 -403 -379 -325 -273 -246 -245 -245 -227 -184 -133 -95 -86 -102 -124 -132 -124
7210 -124 -118 -130 -156 -177 -186 -194 -212 -237 -252 -250 -238 -219 -193 -156 -110 -70 -52 -59 -80 -94 -91 -82 -84 -99 -116 -131 -147 -160 -165 -164 -164 -165 -163 -159 -163 -177 -189 -194 -208 -239 -277 -299 -297
7192 -297 -284 -269 -257 -247 -246 -258 -283 -315 -346 -374 -397 -413 -414 -398 -373 -355 -349 -345 -335 -319 -297 -265 -228 -200 -196 -209 -218 -212 -199 -191 -195 -209 -237 -275 -316 -343 -345 -330 -318 -324
7174 -324 -343 -349 -331 -297 -262 -237 -222 -221 -235 -259 -282 -294 -288 -259 -214 -177 -170 -192 -224 -247 -256 -254 -245 -238 -243 -259 -279 -296 -311 -328 -344 -356 -355 -332 -288 -242 -216 -216 -224 -226 -220 -206
7156 -206 -185 -164 -164 -191 -230 -259 -268 -266 -258 -253 -263 -292 -323 -328 -297 -244 -191 -152 -137 -146 -170 -189 -195 -193 -194 -195 -188 -169 -153 -156 -186 -231 -266 -277 -264 -242 -223 -208 -198 -200 -220 -249
7138 -249 -269 -271 -260 -242 -214 -176 -139 -115 -107 -106 -108 -121 -142 -157 -151 -127 -100 -78 -57 -33 -10 -1 -11 -41 -83 -124 -153 -174 -197 -227 -256 -278 -296 -318 -348 -372 -379 -367
7122 -367 -350 -343 -345 -352 -354 -346 -328 -306 -291 -291 -294 -279 -246 -217 -216 -239 -266 -284 -297 -308 -311 -301 -282 -262 -243 -226 -212 -199 -177 -148 -129 -139 -174 -221 -264 -296 -313 -318 -316 -310 -298
7104 -298 -281 -266 -258 -257 -263 -279 -305 -328 -334 -325 -314 -306 -297 -289 -296 -320 -346 -354 -337 -302 -261 -227 -210 -209 -213 -213 -214 -223 -242 -259 -263 -256 -247 -246 -247 -237 -209 -175 -158 -173 -218 -275 -324 -351 -355
7084 -355 -350 -354 -363 -364 -354 -349 -359 -373 -378 -376 -380 -386 -384 -368 -351 -344 -347 -356 -373 -389 -389 -364 -321 -280 -256 -248 -253 -263 -275 -286 -296 -302 -299 -290 -282 -282 -285 -282 -267 -253 -261 -296 -338 -358 -346 -324 -318
7064 -318 -334 -350 -349 -330 -308 -294 -288 -281 -273 -266 -263 -263 -261 -260 -263 -271 -279 -285 -293 -304 -310 -301 -282 -267 -258 -250 -239 -235 -242 -260 -285 -318 -353 -364 -337 -280 -223 -187 -176 -186 -215 -253 -283 -294 -286
7044 -286 -267 -241 -215 -196 -186 -182 -181 -183 -188 -190 -183 -173 -166 -171 -186 -210 -237 -257 -261 -250 -239 -246 -273 -304 -316 -301 -266 -223 -187 -168 -173 -193 -207 -205 -197 -200 -215 -231 -239 -243 -248 -253 -256 -264 -278
7025 -278 -297 -315 -326 -325 -308 -285 -274 -278 -279 -262 -241 -240 -268 -311 -353 -386 -401 -389 -350 -301 -260 -232 -207 -179 -153 -142 -153 -177 -194 -194 -192 -211 -257 -304 -328 -324 -308 -294
7008 -294 -286 -283 -288 -297 -303 -294 -271 -241 -221 -216 -221 -225 -219 -208 -198 -195 -201 -212 -218 -211 -195 -189 -207 -248 -289 -310 -307 -289 -272 -263 -260 -255 -247 -240 -233 -225 -216 -216 -233 -259 -276 -264 -226 -187 -174 -192 -216
6988 -216 -216 -187 -153 -137 -145 -171 -204 -231 -242 -241 -248 -272 -299 -318 -334 -353 -359 -336 -294 -260 -247 -240 -230 -230 -250 -272 -276 -262 -249 -247 -251 -253 -251 -236 -203 -157 -118 -97 -90 -88 -98 -127
6970 -127 -168 -206 -230 -243 -247 -238 -217 -199 -196 -200 -189 -160 -132 -128 -148 -172 -186 -189 -185 -177 -176 -194 -227 -245 -227 -185 -149 -137 -143 -161 -191 -225 -250 -259 -264 -275 -289 -295 -293 -293 -299 -302 -290
6951 -290 -269 -253 -248 -245 -234 -222 -226 -251 -282 -294 -282 -256 -229 -205 -185 -175 -176 -178 -170 -148 -123 -110 -120 -150 -182 -197 -197 -197 -211 -236 -257 -268 -268 -257 -245 -244 -259 -277 -277 -259
6934 -259 -241 -240 -250 -254 -245 -227 -215 -219 -240 -268 -293 -316 -338 -351 -347 -333 -327 -336 -345 -346 -343 -341 -328 -297 -261 -245 -253 -264 -260 -242 -222 -207 -204 -218 -243 -263 -264 -246 -215 -184 -173 -193
6916 -193 -237 -277 -293 -288 -285 -298 -329 -364 -382 -374 -346 -318 -294 -269 -236 -210 -208 -230 -257 -269 -260 -237 -215 -204 -203 -205 -204 -205 -217 -236 -245 -237 -225 -223 -231 -233 -215 -180 -148 -137 -146 -162
6897 -162 -177 -198 -230 -262 -282 -290 -298 -307 -304 -281 -252 -241 -256 -287 -311 -313 -289 -246 -198 -160 -138 -135 -148 -173 -205 -236 -258 -269 -275 -282 -289 -287 -276 -270 -277 -284 -270 -235 -198 -176 -163
6880 -163 -144 -118 -95 -87 -93 -106 -118 -126 -129 -127 -121 -121 -133 -152 -157 -139 -114 -106 -115 -132 -151 -179 -209 -231 -248 -271 -294 -299 -283 -271 -280 -295 -298 -293 -297 -305 -302 -289 -290 -311 -330 -327 -314 -314 -333
6860 -333 -356 -373 -383 -388 -386 -373 -351 -325 -300 -277 -256 -239 -225 -213 -197 -180 -173 -181 -194 -204 -211 -217 -220 -214 -205 -204 -213 -218 -211 -197 -186 -179 -173 -175 -190 -215 -235 -241 -237 -232 -229 -224 -209 -188 -173
6841 -173 -175 -198 -229 -252 -258 -248 -234 -235 -257 -288 -308 -307 -292 -271 -247 -219 -195 -185 -186 -189 -186 -176 -163 -153 -154 -174 -214 -262 -304 -325 -323 -307 -285 -262 -239 -223 -215 -213 -212 -217 -238
6823 -238 -270 -290 -275 -229 -176 -140 -134 -154 -188 -219 -236 -243 -245 -248 -247 -242 -229 -209 -188 -172 -163 -154 -145 -149 -176 -214 -238 -240 -236 -244 -262 -277 -279 -272 -258 -244 -234 -227 -221 -211 -198 -189 -187 -186 -183
6803 -183 -182 -188 -199 -208 -212 -211 -205 -193 -183 -190 -221 -260 -282 -282 -275 -279 -290 -291 -279 -261 -242 -219 -194 -176 -174 -186 -203 -219 -234 -249 -259 -263 -260 -257 -261 -276 -292 -292 -271 -236 -211 -208 -226 -245
6784 -245 -250 -247 -252 -268 -278 -257 -207 -157 -131 -125 -122 -108 -91 -77 -69 -66 -73 -101 -154 -220 -275 -297 -287 -266 -253 -250 -246 -238 -235 -244 -260 -274 -286 -304 -324 -330 -314 -283 -254 -240 -241 -250 -258
6766 -258 -256 -241 -221 -210 -221 -249 -271 -265 -232 -199 -182 -174 -162 -150 -150 -157 -159 -157 -169 -205 -244 -260 -256 -254 -266 -283 -289 -277 -251 -222 -202 -196 -195 -191 -189 -196 -209 -218 -223 -238 -269 -308 -340
6747 -340 -359 -358 -335 -303 -282 -277 -280 -276 -263 -240 -204 -164 -148 -168 -201 -214 -207 -202 -213 -226 -223 -208 -193 -184 -179 -179 -184 -198 -220 -243 -251 -229 -190 -163 -167 -193 -221 -241 -251 -248 -235 -223
6729 -223 -220 -226 -234 -247 -273 -304 -324 -325 -324 -332 -350 -369 -388 -403 -401 -371 -321 -276 -249 -241 -243 -254 -266 -257 -218 -166 -135 -135 -153 -172 -192 -216 -239 -257 -274 -292 -300 -287 -262 -249 -262
6711 -262 -297 -346 -394 -417 -404 -373 -354 -358 -361 -347 -321 -297 -280 -266 -262 -269 -276 -272 -267 -277 -300 -322 -328 -316 -286 -244 -210 -208 -240 -280 -304 -311 -315 -321 -324 -322 -319 -313 -296 -269 -244 -240 -260
6692 -260 -289 -307 -307 -289 -258 -218 -175 -142 -128 -132 -145 -166 -186 -193 -176 -144 -127 -139 -162 -169 -154 -135 -132 -145 -166 -194 -231 -268 -287 -283 -261 -229 -195 -171 -167 -184 -208 -221
6676 -221 -215 -192 -165 -145 -143 -156 -170 -168 -149 -125 -110 -110 -120 -134 -142 -141 -134 -124 -114 -111 -128 -164 -199 -206 -189 -177 -194 -234 -270 -283 -273 -250 -224 -198 -169 -141 -129 -146 -184
6659 -184 -214 -215 -194 -173 -160 -155 -157 -162 -160 -146 -131 -132 -152 -172 -171 -149 -121 -109 -122 -157 -199 -230 -247 -251 -246 -236 -227 -222 -214 -193 -165 -144 -132 -122 -109 -98 -97 -114 -147 -189 -222
6641 -222 -234 -236 -243 -251 -236 -191 -147 -130 -136 -141 -143 -154 -175 -190 -197 -207 -222 -230 -226 -219 -213 -199 -165 -117 -69 -16 62 191 377 598 790 863 763 532 278 96
6626 96 -1 -54 -100 -145 -181 -208 -223 -227 -225 -229 -239 -243 -235 -220 -211 -208 -206 -206 -217 -234 -240 -223 -192 -164 -143 -128 -121 -129 -150 -173 -185 -188 -184 -173 -154 -131 -113 -111 -132 -171 -220 -271 -318
6607 -318 -349 -345 -301 -235 -181 -155 -153 -159 -170 -179 -172 -145 -110 -84 -69 -52 -38 -40 -68 -107 -142 -166 -173 -158 -134 -127 -157 -210 -258 -287 -302 -311 -311 -298 -278 -261 -253 -256 -269 -290 -315
6589 -315 -333 -333 -303 -255 -211 -185 -168 -141 -105 -80 -81 -105 -144 -190 -223 -222 -192 -158 -140 -128 -110 -92 -87 -96 -105 -112 -125 -146 -167 -183 -190 -184 -161 -128 -100 -85 -84 -95 -111 -124
6572 -124 -133 -147 -172 -194 -200 -199 -210 -236 -256 -258 -253 -248 -237 -216 -202 -213 -242 -267 -275 -269 -250 -219 -182 -153 -141 -145 -164 -194 -226 -248 -262 -276 -291 -297 -288 -271 -263 -264 -260 -242 -223 -224
6554 -224 -248 -271 -273 -255 -240 -234 -226 -210 -199 -207 -230 -249 -257 -258 -256 -253 -250 -251 -254 -255 -258 -271 -296 -321 -334 -340 -345 -345 -332 -311 -297 -301 -315 -331 -347 -368 -385 -388 -374 -352 -332 -317 -299 -278
6535 -278 -256 -234 -217 -210 -212 -218 -228 -240 -251 -256 -253 -253 -263 -274 -272 -251 -220 -194 -183 -195 -220 -239 -236 -223 -224 -244 -272 -299 -323 -334 -323 -300 -286 -281 -268 -239 -205 -185 -182 -200
6517 -200 -249 -322 -388 -421 -421 -401 -371 -337 -315 -313 -317 -309 -294 -289 -287 -263 -214 -167 -147 -156 -182 -212 -235 -245 -248 -252 -253 -244 -230 -224 -228 -224 -206 -193 -206 -242 -285 -323 -350 -357 -344 -320
6499 -320 -308 -316 -335 -342 -319 -272 -227 -202 -194 -188 -186 -201 -228 -249 -260 -272 -292 -308 -311 -309 -306 -295 -268 -234 -208 -189 -176 -174 -186 -206 -227 -257 -295 -319 -303 -256 -210 -189 -183 -169
6482 -169 -142 -113 -98 -104 -122 -134 -128 -111 -105 -118 -139 -156 -169 -182 -196 -210 -219 -221 -211 -192 -171 -162 -178 -216 -258 -281 -282 -275 -278 -283 -274 -249 -223 -201 -177 -145 -115 -105 -115 -130
6464 -130 -136 -131 -129 -149 -189 -228 -247 -246 -242 -253 -273 -283 -272 -252 -245 -255 -265 -257 -234 -223 -243 -271 -276 -244 -196 -153 -123 -108 -108 -122 -143 -165 -191 -228 -265 -285 -278 -254 -230 -218
6447 -218 -226 -259 -306 -349 -369 -362 -343 -327 -321 -320 -320 -315 -298 -272 -249 -244 -256 -276 -298 -328 -358 -378 -382 -377 -374 -372 -365 -355 -349 -351 -358 -363 -351 -320 -282 -259 -257 -263 -269 -281 -305 -321 -306 -269
6428 -269 -238 -228 -226 -218 -203 -187 -172 -162 -161 -170 -186 -207 -229 -246 -252 -251 -256 -266 -268 -257 -246 -249 -262 -274 -275 -269 -261 -256 -252 -241 -223 -204 -193 -186 -172 -148 -126 -113 -104 -95 -99 -124 -160 -187
6409 -187 -196 -191 -173 -143 -106 -78 -71 -86 -120 -165 -209 -240 -255 -264 -278 -294 -304 -301 -286 -269 -252 -232 -209 -196 -206 -235 -260 -264 -252 -243 -242 -241 -239 -240 -245 -245 -233 -221 -222 -232 -233 -219
6391 -219 -203 -198 -204 -217 -236 -267 -307 -343 -363 -371 -379 -391 -398 -384 -346 -298 -258 -230 -202 -162 -120 -94 -94 -110 -125 -142 -171 -206 -226 -217 -196 -187 -198 -212 -214 -209 -212 -224 -232 -228 -225 -234
6372 -234 -253 -267 -269 -266 -257 -233 -193 -151 -124 -111 -106 -108 -119 -135 -151 -171 -193 -204 -191 -165 -149 -155 -169 -184 -203 -232 -259 -274 -280 -288 -296 -298 -293 -286 -278 -270 -268 -273 -282 -290 -298 -304 -306 -309 -325 -353
6353 -353 -377 -386 -387 -392 -395 -388 -377 -374 -373 -356 -323 -292 -274 -263 -253 -247 -251 -261 -268 -269 -266 -258 -245 -226 -196 -159 -126 -114 -125 -148 -173 -196 -214 -222 -224 -228 -237 -248 -256 -259 -251 -228 -201 -186 -183
6333 -183 -177 -163 -157 -174 -196 -198 -180 -163 -158 -156 -148 -144 -156 -176 -185 -175 -156 -145 -150 -167 -187 -199 -193 -164 -111 -52 -18 -34 -89 -151 -192 -213 -230 -250 -267 -283 -309 -344 -369 -367
6316 -367 -337 -299 -273 -266 -272 -280 -279 -268 -252 -229 -194 -153 -125 -122 -134 -143 -143 -148 -166 -187 -198 -200 -208 -229 -261 -288 -296 -282 -254 -226 -215 -229 -264 -302 -319 -312 -300 -302 -307 -288 -247 -216
6297 -216 -226 -262 -285 -274 -238 -195 -159 -146 -162 -194 -217 -215 -193 -172 -166 -179 -202 -221 -227 -227 -233 -248 -262 -265 -261 -260 -265 -268 -259 -238 -217 -208 -209 -211 -214 -226 -241 -242 -226 -216 -227 -249 -262
6279 -262 -264 -269 -274 -265 -248 -249 -279 -315 -333 -334 -331 -327 -317 -308 -312 -330 -348 -355 -351 -344 -341 -342 -343 -340 -328 -297 -252 -211 -191 -188 -176 -139 -88 -53 -44 -45 -45 -51 -72 -103 -129 -140 -142 -148 -163 -179 -185
6258 -185 -175 -159 -148 -148 -159 -180 -205 -221 -220 -209 -200 -196 -193 -195 -213 -241 -260 -260 -246 -227 -211 -208 -226 -251 -255 -233 -216 -230 -263 -289 -300 -308 -318 -326 -324 -313 -294 -272 -257 -253 -252 -237
6240 -237 -205 -166 -131 -117 -139 -201 -283 -354 -390 -390 -366 -333 -299 -267 -233 -205 -194 -202 -217 -234 -254 -279 -298 -299 -284 -260 -230 -195 -168 -163 -175 -188 -192 -192 -197 -210 -230 -252
6224 -252 -269 -277 -278 -272 -252 -221 -197 -196 -206 -203 -180 -157 -151 -156 -163 -177 -205 -244 -280 -301 -305 -302 -302 -305 -298 -271 -232 -199 -188 -199 -223 -243 -252 -251 -251 -254 -253 -241 -220 -193 -171 -168 -193 -231
6205 -231 -253 -251 -249 -258 -260 -240 -215 -212 -223 -224 -217 -220 -233 -234 -220 -213 -225 -244 -263 -287 -306 -300 -264 -222 -193 -166 -131 -104 -107 -134 -162 -184 -204 -220 -231 -236 -237 -225 -194 -152 -112 -76
6187 -76 -55 -67 -113 -161 -175 -150 -101 -34 59 161 232 249 220 168 108 48 0 -28 -46 -67 -93 -112 -109 -92 -83 -104 -149 -193 -219 -235 -254 -275 -293 -309 -323 -320
6171 -320 -290 -246 -216 -212 -220 -225 -227 -228 -230 -226 -215 -199 -183 -174 -177 -192 -212 -228 -232 -216 -183 -152 -139 -143 -148 -144 -136 -138 -154 -177 -191 -187 -173 -162 -159 -150 -131 -115 -118 -135 -151 -164 -190 -231
6152 -231 -264 -271 -262 -256 -253 -240 -214 -190 -186 -202 -220 -230 -228 -216 -200 -187 -186 -200 -223 -248 -280 -320 -359 -377 -364 -327 -273 -211 -157 -136 -153 -183 -205 -218 -234 -245 -238 -210 -177
6135 -177 -150 -135 -137 -156 -180 -196 -203 -210 -220 -227 -237 -257 -285 -306 -312 -310 -305 -298 -290 -285 -278 -258 -229 -211 -212 -217 -208 -192 -190 -208 -227 -230 -212 -176 -130 -85 -58 -63 -91 -119 -128 -121 -113 -120 -149
6115 -149 -194 -243 -276 -279 -260 -242 -244 -264 -293 -322 -338 -324 -290 -263 -259 -260 -236 -193 -157 -139 -127 -122 -138 -168 -182 -168 -152 -155 -165 -162 -153 -159 -180 -197 -200 -197 -195 -185 -160 -129 -107
6098 -107 -108 -134 -173 -200 -204 -195 -189 -184 -167 -135 -109 -107 -128 -153 -168 -166 -153 -140 -130 -112 -72 -18 27 50 60 67 74 70 52 22 -8 -24 -13 19 54 70 59 27 -16 -64
6080 -64 -108 -146 -184 -227 -265 -283 -281 -273 -268 -256 -233 -210 -204 -214 -221 -218 -212 -215 -223 -227 -220 -202 -178 -165 -174 -200 -221 -222 -205 -186 -171 -163 -168 -190 -216 -229 -231 -234 -243 -252 -255 -255 -259 -264 -268 -267 -261 -247
6059 -247 -226 -201 -167 -123 -83 -60 -60 -72 -87 -102 -107 -88 -46 7 69 154 275 428 598 763 892 946 900 768 592 421 282 182 112 57 7
6046 7 -41 -86 -130 -169 -199 -211 -205 -190 -175 -168 -173 -188 -202 -200 -181 -165 -177 -220 -267 -284 -267 -245 -242 -247 -239 -222 -219 -234 -250 -252 -247 -248 -249 -242 -226 -205 -182 -169 -180 -212 -240 -249 -249
6027 -249 -257 -264 -259 -246 -243 -252 -262 -263 -256 -242 -217 -194 -187 -193 -191 -172 -151 -151 -175 -202 -210 -200 -194 -206 -228 -238 -233 -229 -236 -247 -252 -259 -282 -312 -332 -334 -325 -312 -296 -278 -257 -235 -214 -203 -203
6008 -203 -201 -188 -177 -183 -198 -196 -170 -142 -135 -151 -183 -225 -267 -298 -309 -304 -289 -269 -253 -252 -269 -288 -296 -293 -290 -296 -309 -324 -339 -345 -330 -286 -228 -184 -171 -178 -182 -181 -192 -222 -254 -275
5990 -275 -293 -318 -345 -359 -358 -347 -322 -282 -241 -217 -208 -198 -190 -200 -235 -276 -306 -317 -306 -269 -213 -160 -131 -131 -144 -154 -154 -153 -157 -163 -158 -143 -142 -173 -225 -268 -288 -292 -289 -279 -264
5972 -264 -254 -252 -250 -249 -249 -243 -224 -201 -190 -190 -188 -184 -191 -208 -222 -226 -233 -250 -265 -272 -278 -287 -293 -293 -297 -311 -325 -333 -338 -346 -356 -364 -375 -389 -400 -405 -405 -399 -385 -370 -362 -349 -308 -245 -193 -172 -163 -144
5951 -144 -116 -97 -88 -83 -83 -93 -109 -131 -165 -207 -234 -232 -220 -220 -228 -229 -225 -232 -255 -280 -300 -309 -302 -280 -261 -256 -254 -242 -225 -224 -241 -263 -280 -292 -294 -279 -257 -246 -256 -276 -302 -331
5933 -331 -358 -369 -359 -332 -293 -243 -189 -149 -133 -140 -159 -177 -189 -202 -224 -246 -244 -215 -183 -172 -174 -166 -147 -138 -152 -181 -214 -243 -258 -251 -232 -217 -214 -219 -239 -275 -308 -314 -295
5916 -295 -272 -251 -225 -198 -187 -187 -175 -146 -126 -132 -147 -143 -125 -116 -121 -124 -108 -77 -44 -23 -21 -38 -64 -95 -132 -168 -193 -197 -185 -166 -151 -146 -156 -177 -200 -222 -242 -264 -288
5899 -288 -310 -323 -314 -279 -237 -211 -201 -184 -153 -125 -125 -154 -194 -223 -230 -220 -210 -216 -233 -239 -222 -187 -145 -106 -78 -69 -83 -112 -145 -177 -206 -231 -249 -257 -254 -249 -251 -259 -265 -265 -266 -279
5881 -279 -295 -298 -286 -263 -235 -201 -170 -154 -153 -162 -181 -211 -243 -261 -267 -268 -263 -239 -198 -154 -120 -98 -88 -89 -91 -86 -83 -104 -146 -186 -215 -242 -267 -276 -263 -241 -226 -213 -204 -206 -217
5863 -217 -214 -187 -156 -136 -120 -96 -78 -83 -108 -129 -140 -148 -153 -155 -163 -184 -213 -232 -240 -245 -247 -241 -228 -219 -217 -221 -234 -260 -297 -334 -365 -385 -388 -370 -340 -312 -293 -286 -294 -317 -342 -348 -327
5844 -327 -291 -256 -234 -224 -219 -211 -193 -168 -144 -136 -156 -202 -252 -276 -265 -235 -206 -184 -169 -166 -179 -205 -238 -274 -308 -325 -320 -305 -289 -276 -264 -256 -252 -245 -237 -238 -247 -251 -245 -243 -259 -282
5826 -282 -296 -300 -293 -274 -245 -223 -217 -211 -197 -187 -194 -206 -206 -202 -214 -238 -249 -240 -227 -221 -223 -232 -241 -243 -236 -236 -253 -277 -290 -291 -291 -289 -278 -269 -279 -299 -304 -290 -280 -292 -319 -346 -365 -375 -373
5807 -373 -367 -363 -360 -348 -331 -319 -314 -307 -305 -321 -347 -351 -319 -273 -235 -211 -189 -166 -147 -132 -119 -110 -112 -132 -167 -200 -211 -198 -178 -166 -166 -173 -194 -230 -260 -266 -255 -246 -241 -228 -207 -189
5789 -189 -175 -163 -163 -196 -253 -303 -325 -321 -295 -247 -186 -134 -106 -99 -105 -126 -157 -183 -196 -198 -194 -188 -189 -206 -230 -244 -247 -250 -253 -248 -242 -249 -273 -295 -304 -299 -278 -236 -186 -153 -154 -178 -207
5770 -207 -225 -223 -198 -167 -154 -155 -152 -146 -159 -192 -222 -231 -229 -230 -231 -224 -217 -219 -227 -241 -271 -314 -344 -334 -286 -226 -175 -147 -137 -137 -141 -154 -185 -224 -249 -255 -259 -263 -257 -237 -220 -219 -228 -239 -253
5750 -253 -271 -288 -307 -335 -368 -389 -391 -378 -350 -307 -272 -270 -291 -294 -258 -207 -169 -148 -147 -175 -225 -261 -261 -241 -227 -219 -210 -207 -214 -217 -210 -203 -202 -192 -171 -173 -220 -288 -334 -348 -346 -329
5732 -329 -291 -246 -217 -214 -228 -256 -294 -323 -329 -323 -322 -322 -310 -292 -284 -290 -301 -319 -340 -349 -339 -326 -326 -330 -323 -313 -314 -316 -303 -280 -264 -254 -241 -226 -215 -196 -166 -146 -154 -171 -172 -165 -172
5714 -172 -186 -176 -144 -124 -134 -160 -182 -196 -203 -209 -222 -246 -258 -242 -212 -195 -192 -190 -195 -225 -267 -294 -299 -298 -299 -294 -288 -289 -287 -271 -255 -259 -274 -269 -239 -204 -173 -140 -113 -113 -142 -173
5695 -173 -198 -223 -239 -227 -191 -161 -155 -162 -169 -182 -203 -219 -223 -225 -230 -229 -217 -202 -188 -176 -169 -173 -180 -181 -184 -198 -206 -188 -151 -127 -127 -143 -171 -210 -240 -235 -205 -177 -156 -128 -99 -96 -119
5677 -119 -138 -144 -150 -150 -127 -93 -80 -92 -100 -102 -129 -186 -234 -252 -258 -269 -273 -264 -267 -290 -304 -288 -261 -250 -255 -269 -295 -322 -322 -288 -253 -245 -253 -264 -278 -295 -298 -286 -275 -263 -227 -168
5659 -168 -132 -147 -188 -218 -233 -249 -259 -251 -232 -220 -220 -228 -248 -271 -286 -299 -334 -388 -424 -420 -393 -366 -340 -318 -314 -320 -308 -273 -245 -238 -231 -210 -192 -187 -175 -145 -128 -141 -158
5642 -158 -155 -138 -126 -112 -94 -90 -110 -130 -137 -148 -170 -179 -164 -159 -186 -228 -255 -271 -280 -270 -241 -221 -214 -185 -127 -78 -65 -62 -48 -49 -83 -120 -136 -150 -182 -207 -207 -213 -247 -272
5624 -272 -254 -217 -199 -183 -146 -113 -113 -121 -107 -97 -124 -159 -158 -136 -127 -122 -94 -65 -70 -92 -94 -82 -79 -76 -63 -70 -123 -186 -214 -224 -245 -256 -235 -219 -241 -260 -226 -174 -171 -212
5607 -212 -241 -249 -265 -269 -232 -188 -188 -206 -180 -114 -67 -49 -30 -16 -34 -58 -53 -45 -79 -128 -135 -122 -136 -149 -104 -34 -20 -59 -80 -68 -63 -55 -1 67 80 49 39 44 11
5590 11 -42 -59 -56 -87 -119 -82 -8 7 -25 -19 25 37 22 51 100 87 38 52 118 138 113 131 182 174 129 152 233 260 247 307 426 476 458 500 610 685
5574 685 762 983 1298 1502 1576 1693 1854 1865 1718 1648 1727 1779 1760 1849 2068 2220 2297 2531 2934 3271 3574 4170 5098 6108 7331 9160
5563 9160 11264 12729 13592 15158 18207 22224 27350 35378 46591 56532 58842 51906 40668 31103 24791 19893 15312
5556 15312 11738 9570 8070 6670 5608 5013 4469 3758 3188 2925 2680 2287 1980 1897 1822 1616 1450 1428 1382 1222 1107 1116 1092
5546 1092 944 812 776 710 546 423 421 416 322 238 236 223 143 102 162 219 192 154 172 172 106 57 90 132 119 103 132 150 114 85 105 117 83 61
5531 61 86 94 51 25 56 65 -3 -82 -104 -104 -126 -132 -87 -44 -48 -66 -68 -95 -158 -185 -132 -69 -61 -70 -53 -52 -108 -169 -183 -186 -225 -257 -237 -198 -188 -179 -128 -77 -78 -105 -103 -78
5513 -78 -64 -49 -20 -11 -48 -87 -83 -67 -74 -73 -30 16 17 -1 7 26 13 -11 -4 25 41 60 114 178 215 248 324 446 603 817 1109 1455 1830 2240 2634
5498 2634 2847 2739 2362 1903 1492 1142 848 630 483 370 287 252 245 224 193 192 213 209 168 120 82 40 -2 -22 -25 -39 -64 -75 -74 -83 -95 -93 -89
5483 -89 -110 -144 -154 -136 -121 -113 -92 -65 -61 -83 -102 -113 -126 -135 -117 -91 -95 -136 -180 -206 -223 -232 -225 -214 -217 -225 -220 -221 -254 -301 -318 -306 -297 -296 -274 -236 -217 -225 -231 -223 -225 -245 -256
5465 -256 -248 -234 -216 -183 -143 -120 -115 -106 -95 -108 -147 -185 -206 -225 -239 -234 -221 -227 -240 -223 -177 -151 -170 -204 -224 -243 -274 -308 -331 -348 -354 -330 -281 -235 -210 -194 -186 -194 -216
5448 -216 -234 -247 -277 -321 -348 -346 -333 -318 -287 -244 -221 -221 -209 -166 -118 -95 -90 -91 -99 -112 -115 -106 -103 -108 -102 -91 -105 -149 -187 -198 -201 -203 -181 -131 -96 -105 -127 -116 -84 -69 -74 -77
5430 -77 -78 -99 -141 -187 -223 -244 -242 -218 -195 -191 -197 -195 -184 -169 -153 -143 -152 -170 -162 -108 -43 -11 -18 -41 -66 -93 -114 -120 -117 -117 -124 -143 -179 -223 -251 -252 -247 -245 -236 -213 -198 -210 -230
5411 -230 -235 -232 -236 -238 -227 -214 -219 -233 -240 -248 -275 -310 -331 -333 -322 -294 -244 -194 -173 -178 -183 -175 -163 -154 -151 -156 -170 -173 -155 -131 -127 -151 -191 -238 -284 -305 -288 -248 -213 -193 -184 -183 -186 -183 -172
5391 -172 -172 -192 -211 -211 -205 -213 -225 -222 -213 -224 -252 -266 -254 -230 -205 -180 -162 -163 -174 -179 -171 -160 -147 -133 -126 -136 -145 -132 -110 -110 -133 -148 -144 -142 -157 -181 -199 -215 -236 -254 -262 -261 -257
5373 -257 -257 -267 -281 -282 -264 -236 -207 -168 -121 -98 -116 -141 -128 -90 -83 -130 -197 -245 -273 -293 -301 -294 -281 -271 -259 -248 -247 -249 -238 -210 -182 -164 -155 -155 -173 -207 -243 -281 -325
5356 -325 -361 -361 -327 -286 -259 -233 -201 -167 -139 -115 -106 -127 -171 -200 -189 -161 -150 -166 -199 -234 -247 -223 -177 -146 -148 -165 -188 -226 -280 -315 -303 -260 -223 -201 -186 -176
5340 -176 -178 -193 -212 -232 -256 -278 -286 -282 -268 -250 -236 -236 -242 -229 -192 -165 -174 -203 -216 -202 -179 -162 -149 -140 -132 -121 -105 -98 -113 -140 -154 -156 -162 -181 -197 -196 -181 -161 -145 -136 -135 -136
5322 -136 -129 -106 -73 -44 -25 -5 32 84 116 97 34 -38 -98 -146 -180 -190 -182 -184 -212 -250 -272 -277 -277 -271 -260 -253 -256 -252 -225 -186 -164 -170 -187 -200 -206 -210 -211 -214 -226 -247 -268 -276
5304 -276 -262 -231 -198 -185 -198 -221 -236 -241 -249 -259 -264 -258 -243 -226 -218 -224 -234 -234 -224 -222 -229 -228 -213 -207 -231 -269 -290 -284 -270 -263 -265 -275 -290 -299 -289 -273 -268 -271 -267 -254 -247 -250 -249 -240 -237 -246 -259
5284 -259 -266 -272 -284 -303 -325 -348 -359 -343 -304 -261 -230 -202 -171 -144 -135 -149 -177 -206 -222 -213 -185 -159 -153 -159 -158 -142 -121 -110 -110 -117 -127 -143 -170 -212 -260 -298 -318 -324 -323 -325 -325
5266 -325 -316 -297 -275 -258 -248 -239 -234 -239 -249 -253 -246 -241 -243 -248 -253 -261 -273 -274 -256 -237 -237 -254 -267 -264 -251 -239 -232 -235 -250 -274 -300 -324 -342 -347 -342 -347 -378 -419 -437 -426 -407 -396 -390 -378 -364
5246 -364 -356 -362 -383 -410 -429 -432 -421 -405 -376 -329 -275 -237 -224 -227 -233 -232 -217 -188 -161 -158 -175 -190 -195 -201 -214 -221 -215 -209 -220 -245 -268 -287 -305 -324 -338 -335 -308 -260 -209 -179 -180 -206
5228 -206 -243 -276 -288 -278 -259 -248 -247 -249 -254 -267 -280 -279 -260 -232 -198 -155 -110 -84 -86 -106 -133 -169 -212 -254 -289 -314 -324 -313 -288 -265 -246 -216 -177 -153 -161 -184 -198 -196
5212 -196 -191 -192 -206 -234 -274 -310 -327 -324 -311 -295 -280 -269 -265 -261 -250 -236 -231 -242 -264 -277 -266 -234 -207 -199 -195 -176 -151 -143 -157 -171 -177 -190 -217 -245 -262 -272 -274 -260 -233 -214
5194 -214 -214 -212 -188 -151 -123 -109 -98 -89 -87 -86 -88 -109 -157 -208 -229 -221 -211 -216 -231 -253 -280 -298 -286 -251 -223 -220 -233 -250 -273 -304 -328 -328 -308 -284 -271 -270 -275 -276 -265 -238 -196
5176 -196 -146 -101 -77 -81 -105 -142 -196 -266 -329 -353 -330 -284 -239 -204 -177 -160 -154 -152 -146 -137 -132 -140 -167 -201 -223 -219 -200 -187 -191 -206 -222 -230 -221 -198 -179 -181 -195 -191 -163 -132 -122
5159 -122 -131 -152 -188 -237 -282 -296 -274 -233 -191 -151 -114 -86 -77 -87 -104 -111 -104 -90 -77 -72 -86 -128 -191 -248 -277 -282 -279 -273 -258 -237 -223 -218 -211 -192 -162 -126 -98 -95 -127 -179
5141 -179 -221 -237 -239 -249 -268 -284 -278 -244 -190 -136 -100 -89 -92 -98 -97 -89 -78 -72 -79 -93 -108 -122 -136 -147 -153 -162 -185 -212 -224 -213 -195 -187 -193 -207 -228 -253 -274 -286 -286 -274 -251
5124 -251 -229 -222 -226 -225 -211 -191 -181 -184 -194 -207 -220 -230 -233 -232 -230 -227 -224 -221 -207 -180 -153 -148 -169 -192 -195 -187 -188 -205 -226 -228 -207 -171 -140 -130 -142 -165 -189 -214 -240 -262 -273 -265 -237
5105 -237 -199 -175 -182 -207 -223 -218 -204 -193 -186 -192 -218 -258 -286 -291 -290 -302 -322 -328 -317 -304 -302 -313 -331 -352 -364 -354 -321 -281 -252 -245 -252 -260 -264 -274 -295 -311 -303 -280 -268 -283 -307
5087 -307 -322 -329 -336 -341 -339 -336 -340 -353 -368 -383 -392 -384 -356 -322 -300 -293 -293 -294 -290 -275 -254 -246 -260 -284 -293 -283 -262 -238 -213 -195 -189 -190 -194 -206 -228 -248 -245 -222 -196 -176 -166 -172 -203 -243
5068 -243 -268 -272 -267 -257 -235 -209 -201 -217 -235 -234 -224 -223 -236 -245 -242 -229 -211 -193 -179 -174 -178 -187 -198 -211 -222 -227 -227 -225 -219 -202 -178 -157 -150 -150 -140 -115 -91 -87 -106 -133 -154 -165 -171 -174
5049 -174 -175 -183 -200 -217 -223 -216 -203 -192 -191 -204 -227 -245 -258 -273 -294 -303 -288 -263 -252 -252 -242 -215 -188 -178 -180 -178 -170 -165 -174 -199 -233 -258 -263 -251 -241 -239 -238 -232 -227 -232 -247 -266 -284 -294
5030 -294 -290 -273 -258 -255 -262 -263 -253 -242 -239 -249 -266 -276 -267 -238 -201 -166 -138 -116 -104 -103 -111 -125 -142 -157 -162 -155 -138 -114 -90 -78 -89 -121 -152 -169 -176 -189 -216 -244 -253 -234 -202
5012 -202 -180 -182 -204 -228 -248 -266 -283 -296 -303 -313 -327 -337 -330 -302 -269 -246 -239 -239 -236 -232 -240 -261 -281 -283 -276 -277 -292 -311 -326 -335 -341 -339 -334 -327 -316 -303 -297 -302 -305 -287 -253 -223 -205 -190
4993 -190 -175 -178 -204 -226 -219 -184 -144 -117 -107 -115 -135 -152 -149 -131 -118 -114 -108 -92 -79 -86 -111 -140 -160 -174 -193 -220 -250 -274 -288 -289 -278 -255 -234 -228 -237 -244 -235 -216 -203 -203 -208 -213
4975 -213 -217 -219 -218 -216 -217 -215 -203 -182 -167 -175 -200 -224 -230 -226 -231 -258 -292 -313 -315 -309 -301 -286 -255 -216 -186 -177 -187 -207 -228 -246 -257 -255 -234 -207 -202 -232 -272 -278 -237 -181 -149 -149 -161 -167
4956 -167 -163 -153 -148 -155 -163 -152 -112 -61 -29 -28 -50 -73 -85 -91 -108 -140 -173 -191 -201 -218 -239 -243 -222 -196 -187 -196 -211 -228 -236 -219 -176 -130 -108 -106 -109 -116 -132 -148 -149 -143 -150 -172 -186
4937 -186 -181 -175 -180 -183 -166 -128 -87 -55 -35 -33 -48 -69 -80 -76 -70 -81 -107 -127 -121 -91 -59 -44 -52 -79 -119 -157 -175 -173 -173 -188 -209 -214 -196 -167 -143 -133 -136 -145 -150 -150 -153 -163 -177
4919 -177 -191 -205 -213 -204 -179 -158 -156 -164 -167 -165 -172 -189 -205 -209 -196 -170 -144 -136 -137 -123 -86 -53 -49 -62 -71 -77 -93 -111 -115 -107 -101 -93 -66 -23 10 29 49 75 95 107 132 178 238
4900 238 301 367 428 462 462 442 411 363 294 224 171 137 116 100 71 16 -52 -103 -121 -129 -148 -168 -176 -175 -175 -166 -137 -100 -77 -72 -79 -98 -134 -175 -208 -230 -242 -242 -227
4883 -227 -209 -194 -170 -129 -89 -77 -93 -117 -132 -134 -123 -105 -106 -138 -179 -188 -157 -116 -93 -85 -73 -48 -21 -4 -5 -16 -22 -14 -1 8 13 19 25 27 29 35 43 51 66 80 77 55 38
4864 38 44 59 59 49 49 60 67 73 93 119 127 113 105 113 120 113 110 127 156 176 192 223 279 348 412 458 484 503 527 558 583 593 597 608 629 650 665 674 672 652 625 615
4846 615 642 704 777 849 929 1030 1143 1249 1349 1456 1569 1658 1702 1712 1717 1733 1764 1821 1913 2031 2156 2289 2450 2658 2928 3273 3702 4216
4834 4216 4808 5484 6276 7232 8414 9871 11626 13672 15977 18418 20680 22268 22720 21890 20036 17637 15139 12823 10812
4826 10812 9126 7740 6612 5700 4949 4305 3742 3264 2875 2556 2287 2065 1889 1748 1625 1509 1395 1277 1165 1083 1039 1014 984
4816 984 952 930 921 921 931 955 987 1025 1074 1141 1223 1307 1374 1397 1350 1244 1119 1006 898 781 670 588 539 500 459 421 395 376 356 329 292 245 200
4802 200 164 132 95 60 39 35 41 57 85 116 132 125 102 77 61 62 75 84 77 71 86 115 132 128 118 109 89 52 15 0 3 5 -6 -26 -40 -43 -35 -30 -35 -51 -65 -72 -75
4783 -75 -81 -84 -78 -57 -30 -3 17 35 55 73 89 107 130 152 152 127 101 101 125 143 137 114 89 61 27 -4 -20 -23 -31 -55 -81 -84 -63 -39 -35 -45 -51 -44 -42 -65 -108 -156
4765 -156 -195 -219 -228 -220 -197 -164 -133 -119 -131 -154 -161 -141 -115 -108 -117 -123 -122 -122 -128 -129 -129 -140 -164 -184 -188 -179 -166 -155 -147 -146 -150 -154 -155 -159 -173 -191 -204 -206 -196 -176 -160 -164 -192 -226 -246
$$ [...]
-3131a59
##END=	
##END=	
