##TITLE=	Jan12-2022.10.fid
TM-VI-221

##JCAMP-DX=	6.0	$$ MestReNova 14.3.1-31739
##DATA TYPE=	LINK
##BLOCK_ID=	1
##BLOCKS=	2    
##ORIGIN=	Mestrelab Research S.L.
##OWNER=	hrzepa
##$MNOVA/LINK_BLOCK_TYPE=	ITEM	$$ NMR Spectrum
##$MNOVA/ITEM/POLYGON=	(XY..XY)
5321,5835
8722,5835
8722,8208
5321,8208
5321,5835
##$MNOVA/ITEM/Z=	0
##$MNOVA/ITEM/ANGLE=	0
##TITLE=	Jan12-2022.10.fid
##JCAMP-DX=	6.0	$$ MestReNova 14.3.1-31739
##BLOCK_ID=	2
##DATA TYPE=	MNOVA NMR VIEW DATA
##DATA CLASS=	MNOVA VIEW DATA
##$MNOVA/ITEM/ZOOM/X=	-4.0107147498308073352,	16.011019999997905927
##$MNOVA/ITEM/ZOOM/Y=	-1740.4130678176879883,	19094.23828125
##END=	
##TITLE=	Jan12-2022.10.fid
##JCAMP-DX=	6.0	$$ MestReNova 14.3.1-31739
##BLOCK_ID=	3
##DATA TYPE=	NMR SPECTRUM
##DATA CLASS=	XYDATA
##NUMDIM=	1
##ORIGIN=	Bruker BioSpin GmbH
##OWNER=	nmr
##.OBSERVE FREQUENCY=	400.20240119999999706
##.OBSERVE NUCLEUS=	^1H
##.SOLVENT NAME=	CDCl3
##.PULSE SEQUENCE=	zg30
##LONGDATE=	2022/01/12 11:03:00.000
##.ACQUISITIONMODE=	SIMULTANEOUS (DQD)
##$ORIGINAL FORMAT=	Bruker XWIN-NMR
##$MNOVA/SCALES_VERSION=	9
##$PARAMETER FILE=	(acqus, ASCII, /private/var/folders/f6/rjf_tdyn2v98c5c0wvkgn4s80000gn/T/7A2T+PGWSC217dOy85dfFA/10/acqus, 0)
$$ ##TITLE= Parameter file, TOPSPIN		Version 3.2
$$ ##JCAMPDX= 5.0
$$ ##DATATYPE= Parameter Values
$$ ##NPOINTS= 11	$$ modification sequence number
$$ ##ORIGIN= Bruker BioSpin GmbH
$$ ##OWNER= nmr
$$ $$ 2022-01-12 11:03:25.903 +0000  nmr@CZC2439F63
$$ $$ /opt/topspin/data/agmb/nmr/Jan12-2022/10/acqus
$$ $$ process /opt/topspin3.2/prog/mod/shimcntl
$$ ##$ACQT0= -2.36344537815126
$$ ##$AMP= (0..31)
$$ 100 100 100 100 100 100 100 100 100 100 100 100 100 100 100 100 100 100
$$ 100 100 100 100 100 100 100 100 100 100 100 100 100 100
$$ ##$AMPCOIL= (0..19)
$$ 0 0 0 0 0 0 0 0 0 0 0 0 0 0 0 0 0 0 0 0
$$ ##$ANAVPT= -1
$$ ##$AQSEQ= 0
$$ ##$AQ_mod= 3
$$ ##$AUNM= <au_zg>
$$ ##$AUTOPOS= <31 >
$$ ##$BF1= 400.2
$$ ##$BF2= 400.2
$$ ##$BF3= 400.2
$$ ##$BF4= 400.2
$$ ##$BF5= 400.2
$$ ##$BF6= 400.2
$$ ##$BF7= 400.2
$$ ##$BF8= 400.2
$$ ##$BYTORDA= 0
$$ ##$CAGPARS= (0..11)
$$ 0 0 0 0 0 0 0 0 0 0 0 0
$$ ##$CFDGTYP= 0
$$ ##$CFRGTYP= 9
$$ ##$CHEMSTR= <none>
$$ ##$CNST= (0..63)
$$ 1 1 145 1 1 1 1 1 1 1 1 1 1 1 1 1 1 1 1 1 1 1 1 1 1 1 1 1 1 1 1 1 1 1 1
$$ 1 1 1 1 1 1 1 1 1 1 1 1 1 1 1 1 1 1 1 1 1 1 1 1 1 1 1 1 1
$$ ##$CPDPRG= (0..8)
$$ <> <> <> <> <mlev> <mlev> <mlev> <mlev> <mlev>
$$ ##$D= (0..63)
$$ 0 1 0 0 0 0 0 0 0 0.06 0 0 0 0 0 0 0.0002 0 0 0 0 0 0 0 0 0 0 0 0 0 0 0
$$ 0 0 0 0 0 0 0 0 0 0 0 0 0 0 0 0 0 0 0 0 0 0 0 0 0 0 0 0 0 0 0 0
$$ ##$DATE= 1641985405
$$ ##$DE= 6.5
$$ ##$DECBNUC= <off>
$$ ##$DECIM= 2496
$$ ##$DECNUC= <off>
$$ ##$DECSTAT= 4
$$ ##$DIGMOD= 1
$$ ##$DIGTYP= 12
$$ ##$DQDMODE= 0
$$ ##$DR= 22
$$ ##$DS= 2
$$ ##$DSPFIRM= 0
$$ ##$DSPFVS= 20
$$ ##$DTYPA= 0
$$ ##$EXP= <proton>
$$ ##$F1LIST= <111111111111111>
$$ ##$F2LIST= <222222222222222>
$$ ##$F3LIST= <333333333333333>
$$ ##$FCUCHAN= (0..9)
$$ 0 2 0 0 0 0 0 0 0 0
$$ ##$FL1= 90
$$ ##$FL2= 90
$$ ##$FL3= 90
$$ ##$FL4= 90
$$ [...]
$$ ##$Sgu3PowerLevels= (0..7)
$$ 0 0 0 0 0 0 0 0
$$ ##$Sgu4PowerLevels= (0..7)
$$ 0 0 0 0 0 0 0 0
$$ ##$Sgu5PowerLevels= (0..7)
$$ 0 0 0 0 0 0 0 0
$$ ##$Sgu6PowerLevels= (0..7)
$$ 0 0 0 0 0 0 0 0
$$ ##$Sgu7PowerLevels= (0..7)
$$ 0 0 0 0 0 0 0 0
$$ ##$Sgu8PowerLevels= (0..7)
$$ 0 0 0 0 0 0 0 0
$$ ##$SguType= 3
$$ ##$ShimPowMaxUA= (0..63)
$$ 130000 130000 130000 130000 130000 130000 130000 130000 130000 130000 130000
$$ 130000 130000 130000 130000 130000 130000 130000 130000 130000 0 0 0 0
$$ 0 0 0 0 0 0 0 0 0 0 0 0 0 0 0 0 0 0 0 0 0 0 0 0 0 0 0 0 0 0 0 0 0 0 0 0
$$ 0 0 0 0
$$ ##$ShimPowMaxUC= (0..63)
$$ 130000 130000 130000 130000 130000 130000 130000 130000 130000 130000 130000
$$ 130000 130000 130000 130000 130000 130000 130000 130000 130000 0 0 0 0
$$ 0 0 0 0 0 0 0 0 0 0 0 0 0 0 0 0 0 0 0 0 0 0 0 0 0 0 0 0 0 0 0 0 0 0 0 0
$$ 0 0 0 0
$$ ##$ShimPowMaxUG= (0..63)
$$ 524287 524287 524287 524287 524287 524287 524287 524287 524287 524287 524287
$$ 524287 524287 524287 524287 524287 524287 524287 524287 524287 0 0 0 0
$$ 0 0 0 0 0 0 0 0 0 0 0 0 0 0 0 0 0 0 0 0 0 0 0 0 0 0 0 0 0 0 0 0 0 0 0 0
$$ 0 0 0 0
$$ ##$ShimPowRcbType= 3
$$ ##$ShimPowRes= (0..63)
$$ 1e-20 1e-20 1e-20 1e-20 1e-20 1e-20 1e-20 1e-20 1e-20 1e-20 1e-20 1e-20
$$ 1e-20 1e-20 1e-20 1e-20 1e-20 1e-20 1e-20 1e-20 0 0 0 0 0 0 0 0 0 0 0 0
$$ 0 0 0 0 0 0 0 0 0 0 0 0 0 0 0 0 0 0 0 0 0 0 0 0 0 0 0 0 0 0 0 0
$$ ##$ShimPowRng0= (0..63)
$$ 1 1 1 1 1 1 1 1 1 1 1 1 1 1 1 1 1 1 1 1 0 0 0 0 0 0 0 0 0 0 0 0 0 0 0 0
$$ 0 0 0 0 0 0 0 0 0 0 0 0 0 0 0 0 0 0 0 0 0 0 0 0 0 0 0 0
$$ ##$ShimPowRng1= (0..63)
$$ 1 1 1 1 1 1 1 1 1 1 1 1 1 1 1 1 1 1 1 1 0 0 0 0 0 0 0 0 0 0 0 0 0 0 0 0
$$ 0 0 0 0 0 0 0 0 0 0 0 0 0 0 0 0 0 0 0 0 0 0 0 0 0 0 0 0
$$ ##$ShimPowRng2= (0..63)
$$ 1 1 1 1 1 1 1 1 1 1 1 1 1 1 1 1 1 1 1 1 0 0 0 0 0 0 0 0 0 0 0 0 0 0 0 0
$$ 0 0 0 0 0 0 0 0 0 0 0 0 0 0 0 0 0 0 0 0 0 0 0 0 0 0 0 0
$$ ##$ShimPowRng3= (0..63)
$$ 1 1 1 1 1 1 1 1 1 1 1 1 1 1 1 1 1 1 1 1 0 0 0 0 0 0 0 0 0 0 0 0 0 0 0 0
$$ 0 0 0 0 0 0 0 0 0 0 0 0 0 0 0 0 0 0 0 0 0 0 0 0 0 0 0 0
$$ ##$ShimSysFunc= (0..63)
$$ 1 2 3 4 5 7 9 11 15 16 8 10 12 14 6 17 13 18 19 20 0 0 0 0 0 0 0 0 0 0
$$ 0 0 0 0 0 0 0 0 0 0 0 0 0 0 0 0 0 0 0 0 0 0 0 0 0 0 0 0 0 0 0 0 0 0
$$ ##$ShimSysMatrix= 0
$$ ##$ShimSysType= 1
$$ ##$TFXNUM= 0
$$ ##$TRIPLO2= 0
$$ ##$VTU= 2
$$ ##$VTUETH= <149.236.99.20>
$$ ##$VTUTY= <no>
$$ ##$WBREFAM= (0..15)
$$ 135.5 97.7 100 100 100 100 100 100 100 100 100 100 100 100 100 100
$$ ##$WBREFLM= (0..15)
$$ 0 0 0 0 0 0 0 0 0 0 0 0 0 0 0 0
$$ ##$WBREFPH= (0..15)
$$ 72.26 -67.22 0 0 0 0 0 0 0 0 0 0 0 0 0 0
$$ ##$WBSGU= (0..15)
$$ 0 0 0 0 0 0 0 0 0 0 0 0 0 0 0 0
$$ ##$XFAC= 2
$$ ##END=
$$ 
##$DECIM=	2496
##$DSPFVS=	20
##XUNITS=	HZ
##YUNITS=	ARBITRARY UNITS
##FIRSTX=	6407.6102040000005218
##LASTX=	-1605.0880428824991668
##DELTAX=	-0.12226593800080109986
##XFACTOR=	1
##YFACTOR=	0.0031820907231727441761
##FIRSTY=	3.695888519287109375
##MINY=	-4.5732240676879882813
##MAXY=	17358.3984375
##NPOINTS=	65536
##XYDATA=	(X++(Y..Y))
$$ [...]
2619D814J39J60J90K05J91J66J47J28R5O0M0J7l2q1q7n9n9j09j45j23q0p9j06j04o4l2k8k4
2616E140lJ5J9K7M2M0Nl7n4o0r0j48k01k29k30k23k23k31k35k15j83j62j70j75j44q8n8q2
2612B047j31j46j11o6n8q2q2l4J0qp8j20r4l9j6k6l0pJ8K2Nk3m3m3l0k1k7l5k8j7k0l1l3k2
2608F01j2pMK0K1PkORnj6PM3M9Rl4m1j4J5L0L0K1LqML5N7N2M1N2Q0R6Q2O5P3R8J04O8J5j7
2603A641j8j4k4l6l1j8k5n5p0n8m3n6q1p6m6k8l7m1k6k1m8q3q2m8j8j3k3l3l9l5k1j5k0k4
2599C35qJ7L1K8K1J0npRK1QpNM0N5L9K2J7J2NJ5M0M6K5MJNKRK8L9K7J9K8L2J0j3j4j3l8p0
2594H30o6l8k8m4n6n5n3n4m0j8j6l2l6j6Okl0n3m9k2QRj6k9rJ3ll4k3K3M0Jm3m6k1nJQOqj1
2589a1JRmj4mOkj3qmk3l9k5KQmJJ7J8MNK1K4Roj8l6m9l3MJ8NLK2K9%k9k4NK8L4K2lk7j4K3
$$ plain form
2619 4814 4953 5113 5303 5508 5699 5865 6012 6140 6235 6295 6335 6352 6320 6239 6152 6093 6034 5925 5780 5657 5577 5498 5392 5288 5224 5192 5164 5140
2616 5140 5137 5152 5171 5198 5240 5280 5285 5248 5194 5134 5044 4896 4695 4466 4236 4013 3790 3559 3324 3109 2926 2764 2594 2419 2275 2187 2129 2047
2612 2047 1916 1770 1659 1593 1535 1453 1371 1337 1347 1339 1261 1141 1047 1008 992 966 936 929 947 969 974 951 908 865 835 814 787 752 724 707 687 656 623 601
2608 601 589 582 586 606 627 634 632 638 647 642 626 633 676 725 734 700 659 645 660 690 720 741 744 736 740 775 832 884 925 977 1057 1153 1235 1300 1373 1471 1575 1643 1658 1641
2603 1641 1623 1609 1585 1549 1518 1500 1475 1420 1350 1292 1249 1193 1112 1036 990 962 925 884 858 837 789 706 624 576 558 545 522 489 450 415 394 379 359 335
2599 335 327 344 375 403 424 434 429 422 431 452 460 453 458 498 553 592 614 631 643 648 663 703 749 774 778 779 784 786 795 823 862 889 908 936 968 978 965 951 938 900 830
2594 830 764 726 698 654 598 543 490 436 396 378 362 330 294 278 284 282 252 199 150 128 136 145 129 100 91 104 101 67 44 67 107 108 65 19 -2 -7 -6 2 8 0 -11
2589 -11 -10 -1 -5 -19 -23 -17 -19 -32 -40 -44 -67 -106 -131 -129 -121 -125 -124 -107 -89 -85 -80 -59 -35 -26 -32 -50 -86 -135 -168 -164 -146 -141 -138 -116 -87 -87 -116 -140 -135 -107 -73 -51 -54 -81 -95 -72
2583g2L1j4n5m0LJ0j6k2OK1Mj5j8j9l2k7J0M4M3J5lrj6k8k3kK3L1K3QlKK0K7Qj5k1j2j0j7
2578a60j7roj1j0OJ8J8J4J4Oj6l3j6J7L1Pk6l7k5j4j0nQK3J8pl2l6j3J5K7K5J9J0jrj3j5j6
2574b61nK0L2J1k5l4j2Kj0j6MK3J6KRK7J9%JJ5Ll2l6QM6K8k4m6k4OJ2OKKPRMqj6j3pj7l2k8
2568c32mK0K5J6Kqj7j8j1njkLQJ4J3PJnqpOK9L8J7k5m9l2lMj0j8j5oQL8N9K7m7q7m9K1M3K
2563c58l6k1J8K7mk9j0L6N7L3%jK0K2pl8m2k7j4mJ0K0J6Kj2k1k7k6j1QJ8K0J8QnlJ8L3J6j6
2558c12k3rrk7k7QM1L4LoMNj3k4j6qqMK6K8ol5k1J6K7LrJ5L5Kn6p2l0J1Mk3j5L3O7N0Nk6k9
2553c83j9qNJ8K0Pm%QOqj2JQpk8k7%J9Pj6k0pkmjJ6K5J7RRJ2PNQQ%qonj4k4j6mmj5j8%J9K1
2547d05Kk7l9j4L5O0L4j3k7qKj8l5k1QJ8Lj1q%LlqlJ7L3K8Qonoj7j8jJ8J5jnJ3L0L0J2rk2
$$ plain form
2583 -72 -41 -55 -110 -150 -147 -137 -153 -175 -169 -148 -144 -159 -177 -196 -228 -255 -245 -201 -158 -143 -146 -155 -171 -199 -222 -224 -201 -170 -147 -139 -142 -140 -120 -93 -85 -100 -121 -133 -143 -160
2578 -160 -177 -186 -192 -203 -213 -207 -189 -171 -157 -143 -137 -153 -186 -202 -185 -154 -147 -173 -210 -235 -249 -259 -264 -256 -233 -215 -222 -254 -290 -303 -288 -261 -236 -217 -207 -208 -217 -230 -245 -261
2574 -261 -266 -246 -214 -203 -228 -262 -274 -272 -282 -298 -294 -271 -255 -253 -244 -217 -198 -198 -197 -182 -179 -211 -247 -239 -193 -165 -189 -235 -259 -253 -241 -235 -233 -231 -224 -215 -211 -219 -235 -248 -255 -272 -304 -332
2568 -332 -336 -316 -291 -275 -273 -281 -298 -316 -327 -332 -333 -335 -332 -324 -310 -297 -290 -289 -294 -302 -309 -303 -274 -236 -219 -244 -293 -325 -328 -324 -334 -352 -367 -373 -365 -327 -268 -241 -288 -375 -424 -403 -360 -358
2563 -358 -394 -415 -397 -370 -374 -403 -413 -377 -320 -287 -287 -288 -268 -246 -253 -291 -333 -360 -374 -378 -368 -348 -332 -330 -342 -363 -390 -416 -427 -419 -401 -381 -363 -355 -360 -363 -345 -312 -296 -312
2558 -312 -335 -344 -353 -380 -407 -399 -358 -324 -321 -327 -323 -318 -331 -355 -371 -379 -387 -383 -357 -329 -335 -370 -391 -375 -348 -345 -354 -339 -304 -302 -358 -430 -460 -449 -445 -468 -483 -450 -383 -333 -328 -354 -383
2553 -383 -402 -410 -405 -387 -367 -360 -364 -364 -356 -350 -358 -370 -369 -361 -368 -396 -423 -423 -404 -397 -413 -433 -440 -442 -446 -447 -431 -406 -389 -380 -371 -359 -352 -347 -339 -331 -331 -339 -345 -350 -364 -388 -404 -408 -412 -427 -445 -445 -426 -405
2547 -405 -403 -430 -469 -483 -448 -388 -354 -367 -394 -402 -400 -418 -453 -474 -466 -448 -445 -456 -464 -464 -461 -464 -472 -475 -458 -425 -397 -389 -395 -400 -406 -423 -441 -442 -424 -409 -410 -415 -402 -372 -342 -330 -339 -361
2541c61j5kkj9l0j7OJ0pk7l1k1mJ6K7K6K0J4NqqJ4L1J4k7m5k9lPLpj8k6j9QK6J9KnjLQJ9K6
2536d28J5oj3qopkQOj6l0j5J3K4J2lmmj6k4qK5M0J8j8l3k1%J5K0J0j2k7j7OJ6POK1L2K0oj6
2531d26oJ5K5J6j0l3l1pJ2J5Qjj3j8lJ4Ok5l7j3J0OpJJ3Lj6rJ0J0j0j9pJklMJ2K0L6L8Ll9
2525d57m3j9j4l3k8J6M4K4kPK6J9jlKj1k4j0J3J0j3j8qqj2LK7L1J2kpk5m2k0L6O6M0mj8rq
2520d63k1k7k0j0orj7k0lK2K6J1OJ6K1NoPJ9J1pj0rk1l5j8J5K9J4%kqk6l9l4j9kJ5L4L8K1
2515e22lj6k1k6k9k5k1j6j0RL5N4M8J5k0k6LL0J7k0l7j4K1L3K0LqrLJ6J5mk4k6j6lJ4K9K2
2511e09k1n9n0j0J5J6K0L1K1j3l3oK9L2Qnjjj5k6k2j1NJ6J0j0j4J4L8K0k4l9j4PKMJ9J3k7
2506e90m8qN5P0L2jqj8l6l3kK2J7LNMj3k5j1Q%k2k3NL4L7J5j3k3qJ3J9Opqj0k4l3j4J8L1K2
$$ plain form
2541 -361 -376 -378 -380 -399 -429 -446 -440 -430 -437 -464 -495 -516 -520 -504 -477 -451 -431 -417 -412 -420 -428 -414 -383 -369 -396 -441 -470 -473 -466 -463 -470 -488 -514 -533 -525 -499 -480 -478 -483 -484 -481 -473 -454 -428
2536 -428 -413 -419 -432 -440 -446 -453 -455 -447 -441 -457 -487 -502 -489 -465 -453 -456 -460 -464 -480 -504 -512 -487 -447 -429 -447 -480 -501 -501 -486 -466 -456 -468 -495 -512 -506 -490 -483 -477 -456 -424 -404 -410 -426
2531 -426 -432 -417 -392 -376 -386 -419 -450 -457 -445 -430 -422 -423 -436 -454 -457 -443 -437 -462 -499 -512 -502 -496 -503 -502 -489 -486 -502 -511 -501 -491 -501 -520 -527 -526 -528 -531 -527 -515 -495 -459 -421 -418 -457
2525 -457 -500 -519 -533 -566 -594 -578 -534 -510 -512 -505 -479 -460 -461 -464 -462 -473 -497 -507 -494 -484 -497 -515 -523 -531 -543 -540 -513 -482 -470 -472 -479 -504 -546 -566 -530 -464 -424 -428 -446 -455 -463
2520 -463 -484 -511 -531 -541 -547 -556 -573 -593 -596 -574 -548 -537 -531 -515 -494 -489 -495 -488 -469 -458 -465 -475 -484 -505 -540 -558 -543 -514 -500 -500 -502 -510 -536 -575 -609 -628 -630 -615 -581 -543 -522
2515 -522 -525 -541 -562 -588 -617 -642 -663 -679 -689 -680 -645 -591 -543 -528 -548 -574 -571 -541 -524 -544 -581 -595 -574 -541 -521 -518 -526 -535 -532 -516 -501 -505 -529 -555 -571 -574 -560 -531 -509
2511 -509 -530 -589 -639 -649 -634 -618 -598 -567 -546 -559 -592 -598 -569 -537 -529 -534 -535 -536 -551 -577 -599 -610 -605 -589 -579 -589 -603 -589 -551 -531 -555 -594 -608 -601 -599 -595 -576 -563 -590
2506 -590 -638 -646 -591 -521 -489 -490 -498 -516 -552 -585 -587 -565 -548 -545 -540 -536 -549 -574 -585 -577 -577 -599 -622 -617 -583 -546 -531 -544 -567 -575 -562 -543 -537 -544 -552 -562 -586 -619 -633 -615 -584 -562
2501e62Jj2j7qOJ2KjJ7L1J2k4l7k5k4m0l5ML5J8k1l4j3J5L2M0M1K7Lj8j8qKQPOQJ0%j7k5q
2495f10J6K6J0j2k6j9OL1L6J5j0j5j2j8k1%L7M5J6k2k7rMkr%K0M0M3K2rk3pK0K2Lj1pOMoq
2490d61jLmj2j7j9j7j2LJ5K1J4Lj0j6j0QJ9J4OJ4L0K6%j3QM7O5N3K6Jk0k7qK4M1K1k1n2n2
2485c10l2j4oJPMj4k9j8RJ9NKK6L9jo2p3k8J5J6pj5j5j6jL5O2M9Qj8k3l2m5m4k6j3j1oLKr
2480e66j0lknLJ4Kl3m4j3K2K2lj6pLOPO%LJ6J5j1l3k0QQj3j1K2L6J1j8j5PJ4J2J3J0pj6oL
2475e89j7m1k6J6L7K0oj8k3k1pJ6K1J0J0K3J5j3j6K0M6J5l9o2m6l2k1LL7L8Oj4JJ7jl1k9%
2470g01J2rk9j1L1M6J9j2oJ7J0l1m9j1M2M4Jl1k5lJ1J7K2J2qj5j0rj5oJ4J3j0j9QL8L0lj8
2466f44mJ3K2K5J8jj2j5k1l4k1K3N8L8j5m5m6m1l5j4J1J4JPK1Ll3l3J2M3K2j1j7mLJ0J8J1
$$ plain form
2501 -562 -561 -573 -590 -598 -592 -580 -578 -579 -562 -531 -519 -543 -580 -605 -629 -669 -704 -700 -665 -647 -668 -702 -715 -700 -668 -628 -587 -560 -557 -575 -593 -601 -599 -591 -584 -578 -570 -560 -560 -577 -602 -610
2495 -610 -594 -568 -558 -570 -596 -615 -609 -578 -542 -527 -537 -552 -564 -582 -603 -603 -566 -521 -505 -527 -554 -563 -559 -561 -570 -570 -550 -510 -467 -445 -454 -477 -484 -464 -442 -439 -450 -457 -451 -447 -453 -461
2490 -461 -462 -459 -463 -475 -492 -511 -528 -540 -537 -522 -501 -487 -484 -494 -510 -520 -512 -493 -479 -473 -459 -429 -403 -403 -416 -408 -361 -296 -243 -217 -216 -236 -263 -271 -247 -206 -185 -206 -258 -310
2485 -310 -342 -356 -362 -361 -354 -350 -364 -393 -411 -402 -383 -378 -376 -350 -311 -312 -374 -447 -475 -460 -444 -451 -466 -481 -497 -498 -463 -401 -352 -344 -362 -385 -417 -462 -506 -532 -545 -556 -562 -559 -557 -566
2480 -566 -576 -579 -581 -586 -583 -569 -567 -600 -644 -657 -635 -613 -616 -632 -639 -636 -630 -623 -617 -617 -614 -598 -583 -594 -627 -647 -639 -631 -644 -655 -633 -597 -586 -604 -619 -612 -598 -586 -573 -563 -570 -586 -592 -589
2475 -589 -606 -647 -673 -657 -620 -600 -606 -624 -647 -668 -675 -659 -638 -628 -618 -595 -580 -593 -609 -589 -543 -528 -567 -629 -675 -707 -728 -725 -688 -650 -644 -658 -657 -640 -641 -672 -701 -701
2470 -701 -689 -698 -727 -738 -707 -661 -642 -654 -660 -643 -633 -664 -713 -724 -682 -638 -637 -668 -693 -696 -685 -668 -646 -634 -642 -657 -667 -676 -691 -697 -683 -670 -680 -699 -691 -653 -623 -626 -644
2466 -644 -648 -635 -613 -588 -570 -571 -583 -598 -619 -653 -674 -651 -593 -555 -570 -615 -661 -702 -737 -751 -740 -726 -725 -718 -697 -694 -727 -760 -748 -705 -683 -694 -711 -715 -712 -702 -684 -673
2461f73j2j7MJ4oj6J3L9J9j6j3J4J3j2j5J2K1kk3j5JONOJnNK0K1J1J0J3nl3k4J9L8Ml4k5M
2456f33J2pj6j0nkRJ9J4pk0j7mJ2J7Nj8k3LL5L7Ml3l9qM0O0L0k1m0j8jj0k4j9qqlK5M5K4j7
2451f20l4k3j0pkLkoJ0L7M7L1Ppj6j1RK1Jk8k7KQj6l1rJ7J0rj3rk1l6k5RL5L2J0j1j3JJ2J
2445f83j8k1qjjJ4L7L2lk0LJ9j0m8l5J6L8Rk9l7k1mOJ0NOJ9L6L0J3Knk1l1j0K8L0j0l7j7J0
2440g07Nj0RM5M6Pk1j4JJJJ2K0%l2m0j4J7K7J9Nj0k4k7j1J2J7Jj6j8j3nJ2L1K5j3m1k2K3L8
2436f64Qj9j1J2K0J7J0pk8k3J5M4K7p%M0M7Qk5qK6K6jj4rj5l3l1KL8M9M4M4M6K9J3K0M7N6
2431b07L2NMJ6K2K5L9N4M9L6L8N2N6M6N2P4P6L3j6k7j5j7l2l9m1n5p4o4m1l9n6n5k3mk3m3
2426a62l1rj3l5l6j3LLMQLpoPJ4J6K4L5K8Nrmjj9l4l1j6j0j3j6k2l5m2k3NJ5nl0l3j5%lk1
$$ plain form
2461 -673 -685 -702 -698 -684 -690 -706 -693 -654 -635 -651 -664 -650 -637 -649 -664 -652 -631 -633 -656 -671 -670 -664 -659 -653 -652 -657 -652 -632 -611 -600 -590 -577 -582 -615 -639 -620 -582 -578 -612 -637 -633
2456 -633 -621 -628 -644 -654 -659 -661 -652 -633 -619 -626 -646 -663 -667 -655 -638 -633 -651 -674 -671 -636 -599 -595 -628 -667 -675 -635 -575 -545 -566 -606 -624 -625 -635 -659 -678 -686 -694 -697 -672 -627 -603 -620
2451 -620 -654 -677 -687 -694 -696 -693 -695 -701 -691 -654 -607 -576 -569 -576 -592 -603 -594 -573 -572 -600 -627 -625 -617 -633 -664 -673 -656 -646 -655 -668 -677 -698 -734 -759 -750 -715 -683 -673 -684 -697 -696 -684 -683
2445 -683 -701 -722 -730 -731 -732 -718 -681 -649 -652 -672 -669 -650 -660 -708 -743 -727 -689 -680 -709 -746 -767 -771 -765 -755 -750 -744 -725 -689 -659 -646 -644 -649 -670 -701 -711 -683 -653 -663 -700 -717 -707
2440 -707 -702 -712 -703 -658 -612 -605 -626 -640 -639 -638 -637 -625 -605 -605 -637 -677 -691 -674 -647 -628 -623 -633 -657 -684 -695 -683 -666 -665 -681 -699 -712 -717 -705 -674 -649 -662 -703 -725 -702 -664
2436 -664 -656 -675 -686 -674 -654 -637 -627 -634 -662 -685 -670 -626 -599 -606 -606 -566 -519 -511 -536 -544 -518 -492 -493 -507 -516 -531 -564 -595 -593 -555 -506 -462 -418 -372 -343 -330 -310 -263 -207
2431 -207 -175 -170 -166 -150 -128 -103 -64 -10 39 75 113 165 221 267 319 393 469 502 486 459 444 427 395 356 315 260 186 122 81 42 -14 -69 -92 -96 -119 -162
2426 -162 -193 -202 -215 -250 -286 -299 -296 -293 -289 -281 -278 -285 -291 -284 -270 -254 -230 -195 -167 -162 -171 -175 -176 -195 -229 -260 -276 -286 -299 -315 -337 -372 -414 -437 -432 -417 -422 -452 -485 -500 -500 -503 -524
2421e24l1k2nmk1l3k6j3mJ0K3J5j7m0k3J2K5K0K4L2J5k2l6j1J3J2NJ1Rj7l8l0roj2LL2L8J7
2416f28rl1m9m8j1L9N0K2KJ4K1ol3k1ONk1l2j2QJ5J6J9J2lnPOk1l7j3K2K0j8m0j8J6J9%lJ4
2411g26Rk5n2l5J0L8L6K1Oqj4mJ8K9K6J5RJpj5k5l7l6rK5L7K1Lqk4m3l7jL0K6QJ1L0K9Oj0
2406f72mNmk7m3l5nK1J6j2k4KL4K8lj5J1M0M0J0j9k7nK6L8J4k0l7l9l3j9MJ1rk7lM2N0J5j8
2401f93j4kqk4k6rJ4K8K0j0l3k2QJ0pkL0L1k4o7l5K6M0QnJ8L3J7lJRjj5j8j0mJK%kLOnk1k3
2396g78j1KJ3K7K9J3rpKj1l8m0j4NNJ0K8L1Lj7jK3J8rj8JK1J7mj9j5JJ1NojJ4Rj2k0lJ3Mj0
2391g38j6k4l4k9KL0L3K2J5om1n0j0L5L0j2k7JK3J7MJ1J7J0oj0oLJ6K4J3kMK3J9j4l5k1ON
2386g18j0j1kmj6j0J4L5L0Rj2k5k7k3j4pjJj%RK1J7%j6j5oLQRLokJ3J1j5l8k4J3L5L1J6Lj2
$$ plain form
2421 -524 -555 -577 -582 -586 -607 -640 -666 -679 -683 -673 -650 -635 -652 -692 -715 -703 -678 -658 -634 -602 -587 -609 -645 -656 -643 -631 -626 -615 -606 -623 -661 -691 -700 -706 -718 -715 -683 -645 -628
2416 -628 -637 -668 -717 -765 -776 -737 -687 -665 -663 -649 -628 -634 -667 -688 -682 -677 -698 -730 -742 -734 -719 -703 -684 -672 -675 -680 -673 -667 -688 -725 -738 -716 -696 -714 -754 -772 -756 -737 -737 -740 -726
2411 -726 -717 -742 -794 -829 -819 -781 -745 -724 -718 -726 -740 -744 -726 -697 -671 -656 -647 -646 -653 -668 -693 -730 -766 -775 -750 -713 -692 -689 -697 -721 -764 -801 -802 -772 -746 -738 -727 -697 -668 -662 -672
2406 -672 -676 -671 -675 -702 -745 -780 -785 -764 -748 -760 -784 -782 -748 -720 -723 -738 -727 -687 -647 -637 -656 -683 -688 -662 -624 -610 -630 -667 -706 -739 -758 -754 -743 -752 -779 -782 -740 -690 -675 -693
2401 -693 -707 -709 -717 -741 -767 -776 -762 -734 -714 -724 -757 -779 -771 -761 -768 -770 -740 -709 -733 -800 -835 -809 -769 -761 -766 -748 -715 -698 -701 -700 -691 -692 -707 -725 -735 -739 -738 -736 -736 -738 -735 -729 -734 -755 -778
2396 -778 -789 -787 -774 -747 -718 -705 -714 -721 -719 -730 -768 -808 -822 -817 -812 -802 -774 -743 -740 -757 -758 -735 -717 -726 -744 -743 -722 -705 -709 -728 -743 -742 -731 -726 -732 -733 -719 -710 -722 -742 -745 -732 -728 -738
2391 -738 -754 -778 -812 -841 -839 -809 -776 -754 -739 -745 -786 -836 -846 -811 -781 -793 -820 -819 -796 -779 -775 -764 -747 -737 -743 -753 -759 -756 -740 -716 -703 -705 -701 -678 -659 -673 -708 -729 -723 -718
2386 -718 -728 -739 -741 -745 -761 -771 -757 -722 -692 -683 -695 -720 -747 -770 -784 -791 -792 -791 -792 -792 -783 -762 -745 -745 -761 -776 -782 -779 -771 -762 -759 -765 -767 -754 -743 -758 -796 -820 -807 -772 -741 -725 -722 -734
2380g34k2j5%Kj9l3k4kJ1J4K3L9M9M1J6j4l1l1k6k7k8j1J8L1K0nj7j7j4j8j9j0OJ5QnkK8N4
2376g49M3%l1k2jmj9pL4O4M5%l5m9m5k4J5M9M7J2k4l2k2rJPJj0j3KK2K5J2%NK1K7Pl3n7l8
2371g85RL3J0k2k1OK1J1JLM%LJ0Pn%J8J8rk6rJ2Jk6k6MK5J2j5l4l0KM4N8L1pj6mnj3%K5J3
2365f72l7o2k0L9M7Nl3k8kJ2ll1l7mL8M4Jl9l5jK3K5J8Mj4j8NK7J9pj8j0m%J2J7ml0j5L9O3
2360f86K4l2m0oJ6Lj3rLMl%J6K9J9j1l4k3J3L4K0j1k3j2%KmoLJ9K6J8kj8k4k6j8LL1L4Nk3
2355g02j0L1O0N2K4MkNJ5J9J5Pkj4l0l0oK0J5j5l2j6J1K0J8J4Rnj4KK7L1J1rj4k0l4l7j0L2
2350e60M6J3l3n1k5J0K6J3j0k4k0q%jlOJ5J4kj6k1j5mPKj7k9nM4O7L7rk1lNlpjrl5m6k1J3
2345f81K7K7L1L7L5K5K3L1M1M9M9L9L0L3M0K8%j4lPJmJ2K4Nk5k6rj0k8k1J0J8j1k9kM2N8N1
$$ plain form
2380 -734 -756 -771 -771 -769 -788 -821 -845 -847 -836 -822 -799 -760 -711 -670 -654 -668 -699 -730 -756 -783 -811 -822 -804 -773 -753 -758 -775 -792 -806 -824 -843 -853 -847 -832 -824 -829 -831 -803 -749
2376 -749 -706 -706 -737 -759 -760 -764 -783 -790 -756 -692 -647 -647 -682 -731 -776 -800 -785 -736 -689 -677 -701 -733 -755 -764 -763 -756 -755 -765 -778 -776 -754 -729 -717 -717 -712 -691 -664 -657 -690 -747 -785
2371 -785 -776 -743 -733 -755 -776 -770 -749 -738 -737 -734 -730 -730 -727 -717 -710 -715 -715 -697 -679 -688 -714 -723 -711 -710 -736 -762 -758 -733 -721 -736 -770 -800 -798 -754 -696 -665 -672 -688 -692 -697 -710 -710 -685 -672
2365 -672 -709 -771 -791 -752 -705 -700 -733 -761 -763 -751 -754 -785 -822 -826 -788 -744 -743 -782 -817 -818 -795 -770 -752 -748 -762 -780 -775 -748 -729 -736 -754 -764 -768 -768 -756 -739 -743 -773 -788 -749 -686
2360 -686 -662 -694 -734 -740 -724 -721 -734 -743 -740 -736 -739 -739 -723 -694 -675 -686 -720 -743 -730 -696 -676 -687 -710 -722 -722 -720 -724 -730 -727 -708 -682 -664 -666 -684 -708 -734 -752 -749 -718 -684 -679 -702
2355 -702 -712 -681 -621 -569 -545 -541 -543 -538 -523 -504 -489 -482 -484 -498 -528 -558 -564 -544 -529 -544 -576 -592 -581 -561 -543 -529 -520 -525 -539 -537 -510 -479 -468 -477 -491 -511 -545 -582 -592 -560
2350 -560 -514 -501 -534 -585 -610 -600 -574 -561 -571 -595 -615 -623 -623 -624 -627 -621 -606 -592 -594 -610 -631 -646 -650 -643 -641 -658 -687 -692 -648 -581 -544 -553 -574 -577 -572 -575 -582 -583 -592 -627 -673 -694 -681
2345 -681 -654 -627 -596 -559 -524 -499 -476 -445 -404 -355 -306 -267 -237 -204 -164 -136 -136 -150 -153 -146 -145 -149 -137 -113 -108 -133 -159 -168 -178 -206 -227 -217 -199 -210 -239 -241 -199 -141 -90
2340i0L4Pl9o9n5j5N%%J5J7%j7j7pRK8L6J2k9m6j8K2M0L3K8L1L9N1N7L5j3m9m5j7Ljj1rkN
2335d2Jk1m6m4nK8J1l7n8l4lLNK7N5N7L7J6KnKJ8K5Mk4l4l1l4l7k1nj6m3m1oK2J9MlnnNK1
2330b38J7j2k4kJ5rl9k8QJ0k3l6lL1L2J6J6L2M1M7N5N2L7K6L8N0M2K9K9L4K2rl1l5k8k6k7
2325A09l7n9p8q1o9o0n5l7nK1J9nl0l8l6l5l7m0k7pONJ1L0M1J6k8m6k7MJ8K9M0M3L0K1L5M8
2321c11L6K2M8J00J24R7N3M0M6L7Qj2p%j5m7p2p8o9n4l4pR%l4o2n5j7J5J5lmJ4K4J1j0qJ5
2316a85L9M2K7Nj2k1k3k4k5k0j1lmmJ1L3M5L9L5M5N7O0N5N8O3M6Qj4LL8M8L2K6M4O2N4M3N9
2311G31Q8Q5M9K9M9O8M0oj5J2K4Jj5LK6K1LPK6M0M1L6J7k0n2o5p0q8j01r0o6o9r3j01q8r1
2307C66j17j27r6n1k8j2Ojm5q1n9qJ2nrJ1J5j1k9nK8K4pk5j3OK0K6K2kk9k7J1M6M9K5J0On
$$ plain form
2340 -90 -56 -49 -88 -157 -212 -227 -222 -222 -222 -207 -190 -190 -207 -224 -231 -222 -194 -158 -146 -175 -221 -239 -217 -177 -144 -116 -85 -46 5 62 97 84 35 -10 -27 -24 -25 -36 -45 -47 -42
2335 -42 -41 -62 -108 -152 -157 -129 -118 -155 -213 -247 -250 -247 -242 -215 -160 -103 -66 -50 -48 -53 -51 -33 -8 -4 -28 -62 -93 -127 -164 -185 -190 -206 -249 -290 -296 -274 -255 -251 -254 -259 -264 -259 -238
2330 -238 -221 -233 -257 -259 -244 -253 -292 -320 -312 -302 -325 -361 -364 -333 -301 -285 -269 -237 -196 -149 -94 -42 -5 21 59 109 151 180 209 243 265 256 225 190 162 136 109
2325 109 72 13 -65 -146 -215 -275 -330 -367 -372 -351 -332 -337 -367 -405 -441 -476 -513 -553 -580 -587 -581 -576 -565 -535 -494 -478 -506 -552 -579 -575 -557 -528 -488 -445 -415 -394 -359 -311
2321 -311 -275 -253 -205 -105 19 116 169 209 255 292 300 288 281 281 266 219 147 69 0 -54 -88 -95 -86 -86 -120 -182 -237 -254 -239 -224 -227 -231 -217 -193 -182 -192 -200 -185
2316 -185 -146 -104 -77 -72 -84 -105 -128 -152 -177 -197 -208 -211 -215 -219 -208 -175 -130 -91 -56 -11 46 106 161 219 282 328 336 322 325 363 411 443 469 513 575 629 672 731
2311 731 819 904 953 982 1031 1099 1139 1133 1118 1130 1154 1155 1140 1143 1169 1190 1193 1200 1226 1266 1307 1343 1360 1340 1288 1223 1153 1065 964 874 808 739 646 545 457 366
2307 366 249 122 26 -25 -53 -65 -59 -60 -105 -186 -245 -253 -241 -246 -255 -244 -229 -240 -269 -274 -246 -222 -229 -254 -267 -261 -241 -215 -193 -195 -224 -251 -240 -194 -145 -120 -110 -104 -109
2302a09k7l6j9Kql5m2j9Knk0j8jLj4k7j9jJ3J1mj9j4J0J7j2m5l1K0M1J0k1qJ6Pj9j5J4J6r
2297d15rK3L2ml0jM2M1PoJ1Rj8k6NM3M9L3J8NqnJ0J5KlJ6L1J9kLK0K2J5K8N3N5K6J3L5N6N0
2292B60L4L9O3P7P7P7P9Q2Q7R1Q2O2O0Q5J12J13J03J07J23J30J32J44J56J50J42J49J59J32
2289C107P6M1M7N8M4K5K1J8mk3j1QPoRL9M5K3J6L6M4K3OK4M4K2k5m7m1n4j04j51j60j47j52
2284B858j72j77j59j49j62j75j57j19j04j22j35j06n9n5r2j14p8l5m2q7j03o7l4l7m8l7j9
2281B14k6m5m7k9j9j6j1oj4k3j7pj5l1k2%rm1m3LL5J6j5j0J2J1j0j7j3k3l8k7PK7K1J7K7L0
2276a54J8Jj7m0m6k1K2M0K4Nkqj4oJ8K5J2J1L0L4Qj3JK2J1j5j8MK1K0J4Mpj1OK7K3L%J8L2
2271H2K2O%jojK0L7L1Lj6qJ9L5L4L2M2M7K9JlJ6K3Nj4j1nj0j8k3l6n0k6K9N3J2l4k5J2Ql0
$$ plain form
2302 -109 -136 -172 -191 -189 -197 -232 -274 -293 -291 -296 -316 -334 -335 -332 -346 -373 -392 -393 -380 -369 -373 -392 -406 -396 -379 -391 -436 -467 -447 -406 -396 -417 -425 -409 -402 -421 -436 -422 -406 -415
2297 -415 -424 -401 -369 -373 -403 -404 -362 -321 -314 -320 -309 -300 -318 -344 -339 -296 -247 -214 -196 -191 -199 -204 -194 -179 -177 -180 -164 -133 -114 -116 -113 -93 -71 -56 -28 25 80 106 119 154 210 260
2292 260 294 333 396 473 550 627 706 788 875 966 1048 1110 1170 1255 1367 1480 1583 1690 1813 1943 2075 2219 2375 2525 2667 2816 2975 3107
2289 3107 3183 3224 3271 3329 3373 3398 3419 3437 3433 3410 3399 3407 3414 3408 3417 3456 3501 3524 3540 3576 3620 3643 3649 3673 3717 3739 3714 3667 3626 3572 3468 3317 3157 3010 2858
2284 2858 2686 2509 2350 2201 2039 1864 1707 1588 1484 1362 1227 1121 1062 1007 915 801 723 688 646 559 456 389 355 318 270 233 214
2281 214 188 143 96 67 48 32 21 15 1 -22 -39 -46 -61 -92 -114 -114 -123 -164 -207 -204 -169 -153 -168 -178 -166 -155 -165 -182 -195 -218 -256 -283 -276 -249 -228 -211 -184 -154
2276 -154 -136 -135 -152 -192 -238 -259 -237 -197 -173 -168 -170 -178 -192 -198 -180 -155 -143 -132 -102 -68 -60 -73 -72 -50 -39 -54 -72 -68 -47 -27 -13 -9 -16 -27 -21 6 29 32 32 50 82
2271 82 104 110 110 109 103 102 122 159 190 193 177 169 188 223 257 289 331 378 407 408 405 421 444 449 435 424 419 409 391 368 332 282 256 285 338 350 316 291 303 311 281
2266B81l8qLj7k0J5M3L6K4L7M9K9lj2jOMkpJK9N5M6J0%L0N1L2OMPpj0K5O2N3K1J7L3K5l%M4
2261I50Q2Q2O1M2K9K6M0O0O4N0M6N6O0O1P7J00R8P5O6Q2R2Q2Q8J23J50J38J14J23J52J70J70
2257C609J84K07K21K24K49K96L33L40L48L80M27M62M89N36O07O74P22P78Q87J046J224J402
2255A5645J605J854K137K436K754L107L507L954M449M959N426N823O158O410O474O249N720
2253H8667M907L737K134K46j527k792l433l559l310k767k014j141k16P24J611K351K880L175
2250H9673L216K971K393J425Pj795l696n290o313o770o831o639o262n747n158m561m014l549
2248C3060l159k814k501k235k010j784j541j321j178j094j006q85p66o88o44n93n20m37l84
2246G500l73l77l52k94k47k51k79k75k28j81j75j99k13j98j66j41j40j54j54j23q6p7r2r6
$$ plain form
2266 281 243 235 238 221 201 216 259 295 319 356 405 434 431 419 418 424 428 426 419 420 449 504 550 560 560 590 641 673 679 683 690 683 673 698 760 813 834 851 884 909 906 906 950
2261 950 1032 1114 1175 1217 1246 1272 1312 1372 1436 1486 1532 1588 1648 1709 1786 1886 1984 2059 2125 2207 2299 2381 2469 2592 2742 2880 2994 3117 3269 3439 3609
2257 3609 3793 4000 4221 4445 4694 4990 5323 5663 6011 6391 6818 7280 7769 8305 8912 9586 10308 11086 11973 13019 14243 15645
2255 15645 17250 19104 21241 23677 26431 29538 33045 36999 41448 46407 51833 57656 63814 70224 76698 82947 88667
2253 88667 93574 97311 99445 99691 98164 95372 91939 88380 85070 82303 80289 79148 78932 79656 81267 83618 86498 89673
2250 89673 92889 95860 98253 99678 99685 97890 94194 88904 82591 75821 68990 62351 56089 50342 45184 40623 36609 33060
2248 33060 29901 27087 24586 22351 20341 18557 17016 15695 14517 13423 12417 11532 10766 10078 9434 8841 8321 7884 7500
2246 7500 7127 6750 6398 6104 5857 5606 5327 5052 4824 4643 4468 4269 4056 3858 3692 3551 3411 3257 3103 2980 2894 2817 2725 2629
2243B629q0o3o3o3n4m7n6o9o8o2o4n9l9k5m3p7p5l1mk1m7l7mPj5l3k9k1l1m4l6j5mj2k5j9
2239A201lPJrnNRlpMJ4Mj5j5nj2l0k6PL5K2j4l5l1j1J4L1K1j3l5j3K6L2jk5qK0K4NoljlKJ7
2233A172K3J0j1j5RM6O0K9k6o1m9j7lj0j8jL0N4N1K5mj4nPPMQJ0Jj1j4j1j7k9k9j0RJ4J5K0
2228A249J8NmJ4M3N0K7PK0N6P2N5L0L0N1O4N3K8Qkmpj2j8j3J2M6O3M9K6K5L6L0LlK5N4L9j
2223B224j4PJ9nk7nM0N8L4NJK0M2N9O9O7N1L1K0J1PJ0K1K6K2J5J7K4L5N0O6O9N8M8N0M6K4
2219C295PL0P5P8K8k0j5K0M0M3O3R6J09R1P8R0J04R9P8N1J8pLN7J08J13Q0N2M9N3M7M0M8P2
2215E173J00J19J16R6Q3R0J01R2P5P9J08J33J30J15J09J12J16J22J25J14J04J24J68J88J59
2212H051J22J28J63J76J67J80K17K32K03J73J85K20K38K30K23K18K11K12K40K86L15L17L09
$$ plain form
2243 2629 2549 2486 2423 2360 2306 2259 2203 2134 2066 2004 1940 1881 1842 1817 1774 1697 1622 1591 1587 1566 1519 1482 1478 1485 1470 1437 1408 1387 1356 1312 1276 1261 1257 1245 1220 1201
2239 1201 1198 1205 1206 1197 1192 1197 1206 1203 1196 1200 1214 1218 1203 1188 1183 1171 1141 1115 1122 1157 1179 1165 1130 1099 1088 1102 1133 1154 1141 1106 1093 1119 1151 1150 1125 1117 1137 1161 1166 1160 1157 1156 1153 1155 1172
2233 1172 1195 1205 1194 1179 1188 1234 1294 1323 1297 1236 1187 1170 1167 1157 1139 1138 1168 1222 1273 1298 1294 1280 1275 1282 1289 1293 1301 1311 1312 1301 1287 1276 1259 1230 1201 1191 1200 1214 1229 1249
2228 1249 1267 1272 1268 1282 1325 1375 1402 1409 1429 1485 1557 1612 1642 1672 1723 1787 1840 1868 1876 1874 1870 1863 1851 1833 1820 1832 1878 1941 1990 2016 2041 2077 2107 2110 2107 2132 2186 2225 2224
2223 2224 2210 2217 2236 2231 2204 2199 2239 2297 2331 2336 2337 2357 2399 2458 2527 2594 2645 2676 2696 2707 2714 2724 2745 2771 2793 2808 2825 2849 2884 2934 3000 3069 3127 3175 3225 3271 3295
2219 3295 3302 3332 3407 3485 3513 3493 3478 3498 3538 3581 3644 3740 3849 3940 4018 4108 4212 4311 4389 4440 4458 4451 4454 4511 4619 4732 4812 4864 4913 4966 5013 5053 5101 5173
2215 5173 5273 5392 5508 5604 5687 5777 5878 5970 6045 6124 6232 6365 6495 6610 6719 6831 6947 7069 7194 7308 7412 7536 7704 7892 8051
2212 8051 8173 8301 8464 8640 8807 8987 9204 9436 9639 9812 9997 10217 10455 10685 10908 11126 11337 11549 11789 12075 12390 12707 13016
2209A3016L09L13L26L51L79L95L93L88L88L86L93M22M64M88M78M61M67M95N29N62N89O09O28
2206B3229O61P07P49P69P78Q01Q49R10R75J039J103J174J256J348J446J556J684J823J948
2204D4805K052K157K282K414K513K574K626K686K729K725K687K647K641K692K819L035L330
2202H9414L682M089M557N087N661O275O946P691Q514R417J0425J1557J2806J4160J5644J7307
2200B33232J9161K1163K3289K5561K8018L0645L3394L6218L9062M1808M4259M6199M7400M7601
2198G17010M6533M3965L9756L3871K6420J7759Q500o03q781j5387j9992k2462k2945k1726
2196H21918j9087j5302j0675n534j74N145J0180J4701J8507K1366K2978K3022K1276J7643
2195I25964J2105M765m012j3562k3065l1736l8953m4314m7696m9250m9283m8115m6047m3383
$$ plain form
2209 13016 13325 13638 13964 14315 14694 15089 15482 15870 16258 16644 17037 17459 17923 18411 18889 19350 19817 20312 20841 21403 21992 22601 23229
2206 23229 23890 24597 25346 26115 26893 27694 28543 29453 30428 31467 32570 33744 35000 36348 37794 39350 41034 42857 44805
2204 44805 46857 49014 51296 53710 56223 58797 61423 64109 66838 69563 72250 74897 77538 80230 83049 86084 89414
2202 89414 93096 97185 101742 106829 112490 118765 125711 133402 141916 151333 161758 173315 186121 200281 215925 233232
2200 233232 252393 273556 296845 322406 350424 381069 414463 450681 489743 531551 575810 622009 669409 717010
2198 717010 763543 807508 847264 881135 907555 925314 933814 933211 924430 909043 889051 866589 843644 821918
2196 821918 802831 787529 776854 771320 771146 776291 786471 801172 819679 841045 864023 887045 908321 925964
2195 925964 938069 942834 938822 925260 902195 870459 831506 787192 739496 690246 640963 592848 546801 503418
2193E03418m0409l7318l4236l1254k8448k5836k3394k1119j9045j7201j5566j4100j2785j1619
2191A71088j0595r699q916q227p598p012o474n986n544n144m790m482m198l912l633l383l168
2189F8327k975k791k616k446k271k099j961j881j832j756j623j481j396j368j332j243j144
2187C6112j091j076j047r84r33r13q90q31p63p23p06o72o23n91n88n84n61n36n27n17m89m63
2184B0004m62m64m42l99l71l71l67l40l10l07l21l19k96k77k71k62k33k02j95k12k26k15j95
2181A2947j89k11k38k44k22j92j74j67j62j62j74j89j81j48j22j27j47j47j24j09j20j34j32
2179I132j27j41j56j37q8n4o5j02j25j19j04r1q0p3q1j03j12r3o8o4r0j15j18j08j02j01r5
2175F420q5q1q7r7r9q5n4k5k8o0p6m9j2k0o4q0m9j8l3o4o8m9n2p7q2n9l9m7o4p1o9o3m7k3
$$ plain form
2193 503418 463009 425691 391455 360201 331753 305917 282523 261404 242359 225158 209592 195492 182707 171088
2191 171088 160493 150794 141878 133651 126053 119041 112567 106581 101037 95893 91103 86621 82423 78511 74878 71495 68327
2189 68327 65352 62561 59945 57499 55228 53129 51168 49287 47455 45699 44076 42595 41199 39831 38499 37256 36112
2187 36112 35021 33945 32898 31914 30981 30068 29178 28347 27584 26861 26155 25483 24860 24269 23681 23097 22536 22000 21473 20956 20467 20004
2184 20004 19542 19078 18636 18237 17866 17495 17128 16788 16478 16171 15850 15531 15235 14958 14687 14425 14192 13990 13795 13583 13357 13142 12947
2181 12947 12758 12547 12309 12065 11843 11651 11477 11310 11148 10986 10812 10623 10442 10294 10172 10045 9898 9751 9627 9518 9398 9264 9132
2179 9132 9005 8864 8708 8571 8483 8429 8364 8262 8137 8018 7914 7823 7743 7670 7589 7486 7374 7281 7213 7149 7059 6944 6826 6718 6616 6515 6420
2175 6420 6335 6254 6167 6070 5971 5886 5832 5807 5779 5719 5643 5594 5582 5562 5498 5418 5369 5351 5318 5254 5186 5137 5085 5008 4926 4867 4828 4781 4717 4646 4577 4514 4467 4444
2171D444j3k0k8l1m8p6q0n1k5l3m5k5PLl0l7oJ7kl7n7o4o5n5k5kmj7k0k0k8l8l2j8j7k2j9
2167C381j7l6o7p5m9j4NJ0Mk0o2r1q4m1%J8J3%nKJ1J7J0qk7l8l1j3mrj9j7oKRJ6J0j1k4j6
2162B724oj7l5k5ONl5o8n5k6j9k5k0nnj7j9j0kMRLk7o0p2o8p0p5n5k2rk3k8j2Njj2j4j3k0
2157A786k9k9k4k5k4j6lMJ2J8J3mk1k5k3j8j1nj0j9j2O%l2n2l4pJMK3L7J2l3m7k1RJ8J2Jj3
2152A419k2rQLk2k5%J5ml0l2j6j0j9k2j0J4L3L3Ml3m2j3J9J9KlOPmkJ3J3j1l8l1LL3L3J7%
2147A296j1k5l7l3oJ6J6NRK3J8j4m7m5j6J3K6J7mk6l2k5j8j9j1J2K9K3Mnrj7k2j2ok7n4l9
2142I47K1O7N6Rj5kK2K9J6rl4l9rL8O4M6J2rj2k2m0m6k0K3M9N1L7J8pk6j8J1K2nm3m8j9PJ2
2138A134OKjomMJ0J7L2M0K0j2j9LJ7Jk0j7j1j9k7jL9M6J4k1l1k5mL0N3L0k4m3mM3M1Jj6lP
$$ plain form
2171 4444 4431 4411 4383 4352 4304 4228 4148 4097 4072 4039 3994 3969 3976 3979 3949 3912 3906 3923 3921 3884 3827 3763 3698 3643 3618 3616 3612 3595 3575 3555 3527 3489 3457 3439 3422 3400 3381
2167 3381 3364 3328 3261 3186 3137 3123 3128 3138 3142 3122 3060 2969 2885 2844 2844 2862 2875 2875 2870 2872 2883 2900 2910 2902 2875 2837 2806 2793 2789 2780 2761 2744 2738 2740 2749 2765 2775 2764 2740 2724
2162 2724 2718 2701 2666 2641 2647 2652 2617 2549 2494 2468 2449 2424 2404 2399 2394 2377 2358 2348 2346 2350 2359 2362 2335 2275 2203 2135 2065 1990 1935 1913 1904 1881 1853 1841 1846 1845 1833 1819 1806 1786
2157 1786 1757 1728 1704 1679 1655 1639 1636 1640 1652 1670 1683 1679 1658 1633 1610 1592 1581 1576 1566 1547 1535 1541 1541 1509 1457 1423 1416 1417 1421 1444 1481 1493 1460 1413 1392 1401 1419 1431 1432 1419
2152 1419 1397 1388 1396 1399 1377 1352 1352 1367 1363 1333 1301 1285 1275 1256 1234 1224 1238 1271 1304 1308 1275 1233 1220 1239 1258 1260 1257 1263 1270 1266 1264 1277 1290 1279 1241 1210 1213 1246 1279 1296 1296
2147 1296 1285 1260 1223 1190 1184 1200 1216 1221 1230 1253 1271 1257 1210 1165 1149 1162 1188 1205 1201 1175 1143 1118 1100 1081 1070 1082 1111 1134 1138 1133 1124 1107 1085 1073 1067 1040 986 947
2142 947 968 1035 1091 1100 1085 1083 1105 1134 1150 1141 1107 1068 1059 1097 1161 1207 1219 1210 1198 1176 1136 1090 1070 1093 1142 1193 1230 1248 1241 1215 1197 1208 1230 1225 1182 1134 1115 1122 1134
2138 1134 1140 1142 1141 1135 1131 1135 1145 1162 1194 1234 1254 1242 1223 1226 1243 1244 1224 1207 1196 1177 1150 1149 1188 1234 1248 1227 1196 1171 1167 1197 1250 1280 1256 1213 1209 1252 1293 1294 1278 1275 1282
2133A282rk2lK7M0L2J6lk8l9k0J4K5jk4j1K4L6J7ljJ0PnlJ2K7L5L5K4MkK4O4P4L9j4m8m0k
2128A590L7N2L7J3%JOJ7L1L3J7PK5M9L5KON8R4N5k4o2l5J6M5N0M9M9M4M0L8N0O2N9L0%NL9
2123B620O1N7O2Q8J05P7L5K8N9Q6Q7P9P9Q6J00J17J24J12J08J31J61J61J39J44J75J84J63
2120E428J56J91K25K17J89J87K03K03J92K03K33K46K35K26K29K31K18K05J99J81J33Q1N8P3
2117I942R1P1J2n2q2p5o9j04j67k09k00j70j64j96k30k37k24k13k05j87j63j57j72j77j47
2114F516j07j08j42j57j35j13j26j46j33r2p0p7q4p5o6p2q0o9m4k4j6k4m3o6p5o1l4j8k5m1
2110D193m1j9RJ7OKJ8L7L5J8J3K8M8N4M8M6N6P7J02J24J35J39J38J39J50J68J79J80J94K31
2106F524K65K61K43K59L15L47L29L16L61M32M69M82N32O27P12P80Q75J022J175J298J381J410
$$ plain form
2133 1282 1273 1251 1248 1275 1315 1347 1363 1360 1332 1293 1273 1287 1312 1311 1287 1276 1300 1336 1353 1350 1349 1359 1366 1361 1358 1370 1397 1432 1467 1491 1495 1493 1517 1581 1655 1694 1680 1632 1592 1590
2128 1590 1627 1679 1716 1729 1729 1730 1736 1753 1784 1817 1834 1841 1866 1915 1950 1952 1958 2016 2110 2165 2141 2079 2044 2060 2105 2155 2204 2253 2297 2337 2375 2425 2487 2546 2576 2576 2581 2620
2123 2620 2681 2738 2800 2888 2993 3070 3105 3133 3192 3278 3365 3444 3523 3609 3709 3826 3950 4062 4170 4301 4462 4623 4762 4906 5081 5265 5428
2120 5428 5584 5775 6000 6217 6406 6593 6796 6999 7191 7394 7627 7873 8108 8334 8563 8794 9012 9217 9416 9597 9730 9811 9869 9942
2117 9942 10033 10104 10116 10064 9982 9907 9838 9734 9567 9358 9158 8988 8824 8628 8398 8161 7937 7724 7519 7332 7169 7012 6840 6663 6516
2114 6516 6409 6301 6159 6002 5867 5754 5628 5482 5349 5257 5187 5110 5026 4951 4885 4813 4733 4664 4620 4596 4580 4556 4513 4447 4372 4311 4277 4259 4234 4193
2110 4193 4152 4133 4142 4159 4165 4167 4185 4222 4257 4275 4288 4316 4364 4418 4466 4512 4568 4645 4747 4871 5006 5145 5283 5422 5572 5740 5919 6099 6293 6524
2106 6524 6789 7050 7293 7552 7867 8214 8543 8859 9220 9652 10121 10603 11135 11762 12474 13254 14129 15151 16326 17624 19005 20415
2104B0415J350J199R90O93K21m14j026j397j502j478j438j367j239j087r66q71p81o95o34
2101I973n90n40m74m05l54l23l02k81k53k23k02j87j66j40j29j31j30j03p2o9j01j28j12o5
2098D493l1m0o1o1m5m1m9l7PM2K9k1n2l6NJ9j0n2n7j4L4M1J0j5j0kj1k2oJ8K8K6L1L6J9j2
2094D153k8k8k7k7j0K4N4O0M7K0l%L2N3L5OQL2L6J3JJ8K9K0J4K0J4j0j1L2P2O2K3JjKJ4N0
2089D800Q1P1L7K2L4L4J6K1N3P1M9K6L6N6M7J5QL7O7O5N2N6Q0R4P8M9L0K9L6M4N3N6N1M8O5
2085F467R3R7O6L3K9L5K3OJ5M9O9O4N4M8L4QLL0O0N7L5L2M4M4K9K8N3P5P1M4K1J9L8O6Q0O7
2081H086L9L0N1P8Q2O9O5Q1R2Q1N7M3L9M0M3M8N7O1N2L0Kj1J1N1P9P2M7M0N4O8P2P1O6N2L9
2076I937M7Q1J09J05Q3P5R2J14J22J18J14J15J12R7Q7J07J53J75J46R7P9J05J33J37J33J32
$$ plain form
2104 20415 21765 22964 23954 24647 24868 24454 23428 22031 20529 19051 17613 16246 15007 13920 12954 12083 11302 10607 9973
2101 9973 9383 8843 8369 7964 7610 7287 6985 6704 6451 6228 6026 5839 5673 5533 5404 5273 5143 5040 4968 4899 4798 4670 4558 4493
2098 4493 4462 4422 4361 4300 4255 4214 4165 4128 4135 4177 4206 4185 4133 4097 4102 4121 4111 4059 4002 3988 4022 4063 4073 4058 4048 4046 4035 4013 4007 4025 4053 4079 4110 4146 4165 4153
2094 4153 4125 4097 4070 4043 4033 4057 4111 4171 4218 4238 4235 4235 4267 4320 4355 4361 4369 4401 4437 4450 4451 4469 4498 4518 4532 4552 4566 4556 4545 4577 4649 4711 4734 4735 4734 4736 4750 4800
2089 4800 4881 4952 4989 5011 5045 5079 5095 5116 5169 5240 5289 5315 5351 5407 5454 5469 5477 5514 5581 5646 5698 5754 5834 5928 6006 6055 6085 6114 6150 6194 6247 6303 6354 6402 6467
2085 6467 6560 6657 6723 6756 6785 6820 6843 6849 6864 6913 6982 7046 7100 7148 7182 7190 7193 7223 7283 7340 7375 7407 7451 7495 7524 7552 7605 7680 7751 7795 7816 7835 7873 7939 8019 8086
2081 8086 8125 8155 8206 8284 8366 8435 8500 8581 8673 8754 8811 8854 8893 8933 8976 9024 9081 9142 9194 9224 9226 9215 9226 9277 9356 9428 9475 9515 9569 9637 9709 9780 9846 9898 9937
2076 9937 9984 10065 10174 10279 10362 10437 10529 10643 10765 10883 10997 11112 11224 11321 11408 11515 11668 11843 11989 12086 12165 12270 12403 12540 12673 12805
2073A2805J25J07J04J21J35J35J46J76J88J56J23J38J75J79J59J74K23K45K17J85J84J79J49
2070A6528J31J70K27K41K14K06K33K56K52K43K43K41K20K02K08K36K53K48K31K23K39K67K77
2068B1789K58K35K41K79L17L29L17L06L12L37L65L72L57L42L51L73L88L88L97M21M44M48M43
2065B9809M48M69M98N24N39N36N21N12N29N77O37O87P06O99O89P05P56Q10Q37Q37Q33Q40Q51
2062D4849Q54Q59Q74Q87Q93Q98R16R28R03Q49Q06Q03Q23Q35Q39Q50Q70Q86Q91Q97R17R55J007
2059F5089J063J113J159J220J301J373J413J438J486J558J624J665J706J771J860J958K055
2057I0852K133K179K212K267K361K463K555K647K752K852K932L021L151L317L484L641L799
2055A38618L956M105M261M445M660M879N089N311N567N852O146O443O755P100P479P872Q266
$$ plain form
2073 12805 12930 13037 13141 13262 13397 13532 13678 13854 14042 14198 14321 14459 14634 14813 14972 15146 15369 15614 15831 16016 16200 16379 16528
2070 16528 16659 16829 17056 17297 17511 17717 17950 18206 18458 18701 18944 19185 19405 19607 19815 20051 20304 20552 20783 21006 21245 21512 21789
2068 21789 22047 22282 22523 22802 23119 23448 23765 24071 24383 24720 25085 25457 25814 26156 26507 26880 27268 27656 28053 28474 28918 29366 29809
2065 29809 30257 30726 31224 31748 32287 32823 33344 33856 34385 34962 35599 36286 36992 37691 38380 39085 39841 40651 41488 42325 43158 43998 44849
2062 44849 45703 46562 47436 48323 49216 50114 51030 51958 52861 53710 54516 55319 56142 56977 57816 58666 59536 60422 61313 62210 63127 64082 65089
2059 65089 66152 67265 68424 69644 70945 72318 73731 75169 76655 78213 79837 81502 83208 84979 86839 88797 90852
2057 90852 92985 95164 97376 99643 102004 104467 107022 109669 112421 115273 118205 121226 124377 127694 131178 134819 138618
2055 138618 142574 146679 150940 155385 160045 164924 170013 175324 180891 186743 192889 199332 206087 213187 220666 228538 236804
2053B36804Q679R148R687J0265J0848J1447J2098J2805J3561J4378J5269J6221J7212J8248
2051D16670J9372K0598K1904K3278K4732K6283K7923K9661L1509L3453L5446L7467L9562M1760
2050H29618M4014M6230M8363N0425N2411N4247N5839N7116N8041N8572N8632N8125N6966N5114
2048A583713N2555M9279M5259M0509L5082K9071K2576J5719Q656J530n557j2493j9107k5221
2046A821571l0744l5658l9943m3533m6402m8594n0180n1195n1674n1688n1313n0594m9568
2045A220485m8313m6921m5423m3812m2108m0366l8620l6863l5104l3390l1772l0247k8778
2043G18768k7360k6004k4724k3520k2409k1397k0477j9642j8884j8191j7528j6884j6285j5744
2041D29719j5234j4718j4202j3719j3264j2804j2327j1861j1415j0973j0526j0092r680r278
$$ plain form
2053 236804 245483 254631 264318 274583 285431 296878 308976 321781 335342 349720 364989 381210 398422 416670
2051 416670 436042 456640 478544 501822 526554 552837 580760 610421 641930 675383 710829 748296 787858 829618
2050 829618 873632 919862 968225 1018650 1071061 1125308 1181147 1238263 1296304 1354876 1413508 1471633 1528599 1583713
2048 1583713 1636268 1685547 1730806 1771315 1806397 1835468 1858044 1873763 1882419 1883949 1878392 1865899 1846792 1821571
2046 1821571 1790827 1755169 1715226 1671693 1625291 1576697 1526517 1475322 1423648 1371960 1320647 1270053 1220485
2045 1220485 1172172 1125251 1079828 1036016 993908 953542 914922 878059 842955 809565 777793 747546 718768
2043 718768 691408 665404 640680 617160 594751 573354 552877 533235 514351 496160 478632 461748 445463 429719
2041 429719 414485 399767 385565 371846 358582 345778 333451 321590 310175 299202 288676 278584 268904 259626
2040B59626q873q474q091p719p370p061o784o501o193n895n638n407n179m960m761m562m347
2037A51811m142l988l865l717l534l357l216l092k965k842k734k647k572k498k404k278k153
2035I9807k064k016j966j895j818j753j689j611j537j489j454j405j344j296j275j250j191
2033G2754j112j054j037j035j008r50q94q54q08p56p21p21p21o85o29n88n60n27m91m75m71
2031E6657m46m01l62l34k95k62k66k98l06k78k53k67l01l30l55l75l77l74m03m62n05n01m90
2028D8416m96n00m90m95n33n50n04m48m47m79m72m22l88l99m13l99l75l57l46l49l68l76l41
2025C8469k88k74l01l21l09k90k80k51k05j77j81j88j76j63j60j43j05p5p1o2k0K5M8O6J01
2022C4669J28J21J13J50K28K86L00K97L16L54M05M62N19N73O35P08P87Q54R20J015J138J264
$$ plain form
2040 259626 250753 242279 234188 226469 219099 212038 205254 198753 192560 186665 181027 175620 170441 165481 160720 156158 151811
2037 151811 147669 143681 139816 136099 132565 129208 125992 122900 119935 117093 114359 111712 109140 106642 104238 101960 99807
2035 99807 97743 95727 93761 91866 90048 88295 86606 84995 83458 81969 80515 79110 77766 76470 75195 73945 72754
2033 72754 71642 70588 69551 68516 67508 66558 65664 64810 64002 63246 62525 61804 61083 60398 59769 59181 58621 58094 57603 57128 56657
2031 56657 56211 55810 55448 55114 54819 54557 54291 53993 53687 53409 53156 52889 52588 52258 51903 51528 51151 50777 50374 49912 49407 48906 48416
2028 48416 47920 47420 46930 46435 45902 45352 44848 44400 43953 43474 43002 42580 42192 41793 41380 40981 40606 40249 39903 39554 39186 38810 38469
2025 38469 38181 37907 37606 37285 36976 36686 36406 36155 35950 35773 35592 35404 35228 35065 34905 34762 34657 34582 34511 34449 34429 34454 34502 34568 34669
2022 34669 34797 34918 35031 35181 35409 35695 35995 36292 36608 36962 37367 37829 38348 38921 39556 40264 41051 41905 42825 43840 44978 46242
2019D6242J374J475J588J718J866K040K231K412K568K720K901L105L288L421L516L585L615
2017H9665L587L511L405L247K988K624K207J764J271P08J15m46r69j474j951k359k687k952
2015A02254l147l256l296l308l291l212l081k946k831k701k532k357k211k077j930j776j634
2013E6668j506j383j280j193j101r94r01q41p87p17o58o35o23n90n59n66o01o22o21o21o33
2010C9236o45o61o90p12p07o90o92o99o75o30o01n96n82n46n17n09n04m84m50m11l67l41l51
2008B6176l77l80l56l37l30l10k80k74l02l22l06k81k72k64k39k25k43k69k51k02j64j54j50
2005A9888j40j36j44j33r1m3j4jJ6M2O3P3Q6J05J20J33J61K16K71K97L07L47M33N21N70O03
2002B3550O65P42P85P94Q21Q97R88J045J067J079J092J105J108J087J020R09P77O32M66K73
$$ plain form
2019 46242 47616 49091 50679 52397 54263 56303 58534 60946 63514 66234 69135 72240 75528 78949 82465 86050 89665
2017 89665 93252 96763 100168 103415 106403 109027 111234 112998 114269 114977 115092 114646 113677 112203 110252 107893 105206 102254
2015 102254 99107 95851 92555 89247 85956 82744 79663 76717 73886 71185 68653 66296 64085 62008 60078 58302 56668
2013 56668 55162 53779 52499 51306 50205 49211 48310 47469 46682 45965 45307 44672 44049 43459 42900 42334 41733 41111 40490 39869 39236
2010 39236 38591 37930 37240 36528 35821 35131 34439 33740 33065 32435 31834 31238 30656 30110 29593 29084 28580 28096 27646 27235 26868 26527 26176
2008 26176 25799 25419 25063 24726 24396 24086 23806 23532 23230 22908 22602 22321 22049 21785 21546 21321 21078 20809 20558 20356 20192 20038 19888
2005 19888 19748 19612 19468 19335 19244 19201 19187 19186 19202 19244 19307 19380 19466 19571 19691 19824 19985 20201 20472 20769 21076 21423 21856 22377 22947 23550
2002 23550 24215 24957 25742 26536 27357 28254 29242 30287 31354 32433 33525 34630 35738 36825 37845 38754 39531 40163 40629 40902
1999D0902Q2q7k43m20o11p78q80r27r61j015j059j047r76r06q65q15p07n78n07m89m45l44
1996B6324k54k38k56k50k41k86l81m60m96n15n37n63n92o19o26o00n66n57n64n46m94m40m11
1994A5832m01l90l64l11k46k08k26k62k65k34k05j95j82j62j64j83j88j60j29j20j22j22j23
1991A0870j27j18r7q9j01j07q8o7p1q3p7o1n5n1k8J1K8J7oj5pJ0L3M8M1K0J4L3O1P5P7P7Q0
1987A0247Q0P7Q4R7J00R3Q6Q5P8N4K7K6M1L4jj8LL3K7KkMj7o8j01r1o6n7n6m9m8n2l9nJ8J
1982A0627k5k0J%j7j2K1L2Kk5kN4Q8P7N4O0R3J24J28J24J31J52J66J63J63J83K06K08J93J90
1979A3139K11K39K57K72K94L14L27L40L62L84L94L91L90L96M01M13M54N17N64N55N12M93N23
1976B2142N69N87N77N76N93O09O16O28O52O78O97P19P55P97Q41R00R96J120J248J361J471
$$ plain form
1999 40902 40984 40897 40654 40234 39623 38845 37965 37038 36077 35062 34003 32956 31980 31074 30209 29394 28687 28109 27602 27113 26668 26324
1996 26324 26070 25832 25576 25326 25085 24799 24418 23958 23462 22947 22410 21847 21255 20636 20010 19410 18844 18287 17723 17177 16683 16243 15832
1994 15832 15431 15041 14677 14366 14120 13912 13686 13424 13159 12925 12720 12525 12343 12181 12017 11834 11646 11486 11357 11237 11115 10993 10870
1991 10870 10743 10625 10528 10439 10338 10231 10143 10076 10005 9922 9845 9784 9729 9678 9650 9661 9689 9706 9700 9685 9678 9688 9721 9769 9810 9830 9844 9877 9938 10013 10090 10167 10247
1987 10247 10327 10404 10488 10585 10685 10778 10864 10949 11027 11081 11108 11134 11175 11209 11208 11190 11193 11226 11253 11255 11253 11257 11240 11172 11071 10980 10914 10857 10801 10752 10704 10652 10613 10608 10626 10627
1982 10627 10602 10582 10583 10583 10566 10554 10575 10607 10609 10584 10582 10636 10724 10801 10855 10915 11008 11132 11260 11384 11515 11667 11833 11996 12159 12342 12548 12756 12949 13139
1979 13139 13350 13589 13846 14118 14412 14726 15053 15393 15755 16139 16533 16924 17314 17710 18111 18524 18978 19495 20059 20614 21126 21619 22142
1976 22142 22711 23298 23875 24451 25044 25653 26269 26897 27549 28227 28924 29643 30398 31195 32036 32936 33932 35052 36300 37661 39132
1973C9132J601J777J999K250K508K777L088L465L889M333M796N310N901O556P251P976Q730
1971A13339R497J0241J0927J1536J2041J2387J2513J2372J1919J1111R922Q373O522M411K080
1969B59191l72k781n016p041q842j0338j1433j2121j2487j2576j2371j1900j1290j0657r997
1968A19969r265q490p764p114o491n874n309m827m398l990l622l315l035k736k431k177j998
1966C7133j853j701j542j398j277j171j069r72q80p97p34o94o64o32n92n57n26m93m54m26
1963A8701m17m22m17m01l89l86l73l49l34l36l28k89k39k19k32k40k24k07k07k07j82j36r9
1960A2068q6q5q3p9p8p9p1n1k9k1l0m5n1m7l4j5%j3n0p6o8n1o6j03j16r8r2j23j59j61j47
1957I861j55j88k15k26k31k31k14j87j76j81j75j49j28j34j40j16p7p4j12j42j22p2m2m6n8
$$ plain form
1973 39132 40733 42510 44509 46759 49267 52044 55132 58597 62486 66819 71615 76925 82826 89382 96633 104609 113339
1971 113339 122836 133077 144004 155540 167581 179968 192481 204853 216772 227883 237805 246178 252700 257111 259191
1969 259191 258819 256038 251022 243981 235139 224801 213368 201247 188760 176184 163813 151913 140623 129966 119969
1968 119969 110704 102214 94450 87336 80845 74971 69662 64835 60437 56447 52825 49510 46475 43739 41308 39131 37133
1966 37133 35280 33579 32037 30639 29362 28191 27122 26150 25270 24473 23739 23045 22381 21749 21157 20600 20074 19581 19127 18701
1963 18701 18284 17862 17445 17044 16655 16269 15896 15547 15213 14877 14549 14260 14021 13802 13570 13330 13106 12899 12692 12485 12303 12167 12068
1960 12068 11982 11897 11814 11735 11657 11578 11507 11456 11427 11406 11376 11331 11280 11233 11199 11184 11184 11171 11121 11045 10977 10926 10860 10757 10641 10543 10451 10328 10169 10008 9861
1957 9861 9706 9518 9303 9077 8846 8615 8401 8214 8038 7857 7682 7533 7405 7271 7131 7015 6938 6864 6752 6610 6488 6416 6374 6328 6270
1953F270n7n1m6l5j9j2k1l3l5l5l2j9KPj3k9j4NJj2jJ9Kl6l2L0Q4P5L1NQJ9M1P6R5P3L7L7
1949F385O5P1M1K6N5J04J30J29J25J34J58J84J94J84J75K00K57L13L50L82M13M42M63N00N56
1946A2036O09O48O87P40P92Q17Q26Q38Q41Q18P72P19O44N21L62K16R5m2k21m09n56o65p63
1943B0325q51r04r13r02q89q63q16p65p30p03o69o19n50m74m15m00m15m02l29k34j88k04k33
1940F857k31k09j93j77j49j22j16j23j23j00p7o8p0p0o4n8n9o3o1m7l0k3l2m8n3m6l6k9j8
1937D362jJ5J7Jj8j9mQnl2m4k0J8L7J7j3k2%K8M0L3K0Oqj0RL3M2K8K1L4M9M4K8K6L6K9MmJ4
1932D799L1K5PLJ3L1N4P6Q2O7N7O9P8O8O2R1J28J17O6M1Q0J38J56J34J22J37J52J47J39J55
1928G325J84K00J89J75J93K51L21L64L70L68L87M34M94N40N68O00O55P34Q05Q56R02R66J042
$$ plain form
1953 6270 6213 6162 6116 6081 6062 6050 6029 5996 5961 5926 5894 5875 5877 5884 5871 5842 5828 5833 5834 5822 5821 5840 5842 5806 5774 5804 5888 5963 5994 5999 6007 6026 6067 6143 6238 6311 6348 6385
1949 6385 6450 6521 6562 6588 6643 6747 6877 7006 7131 7265 7423 7607 7801 7985 8160 8360 8617 8930 9280 9662 10075 10517 10980 11480 12036
1946 12036 12645 13293 13980 14720 15512 16329 17155 17993 18834 19652 20424 21143 21787 22308 22670 22886 22981 22939 22718 22309 21753 21088 20325
1943 20325 19474 18570 17657 16755 15866 15003 14187 13422 12692 11989 11320 10701 10151 9677 9262 8862 8447 8045 7716 7482 7294 7090 6857
1940 6857 6626 6417 6224 6047 5898 5776 5660 5537 5414 5314 5237 5169 5099 5029 4965 4907 4848 4785 4724 4677 4647 4624 4592 4544 4491 4445 4409 4380 4362
1937 4362 4361 4376 4393 4394 4376 4357 4353 4361 4356 4324 4280 4260 4278 4315 4332 4319 4297 4297 4325 4365 4398 4418 4424 4416 4406 4415 4448 4490 4518 4539 4573 4622 4666 4694 4720 4756 4785 4789 4785 4799
1932 4799 4830 4855 4862 4865 4878 4909 4963 5039 5121 5188 5245 5314 5392 5460 5522 5613 5741 5858 5924 5965 6045 6183 6339 6473 6595 6732 6884 7031 7170 7325
1928 7325 7509 7709 7898 8073 8266 8517 8838 9202 9572 9940 10327 10761 11255 11795 12363 12963 13618 14352 15157 16013 16915 17881 18923
1925A8923J112J181J269J371J449J488J517J562J618J653J642J586J493J376J239J064Q32
1923D2375N48K47m5l35o34r32j188j376j502j598j697j789j827j779j674j576j504j419j285
1921B1010j132j018r56r08q37p41o40n59n11m82m50l99l44l01k71k44k15j96j86j75j63j52
1918A0130j44j30j08q5o4n2n6o8o9m8k0%J1J8J3j1k9j0M0P9P8N8N6Q2J19J43J38J08R0J07
1914A0376J46J65J53J49J78K09K06J90K03K50K85K87K90L24L70L95L98M03M16M42M85N47N99
1912A7466O18O22O50O98P30P31P27P30P07O38N50M88M43L71K64J51N4k5r1j41j85k39k84k89
1909B5384k58k40k51k64k39j93j57j35j10p9n9m7l0rJMJ7M6P2Q4R0R3Q5O1L0J1K0M4N2K1k9
1905B4015n7m5j9pj9m6p9j06j11r7j03j38j67j64j52j74k23k49k39k23k32k45k43k25k10k04
$$ plain form
1925 18923 20035 21216 22485 23856 25305 26793 28310 29872 31490 33143 34785 36371 37864 39240 40479 41543 42375
1923 42375 42923 43170 43125 42790 42156 41224 40036 38660 37158 35560 33863 32074 30247 28468 26794 25218 23714 22295 21010
1921 21010 19878 18860 17904 16996 16159 15418 14778 14219 13708 13226 12776 12377 12033 11732 11461 11217 11002 10806 10620 10445 10282 10130
1918 10130 9986 9856 9748 9663 9599 9547 9491 9423 9354 9306 9286 9286 9297 9315 9328 9317 9288 9278 9318 9397 9475 9533 9589 9671 9790 9933 10071 10179 10269 10376
1914 10376 10522 10687 10840 10989 11167 11376 11582 11772 11975 12225 12510 12797 13087 13411 13781 14176 14574 14977 15393 15835 16320 16867 17466
1912 17466 18084 18706 19356 20054 20784 21515 22242 22972 23679 24317 24867 25355 25798 26169 26433 26584 26638 26613 26522 26381 26196 25957 25673 25384
1909 25384 25126 24886 24635 24371 24132 23939 23782 23647 23537 23458 23399 23352 23322 23313 23314 23318 23335 23381 23453 23537 23627 23720 23805 23866 23896 23907 23927 23971 24023 24044 24015
1905 24015 23958 23913 23894 23887 23868 23822 23743 23637 23526 23429 23326 23188 23021 22857 22705 22531 22308 22059 21820 21597 21365 21120 20877 20652 20442 20238
1902B0238k19k55k89k88k58k36k43k62k73k76k72k58k38k25k23k17k13k26k46k41k13k02k30
1899A4635k62k63k53k66k85k73k36k15k29k50k59k53k47k45k47k50k39k10j79j71j80j92j95
1896I236j98j95j80j54j31j21j19j14j11j15j33j64j90j91j62j26j01q8q6r4j05j11j09j13
1893F025j24j21j01r4j15j30j01n0k7m8p6q5q2q0p8q0q6r1p9n8m8n4o3n8m7l1j6j4l1n4n7
1889C846m6m7o0n6l9l4n4o6m8k4j8k3j0Kj4n3q1p8o2m3k1%Jk1m1l8j2PNj6l4m2m2l8k5j3j3
1885B649k2j5J3K6nn8p4l2J8L1Rj7l4m2l7k1rj8l3k8oQ%j8l3l8k8kK5K5pl9l9j5PQJKLj1l0
1880B114k3J3K7j2o5o6k0Lk4n4m7j7KJ9L4J6l9p8m9J4K9mk0J2M3L2Mnlj3k6j4K3N0M8K4OJ2
1875A946L7N0L0JML9O4N8L9L7M8N4N3N0M8N1O3O8M7J2jJ6K4ll7m8m3n1o4o5o3p1p2m8k1l4
$$ plain form
1902 20238 20019 19764 19475 19187 18929 18693 18450 18188 17915 17639 17367 17109 16871 16646 16423 16206 15993 15767 15521 15280 15067 14865 14635
1899 14635 14373 14110 13857 13591 13306 13033 12797 12582 12353 12103 11844 11591 11344 11099 10852 10602 10363 10153 9974 9803 9623 9431 9236
1896 9236 9038 8843 8663 8509 8378 8257 8138 8024 7913 7798 7665 7501 7311 7120 6958 6832 6731 6643 6557 6463 6358 6247 6138 6025
1893 6025 5901 5780 5679 5585 5470 5340 5239 5189 5162 5114 5038 4953 4871 4791 4713 4633 4547 4456 4377 4319 4271 4217 4154 4096 4049 4018 4002 3988 3957 3903 3846
1889 3846 3800 3753 3693 3637 3598 3564 3510 3444 3396 3372 3354 3331 3321 3323 3309 3256 3175 3097 3035 2992 2971 2971 2972 2951 2910 2872 2860 2867 2872 2856 2822 2780 2738 2700 2675 2662 2649
1885 2649 2627 2612 2625 2651 2646 2588 2514 2482 2500 2531 2540 2523 2489 2447 2410 2389 2380 2362 2329 2301 2295 2303 2303 2285 2252 2214 2186 2184 2209 2234 2227 2188 2149 2134 2141 2149 2150 2152 2155 2144 2114
1880 2114 2091 2104 2131 2119 2054 1988 1968 1971 1947 1893 1846 1829 1831 1850 1884 1900 1861 1783 1734 1748 1777 1773 1753 1765 1808 1840 1844 1839 1836 1823 1797 1783 1806 1856 1904 1928 1934 1946
1875 1946 1983 2033 2063 2064 2068 2107 2171 2229 2268 2305 2353 2407 2460 2510 2558 2609 2672 2740 2787 2799 2798 2814 2838 2835 2798 2750 2707 2656 2592 2527 2464 2393 2321 2273 2252 2218
1871B218p5r1o3k6j3j9l1m4n1l9j6j5m3n7l3nj8o1r0q1n7l8l2l1m2n5n4l6j9j9k8l1k8k7k9
1867H21j8OK9K3nl2l3j6jOJ1J1pl5m4j6J9K0j1l2j7J4K6J1jmpk2l0j6J1K2J2PJ8K3Jl6m8l0
1862F30pmj4j5p%PJ3K0J6QLMkj9l5l4j9onj3j6pM%j4j1K0M6L6OpOJ3PJ1L5M3J9j1rJ2J9J3
1856G36J7K6J8MJ2L7L9J7J2M1N8L1mmJ4Pk1l6k7k6m1m8l2j8k6m9o1m8j0L1L5pm7l6J0K4j8
1852F10o4o4l3qMJ9L5L0Rrj9l5n2n0k6kQQKknkmj2k0j9j3j3qQJ5Jk0j6KOj0j6mMjkPJ2%j5
1846B36j9k2k5j0J9L2J6OJ7J5k5o4m8lJ0qmK6K7j3m0j4K7L7L2M3M9J9k4k8jJ1pj6MK5K1Lq
1841B96j3j8j1QK4K6J4kj7k0OM0M7J9mPK6K1OJ3L2L1RQL8N9M5K2K8O2Q9Q6O9N9O5Q0R4J00
1837A444J01J05J31J82K45K96L18L23L26L42L64L88M09M24M15L82L40L09K70J91O9n2j40k01
$$ plain form
1871 2218 2143 2052 1989 1963 1950 1931 1900 1856 1805 1766 1750 1735 1692 1635 1602 1597 1579 1518 1428 1347 1290 1252 1220 1189 1147 1092 1038 1002 983 964 936 905 877 850 821
1867 821 803 809 838 861 856 824 791 775 774 780 791 802 795 760 716 700 719 739 728 696 679 693 719 730 729 725 718 696 666 650 661 683 695 702 720 743 744 708 660 630
1862 630 623 619 605 590 583 583 590 603 623 639 647 650 654 652 633 598 564 545 539 534 521 505 498 502 502 488 477 497 543 579 585 578 584 597 604 615 650 693 712 701 692 704 723 736
1856 736 753 779 797 801 813 850 889 906 918 959 1017 1048 1044 1040 1054 1061 1040 1004 977 951 910 862 830 812 786 737 676 628 618 649 684 677 630 594 604 628 610
1852 610 546 482 449 441 445 464 499 529 538 529 510 475 423 373 347 345 353 361 363 361 356 354 350 338 318 299 286 273 265 273 288 289 269 253 255 261 251 235 231 235 234 232 239 251 251 236
1846 236 217 195 170 160 179 211 227 233 250 265 240 176 128 125 135 127 123 149 176 163 123 109 136 173 205 248 297 316 292 264 263 274 267 251 255 280 301 304 296
1841 296 283 265 254 262 286 312 326 324 307 287 293 333 380 399 395 402 428 449 455 468 500 531 540 548 586 645 690 712 740 802 891 977 1046 1105 1170 1250 1344 1444
1837 1444 1545 1650 1781 1963 2208 2504 2822 3145 3471 3813 4177 4565 4974 5398 5813 6195 6535 6844 7114 7305 7374 7322 7182 6981
1834F981k55l10l60m05m42m52m25l84l58l42l10k56k14k04k07j94j65j43j41j47j40j13q1
1831I33o4o2o1m8l4m3o9q4o7k4J7K7Kl6m8k5LKk3l5k1j0k0k7rJ5J2j5l6l0j6rj0j1qkOMj0
1826F4k0oJ6J7j1l1oL7N1Qn3p3l9J2K1j2l6k3MMj6j9lJj4j7J1L8L6J3jkKNJ3J5Kj2j2pj3k0
1821g6j2%lj4mK0K6Mj3KK5L2J9%j6k0JK8K5j8n9m8LL4J1l6n5l0OK0J3jj3k2j6RL1J7k0k4K4
1816a50O4L4m2o9k1L4L0%mJ6J7jkJ7K1%k3k9l1l0j3J3K1kk6k2JJ2Lj6l0l2j6J0K0jk4k0MK3
1811b64J8Knqj0nJ3K9K5kk2j4QJ5NkNLj9l9k2K2M5K5rj5mnk7l9k0QJ7RQJ5Ml4o0m3PL6K5%
1806c24j1oJ0L0M7M5L3L1L8J8l2o5n0j1J2K6M9N4Ko4p7l2NPOJ9J3j7k0K0M5J3l5m3k2j6j7
1801c19JK1J3jJ2K8Pk2j0K3J5l1m4j1J2MJJ7Rk6l4J0L9Rk7qL2K8pj1J5J4k6m9l6j5j0jK1L0
$$ plain form
1834 6981 6726 6416 6056 5651 5209 4757 4332 3948 3590 3248 2938 2682 2468 2264 2057 1863 1698 1555 1414 1267 1127 1014 933
1831 933 869 807 746 698 664 621 552 468 401 377 394 421 423 387 339 314 317 319 296 261 240 230 210 183 174 189 201 186 150 120 104 95 85 74 66 64 70 74 64
1826 64 44 38 54 71 60 29 23 60 111 119 66 -7 -46 -34 -13 -25 -61 -84 -80 -76 -92 -111 -114 -113 -127 -144 -133 -95 -59 -46 -47 -49 -47 -42 -29 -14 -12 -24 -36 -43 -56 -76
1821 -76 -88 -88 -91 -105 -109 -89 -63 -59 -72 -70 -45 -13 6 6 -10 -30 -29 -1 24 6 -53 -101 -98 -64 -53 -89 -144 -174 -168 -148 -135 -136 -149 -171 -187 -178 -147 -130 -150 -174 -150
1816 -150 -86 -52 -94 -163 -184 -150 -120 -120 -124 -108 -91 -92 -94 -77 -56 -56 -79 -108 -139 -169 -182 -169 -148 -150 -176 -198 -197 -185 -182 -198 -228 -260 -276 -266 -246 -247 -271 -291 -287 -264
1811 -264 -246 -244 -249 -257 -267 -272 -259 -230 -205 -207 -229 -243 -235 -220 -215 -217 -212 -209 -228 -267 -289 -267 -222 -197 -206 -221 -225 -230 -257 -296 -316 -308 -291 -282 -274 -259 -255 -289 -349 -392 -385 -349 -324 -324
1806 -324 -335 -341 -331 -301 -254 -209 -176 -145 -107 -89 -121 -186 -236 -247 -235 -209 -160 -106 -104 -168 -245 -277 -272 -265 -259 -240 -227 -244 -264 -244 -199 -186 -221 -264 -286 -302 -319
1801 -319 -318 -297 -284 -285 -273 -245 -238 -260 -270 -247 -232 -263 -307 -318 -306 -302 -301 -284 -275 -301 -335 -325 -286 -277 -304 -312 -280 -252 -259 -270 -255 -241 -267 -316 -352 -367 -377 -378 -357 -327
1796c27J1nOK5K4PjKMj0k9l3j2K3M1K9Mo%J1K3L8L5Nk9l4j5j0l1m3j7K0L9L0J0rk4j7J3L3
1791b19J1l8o4l4J8M9M0J0j2rQK2J1j4l2k8j7j7j9pOJk1j7K1M3J1l7l0L0N8J6l5k0L6N4J4
1787b11l4m6l1rJ6L6L7K0QRNj1j6nJj3l0l2j8mJ7L4K9nl3k6NK3K4K1J2oj7MM4N2J2l7n5l8
1782b68j5%QJ2J3J3J4Kk0m4m8k4J4M0L8J5NK6M9M3J2JK7N0L2j2l1rJ9K6K8M9Q1R1P1M3L6N1
1777D38Q0J06J22J30J31J26J15J13J30J55J55J19O4L4L2L0Ll5o0p0q1r3r9r3q5p8p1o3n7o0
1774A138o8p5p2n3k8k0l1l8j2K1K0j7l3KN5P4O6O7R1J11J09J08J34J92K60L07L32L46L73M17
1770C776M67N14N58N86N78N30M68M07L24J95L7j03k10l11m21n14n66n79n69n44n07m56l93
1767C267l29k84k74k75k39j73j32j44j70j58j18j06j29j32r2m6m0o7q3o4l4l0n3o9n5k4mr
$$ plain form
1796 -327 -316 -321 -315 -290 -266 -259 -260 -258 -254 -264 -293 -326 -338 -315 -274 -245 -241 -247 -247 -236 -213 -175 -140 -135 -164 -198 -213 -223 -254 -297 -314 -294 -255 -225 -215 -224 -248 -265 -252 -219
1791 -219 -208 -246 -310 -344 -326 -277 -237 -227 -239 -248 -240 -218 -207 -221 -253 -281 -298 -315 -334 -341 -335 -334 -355 -372 -351 -308 -297 -334 -364 -334 -276 -260 -295 -315 -279 -225 -211
1787 -211 -245 -291 -322 -331 -315 -279 -242 -222 -214 -205 -200 -211 -227 -232 -231 -244 -274 -306 -324 -328 -311 -277 -248 -253 -286 -312 -307 -284 -260 -239 -227 -233 -250 -246 -202 -150 -138 -175 -230 -268
1782 -268 -283 -283 -275 -263 -250 -237 -223 -221 -241 -285 -333 -357 -343 -303 -265 -250 -245 -219 -170 -127 -115 -114 -87 -37 -5 -17 -48 -57 -38 -12 16 65 146 237 308 351 387 438
1777 438 518 624 746 876 1007 1133 1248 1361 1491 1646 1801 1920 1984 2018 2050 2080 2083 2048 1988 1918 1837 1744 1645 1552 1467 1389 1318 1255 1198 1138
1774 1138 1070 995 923 870 842 822 791 753 741 762 782 765 732 734 789 863 929 996 1087 1198 1307 1415 1549 1741 2001 2308 2640 2986 3359 3776
1770 3776 4243 4757 5315 5901 6479 7009 7477 7884 8208 8403 8440 8337 8127 7816 7395 6881 6315 5736 5167 4623 4116 3660 3267
1767 3267 2938 2654 2380 2105 1866 1693 1561 1417 1247 1089 971 865 736 604 512 466 426 359 276 212 178 148 95 26 -29 -53 -57 -66
1764f6k8l8l7l0j4J2L1K7Prj1j6k7k7j2kpj9j9j0j2k3k8j2J3L5M3L6J2j5l1k7qJ6L6L8J8j0
1759b14k7k5k0j8j2KJ7J2pk2j5MJ4J1LKJ1J7J0nj7j8k1j7KK8L3Kl4l5j1NPRJ4OrOM9O8K7j9
1754a87mN1O7K5pJ6N1N3K9K0J9Lj9j3RJ1j8m0l8l2l7l3j8j3l3m9k7PQk4m4k9qoj5j3mqk7l8
1749d15k7mK0L4L6K2lj7j2nj6l6l6qPj5l7j7L1M2jm4l9kJ6RJ0K4K6Nj5j5jPRJ0RNjqj8j7J0
1744d77M6N4K6qk1j6pOK3K4%k4j7J1L0K4RJjLQMj0k1j9j1%J3L2M0K8Plj1k4k0J7N3M1L%M9
1739a38R0P4K9%kJ0K0K3J3%JQjk5k5jLk2l8j9jj6l2j3J4Pj9k1lmj4%K9K4j5l5j2J8K4K1J7
1734c1ol6l1J0K9ml9k5J8K8Mj3pMKklkkjJlqj5l0n0n5l2pLNJ8L2K4RQJ7Pk1l0pJ9J8%rlLN
1728b08J8M2N3L2KkK5N0M8K8K7N2P9Q7Q2Q5J02J29J45J37J10R2J03J28J37J34J43J58J51J17
$$ plain form
1764 -66 -94 -132 -169 -199 -213 -201 -170 -143 -136 -145 -156 -172 -199 -226 -238 -240 -247 -266 -285 -295 -307 -330 -358 -370 -357 -322 -279 -243 -231 -246 -277 -304 -312 -296 -260 -222 -204 -214
1759 -214 -241 -266 -286 -304 -316 -314 -297 -285 -292 -314 -329 -325 -311 -300 -297 -295 -284 -267 -257 -262 -279 -297 -318 -335 -333 -305 -272 -270 -304 -339 -350 -345 -338 -329 -315 -309 -318 -312 -263 -195 -168 -187
1754 -187 -191 -140 -73 -48 -55 -39 12 65 94 114 133 136 117 104 113 124 106 66 28 -4 -41 -74 -92 -105 -138 -187 -214 -207 -199 -223 -267 -296 -304 -310 -325 -338 -342 -350 -377 -415
1749 -415 -442 -446 -426 -392 -356 -334 -337 -354 -366 -371 -387 -423 -459 -467 -460 -475 -512 -529 -498 -456 -457 -501 -540 -542 -526 -517 -507 -483 -457 -452 -467 -482 -483 -476 -467 -457 -448 -443 -444 -452 -470 -487 -477
1744 -477 -431 -377 -351 -359 -380 -396 -403 -397 -374 -350 -350 -374 -391 -380 -350 -326 -317 -316 -317 -314 -306 -302 -312 -333 -352 -363 -363 -350 -318 -278 -250 -243 -246 -257 -281 -301 -284 -231 -190 -187 -187 -138
1739 -138 -48 26 55 55 53 63 83 106 119 119 120 128 127 102 77 76 79 57 19 0 -1 -17 -49 -62 -48 -41 -60 -81 -84 -88 -102 -102 -73 -49 -64 -99 -111 -93 -69 -48 -31
1734 -31 -37 -73 -104 -94 -65 -69 -108 -133 -115 -87 -83 -96 -103 -99 -97 -99 -102 -104 -106 -107 -106 -109 -117 -132 -162 -212 -267 -299 -306 -303 -298 -280 -248 -224 -215 -207 -190 -183 -204 -234 -241 -222 -204 -204 -213 -216 -213 -208
1728 -208 -190 -148 -95 -63 -61 -63 -38 12 60 88 115 167 246 333 415 500 602 731 876 1013 1123 1215 1318 1446 1583 1717 1860 2018 2169 2286
1724B286Q3O0K3l7r0j14j26j40j44j22j00j02j13j05q7q2q4o6l3qrj9l5n3o1l8J0N5P2N2J8
1720H91KK9O9P1L9L8R3J46J46J25J47K03K28K23K38K85L23L40L72M26M64M64M62M82M95M63
1717G264L88K93J83O4n5j71k85l78m19m17m12m09l78l23k91k89k73k14j59j44j40j08o8n1
1714C208m6k5rl4q2r8o7k0PPj0k2oL6O8P6R4J48K08K36K43K72L12L37L54M04M87N55N87O10
1711G830O45O89P29P53P44O98O33N79N28M54L72L35L69M52N36O02O64P33Q03Q34P88O65N03
1708B1938L12O1k44n20o95p93q87r81j020r97r71r72r56q94q06p20o27n28m47l90l24k40j77
1705H122j50j17l8N6J20J59K05K67L29L95M70N47O14P00Q18R36J014J069J161J313J499J681
1702B1170J849K021K221K459K712K936L104L226L292L253L052K667K095J322L79o28j552k293
$$ plain form
1724 2286 2369 2429 2452 2415 2325 2211 2085 1945 1801 1679 1579 1477 1364 1259 1172 1090 1006 940 907 899 890 871 836 783 722 684 694 749 821 873 891
1720 891 893 922 991 1062 1101 1139 1232 1378 1524 1649 1796 1999 2227 2450 2688 2973 3296 3636 4008 4434 4898 5362 5824 6306 6801 7264
1717 7264 7652 7945 8128 8192 8137 7966 7681 7303 6884 6467 6055 5646 5268 4945 4654 4365 4092 3878 3719 3575 3435 3327 3259 3208
1714 3208 3162 3137 3128 3094 3012 2914 2847 2827 2834 2841 2831 2809 2803 2839 2907 2983 3077 3225 3433 3669 3912 4184 4496 4833 5187 5591 6078 6633 7220 7830
1711 7830 8475 9164 9893 10646 11390 12088 12721 13300 13828 14282 14654 14989 15358 15810 16346 16948 17612 18345 19148 19982 20770 21435 21938
1708 21938 22250 22311 22067 21547 20852 20059 19172 18191 17171 16174 15203 14231 13275 12381 11575 10855 10228 9700 9253 8863 8539 8299 8122
1705 8122 7972 7855 7817 7873 7993 8152 8357 8624 8953 9348 9818 10365 10979 11679 12497 13433 14447 15516 16677 17990 19489 21170
1702 21170 23019 25040 27261 29720 32432 35368 38472 41698 44990 48243 51295 53962 56057 57379 57758 57130 55578 53285
1700E3285k821l132l246l226l159l068k919k691k427k188j978j779j582j406j246j086r21
1698A4410p76o62n64m65l72l00k33j43l2O2J14J66K56L72M67N43O42P86R37J067J201J371
1695A8847J563J754J947K164K403K641K869L076L229L288L225L026K659K107J387N25m44j435
1693E4831k292k887l216l368l405l329l145k914k682k451k209j981j782j603j428j269j133
1691A3737j005q79p73o92o08n06m13l63l35k80j97j24q4n2jN9J08J42J72K10K57L11L60L93
1688I437M30N00O04P06P79Q33Q90R34R40R16Q88Q37P00M53J54j15l44n72p94r52j015j027
1685A5182j035j035j003r50r02q48p70o77o05n57n09m59m23l96l50k91k51k48k50k28j93j65
1683C037j52j39j21r3o6n7p4q2n3oOl3p0p3o0o0n0pM1N0K1OL1P7J19J49J71J78J81J96K23
$$ plain form
1700 53285 50464 47332 44086 40860 37701 34633 31714 29023 26596 24408 22430 20651 19069 17663 16417 15331 14410
1698 14410 13634 12972 12408 11943 11571 11271 11038 10895 10863 10925 11039 11205 11461 11833 12300 12843 13485 14271 15208 16275 17476 18847
1695 18847 20410 22164 24111 26275 28678 31319 34188 37264 40493 43781 47006 50032 52691 54798 56185 56710 56266 54831
1693 54831 52539 49652 46436 43068 39663 36334 33189 30275 27593 25142 22933 20952 19170 17567 16139 14870 13737
1691 13737 12732 11853 11080 10388 9780 9274 8861 8498 8163 7883 7686 7562 7478 7426 7425 7484 7592 7734 7906 8116 8373 8684 9044 9437
1688 9437 9867 10367 10971 11677 12456 13289 14179 15113 16053 16969 17857 18694 19394 19847 20001 19886 19542 18970 18176 17224 16209 15182
1685 15182 14147 13112 12109 11159 10257 9409 8639 7962 7357 6800 6291 5832 5409 5013 4663 4372 4121 3873 3623 3395 3202 3037
1683 3037 2885 2746 2625 2532 2466 2409 2335 2253 2200 2194 2200 2167 2097 2024 1964 1904 1854 1847 1888 1938 1959 1965 1996 2073 2192 2341 2512 2690 2871 3067 3290
1679C290K49K67K80K91K77K26J45O4j1q5j55j97j90j46j10j02r4m3M6J15J42J56J93K35K55
1676E098K64K97L40L43K71J53K8r1k09l12l73l88l76l65l64l57l35k93k43j87j29q2o1o1m6
1673B522%N7Q8R3J11J61K24K71K92K97L04L23L46L42K85J81P0ml9n7o3l6M2J45K38L06L85
1670F884N04O46P68Q56R36J037J139J200J194J119R71P42M10j9m83q78j124j224j243j231
1667A2204j192j114j015r07p91o74n82n18m60l89l25k85k54k07j56j23r6n6j5RL1Q1J36J48
1664C450J11Q4Q8R6Q3P5R4J25J51J85K47L22L93M73N79P01Q02Q74R49J049J162J244J248J167
1661A5752J024Q33N61J75k95p41j065j239j290j260j196j137j074r74q36p07o21n62n07m56
1659D385m16l58k78k14j98k01j69j21j09j30j29q9n4n2n1k1J7K1kj3J0M5P3Q3Q7R1J07J34
$$ plain form
1679 3290 3539 3806 4086 4377 4654 4880 5025 5089 5078 4993 4838 4641 4451 4305 4195 4093 3999 3956 4002 4117 4259 4415 4608 4843 5098
1676 5098 5362 5659 5999 6342 6613 6766 6794 6703 6494 6182 5809 5421 5045 4680 4316 3959 3624 3331 3088 2901 2772 2690 2629 2568 2522
1673 2522 2522 2579 2667 2760 2871 3032 3256 3527 3819 4116 4420 4743 5089 5431 5716 5897 5967 5963 5924 5867 5804 5768 5810 5955 6193 6499 6884
1670 6884 7388 8034 8802 9658 10594 11631 12770 13970 15164 16283 17254 17996 18406 18387 17904 17026 15902 14678 13435 12204
1667 12204 11012 9898 8883 7976 7185 6511 5929 5411 4951 4562 4237 3952 3698 3491 3335 3212 3116 3060 3045 3054 3085 3166 3302 3450
1664 3450 3561 3645 3733 3829 3912 3987 4081 4206 4357 4542 4789 5111 5504 5977 6556 7257 8059 8933 9882 10931 12093 13337 14585 15752
1661 15752 16776 17609 18170 18345 18050 17309 16244 15005 13715 12455 11259 10122 9048 8074 7238 6531 5910 5348 4841 4385
1659 4385 3969 3611 3333 3119 2921 2720 2551 2430 2321 2191 2062 1973 1919 1867 1816 1795 1812 1833 1831 1818 1828 1873 1946 2029 2116 2207 2314 2448
1655B448J68K06K41K74L02L33L69L98M08L96L60K96K01Q7j7j14k19l21l89m04l78l36k85k27
1652C797j74j29q1k9K0O5J20J89K49K93L51M43N49O22O63P03P48P53O83N52L91K07j5k74n19
1649A0177o90p58p52p26p02o63n84m82m06l77l58l05k31j85j82j83j48r4n9m8l9k2j1nK3P7
1646B267J17J09Q1R2J54K25K60K65K81L45M55N78O72P35Q14R49J129J307J465J637J837K032
1644A7806K180K266K278K175J913J482Q92J60o46j389j930k225k324k285k146j959j782j620
1641A2846j427j210j040r52q76p39n74m78m58m34l65k86k38j97j38q3p0p5n6lM9Q5J11J34
1638C526J55J86K43L22L96M64N46O60Q03R52J100J249J407J581J768J955K119K236K283K231
1636B6182K048J706J179M77l36j124j746k137k314k331k245k095j913j710j486j263j074r37
$$ plain form
1655 2448 2616 2822 3063 3337 3639 3972 4341 4739 5147 5543 5903 6199 6400 6487 6470 6356 6137 5816 5427 5023 4645 4309 4024 3797
1652 3797 3623 3494 3413 3384 3404 3469 3589 3778 4027 4320 4671 5114 5663 6285 6948 7651 8399 9152 9835 10387 10778 10985 10970 10696 10177
1649 10177 9487 8729 7977 7251 6549 5886 5302 4820 4414 4037 3679 3374 3143 2958 2776 2593 2445 2351 2292 2244 2205 2183 2172 2167 2190 2267
1646 2267 2384 2493 2574 2666 2820 3045 3305 3570 3851 4196 4651 5229 5901 6636 7450 8399 9528 10835 12300 13937 15774 17806
1644 17806 19986 22252 24530 26705 28618 30100 30992 31152 30506 29117 27187 24962 22638 20353 18207 16248 14466 12846
1641 12846 11419 10209 9169 8217 7341 6602 6028 5550 5092 4658 4293 4007 3769 3572 3434 3351 3281 3206 3150 3147 3196 3281 3392 3526
1638 3526 3681 3867 4110 4432 4828 5292 5838 6498 7301 8253 9353 10602 12009 13590 15358 17313 19432 21668 23951 26182
1636 26182 28230 29936 31115 31592 31256 30132 28386 26249 23935 21604 19359 17264 15351 13641 12155 10892 9818 8881
1634H881q39p59o80o01n25m64m25l95l46k77k12j80j76j82j78j58j21p2l4j0LJ3K1L6P3J21
1631B514J61J87K22K72L14L45M00M95N90O42O74P24P78P79P10O01M67K83M2k09m29n96o98
1628I268p22o78o17n66n12m39l65l19k98k88k84k83k69k46k31k34k38k25k09k01j90j66j42
1625A546j37j39j27j05r1q4p0n7n9o3m7k0j5k7k1J3M1L1Lj3j7j8j4JJ4J2KJ2M0O2N8L8K2J9
1621G90K7M0M9M3K1NMRkk5m0m5n5p3p8n9l9m9p6p9m8j8j9l9n4o1o8o3m1j6rj6j3KJ2Mj6l6
1616a31m8l7kL3L4Nj9j3RK1J8J0kj8k0jK3L1J8nk5l6l7j8J3L8M2K7Pj1j7j2lmpJJ4J1j8m2
1611a71l0LJ3j0k8j8j1l4n3k1M0N7Qm4m2rNj3k8l6m6n1k9J6M5L6Nk3l5l1j6kNJ4K9M1K9Lj1
1606d43lJnj7j9k2k5k4j8j1lJ4L2L1RjJ1K2Qj9k3lJ1Oklok0l6l5j2J9L3K2%j2j2j5k3k3rJ
$$ plain form
1634 8881 8042 7283 6603 6002 5477 5013 4588 4193 3847 3570 3358 3178 3002 2820 2642 2484 2363 2291 2257 2247 2250 2263 2284 2320 2393 2514
1631 2514 2675 2862 3084 3356 3670 4015 4415 4910 5500 6142 6816 7540 8318 9097 9807 10408 10875 11158 11200 10991 10562 9966 9268
1628 9268 8546 7868 7251 6685 6173 5734 5369 5050 4752 4464 4180 3897 3628 3382 3151 2917 2679 2454 2245 2044 1854 1688 1546
1625 1546 1409 1270 1143 1038 947 863 793 736 677 614 567 547 532 505 484 497 538 569 572 559 542 524 510 511 525 537 539 551 591 653 711 749 771 790
1621 790 817 857 906 949 970 975 979 988 986 961 921 876 821 748 670 611 572 523 447 368 320 302 283 244 190 129 61 -2 -43 -59 -68 -84 -97 -95 -83 -79 -95 -131
1616 -131 -179 -216 -218 -185 -151 -146 -165 -178 -169 -148 -130 -120 -122 -140 -160 -161 -138 -107 -89 -94 -119 -155 -192 -210 -197 -159 -117 -90 -83 -94 -111 -123 -126 -130 -137 -136 -122 -111 -129 -171
1611 -171 -201 -198 -185 -195 -223 -241 -252 -286 -339 -360 -320 -263 -255 -299 -341 -350 -345 -358 -386 -422 -468 -519 -548 -532 -487 -451 -446 -469 -504 -535 -551 -553 -548 -534 -505 -464 -435 -432 -443
1606 -443 -446 -445 -450 -467 -486 -508 -533 -557 -575 -586 -589 -575 -543 -512 -503 -504 -493 -471 -463 -482 -505 -508 -497 -491 -493 -496 -502 -522 -558 -593 -605 -586 -553 -531 -531 -543 -555 -570 -593 -616 -625 -624
1601f24qk2k3j0jpj5j1J1L7M3J1l3m1PO4O7J9k8k5J4M5M9K8ll5n4o3o8o9n3j1M0O3M8J8JM
1597f35J1J4J1Kj4k6pL9O9M5j7n9n6k9j1j0j0KJ6K2J5M%J1J8RnKK4M0K8Mj5k5k4pJ7L3L5L2
1592d47K6Rqj2lrk9k8PM1K5k3m8l5j2%LLnj1mQJk0l1j6J2L5M5L6Rj7j9JK0K2J5LpNL9O9O4
1587b86L3J2J3J3LJ1M4O0L3qj4J7L8K0j8l7j9J5K0k1p2q0l6J3K7K7K9K2ol0k1PJ9J0LJ0J4
1582a35J2ROmj5oJ4J6nk5k2mOpm2p1o7k9J1J6kj2mok0k0LJ8PrmJ5J3k0n9o9m1RN3O3L3j3m3
1577d50m0j7PJ0qk5j8J3M4N0L8K8K3J5lj6j3KRONJ6K5J2j2j4QK0kk7j3K8M5K3%KJ4K0K9M7
1572a19M8J8pJ2N0N9L0OJ4K9K7J3J4K7L5L1K7L5N9Q9J07J02R6J12J45J69J74J81K06K26K14
1568B229J84J69J68J40O4l0r8j32j57j85k04k08k05j94j70j40j21j24j28j14q1n1l8l3k9k4
$$ plain form
1601 -624 -632 -654 -677 -687 -688 -695 -710 -721 -710 -673 -630 -619 -652 -693 -686 -622 -555 -536 -564 -589 -575 -530 -481 -453 -456 -491 -545 -608 -676 -745 -798 -809 -769 -706 -658 -640 -639 -635
1597 -635 -624 -610 -599 -597 -611 -637 -644 -605 -536 -491 -508 -567 -623 -652 -663 -673 -683 -681 -665 -643 -628 -624 -624 -613 -595 -586 -591 -589 -565 -525 -497 -493 -508 -533 -557 -564 -547 -514 -479 -447
1592 -447 -421 -412 -420 -432 -435 -444 -473 -501 -494 -453 -428 -451 -499 -534 -546 -546 -543 -540 -545 -556 -560 -552 -551 -571 -602 -618 -606 -571 -526 -490 -481 -498 -517 -516 -496 -474 -459 -456 -463 -458 -419 -350 -286
1587 -286 -253 -241 -228 -215 -212 -201 -157 -97 -64 -72 -86 -69 -31 -11 -29 -66 -85 -70 -50 -71 -143 -223 -259 -246 -219 -192 -163 -141 -147 -177 -198 -191 -172 -162 -159 -149 -135
1582 -135 -123 -114 -108 -112 -127 -133 -119 -103 -108 -133 -155 -159 -153 -160 -202 -273 -340 -369 -358 -342 -344 -356 -360 -366 -386 -406 -403 -385 -378 -387 -391 -376 -363 -383 -442 -511 -552 -543 -490 -427 -394 -407 -450
1577 -450 -490 -507 -500 -490 -498 -523 -541 -528 -484 -434 -396 -368 -345 -330 -333 -349 -362 -360 -351 -345 -340 -324 -299 -287 -299 -313 -305 -285 -287 -314 -327 -299 -254 -231 -231 -229 -215 -195 -166 -119
1572 -119 -71 -53 -60 -48 2 61 91 97 111 140 167 180 194 221 256 287 314 349 408 497 604 706 802 914 1059 1228 1402 1583 1789 2015 2229
1568 2229 2413 2582 2750 2890 2954 2924 2826 2694 2537 2352 2148 1940 1735 1541 1371 1231 1110 986 858 744 663 612 574 541 512 488
1565D88k2k0j2JK1L8M5M1L2L4N3Q4J15J28J17R8Q8Q9P1J5m8o9m7k2k6m3m4l2k1j0J4M4N7N5
1561A312O4Q8R6P4N5N9O9L9k0n6m9l1m7p7p3l6lmj6mL7Q0J03J02Q5O9O9R4J32J71J90J90J85
1557B947J97K38K83K94K66K35K30K42K39K27K26K39K47K59K93L52M05M53N26O39P67Q78R89
1554A1671J122J259J364J437J513J593J636J606J503J331J081P37L16j43n84r67j277j513
1552B3685j667j727j690j596j483j362j229j094r81q88p87o71n76n18m85m47m13l94l78l51
1549D948l19l10l23l30l03k56k11j89j86j86j72j48j25j03p9n6n0o6p8o3k6QK8L9L6J5nKL6
1546A528O3O1N1N8Q1Q9P2M0K1J8J6Oqj2rk2n4p9o6k8%KLJ5K9K2Lj1j6k3l0l3l6n4q1r1o8l1
1541A426j0k0m1n0l5k2k6m2l7qJ3om7o1k2M0P5O5L1J0J6L7N3N7N8N5M6L4M5Q1J07R1M6K3L5
$$ plain form
1565 488 466 446 434 435 456 494 539 580 612 646 699 783 898 1026 1143 1241 1329 1418 1489 1504 1456 1387 1340 1318 1292 1249 1205 1173 1152 1142 1156 1200 1257 1312
1561 1312 1376 1464 1560 1634 1689 1748 1817 1856 1836 1780 1731 1700 1653 1576 1503 1467 1464 1460 1444 1440 1477 1557 1660 1762 1847 1916 1985 2079 2211 2382 2572 2762 2947
1557 2947 3144 3382 3665 3959 4225 4460 4690 4932 5171 5398 5624 5863 6110 6369 6662 7014 7419 7872 8398 9037 9804 10682 11671
1554 11671 12793 14052 15416 16853 18366 19959 21595 23201 24704 26035 27116 27853 28169 28026 27442 26475 25198 23685
1552 23685 22018 20291 18601 17005 15522 14160 12931 11837 10856 9968 9181 8510 7934 7416 6931 6484 6071 5677 5299 4948
1549 4948 4629 4319 3996 3666 3363 3107 2896 2707 2521 2335 2163 2015 1890 1787 1708 1652 1602 1536 1458 1395 1369 1377 1405 1444 1480 1495 1490 1492 1528
1546 1528 1591 1652 1703 1761 1842 1931 2003 2043 2064 2082 2098 2104 2096 2084 2075 2053 1999 1920 1854 1826 1826 1828 1831 1846 1875 1897 1900 1889 1873 1850 1820 1787 1751 1697 1616 1525 1457 1426
1541 1426 1416 1396 1355 1305 1270 1248 1222 1180 1143 1135 1148 1142 1095 1034 1012 1052 1127 1192 1223 1233 1249 1286 1339 1396 1454 1509 1555 1589 1634 1715 1822 1913 1959 1982 2017
1537B017N0M5L5M7O3M7Ll0k4MK3J5nk2k7k3j4qoj0k0k8j9J6N7Q0Q0O9P3R1J18J45J73K04K42
1533C461K83L22L44L41L15K75K26J65Q3op4j06j21j46j75j77j54j45j68j94j85j64j68j80
1530C652j57r9o6q1j03r6p6p1o8l8JQj6l5k9j6pRL3M3L0J6K1L7M2L3K5L1N2P1P3N5M2N1O5
1525C432N8L9L9N5N8M3M7P9R4N7J5K3O1O8M0L2N8P9O3L7L9O4Q1Q3P7O7N2N2P2R4R6Q9R5J15
1521E553J29J32J36J42J41J35J29J23J11J03J14J49J83J96J92J77J73J93K46L04L25L12L09
1518I707L48M05M39M58M95N54N99O04N94N94N91N41M29K91J70Q9M7M3P2J14J51J85K39L29
1515A8088M42N50O42P27Q29R56J089J201J275J331J398J470J510J515J531J617J789K016K272
1513D2248K569K928L359L865M435N039N641O219O744P140P304P176O754O020M921L479J917
$$ plain form
1537 2017 2067 2112 2147 2194 2257 2304 2307 2277 2253 2257 2280 2295 2290 2268 2241 2218 2204 2196 2190 2180 2160 2132 2113 2129 2186 2266 2346 2415 2488 2579 2697 2842 3015 3219 3461
1533 3461 3744 4066 4410 4751 5066 5341 5567 5732 5815 5809 5735 5629 5508 5362 5187 5010 4856 4711 4543 4349 4164 4000 3832 3652
1530 3652 3495 3396 3330 3249 3146 3050 2974 2903 2835 2797 2798 2806 2790 2755 2726 2710 2703 2712 2745 2788 2818 2834 2855 2892 2934 2967 2992 3023 3075 3146 3219 3274 3316 3367 3432
1525 3432 3490 3529 3568 3623 3681 3724 3771 3850 3944 4001 4016 4039 4100 4168 4208 4240 4298 4377 4440 4477 4516 4580 4661 4744 4821 4888 4940 4992 5064 5158 5254 5343 5438 5553
1521 5553 5682 5814 5950 6092 6233 6368 6497 6620 6731 6834 6948 7097 7280 7476 7668 7845 8018 8211 8457 8761 9086 9398 9707
1518 9707 10055 10460 10899 11357 11852 12406 13005 13609 14203 14797 15388 15929 16358 16649 16819 16908 16955 16998 17070 17184 17335 17520 17759 18088
1515 18088 18530 19080 19722 20449 21278 22234 23323 24524 25799 27130 28528 29998 31508 33023 34554 36171 37960 39976 42248
1513 42248 44817 47745 51104 54969 59404 64443 70084 76303 83047 90187 97491 104667 111421 117441 122362 125841 127758
1511A27758N94j91l81j33L06P41J064J216J086N18n74k057l595m806n465n559n244m726m143
1509I6409l533k912k373k058k028k188k380k529k646k746k782k703k500k214j904j601j313
1507E5999j034p77n74m31l11j91q3j0N3J38K38L22L89M73N83O90P77Q69R81J087J170J253
1504F1611J358J461J526J563J604J646J651J608J544J499J485J502J560J664J815K021K280
1502H9398K581K909L264L663M109M566N003N418N808O143O369O457O399O174N730N056M231
1500A73278L416K777K424K415K788L580M787O342Q152J0162J2373J4832J7584K0648K3979
1498C09537K7461L0971L4461L7894M1000M3151M3610M1973L8158L1922K2667J0190m245j7923
1496F90827k8174l3998l6281l6616l6109l5115l3636l1641k9156k6302k3307k0377j7550j4739
$$ plain form
1511 127758 128352 128161 127780 127647 127953 128694 129758 130974 132060 132578 132004 129947 126352 121546 116081 110522 105278 100552 96409
1509 96409 92876 89964 87591 85533 83505 81317 78937 76408 73762 71016 68234 65531 63031 60817 58913 57312 55999
1507 55999 54965 54188 53614 53183 52872 52681 52598 52588 52641 52779 53017 53339 53728 54201 54784 55474 56251 57120 58101 59188 60358 61611
1504 61611 62969 64430 65956 67519 69123 70769 72420 74028 75572 77071 78556 80058 81618 83282 85097 87118 89398
1502 89398 91979 94888 98152 101815 105924 110490 115493 120911 126719 132862 139231 145688 152087 158261 163991 169047 173278
1500 173278 176694 179471 181895 184310 187098 190678 195465 201807 209959 220121 232494 247326 264910 285558 309537
1498 309537 336998 367969 402430 440324 481324 524475 568085 610058 648216 680138 702805 712995 708750 690827
1496 690827 662653 628655 592374 555758 519649 484534 450898 419257 390101 363799 340492 320115 302565 287826
1494B87826j1916r164o560m113j806L51K348M230O051P850R646J1434J3211J4980J6748J8399
1493C59515J9629K0048J9415J7654J4651J0156M121k841r447j4367j6962j7469j6574j4830
1491C72699j2476r629o479l262j15K920N813Q516J1015J3276J5120J6225J6322J5321J3172
1489D58438R735M973o45o093j0269j2595j3176j2491j0995q958o532l831r80J909M772P602
1487D00864J0459J3414J6500J9705K3011K6419K9930L3512L7086M0543M3770M6652M9077N0925
1485H41867N2081N2516N2344N1747N0746M9122M6735M4052M2314M3055M7305N5207O6229P9690
1484A575010R5105J12207J30837J50852J72090J94325K17143K39831K61369K80496K95641
1482C724906L04708L05064K94083K69862K31500J78782J12189L3935n0678j33330k05066k59564
$$ plain form
1494 287826 275910 266746 260186 256073 254267 254618 256966 261196 267247 275097 284743 296177 309388 324368 341116 359515
1493 359515 379144 399192 418607 436261 450912 461068 465189 462348 452901 438534 421572 404103 387529 372699
1491 372699 360223 350594 344115 340853 340738 343658 349471 357987 369002 382278 397398 413623 429945 445266 458438
1489 458438 468173 473146 472501 466408 456139 443544 430368 417877 406882 397924 391392 387561 386581 388490 393262 400864
1487 400864 411323 424737 441237 460942 483953 510372 540302 573814 610900 651443 695213 741865 790942 841867
1485 841867 893948 946464 998808 1050555 1101301 1150423 1197158 1241210 1283524 1326579 1373884 1429091 1495320 1575010
1484 1575010 1670115 1782322 1913159 2064011 2236101 2430426 2647569 2887400 3148769 3429265 3724906
1482 3724906 4029614 4334678 4628761 4898623 5130123 5308905 5421094 5455029 5404351 5271021 5065955 4806391
1481D806391k94959l13088l17300l10771k96152k75909k52497k28069k04158j81594j60703
1479A971191j41616j24483j09505r6856q6671p9110p4290p1942p1163p0647o9312o6755o3191
1478H45650n9036n4613n0102m5634m1345l7375l3832l0727k7992k5556k3377k1429j9671j8082
1476C56879j6666j5406j4253j3177j2205j1369j0626r923r269q703q223p778p363p007o694
1474A98217o354n980n649n403n175m878m523m203l954l735l498l230k959k732k601k564k557
1472A28222k519k469k455k467k429k319k190k098k019j896j721j534j363j192r84p24m45j92
1470I7206K0K22M52O95Q92J013J081J112J073R23O66L35n1m99j004j539k071k557k936l167
1468I1866l257l248l172l038k869k695k514k308k096j925j810j701j562j412j297j225j166
$$ plain form
1481 4806391 4511432 4198344 3881044 3570273 3274121 2998212 2745715 2517646 2313488 2131894 1971191
1479 1971191 1829575 1705092 1595587 1498731 1412060 1332950 1258660 1186718 1115555 1044908 975596 908841 845650
1478 845650 786614 732001 681899 636265 594920 557545 523713 492986 464994 439438 416061 394632 374961 356879
1476 356879 340213 324807 310554 297377 285172 273803 263177 253254 243985 235282 227059 219281 211918 204911 198217
1474 198217 191863 185883 180234 174831 169656 164778 160255 156052 152098 148363 144865 141635 138676 135944 133343 130779 128222
1472 128222 125703 123234 120779 118312 115883 113564 111374 109276 107257 105361 103640 102106 100743 99551 98567 97843 97398 97206
1470 97206 97226 97448 97900 98595 99487 100500 101581 102693 103766 104689 105355 105690 105639 105140 104136 102597 100526 97969 95033 91866
1468 91866 88609 85361 82189 79151 76282 73587 71073 68765 66669 64744 62934 61233 59671 58259 56962 55737 54571
1465E4571j117j091j087j081j054j022r89r46q78q00p36o94o71o55o33n98n65n54n60n58n31
1463C7751m93m60m26l77l25k90k77k66k39j98j57j30j25j32j34j23j24j62k27k86l20l51m01
1460C1728m63n21n65n98o11n95n63n30m95m51l99l49l10k81k59k41k17j88j76j96k23k24k09
1457B3064k13k39k49k30k17k41k72k74k55k48k53k51k40k37k42k33k16k11k19k14j97j86j83
1454A7744j77j67j72j84j63j11p6q4r7p6m1k9l0j3J0on2p5o2n0o5p7o4n4p6j02r0m8k5m4p3
1451A5371q8r1r1q7p9q1r5r7p7m5k5k2j8kJ3K2K5L4M7N1M0J8jj2j1NL9Q5J27J52J56J64K07
1447A5634K88L74M37M80N33O00O65P13P58Q11Q57Q69Q49Q22P98P59O82N61M18K76J35j8j81
1444B8120l31m47n34o26p21p88q00p67p20o74o35o03n80n48n02m58m33m26m18m04l84l54l16
$$ plain form
1465 54571 53454 52363 51276 50195 49141 48119 47130 46184 45306 44506 43770 43076 42405 41750 41117 40519 39954 39400 38840 38282 37751
1463 37751 37258 36798 36372 35995 35670 35380 35103 34837 34598 34400 34243 34113 33988 33856 33722 33599 33475 33313 33086 32800 32480 32129 31728
1460 31728 31265 30744 30179 29581 28970 28375 27812 27282 26787 26336 25937 25588 25278 24997 24738 24497 24280 24092 23916 23720 23497 23273 23064
1457 23064 22851 22612 22363 22133 21916 21675 21403 21129 20874 20626 20373 20122 19882 19645 19403 19170 18954 18743 18524 18310 18113 17927 17744
1454 17744 17567 17400 17228 17044 16881 16770 16694 16610 16513 16437 16396 16367 16337 16324 16334 16328 16276 16201 16139 16089 16024 15947 15883 15829 15753 15651 15561 15513 15488 15444 15371
1451 15371 15283 15192 15101 15014 14935 14854 14759 14662 14585 14540 14515 14493 14475 14473 14486 14508 14533 14567 14614 14665 14705 14723 14722 14710 14699 14704 14743 14828 14955 15107 15263 15427 15634
1447 15634 15922 16296 16733 17213 17746 18346 19011 19724 20482 21293 22150 23019 23868 24690 25488 26247 26929 27490 27908 28184 28319 28301 28120
1444 28120 27789 27342 26808 26182 25461 24673 23873 23106 22386 21712 21077 20474 19894 19346 18844 18386 17953 17527 17109 16705 16321 15967 15651
1441A5651k87k67k38j87j46j41j36q9k4RJ1L3P8Q6M6K8P5J34J38J04Q0P0M4Qj6m3j00j57j71
1437A4593j56j73k21k46k24k04k22k50k52k36k24k08j86j77j89k02j99j92j94j89j63j42j49
1435I995j72j91k08k29k31j98j64j58j66j43j04r6j30j46j14p8q6j20j30j02p4o9p4o5n1m0
1432F656l3k3j3j2j1%J5Rk3n0m3qJ2ll9o0n5m2m0m7n1m4k6qLOKoj1mJ1K3L1M7O1N2J9NM3R3
1427F436R3M8K2M4P0O2M9O6R7J20J45J84K06J93J82K16K70K87K75K88L30L38K83K01J36P8
1423A0719J4m7r5j43j97k29k24k06j91j81j72j74j73j37p8n4q7j10o9oJ1p%L9O6O7Q3J26J58
1420H703J54J50J72K06K13J97J71J44J21J05R5P8N7N5Q9J38J78J99K07K17K46L03L63L92M02
1417A3355M30M90N49N87O16O55O83O95P18P70Q31Q79R33J023J138J249J360J488J633J779
$$ plain form
1441 15651 15364 15097 14859 14672 14526 14385 14249 14160 14136 14145 14156 14189 14267 14353 14399 14427 14502 14636 14774 14878 14958 15028 15072 15080 15064 15021 14921 14764 14593
1437 14593 14437 14264 14043 13797 13573 13369 13147 12897 12645 12409 12185 11977 11791 11614 11425 11223 11024 10832 10638 10449 10286 10144 9995
1435 9995 9823 9632 9424 9195 8964 8766 8602 8444 8278 8135 8031 7935 7805 7659 7545 7467 7381 7261 7131 7029 6955 6886 6812 6747 6696 6656
1432 6656 6623 6600 6587 6575 6564 6564 6579 6588 6565 6515 6472 6464 6476 6473 6434 6374 6319 6277 6237 6190 6139 6095 6069 6061 6064 6070 6072 6066 6055 6051 6062 6085 6116 6163 6224 6276 6295 6300 6343 6436
1427 6436 6529 6577 6599 6643 6713 6775 6824 6890 6987 7107 7252 7436 7642 7835 8017 8233 8503 8790 9065 9353 9683 10021 10304 10505 10641 10719
1423 10719 10733 10686 10591 10448 10251 10022 9798 9592 9401 9220 9048 8874 8701 8564 8486 8432 8345 8235 8166 8160 8171 8164 8164 8203 8269 8336 8419 8545 8703
1420 8703 8857 9007 9179 9385 9598 9795 9966 10110 10231 10336 10431 10509 10566 10621 10710 10848 11026 11225 11432 11649 11895 12198 12561 12953 13355
1417 13355 13785 14275 14824 15411 16027 16682 17365 18060 18778 19548 20379 21258 22191 23214 24352 25601 26961 28449 30082 31861
1414C1861J940K145K391K657K927L210L503L793M089M406M722N002N242N458N628N692N629
1412A00295N474N239M890M399L788L090K306J445N66k74j072j837k539l128l598l970m226
1410A10848m338m311m199m026l787l489l164k827k476k150j921j822j812j857j979k213k507
1408F1970k773k965l085l128l068k932k777k628k447k216j981j798j651j490j308j147j032
1406B3544r30q12o96o11n52n01m56m33m24m16m23m67n43o05o35o50o58o34n65m89m51m34l98
1403A0761l44l16l15l04k63k22k09k10j92j66j48j35j19j05j05r8p0m4m7o3n3j1K6L7M2N8
1400G385Q4J09J34J66K07K62L38M17M71N10N74O77P89Q82R59J044J126J184J196J143J008
1398B0665P94N37K48j02n20r17j181j274j259j208j143j063r74q75p55o21n09m39m03l74l41
$$ plain form
1414 31861 33801 35946 38337 40994 43921 47131 50634 54427 58516 62922 67644 72646 77888 83346 88974 94666 100295
1412 100295 105769 111008 115898 120297 124085 127175 129481 130926 131492 131218 130146 128309 125770 122642 119044 115074 110848
1410 110848 106510 102199 98000 93974 90187 86698 83534 80707 78231 76081 74160 72338 70526 68669 66690 64477 61970
1408 61970 59197 56232 53147 50019 46951 44019 41242 38614 36167 33951 31970 30172 28521 27031 25723 24576 23544
1406 23544 22614 21802 21106 20495 19943 19442 18986 18553 18129 17713 17290 16823 16280 15675 15040 14390 13732 13098 12533 12044 11593 11159 10761
1403 10761 10417 10101 9786 9482 9219 8997 8788 8578 8386 8220 8072 7937 7818 7713 7608 7510 7440 7396 7349 7286 7233 7222 7248 7285 7327 7385
1400 7385 7469 7578 7712 7878 8085 8347 8685 9102 9573 10083 10657 11334 12123 13005 13964 15008 16134 17318 18514 19657 20665
1398 20665 21459 21996 22244 22142 21622 20705 19524 18250 16991 15783 14640 13577 12603 11728 10973 10352 9843 9404 9001 8627 8286
1395H286k89k15j43j06j01q3l9qj6k9NO9J03J07J31J98K78L43M12N11O22P24Q28R57J119J304
1392A4968J515J747J984K209K444K714K998L217L285L169K897K490J902J017j94j542k674
1390D4146l320l495l409l244l045k788k477k155j859j609j403j225j062r24q25p34o06m58
1387I508l61l38l25k56j62j11j08r3l6L1P6J12J65K34L12L96M92N94P03Q29R77J139J312J515
1385A6605J763K041K319K584K843L088L260L287L136K813K289J485L53r81k219l079l464l495
1382C4628l350l144k905k625k313j991j703j472j295j158j042r41q37p17n90m89m25l87l45
1380F899k90k25j62j19j07j13j18j07q2l8K1P6J02J05J32J97K75L33L79M47N44O38P10P74
1377A0271Q52R47J030J060J006Q86P30N38K69j13n50r19j121j169j143j106j058r62q25o88
$$ plain form
1395 8286 7997 7782 7639 7533 7432 7349 7310 7302 7286 7257 7262 7331 7434 7541 7672 7870 8148 8491 8903 9414 10036 10760 11588 12545 13664 14968
1392 14968 16483 18230 20214 22423 24867 27581 30579 33796 37081 40250 43147 45637 47539 48556 48362 46820 44146
1390 44146 40826 37331 33922 30678 27633 24845 22368 20213 18354 16745 15342 14117 13055 12131 11306 10572 9966 9508
1387 9508 9147 8809 8484 8228 8066 7955 7847 7754 7718 7749 7825 7937 8102 8336 8648 9044 9536 10130 10833 11662 12639 13778 15090 16605
1385 16605 18368 20409 22728 25312 28155 31243 34503 37790 40926 43739 46028 47513 47866 46885 44666 41587 38123 34628
1382 34628 31278 28134 25229 22604 20291 18300 16597 15125 13830 12672 11630 10689 9852 9135 8545 8056 7631 7244 6899
1380 6899 6609 6384 6222 6103 5996 5883 5765 5658 5576 5538 5559 5635 5737 5842 5974 6171 6446 6779 7158 7605 8149 8787 9497 10271
1377 10271 11123 12070 13100 14160 15166 16052 16782 17320 17589 17476 16926 16007 14886 13717 12574 11468 10410 9448 8623 7935
1375G935n90n32m82m24l68l28k98k66k32k13k09j97j65j22r4q6p9n8m1n2p9q5o6n7p3p8m9
1371B612j2j0l7m6k6rj3j9j2lnm%j0l8n0l2j5k1l0j8MQ%JLrk4j7J0K4J0j5l3l4rK6L1nm1l3
1366B099NK0%oJ9L8J3l6n7l9j5j1k4k5kK2K6J2jqj9k7j6J1J3j3k8ML9K7j1j6J3K7RnMJ5J3
1362B070J3J3kk2j1K4L0kk1LJ9ql7k2QLk4j6K0L8K2MKok5l5k3qpk1l1l1k0qjOJ8J9qm4l2K3
1356A870N3J9k5j1L7M8J7KL0O0N0J5j6k8j6PJ3j2l0pK9K2k4m1lL8L8J6RJ9K2K0J9J8J3PKj2
1352B268k4j3J6K8J4mj0j1oJ4L7M2L2M0N8M5%j5J7M4L1J6M2P7P0M9O5J02J10Q5P8J07J35J35
1348C674J25J23J25J25J35J49J52J54J73K10K37K40K43K58K86L20L63M10M63N34O35P56Q84
1345A0774J022J178J335J492J685J937K212K452K662K876L065L144L087K939K708K295J610
$$ plain form
1375 7935 7345 6813 6331 5907 5539 5211 4913 4647 4415 4202 3993 3796 3631 3509 3415 3329 3250 3192 3151 3099 3020 2935 2869 2812 2739 2661 2612
1371 2612 2600 2590 2553 2507 2481 2472 2459 2440 2428 2425 2420 2416 2416 2406 2368 2318 2286 2271 2250 2220 2202 2206 2214 2214 2215 2218 2209 2185 2168 2178 2202 2212 2197 2164 2130 2121 2147 2178 2173 2132 2099
1366 2099 2104 2124 2124 2118 2137 2175 2188 2152 2095 2056 2041 2030 2006 1981 1979 2001 2027 2039 2038 2030 2011 1984 1968 1979 1992 1979 1951 1955 1994 2021 2010 1994 2007 2034 2043 2038 2042 2057 2070
1362 2070 2083 2096 2094 2072 2061 2085 2115 2113 2092 2095 2114 2106 2069 2047 2055 2058 2034 2018 2038 2076 2098 2102 2104 2098 2073 2038 2015 2007 2000 1979 1948 1917 1897 1889 1888 1894 1912 1931 1923 1879 1847 1870
1356 1870 1923 1942 1917 1906 1943 1991 2008 2010 2040 2100 2150 2165 2149 2121 2105 2112 2125 2113 2083 2076 2105 2127 2103 2062 2059 2097 2135 2151 2160 2179 2201 2221 2240 2258 2271 2278 2280 2268
1352 2268 2244 2231 2247 2275 2289 2285 2275 2264 2258 2272 2309 2351 2383 2423 2481 2526 2526 2511 2528 2572 2603 2619 2661 2738 2808 2857 2922 3024 3134 3219 3297 3404 3539 3674
1348 3674 3799 3922 4047 4172 4307 4456 4608 4762 4935 5145 5382 5622 5865 6123 6409 6729 7092 7502 7965 8499 9134 9890 10774
1345 10774 11796 12974 14309 15801 17486 19423 21635 24087 26749 29625 32690 35834 38921 41860 44568 46863 48473
1343D8473P07k55j128j830k317k592k709k722k647k495k321k183k091k009j913j807j682j519
1341A4960j336j182j074r77q52p07n83m98m54m38m25l86l16k47k18k23k24k06j89j85j82j62
1338C896j34j17j17j24j30j36j33j05o6l8l4l3k9l7o7q7o4j9ml2o3n4k5j2k0k8k4j3j3k2k9
1334B087k6j5pj9m5n8m3j5JNNJ3J9J8J0kpmM%j1j4MK6L4K2J1J0J5K5M1N5N3K8ok4k0j3k0k7
1329B110j7OJ7QOK4M2K9j1m2m6m3m3l1nK0K3J4J6K4J9Lj3k1j9oRJ3jrOK5J9oj5OK3Qk5l6j2
1324B069K3L9L2J4Jjnj4j8oJ3J8P%J0K5K1lk2k5j7rMK9M5L5NrJ1L6L7K4K6M3M1J1j0KL1M9
1319B562M9M0J2l2n4j8M4P0M3QJ0L0L0J3KPJ4J7K2K9K8J8K3M6O7O2L1J1K6O1P8N8K8J5K9M7
1315C526N7O0O8Q7J08J14R9P7P1R1J14J18J09J04J06J01Q8P9P7P4O4M9L3J6POjk0m4m9l6l2
$$ plain form
1343 48473 49180 48925 47797 45967 43650 41058 38349 35627 32980 30485 28164 25981 23890 21881 19968 18161 16479 14960
1341 14960 13624 12442 11368 10391 9539 8832 8249 7751 7297 6859 6434 6048 5732 5485 5267 5044 4820 4614 4425 4240 4058 3896
1338 3896 3762 3645 3528 3404 3274 3138 3005 2900 2834 2796 2762 2729 2700 2663 2596 2509 2445 2426 2422 2390 2327 2273 2248 2236 2216 2188 2164 2151 2138 2116 2087
1334 2087 2061 2046 2039 2020 1975 1917 1874 1859 1860 1865 1870 1883 1902 1920 1930 1928 1921 1917 1921 1921 1910 1896 1900 1926 1960 1982 1993 2003 2018 2043 2084 2139 2192 2220 2214 2190 2170 2157 2137 2110
1329 2110 2093 2099 2116 2124 2130 2154 2196 2225 2214 2172 2126 2083 2040 2009 2004 2024 2047 2061 2077 2101 2120 2123 2110 2089 2070 2064 2073 2086 2085 2076 2082 2107 2126 2120 2105 2111 2134 2142 2117 2081 2069
1324 2069 2092 2131 2163 2177 2178 2177 2172 2158 2140 2134 2147 2165 2172 2172 2182 2207 2228 2225 2203 2178 2161 2152 2156 2185 2230 2265 2270 2261 2272 2308 2345 2369 2395 2438 2479 2490 2480 2482 2513 2562
1319 2562 2611 2651 2663 2631 2577 2559 2603 2673 2716 2724 2734 2764 2794 2807 2809 2816 2830 2847 2869 2898 2926 2944 2967 3013 3080 3142 3173 3184 3210 3271 3349 3407 3435 3450 3479 3526
1315 3526 3583 3643 3711 3798 3906 4020 4119 4196 4267 4358 4472 4590 4699 4803 4909 5010 5098 5177 5254 5328 5392 5441 5474 5490 5497 5503 5502 5482 5438 5389 5353 5321
1311E321m9o6o4m8l1k4k4l4m8n2l8j2J2L1L7K9J2J0K7M4M6L9M2M8M7M3N3Q3J12J23J15J04
1307E888J02J18J40J44J18Q1N9O7P9O7L4QQK2J5j3l2k0jJoQL7N1L8L1M9P5Q0P7Q3R0Q6P9Q5
1303G748R7J01J01J13J35J45J48J58J74J73J51J31J31J48J74K03K19K11J94K00K34K68K81
1300A1638K85K87K85K82L00L35L50L38L40L94M60M81M64M71N28N86O03O04O35P05P82Q49R13
1297B2915R76J037J107J212J342J449J506J531J577J654J724J734J671J552J405J230J003
1295D6625P05L55Jl15n94q46j056j195j261j281j271j229j165j105j053r82q82p84p21o84
1293C1262o42n84n38n10m85m48m08l83l69l63l66l71l62l39l19l19l34l49l58l63l55l32l11
1290B2054l16l39l48l29l04l08l34l52l41l21l03k87k74k75l04l31l20k87k74k95l02k75k47
$$ plain form
1311 5321 5272 5206 5142 5094 5063 5039 5015 4981 4933 4881 4843 4831 4843 4874 4911 4940 4952 4962 4989 5033 5079 5118 5160 5208 5255 5298 5351 5434 5546 5669 5784 5888
1307 5888 5990 6108 6248 6392 6510 6591 6650 6717 6796 6863 6897 6905 6913 6935 6950 6937 6905 6885 6884 6885 6879 6887 6924 6975 7013 7044 7093 7168 7248 7325 7408 7498 7584 7663 7748
1303 7748 7845 7946 8047 8160 8295 8440 8588 8746 8920 9093 9244 9375 9506 9654 9828 10031 10250 10461 10655 10855 11089 11357 11638
1300 11638 11923 12210 12495 12777 13077 13412 13762 14100 14440 14834 15294 15775 16239 16710 17238 17824 18427 19031 19666 20371 21153 22002 22915
1297 22915 23891 24928 26035 27247 28589 30038 31544 33075 34652 36306 38030 39764 41435 42987 44392 45622 46625
1295 46625 47330 47685 47686 47371 46777 45931 44875 43680 42419 41138 39867 38638 37473 36368 35315 34333 33451 32667 31946 31262
1293 31262 30620 30036 29498 28988 28503 28055 27647 27264 26895 26532 26166 25795 25433 25094 24775 24456 24122 23773 23415 23052 22697 22365 22054
1290 22054 21738 21399 21051 20722 20418 20110 19776 19424 19083 18762 18459 18172 17898 17623 17319 16988 16668 16381 16107 15812 15510 15235 14988
1287A4988k51k68k64k44k48k72k77k56k40k44k42k25k16k26k24j96j70j68j78j74j67j81k01
1284I856j95j66j49j59j70j66j55j49j51j54j55j49j38j24j17j15j14j21j31j27r8o5o2q9
1281F637j12j02p4n9o8q8j03j04q1m4j3j9n9j02j13r7q3r0r4p5m5l6m4m7m6o0q3q2m6j5k4
1277D529n1n2k3qk6o1p6o7n1n1p2q5o9l9l3n7p2n3l4m7p4p4n6n0n9m6j2Kk2m5l9j9k1l9m3
1273B905k4jkl2o8p6m6j3j4m6n9l6prl3m5l6j9j8l1m1k3J4K6j1o0o2j9J0%j5%J9J1j5k2j7
1269B085l1n3m7rK5K5Kk1l4l9m2l6j9RK8J1l6n7k6J9J6l0n7l4RK6J8RJj7l9m2k2%Moj1rj0
1264A560j7j9qjqj5j0jj5l9l3RL4J1j8j0J2jl6l8jJ7ql7k2J6K8Mk2j9KJ8J5jj8l1l3k5j1j
1259A228rk9l3j4mj8l1j2J7J3j5k6j9k5m7m1%K6Oj6lJ6Jl3l7qK0K9K9K1mk8k2OK2J9J0Oqk4
$$ plain form
1287 14988 14737 14469 14205 13961 13713 13441 13164 12908 12668 12424 12182 11957 11741 11515 11291 11095 10925 10757 10579 10405 10238 10057 9856
1284 9856 9661 9495 9346 9187 9017 8851 8696 8547 8396 8242 8087 7938 7800 7676 7559 7444 7330 7209 7078 6951 6853 6788 6726 6637
1281 6637 6525 6423 6349 6290 6222 6134 6031 5927 5846 5802 5789 5770 5711 5609 5496 5399 5316 5226 5132 5057 5012 4976 4932 4885 4839 4779 4696 4614 4568 4553 4529
1277 4529 4478 4426 4403 4395 4369 4308 4232 4165 4114 4063 3991 3906 3837 3798 3765 3708 3636 3583 3549 3502 3428 3354 3298 3248 3189 3143 3131 3133 3111 3066 3027 3008 2987 2948 2905
1273 2905 2881 2880 2878 2846 2778 2702 2656 2643 2629 2583 2524 2488 2481 2472 2439 2394 2358 2339 2321 2290 2249 2226 2240 2266 2255 2195 2133 2114 2124 2124 2109 2109 2128 2139 2124 2102 2085
1269 2085 2054 2001 1954 1945 1970 1995 1997 1976 1942 1903 1861 1825 1806 1815 1843 1854 1818 1761 1735 1754 1770 1740 1683 1649 1658 1684 1702 1711 1712 1695 1656 1614 1592 1592 1596 1590 1579 1570 1560
1264 1560 1543 1524 1516 1515 1507 1492 1482 1481 1466 1427 1394 1403 1437 1448 1430 1420 1432 1431 1395 1357 1356 1373 1365 1328 1306 1322 1350 1354 1332 1313 1315 1333 1348 1347 1329 1298 1265 1240 1229 1228
1259 1228 1219 1190 1157 1143 1139 1121 1090 1078 1095 1108 1093 1067 1048 1023 976 935 935 961 967 951 948 964 965 932 895 887 907 936 965 986 982 954 932 938 960 979 989 995 987 963
1254I63k2kJ2NjJ5L7L7J1k2k6RN2N9K0k1j9J2K3P%J4K1Jk3k2rpj6k2k2j9j3j3k8m8m2oJ8R
1249I22j0nRKk1k6j5j7l3l8j6L%qLJ9J6j3m3n2k6J4L6K4JmMj3m8n3kM8M1jk2nKj9l2rJ9J5
1244F47j3k9k0lOJ2K4L1K4QmlPMj7l3j7J1J4j0j8J0L4J1l0l9oL1M9N8N6L0oj2J7M0K7MMK8
1239I27N4P1P6N7K1j5l2l2k0OJ9mm8o8n0l5m5n2l1j3l0n3l8lNrlK4L0Kk5k6k2k3k1j8k5k7
1235E24JL4K3k3l9%L6K1nLK0Pj9j1K0K6jk2k2k2l1j7K3N2M1Pr%J1Mk1m0l0NL3L6K1RPQJ3J8
1229F91Ok4m5l2nKrj1JKj3k3k5l1l1kN1Q4P0K4j4l2k5oRMp%J7J4j0k2KL6M6L1J2MQJ7K7L8
1224H29N3O6N5J5j5MM7N7K7%kj5m5n1j3J5j5o2o4l6k8m6n1l7l1l5k6j1k3n0m6kL2K6RJ4K5
1220E70Rl3o4o2k6RJ1k0l4kM1L9ml1k2j5k1j3J9K8om0k8JMpRM3M6J8jQJ4ok9l2j7oLJ3K2K1
$$ plain form
1254 963 941 939 951 956 955 970 1007 1044 1055 1033 1007 1016 1068 1127 1147 1126 1107 1119 1142 1149 1149 1163 1184 1185 1162 1140 1131 1124 1108 1086 1064 1045 1032 1019 991 943 901 895 913 922
1249 922 912 907 916 918 897 871 856 839 806 768 752 755 755 747 750 769 785 772 729 677 651 665 701 725 726 722 726 713 665 612 610 658 699 698 676 671 673 654 622 613 632 647
1244 647 634 605 585 582 588 600 624 655 679 687 683 680 687 691 674 641 624 635 649 639 621 631 665 676 646 607 601 632 681 739 795 825 819 807 824 864 891 895 899 927
1239 927 981 1052 1128 1185 1206 1191 1159 1127 1107 1113 1132 1128 1080 1012 962 927 882 830 799 786 756 703 665 662 667 658 655 679 709 711 686 660 638 615 594 576 551 524
1235 524 525 559 582 559 520 520 556 577 572 575 595 602 583 572 592 618 617 595 573 551 520 503 526 578 619 626 617 617 628 632 611 571 541 546 579 615 636 645 652 660 673 691
1229 691 697 673 628 596 591 593 584 573 574 576 563 540 515 484 453 451 502 586 656 680 666 634 609 603 612 616 609 609 626 640 630 608 610 646 692 723 735 739 747 764 791 829
1224 829 882 948 1003 1018 1003 1007 1054 1111 1138 1138 1136 1121 1076 1025 1012 1027 1012 950 886 850 822 776 725 688 657 622 596 585 562 512 466 464 496 522 531 545 570
1220 570 579 546 482 420 394 403 414 394 360 358 399 438 434 403 381 366 345 332 351 379 373 333 305 306 310 303 312 355 401 419 418 426 440 434 405 373 356 350 353 366 388 409
1215D09Rj2k4j2K5N7N5K5JNK9M0K9MnJ3L6L6J9J6M3O1N3M9P6J11J11Q7Q1R5R4Q0R0J28J46
1210B060J17P6O3N6K8lj1j1l0o5q8j07j27j40j26j04j04j12r4n7l8m9o7p0p4q3p2l3NJl8o0
1206F43m2jJ9mm0m8k0nl0o1m7KK7J0j1j3j1j9j9JJ4jj7pPpl3k6J2K8Jl3l4j1J3K4J7ok6k0
1202B26PK4J6%oj5k9k9qJ3J2%j0j8k3pK8M2Pl2j3N0P7L7p%K6K2JJ7O2P6L6lJL0L8K2QQP%r
1196F84q%J1K1K6J8%j4j9rJ3M2O0O2O0P2Q3P6N6M8O5Q6Q9P5O3N6N3L6Ll5n2m1k2k7n2o9p2
1192A438q0r4q7o2m9p3r7q7n6m3m6l6j8j2k5l3l2l2k8j1Npl3l5j3nk1k5jJ8%l2m3l4j4J0K5
1187B32J6nnJ7J5k5n1k3K2K1j1k6j5j3k1mL1M5K4nj8l0l8k9nLlJ5N8P5L7j1j4J5J9j6n0m3
1183A84JL9M1J3rrnj1pK0M5L3NJ0M2M8J3pK0N7O5N5M5K8lrK3N0K5k0l0pNpj8k4m3o0m9j4M
$$ plain form
1215 409 418 406 382 370 395 452 507 532 533 538 567 607 636 640 635 648 684 720 739 755 798 859 912 961 1037 1148 1259 1346 1427 1522 1616 1696 1786 1914 2060
1210 2060 2177 2253 2316 2372 2400 2397 2386 2375 2345 2280 2192 2085 1958 1818 1692 1588 1484 1372 1278 1221 1183 1134 1067 997 923 840 768 735 740 741 703 643
1206 643 601 600 619 615 575 527 507 502 472 411 364 366 393 403 392 379 368 349 330 331 345 344 327 320 327 320 287 261 273 301 302 269 235 224 237 261 278 272 246 226
1202 226 233 257 273 273 267 252 223 194 186 199 211 211 201 183 160 153 181 223 230 198 185 235 312 349 342 342 368 390 391 408 470 546 582 579 580 610 648 670 678 686 693 693 684
1196 684 676 676 687 708 734 752 752 738 719 710 723 765 825 887 947 1019 1102 1178 1234 1282 1347 1433 1522 1597 1660 1716 1769 1805 1808 1773 1721 1680 1658 1631 1579 1510 1438
1192 1438 1358 1264 1177 1115 1066 993 896 809 753 710 664 628 610 598 573 540 508 476 448 437 442 435 402 367 354 349 328 303 302 320 320 288 245 211 197 207 232
1187 232 248 243 238 255 270 245 194 171 193 214 203 177 162 149 128 124 155 200 224 219 201 171 133 104 99 102 99 114 172 247 284 273 259 274 293 277 227 184
1183 184 185 224 265 278 269 260 255 244 237 257 302 335 340 350 392 440 453 446 466 523 588 643 688 716 713 704 727 777 802 782 752 745 750 743 725 701 658 598 549 535 539
1178E39nj6k3l1l2qJ4lm1l9NL5J9rj2pk3l9k2J5L5L2J2j9m8m9k1lk0l5rL7M4Rj3MK7J8rj9
1173B90j1j1k5k7mK2J3j6k8oJ6J3njK3L6K3lk8m4l8mM2O4N6L8K3OpPL8L6j0m6k7J3K2KMK6
1168D72K8lk4pK1L2K5K3K3J6RJ0Orl0l7l1k0r%jj3k1pJ5K1PkNJ2Kk0k1JK2K3J0LQJ6K0K2K1
1163F18J2LLQJ4J4J4Qpj5j1rk3m2l8j4knOL8M9J3l9n6l1MJ5Kk6m1k5J1K6QqNJ5mk3nK6K3M
1157E15K4P1P2J5k4NM6L8JJL8O2N2K9J5LjPJ5Kk8m8n5n6n3l5k0k9n1n9m0j9rlQJ1%j4k0k1
1152D45k7l5l1j8mKKJOJ5K5K7J6%j0j1mJ0K5L6M4M9N8O7P3O4M5K6K2L3N2O2N5L3OJJ9K8Ml4
1147A177m6k9k0l5m8k9pj4m8o1m3j5oommj3k8l3k7k3l0m0l8j5Ljk0l4l1k7l0k5rKqk0k0pL
1143B91RJ1Lj6k5k0j1mJ2M3O4N4L3K6L4M1M9O3O8M7K2K0K8J2k4l4j1Oj4m5m2j1Pj1n0o7m3
$$ plain form
1178 539 534 518 495 464 432 424 438 435 394 355 360 395 414 405 393 386 363 324 302 317 352 384 396 377 329 280 259 256 236 201 192 229 273 282 269 273 300 318 309 290
1173 290 279 268 243 216 212 234 247 231 203 197 213 226 221 220 243 279 302 299 271 227 189 185 227 291 347 385 408 414 407 414 452 488 478 432 405 418 440 442 446 472
1168 472 500 497 473 466 487 519 544 567 590 606 615 625 631 622 592 555 524 504 495 495 494 481 460 453 468 489 496 494 499 511 513 493 472 473 495 518 528 531 539 555 575 597 618
1163 618 630 633 636 644 658 672 686 694 687 672 661 652 629 587 549 535 533 528 534 572 621 634 595 539 508 512 527 529 503 462 437 448 474 482 474 479 494 490 467 462 488 511 515
1157 515 539 610 682 697 673 678 724 762 763 764 802 864 916 945 960 963 962 969 984 986 958 910 855 799 746 711 691 662 611 552 512 493 484 481 489 500 500 486 466 445
1152 445 418 383 352 334 330 332 334 335 341 356 381 408 424 424 414 403 399 409 434 470 514 563 621 688 761 825 870 896 918 951 1003 1065 1120 1153 1159 1160 1179 1207 1211 1177
1147 1177 1131 1102 1082 1047 999 970 963 949 901 840 797 782 776 770 766 762 749 721 688 661 638 608 568 530 515 518 517 497 463 432 405 375 350 341 343 335 315 295 288 291
1143 291 300 311 314 298 273 253 242 238 250 293 357 411 444 470 504 545 594 657 725 772 794 814 842 854 830 796 785 791 777 732 690 679 686 675 625 558 515
1138E15JJ4j1l9l5k8o0j01q5j0M4K6k4m7m4m4m4k8mlk0k8j8jK0L2K2qk6j4Kmj6j0kj3k9j3
1133a33K3L1kl1k3PK8K2MqKK2K2rl1j3J8J9%JJ9J3k2l2%K8J3j7k4j6k0j8NL0K5%q%jj1pJ6
1128g8L1K3Plj4k5k6j2lj0j2ML0L2Ml0m2k2J3L5K3rl1j8J4L4K6N%J8L4J8j6l6k2NJ9J4Mqj7
1123d1j4jKj4k3KL8L3j7n3l9JJ7Lj0plj1k2j9mJ4K4J8%j8j9JK7L6J8j5l2k1OK2J9QNK%OJ8
1118f3J4j8m9m2j4j0l6m2%N6O5K9pk0j5lJ2J8jk8k9jK3J5nq%lj1kK8M1J1l8n8l2J5M2L5J2
1113a19JJ0K5K3Lj9k3j0JOJ1J9J1j6m5m1qK1K4J3Ool3n4l8OL9L7J8QJqj1KK2K3%k6l2j0K1
1108a48L5K4jqKRj1l8m5k7mPJ0J4J3LjJ0L3M6L4Oj7k1j0NJ1Qj2l5l3PM5L8nk9j1Qnk6j8LM
1103a30qpKj4m0l2OK4%k0jK8L1J7J2J2%k3l6l6k5jK1J6j2k4JK4Qk0rL2M0Kl3l1rJ3L3M7L4
$$ plain form
1138 515 516 530 519 480 445 417 357 256 171 161 205 231 207 160 116 72 28 0 -4 -7 -27 -55 -73 -74 -54 -22 0 -8 -34 -48 -46 -50 -66 -76 -78 -91 -120 -133
1133 -133 -110 -79 -81 -112 -135 -128 -100 -78 -74 -82 -80 -58 -36 -45 -76 -89 -71 -52 -52 -51 -32 -19 -41 -73 -73 -45 -32 -49 -73 -89 -109 -127 -122 -92 -67 -67 -75 -75 -76 -87 -94 -78
1128 -78 -47 -24 -17 -20 -34 -59 -85 -97 -100 -110 -122 -118 -88 -56 -52 -82 -124 -146 -133 -98 -75 -84 -115 -133 -119 -85 -59 -54 -54 -36 -2 16 0 -36 -58 -53 -34 -20 -16 -24 -41
1123 -41 -55 -56 -54 -68 -91 -89 -51 -18 -35 -88 -127 -126 -109 -106 -116 -123 -126 -137 -159 -178 -182 -168 -144 -126 -126 -144 -163 -162 -135 -99 -81 -96 -128 -149 -143 -121 -102 -94 -89 -87 -87 -81 -63
1118 -63 -49 -67 -116 -158 -172 -182 -218 -260 -260 -204 -139 -110 -117 -137 -152 -155 -143 -125 -126 -154 -183 -184 -161 -146 -151 -159 -159 -162 -173 -175 -147 -106 -95 -133 -191 -223 -208 -166 -131 -119
1113 -119 -118 -108 -83 -60 -57 -76 -99 -109 -108 -102 -91 -72 -61 -77 -122 -163 -171 -150 -126 -113 -107 -113 -146 -200 -238 -232 -193 -156 -138 -130 -129 -137 -148 -146 -124 -101 -101 -127 -159 -169 -148
1108 -148 -113 -89 -90 -98 -96 -87 -98 -136 -181 -208 -212 -205 -195 -181 -168 -165 -166 -156 -123 -77 -43 -37 -54 -75 -85 -80 -69 -61 -73 -108 -141 -134 -89 -51 -56 -85 -96 -88 -93 -119 -137 -134 -130
1103 -130 -138 -145 -143 -157 -197 -229 -223 -199 -199 -219 -220 -192 -161 -144 -132 -120 -120 -143 -179 -215 -240 -241 -220 -204 -216 -240 -239 -215 -207 -227 -236 -204 -164 -162 -195 -226 -235 -222 -189 -142 -108
1098a08Kj5MK5K4J2J1J0pk4j9m%KK1L6J5k8m6k4lj5l1j2K8L9Ok8k4%Orj6kLj2k7k1lPJ2K2
1093a93K3Mk1k1jNqj3JPqj7nOrk5j0J5J2qmK6L8J5olRKj4k2k0j5rKPKjPJ7J4PNLKPK5L3K2
1087a17M%Mlk0j9LJ4ll2l8j9%lj8k5rQMj5k1mJ2J0LPRlk0k0mNJkj%QK8M2K7mj5mkj4pK7M5
1081a81J8k5l9k8j8j4kJ0Lj1pJ1J1pj6jJ7K1J2M%JPJ5J2kj6k5k7rK2M0K4%JJ0pm2m2KL4K3
1076b21JMJ2nl2l5j9j1qMJ8J4MNJ8K2J4J1J0POJ4K0Pj6l3m5n3m3qK1J5j1j5LJ2MKPlk3k0O
1071c40K3J8RJ0MpnJ6K5J3KNMrj3LJ3kj8j4kJjPOj8m1l4mJ8L0M0M0K0qj8rmj0j7k1k3j6PK4
1065b96J5LJ7M3L8jl1k2OJ7Ork1k6j9lJ2J8J7Rj4m2m6k0J5L1K2lk5k7lK6L4K0PJrk4k3KK9
1060b76K8Mj9k0mJ8K6J3rj4lNkoJLj7m2l7%L5M5L1Qj3k8k5lJ8J6j0l3k2J4L9L5J3mj8k8k3
$$ plain form
1098 -108 -106 -121 -117 -92 -68 -56 -45 -35 -42 -66 -85 -89 -89 -87 -66 -30 -15 -43 -89 -113 -116 -131 -162 -174 -146 -107 -101 -129 -153 -153 -147 -156 -172 -174 -171 -183 -210 -231 -234 -227 -215 -193
1093 -193 -170 -166 -187 -208 -209 -204 -212 -225 -224 -217 -225 -242 -247 -241 -250 -275 -285 -270 -258 -266 -270 -244 -206 -191 -197 -200 -191 -189 -203 -225 -245 -260 -269 -267 -260 -258 -259 -252 -235 -221 -214 -209 -206 -204 -197 -172 -139 -117
1087 -117 -113 -113 -109 -112 -132 -151 -148 -134 -137 -169 -207 -226 -226 -229 -247 -272 -281 -273 -269 -284 -305 -309 -297 -287 -284 -277 -268 -271 -291 -311 -315 -310 -309 -311 -312 -312 -304 -276 -234 -207 -211 -226 -230 -232 -246 -253 -226 -181
1081 -181 -163 -188 -227 -255 -273 -287 -289 -279 -276 -287 -294 -283 -272 -279 -295 -296 -279 -258 -246 -242 -242 -241 -234 -219 -207 -209 -225 -250 -277 -286 -264 -224 -200 -200 -199 -189 -196 -238 -280 -278 -244 -221
1076 -221 -220 -216 -204 -209 -241 -276 -295 -306 -314 -310 -292 -278 -274 -269 -251 -229 -215 -204 -194 -187 -181 -167 -147 -140 -156 -189 -234 -287 -330 -338 -317 -302 -313 -328 -325 -313 -309 -307 -300 -303 -326 -346 -340
1071 -340 -317 -299 -290 -280 -276 -283 -288 -272 -247 -234 -232 -227 -223 -232 -245 -242 -229 -231 -249 -263 -265 -264 -265 -258 -252 -270 -311 -345 -349 -331 -301 -261 -221 -201 -209 -227 -236 -240 -250 -267 -288 -311 -327 -320 -296
1065 -296 -281 -278 -261 -218 -180 -181 -212 -234 -228 -211 -205 -214 -235 -261 -280 -283 -271 -253 -236 -227 -241 -283 -329 -349 -334 -303 -281 -284 -309 -336 -339 -313 -279 -259 -252 -251 -260 -284 -307 -305 -276
1060 -276 -248 -244 -263 -283 -287 -269 -243 -230 -239 -253 -256 -251 -253 -259 -258 -255 -272 -314 -351 -351 -316 -271 -240 -232 -245 -273 -298 -301 -283 -267 -277 -310 -332 -318 -279 -244 -231 -235 -253 -281 -304
1055c04KK1J0j6j5J7M0K3pj7mJ0K1K6K3Rjklj3j9pJ7K6J6ok2k5oK4M2K8mk1rK0M0L9J4j8l0
1050h1pL0M3K1opJ9M8N7M6K6QKJ2L9O9Q6Q2N8L0J4J7L6M6L2OnMMk2n1n4l8l4m3m3k9k3k2r
1045C61J6K3PqnLNJ7L9M8K9J4K0K5J2NK7N3M5K4L5O9P4M2J1QJ4J1Jqj6j6lQj2m6m9j9MLMK3
1040H98L0J3OK5M7L7K2L2N2M8K0mj3j8k7l4m0m9n6o4q3j01r1m4qj9n2n3k2qk9n8o5m4j9mj3
1035B12l9m7k0J1%l2l4lRj7l4nL5L3QNK2K7Q%J4K7K1J1J5K2K1J9K6M0M6M1K6J5J7K6K5Lj9
1031E35k1j2j8m1n8n2l2k4l3m8n9o0n4m1l5k3mJ8K0mk9l1j8qpj0j9k3j3J8L4J1l0m3j7Nmj8
1026b48qJ7K2MqkJ0J6J1jj5j9rKoj7j2%j1l6l9kL6M0K2J4K0J6ol1m6m1j7J3K7K0RQNj6l0j3
1021c21K2L1%l5l2KL0L2J8Jj1k4l3k3MK5J4j7k7LK9J2k1j8K6N6M1J2jj0k4k6j0jj8l4k1LN
$$ plain form
1055 -304 -302 -281 -271 -287 -302 -285 -245 -222 -229 -246 -250 -240 -219 -193 -170 -161 -162 -164 -167 -180 -199 -206 -189 -163 -147 -153 -175 -200 -206 -182 -140 -112 -116 -137 -146 -126 -86 -47 -33 -51 -81
1050 -81 -88 -58 -15 6 0 -7 12 60 117 163 189 197 199 211 250 319 405 487 545 575 589 606 642 688 720 726 721 725 729 707 656 602 564 530 487 444 415 392 370 361
1045 361 377 400 407 399 394 397 402 419 458 506 535 549 569 594 606 611 638 691 736 760 795 864 938 980 991 999 1013 1024 1025 1017 1001 985 982 990 978 932 883 864 868 871 875 898
1040 898 928 941 947 972 1019 1056 1078 1110 1162 1210 1230 1226 1213 1195 1168 1134 1094 1045 989 925 842 741 650 606 598 579 527 474 452 444 415 357 292 248 229 225 212
1035 212 173 126 106 117 117 85 51 48 57 40 6 1 36 69 77 82 104 131 139 139 153 180 201 212 227 249 270 289 315 355 401 442 468 483 500 526 551 554 535
1031 535 514 502 484 443 385 333 301 277 244 196 137 77 23 -18 -53 -76 -80 -62 -42 -46 -75 -106 -124 -132 -139 -149 -168 -191 -204 -186 -152 -141 -171 -214 -231 -226 -230 -248
1026 -248 -256 -239 -217 -213 -221 -223 -213 -197 -186 -187 -202 -221 -230 -228 -234 -251 -263 -263 -274 -310 -349 -351 -315 -275 -253 -239 -219 -203 -209 -240 -286 -327 -344 -331 -304 -284 -275 -267 -262 -278 -308 -321
1021 -321 -299 -268 -268 -303 -335 -333 -303 -271 -253 -252 -263 -287 -320 -343 -339 -314 -300 -317 -344 -341 -312 -300 -321 -339 -313 -257 -216 -204 -205 -215 -239 -265 -275 -276 -294 -328 -349 -346 -341
1016c41lJ3L4K6oj0J6K7kk6j1Rkk6k3rj7k9pL3M0J1kK2L7J5j3j4rl1n3l1K2M0Qk4j4J4J6p
1011c27j5%J1JrJK5L0J1j0j5j5j7rJ4K9Rl1m0nK2Qk2j8J3K7J6PR%k6m3k6KJ5J9K8M1L8J4j6
1006b54k8j6J4L7K3j4m2l0kJ5J2%j0j7j4J0L5L2Kk4k5qnk4l9k9%J4Jj4nJ6J7lj0j%k0l5j8
1001d59J2K8K8L2L6K3Jonj1k3j9qmj1oQJ2MQK4K3kk1j4NRKlKRK2L3K9J0mpj0k3l9m6m3k6O
996d24L7L4jl0k5JK3L4L3Rk7l5jL1J5k4k5J9M4J8k5l7j7MLj6l2k7NL4L2Jj6lJ1Lj6j4MJ6J5
991c69J0J0Plj0j2rnKJ3J8J7J0Krj9k4k3j3OK9L0Jk8k1J5L0Kk5qK5J8k3l8nK1Oj7kK8K4mj2
986c55J0J6jqNJ0j2k7j8rj6j5J7M4K9pk1j2mJK2M6M4J3k1l5l1qL0M8K2l3o3n0j6J2L5M5L1
981b82kk4k2j1ljJRJ5J7ll3m0%M1L2j1k1PK0MJK6K9k0n6k1L9M5Jk0MJ6j6n0l1K3O0N5K6nk9
$$ plain form
1016 -341 -344 -331 -297 -271 -277 -287 -271 -244 -246 -272 -283 -274 -276 -302 -325 -334 -351 -380 -387 -354 -314 -303 -305 -283 -246 -231 -244 -258 -267 -298 -351 -382 -360 -320 -312 -336 -350 -336 -320 -327
1011 -327 -342 -342 -331 -330 -339 -338 -313 -283 -272 -282 -297 -312 -329 -338 -324 -295 -286 -317 -357 -362 -340 -332 -354 -372 -359 -332 -316 -309 -300 -300 -326 -369 -395 -393 -378 -359 -331 -290 -252 -238 -254
1006 -254 -282 -298 -284 -247 -224 -238 -280 -310 -312 -297 -285 -285 -295 -312 -326 -316 -281 -249 -247 -271 -296 -304 -309 -333 -372 -401 -401 -387 -386 -400 -405 -389 -372 -375 -385 -386 -386 -406 -441 -459
1001 -459 -447 -419 -391 -359 -323 -300 -299 -305 -310 -321 -344 -363 -371 -375 -386 -392 -384 -372 -368 -360 -336 -313 -315 -336 -350 -345 -336 -334 -337 -335 -326 -304 -271 -242 -232 -236 -243 -253 -276 -315 -361 -404 -430 -424
996 -424 -387 -353 -354 -384 -409 -408 -385 -351 -318 -309 -336 -371 -372 -341 -326 -350 -375 -356 -312 -294 -319 -356 -373 -369 -366 -382 -414 -441 -436 -402 -370 -369 -385 -388 -377 -374 -390 -404 -400 -384 -369
991 -369 -359 -349 -342 -345 -355 -367 -376 -381 -379 -366 -348 -331 -321 -319 -328 -347 -371 -394 -407 -401 -372 -342 -341 -369 -390 -375 -345 -343 -368 -376 -351 -333 -356 -394 -399 -378 -372 -389 -391 -363 -339 -343 -355
986 -355 -345 -329 -330 -338 -333 -323 -335 -362 -380 -389 -405 -420 -403 -359 -330 -337 -358 -370 -374 -373 -351 -305 -261 -248 -269 -304 -335 -343 -313 -265 -243 -276 -339 -389 -405 -393 -358 -313 -282
981 -282 -284 -308 -330 -341 -344 -345 -344 -335 -320 -303 -306 -339 -379 -379 -338 -306 -317 -338 -331 -311 -307 -306 -280 -251 -271 -327 -348 -309 -264 -263 -283 -279 -263 -279 -329 -360 -337 -277 -222 -196 -201 -230
976b30m0l8k3nRJ2MLJ1J7K2L0M9N6L4jk6l2l3l2j7MJ9K3J9Ppj5lJ0Lj7k3nJ5K2Qj8m2m4j5
971b89J8K8K0J7J7Lj1JL0L9J8LJ1J1j1k3JL5L5J1pj3k5l8k6LJ2lqJ3L3K3kk2k5k0j1lmj0l
966a72K0L2Rk5l4j3RMj8l1k5rKPJ0J5J8J1kj5k0k2k1j7oNQL%j3l7n5l6J9O1M8Mj9pMj1k8j2
961c59K2K9Kl1m3l6k6j9j6k1k1oK1L3J9NRJ5rm2m0kK2PpJ7M5K7j7k0K2M6J4k7j5K2K1j7k8
956d04RM2K7j5l7l1j5OL2L3nm6l7J7N6L5j2l6k0QK4J6ok1j7LJ6J1Lkj1l0m1k2J4L2J9JLJ5
951c86Rj2k3j2lj3k0PM3M0rm4k3K4L6J8J2K4Pm6p5m1J9M4L5K9L2K0j1k5j4MJ1K1L0K1j5n2
946c38n8l6oJ3J3Kj0lJ6J8jj1PK3Ok7k2J3L1J5jJ1J8j3n4m9MN0N1K5%j5k2j8j0j0j0RM3M9
941b97J2k9l0nMpj1KJ1KmKJ3RlqlJ6L3K6j3n8o2k1K2L0Rj4k8k7KM1N7L0%JK0Ol7n8l0J7L5
$$ plain form
976 -230 -270 -308 -331 -336 -327 -315 -311 -308 -297 -280 -258 -228 -179 -123 -89 -90 -116 -148 -181 -213 -230 -226 -207 -184 -165 -158 -165 -180 -183 -173 -170 -187 -210 -215 -200 -178 -170 -188 -230 -274 -289
971 -289 -271 -243 -223 -206 -189 -186 -197 -196 -166 -127 -109 -106 -95 -84 -95 -118 -117 -82 -47 -36 -43 -56 -81 -119 -145 -142 -130 -133 -141 -128 -95 -72 -74 -96 -121 -141 -152 -155 -159 -169 -172
966 -172 -152 -120 -111 -136 -170 -183 -174 -170 -188 -219 -244 -253 -251 -244 -234 -219 -201 -190 -192 -207 -227 -249 -270 -287 -293 -288 -280 -277 -277 -290 -327 -382 -418 -399 -338 -290 -286 -305 -312 -308 -319 -347 -359
961 -359 -337 -308 -306 -337 -380 -416 -442 -461 -477 -498 -519 -525 -504 -471 -452 -447 -438 -423 -432 -474 -514 -516 -494 -487 -494 -477 -432 -405 -422 -442 -420 -374 -360 -387 -402 -380 -359 -376 -404
956 -404 -395 -353 -326 -341 -378 -409 -424 -418 -386 -353 -358 -404 -441 -424 -368 -333 -345 -381 -401 -393 -369 -353 -359 -380 -397 -394 -378 -367 -364 -366 -377 -407 -448 -470 -456 -424 -405 -404 -401 -386
951 -386 -377 -389 -412 -424 -427 -440 -460 -453 -410 -370 -379 -423 -446 -422 -386 -368 -356 -332 -325 -371 -446 -487 -468 -424 -389 -360 -328 -308 -319 -344 -358 -354 -343 -322 -292 -271 -286 -338
946 -338 -396 -432 -438 -425 -412 -410 -420 -423 -407 -389 -390 -401 -394 -371 -365 -392 -414 -401 -370 -355 -356 -345 -327 -340 -394 -443 -439 -389 -338 -313 -313 -328 -350 -368 -378 -388 -398 -389 -346 -297
941 -297 -285 -314 -344 -349 -345 -352 -363 -361 -350 -348 -352 -350 -337 -328 -331 -339 -342 -326 -293 -267 -280 -338 -400 -421 -399 -369 -360 -374 -402 -429 -427 -386 -329 -299 -299 -298 -278 -272 -309 -367 -397 -380 -345
936c45J7nqMJ2Kj7l0k5qPPOJ8L6M7M1K5J7J7J9J8K2L6M5L7J5J0K9N0N6N7O5P1N8L7M6R0J27
931G06J21R2P8Q4Q2N9L5K4Nm7j06j29j08q8r0r7q7p0p6q9q1m8k2k1k8k6k8m5n9m2lK1J1j1
927h3rK2N2L7j8o2m9LK9J4oNJ8Qoopl1m5j9J6Ol5l6J2M6L0NRJ1k4o0m6LK3LqJ0J9pk9j2K0
922a97J2k7l8ML9J4l7m1QM5K8KJ4M5M5J1pNJ0oj8j0nj9k2LK6Nk9k2K4M4J1k9k2J3K8J1lnr
917i9k0j3J3J6k6o1l3L4O5L6JjJ1Kj1l%l0o3m4J3M2J6j7j4RJ9Poj0qkJ%lqj5j6J1N3N8Kn0
912a44k5L9M4j4l9QM0po0k9M5O0Qk4ML2K2MJ2L2M1L5L0K2K2M1O6O4K9mMM9J00J35J52J50J45
907A089J51J78K13K51K83L03L19L47L94M22L98L37K78K32J80J22P1Qq5j84k37k54k92l67m12
904C745l75k99k69k96l23l03k43j82j45j40j52j54j42j24j01o6k9k2m9p3o5m0k7l2l7l6k5
$$ plain form
936 -345 -328 -333 -341 -337 -325 -323 -340 -370 -395 -403 -396 -389 -383 -365 -329 -282 -241 -216 -199 -182 -163 -145 -123 -87 -42 -5 10 20 49 99 155 212 277 348 406 443 489 579 706
931 706 827 919 997 1081 1163 1222 1257 1281 1286 1239 1133 1004 896 808 718 621 534 464 388 299 218 170 148 127 99 73 45 0 -59 -101 -104 -83 -72 -83
927 -83 -92 -70 -18 19 1 -61 -110 -107 -78 -64 -70 -65 -47 -39 -45 -51 -58 -89 -134 -153 -137 -131 -166 -202 -190 -144 -114 -109 -100 -89 -113 -173 -219 -216 -193 -190 -198 -188 -169 -176 -205 -217 -197
922 -197 -185 -212 -250 -246 -207 -193 -230 -271 -263 -218 -190 -188 -174 -129 -84 -73 -80 -75 -65 -71 -89 -99 -104 -123 -145 -142 -116 -111 -140 -162 -138 -94 -83 -112 -134 -121 -93 -82 -85 -90 -99
917 -99 -119 -132 -119 -103 -129 -190 -223 -189 -124 -88 -87 -88 -77 -75 -86 -89 -89 -119 -182 -226 -213 -171 -155 -172 -186 -177 -158 -151 -157 -167 -175 -177 -176 -176 -179 -187 -202 -218 -207 -154 -96 -94 -144
912 -144 -169 -130 -86 -100 -139 -131 -91 -98 -158 -187 -142 -82 -74 -98 -94 -62 -40 -36 -24 8 49 84 114 136 158 199 265 329 358 354 358 407 507 642 794 944 1089
907 1089 1240 1418 1631 1882 2165 2468 2787 3134 3528 3950 4348 4685 4963 5195 5375 5497 5568 5576 5491 5307 5070 4816 4524 4157 3745
904 3745 3370 3071 2802 2506 2183 1880 1637 1455 1310 1170 1018 864 722 598 497 431 402 380 331 258 193 153 126 94 57 21 -4
901dj2kj6m6n2k0J7J5j6l7l7k6j3QK3J2j8l7l0lJ8J8ol6l8rK1K7J3kj5k8k7mK4L0J5Jj1l2
896c35m4k5J0J6j3m1l7j4qj4j3LK1K7K2J2NOJ0J3J2J1QKlorj2kJ8K8Rj3oK2L2J8J0K3L4K2
891b01QK0M5M7K0rj5okqk0l2m0m0k8j2pj6k3j0J3J7nk7k6j2qj1nQJ1jjJ5K7J5j2j8JK3K3J0
886b92OK0L4K3j3m2l7pJ6K0K3L8O0O1L7J1PK1J9nk6pK0Nm3o2k9jk2n3l5J4L3J8%j8n3p6l6
881c71L7N2on6m6j3mkJ7K2rl7j7J8K2RK0M0K6jQL1J0m4n7qL8L2RJ3K9K2PJ1L1M9O1O6N8L8
876A05M3P6R3O4L6N9J01R3L3j2oOj1m4n6n4n3m1j1Opk2kM5O9N0J6j0k7l9m6n5p6r4q4n5n0
872D0o9o9l1Jj4m0l0%j0n5o3j1L8K6k2m3j8J7K4J1oj8k7l0k9k3j0NJ1J0J1J7J9J2mk1k9j9
867d49RK2Pj7j4RQk5m6k3J5K7J8J3J0jj3j0jkp%Pnk6k4JK5K9K8K3Qj2k5k3qJ3K8J3j9k1J9
$$ plain form
901 -4 -16 -18 -34 -80 -132 -152 -135 -120 -136 -173 -210 -236 -249 -241 -218 -206 -224 -261 -291 -294 -276 -258 -264 -300 -338 -347 -326 -299 -286 -288 -303 -331 -358 -362 -338 -308 -293 -292 -303 -335
896 -335 -379 -404 -394 -378 -391 -432 -469 -483 -491 -505 -518 -515 -494 -467 -445 -433 -428 -422 -412 -399 -387 -376 -368 -366 -369 -375 -384 -396 -398 -380 -352 -343 -356 -362 -340 -308 -290 -280 -257 -223 -201
891 -201 -193 -173 -128 -81 -61 -70 -85 -91 -93 -101 -121 -153 -193 -233 -261 -273 -280 -296 -319 -329 -316 -299 -304 -331 -357 -369 -377 -388 -393 -385 -374 -375 -376 -361 -334 -319 -331 -349 -348 -325 -302 -292
886 -292 -286 -266 -232 -209 -222 -264 -301 -308 -292 -272 -249 -211 -151 -90 -53 -42 -35 -14 5 0 -26 -33 -13 -8 -51 -113 -142 -143 -165 -218 -253 -239 -206 -188 -188 -206 -259 -335 -371
881 -371 -334 -282 -288 -344 -390 -403 -407 -409 -392 -370 -379 -416 -433 -415 -393 -384 -364 -324 -298 -299 -291 -260 -250 -294 -351 -359 -321 -289 -280 -267 -238 -216 -209 -198 -167 -118 -57 9 67 105
876 105 148 224 317 381 417 476 577 670 703 691 685 691 680 636 580 526 473 432 421 427 420 398 396 441 510 560 576 566 539 500 454 399 323 229 145 90 40
872 40 -29 -98 -129 -128 -142 -182 -212 -212 -222 -277 -340 -351 -313 -287 -309 -352 -370 -353 -329 -318 -324 -342 -369 -399 -428 -451 -461 -456 -445 -435 -424 -407 -388 -376 -380 -401 -430 -449
867 -449 -440 -418 -411 -428 -442 -433 -425 -450 -496 -519 -504 -477 -459 -446 -436 -437 -450 -460 -461 -463 -470 -470 -463 -468 -494 -518 -517 -492 -463 -435 -412 -404 -416 -441 -464 -472 -459 -431 -418 -437 -458 -439
862d39N0K3k8l2LRk9m8j1L1K3k3m3k7qlm%MKKJ1K5L4K2%j1kOj0l6l0ML2L4K7K5Rj5j9J1M1
857c90M1K7K2K2Pj3j6nNNJqj6rLpl9n9l7MK2J8K1L1K9Rj2k2k6k2j4rj1pMOpnK1L8J5j3pK0
851c83J8k0m0k1MNqrjNJ4K2J9OjNJ1J5K0K3J9J5K3L1J8jMK1J2k0k7JJ5j0l4j4J1kl6l6jK1
846c06J5OPkk1k2LK1J0qq%jrpPJ5J9J7Rrk5k3kJ5J0oj4oOPKJQOnj6j5j0pmOQol0l8j8RK0J1
840c80pk1j8LK7L3J3j3j7NK5K8K3L0M0L4J0mJ4M0M9L5K4K4K8L3M3N4M5K0JQJ7Nj6j9onk4l9
835A42l0j4j8l7n1n1l7k3j2oqnQK4K8J6kk0l2l2j8jMqj9j2PJ1qk2lL4M8K1j7k7nJ6J7J0J0
830a22K1K5K3J9J7Lk5m4l6oJ3J2J0K6M2L7J1j0pJ1K1J8QOJ4K5K6K3K1K7L4L8L2J4rj1J8N7
825C82P0N2L3M0N9O1M7L8M5N7O6O8N6L3J7K4M1N0M9N4O2O6O6O9O1L8K0L4N6N0K6K3M4N1L1
$$ plain form
862 -439 -389 -366 -394 -426 -423 -414 -443 -491 -502 -471 -448 -471 -514 -541 -549 -552 -556 -556 -552 -550 -548 -537 -512 -478 -456 -456 -467 -469 -463 -473 -509 -539 -535 -503 -469 -442 -417 -408 -423 -442 -431 -390
857 -390 -349 -322 -300 -278 -271 -284 -300 -305 -300 -295 -294 -302 -318 -327 -324 -331 -370 -429 -466 -462 -440 -422 -401 -370 -341 -332 -344 -366 -392 -414 -428 -437 -448 -455 -451 -445 -452 -457 -436 -398 -383 -396 -403 -383
851 -383 -365 -385 -425 -446 -442 -437 -445 -454 -455 -450 -436 -414 -395 -389 -390 -385 -374 -359 -339 -316 -297 -282 -259 -228 -210 -211 -207 -186 -174 -194 -221 -220 -205 -215 -249 -263 -252 -254 -290 -326 -327 -306
846 -306 -291 -285 -278 -280 -301 -323 -320 -299 -289 -297 -305 -305 -306 -315 -322 -315 -300 -281 -264 -255 -264 -289 -312 -314 -299 -289 -295 -309 -315 -309 -302 -300 -299 -291 -285 -290 -306 -321 -331 -338 -342 -336 -328 -334 -364 -402 -420 -411 -391 -380
840 -380 -387 -408 -426 -423 -396 -363 -350 -363 -380 -375 -350 -322 -299 -269 -229 -195 -185 -189 -175 -135 -86 -51 -27 -3 25 58 101 155 200 220 221 229 246 251 235 216 210 205 181 142
835 142 112 98 80 43 -8 -59 -96 -119 -131 -137 -145 -150 -142 -118 -90 -74 -76 -96 -128 -160 -178 -179 -175 -183 -202 -214 -207 -196 -204 -226 -229 -195 -147 -126 -143 -170 -175 -159 -142 -132 -122
830 -122 -101 -76 -53 -34 -17 -14 -39 -83 -119 -125 -112 -100 -90 -64 -22 15 26 16 9 20 41 59 67 73 87 112 138 161 182 209 243 281 313 327 318 307 325 382
825 382 452 504 537 577 636 697 744 782 827 884 950 1018 1074 1107 1124 1148 1189 1239 1288 1342 1404 1470 1536 1605 1666 1704 1724 1758 1814 1864 1890 1913 1957 2008 2039
821B039K3M4O1M6K5L1N1N6M8M3M2M7O1Q3Q8P4Q1J18J37J08P3R5J64K14K19K11K12K12K09K27
817E142K69L04L16L06K83K62K71L21L80M02L92L91M12M28M46M95N66O10O22O58P48Q46R05
815A5775R43J012J119J240J376J548J764K029K356K755L214L727M310M975N714O529P454Q505
812G6345R632J0766J1893J3033J4130J4999J5383J5094J4071J2315R719O086J453l557p858
811B13504j0566j1553j1338j0462r125p355n289l152j082Q64K570L826M504M604M094K768
809A66812M02k898o525r639j1619j2363j2197j1553j0719r784q753p677o664n806n117m540
807D1360m018l534l088k681k319k018j775j567j373j206j079r75q70p72p11o78o48o08n72
804A0868n44n15m69m17l75l50l34l11k72k35k26k38k27j78j36j38j56j38r0o7p8q0o0n5q2
$$ plain form
821 2039 2062 2106 2167 2213 2238 2269 2320 2376 2424 2467 2509 2556 2617 2700 2788 2862 2943 3061 3198 3306 3379 3474 3638 3852 4071 4282 4494 4706 4915 5142
817 5142 5411 5715 6031 6337 6620 6882 7153 7474 7854 8256 8648 9039 9451 9879 10325 10820 11386 11996 12618 13276 14024 14870 15775
815 15775 16718 17730 18849 20089 21465 23013 24777 26806 29162 31917 35131 38858 43168 48143 53857 60386 67840 76345
812 76345 85977 96743 108636 121669 135799 150798 166181 181275 195346 207661 217380 223466 224919 221362 213504
811 213504 202938 191385 180047 169585 160460 153105 147816 144664 143582 144446 147016 150842 155346 159950 164044 166812
809 166812 167214 164316 157791 148152 136533 124170 111973 100420 89701 79917 71164 63487 56823 51017 45900 41360
807 41360 37342 33808 30720 28039 25720 23702 21927 20360 18987 17781 16702 15727 14857 14085 13374 12696 12048 11440 10868
804 10868 10324 9809 9340 8923 8548 8198 7864 7553 7281 7046 6820 6582 6355 6177 6041 5903 5747 5609 5519 5452 5374 5294 5234 5179 5097
801E097j08j05q7p8p2o2o0p3q7r0j05j38j62j61j64j86j90j47r5q7j15j24r6p4p7q6p8p1o8
798B051n9l9l1m7o6o9n7m7l8k8k4l0l3k2%Ok2p0j01q2k8J0Kk3k2mol1m2k1nj5l6m5m4m1k6
793H15JJ5%k5k8j1JmroMRPlj8k8l0k5k0j1lpk1k4j0mk4m2k8j%k3l4j5Joj7j3%NPJ8K0Nj5j4
788C89mqk7l4k3pLJ1J6J0j1k5k4rMNnk2k3KK9J9j7l6rL3L5mn1o9m8jM5N8K9j2k1KK0Ok8m2
783A56j8K2L7J7j5k1lPnj3KK2J9pk2j5LJ4J4Jj9k8j3PLj8k8j9j2j0PL0K2k2m9k3J8K1nk3k4
778A0k3k2pNpk3oK9K4k6n4k2K2K2j3k9j4PJ8K6K8J1j4k4j5qj2j0MJ6J6J0J0jk6m6l5nQJjJ2
772a64K1Oj5j2PJ2%oPJ5QMK1M2L8Pk0k5j2%Ojj5k1j4%QLmrj8k9l2k3nRJ2Kj0oJ2K4J1qrOO
767a71j1k2j2LQPPJpmJ0J2jj1jJ1Pj3k7k8j3J7M0L0kj4PK4Nk5j8J0J3j0j4J4L4J0k3k1J7N0
$$ plain form
801 5097 4989 4884 4797 4719 4647 4585 4525 4452 4365 4275 4170 4032 3870 3709 3545 3359 3169 3022 2927 2840 2725 2601 2505 2431 2354 2268 2190 2119 2051
798 2051 1992 1953 1922 1875 1809 1740 1683 1636 1598 1570 1546 1516 1483 1461 1461 1467 1445 1375 1274 1192 1164 1174 1176 1153 1131 1127 1121 1090 1048 1027 1022 1007 971 926 882 841 815
793 815 816 831 831 806 778 767 768 764 755 749 753 762 769 766 748 720 690 665 645 634 631 624 603 579 569 565 541 499 471 470 470 447 413 398 399 393 376 363 363 368 375 393 413 418 403 389
788 389 385 377 350 316 293 286 289 300 316 326 315 290 266 257 261 266 261 239 216 218 247 266 249 213 204 237 272 268 217 148 100 99 144 202 231 219 198 200 220 226 198 156
783 156 138 160 197 214 199 178 175 182 177 164 166 188 207 200 178 163 166 180 194 195 176 148 135 142 145 127 99 80 68 58 65 95 117 95 46 23 41 62 57 34 10
778 10 -13 -35 -42 -37 -44 -67 -73 -44 -20 -46 -100 -122 -100 -78 -91 -120 -134 -127 -109 -83 -55 -44 -58 -82 -97 -105 -117 -127 -123 -107 -91 -81 -71 -72 -98 -144 -179 -184 -176 -175 -176 -164
772 -164 -143 -137 -152 -164 -157 -145 -145 -151 -144 -129 -121 -117 -96 -54 -16 -9 -29 -54 -66 -66 -60 -61 -76 -97 -111 -111 -103 -100 -104 -113 -131 -160 -192 -215 -220 -211 -199 -197 -207 -213 -201 -177 -166 -174 -183 -177 -171
767 -171 -182 -204 -216 -213 -205 -198 -191 -190 -197 -201 -191 -179 -180 -191 -192 -181 -174 -187 -214 -242 -255 -238 -198 -168 -170 -184 -177 -153 -148 -173 -191 -181 -168 -178 -192 -178 -144 -134 -157 -178 -161 -111
761a11M5J6nKK1J9oj9PM5N5K6KJ0K5J9krJQLj5l9n6m8j6J5J4pk5j1J4J6j2m3l1K0N7L6j8m6
756d3k7LJ0Kpj5k5k3nMqj7%K6K7Jj6j7j8k8k9j2J1J7Q%nqqj0j4j8j4jJ5K5K0OolPLk5m2j9
751b78K3L8Rk7k8mJ1MjMPmk0j9LK9L5K0MNK9M9L6ql6j0M9Q3P1M9O2Q9Q5N3M4P6J03Q4M9M2
746H10N5M1j2o2p4n3l4l6n2o0l7QM0K6j5l4k2lMPJ8K1Lk1l4l6m0n3o7o9n8l9l3m6n9n2k9j8
741a15k5k7j0RRmj7k9l9l1mJ5QpoKok0j9LK2K5J6kk6l7k2NPj3k5j1RJ3Nnj1j3ML4M5J8k3m6
736c44n1m5l1nJ7J6oj8rJ6L3L2K4K0J8Ll3o4n3pK6J9KJ2L0J7j4j9J3L2J7pqpk1l2j7kj7m7
731e10m4rJ6J8K3M1L4j7o3n9j7QPJ1L3M6L2J4RPqk2rK0L0Nk1k4oLnj2jK8M9L9jm4n6l0OK3
726d56K2Qqk6k9j0K3M2L8K5J4mk6l0lK7L0J4N%j8m7m6j0J9J8Kpj9l8m0pL0L2J1RK8L1J1lk
$$ plain form
761 -111 -66 -50 -55 -53 -32 -13 -19 -38 -31 14 69 95 97 107 132 151 149 140 141 149 152 137 98 42 -6 -22 -7 7 0 -25 -36 -22 -6 -18 -61 -92 -72 -15 21 3 -43
756 -43 -70 -67 -57 -55 -62 -77 -102 -125 -130 -126 -134 -151 -151 -125 -98 -97 -113 -130 -148 -176 -205 -217 -206 -189 -181 -181 -186 -194 -202 -212 -226 -244 -258 -259 -244 -219 -199 -193 -199 -202 -195 -192 -217 -259 -278
751 -278 -255 -217 -208 -235 -263 -267 -256 -252 -253 -249 -242 -246 -266 -285 -282 -253 -218 -198 -194 -189 -160 -111 -75 -83 -119 -129 -80 3 74 123 185 274 359 412 456 532 635 719 768 810
746 810 865 906 894 832 758 705 671 635 583 523 486 494 534 560 545 511 489 486 490 497 515 536 539 518 484 448 408 355 288 219 161 122 89 43 -16 -68 -97 -115
741 -115 -140 -167 -177 -168 -159 -163 -180 -209 -248 -279 -283 -268 -260 -267 -273 -271 -277 -297 -316 -313 -291 -266 -250 -252 -278 -315 -337 -332 -325 -338 -363 -374 -365 -352 -347 -352 -363 -376 -372 -338 -293 -275 -298 -344
736 -344 -395 -440 -471 -476 -459 -443 -449 -467 -476 -460 -427 -395 -371 -351 -333 -330 -363 -427 -480 -487 -461 -442 -440 -428 -398 -381 -395 -414 -401 -369 -352 -359 -367 -374 -395 -427 -444 -446 -463 -510
731 -510 -554 -563 -547 -529 -506 -465 -431 -448 -511 -570 -587 -579 -572 -561 -528 -482 -450 -436 -427 -420 -428 -450 -459 -439 -409 -404 -425 -449 -455 -452 -457 -469 -470 -442 -393 -354 -355 -399 -455 -485 -479 -456
726 -456 -434 -426 -434 -460 -489 -499 -476 -434 -396 -371 -357 -361 -387 -417 -420 -393 -363 -349 -344 -344 -362 -409 -455 -465 -446 -428 -426 -433 -452 -490 -530 -537 -507 -475 -464 -455 -427 -396 -385 -388 -390
721c90LNJ8L3K2j2k0%Rj8l6j6Rpm1m1j1Jj4k3qJ7K9L1K3Kj3nJ3J5KomkJJ6K6Qj3nK1K5OMJ9
716c27J2k0l1lJ7PjJ9L8K5Mnj6l1j3M0O5K7j3KL1Ln0m7%J4j4k0J3K3j2l1nJ3j6m9l2PK0J2
711c44J3J2qk9j2J9K2pj4J4M5L7%l5l6kL7M1Ok0j0J3Ok6m0k3moj5j4JJ0Mrj6oPNnKK3L1Qk1
705c46k8k6l0k8rkk0l4JN3N6Ml0%N1N2Rk8k7roj5j4PJ9Mk4k7jK5K6K2J9ln1p3l7J7K4j0j6
700e05J6L6J9LPKk6l6pJ7ll1k8pllK3M3J7k7k4K4M9K2pnLj3k5kL0L0kl2l4k0omjJ8M7N0Mn5
695d46p1l4OJ6J8K9K9Lk7k2MK1K0J1mk9m1k1J5K9J9RJ2J4RPRok6k8jK3K0LlMRKj4l1m0k7J
690e29K6L2K7K0J1oj6j0KKooJJj2k3k5j8%K5M3K7rk8oK2J9rj6J1L3K1jjJ8K2ml4l2ML6L1j3
684c70n3n2j7RLj2kK9M2K3oj5qLJ5K3K3J1MRJ1nk5k3JK4L5M1L5J1k2l6k6j6k1j6J0K5Oj3%
$$ plain form
721 -390 -387 -382 -364 -331 -309 -321 -341 -341 -332 -350 -386 -402 -393 -400 -441 -482 -493 -492 -506 -529 -537 -520 -491 -460 -437 -435 -448 -453 -440 -425 -423 -429 -433 -435 -434 -418 -392 -384 -397 -402 -381 -356 -350 -346 -327
716 -327 -315 -335 -366 -369 -352 -345 -346 -327 -289 -264 -260 -265 -281 -312 -325 -285 -220 -193 -206 -204 -173 -170 -220 -267 -267 -253 -267 -287 -274 -251 -263 -294 -299 -286 -302 -351 -383 -376 -356 -344
711 -344 -331 -319 -327 -356 -368 -349 -327 -334 -348 -334 -289 -252 -252 -287 -323 -325 -288 -247 -241 -261 -271 -258 -252 -278 -318 -341 -345 -351 -366 -380 -379 -369 -365 -374 -390 -396 -389 -384 -389 -387 -364 -333 -325 -346
705 -346 -374 -400 -430 -458 -467 -469 -489 -523 -522 -469 -413 -409 -439 -439 -388 -336 -327 -355 -382 -391 -397 -412 -426 -419 -400 -396 -420 -447 -448 -423 -397 -375 -356 -359 -410 -483 -520 -503 -479 -489 -505
700 -505 -489 -453 -434 -431 -424 -422 -448 -484 -491 -474 -477 -508 -536 -543 -546 -549 -526 -483 -466 -493 -517 -493 -444 -422 -429 -434 -431 -444 -469 -471 -441 -411 -413 -445 -479 -499 -505 -509 -510 -492 -445 -395 -391 -446
695 -446 -517 -551 -545 -529 -511 -482 -453 -450 -477 -499 -495 -474 -454 -443 -447 -476 -517 -538 -523 -494 -475 -466 -454 -440 -431 -424 -415 -421 -447 -475 -476 -453 -433 -430 -433 -429 -420 -418 -432 -463 -503 -530 -529
690 -529 -503 -471 -444 -424 -413 -419 -435 -445 -443 -441 -447 -453 -452 -451 -463 -486 -511 -529 -529 -504 -461 -434 -443 -471 -477 -455 -436 -445 -461 -450 -417 -396 -397 -398 -380 -358 -362 -396 -428 -424 -388 -357 -370
684 -370 -423 -475 -492 -483 -480 -492 -494 -465 -423 -400 -406 -421 -429 -426 -411 -388 -365 -354 -350 -341 -330 -335 -360 -383 -382 -358 -323 -282 -247 -236 -258 -294 -320 -336 -357 -373 -363 -338 -332 -345 -345
679c45K9K8mj6OJ9NkJ8K5j4o2n7j0K3J7J0J7K1Nj0j2j1j7k0j1%PJ3J6Oj3j7pj1l2k9J6N6M9
674c14J0j0rj4l0k5MJ9RookLJ9M5M6Km8n4j3K9L3Mj7oK1K5kj5MK1%l5l0OJ4j8l4pJ1j6m1j4
669d41L4M2J7J1K7K4JjJ8J4j8l1%L1K0qqJ2K2J4NMJk%ORJ1J8K2Rj4k3nK2L6K8Pj0j8k5k9j1
664a79K3L8Ql4l1J4M0J5k3l0j6j4k1j4MPnoRK0J9J4J4J3Kj1j8j4lJ0J5J5J4J1kj9j3K0L8J4
659g6k2k2MRj3j6J5L3Ll5k3K0L1ll0j2K5L5J3rlJ9L0J8%nkjm%PKk0k9%N4Q9Q0L7ql3l5k1n
654I7QJ5K2K6K9L3M1M7M2K9J5PlpMK6L7K1jNL4M3K3OJ8L2J2j3%M6O6L4kJK1K3J1ORPJ0K7L7
648I44J6q%K4K1j1k4lK5L0K8K6J7JJ0M1M9Pl6k6J9L5J0j5j0J1K3K1J8J9J7J3N%LNlj7k4k5
644A236l8n6m2RM1J1m5n7j4L1L8K3Qj3l5l2mJ2rm0l9mL2L8J4j6l0j6J3K7J3j4k6j2J5L3K4
$$ plain form
679 -345 -316 -288 -292 -308 -302 -283 -278 -280 -262 -237 -251 -313 -370 -380 -357 -340 -330 -313 -292 -287 -297 -309 -320 -337 -357 -368 -368 -361 -348 -332 -326 -339 -356 -363 -374 -406 -435 -419 -363 -314
674 -314 -304 -314 -323 -337 -367 -392 -388 -369 -360 -366 -372 -374 -371 -352 -307 -261 -259 -307 -361 -374 -345 -312 -308 -325 -331 -310 -285 -287 -302 -298 -277 -277 -312 -342 -336 -322 -340 -374 -381 -370 -386 -427 -441
669 -441 -407 -365 -348 -337 -310 -286 -285 -286 -268 -254 -272 -303 -303 -272 -252 -260 -268 -256 -234 -220 -215 -211 -210 -212 -212 -206 -197 -186 -168 -146 -137 -151 -174 -179 -157 -121 -93 -86 -96 -114 -139 -168 -179
664 -179 -156 -118 -110 -144 -175 -161 -121 -106 -129 -159 -175 -189 -210 -224 -220 -213 -218 -224 -215 -195 -176 -162 -148 -135 -133 -144 -162 -176 -179 -169 -154 -139 -125 -114 -116 -135 -148 -128 -90 -76
659 -76 -98 -120 -116 -107 -120 -136 -121 -88 -85 -120 -143 -123 -92 -95 -125 -137 -112 -77 -64 -73 -76 -57 -27 -9 -9 -14 -16 -17 -21 -21 -14 -12 -32 -61 -61 -7 82 162 199 191 158 123 102 97
654 97 105 120 142 168 197 230 271 318 360 389 404 411 408 401 405 431 468 489 488 493 527 570 593 599 617 649 661 648 648 694 760 794 792 793 814 837 848 854 863 870 880 907 944
648 944 960 952 952 976 997 986 962 959 984 1014 1042 1068 1085 1086 1096 1137 1186 1193 1157 1131 1150 1185 1195 1180 1170 1181 1204 1225 1243 1262 1279 1292 1297 1297 1300 1305 1302 1285 1261 1236
644 1236 1198 1142 1100 1109 1150 1161 1116 1059 1045 1076 1114 1137 1145 1132 1097 1065 1061 1073 1064 1024 985 981 1013 1051 1065 1049 1019 1003 1016 1043 1056 1042 1016 1004 1019 1052 1076
639A076%rPK2Pj6oL2N4L7J2OJ0KqmRJ5K0K7K3Jk1k6k2k5k7j3J0J5jj4qNJ1J0KpmJ7L2K0j6
634A255l6k5MK4K9K0OmJK3L9M4M6N9P1O0K6kNL7N7M4K6L4O5Q3P3O3P2P5N1J9J6L7M3K3LJ3
629B479M3N8M7L0L8O1P5N9L3L2N3O3N2M5O5Q8Q8P0P1R4J19J30J20R1O2O4J01J28J11P9Q1J03
625D833R2N5N0Q4J02P0L7M9Q3R1P9P7Q6Q6Q3R4J11J12J11J36J67J73J58J63J93K21K27K30
622H053K36K35K28K41K91L50L79L74L73L91M17M26M23M44N06N81O28O41O53O84P20P57Q09
619A8840Q81R39R63R88J042J107J139J149J172J212J236J239J236J223J189J139J101J052
617C8847R50Q03O65N50M05K12K2j19k41l88n47o81p88r02j011j085j117j138j164j186j200
614C0887j206j196j156j102j065j042j009r63r30r19r01q50p83p45p32p04o37n66n42n64n73
$$ plain form
639 1076 1076 1067 1074 1096 1103 1087 1081 1113 1167 1204 1216 1222 1232 1234 1226 1222 1231 1246 1266 1293 1316 1317 1296 1270 1248 1223 1196 1183 1193 1208 1207 1193 1185 1190 1201 1211 1213 1206 1202 1219 1251 1271 1255
634 1255 1219 1194 1198 1222 1251 1271 1277 1273 1274 1297 1336 1380 1426 1485 1556 1616 1642 1640 1645 1682 1739 1783 1809 1843 1908 1991 2064 2127 2199 2274 2325 2344 2360 2397 2440 2463 2466 2479
629 2479 2522 2580 2627 2657 2695 2756 2831 2890 2923 2955 3008 3071 3123 3168 3233 3321 3409 3479 3550 3644 3763 3893 4013 4104 4166 4230 4331 4459 4570 4649 4730 4833
625 4833 4925 4980 5030 5114 5216 5286 5323 5372 5455 5546 5625 5702 5788 5874 5957 6051 6162 6274 6385 6521 6688 6861 7019 7182 7375 7596 7823 8053
622 8053 8289 8524 8752 8993 9284 9634 10013 10387 10760 11151 11568 11994 12417 12861 13367 13948 14576 15217 15870 16554 17274 18031 18840
619 18840 19721 20660 21623 22611 23653 24760 25899 27048 28220 29432 30668 31907 33143 34366 35555 36694 37795 38847
617 38847 39797 40600 41265 41815 42220 42432 42454 42335 42094 41706 41159 40478 39690 38788 37777 36692 35575 34437 33273 32087 30887
614 30887 29681 28485 27329 26227 25162 24120 23111 22148 21218 20299 19398 18548 17765 17020 16288 15584 14947 14381 13839 13275 12702
612A2702n29m62m30m32m16l64l18l13l22l16l03l06k99k48j80j55j76j88j65j42j46j59j48
609F185j15r0q1r0j15j49j62j47j27j16j07r1q1q8r4q0o8q0j09j17j05r7r9r7q3p8q9r1p1
605C268n0n9q3q2m6k2m4q9j02o9l2l4o3p0m2j2pj9k3j5j0j4k0k0j7j5j9k3j9lJ4J4Krqpqj
601B142J5K2Nj9k3jK5M0M3K8ol6l2LK2Lk0qK5K7j2m8m4qK1L3K8J8J0J5L2L5J2rjK4L0J8K4
596B433N1N7K9J1L7P2O7L9M2P8R6Q3P9J01J04O0K3M9J08J34J15J00J14J23J06Q8J01J33J54
592D787J57J62J79J98K09K07K01J99K08K13K05J97K17K67L07L05K84K83L09L29L27L32L66
589A0448M08M12L80L67M16M87N22N24N47O14O85P26P57Q12Q80R25R58J010J080J137J173J211
587B6479J254J268J254J250J267J249J158J032R33Q52P21N21L14J51Qj68l69n44o64p55q39
$$ plain form
612 12702 12173 11711 11281 10849 10433 10069 9751 9438 9116 8800 8497 8191 7892 7644 7464 7309 7133 6945 6780 6638 6492 6333 6185
609 6185 6070 5980 5899 5809 5694 5545 5383 5236 5109 4993 4886 4795 4714 4626 4532 4452 4384 4304 4195 4078 3973 3876 3777 3680 3597 3519 3430 3339 3268
605 3268 3218 3159 3076 2994 2948 2926 2882 2793 2691 2622 2590 2556 2493 2423 2381 2369 2362 2343 2320 2305 2295 2281 2261 2241 2224 2209 2190 2167 2148 2145 2159 2173 2175 2166 2158 2151 2143 2142
601 2142 2157 2179 2184 2165 2142 2141 2166 2206 2249 2277 2271 2235 2203 2206 2228 2231 2211 2203 2228 2255 2243 2195 2151 2143 2164 2197 2225 2243 2253 2268 2300 2335 2347 2338 2337 2361 2391 2409 2433
596 2433 2484 2541 2570 2581 2618 2690 2757 2796 2838 2916 3012 3095 3174 3275 3379 3439 3462 3511 3619 3753 3868 3968 4082 4205 4311 4399 4500 4633 4787
592 4787 4944 5106 5285 5483 5692 5899 6100 6299 6507 6720 6925 7122 7339 7606 7913 8218 8502 8785 9094 9423 9750 10082 10448
589 10448 10856 11268 11648 12015 12431 12918 13440 13964 14511 15125 15810 16536 17293 18105 18985 19910 20868 21878 22958 24095 25268 26479
587 26479 27733 29001 30255 31505 32772 34021 35179 36211 37144 37996 38717 39238 39552 39703 39711 39543 39174 38630 37966 37211 36372
584C6372r05r26r17r09r19r18q88q43q07p67o99o11n38n06m86m46l89l36k88k30j58r1l4K0
581B2781Q3J58K33K96L33L61M14N08O15O95P44P94Q60R19R49R57R67R80R78R52Q98Q07O88
578C7970N62M49L36J94J4j84l72n38o81q04r19j025j115j178j214j235j246j234j205j171
576B5404j141j098j040r87r57r26q60p60o77o38o27o05n62n07m51m01l65l50l37l00k37j69
573A1409j28j11j00p2l3oLJ3N1J11J51J47J24J22J51J96K44L06L83M65N52O53P71Q96J034
570A7332J212J433J670J891K111K365K656K945L188L362L474L523L480L296K942K449J889
568F1218J324P89L16q5m84j006j727k551l276l756l967l965l811l567l289k995k666k313j994
566B2195j760j587j412j222j049r11p96o96o26n90n65n18m50l93l67l66l63l44l12k84k60
$$ plain form
584 36372 35467 34541 33624 32715 31796 30878 29990 29147 28340 27573 26874 26263 25725 25219 24733 24287 23898 23562 23274 23044 22886 22795 22761 22781
581 22781 22864 23022 23255 23551 23884 24245 24659 25167 25782 26477 27221 28015 28875 29794 30743 31700 32667 33647 34625 35577 36475 37282 37970
578 37970 38532 38981 39317 39511 39525 39341 38969 38431 37750 36946 36027 35002 33887 32709 31495 30260 29014 27780 26575 25404
576 25404 24263 23165 22125 21138 20181 19255 18395 17635 16958 16320 15693 15088 14526 14019 13568 13167 12802 12452 12115 11815 11578 11409
573 11409 11281 11170 11070 10998 10965 10959 10962 10975 11026 11137 11288 11435 11559 11681 11832 12028 12272 12578 12961 13426 13978 14631 15402 16298 17332
570 17332 18544 19977 21647 23538 25649 28014 30670 33615 36803 40165 43639 47162 50642 53938 56880 59329 61218
568 61218 62542 63331 63647 63562 63078 62072 60345 57794 54518 50762 46795 42830 39019 35452 32163 29168 26502 24189 22195
566 22195 20435 18848 17436 16214 15165 14254 13458 12762 12136 11546 10981 10463 10013 9620 9253 8887 8524 8180 7868 7584 7324
563G324k27j80j41j27j41j64j80j79j64j48j41j47j53j56j52j41j21j03j03j12j03p6n7n9
560D049o2n5n3p2p9m7jJ1rrK7N3L6RJ8N0N9M2L3M8O2N8M4L5J8j9o6q4o0k3mJK2O4J00J16J24
556D436J43J67J90K20K69L19L33L22L28L62L95L97L79L51K96J99P9l4j34k26k99l48l78l94
553G372l74l11k42k11k08j92j53j23j20j13q2m6l3l5l0k5l6n9p5q4r4j01q6n5l6l9n3n0k3
549D283PJ7Mj5j0J6L6L0Pn%ONLJqj8j7ooj5oL4O5M3k7q1p3k6QOj5l4m6m8l4j2Jj0k9l6k2p
544C966qk0k1mJ2Lj6j7NJ9lm2o0m9l4k7rK3L9K3PL3Q6J12Q2L8K5M8P4Q6R1R9J07J17J35J57
540E077J73J83J84J80J83K15K74L32L58L65L98M65N29N64N95O58P43Q14Q60R01R47R80R83
537A6961R53Q86P59N73L60J48o5k90n05o78q04q85r21r08q64q13p54o77n96n38m93m24l39
$$ plain form
563 7324 7097 6917 6776 6649 6508 6344 6164 5985 5821 5673 5532 5385 5232 5076 4924 4783 4662 4559 4456 4344 4241 4165 4108 4049
560 4049 3987 3932 3879 3807 3728 3681 3680 3691 3682 3673 3700 3753 3789 3798 3816 3866 3925 3967 4000 4048 4110 4168 4212 4247 4265 4246 4180 4096 4036 4013 4009 4010 4032 4096 4196 4312 4436
556 4436 4579 4746 4936 5156 5425 5744 6077 6399 6727 7089 7484 7881 8260 8611 8907 9106 9185 9151 9017 8791 8492 8144 7766 7372
553 7372 6998 6687 6445 6234 6026 5834 5681 5558 5438 5325 5243 5197 5164 5129 5099 5074 5038 4979 4904 4820 4726 4625 4539 4484 4448 4409 4356 4306 4283
549 4283 4290 4307 4311 4296 4286 4302 4338 4368 4375 4370 4370 4376 4381 4384 4385 4377 4359 4342 4336 4330 4315 4309 4343 4408 4451 4424 4343 4270 4244 4252 4258 4243 4209 4163 4115 4081 4069 4070 4060 4031 3995 3973 3966
544 3966 3958 3938 3917 3913 3925 3928 3912 3895 3900 3919 3916 3874 3814 3765 3731 3704 3695 3718 3757 3780 3787 3820 3906 4018 4100 4138 4163 4211 4285 4371 4462 4561 4668 4785 4920 5077
540 5077 5250 5433 5617 5797 5980 6195 6469 6801 7159 7524 7922 8387 8916 9480 10075 10733 11476 12290 13150 14051 14998 15978 16961
537 16961 17914 18800 19559 20132 20492 20640 20575 20285 19780 19102 18298 17413 16492 15584 14720 13907 13153 12476 11880 11342 10849 10425 10086
534A0086k78k60k36j78j29j35j73j83j51j11q2l9RL3K4L3Q4J49J96K44L14L84M29M69N45O48
531A1692P32P83Q41R40J063J176J243J243J169J038Q70O54L61Ml59o62q77j003j048j018r47
528A7895q63p71o61n35m11l03k11j25l0P0J64K37K98L72M70N76O70P55Q41R25J013J114J228
526B2718J340J440J575J797K099K424K724L003L288L569L805L945L947L771L397K823K042
523F9707J060n4j142k018k600k929l089l124l055k926k796k688k570k409k209j998j793j591
521C1776j387j184r75p62n56l77k28r1M5J79L12M55O12P56Q81J017J196J408J602J760J913
519C8352K090K272K442K627K885L239L689M228M850N505O133O698P195P565P684P442O790
517A21686N694M086J947n53l042n116o539p292p514p378p015o493n855n154m454l803l213
$$ plain form
534 10086 9808 9548 9312 9134 9005 8870 8697 8514 8363 8252 8170 8131 8140 8173 8197 8230 8314 8463 8659 8903 9217 9601 10030 10499 11044 11692
531 11692 12424 13207 14048 14988 16051 17227 18470 19713 20882 21920 22790 23444 23805 23809 23450 22788 21911 20908 19860 18842 17895
528 17895 17032 16261 15600 15065 14654 14351 14140 14015 13985 14055 14219 14456 14754 15126 15596 16172 16842 17597 18438 19363 20376 21490 22718
526 22718 24058 25498 27073 28870 30969 33393 36117 39120 42408 45977 49782 53727 57674 61445 64842 67665 69707
523 69707 70767 70713 69571 67553 64953 62024 58935 55811 52756 49830 47034 44346 41776 39367 37158 35160 33367 31776
521 31776 30389 29205 28230 27468 26912 26535 26307 26216 26261 26440 26752 27207 27819 28575 29456 30473 31669 33077 34679 36439 38352
519 38352 40442 42714 45156 47783 50668 53907 57596 61824 66674 72179 78312 85010 92205 99770 107454 114896 121686
517 121686 127380 131466 133413 132860 129818 124702 118163 110871 103357 95979 88964 82471 76616 71462 67008 63205 59992
515E9992k689k245j886j597j366j203j124j110j126j135j114j045r20p44n40l29j37J8J28
512C9828J95K32K64L26M35N69O98Q23R84J197J430J670J949K293K654K962L214L447L645L733
510G2548L649L382K907K169J169K0j103k068k800l259l447l422l267l028k725k380k019j658
508E4668j300r71o86m23j45J39M02O46R13J201J458J650J811J988K169K306K357K338K282
505G2803K224K175K132K112K182K404K772L212L669M163M717N294N816O256O639O967P176
503A42713P201P043O783O492O163N708N043M135K964J473l62k382m227n563o307o619o687
501A63571o594o361o032n662n290m953m706m552m422m243m022l820l640l446l232l039k875
499H6682k706k513k338k205k074j897j689j513j386j270j119r14o42k87J33N94J093J641K204
$$ plain form
515 59992 57303 55058 53172 51575 50209 49006 47882 46772 45646 44511 43397 42352 41432 40688 40148 39819 39682 39700 39828
512 39828 40023 40255 40519 40845 41280 41849 42547 43370 44354 45551 46981 48651 50600 52893 55547 58509 61723 65170 68815 72548
510 72548 76197 79579 82486 84655 85824 85844 84741 82673 79873 76614 73167 69745 66478 63450 60725 58345 56326 54668
508 54668 53368 52397 51711 51288 51143 51282 51684 52330 53243 54444 55902 57552 59363 61351 63520 65826 68183 70521 72803
505 72803 75027 77202 79334 81446 83628 86032 88804 92016 95685 99848 104565 109859 115675 121931 128570 135537 142713
503 142713 149914 156957 163740 170232 176395 182103 187146 191281 194245 195718 195356 192974 188747 183184 176877 170258 163571
501 163571 156977 150616 144584 138922 133632 128679 123973 119421 114999 110756 106734 102914 99274 95828 92596 89557 86682
499 86682 83976 81463 79125 76920 74846 72949 71260 69747 68361 67091 65972 65058 64416 64129 64262 64856 65949 67590 69794
497F9794K687L028L255L422L487L307K827K215J758J586J566J471J227Q47K09r54k709m657
494I4366o139o783o738o399o011n562n004m374l771l251k817k464k176j938j724j516j298
492B6401j079q78p16n82m67l59k54j36j2R4J71K41L08L48L52L61M28N48O80Q30J020J237J436
490B9972J606J777J933K018K005J915J743J475J177R83R53R79R23P47M58k3p70j686k514l040
487D2631l230l173k952k644k322k030j765j512j275j065q80p10n57m07k40n7J19K83M49O33
485A9296Q20J002J178J342J485J619J761J904J998K032K074K215K464K712K831K759K523K129
482E4144J490M70q84k261l270l739l804l690l509l252k914k536k183j892j679j508j326j124
480A6533r43q03o71n26l98l19k62j95j33r9n0O1J98K76L00L51M74O25P60Q97J075J283J501
$$ plain form
497 69794 72481 75509 78764 82186 85673 88980 91807 94022 95780 97366 98932 100403 101630 102477 102686 101732 99023 94366
494 94366 88227 81444 74706 68307 62296 56734 51730 47356 43585 40334 37517 35053 32877 30939 29215 27699 26401
492 26401 25322 24444 23728 23146 22679 22320 22066 21930 21918 22012 22183 22424 22732 23080 23432 23793 24221 24769 25449 26279 27299 28536 29972
490 29972 31578 33355 35288 37306 39311 41226 42969 44444 45621 46604 47557 48536 49459 50206 50664 50641 49871 48185 45671 42631
487 42631 39401 36228 33276 30632 28310 26280 24515 23003 21728 20663 19783 19073 18516 18109 17869 17812 17931 18214 18663 19296
485 19296 20116 21118 22296 23638 25123 26742 28503 30407 32405 34437 36511 38726 41190 43902 46733 49492 52015 54144
482 54144 55634 56104 55220 52959 49689 45950 42146 38456 34947 31695 28781 26245 24062 22170 20491 18983 17657 16533
480 16533 15590 14787 14116 13590 13192 12873 12611 12416 12283 12184 12134 12195 12393 12669 12969 13320 13794 14419 15179 16076 17151 18434 19935
477A9935J733J997K290K607K963L368L798M231M681N199N787O343O678O636O215N482M347
475I4290K533p5l036n507o897p287p180o922o518n902n161m463l883l394k967k599k280j985
473B0767j700j435j206j030r04q05p10o16n31m48l56k66k08j77j31m7M8J19J71K40L50M87
470A1612O28P56Q84J035J227J452J691J939K201K484K775L051L249L294L151K846K375J631
468D8281N17q64k176l085l506l584l490l299l032k722k410k105j814j556j348j187j047r16
466A0657p89o69n65m89m45m07l56k99k65k62k70k64k35k01j78j65j56j51j41j20r5q8j03j20
463C824j12q7p1p5q3p9o9o0m7l5m1o7q1o6m4n0o5m5mOk8n1k2K3K7j1m3m5k8qJ7L0J1k7n5n4
459B385m3m6o0o6n8l5j1nk7n4n5k7NK3L3L2J4j8l6k8j1j3l0m3l8k1JJ3J0jlPLk0l3j4J0J1
$$ plain form
477 19935 21668 23665 25955 28562 31525 34893 38691 42922 47603 52802 58589 64932 71610 78246 84461 89943 94290
475 94290 96823 96748 93712 88205 81308 74021 66841 59919 53401 47499 42338 37875 33992 30598 27631 25032 22752 20767
473 20767 19067 17632 16426 15396 14492 13687 12977 12361 11830 11382 11026 10760 10552 10375 10244 10197 10245 10364 10535 10775 11125 11612
470 11612 12240 12996 13880 14915 16142 17594 19285 21224 23425 25909 28684 31735 34984 38278 41429 44275 46650 48281
468 48281 48798 47934 45758 42673 39167 35583 32093 28794 25762 23040 20630 18525 16711 15155 13807 12620 11573 10657
466 10657 9868 9199 8634 8145 7700 7293 6937 6638 6373 6111 5841 5577 5342 5141 4963 4798 4642 4491 4350 4230 4135 4047 3944 3824
463 3824 3712 3625 3554 3479 3396 3317 3248 3188 3141 3106 3065 2998 2917 2851 2807 2757 2692 2647 2643 2649 2621 2570 2548 2571 2598 2587 2544 2499 2471 2463 2480 2510 2521 2494 2439 2385
459 2385 2342 2296 2236 2170 2112 2077 2066 2061 2034 1980 1925 1898 1903 1926 1959 1991 2005 1987 1951 1923 1912 1899 1869 1826 1788 1767 1768 1781 1791 1790 1787 1794 1797 1777 1744 1730 1740 1751
454A751klNMMK4N4N7L2J4J9K5K1J6J1pk4j2J7Pm5p0k0M3L1m7j00q7m6k5j6JJ6J3mk1l8n0m1
449A507qK6K9Lk3k1%J1Nqj1j6l1l8j6J7K1j2l4j3K3L2J8J2J5Mj2oK2L9L4K6K1J0%NJ6Kl1m5
444A573k4KLkNRmj5jK4K8J0j1j5lJ9L2L1K2K1K9L4L9N9Q2P8M1J9L7O5O4L6J2%kPL0M5M1L8
440B458M7N2L5J8K4L6L2K7M6O5M7Qj0m%lJ5M2M1J1mJ3L4L5K8L0L1L7O2R0Q6N4M7Q1J11J03
435C825Q3Q6J00R3O8M1J9PJ5L1J0m9j02j13j09j21j27j03p7q3j11j26j14r0m9j0j3n8r0o6
431B767l5o3j18j25q4o1p4q6p6p4q5q3p1p7r9r1n3l7o1o8l4lj6m1l7k1k1k4j2nj9k7%K7J7
427A030j3k0pqj6nK0J9kKM2P3O7N0M9N4M2K2J1Mj2k8k6oOj5n3p1m9j2%k7n9p2o4n4m7m2m4
422G39n1m9l6k3j2kJ1Oj3j8lPkj0OK1J2mlMrj0K8P0O5L0K6M8L6j9m4nL5K0k2l3k2k5l2j7J1
$$ plain form
454 1751 1749 1746 1751 1755 1759 1783 1837 1894 1926 1940 1959 1984 2005 2021 2032 2025 2001 1989 2006 2013 1968 1898 1878 1921 1952 1905 1805 1718 1672 1647 1631 1632 1648 1661 1657 1636 1598 1548 1507
449 1507 1499 1525 1554 1557 1534 1513 1513 1524 1529 1521 1510 1494 1463 1425 1409 1426 1447 1435 1401 1388 1411 1443 1461 1473 1488 1492 1480 1474 1496 1535 1569 1595 1616 1626 1626 1631 1647 1649 1618 1573
444 1573 1549 1551 1554 1552 1557 1566 1562 1547 1546 1570 1598 1608 1597 1582 1579 1598 1630 1661 1683 1704 1733 1767 1806 1865 1947 2025 2066 2085 2122 2187 2251 2287 2299 2299 2297 2304 2334 2379 2420 2458
440 2458 2505 2557 2592 2610 2634 2670 2702 2729 2775 2840 2887 2895 2885 2881 2881 2878 2893 2935 2976 2987 2983 2996 3030 3065 3093 3123 3154 3191 3253 3343 3429 3483 3530 3611 3722 3825
435 3825 3908 3994 4094 4187 4255 4296 4315 4322 4337 4368 4378 4329 4227 4114 4005 3884 3757 3654 3577 3494 3383 3257 3143 3053 3004 2994 2981 2923 2833 2767
431 2767 2732 2669 2551 2426 2342 2281 2207 2121 2045 1971 1886 1803 1732 1655 1556 1465 1412 1375 1314 1246 1212 1209 1193 1152 1115 1094 1073 1049 1037 1032 1013 986 986 1013 1030
427 1030 1017 997 990 982 966 961 981 1000 998 1000 1042 1115 1182 1232 1281 1335 1377 1399 1410 1414 1402 1374 1348 1342 1348 1333 1280 1209 1160 1148 1148 1121 1062 990 926 872 825 783 739
422 739 688 639 603 580 568 566 577 583 570 552 549 556 554 544 550 571 583 579 576 580 571 561 589 659 724 754 780 828 864 845 801 796 831 851 829 796 774 749 717 700 711
417G11J2nj3pj2k8l2k6k9l5k3knl2m5k5OJ5lk4k8qK1L1J3j2j5KJ6J3LnqnPK1K5K8L6M5M4M5
412F67N7O1L8J1J1K6Qm0o0l8k4m8o6k8K0Oo2r7o1rlk3k4oJj1j2OJ3mj2J0L8L1rl4k4nnj6j0
407B73RJ7Lj7k0lK3L0J8%lMjj4mK8M2J7lJ7M2Qo2q5l2K8L4J1PJ5om3n5k8MJ8J7Qlp%RNKQJ3
402C24LkJ6L3J4l0m9l9k9k9k0kml1l4KL3J8j8k7qQJ9L3L3on8o4j7K9J8k2l2lK0Kl0k8J5M9
397H7L6LpOOj7k6lJ8jm1n5k8RK9L1J7KkMjk1k9KL6K7j8l7j0K0J5oqOJ5J5Rmj7j3LJ2JnQJ9
391H7Mj3%K7L5K5K6L4J8j2j5J0K3OpOJ0j8m8m6j9KJ5L8N2K7k0n2m8k5%J5Qk5m8l0J2K6%k5
386E5j9moj3%K1K2Lq%RPJLJ9K7J7KNK6L2jm6n7k1K2L1Qj4j6jJ0OkMK3K8Lk9l1j1%j0j4kPO
381I2J7M2M6Nm3n2k2J1K8L4J7j3k5jK7J5j8k7j2j2k9k6lKj1%M6P0K9l1m2qK3L1K8J6j3m3m4
$$ plain form
417 711 723 718 705 698 686 658 626 600 571 536 513 511 506 474 429 404 410 425 422 398 370 362 383 414 427 415 400 402 418 431 434 429 421 416 423 444 469 497 533 578 622 667
412 667 724 785 823 834 845 871 879 839 779 741 717 669 603 575 595 601 539 442 381 372 369 346 322 316 317 306 294 300 313 309 297 307 345 376 367 333 309 304 299 283 273
407 273 282 299 302 285 265 262 285 315 333 333 330 334 333 319 315 343 385 402 399 416 458 466 404 319 287 315 349 360 367 382 376 333 278 250 254 272 289 297 294 287 287 296 301 303 311 324
402 324 327 325 341 374 388 358 309 270 241 212 192 190 186 155 121 123 156 174 156 129 121 129 148 181 214 208 150 86 69 98 116 94 62 59 79 81 51 23 38 87
397 87 123 126 119 125 131 114 88 85 103 102 61 6 -22 -13 16 47 64 66 64 68 67 46 17 19 55 82 64 27 17 37 52 46 38 44 59 74 83 79 62 49 52 64 65 60 68 87
391 87 91 78 78 105 140 165 191 225 243 231 216 226 249 255 248 254 264 246 198 152 133 135 150 188 240 267 247 195 147 122 122 137 145 120 72 42 54 80 80 55
386 55 36 32 26 13 13 34 56 59 51 51 60 67 68 71 90 117 134 136 141 167 199 198 152 95 74 96 127 135 121 105 104 114 120 118 122 145 173 176 147 116 105 105 95 81 79 86 92
381 92 109 151 197 202 159 107 85 96 124 158 175 162 137 136 163 178 160 133 121 109 80 54 51 53 42 42 88 158 187 156 114 106 129 160 188 204 191 148 104
376A04qL0M5L8L0K4K3L1M6N1L0j6o0p1l7J4M2L6J8RJop%%j0j8j4j2k4l6l4k8k1j1OJ3P%LL
371A91kKK1J6k2n4m0j2j1k0NN1O2K9NQNk8n1l2NK1K0K2K6J7KnlNJ7L0K8J0k%NJ%%rk2qM1P4
365C98N4RpPJ9J3J0J4Pj6k5mK0K2R%KNRROnj6j1J3M2N3L6QnRK9L7L3K7K0J5J3K1L2L3K0Mn
360I64%J1J7J1LJ6M7P0P1O1O4P1O7N7N8P8R6J03J00J02J20J50J69J57J29J31J81K38K52K36
356C830K38K67K89K80K65K75K88K69K12J59J39J41J34R6M8K1J9J9Kk3m3o2q7j04r6p3o4p4
353F365q2q2q6r8r0n7k4k0l3k7J3N8Q6Q8Q7R7J16J33J49J80K31K87L36L80M28M74N01N11N27
349A0448N54N77N93O03N97N38M17K67J29Kj26k57l62m26m59m87n28n74o09o11n82n45n08m72
346H179m30l83l36k94k66k51k34k07j84j74j67j43j05q1p1n9l7j4kJ5M1O5P6Q6R7J10J32J63
$$ plain form
376 104 96 126 171 209 239 263 286 317 363 414 444 428 368 297 260 274 316 352 370 379 380 374 367 367 367 357 339 325 313 289 253 219 191 170 159 165 178 185 185 188 191
371 191 189 191 212 228 206 152 112 100 89 69 74 125 187 216 221 229 234 206 155 123 128 149 169 191 217 234 236 231 228 233 250 280 308 318 316 316 321 322 322 322 313 291 283 324 398
365 398 452 461 454 461 480 493 503 517 524 508 483 479 499 521 530 530 532 537 546 555 561 556 540 529 542 584 637 673 681 676 685 714 751 784 811 831 846 859 880 912 945 965 969 964
360 964 964 975 992 1003 1006 1022 1069 1139 1210 1271 1335 1406 1473 1530 1588 1666 1762 1865 1965 2067 2187 2337 2506 2663 2792 2923 3104 3342 3594 3830
356 3830 4068 4335 4624 4904 5169 5444 5732 6001 6213 6372 6511 6652 6786 6882 6930 6951 6970 6989 6991 6968 6925 6863 6776 6672 6576 6503 6439 6365
353 6365 6283 6201 6115 6017 5927 5870 5846 5826 5793 5766 5779 5837 5923 6011 6098 6195 6311 6444 6593 6773 7004 7291 7627 8007 8435 8909 9410 9921 10448
349 10448 11002 11579 12172 12775 13372 13910 14327 14594 14723 14725 14599 14342 13980 13554 13095 12608 12080 11506 10897 10286 9704 9159 8651 8179
346 8179 7749 7366 7030 6736 6470 6219 5985 5778 5594 5420 5253 5110 5005 4924 4853 4794 4757 4743 4741 4756 4797 4862 4938 5024 5121 5231 5363 5526
343E526J86J82J71J92K37K55K33K14K22K18J72J09P2N3J9k6o7j19j90k47k57k47k66l03l13
340F026k94k88k94k75k33k05k03j91j60j41j46j42j15r0q7q9q3q1q6p1l3j0k4m5m5m7p7j06
336B365r0m6j7j7j7j6k7n7p5o7m2j5Knl4n7m6j3mk7n2m5j8jjlok0l5l2lK1J0k1l2qK0J6lj1
331A471qj2j7LL9N1K9Lmrk4k7j1PMmoj7l9m5k5k1n7q7o7k5k2n2o0l2j6k4k4j3k1n1n3j6Pk3
327G02o6o4k3J1K4K5J4j4l7l1rknLK1K8J4pk4l8m5l4nL1N3M7J4k2l4j8jnj0MJ3nk9k3PK1L
322D84j8k4k7l7l6j4Jj2k8j5J0Jm0o2m2j3j6m0l8nK3K4J3J0Lj7l3k3j%k0l2k0mKRK0K1Lj8
317a1k1j0rk0l4m1m0l3j9kJ5L0L6J6j8l4k2kLLJ3J3j2l9l5j4j5l2j9K6N5L6Jj4o%%jmj1j6
312b87rkLJ3K3J5rk0%K1J2k1m3l7k2j0kQJ8K3J8MqkJ5K0Nj4j8j6j5qjjmNK5L0J2jMNj8l4j8
$$ plain form
343 5526 5712 5894 6065 6257 6494 6749 6982 7196 7418 7636 7808 7917 7989 8042 8061 8035 7968 7849 7659 7412 7155 6908 6642 6339 6026
340 6026 5732 5444 5150 4875 4642 4437 4234 4043 3883 3742 3596 3454 3339 3249 3162 3073 2990 2909 2823 2752 2719 2709 2685 2640 2595 2548 2471 2365
336 2365 2275 2229 2212 2195 2178 2162 2135 2078 2003 1936 1894 1879 1881 1876 1842 1785 1739 1726 1722 1695 1643 1598 1580 1579 1578 1575 1569 1549 1514 1482 1479 1500 1510 1489 1457 1449 1469 1485 1482 1471
331 1471 1463 1451 1434 1437 1476 1527 1556 1559 1555 1546 1522 1495 1484 1491 1495 1491 1485 1468 1429 1384 1359 1338 1281 1194 1127 1102 1080 1028 968 936 920 896 872 859 838 787 734 718 725 702
327 702 636 572 549 560 584 609 623 609 572 541 532 530 525 528 549 577 591 584 560 522 477 443 438 469 522 569 583 561 527 509 508 503 493 497 510 505 476 453 460 481 484
322 484 466 442 415 378 342 328 329 317 289 274 284 285 245 183 141 128 112 72 34 29 52 76 89 99 102 85 52 29 28 28 8 -24 -44 -48 -46 -37 -17 4 7 -11
317 -11 -32 -42 -51 -71 -105 -146 -186 -219 -238 -240 -225 -195 -159 -143 -161 -195 -217 -219 -216 -213 -200 -187 -199 -238 -273 -287 -302 -334 -353 -327 -272 -236 -235 -249 -255 -255 -255 -256 -260 -271 -287
312 -287 -296 -298 -295 -282 -259 -244 -253 -273 -273 -252 -240 -261 -304 -341 -363 -373 -375 -367 -349 -326 -308 -304 -312 -314 -299 -279 -274 -288 -306 -322 -337 -345 -346 -347 -351 -346 -321 -291 -279 -280 -276 -271 -289 -323 -341
306c41Krl4l1mJ4J9L3M6K3k6n1l4mJ4K8M1L1nk8k2j8m0o0m1J0N1N8L5om1m3j2J7K5K0J6om0
301d13m6lM7M9J0j7j1Jnk0k4qJ8L2J7j3k6j1LmmJ3K0mk5j2Pj2m1j3M8O0Lm6k9J4K9J4mj8k8
296d52j9LLk6l4NL7J4k9l1LJ3rj8JK4K8K4K2RjJ0L2K6j2m0k7QK9L1K4Nk6m3l1jJ9J8jk6m0
291d78l0KK5K8K2J3nl0l3kL2K5j7m1k5%LnKJ8J9LmQJ2nk5j7J0J3j9n2m3LM8N8L2j5m7l4J5
286e36N6N3K1JNRjj5j6kJ9K9J1k4m4k4QJ4qj1J8L7J7j7k4ojj7l2k8j5j3j9k0mK5M4L1ml2l0
281e45j3lOK4L5J5k5m0j1K4J9k0m2j8J9L5K8K4L0K2lj8oLj6m2l2J3L3Ml4l1jJ5Pjkk2n1n3
276f73j0L8M6J4j0rKmj4nJ2Rj7k9kM0N3K4j1k0oOOlmLQJj8k8k3qLJ8L9M2J1k4k9oJj9k6lJ9
271f06Rj3j6j0j3j8qQJ4J5K4K6J3jJMoj6nJ1NnPK4Qk7l4j2jj7k2KK7K3Jj3j7j6kJ5J3pj0J4
$$ plain form
306 -341 -339 -348 -382 -413 -417 -403 -384 -351 -305 -282 -308 -359 -393 -397 -383 -355 -314 -283 -288 -316 -338 -356 -396 -456 -497 -487 -436 -378 -343 -349 -390 -433 -445 -428 -403 -383 -367 -373 -413
301 -413 -459 -462 -415 -366 -356 -373 -384 -383 -388 -408 -432 -440 -422 -390 -373 -386 -412 -423 -420 -424 -428 -415 -395 -399 -424 -436 -429 -441 -482 -495 -447 -387 -384 -430 -459 -445 -416 -402 -406 -424 -452
296 -452 -471 -468 -465 -491 -525 -520 -483 -469 -498 -529 -526 -513 -522 -540 -539 -515 -487 -463 -441 -432 -433 -423 -391 -365 -377 -417 -444 -436 -407 -376 -352 -347 -373 -416 -447 -448 -429 -411 -412 -438 -478
291 -478 -508 -506 -481 -453 -431 -418 -423 -453 -486 -488 -456 -431 -448 -489 -514 -514 -511 -516 -514 -496 -477 -474 -478 -470 -458 -463 -488 -505 -495 -482 -501 -553 -596 -593 -545 -487 -455 -470 -517 -551 -536
286 -536 -480 -427 -406 -405 -400 -391 -392 -407 -423 -425 -406 -377 -366 -390 -434 -458 -450 -436 -444 -455 -437 -400 -383 -400 -424 -430 -431 -448 -480 -508 -523 -536 -555 -575 -579 -554 -510 -479 -483 -515 -545
281 -545 -558 -561 -555 -531 -496 -481 -506 -546 -557 -533 -514 -534 -576 -594 -575 -540 -512 -488 -458 -436 -439 -457 -463 -460 -476 -518 -550 -537 -504 -500 -534 -565 -566 -551 -544 -545 -547 -569 -620 -673
276 -673 -683 -645 -599 -585 -595 -604 -602 -606 -620 -625 -613 -604 -621 -650 -652 -612 -559 -535 -546 -566 -572 -566 -560 -563 -567 -564 -556 -555 -573 -601 -624 -632 -629 -611 -572 -530 -519 -543 -572 -578 -577 -596 -622 -625 -606
271 -606 -597 -610 -626 -636 -649 -667 -675 -667 -653 -638 -614 -588 -575 -576 -575 -571 -577 -593 -598 -587 -582 -587 -580 -556 -548 -575 -609 -621 -622 -639 -661 -659 -632 -609 -608 -621 -638 -654 -656 -641 -628 -635 -645 -631
266f31K9Rj8k1nkk1l7l3mM0O6M5mk3kK4K6K2K7J3k8m5oL8L0j8l4j1J1QLRQj0k4k5k1j1PJ5
261f04j1m2l2J1L3J2j3mJ8K3J0nj3j3LJ6Pj8k1KJ8R%J5K6Rj5j2J1J5mj2NK0J4nrLJ3J1KJP
255e19Lk3m6k9J3L3Rk2l1k0kJ7L5K4j9n4m7j3J2K5L3K7lk9j5J9K1j5l5j5J2Pj8l3k3kK4M3
251f56M6K6%j5k2k3j7oKJ1K9L6J2k3k1K0M1J1k9k9nkk2k5JK5K8K0Ok0n1n5k3J4K9K7K2J5k
246f25j5j6pPK3L3J6k1m3k5OJ4jnRJ9J3Kjlj2j0QK3J5nj6j7k1k5j3PJ3nk6j9J0K9J5k0l8j9
241g46J6L1J5j3l1k8j3KJj0j3PL7L8Nk2qK8M2K0mpnj3j8qJ3K0Oj3k1j1OJ3mk3j6J6L3J1k9
236f96m8k9PL2L9K3mk7l1k1j1%RJ1jj0KJ6Oj4oL7O0K3l8n0lM3L8%k6k4j1KJ6K6J8nk8m0m0
231g55k7pJ2J2jmPK0K5K7K9J8kk0k0j2j0pOJ4OojJ2J0oj3l%j2k5k3j2jJ7K7J6j1j6RL0K1K
$$ plain form
266 -631 -602 -593 -611 -632 -637 -639 -660 -697 -730 -734 -694 -628 -583 -587 -610 -612 -588 -562 -540 -513 -500 -528 -573 -579 -541 -511 -529 -563 -574 -563 -555 -552 -543 -535 -545 -569 -594 -615 -626 -619 -604
261 -604 -615 -657 -689 -678 -645 -633 -646 -650 -632 -609 -599 -604 -617 -630 -627 -611 -604 -622 -643 -641 -623 -614 -614 -599 -573 -564 -579 -591 -580 -565 -569 -581 -576 -556 -542 -547 -556 -553 -540 -529 -527 -526 -519
255 -519 -516 -539 -585 -614 -601 -568 -559 -581 -612 -632 -634 -617 -582 -558 -577 -631 -678 -691 -679 -654 -621 -594 -597 -626 -641 -622 -601 -616 -651 -666 -654 -647 -665 -698 -721 -723 -699 -656
251 -656 -610 -584 -584 -599 -621 -644 -661 -667 -665 -654 -625 -589 -577 -600 -621 -601 -560 -549 -578 -607 -612 -614 -636 -661 -660 -635 -607 -587 -581 -601 -652 -707 -730 -716 -687 -660 -638 -623 -625
246 -625 -640 -656 -663 -656 -633 -600 -584 -605 -648 -673 -667 -653 -654 -659 -650 -631 -618 -616 -617 -620 -632 -642 -634 -611 -596 -601 -617 -634 -655 -680 -693 -686 -673 -678 -704 -723 -713 -684 -669 -689 -727 -746
241 -746 -730 -699 -684 -697 -728 -756 -769 -767 -766 -776 -789 -782 -745 -707 -702 -724 -732 -704 -662 -642 -646 -653 -658 -671 -689 -697 -684 -664 -658 -671 -692 -703 -697 -684 -688 -711 -727 -711 -678 -667 -696
236 -696 -744 -773 -766 -734 -695 -672 -676 -703 -734 -755 -766 -766 -757 -746 -747 -757 -755 -739 -733 -747 -753 -716 -656 -633 -671 -721 -724 -681 -643 -643 -669 -693 -704 -702 -686 -660 -642 -647 -675 -715 -755
231 -755 -782 -789 -777 -765 -766 -770 -763 -743 -718 -691 -662 -644 -646 -666 -686 -698 -708 -715 -709 -695 -689 -695 -696 -684 -674 -680 -693 -696 -696 -708 -733 -756 -768 -769 -752 -725 -709 -720 -736 -727 -697 -676 -674
225f74kKok0k4j8j9j8jK0J6oj9j9k2k0OM2M2kl8k9PK7K7K2J6kj8j4PK0J4%oj1k2l2k1J1L8
220g46L5Lj9j3%j1l5l6j0J4K4L5N4N0J1l1l7k0qroJJ%PJ5Nj1rNNrj0J2L1K1qk6k7j1OJ9J4
$$ plain form
225 -674 -676 -674 -680 -700 -724 -742 -761 -779 -780 -760 -744 -750 -769 -788 -810 -830 -824 -782 -740 -742 -780 -809 -802 -775 -748 -726 -710 -712 -730 -744 -737 -717 -703 -703 -709 -720 -742 -774 -795 -784 -746
220 -746 -711 -708 -727 -740 -740 -751 -786 -822 -832 -818 -794 -759 -705 -655 -644 -675 -712 -732 -740 -749 -755 -754 -753 -753 -746 -731 -726 -737 -746 -741 -736 -745 -755 -743 -712 -691 -699 -725 -752 -763 -757 -738 -724
$$ [...]
##END=	
##END=	
