##TITLE=	QLsDr7KlQGmRkcnPK42u0w.14.ser
TM-VI-221 hmbc

##JCAMP-DX=	6.0	$$ MestReNova 14.3.1-31739
##DATA TYPE=	LINK
##BLOCK_ID=	1
##BLOCKS=	2    
##ORIGIN=	Mestrelab Research S.L.
##OWNER=	hrzepa
##$MNOVA/LINK_BLOCK_TYPE=	ITEM	$$ NMR Spectrum
##$MNOVA/ITEM/POLYGON=	(XY..XY)
5321,5835
8722,5835
8722,8208
5321,8208
5321,5835
##$MNOVA/ITEM/Z=	0
##$MNOVA/ITEM/ANGLE=	0
##TITLE=	QLsDr7KlQGmRkcnPK42u0w.14.ser
##JCAMP-DX=	6.0	$$ MestReNova 14.3.1-31739
##BLOCK_ID=	2
##DATA TYPE=	MNOVA NMR VIEW DATA
##DATA CLASS=	MNOVA VIEW DATA
##$MNOVA/2D/THRESHOLD=	18.121408462524414063
##$MNOVA/ITEM/ZOOM/X=	-0.47669846964044454429,	14.506009999935889354
##$MNOVA/ITEM/ZOOM/Y=	-9.5219447936452610293,	250.03239999719292541
##END=	
##TITLE=	QLsDr7KlQGmRkcnPK42u0w.14.ser
##JCAMP-DX=	6.0	$$ MestReNova 14.3.1-31739
##BLOCK_ID=	3
##DATA TYPE=	nD NMR SPECTRUM
##DATA CLASS=	NTUPLES
##NUMDIM=	2
##ORIGIN=	Bruker BioSpin GmbH
##OWNER=	nmr
##.OBSERVE FREQUENCY=	400.32280223999998725
##.OBSERVE NUCLEUS=	^1H
##.SOLVENT NAME=	CDCl3
##.PULSE SEQUENCE=	hmbcgplpndqf
##LONGDATE=	2022/01/13 22:23:27.000
##.ACQUISITIONMODE=	SIMULTANEOUS (DQD)
##$ORIGINAL FORMAT=	Bruker XWIN-NMR
##$MNOVA/SCALES_VERSION=	9
##$PARAMETER FILE=	(acqu2s, ASCII, /private/var/folders/f6/rjf_tdyn2v98c5c0wvkgn4s80000gn/T/QLsDr7KlQGmRkcnPK42u0w/14/acqu2s, 0)
$$ ##TITLE= Parameter file, TOPSPIN		Version 3.2
$$ ##JCAMPDX= 5.0
$$ ##DATATYPE= Parameter Values
$$ ##NPOINTS= 129	$$ modification sequence number
$$ ##ORIGIN= Bruker BioSpin GmbH
$$ ##OWNER= nmr
$$ $$ 2022-01-13 22:43:04.285 +0000  nmr@CZC2524DW0
$$ $$ /opt/topspin/data/agmb/nmr/Jan13-2022/14/acqu2s
$$ $$ process /opt/topspin3.2/prog/mod/go
$$ ##$ACQT0= 0
$$ ##$BF1= 100.660544
$$ ##$FnMODE= 1
$$ ##$NUC1= <13C>
$$ ##$NusJSP= 0
$$ ##$NusT2= 1
$$ ##$NusTD= 128
$$ ##$O1= 12079.3932956644
$$ ##$SFO1= 100.672623393296
$$ ##$SW= 260.03107487261
$$ ##$SW_h= 26178.0104712042
$$ ##$TD= 128
$$ ##END=
$$ 
##$PARAMETER FILE=	(acqus, ASCII, /private/var/folders/f6/rjf_tdyn2v98c5c0wvkgn4s80000gn/T/QLsDr7KlQGmRkcnPK42u0w/14/acqus, 0)
$$ ##TITLE= Parameter file, TOPSPIN		Version 3.2
$$ ##JCAMPDX= 5.0
$$ ##DATATYPE= Parameter Values
$$ ##NPOINTS= 12	$$ modification sequence number
$$ ##ORIGIN= Bruker BioSpin GmbH
$$ ##OWNER= nmr
$$ $$ 2022-01-13 22:43:07.751 +0000  nmr@CZC2524DW0
$$ $$ /opt/topspin/data/agmb/nmr/Jan13-2022/14/acqus
$$ $$ process /opt/topspin3.2/prog/mod/shimcntl
$$ ##$ACQT0= 1000000
$$ ##$AMP= (0..31)
$$ 100 100 100 100 100 100 100 100 100 100 100 100 100 100 100 100 100 100
$$ 100 100 100 100 100 100 100 100 100 100 100 100 100 100
$$ ##$AMPCOIL= (0..19)
$$ 0 0 0 0 0 0 0 0 0 0 0 0 0 0 0 0 0 0 0 0
$$ ##$ANAVPT= -1
$$ ##$AQSEQ= 0
$$ ##$AQ_mod= 3
$$ ##$AUNM= <au_zgonly>
$$ ##$AUTOPOS= <51 >
$$ ##$BF1= 400.32
$$ ##$BF2= 100.660544
$$ ##$BF3= 400.32
$$ ##$BF4= 400.32
$$ ##$BF5= 400.32
$$ ##$BF6= 400.32
$$ ##$BF7= 400.32
$$ ##$BF8= 400.32
$$ ##$BYTORDA= 0
$$ ##$CAGPARS= (0..11)
$$ 0 0 0 0 0 0 0 0 0 0 0 0
$$ ##$CFDGTYP= 0
$$ ##$CFRGTYP= 9
$$ ##$CHEMSTR= <none>
$$ [...]
$$ 0 0 0 0
$$ ##$ShimPowMaxUC= (0..63)
$$ 130000 130000 130000 130000 130000 130000 130000 130000 130000 130000 130000
$$ 130000 130000 130000 130000 130000 130000 130000 130000 130000 0 0 0 0
$$ 0 0 0 0 0 0 0 0 0 0 0 0 0 0 0 0 0 0 0 0 0 0 0 0 0 0 0 0 0 0 0 0 0 0 0 0
$$ 0 0 0 0
$$ ##$ShimPowMaxUG= (0..63)
$$ 524287 524287 524287 524287 524287 524287 524287 524287 524287 524287 524287
$$ 524287 524287 524287 524287 524287 524287 524287 524287 524287 0 0 0 0
$$ 0 0 0 0 0 0 0 0 0 0 0 0 0 0 0 0 0 0 0 0 0 0 0 0 0 0 0 0 0 0 0 0 0 0 0 0
$$ 0 0 0 0
$$ ##$ShimPowRcbType= 3
$$ ##$ShimPowRes= (0..63)
$$ 1e-20 1e-20 1e-20 1e-20 1e-20 1e-20 1e-20 1e-20 1e-20 1e-20 1e-20 1e-20
$$ 1e-20 1e-20 1e-20 1e-20 1e-20 1e-20 1e-20 1e-20 0 0 0 0 0 0 0 0 0 0 0 0
$$ 0 0 0 0 0 0 0 0 0 0 0 0 0 0 0 0 0 0 0 0 0 0 0 0 0 0 0 0 0 0 0 0
$$ ##$ShimPowRng0= (0..63)
$$ 1 1 1 1 1 1 1 1 1 1 1 1 1 1 1 1 1 1 1 1 0 0 0 0 0 0 0 0 0 0 0 0 0 0 0 0
$$ 0 0 0 0 0 0 0 0 0 0 0 0 0 0 0 0 0 0 0 0 0 0 0 0 0 0 0 0
$$ ##$ShimPowRng1= (0..63)
$$ 1 1 1 1 1 1 1 1 1 1 1 1 1 1 1 1 1 1 1 1 0 0 0 0 0 0 0 0 0 0 0 0 0 0 0 0
$$ 0 0 0 0 0 0 0 0 0 0 0 0 0 0 0 0 0 0 0 0 0 0 0 0 0 0 0 0
$$ ##$ShimPowRng2= (0..63)
$$ 1 1 1 1 1 1 1 1 1 1 1 1 1 1 1 1 1 1 1 1 0 0 0 0 0 0 0 0 0 0 0 0 0 0 0 0
$$ 0 0 0 0 0 0 0 0 0 0 0 0 0 0 0 0 0 0 0 0 0 0 0 0 0 0 0 0
$$ ##$ShimPowRng3= (0..63)
$$ 1 1 1 1 1 1 1 1 1 1 1 1 1 1 1 1 1 1 1 1 0 0 0 0 0 0 0 0 0 0 0 0 0 0 0 0
$$ 0 0 0 0 0 0 0 0 0 0 0 0 0 0 0 0 0 0 0 0 0 0 0 0 0 0 0 0
$$ ##$ShimSysFunc= (0..63)
$$ 1 2 3 4 5 7 9 11 15 16 8 10 12 14 6 17 13 18 19 20 0 0 0 0 0 0 0 0 0 0
$$ 0 0 0 0 0 0 0 0 0 0 0 0 0 0 0 0 0 0 0 0 0 0 0 0 0 0 0 0 0 0 0 0 0 0
$$ ##$ShimSysMatrix= 0
$$ ##$ShimSysType= 1
$$ ##$TFXNUM= 0
$$ ##$TRIPLO2= 0
$$ ##$VTU= 2
$$ ##$VTUETH= <149.236.99.20>
$$ ##$VTUTY= <no>
$$ ##$WBREFAM= (0..15)
$$ 132.2 106.2 100 100 100 100 100 100 100 100 100 100 100 100 100 100
$$ ##$WBREFLM= (0..15)
$$ 0 0 0 0 0 0 0 0 0 0 0 0 0 0 0 0
$$ ##$WBREFPH= (0..15)
$$ 77.55 -65.76 0 0 0 0 0 0 0 0 0 0 0 0 0 0
$$ ##$WBSGU= (0..15)
$$ 0 0 0 0 0 0 0 0 0 0 0 0 0 0 0 0
$$ ##$XFAC= 2
$$ ##END=
$$ 
##$DECIM=	3328
##$DSPFVS=	20
##.ACQUISITIONSCHEME=	NOT PHASESENSITIVE
##NTUPLES=	nD NMR SPECTRUM
##VAR_NAME=	FREQUENCY1,	FREQUENCY2,	SPECTRUM
##SYMBOL=	F1,	F2,	Y
##.NUCLEUS=	13C,	1H
##.OBSERVE FREQUENCY=	100.67262339329600707,	400.32280223999998725
##VAR_TYPE=	INDEPENDENT,	INDEPENDENT,	DEPENDENT
##VAR_FORM=	AFFN,	AFFN,	ASDF
##VAR_DIM=	512,	512,	262144
##UNITS=	HZ,	HZ,	ARBITRARY UNITS
##FIRST=	25168.397401625570637,	5807.04592319999756,	0.22766140103340148926
##LAST=	-958.48414287705929837,	-190.8319313673060833,	0.41427579522132873535
##MIN=	-958.48414287705929837,	-190.8319313673060833,	0.00047148423618637025356
##MAX=	25168.397401625570637,	5807.04592319999756,	790.7022705078125
##FACTOR=	1,	1,	0.0035354686010179913955
##PAGE=	F1=25168.4
##FIRST=	25168.397401625570637,	5807.04592319999756,	0.22766140103340148926
##DATA TABLE=	(F2++(Y..Y)), PROFILE
$$ [...]
##PAGE=	F1=9113.91
##FIRST=	25168.397401625570637,	5807.04592319999756,	0.40407860279083251953
##DATA TABLE=	(F2++(Y..Y)), PROFILE
584B6Q5l2J2K0L0N9r6n9N6j1kL7n1M4r9N5P2l3q6J7l8J26j0J0K3l9l7k6K0k0J8Q9L6j50kJ30
$$ 26 111 79 91 111 141 200 104 45 101 90 88 125 74 118 19 74 146 113 27 44 6 132 122 132 155 116 79 53 73 53 71 160 196 46 44 174
161A74q9j0j4J31j50K00Qr5j9K1j7j02Q1k3j5l2OL8J22Jr4l5%k1J22j52J39p8l3o
$$ 174 85 75 61 192 42 242 250 155 136 157 140 38 119 96 81 49 55 93 215 216 122 87 87 66 188 36 175 97 64 58
-191E8
##PAGE=	F1=9011.66
##FIRST=	25168.397401625570637,	5807.04592319999756,	0.19251525402069091797
##DATA TABLE=	(F2++(Y..Y)), PROFILE
5807F6n3RQ8k6J03l6l0Q0j36R2r4n8J15L8l3m6M0M1j01N5K7Rm2pJ02r5M7r6J28N5j54m1Q0
$$ 66 13 22 110 84 187 151 121 201 65 157 63 5 120 158 125 79 119 160 59 114 141 150 108 101 203 108 155 59 187 242 88 47 127
5420A27K2n3KL3pJ4O9l7j26P6K00j68lP3j01j6P5MP0p0n2n2R7K9l6L9n6p9QO9l9K3K5j41J01
$$ 127 149 96 98 131 124 138 207 170 44 120 320 152 149 222 121 105 180 184 254 184 132 80 177 206 170 209 153 74 82 151 112 135 160 19 120
5009A20J4M4j13O2K6r1J15N0p4M9o9j04J40R6q1L4J59q7j44k5l7L4M1J3n9Lk4M7J18o5j20
$$ 120 134 178 65 127 153 62 177 227 153 202 133 29 169 265 184 218 377 290 146 121 84 118 159 172 113 116 92 139 257 192 72
4645G2N8J9j4rK6qK4P6j67J8Q7n2n5NJ52OJ9k5k0j63L5J06k6q2O1l8Q1j1j1r1n5O8O6P8J23
$$ 72 130 149 135 126 152 144 168 244 77 95 182 130 75 80 232 238 257 232 212 49 84 190 164 82 143 105 186 175 164 73 18 86 152 230 353
4234C53j90j26J7k7Q3l9N9j4l1l1N8R9j04K9r3J43l3M0K5j91R3J0R1j6q9p1N3LJ03j9j35M4
$$ 353 163 37 54 27 110 71 130 116 85 54 112 211 107 136 43 186 153 193 218 27 120 130 221 205 116 45 98 101 204 185 50 94
3859I4M4L0r6Q2K7j52J91p5q6l9J90r0M9Q3j67j8J09j64O2M1M4L1j35l5R9K8q7O8nM3M9j33
$$ 94 138 168 72 154 181 29 220 145 59 20 210 120 169 252 85 67 176 12 74 115 159 190 55 20 119 147 60 128 123 166 215 82
3483H2KN1o2n7P7m6J67N8L5q4j35Rl3j1nR2K7o7j5l5K1R7p8l5J4pj7P8jP0r1R8n9j24L8J38
$$ 82 84 135 73 16 93 47 214 272 307 223 88 97 64 53 48 140 167 100 85 50 71 168 90 55 69 62 45 123 122 192 101 199 140 16 54 192
3060A92Nj69P1jL3JP6J35j29m0j6J039J58j058oj58P5K3k11O7O0l0J5n9j0N4l3j3kK49K62
$$ 192 197 28 99 98 131 132 208 343 214 174 158 1197 1355 297 291 133 208 231 20 87 147 117 132 73 63 117 84 71 69 318 580
2697E80m75N1o6M1r6N4K5NL4K7r1j0j5Q9Qr6J8MJ48L9k36J26n7K2J36r1j52N8M5k1J00q1P0
$$ 580 105 156 90 131 35 89 114 119 153 180 89 79 64 153 161 65 83 87 235 274 38 164 107 129 265 174 22 80 125 104 204 123 193
2309A93om6r5K8N5j3K2J42j80J12o1m2j9o1L6J61r4k3Q7r4m1M7M7q3L2q4R7J8o7L3rj5R3J54
$$ 193 187 141 46 74 129 116 138 280 100 212 151 109 90 29 65 226 132 109 196 102 61 108 155 72 104 20 117 135 68 101 92 77 170 324
1910C24k05m7O2n7J6k3k9J54L4N8j75Q8k3j03M5P4q2J0r1N0J12K05k09p7MK42j10p0J42j03
$$ 324 119 72 134 77 93 70 41 195 229 287 112 200 177 74 119 193 111 121 30 80 192 397 188 111 115 357 247 177 319 216
1558B16j01qL0J7K71J015J020j421p14j47p3j8J21j29J02P1P8J374P07j551o80N3o7l1O9J6
$$ 216 115 107 137 154 425 1440 2460 1039 325 178 105 87 208 79 181 252 330 1704 2411 860 180 233 166 135 204 220
1253B20n7j15J6J05J07m5j59J90q2r1N5J50n6l3k1m4m4qJ51p7N2k02J47Q4p6K3l2J3O4j67
$$ 220 163 48 64 169 276 231 72 262 180 89 144 294 238 205 184 140 96 88 239 162 214 12 159 243 167 190 158 171 235 68
901F8jj9KJ3k8M8Q6L16j71j74r5LP2J59%j19l1Q3j17R0j01R6r7l2Q7j3l7L3Lm4L1%M3o4n4
$$ 68 67 48 50 63 35 83 169 485 314 140 45 48 120 279 279 160 129 212 95 185 84 180 83 51 138 125 88 121 124 80 111 111 154 90 36
490C6O4n2J2P4p2O1q3J13%n5m9Qk4J11%pJ1l5j3l1K6j3k9Q7K2j29L6J11o5mn5J32j22P1L2
$$ 36 100 48 60 134 62 123 40 153 153 98 49 57 33 144 144 137 148 113 100 69 95 82 53 140 162 33 69 180 115 111 56 188 66 137 169
79A69k2KL7p5q4P1qRn4j2M1R8N2o6n7m8L6P9j55J83j01l9l0
$$ 169 147 149 186 111 27 98 90 99 45 33 74 172 224 158 101 53 89 168 13 196 95 56 26
-191B6
##PAGE=	F1=8909.4
##FIRST=	25168.397401625570637,	5807.04592319999756,	0.1797024458646774292
##DATA TABLE=	(F2++(Y..Y)), PROFILE
5807G7o9J5O8k2O9kl7R0j35R7r9J9rP7rj2n2L0j7K7K2Jn9J5J25j23MJ5P0O7j92k6N7N3p3L9
$$ 77 8 23 91 69 138 136 99 189 54 151 52 71 62 139 130 118 66 96 79 106 128 129 70 85 210 87 91 106 176 243 51 25 82 135 62 101
5384A01J2qO0Q0q5j33J56J68j70LK5q3k7Q6L4N6l6n6j00P9K4j8M0l0j20NP9n6M8K0j40R7M2
$$ 101 113 105 165 245 160 27 183 351 181 184 209 126 99 185 219 275 239 183 83 162 186 168 208 178 58 63 142 86 134 154 14 111 153
4997A53J7j25J17M4j02P7K4l1J2j14n9J69Q7p2k6J90n3j52Np5ON8J1o1m4M3L9J05n4j30Q3
$$ 153 170 45 162 206 104 181 205 174 186 72 13 182 269 197 171 361 308 156 161 86 92 150 161 100 56 99 138 243 189 59 142
4633A42J8j6J8j5k9N0P3j42J5R4o4m4l7J87J1mn6Pj70L3Q7o4m1Q2k0N6m3j4r5O6PJ15Q0P4
$$ 142 160 144 162 147 118 168 241 99 114 208 144 100 63 250 261 257 201 208 38 71 158 94 53 135 115 171 128 114 19 85 92 207 287 361
4234C61k38o8J8j6N7j3K0ql5l8J10P5j23Lk3J00J3k3K6j64L0PJ03J4o8m7K3N2P7p1p7MM9L2
$$ 361 123 55 73 57 114 101 121 113 78 40 150 225 102 105 82 182 195 172 198 34 64 71 174 188 120 73 96 148 225 154 77 81 130 162
3835A62j07J06O6j75K03j11n5n7J91k8J4N0j68k4J25j53L8J8J9M9j08JJ2R0r5K8k0J46%j28
$$ 162 55 161 227 52 255 144 89 32 223 195 209 259 91 67 192 39 77 95 114 163 55 56 68 158 63 91 71 217 217 89
3483H9K7M5o2n6O5q8J24J41N6j10j52J8jp2K1O9R3k2j07l2K9P8p1k6L2%m6Q6j6N8j28M6Qj6
$$ 89 116 161 99 43 108 20 144 285 341 231 79 97 96 24 45 114 207 185 78 46 75 153 82 56 88 88 42 128 112 170 42 88 96 80
3084H0KJ41l5j76R9j4M0nQ1J47j61op3J142L83j093l13r6Onj09N4L7Qk7k4K8P3j28O0n2K25
$$ 80 82 223 188 12 111 97 137 132 213 360 199 193 120 1262 1645 552 239 143 149 144 35 89 126 134 107 83 111 184 56 116 64 289
2708B89K41m63R6o4k1j3L1L9J0K3Oj25M3m3J27J7j36M2o6J86K3k07J28m1LR7q3r6J7J5N1O0
$$ 289 530 67 163 99 78 65 96 135 145 168 174 49 92 49 176 193 57 99 33 219 242 35 163 122 125 222 139 43 60 75 126 186
2333A86j6O1K8m9j44k5R1o6O4J58j98L01k28m9j6m4L4J25r8K6J08j37o3k7J17m3k4l2R2nm0
$$ 186 170 231 259 210 66 41 132 66 130 288 90 391 163 114 98 54 88 213 115 141 249 112 49 22 139 96 72 40 132 127 87
1969H7k4P0p8J29J31j93l3N3p2Kll1J22Q3M4j86R3m3q5jO3k8M0q9N7J35J64k17o6k4K02p3
$$ 87 63 133 55 184 315 122 89 142 70 72 69 38 160 243 287 101 194 151 66 65 128 100 140 51 108 243 407 190 124 100 302 229
1593B29o2J42j09q6k0P3j7K18Q86R84j199p34p8j52M7O1j19J73M2l8P84M87r52m42K46lj78
$$ 229 167 309 200 114 94 167 150 368 1254 2238 1039 305 227 75 122 183 64 237 279 241 1025 1512 560 118 364 361 183
1276A83k7N8m9r1k9R1J18k2j48J67p8n7rK02l9n3n7o4m5O2J19o8L7j95J61O9o3jJ2jN1j33
$$ 183 156 214 165 74 45 136 254 232 84 251 173 116 107 309 270 217 160 96 51 113 232 164 201 6 167 236 173 172 184 183 234 101
901A01J7ql9Nn7J9J97K33k42j41n1M2L6J72J0j12l0J07j49J10j05Q0j31ON7Pj0qL8r5N0j9
$$ 101 118 110 71 76 19 38 235 468 226 85 34 76 112 284 294 182 152 259 110 220 115 195 64 70 127 134 124 116 154 59 109 90
525I0Lj4m4O7r4K6J06r6P6o8J54n6o7j7J6j2Q3J1k2Kl0Jk5K4j3o2N2K1j00Q7O9l1j5o1J01
$$ 90 93 79 35 102 8 34 140 44 120 52 206 150 83 66 82 70 153 164 142 144 114 115 90 114 101 39 91 112 12 99 168 137 122 61 162
114A62p7n4M9L9L8L6q7n4L6k5K8l5n5O4N3J06l4q5o3P0L3j31J92j04m3m
$$ 162 85 31 80 119 157 193 106 52 88 63 91 56 1 65 118 224 190 105 42 112 145 14 206 102 59 55
-191E5
##PAGE=	F1=8807.14
##FIRST=	25168.397401625570637,	5807.04592319999756,	0.25183129310607910156
##DATA TABLE=	(F2++(Y..Y)), PROFILE
5807H8p8K3K4OJ6M5m4J05j39J02j05Q5j18J10J1K2j25K2P7k8j1jm0L7J19j55nJ04mP2j90L0
$$ 88 10 33 57 63 79 124 80 185 46 148 43 128 10 120 131 153 28 50 127 99 88 87 47 84 203 48 43 147 143 215 25 55
5431E5j9Q0p7P1j4j0J01P5j38n9J68J27j48ml6l3k8Q9N9K7%n5j51M3L8j5N1j1j27k2Q6p5Q2
$$ 55 36 116 39 110 96 86 187 262 124 65 233 360 212 208 172 139 111 200 259 286 286 231 80 123 161 146 197 186 59 37 123 48 130
5044A30jj10Q0O4Mj27J50O1j06L7MQk5j36K9J22J03q9o7J74j3j45M1p2n5P0%m1p0P2M9Q3n5
$$ 130 129 19 99 163 167 40 190 251 145 182 186 194 169 33 62 184 287 198 131 305 292 147 188 116 61 131 131 90 20 92 141 224 169
4657A69r0O7QqM9l3o8Q6N9j28J7J02q0l8n5J94Mj7p7K9j43J8P2j08oR2rM3m5k4%N0l5J53P6
$$ 169 79 146 154 146 195 162 94 180 239 111 128 230 150 112 57 251 255 238 161 190 47 65 137 29 23 115 106 149 104 80 80 130 95 248 324
4246C24J7k61jjJL3J3Lmo0N3Q4L6j26m5M1M7M8q1M5r4l0k4R2M0j4k5j1R2L4j12nm2N7M5j47
$$ 324 341 80 79 78 79 112 125 128 124 64 117 201 237 111 66 107 154 202 121 166 72 42 18 110 150 136 111 100 192 226 114 109 67 124 169 22
3823B2J32Q9j83K03j31l0k1J37K5k1J9j42m0J13j04ljNO7r3P3q3J59n0q9l1K30l6j21N6K8
$$ 22 154 243 60 263 132 102 81 218 243 222 241 99 59 172 68 65 64 69 136 43 116 33 192 142 53 22 252 216 95 151 179
3460A79o5m6M4r1J13J59O1j28j46K0M0j18kN9J54L0j83m1L0N8n1j3M6mn1R6n0N1j04k9L9O6
$$ 179 114 68 112 21 134 293 354 226 80 100 140 22 20 79 233 263 80 39 69 127 76 63 109 105 54 150 100 151 47 18 57 123
3084A23J3J21r4j35J30o0L0QM7J74j98j1p8M88L16m83k65m6j2L3l7k4P2ll4J2Q0L9j92J20
$$ 123 136 257 163 28 158 98 128 136 183 357 159 148 70 558 874 391 126 80 68 101 64 40 112 109 75 87 167 206 14 134
2732A34r4Q5J41j77O8l7q6N8J3O3Pkl4j26J09m1J21J3j36O5r3J36Nj28Q9k7nN7p3n0j8j5J27
$$ 134 40 125 266 89 157 120 34 92 105 168 175 173 139 13 122 81 202 215 79 144 51 187 192 64 153 126 121 178 105 55 37 22 149
2344A49K4K5N5O8m9j55m4N4r1Q6J61j56L15k81n6j4j2K3Q9q6P1J08j72p0J4L7j8k0jQ2k8j
$$ 149 173 198 253 321 272 117 73 127 36 122 283 127 442 161 105 91 79 102 191 105 176 284 112 42 56 93 75 55 54 136 108 107
1969A07n3J07j11J17R6j55kK0m0qj1l6P5J29K2j80R9n7p6k2P0J0P6k0k2J79P8k03n6n3J17
$$ 107 54 161 50 167 263 108 106 126 86 78 67 31 106 235 257 77 176 119 43 21 91 101 177 157 135 314 392 189 133 80 197
1605A97%l2Q6o8o5o9J15n9J6J23L61j95k78J04j38J5N7r0J87N2j89N42K58o40j75K34nj30
$$ 197 197 165 251 183 118 49 164 105 121 244 605 410 132 236 98 113 170 80 267 319 130 672 930 290 115 349 344 214
1276B14q6N5l8m3n9P0J18pj38J21o1rn0K36l4p4q6q9k9R9R3m2J8j54J53L1m3j5L9J2K2q4J7
$$ 214 128 183 145 102 43 113 231 224 86 207 146 137 87 323 289 215 129 40 11 110 203 161 179 25 178 209 166 151 190 202 224 140 157
889A57K6n1l8m2l9K19R0k51j7k4P7j7J89K0j04k3J07j53J00j01N7j62M3L9K7Nl6N5j10O1k
$$ 157 183 132 94 52 13 232 322 71 54 30 107 90 279 299 195 172 279 126 226 125 182 20 63 102 129 134 98 153 43 104 102
525A02m7J8l2O4o0k9J22r5O7n2J74r1o2oL7JN2J1l3kj7Lk1J6k3m2j6K3l7Q8L1kk9n6O3l2k9
$$ 102 55 73 41 105 45 16 138 43 110 58 232 141 79 73 110 111 163 174 141 139 122 125 104 120 97 55 39 62 25 113 144 142 113 57 120 88 59
91E9l5N8Q2J1o0l8J1o4N4J8n3K6j1J47Kr9m5O1j0p6J66r0o5M2
$$ 59 24 82 164 175 115 77 88 24 78 96 43 69 58 205 207 108 63 124 114 38 204 114 49 91
-191I1
##PAGE=	F1=8704.88
##FIRST=	25168.397401625570637,	5807.04592319999756,	0.25765833258628845215
##DATA TABLE=	(F2++(Y..Y)), PROFILE
5807I7p7L0k6M3l3Q6l2R8j47J09j22J31j17P0K0N3j18L5P3p8o0j2L4L3R2j66N5J05q0P0j42
$$ 97 20 50 24 67 34 120 88 186 39 148 26 157 40 110 130 183 65 100 173 95 35 23 57 90 182 16 71 176 96 166 24
5443B4O5o9P3m7P6l1j5J25N8j85L1J59Q2j05k7q9K6j8Q1Q1nK4n1j93pO2j7P4qj03n9R0r4J13
$$ 24 89 20 93 46 122 91 76 201 259 74 105 264 346 241 214 125 151 133 214 295 290 314 263 70 63 125 108 182 174 71 12 102 8 121
5044A21k5n7M6Q0Kj12J46P5r6Kj2L7n1j08O4O6J39j37m4R0K1j27P5m9j14O7j2PMk7P5O1o6
$$ 121 96 39 85 165 167 55 201 276 180 182 170 207 156 48 112 178 317 180 136 226 247 120 195 146 32 99 87 94 98 71 146 207 141
4657A41k2K3mNP7l2p9Q9L5j25K4J09r5l4n0J73j4k2q1M6j06J4O6j01K6K5kM2jm5N1J3n7J68
$$ 141 119 142 138 143 220 188 109 198 233 108 132 241 146 112 62 235 221 199 118 164 58 72 138 37 63 88 86 128 127 82 133 146 89 257
4258B57P3l2k15K3l2J9J2M1Qor6J18O8Oj15r4P9lN9j14P6k9l2l8M7J7O5j9l5J01pj27O6q6
$$ 257 330 298 83 106 74 93 105 146 154 148 52 170 238 244 129 35 114 111 170 56 132 103 71 33 80 97 162 143 108 209 202 75 141 55
3859E5O4O5j54J01Q8j68J93j30k1K5Q5N8n4kr7p1Q8k9n4lK2M9r9J41j18J99j4j96pK46n5j11
$$ 55 119 184 30 131 219 51 244 114 93 118 203 261 207 205 108 37 125 96 42 39 61 110 11 152 34 233 219 23 16 262 207 96
3483I6Q7Pp2l4K2q1J50J15M6j28j22KQ3j34j2K2J97P5k26o7K4M1k2MO1k0n9J27r8O7p6Ro3
$$ 96 183 190 118 84 106 25 175 290 336 208 86 88 171 37 25 47 244 319 93 26 50 91 69 73 134 114 55 182 84 151 75 84 21
3096B1J16J6J20j51r7J75j07J4K7NK00k20j4J07M08K3m83j10j2j2J32o1MJ4o4lM9J16k7j53
$$ 21 137 153 273 122 25 200 93 107 134 139 339 119 105 212 620 643 160 50 38 26 158 97 101 115 51 48 97 213 186 33
2744C3R2j18R8O4Q1j11Qj18P7QQ7Nm2p8j9P8pQ7pr8P0r7N5j2k4L4k7KK2o8k2j8K1J07NL9N0
$$ 33 125 7 105 169 250 139 147 29 106 114 201 206 164 86 67 145 138 225 218 120 190 93 148 136 112 146 119 121 143 75 53 35 56 163 168 207 257
2309B57J08m8j61k1j7r5P4J70j70K06j89k4qJ8J0O4n5Q8R1j78r5J23M2j45J8rO6l3M0l1P2
$$ 257 365 317 156 135 118 23 97 267 97 303 114 90 82 100 110 174 119 207 298 120 25 148 190 45 63 54 120 87 127 96 168
1945A68j18P0O6r6M5k3J1qn0j8MJ62jj62J02o5j1m9J13pQ9K1q6K33k8j63o0p8J8P6L9k1Rk7
$$ 168 50 120 186 90 135 112 123 115 65 47 51 213 212 50 152 87 76 27 140 133 222 243 157 390 362 199 139 61 79 155 194 173 182 155
1546A55j24J28L1N4R06N63j125m60R6p2o6P7m8J69O3l27J263L75j231k32J08j03L0q7j1k4
$$ 155 31 159 190 244 1150 1713 588 128 224 152 86 163 115 284 347 20 1283 1658 427 195 303 200 230 143 132 108
1241A08K4p9P2P6J0j22N4l8K9%K10n0r0r7n1K4QP3mNq6J17j8k5l0N2N3j2m1MP2n0r5k9l1J43
$$ 108 132 53 125 201 211 89 143 105 134 134 344 294 204 107 56 80 88 161 157 162 76 193 175 150 120 172 225 213 172 176 248 198 103 74 43 186
819A86n6k8l0k8R2p6K02K9j00j1Q4j17N2q3L3j12OK9M5J0n6N0q4O1K9l1k0l0O2k4o9J04l4
$$ 186 130 102 72 44 136 60 262 291 191 180 264 147 199 116 149 37 43 72 117 127 71 121 37 98 127 96 76 46 108 84 15 119 85
431H5J1l4J72j00m4j4N7J5K3%m1KKkk7Jm0J5k0j2QN5QJ7l8n1M4kL1k3m6J19l3k4k6nm7O6M5
$$ 85 96 62 234 134 90 76 133 148 171 171 130 132 134 132 105 106 66 81 61 49 57 112 120 137 99 48 92 90 121 98 52 171 138 114 88 83 36 102 147
-27A47o0pm8J30M2r4l2M6n3qJ24o8q4Q3
$$ 147 87 80 32 162 204 110 78 124 71 63 187 119 35 118
-191A18
##PAGE=	F1=8602.63
##FIRST=	25168.397401625570637,	5807.04592319999756,	0.29164040088653564453
##DATA TABLE=	(F2++(Y..Y)), PROFILE
5807A05p5L9qMj7P3LO0j52J16j28J34q8M6J3Q1q8N3L4j09m7J2L2nO1p0M1O5j36O2p0P4o2J5
$$ 105 30 69 61 65 48 121 124 184 32 148 20 154 66 112 125 206 118 171 205 96 49 61 93 88 149 79 120 185 49 111 41 115 53 68
5408F8j4P8l5j2J23L2k05J06J34L4m7o2j16P0j2P5J06l1K5m6k12l4N3j5J04j9p0o1O8o2Q9
$$ 68 54 132 97 85 208 240 35 141 275 309 262 200 84 154 142 217 323 292 317 271 59 25 78 63 167 148 78 17 85 23 112
5044A12l2j1LR1Pr6J15Q1p0j5k8M9n9q7R0J6J74k02L0j4L1j08J03j7j50M4k1P2N6j07Q5N1
$$ 112 80 69 72 163 170 74 189 270 200 185 157 206 147 60 150 166 340 138 168 154 185 77 180 163 13 57 36 108 164 57 142 193
4669A93p9L5k0qJ6R6k2o5O9Lj26L3J09j03l1k7J33m2k0o6O0q1K5P3p4N1o4nN2N0o6O1l0n4
$$ 193 114 149 129 121 137 233 211 146 215 218 92 125 234 131 100 73 206 164 144 78 138 57 82 155 81 132 68 63 115 165 99 160 130 76
4269G6J47Q1o3j12jn9L1qP1K3j1j23J56M0nr6j13P3l2M0q8P6K2k5l4N9n9J27l2l9O8l0j09
$$ 76 223 304 241 129 128 69 100 92 163 186 175 52 208 248 243 147 34 107 75 115 27 103 125 100 66 125 66 193 161 122 190 160 51
3882E1J17j18O1Q6j18J2O6j14J63j10l3Q0M3O8q2pn6j04P2M5q7MM9nm2J21j19K15J6k70J4
$$ 51 168 50 111 197 79 91 157 43 206 96 63 143 186 254 172 165 109 5 77 122 35 39 88 83 41 162 43 258 274 4 18
3518A8K30o6q9J08j0p8k2Kp1J95N4J3j03q6l6J27j35L0l3J96R7k33r2J0K3J0K6P9m7p7J62
$$ 18 248 182 93 201 191 113 91 93 22 217 271 284 181 95 59 186 51 81 48 244 341 108 16 26 49 59 85 164 117 40 202
3154B02j34R2q2K7q3J08kJ26j80o3K01j29PL0k3K11j93NK15J239M54j294n98K6q5J00rRl9
$$ 202 68 160 78 105 22 130 128 254 74 11 212 83 90 120 97 308 115 120 335 1574 2028 734 136 162 77 177 168 177 138
2814A38j02lR0J09r6o5L1q7K53J38o1k23M8j39Q0J0R9J0q3q9O1K9M5M3l8m3P0j14%k0O6lm5
$$ 138 36 33 123 232 136 71 102 15 268 406 345 122 170 31 111 121 220 230 147 58 119 148 193 236 198 155 225 111 111 91 157 154 109
2427A09K1np0qK9M2M2NL8M4J34m5j56Mo5r2K7J85Nj12o7K4mL6kN4j8P7O2j45j18K59J16k95
$$ 109 130 125 55 47 76 118 160 165 203 247 381 336 180 184 119 27 54 239 244 132 65 89 85 121 119 173 155 232 294 149 31 290 406 111
2028A11k3l6K4MO5nJ8j13RN4k3R8m3K1nj04K8m9J56j3j31Q6o9Q4j06J80k4M0J9n9K45j16j13
$$ 111 88 52 76 80 145 140 158 45 54 108 85 183 140 161 156 52 80 31 187 174 43 129 60 144 38 218 194 234 253 194 439 323 210
1640B10p0r2M8J8J14j20Q4qj28J11J22K42J604J251k099r67j18k5q9N2QJ38P4k66J830N78
$$ 210 140 48 96 114 228 108 192 184 56 167 289 531 2135 3386 1287 320 202 177 88 140 148 286 360 94 1924 2502
1335B502j824l96R5k75J26n4j07J0Q2r3R3nM0r0j9j2L1J13J55q4r8r1ML3p5O2L0Jk0P7o3J
$$ 2502 678 282 377 102 228 174 67 77 159 66 159 154 194 104 85 73 104 217 372 288 190 99 103 136 61 123 153 154 134 211 148 149
959A49n6M3J04l8j8oJ14m4j53rk7P9n2J45j31l7R7j21J95L1j00NM7m7k9n2K2k4k5j1N3J0p0
$$ 149 93 136 240 202 184 178 292 248 95 86 59 138 86 231 100 63 160 39 234 265 165 170 217 170 141 89 111 87 62 51 104 114 44
572D4L4m0N2N5Ko6l6O7Pq7N3O3o6j5J50q3k8k6O3K9Kj5n0J3K0pm2k5n3Q0Pk8OL2j3L7l7m7
$$ 44 78 38 90 145 147 81 45 112 119 32 85 148 82 67 217 134 106 80 143 172 174 159 109 122 142 135 93 68 15 95 102 74 80 112 99 136 99 52
126E2O2LL3J5j13J26q7Lj1j6NP6M4o7l3rK1Q1p8l2L8r0O4O9m7o7R3
$$ 52 114 117 150 165 52 178 91 94 83 67 72 148 192 125 92 83 104 185 107 75 113 23 87 156 109 42 135
-191A35
##PAGE=	F1=8500.37
##FIRST=	25168.397401625570637,	5807.04592319999756,	0.31233769655227661133
##DATA TABLE=	(F2++(Y..Y)), PROFILE
5807A10p0M2K7n9K7M4M4Pj43J16q8O7n0M1kJ07n7O4oj18kM7oo6L3L7J0J6j42M1j8P1m6l7J
$$ 110 40 82 109 50 77 121 165 172 29 145 57 124 74 115 113 220 163 227 221 103 101 148 142 76 109 146 156 172 30 71 53 124 78 41 42
5396D2R6k9KR9Jj53J09J03j3J3j02j07Q0j1P6J31m2ml8j93L4m6k8J32l8m0m4N4m6P2j7Ol4
$$ 42 138 109 111 210 211 58 167 270 257 270 168 61 141 130 206 337 295 291 253 60 94 48 20 152 114 74 30 84 38 110 93 99 65
5009F5R4J5q5O4P7k6j3l7L6m8q1J12k6J84k50J06n9or4J20J7j58NLJ07Q4j22L7O0q5O2m7j
$$ 65 159 174 89 153 230 204 191 154 190 142 61 173 147 331 81 187 128 122 28 148 165 7 12 15 122 206 84 121 181 96 158 111 110
4622A10K0J02rn1M6k5j25M3R4r8k8QQ3o7k1l7P0p1M3Q5o3Q8j29k4O8P7q7N6p0k8Q8J03o8j6
$$ 110 130 232 223 172 218 193 68 111 205 107 79 87 170 103 82 45 115 44 87 172 109 197 68 44 112 189 102 158 88 60 148 251 183 167
4222A67k7p7M6l1R5L8j5j25J74j7Ko9j13M9k5Nj5L0N0k8k6Q7n3J05o7j7kk4p1J42j34M9R8
$$ 167 140 63 109 78 173 211 196 71 245 228 230 161 48 97 72 77 62 92 142 114 88 175 122 227 160 143 141 117 46 188 54 103 201
3835B01q1q0L1nJ02q1n9J30J0O0q9nl9o9N4O0p3k1O2n1N1M5j12K11M6k62k5K01p0n2J08j6
$$ 201 120 40 71 66 168 87 28 158 168 228 139 134 95 26 80 140 67 46 108 57 108 153 41 252 298 36 11 212 142 90 198 182
3460A82p5j9j2o1K22Ml4n3m2r1J68j31P6m7J51Q7k08q9JoK2N7R1p3j08J83j38R5r6K1j4P4
$$ 182 107 88 76 15 237 241 207 154 112 21 189 58 134 87 238 325 117 28 29 23 45 102 193 120 12 195 57 152 56 77 63 137
3084A37o8J26j71j2J72j08M3oo3K10j17k5K02J274O66j301p97Q2j44L6J24q1jj09j5J02N5
$$ 137 69 195 24 12 184 76 119 113 50 260 143 118 320 1594 2260 959 162 244 100 136 260 179 178 69 54 156 211
2767B11j34K5k1l7K08R8o7j63N5j38Q2J0Q5K8j16k2M8k0J00%p2J1O7j36j7j0J07oo0L4k3p9
$$ 211 77 102 81 44 252 350 283 120 175 37 119 129 214 242 126 104 152 132 232 232 160 171 238 102 85 75 182 176 116 150 127 48
2391D8JP8M7l7K0L4L9J36l9j40J5p2n7o5J91K51r3k46joL5j0M8K3M8K8j04r5L12J62l80n0
$$ 48 49 127 174 137 157 191 230 366 327 187 202 130 73 8 199 450 357 111 110 104 139 129 177 200 248 276 172 77 389 551 171 121
2016A21j9m2K8O5J4k5j03j9L2N0J37l9j2mj51Q5p3J22j4q9N4o3J48j76K57j7r5J8J05J40j59
$$ 121 102 60 88 153 167 142 39 20 52 102 239 200 188 184 33 118 45 167 153 64 118 55 203 27 284 267 172 190 295 435 276
1652B76p8n8p2R0m3J09j72J31k3j26J29J30K84J400J186j996q46j95Ql1k3Q1R8J06j81K072
$$ 276 198 140 68 158 115 224 52 183 160 34 163 293 577 1977 3163 1167 321 126 134 103 80 161 259 365 184 2256
1347B256O50k110m68J50k90J7k5j69O8R4q9R8r7Q2m3l2k2rK30J01j17j00p3J8M4j16N2M4N
$$ 2256 2906 796 328 478 188 205 180 11 79 173 84 182 85 167 124 92 70 61 291 392 275 175 102 120 164 48 100 144 149
1006A49L6M3r3N4p5k3J43m5k1jJ39l7j99J6l1O1J1J54j59m8J03j19J41K4j05K7ML9j26j4M0
$$ 149 185 228 135 189 114 91 234 189 168 167 306 269 70 86 55 116 127 281 122 74 177 58 199 223 118 145 149 188 62 48 88
643H8K5jn8L6J2o3L7k8K9Q2J8r6m1R3J8r3NJ50j39mJ18n1k1l1N1M3j0k7n5K2K9mo1n9L2M3
$$ 88 113 112 54 90 102 39 76 48 77 159 177 81 40 133 151 58 63 213 74 70 188 137 116 85 136 179 169 142 87 109 138 134 73 14 46 89
220H9K7k4qM7n7P6l9l5Q2Mj1O1j46J16j35OK1k9M3R4L8p2m2K5m1O3n8l4L8o0O7Nl1k7Q5
$$ 89 116 92 84 131 74 150 111 76 158 162 151 212 66 182 47 53 74 45 88 182 220 148 106 131 90 153 95 61 99 39 106 111 80 53 138
-191A38
##PAGE=	F1=8398.11
##FIRST=	25168.397401625570637,	5807.04592319999756,	0.19663645327091217041
##DATA TABLE=	(F2++(Y..Y)), PROFILE
5807A12o1L3O1j23P3K3Q1m8j18J05l3k9qM0k0J35l1O9m2j04K2Q8k9j42K3J25k6l4r7K2j2N9
$$ 112 51 84 145 22 95 118 199 151 33 138 105 76 68 108 88 223 192 261 219 115 137 225 196 54 77 202 176 142 45 67 55 114
5431A14k5o0j6J24j4K1O1k9q6Q7P3n1N9j35o3N7j9R6J40l8n3l0j27P2q2o0J17n6j5l1O8n8
$$ 114 89 29 13 137 123 144 205 176 90 177 250 199 258 123 60 117 98 194 334 296 243 213 86 158 76 16 133 77 62 31 99 41
5056D1P3lRn3Q7K3p9MO0K8J1l7Ol1o6J10n7J53k15J19l7n7n2Q9L5j37J0J7Q3Q7r0m8Q6p8O1
$$ 41 114 111 120 67 154 177 98 102 162 190 201 164 170 139 73 183 126 279 64 183 146 89 37 126 161 24 34 51 134 221 131 83 169 91 152
4645A52n4OJ8R3J1n7L0l8j19N3O1p9k4M6L7n3n5OO5o6N5R5n8J15j62n3Q9P3j09N3j02J6PJ32
$$ 152 98 104 122 215 226 169 199 161 42 95 156 77 53 99 136 83 28 34 99 33 88 183 125 240 78 25 114 187 78 131 29 45 52 184
4246A84n4M9l7r0P3n5J05M8j7j07J91r7J2l5j15L9oJ4k8L8M4m4j5J04PN7j24K7q1Qn2J60j39
$$ 184 130 179 142 52 125 70 175 223 206 99 290 193 205 170 55 94 88 102 74 112 156 112 97 201 208 265 141 168 87 95 43 203 64
3859F4L2R3m7j21JP5N4n7m0J11k5N3o3j2n5j3O4L3m6o2P2m5J13m1j11J86P9k11j8R9p4J6O7
$$ 64 96 189 142 21 22 97 151 94 54 165 140 193 130 118 63 50 114 147 101 39 111 66 179 138 27 213 292 81 63 162 88 104 171
3471A71ln5m0j8m6K20j4r8J5Mj12J58j25J16m1R7M7j61o8Moj8R6R4r4j03J36j07P0r9kQ3Q4
$$ 171 168 113 73 55 9 229 215 117 132 136 24 182 57 173 132 229 276 115 47 51 45 27 123 217 123 20 156 49 119 20 18 101 185
3084A85j76R5o3j2R7m3J28m4r0J16k3N5r2K67M06k73m28J56j42K8J74j90R4j61L8P9k5j26
$$ 185 9 104 41 29 126 83 211 167 77 193 170 225 133 400 806 533 105 261 119 147 321 131 225 64 102 181 156 30
2755C0J13p1O4N0j16j3P7K4p0N4%L6O2j38O6qn7J47l8r8N0O5j58lOJ05J8m8L0l1q7%J13M1
$$ 30 143 72 136 186 70 57 134 158 88 142 142 178 240 102 168 160 103 250 212 114 164 229 71 68 74 179 197 149 179 148 61 61 174 215
2356B15j14L4L4M1J20l9j12Rm7or2J08L81o1l48J2MJ5k0L8P4Pkq6m2K28J57l38j8N5l3p6M8
$$ 215 101 135 169 210 330 291 179 188 141 135 43 151 532 471 123 135 139 154 134 172 246 253 251 165 123 351 508 170 152 207 174 98 146
1969A46K9l6j03L8l4Q9J56l0n9mj12P7j08J07j5n2L2l3J46k25L21Kl17K99J60j10j23q7Rl3
$$ 146 175 139 36 74 40 129 285 255 196 192 80 157 49 156 141 89 121 88 234 9 330 332 15 314 474 364 241 154 163 130
1617A30K5K5j2j41J13po9J28J05L0J52J87n51k2k3L9N1j33J20O2J53j03J962N59k035m30J93
$$ 130 155 180 168 27 140 133 64 192 297 327 479 666 115 93 70 109 160 27 147 209 362 259 2221 2780 745 315 508
1300E08k66q0j7o7K2O4m9O5j59J05J1J3o5j5K61O0j33r7m1j5M7j00M6L2K6O1K3j06J28q8j23
$$ 508 242 162 145 78 100 164 115 180 21 126 137 150 85 70 331 391 258 161 120 105 152 52 98 130 156 217 240 134 262 174 51
936E1J53l5l8K1J40l4j98J5l8P2l1J74j16o3J14r3P2Kr6N4m9J19j62j8P4J6N0p5oJ2l7O7m4
$$ 51 204 169 131 152 292 258 60 75 37 109 78 252 136 73 187 94 166 168 72 126 77 196 34 16 90 106 156 81 75 87 50 117 73
549G3j8J25Mj13l2J42Nr9J2J68j93jP6j0k6j9J5N5j1l1m5J2K5J8o4j9N3l9M1j3k7R8j29J38
$$ 73 55 180 184 71 39 181 186 87 99 267 74 73 149 139 113 94 109 164 153 122 77 89 114 132 68 49 102 63 104 91 64 162 33 171
150A71m9j3Q3Po6J02j58J00j59NO2l6K9J07M0p2k3L3jm4l6k7L1KK9o1k2J2P9
$$ 171 122 109 192 199 133 235 77 177 18 23 85 49 78 185 225 153 130 163 162 118 82 55 86 88 117 56 34 46 125
-191A25
##PAGE=	F1=8295.85
##FIRST=	25168.397401625570637,	5807.04592319999756,	0.24119168519973754883
##DATA TABLE=	(F2++(Y..Y)), PROFILE
5807A11m3KR1j54R6RJ03q6q8Q5K3j24L3K6k6J57j1P4p6p9K6J32l4k26N4J63n5p1o2K9k0K3
$$ 111 68 70 161 7 103 112 215 129 41 126 149 25 58 84 58 215 204 278 202 123 149 281 247 21 75 238 183 112 50 79 59 82
5431H2Pl5k5J00OL7K2n5l5O1N1o9P9j52%K2l9J33J22k5j05k5l8Q2r0p7P0o1J2l1R8p8P0%J0
$$ 82 89 54 29 129 135 172 194 139 104 165 216 147 226 74 74 96 57 190 312 287 182 157 119 201 111 34 104 43 55 24 122 44 114 114 124
5021A24m8O7L7p3l8J2P8N4k6k4k8l1Q5q1Q0o2N1j2o1k4N8K6j18K5MP1O7m1j25J06n7M9m8k
$$ 124 76 143 180 107 69 81 159 213 187 163 135 104 189 108 188 126 177 165 104 80 138 164 46 71 75 146 213 172 47 153 96 145 97 95
4622I5J7P1M8r1J6l3r2N1J2m6j8P7NJ2p8lM2l9L8J00m8J16j72p5J11M2j25N8m2j7M3M4l3P5
$$ 95 112 183 231 140 156 123 31 82 94 48 30 107 112 124 46 43 85 46 84 184 136 252 80 5 116 158 33 91 49 32 75 119 86 161
4222A61k0j06J10o7R2M6j6p7K11j63nRj23M9oM5p8R7J0p2nJ12Q5J3j90Q2q9kp0J84j36PP1
$$ 161 141 35 145 78 170 216 200 123 334 171 166 175 52 101 95 140 62 159 169 97 92 204 289 302 112 194 105 103 33 217 81 88 159
3835A59j9o5K5QM3l1j5O0p2O0ll9r4M6P1Mk0r9P9J7J28j14j23J43J12j34oj6p7J13j7L9k5
$$ 159 140 75 100 108 151 120 105 165 93 153 150 111 17 63 134 138 118 19 98 115 243 129 6 149 261 127 121 105 28 141 124 163 138
3448A38r0j8j8J86J0j57O8M2j01J03j13J37k0M9rj04l9Lkn6J31Q8j04p8M6m9K3m4M6N8J21
$$ 138 48 30 12 198 208 51 119 161 60 163 50 187 167 216 207 103 64 67 65 9 140 228 124 46 92 43 66 22 68 126 247
3084B47j88m3P8n0J4N1K20m8q8o5N9K66k72J555J99j446m31J83p1N4Q1r2M4j52N1K3r1p2J87
$$ 247 59 16 94 44 58 109 329 281 193 128 187 453 181 1736 1935 489 58 241 170 224 305 213 257 105 156 179 88 16 203
2744B03j31J92K50J73m08j23l1L1K5j9l9J00j51J50p6o3J68p4j01O5O2j61J0J9Q0N3j3K0l4
$$ 203 72 264 514 687 279 156 125 156 181 162 123 223 72 222 146 83 251 177 76 141 203 42 52 71 151 204 191 211 177
2403A77r0k1J40L1j73L4L6N0J01n0p7j0qM9j22L5L05p7k50P8K3j7l5K9J29l6k3r1J6j3J01
$$ 177 87 66 206 237 64 98 134 184 285 235 158 148 140 189 67 102 407 330 80 158 181 164 129 158 287 251 228 137 153 140 241
2039B41j34O4J65k1k16K5M5j3j20P1n5R8J56k0j03kj9K8j29Q8k0k5L5kR7j67K90K0j48M48
$$ 241 107 171 336 315 99 124 169 156 36 107 52 150 306 286 183 181 162 190 61 149 129 104 139 137 234 67 357 377 229 677
1687F77J6m50J6j70J25j0j07J61j34J1l4J39o7J34J74k09J570J300j485j336m7oL8j42l8N7
$$ 677 693 243 259 89 214 204 97 258 124 135 101 240 173 307 481 272 1842 3142 1657 321 274 268 306 164 126 183
1382A83J56k3J558L54j664l10K04k28j24k8N3j7K2J7jn2k4O1P0j11K8K07L4j28q8Qn7Lm7N8
$$ 183 339 316 1874 2228 564 254 458 230 106 78 131 114 136 153 152 100 76 137 207 96 124 331 365 237 149 157 100 103 56 114
1030A14jP9L9Or8K01j08j79J02j5m0L8J20l0j31m0l7Q3j6Q3k3p5J21o4J5l8k3M9j02J58p0
$$ 114 113 192 231 237 139 340 232 53 155 140 100 138 258 228 97 57 20 103 87 170 147 72 193 129 144 106 83 132 30 188 118
666A18m6L7l2J06o8n3Pj8J03m8o9J72l6j09j0J88k1j12M3J50k21%K6K3l1J3m1N7%k6k0j4J
$$ 118 72 109 77 183 115 62 69 51 154 106 37 209 173 64 54 242 221 109 152 302 81 81 107 130 99 112 71 128 128 102 82 68 69
279F9O5l6LM0j09N1qm6J62j67J66o6J8O6Pj07J29j47P0j33M7N3m2k9J00M8o2K7QP2j55nk5
$$ 69 134 98 101 141 32 83 75 29 191 24 190 124 142 208 215 108 237 90 160 27 74 127 85 56 156 204 142 169 177 249 94 89 64
-109F4QN7qj11K3j2P6
$$ 64 72 129 121 10 33 21 97
-191I7
##PAGE=	F1=8193.59
##FIRST=	25168.397401625570637,	5807.04592319999756,	0.61081969738006591797
##DATA TABLE=	(F2++(Y..Y)), PROFILE
5807A04rn4J15j29P4%J09r4o5N9O9j61L7j0K4J33MQ5j15n5J6J75k8k64P9J49o8q0o0M6pm4
$$ 104 95 41 156 27 101 101 210 116 51 110 179 18 55 45 69 202 206 291 176 121 137 312 284 20 99 248 180 100 40 86 79 35
5431C5N2Kk0M7K5M9j7o9pL6M0n8O7j40N3no9J65Q5rj43k5M9P3r2r0L1n1M8l4J17p6K9%J5k5
$$ 35 87 89 69 116 141 190 173 104 97 133 173 115 182 42 95 90 21 186 271 262 119 94 143 216 124 34 65 14 62 28 145 69 98 98 113 88
5009H8L5O2o3j5q5R5R9nl5n0NO1r6k0J15Jk4l5k1O0Oj13L2j2P6L2kj18N8k6M5m8j9J5M2J07
$$ 88 123 185 122 107 22 117 216 211 176 126 131 192 96 76 191 192 168 133 112 172 178 65 97 85 161 193 191 73 131 105 150 102 83 98 140 247
4586B47j46jj9k9K5m5kRP1mO7q6l4J5kJ4R7l3Q5j62m8R9np0K4N3r6J30p4l0P0K0j26J44o2
$$ 247 101 100 81 52 77 32 30 39 110 106 173 87 53 68 66 80 177 144 229 67 19 118 113 43 67 120 24 154 80 50 120 140 14 158 96
4176I6O1L5j4m7K32j72p8O0j30P2k5O5r5J53l4r8jJ15J52j4k47J26l8n2j01K08j27l0M3N%
$$ 96 157 192 178 131 363 191 113 173 43 115 90 155 60 213 179 81 80 195 347 333 86 212 174 122 21 229 102 72 115 120 120
3812A20L6o6N8NlOj26Q3N7o7o3K9O2k1%r8O4R0J23j62j05O1J31n4Lj14k1J61j23J14qj12l1
$$ 120 156 90 148 153 150 156 30 113 170 103 40 69 131 110 110 12 76 166 289 127 22 83 214 160 163 49 28 189 66 180 172 60 29
3424B9MJ20O7j42L7O4r4M9q4J22MJ9n9n3pjoo6J39Q1j08n3l2J0j1K2P4J4J49k00k0O1p7m2
$$ 29 33 153 220 78 115 179 85 134 50 172 176 195 136 83 76 75 69 3 142 223 115 62 30 40 29 51 125 139 288 88 68 129 52 10
3025A0J33K89j4j10k07R8M27j82L075R82k897j472R4mk6JJ45r3k7j2o5j04JK18j90K93M52
$$ 10 143 432 418 308 101 199 626 444 3519 4501 1604 132 226 222 196 197 342 249 222 210 145 41 42 260 70 363 815
2708H15L29o34l36q3J22J4m5j04J17j61K24j35k6J47j14p1N3O2j17k7L3M7Q0L4J2l3q7n8J64
$$ 815 1144 510 174 91 213 227 182 78 195 34 258 123 97 244 130 59 112 174 57 30 63 110 190 224 236 203 116 58 222
2368B22J3j97K5K1O4J01p2n1l4K1J00j48OJ95J44k17j2L4l8n9K7J69p0l0p2J9K4K0r0N4K92
$$ 222 235 38 63 84 148 249 177 126 92 113 213 65 71 266 410 193 181 215 177 118 145 314 244 214 142 161 185 205 115 169 461
2004D61k4l44KO0K3j36P1m3Q1J44rj33PP9l5j17M8j0k5P3QL6o9K23K1J31N70k00p51J77k83
$$ 461 437 93 95 155 178 42 113 70 151 295 286 153 160 239 204 87 135 125 100 173 181 217 148 371 392 523 1093 893 142 319 36
1640C6K25j0j89K50j32N8j13K45j30J64K58j7K976K477l149k315k01k2M8j72j81Q8Q7N2J004
$$ 36 261 251 62 312 180 238 125 370 240 404 662 645 3621 6098 2949 634 433 411 459 287 106 194 281 333 1337
1347A337J34j130j61J87j84j26j7J09l5nO8o6N5j29R0J13j36N3J42K1j15o3O0n6j13K1Q0l6
$$ 1337 1471 341 180 367 183 57 40 149 114 109 177 111 166 37 127 240 104 157 299 320 205 142 202 146 33 54 134 98
1018I8J51j4k1o8K52j36j72MQJ1J2R1j6n8j03j0O2J12j29Q4o5J09m7j7r3Q3K1j01J19K1n6
$$ 98 249 235 214 146 398 262 90 94 102 113 125 216 200 142 39 29 91 203 74 158 93 202 155 138 45 128 149 48 167 188 132
654A32Oq0J32m6q7lk3J40l7o6J59p1o4j1K14m9j29O7J29k22Jk3L6k0N3p5J3K5j2jj8n4J26
$$ 132 138 58 190 144 57 54 31 171 134 68 227 156 92 81 295 246 117 184 313 91 92 69 105 85 138 63 76 101 89 88 70 16 142
267A42%j1K9j21M0k2qJ59j21J22q8M7L8mj21J42j15K3q3P7O1n6o1M3N0l7R2m2J39k24K9m8
$$ 142 142 131 160 39 79 57 49 208 87 209 121 168 206 202 81 223 108 131 48 125 186 130 69 112 162 125 217 175 314 90 119 71
-109G1j4R7l2n4K9p0L3
$$ 71 57 154 122 68 97 27 60
-191F0
##PAGE=	F1=8091.34
##FIRST=	25168.397401625570637,	5807.04592319999756,	0.89879739284515380859
##DATA TABLE=	(F2++(Y..Y)), PROFILE
5807H7M5j26J28j04O0lR6p0n6L7R2j41K2o3J24N9J8R9j60m0LK11j9k36O4J08o8o6o7N8J8q8
$$ 87 132 6 134 30 90 87 183 113 57 94 186 45 67 4 128 187 205 304 144 104 107 318 299 63 127 235 167 101 34 92 110 22
5431B2O7L1k3ML3N7m4o4lPM5k2K8q6O6k2p8J50N0Kj56k2J05N7r0r5%qO6k2J08n4m6QJ9J1q
$$ 22 89 120 97 101 134 191 147 83 80 87 132 110 138 52 118 96 18 168 218 220 64 42 147 204 114 19 19 11 77 55 163 109 63 71 90 101 93
4997I3J00m9K4j04NJ28K9l1q6K8M2r1m8J94j4n3j7k1P0%j24L8k8R6nRo0k2RM8n8k7NK4J70
$$ 93 193 144 168 64 69 197 226 195 109 137 179 88 40 234 220 167 150 129 199 199 75 113 85 181 176 185 125 103 112 160 102 75 80 104 274
4586B74j94j4l1M8jm9lM4L2J6Q7r0o1pK5J2P7k5L7j36pQ6n4M3k8J04j61J68j12m1L9N2j14
$$ 274 80 66 35 83 82 33 30 74 106 122 209 119 58 51 76 88 165 140 177 41 34 120 66 109 81 185 24 192 80 39 78 130 16
4199A6J39m0J7K2j1k4K45j31j84J15j32R8n1O5n2J59o8j10J0J07J80k0k65J34J6r6j20K14
$$ 16 155 115 132 154 143 119 364 233 49 164 32 130 79 144 92 251 183 73 83 190 370 350 85 219 235 139 19 233
3870B33j08p7K2L1M8L8j41Q3N1jm4q8L1R3p6rj1L7m6J1m1J9J47J08j83o8J5Q5J2Lj61N4J64
$$ 233 125 48 70 101 149 187 46 129 180 179 135 47 78 171 95 86 75 112 66 77 36 55 202 310 127 59 74 159 171 174 13 67 231
3483B31k07J92j5p1n0j8M4J32j19oO4p8Ll8O9J9J1q2j5J0Jk0m8J09Q4j14j7rk9K6J1P0MJ42
$$ 231 24 216 201 130 80 62 106 238 119 113 177 99 102 64 133 152 163 81 66 76 77 57 9 118 202 88 71 62 33 59 70 140 144 286
3084B86k06MM4q8j4J44L09O9j80k65J17L69r1L168J375k968j930L8N4j13Q6J52j82J38n2j72
$$ 286 80 84 128 40 26 170 479 548 368 103 220 589 498 3666 5041 2073 143 181 235 122 208 360 178 316 264 92
2779I2o4P2J88k14K91M11K89n78l18r8J65L5p6j12P8j50K57j58K1J05j55l2M1O7p2q4N7K0
$$ 92 28 100 288 74 365 776 1065 487 169 71 236 271 195 83 161 11 268 110 131 236 81 49 90 157 85 1 58 78
2450G8P6Q7Kk4p9j04J85qj77M0n7Q0J25q2n3l6oJ42j47N2M90L00n43j41K6k8r3M0J66p1k7
$$ 78 154 241 243 219 140 36 221 213 36 76 19 99 224 142 89 53 47 189 42 94 584 884 341 200 226 198 105 145 311 240 213
2086B13k2m7L26J21l59q6M05m2m11l4P6M6j24L0ML1J32%j44K4J42r2q2LK5n8J48j9rN0J30
$$ 213 191 144 470 591 232 146 551 509 98 64 140 186 62 92 96 127 259 259 115 139 281 189 107 110 135 77 225 206 197 247 377
1722C77OM27O25m22q39J84l28K36k6j47K25q7P3j41K38j94J60K46M5K843K328l063k144k09
$$ 377 383 810 1435 1013 174 358 30 266 240 93 318 231 304 163 401 207 367 613 658 3501 5829 2766 622 413
1441D13JR5j63k87J05J2J09M61J1n48p7J46j57n1J5M5l3J0N6q6J06j52P3J34j25L4J06J3j06
$$ 413 414 509 346 59 164 176 285 746 757 209 132 278 121 70 85 130 97 107 163 77 183 31 104 238 113 147 253 266 160
1100A60j9R6l7j63K0R1n3K05o7n9k1K62j62j28r5L3P7k6O4Pj5j41OL1K05k64J65l6Q0m9k3
$$ 160 141 237 200 37 57 148 95 300 233 174 153 415 253 125 30 63 140 114 178 185 170 29 35 66 271 7 172 136 216 167 144
736A44j13J22Lr1P6R3n6qj00J09k0j00jm4J58k7k0R5q2J7m6K09o7j42P1J21k02Km9J7J5P6
$$ 144 31 153 156 65 141 234 178 170 70 179 159 59 58 14 172 145 125 220 138 155 109 318 251 109 180 301 99 101 52 69 84 160
361A60n7o6M7J0j2J9n2R7L0m2L1r1J2l2N0J06p0R2j11O2Mk3j12J48p1l4l5R4Q9o9n9k4J9Q
$$ 160 103 37 84 94 82 101 49 146 176 134 165 74 86 54 104 210 140 232 121 183 187 164 52 200 129 95 60 154 243 174 115 91 110 118
-38A18J37r4J76k44N7q3k5J20m1LL9r8l3
$$ 118 255 161 337 93 150 67 42 162 121 124 163 65 32
-191C2
##PAGE=	F1=7989.08
##FIRST=	25168.397401625570637,	5807.04592319999756,	1.0011591911315917969
##DATA TABLE=	(F2++(Y..Y)), PROFILE
5807F0J12j39P0p9N9j1O6k5n7K2Q8j10L1l9J49j9K8J05k00l8jK32j5j86M9N7o4m8l9M0L9o4
$$ 60 172 33 103 24 83 72 138 113 56 78 166 56 87 48 197 178 206 311 111 73 72 304 289 103 152 209 145 97 58 98 137 73
5431G3K1N0l8j9K4O3n0l4%n0O7J6j4l4O2m0o6R9L4Lj36K7P5L8q3o4NNN7nQ5j8j27K3J5N0o3
$$ 73 94 144 106 87 111 174 124 90 90 40 107 123 109 75 137 97 31 130 164 167 31 58 133 171 88 24 29 34 91 86 171 153 26 49 64 114 51
4997E1J51l2M8j29o4J23P6k3j16K9K2n9M9J21j5m9l1j5O9Rj40M7m5J24k9j3Or3M0M7o4j3k5
$$ 51 202 170 218 89 25 148 224 201 85 114 136 77 126 247 232 183 152 137 206 215 75 122 77 201 172 159 165 72 112 159 95 82 57
4610E7N7J86k17Ko0Q7j1k8l2O9j3N2P8q4p3j3J6M3L6l9lp2kQ2o7J15o7J37k05J46q1k6oL8
$$ 57 114 300 83 85 25 112 101 73 41 110 97 149 227 143 70 57 73 116 152 113 110 38 36 118 51 166 99 236 31 177 96 70 64 102
4211A02o8R9pk8K1j2j9K45o9k37J19j23J19p5N0J5J20p8j05M4Q6J50lk37J01N6j18j25K03
$$ 102 34 133 126 98 119 107 88 333 264 27 146 23 142 67 117 132 252 174 69 113 199 349 346 109 210 266 148 23 226
3870B26p9j12K4M9M9M3j61N6R5Jr0J0n6Q9n2K2k5Mp7J0K9j3J68R4j82j7J5j3N1j2j07M2J73
$$ 226 147 35 59 108 157 200 39 95 190 191 101 111 55 144 92 114 89 93 16 26 55 42 210 304 122 105 120 107 158 146 39 81 254
3483B54k07K07l8Lp6n1k6J83j10k4L4m7Jk0mJ5K2n3J8j8J5l3l5P4Q5j23L3L6j01O6lL0M1Q9
$$ 254 47 254 216 219 143 92 66 249 139 115 149 102 103 83 79 94 116 63 81 63 78 45 10 84 169 46 79 115 14 80 77 107 148 237
3084B37j98oN4p2P4Q7K75J88l03k43J76KjJ088R47j030j136m2J84L82q4l47j88K64kk28k6
$$ 237 39 33 87 15 89 176 451 639 336 93 269 271 270 1358 2305 1275 139 97 281 663 579 232 44 308 306 78 52
2767E2J29R3j40J09L3J54j44j60m5J37R0j14r1K5p4J97j43N2O3j52l9N1P0n7o1K8J2L1J36
$$ 52 181 274 134 243 276 430 286 126 81 218 308 194 103 128 54 251 108 160 223 71 32 83 153 96 35 63 75 106 242
2427B42j3mo9j49K02l4j23P2o4j7J58n1r5N3L5l1r7J33P29K51p80j44mK7j27M9J20k7k4Mj21
$$ 242 229 225 156 7 209 175 52 124 60 43 201 150 55 108 143 112 15 148 877 1128 348 204 200 227 100 149 269 242 218 222 101
2063A01M24J96m27j74M63p2l90r0J02M0p8k4N6m4J28J4j33K9J51j31l1qN8r1K21p9l3J74K1
$$ 101 525 721 294 120 583 511 121 31 133 173 95 71 127 83 211 225 92 121 272 141 110 102 160 69 290 211 178 352 373
1722C73oO66N80o00p76J03k91J65m3q9K09q9J44j34O7r3k4P9p9O18L20n00m55M5M4J39l8k92
$$ 373 367 1033 1613 1013 237 340 49 214 171 82 291 202 346 212 279 186 162 241 162 780 1100 600 145 190 234 373 335 43
1394D3J1kJ10O4O5m4j31J13j86J03m3K4n6O2k7m0P6r6K4J29o5m1J33j7r2K9J08l5j34QN8l8
$$ 43 54 52 162 226 291 247 116 229 43 146 103 127 71 133 106 66 142 46 70 199 134 93 226 209 117 146 254 219 85 93 151 113
1018A13K06r2r4K5K23j73o4r7j4J11l5M1J5J3j38k0JK37j96J25qN5p0j0p9O8J1q7N3J34n4
$$ 113 319 227 133 158 381 208 144 47 33 144 109 150 165 178 40 20 21 258 62 187 179 234 164 154 75 143 154 67 120 254 200
654B00jj22Q0jr0K2j2Q8l2M9%o4J12r9J74p3j38N1J28j66jm4J1J9P4k1o1J1J4m7P3m3N0N0
$$ 200 199 77 157 156 66 88 76 164 132 181 181 117 229 130 304 231 93 144 272 106 105 61 72 91 165 144 83 94 108 61 134 91 141 191
255A91p8N5n5l5j1Q6M5l0Q8j28N6l2m2r2J60l5q8kJ00J29p3n1m5m9O4J42j32J69k19P5j08
$$ 191 113 168 113 78 67 153 198 168 256 128 184 152 110 18 178 143 55 53 153 282 209 158 113 64 128 270 138 307 88 163 55
-109E5j4J13l2M8N4j34l8
$$ 55 41 154 122 170 224 90 52
-191E2
##PAGE=	F1=7886.82
##FIRST=	25168.397401625570637,	5807.04592319999756,	0.87568837404251098633
##DATA TABLE=	(F2++(Y..Y)), PROFILE
5807B4J81j45J8l0M7l9L5K0n8QO2o2M7k6J75p4J9R8k21m8J8K28k3j23L9J0n9l7J0J0M6m3j3
$$ 24 205 60 78 48 95 56 91 111 53 61 123 61 108 82 257 183 202 300 79 31 49 277 254 131 170 180 121 84 94 104 150 107 94
5420I4O5n9k0pO4j8nK4r3O4L4m4qN5n9m8M0M2ko0M1J7J1o9pJ4j0M9PN4K3j29nj0Q4j14J89
$$ 94 159 100 80 73 137 119 114 138 45 109 143 99 91 146 87 39 79 121 119 59 100 117 128 59 52 66 56 105 112 166 189 60 55 45 129 15 204
4985B04j0M9j63n4M8J28j6j26Ln%J17N7k0Kp3ON2J7j42N3o0J48l8n1N8j43O1M2n6J2n7J23
$$ 204 194 243 80 26 74 202 186 60 63 58 58 175 232 212 214 141 147 199 216 74 127 67 215 177 126 184 41 102 144 88 100 43 166
4598A66J49k32K5m3P3j0l1m2Q4n6R4N6o8p3%k7Q4rq1QJ0n7Q7l8J29j00J69k20O8lkk9l0oN5
$$ 166 315 83 108 65 138 128 97 55 139 83 177 233 165 92 92 65 149 140 59 67 77 20 107 69 198 98 267 47 115 112 110 81 51 45 100
4187A00K5o0M8k8l8K27pj71K3r5J29r6L4O9N1o2r0R1O9P0K8j78N1P4j18j26J87m6r5K5M6J0
$$ 100 125 65 113 85 47 274 267 96 119 24 153 57 91 160 211 149 59 150 219 289 317 139 190 264 146 20 207 161 66 91 137 147
3812A47N6j07l3J13Oj16R3j14M7MK5j1k3m6mL6l0J48Q7j73N1Nr4N8l7l1J0J83j84K11o4Q9
$$ 147 203 96 63 176 182 66 159 45 92 96 121 110 87 41 37 73 43 191 278 105 156 161 67 125 88 57 67 250 66 277 213 302
3436C02j00r1p0K06j00k4k5jN5n9o6mL6K3M5q7L9j0n5R4L1q4L1P4j38N4lmQ7mj20O8o5K2J33
$$ 302 202 111 41 247 147 123 98 97 152 93 27 23 59 82 127 40 79 69 14 108 139 55 86 160 22 76 73 69 156 152 32 100 35 57 190
3025A90k9K14K91m52j01K29n8J31K704N61k803n70pK07J022l71r76l0J6J39j87j7J56k9J3
$$ 190 161 375 666 214 113 342 284 415 3119 3680 877 307 300 507 1529 1158 182 152 168 307 120 103 259 230 243
2732B43q6N37N38n74n91N8M7J56j48p4nj5J28j09O9K4q0q3O1M6n8j2LK7l0J57l0K4n5j48J70
$$ 243 157 694 1232 658 67 125 172 328 180 106 101 86 214 105 174 198 118 35 96 142 84 72 75 102 72 229 199 223 168 20 190
2368A90o4n6J03l2j20J50Rj41J64J70k94k7J47O54K5p24L6m3J07j37K9M5N7k8j8j32J56K01
$$ 190 126 70 173 141 21 171 180 39 203 373 79 52 199 853 878 154 190 147 254 117 146 191 248 220 202 70 226 427
2039D27j86j06M11r8l01j42J35Mj6k2M5j07J22M6j13RJ05j29J9L3O0q3K38j44n0K83q4kP90
$$ 427 241 135 546 448 147 5 140 144 128 106 151 44 166 212 99 108 213 84 103 136 196 113 351 207 157 440 356 354 1144
1699A144M43o97o40K6j66K6no0K07j51K94r8k86L85j54R3O40K894L050l718k538k85j90j62
$$ 1144 1587 890 250 276 110 136 131 71 278 127 421 323 37 422 268 361 1001 3895 6945 3227 689 404 214 52
1417E2L20k00lj1j42J83m9J85k08J17j91J90j60J32j27Q9j52N4Qj1l3R1K9j03J85r1k8K3J09
$$ 52 372 172 169 158 16 199 150 335 127 244 53 243 83 215 88 177 25 79 87 76 43 134 163 60 245 154 126 149 258
1077B58o7r1N2%oJ53q4r2N6J25j50j1l1p3P6KJ7j0N4j18m6K8J40q5J03J1M0j05J4n1kN6j00
$$ 258 191 100 152 152 146 299 215 123 179 304 154 143 112 39 115 117 134 124 178 60 14 42 182 97 200 211 251 146 160 109 107 163 63
689F3M7J41n5J8j52O4J2o1O2QPn5J17j02k2K05j55J13o3j16L5J20j15ol3N4m3N9J7k6j3qq6
$$ 63 110 251 196 214 62 126 138 77 139 147 154 99 216 114 92 297 142 255 192 76 111 231 116 110 77 131 88 147 164 138 125 117 31
302C1J23m4J3O6j02Q7j5j04K6J06j3qJ04j32L3p1m8l1J40j3j28KR9J69o5m2m8r3R9J12j47
$$ 31 154 110 123 189 87 174 159 55 81 187 174 166 270 138 171 100 52 21 161 148 20 22 121 290 225 183 135 42 141 253 106
-62A06J22j55P9j09J7P8j7Q0O9j76j0
$$ 106 228 73 152 43 60 138 121 201 270 94 84
-191H4
##PAGE=	F1=7784.56
##FIRST=	25168.397401625570637,	5807.04592319999756,	0.61180162429809570313
##DATA TABLE=	(F2++(Y..Y)), PROFILE
5807B6J92j46QOL1p8K7M2n1j0K0NN0k1J97r6k1Q2k07l5L1J88l7o0L3k1m3l2M8k2M2l3k9P8
$$ 26 218 72 80 86 117 39 66 108 57 47 67 72 122 101 298 202 181 263 56 21 52 240 203 143 176 155 112 80 128 106 148 115 86 164
5408A64p7lm5M6M8jO1j06L9L8o9JN2p6k9j0O3OjL0j1l0m9K7K1j4M6KK4O1j01m3k8J10q8J35
$$ 164 87 84 39 85 133 132 193 87 126 164 95 96 148 72 43 33 96 102 101 131 120 90 41 68 89 75 121 123 147 208 107 64 36 146 58 193
4985A93J6L8k03J4k6J26mj10k8L2k1J57J0k5P3j18M0K6Oj11M5o8J55l4p5P6j67P0L3l0K4n2
$$ 193 209 247 44 58 32 158 154 44 16 48 27 184 194 169 242 124 164 190 196 85 130 62 217 183 108 184 17 87 120 90 114 62
4610F2J57Q7k38L9j8P2j0m5l1P8r1J33L6m4o9J2o2J02l6r3P0Mr2N7%J18j23K01k01m1R3J4
$$ 62 219 306 68 107 89 161 151 106 75 153 62 195 231 187 118 130 68 170 134 41 111 115 23 80 80 198 75 276 75 34 127 141
4234A41m4q1L3K3L6m6P4n2m8J67L6q4o5n6J24j00K7R1l4l8o1J28O7l3N9j01LO6r5j28J75k3
$$ 141 97 16 49 72 108 62 136 84 36 203 239 155 90 34 158 58 85 176 142 104 43 171 238 205 264 163 166 232 137 9 184 161
3859A61o1K6M1m5P3n8q3Q5J2q7J19j47mP0RK2m1j5OJ1m7J05Q7j70J32j7j35L8n2L1l2J87j61
$$ 161 100 126 167 122 195 137 54 139 151 64 183 36 32 102 111 133 92 77 83 94 47 152 239 69 201 184 49 87 35 66 34 221 60
3471F0K13p7J61j20j27m9J75p5k8r6M9J26j17n5L1m2Q2O2j57O5L1r1J54l4k9k4J09j39lLO3
$$ 60 273 196 357 237 110 61 236 161 133 37 86 212 95 40 71 29 111 173 16 81 112 21 175 141 112 88 197 58 55 58 121
3107A21M4j04N7J35j72K2J89j52J79K92n65J22K28L68J72O643K331o420l023J09K83J766o63
$$ 121 165 61 118 253 81 103 292 140 319 611 46 168 396 764 936 7579 9910 3490 467 576 859 2625 1962
2837A962j652J9k18J28q2l6J70r9J49%J201P89j231j007P7l3J80j60n8j8J4P8q3P9mJq3M1
$$ 1962 310 329 111 239 157 121 291 192 341 341 1542 2331 1100 93 170 137 317 157 99 81 95 173 90 169 165 166 83 124
2509A24j8n0M8j6N6o8J29m0N2l7j38J24r2QJ30Kj60Q2O3j51K55L46m11j25J23K97J79l11k21
$$ 124 106 56 104 88 144 76 205 165 217 180 42 166 74 82 212 214 54 136 199 48 303 649 238 113 236 533 712 401 180
2168A80p1J57j08k6j0J28l6o5qL21j72k00R8K58r9j94j11J05k9L1J9k3r4P6R1j07j9L3m0J7
$$ 180 109 266 158 132 122 250 214 149 141 462 290 90 188 446 347 153 42 147 118 149 168 145 51 127 218 111 92 125 85 102
1816A02P4N1p3K30j83p1L47j65J1P94K66o95m67pm5l7P6m9J22j19L46q1j99M29p1K97J152
$$ 102 176 227 154 384 201 130 477 312 323 1117 1383 688 221 214 169 132 208 159 281 162 508 427 228 657 586 883 2035
1499B035O128O214p696n204o47l06j90J92k75R7q0j13K31l09L35k51J16j46J89k66K66j86
$$ 2035 8163 14377 6681 1477 830 524 334 526 251 348 268 155 386 77 412 161 277 131 320 54 320 134
1241A34Q8j52K5M1k6n5K2J05n9J68j79O4m1J17j19n1J21m9J9Q1n8n5P5rq7PK8r0NN9Oo8J10
$$ 134 222 70 95 136 110 55 77 182 123 291 112 176 135 252 133 82 203 154 173 254 196 141 216 207 120 127 155 65 70 129 135 67 177
854A77j09j0L3JK8Q1K8K3j32K9k8m4J11j26N1J14n2L2j67M7K7l1J16J3o1r0J55j77K6K74j95
$$ 177 68 58 91 92 120 201 229 252 120 149 121 77 188 62 113 227 175 207 40 87 114 83 199 212 151 61 216 39 65 339 144
490A44M4l8q8O6N8o3pl1J03j21M5M5Rpm7r4J37n2pQ7j03J03L0j42J5J19o0%J17j14kj07l9
$$ 144 188 150 62 128 186 123 116 85 188 67 112 157 166 159 112 18 155 103 96 183 80 183 213 71 86 205 145 145 262 148 146 39 0
103@N5R5oj15PL8J84m5k4n8r0R8P0j43N1n1N2r0N2M2j0J03P5k14K8
$$ 0 55 150 144 29 36 74 258 213 189 131 41 139 209 66 117 66 118 28 80 122 112 215 290 76 104
-191A04
##PAGE=	F1=7682.3
##FIRST=	25168.397401625570637,	5807.04592319999756,	0.43310412764549255371
##DATA TABLE=	(F2++(Y..Y)), PROFILE
5807F4J34j27K3J7J6j00M0M1l6mm7O2M4k0K11r6q8O9j58K1LJ23m2oK1l0j2j9N3n1L4m4j9P9
$$ 64 198 71 94 111 127 27 67 108 72 68 21 83 127 107 318 222 134 203 45 66 69 192 150 144 165 135 123 104 157 106 140 96 77 156
5408A56q1J7m0j8J17k0J02j05J8L0q8LO2q2k9j3N7L2J5J6j8n2m0K2L4j0N1k2QP9o9p4k5J28
$$ 156 75 92 52 34 151 131 233 128 146 176 88 91 153 71 42 29 86 118 133 149 131 79 39 61 95 85 136 114 122 201 132 58 33 161
5009A61n9O0N0K7k36Q3J5%J8p6M5O7j29J41k7lJ17j56Q1Qk8n5K2o7J45j5p5O1j66O7K6jJ0
$$ 161 102 162 212 239 3 86 101 101 119 43 88 155 26 167 140 137 254 98 179 187 159 104 126 59 204 189 114 175 9 76 102 101 111
4622A11j1J48K2k24M8j1R8j9n3pM1j14J64L6j6p5Rp0R2l3j9O8n4o7k1K6R8j20K19j50n2Q1
$$ 111 100 248 270 46 94 83 181 162 109 102 143 29 193 229 213 138 147 77 169 136 117 185 131 64 43 69 167 47 266 116 64 145
4246A45Pm8j8l3J0J2LP8o2k6P3N4mj23j9J07q7L7Q4q3n7jJ16P7j05N2j5k5K8n0r4J30k6k2
$$ 145 152 104 86 53 63 75 78 156 94 68 141 195 191 68 49 156 69 106 190 107 50 49 165 242 137 189 174 149 177 127 33 163 137 115
3847A15K9M6r9P8k8q7L5J2JQ0j56J5O3LM3o0JRJ2p7P0R0j78K08m2j42J8KK7o9J50j26J90n9
$$ 115 144 190 91 169 141 54 89 101 102 182 26 41 104 107 150 90 91 100 112 35 105 195 17 225 183 41 59 61 88 19 169 43 233 174
3448A74J91j33j44J8J18l6n5j17N8J73j50k0M2m0N5O4j85Q2M8j09J82l0m2o5J29j31m9MJ50
$$ 174 365 232 88 106 224 188 133 16 74 247 97 77 119 79 134 198 13 95 143 34 216 186 144 79 208 77 28 32 182
3107A82j1j45J99J66k54k5K30j95J52J63l77Q2K01M61K45P784L404p316m531K64N23K622q02
$$ 182 171 26 225 391 137 112 342 147 299 462 85 167 368 829 1074 8858 12262 4946 415 679 1202 3824 3022
2837C022k834K24p8j81M0j45J88o4J88M9J289N61j270q49L3l4J23j38j6m3QP7q4Q2j1N1l8
$$ 3022 188 412 334 153 193 48 236 172 360 409 1698 2259 989 140 173 139 262 124 108 65 73 150 66 148 137 188 150
2521A50Mj14RP5l0Q9q6P4k6O3j1j35O5j05N3J62L2k05M2Q4j33L34N20m86k38O8L40J053p36
$$ 150 154 40 49 124 94 183 97 171 145 208 197 62 127 22 75 237 269 64 106 190 57 391 911 425 187 255 595 1648 912
2180I12p23o5J19m8r5M4Q5l0o8R6R71n5r57L7P6n2j22n3P3l1M3M9j24l2L1J22j11k3l1P4k3
$$ 912 189 124 243 195 100 144 229 199 131 227 1198 1143 186 223 299 247 125 72 145 114 157 206 82 50 81 203 92 69 38 112 89
1816H9Q5M7p9K15j74r1L33k06QP17J40o00l10oj9jQ3l2MpK78r8n6L17k0K67J390O336O685
$$ 89 174 221 142 357 183 92 425 219 227 944 1084 484 174 168 149 148 231 199 203 196 474 376 320 637 617 884 2274 8610 15295
1476A5295q151n546o90l13l6N5m32J97j45n4J86l50M02k65R1j13J89k93L31k19R1j41MJ05
$$ 15295 7144 1598 908 595 559 614 182 379 234 180 366 16 418 153 244 131 320 27 358 139 230 89 93 198
1194A98q4o1j4J18MJ53j99Q6j18J37j39m2J76p0K2N4n3j6Q9j17l0LN5n1o5R0M4j19J08j16
$$ 198 114 53 39 157 161 314 115 201 83 220 81 39 215 145 167 221 168 152 241 124 94 97 152 101 36 126 170 51 159 43
842D3M9J4m7P2N5N4j7j36K3oj9J13j23M5O1k5J5j41JO4k2J74Or0j10J18j40PK99j94j6j0p0
$$ 43 92 106 59 131 186 240 223 87 110 104 85 198 75 120 181 156 171 30 31 95 73 247 253 163 53 171 31 38 337 143 127 117 47
455D7J12ql6Kk9J24j49J3N3K1K7q3o4J14o6oJ14j04J05P3j32n1J31q3OR7p6m4q9K1L4O1oo1
$$ 47 159 151 115 117 88 212 63 76 129 150 177 94 30 144 78 72 186 82 187 260 128 77 208 125 131 228 152 108 19 40 74 135 129 68
56F8L2l7J23j5Op9n9O9M0j01l2O9np0P4K8k6J32N4k22N6
$$ 68 100 63 186 171 177 98 39 108 148 47 15 84 79 9 83 111 85 217 271 49 105
-191A05
##PAGE=	F1=7580.05
##FIRST=	25168.397401625570637,	5807.04592319999756,	0.4782524406909942627
##DATA TABLE=	(F2++(Y..Y)), PROFILE
5807A00L6n4RJ8Qo6NN9l0N1r8L5N6k3K14r6j64P2j02P7k4N3k2L0rj1LJ1M7q3M6p7J3M8o6K8
$$ 100 136 82 91 109 117 51 56 115 85 136 38 73 129 106 320 224 60 132 30 107 83 136 114 144 135 124 127 138 185 102 148 71 84 132 66 94
5384I4j6k4J02l6J27p7nKq9pJ07p9m8pM1M8RJ3l6k2m9JM2qO6p0L4N3m3o0l8J45m2j8Q7M4k03
$$ 94 78 54 156 120 247 170 165 167 78 71 178 99 51 44 85 133 142 155 119 97 48 49 91 83 149 79 113 166 123 63 25 170 128 110 197 241 38
4950C8P8L0o3J9m4J04P7j51N8o5O0J12j90J13Pn1j0j0o2J20L0p4N1j50O3LJ7k7N7J00l6j72
$$ 38 116 146 83 102 58 162 239 88 146 81 141 253 63 176 183 132 122 112 50 170 200 126 177 27 90 93 110 83 140 240 204 32
4575C2Q0o5J51m2m8K5k6q6J44O7Nr8j0n9Q0mL4P4j38j4n6rP7o9J99p8m7N1l8k1K8p8j0j5M4
$$ 32 112 47 198 156 108 133 107 21 165 232 237 139 129 70 150 146 180 254 116 102 46 37 114 45 244 166 119 170 132 111 139 61 51 36 80
4164H0P7n0j2PN5M0j36J2O9p1P8N9n5o6LM0Q5q5l1O9k5l3K0l9N3o4J7M2P0j50N4Np7J6j5J03
$$ 80 157 107 95 102 157 197 61 73 142 71 149 208 153 87 90 130 215 130 99 168 143 110 130 91 144 80 97 139 209 59 113 118 41 57 42 145
3741A45J2j19L9K8K8K8q0mQL1r1L6Q3p4J45n5j34K9L8N3j06O4k0P4lJ60j35r4O0Q5qj12p0
$$ 145 157 38 77 105 133 161 81 77 85 116 25 61 144 70 215 160 26 55 93 146 40 104 84 158 155 315 180 86 146 231 223 111 41
3354D1N3J39j21rJ2K1J2M0j39Q6Pp0J19O3j24m3Q1j12j7L7J10j0r8K82R8k68p3J73p5Mmj18
$$ 41 94 233 112 103 115 136 148 188 49 135 142 72 191 254 130 87 168 56 39 76 186 176 78 360 458 190 117 290 215 219 215 97
2978I7m1J55j03L00L086K296k615k876J31R73L571o55l651l69P6q9l2m1m6k4J34p4L56K33
$$ 97 56 211 108 408 3494 5790 3175 299 430 1403 4974 4319 668 299 375 286 254 213 167 143 277 203 559 792
2697G92K1o13n5J6%q4P8q2n1J36j19P4K3L9N5n9j21N4K3l2R8p3KL1L9K4j26j5m0NK07N7k64
$$ 792 813 200 145 161 161 77 155 73 22 158 39 113 136 175 230 171 50 104 127 95 193 120 122 153 192 216 90 75 35 40 247 304 40
2309D0N5N1r4M05O29m97l23JO75J382j137j010n0L9K7j64J55k3K3l8R5J341P5j329j28m7J9
$$ 40 95 146 52 457 1086 589 266 267 942 2324 1187 177 127 166 193 29 184 161 184 146 241 1582 1657 328 200 153 172
1992A72r3J9P2m0N9Jj32k2k4J15q3N3n9O0m1M5L6r2J96o8r8J78j79n0O07J62m29k01n9q4P6
$$ 172 79 98 170 130 189 190 58 36 12 127 44 97 38 98 57 102 138 46 242 174 76 254 75 25 632 794 365 164 105 21 97
1628I7lj3L2p3J48j00j3Q4l7K5P53R33J970j934j452j27j24K00R4j95j32p6m3J10o6K07j58
$$ 97 94 81 113 40 188 88 75 159 122 147 900 1833 3803 1869 417 290 166 366 460 265 133 57 14 124 58 265 107
1312A07l0j2J32j09J80j55O0j63J29L4q3k6k5K5O5J44q1l7j16J02n7m2J28l7j5J18j09M7M2
$$ 107 77 65 197 88 268 113 173 10 139 173 90 64 39 64 129 273 192 155 39 141 84 42 170 133 118 236 127 174 216
971B16j14p4J4M4P0j30O4J68j80J5o0O0%m3P0N2Q4j05j14nK9M4N5n8J5J2L2o0r0N1K0k2K08
$$ 216 102 28 42 86 156 26 90 258 78 93 33 93 93 50 120 172 256 151 37 32 61 105 160 102 117 129 161 101 11 62 82 60 268
584B68qo0j32J3j6j4K29j29m9j9n9J25Op6K5oQ6m9p8L1pQ9q7o0J11p0J5J15j30J15R6r3j22
$$ 268 260 200 68 81 65 51 280 151 102 83 24 149 155 79 104 98 184 135 57 88 81 170 83 23 134 64 79 194 64 179 275 182 60
197F0J37o0J5J9k9r3J0J3lL5jJ7L4m9k5M6J8j00K5k9M9RnK4m7qmM3o7J76jj74N0
$$ 60 197 137 152 171 142 49 59 72 69 104 103 120 154 105 80 126 144 44 69 40 89 98 93 117 70 62 58 101 34 210 209 35 85
-191H5
##PAGE=	F1=7477.79
##FIRST=	25168.397401625570637,	5807.04592319999756,	0.68819010257720947266
##DATA TABLE=	(F2++(Y..Y)), PROFILE
5807A40j03R2p5K2K3Nq1J11m9J47j83k0J15l8K20j35j44J9n0J23m3QOM7o2M3l4O9N0j34J05
$$ 140 37 129 54 76 99 104 23 134 85 232 49 29 144 106 326 191 47 66 16 139 96 104 110 157 95 138 104 173 223 89 194
5443A94r0J8l4k0J6OJ4L8j2J02j1l5n6m4m8J84o9n7l9N2J3QK6q5N6o9N0k2k2J06j33J01k6
$$ 194 104 122 88 68 84 90 104 142 130 232 221 186 130 86 38 222 153 96 57 109 122 130 156 71 127 58 108 86 64 170 37 138 112
5056A12l0N2j28J62m0q0J15J09k09R3j1Rm1k7J40M6j12j6p6Q6J05j99Q4J8kk2n2k8N7J11r7
$$ 112 82 134 6 168 128 48 163 272 63 156 145 154 113 86 226 272 160 144 68 154 259 60 144 162 160 138 86 58 115 226 129
4692A29P8j46Q3n5K0n5J24K0p9j05J52q7J35o3n1O3j11M0J6J36J0j38l8m4J10K3L8J01k36
$$ 129 207 61 144 89 109 54 178 198 119 14 166 79 214 151 100 163 52 92 108 244 254 116 78 34 144 167 205 306 70
4352G0N5k8o3N2k3J66pr1O9j19M2M3r5n8L8JR5k2j9k0P0K1j14N5oo4J60J8k6j1m7n1O4Jr2
$$ 70 125 97 34 86 63 229 222 131 200 81 123 166 71 13 51 52 147 125 106 86 156 177 63 118 112 48 208 226 200 189 142 91 155 156 64
3941F4P7J4j16J14K2n1r9K2P2J11j85j2R1o0L8k4J10q1k5jN4N4j6o2p2M4K2j3m5L2Q6lk3j05
$$ 64 141 155 39 153 175 124 25 47 119 230 45 33 124 64 102 78 188 107 82 81 135 189 173 111 39 83 105 92 47 79 165 162 139 34
3542C4M2N3J05j87PJ21q3O6N4r8N1oJ14kj85l3J15j1jl1n2J33l6j6k7Q3j08M5o2K41j96K8
$$ 34 76 129 234 47 54 175 92 158 212 114 165 159 273 271 86 53 168 157 156 125 73 206 170 154 127 210 102 147 85 326 130 158
3166A58j02nQ7N7o8Q3k7L47j03j36l2j50K62l13P2J9J95j50J435j18R533K236r710k398n27
$$ 158 56 51 138 195 127 210 183 530 427 291 259 109 371 58 130 149 344 194 1629 1511 11044 13280 3570 1172 645
2873F45P18M571j64l660j985Q9L06j96K98j74k42J83L60J845K778k183k735j48p4j16o6K00
$$ 645 1363 5934 5770 2110 125 214 520 324 622 448 206 389 749 2594 5372 3189 454 306 232 116 50 250
2614B50j14m3J02j66N3Q2k9J84j53j0K3n5j6M8Oj08J40k8P5j11n2J9n9K19O7l05J04m2l4M59
$$ 250 136 93 195 29 82 164 135 319 166 156 179 124 108 156 162 54 194 166 241 130 78 97 38 257 324 19 123 81 47 506
2262E06O08m12l59m1M35R88q43p40n4k7R1k9M5j47K13r5N2Q96J56r78j38M3k1rOJ32j12J32
$$ 506 1114 702 343 302 737 1725 882 142 88 61 152 123 168 21 234 139 191 1087 1243 265 127 170 149 140 146 278 166 298
1934B98j92J46j01n7n4J02Q4r7J1K5o2n3J10j17K69q5j73J90N3r4M33k13o9m9P6m2j1rL06
$$ 298 106 252 151 94 40 142 226 129 140 165 103 50 160 43 312 227 54 244 297 203 636 423 354 305 381 339 328 319 625
1593F25j99O4K55r6K74K20J112M56J1456R587j2943q347j206k53m11O1K65m51J34j38j00l6
$$ 625 426 490 745 649 923 1143 2255 2711 14167 23754 10811 2464 1258 1005 594 655 920 469 603 465 365 329
1335C29k15K79j33J08j69J18k52K34j04L6J12k59J24L2l2n6J3J2J78k97J58r0M6rm6R1n8J61
$$ 329 114 393 260 368 199 317 65 299 195 231 343 84 208 240 208 152 165 177 355 58 216 126 172 163 117 208 150 311
1006C11k01J82j65L3l5n1pJ77j47LK96l32j1J07j11J17j44N9J37P5k32jK8KO3o9O4m0M0O0
$$ 311 110 292 127 160 125 74 67 244 97 100 396 64 53 160 49 166 22 81 218 293 61 60 88 90 153 84 148 108 148 208
654B08j94N8J10j01L4J46k2K4j75oj7P8K8J5n7r5j9O3J28j77O4L8k5J45k08jlJ05k1r2J17
$$ 208 14 72 182 81 115 261 239 263 88 82 65 143 171 186 129 34 15 78 206 29 93 131 106 251 43 42 39 144 123 31 148
290A48l4J6P1j89J51P8k0j51J15%J1q8Qp4L5L2o8J4K8J05j0m1q0J00p0l8R7q6j6J30m2K9p4
$$ 148 114 130 201 12 163 241 221 70 185 185 196 108 116 42 77 109 41 55 83 188 178 137 57 157 87 49 146 60 44 174 132 161 87
-97H7N3r4M4l6J50r2o7J3
$$ 87 140 46 90 54 204 112 45 58
-191E8
##PAGE=	F1=7375.53
##FIRST=	25168.397401625570637,	5807.04592319999756,	0.78404343128204345703
##DATA TABLE=	(F2++(Y..Y)), PROFILE
5807A99r2R8j77K6N8O0q9Q5r9K70k90QJ28o6K41k40K6j09M6Q2m6M2l6O8j11J09j26J51N7k14
$$ 199 107 205 28 54 112 172 83 168 69 339 49 57 185 119 360 120 146 37 83 165 119 161 125 193 82 191 65 216 273 59
5455E9K15q7Lj45N3j5J8N1m2P6K0P6p1j47O4p1K11l4o5q6Q8r4N6K4r7J03j03J51j12n3J72
$$ 59 274 187 190 45 98 83 101 152 110 186 206 282 211 64 128 57 268 234 169 83 171 77 133 157 60 163 60 211 99 46 218
5091B18j24R2j01m4K06k17J26n1j6L4K02k30J12j11J55j06k0J57m1qp0k5RJ44j61m7M2J02
$$ 218 94 186 85 41 247 30 156 105 89 123 325 95 207 96 251 145 125 282 241 233 163 138 147 291 130 83 125 227
4762B27o6r1N3o5K11j49J47j58J17j23%J3R7o1p0n1J87l2M7n7r6J09j22J14j44K28%j92K1
$$ 227 161 70 123 58 269 120 267 109 226 103 103 116 213 152 82 31 218 186 233 176 80 189 67 181 37 265 265 73 94
4422I4l2J26Qj5J56k82Q2J1n0M5o8J67L8j84J36k00J06L4q5k2M3r7J62j8m2j6R8l5q4J09j20
$$ 94 62 188 196 181 337 55 137 148 98 143 75 242 280 96 232 32 138 172 87 65 108 11 173 155 113 97 195 160 76 185 65
4058F5n7K71l9l7R7j06q0k7Q7j3o4J03j51J40Q6j63K5q8O3J51j84J7R9l9L1j4P1k10J17j01
$$ 65 8 279 240 203 300 194 114 87 174 161 97 200 49 189 275 112 137 49 112 263 79 96 195 156 187 173 244 34 151 50
3706E0J58N4n4Kj95J51m5P2q4j04K64j97J13q8K2R3J24k66L7J83j15L9j07N8J23j57K16jk11
$$ 50 208 262 208 210 15 166 121 193 109 5 269 72 185 97 119 212 336 70 107 290 175 214 107 165 288 131 347 346 135
3366A35j9J61k19J76o0j3J40o9o8Q4P2k31J63j36K76j14%j44N3J08O7j83J37N2L66l78R3O1
$$ 135 116 277 58 234 174 161 301 232 164 248 320 89 252 116 392 278 278 134 187 295 362 179 316 368 734 356 449 510
3037E10l02M11k03J26mL47k27L639J55L0004J0699k9347j3232n37r55N510O43l059l300J41
$$ 510 208 619 416 542 538 885 658 4297 4452 34456 45155 15808 2576 2039 1084 6594 7237 4178 878 1019
2802A019k84l84Q12k35m72M57J098N303N711o059o040k54k70j16j38K39j47k2M4j79K0J14
$$ 1019 735 351 1163 928 456 913 2011 7314 13025 6966 926 672 402 286 148 387 240 218 262 83 103 217
2544B17j01K97k56J05nj16K0r8J69j94K30j32J43r7oJm0J57M9k34Q3p8j1M51M10k09l22l4
$$ 217 116 413 157 262 257 141 161 63 232 38 268 136 279 182 176 177 137 294 343 109 192 114 103 554 964 755 433 399
2215C99J011M3r23j91j17L6m2J45j73J5K26j20J34M20j30m17q6P4p8O3n5K15k06K33m23M15
$$ 399 1410 1453 530 339 222 258 216 361 188 203 429 309 443 863 733 316 230 304 226 289 234 449 243 476 53 468
1910D68j28j02J8P8Q4j29N4M5m6pJ05j46L07j15m2J50J23m09M41n8M6J4J68p3Q5J0M45k08
$$ 468 340 238 256 334 418 289 343 388 342 335 440 294 601 486 444 594 717 308 749 691 737 751 919 846 931 941 1386 1178
1582A178K79M04o2P26N08K503K878L0298K7583l5778k3536l306q81o09k89l9m63K9k53j46
$$ 1178 1457 1861 1799 2525 3033 5536 8414 38712 66295 30517 6981 3675 2794 2185 1896 1857 1394 1423 1170 1024
1347A024j35j74K01j78J31k17L0k81K74j76Q8Q4l49J54M6n0m2j0j77L57l47K01j01lrq8J43
$$ 1024 889 715 916 738 869 652 682 401 675 499 587 671 322 476 522 472 430 420 243 600 253 454 353 350 341 253 396
1030C96m2R5k34K96l75J49N2j05K5J10j20PL08n27K18P7k53K68k06l7K43J6j95K7N0k6N5j11
$$ 396 354 449 215 511 136 285 337 232 257 367 247 254 562 35 253 330 77 345 139 102 345 361 166 193 243 217 272 161
701A61N6o8J17L3j64O5J30k03J05L7m1J20k03R7j78K18k08J82o1j09l0J0K16j63K0N6j08K95
$$ 161 217 149 266 299 135 200 330 127 232 269 228 348 145 242 64 282 74 256 195 86 56 66 282 119 139 195 87 382
373C82l29l9J72l0N1j05J02LmJ5j44R8j9R7j15O5N7j4j40j5P3m8N2j08K0N1J45j05k6N6O8
$$ 382 53 14 186 156 207 102 204 207 203 218 74 172 153 250 135 200 257 243 103 88 161 113 165 57 77 128 273 168 142 198 266
9B66k50J08J25o5j60K27j38J08j31J40q6m9O3N6j26k8K4
$$ 266 16 124 249 184 24 251 113 221 90 230 144 95 158 214 88 60 84
-191H4
##PAGE=	F1=7273.27
##FIRST=	25168.397401625570637,	5807.04592319999756,	0.65616017580032348633
##DATA TABLE=	(F2++(Y..Y)), PROFILE
5807B76k6M1j60j0M4P9n6K8j68L91l45P8P2r3K79l90J99j71J13Ql2J08j23J10j28J42j76J84
$$ 276 250 291 131 121 165 244 188 216 48 439 94 172 244 151 430 40 239 68 181 189 157 265 142 252 124 266 90 274
5478B74N6l12L47r0Mj89O1j6JO2j13J78o4J50j08j72J16m3J55L8q3j26J28k39J81l7J5L2j49
$$ 274 330 18 365 275 279 90 151 135 136 198 85 263 199 349 241 69 185 142 297 335 252 126 254 15 196 159 174 206 57
5138E7K67j84o1K13r7M4j00l9K75k94O5o2J06o1K49k26J15k18K96j47l2J66j73J39j01K9j02
$$ 57 324 140 79 292 195 239 139 100 375 81 146 84 190 129 378 152 267 49 345 198 166 332 159 298 197 226 124
4821A24K17j18k06R3J82r6r2J19j18K19k15K33j78J55j66m7J19K3q1Kn9J34N3m0k4j65J41
$$ 124 341 223 17 110 292 196 104 223 105 324 109 342 164 319 153 106 225 248 167 169 110 244 297 257 233 68 209
4504B09n7J25j90K08j5k05J40m5R6l6j04K18k12L1K2j4O1j41J93N8l17K37j53M6L0n9L7Kq2
$$ 209 152 277 87 295 280 75 215 170 266 230 126 344 132 163 185 171 232 91 284 342 25 262 109 155 185 126 163 165 83
4164H3J74n7o5J6J00o1p6J52k50P6K60j00q6K39j61n7n7O2P9k04K13j60J09J46k44J43j36
$$ 83 257 200 135 151 251 190 114 266 16 92 352 252 166 405 244 187 130 192 271 67 280 120 229 375 131 274 138
3847A38J5J58j72P8O3mJ2j5M4k52J74j95K58M7p8O9k65K10q7J08j00j01K63k95K24j16JJ57
$$ 138 153 311 139 217 280 276 288 273 317 65 239 44 302 349 271 340 75 285 198 306 206 105 368 73 297 181 182 339
3518C39R8k95O5K03q8oj41J30J18l63L76J1k01j9J70k10J55p2Q5O1q3o5J28N6k52J75k5R8
$$ 339 437 142 207 410 322 316 175 305 423 60 436 447 246 227 397 187 342 270 355 416 333 268 396 452 200 375 350 448
3190D48O5r5m5lJ19P0j58Q6J24L42m87J60J63j97L38k4Q3R7M67l34O294O10N5774K2450n3839
$$ 448 513 418 373 370 489 559 401 487 611 953 466 626 789 592 930 906 989 1086 1553 1219 7513 8123 63897 86347 32508
2896C2508k8307l17l037O048J653j987m573N32j517p04J444k83o61Q15J992R504R042j0757
$$ 32508 4201 3884 847 6895 8548 6561 1988 2520 1003 299 1743 1460 799 1614 3606 13110 22152 11395
2685A1395r862l97m94j35k12K56j86j7Kj75%J20j16L24l11J63k6j28M7j63K30j70K16k19J92
$$ 11395 1533 1136 642 507 295 551 365 348 350 175 175 295 179 503 192 355 329 201 248 85 315 145 361 142 334
2391C34r2N1j8j6J13Lj55O5l7l7M03M2J14k00lL792J985l799j779k42N2j16K17k54P7K50m2
$$ 334 242 293 275 259 372 375 220 285 248 211 614 656 770 570 567 4359 6344 2545 766 524 576 460 677 423 500 750 708
2075G08L24L092K7l026o17j00l0P2j12L00k80L22m35L99p8j58J03M6Q0j31J12M2k4M8P0r4
$$ 708 1032 4124 4151 1125 508 408 378 450 338 638 358 680 245 644 566 408 511 557 637 506 618 660 636 684 754 660
1769F60K97j52Q2J06J84l40K73JJ22P9K46p8J89O5N38j45M92N85J9J216Q85M141O069N2693
$$ 660 957 805 887 993 1177 837 1110 1111 1233 1312 1558 1480 1669 1734 2272 2127 2619 3204 3223 4439 5324 9465 15534 68227
1488F8227M9644o3338m2005n887j647o20o92p75l96j21l66k32j48j86J04k73J80k41r1k50
$$ 68227 117871 54533 12528 6641 4994 4374 3682 2907 2511 2390 2024 1792 1644 1458 1562 1289 1469 1228 1137 887
1253H87K56k16R0N1l66J10N6p3l5jk41L75l34J58o2n5m0p1J47k0L0k53L80m12J02J21j53M8
$$ 887 1143 927 1017 1068 702 812 868 795 760 759 518 893 559 717 655 600 560 489 636 616 646 393 773 361 463 584 431 479
924D79L2o0J7K58n56L25J7k91L42k69m2K58n3j14J7N2m3P7r9l7m3J42J0j39Q3J21k60J46k0
$$ 479 511 451 468 726 170 495 512 221 563 294 252 510 457 343 360 412 369 446 347 310 267 409 419 280 363 484 224 370 350
584C50p4J68j98J67k82L13k40J43o1p6j01J20J33j10j7M6n0K76l69m9K50r0N8j10R5K5l2j2
$$ 350 276 444 246 413 131 444 204 347 286 210 109 229 362 252 235 281 231 507 138 89 339 249 307 197 292 317 285 273
255B73r8O1k14K62n7L5Q4o1j00q9K05r5L1j03N0M3J39k24oK05M7k92J04J57m4k66K70k26K04
$$ 273 175 236 22 284 227 262 346 285 185 96 301 206 237 134 184 227 366 142 136 341 388 96 200 357 313 47 317 91 295
-85B95k27K45l8j41J36k4l6j26P5
$$ 295 68 313 275 134 270 246 210 84 159
-191A59
##PAGE=	F1=7171.02
##FIRST=	25168.397401625570637,	5807.04592319999756,	0.46187669038772583008
##DATA TABLE=	(F2++(Y..Y)), PROFILE
5807C57K0oj24l7J2Q1rk0k29M67l35J20Jr9L12l89J85j96J83p5j9J67k09J60j38J64j81J73
$$ 357 377 371 247 210 222 303 294 274 45 512 177 297 298 199 511 122 307 111 294 219 200 367 158 318 180 344 163 336
5478C36M8l27L90r7K4k05L7J7l4N8j39K21r9J83j45q9N8PN4J41j11j49J58k38J91j29J39m6
$$ 336 384 57 447 350 374 169 206 223 189 247 108 329 230 413 268 179 237 244 298 439 328 179 337 99 290 161 300 254
5150B54j89L53k15n9K25p4j1p1l3L13l52Pl9J83r0K10j88J01j94K88j47p5J74k63K36j07P1
$$ 254 65 418 203 144 369 295 284 213 180 493 141 148 109 292 202 412 224 325 131 419 272 197 371 108 344 237 308
4833C08j88K68p8k11O3J70r9o7J70j27J67k70L09k00J89j85r1K06n1m4L0n6K7J38r7J2j83
$$ 308 120 388 310 99 162 332 233 166 336 209 376 106 415 215 404 219 128 334 283 239 269 213 240 378 281 293 110
4516A10J18QJ31j87J46j4j59J95o0N8q5j47K15j15J1j8K8P9j88K12O7l31K07q3k4O0m4P3n6
$$ 110 228 236 367 180 326 312 153 348 288 346 261 114 329 214 225 207 235 314 126 338 405 74 281 198 174 234 190 263 207
4176B07m1J97j07p8N1P7m9q3J68k76J18K31j44j33L49j98k8k5mJ31k61K73j89Q2J89k85K33
$$ 207 166 363 256 178 229 306 257 174 342 66 184 415 271 138 487 289 261 236 232 363 102 375 186 268 457 172 405
3859D05j83nJ53j67J28NO3j1k4K8k24J65k13K67N0r0J20l34K65r2J02r6j07K43k48K21j50
$$ 405 222 217 370 203 331 336 399 388 364 392 168 333 120 387 437 347 467 133 398 306 408 312 205 448 200 421 271
3542B71j5K13M9k83P4K10n8k7j21J24J09m98M69L4j84j3J48j31R3p0J77m5q6l2J37L6k38J51
$$ 271 256 469 518 235 309 519 461 434 313 437 546 48 517 551 367 354 502 371 464 394 571 526 440 408 545 581 343 494
3213D94R3r8K69k09P3o6J27P1j03L2J78K96l67KK33m7K72J39K1K54N58m72Q892J182Q2093
$$ 494 587 489 758 549 622 556 683 754 651 683 861 1157 790 792 1025 978 1250 1389 1410 1664 2222 1750 10642 11824 93917
2920I3917L5665p8611m5262J02m584N599K703p24n452J110k927j278J986l13p84J177K906
$$ 93917 129582 50971 5709 5811 1227 6826 9529 8805 3353 4463 1536 258 2244 1931 1147 2324 5230
2720E230J3622J2096j5357j3440n50p09j84k56K57k20l3j5j57k9J33j14L02l01J49m0j01O2
$$ 5230 18852 30948 15591 2151 1601 892 708 452 709 489 456 441 284 255 388 274 576 275 424 384 283 345
2462C45j01J45j29J92k41J80q3Q9j4KQ3m5q6L9J7n2L44m18N23k2J6P777M663p867m043m18
$$ 345 244 389 260 452 211 391 308 397 383 385 468 423 337 376 393 341 685 267 790 768 784 8561 13224 5357 1314 896
2157H96L5j58K56k55N9L11Q3N71O796L43o647j470l52P9M2j66L82l23L81m11K68P4k17J68
$$ 896 931 773 1029 774 833 1144 1227 1798 8594 8937 2290 820 468 547 589 423 805 482 863 452 720 794 577 745
1875G45K5P0j06J59L1lJ07J1j6K73j74J73P4K28k88K48K2J63J26L09o6K83J52N65k1O62P69
$$ 745 770 840 734 893 924 921 1028 1039 1023 1296 1122 1295 1369 1597 1309 1557 1579 1742 1868 2177 2111 2394 2546 3111 3090 3752 4521
1558D521J21J658J274N708R475P4101P1617r0202o0212q468k411m02j094j837k49k79m56l22
$$ 4521 4642 6300 7574 13282 22757 96858 168475 78273 18061 9593 7182 6780 5686 3849 3600 3321 2865 2543
1347B543j19k28Ol94K44k50k06k32K45k37O5J7l58N3O3j01l0J2k70L55k99P6kq3q7n4J42l
$$ 2543 2424 2196 2202 1808 2052 1802 1596 1364 1609 1372 1437 1454 1096 1149 1212 1111 1081 1093 823 1178 879 955 953 870 783 729 871 868
1018H68Nk91M37m09M8J57j81N2l8K1K3J60n08L84n8k85L84l24%K20j03n6K7L5n4J11r7j13
$$ 868 873 582 1019 610 658 815 634 686 648 669 692 852 344 728 670 385 769 445 445 665 562 506 533 568 514 625 528 415
689D15OJ13Pj24J11Q9k73J54rj22J67j69J95l30L65k21O4n5m4j67K23L5m7m1K7J7K15l39q0
$$ 415 421 534 541 417 528 617 344 498 489 367 534 365 560 230 595 374 438 383 339 172 395 430 383 342 369 386 601 262 182
349A82K82q4J8j03R5L3o1%q9N8k03J98JJ8R2j21k6j48K95j06j9r6Q6L3J18l06J5L07K2k98
$$ 182 464 380 398 295 390 423 362 362 273 331 128 326 327 345 437 316 290 142 437 331 312 216 302 335 453 147 162 469 491 193
-3A93P1J86k5l28K63j78J86k98L04K9k14J80p5L8k11J17
$$ 193 264 450 425 97 360 182 368 70 374 403 189 369 294 332 121 238
-191B38
##PAGE=	F1=7068.76
##FIRST=	25168.397401625570637,	5807.04592319999756,	0.39822328090667724609
##DATA TABLE=	(F2++(Y..Y)), PROFILE
5807D19M4l8p6o6k2P1M6m6k73M85k78J36p0q4L22l40J06j79K43j43k9K14k67J94j47J84j85
$$ 419 463 425 349 283 261 332 378 332 59 544 266 402 332 248 570 230 336 157 400 257 228 442 175 369 222 406 221
5490B21J61L8l01L83j03N6k21J2O8p9N7j31K00q5J85j78Rk5P4o9K50j43j45J63k05J79k08
$$ 221 382 420 119 502 399 455 234 246 314 235 292 161 361 276 461 283 292 267 341 272 522 379 234 397 192 371 163
5173A63K38j02k01L76k01o5K16m9o2m8k4L39l83l7kK20q6J22j29Q6j43K36j08j45J79j83J58
$$ 163 401 299 98 474 273 208 424 375 313 265 241 580 197 160 158 378 292 414 285 371 228 464 356 211 390 207 365
4856C65r0R9k24K58l5j90N4J01p8l9K20j29J01l00L56k20K15j87j14K52j00pL2k0r8J83j07
$$ 365 275 374 150 408 373 183 237 338 260 221 441 312 413 113 469 249 464 277 163 415 315 308 340 320 222 405 298
4539B98L0j42O1N0J36j76R3Pj17K14o9K1j28r9J18k9M3j00O8R0k02K18P6k95J20k4p1J12l8
$$ 298 328 186 247 297 433 257 350 357 240 454 385 406 278 179 297 268 311 211 279 369 167 385 461 166 286 262 191 303 265
4199B65P8j17J2K15j38r5Q0M9l3p7J54k63J30J98j65j10L52k12qPl8J37k61K98k16N5K04k92
$$ 265 343 226 238 453 315 220 300 349 316 239 393 130 260 458 293 183 535 323 315 322 284 421 160 458 242 297 501 209
3870B09K97k27rJ62j75J61p4J57l3l3J4j84J50k14K39P0r8J43l71K90o8P2p6j18K12j81K03
$$ 209 506 279 270 432 257 418 344 501 468 435 449 265 415 201 440 510 412 555 184 474 406 478 402 284 496 315 518
3553E18j71k0K37jk45P7K00l4l0j17J08J14m80M14N8j62mJ07m4M8n8K43j56q6J3J37J1k12
$$ 518 347 327 564 563 318 395 595 561 531 414 522 636 156 570 628 466 462 569 525 573 515 758 602 516 529 666 677 465
3225D65J22J88k67M45l07J84j32J33P9n6OK04K40j47j96J97J23K25K40j2L96O18o11J0839
$$ 465 587 775 508 953 646 830 698 831 910 854 860 1064 1304 1157 961 1158 1281 1506 1746 1734 2130 2748 2137 12976
2943A2976J767J03277M7735r8268o0730O49n448M456L623M09n655J750m129j930K071l15q26
$$ 12976 14743 118020 165755 67487 6757 7406 1958 6414 10037 10446 4791 6541 2412 482 2553 2238 1412
2744A412J471L641J6729J4177j8819j5970o73q79k43k58K38k40o9pj24o9J54j11K60k56R7
$$ 1412 2883 6524 23253 37430 18611 2641 1968 1089 846 588 826 586 517 510 386 317 471 360 620 364 461
2497D61m9n2P4m6M6p2J57k08J17n9R8J4J2N5p4l0%P3m9K79m77N76J53OJ2226P544j2396o502
$$ 461 412 360 434 388 434 362 519 311 428 369 467 481 493 548 474 444 444 517 468 747 270 846 999 1005 13231 20775 8379 1877
2168A877o14kj85K77k16RL92K14Q47J0907P57j0681k499n34J42j0k20M55l36M03l50L2L20
$$ 1877 1263 1261 1076 1353 1137 1146 1538 1752 2599 13506 14263 3582 1083 549 691 681 461 916 580 983 633 665 985
1898I85k73J93K3N3o8J89J8J6J55o1Q4K20j64K16O1K48k52K98L1J73J46L47m4L53K47N24J33
$$ 985 712 905 928 981 913 1102 1120 1136 1291 1230 1314 1534 1370 1586 1647 1895 1643 1941 1972 2145 2291 2638 2594 2947 3194 3718 3851
1582C851P57R21K13J960J586O856J2387Q9562Q8710j10297p4130j0495l007L2j387l059l9
$$ 3851 4608 5529 5742 7702 9288 16144 28531 118093 206803 96506 22376 11881 8874 8906 7519 4460 4421
1382D421m08n04l80r2k69p8n04L02k39k91k33K46k37K1j0l36KP0j33j9J2k75L22k41l0O5q7
$$ 4421 4013 3509 3129 3037 2768 2690 2186 2488 2249 1958 1725 1971 1734 1755 1745 1409 1411 1481 1348 1329 1341 1066 1388 1147 1117 1182 1095
1065A095j36m2J27OL0l42M53l81J2J57j85M6r4J03K8L4m04L93j30k40L90l63P2J42j24k8N4
$$ 1095 959 917 1044 1050 1080 738 1191 810 822 979 794 840 746 849 877 911 507 900 770 530 920 557 629 771 647 619 673
748F73Qo0J41j06j43N4M5K2j14J36M3k42J29L8j72J45j28J86l33L75j88ol9k3k01K82n0J4
$$ 673 681 621 762 656 513 567 612 634 520 656 699 457 586 624 452 597 469 655 322 697 509 503 464 441 240 522 472 486
420D86n2LO6J41k52j11K53l5m0q4J01K7q0K4j01P1j51R3N7jJ01j90O4k05L60r5p7r4J23J8
$$ 486 434 437 503 644 392 281 534 499 459 375 476 503 423 447 346 417 266 359 416 415 516 326 390 185 545 450 373 279 402 420
67D20R9l28L9L34j2k84L7K03rl45K18n6J01k74K60R4k60J96r3P8k56J35
$$ 420 519 191 230 564 552 268 305 508 499 154 372 316 417 143 403 497 237 433 340 418 162 297
-191B97
##PAGE=	F1=6966.5
##FIRST=	25168.397401625570637,	5807.04592319999756,	0.40476831793785095215
##DATA TABLE=	(F2++(Y..Y)), PROFILE
5807D41N1n3k2r6m8M6J04m5l14M66j94J25j24n5L01k74J4j23K80j74q2K52k86J93j44K00k00
$$ 441 492 439 417 321 273 319 423 378 64 530 336 461 337 282 583 309 323 200 480 306 224 476 190 383 239 439 239
5490B39J55L7k66L53j01Q2k29j1J22j29P1j16J44m3J72k03J01j13J47j86L37j69j14J38j58
$$ 239 394 431 165 518 417 499 270 259 381 252 323 207 351 308 480 277 378 265 412 226 563 394 280 418 260
5197B60J52k44K81j16j97L43j44p9J81k0r6l8j3L51l84p1K8K42p2K0p1Q1j00J80m5k28J79
$$ 260 412 168 449 333 136 479 335 256 437 417 321 283 270 621 237 166 194 436 364 384 313 394 294 474 429 201 380
4880C80n4L1o3J23k37K13Rj59M9K1m8j5K68j28L4l07L72k33K28j79j09K50j08NK2M2j89J49
$$ 380 326 357 294 417 180 393 402 243 292 313 265 250 518 390 424 117 489 256 484 305 196 446 338 343 365 407 218 367
4551C67o8K3o0%O4J36j60N6L8r1K05p6Mj66k8J1K6J12j96R7R4j93K15R0k55K7J0q3J60l1N9
$$ 367 299 322 262 262 326 462 302 358 396 305 510 434 438 272 244 255 281 393 197 294 388 195 410 500 245 272 282 199 359 328 387
4187C87j66O5K14j35j23R9L3l6m6J09k18J14J76j72m6K85k00KK2m5J16k37L08k24K6J91k75
$$ 387 221 286 500 365 242 341 374 338 292 401 183 297 473 301 255 540 340 342 364 319 435 198 506 282 308 499 224
3870B24L33k60oJ91j96J78j59K58n8k7rj31J28k08J85J04j01J34l57K75k6K6m5j28J77j10
$$ 224 557 297 291 482 286 464 305 563 505 478 469 338 466 258 443 547 446 580 223 498 472 498 453 325 502 392
3565C92J69j66j4K14l2j97Q0J76j9k3j29R1J35m33L38O8j32PN5L4K9m3K79k55r0O9J30j8j83
$$ 392 561 395 381 595 563 366 446 622 603 580 451 542 677 244 582 650 518 525 580 614 643 600 879 624 534 603 733 715 532
3225E32J01K39l72N50l65K66j88J29J01l4J5J98J87R8k79rK64K00K56OM71O43p17J1656K238
$$ 532 633 872 500 1050 685 951 763 892 993 959 974 1172 1359 1457 1178 1169 1433 1633 1889 1895 2366 3009 2292 13948 16186
2931A6186J14378N5992j08191p1273J208n696L111M273J165n094K305m871k627J730k84p85
$$ 16186 130564 186556 78365 7092 8300 2604 5715 9988 11153 6059 8364 3493 866 2596 2312 1527
2744A527J633M021J8065J4781k0297j6853p25r67k95k18K01k38j19K2q4j09J72j00K04j99
$$ 1527 3160 7181 25246 40027 19730 2877 2152 1185 890 672 873 635 516 538 454 345 517 417 621 422
2509D22M1n6%R0j2m8qJ17j42K0j1Q0N5J4K3p5J5n4J26l1K10j64L04K87k3J6194J0026j6433
$$ 422 463 407 407 497 485 437 429 546 404 424 413 493 548 562 585 510 525 471 597 566 776 612 916 1203 1180 17374 27400 10967
2180A0967q630p89n2j98K85j57n3M74L14J105J4583J179j4301l494m98M7o4k73N03l26L90
$$ 10967 2337 1548 1496 1298 1583 1426 1373 1847 2161 3266 17849 19028 4727 1233 735 782 718 445 948 622 1012
1934A012k53k50N99l24J68M3L0l3K03PL3J75j28J97J28j17K07O7K46k30L59L9J61J38L52k0
$$ 1012 759 509 1108 784 952 995 1025 992 1195 1202 1235 1410 1282 1479 1607 1490 1697 1764 2010 1780 2139 2178 2339 2477 2829 2809
1628B809L89L26M22K79P65J000K73K052J748P308J4152R5209R6916j18734q0451j1498l298
$$ 2809 3198 3524 3946 4225 4990 5990 6263 8315 10063 17371 31523 126732 223648 104914 24463 12965 9667
1429I667O03j482m206K00m81m94l87r1k90j32n66L32k05l33k47K56k15l4k9k99k9P4j61mm
$$ 9667 10270 8788 4582 4782 4301 3807 3420 3329 3039 2907 2341 2673 2468 2135 1888 2144 1929 1895 1866 1567 1538 1612 1451 1447 1443
1136A443k55K82j64j42J27p4j75k9J04%R6l89M24l38MJ25j69M3j38J72L8r7k72L56j86j66
$$ 1443 1188 1470 1306 1164 1291 1217 1042 1013 1117 1117 1213 824 1248 910 914 1039 870 913 775 947 985 888 616 972 786 620
830F20L65l81J53M3j15k7Q7j6o4J50j15j22R2m2M3j01J48pj73P4R2k11J23q5J49k96L40j39
$$ 620 985 604 757 800 685 658 745 729 665 815 700 578 670 628 671 570 718 711 538 612 704 493 616 531 680 384 724 585
502E85o3j1k2j85K76j05O2m6k7R4O4j22j34J68M0j03n2J11Qq2L7j12Q3j02kJ16l1J17k54J60
$$ 585 522 511 489 304 580 475 537 491 464 558 622 500 366 534 574 471 419 530 538 456 493 381 464 362 360 476 445 562 308 468
150D68k67L99p5j19j01J54%R1l22P5L05n2k49OK04Nl19J48P6%j96J65J38k70J83q0Q3k58J29
$$ 468 201 600 525 406 305 459 459 550 228 303 608 556 307 313 517 522 203 351 427 427 231 396 534 264 447 367 450 192 321
-191C21
##PAGE=	F1=6864.24
##FIRST=	25168.397401625570637,	5807.04592319999756,	0.351299285888671875
##DATA TABLE=	(F2++(Y..Y)), PROFILE
5807D13M6n4L3j21n7%J60j6l41M13j08R2j45k7K50j97p0m1K85j54j82K83k58J41j15K03k17
$$ 413 459 405 438 317 260 260 420 404 63 476 368 460 315 288 538 341 271 230 515 361 179 462 204 345 230 433 216
5490B16J51M6k32L13q9Q8k23k8J61j70R9j06P3J2J55k17J70j89K10k65L72j77o3Q7j07J17
$$ 216 367 413 181 494 405 493 270 242 403 233 332 226 299 311 466 249 419 230 440 175 547 370 307 394 287 404
5185D04k23K53q5j86K68n8r8J25J4j05m3lL46l56r9M6K59n9o8l7R0p1J34K3l01J67O2p9l4
$$ 404 181 434 349 163 431 373 275 400 414 309 266 263 609 253 154 200 459 400 332 295 385 314 448 471 170 337 399 320 286
4845B86J47k45J55N0j23L3l6k3JL08j22k5k96L58k36K28j65p8K02o7j6PJ13k20L8QrM7n4N1
$$ 286 433 188 343 393 270 303 267 244 245 553 431 406 110 468 232 460 295 217 419 352 336 343 456 236 274 282 273 320 266 317
4492C17J29j38L5O8p7J70q4J7j95K4n8M2J99k82J08R3j73K11J05k09n9Ro1J88j7K8j96J10
$$ 317 446 308 343 411 334 504 420 437 242 266 208 250 449 167 275 368 195 406 511 302 243 252 191 379 362 390 194 304
4164C04J84r5j65J06M0o2J0L7j41O4J75j76K1J98j67QJ4m2Q9j98K99k01j0J61k45L40k74%
$$ 304 488 393 228 334 374 312 322 359 218 282 457 281 302 500 333 341 355 313 402 204 503 302 292 453 208 548 274 274
3835B74K32k23J82k32L39q5jm2p0R8j92J16J36r4R2k84K19K3k2j4j30J43m7J23j37JJ51m1
$$ 274 506 283 465 233 572 487 486 444 374 472 280 396 532 438 530 246 465 488 466 452 322 465 418 541 404 405 556 515
3506E15j48Q3J44j3j8j44P9J60l71K61O2r7J7jR3L1l0K84l23j01J31J17m9j54R3K43m03N62
$$ 515 367 450 594 581 563 419 498 658 287 548 610 513 530 529 622 653 623 907 584 483 614 731 682 528 621 864 461 1023
3178A023l63L00k26J11J40m4N5J63J45L19j69l60L06J93J93O9M55O32p60J1129K488J12724
$$ 1023 660 960 734 845 985 941 996 1159 1304 1623 1454 1094 1400 1593 1786 1855 2310 2942 2182 13311 15799 128523
2920A28523N8496j05971p4410J636n310J843M578J460l932K640n018l283J113k24o78J625
$$ 128523 187019 81048 6638 8274 2964 4807 9385 10845 6913 9553 4535 1252 2365 2141 1463 3088
2732C088L946J7290J3751j9410j5872o83r55l26j44J49k13j65O3m9j38J76p0J37j46Lo5M1
$$ 3088 7034 24324 38075 18665 2793 2110 1155 829 685 834 621 456 519 470 332 508 438 575 429 432 367 408
2474D08J14pj21N4P8o2r3N4M9R3Rrn4N3j14J68rJ46Q6J09L71o1J8749J1542j9032r934q97
$$ 408 522 515 394 448 526 464 371 425 474 567 576 567 513 566 452 620 611 757 843 952 1323 1262 20011 31553 12521 2587 1690
2157A690j07j98K81r5j06N31L54J295J6965J508j6664m223k24j96j05l11M99k99L47j24m17
$$ 1690 1583 1385 1666 1571 1465 1996 2350 3645 20610 22118 5454 1231 1007 811 706 395 894 595 942 818 401
1910D01P41l68J00Q3Jj3K07lM8J57j67L02Lm1J54Q8K28k22L88N0J36J07L22kL88L66K82L81
$$ 401 1142 774 874 957 958 945 1152 1149 1197 1354 1187 1489 1492 1451 1605 1693 1921 1699 2087 2137 2273 2380 2702 2700 3088 3454 3736 4117
1582D117O93R82K96J904J721O952J4368Q9519R4254j13361p7626j1239l213J181j346n027
$$ 4117 4810 5792 6088 7992 9713 16665 31033 120552 214806 101445 23819 12580 9367 10548 9202 4175
1394D175M24m88m23l48j10k79j54n56L19j51l27k65K70j75q8l8k50l4P0j77J3l4k13K38p5
$$ 4175 4599 4111 3688 3340 3230 2951 2797 2241 2560 2409 2082 1817 2087 1912 1824 1786 1536 1502 1572 1395 1408 1374 1161 1399 1324
1100A324k42J73n2j96j1P5j7J79m13L55k89K5P4j46O0j78K15N5k08j39K83k12p9L16l75K17
$$ 1324 1082 1255 1203 1007 996 1071 1054 1233 820 1175 886 911 985 839 899 721 936 991 783 644 927 715 636 952 577 794
795G94n4q4l7J09k7o6J32j14o2J12j23O0q5J43m9q3LJ33k24J04m4R4k31K67p5j07K9m2j23
$$ 794 740 656 619 728 701 635 767 653 591 703 580 640 555 698 649 566 569 702 478 582 538 632 401 668 593 486 515 473 350
455C50K09j29R4k3o0R9nK5j42N0J18j63oJ20j6o4K5j10Q3n6q0J77p5J37k93K46l24M05n9j32
$$ 350 559 430 524 501 441 540 535 560 418 468 586 423 417 537 521 457 482 372 455 399 319 496 421 558 265 511 187 592 533 401
103D01j13J71j9J00l16J28K40r1j98j9J91J7k62P1J80q8r3N8J47k40J42m0N9k25J03
$$ 401 288 459 440 540 224 352 592 501 303 284 475 492 230 301 481 393 300 358 505 265 407 367 426 201 304
-191C04
##PAGE=	F1=6761.98
##FIRST=	25168.397401625570637,	5807.04592319999756,	0.26467046141624450684
##DATA TABLE=	(F2++(Y..Y)), PROFILE
5807C36L9m8Q7j41m4o0K03K9l21L16l9M4j20k1J84j18j29M1K62q5l21L11j89L6n3J91k20J43
$$ 336 375 327 414 273 229 169 372 401 80 396 357 401 281 260 444 326 197 238 500 415 94 405 216 252 199 390 170 313
5478C13N6k06K76o9O4j92m4J72j89J39j08QO3J35k13K01k35K45k82L42j67pL0o6Q5j49J58
$$ 313 369 163 439 370 434 242 198 370 181 320 212 220 283 418 205 406 171 416 134 476 309 302 332 266 351 202 360
5161C60j7j74J74L4j18O0M8q9n5NL19l03j23N2K77n8j18l8J09o0J06P8l43J47J33j44j4J78
$$ 360 343 169 343 377 259 319 367 278 223 228 547 244 121 173 450 392 274 236 345 285 391 469 126 273 406 262 248 426
4833D26k49Q8Q8q9km6j5NL35j13o5k73L18k30K20j49k6J16J6n9rJ70j99j03R5n6J54r6K4J10
$$ 426 177 265 353 264 262 216 201 206 541 428 363 90 408 178 398 249 223 339 355 296 287 457 258 155 250 194 348 252 276 386
4481C86j05K1Q9p0J21r9O4k08M1p9K4K82l38R6R0j52K10J15j52j30k7j2J90lOk08J39J27k6
$$ 386 281 302 391 321 442 343 407 199 240 161 185 467 129 225 315 163 373 488 336 206 179 167 357 354 360 152 291 418 392
4140C92k13J01P2j08P9m9m0j7J97j87Q0J15j24J8on1P0j55K72j44n1J25k09L14k63RK67k46
$$ 392 179 280 352 244 323 274 234 217 414 227 307 422 298 316 310 259 329 174 446 302 251 376 167 481 218 227 494 248
3812B48J76k71L74j10M3q1j0O2j70N1J49p1K6j67J37O6o3J5j25J12KP3r0J4O7l0j04Q5J08
$$ 248 424 153 527 417 460 379 369 431 261 312 461 390 416 249 386 452 389 404 279 391 393 466 376 390 457 427 323 408 516
3471E16j0k3j51P6J71l05K00M0o5L0n4J32M1k1K64l44j25J93R8p9j30J00K04l62M82l00K83
$$ 516 506 483 332 408 579 274 474 514 449 479 425 557 598 577 841 497 372 565 663 584 454 554 758 396 878 578 861
3154H61k39P4J95q5J14J09J13M83J02p18J88J91Q7J39L67N82p21R376K462R8761N4647r2177
$$ 861 622 696 891 806 920 1029 1142 1625 1727 1009 1197 1388 1475 1614 1981 2563 1842 11218 13680 112441 167088 74911
2896G4911o9392J816m377Q24M543J381k541K682m563l748L81j43n35J444L432J4598J1325
$$ 74911 5519 7335 2958 3782 8325 9706 7165 9847 5284 1536 1917 1774 1239 2683 6115 20713 32038
2697C2038j6370j3268n46q43l39m3Q8j73j91J05k9j49J62j5N9j00j2p8O3J45k3j71J02N2J1
$$ 32038 15668 2400 1854 1011 672 629 717 544 353 458 429 280 442 427 486 386 374 296 359 504 481 310 412 464 475
2403D75j98J25J8J11%l0k7Q5j65J89J0Q8K35oM12r3J9252J1735j9549j0102r06j59j84K68
$$ 475 277 402 420 531 531 501 474 559 394 583 593 681 916 910 1322 1229 20481 32216 12667 2565 1659 1500 1316 1584
2121A584m7j41N45L27J370J7449J654j7161m499J91m93j17l14M17k56K83J7k86N61l97NJ32
$$ 1584 1537 1396 1941 2268 3638 21087 22741 5580 1081 1272 779 662 348 765 509 792 809 523 1084 687 692 824
1863H24l1j3K09j6O3J00j63L76j39N4P1J14K04k24L68N5J11O1K60J1L55L53J31M18N64Q65
$$ 824 793 780 989 973 1036 1136 973 1349 1210 1264 1335 1449 1653 1429 1797 1852 1963 2024 2284 2295 2650 3003 3134 3552 4116 4981
1558D981K90J537J517N874J3010P3831Q1396r5469o6354r788k776J626j011n330N88m38l02
$$ 4981 5271 6808 8325 14199 27209 101040 182436 86967 20613 10825 8049 9675 8664 3334 3922 3484 3182
1359C182k84j21k44j45m74K59q1k84k73K79j26j26m3j85k3N7j69K2o9j56J92J3l12J95k7j99
$$ 3182 2898 2777 2533 2388 1914 2173 2092 1808 1535 1814 1688 1562 1519 1334 1311 1368 1199 1221 1152 996 1188 1201 889 1084 1057 858
1053H58J6M5m3K54l99K53k37O8K2j31J05k24K30P9k77l3J92k03kK58l46K49j33l9m5J08j7
$$ 858 874 919 876 1130 731 984 747 815 837 706 811 587 817 896 619 586 778 575 573 831 485 734 601 562 517 625 608
736F08p1R0r5J1J15j73O3o7J21p5Rp0J50k05Q9pL2j54J74lj40P9q1k7R8j31J11J3r6Q9n9J63
$$ 608 537 627 532 543 658 485 548 481 602 527 536 466 616 411 500 493 525 371 545 542 402 481 400 373 471 340 451 464 368 457 398 561
361E61j35p0J77k14N6J20l8l2rr0O6j6j39K35j23J48k82K97l50L62n3j10j29J69l3J21l15
$$ 561 426 356 533 319 375 495 457 425 416 326 392 376 237 472 349 497 215 512 162 524 471 361 232 401 368 489 174
44A74J90J52j21j33m2J70K4j83LK26j36Rl0J19j79P9J9J6j72O8
$$ 174 364 516 395 262 220 390 414 231 234 460 324 333 303 422 243 322 341 357 185 253
-191B53
##PAGE=	F1=6659.73
##FIRST=	25168.397401625570637,	5807.04592319999756,	0.14798468351364135742
##DATA TABLE=	(F2++(Y..Y)), PROFILE
5807B25L3l6J32j55rj09K15P3k51J91j%n2n6J21m7j43R3K14K1m44L03r4r5K7J60j76J22M9
$$ 225 258 222 354 199 190 81 296 369 118 309 308 308 256 200 321 274 131 224 438 459 15 318 224 129 156 316 140 262 311
5467C11j92K49m3Qj36o1J50j69J75j22l7J01J09j86J87k42K41k33K56j44L8j3m3O8m4J9O7
$$ 311 119 368 325 333 197 136 286 117 292 170 133 234 343 157 344 102 343 110 366 222 260 247 204 272 228 247 314
5150C14j59Q2J09j37NP6n3o8J3K64k35j37M7K93o8j22p2J31o1R2J06l33J21J45j58nK07k33
$$ 314 155 237 346 209 214 290 237 169 182 446 211 74 121 414 346 224 152 283 222 314 420 87 208 353 195 190 397 164
4821A64J2J15n9n9mk0nL39r9p7k39K54k18K07j31L4K1J16j05k7J96j56j64J17j08K37j16j5
$$ 164 176 291 232 173 169 149 144 483 384 307 68 322 104 311 180 214 235 351 246 219 415 259 95 212 104 341 225 210
4492B10Q3o0PJ01o6O8j21J32j83Mn8j0L37l36M6Q8j35K07J19q5j75q1M5J65MOk04J46N0N3
$$ 210 293 233 240 341 275 343 222 354 171 175 117 107 444 108 154 242 107 314 433 348 173 92 137 302 306 312 108 254 304 357
4140C57k49Q5J21j62J47j34O6j13K34k03J25M5q4L5j7q7O7j13K24n9r2R9j80K59k24K1K75
$$ 357 108 193 314 152 299 165 231 118 352 149 274 319 235 270 253 166 233 120 344 285 193 292 112 371 147 168 443
3823D43k55J65k59L45j27R6j21L9K5j43J3J26l2n2l4N5R2r0M3j19Q1L7L1l9J8j0j3o6Q2P5
$$ 443 188 353 94 439 312 408 287 326 351 208 221 347 315 263 229 284 376 286 329 210 291 328 359 320 338 328 315 249 331 406
3471D06ol7j43Q4J48k30J59Lm5M9r7J52M4j8K28l08j65K47P5j06j07J11J43k73L36j91K19
$$ 406 400 363 220 304 452 222 381 384 339 388 291 443 487 469 697 389 224 471 546 440 333 444 587 314 650 459 678
3154F78k17J8K56j44J70N1R1N71M30r32r2J82k1J84K41M99o08O815K171P5902M5370p0164
$$ 678 461 479 735 591 761 812 903 1474 1904 972 880 1062 1041 1225 1466 1965 1357 8172 10343 86245 131615 61451
2896F1451n7428J685l094J23M233J145j367K434l637l899k89n8l85J126K602J0652Q067j1919
$$ 61451 4023 5708 2614 2737 6970 8115 6748 9182 5545 1646 1357 1299 914 2040 4642 15294 23361 11442
2685A1442r657l42o50l40O9K3j27j79J33k5j46J33N8k5n9qr6O6J73l8k07J34M2O1k67J76L
$$ 11442 1785 1443 793 453 522 545 418 239 372 347 201 334 392 367 308 300 204 270 443 405 198 332 374 435 168 344 347
2368C47J02j4l1rJ10j90J85J5L8K91o2M13j13J7566J0573j7842r108q04k03j60K53k3j53N05
$$ 347 449 435 404 395 505 315 500 515 553 844 782 1195 1082 18648 29221 11379 2271 1467 1264 1104 1357 1334 1181 1686
2086A686K45J305J5883J580j5630m234O01p41r5k70K58j98K07J48k5K25l98r7J76n9l5K24
$$ 1686 1931 3236 19119 20699 5069 835 1436 695 600 330 588 390 597 745 720 945 547 450 626 567 532 756
1828G56m0P8J3j11M05k72J43j6J34J77k30L10M3R7J0J77J8L01K92lL84M12O72K69J027J193
$$ 756 716 794 807 696 1101 829 972 956 1090 1267 1037 1347 1390 1487 1497 1674 1692 1993 2285 2282 2666 3078 3750 4019 5046 6239
1523F239M324J0444N1920O1446o9382m9370p490k097J832n69n039O60l55j55k18r9j98j14
$$ 6239 10563 21007 72927 134373 64991 15621 8131 6034 7866 7297 2258 2918 2563 2408 2190 2091 1893 1779
1312A779l40J63mk21k63K76p7j44l8j12pL5j31J0r2r7J46Q7l39J88kj86M5K2p1K96l37J30
$$ 1779 1439 1602 1598 1377 1114 1390 1313 1169 1131 1019 1012 1047 916 926 834 737 883 970 631 819 817 631 676 698 627 923 586 716
983G16j83J19j8j32J74k73K17J01k91L2J01j61M8J99k96K43j83Ol6P5J2p6L3n8P5J03j80N0
$$ 716 533 652 634 502 676 403 620 721 430 462 563 402 450 649 353 596 413 419 383 458 470 394 427 369 444 547 367 417
654D17m8Q5p9P8j23J37j53O9K7k1q5Q5N9j55J24j21P5k9j24J17N1j25P1r5K67j11j59J94k51
$$ 417 369 454 375 453 330 467 314 383 410 389 304 389 448 293 417 296 371 342 218 335 386 261 332 237 504 393 234 428 177
314A77J34J03n0Kn1n8L5J6j78K82j65J36j98K86l00K45o1o1j43J46l9J46l12K44O1j37n9o8
$$ 177 311 414 364 366 315 257 292 308 130 412 247 383 185 471 171 416 355 294 151 297 258 404 92 336 397 260 201 133
-15A33J48K4r7m3K03j28Q2p5O4j03JQ6l3j16L7
$$ 133 281 305 208 165 368 240 322 247 311 208 209 295 262 146 183
-191A83
##PAGE=	F1=6557.47
##FIRST=	25168.397401625570637,	5807.04592319999756,	0.071405716240406036377
##DATA TABLE=	(F2++(Y..Y)), PROFILE
5807A04L0j8J61j64M5o0J14J02j60P6MpK5j32P6Qq6P2J58J38l56Q9Qj29J5J16q0R2J4j78K24
$$ 104 134 116 277 113 158 98 212 314 154 230 234 227 252 120 196 204 118 190 348 486 130 219 227 98 113 229 149 241 255 77 301
5443C01k0o3o5q7J00o9J62j48m1J05P9j36J32k11K01j44J45j16O2k7k7N9N8j24J38j37J6J44
$$ 301 281 218 153 66 166 97 259 111 70 175 254 118 250 39 240 96 241 125 187 160 133 192 250 126 264 127 143 287
5115B87j51k8R6j2o6K0J78j60j34L9K95q5r6r9J32o9Q3J04k53Q7R4j23j1K26j89p2J26l0j33
$$ 287 136 108 204 192 126 146 324 164 30 69 364 279 183 84 216 147 230 334 81 168 262 139 128 354 165 93 219 189 56
4774E6P3k9k3L14p8o3j82J58k04J96j11Q6l0J78j34l9J73j11p5K2j54K82j08o3M8jj3J05o0
$$ 56 129 100 77 391 313 250 68 226 22 218 107 193 163 341 207 168 341 230 155 177 23 305 197 134 182 181 168 273 213
4434B13J8j43K03j11q2j0n1L53k70m4R1j25J97J17j7j91n6K7J15qL3j84J26l1J23k51O9J58
$$ 213 231 88 291 180 98 88 37 390 120 76 167 42 239 356 339 148 92 119 234 226 259 75 201 170 293 42 111 269
4105B69k04J92j97J57j95K62j97J36j3o0O0Kj59Q9q0J57L5j16R2j72J84j48K9K37k41J51j93
$$ 269 65 257 60 217 22 284 87 223 210 150 210 212 53 142 62 219 254 138 230 58 242 94 123 360 119 270 77
3788G7K52j27J38j53P4qj17K0N9K5j32Q0nJ02j08Q6j26M7O1PKNm9j2k7O4N3Nn4j11R4P7j17
$$ 77 329 202 340 187 261 253 136 156 215 240 108 188 183 285 177 263 137 184 245 252 254 259 210 198 171 235 288 293 239 128 222 299 182
3401A82J17m8m4P2j26J61K7j6J85k19k14K80M9j24p5J09P8j66J63n6J20j64m5L09k09K08j
$$ 182 299 251 207 279 153 314 341 325 510 291 77 357 406 282 207 316 394 228 391 335 455 291 246 555 346 554 553
3084E53Q4N71O99r50m30J62r1J77J18L89m42M024J698M9429L2819m4994m1279J224j723k67
$$ 553 637 1208 1907 957 527 689 598 775 893 1282 840 4864 6562 55991 88810 43816 2537 3761 2038 1771
2849A771L737R59p27J970k475l680p44J2k49P27J653O369M686p084n841j16m13l41J83l5r4
$$ 1771 5508 6467 5740 7710 5235 1555 811 823 574 1301 2954 9323 14009 6925 1084 968 555 214 397 362 268
2603B68j20J33k5j37R0J35j06j2oj12N4J87l1k34J47M2Q2k62J70OP3l1rj4J23j74J59jpK85
$$ 268 148 281 256 119 209 344 238 226 220 108 162 349 318 84 231 273 355 93 263 269 342 311 302 288 411 237 396 395 388 673
2251F73q9L89j20J4099Q355j4328p211o06k31j32K35k0j44M13J36J110J2634J309j2429l452
$$ 673 584 973 853 14952 23307 8979 1768 1162 931 799 1034 1014 870 1283 1419 2529 15163 16472 4043 591
2016E91Q51q72m5j93P4j38J34K40J80p2l61j82K00p7p2K56q0R6q7k1L82l65J99q3J37J57k35
$$ 591 1442 570 525 332 406 268 402 642 822 750 389 207 407 330 258 514 434 530 443 422 804 439 638 555 692 849 614
1699F14K38OJ06m7R3K2K38J97r2K91K68M45K48M78Q28K644P304K8813L8941m1082l0567m866
$$ 614 852 858 964 917 1010 1032 1270 1467 1375 1666 1934 2379 2627 3105 3933 6577 13881 42694 81635 40553 9986 5120
1441E120j334J761j34m221O27k65j2j66m1j53p2j91N1Q0j67k27K56l8j38k7l5kPo3k9r3m2
$$ 5120 3786 5547 5413 1192 1819 1554 1542 1376 1335 1182 1110 919 970 1050 883 656 912 874 736 709 674 672 679 616 587 494 452
1124D52R9J35l16J49K3j62O6J0r4K94k34Jj22J62l5j43K44l22J88J11k48N4K1r3N8J44k30
$$ 452 551 686 370 519 542 380 446 456 362 656 422 423 301 463 428 285 529 207 395 506 258 312 333 240 298 442 212
807B12K13k10M4j0J8N2p8k7qJ12P8j40K7l4L5n7J10j37R0p5L7O1m4m9K2R7j44J43j35J47j42
$$ 212 425 215 259 249 267 319 241 214 206 318 396 256 283 249 284 227 337 200 290 215 252 313 269 220 242 339 195 338 203 350 208
443B08j18J11P9j37N0j13L26p4j68J37k67K28N1n0K6p5l4ML9j85K92j75P8m8K07j72P3o7j0
$$ 208 90 201 280 143 193 80 406 332 164 301 34 262 313 263 289 214 180 184 223 38 330 155 233 185 392 220 293 226 216
103B16j49J03l2J60k69K50j4j35J0j01J32J8j3o5J14n6J06o8Mm0p8J52p8p4K4
$$ 216 67 170 138 298 29 279 265 130 140 39 171 189 176 111 225 169 275 207 211 171 93 245 167 93 117
-191A17
##PAGE=	F1=6455.21
##FIRST=	25168.397401625570637,	5807.04592319999756,	0.16923415660858154297
##DATA TABLE=	(F2++(Y..Y)), PROFILE
5807A8OL0J46j62J04J8j0R8p8pqM9N6k11M2M6RJJ11K34k63j01R4j7j23P7JQ5l3j28J66oj13
$$ 18 24 54 200 38 142 160 150 248 170 163 155 204 260 49 91 137 146 147 258 492 229 128 222 205 82 159 160 245 212 84 250 244 131
5420A31j5j01K8J00Q9j74QN4M6p1N6j18J07n3M5p1L8mK8J4J21j93J34r8jJ14j56l3J10J5m4
$$ 131 116 15 43 143 232 58 66 120 166 95 151 33 140 87 132 61 99 95 123 137 258 65 199 101 100 214 58 25 135 150 106
5056A06K7P2r5j01N9K43r3p5n5P8p3O3P3j29O1J3n1l6K15j27j31J07mp0J4k4m5K56m2l0j21
$$ 106 133 205 110 9 68 311 218 143 88 166 93 156 229 100 161 174 123 87 302 175 44 151 147 77 91 67 22 278 236 206 85
4692H5N3q4Q7q4J06K3J36j37l8J10q0L2n8j19K19p2j20J6O2l5J01m5k8p3J74k0j63L9p7L07
$$ 85 138 54 141 57 163 186 322 185 147 257 177 209 151 32 251 179 59 75 137 102 203 158 130 57 231 211 48 87 10 317
4340C17j72j08P2p1J22J09M0j76M4n2N3m4P7j46P8j02J68j62N8J21j94J76j52J42j01J26j11
$$ 317 145 37 109 38 160 269 309 133 177 125 178 134 211 65 143 41 209 47 105 226 32 208 56 198 97 223 112
4023A12N9n3o4Q9M8j35M4n0M5J22r8Q4j83J00j4jJ50j92J37j05J23j01J53j78J03l0r9P2k9
$$ 112 171 118 54 143 191 56 100 50 95 217 119 203 20 120 106 105 255 63 200 95 218 117 270 92 195 165 66 138 109
3683A09Q4j41Q3k8J10j33J42j48RQ5KJ9k3j6o1K4K5M8K8n8m8O9nM0M1j17o3R9j36J60j0qJ37
$$ 109 193 52 135 107 217 84 226 78 87 172 174 193 170 154 93 117 142 190 218 160 112 181 176 216 257 140 77 176 40 200 190 182 319
3295C19r9j44J71K8j35pO2K6p2QQ0Jq6p4L12k66K21l9Q8M88Q29q18o67J32q7J14KK65k53J568
$$ 319 220 76 247 275 140 133 195 221 149 157 237 238 152 78 390 124 345 306 394 882 1711 893 226 358 271 385 387 652 399 1967
2943A967J165K4874J9699k1886k4347M30n27m08L129Q98o50J411j341l128q88L6j25L06P88
$$ 1967 3132 28006 47705 25819 1472 1902 1375 967 4096 4994 4344 5755 4414 1286 398 434 309 615 1403
2720A403K647J825k869k562P7j68l40K74n6j07j8R9j0j06J6J88j72M9k1j16M0J63J2j62O0
$$ 1403 4050 5875 3006 444 521 353 13 287 231 124 106 205 195 89 105 293 121 170 149 33 73 236 248 86 146
2427A46L3Q2j56P0K2M5n5K9m2J21j19J30m7n2K57j07L52j18R672N619r838m876l54k38j10
$$ 146 179 261 105 175 197 242 187 216 174 295 176 306 259 207 464 357 709 591 10263 15882 6044 1168 814 576 466
2133D66K19l5j16K84L2Q24Q486R20q327k290Q21q65J8r7p2j02P9K71K61k41k82j88J44q4j13
$$ 466 685 650 534 818 850 1674 10160 11080 2753 463 1284 419 437 340 268 166 245 516 777 536 254 66 210 126 13
1840A3L11j43J19j81R0L11l45J55j14J18J42k27J81o1J45j15K9L1J74R1r7J42J45K32K34M
$$ 13 324 181 300 119 209 520 175 330 216 334 476 249 430 369 514 399 428 459 633 724 627 769 914 1146 1380 1384
1535A384N02J157M320R287J8403j6372j3817k446o49J454J91l035M71j89R5j31M4j18l1o1
$$ 1384 1886 3043 7363 16650 35053 18681 4864 2418 1769 3223 3414 379 850 661 756 625 669 551 520 459
1300D59n8J77j50j72K21j6j10mL2j5k6L0r6o2pN6J49k35P4M4j29O4J4j05K48j05j05o7J81
$$ 459 401 578 428 256 477 461 351 347 379 364 338 368 272 210 203 259 408 173 247 291 162 226 240 135 383 278 173 106 287
959B87k7r0K29l46J49R2j41K6m2qK6R3j55J84k16O1K5m9Q7n9r2N1J09M3o7Rk1l1j6J00q3l
$$ 287 260 170 399 53 202 294 153 179 137 129 155 248 93 277 61 122 147 98 185 126 34 85 194 237 170 179 158 127 111 211 128 125
584A25J1rR7k0n4j4J04r1J06q8J50k18j8nQ5j23L1k2K44k6q3Qo0J25m1m3L3n9l0j7O2n9J42
$$ 125 136 127 224 204 150 136 240 149 255 167 317 99 81 76 161 38 69 47 291 265 182 190 130 255 214 171 204 145 115 98 160 101 243
197B43j09o4J25R2k2q2l1j0j20L3NJ25r8J21m6q8K7n9L9J6N2n9k6P1P1k1k6j9j23J84r5o6
$$ 243 134 70 195 287 265 183 152 142 22 55 60 185 87 208 162 74 101 42 81 97 149 90 64 135 206 185 159 140 17 201 106 40
-179D0L4
$$ 40 74
-191G4
##PAGE=	F1=6352.95
##FIRST=	25168.397401625570637,	5807.04592319999756,	0.12345931679010391235
##DATA TABLE=	(F2++(Y..Y)), PROFILE
5807H1k4J5O6q9R4M7n8N4k5n6j5J33L7j86n7P0P3n0R4K79j85k28J40P8k15O4PR9o5o6J01j
$$ 81 57 72 138 49 143 190 132 186 161 105 90 223 260 74 17 87 160 110 204 483 298 70 210 288 73 137 144 243 178 112 213 212
5431B12r5l2j3QJ14K2j72L8oK2nj6PK3k8oK9m0PJ15p3J36j34K0m0J3L7q3l5P8RjK1j7n7m7
$$ 212 117 85 72 80 194 216 44 82 76 98 93 77 84 107 79 73 102 62 69 184 111 247 113 133 93 106 143 60 25 103 112 111 132 115 58 11
5009A1Q8J61p1r3K1K9n6J7J9j3M9k6Kn9J69p2j19N3NP1j36Om6J53J8mq4j7L4om9P4J15M8j25
$$ 11 99 260 189 96 117 146 90 107 126 113 162 136 138 79 248 176 57 110 115 186 50 56 10 163 181 177 93 76 110 104 55 129 244 292 167
4598A67k8M3o9J06q2p9J34j9j71M6N2l1P7j6p4P7N9L8j75N3q6K15p7p7%JRR4P7j34J20j06
$$ 167 139 182 113 219 137 58 192 173 2 48 100 69 146 130 56 133 192 230 55 108 22 237 160 83 83 84 93 187 264 130 250 144
4222A44Lr0J11r9K0l1O3n4Q1L6j35J07m8P7k0J0pl3o0l3L9R0l1k3l9p0J72m6O3j87L1J13n2
$$ 144 147 57 168 69 89 58 121 67 148 184 49 156 108 185 165 175 168 135 75 42 81 171 140 117 78 8 180 134 197 10 41 154 102
3835A02M3p4R5l8Jn0J34j98J44l6p6R4m2Q3o3l2k1J43j54J47j41j6R1lJ1m3N9j46Q6l0O5N5
$$ 102 145 71 166 128 129 79 213 15 159 123 47 141 99 182 119 87 66 209 55 202 61 45 136 133 144 101 160 14 100 70 135 190
3460A90l9j2L0J8R8k6j83l0N0o2Q9n6K3O9J4k0PK3j43J02l8mj5n7J61j16rN7J48k32J40m5
$$ 190 151 139 169 187 285 259 76 46 96 34 123 67 90 159 173 153 160 183 40 142 104 100 85 28 189 73 64 121 269 37 177 132
3084A32Q6L35P99o11o27Q5K2Mj86J44l5p0O89O448Q369m758r727o46L14l87K451Q64q59Q82
$$ 132 218 553 1352 741 114 199 221 225 39 183 148 78 767 7215 15584 10826 1099 453 767 380 2831 3695 2836 3718
2802C718m57k356o74l4jr7J78K40N6k15k79R1N0o6N8Jk03R7N0K5m6o4J76k09J13m9n3K7N3
$$ 3718 3261 905 231 197 196 99 277 517 573 358 79 170 220 154 212 213 10 107 157 182 136 72 248 39 152 103 50 77 130
2462A30P5k6o3j6Q4n2l7M1N8j01O3p5R9l8J16j25q8K23j19L21j18N258K971n364k619j05k20
$$ 130 205 179 116 100 184 132 95 136 194 93 156 81 180 142 258 133 45 268 149 470 352 5610 8581 3217 598 493 273
2145B73j04K06n5o8J34m1N11M392N21m275j042N47p30P2J5j43j30O0K43K14k54j68l0q0k9
$$ 273 169 375 320 252 386 345 856 5248 5769 1494 452 999 269 341 356 213 83 143 386 600 346 178 148 68 39
1851C9J22N7k11J32k9j9K08p7j03j02N9J28j29R6o2J40j52j3N2P7l1J58j10l7O1K34k50K77
$$ 39 161 218 7 139 110 91 299 222 119 17 76 204 75 171 109 249 97 84 136 213 182 340 230 193 254 488 238 515
1523E15L7K190M89r55Q20j992o12j66J003L53j379r5j07P7j02J39j06J5J3n5K25j91q7J31
$$ 515 552 2742 3231 2276 3096 1104 492 326 1329 1682 303 208 101 178 76 215 109 124 137 82 307 116 29 160
1241A60j3p2N1N4j3q5J26j49L4l1lJ31o8l1K2q2K0L2o1J29K8n2r4J23jQ5O5k17L3Rjk8m9K7
$$ 160 147 75 126 180 167 82 208 59 93 62 59 190 122 91 113 31 51 83 22 151 179 127 33 156 155 240 305 88 121 130 129 101 52 79
842G9pK5n4J65j03n3L6m9N3J0j9j2K7LJ3J9j2p9NN1L5j07N4m5J29K3o4l9Q9k6L2jJ00k43J40
$$ 79 72 97 43 208 105 52 88 39 92 102 83 71 98 101 114 133 121 42 47 98 133 26 80 35 164 187 123 84 173 147 179 178 278 35 175
431A75j51K2%k4J03O4L0Nq5R5M0j35l9K3j3l2k7J05J8nkq9J27l4J02j66O0q3l2K2J2lM4J4
$$ 175 24 46 46 22 125 189 219 224 139 234 274 139 100 123 110 78 51 156 174 169 167 78 205 171 273 107 167 84 52 74 86 83 127 141
32A41mk1k7J1p7O7M9l3j7L8J2L0k1l7m3J02p1o2J4
$$ 141 137 116 89 100 23 90 139 106 89 127 139 169 148 111 68 170 99 37 51
-191E1
##PAGE=	F1=6250.69
##FIRST=	25168.397401625570637,	5807.04592319999756,	0.094002299010753631592
##DATA TABLE=	(F2++(Y..Y)), PROFILE
5807A13qk3J4j7P0L0l2%j4q0JJ76J2j14r6K8Q3m8J03K65j32k56J31J06k33P1n6J24p9k0O5
$$ 113 105 82 96 79 149 179 147 147 133 53 54 230 242 128 32 60 143 95 198 463 331 75 206 312 79 150 94 218 139 119 184
5443A84mn1o8O6K5O9j4j44K1m1M5K3n5Q2Pp5J0Q2l4n8J75j52J26o7n3RKj9K5p9O0mL9ol8o8
$$ 184 180 129 61 127 152 221 207 63 84 43 88 111 56 138 145 70 80 162 128 70 245 93 219 152 99 108 110 91 116 37 97 93 132 126 88 20
5021B0NQ9J01k6j44P5K3l6j4m7O3M3j0Qo8J13l6q9M8k4J69k41M1m7M7J01lq1l1R1l2m3L6J76
$$ 20 25 114 215 189 45 120 143 107 93 46 109 152 142 150 82 195 159 70 118 94 263 22 63 16 63 164 161 80 49 140 108 65 101 277
4622B77k6j02k2No7J23n9o9Q0L4j28O5m6QL4J8r9J41RM3j53O6r6J26jm1l9L6o3O9R0p3J55
$$ 277 251 149 127 132 65 188 129 60 140 174 46 111 65 73 107 125 26 167 176 219 66 132 36 162 161 120 81 117 54 123 213 140 295
4234B95j27l9p7Q0o0k1O8n7pJ15k9r8O7K3M7J6n2O2q7k9L5q3J02M3n0m6j5P3JM1j87O0J35
$$ 295 168 129 52 132 72 51 119 62 55 170 141 43 110 133 180 196 144 206 119 90 125 42 144 187 137 91 76 149 150 191 4 64 199
3847A99q8n3O1N4or4NJ07j13R3l7n0O2mM5l7q3oJ93j36M6o3pM7l0Ql2R4j33N4m6Q4N9k7j8
$$ 199 111 58 119 173 167 73 78 185 72 165 128 78 140 136 181 144 61 55 248 112 158 95 88 135 105 113 81 175 42 96 50 134 193 166 148
3436A48K2J08N4n4k03M3o7PK6l5N1m6P8N5q6M9j09J19j05poO7P9j01o0J26N2q4k5L4NJ36O40
$$ 148 170 278 332 278 75 118 51 58 84 49 100 54 132 187 101 150 41 160 55 48 42 109 188 87 27 153 205 121 96 130 135 271 911
3049I11l93l47Q2K5pj28k2M5Q95o8M398j005l390N1o17j19k43J689P28r97M80N6j524k70q7
$$ 911 518 171 253 278 271 143 121 166 1061 993 5391 4386 996 1047 430 311 68 1757 2485 1488 1968 2024 500 230 143
2755A43L8L1J97J218J015j506q46k30R1Q3n5O6j85P2OM3Pr5J23j72J09n0l0L8k7J07O2j21
$$ 143 181 212 409 1627 2642 1136 290 60 151 234 179 245 60 132 138 181 188 93 216 44 153 103 73 111 84 191 253 132
2427A32r0J06j9p4L5J20j61P1p5N7L1J16k11O0K3p4K61j22J683R19j767p91J8j70k3R4o6L6
$$ 132 42 148 129 55 90 210 49 120 45 102 133 249 38 98 121 47 308 186 1869 2788 1021 230 248 78 55 149 83 119
2098A19n4j8K07J191K22j140r5K26n02R6J19j52k14P5J90Q1j24o4K5j60Q3J39q2n7n5J67j64
$$ 119 65 47 254 1445 1667 527 432 658 156 252 371 219 5 80 270 351 227 163 188 28 111 250 168 111 56 223 59
1781E9J08J24j64l3j9rJ06m4J40n7M0m0J4m6p4L50r4j10k1o7L71J0L02O68Q692M094q843m478
$$ 59 167 291 127 94 75 66 172 128 268 211 251 211 225 179 105 455 361 251 230 163 534 544 846 1514 10206 14300 5457 979
1452I79m00j20k03K76r3j65O3j95Q9q3j2J2o5K04l2r0pj11M1k3L6l6R8q3M4OMm3j6PO7jr5
$$ 979 579 459 256 532 439 274 337 142 231 148 136 148 83 287 255 165 158 47 88 65 101 65 163 80 124 130 134 91 75 82 149 148 53
1065E3jRm0Q0p6J03R2j49J4K6K08o4j26J2m7L1n0L0n8N1p6N8J29m4j15PK1j7N5J1l5m7l7P3
$$ 53 52 61 21 101 25 128 220 71 85 111 319 255 129 141 94 125 75 105 47 98 22 80 209 165 50 57 78 61 116 127 92 45 8 81
666H1M9kl8o0j1J26o3k8L1O5J5l7m6O1Kk8P1M3k03K18j64l1M3j4P3l0Q2L8r7J42pj75n8NK5
$$ 81 130 128 90 30 19 145 82 54 85 150 165 128 82 143 145 117 188 231 28 246 82 51 94 80 153 123 205 243 146 288 281 106 48 53 78
255G8km7J60K9j01P1JL0j58J77j58J05j35PP9k2q4R7l6P3k2m5L2j22J19K3qO0q5j5M4jo1J
$$ 78 76 29 189 218 117 188 189 219 61 238 80 185 50 57 136 114 30 127 91 164 142 97 129 7 126 149 141 201 116 101 145 144 83 84
-144H4P0m4l8m5
$$ 84 154 110 72 27
-191B7
##PAGE=	F1=6148.44
##FIRST=	25168.397401625570637,	5807.04592319999756,	0.2291030585765838623
##DATA TABLE=	(F2++(Y..Y)), PROFILE
5807A07J8n6OOO3mK6k6l9p6M7J41rm5q6k0M5OJ06K30j06k35J22O1j96P4j36J50r4J2O6j6k5
$$ 107 125 69 75 81 144 140 166 140 101 25 72 213 204 159 73 53 98 104 210 440 334 99 221 282 86 160 24 174 80 92 158 142 117
5420A17n9J11J0L9k1j22%n1J02J3q7J36j3j22M6J01oj14J97k09J15k2m0J1l8k2P8j17N3K0
$$ 117 58 169 179 218 197 75 75 24 126 139 52 188 175 53 99 200 194 80 277 68 183 161 121 132 94 72 150 33 86 106
5068A06N6n4mp8N0L0P2J6j75P6M4k4j6o9O4L2J2Lo5P1k0o5Q3o4K18k49L1p1J2J45j9j01LR5
$$ 106 162 108 104 26 76 106 178 194 19 95 139 115 99 30 94 126 138 141 76 147 127 62 145 81 299 50 81 10 22 167 148 47 50 145
4669A45l0n5L7J74o9o2k5ql9O8j4o9N2P6j12Q4j13L9LM2o4R7RJ0r3O6o9J8N8k2n6O0r5M8P7
$$ 145 115 60 97 271 202 140 115 107 68 136 122 53 105 181 69 153 40 79 82 124 60 157 166 176 83 149 80 98 156 134 78 138 43 91 168
4258A68j3J56j21q7j6K1l9l0J02o0o3J41p0l7M1M1M2J6o9R5r5mO7j38P1P6o1m9K5J8K1K8j63
$$ 168 155 311 190 103 87 108 69 39 141 81 18 159 89 52 93 134 176 192 123 218 123 119 186 48 119 195 134 85 110 128 149 177 14
3870A4Q0J34q7n9Q6K6Pj46N0Q6n5M6m7m2M1J6J7m2p0J1K27j16r3O4k2J5o6M0k4Q5j02J0pR0
$$ 14 94 228 141 82 168 194 201 55 105 191 136 182 135 93 134 150 167 125 55 66 293 177 84 148 126 141 75 115 91 176 74 84 77 167
3471A67L5j8m7N0J59j0m5j93O5j07j6K6J2N4j22Q3Q8j18Q8q9R0j01Kj3J01O8o6j25J08O6n6
$$ 167 202 184 137 187 346 336 291 98 163 56 40 66 78 132 10 93 181 63 151 62 152 51 53 40 141 209 143 18 126 192 136
3107A36k4P5n8n8M25k20j06J32l1j0r4L9k5J004J01P431K729p659k915j23p07J17P51M75q72
$$ 136 112 187 129 71 496 276 170 302 271 261 167 206 181 1185 1286 8717 11446 3787 872 749 42 159 910 1385 513
2814E13K57J73p80L3l4j6J65K59J314J086j628j014j55n0J21n5O1j59Q8m2K9N5j18R2j32R6
$$ 513 770 943 163 196 162 146 311 570 1884 2970 1342 328 173 123 244 189 250 91 179 137 166 221 103 195 63 159
2509A59k3p0N1%Q9Q7j45j31J19l3k6j8J92j99M4m8N0M0J08k24J56j11M6J19r4L54M18o35K9
$$ 159 136 66 117 117 206 293 148 17 136 103 77 59 251 52 96 48 98 138 246 22 178 67 113 232 138 492 910 275 304
2168C04k08m8J26j48K6Q9j5O2O1P76M5q58J26Mk25O9J78j24j68m2J52p3Q5k0j0j15R6J13j34
$$ 304 96 48 174 26 52 141 126 188 249 1025 1070 212 338 342 117 186 364 240 72 30 182 109 194 174 164 49 145 258 124
1828A24K4j04J86j89P5J56r3j04M0n6J40m5J86j03R8j02K1l3n3K97m9o2j0j07L98K5M58O61
$$ 124 148 44 230 41 116 272 179 75 115 59 199 154 340 237 335 233 254 221 168 465 416 354 344 237 635 660 1118 1779
1499A779Q633O263r563n583p55j61p5r4r3pM9j60O4j05j5Lo3K52j36j9m2r3Q7p8K1p6J72q1
$$ 1779 10412 16675 7112 1529 774 613 538 444 351 344 393 233 297 192 177 180 117 369 233 214 172 79 166 88 109 33 205 124
1171A24o2J07m7j9onN6M5j29l0P9o5P0j3K1J27j90J7L0K35j09j20L0pl6n5Q2p1P9q3M6J09
$$ 124 62 169 122 103 97 92 148 193 64 34 113 48 118 105 126 253 63 80 110 345 236 116 146 139 103 48 130 59 138 55 101 210
795B10l2j49ML3lL7J2k7n0KK5P3J3m0p0nJ01k2k2O0K6o2J8rQlm6R9nj11K24j82J5mjK2m1J11
$$ 210 178 29 33 66 63 100 112 85 35 37 62 135 148 108 38 33 134 112 90 150 176 114 132 123 131 128 82 181 176 65 289 107 122 118 117 139 98 209
349B09K6p5J33l7j42j01MJ6N4q3K16J6j46Q8P2j2j88J30r1P3j28JJ30n9l8L2k6J11n1k0J9
$$ 209 235 160 293 256 114 13 17 33 87 4 220 236 90 178 250 238 50 180 89 162 34 35 165 106 68 100 74 185 134 114 133
-15A33j11J16L6PQ1j76J7QK6p6%Q7l7j6p1
$$ 133 22 138 174 181 262 86 103 111 137 61 61 148 111 95 24
-191B4
##PAGE=	F1=6046.18
##FIRST=	25168.397401625570637,	5807.04592319999756,	0.16971881687641143799
##DATA TABLE=	(F2++(Y..Y)), PROFILE
5807G7N0n1qj3O7j6P4k9p4k0O6O7l8J2n5n4j8Q2R3K02r5k09J36k4j34O4j00R1j07kJ07l6j9
$$ 77 127 76 68 55 122 106 180 151 77 57 123 190 152 164 109 55 37 119 212 414 319 110 246 222 88 152 52 143 36 34 141 105 86
5420H6pJ15l0K3j2r6j2m0J40kj28J89n1j46Q6R8K5j37J75k31J11pPrp7LP9j02J0P6N2j08L5
$$ 86 79 194 164 187 175 79 67 27 167 165 37 226 175 29 115 213 238 101 276 45 156 149 156 147 70 73 152 50 60 136 188 80 115
5032A15p2R7n9Q0K6j35QO6j0on7L1NJ6Pn0M4j8n4J27q7K24k12J6p4L5R9l0j08L1Q2k9n8P0
$$ 115 43 140 81 161 187 52 60 126 116 110 53 84 89 105 112 62 106 88 34 161 74 298 86 102 28 63 162 132 24 55 137 108 50 120
4633A20J15q4Kl4j5qnJ7n6L6J07j19R2j13J8qN4k2K5J9l3J8L1k5q0J01k8o1Q9j12O7K9K8J37
$$ 120 235 151 153 119 104 96 91 108 52 88 195 76 168 55 73 65 119 97 122 141 108 126 157 132 52 153 125 64 153 41 108 137 165 302
4234C02r6j42N0j2l5k8J01k6q0R1r5P0K6lL9kn5J01o9RP3j55N5N1o3l8M7kJ7K5j17O8J32n5
$$ 302 206 64 114 102 67 39 140 114 34 125 30 100 126 123 162 160 105 206 137 146 219 64 119 170 107 69 116 114 131 156 39 107 239 184
3835A84m0O8lJ5j56Q6O4l4jo0m0M4J1Jn6l6M1K35q5k04J68n6j1p9R9o5Q0p9k8M3R7KJ0r1R0
$$ 184 144 212 209 224 68 154 218 184 183 123 83 127 138 139 83 47 88 323 238 34 202 146 135 56 155 90 170 91 63 106 203 205 215 124 214
3424B14J54o7qj75P0r2p0L4J5O6j30N7Q4j19J19r3O8m9J2k5R6P5p2j48J23O5r9L9O6n3p9J42
$$ 214 368 301 293 118 188 96 26 60 75 141 11 68 152 33 152 59 127 78 90 65 161 236 164 16 139 204 105 144 210 157 78 220
3049B20j21K1J78p6m7p0O9l4O34J68N607L302n732l560J02n98J18K24K24l62R2j32j20J9N4
$$ 220 99 120 298 222 175 105 174 140 774 942 6549 9851 4119 559 661 63 181 405 629 267 359 227 107 126 180
2755A80r5J81J68P44O73r94o32j7p8P4J8qj18J34q8pR5j26P3j14J08Nj36N8M8R2O1j43j20
$$ 180 85 266 434 1178 1851 857 225 208 130 204 222 214 96 230 142 135 230 104 177 63 171 176 40 98 146 238 299 156 36
2415C6P8m0L3o8K49j92k3m2Q5K7Q6j80J60r4J4O7m3J250P71j473k93l74K7J52j80M4O2L9J7
$$ 36 114 74 107 39 288 96 73 31 116 143 229 49 209 115 129 196 153 1403 2174 701 408 34 61 213 33 77 139 178 195
2075A95J65J293N7j374j48n9rK1J75n1j25j05R0k4R0rp9n1R9O0j33O4o1Q6j42P9R9k2j52O2
$$ 195 360 1653 1710 336 188 129 120 141 316 265 140 35 125 101 191 182 103 52 151 211 78 142 81 167 25 104 203 181 29 91
1722I1l2J17J4J29m2N6j75M6j8q6K53n0k0m6o9K60JL22M39M808M409n749l562o34p5J61J8
$$ 91 59 176 190 319 277 333 158 204 186 100 353 303 283 237 168 428 429 751 1190 5998 10407 4658 1096 462 387 548 566
1405E66l85P9J9r8L8p6j4j3rK34j51k6m8o9J33j39J00j2Q0j13o5J04p4K4j6K4L5O7j30m0R4
$$ 566 181 260 279 181 219 143 129 116 107 341 190 164 116 47 180 41 141 129 209 96 31 135 61 85 69 93 128 195 65 25 119
1042A19o8M8M0K1O3j55M4J5J97r6j56N8K9p8o7J14NL3q9K2Q3k4j19j3K0K6j8J8j7Lj3J0Q2
$$ 119 51 99 139 160 223 68 112 127 324 228 72 130 159 81 14 128 133 166 77 99 182 158 39 26 46 72 54 72 55 58 45 55 137
654A37K6q2k4j4O5J2L1M9J5j64P7M5o1Om3Q8m6kJ96k01N3l2J8n1rJ26om6J03o6n8j22K5k4
$$ 137 163 81 57 43 108 120 151 200 215 51 128 173 112 118 75 163 117 115 311 110 163 131 149 98 89 215 209 163 266 200 142 20 45 21
255B1P6p8K11Oj51N8J15j2j30M2m7qp8j5J55r4K2j8RJ05q3K4rp6P2Q6J3N6k31P9m2N8p4m7
$$ 21 97 19 230 236 85 143 258 246 116 158 111 103 25 10 165 71 93 75 84 189 106 130 121 45 117 203 216 272 41 120 78 136 62 15
-144A5J30m1kl8
$$ 15 145 104 102 64
-191F4
##PAGE=	F1=5943.92
##FIRST=	25168.397401625570637,	5807.04592319999756,	0.078895926475524902344
##DATA TABLE=	(F2++(Y..Y)), PROFILE
5807D0Q4mm9n7P1L1P3l0r5K8R1J0r8N2j3p8l6J07O9J87q6j95J59q9q8M7j5N2n4o8R5n7mK3
$$ 40 124 120 71 14 85 116 189 159 64 92 183 193 95 147 134 56 20 127 196 383 297 102 261 172 84 131 116 168 114 46 141 84 80 103
5408A03R8q0J2Nn8j7k8J56rj26J88r3j18R8P2N8j33J20j93R1j5M0l2q2QN9m2n8J33L8j46O8
$$ 103 201 121 133 138 80 63 35 191 182 56 244 151 33 131 203 261 128 248 55 146 131 171 139 57 65 124 82 24 157 195 49 117
5032A17o6J48j38J03Lr0k8N9J2Ko1L2l8oL3l9L4k8m1J51q5J95j55Lo6L1N7k6m2j7Q0m8k0Q4
$$ 117 51 199 61 164 167 77 49 108 120 122 61 93 55 49 82 43 77 49 8 159 74 269 114 117 51 82 139 113 71 54 134 86 66 150
4633A50L2p6O8l8j8ml3Kk7L1J23j32P9p4k0rN3J7l0Ko8J51k7J7j36J16m5m5J02j04R4l6M7
$$ 150 182 106 174 136 118 114 81 83 56 87 210 78 157 83 63 54 107 124 94 96 28 179 152 169 33 149 104 59 161 57 151 115 162
4246A62J12o6j89J17k4m0k3Q7j7m9K3n7J13K6p0K4j9k3Q7k8K0N6j52O9j5o2rN8rjL1o9N2J16
$$ 162 274 208 19 136 112 72 49 136 119 70 93 36 149 175 105 129 110 87 174 146 166 222 70 139 124 62 53 111 102 101 132 63 115 231
3847B31j1k9N1l1K4j46J13M4l7n4o3m2P0lLq1j1P6K22l9j64J21r8l1m7J41j32Q8o6n6Q3R5
$$ 231 220 191 242 211 235 89 202 246 209 155 92 50 120 117 120 39 28 104 326 287 123 244 146 115 68 209 77 165 99 43 126 221
3471B21k1N6j29J08J10j03L9j55Q6o0o6prO2r3L3M5j09J31r7N7K1K6n8J12N7q8j57K26j7j62
$$ 221 200 256 127 235 345 242 281 126 212 152 86 79 70 132 39 72 117 8 139 42 99 120 146 88 200 257 169 12 238 221 59
3107E9J09L8j6p2O1n3l8J74p7j17k8M8QJ26J35J900K046k157j913J44k93Q5K42J95j84j7j03
$$ 59 168 206 190 118 179 126 88 262 185 68 40 88 96 222 357 2257 4303 2146 233 377 84 169 411 606 422 405 302
2791C02j16q5R7j55J15N5J0J32j73j06J26m5j9J09r2o1J70j14m8J18j04L5r3J28K6j76M7O7
$$ 302 186 101 198 43 158 213 223 355 182 76 202 157 138 247 155 94 264 150 102 220 116 151 58 186 212 36 83 150
2462A50J10J6j22j01L0l1P0j03K93j44j22l3J00K2O1j32J44m4o8O8%J100N80j331j08l48L9
$$ 150 260 276 154 53 83 52 122 19 312 168 46 13 113 135 196 64 208 164 96 164 164 1264 1844 513 405 57 96
2145I6J03j60J1N1M9m6K13R00J3r75j97O5prJ24M8r8j06NJ07qKj24RP4mr0P3Jm4m9P7L6Pn2
$$ 96 199 39 50 101 150 104 317 1217 1230 255 58 123 116 107 231 279 181 75 80 187 179 181 57 66 140 136 46 119 120 76 27 104 140 147 95
1734I5m1LJ01P0K8P9m3j90O0j9l3J08r0M1o5k4J36j34J21J94K74J118q49o09k51mK29J46k54
$$ 95 54 57 158 228 256 335 292 102 162 143 110 218 128 169 104 80 216 82 203 397 671 1789 940 331 80 76 305 451 197
1394A97n4k6j3Qn1P9j00J02J17o5j30qjJ11j07J56%k3j41J9ok4L4m9M3L9P4j16K5Qm4J8P2
$$ 197 143 117 104 112 61 140 40 142 259 194 64 56 55 166 59 215 215 192 51 70 64 40 74 25 68 107 181 65 90 98 54 72 144
1006A44N6m7n0M9j1J35o3j89R5L6p1l3O3R2j7q3k3M4Kl5n1N1No7L1m3P1n3J4Q3J9j32M6l8
$$ 144 200 153 103 152 141 276 213 24 119 155 84 51 114 206 189 106 83 127 129 94 43 94 99 32 63 20 91 38 52 135 154 22 68 30
607C0N3L8P7L5J0j73O0P5j27N3m8O4q3R5J60k17P5l0L6j31K8J34l4k1P2j02M6j32K2qM9q4
$$ 30 83 121 198 233 243 70 130 205 78 131 83 147 64 159 319 102 177 147 183 52 80 214 180 159 231 129 175 43 65 57 106 22
232B2J93J3j34PJ22ko8N1o4j07rK3J01j23P3j4J6P5r6O0l3l6jJ56J4Jk31J22p1Q0n8l0Q8l9
$$ 22 215 228 94 101 223 221 153 204 140 33 24 47 148 25 98 84 100 175 79 139 106 70 69 225 239 240 9 131 60 140 82 52 140 101
-167A01pO
$$ 101 94 100
-191A00
##PAGE=	F1=5841.66
##FIRST=	25168.397401625570637,	5807.04592319999756,	0.20138144493103027344
##DATA TABLE=	(F2++(Y..Y)), PROFILE
5807A6J06M3q7m4PJ13L9m0q8N6J13j7j75P4K0q6J1O5L9J77o7j96J72q8q6L2N3P6l3p5L0p5
$$ 16 122 165 78 34 41 154 193 153 65 121 234 217 42 116 136 50 61 126 165 342 275 79 251 163 77 109 162 238 205 130 160 85
5431H5L2KP3j21mL0j7j8l0J63pq7J41j23l8O8K7R1j16N3j17N7k7L8m7m9k2L7L3p6J29J5j44
$$ 85 117 119 192 71 67 97 80 62 32 195 188 101 242 119 81 149 176 267 151 204 87 144 117 155 108 59 37 74 107 31 160 175 31
5044C1R0o9J86j74J07l1n3k1K3M5Nq0N1m6m1O3o0L8m8M4R2p2J43r4rm9J3J7mK3p5J02p8L9
$$ 31 121 52 238 64 171 140 87 66 89 134 139 59 110 64 23 86 26 64 16 60 152 80 223 129 120 71 84 101 97 120 45 147 69 108
4645A08O4m7n1J10l4ok9j9m3jM1J21j29L9k8l3j0L8M3l2p0J9J68q8M9j43R3l7LO2n9R3r6N4
$$ 108 172 125 74 184 150 144 115 96 53 52 93 214 85 124 96 63 53 91 134 102 32 51 219 131 180 37 130 93 96 158 99 192 96 150
4246A50Q4m5j64J33k3n0jN9n2j1LJ3Q1L3j31%k6J6N5J3L8K1j23Q6q9n5K8O4j9j8L9k8M0Q7
$$ 150 234 189 25 158 135 85 84 143 91 80 83 96 177 210 79 79 53 69 124 137 175 196 73 159 70 15 43 107 88 70 109 81 121 208
3847B08K6j5L1n3L6j31J27L0n2j02n1m1R2nL4j10k0J00J97J6j14O0j31m7NJ65j92J00o4o8
$$ 208 234 219 250 197 233 102 229 259 207 105 54 13 105 100 134 24 4 104 301 317 203 263 132 85 90 255 63 163 99 31
3495C1J06P0k4J04j40Q5O1j11P2j33J22k5o5k3k4Ql6J8qo2R0q4M7Q5L5r1J32K3q4j32K92j05
$$ 31 137 207 183 287 147 232 293 182 254 121 243 218 153 130 106 114 78 96 88 26 116 32 79 164 199 108 240 263 179 47 339 234
3119B34k06J54KJ8j05Q9j8o2J03l1j60K0rN5J36q6J661K57j491n09M5K5O6K96K31l28n8M0
$$ 234 28 182 184 202 97 186 168 106 209 178 18 38 29 84 220 134 1795 2052 561 52 97 122 188 484 715 387 329 369
2791C69k14j7P5j67J2P8L95J87l89k44Q7jj00J75j32k8J80j13p6J20n3l1n1J29M5j74K9M9
$$ 369 155 138 213 46 58 136 531 718 329 85 172 171 71 246 114 86 266 153 77 197 144 113 62 191 236 62 91 140
2462A40J14k1r2q1K7o3R5j11L11p5k05J9L0K2M7p4J15oj37P9K6M74J29o22J96k51O6J5j15
$$ 140 254 233 141 60 87 24 119 8 319 244 39 58 88 110 157 83 198 192 55 134 160 634 763 141 337 86 152 167 52
2121E2J5%M7q9J83J45j8k45L3L4m7l1N6J30p8r2o0J61k9%p4LJ5m5k4M6M7j24M6N2Lj9M2q9
$$ 52 67 67 114 25 208 353 335 90 123 157 110 79 135 265 187 95 35 196 167 167 93 96 111 66 42 88 135 11 57 109 112 93 135 46
1722D6J5J01P0l7J72j18j16K1l5Q3n4r5O2K7l5K04j28P9N15K372J453k669j590N3j55j38J59
$$ 46 61 162 232 195 367 249 133 154 119 202 148 53 115 142 107 311 183 262 777 3149 4602 1933 343 396 241 103 262
1405B62K9k02PQk6p5J97j38J37l5P1j43j9L7M1l8J59qq3j06J5p6R5k0p4J6N5Q6j09O7o1lj0
$$ 262 291 89 96 104 78 3 200 62 199 164 235 92 73 110 151 113 272 264 181 75 90 14 109 89 15 31 86 172 63 130 69 66 56
1018E6Q2Q4j52N0O5m8Q2l6j71J00K7m7nJ1J51m0o4o8mL2K8p4Q8nn5jp4J02o5LP2j8k8j6m5
$$ 56 138 222 70 120 185 137 219 183 12 112 139 92 87 98 249 209 145 77 73 105 133 59 147 142 87 86 12 114 49 52 124 106 78 62 17
607A7N2M5J00L4Lj18J3N6j74J29n6L8q7J32J29k18P8lM2j75L5J30m3j2P0j43J27j33NpN6j10
$$ 17 69 114 214 248 251 133 146 202 28 157 101 139 52 184 313 95 173 170 212 37 72 202 159 147 217 74 201 68 73 66 122 12
232A2J65M2j10m1R2kjR6q6j22j0M5M8j10P7PRL5q0P0m0pq4K21K3o4j27P6p7Q2l6kL0k3l1M3
$$ 12 177 219 109 68 160 158 157 253 167 45 35 80 128 18 95 102 111 146 66 136 96 89 5 226 249 185 58 134 57 139 103 101 131 108 77 120
-191A20
##PAGE=	F1=5739.41
##FIRST=	25168.397401625570637,	5807.04592319999756,	0.40316525101661682129
##DATA TABLE=	(F2++(Y..Y)), PROFILE
5807B1J02P0j03k0o1J77%n8l6N3J20l1k11N6L4p6M0M0J1J59l4k07J68m5j02K6R8J20l4p4q
$$ 21 123 193 90 70 9 186 186 128 92 145 265 234 23 79 113 37 77 117 128 287 253 46 214 169 67 93 191 311 277 203 195
5443A95j03O1k7M6j40j7O3lj1m9J62Mm4Q7j26L6L2k4J20r8om2J9k4Nm9j0m2kJ05m7P8j9q4
$$ 195 92 153 126 172 32 15 78 75 64 15 177 181 137 224 98 134 166 142 262 164 158 116 135 111 116 67 57 15 13 118 71 149 130 46
5044D6Q5q2J98j74R0m8l1oqQ3Mj00O1j8k1M2r9M2m2R4M6p5Q0l7k1j4j0k2L5N6j16J26p9P0
$$ 46 131 49 247 73 163 115 84 78 70 153 157 57 118 100 79 121 22 64 22 116 162 87 167 130 109 95 85 63 98 154 38 164 85 155
4645A55K3j04j6J12k1J9o7Lo2pN9J03r5k7J2j7j0J4N7Lr7P7J15j35O4j21N5L7K9k3J5P0j42
$$ 155 178 74 58 170 149 168 101 104 42 35 94 197 102 75 87 70 60 74 131 134 37 114 229 94 158 37 92 129 158 135 150 220 78
4258G8N7N3l1r7J14pp0M0J9j16K3L1N2L6L4j70k2J2K2%M8O1j6o0P7j51M7k5O8l6k5N0nL1N1
$$ 78 135 188 157 60 174 167 97 137 156 40 63 94 146 182 216 46 24 36 58 58 106 167 151 91 168 17 64 39 107 71 46 96 91 122 173
3847A73M9QKo6N4j25J33J8o3j17l1J6L0J8P3j19l4P1J60P2p0Mj40n8N4J69k18R8o7o6J11K0
$$ 173 222 230 232 166 220 95 228 246 183 66 35 51 81 99 172 53 19 90 250 322 252 256 116 58 112 281 63 161 94 28 139 159
3471A59lJ36j21L3K6r8Q1j06J68Rp4j3l8o2J3J9n9j8L6k1OJ23L6j08J33on2r7K95j58k08J43
$$ 159 156 292 171 204 230 132 213 107 275 284 210 197 159 97 110 129 70 52 88 67 73 196 232 124 257 251 199 102 397 239 31 174
3096A74k2K2j39J03J8m0L1J9j04m5M5J5K72lK907J149k566j700l4P4L3K11J68l33l0K5k04
$$ 174 152 174 35 138 156 116 147 166 62 17 62 77 349 346 3253 4402 1836 136 102 176 209 420 588 255 225 250 46
2779D6J22N5j85nJ16N94K81n40l38k0L2j36J94q4o4J62q2q7J11J1j20J3J03N9j60K6K3Q6l5
$$ 46 168 223 38 33 149 743 1024 484 146 126 158 22 216 132 68 230 148 61 172 183 63 76 179 238 78 104 127 213 178
2438A78o4n4P4j11P5p4K84qk19J9m5J8M8j6Q8Jj23L2L6J26J09J6j33j61Q4l7o8M3o7O4j8K5
$$ 178 114 60 134 23 98 24 308 300 81 100 55 73 121 105 193 194 71 103 139 265 374 390 257 96 180 143 75 118 51 115 97 122
2063A22K20J08m26J58m1k0n4LJ48n4p2q2J63kk0jj7n3j0lj6O9m7M6rj1o7Q8p9J9J01K8l7J89
$$ 122 342 450 24 182 141 121 67 70 218 164 92 10 173 171 151 150 133 80 70 67 51 120 73 119 110 99 32 120 41 60 161 189 152 341
1664C41j24o7j8m5J48j02k1j6N3l8K89j28J01O14L036K355l603k234k3k00j48l8J68k32R2
$$ 341 217 150 132 87 235 133 112 96 149 111 400 272 373 987 4023 6378 2775 541 518 318 170 132 300 68 160
1370A60n9l6k2J70j41J53j33J57n5q7L3Mj7J53j7q0o3m2j7J11m6q7k9O6R4j14P6q5L2j2N7
$$ 160 101 65 43 213 72 225 92 249 194 107 140 144 127 280 263 183 120 78 61 172 126 39 10 76 170 56 132 47 79 67 124
1006A24R6k01Q5J01q4M4k5j03M8L9m3K2pJ55k9m7p9qlN1o6J06J0n0m4o1Q4m4rL6o1J38j25
$$ 124 220 19 104 205 121 165 140 37 85 124 81 103 96 251 222 175 96 88 85 136 70 176 186 136 92 31 115 71 62 98 37 175 50
619E0pL0J7J02N4j0o0j0Jj35J48n5J6n3R7J03j94O8L4L4j61NJ05l4j9J02j54J36j18j9l0J06
$$ 50 43 73 90 192 246 236 176 166 167 32 180 125 141 88 185 288 94 162 196 230 69 74 179 145 126 228 74 210 92 73 43 149
243A49p6N2Q4q3p6M3k7P4J24p7r9l7N0J2o4N0OQj1l8N6k6Lk6J32M3j18k8K8p7P4rJ1jjo4O1
$$ 149 73 125 209 126 50 93 66 140 264 187 88 51 101 113 49 99 105 113 102 64 120 94 97 71 203 246 128 100 128 51 125 116 127 126 125 61 122
-191A22
##PAGE=	F1=5637.15
##FIRST=	25168.397401625570637,	5807.04592319999756,	0.71090477705001831055
##DATA TABLE=	(F2++(Y..Y)), PROFILE
5807B9R5P4r0j8p1J85l8q1M7L4J02m0j76nK6n3M9L7j6J27J0j93J23Jr9K6J22J60n0o6j8j43
$$ 29 124 198 108 90 19 204 166 85 132 166 268 228 52 47 73 20 69 106 90 217 227 34 157 158 59 85 207 367 317 251 233 90
5431I0P8m0J9j33N7K2k1Jn7J29J2lM8j09Q6Jo9J38q5m4J4j8pl2%l4K5k4P3j0L2o4jO8r5J75
$$ 90 168 128 147 14 71 93 72 73 16 145 157 154 202 93 179 180 111 249 164 120 134 116 109 77 77 43 68 44 117 107 139 75 74 142 47 222
5009B22j50N8l1k7%j8J15Mj12N0J3NK7j19K9j4J18K0j02J9Qk7M6l7n5P2N5j14J13m8P4k8j36
$$ 222 72 130 99 72 72 54 169 173 61 111 124 129 156 37 66 52 170 190 88 107 115 88 134 97 42 114 169 55 168 120 194 166 30
4622C0K5P6MM3j04K1l3n1P2P6m1r8L8J4qLN8M1o3N0N5j66P0q5J3J63J7j31J03L4j53M9J9j5
$$ 30 55 131 135 178 74 95 62 11 83 159 118 20 58 72 64 67 125 166 103 153 208 42 112 27 40 203 220 89 192 226 73 122 141 126
4222A26m3R6K6j03R2l1j00j4O6O4qK1j70L1K8k3l7L6Q6m4L0M0j33R0q6O8n4k0P0j0J7K2N6
$$ 126 83 179 205 102 194 163 63 49 115 179 171 192 22 53 81 58 21 57 143 99 129 169 36 126 40 108 54 34 104 94 111 133 189
3835A89L8m1o5P4j31J37Mo6l7m2L4k8M6R6j14o2L9J15J12l4m0j12m3P5J41k10Q1o9n1J01n2
$$ 189 227 186 121 195 64 201 205 139 102 60 94 66 112 208 94 32 71 186 298 264 224 112 69 144 285 75 156 87 36 137 85
3471H5M2J47q2k8J2q2P0p4K04M1q5J0o3j12M2L5q6jqN6k5J15K5j03J07j7oo1K38j62j97J02
$$ 85 127 274 192 164 176 94 164 90 294 335 250 260 197 85 127 162 76 75 67 123 98 213 238 135 242 225 219 158 396 234 37 139
3096A39k8ko1O1Rk3j3M2j6m7K2k6J78O5K282J329j968j776l8P9j0J00L2j99N4q0j4Q5N2k06
$$ 139 111 109 48 109 118 95 82 124 108 61 83 57 235 300 2582 3911 1943 167 129 208 198 298 330 131 185 105 91 176 228 22
2744B2J2O4M20J52l23k12o2N1r9J49Pj23J04l2p5J07O2j95O2O2N9j36K6J3L3k7m2k7J24r5
$$ 22 34 98 518 670 347 135 73 124 25 174 181 58 162 130 55 162 224 29 91 153 212 76 102 115 148 121 79 52 176 81
2391H1j7l2K47M3j89Jj00KO3K6O4j5o5m2L2L81L76l06l51j21Q1k0m2N7j01O6kj7M52P1o07
$$ 81 64 32 279 322 133 134 34 36 99 125 189 174 109 67 99 480 856 550 199 78 159 139 97 154 53 119 117 100 552 623 16
2028A6J69q4M7q3nR6k6n8k2J28Kl1M7k0p7K5j0j06P4K8Q2q7j7n8K9l9M6Q0k4%J37o8o0n5m0
$$ 16 185 101 148 65 60 156 130 72 50 178 180 149 196 176 99 124 114 8 82 110 192 105 88 30 59 20 66 146 122 122 259 191 131 76 36
1617C6J63q6jn6J1L7K81j65J0M70J850J668k367j477M9j88q0j06J94j86J14j17OK4Q2j20J61
$$ 36 199 113 112 56 67 104 385 220 230 700 2550 4218 1851 374 423 235 155 49 243 57 171 54 60 84 166 46 207
1300B07j02J23L1j36K8rm6J41j7l3m2j05M2J46m7j14k1N3O5r4L6o7N0PNR7j40OJ45r9Rj7l5
$$ 207 105 228 259 123 151 142 96 237 220 187 145 40 82 228 181 67 46 99 164 70 106 39 89 96 101 198 58 64 209 110 119 102 67
912F7l8Q0o1N1J3J01Pl4o1J9q1M1k9J05L2m7r6l4N7j0lj8N0J55j99J0J8m6R1Q7k5j0j4o2k5
$$ 67 29 109 48 99 112 213 220 186 125 144 63 104 75 180 212 165 69 35 92 82 79 61 111 266 67 77 95 49 140 227 202 192 178 116 91
502I1J07m9mj5L6P7j41N5O6J9j38k1O2j4k9J46j53J03r1l4n6J65k5p3J15n7r5jj5R8R7l5q0
$$ 91 198 149 145 130 166 243 102 157 223 242 104 83 145 131 102 248 95 198 107 73 17 182 157 84 199 142 47 46 31 129 226 191 111
114A11m3M6pl7M2j7J1n8J7L1JLL6K3P5j48M7j5p8O0J8MQJ6q2M6
$$ 111 68 114 107 70 112 95 106 48 65 96 97 100 136 159 234 86 133 118 40 100 118 122 130 146 64 110
-191A10
##PAGE=	F1=5534.89
##FIRST=	25168.397401625570637,	5807.04592319999756,	0.8552119135856628418
##DATA TABLE=	(F2++(Y..Y)), PROFILE
5807D2P8O7n7l5q3J96p6r8J29J8O1l8j24m5ok0L8N6m2P8M8j30L8K8o5K6J31J78p3n8lj84Q7
$$ 42 120 187 130 95 12 208 132 34 163 181 242 204 80 35 29 9 47 103 61 139 187 57 95 123 58 84 215 393 320 262 259 75 162
5420A62l3pj12J16j4k5jl8O0PM2K2q9J16j6j05J40p1o2N1m4J0l4N4j09J00l0J7K6Rj09O9M8
$$ 162 129 122 10 126 112 87 86 48 108 115 157 179 90 206 190 85 225 154 92 143 99 109 75 129 20 120 90 107 133 142 33 102 150
5032A50j02J22j03OJ7l4lrJ32Nj08K0L0M2K0j27RJ7J30Kj39l4M0j8J16n7q0Q4L6p7O2mP2q1
$$ 150 48 170 67 73 90 56 53 44 176 181 73 93 123 165 185 58 67 84 214 216 77 43 83 65 181 124 44 128 164 87 149 145 217 136
4633A36j17M4J2M0N1j25L0Rm4K1M9J9q7j6L4KJ8M6O6l4Rlj42M4l9K5K43k7k29J81pj23J7%
$$ 136 19 63 75 115 166 41 71 80 36 57 106 125 38 22 56 58 76 122 188 154 163 160 18 62 23 48 291 264 35 216 209 86 103 103
4234A03J4k0P6P1j44J38q1j5n9O1M6l0j3j10O5J6o0M4p2P9m4J10qr3J06j33N5o1pR1l6kQN1
$$ 103 117 97 173 244 100 238 157 142 83 144 190 160 147 37 102 118 58 102 30 109 65 175 167 74 180 47 102 41 34 125 89 87 95 146
3835A46O4q9n0R0j46J47j5n9P4p4L8l0L9R6r1j05K1O9J21Jp2n6qP9Q0j85O2o6k6Q1j28R7J46
$$ 146 210 121 71 161 15 162 147 88 162 88 126 96 135 231 140 35 56 125 246 247 175 119 111 190 270 85 147 81 55 136 8 105 251
3448B51m8o4Kp8N3m1K16O7q8L2r2j34N2N7p9j3k7J15l5O8Np8O3j5M1l1J45j30j84N2j9l4J03
$$ 251 203 139 141 63 116 75 291 358 270 302 210 76 128 185 106 93 66 181 146 214 219 141 204 189 230 199 344 214 30 82 63 29 132
3060A32K1o9k6j2KJ22j3o4n1K4O0N90P38m12q53j30J46m0Q5o8j07O0M6L5n1O8j93k9R1j2k3
$$ 132 153 84 58 46 48 170 157 93 42 66 126 716 1454 1042 189 59 205 165 250 182 75 135 181 216 165 233 40 11 102 90 67
2697F7O7n0m4M8m9J06P9j31j9K9m0J11Q8j95L2K0M0r0J8J0k2pj7rJ46n2j11%K14O8j28j7j26
$$ 67 134 84 40 88 39 145 224 93 74 103 63 174 262 67 99 119 159 69 87 97 75 68 51 42 188 136 25 25 239 307 179 162 36
2309C6j0P6L5L8l5j1r0QL79L25k87k94j33O5M2k2N5p5%k0N1J76N4k62N6p8R9j26K2L9pn0K9
$$ 36 26 102 137 175 140 129 39 47 426 751 464 170 37 102 144 122 177 102 102 82 133 309 363 101 157 79 178 52 74 113 106 56 85
1922H5J21l0rN9mo8J8oj26PQ0J26j56Oj8m4j6O5L6m1J5M6J0m9j01J6J01l3Km0PR2J89j50q6
$$ 85 206 176 167 226 222 154 172 166 40 47 127 253 97 103 85 41 25 90 126 85 100 146 156 107 6 22 123 90 92 52 59 151 340 190 104
1511A04O2oJ94j46m1O4j11m9pJ13o7L5o0M8nm4n2J26kM9O9j52L9k0j00J19j2K5k1j44P3J94
$$ 104 166 160 354 208 167 231 120 71 64 177 110 145 85 133 128 84 32 158 156 205 274 122 161 141 41 160 148 173 152 8 81 275
1136B75l7j39j6N5J3m2l3l8O4K6m8Q8r4k8J57r1k3J6%n3L9o4N5M0K5M7k1k9L8j28JK2J01L4
$$ 275 238 99 83 138 151 109 76 38 102 128 80 168 74 46 203 112 89 105 105 52 91 27 82 122 147 194 173 144 182 54 55 77 178 212
736B12l8j47nL3J6J6o0J93J13k28MJ6r3M3J21m0L1j0r4N7P1m7j8J6k7M5n9M4Q1Oj18l9RMj4
$$ 212 174 27 22 55 71 87 27 220 333 105 109 125 32 75 196 156 187 177 83 140 211 164 146 162 135 180 121 165 246 252 134 95 104 108 94
326I4J74j70P0o2k8LJ31K6j52J06l2j01j7O9L9NK0n2m0M0j3k3M3m0Lp8N4MK6LP9p4J08j40
$$ 94 268 98 168 106 78 81 212 238 86 192 160 59 42 111 150 155 175 123 83 123 110 87 130 90 93 15 69 73 99 102 181 107 215 75
-73G5Q5m7o9K5L7j6M8K5p3K
$$ 75 160 113 44 69 106 90 138 163 90 92
-191I2
##PAGE=	F1=5432.63
##FIRST=	25168.397401625570637,	5807.04592319999756,	0.73170220851898193359
##DATA TABLE=	(F2++(Y..Y)), PROFILE
5807F4M7N6j3n6q1J82j09n7J36J9Nj5p6n8l2%J5Q6n6J3O0n5l5L4qL2J21J66r4n6K1k01Q8j4
$$ 64 111 167 154 98 17 199 90 33 169 188 193 178 102 44 12 12 27 113 57 70 130 75 40 74 66 98 219 385 291 235 256 55 143 129
5408A29k8q4J53m7lk2k4Ok6J11j2p5J31j4j37J31m6o9P2n2J6j8P9j52J34l7j9N0Nj14R0L3
$$ 129 101 17 170 123 120 98 74 80 54 165 153 78 209 195 58 189 143 74 146 94 110 92 171 19 153 116 97 147 152 38 128 161
5032A61j05M8l2o7Q2m9j0J6J27Rq9j1J9R0K2j30j2M6J24k0j57l6K0OJ73o6j10Q3J2l1qM6P1
$$ 161 56 104 72 5 87 38 28 44 171 180 91 80 99 189 211 81 69 115 239 219 62 26 46 52 225 159 49 132 144 113 105 151 222
4645B22j30l6K1k3M4L7j14L2K3Jn7L1O7l6n9MK7L9K8P9j2m0m2k7j1j8N6K70r5k03J38m2o6
$$ 222 92 56 77 54 98 135 21 53 76 77 20 51 118 82 23 27 54 93 121 200 188 148 106 79 68 50 106 376 281 78 216 174 108
4258A08l6RM4k0N4J20j83J63j18P3r0N3Nk6n4m9Q0Kq4J21q6rrJ45n0o0J13j56L0m8JJ00o4
$$ 108 72 81 125 105 159 279 96 259 141 214 124 177 182 156 102 53 133 135 51 172 86 77 68 213 163 103 216 60 90 42 43 143 79
3870G9k3J7L2P8j34%Q3r0P9j5l6J34r9M3LQQ1n4j51K3M1P7M2r5lL7Q2Mj54M3o0LO3p6L6J45
$$ 79 56 73 105 183 49 49 132 42 121 106 70 204 105 148 151 159 240 186 35 58 99 176 218 123 120 157 239 243 89 132 72 75 138 62 98 243
3448B43m3n7j9p5K9j9K04Q2p5M1j16j33N0P9n0l8j5J43l6Qj3m6J7j3P7qM7r0j67L3k1N6J27
$$ 243 200 143 124 49 78 59 263 345 270 311 195 62 112 191 141 103 88 231 195 203 190 144 161 148 225 217 264 174 7 40 19 75 202
3060B02j1j22l1L6kJ72Nj42n8J92j81J123J37j160N6j60J21l2J15m8j11o6K38L2j58R1j83
$$ 202 191 69 38 74 72 244 249 107 49 241 60 1183 1320 160 216 56 177 145 260 212 101 35 273 305 147 238 55
2744E5l5J49J22K26k91j37l2J2k8R9J08r9j28N1KJ26R2j81j7nlj1J0j6n5J9J1pJ28Mj46j8
$$ 55 20 169 291 517 226 89 57 69 41 140 248 149 21 72 74 200 292 111 94 89 86 75 85 69 14 33 44 37 165 169 23 5
2368EJ91O4m9k4j51K2P7RJ3n1K2q2l6J29J16k9o5j33N2O5NN0l1q0n7J56n4K17j26r8l4J05
$$ 5 196 260 211 187 36 58 135 144 157 106 128 46 10 139 255 226 161 28 80 145 150 200 169 89 32 188 134 351 225 127 93 198
1992A98j74Q1lol4N7J01o8L5N0K2o2OMj29l1Q3J58j95M5j6ln4N7prk6m5O8Kn6oJ8K2J8j3P0
$$ 198 24 105 102 96 62 119 220 152 187 237 259 197 203 207 78 47 130 288 93 138 122 119 65 122 115 106 80 35 103 105 49 43 61 83 101 88 158
1558A58K7J30l5NM4J517J085j566r83k93R2n1N2m8J9m2O7J5m2j35M1M1Q4K7L9j43O7l8r4L7
$$ 158 185 315 280 285 329 1846 2931 1365 382 89 181 130 182 134 153 111 178 193 151 16 57 98 182 209 248 105 172 134 40 77
1206G7rO5J8r6J4K33k4j57lM9l1J2q0l2Q8K9p7O2p8J8J12p8j9N5lj6o0Kj2M4l4P2lJ2M0j11
$$ 77 68 133 151 55 69 302 278 121 118 167 136 148 68 36 124 153 76 138 60 78 190 112 93 148 145 129 69 71 59 103 69 141 138 150 190 79
783G9l0K9J07%j9j25k3OJ5L7k5K49O6k26oJ5p0n3J35n3O2lp4P7M6n1k8M2p9J1M3L1P7%j03
$$ 79 49 78 185 185 166 41 18 24 39 76 51 300 366 140 134 149 79 26 161 108 170 167 93 170 216 165 137 179 100 111 154 185 262 262 159
373A59n3l9J3L1J74k07M6l3lO5P8O1j81P6pr3l0R8K9r3M7ml7L3j2j1M1m5k3k5K0j3L2J1R3
$$ 159 106 67 80 111 285 78 124 91 88 153 231 292 111 187 180 87 57 155 184 91 138 134 97 130 118 107 148 103 80 55 75 62 94 105 198
-38A98j37J28j04J02o2n3m0N0l0R0K7m9m8
$$ 198 61 189 85 187 125 72 32 82 52 142 169 120 72
-191G2
##PAGE=	F1=5330.37
##FIRST=	25168.397401625570637,	5807.04592319999756,	0.46592116355895996094
##DATA TABLE=	(F2++(Y..Y)), PROFILE
5807H8PN3K8o5m8J18j34K8P2L7n6L6m8o5j3kj7J06n5rmJ5o4J7N3M8R4J23j05o1M1j78Q3Om3
$$ 88 95 148 176 111 63 181 47 75 147 184 128 164 116 51 38 36 19 125 70 61 57 72 8 25 78 126 220 343 238 177 218 40 123 129 86
5396H6m8J62o7K2m8k2j1m2J64p7m9J18Pj77J26qp5Q9m4Kj8R4j36J10l4l5O0Jj09J08L4j13
$$ 86 38 200 133 155 107 85 74 32 196 119 70 188 195 18 144 136 61 150 106 108 90 184 48 158 124 89 149 150 41 149 183 70
5021G0k4L9k6L4p6OL1J00J7o3j3LJ00L9j28k7O0R8m9j28K7l3QJ87n8j34O4rJ4q4R4P0j66N6
$$ 70 46 85 59 93 17 23 54 154 171 108 95 98 198 237 109 82 142 240 191 63 90 57 65 252 194 60 124 115 129 45 139 209 43 99
4622I9j0K1j9Pn5K9k2O4p3k3P7J3o3ML6K3J5Q4lq7l7N0j7k7O6K89j70j13M0o9lr5M2N9k3L6
$$ 99 89 110 91 98 43 72 50 114 41 18 95 108 45 49 85 108 123 207 204 117 80 130 113 86 152 441 271 158 198 129 126 31 73 132 109 145
4199A45J59k05J55j28J38j19N8m4po8k9Q9j2q8J75p5r2K8J49p3l8J15j56Ok3%R2q7k1M5j3
$$ 145 304 99 254 126 264 145 203 159 152 84 55 144 132 44 219 144 52 80 229 156 118 233 77 83 60 60 152 65 44 89 76
3835G6P8j22L7M9k5pM8oQ9j09N3M2k6O3j6j81M0L7qQ3j03RR0Q6o4j28K5n1L0N1m2J0J46p5
$$ 76 154 32 69 118 93 86 134 128 217 108 161 203 177 240 224 43 83 120 112 195 92 101 191 277 213 85 110 59 89 140 98 108 254 179
3436A79k3l8n4pj9J78Q1m3L0j27j00K2R6oo5J4J48l3m9j6k1j9k6J01J4l6o0q9N5m9J05J05
$$ 179 156 118 64 57 38 216 297 254 284 157 57 79 175 169 104 118 266 233 184 168 147 128 102 203 217 181 121 32 87 38 143 248
3060B48n5j20k9O4Q0J41j7j83p5K88k51J978P84j873p60q8PQP3o3nq0K29M9k04R3j92j5J48
$$ 248 193 73 44 108 188 329 312 129 54 342 91 2069 2853 980 220 132 139 147 220 157 152 72 301 350 146 239 47 32 180
2720A80K84K37m19j32o0k9k9J09J08n0r8n5K9J50Q1j67o8%l1N1K9o8k8K3rMP2O1j17k6J22
$$ 180 464 701 282 150 90 61 32 141 249 199 101 46 75 225 306 139 71 71 40 91 120 52 24 47 38 42 114 175 58 32 154
2356A54M0L7k8j74P5Q0l6Kn3J3n9jJ25J13k09Q0o9O1j7L8N6oj08m4J51K15J71l26j78jR4j71
$$ 154 194 231 203 29 104 184 148 150 97 110 51 50 175 288 79 159 90 151 134 172 228 222 114 70 221 436 607 281 103 102 196 25
1981B5J20o4%mP4N8r5P9L6M6o6%J7j21m4O0J69j93P0l1M1o9M8l8No0j4lN7k9m5M5J2K3j5J01
$$ 25 145 81 81 77 151 209 114 193 229 275 209 209 226 105 61 121 290 97 167 136 177 108 156 118 123 63 49 46 103 74 29 74 86 109 94 195
1558A95l3J14P7jJ81J926J561k165j367m00J67o2O4j68O0m7J47n4n1p6kk0J23N4j7j33R8n6
$$ 195 162 276 353 352 533 2459 4020 1855 488 88 255 193 257 89 149 102 249 195 144 68 66 46 169 223 206 73 171 115
1229A15l0n3J2K7P6n4l6K41pj68K2L8n7M6r8m7J28J7r4L1q1P6P2p9L0O9j3Nj39O7q2K5l2M3
$$ 115 85 32 44 71 147 93 57 298 291 123 145 183 126 172 74 27 155 172 78 109 28 104 176 97 127 196 183 188 49 116 34 59 27 70
830G0K1N3K8m9l1pJ15n4jm8l9j0k2K8L7K39K7j97j4J1l0p8P9o0Q5Ll3N2L4n5l6N6j07JJ33
$$ 70 91 144 172 123 92 85 200 146 145 97 58 48 26 54 91 330 357 160 146 157 127 49 128 68 153 156 123 175 209 154 118 174 67 68 201
420B01OO0Jr1o6o4K0O7J70k58K9PJ5J21J6O8j72N8J2p8l5O9M7j08j2N8l0K0jkL3l5m9Pmj5
$$ 201 207 267 268 177 111 47 67 134 304 46 75 82 97 218 234 302 130 188 200 122 87 156 203 95 83 141 111 131 130 128 161 126 77 84 80 65
-3F5J5K6P4j45J20n4J15o7m5r6M1J9O7K6j9q9
$$ 65 80 106 180 35 155 101 216 149 104 8 49 68 135 161 142 53
-191E3
##PAGE=	F1=5228.12
##FIRST=	25168.397401625570637,	5807.04592319999756,	0.37375840544700622559
##DATA TABLE=	(F2++(Y..Y)), PROFILE
5807A07l3O1N6o1k0M9j45Q7NO6j14R9l9p2K8Nn6J03m8J8n5Mnj9O4P1N9O0j00o4L6r6O0J8n3
$$ 107 74 135 191 130 110 159 14 101 106 172 58 157 118 46 74 79 23 126 78 96 41 45 40 21 85 156 215 275 175 111 147 51 111 129 76
5396G6j8J56o1K3o7l0J1J6J37j60RN4M8j57O0M0q2J01k4l3l8J06q9N9k1k9N4j1j04J35N9j37
$$ 76 58 214 153 176 109 79 90 106 243 83 92 146 194 37 97 137 55 156 132 99 61 167 78 137 116 87 141 130 26 161 220 83
5021H3l6M3J4Or4L1K5N6L0l5KK9L6P1j19l1M6N7p9m7N8l5j8J61l5j31K1k6N0j01R0O0j37R7
$$ 83 47 90 104 110 16 47 72 128 158 123 125 154 190 261 142 111 157 214 135 88 146 111 93 254 219 88 109 83 133 32 122 182 45 142
4622A42n0Q1p8j5j1M2p7J08m9m9J7N0n7O0K8k4J8P6pj22J0O9j5l0N8K98k32j4m7r7M8j02L7
$$ 142 92 173 95 80 69 111 34 142 93 44 61 111 54 114 142 118 136 212 205 83 93 162 147 117 175 473 241 227 180 83 131 29 66
4234F6O4k0K3J78k04J20j07J65j48P8q3Pm9m2R3k9n2J70m2j52M3J37p3k2J12j34jj3kP2j06
$$ 66 130 110 133 311 107 227 120 285 137 215 132 139 90 48 141 112 60 230 188 36 79 216 143 121 233 99 98 85 83 155 49
3870D9K4N5o2P3n4KK9J1o6J33J5qj03O9O8m9N2J4j91O4L5n7Q3p9m5J44Q7j05j07%l8M9M2l8
$$ 49 73 128 66 139 85 87 116 127 61 194 209 201 98 167 235 186 238 252 61 125 160 103 186 107 62 206 293 188 81 81 43 92 134 96
3471I6L1J43j26Rl7l2k2m8J46O5KLj23k5l7R7M5q4L8J41l1q9jqm5m5J06M1q8l4mO1p2J08Q3
$$ 96 127 270 144 153 116 84 62 14 160 225 227 230 107 82 45 142 187 103 141 282 251 162 161 153 108 63 169 210 122 88 84 145 73 181 264
3060B64r3q6m7Q5J60J36q0j78j06K67k77J745R49j639r01m6l8K4j7o1J31n5J54O5j72M2j94
$$ 264 171 85 38 123 283 419 339 161 55 322 45 1790 2739 1100 199 153 115 139 122 61 192 137 291 356 184 226 32
2744C2j2J25K68J04l36J1o8q2k5J19R7kp3j24L2J73O4j58j12L9J9OP2r4l6L9o0L9nJ13p9j0
$$ 32 20 145 413 517 181 192 124 42 17 136 233 231 158 34 66 239 303 145 33 72 91 97 169 75 39 78 18 57 52 165 86 76
2368G6L9QJ17l8j78J33P6q4J2m3l5m9M7K69K55l81o6mP6j08N6P6oq3m2Q1K38J00l17j46KQ6
$$ 76 115 123 240 202 24 157 233 149 161 118 83 34 81 350 605 224 158 154 230 122 178 254 248 165 123 204 442 542 225 79 81 167
1992A67j10J16j43K5K4Q9J3r6R8K5N5p4%K9q8p0M6J58j55P4n8Q0m7L5o2j1o2L9k5J4k0l3P3
$$ 167 57 173 30 55 79 168 181 85 183 208 263 189 189 218 130 60 106 264 109 183 125 205 158 193 131 120 58 97 72 86 66 33 106
1605A06j0j1k0R8o8J04J62p2J50J304J152j559r42k42J10q2Q2k12N7L8J34j39k7j1n0k7R8
$$ 106 96 85 65 163 95 199 361 289 439 1743 2895 1336 394 152 262 180 262 50 107 145 279 140 113 102 52 25 123
1288A23R0m1j24J04o5K0l8L7p9J18k1p6K14J5j66N0L1o7N6j02n6J66kj18Ro2R1N6r3R7O5j2
$$ 123 213 172 48 152 87 107 69 106 27 145 124 48 262 277 111 161 192 125 181 79 23 189 187 69 78 16 107 163 70 167 232 220
912B20mj79J10j24M5J6k1k1R1J6J8m3k2J07q3rK6m0j6Rk4M8J83Kj39k4KJ6q5K9n3R2KRLL0
$$ 220 216 37 147 23 68 84 63 42 133 149 167 124 102 209 126 117 143 103 87 96 72 120 303 305 166 142 144 160 75 104 51 143 145 154 157 187
490A87n1m2N3j03N0J63l8M1Ko7r1o4M5N9J79l11J7P8nJ64l9L7j30N8K5o6j3oN8o6j03J12j1
$$ 187 136 94 147 44 94 257 219 260 262 195 104 40 85 144 323 12 29 107 102 266 227 264 134 192 217 151 138 132 190 124 21 133 122
103A22KK1lK7k2o2J5j9pj4M0L0j00Q5KJ27p6l5q7j9R4kL1Jj14
$$ 122 124 145 142 169 147 85 100 81 74 60 100 130 30 115 117 244 168 133 46 27 121 119 150 151 37
-191C7
##PAGE=	F1=5125.86
##FIRST=	25168.397401625570637,	5807.04592319999756,	0.48604357242584228516
##DATA TABLE=	(F2++(Y..Y)), PROFILE
5807A14o6Q0O7n6Loj33J06l6Q5j35J17l5p6J04Jq3N6l4M0Oq8L7lJ6R4K4rp5k4k9J8K9J9o1
$$ 114 48 128 195 139 142 136 3 109 73 158 23 140 105 29 133 134 51 107 73 113 119 31 68 65 81 175 199 190 115 91 62 80 109 128 67
5396F7PJ35l4Jp3m4N5O3J08k14O7m8J03q6n0Q4q4J09Nq9m7R2k5k%j2L7l1o6J37R7j71j9OM3
$$ 67 74 209 175 176 103 59 114 177 285 71 138 90 193 107 57 141 57 166 171 82 35 127 102 100 100 88 125 94 28 165 262 91 72 78 121
4985A21J0q0K1K4KN0j1J4P0n3J07r3k9KRj01N1P2k4l8J06mj04l1m2Q6m3L1K4n0Q6r5J32j11
$$ 121 131 51 72 96 98 148 137 151 221 168 275 182 153 155 164 63 114 186 162 124 230 226 122 91 49 135 92 123 147 97 183 88 220 109
4586A09rj8O3o4P5j9p4l6O7l6J21K0p4M0N2k3j33M6O3j2k4M1K91k58O2q1j48Q0n2j7P4j6J7
$$ 109 100 82 145 81 156 137 63 27 94 58 179 199 125 165 217 194 61 107 170 158 134 175 466 208 270 189 41 121 69 52 126 110 127
4199A27J70j80P0o3J52j68J01r9Pk9m9R1m9QJ15Oj80L3J10n2qJ14j04J3k6nN0j21P9N3r1O9
$$ 127 297 117 187 124 276 108 209 110 117 88 39 130 81 89 204 210 30 63 173 121 113 227 123 136 110 105 155 34 113 166 75 144
3823A44k3l4K7K7q2J82M0j13q8Q4P6n1N1K6j86Q7K9o2N0l8j25J77Q5j15q1l9j1N1K9n5Q4J32
$$ 144 121 87 114 141 59 241 281 168 80 164 240 189 240 266 80 167 196 134 184 146 21 198 283 168 87 48 37 88 117 62 146 278
3448B78j66J7j6k1Kq3R6M4M3l1j08O1m1K2J02q0L0J33l1j06J0Lo4j7N5P1j10J6K6M9r0R5O2
$$ 278 112 129 113 92 94 11 107 151 194 163 55 116 75 97 199 119 149 282 251 145 155 158 94 77 132 203 93 109 135 184 94 189 251
3060B51j11n5p0R9K10J56j45j36j24J65p6N85O30p76m27n5lj0j7J26pp3J44M7r1m5j32l9J38
$$ 251 140 85 15 114 324 480 335 199 75 240 164 749 1379 603 176 121 118 108 91 217 210 137 281 328 237 192 60 21 159
2720A59P3j02m6J15m7j39J5R6Q6L2n8j46L3J64N0j56j12P9M2n1J24r9o4N8q8N5n7J53o9K6
$$ 159 232 130 84 199 152 13 28 124 210 242 184 38 71 235 285 129 17 96 138 87 211 112 48 106 18 73 16 169 100 126
2368A26n0j4J75n9j52J79O3j24K9l3q6oO2K18K76l25j21N2P8j59M1R6k0k9n7j3M8j7r7k3l1
$$ 126 76 62 237 178 26 205 268 144 173 140 54 48 110 328 604 279 158 210 288 129 170 266 246 217 160 147 195 178 81 58 27
2004B7R4m6J08j32j5K8R4j5n3Q4PM4p8nM6k8j16M6J31r9O7r4J12KK3q0m0m1M5J6o4k9M8M0
$$ 27 121 75 183 51 36 64 158 143 90 174 181 225 147 142 188 160 44 90 221 122 189 95 207 209 232 152 112 71 116 132 68 39 87 127
1605A27j4q0nO0l6R9J76j04k6J94K92l12j52O3n3j05Q8j08m1J45O8k08J1L4q8J4K5J03j7r2
$$ 127 113 33 28 88 52 151 327 223 197 391 683 371 219 282 229 124 212 104 63 208 276 68 79 113 25 39 64 167 150 58
1253E8O2o4M9pN9q2P0Qj01J53M0j40O1L7o8M5q4m7J68k1j45m%M4N8j05J49N8Jm1j84J33j09
$$ 58 120 56 105 98 157 75 145 153 52 205 245 105 166 203 135 180 96 49 217 196 51 47 47 91 149 44 193 251 252 211 27 160 51
866E1Q8j0jr7Q8K7N5n9k0Q5n8o4Q6l0j4N0m2nR9qo3m0mO0q7Mk9Q0j1N5o4L2l9m2L2o2J01J66
$$ 51 139 129 128 31 119 146 201 142 122 207 149 85 171 141 127 177 135 130 229 221 158 118 114 174 87 91 62 142 131 186 122 154 115 73 105 43 144 310
420C10j01K9Lk3j33n9Q8K4J97l11j3J41n0J93p3l3o6P4K9o0L1p8K6k0q5O4K5k0N2j2K3j1o3
$$ 310 209 238 241 218 85 26 114 138 335 24 11 152 102 295 222 189 123 197 226 166 197 119 145 125 40 104 129 109 161 149 172 161 98
32I8J6l5Lm6M9l0j7L3O4J27r5j0q1k5J18p1N4nj14
$$ 98 114 79 82 36 85 55 38 71 135 262 167 157 76 51 169 98 152 147 33
-191C3
##PAGE=	F1=5023.6
##FIRST=	25168.397401625570637,	5807.04592319999756,	0.44063863158226013184
##DATA TABLE=	(F2++(Y..Y)), PROFILE
5807A07q8J00O9n8J8l6j10J04k4O4o8K7j9q3K05j7r6k8nL8Q2r5MK1m6J09oo4l2N3o5M8OJ1
$$ 107 19 119 188 130 148 112 2 106 82 146 78 105 86 3 208 191 95 67 62 100 182 87 91 112 66 175 169 105 73 126 61 109 115 126
5408A26o6K5J02%l4o7m9J01R1Q0k09Q2j55J66j4j44J05p2J09M0j41nJ3K5m6K2NJ8n2LJ02J35
$$ 126 60 85 187 187 153 86 37 138 229 309 100 182 27 193 179 35 140 68 177 217 76 71 84 109 63 85 90 108 56 59 161 296
5032B96k02k0j4N3L2n2%L4n4P5KJ1J01j20J34m7l3o3k8n6P8P7j0m9M0K7o4p7n2J26jLl5L2
$$ 296 94 74 60 113 145 93 93 127 73 148 150 161 262 142 276 229 196 133 105 49 127 204 194 145 185 212 148 71 19 145 144 147 112 144
4633A44P1j33J63j10Jo0Q6l0K4Qr8k9K6J2J56Nj12P1J5l8j16M1N9nj5K1K65k30Q7n1k19Q5
$$ 144 215 82 245 135 136 76 162 132 156 164 66 37 63 75 231 236 124 195 210 172 56 97 156 151 136 157 422 192 279 228 9 94
4258I4Jo2R0j6J6J42j44K6k2J17j62J08r1Ml6l4Q3o7O6L2O3j72QO6j8QJ24q0L2m7rL6j32J24
$$ 94 95 33 123 107 123 265 121 147 125 242 80 188 97 101 65 31 114 47 113 145 208 36 44 110 92 100 224 144 176 129 120 156 24 148
3859A48M4j00O2k1o0L2L1o0J87O4j91p2Q4O8k8N7K1j73J01K6o8K1J0j19J06P6r3m7q5K0M4
$$ 148 192 92 154 133 73 105 136 76 263 327 136 64 148 216 188 245 266 93 194 220 152 173 183 64 170 246 153 106 21 41 85
3495H5Lp9J42J21j63k0J2j9O0j03L6L2N6o8q0J18Jp6J51m9k5J32l0j03MK1p5M5j6Q3j19P1
$$ 85 88 9 151 272 109 89 101 82 142 39 75 107 163 95 15 133 134 58 209 160 135 267 237 134 138 159 84 129 113 196 77 148
3119A48K0L1j00P5L9r8n6j7M1K08J82j60q1j17P2J03K48j90k01K6j11P3n6R0J77j34j28K03
$$ 148 168 199 99 174 213 115 59 42 83 291 473 313 232 115 187 290 538 348 147 173 62 135 79 169 346 212 84 287
2791B87j4%j35l9m3J74j82K05j7n5k0j19J7N2Q4M0n8j22M8J14M4j66k1P0J1q7J66r8o6N5o6
$$ 287 273 273 138 99 56 230 48 253 236 181 161 42 59 111 195 235 177 55 103 217 261 95 74 144 155 68 234 136 70 125 59
2427E9K4l7J60j07P5j35KJ82r0j09K12M2j49L6k3j16Q5L2K2K15j11j03Q1P3j67JJ05l1K3o9
$$ 59 83 46 206 99 174 39 41 223 133 24 236 278 129 165 142 26 111 143 165 380 269 166 247 320 153 154 259 228 251 182
2075A82p6J03N9j82l2j0M0j0J10o4o9j5P8j1K0O0l4J9o9j3N8N1j69M9R3l9O1j35J35N8J8r0
$$ 182 106 209 268 86 54 44 84 74 184 120 51 36 114 103 123 183 149 168 99 86 144 195 26 75 168 129 190 55 190 248 266 176
1699A76o2k8L6N3j01m7R6K0k0r1J0j4M8J32P5j6n0O88P01p38o88K25k09q2L4J9j13J96Jj62
$$ 176 114 86 122 175 74 27 123 143 123 32 42 28 76 208 283 267 217 905 1606 868 180 405 196 114 148 167 54 250 251 89
1347H9l4N3p8M3m9O8K0l7J5o6P2J3P3p0L4L8j10P1O3q4L5N2n8K4n3l4J40l7j38l5M2NO1r8
$$ 89 55 108 30 73 24 92 112 75 90 24 96 109 182 112 146 184 74 145 208 124 159 211 153 177 124 90 230 193 55 20 62 67 128 30
948C0J68N2K1r0j67J48p5J09m5K0j05L2O8N4o2k1N4mj35J23j4NR0n1q5J2kJ1o5jR2p2j3mP0
$$ 30 198 250 271 181 14 162 87 196 151 171 66 98 166 220 158 137 191 187 52 175 161 166 256 205 120 132 130 141 76 75 167 95 82 78 148
537A48l6J06j32L2k9k5Qj6J27J65j78L2LL8j85k1J00j5K11k89mJ52r4K03p2j36J0R4K7o3Q3
$$ 148 112 218 86 118 89 64 72 56 183 348 170 202 205 243 58 37 137 122 333 44 40 192 98 301 229 93 103 197 224 161 244
173B44j00o2J0kk5O3l9Q7k8K7mo3K4n0Pp2M5k3J5l1J26J16j21L1q5pJ18j23R2l5q9
$$ 244 144 82 92 90 65 128 89 176 148 175 171 108 132 82 89 17 62 39 54 23 149 265 144 175 90 83 201 78 170 135 46
-191D6
##PAGE=	F1=4921.34
##FIRST=	25168.397401625570637,	5807.04592319999756,	0.25677269697189331055
##DATA TABLE=	(F2++(Y..Y)), PROFILE
5807H4p3R3O4o8K1l5o9R4kL1j5o7K5o0K62m6r8j29N3mJ53n9m5M7r7R3k4q0J7Q9k8%klo6L9
$$ 84 11 104 168 100 121 86 17 111 109 140 125 58 83 23 285 239 141 12 65 61 214 155 110 157 60 153 129 49 66 155 127 127 125 122 56 95
5384I5N9K8p0n5k5J22J03N1j73P3j63J40N7k10J00m4R5P0j51J0m6K9n3L8QOm6L2P3J60k15
$$ 95 154 182 112 57 32 154 257 308 135 208 45 185 242 32 132 88 183 253 102 112 66 95 42 80 88 94 48 80 153 313 98
5021I8l9K7K0L9j0k8N1r1R3LqJ00j29J39J1m3j40j2L7J2P0jn0k0N1k5r8j7J24K3j2r4R5O0
$$ 98 59 86 106 145 135 107 158 67 160 163 155 255 126 265 276 233 93 81 118 130 200 199 149 129 180 155 57 40 164 187 175 81 176 236
4622B36j52J65p7kj22J10Pk0K2j13J2l0O9J52j4j34R6k2m3q1MO8Qj5NK23j51N5K0k57M2M1
$$ 236 84 249 172 170 48 158 165 145 167 54 66 36 105 257 243 109 205 183 140 59 63 131 139 124 129 352 201 256 276 19 61 102
4246A02p2Q9j9J7J11j07rJQ6j17P9p2J7q3LO6o2R2m7J05j31j1MK1K6J35o9N1o5j6K8j33J49
$$ 102 30 119 100 117 228 121 112 113 199 82 161 89 106 23 26 92 30 122 75 180 49 38 42 63 89 224 155 206 141 125 153 20 169
3859A69L2q8L8l1o9M1K9k4J63P8k15o1O0N0J4O1Nj54R6L2q4MO0q7J1N8n0j3q7JO2m3oQ3J18
$$ 169 201 113 151 120 51 92 121 97 260 338 123 62 122 172 186 247 252 98 194 226 142 146 206 119 130 188 138 125 38 39 101 58 52 135 253
3448B53j18q7L0j8J28j19LL9L2j03LP9O0j14J47mj10J40k3q8k3M6o8R5n1N4j28J16%J9j04
$$ 253 135 48 78 60 188 69 72 111 143 40 43 122 182 68 215 211 101 241 218 130 107 153 85 180 129 183 55 171 171 190 86
3084H6N9J2n6o2N2n6J60J93r9l6r9J7J63Q89K86p64n61j62J19m8J15J83j81j72K55j00Q2j95
$$ 86 145 157 101 39 91 35 195 388 289 253 154 171 334 1223 1509 745 184 22 141 93 208 391 210 38 293 193 275 80
2755H0M0l7J97k37L84j11j63po3QJ5Q6K1o9o6O4M7N4j91Q0P9o9q4J77r4l9L1l9j2k7K00j73
$$ 80 120 83 280 43 427 316 153 146 83 91 106 192 213 144 78 142 189 243 52 132 211 142 58 235 141 102 133 94 82 55 255 82
2380H2J33j89M6J25j24n6K27J5j54K6j6j01J56Nj50J68O6p9P1P7j60l3J02k6M3n9o1K44J23
$$ 82 215 26 72 197 73 17 244 259 105 131 115 14 170 175 25 193 259 180 251 328 168 135 237 211 254 195 134 378 501
2039E01l03j46O3l4k7J30k0r5m5K0N7N8M7r5nm3J2L4J17j86J2N9K2N8j71J40R9K9r3p0l4L9
$$ 501 198 52 115 81 54 184 164 69 24 44 101 159 206 111 106 63 75 109 226 40 52 111 133 191 20 160 259 288 195 125 91 130
1664A30O8j01n1P6L1m2k9j3rNK07k5O0K2J029J111j150j104K39k80k6l7Q6j36J95l5q4j10
$$ 130 198 97 46 122 153 111 82 69 60 65 272 247 307 329 1358 2469 1319 215 454 174 148 111 197 61 256 221 137 27
1335B7N6j2N9r2l2L9M3j5o1Q6J1P2o2K8O9j17NP3k3j1O8l0nk8j6Q8m3q4q1M6qN5p9J55M5L9
$$ 27 83 71 130 38 6 45 88 73 12 98 109 181 119 147 216 99 104 177 154 143 211 181 176 148 132 220 177 93 12 58 50 105 26 181 226 265
912B65j28j02J25m2J02p1K8q3k4J16L4l9m2K3N0j91J35LL7J24n6j69l0L5K7j05K2J03l7l9
$$ 265 137 35 160 118 220 149 177 94 70 186 220 181 139 162 212 21 156 159 196 320 264 95 65 100 127 22 44 147 110 71
560G1J2P4o3J50j72J6k8J2J3j9J39J56k58N9mJ04k24N0O1m2K02k58J0J54j26J96m5k28O4J09
$$ 71 83 157 94 244 72 88 60 72 85 66 205 361 103 162 158 262 38 88 149 107 309 51 61 215 89 285 240 12 76 185
208A85K9p8J29q8j32MP6n5M7m8J15m3L9%o6M1o1Lq8K4R0n1m3J29Q9j43Q6j04J8J07j49J27
$$ 185 214 136 265 177 45 49 125 70 117 69 184 141 180 180 114 155 94 97 9 33 123 72 29 158 247 104 190 86 104 211 62 189
-167A89p0n6
$$ 189 119 63
-191F3
##PAGE=	F1=4819.08
##FIRST=	25168.397401625570637,	5807.04592319999756,	0.30358090996742248535
##DATA TABLE=	(F2++(Y..Y)), PROFILE
5807E4j6M5N6q6J8j6j1R0qJ2J9j24P5o3L02p7r5j30N0m3J56Pq5O1j05L2k8j4QP3Ql8Nk1m6
$$ 54 38 83 139 53 71 55 44 134 126 138 157 33 108 45 347 270 175 45 95 52 208 215 130 191 86 118 90 76 84 157 165 127 132 111 65
5396F5M0K0L9r9m6J7J18J08K3j29N6r7N1J17k40P6oO6Q7j20j4m6k8k9N3kMqJO6J62j95m0P7
$$ 65 105 125 164 65 19 36 154 262 285 156 212 115 166 283 43 119 113 179 266 146 132 86 58 29 82 80 84 76 77 143 305 110 70 147
4997A47k0KL7n4P0j02R6pk5N2o9J19O6n4k11P5N7m1M1mm3n7N7Pp1J5J01L6k6j34J27N8j52
$$ 147 127 129 166 112 182 80 176 169 144 196 127 246 312 258 47 122 179 138 179 175 132 75 132 139 68 83 184 220 194 60 187 245 93
4610I3J46k4j4j99J29L7m4K4j16N4l8Q3J21l1j43J08n2l0l8m5R1K7l5mJ73m1k0J00k77K2L8
$$ 93 239 215 201 2 131 168 124 148 32 86 48 131 252 221 78 186 134 104 66 21 112 139 104 100 273 232 212 312 35 57 95
4246I5l7N5j2J4Q5q3k7nQ0o4L7n8M4r8kM1k2P8m0M7o9j3j0J6L3J37o9O3p1k4K5j23J47K3o0
$$ 95 58 113 101 115 200 117 90 85 165 101 138 80 124 26 24 65 43 121 81 128 59 46 36 52 85 222 153 216 145 121 146 23 170 193 133
3835A33rl9n3M7K1RJ33P1j88m8K1K1N9O3j6j34P8M6r0k5J11m5p2K5JJ1o4l6J07q6N3%J17o2
$$ 133 124 85 32 79 100 109 242 313 125 77 98 119 178 241 225 91 169 215 125 100 211 166 94 119 120 131 67 31 138 52 105 105 222 160
3436A60j27J7j2J82j21j2M0J2j39Q2NJ19r5R7M7j99J52j1p3n2O5l5J13n0Jj35J44l5K3j04
$$ 160 33 50 38 220 99 87 127 139 0 82 87 206 111 208 255 56 208 197 124 72 137 102 215 165 166 31 175 140 163 59
3084E9M7j1Pj1M0j16P1J70J7j5q0m7J53R82M84q07p48j40P1oP8J86j85j11J88j74J42j79N3
$$ 59 106 95 102 91 131 15 86 256 273 258 178 131 284 1266 1750 943 195 55 126 120 198 384 199 88 276 102 244 65 118
2744A18k7J96k63L32p9j53koJpP6j0p9kP4j0P4j98J53J00j77m9J52q7Kkj1m8k5K46k35J82
$$ 118 91 287 24 356 277 124 122 116 117 110 186 176 97 95 169 159 233 35 188 288 111 62 214 127 129 127 116 68 43 289 54 236
2368B36j96P5N0j25j0K00j6j36mj1k8J67j0n2J15Jo8L0R9j55m3R0oK0j6k5J14J16j93j67J22
$$ 236 40 115 165 40 30 230 214 78 74 63 35 202 192 140 255 256 188 218 317 162 119 209 203 223 207 182 296 412 219 52 174
2004A74o8p8J54nj08k2pJ24K5L3j56j5rQ8j9J31j71n1L0Q8N4j76J05J14O0q8p1m8N8O2q1o6
$$ 174 106 28 182 177 69 47 40 164 189 222 66 51 42 130 111 242 71 20 50 138 192 16 121 235 295 207 136 88 146 208 127 61
1628F1J7P7p4L4k8qp5K84n7M1PO99R82q19r58K32k38j9m1P4j04J41l6m7j29J7Q6Q1j51L3k5
$$ 61 78 155 81 115 87 79 4 288 231 272 279 978 1960 1141 183 415 177 158 117 191 87 228 192 145 16 33 119 200 49 82 57
1265E7N9m6j4N9jM9o2M6R3j23l3P2K0n6Q2J3m1k2J0K4l4k2r8J7nM9m4J08K1N3j41j1Q2k5P5
$$ 57 116 70 56 115 114 163 101 147 240 117 84 156 176 120 202 215 174 152 162 186 152 130 32 49 44 93 49 157 178 231 90 79 161 136 211
854B11p8K2n2l6J23QJ5p7j8R9k08J08K0P3J50n6k40M1N6l3r3J1Q6Oq0J7R0q1J78j82mm2N6
$$ 211 133 155 103 67 190 198 213 136 118 217 9 117 137 210 360 304 64 105 161 128 35 46 132 138 58 75 165 84 262 80 76 34 90
466I0L4n3J38J39l31J21l2J57k12R1Nm8J65k15K9J39j44J77qj61l8J13M8j10J60o4j10l3R6
$$ 90 124 71 209 348 17 138 106 263 51 142 147 99 264 49 78 217 73 250 242 81 43 156 204 94 254 190 80 47 143
126A43j9k9m4J28n4N8Mp2O0o1mr9OJ74j05KP2N4j47J34j26L5R0j45J41r2l4
$$ 143 124 95 51 179 125 183 187 115 175 114 110 11 17 191 86 88 160 214 67 201 75 110 200 55 196 104 70
-191G0
##PAGE=	F1=4716.83
##FIRST=	25168.397401625570637,	5807.04592319999756,	0.45523554086685180664
##DATA TABLE=	(F2++(Y..Y)), PROFILE
5807C5K6NM0j04M6k3M8R4m0J4L4j15Q0q2L24j02r2r5M3j0M1Q9j01N1p9l5j3L5j1L2K9n5K4
$$ 35 61 66 106 2 48 25 73 167 127 141 175 60 140 58 382 280 188 93 136 126 167 256 155 206 127 92 79 114 103 135 164 109 133
5420A33m4NK1%L4j16j0OJ11J08jr2M6j6m9J60k41N1L1K7Q4o3n9pp8l2P3j5PL5n8Q0J42j49
$$ 133 89 94 115 115 149 33 23 29 140 248 247 155 201 185 136 296 55 106 137 164 248 185 126 119 41 9 82 67 74 109 51 131 273 124
5021A24JP9l9o1P3p2Q4r1R2k3j7n3M3Q1J04n8k27J29M8n8lk8l0o4M0L3j6L1P4M2m2j45J27
$$ 124 125 204 165 104 177 105 189 98 190 167 150 97 140 221 325 267 40 169 217 159 156 128 98 34 74 107 91 122 196 238 196 51 178
4633A78O4j40J22K7k6j71L9M8n0K7r5P4k1O5P4l4j35R5p1%J1l2P1L9p7lJ23P0j05J54k78N1
$$ 178 242 102 224 251 225 54 93 141 91 118 23 97 76 141 215 181 46 141 70 70 81 49 120 159 82 79 202 272 167 321 43 94
4258I4j2J7J8J0%N7p5pl9R9m9J7o2P1o5m6NK1O9L2r5LqK1j2K7J22p3O3o4k7K3j05J19K1k6
$$ 94 82 99 117 127 127 184 109 102 63 162 113 130 68 139 74 28 33 54 123 155 60 63 55 76 64 91 213 140 203 139 112 135 30 149 170 144
3835A44o8l9KL9JL2J10L8j33l0%k7R0O4l3j19N6O3n8q0J44Pj20l4N1K0l1l4J32j17P5n0Q4
$$ 144 76 37 39 78 79 111 221 259 126 96 96 69 159 223 190 71 127 190 132 52 196 203 83 49 100 120 89 55 187 70 145 95 179
3448A79j1j17kjJ81j08j6K9J1j20R6p0J55n4L0R9k29J20Oo1p1P1QJ03k8n0j11J34q5M0r8L3
$$ 179 168 51 49 48 229 121 105 134 145 25 121 51 206 152 182 281 52 172 178 117 46 117 125 228 200 150 39 173 88 128 30 63
3072F3k6O9M7Mj00L8N2J20j3p3r8R5O13M01m52n42j19J2L7M2K05k00l5Q5j42J11r8Pj8J87
$$ 63 37 106 153 157 57 95 147 267 254 181 83 178 791 1192 740 198 79 91 128 170 375 175 140 225 83 194 96 103 85 272
2720B72j68N0L5r1K9Qlj8M6l7o7M0P9m5R8j64J70J27k74k4J12p5M3l7J8p5j2K58k69K04j86
$$ 272 104 154 189 98 127 135 132 114 160 123 56 96 175 130 228 64 234 361 87 63 175 100 143 106 124 49 37 295 26 230 44
2356D4J11j9n2k3J46n4q6l7k6N8J37j2n1J12jo8k2J30j47l4Q1J7l1M2Rj80Q0M0r8J52o7j05
$$ 44 155 136 84 61 207 153 67 30 4 62 199 187 136 248 247 179 157 287 140 106 187 204 173 215 224 44 124 164 66 218 151 46
1981D6J30mj25J5N4J27l7J2j98J5nJ59m2R3j44o4k3J33M8j60N2R5J07p6o6o0Q4M5m8r6n1J32
$$ 46 176 172 47 62 116 243 206 218 20 35 30 189 147 240 96 32 9 142 190 30 82 177 284 208 142 82 166 211 163 67 16 148
1605A48q9P1l6j3OJ73j8n1n8J3N77j62l74J29j03p4J4J5k8M8k1n2m4l0J25R5k10J00PQq2J7
$$ 148 59 130 94 81 87 260 242 191 133 146 723 561 187 316 213 139 153 168 140 188 167 115 71 41 166 261 51 151 158 166 84 101
1229A01L5nQo9Q0J00j23n1O2M3q9R6N9q3l3M3l9j4K9r4J3k7O0%M8m0O7j29Q1L6l1N5p1K2n3
$$ 101 136 131 139 70 150 250 127 76 138 181 92 188 247 164 131 174 135 121 150 56 69 42 102 102 150 110 177 48 129 165 134 189 118 140 87
819H7L9M9j3Q4r9r1J46j78M6L6R8J67m8k79J11O8p9o4j4P5L7j18mJ14r2J93j80j4l8P0M7p8
$$ 87 126 175 162 246 147 56 202 24 70 106 204 371 323 44 155 223 144 80 66 141 178 60 56 170 78 271 91 77 39 109 156 78
443G8J17J20k40P4r6J86j60J04n4k8J03j63N1J11j54J55J8r0j26J03Q8j52J66k8o9m0P5L1
$$ 78 195 315 75 149 53 239 79 183 129 101 204 41 92 203 49 204 222 132 6 109 197 45 211 183 114 74 149 180
114A80j14k7J17n9P9J0p9Q4n8pj14L8J82j31N0MJ8j12J49j30K4O8j11J23r8k0
$$ 180 66 39 156 97 176 186 107 191 133 126 12 50 232 101 151 155 173 61 210 80 104 172 61 184 86 66
-191F6
##PAGE=	F1=4614.57
##FIRST=	25168.397401625570637,	5807.04592319999756,	0.49814346432685852051
##DATA TABLE=	(F2++(Y..Y)), PROFILE
5807D6L0pMk0N3p1O7R6q0K8L6r9P4r5L21j14r1n9N5M0j11J71r0J8m2n3%K4j4j3K7n0L9o0P7
$$ 46 76 69 73 53 106 35 102 198 118 146 182 83 157 62 383 269 178 119 174 214 103 274 184 202 160 107 107 131 117 104 131 81 120 60 137
5396A37j3JK6j22L6n8J07J08k3o7O4M9j47J82k24M7N3j7O4Nj06N4n7o2L4j7MQ0j07Q0J11r0
$$ 137 124 125 151 29 65 7 114 222 199 132 196 245 98 280 56 103 156 139 203 208 102 156 99 37 71 54 58 138 31 111 222 132
5021A32N7M8m3j02P2p6Q4o3Q8m3K6j20R8L2J16n3j74J12L7m7m1p3om9J0O8RM8M6M1n4j33J05
$$ 132 189 237 194 92 164 88 172 109 197 154 180 60 158 190 306 253 79 191 228 181 140 67 61 12 22 90 99 147 193 234 180 47 152
4633A52P4j24J11N9l7j27j3Kn3O2n3N6j0L2K3j5q1M0q1K5N8pN0M3j21LQ3J61j71J61k57Q5
$$ 152 226 102 213 272 235 108 95 97 44 106 53 109 99 131 154 139 58 98 17 42 100 93 143 186 65 68 151 312 141 302 45 130
4258A30n6P3qL1j4J2p6O0o6J01p5K2p7Q5l1o6l6M2Q9P8j96M5oL4k3L5R3p7M7m8j9J8q2O7L6
$$ 130 74 147 139 170 156 168 92 152 86 187 112 134 57 142 111 45 9 51 140 218 22 67 61 95 72 107 200 123 170 122 103 121 39 106 142
3847A42Nj28PM3K8l2L8J00j0p6mMq5R7O6m2j15M9O9Lr3J01O8j33q9P2J2KNJ33j44Q1k9k1L4
$$ 142 147 19 26 69 97 65 103 203 193 117 113 117 32 129 195 153 38 87 156 159 66 167 235 102 13 85 97 99 104 237 93 174 145 124 158
3436A58q2QpJ36q5j1J6J8j10J14j05J41j5l8J47j87M1K4n2p5O1M9P3Pq4p2J13j14K5n2rk1
$$ 158 76 84 77 213 128 117 133 151 41 155 50 191 176 138 285 98 139 163 111 36 97 146 219 226 142 70 183 69 94 42 33 12
3060A2Q8R2k3p8O0j4J30k1p7n3m2R0J62Mj40j04m1P3K9K16k14L1j6Qk9k5j9k5J81l3qk2j18
$$ 12 100 192 169 91 151 137 267 246 169 116 74 164 326 330 190 86 45 118 147 363 149 180 164 172 143 118 99 74 255 222 214 192 74
2673G4Q8j7j0k3jn4j3L6Q0n6J17j33J77J49l14m3P1n7O8o8N5q2J2K16k39J61j66J56o4Rl6
$$ 74 162 145 135 112 111 57 44 80 160 104 221 88 265 414 100 57 128 71 139 71 126 44 56 272 33 194 28 184 120 129 93
2309I3R0q8j4mj0K4P4kj22Q5J34j15n1J42j18k3Q2L1p6P4N3RK7k04j1J71l7j19P3mj47M2J11
$$ 93 183 95 81 77 67 91 165 163 41 126 260 145 94 236 118 95 177 208 132 206 259 268 295 91 80 251 214 95 168 164 17 59 170
$$ [...]
-191A17
##END NTUPLES=	nD NMR SPECTRUM
##END=	
##END=	
