##TITLE=	ZGdrtYGdQFCjDMJZltIfpA.12.ser
TM-VI-221 hmqc

##JCAMP-DX=	6.0	$$ MestReNova 14.3.1-31739
##DATA TYPE=	LINK
##BLOCK_ID=	1
##BLOCKS=	2    
##ORIGIN=	Mestrelab Research S.L.
##OWNER=	hrzepa
##$MNOVA/LINK_BLOCK_TYPE=	ITEM	$$ NMR Spectrum
##$MNOVA/ITEM/POLYGON=	(XY..XY)
5321,5835
8722,5835
8722,8208
5321,8208
5321,5835
##$MNOVA/ITEM/Z=	0
##$MNOVA/ITEM/ANGLE=	0
##TITLE=	ZGdrtYGdQFCjDMJZltIfpA.12.ser
##JCAMP-DX=	6.0	$$ MestReNova 14.3.1-31739
##BLOCK_ID=	2
##DATA TYPE=	MNOVA NMR VIEW DATA
##DATA CLASS=	MNOVA VIEW DATA
##$MNOVA/2D/THRESHOLD=	35.041049957275390625
##$MNOVA/ITEM/ZOOM/X=	-0.98135677571250334861,	11.004809999983093505
##$MNOVA/ITEM/ZOOM/Y=	-4.6325299116681737388,	174.98660000188448294
##END=	
##TITLE=	ZGdrtYGdQFCjDMJZltIfpA.12.ser
##JCAMP-DX=	6.0	$$ MestReNova 14.3.1-31739
##BLOCK_ID=	3
##DATA TYPE=	nD NMR SPECTRUM
##DATA CLASS=	NTUPLES
##NUMDIM=	2
##ORIGIN=	Bruker BioSpin GmbH
##OWNER=	nmr
##.OBSERVE FREQUENCY=	400.32200160000002143
##.OBSERVE NUCLEUS=	^1H
##.SOLVENT NAME=	CDCl3
##.PULSE SEQUENCE=	hmqcgpqf
##LONGDATE=	2022/01/13 15:55:46.000
##.ACQUISITIONMODE=	SIMULTANEOUS (DQD)
##$ORIGINAL FORMAT=	Bruker XWIN-NMR
##$MNOVA/SCALES_VERSION=	9
##$PARAMETER FILE=	(acqu2s, ASCII, /private/var/folders/f6/rjf_tdyn2v98c5c0wvkgn4s80000gn/T/ZGdrtYGdQFCjDMJZltIfpA/12/acqu2s, 0)
$$ ##TITLE= Parameter file, TOPSPIN		Version 3.2
$$ ##JCAMPDX= 5.0
$$ ##DATATYPE= Parameter Values
$$ ##NPOINTS= 129	$$ modification sequence number
$$ ##ORIGIN= Bruker BioSpin GmbH
$$ ##OWNER= nmr
$$ $$ 2022-01-13 16:07:49.364 +0000  nmr@CZC2524DW0
$$ $$ /opt/topspin/data/agmb/nmr/Jan13-2022/12/acqu2s
$$ $$ process /opt/topspin3.2/prog/mod/go
$$ ##$ACQT0= 0
$$ ##$BF1= 100.660544
$$ ##$FnMODE= 1
$$ ##$NUC1= <13C>
$$ ##$NusJSP= 0
$$ ##$NusT2= 1
$$ ##$NusTD= 128
$$ ##$O1= 8556.27425043792
$$ ##$SFO1= 100.66910027425
$$ ##$SW= 179.955338625584
$$ ##$SW_h= 18115.9420289855
$$ ##$TD= 128
$$ ##END=
$$ 
##$PARAMETER FILE=	(acqus, ASCII, /private/var/folders/f6/rjf_tdyn2v98c5c0wvkgn4s80000gn/T/ZGdrtYGdQFCjDMJZltIfpA/12/acqus, 0)
$$ ##TITLE= Parameter file, TOPSPIN		Version 3.2
$$ ##JCAMPDX= 5.0
$$ ##DATATYPE= Parameter Values
$$ ##NPOINTS= 12	$$ modification sequence number
$$ ##ORIGIN= Bruker BioSpin GmbH
$$ ##OWNER= nmr
$$ $$ 2022-01-13 16:07:52.832 +0000  nmr@CZC2524DW0
$$ $$ /opt/topspin/data/agmb/nmr/Jan13-2022/12/acqus
$$ $$ process /opt/topspin3.2/prog/mod/shimcntl
$$ ##$ACQT0= 1000000
$$ ##$AMP= (0..31)
$$ 100 100 100 100 100 100 100 100 100 100 100 100 100 100 100 100 100 100
$$ 100 100 100 100 100 100 100 100 100 100 100 100 100 100
$$ ##$AMPCOIL= (0..19)
$$ 0 0 0 0 0 0 0 0 0 0 0 0 0 0 0 0 0 0 0 0
$$ ##$ANAVPT= -1
$$ ##$AQSEQ= 0
$$ ##$AQ_mod= 3
$$ ##$AUNM= <au_zgonly>
$$ ##$AUTOPOS= <51 >
$$ ##$BF1= 400.32
$$ ##$BF2= 100.660544
$$ ##$BF3= 400.32
$$ ##$BF4= 400.32
$$ ##$BF5= 400.32
$$ ##$BF6= 400.32
$$ ##$BF7= 400.32
$$ ##$BF8= 400.32
$$ ##$BYTORDA= 0
$$ ##$CAGPARS= (0..11)
$$ 0 0 0 0 0 0 0 0 0 0 0 0
$$ ##$CFDGTYP= 0
$$ ##$CFRGTYP= 9
$$ ##$CHEMSTR= <none>
$$ [...]
$$ 0 0 0 0
$$ ##$ShimPowMaxUC= (0..63)
$$ 130000 130000 130000 130000 130000 130000 130000 130000 130000 130000 130000
$$ 130000 130000 130000 130000 130000 130000 130000 130000 130000 0 0 0 0
$$ 0 0 0 0 0 0 0 0 0 0 0 0 0 0 0 0 0 0 0 0 0 0 0 0 0 0 0 0 0 0 0 0 0 0 0 0
$$ 0 0 0 0
$$ ##$ShimPowMaxUG= (0..63)
$$ 524287 524287 524287 524287 524287 524287 524287 524287 524287 524287 524287
$$ 524287 524287 524287 524287 524287 524287 524287 524287 524287 0 0 0 0
$$ 0 0 0 0 0 0 0 0 0 0 0 0 0 0 0 0 0 0 0 0 0 0 0 0 0 0 0 0 0 0 0 0 0 0 0 0
$$ 0 0 0 0
$$ ##$ShimPowRcbType= 3
$$ ##$ShimPowRes= (0..63)
$$ 1e-20 1e-20 1e-20 1e-20 1e-20 1e-20 1e-20 1e-20 1e-20 1e-20 1e-20 1e-20
$$ 1e-20 1e-20 1e-20 1e-20 1e-20 1e-20 1e-20 1e-20 0 0 0 0 0 0 0 0 0 0 0 0
$$ 0 0 0 0 0 0 0 0 0 0 0 0 0 0 0 0 0 0 0 0 0 0 0 0 0 0 0 0 0 0 0 0
$$ ##$ShimPowRng0= (0..63)
$$ 1 1 1 1 1 1 1 1 1 1 1 1 1 1 1 1 1 1 1 1 0 0 0 0 0 0 0 0 0 0 0 0 0 0 0 0
$$ 0 0 0 0 0 0 0 0 0 0 0 0 0 0 0 0 0 0 0 0 0 0 0 0 0 0 0 0
$$ ##$ShimPowRng1= (0..63)
$$ 1 1 1 1 1 1 1 1 1 1 1 1 1 1 1 1 1 1 1 1 0 0 0 0 0 0 0 0 0 0 0 0 0 0 0 0
$$ 0 0 0 0 0 0 0 0 0 0 0 0 0 0 0 0 0 0 0 0 0 0 0 0 0 0 0 0
$$ ##$ShimPowRng2= (0..63)
$$ 1 1 1 1 1 1 1 1 1 1 1 1 1 1 1 1 1 1 1 1 0 0 0 0 0 0 0 0 0 0 0 0 0 0 0 0
$$ 0 0 0 0 0 0 0 0 0 0 0 0 0 0 0 0 0 0 0 0 0 0 0 0 0 0 0 0
$$ ##$ShimPowRng3= (0..63)
$$ 1 1 1 1 1 1 1 1 1 1 1 1 1 1 1 1 1 1 1 1 0 0 0 0 0 0 0 0 0 0 0 0 0 0 0 0
$$ 0 0 0 0 0 0 0 0 0 0 0 0 0 0 0 0 0 0 0 0 0 0 0 0 0 0 0 0
$$ ##$ShimSysFunc= (0..63)
$$ 1 2 3 4 5 7 9 11 15 16 8 10 12 14 6 17 13 18 19 20 0 0 0 0 0 0 0 0 0 0
$$ 0 0 0 0 0 0 0 0 0 0 0 0 0 0 0 0 0 0 0 0 0 0 0 0 0 0 0 0 0 0 0 0 0 0
$$ ##$ShimSysMatrix= 0
$$ ##$ShimSysType= 1
$$ ##$TFXNUM= 0
$$ ##$TRIPLO2= 0
$$ ##$VTU= 2
$$ ##$VTUETH= <149.236.99.20>
$$ ##$VTUTY= <no>
$$ ##$WBREFAM= (0..15)
$$ 132.2 106.2 100 100 100 100 100 100 100 100 100 100 100 100 100 100
$$ ##$WBREFLM= (0..15)
$$ 0 0 0 0 0 0 0 0 0 0 0 0 0 0 0 0
$$ ##$WBREFPH= (0..15)
$$ 77.55 -65.76 0 0 0 0 0 0 0 0 0 0 0 0 0 0
$$ ##$WBSGU= (0..15)
$$ 0 0 0 0 0 0 0 0 0 0 0 0 0 0 0 0
$$ ##$XFAC= 2
$$ ##END=
$$ 
##$DECIM=	4160
##$DSPFVS=	20
##.ACQUISITIONSCHEME=	NOT PHASESENSITIVE
##NTUPLES=	nD NMR SPECTRUM
##VAR_NAME=	FREQUENCY1,	FREQUENCY2,	SPECTRUM
##SYMBOL=	F1,	F2,	Y
##.NUCLEUS=	13C,	1H
##.OBSERVE FREQUENCY=	100.66910027424999896,	400.32200160000002143
##VAR_TYPE=	INDEPENDENT,	INDEPENDENT,	DEPENDENT
##VAR_FORM=	AFFN,	AFFN,	ASDF
##VAR_DIM=	512,	512,	262144
##UNITS=	HZ,	HZ,	ARBITRARY UNITS
##FIRST=	17614.246348710370512,	4405.4455391999963467,	0.67486417293548583984
##LAST=	-466.31298099976766025,	-392.85674445383250486,	0.30835857987403869629
##MIN=	-466.31298099976766025,	-392.85674445383250486,	0.00088372931350022554398
##MAX=	17614.246348710370512,	4405.4455391999963467,	1652.3280029296875
##FACTOR=	1,	1,	0.0056416729589985172358
##PAGE=	F1=17614.2
##FIRST=	17614.246348710370512,	4405.4455391999963467,	0.67486417293548583984
##DATA TABLE=	(F2++(Y..Y)), PROFILE
$$ [...]
##PAGE=	F1=-4039.97
##FIRST=	17614.246348710370512,	4405.4455391999963467,	0
##DATA TABLE=	(F2++(Y..Y)), PROFILE
1335 253 201 258 145 265 234 299 272 223 102 172 254 335 206 99 189 206 233 301 90 216 250 147 168 153 236 255 186 192 150 22 51
1044 51 102 42 159 204 211 141 117 97 70 134 172 82 119 135 198 101 92 209 172 42 41 193 229 100 226 206 8 111 74 91 98 32 97
734 97 88 34 131 152 145 165 21 103 74 92 44 47 96 86 122 77 60 45 152 175 43 43 131 140 149 147 100 76 32 66 44 70 74 46 134 162 82 64
377 64 55 20 64 97 20 22 23 74 82 20 46 24 96 166 136 123 40 55 62 47 72 75 64 48 94 82 118 72 37 101 52 47 68 8 75 69 74 64 21 41
2 41 83 88 71 97 53 33 97 80 45 102 36 49 26 39 130 137 85 9 72 94 165 47 132 30 56 51 8 44 7 17 62 63 38 39 129 139 115 117 138
-365 138 70 64 54
-393E4
##PAGE=	F1=-4110.73
##FIRST=	17614.246348710370512,	4405.4455391999963467,	0
##DATA TABLE=	(F2++(Y..Y)), PROFILE
4405 46 97 92 111 48 124 139 219 146 5 47 49 53 100 89 196 108 43 67 63 54 39 76 174 89 57 104 16 10 36 11 35 64 135 109 33 74 87
4058 87 49 59 26 97 82 83 112 73 27 93 94 62 53 26 97 34 45 80 62 67 36 59 53 40 116 63 9 122 96 127 70 37 105 154 159 107 127 95
3701 95 92 89 16 42 60 49 83 97 192 98 79 151 64 121 55 122 54 56 178 199 125 119 116 114 151 104 45 113 108 61 58 63 75 66 35 23 43 84 89 115
3326 115 108 199 308 174 62 183 229 159 126 51 127 146 64 96 92 142 168 150 197 278 341 377 370 453 202 114 41 75 44 54 90 17 73 129
3006 129 82 79 45 12 57 184 212 321 408 499 395 408 318 160 136 201 207 183 248 186 181 54 168 140 93 160 238 163 285 319 457 804
2706 804 876 723 295 253 190 182 198 88 165 71 59 155 154 19 56 122 48 73 92 64 128 85 96 26 101 34 74 121 100 116 78 199 215
2396 215 177 129 203 140 188 121 148 126 104 110 50 124 121 121 345 266 104 225 367 591 1147 976 308 227 109 168 54 126 198 398 257
2105 257 348 443 599 844 1344 3447 3495 1483 812 530 560 617 486 589 866 220 136 105 12 166 146 102 228 40 116 161 205
1851 205 152 151 75 136 108 134 199 222 103 93 151 227 223 219 211 268 367 341 285 257 301 355 309 300 335 457 507 451 484 498 592 620 681 877 1116
1523 1116 1611 2194 3344 5466 11665 5832 2711 1846 1443 1136 1032 856 891 1081 1017 787 397 351 363 303 237 251 169 253
1297 253 213 299 283 261 119 138 219 337 240 102 160 190 205 314 113 205 280 158 180 137 238 279 206 191 170 64 44 94 31 123 183
1006 183 217 161 154 107 74 120 160 108 77 111 186 109 85 192 185 57 58 150 209 123 201 221 33 117 106 96 133 48 96 98 19 112 143 149 197 55
668 55 98 87 98 53 69 70 95 147 105 88 57 135 179 63 44 104 159 165 150 122 107 44 91 72 72 65 41 130 185 121 60 51 23 41 117 55 25 21
311 21 86 96 17 48 23 92 173 141 111 44 23 71 53 64 64 35 25 64 59 131 62 7 108 72 35 69 17 41 55 66 63 14 47 108 77 78 103
-36 103 75 1 91 64 26 89 15 66 31 21 106 123 83 8 79 83 192 33 142 56 62 80 39 57 18 24 60 51 62 17 93 119 119 123 159 70 75
-383 75 43
-393D3
##PAGE=	F1=-4181.5
##FIRST=	17614.246348710370512,	4405.4455391999963467,	0
##DATA TABLE=	(F2++(Y..Y)), PROFILE
4405 30 87 59 101 60 146 151 241 151 29 83 69 57 107 103 178 84 37 55 84 71 33 95 174 93 41 105 3 16 32 9 28 62 132 107 44
4077 44 66 91 32 52 32 74 79 72 129 90 36 82 106 93 44 32 85 25 30 55 71 65 29 58 59 37 96 67 27 101 111 106 83 51 80 127 140 113
3720 113 163 98 46 48 9 33 45 45 75 94 202 106 76 163 64 136 71 117 77 79 142 172 133 136 119 96 136 107 46 151 111 88 81 69 55 34
3382 34 53 57 82 83 69 99 107 122 261 168 48 152 205 129 133 44 129 159 56 109 83 99 150 140 178 266 345 356 319 432 199 86 38 69
3063 69 41 66 127 56 70 140 83 87 43 10 49 169 209 316 429 475 387 327 328 151 118 177 180 171 237 200 194 82 166 173 109 153 235 176 292
2734 292 293 457 813 845 699 258 245 178 136 205 84 160 92 36 158 181 32 44 113 79 49 88 44 118 105 108 17 112 45 53 95 82 58
2424 58 66 199 216 229 134 216 142 218 152 134 141 142 126 96 114 167 69 322 294 117 194 288 506 1080 961 307 236 95 184 58 109 169
2124 169 394 271 341 455 598 797 1365 3512 3544 1511 853 551 564 625 538 630 867 217 170 99 50 159 141 108 246 103
1880 103 75 156 220 135 179 58 127 117 143 191 254 102 122 132 227 229 230 266 304 391 377 269 267 322 409 340 322 319 426 523 488 515 491 612
1560 612 666 741 907 1154 1628 2298 3471 5710 12111 6015 2731 1867 1492 1166 1064 883 946 1230 1240 1062 533 425 408
1344 408 376 294 266 212 255 222 308 299 290 185 150 177 331 276 155 140 173 174 297 142 177 301 183 196 123 227 289 250 200 182 110 75
1044 75 112 25 83 154 202 172 175 144 97 133 163 149 40 93 165 133 68 161 187 68 90 95 172 134 158 212 56 104 128 83 162 88 73 96 11
715 11 113 116 140 204 102 100 98 108 61 86 90 101 165 129 118 71 130 185 88 52 86 160 184 139 130 133 72 118 102 64 57 36 117 197 161 61 42 54
358 54 10 125 94 22 41 85 97 52 63 37 86 172 139 96 60 15 83 66 73 60 48 10 76 29 135 48 47 103 83 41 70 37 47 45 63 60 13
11 13 35 116 63 82 109 97 33 84 82 9 73 18 83 36 31 71 103 71 14 81 78 213 44 133 73 66 100 70 66 36 37 56 51 85 52 83 95 120 119
-355 119 166 61 79 26
-393B6
##PAGE=	F1=-4252.26
##FIRST=	17614.246348710370512,	4405.4455391999963467,	0
##DATA TABLE=	(F2++(Y..Y)), PROFILE
4405 9 73 41 90 60 155 151 244 145 60 116 83 47 107 120 156 55 35 62 106 89 32 116 163 83 20 87 17 37 15 13 21 62 121 104 54 52 85
4058 85 15 30 41 54 75 59 136 102 45 74 122 127 59 45 92 25 18 42 89 67 26 52 74 64 76 69 42 80 124 88 96 56 76 95 115 109 182 96
3701 96 43 15 28 46 36 36 65 77 194 107 76 163 64 139 78 106 95 92 103 145 125 138 115 70 110 110 32 177 104 101 95 81 40 26 71 87 107
3354 107 106 39 76 124 65 198 162 58 114 185 104 126 35 124 172 45 122 80 74 122 118 165 246 330 339 257 387 204 50 39 63 37 79 164
3035 164 87 72 142 70 87 34 36 42 138 184 297 426 454 393 247 315 164 102 150 154 158 207 186 193 102 161 196 124 180 225 205 300 291 423 827
2706 827 842 699 246 243 194 83 204 100 156 115 22 161 212 47 68 116 119 44 94 18 92 126 119 38 114 66 40 78 108 29 42 193
2405 193 203 259 158 228 142 234 197 131 150 179 135 131 121 198 103 328 333 161 225 261 454 1013 943 339 230 119 196 109 91 157 384
2114 384 299 342 464 639 774 1359 3584 3613 1514 895 597 576 614 576 695 888 207 190 90 113 183 145 127 256 158 26 146
1861 146 221 148 209 77 113 109 147 175 283 94 153 143 225 231 239 298 362 429 415 278 276 337 455 402 390 365 400 528 534 562 498 623 696 803
1541 803 953 1225 1675 2391 3629 5945 12607 6248 2742 1857 1499 1160 1052 862 925 1303 1416 1329 725 541 482 469 374
1326 374 314 256 264 263 323 330 308 250 202 151 314 305 222 168 172 170 269 167 139 302 210 213 124 206 276 293 224 184 154 112 149 69 42 122 175 167 183
978 183 175 120 157 175 188 75 98 144 171 46 122 179 79 122 36 125 136 119 185 75 78 142 53 171 134 40 78 9 125 79 116 185 131
668 131 102 99 126 71 88 142 119 177 152 140 85 128 190 112 54 91 146 207 120 125 150 90 138 131 46 56 30 96 195 189 82 30 80 24 120 130 8
321 8 66 70 87 78 83 60 75 163 130 80 78 39 95 75 85 64 70 26 118 41 138 48 84 88 80 53 70 48 88 64 65 47 32 6 103 52 85 115 111 63 70
-64 70 107 30 52 38 95 40 51 39 80 53 13 76 71 221 79 111 72 61 108 90 68 49 48 49 55 99 79 107 88 116 108 158 44 75 6
-393F
##PAGE=	F1=-4323.03
##FIRST=	17614.246348710370512,	4405.4455391999963467,	0
##DATA TABLE=	(F2++(Y..Y)), PROFILE
4405 17 62 55 78 52 153 142 229 129 81 140 89 24 100 137 141 24 43 80 124 102 33 131 143 64 9 62 31 64 20 20 14 65 100 98 72 29
4067 29 73 24 20 40 34 64 48 131 106 55 69 130 149 85 61 109 40 14 56 113 71 27 36 92 84 73 68 55 60 131 80 99 58 103 70 87 97 183
3711 183 88 79 42 39 72 41 29 58 47 165 102 71 152 62 129 71 87 104 91 69 121 104 125 108 43 85 113 11 187 100 100 95 87 51 69 85
3373 85 112 110 132 12 49 141 117 142 163 90 67 166 99 113 33 110 181 30 126 76 75 96 88 160 230 306 335 214 333 217 29 46 62 30
3053 30 85 190 107 79 135 54 84 20 64 47 94 138 262 403 437 410 209 288 196 111 117 135 152 182 162 176 106 160 204 134 213 219 239 318
2734 318 326 375 820 844 710 264 233 220 34 192 120 160 139 48 158 241 61 98 126 152 78 118 18 65 139 131 69 108 85 29 76 151
2434 151 91 25 178 189 265 186 240 144 231 230 150 148 219 149 145 140 213 157 349 375 203 269 301 482 992 933 372 219 162 206 172 68 165
2124 165 374 335 367 458 704 813 1354 3664 3706 1499 912 658 606 593 591 752 932 202 191 73 171 234 168 154 265 199 54
1870 54 127 206 173 247 137 138 100 137 146 302 79 176 167 224 227 257 311 411 475 447 293 282 341 470 462 458 456 416 528 588 613 543 639 713 848
1541 848 994 1298 1747 2473 3802 6152 13060 6507 2754 1835 1470 1119 993 793 811 1248 1473 1498 896 663 566 562 462
1326 462 387 302 275 314 335 367 328 295 255 163 290 318 270 228 202 197 270 182 112 280 232 226 132 188 243 313 250 177 191 142 182 125 25 99
1006 99 147 150 182 194 136 171 186 210 130 119 133 209 46 93 164 85 148 33 79 130 114 150 86 48 152 45 159 173 57 68 10 128
706 128 44 83 143 135 96 85 141 79 75 187 149 189 175 154 107 123 189 133 58 105 121 230 103 114 155 97 146 152 23 62 21 67 178 197
387 197 114 34 93 48 102 154 14 84 43 69 89 101 83 56 144 114 64 93 63 105 77 94 70 79 33 150 78 139 76 116 70 60 59 72 51
58 51 120 91 65 30 59 32 79 46 90 123 111 82 57 119 56 31 58 98 43 69 49 57 43 9 71 60 212 118 90 58 41 102 98 60 61 50 36
-290 36 55 101 86 131 107 107 100 141 21 66 13
-393A3
##PAGE=	F1=-4393.79
##FIRST=	17614.246348710370512,	4405.4455391999963467,	0
##DATA TABLE=	(F2++(Y..Y)), PROFILE
4405 39 57 76 64 39 141 130 205 108 88 150 87 7 84 152 142 15 56 94 134 108 33 139 118 51 42 54 49 92 50 30 14 70 71 91 95 18
4067 18 65 44 56 33 10 41 42 114 103 69 68 124 151 104 82 125 58 23 82 141 78 29 14 107 88 86 62 64 43 129 81 89 62 139 72 56 84 170
3711 170 74 112 75 38 94 63 30 53 14 121 94 56 134 60 111 60 59 103 81 47 99 72 99 102 28 71 116 19 185 114 96 83 86 70 113
3382 113 96 130 94 149 13 27 139 180 116 161 120 18 144 110 104 46 89 183 27 121 70 80 81 48 151 211 279 324 195 277 224 44
3081 44 59 71 22 79 201 113 94 121 49 80 3 86 63 47 83 215 367 423 430 228 257 229 146 78 121 149 179 150 159 93 162 197 140 230
2762 230 216 260 345 386 350 790 826 711 290 214 236 15 170 130 163 160 89 144 263 77 118 130 167 117 152 43 73 135 140 96 101 95 27
2452 27 86 191 152 55 152 183 253 201 256 155 218 238 182 133 249 180 143 159 218 199 363 411 243 285 357 551 1022 933 377 213 209
2161 209 209 235 61 182 363 368 416 445 755 901 1377 3759 3818 1489 890 703 653 575 594 776 979 209 177 55 215 288 198
1908 198 182 275 218 113 101 185 183 284 213 205 123 117 125 305 73 191 188 230 216 282 314 444 523 477 310 278 341 452 496 497 547 470 537 642
1588 642 662 612 686 736 885 1025 1357 1830 2551 3995 6379 13523 6807 2815 1845 1446 1083 916 717 641 1060 1383 1521
1372 1521 991 748 631 628 537 458 353 294 354 344 391 359 321 288 198 268 314 288 278 253 225 321 195 131 242 245 235 136 186 214 305 268
1072 268 167 220 166 193 175 56 91 129 128 175 205 145 172 192 215 171 137 132 237 71 96 153 82 167 79 61 113 143 130 87 35 156 83
762 83 129 196 106 102 24 121 34 61 86 119 82 56 142 83 51 205 172 203 193 165 134 119 187 148 82 115 91 245 99 111 152 102 144 166 16
433 16 75 10 33 150 181 143 59 97 62 74 159 40 89 14 56 84 110 98 28 116 90 48 101 86 111 72 99 77 77 33 158 104 133 112 140
105 140 58 27 53 75 52 137 111 62 34 82 71 66 47 96 132 100 86 59 115 78 28 76 91 43 82 81 32 43 7 72 43 189 151 91 66 23
-233 23 84 97 42 74 49 21 48 99 74 138 131 100 100 128 13 55 31
-393C1
##PAGE=	F1=-4464.56
##FIRST=	17614.246348710370512,	4405.4455391999963467,	0
##DATA TABLE=	(F2++(Y..Y)), PROFILE
4405 58 59 89 48 23 123 122 180 89 80 144 78 32 64 163 158 38 68 97 131 102 32 137 97 60 74 72 72 116 81 38 21 75 39 89 116 51 78
4058 78 63 90 34 16 5 34 91 95 88 70 107 135 106 103 131 70 36 111 172 87 31 29 118 77 100 46 68 30 115 83 67 70 169 100 32 72 152 54
3701 54 137 100 24 104 89 39 52 21 73 87 33 120 64 94 71 29 96 82 38 77 34 64 98 46 70 113 36 179 138 105 63 83 80 150 106
3373 106 138 68 154 28 21 116 215 123 146 137 30 115 119 108 68 60 177 47 110 78 70 77 4 131 179 250 291 180 220 212 64 74 86 22 63
3044 63 201 114 114 107 64 73 15 98 85 21 57 166 327 402 434 263 227 248 181 36 107 138 189 157 155 72 160 177 149 230 210 255 368 444
2725 444 370 761 783 688 303 193 234 37 145 125 155 169 130 118 272 97 124 127 157 143 182 61 116 113 136 109 92 91 37 98 222 197
2424 197 97 121 180 237 198 274 175 214 218 210 112 256 218 142 166 218 229 357 431 280 267 392 599 1066 939 351 207 247 201 285 89
2133 89 207 350 387 467 448 771 991 1431 3867 3948 1506 845 705 699 564 598 769 1011 229 161 70 238 324 218 200 287 215
1880 215 156 76 169 163 304 285 273 175 106 144 298 92 200 204 249 210 304 319 464 570 511 341 261 345 421 495 498 605 525 558 686 709
1579 709 672 763 782 928 1058 1408 1910 2626 4198 6659 14065 7153 2954 1915 1468 1100 871 690 517 791 1175 1406
1372 1406 990 772 658 646 583 502 398 327 374 356 390 394 341 301 232 258 302 277 293 302 233 386 214 183 205 251 239 136 187 213 277 273
1072 273 159 237 194 187 211 92 92 120 109 161 215 146 172 192 210 196 147 134 251 99 123 159 70 175 113 91 83 171 144 75 54 145 122 90
753 90 197 144 156 44 115 52 69 50 95 76 39 125 76 35 192 175 210 195 171 158 121 187 159 122 128 73 242 104 122 149 114 134 176 37
433 37 92 8 4 120 147 158 94 94 79 39 145 63 80 27 59 64 107 95 2 89 62 31 101 106 113 66 99 84 71 42 140 110 113 141 154 54 16
86 16 36 77 53 142 121 68 58 93 100 82 52 102 141 81 74 75 103 94 49 91 74 39 90 108 10 40 6 75 26 158 169 111 106 58 64 100 12 86 54
-280 54 5 36 99 57 127 148 98 105 126 31 45 45
-393D5
##PAGE=	F1=-4535.32
##FIRST=	17614.246348710370512,	4405.4455391999963467,	0
##DATA TABLE=	(F2++(Y..Y)), PROFILE
4405 71 63 92 29 5 102 117 166 81 62 127 69 49 40 167 181 59 76 90 114 84 30 129 86 79 98 93 95 130 110 44 24 75 23 94 127 88 109
4058 109 81 111 53 48 41 18 70 86 110 77 85 109 89 114 125 72 48 137 200 98 36 57 124 57 103 25 62 29 90 82 48 78 185 129 46 62
3720 62 140 30 151 117 9 102 111 55 52 45 46 81 12 114 73 94 107 13 86 109 45 56 15 40 96 72 77 103 45 174 157 131 41 85 79 180
3382 180 115 135 52 150 39 35 76 219 151 123 139 62 81 116 122 91 31 161 70 101 113 61 80 45 99 133 218 246 154 170 181 81 89 99
3063 99 31 47 201 123 133 101 86 63 36 106 106 53 92 148 300 377 414 281 199 245 200 14 90 112 191 164 159 61 151 144 162 217 198 225 370
2734 370 479 417 765 735 642 295 180 214 44 125 110 132 161 162 82 266 118 117 122 120 150 197 66 160 78 118 107 82 73 50 103 240 222
2424 222 133 96 169 226 177 283 193 232 185 226 102 232 241 145 163 213 249 337 427 311 234 399 603 1087 945 318 187 269 177 312
2142 312 121 240 342 392 504 483 753 1057 1497 3967 4088 1561 819 662 728 561 611 753 1034 253 156 122 236 329 215
1908 215 200 294 191 172 68 165 111 292 334 315 225 115 190 285 127 200 213 275 227 320 332 480 615 550 388 233 355 406 465 471
1626 471 618 551 578 706 752 701 838 848 981 1101 1459 1981 2690 4367 6954 14621 7498 3142 2023 1531 1171 879 728
1410 728 539 548 925 1214 916 740 647 615 595 508 421 368 372 375 367 413 365 306 256 258 295 254 269 331 218 426 240 238 194 255 241 147 171 232
1091 232 246 269 151 241 228 181 234 129 96 113 98 137 223 140 175 184 208 208 151 137 249 121 152 181 70 173 136 134 44 178 182 56 84
781 84 116 144 47 174 158 200 66 123 81 82 80 85 93 73 92 57 49 152 152 201 170 166 169 122 183 163 163 153 101 219 108 142 148 138 118 186 61 106
424 106 29 36 104 115 153 129 92 112 11 123 81 58 49 71 33 97 75 28 81 41 16 93 121 109 66 88 87 69 68 101 96 79 151 153 53 49 22
77 22 74 57 147 128 97 80 88 113 107 60 102 146 61 48 89 94 106 76 108 50 34 92 126 38 25 11 72 13 124 169 131 147 103 53 115 25 92
-271 92 68 18 21 103 56 110 152 103 110 129 46 39 56
-393E6
##PAGE=	F1=-4606.09
##FIRST=	17614.246348710370512,	4405.4455391999963467,	0
##DATA TABLE=	(F2++(Y..Y)), PROFILE
4405 80 64 85 10 16 81 112 166 84 46 112 68 54 15 167 204 73 78 75 86 57 32 115 83 93 109 105 115 134 135 51 24 69 34 102 123 114 141
4058 141 98 118 77 78 91 5 62 78 130 90 65 92 57 114 109 61 57 155 218 106 49 77 125 48 94 31 46 36 58 75 55 82 181 146 78 50
3720 50 140 20 153 124 29 95 124 75 51 58 67 74 31 117 79 110 148 31 80 149 71 42 49 60 94 93 93 85 46 172 161 163 21 93 70 206
3382 206 124 121 75 139 53 58 28 197 185 113 134 76 59 101 134 111 36 140 88 96 157 88 91 92 57 90 182 214 120 144 141 98 97 105 39 51 212
3035 212 149 148 102 105 50 57 120 123 91 135 185 306 362 376 275 174 221 198 43 72 77 173 161 156 70 144 99 172 202 187 188 343 481 457 798
2706 798 712 588 268 174 182 38 112 91 102 132 178 40 241 136 106 129 69 134 196 61 192 48 98 90 68 45 61 99 241 227 161
2415 161 87 142 216 140 274 197 257 165 224 118 185 238 144 157 200 255 318 399 327 212 385 571 1071 950 317 150 272 146 312
2142 312 134 271 345 389 521 540 720 1097 1563 4051 4228 1644 846 603 739 566 627 753 1063 271 167 184 212 307 193
1908 193 185 297 170 158 86 170 37 242 346 320 252 133 225 273 164 187 211 289 262 337 352 494 657 594 439 208 367 427 434 447
1626 447 598 549 587 696 783 701 879 919 1033 1153 1513 2054 2754 4490 7228 15115 7802 3330 2139 1607 1259 921 785
1410 785 652 469 734 1036 828 687 621 556 588 485 419 401 358 395 339 406 389 322 276 261 295 241 226 332 197 421 264 278 217
1138 217 256 245 182 130 243 221 260 145 227 258 199 249 170 112 114 93 110 219 131 178 165 214 214 162 140 234 133 171 203 100 164 151 171
828 171 42 161 220 55 114 80 150 13 131 148 220 85 139 117 80 118 99 121 121 54 28 71 96 111 177 117 142 162 113 165 156 192 184 157
509 157 182 103 158 149 167 93 192 81 111 54 61 110 116 132 156 93 158 51 114 98 34 58 80 17 94 60 43 96 54 27 82 123 100 75 62 84
171 84 69 95 57 71 48 138 138 48 70 39 65 59 155 139 137 94 66 108 123 69 95 145 50 17 91 89 114 104 126 22 32 89 138 77 6 30 58
-177 58 8 91 148 140 171 135 59 139 69 84 83 37 3 107 71 97 146 109 117 128 56 36 64
-393F4
##PAGE=	F1=-4676.85
##FIRST=	17614.246348710370512,	4405.4455391999963467,	0
##DATA TABLE=	(F2++(Y..Y)), PROFILE
4405 83 61 69 20 39 66 105 171 90 52 115 77 51 8 162 222 81 77 59 55 36 42 99 81 99 106 106 127 130 151 63 34 57 39 107 107 122 161 109
4049 109 113 95 104 135 34 72 74 144 107 47 92 24 102 93 37 60 158 219 108 69 87 123 58 74 64 24 43 23 62 81 79 156 143 105 40 150
3711 150 43 144 123 50 92 129 96 52 62 101 64 51 122 80 126 182 42 78 186 108 38 83 98 90 109 121 70 44 170 148 189 5
3410 5 100 59 227 130 100 118 125 66 89 23 161 214 133 134 78 74 83 140 127 70 120 96 95 190 139 114 135 17 91 147 214 95 150 110 115 95 99
3063 99 40 69 232 179 155 105 116 42 76 148 135 123 163 244 342 367 341 252 162 188 186 74 66 43 135 148 134 86 145 54 171 190 183 172 294
2734 294 449 472 829 725 550 230 166 149 36 99 73 83 91 180 13 199 150 96 150 64 100 181 59 209 64 107 70 67 20 67
2452 67 90 225 219 182 101 95 196 103 243 183 267 175 210 145 138 213 125 152 183 248 306 361 325 216 360 530 1019 946 355 110 261 128
2152 128 297 132 281 359 387 520 599 699 1120 1635 4136 4368 1736 916 573 745 587 637 780 1105 275 184 237 172 273
1917 273 164 173 302 184 124 112 185 59 159 314 291 253 147 230 260 197 163 201 275 289 362 379 506 686 640 473 210 371 465
1645 465 429 455 573 542 594 672 798 700 878 978 1078 1212 1568 2143 2845 4617 7521 15614 8094 3515 2257 1696 1343
1429 1343 983 820 764 550 671 945 785 664 612 511 579 465 404 420 342 409 329 374 403 353 300 272 302 249 204 308 199 376
1166 376 273 300 262 254 256 230 79 235 197 248 146 190 268 238 261 212 148 137 101 97 203 130 179 133 217 212 189 145 214 138 179 211 139 159
847 159 164 196 90 127 243 83 141 81 156 45 81 126 215 102 147 155 74 135 120 146 162 26 19 85 39 74 155 53 97 135 99 126 136
537 136 202 207 213 151 86 166 152 195 57 188 95 104 80 76 124 146 104 169 97 202 97 131 117 39 57 80 40 106 95 45 119 84 53 72 114
208 114 89 86 30 73 63 112 40 62 67 103 113 42 73 62 48 57 163 153 175 96 33 87 125 81 77 135 50 14 81 82 116 126 143 6 37 79 145
-139 145 113 38 58 37 10 62 109 132 168 144 67 158 111 60 88 53 20 107 85 91 132 109 128 121 64 38 68
-393F8
##PAGE=	F1=-4747.62
##FIRST=	17614.246348710370512,	4405.4455391999963467,	0
##DATA TABLE=	(F2++(Y..Y)), PROFILE
4405 82 57 48 45 59 59 95 170 88 71 137 88 47 30 155 235 84 75 46 27 47 60 78 77 100 91 99 133 124 153 73 54 42 31 104 87 112 164 109
4049 109 107 100 119 164 63 90 77 152 124 31 97 46 83 94 6 56 146 202 100 88 86 118 73 48 97 30 48 15 45 103 74 111 120 119 37 162
3711 162 73 126 117 60 96 130 114 54 56 127 62 56 128 75 131 201 41 77 208 147 39 106 132 85 119 156 79 45 164 123 204 12 101 60
3391 60 240 135 75 160 118 76 122 66 125 227 167 141 76 101 77 139 142 104 112 99 91 203 187 145 169 44 127 124 233 94 167 101 131 77
3072 77 80 32 83 245 197 154 102 118 43 89 180 138 144 174 287 383 389 334 228 173 169 184 105 86 39 88 144 97 95 151 59 154 182 188 188 248 396
2725 396 464 830 749 542 196 153 130 60 77 53 80 48 175 51 142 157 92 175 127 60 160 76 214 103 150 63 93 42 67 91 193
2434 193 203 199 129 36 161 94 193 160 253 206 193 169 131 193 98 148 169 238 296 335 310 237 331 504 945 918 396 104 242 140 292
2142 292 141 258 375 392 509 649 718 1127 1719 4249 4507 1821 990 590 757 627 634 818 1149 264 192 267 126 246 148
1908 148 182 316 235 103 135 211 137 70 248 250 240 159 208 243 223 143 197 235 283 389 415 521 700 687 481 243 368 496 450 492
1626 492 566 560 614 657 800 730 849 1016 1119 1273 1620 2242 2966 4794 7874 16221 8406 3709 2382 1809 1429 1065 825
1410 825 846 655 701 934 792 691 641 516 582 479 407 431 337 417 342 336 396 387 328 301 319 265 232 279 230 318 265 305 309 253 272 273 89
1100 89 222 173 224 161 135 245 270 268 244 187 179 133 107 185 141 182 95 211 195 226 153 194 141 174 201 165 164 175 207 136 86 244 115 157
781 157 124 174 84 64 113 197 120 140 187 94 133 132 163 192 42 54 88 21 68 156 70 42 95 102 72 104 189 213 254 148 67 162 157 217 35
452 35 169 101 87 101 83 129 175 88 166 99 232 136 157 139 70 50 70 57 122 151 41 140 111 82 71 98 78 95 48 64 46 110 63 81
133 81 114 56 96 51 57 75 28 49 165 161 198 88 37 56 118 98 52 115 55 35 65 64 110 137 153 32 47 65 146 139 72 88 32 19 48 60
-205 60 111 138 127 66 162 143 23 81 58 43 102 95 83 112 97 140 118 80 43 68
-393F8
##PAGE=	F1=-4818.38
##FIRST=	17614.246348710370512,	4405.4455391999963467,	0
##DATA TABLE=	(F2++(Y..Y)), PROFILE
4405 78 60 37 68 74 55 82 158 76 87 161 95 50 45 144 238 80 75 39 10 70 77 52 76 106 75 84 133 124 139 74 74 27 12 93 74 92 152 94
4049 94 107 91 122 172 84 109 85 151 134 35 91 84 62 115 30 42 120 166 81 98 78 111 80 20 122 61 56 40 34 110 68 57 82 119 43 166
3711 166 97 106 114 60 98 129 128 62 43 141 81 44 127 72 120 202 36 71 210 178 39 115 154 78 126 191 115 57 151 97 203 33 90 73
3391 73 242 136 51 187 123 81 149 100 119 221 194 152 88 113 89 130 162 130 117 101 89 191 215 175 190 94 165 128 252 108 175 106
3091 106 143 41 48 21 87 242 194 145 93 110 49 94 205 138 150 172 302 411 415 359 217 198 177 201 136 120 66 63 158 70 100 157 104
2781 104 131 174 199 213 235 348 447 798 759 553 182 137 132 96 43 25 76 22 171 88 82 157 86 197 189 59 144 105 216 140 204 79
2480 79 134 81 56 107 149 178 206 163 25 117 125 131 142 218 234 181 187 157 204 101 139 161 243 278 337 292 261 302 493 876 870 410 134 220
2161 220 163 310 182 208 383 399 493 685 778 1121 1798 4386 4636 1890 1037 631 774 679 624 851 1188 255 184 266 84 233
1917 233 155 204 336 292 125 150 241 194 78 172 219 236 181 176 225 239 150 214 198 239 405 460 555 714 737 474 282 377 518 478 537
1626 537 579 608 654 671 800 798 824 1031 1160 1340 1667 2327 3084 5007 8246 16899 8703 3899 2492 1929 1526 1163 822 895
1401 895 728 754 951 811 734 693 561 593 525 441 450 351 424 362 307 368 405 348 341 351 277 283 273 266 283 254 293 345 261 287 298 151 224 174
1081 174 186 182 89 187 275 267 257 214 216 183 126 189 160 192 86 194 159 257 164 182 151 158 179 166 171 184 207 167 63 219 136 157 162 199 115 99
743 99 115 184 142 122 204 139 132 130 175 208 73 90 81 58 80 178 142 51 47 127 56 67 156 201 275 172 74 145 162 230 78 134 98 69 110 85
405 85 123 190 95 150 98 242 166 171 157 104 44 62 58 123 194 43 162 128 106 81 83 73 100 95 71 33 87 79 103 151 26 101 75 30 74 23
67 23 35 158 159 200 72 80 28 110 118 30 89 58 47 56 45 93 136 152 55 59 47 136 148 98 114 54 32 56 37 85 92 89 52 145 158 21 70 49
-290 49 62 94 103 79 98 70 148 128 106 48 62
-393F2
##PAGE=	F1=-4889.15
##FIRST=	17614.246348710370512,	4405.4455391999963467,	0
##DATA TABLE=	(F2++(Y..Y)), PROFILE
4405 75 73 51 87 84 47 66 138 52 93 176 97 57 51 131 233 72 79 39 8 81 88 24 86 121 73 63 129 131 114 63 87 14 17 82 77 74 136 72 111
4039 111 70 117 164 95 125 92 143 135 63 74 113 39 141 63 24 88 120 53 95 65 100 78 8 137 89 71 59 51 100 64 35 38 108 51 158
3711 158 112 92 119 63 93 127 135 74 22 138 110 32 114 77 94 186 42 60 193 194 42 105 158 69 130 218 156 77 134 92 187 61 69 85
3391 85 229 135 33 193 133 82 165 120 150 201 208 161 119 99 101 115 183 148 128 106 97 163 215 196 194 139 193 150 259 116 168 111 148 13
3072 13 15 34 79 220 175 129 80 94 55 90 212 139 139 167 288 415 431 391 215 214 197 221 162 149 93 82 180 77 104 162 139 121 163 209
2753 209 226 254 334 438 753 748 560 189 122 148 133 16 15 55 16 169 116 37 148 71 209 226 106 142 131 221 170 253 105 167 120
2462 120 31 126 100 144 197 189 77 99 171 77 141 171 250 172 200 177 240 142 128 152 263 255 362 276 284 287 479 830 839 401 168 199 167 338
2142 338 235 157 378 392 478 705 860 1119 1853 4516 4740 1942 1057 667 779 729 618 865 1216 263 163 237 54 219
1917 219 170 225 352 332 168 154 266 223 148 135 210 251 214 168 216 244 180 248 207 178 394 498 609 744 792 476 297 412 552
1645 552 510 579 601 673 711 717 813 894 836 1034 1205 1426 1729 2397 3192 5223 8599 17611 8971 4076 2576 2020 1629 1264 844
1410 844 917 775 797 972 819 755 743 613 604 576 492 489 383 452 382 297 333 400 349 374 391 286 323 304 289 289 260 269 361 279 298 303 205 245
1091 245 224 153 198 111 105 246 256 250 218 233 230 139 217 184 206 122 177 120 268 179 178 173 133 166 142 170 186 200 181 78 174 142 138 175 213 132
753 132 137 119 181 167 101 202 183 150 118 182 209 104 123 65 86 85 199 202 111 21 152 115 36 110 180 281 204 115 115 164 229 134 94 90 61
424 61 106 85 113 191 110 131 99 231 186 170 167 135 43 76 44 102 208 52 186 137 121 98 79 78 102 137 90 61 47 75 110 168 60 122
105 122 99 18 64 42 16 144 151 182 51 124 46 103 139 42 67 57 56 57 50 66 127 140 77 70 25 115 141 113 132 82 47 68 69 64 46 45 33 112
-252 112 152 57 69 25 73 86 107 89 103 37 144 146 131 52 50
-393E0
##PAGE=	F1=-4959.92
##FIRST=	17614.246348710370512,	4405.4455391999963467,	0
##DATA TABLE=	(F2++(Y..Y)), PROFILE
4405 80 90 73 99 87 37 47 118 27 86 174 96 63 51 115 225 66 84 45 19 74 86 22 104 142 86 38 123 142 93 40 90 20 40 78
4086 78 89 70 131 66 111 49 114 151 98 137 92 127 120 95 65 127 13 155 90 25 55 69 20 79 48 81 71 35 142 106 87 69 85 77 57
3758 57 78 22 93 60 138 114 92 125 79 89 124 135 86 9 123 137 56 87 90 58 158 60 50 162 192 51 78 144 58 129 232 188 100
3448 100 124 116 159 91 38 86 201 130 41 178 138 80 165 125 190 179 211 170 163 58 97 95 197 157 138 112 117 134 185 205 178 171 213 170 255
3119 255 109 148 108 146 70 38 61 66 182 154 113 71 75 62 79 201 145 118 161 251 393 426 406 215 207 207 227 176 166 112 105 199 97 106 172
2790 172 158 131 150 214 224 273 352 451 721 735 553 206 114 164 164 64 52 17 2 158 136 53 131 42 205 233 151 151 147 230 196 297 136
2480 136 183 150 26 138 48 107 162 200 108 136 216 86 157 132 252 171 209 178 274 186 125 143 281 243 398 267 300 304 449 775 866
2189 866 408 197 191 140 352 278 151 365 361 461 705 934 1148 1889 4627 4834 1983 1070 696 765 766 631 864 1237 292 141
1945 141 192 41 186 169 238 364 348 210 150 280 227 197 167 216 273 247 197 229 238 216 282 256 164 359 510 655 786 840 508 258
1664 258 453 607 557 624 627 736 779 784 851 1002 909 1051 1252 1544 1838 2486 3337 5461 8987 18469 9301 4267 2664 2072
1438 2072 1728 1357 912 927 809 827 998 832 750 773 656 609 612 540 543 427 515 414 306 310 380 330 385 425 303 344 360 299 316 292
1156 292 248 359 299 307 297 237 263 296 172 201 175 64 187 237 234 207 223 261 151 249 213 216 169 168 124 255 199 182 202 110 182 110 154 183
837 183 195 186 104 122 137 105 166 206 133 161 110 175 189 96 180 210 180 110 185 191 129 153 39 102 81 206 236 163 67 159 181 22 61 156 281
509 281 229 163 76 155 212 177 74 87 67 88 78 108 191 114 124 110 211 202 156 170 159 42 113 19 60 192 56 206 147 120 119 78 89
199 89 104 168 105 106 26 50 98 162 92 144 113 42 58 59 19 123 146 151 28 162 90 97 155 75 53 54 68 57 74 35 120 122 97 82 1 84 121
-149 121 116 140 111 64 68 101 61 40 45 24 70 131 81 83 18 79 75 101 106 124 36 126 154 148 53 40
-393D0
##PAGE=	F1=-5030.68
##FIRST=	17614.246348710370512,	4405.4455391999963467,	0
##DATA TABLE=	(F2++(Y..Y)), PROFILE
4405 92 104 89 105 87 40 26 114 31 72 157 92 65 47 100 219 74 86 53 36 54 70 48 122 161 99 11 117 151 94 12 86 45 58 83
4086 83 104 72 142 93 104 51 118 153 97 144 84 105 91 118 82 127 28 146 106 49 29 21 13 51 28 61 63 62 142 110 99 70 121 45 48 117 50
3739 50 78 72 111 101 100 125 98 93 126 127 91 31 104 154 95 65 111 23 130 79 50 127 178 63 40 117 45 121 231 203 118 128 154 122 117 5
3401 5 72 158 116 71 156 139 72 151 118 216 168 207 180 210 4 72 71 196 157 143 115 141 125 132 202 144 183 227 181 241 87 119 99 138 124
3072 124 70 81 58 136 145 100 66 62 71 65 181 148 108 157 204 348 397 402 218 178 199 213 180 170 126 112 209 108 101 185 169 145 143 210 216 265 374
2725 374 477 719 748 553 223 115 175 185 123 91 30 33 132 150 90 119 8 186 217 179 164 156 239 219 345 174 182 166 70 140 7
2434 7 104 103 187 113 189 259 146 189 131 248 189 217 173 294 220 124 146 281 251 429 274 312 352 420 637 918 472 240 219 99 342
2142 342 303 194 349 310 429 680 974 1208 1927 4736 4947 2025 1101 734 744 791 671 867 1267 329 129 152 37 137
1917 137 140 248 374 346 241 147 280 216 221 216 230 288 269 242 264 230 252 311 308 240 338 509 685 833 877 583 139 445 649 607 667
1626 667 653 775 842 847 902 1094 1022 1098 1292 1668 1989 2610 3541 5732 9445 19510 9766 4491 2802 2101 1809 1437 1011
1410 1011 942 843 846 1027 872 734 779 690 615 623 568 593 473 600 471 342 311 367 304 374 437 328 351 417 307 345 337 251 351 308 319
1119 319 293 253 258 351 237 193 230 132 118 213 221 196 193 265 167 267 249 219 204 167 173 228 220 193 230 104 218 105 130 180 197 196 120 88 129
790 129 70 148 183 127 167 98 148 197 113 146 219 208 122 187 156 137 176 24 105 81 198 247 200 117 144 237 28 29 131 278 245 198 39
480 39 135 180 196 91 94 74 65 65 107 196 100 127 133 196 218 137 169 173 42 158 24 9 156 52 214 162 103 140 68 98 106 186 113 142 78
152 78 11 68 132 105 158 111 59 64 68 44 100 154 128 20 188 136 87 164 108 44 48 81 53 89 8 122 108 114 93 20 56 94 112 138 143 85 56
-196 56 116 71 61 83 30 41 111 91 100 59 88 62 80 112 141 69 98 144 147 47 45
-393D5
##PAGE=	F1=-5101.45
##FIRST=	17614.246348710370512,	4405.4455391999963467,	0
##DATA TABLE=	(F2++(Y..Y)), PROFILE
4405 102 110 96 105 82 60 15 127 57 56 128 86 65 44 89 220 100 81 60 50 44 51 67 132 172 103 14 111 151 109 15 79 74 65 89 120 66 158
4058 158 130 89 73 129 174 100 144 72 79 49 126 112 122 70 112 109 69 14 28 43 17 22 59 57 91 137 101 100 66 149 30 39 136 77 65 83 86 74
3701 74 107 111 107 97 130 113 82 50 98 162 128 82 137 30 119 97 62 95 157 70 29 85 41 109 216 198 126 141 187 82 132 29 45 103
3382 103 91 100 150 146 64 125 100 218 167 200 190 251 69 33 48 178 146 144 112 159 138 84 192 105 169 234 190 225 62 94 85 122 161 93
3063 93 84 62 90 146 94 65 59 79 51 162 138 117 156 164 291 350 393 241 149 187 189 178 170 143 101 214 115 84 195 186 147 148 195 218 223 375
2725 375 498 742 797 597 247 127 183 191 180 125 74 71 90 162 125 128 56 151 191 189 176 164 247 237 405 227 181 167 117 133 42 144 38
2415 38 157 93 224 295 205 229 177 250 230 231 194 313 267 104 164 263 274 443 305 324 415 444 394 914 575 308 287 132 315 322 259
2124 259 349 282 367 624 967 1267 1973 4855 5087 2073 1150 787 739 813 730 897 1326 368 129 141 37 112 105 257 383 332
1880 332 261 154 270 203 230 253 256 296 277 283 307 228 287 343 350 349 396 566 766 950 976 746 114 337 622 628 683 661 773 880 880 943
1579 943 1138 1130 1165 1316 1751 2134 2740 3754 5986 9887 20523 10284 4716 2989 2142 1860 1500 1105 970 882 853 1042
1372 1042 934 729 761 719 626 614 573 620 512 674 542 408 331 382 292 350 421 348 350 460 324 370 376 283 362 311 337 303 271 221 367
1081 367 304 179 263 202 81 187 220 197 168 244 186 262 284 222 221 167 221 210 240 209 247 119 249 139 116 183 207 221 130 93 128 57
781 57 140 160 132 160 108 96 184 136 114 213 225 153 199 126 121 188 50 95 93 176 241 224 162 109 282 57 46 99 266 253 209 37 108 143
462 143 189 118 103 80 56 68 100 199 72 126 157 190 231 123 167 173 45 195 63 52 129 49 203 182 71 156 42 98 104 191 120 158
161 158 130 45 27 88 99 161 97 63 72 64 65 83 166 139 42 198 176 73 164 137 32 41 89 48 91 24 125 103 121 102 36 52 63 99 128
-167 128 171 106 40 114 81 73 115 31 46 110 92 107 99 107 50 50 95 140 94 73 115 128 36 63
-393F3
##PAGE=	F1=-5172.21
##FIRST=	17614.246348710370512,	4405.4455391999963467,	0
##DATA TABLE=	(F2++(Y..Y)), PROFILE
4405 108 108 95 102 75 83 26 143 79 47 93 78 61 43 80 218 132 65 68 59 67 60 71 130 173 98 36 103 138 119 38 72 100 65 89 133 50 168
4058 168 160 73 94 140 201 111 137 60 56 2 117 139 125 114 62 104 77 10 65 68 23 42 85 57 122 129 81 89 59 164 54 41 136 101 57 88
3720 88 72 40 106 86 99 90 134 96 55 59 103 161 148 118 167 61 128 117 80 73 137 67 66 69 55 96 192 177 121 150 203 54 130 52 33 49 55
3373 55 121 164 167 72 99 76 194 168 188 196 279 132 33 34 144 126 138 106 167 154 97 185 93 134 234 209 222 60 87 68 97 177 113 65
3053 65 69 51 141 92 74 57 82 36 155 110 131 160 155 249 303 392 277 153 190 177 171 175 172 92 218 131 60 190 210 143 161 178 238 166 346
2725 346 501 773 863 689 287 149 194 180 226 154 100 101 55 171 154 157 107 113 169 186 179 173 254 244 468 293 204 166 156 131 69 189 72
2415 72 127 64 225 317 248 263 235 264 278 257 249 352 354 60 181 246 298 434 353 345 475 551 431 805 663 387 370 234 296 352 334
2124 334 393 351 298 540 919 1290 2009 4969 5227 2128 1202 843 759 838 790 951 1410 398 136 157 47 160 157 273 381
1889 381 308 263 168 259 189 229 270 292 303 277 311 342 236 316 380 388 445 533 744 1012 1254 1276 1052 422 103 496 598 665 649 735 891
1598 891 885 971 1134 1211 1240 1346 1779 2246 2862 3943 6220 10278 21414 10781 4925 3202 2239 1896 1557 1184 1010 931
1391 931 862 1036 998 745 733 746 647 601 557 619 547 713 604 489 358 423 316 330 392 354 339 485 351 392 400 323 406 326 363 336 310
1100 310 166 344 350 173 273 246 107 167 224 202 179 207 198 238 311 237 223 165 243 215 259 228 250 143 258 182 126 200 220 260 152 109
800 109 135 79 144 155 157 157 150 23 150 148 100 197 235 189 227 146 85 189 82 82 115 146 227 240 202 63 316 107 70 53 237 256 197 54
480 54 87 123 160 140 104 85 73 106 84 190 59 110 171 190 237 116 162 160 49 213 100 102 142 66 176 204 27 161 12 87 95 183
180 183 131 150 165 97 19 53 73 153 79 59 69 54 76 83 172 174 69 189 204 62 156 161 18 43 85 54 86 54 120 103 116 106 43 71 28
-149 28 80 108 190 119 44 97 83 72 134 20 54 127 94 106 127 136 46 40 58 120 100 68 72 92 21 81
-393H1
##PAGE=	F1=-5242.98
##FIRST=	17614.246348710370512,	4405.4455391999963467,	0
##DATA TABLE=	(F2++(Y..Y)), PROFILE
4405 107 98 88 94 71 99 39 149 96 46 60 70 55 49 65 203 156 40 74 62 100 95 62 117 163 86 57 94 113 117 58 62 117 60 84 138 31
4067 31 164 178 67 104 148 221 125 125 53 46 43 97 153 144 152 59 99 71 10 95 86 51 64 117 67 153 116 54 69 51 163 82 56 118 123 64 84
3720 84 69 8 96 61 77 68 131 88 11 57 104 151 157 143 196 91 145 141 102 69 119 52 99 78 77 88 168 148 104 146 199 55 107 63 57 61 28
3373 28 131 182 192 102 94 58 148 161 169 194 289 181 79 37 104 98 123 100 169 158 150 186 124 93 227 239 237 87 100 49 72 173 145 36
3053 36 67 46 123 92 95 46 79 21 158 73 130 168 182 250 271 389 304 183 209 190 158 184 204 113 228 160 46 168 227 154 174 166 269
2743 269 150 298 488 795 915 785 335 175 209 151 253 178 105 111 67 171 172 183 145 90 155 180 171 178 260 239 516 359 250 181
2462 181 182 145 87 214 140 133 74 186 316 269 280 279 289 311 287 309 409 469 78 181 255 320 404 397 376 519 698 950 667 693 448
2171 448 440 337 304 398 408 483 502 335 459 860 1283 2020 5069 5345 2183 1240 889 789 864 835 1005 1481 406 144 176 73
1926 73 242 283 308 351 271 241 172 253 170 212 265 320 308 269 320 351 243 325 405 416 503 681 993 1410 1749 1792 1480 796 237 320 555
1635 555 661 655 714 906 900 1024 1126 1284 1344 1438 1813 2360 3034 4167 6556 10792 22519 11361 5176 3443 2430 1972
1429 1972 1638 1274 1066 1000 900 1036 1055 790 722 773 679 612 539 601 584 719 641 563 392 472 367 337 378 351 319 493 381 410 413
1156 413 350 468 370 398 392 371 144 307 373 194 272 267 152 166 223 198 219 177 203 202 324 263 221 165 235 235 282 248 244 170 242 210 148 225
837 225 233 301 202 114 144 109 150 164 187 175 201 64 100 143 113 169 241 220 265 210 67 181 102 88 141 115 217 253 238 17 339 167
537 167 88 15 187 260 179 63 79 137 123 160 86 92 97 163 77 162 89 77 169 187 233 117 154 142 52 208 128 139 184 99 141 223 21 152
217 152 53 68 83 160 147 124 181 140 67 80 32 138 78 66 53 52 74 96 161 204 95 161 216 65 140 177 24 62 69 70 89 91 102 102 97 104 42
-130 42 95 11 53 82 192 121 66 76 73 67 139 13 46 140 98 100 138 165 55 59 33 91 89 83 38 48 3 92
-393I2
##PAGE=	F1=-5313.74
##FIRST=	17614.246348710370512,	4405.4455391999963467,	0
##DATA TABLE=	(F2++(Y..Y)), PROFILE
4405 104 83 79 81 72 106 45 138 105 45 48 69 52 62 39 168 165 5 74 61 126 130 42 100 149 77 75 83 81 104 77 47 124 55 85 129 20 146
4058 146 178 71 101 151 225 137 111 49 52 78 70 154 169 175 117 107 59 11 117 99 67 77 135 81 178 102 25 54 49 147 101 72 91 138 84 73
3720 73 63 15 85 50 60 40 123 98 45 43 90 130 160 146 218 122 161 167 124 84 99 30 116 98 99 88 146 121 85 134 179 75 68 62 77 110 56
3373 56 131 188 203 137 118 78 90 144 142 184 283 213 117 51 76 71 97 94 167 143 192 193 165 83 215 272 264 115 118 32 61 159 186 62 55 77 102
3025 102 93 119 22 72 18 159 65 102 168 218 282 262 362 301 203 226 218 130 184 222 157 245 194 61 134 224 184 187 161 294 209 253 469 797
2706 797 927 838 372 193 219 113 253 196 90 96 96 159 172 188 162 93 139 174 151 168 257 217 528 404 292 209 193 173 105 213 186
2415 186 170 119 117 284 267 274 295 309 319 303 346 458 574 179 167 287 346 367 417 405 535 818 1523 722 641 464 477 407 324 439
2133 439 462 580 660 501 444 829 1284 2023 5163 5446 2236 1262 926 816 883 861 1042 1519 387 147 175 106 318 415 373
1898 373 280 212 194 150 244 143 171 229 315 295 241 301 317 226 297 389 413 505 777 1213 1827 2292 2381 1934 1163 625 345 587 744
1626 744 740 774 967 971 1131 1174 1380 1491 1609 1927 2520 3298 4483 7074 11558 24106 12122 5501 3697 2686 2114 1748
1419 1748 1387 1143 1084 973 1066 1099 864 745 799 711 657 538 581 618 712 653 612 431 508 415 372 395 354 293 485 406 423 416 349 514
1138 514 427 428 457 434 198 291 376 238 275 278 193 192 216 183 255 173 208 167 321 291 225 169 210 247 308 270 238 196 206 214 161 242 242 330 267 115
800 115 147 131 151 167 206 212 242 141 58 127 143 122 236 239 299 276 114 172 108 117 163 98 215 263 272 46 347 223 108 69 129 265 188
490 188 71 73 168 93 187 50 93 109 215 106 118 127 44 153 177 219 125 140 134 51 180 140 161 224 133 109 239 68 131 101 47 79 129
180 129 154 93 178 164 111 130 25 123 98 97 27 69 65 104 131 210 115 120 212 79 117 183 41 87 47 84 99 129 76 94 71 96 33 114 52
-149 52 22 54 181 112 86 65 57 62 130 34 23 137 94 94 131 185 73 73 71 80 69 99 55 29 13 96
-393I6
##PAGE=	F1=-5384.51
##FIRST=	17614.246348710370512,	4405.4455391999963467,	0
##DATA TABLE=	(F2++(Y..Y)), PROFILE
4405 102 67 65 64 75 106 49 108 106 37 56 75 55 80 21 116 156 33 60 55 142 155 19 85 135 81 88 70 59 92 93 30 125 52 97 108 19 117
4058 117 158 72 90 146 214 138 103 47 61 98 44 140 189 180 166 126 54 15 126 115 65 80 132 92 191 91 10 62 53 122 108 82 64 139 101
3729 101 67 47 20 82 49 63 36 118 118 102 20 62 99 162 131 224 152 174 190 142 110 70 33 113 113 115 91 124 99 78 124 161 97 33 56 77
3391 77 141 97 126 177 192 156 148 123 61 115 111 166 268 226 141 67 78 60 67 84 166 107 205 192 193 111 201 295 288 132 131 19 74 147 223 120
3053 120 50 111 108 98 135 21 69 44 149 106 49 147 240 313 274 305 264 195 226 245 88 171 210 199 264 229 84 102 199 210 204 158 297
2743 297 285 239 452 778 890 827 380 197 214 82 228 201 72 61 110 136 151 166 152 100 114 160 125 135 236 181 490 410 307
2471 307 225 190 197 126 190 201 205 158 32 225 241 249 278 308 303 290 342 466 631 282 157 312 372 339 401 420 515 861 1964 1003 510
2180 510 418 469 430 327 451 475 633 769 689 517 841 1318 2045 5261 5546 2280 1274 962 848 894 880 1077 1556 367
1955 367 145 151 134 373 519 457 167 139 132 98 224 129 98 160 263 256 175 247 234 167 219 307 353 437 783 1324 2121 2711 2860 2292
1673 2292 1450 982 600 710 902 901 902 1069 1089 1267 1275 1488 1650 1800 2108 2710 3596 4827 7646 12390 25823 12920 5820
1457 5820 3906 2907 2281 1849 1495 1225 1153 1055 1115 1116 943 795 822 723 712 561 561 634 708 653 625 472 517 432 407 424 366 273 453
1185 453 416 424 407 322 516 465 434 506 477 272 310 367 280 285 288 228 235 212 166 263 183 217 150 300 311 239 171 182 235 323 293 243 217 170 193
856 193 150 237 240 335 325 125 144 139 149 149 201 246 262 197 67 113 177 55 209 236 315 317 175 164 103 144 173 100 220 265 300 94 336
546 336 262 138 124 90 261 227 96 56 194 89 221 49 80 100 245 155 71 150 59 127 161 201 134 120 141 45 138 132 164 247 161 87
246 87 248 112 97 138 35 85 101 143 74 165 164 146 169 80 124 118 142 19 95 61 100 91 186 126 74 192 96 86 177 51 106 42 89 100
-74 100 158 58 81 45 86 17 122 88 9 31 164 102 97 79 66 55 106 54 7 118 74 83 108 186 93 72 107 97 54 106 84 63 26 93
-393I3
##PAGE=	F1=-5455.27
##FIRST=	17614.246348710370512,	4405.4455391999963467,	0
##DATA TABLE=	(F2++(Y..Y)), PROFILE
4405 101 51 48 45 77 101 53 66 93 24 66 78 60 97 63 61 131 75 30 41 145 170 23 75 127 97 92 53 61 85 100 18 124 53 115 90 14
4067 14 80 119 60 74 128 189 128 104 47 68 102 23 113 195 168 189 142 66 24 124 138 44 75 105 90 187 88 22 77 61 96 105 84 51 122
3739 122 102 75 22 15 85 43 72 51 121 133 150 13 31 60 160 107 211 178 186 206 152 136 35 63 93 120 123 95 98 77 86 126 168 116 67
3410 67 56 54 146 130 125 153 161 150 164 165 100 80 90 137 247 226 154 82 97 78 57 68 167 54 188 176 203 141 186 304 303 138 139 16 92
3081 92 146 239 172 76 138 147 114 142 63 76 81 128 157 24 104 242 326 301 239 208 162 203 265 60 155 162 218 278 264 100 98 174 215 226 168
2753 168 273 339 267 438 750 816 758 353 184 188 75 180 189 75 27 100 110 117 124 119 92 80 129 104 80 192 131 405 376 287 214 170
2452 170 204 141 165 186 218 175 50 156 192 216 236 276 279 249 299 421 620 355 173 312 391 331 357 414 463 811 2168 1296 325
2180 325 312 417 417 305 422 445 611 797 820 626 875 1365 2094 5362 5667 2320 1287 1000 905 908 914 1134 1639 385 155
1945 155 120 149 402 579 535 28 121 122 64 195 177 34 82 174 225 88 180 153 81 93 159 232 310 695 1285 2191 2869 3085 2459
1673 2459 1600 1237 847 845 1055 1078 1034 1174 1211 1387 1387 1583 1785 1954 2290 2901 3862 5139 8149 13119 27328 13662 6085
1457 6085 4057 3041 2434 1928 1574 1301 1198 1125 1165 1106 1005 856 850 723 759 607 549 624 713 664 617 518 519 420 428 444 386 280 397
1185 397 410 417 394 286 467 471 407 522 497 328 348 357 304 302 301 256 284 229 172 241 188 229 172 262 319 264 172 169 203 313 316 267 237 171 167 117
847 117 203 216 312 357 151 142 140 148 111 174 265 260 228 109 109 207 47 153 203 305 328 223 157 97 157 169 102 222 255 317 139 303 276
537 276 179 169 107 242 270 136 38 207 114 254 124 63 66 245 201 71 157 104 93 134 180 139 100 158 36 95 112 149 247 182 74
246 74 249 153 53 159 49 88 98 116 65 148 141 164 188 133 149 126 190 52 118 70 88 71 137 130 31 166 112 47 158 56 110 65 86
-64 86 88 169 66 73 25 78 17 113 113 39 26 147 108 101 106 113 44 77 64 36 90 43 60 72 164 108 72 121 123 58 101 101 98 37 87
-393H7
##PAGE=	F1=-5526.04
##FIRST=	17614.246348710370512,	4405.4455391999963467,	0
##DATA TABLE=	(F2++(Y..Y)), PROFILE
4405 95 32 31 32 81 98 62 37 66 18 68 73 62 105 112 67 100 112 15 27 135 179 49 69 124 120 89 34 73 84 94 25 120 58 128 93 22 50
4058 50 62 30 56 94 156 108 111 52 71 89 15 77 185 152 183 146 82 35 110 166 6 79 61 73 166 95 26 83 67 77 99 78 58 92 82
3729 82 92 21 33 86 38 66 53 126 136 182 49 5 36 147 91 179 192 193 216 153 150 35 96 63 120 121 97 62 49 96 132 200 132 121 65
3401 65 18 126 151 134 117 124 116 159 191 149 63 96 94 224 217 166 100 110 109 89 44 169 20 149 142 194 156 171 301 312 137 143 22 102 157
3072 157 229 202 118 162 197 142 145 102 95 122 108 198 101 61 229 321 328 206 163 114 162 278 95 162 82 205 277 298 111 119 183 198 245 200
2753 200 236 359 320 428 728 727 664 298 161 146 90 119 164 100 63 76 87 86 97 90 71 67 88 106 27 133 75 291 316 249 183 133 193
2443 193 143 158 159 210 172 114 126 133 195 192 215 265 205 241 334 550 390 211 294 404 343 312 393 411 693 2120 1462 125 191 331 394
2152 394 291 367 405 519 748 868 723 910 1404 2163 5479 5833 2373 1312 1038 991 936 970 1218 1759 432 181 114 150
1926 150 406 593 584 121 211 207 140 192 273 129 128 122 276 161 198 238 148 79 73 138 215 557 1114 2008 2706 2984 2392 1597 1352 1006
1645 1006 932 1146 1226 1137 1259 1321 1484 1496 1673 1903 2085 2463 3122 4139 5505 8719 14003 29116 14650 6463 4280
1448 4280 3171 2616 2051 1665 1407 1264 1203 1239 1124 1059 938 906 758 811 689 572 619 736 711 625 579 558 435 453 463 420 333
1194 333 345 413 418 400 283 398 455 372 505 512 364 390 373 310 326 321 284 335 283 220 219 190 238 235 222 321 305 191 181 181 278 339 309 265 227
865 227 186 100 156 174 271 361 183 157 153 155 83 135 269 246 242 153 122 227 140 89 140 272 319 256 151 105 161 163 92 213 237 322 183 255
546 255 263 223 206 156 214 294 176 72 208 159 276 213 88 13 215 233 129 171 149 62 98 162 138 94 177 35 65 96 125 227 197
255 197 68 240 191 21 167 87 86 122 94 61 132 107 159 187 177 192 122 235 94 137 84 91 99 93 133 16 148 133 26 130 70 96
-45 96 94 89 81 160 86 87 18 77 49 84 122 66 31 132 129 104 131 172 39 67 70 61 61 46 25 33 117 112 91 115 145 86 86 103 127 49 79
-393G9
##PAGE=	F1=-5596.8
##FIRST=	17614.246348710370512,	4405.4455391999963467,	0
##DATA TABLE=	(F2++(Y..Y)), PROFILE
4405 79 13 32 28 90 98 74 67 32 23 69 58 66 101 152 120 79 140 71 50 109 183 79 68 123 142 86 27 76 84 70 36 106 60 133 115 49 47 13
4049 13 13 38 51 121 86 120 65 76 60 24 37 162 146 163 141 93 45 90 187 39 100 11 46 135 112 17 73 68 69 101 69 73 65 45 100 45 65
3701 65 76 60 42 34 126 128 195 89 13 56 121 84 134 190 190 217 151 149 75 125 48 114 112 97 27 23 93 134 235 143 166 81 32 97 159 152 74 101
3344 101 63 135 197 177 83 117 40 194 204 180 124 109 139 132 16 169 76 113 92 173 154 160 289 320 135 147 38 103 176 197 208 156 187
3035 187 240 177 155 128 118 158 108 223 168 91 210 304 335 223 156 83 111 282 151 193 14 165 254 327 122 141 228 182 254 246 226
2743 226 352 371 432 727 650 579 231 133 104 107 56 141 127 114 58 70 77 122 108 68 104 71 128 76 88 36 185 265 236 179 84 181 130 177
2424 177 149 198 165 154 167 108 202 183 158 263 199 210 249 453 391 251 292 422 378 315 368 400 578 1896 1467 66 197 234 391
2152 391 330 335 407 419 663 846 800 948 1440 2246 5630 6057 2454 1353 1074 1083 980 1046 1312 1874 470 206 134 147 388 568
1908 568 587 241 315 309 234 234 373 231 235 192 385 323 318 410 308 244 263 267 311 463 884 1618 2255 2585 2122 1467 1334 1069 955 1160
1626 1160 1321 1213 1326 1418 1571 1609 1785 2029 2234 2650 3405 4498 6026 9527 15361 31803 16155 7122 4702 3419
1438 3419 2880 2279 1825 1570 1403 1319 1364 1223 1131 1046 997 859 893 805 652 667 790 794 677 651 647 530 511 507 477 414 351 453 446 441 337
1147 337 369 447 377 471 543 395 430 430 316 356 353 316 381 358 295 239 208 245 316 212 330 359 238 214 208 239 360 355 303 306 259 153 151 150 233
818 233 347 209 186 187 177 124 94 269 239 249 192 156 238 226 115 65 227 307 286 156 128 169 176 93 192 221 319 228 209 234 255 240 210
509 210 205 290 199 128 200 207 284 290 150 58 169 249 195 211 190 69 69 152 135 115 192 54 61 95 117 204 209 72 225 221 67 164 131 92 154
180 154 111 78 115 97 129 170 204 239 113 270 140 152 95 119 143 98 139 55 147 160 70 113 102 72 116 109 112 138 101 125 32 85 90 40 116
-149 116 94 35 113 149 115 144 225 59 88 85 82 42 92 37 42 51 100 119 100 165 132 68 99 149 66 72
-393G2
##PAGE=	F1=-5667.57
##FIRST=	17614.246348710370512,	4405.4455391999963467,	0
##DATA TABLE=	(F2++(Y..Y)), PROFILE
4405 52 20 53 28 105 102 88 105 33 23 73 38 80 86 173 162 79 152 125 93 69 180 108 79 120 157 92 43 66 85 31 46 80 55 126 133 78
4067 78 60 65 60 34 30 101 77 131 84 84 20 31 2 129 151 148 135 99 50 63 191 80 129 39 24 110 135 13 49 67 64 110 64 87 60 26
3729 26 92 59 92 57 91 14 6 115 115 192 127 30 90 89 76 81 167 168 203 147 131 104 146 76 104 99 94 30 52 71 125 258 147 196 102 60 82
3382 82 151 170 40 90 35 97 188 177 109 128 18 156 188 193 154 93 156 169 11 163 124 119 36 142 139 152 264 322 137 155 63 95 195
3072 195 159 190 175 215 268 208 177 136 138 180 127 228 209 156 191 279 312 252 175 107 56 270 196 225 110 119 210 342 140 144 275 192 254
2762 254 279 264 335 402 451 745 599 520 173 102 76 113 6 136 147 155 72 59 77 158 153 98 159 99 152 138 89 56 135 243 264 231 46
2452 46 180 115 203 164 200 172 173 221 145 228 213 168 259 228 233 221 381 376 274 321 448 427 374 354 434 538 1637 1356 182 326 170
2161 170 401 399 366 459 417 603 796 861 996 1494 2334 5800 6304 2557 1401 1111 1155 1031 1135 1411 1979 485 219 159 152
1926 152 355 513 548 311 388 387 306 288 450 306 314 278 474 462 441 555 455 386 431 441 482 482 705 1132 1626 1995 1732 1270 1231
1654 1231 1061 930 1115 1350 1268 1370 1492 1641 1715 1906 2157 2388 2833 3684 4877 6588 10421 16920 34838 17808 7908
1457 7908 5223 3755 3168 2559 2033 1752 1585 1448 1503 1372 1214 1149 1083 977 986 921 757 758 865 880 753 704 738 664 597 579 551
1203 551 488 415 520 494 494 415 400 456 433 434 581 431 456 502 339 380 392 344 411 428 373 293 246 244 387 243 342 407 291 251 264 229 375
894 375 387 335 369 338 234 210 192 218 335 227 210 223 205 201 52 263 243 252 213 203 239 283 203 82 186 293 320 173 159 185 206 134
593 134 162 210 309 267 188 211 264 270 258 240 264 200 174 186 245 276 336 210 124 131 249 245 268 228 120 80 156 136 154 204 84 79 95 133 200
264 200 226 86 210 240 122 151 168 116 183 154 123 99 128 83 139 208 277 107 290 186 164 107 151 179 134 143 96 158 186 119 130 144 61
-45 61 127 138 167 125 104 168 63 97 131 38 110 126 47 86 154 132 141 262 95 109 110 101 29 134 86 84 27 72 134 93 181 184 57 95 166 83
-383 83 67
-393F7
##PAGE=	F1=-5738.34
##FIRST=	17614.246348710370512,	4405.4455391999963467,	0
##DATA TABLE=	(F2++(Y..Y)), PROFILE
4405 21 45 75 26 122 112 104 126 68 17 77 22 100 68 170 178 92 145 168 134 26 163 132 101 117 164 107 62 50 102 19 57 41 38 110 137
4077 137 100 63 106 97 59 67 121 87 149 106 96 46 26 35 85 150 148 140 111 51 30 171 105 153 73 39 104 161 43 35 79 51 120 66 105 74 73
3729 73 66 61 103 32 111 47 45 92 106 180 160 58 128 77 54 25 124 130 167 144 103 111 152 120 92 89 95 48 93 35 100 260 144 209 131 71 92
3382 92 125 180 66 73 83 53 175 161 125 120 63 113 163 196 184 63 154 196 41 146 148 160 43 106 113 147 223 312 137 172 95 80 201
3072 201 133 159 171 240 280 232 207 129 153 186 147 218 217 209 175 253 261 274 197 162 58 238 225 236 188 116 156 338 169 126 298 224 262 282
2753 282 322 330 408 471 766 568 473 130 62 49 93 19 139 157 179 103 63 67 168 183 132 205 132 167 184 113 87 142 228 298 299 68 191
2443 191 110 220 182 219 189 182 255 196 256 250 234 247 254 282 242 359 365 270 359 472 475 446 359 475 566 1475 1227 245 445 208 400 452
2142 452 430 518 519 611 763 909 1052 1573 2429 5967 6533 2672 1453 1150 1206 1077 1231 1520 2101 488 234 184 169 338 450
1908 450 498 331 426 431 357 331 500 362 357 330 507 548 526 642 561 493 542 576 627 563 645 688 957 1372 1341 1088 1120 1045 901 1055 1331
1617 1331 1320 1400 1544 1692 1800 2015 2280 2527 2994 3906 5211 7070 11208 18322 37514 19191 8609 5697 4094 3408
1429 3408 2813 2245 1911 1758 1569 1616 1511 1296 1228 1140 1056 1059 1006 847 847 950 945 828 728 782 779 679 660 631 540 490 588 545 536 490 452
1138 452 474 500 406 602 476 462 551 383 387 425 364 419 470 442 346 294 235 427 290 354 432 333 279 307 262 381 401 344 398 390 304 286 273
828 273 234 345 245 224 246 231 283 52 236 247 240 208 244 235 300 275 165 170 267 350 195 195 205 230 196 135 197 290 292 196 218 244 286 295 300 247
490 247 180 199 165 261 257 341 248 174 124 239 271 315 261 181 122 173 144 192 213 119 109 79 148 219 248 105 202 247 172 130 186 146 208 196 178
161 178 93 172 71 102 184 296 109 291 229 175 129 163 204 158 137 128 166 201 156 172 185 88 129 162 217 143 96 204 101 113 164 92 121
-149 121 165 77 48 141 153 127 280 139 113 136 121 15 157 131 116 100 30 129 91 186 228 67 95 177 97 64
-393F4
##PAGE=	F1=-5809.1
##FIRST=	17614.246348710370512,	4405.4455391999963467,	0
##DATA TABLE=	(F2++(Y..Y)), PROFILE
4405 39 68 90 20 136 124 118 121 97 30 74 28 119 66 145 166 103 118 192 162 46 135 146 129 118 167 125 73 45 139 76 71 10 24 85 126 110
4067 110 57 117 115 91 104 166 105 174 129 109 111 10 73 34 133 155 156 135 57 19 141 111 171 95 61 111 182 82 62 114 32 121 73 128 89
3739 89 123 38 66 101 16 112 86 86 61 103 166 185 93 172 113 22 36 74 99 119 144 79 101 141 163 90 93 105 47 127 32 59 244 142 210
3410 210 168 78 120 81 175 118 41 130 36 172 164 139 110 90 97 137 189 213 23 134 216 76 122 150 204 105 84 89 141 176 289 129 200
3100 200 132 68 187 133 129 142 252 276 251 240 121 169 186 165 209 197 240 171 236 201 292 221 217 133 196 247 233 242 167 145 323 215 98
2790 98 296 255 298 265 373 349 408 483 777 540 411 96 27 15 47 24 129 164 189 137 97 65 148 190 161 240 162 180 217 144 122 159
2490 159 200 306 353 120 206 126 232 185 249 208 194 273 236 279 283 306 246 264 336 274 370 381 250 379 487 513 502 395 506 604 1437
2199 1437 1168 280 520 323 391 477 487 556 640 678 776 957 1114 1669 2556 6163 6754 2796 1519 1199 1255 1115 1323 1634 2221
1964 2221 466 264 205 210 390 424 486 333 458 459 414 379 545 431 403 375 508 599 583 689 632 585 618 672 746 658 677 427 367 907
1682 907 1092 1011 1094 1109 955 1075 1341 1430 1487 1655 1803 1928 2174 2482 2747 3242 4211 5672 7708 12249 20140 41051 20906
1466 20906 9465 6271 4545 3702 3112 2517 2122 1959 1746 1757 1666 1421 1337 1222 1117 1133 1082 939 922 1066 1024 923 777 790
1241 790 865 758 747 733 599 570 665 610 584 573 512 516 567 428 602 540 473 574 452 393 455 391 421 492 512 391 361 247 437 345 376
950 376 440 370 304 327 317 394 425 341 401 409 351 352 359 277 392 284 252 263 256 363 145 188 252 215 182 263 235 282 312 237 199 230 365 220
631 220 235 229 243 254 148 179 264 298 216 259 207 286 321 359 276 166 210 145 260 246 313 261 202 143 230 275 338 288 242 173 203 162 224 229 162
302 162 154 66 138 237 274 127 209 248 220 118 185 169 229 231 228 117 208 134 104 137 293 126 275 265 189 165 151 227 168 125 146 165 198 175
-17 175 216 221 135 137 179 255 186 97 221 141 136 188 146 148 210 125 8 122 177 111 287 190 112 156 141 26 162 170 133 163 18 122 84 176
-337 176 254 94 96 183 104 61
-393F1
##PAGE=	F1=-5879.87
##FIRST=	17614.246348710370512,	4405.4455391999963467,	0
##DATA TABLE=	(F2++(Y..Y)), PROFILE
4405 77 84 93 15 142 137 129 94 111 60 58 45 129 85 105 135 105 77 195 177 88 105 146 152 122 170 143 74 55 183 134 88 49 41 58 115 112 69 97
4049 97 106 112 128 209 122 199 151 115 171 29 117 35 99 157 174 160 77 60 137 103 186 117 75 113 194 121 96 161 43 113 81 153 104 159 61
3720 61 91 97 37 100 114 121 28 102 151 198 125 217 172 51 88 54 120 108 152 80 102 115 200 103 115 127 28 148 76 5 218 151 208 205 111
3391 111 161 49 155 163 60 157 82 179 210 168 134 96 128 139 177 239 38 109 230 117 107 144 235 167 107 98 142 151 264 111 229 168
3091 168 79 155 152 116 98 248 262 266 272 125 190 195 192 220 172 249 188 239 154 315 260 254 214 182 269 240 273 225 207 314 272 103 284 270 354
2762 354 265 410 393 426 494 776 507 324 80 84 85 80 51 105 185 202 173 153 112 125 191 193 267 202 212 245 195 176 188 199 288 387 180 231
2443 231 165 252 183 282 232 215 299 274 303 320 366 285 285 393 330 397 433 259 382 504 548 542 459 546 637 1457 1181 333 564 462 413
2152 413 503 531 586 742 777 841 1025 1195 1774 2736 6453 7012 2929 1603 1265 1321 1154 1397 1750 2310 421 294 203 287 505
1917 505 464 530 361 511 491 497 458 601 536 492 455 538 659 650 741 692 687 704 761 863 781 754 434 191 810 1081 1076 1190 1287 1139 1238
1626 1238 1473 1646 1705 1905 2071 2192 2467 2852 3173 3720 4794 6501 8843 14067 23254 47318 23955 10893 7213
1448 7213 5283 4225 3587 2931 2490 2268 2064 2026 1912 1650 1551 1411 1241 1271 1205 1084 1013 1235 1170 1068 917 834 949 860 849
1213 849 871 706 676 775 705 678 682 613 612 649 541 621 631 540 601 550 438 494 445 451 516 592 444 455 322 438 419 429 455 424 346 342 376 427
894 427 488 359 414 414 380 405 434 339 466 350 315 297 291 442 265 168 280 207 179 258 254 260 317 286 258 220 359 253 279 268 265 298 214 176
574 176 249 290 231 314 189 276 339 399 345 188 227 139 256 261 286 263 211 169 228 271 335 303 296 232 244 194 248 257 214 212 111 101 237 294 156
246 156 227 246 269 147 176 184 244 267 264 161 233 212 170 94 272 157 250 296 210 205 129 252 184 127 152 161 180 177 247 248 185 167 195 279 238 135
-92 135 213 177 166 200 191 175 252 177 50 120 206 112 288 242 137 175 161 64 158 202 135 212 63 144 85 162 258 127 100 184 104 56
-393E6
##PAGE=	F1=-5950.63
##FIRST=	17614.246348710370512,	4405.4455391999963467,	0
##DATA TABLE=	(F2++(Y..Y)), PROFILE
4405 106 89 82 18 138 147 134 55 112 90 33 61 125 114 64 106 101 29 177 178 115 86 129 161 121 172 157 67 64 217 186 103 83 64 43 117 113
4067 113 110 62 68 112 133 230 132 211 170 108 212 64 162 90 65 155 185 173 101 98 171 102 202 155 87 101 188 155 113 204 83 100 89 172
3748 172 115 175 104 125 107 62 96 127 151 7 94 129 191 139 248 226 105 129 81 169 162 174 100 136 88 224 121 142 153 32 156 109
3448 109 53 186 168 204 228 162 206 94 123 186 125 160 135 184 268 204 188 93 169 183 164 260 91 100 236 155 123 152 248 222 150 146 152 175
3128 175 260 92 250 195 114 119 175 125 47 226 237 268 297 135 210 210 227 250 173 241 219 262 137 338 314 261 272 213 290 273 285 266 287
2819 287 324 323 153 275 268 398 304 429 445 462 524 777 486 235 99 156 168 181 107 83 217 227 209 216 179 135 203 225 289 254 262 272
2518 272 257 240 234 264 274 407 240 266 216 285 189 309 264 237 337 316 326 360 410 347 331 440 416 443 503 326 378 534 580 572 524 602
2218 602 677 1477 1203 406 591 592 480 558 572 621 818 882 933 1111 1298 1871 2941 6822 7304 3052 1682 1346 1409 1219 1454
1983 1454 1894 2462 476 293 163 379 618 531 589 413 573 528 577 551 651 647 603 557 612 745 735 805 746 784 802 842 971 927
1720 927 857 564 504 972 1219 1206 1324 1492 1370 1462 1686 1900 1988 2220 2429 2538 2827 3289 3701 4309 5516 7507 10198 16241
1495 16241 26973 54934 27729 12624 8351 6151 4872 4153 3399 2940 2632 2446 2368 2212 1931 1825 1665 1434 1461 1364
1307 1364 1264 1119 1410 1355 1231 1110 942 1032 975 943 1009 842 796 905 802 798 791 741 742 738 699 687 727 655 654 655 528 540 514 510 549 668
1006 668 507 557 433 450 501 506 492 493 406 374 424 469 574 413 461 428 397 442 486 397 532 420 396 351 331 510 376 233 339 248 233
715 233 239 287 274 299 308 312 266 337 286 316 318 311 323 292 206 259 282 230 360 210 268 350 413 412 241 260 146 258 291 288 274 208 188 232 274 314
377 314 298 332 288 285 235 260 291 264 272 190 68 210 297 190 239 231 309 209 171 192 245 300 279 200 241 272 248 120 245 191 222 317 232 232
58 232 127 273 216 150 159 160 155 159 253 260 222 212 217 291 287 199 179 201 198 196 226 192 277 221 93 139 237 133 286 286 187 200 179 105 155 223 129 241
-299 241 96 187 111 164 251 153 109 184 103 47
-393D7
##PAGE=	F1=-6021.4
##FIRST=	17614.246348710370512,	4405.4455391999963467,	0
##DATA TABLE=	(F2++(Y..Y)), PROFILE
4405 119 84 62 34 124 152 134 31 107 113 24 75 105 141 27 103 101 23 138 170 127 83 98 156 110 164 168 67 64 223 228 116 114 72 53 127
4077 127 118 160 79 26 83 116 218 130 201 188 82 218 91 196 137 58 150 190 168 115 122 207 121 217 206 112 88 161 183 104 232 124
3776 124 91 99 185 122 171 134 152 134 82 116 126 180 36 73 103 159 122 247 259 154 153 100 199 225 205 127 178 92 233 134 163 177 76
3466 76 156 121 106 148 179 197 229 209 246 168 94 179 186 140 176 167 306 231 236 101 191 239 155 271 145 116 230 178 162 176 245 266 185 204
3147 204 172 225 286 101 261 214 160 93 198 151 14 180 201 245 312 144 216 214 258 278 213 228 250 301 150 336 360 237 285 249 297
2856 297 312 278 279 342 341 357 211 271 253 400 356 427 494 490 575 806 509 191 113 204 224 279 172 82 236 257 235 270 243 167 227 240 302
2546 302 298 305 295 302 297 268 353 290 419 295 305 269 321 211 316 296 247 361 353 334 386 430 390 383 454 495 500 556 427 370 565 602 591 558 645
2218 645 719 1474 1201 473 605 693 560 623 618 650 861 968 1020 1185 1406 1931 3110 7178 7601 3165 1742 1447 1524 1350 1537
1983 1537 2113 2819 692 262 114 442 689 590 635 471 622 570 621 644 671 733 705 653 690 839 829 865 793 855 897 903 1044 1068 988
1711 988 712 725 1125 1360 1325 1412 1634 1554 1634 1869 2097 2232 2471 2738 2851 3130 3637 4154 4809 6109 8351 11279 17975 29959
1485 29959 61109 30830 14049 9305 6863 5405 4625 3777 3318 2933 2757 2659 2460 2165 2056 1889 1628 1630 1512 1417 1215
1288 1215 1519 1507 1357 1276 1080 1086 1070 999 1098 960 894 1022 866 893 852 847 855 799 833 778 797 772 723 745 638 589 574 568 570 716 562 639
987 639 535 479 562 578 544 555 466 423 453 493 642 475 533 460 407 464 510 435 562 473 462 409 359 558 456 334 410 324 317 229 319 332
687 332 273 311 336 334 314 305 334 360 374 334 355 261 287 290 208 384 242 269 350 401 445 299 303 165 254 306 315 302 207 196 226 288 283 269 336 330 314
340 314 275 253 314 299 326 269 104 168 279 231 235 186 326 274 178 201 226 324 279 223 223 301 304 186 231 211 196 323 247 243 152 278 254 178
20 178 187 164 143 124 227 251 232 250 242 287 324 269 130 205 225 171 245 204 279 248 126 155 255 160 275 313 236 237 201 147 155 231 122 251
-299 251 116 217 151 185 248 169 127 184 113 43
-393D3
##PAGE=	F1=-6092.16
##FIRST=	17614.246348710370512,	4405.4455391999963467,	0
##DATA TABLE=	(F2++(Y..Y)), PROFILE
4405 113 74 52 60 109 160 139 68 115 139 67 97 68 169 35 133 139 86 78 163 139 103 69 157 110 143 181 94 63 195 262 134 159 75 75 135
4077 135 134 211 156 112 35 79 179 128 167 215 62 190 104 217 175 97 148 204 166 115 140 222 152 230 263 171 118 131 214 77 246 166
3776 166 99 120 211 143 167 155 176 176 105 164 135 222 91 60 120 131 66 204 263 199 171 108 201 266 242 172 211 150 240 155 180 205 132 171
3457 171 131 155 124 190 194 218 243 285 251 124 147 238 129 209 133 319 251 269 143 201 289 172 280 207 161 231 190 212 213 247 314 219 265
3147 265 207 290 340 163 286 251 225 97 237 207 93 125 178 204 322 185 227 209 283 302 283 243 283 355 175 281 372 218 256 255
2865 255 296 346 269 281 368 366 384 277 290 263 369 398 414 549 506 645 882 581 185 80 228 243 362 255 138 236 293 259 320
2593 320 320 226 274 244 315 340 343 336 331 362 278 434 354 443 362 363 338 381 282 320 341 279 366 400 344 407 441 415 439 445 542 576 597 551 395 599
2255 599 636 625 581 674 760 1472 1226 549 624 783 664 697 701 688 884 1041 1111 1247 1526 1978 3240 7519 7950 3319 1811 1591
2011 1591 1688 1579 1724 2419 3286 872 259 136 486 767 690 718 589 709 692 682 795 738 843 850 811 816 995 1006 1011 915 977 1066
1748 1066 1033 1165 1261 1236 961 977 1317 1564 1531 1585 1831 1816 1870 2126 2376 2588 2822 3162 3325 3614 4158 4817 5582 7005 9631
1513 9631 12955 20532 34261 69916 35221 16055 10675 7889 6182 5284 4339 3834 3367 3167 3070 2802 2489 2361 2186
1335 2186 1929 1867 1757 1634 1408 1658 1693 1540 1471 1312 1202 1211 1099 1189 1107 1023 1182 980 1015 907 959 984 864 957 914 885 908 839
1072 839 856 798 700 671 659 616 763 645 724 649 569 626 664 643 636 551 512 512 524 709 563 633 546 457 516 552 493 579 535 527 489 393 611 527
753 527 454 499 440 426 290 370 437 297 353 349 406 347 323 355 402 462 375 417 345 349 351 216 410 289 302 366 400 465 374 366 244 260 309 358
433 358 364 251 222 218 328 277 255 314 365 339 327 246 335 323 381 352 197 169 264 300 247 133 318 338 217 229 206 346 297 259 180 307
133 307 339 259 270 228 198 327 272 259 187 280 302 204 250 200 181 106 181 235 210 271 276 278 356 340 137 201 259 140 251 233 271 270 164 171 257
-196 257 187 266 325 275 292 247 200 176 239 136 261 151 217 197 207 272 184 159 190 140 62
-393F2
##PAGE=	F1=-6162.93
##FIRST=	17614.246348710370512,	4405.4455391999963467,	0
##DATA TABLE=	(F2++(Y..Y)), PROFILE
4405 88 63 78 96 119 188 165 131 155 190 135 151 53 210 108 191 228 169 30 180 179 165 95 204 163 135 220 153 89 156 303 177 233
4105 233 116 113 155 174 273 252 236 89 74 166 160 135 264 120 167 118 242 221 175 174 249 217 117 185 236 199 259 320 265 201 164 269 108
3795 108 269 228 149 164 283 213 203 195 223 242 157 245 203 291 179 120 217 193 62 157 259 257 214 153 212 297 297 253 247 247 290 220 220 258 213
3466 213 235 189 219 181 240 229 242 286 350 349 236 153 302 198 265 156 341 302 307 226 252 342 249 318 297 257 288 228 290 280 293 388 290
3157 290 347 283 392 428 262 364 342 321 173 325 302 209 163 232 214 354 302 305 253 331 356 379 328 341 425 212 155 360 300 273 260
2865 260 340 412 321 337 407 434 449 382 384 362 383 458 439 643 554 738 998 662 141 87 284 288 466 388 287 284 379 339 408 452 366 398
2565 398 322 393 434 434 452 415 489 338 540 497 539 488 493 475 528 454 416 458 424 430 527 448 514 522 502 559 515 610 723 704 730 560 708 774
2246 774 762 708 785 880 1564 1363 711 735 938 875 854 903 845 987 1190 1300 1403 1747 2146 3441 7984 8431 3534 1918 1788
2011 1788 1907 1883 2052 2802 3610 894 401 294 671 989 940 941 868 963 1003 922 1122 1025 1119 1174 1169 1153 1362 1425 1431 1270 1343 1490 1444
1739 1444 1567 1692 1781 1512 1564 1902 2129 2098 2208 2455 2517 2577 2863 3187 3524 3824 4273 4533 4966 5640 6553 7682 9549 13115
1513 13115 17811 27940 46548 94936 47656 21653 14420 10713 8393 7077 5905 5198 4578 4272 4183 3758 3362 3161
1344 3161 2939 2681 2521 2415 2221 1984 2184 2211 2057 1946 1844 1657 1629 1488 1508 1470 1378 1578 1373 1362 1175 1251 1290 1116 1220 1209
1100 1209 1149 1189 1115 1110 1101 995 941 914 836 941 872 913 878 820 812 867 882 837 751 714 714 678 881 771 825 752 636 689 723 678 700 687 671 662
781 662 527 747 667 642 666 641 598 478 515 621 464 525 454 534 506 421 455 505 617 525 545 497 494 512 356 505 418 421 477 491 548 506
480 506 487 427 352 382 453 489 387 331 279 440 370 346 327 439 416 433 309 404 380 468 464 331 285 324 423 350 217 327 432 327 312
189 312 272 414 396 369 187 342 395 354 395 291 278 375 356 332 250 338 390 257 355 304 293 195 195 276 200 299 340 310 410 429 251 243 332
-121 332 180 268 309 307 326 247 238 270 239 299 353 322 377 341 287 252 292 211 311 234 214 266 239 332 222 214 224 188 101
-393A01
##PAGE=	F1=-6233.69
##FIRST=	17614.246348710370512,	4405.4455391999963467,	0
##DATA TABLE=	(F2++(Y..Y)), PROFILE
4405 50 59 120 136 167 242 213 213 223 269 221 237 117 267 214 275 350 275 124 242 252 263 171 300 262 187 299 234 153 176 367 251 330
4105 330 199 178 218 244 357 354 374 199 156 243 239 158 337 224 226 164 297 297 286 246 329 323 161 274 296 268 324 384 383 310 275 354 219
3795 219 332 319 243 233 399 333 293 280 310 333 253 359 329 385 295 230 357 336 190 212 294 345 305 256 292 356 382 361 318 369 407 331
3495 331 310 351 328 348 302 319 317 354 326 343 368 459 464 388 257 404 338 370 284 416 404 376 346 374 429 377 407 424 405 419 331 409 396 405 500
3166 500 418 464 405 546 552 382 502 483 445 310 468 428 354 316 368 337 435 484 471 394 439 473 501 470 438 504 284 89 401 497 440
2875 440 358 477 556 475 487 520 574 583 540 574 556 527 589 562 796 686 862 1124 713 71 277 438 457 634 587 516 454 551 515 577
2593 577 658 601 620 535 582 626 631 661 615 705 528 726 731 750 690 715 702 784 723 656 684 691 647 781 702 771 742 724 801 763 804 987 953 995
2274 995 888 973 1076 1057 1014 1089 1176 1844 1621 1001 1016 1223 1243 1169 1262 1210 1298 1523 1680 1785 2174 2601 3858 8680 8970 3705
2030 3705 2009 1995 2128 2188 2471 3311 3930 1176 748 665 1153 1409 1353 1317 1312 1412 1491 1403 1638 1558 1618 1716 1748 1754 1993 2113 2149 1880
1767 1880 2005 2203 2180 2330 2450 2652 2419 2583 3009 3168 3091 3356 3638 3775 3901 4246 4699 5200 5682 6302 6674 7390 8351 9663
1541 9663 11438 14199 19383 26643 41625 69306 141375 70831 32064 21307 15887 12488 10397 8771 7702 6820
1391 6820 6324 6216 5550 4973 4636 4307 3996 3746 3585 3303 3009 3253 3214 3013 2823 2732 2531 2421 2245 2187 2135 2042 2291 2102 2020
1156 2020 1779 1833 1863 1662 1735 1729 1670 1689 1600 1565 1579 1485 1419 1376 1289 1335 1287 1271 1279 1248 1194 1246 1288 1210 1100 1055 1086 1008 1227 1145 1149 1088 959
847 959 1009 1059 1023 995 970 942 951 811 1016 926 934 944 942 854 773 784 894 758 823 711 766 772 643 675 716 863 793 779 727 737 764 605 706
537 706 657 638 705 693 745 712 688 683 556 584 635 688 603 531 454 641 570 546 463 594 586 610 475 562 515 615 621 509 477 482 597 541 419
227 419 424 582 503 461 452 563 579 557 334 461 523 497 587 435 432 503 513 472 373 483 537 369 498 470 457 359 333 411 289 379 454 427
-74 427 510 551 415 363 461 318 338 429 422 440 387 385 348 337 401 432 404 498 480 413 386 411 342 423 365 279 374 313 424 299 295 294 247 149
-393A49
##PAGE=	F1=-6304.46
##FIRST=	17614.246348710370512,	4405.4455391999963467,	0
##DATA TABLE=	(F2++(Y..Y)), PROFILE
4405 8 65 158 173 234 309 266 303 299 359 314 336 202 332 338 375 479 390 239 335 339 375 260 415 374 282 404 321 238 269 449 342 429 297
4096 297 262 318 336 458 454 505 315 262 367 340 235 416 333 348 243 384 398 414 348 424 444 245 389 409 359 421 454 506 417 406 451
3804 451 351 427 426 357 315 529 474 406 400 418 434 376 495 482 488 417 354 504 496 337 355 388 456 425 384 422 455 485 469 424 497 559 461 434
3485 434 472 465 482 434 447 477 503 458 492 489 596 584 546 403 537 497 507 448 537 527 468 484 530 551 519 527 572 579 583 481 560 545 552 633 576 605
3147 605 548 727 691 508 668 636 568 471 633 556 505 497 526 510 554 686 680 586 591 631 631 627 556 579 398 330 564 744 696 554 679 764
2847 764 685 693 700 761 755 726 810 789 752 788 764 984 882 1011 1225 722 235 524 661 719 860 824 784 700 779 757 814 904 879 896 819 839
2546 839 885 900 916 892 965 795 979 1018 1033 933 984 980 1095 1036 969 974 1013 969 1117 1039 1114 1055 1031 1125 1120 1120 1330 1304 1315 1289 1351 1473 1444
2236 1444 1417 1523 1604 2257 1901 1363 1412 1599 1700 1594 1708 1703 1786 2018 2209 2361 2776 3315 4496 9504 9321 3641 1958 2119
2011 2119 2258 2408 2891 4065 5109 2344 1313 1287 1867 1935 1838 1764 1837 1958 2051 2009 2242 2201 2242 2366 2426 2487 2765 2931 2995 2608
1767 2608 2810 3052 3069 3275 3396 3688 3529 3843 4381 4445 4283 4737 5092 5307 5537 5965 6565 7245 7973 8806 9284 10334 11670
1551 11670 13460 16008 19888 27013 37385 58433 97360 198758 99558 44977 29814 22257 17542 14515 12300
1410 12300 10801 9597 8870 8715 7776 6965 6462 5992 5594 5277 5010 4642 4248 4596 4483 4185 3915 3793 3606 3408 3178 3067
1203 3067 2958 2869 3171 2984 2837 2566 2585 2583 2371 2407 2379 2332 2318 2196 2128 2145 2056 1997 1941 1856 1852 1796 1726 1777 1763 1688 1728 1774 1672 1525 1469
912 1469 1540 1426 1671 1607 1550 1482 1347 1398 1473 1443 1384 1321 1289 1299 1178 1366 1255 1293 1285 1294 1155 1114 1116 1211 1099 1169 1046 1070 1079 932 963 998
612 998 1158 1112 1071 995 1026 1055 888 964 952 903 987 932 1004 952 931 960 810 856 871 923 852 772 689 887 816 780 685 806 811 823 689 776 712
302 712 805 802 709 694 679 789 758 645 600 769 702 643 677 764 795 777 545 641 707 680 798 622 613 682 704 637 544 674 717 522 658 660
2 660 637 544 522 592 457 516 602 599 648 697 583 524 616 492 460 565 580 588 559 573 492 471 543 554 514 638 636 558 547 564 497 569 512 418 511
-327 511 437 527 397 387 386 306 196
-393A96
##PAGE=	F1=-6375.22
##FIRST=	17614.246348710370512,	4405.4455391999963467,	0
##DATA TABLE=	(F2++(Y..Y)), PROFILE
4405 39 73 178 199 297 369 307 383 362 437 396 421 275 386 454 466 589 490 343 426 416 473 339 513 469 379 502 397 324 371 527
4124 527 427 509 381 342 421 425 553 536 603 416 357 482 432 317 478 424 469 326 474 497 531 446 507 541 338 498 530 451 519 522
3842 522 610 498 518 531 469 524 520 465 392 637 600 504 521 516 519 500 626 629 574 520 466 628 630 465 498 503 563 538 497 546 564 577 548 533 606
3513 606 698 572 557 589 598 601 547 572 619 641 583 639 617 720 684 675 534 662 633 635 596 652 622 548 611 667 676 634 637 710 742 727 632 712 694 691
3175 691 750 720 736 675 891 810 620 823 761 653 610 774 655 629 655 658 666 669 865 876 766 740 779 738 756 655 637 523 581 793 985
2884 985 954 768 880 973 886 890 882 934 904 887 1027 1000 964 994 972 1152 1071 1146 1275 715 473 762 880 985 1083 1044 1033 941 996 1000 1062
2593 1062 1135 1133 1156 1093 1089 1137 1163 1154 1161 1195 1045 1222 1282 1304 1151 1227 1235 1374 1318 1263 1248 1309 1289 1443 1363 1438 1362 1323 1439 1470 1450 1657 1645
2283 1645 1611 1654 1722 1839 1806 1786 1941 2016 2628 2081 1695 1801 1954 2121 2003 2114 2170 2291 2532 2741 2957 3391 4080 5191 10225
2049 10225 9297 3233 1662 2074 2217 2485 3225 5088 7627 4149 2058 2103 2656 2435 2290 2183 2339 2472 2561 2593 2791 2796
1842 2796 2835 2965 3041 3169 3486 3680 3755 3275 3551 3823 3885 4152 4292 4644 4592 5052 5657 5617 5360 5984 6420 6717 7051 7557 8278
1607 8278 9117 10083 11113 11674 13019 14705 16935 20190 25094 33967 47160 73840 123168 251698 126119 56916
1457 56916 37661 28118 22194 18318 15558 13666 12167 11223 11006 9827 8801 8141 7541 7058 6703 6313 5882 5377 5828
1279 5828 5660 5251 4918 4751 4592 4321 4032 3889 3712 3632 3980 3785 3586 3311 3294 3248 3035 3043 2983 2951 2905 2739 2645 2656 2560 2523 2457
1025 2457 2379 2337 2260 2143 2239 2235 2154 2178 2213 2095 1913 1849 1956 1806 2075 2035 1920 1828 1696 1752 1849 1829 1739 1641 1612 1611 1526 1694 1560 1633
743 1633 1599 1614 1430 1424 1427 1494 1404 1476 1361 1366 1350 1203 1236 1268 1425 1398 1338 1234 1285 1314 1137 1204 1225 1149 1239 1129 1236 1166 1156 1193 1041 1114
443 1114 1091 1133 1072 993 915 1116 1038 983 910 1007 1022 1014 884 979 913 989 964 890 889 852 951 941 836 782 945 874 812 884 954 986 970 748 820
133 820 890 861 977 796 774 853 875 777 718 849 879 669 802 827 794 708 695 758 631 666 744 766 784 834 721 671 753 648 592 684 724
-158 724 724 720 753 648 606 673 676 614 763 769 690 694 702 639 702 641 569 643 575 615 485 470 471 351 232
-393B32
##PAGE=	F1=-6445.99
##FIRST=	17614.246348710370512,	4405.4455391999963467,	0
##DATA TABLE=	(F2++(Y..Y)), PROFILE
4405 74 81 176 207 339 404 321 431 395 483 446 470 317 413 534 525 654 551 413 487 462 531 391 569 523 445 564 442 393 441 571
4124 571 485 549 431 396 494 487 615 581 649 482 415 554 490 375 501 475 549 385 533 567 608 508 553 590 410 572 615 516 585 567
3842 567 673 534 582 568 547 587 572 538 443 693 679 559 612 576 565 593 723 740 620 577 538 703 708 547 591 591 634 613 567 619 641 628
3542 628 573 604 670 783 635 645 672 693 675 611 659 708 728 666 743 715 795 738 745 612 739 714 714 690 712 652 577 693 746 761 690 701 803
3232 803 852 812 741 825 803 788 819 812 821 751 993 876 699 936 832 672 687 850 695 694 749 727 760 738 979 1010 885 836 868 793 825
2941 825 701 662 608 760 997 1169 1149 932 1024 1121 1022 1021 1003 1037 975 973 1167 1136 1096 1140 1120 1248 1187 1225 1266 737 684 933 1026 1175 1232
2650 1232 1191 1200 1109 1135 1180 1255 1293 1298 1332 1282 1260 1312 1343 1312 1349 1328 1196 1368 1449 1483 1284 1371 1396 1543 1495 1455 1428 1501 1514 1672 1585 1651 1570
2340 1570 1513 1652 1713 1682 1869 1872 1797 1886 1969 2065 2032 2009 2211 2275 2793 2079 1903 2062 2174 2386 2270 2361 2471 2645 2903 3122 3385
2086 3385 3829 4661 5727 10655 8968 2572 1112 1836 1981 2406 3416 6203 10832 6144 2867 2970 3336 2797 2624 2496
1898 2496 2719 2841 2910 3018 3158 3206 3253 3366 3445 3634 3973 4174 4240 3715 4042 4325 4424 4736 4902 5282 5349 5912 6504 6369 6042
1664 6042 6776 7267 7638 8052 8600 9382 10320 11451 12608 13211 14737 16651 19166 22885 28436 38392 53377 83747 139855
1485 139855 286124 143438 64692 42750 31907 25204 20784 17686 15529 13846 12752 12476 11150 9986 9217 8539
1335 8539 8001 7643 7152 6688 6098 6611 6419 5923 5552 5352 5229 4910 4577 4425 4189 4124 4495 4295 4063 3813 3763 3672 3469 3456
1110 3456 3372 3357 3286 3078 2969 2975 2863 2856 2786 2717 2647 2549 2397 2534 2541 2461 2471 2486 2358 2158 2090 2228 2044 2318 2311 2152 2029 1912 1976 2084
828 2084 2082 1954 1841 1818 1800 1763 1906 1751 1860 1797 1820 1603 1628 1635 1665 1596 1668 1572 1568 1518 1381 1420 1446 1587 1575 1499 1380 1442 1475 1289 1358
537 1358 1403 1309 1390 1223 1371 1295 1301 1326 1186 1285 1230 1260 1210 1136 1075 1267 1180 1103 1067 1134 1156 1130 1006 1111 1062 1113 1059 1010 1018 954 1040 1040 949
227 949 909 1057 972 922 1021 1075 1100 1086 890 942 1012 993 1076 910 872 964 979 850 847 959 978 767 891 931 891 815 807 859 757 779 837 875
-74 875 873 923 798 762 831 748 687 752 813 804 828 878 765 710 751 752 665 837 844 773 791 787 732 784 719 682 731 681 658 534 520 526 369 248
-393B48
##PAGE=	F1=-6516.75
##FIRST=	17614.246348710370512,	4405.4455391999963467,	0
##DATA TABLE=	(F2++(Y..Y)), PROFILE
4405 95 86 155 195 349 404 305 433 388 486 452 468 317 403 559 532 658 557 433 499 465 535 405 567 525 462 572 444 430 459 564
4124 564 498 539 437 410 514 503 623 576 630 501 423 565 501 393 477 475 569 399 538 586 629 517 547 575 442 591 637 534 598
3851 598 572 683 516 582 547 566 596 565 556 452 683 690 555 652 583 557 631 762 794 615 573 555 713 715 565 612 622 646 633 579 620 655
3551 655 621 534 610 671 790 632 673 697 726 685 607 681 724 739 685 779 759 798 730 742 613 741 721 719 709 693 603 536 708 744 774 667
3250 667 695 825 883 813 776 868 845 820 819 827 837 755 1004 868 727 987 840 617 676 838 661 680 754 716 766 734 1001 1050 913 850
2969 850 868 779 816 675 643 613 810 1109 1253 1240 1000 1073 1163 1062 1055 1022 1038 939 955 1190 1162 1111 1180 1168 1241 1196 1216 1209 810 821 995
2678 995 1057 1236 1257 1221 1245 1156 1149 1249 1342 1345 1333 1379 1340 1306 1364 1392 1352 1412 1328 1200 1363 1467 1517 1291 1374 1414 1552 1519 1489 1460 1537 1582
2377 1582 1743 1649 1692 1617 1546 1702 1789 1743 1898 1916 1817 1924 2017 2084 2057 2022 2253 2295 2668 1872 1929 2117 2184 2415 2313 2370 2513 2732
2114 2732 3009 3248 3519 3953 4889 5941 10707 8596 2028 386 1453 1592 2202 3430 7106 13736 7861 3566 3687
1936 3687 3726 2945 2781 2645 2904 2985 3022 3189 3257 3341 3394 3472 3540 3767 4101 4291 4328 3823 4161 4432 4553 4878 5066 5437 5606 6207
1692 6207 6699 6504 6152 6910 7411 7834 8282 8822 9585 10535 11718 12890 13483 15031 16992 19558 23381 29028 39108 54385
1504 54385 85517 142968 292879 146901 66227 43718 32611 25765 21250 18120 15887 14184 13045 12728 11385
1363 11385 10200 9398 8718 8172 7846 7302 6846 6220 6731 6549 6017 5641 5430 5350 5017 4666 4530 4256 4211 4574 4382 4138 3940
1147 3940 3864 3737 3554 3527 3432 3438 3353 3115 3006 3015 2882 2910 2839 2780 2694 2585 2413 2577 2596 2525 2524 2517 2384 2192 2121 2281 2075 2324 2360 2177
865 2177 2026 1933 2007 2117 2139 1969 1864 1846 1810 1828 1942 1775 1912 1820 1856 1625 1672 1687 1674 1624 1693 1622 1619 1541 1419 1465 1483 1596 1596 1505 1392
574 1392 1451 1493 1310 1383 1438 1340 1397 1185 1368 1301 1324 1327 1207 1324 1246 1267 1228 1165 1128 1300 1206 1115 1116 1145 1175 1135 1023 1133 1117 1142 1059 1035
274 1035 1052 959 1029 1029 961 943 1070 967 944 1051 1090 1108 1098 939 974 1037 1042 1069 933 884 982 987 832 893 973 987 786 898 946 902 840 831 868
-36 868 801 819 853 896 885 934 798 771 826 765 714 751 822 803 855 917 806 755 755 757 646 837 838 786 813 794 753 788 726 723 751 720 640 530 522
-365 522 534 355 240
-393B40
##PAGE=	F1=-6587.52
##FIRST=	17614.246348710370512,	4405.4455391999963467,	0
##DATA TABLE=	(F2++(Y..Y)), PROFILE
4405 101 90 126 164 327 370 265 385 338 448 416 414 277 357 522 484 600 504 396 458 422 484 381 505 475 430 522 399 427 425 502
4124 502 462 481 397 382 475 466 573 519 550 472 383 514 464 372 412 424 527 363 484 550 589 471 487 502 427 550 591 498 552 528 639
3833 639 448 521 468 526 551 498 512 416 608 630 492 629 535 497 603 732 784 566 510 513 659 656 515 555 586 592 595 535 550 601 556 438
3532 438 545 603 713 562 634 656 687 630 538 629 662 672 635 738 741 732 661 673 538 663 653 647 658 595 487 429 647 660 708 565 618 766
3232 766 825 727 728 826 806 782 749 765 782 684 920 789 700 974 804 511 574 735 559 591 671 624 684 649 927 989 847 780 774 699 734
2941 734 579 576 524 705 1094 1219 1212 956 1014 1088 999 987 933 937 797 830 1090 1071 1007 1100 1104 1126 1095 1113 1129 916 880 949 965 1157 1147 1127
2640 1127 1157 1073 1027 1186 1301 1284 1233 1289 1255 1217 1282 1299 1269 1346 1206 1055 1200 1325 1394 1171 1233 1281 1397 1382 1356 1330 1404 1474 1638 1542
2358 1542 1554 1491 1416 1575 1684 1618 1732 1767 1660 1764 1854 1892 1877 1825 2062 2075 2276 1497 1764 1953 1974 2196 2121 2134 2285 2516 2808
2105 2808 3089 3335 3732 4719 5795 10443 8458 2108 403 1036 1155 1929 3257 7508 15484 8876 3979 4064 3694 2845
1917 2845 2735 2602 2854 2872 2872 3067 3063 3174 3224 3254 3307 3538 3835 3998 3999 3572 3879 4119 4243 4542 4737 5064 5298 5867 6196 5988
1673 5988 5662 6352 6816 7256 7684 8167 8836 9706 10815 11884 12416 13821 15635 18004 21549 26716 35922 49917 78682
1495 78682 131672 270185 135596 61111 40302 30040 23727 19589 16748 14641 13089 12025 11694 10472 9383
1354 9383 8634 8034 7527 7259 6725 6313 5711 6158 6012 5507 5158 4960 4926 4610 4274 4175 3892 3867 4189 4026 3791 3664 3570 3424
1128 3424 3268 3231 3144 3173 3084 2840 2742 2762 2613 2670 2603 2553 2461 2355 2180 2352 2384 2329 2321 2299 2163 2005 1932 2100 1891 2088 2163 1984 1811
856 1811 1748 1834 1940 1991 1782 1703 1686 1634 1703 1790 1623 1775 1655 1711 1489 1543 1572 1512 1481 1543 1502 1502 1411 1307 1358 1368 1445 1456 1351 1263 1308
565 1308 1360 1195 1272 1321 1233 1257 1025 1229 1179 1217 1196 1100 1222 1135 1149 1118 1071 1061 1208 1111 1017 1047 1034 1073 1026 928 1035 1066 1066 961 958 984
264 984 866 918 912 871 875 977 860 873 967 991 1005 1000 886 907 957 997 959 859 809 902 899 726 843 891 905 720 814 868 826 781 764 781 753
-45 753 771 787 821 810 862 725 697 735 698 664 676 750 720 792 861 758 732 684 685 554 758 751 723 757 724 699 715 658 685 699 678 559 470 474
-365 474 493 311 208
-393B08
##PAGE=	F1=-6658.29
##FIRST=	17614.246348710370512,	4405.4455391999963467,	0
##DATA TABLE=	(F2++(Y..Y)), PROFILE
4405 95 91 112 118 277 312 215 303 253 379 351 323 207 287 437 394 494 409 310 373 345 390 328 397 388 358 429 316 387 355 399 386 386 326 321 388
4077 388 386 475 422 429 403 309 414 391 319 323 337 437 287 381 468 500 388 386 388 369 460 490 417 459 440 557 350 419 347 437 466 391 419 340
3758 340 489 514 384 550 450 399 516 638 718 494 406 425 555 557 415 440 495 482 510 453 433 495 454 306 426 482 574 439 538
3485 538 561 590 527 422 517 539 543 531 632 673 624 552 568 414 524 532 521 563 450 344 276 521 517 576 407 487 638 694 573 606 704
3194 704 696 686 627 642 672 561 763 655 624 907 751 419 412 569 412 449 525 476 537 496 774 845 711 652 611 573 604 445 471 377
2912 377 469 956 1071 1078 820 861 914 855 841 764 765 584 624 888 885 810 920 945 928 912 933 1048 1023 905 842 789 972 939 937 971 892 800
2612 800 1008 1144 1137 1038 1095 1062 1022 1099 1099 1091 1190 1019 815 926 1059 1149 963 991 1034 1125 1124 1094 1073 1139 1222 1388 1303 1285 1227 1167 1307 1441
2311 1441 1354 1419 1471 1374 1461 1539 1553 1555 1483 1711 1697 1744 1035 1457 1625 1610 1793 1761 1728 1868 2065 2350 2706 2926 3272 4265 5432 10154
2049 10154 8762 2756 1152 761 839 1653 2916 7253 15561 8932 3989 3993 3215 2507 2489 2366 2578 2523 2490 2680 2619 2745
1842 2745 2784 2764 2803 3007 3235 3365 3332 3026 3267 3468 3573 3816 3997 4257 4508 4993 5134 4956 4699 5252 5637 6056 6424 6812
1617 6812 7335 8053 8986 9856 10290 11427 12939 14915 17879 22120 29684 41169 65069 108981 224141 112576 50723
1457 50723 33420 24885 19636 16246 13943 12130 10859 9970 9653 8657 7756 7127 6674 6245 6046 5577 5239 4713 5050 4954
1269 4954 4531 4234 4067 4075 3804 3504 3462 3195 3187 3440 3324 3118 3065 2966 2820 2690 2650 2583 2632 2553 2325 2245 2284 2128 2202 2147 2102 2013 1925
997 1925 1759 1918 1959 1927 1918 1893 1752 1650 1570 1730 1545 1670 1772 1624 1439 1398 1495 1598 1683 1445 1400 1378 1315 1420 1491 1334 1490 1343
734 1343 1424 1231 1275 1328 1221 1206 1256 1246 1249 1164 1077 1127 1135 1173 1196 1076 1029 1052 1108 977 1054 1084 1015 1009 788 989 959 1005 969 895 1007 923 939
424 939 909 880 893 1014 921 839 886 833 878 829 745 839 924 907 793 800 837 706 733 720 707 724 805 675 731 791 803 818 819 750 763 793 873 779
105 779 713 673 746 743 556 709 733 759 590 655 719 682 657 628 620 629 646 658 671 665 723 599 565 580 566 551 543 618 573 655 727 633 650 563 560 410
-233 410 617 601 596 637 596 584 585 534 580 594 568 431 367 384 412 247 158
-393A58
##PAGE=	F1=-6729.05
##FIRST=	17614.246348710370512,	4405.4455391999963467,	0
##DATA TABLE=	(F2++(Y..Y)), PROFILE
4405 83 87 120 66 212 244 170 215 150 294 281 227 126 212 333 288 370 302 195 261 253 276 264 268 286 269 323 214 322 272 286 289 275 242 249
4086 249 279 287 353 309 298 312 233 287 304 253 240 238 329 199 255 362 388 298 269 262 286 346 366 314 347 324 457 250 305 213 325 367 275 303
3767 303 244 356 375 257 434 352 289 396 501 616 427 292 320 427 455 296 300 380 345 402 360 309 370 351 173 290 332 412 292
3495 292 409 435 467 408 294 377 385 387 399 485 575 509 437 471 292 359 393 377 468 315 243 114 360 352 413 232 332 470 524 390 441
3204 441 529 537 554 483 490 537 419 574 500 516 803 701 407 260 386 266 291 365 311 373 307 577 656 548 512 423 439 467 332 356
2922 356 290 205 738 840 873 631 653 682 668 660 566 572 357 388 633 650 568 682 732 693 691 712 975 1101 949 748 609 753 705 710 751
2631 751 675 536 761 913 950 816 860 829 783 877 858 876 1004 855 581 632 749 855 739 734 747 823 826 792 766 817 898 1065 1010 977
2349 977 906 878 979 1141 1050 1060 1122 1049 1116 1187 1174 1208 1115 1329 1313 1266 591 1103 1254 1225 1336 1364 1295 1425 1552 1787 2232 2477 2796
2077 2796 3778 5134 10252 9585 3566 1800 808 857 1446 2465 6367 13925 8026 3593 3499 2413 1974 2073 1972 2127 2011
1880 2011 1958 2115 2024 2152 2177 2114 2152 2307 2448 2545 2488 2320 2475 2639 2716 2885 3033 3217 3448 3827 3803 3678 3508 3895 4177 4547
1635 4547 4836 5116 5480 6008 6715 7347 7664 8480 9610 11102 13344 16463 22051 30466 48297 80929 167028 84015
1466 84015 37846 24918 18533 14585 12112 10464 9034 8097 7443 7155 6431 5760 5281 5006 4678 4542 4174 3923 3505 3716
1279 3716 3664 3356 3122 2989 3029 2827 2561 2586 2356 2358 2524 2465 2301 2311 2223 2095 1985 1943 1901 1964 1903 1712 1647 1708 1566 1632 1602 1553 1472
1006 1472 1416 1262 1395 1433 1433 1426 1416 1265 1225 1140 1272 1136 1183 1288 1197 1010 973 1071 1176 1301 1055 1042 1004 934 1053 1126 984 1139 965
734 965 1071 921 940 1025 885 876 910 928 929 866 792 836 850 853 888 756 751 756 799 713 790 795 747 716 536 712 696 741 706 646 740 665 692 655 643
405 643 668 772 685 628 686 599 645 598 522 591 729 706 601 605 654 529 524 505 516 531 602 459 564 572 573 591 599 569 582 586 705 581 534 521
86 521 561 571 370 531 541 593 440 461 537 508 507 466 429 467 476 502 491 483 551 456 419 400 412 408 383 462 400 480 551 468 531 430 425 252 447
-243 447 428 437 483 447 440 438 384 439 473 425 294 244 270 313 178 102
-393A02
##PAGE=	F1=-6799.82
##FIRST=	17614.246348710370512,	4405.4455391999963467,	0
##DATA TABLE=	(F2++(Y..Y)), PROFILE
4405 73 73 131 21 144 186 138 163 47 208 227 167 51 152 248 201 267 228 93 144 168 164 210 149 193 185 240 115 252 201 201 197 177 166
4096 166 183 184 201 240 205 194 220 184 161 222 189 185 159 236 138 134 261 281 236 173 153 201 237 252 220 244 210 364 186 210 103 215 281 186
3776 186 204 153 240 254 148 307 266 194 284 349 500 378 207 237 309 384 203 178 277 221 297 279 220 270 282 80 185 191 276 157 275
3485 275 307 357 310 201 251 241 243 271 331 467 417 350 416 240 219 272 259 408 264 234 40 197 211 258 104 185 302 363 222 277
3204 277 339 362 409 346 342 404 301 396 353 398 679 643 452 225 248 180 166 251 175 255 117 375 464 405 404 267 331 362 301 273 367 275
2903 275 511 574 644 444 440 444 478 487 401 409 203 187 377 419 332 437 509 466 479 490 898 1126 1007 711 512 584 537 518 575 500 340
2612 340 506 666 767 641 661 638 567 685 653 682 844 767 481 439 498 594 573 565 512 597 589 568 518 544 599 759 753 739 625 644 689 877
2311 877 819 773 829 789 838 925 873 953 849 1049 1072 1025 269 812 975 975 986 1080 1008 1133 1212 1339 1816 2162 2520 3492 5092 10831
2049 10831 10719 4320 2311 1066 1130 1360 1999 5051 11018 6425 2926 2774 1674 1318 1544 1487 1600 1448 1392 1503 1412
1851 1412 1531 1549 1455 1509 1615 1671 1737 1665 1626 1701 1836 1892 1989 2097 2210 2404 2687 2569 2477 2393 2638 2806 3115 3346 3526 3762 4110
1598 4110 4604 5025 5237 5765 6521 7571 9147 11253 15056 20670 32837 55011 114114 57606 25940 17086 12702
1438 12702 9936 8286 7258 6202 5550 5137 4880 4393 3939 3586 3474 3260 3166 2901 2734 2432 2535 2498 2306 2137 2025 2072
1232 2072 1963 1704 1789 1612 1615 1691 1677 1565 1615 1556 1451 1357 1309 1283 1353 1312 1169 1110 1186 1086 1113 1132 1068 994 979 825 932 950 984 980 1006
941 1006 845 849 776 858 783 764 845 824 652 587 656 772 945 721 729 675 594 692 786 667 825 626 746 645 633 750 607 585 595 640
659 640 634 599 535 565 596 568 621 480 500 512 516 475 554 538 505 457 332 467 463 494 481 421 496 425 472 422 429 445 546 462 432 509 405 441 396
330 396 327 346 525 513 433 427 483 389 350 323 356 348 425 265 421 375 363 379 391 389 411 388 537 419 366 397 401 434 226 363 358 455 324 293
11 293 373 350 380 336 268 319 306 364 335 306 388 337 312 238 284 278 240 325 251 312 379 312 402 323 333 135 286 279 284 335 317 308 321 251 299 380 311
-337 311 200 136 150 218 116 54
-393E4
##PAGE=	F1=-6870.58
##FIRST=	17614.246348710370512,	4405.4455391999963467,	0
##DATA TABLE=	(F2++(Y..Y)), PROFILE
4405 69 50 127 33 85 147 117 160 43 134 189 167 29 119 208 163 220 212 107 47 106 77 173 93 121 119 199 49 196 148 175 133 124 112 133
4086 133 133 152 162 128 142 145 168 66 158 137 152 126 183 137 48 185 202 210 136 92 139 164 174 164 175 134 287 172 152 71 128 219 139 155
3767 155 105 160 193 105 194 200 131 221 217 392 340 167 199 233 349 179 119 214 160 217 218 181 220 256 74 154 105 207 101 161 202 282 255
3457 255 174 186 155 147 174 197 359 347 302 394 259 162 196 190 374 290 264 132 66 142 148 130 72 171 250 118 163 173 211 271 235 221 289 230
3138 230 268 238 289 547 556 476 281 207 183 113 213 113 231 42 205 301 305 334 198 264 298 328 246 477 492 356 323 432 305 274
2856 274 248 315 346 302 301 194 121 163 241 145 232 310 282 311 300 798 1081 1026 698 500 497 468 405 480 410 306 300 455 604 537 535 531 417
2546 417 555 524 538 721 722 509 399 393 425 481 518 399 502 470 496 419 424 412 540 586 619 463 513 506 700 706 627 658 644 679 799 698
2246 698 826 734 910 990 994 170 645 841 904 838 957 928 1032 1148 1184 1548 2011 2460 3433 5243 11587 11812 4932 2679 1338
2011 1338 1434 1379 1613 3607 7628 4626 2248 2164 1683 640 986 1015 1127 983 942 1011 942 1042 1070 956 1037 1118 1127 1155 1065 1116
1767 1116 1143 1256 1322 1364 1449 1501 1663 1880 1772 1652 1633 1810 1863 2113 2341 2450 2628 2849 3200 3497 3642 3997 4471 5232 6363
1532 6363 7835 10491 14323 22694 37975 79072 40198 18078 11953 8906 6908 5742 5147 4377 3876 3643 3422 3064
1363 3064 2763 2467 2445 2353 2276 2082 1977 1772 1828 1758 1655 1544 1438 1446 1446 1173 1278 1163 1166 1178 1151 1098 1158 1149 1052 989 921 890 965 938 828
1072 828 772 840 804 772 862 774 717 728 564 659 641 693 689 759 621 620 590 617 581 536 574 604 480 379 352 464 688 524 541 497 397 428
772 428 543 463 618 433 523 471 445 562 470 414 398 457 455 437 378 386 439 389 458 329 331 382 341 323 405 389 360 297 214 316 325 328 350 272 351
443 351 269 323 274 298 278 395 305 287 397 306 319 274 242 174 346 364 319 311 361 308 254 218 279 222 312 150 329 266 236 240 243 250 283 239 398
114 398 321 237 320 302 356 178 260 217 365 271 221 275 243 308 279 198 228 192 279 260 178 263 266 267 135 218 198 159 243 176 202 250 220 289 256
-214 256 306 130 164 195 181 226 232 221 262 173 194 331 279 189 101 45 147 71 38
-393C8
##PAGE=	F1=-6941.35
##FIRST=	17614.246348710370512,	4405.4455391999963467,	0
##DATA TABLE=	(F2++(Y..Y)), PROFILE
4405 73 20 105 58 37 121 103 164 98 78 151 187 77 105 196 158 220 221 175 76 65 49 145 128 69 65 177 53 162 107 182 102 127 80 96
4086 96 116 130 124 82 118 97 155 56 111 97 117 121 159 159 36 139 159 195 142 79 113 133 134 143 136 124 226 176 128 97 69 174 113 143 112 103 179
3739 179 124 117 148 94 209 150 305 300 148 187 208 331 201 129 180 166 171 174 161 208 246 96 159 108 189 143 81 129 229 229 177 182 156 118
3419 118 120 104 255 279 266 377 276 185 164 149 335 317 271 180 46 143 102 191 40 100 198 103 135 69 136 156 162 131 187 192 193 166 197 419
3100 419 437 443 314 221 201 111 201 102 246 147 100 178 237 270 191 223 249 345 239 524 607 314 138 264 239 199 147 195 237 253 231 222
2800 222 166 18 145 44 91 154 147 201 166 668 969 964 658 497 447 439 349 428 372 349 181 302 454 461 460 477 327 465 447 425 613
2509 613 658 539 402 388 344 409 509 375 473 422 497 419 440 357 422 489 559 406 446 419 588 651 573 582 571 597 736 601 754 694 835
2218 835 956 1014 189 558 772 896 815 913 945 996 1197 1253 1435 1950 2495 3504 5499 12386 12817 5452 2965 1563 1687
2002 1687 1441 1357 2341 4697 3255 1863 1986 2297 317 540 704 861 771 748 797 756 830 865 759 830 918 952 935 816 887 917
1757 917 996 1099 1114 1205 1212 1352 1524 1489 1303 1314 1498 1465 1659 1914 1997 2175 2338 2623 2881 3001 3310 3646 4275 5196 6440 8622
1513 8622 11802 18581 31081 64482 32955 14778 9824 7341 5697 4654 4241 3632 3163 3001 2843 2503 2270 1988
1344 1988 1958 1962 1899 1731 1651 1498 1579 1451 1392 1326 1236 1179 1245 997 1062 998 1013 1026 918 908 954 1005 886 879 785 727 813 799 683 641 686 681
1044 681 622 757 661 631 633 479 568 527 562 554 644 572 529 552 560 512 482 501 525 459 381 254 288 532 445 456 468 360 321 401 381 503 398
734 398 410 395 395 458 439 356 331 376 402 384 334 313 379 317 387 296 242 329 296 264 341 346 316 245 156 261 281 266 309 207 311 228 241 218 255
405 255 198 333 238 198 334 277 275 225 260 167 205 267 246 255 286 262 216 174 269 178 255 135 272 249 208 200 181 176 203 160 301 265 146 266
86 266 254 306 183 227 129 303 245 230 246 193 276 273 209 192 173 238 262 132 183 230 254 105 194 166 140 217 170 172 175 201 206 203 302 172 98 168
-252 168 148 167 184 187 242 155 137 304 303 211 136 58 109 54 56
-393E6
##PAGE=	F1=-7012.11
##FIRST=	17614.246348710370512,	4405.4455391999963467,	0
##DATA TABLE=	(F2++(Y..Y)), PROFILE
4405 83 15 70 70 14 95 96 149 122 55 104 192 124 96 176 151 228 218 216 141 49 79 112 174 51 16 144 74 142 73 180 89 149 62 81 105
4077 105 119 105 83 83 73 129 86 73 67 69 109 134 170 53 109 137 170 144 77 110 119 112 126 105 140 176 171 123 121 26 129 86 126 132 45 162 139
3729 139 85 98 68 203 158 243 259 120 166 206 314 226 159 144 177 156 151 128 200 232 110 151 132 172 186 65 100 168 205 167 186 186 124
3419 124 108 70 160 209 215 348 262 218 167 112 272 312 253 187 89 152 95 219 88 71 176 107 148 53 148 95 138 75 96 157 147 136 119
3110 119 308 307 362 299 228 197 113 179 74 239 200 105 99 184 184 175 187 189 328 213 500 603 321 99 145 220 200 159 139 166 222 183 220
2800 220 186 92 108 84 43 46 46 142 103 514 817 834 586 468 390 396 308 373 337 372 162 204 314 372 391 425 273 382 391 316 509 557
2499 557 524 379 376 312 316 467 366 441 378 478 415 482 366 373 431 498 390 393 375 508 592 538 545 523 545 680 535 682 669 778 922
2208 922 1051 212 500 706 876 825 898 982 984 1237 1388 1479 1984 2598 3708 5937 13510 14063 6025 3270 1775 1907 1519
1992 1519 1231 1467 3071 2738 1825 2106 2821 747 494 674 839 795 764 820 785 850 860 779 796 889 975 933 788 831 886 932 1055
1739 1055 1058 1166 1155 1264 1403 1401 1185 1200 1398 1326 1474 1728 1813 2002 2144 2390 2629 2735 3028 3328 3879 4686 5829 7777 10682
1504 10682 16790 28098 57991 29648 13255 8830 6589 5162 4153 3798 3268 2815 2649 2569 2229 2010 1756 1682 1736
1326 1736 1700 1538 1463 1318 1449 1278 1236 1196 1145 1044 1111 924 945 906 933 996 814 809 835 949 794 835 733 638 737 755 604 575 617
1053 617 588 549 678 596 593 564 443 520 481 482 467 546 541 476 531 550 478 457 485 488 446 415 288 234 416 402 385 463 363 320 313 341 409 398 346
725 346 344 393 388 422 319 312 320 381 373 338 282 354 293 343 297 190 267 286 241 300 332 302 238 100 235 259 244 293 174 295 243 195 188 231 164
396 164 313 228 146 284 251 253 191 280 232 103 211 190 221 235 221 177 137 262 179 218 139 214 247 205 202 173 161 156 125 241 218 90 206
86 206 216 250 171 212 82 240 200 230 235 169 243 266 226 164 191 206 283 145 137 200 236 108 167 149 124 207 170 177 130 201 154 144 278 189 89
-243 89 144 149 140 143 171 225 157 108 269 320 217 162 127 92 72 83
-393H3
##PAGE=	F1=-7082.88
##FIRST=	17614.246348710370512,	4405.4455391999963467,	0
##DATA TABLE=	(F2++(Y..Y)), PROFILE
4405 95 44 37 68 43 60 90 115 119 63 59 174 160 94 135 127 224 194 223 180 71 110 70 204 85 41 90 86 120 71 157 81 162 48 93 105
4077 105 127 90 130 29 59 93 101 46 61 31 80 99 166 72 82 124 140 128 71 112 106 104 100 75 142 143 152 129 147 26 83 76 88 141 19 120
3739 120 131 75 48 54 176 181 194 230 84 125 196 294 242 194 100 165 152 155 83 183 210 125 133 136 142 205 106 121 98 178 142 173 202 137 119 80
3401 80 102 161 147 314 227 233 195 104 194 282 234 174 110 154 111 222 136 46 157 100 156 69 164 112 161 85 46 117 111 132 58 228 215 266
3081 266 265 226 177 129 166 30 202 211 154 100 161 85 134 155 117 288 163 444 517 317 145 61 208 215 195 159 162 214 176 208 183 165 80
2772 80 126 69 52 34 120 100 364 672 689 519 441 344 352 284 317 303 376 215 164 213 282 329 365 262 307 367 219 422 454 491 369 340
2471 340 321 235 388 352 407 345 437 386 516 401 373 426 448 403 364 369 473 537 528 540 520 535 653 523 631 668 764 923 1139 291 488
2180 488 674 864 866 934 1047 1056 1297 1530 1651 2151 2801 4061 6582 15042 15648 6678 3611 2002 2139 1626 1220 1030 2685
1964 2685 2709 1869 2168 2992 1133 732 802 908 868 801 877 832 909 884 815 781 857 977 936 775 785 854 894 1006 1001 1114 1111 1172 1294
1692 1294 1279 1064 1077 1277 1182 1292 1509 1599 1794 1926 2126 2339 2420 2668 2962 3423 4124 5121 6807 9339 14700 24593 50661
1476 50661 25891 11549 7695 5708 4524 3615 3319 2853 2437 2246 2241 1931 1708 1509 1394 1474 1469 1324 1252 1089 1270 1078
1269 1078 1037 1008 1011 900 932 804 801 782 798 931 724 696 690 872 698 759 677 539 633 712 533 494 563 484 485 576 516 538 473 396 451 425
969 425 399 372 423 463 406 481 510 442 408 439 448 402 407 315 253 302 367 292 421 347 333 258 296 314 367 292 277 383 328 395 268 295 250 332 357
640 357 344 255 330 288 302 310 173 174 253 220 249 309 281 244 31 201 225 209 274 144 256 254 181 150 193 125 286 230 124 240 212 226 152
330 152 263 269 77 190 152 192 199 197 129 98 230 187 202 128 144 229 184 193 176 168 147 108 210 188 97 140 177 193 141 189 75 169 134 193 208
2 208 154 193 238 228 128 193 168 295 171 126 163 212 126 127 132 87 192 156 179 98 186 129 95 223 179 113 101 145 124 100 146 198 157 84 219
-327 219 309 202 160 175 80 102 111
-393A11
##PAGE=	F1=-7153.64
##FIRST=	17614.246348710370512,	4405.4455391999963467,	0
##DATA TABLE=	(F2++(Y..Y)), PROFILE
4405 106 66 27 58 72 17 76 80 99 73 52 142 179 104 83 95 207 159 202 186 103 127 25 212 129 86 27 95 89 97 115 74 158 33 107
4086 107 126 159 90 184 34 51 57 103 39 78 60 39 58 153 103 58 114 118 108 63 116 98 112 87 59 123 138 129 134 176 67 47 100 38 134 79
3748 79 61 107 61 15 55 133 184 143 216 67 72 164 266 246 227 68 131 143 174 40 157 178 136 121 124 116 198 147 157 70 159 122 149 194
3429 194 149 134 90 107 158 75 279 200 228 226 144 126 242 227 159 119 151 144 209 177 30 146 102 156 101 144 139 190 133 90 85 92 132 48 186
3100 186 196 191 246 225 159 156 185 66 155 200 195 152 181 73 101 129 50 242 119 394 414 297 173 10 179 212 206 190 198 230 208 215 179
2790 179 228 66 151 93 94 96 127 115 261 575 588 474 442 338 336 289 288 285 379 287 190 196 239 306 314 290 255 384 178 372 391 468 408 306
2471 306 353 242 302 334 387 349 408 357 537 451 402 474 441 435 380 400 489 516 553 567 570 576 678 567 620 692 796 965 1250 410 533 709
2171 709 882 937 1009 1124 1208 1406 1655 1854 2374 3045 4450 7239 16560 17175 7270 3908 2197 2390 1766 1307 902 2472
1964 2472 2611 1814 2047 2813 1351 940 938 964 913 793 890 832 933 884 811 750 793 926 901 745 710 775 845 928 926 1023 1057 1060 1174 1143
1682 1143 929 940 1148 1031 1111 1270 1346 1551 1695 1851 2048 2095 2281 2572 2944 3568 4402 5847 8001 12601 21045 43391
1476 43391 22190 9898 6588 4846 3869 3102 2866 2476 2094 1876 1921 1664 1430 1291 1134 1226 1245 1129 1071 868 1085 914
1269 914 842 811 858 771 765 667 642 660 624 832 649 597 535 771 622 669 638 458 513 662 494 415 514 412 442 489 448 490 398 359 389
978 389 379 340 297 307 356 322 421 448 414 365 369 414 357 373 317 292 207 352 217 352 325 339 254 253 254 313 260 197 362 280 374 226 286 188
659 188 257 331 343 240 306 296 276 338 214 98 206 207 198 288 264 260 47 164 192 155 251 126 205 246 198 126 161 72 239 223 122 217
358 217 183 196 129 216 266 122 198 148 184 188 207 107 92 178 189 218 116 76 202 155 161 176 172 169 110 194 187 140 90 156 173 118 178 101 110 79
20 79 138 165 146 134 196 218 107 174 128 293 198 149 128 190 158 89 123 53 166 140 178 94 166 117 105 149 150 144 54 131 116 77 105 165 156 69
-318 69 168 279 178 134 199 64 125 136
-393A36
##PAGE=	F1=-7224.41
##FIRST=	17614.246348710370512,	4405.4455391999963467,	0
##DATA TABLE=	(F2++(Y..Y)), PROFILE
4405 115 78 33 45 92 26 52 55 80 69 69 114 176 118 43 71 176 123 168 157 124 125 18 196 160 118 40 108 48 123 61 63 135 20 98 149
4077 149 188 108 225 93 61 26 99 49 94 92 12 21 132 135 56 98 111 102 55 120 102 120 107 70 90 153 116 124 195 104 42 133 8 119 122
3748 122 34 82 36 43 58 96 164 80 199 85 29 110 219 235 246 76 97 117 189 48 118 131 131 110 98 101 168 167 173 111 153 125 132 164 153
3419 153 135 87 126 168 50 238 194 201 238 190 91 202 225 152 124 139 178 185 204 46 147 118 154 152 91 141 196 172 132 79 94 119 75 167
3100 167 206 148 243 224 157 170 214 126 112 180 218 196 216 157 137 105 42 193 120 357 359 269 188 81 129 187 188 190 222 243 239 234 180 274 110
2772 110 164 113 116 135 151 130 239 521 538 427 454 358 339 304 280 281 375 342 244 221 246 325 286 326 219 410 204 349 364 453 468 305
2471 305 372 318 251 304 365 366 397 341 530 497 426 530 466 456 420 433 522 526 584 599 633 640 728 634 627 719 829 1009 1335 532 600 788 915
2161 915 1022 1078 1183 1367 1553 1769 2038 2575 3284 4812 7844 17959 18584 7823 4191 2330 2657 1949 1481 942 2039
1964 2039 2373 1698 1850 2455 1427 1082 1062 1011 965 784 890 818 946 901 805 736 745 874 871 751 653 687 816 866 883 946 1036 998 1100
1692 1100 1065 843 853 1082 945 1012 1118 1151 1355 1540 1672 1873 1898 2041 2313 2627 3226 3942 5251 7184 11288 18818 38866
1476 38866 19902 8910 5910 4323 3434 2783 2576 2267 1904 1670 1722 1515 1279 1178 978 1075 1103 1020 977 744 945 849 724
1260 724 680 737 695 674 582 515 584 465 720 592 537 424 655 575 592 618 423 414 604 483 371 460 391 420 452 412 460 372 339 356 360
969 360 318 273 241 258 234 360 385 388 337 300 386 327 333 302 304 162 342 213 284 310 337 283 230 259 263 256 125 334 242 355 220 278 163
659 163 177 288 328 237 281 297 262 357 276 122 173 205 163 276 264 280 110 134 179 110 219 113 167 219 215 127 158 50 168 194 113 212
358 212 172 169 129 157 225 152 209 157 195 196 230 132 116 120 179 249 118 40 176 138 112 169 156 189 125 170 197 169 68 151 191 112 192 130 85
30 85 90 99 121 142 89 149 195 120 144 97 275 222 180 104 174 187 67 119 66 132 135 171 115 158 107 148 85 110 167 59 106 118 90 53 126 150
-308 150 73 125 244 164 93 196 44 134 152
-393A52
##PAGE=	F1=-7295.17
##FIRST=	17614.246348710370512,	4405.4455391999963467,	0
##DATA TABLE=	(F2++(Y..Y)), PROFILE
4405 121 84 35 37 100 62 58 34 80 55 71 111 155 130 64 79 131 87 138 105 130 102 54 157 172 135 88 122 26 141 21 51 98 36 60
4086 60 151 196 129 245 137 94 16 89 62 98 104 51 23 99 156 83 69 103 111 51 117 112 112 136 90 56 171 129 100 198 129 58 159 43 111
3758 111 146 83 84 36 77 51 91 125 7 165 113 51 45 146 205 246 100 105 77 195 101 79 68 113 85 67 90 119 159 159 143 147 140 140 124 157
3419 157 119 81 124 157 89 185 198 160 221 217 92 166 215 158 126 112 199 154 215 69 148 137 143 196 46 126 171 195 151 106 105 94 90 158 212
3091 212 118 233 218 173 160 230 173 79 158 226 217 242 223 219 91 92 137 149 321 368 245 204 149 91 154 162 156 219 235 252 245 178 299 186 178
2762 178 144 137 159 183 147 261 478 514 356 444 377 340 311 263 290 354 364 299 241 260 359 294 360 189 417 249 342 353 435 516 356 372
2462 372 398 282 282 335 375 397 351 494 536 439 574 515 461 468 452 550 564 605 627 683 721 795 731 642 757 854 1047 1393 654 698 905 985
2161 985 1150 1171 1262 1533 1765 1960 2292 2833 3641 5318 8730 20045 20737 8717 4688 2557 3002 2232 1753 1108 1608
1964 1608 2219 1675 1777 2179 1444 1210 1205 1090 1069 838 927 845 991 967 844 768 750 866 870 805 661 635 813 844 887 907 1044 1003
1701 1003 1080 1036 809 824 1069 917 990 1071 1042 1213 1441 1571 1777 1802 1934 2159 2443 3028 3674 4903 6710 10513 17511 36166
1476 36166 18552 8354 5514 4039 3160 2577 2374 2135 1801 1558 1598 1421 1208 1121 890 991 1022 968 927 707 826 831 671
1260 671 610 646 644 630 562 431 540 369 598 527 489 370 521 521 523 590 407 348 526 463 358 381 378 387 439 393 432 382 323 340 353 306 287
950 287 223 205 147 286 325 343 300 244 343 297 288 277 266 155 307 242 231 293 324 308 218 288 237 259 96 300 208 321 242 257 166 126 221
640 221 291 225 252 270 243 343 320 178 168 204 153 265 275 298 161 106 179 130 176 94 152 180 211 132 172 100 87 139 81 197 162 139 130
330 130 105 153 143 199 149 201 206 237 164 137 72 156 269 136 65 147 135 67 150 117 187 137 128 193 173 53 141 213 105 206 147 86 126 92
11 92 101 139 81 115 154 138 114 84 239 236 199 99 162 204 64 111 94 93 137 155 130 165 93 179 86 67 174 111 70 125 111 21 81 132 90 92
-327 92 212 170 48 172 40 124 156
-393A56
##PAGE=	F1=-7365.94
##FIRST=	17614.246348710370512,	4405.4455391999963467,	0
##DATA TABLE=	(F2++(Y..Y)), PROFILE
4405 124 85 42 36 98 84 102 6 97 46 48 129 128 136 103 109 75 53 123 63 131 67 83 102 163 145 119 132 67 155 65 63 65 73 15 126 177 139 247
4049 247 165 134 60 83 83 93 106 86 61 59 165 119 45 85 116 65 104 125 88 148 106 48 185 160 82 192 142 73 177 59 132 155 128
3739 128 109 85 115 38 112 78 73 116 136 93 34 51 158 231 117 153 51 200 159 94 20 107 43 56 88 60 133 122 149 129 152 165 109
3429 109 172 97 95 115 127 126 128 201 139 186 226 109 146 196 177 134 86 203 133 220 97 147 158 120 216 97 128 131 211 156 152 126 79 87 168 227
3091 227 115 204 206 200 144 236 205 75 138 228 223 262 259 306 122 150 98 170 301 411 243 226 205 136 146 169 123 204 224 258 252 180 300 262
2772 262 207 192 182 188 218 166 281 438 520 298 410 399 349 327 234 322 337 363 355 269 266 390 344 410 199 414 299 359 362 423 549 450
2471 450 393 459 390 325 332 390 422 402 461 582 472 625 605 485 532 484 591 642 647 674 729 830 899 880 696 842 909 1115 1461 769
2189 769 855 1074 1134 1346 1353 1427 1743 2062 2293 2693 3255 4228 6112 10123 23317 24139 10125 5453 3056 3506 2645 2117
1983 2117 1375 1460 2291 1807 1897 2156 1490 1363 1378 1211 1208 955 1004 921 1075 1063 926 834 788 890 883 864 723 635 812 842 897 885 1039
1711 1039 1028 1074 1007 787 810 1048 895 972 1056 976 1083 1319 1466 1661 1692 1837 2002 2262 2801 3394 4527 6176 9673 16120
1485 16120 33213 17074 7746 5094 3760 2901 2355 2158 1963 1693 1428 1469 1312 1142 1051 813 910 946 926 877 709 706 803
1269 803 647 564 576 595 577 570 396 505 372 485 468 436 359 381 444 457 544 395 311 438 421 366 287 349 332 416 380 394 399 314 342 353
969 353 288 317 230 217 106 200 277 287 246 211 281 261 243 262 195 142 241 250 196 260 303 320 205 305 241 255 131 271 196 271 269 234 179 145
649 145 137 237 198 226 220 215 291 334 215 179 199 169 252 285 318 200 86 181 201 139 89 149 158 199 139 182 158 87 79 39 165 147 109 125 80
321 80 82 96 163 124 187 211 221 184 147 49 131 267 164 99 117 137 79 127 66 167 138 79 175 165 38 110 216 92 203 146 90 150 92
11 92 106 145 103 118 102 141 99 87 189 241 201 109 163 208 87 104 110 60 142 134 133 172 83 191 126 51 168 167 21 134 124 72 34 98 106 68
-327 68 184 192 27 138 66 100 149
-393A49
##PAGE=	F1=-7436.7
##FIRST=	17614.246348710370512,	4405.4455391999963467,	0
##DATA TABLE=	(F2++(Y..Y)), PROFILE
4405 124 84 62 33 91 92 144 32 112 59 5 135 109 135 130 136 39 47 119 83 136 48 104 51 135 149 134 132 109 167 108 98 68 109 75 79 141 133
4058 133 237 180 167 106 91 113 89 117 107 101 46 173 146 80 59 103 88 83 135 69 132 112 59 189 189 90 190 151 81 185 62 165 161
3748 161 157 131 135 156 39 131 42 137 65 148 125 82 51 106 215 129 201 76 203 208 154 89 125 52 84 115 9 104 96 143 91 155 179 134
3429 134 200 94 122 130 105 151 100 196 161 159 229 136 155 172 202 146 103 196 130 222 135 152 186 92 203 152 156 109 222 158 193 159 96 73 199
3100 199 260 165 168 190 220 147 245 225 114 119 227 219 281 262 373 186 208 125 168 325 456 279 252 239 208 174 219 142 195 232 269 263 193
2790 193 285 314 245 243 242 229 253 191 289 414 562 314 373 429 378 368 215 365 348 362 403 326 274 407 408 472 255 423 349 398 397 423 568
2480 568 542 461 494 513 427 382 424 475 478 462 632 533 690 728 550 604 542 646 739 728 745 776 938 1027 1050 786 961 1006 1215 1550 857
2189 857 1031 1251 1324 1552 1588 1649 1962 2363 2673 3134 3750 4885 6972 11617 26749 27693 11546 6120 3627 4127 3115
1992 3115 2496 1688 1563 2467 1982 2069 2280 1585 1517 1549 1344 1332 1083 1081 1017 1172 1150 1021 914 828 917 886 888 799 682 796 838 888
1729 888 859 999 1033 1059 963 763 793 1004 864 936 1032 936 967 1162 1342 1514 1548 1711 1835 2073 2536 3084 4114 5579 8759 14631
1485 14631 30031 15458 7075 4652 3477 2676 2146 1963 1771 1600 1289 1337 1201 1090 971 761 834 869 890 839 730 620
1279 620 772 656 535 542 568 515 577 417 478 440 421 462 396 382 297 374 412 497 401 303 377 385 388 237 314 274 377 374 362 410 319 363 371 282
959 282 356 253 262 158 142 262 264 211 221 220 231 214 277 157 111 166 228 175 207 276 324 186 306 257 249 176 254 222 228 289 231 200 201 83 181
631 181 171 208 173 180 223 318 232 182 187 201 241 284 334 223 88 184 273 147 124 143 173 202 163 178 198 171 99 68 137 152 96 129 83 89 28
302 28 106 98 149 212 188 192 152 46 121 245 189 125 105 135 124 111 41 149 126 75 156 163 58 60 199 88 181 128 91 163 93 106 156 128 154
-27 154 71 124 101 99 139 241 194 122 183 205 124 112 113 63 143 121 136 171 84 188 155 79 152 214 35 143 125 117 47 49 109 61 155 211 51
-355 51 109 95 68 133
-393A33
##PAGE=	F1=-7507.47
##FIRST=	17614.246348710370512,	4405.4455391999963467,	0
##DATA TABLE=	(F2++(Y..Y)), PROFILE
4405 121 76 89 20 81 88 167 79 116 83 47 111 100 123 138 148 69 92 114 123 143 77 118 60 91 145 141 117 136 169 135 127 95 132 135 26 102 111
4058 111 214 185 184 142 114 146 92 148 108 136 82 195 158 144 64 71 103 59 132 86 88 101 64 174 205 102 194 166 92 180 75 180 168
3748 168 167 138 164 198 60 136 55 178 44 139 142 104 135 61 199 140 230 118 191 235 214 156 144 114 119 168 53 87 111 151 38 151
3448 151 166 164 224 124 136 164 113 165 120 188 195 160 234 172 190 146 223 159 156 194 140 218 175 175 226 82 171 176 187 127 224 173 212 196 124 56
3110 56 229 290 237 157 180 216 171 258 238 171 104 221 207 299 238 401 250 256 187 142 368 486 342 281 262 266 206 281 197 198 259 288 286 216
2790 216 269 332 277 285 298 277 291 231 283 394 603 381 343 454 414 420 232 396 379 379 432 409 299 404 456 534 318 447 398 435 450
2499 450 429 562 601 555 499 612 541 466 467 543 552 497 668 603 746 859 654 676 617 700 822 835 835 828 1017 1152 1210 893 1083 1127 1331
2208 1331 1675 947 1188 1406 1519 1724 1816 1892 2165 2616 3028 3537 4239 5507 7774 13003 29830 30834 12781 6561 3846
2011 3846 4785 3607 2877 2036 1736 2643 2132 2199 2406 1731 1653 1711 1492 1437 1211 1153 1127 1292 1232 1134 1024 895 965 905 894 878 781
1757 781 799 858 888 859 954 1031 1056 938 770 807 976 858 918 1024 956 920 1031 1250 1405 1437 1605 1724 1954 2339 2852 3803 5129
1504 5129 8071 13514 27660 14209 6532 4313 3257 2535 2008 1842 1621 1544 1196 1226 1110 1063 888 750 781 797 850 817
1297 817 746 587 742 688 525 536 566 474 557 458 453 496 406 508 380 415 311 338 398 453 421 313 359 374 402 271 296 230 326 361 340
1006 340 402 325 384 396 295 390 285 298 218 146 271 287 234 262 195 221 208 310 213 88 128 187 168 139 229 315 161 290 257 247 197
715 197 239 257 211 290 245 227 246 132 140 164 189 158 138 164 273 231 165 157 225 230 269 334 230 96 181 317 189 171 125 195 220 204 161 210
396 210 236 169 128 138 193 117 155 93 145 65 37 89 90 204 148 185 162 37 123 205 201 135 121 123 151 111 59 142 104 109 144 169 91 3 167 99
58 99 160 98 81 163 120 76 153 141 193 102 90 99 104 97 234 189 123 205 198 158 133 110 95 136 124 152 162 98 174 163 111 123 241 98 145 122 142
-290 142 94 15 88 67 124 213 77 90 112 33 108
-393A08
##PAGE=	F1=-7578.24
##FIRST=	17614.246348710370512,	4405.4455391999963467,	0
##DATA TABLE=	(F2++(Y..Y)), PROFILE
4405 108 61 114 7 74 91 172 132 109 110 103 66 104 105 134 149 98 153 119 162 149 126 135 119 53 133 153 96 153 168 159 143 128 145 179 76 85 95
4058 95 179 192 185 166 147 182 109 200 92 163 127 247 167 211 121 83 124 57 113 131 61 87 74 135 211 113 197 201 131 170 133 157 182 167 154
3729 154 163 241 102 137 99 206 102 118 151 100 194 65 187 164 245 169 164 243 263 223 158 179 152 238 116 92 149 193 72 156 139 187
3429 187 243 189 135 202 145 183 167 202 216 192 252 226 255 148 244 180 220 230 180 220 217 226 288 137 183 187 221 186 227 225 216 246 161 79 252 314
3091 314 315 220 220 203 211 287 268 242 139 231 205 328 230 402 321 307 264 168 396 506 427 331 323 329 245 360 274 246 310 338 343 276 306 346 321
2762 321 341 366 349 351 303 240 337 630 464 356 489 469 488 319 433 429 449 470 527 388 425 516 628 419 510 483 494 553 497 575 657
2471 657 687 540 706 688 615 559 661 674 607 737 718 824 1035 852 808 769 824 941 1011 1017 988 1153 1353 1454 1102 1288 1363 1566
2208 1566 1958 1222 1457 1692 1875 2058 2199 2344 2612 3095 3659 4269 5169 6687 9401 15778 36178 37351 15547 7963
2020 7963 3736 5675 4403 3540 2630 2123 3022 2467 2478 2659 2067 1906 1996 1775 1644 1441 1316 1322 1546 1414 1344 1246 1089 1124
1795 1124 1038 974 1012 962 919 985 980 960 991 1082 1118 984 853 900 1030 922 971 1074 1056 981 999 1230 1380 1413 1560 1695 1929 2259 2733
1523 2733 3612 4855 7621 12728 26044 13331 6095 4047 3058 2420 1906 1753 1515 1489 1152 1128 1025 1038 793 742 749 732
1316 732 782 790 735 576 696 720 529 537 564 480 503 495 427 511 394 558 382 434 374 337 415 412 441 341 364 388 402 348 324 222 286 336 324
1006 324 377 328 388 414 328 412 324 333 267 173 277 329 294 313 227 244 219 346 307 139 173 159 204 127 159 298 159 262 240 257 204 218
706 218 284 221 287 262 264 273 218 153 193 172 184 111 145 213 231 147 105 224 212 248 313 236 98 168 325 239 213 119 201 241 251 146 206 262
387 262 229 186 159 259 171 202 123 197 152 75 110 12 185 137 171 188 45 118 166 209 136 154 123 156 139 86 143 90 136 137 183 119 57 129
67 129 118 166 113 53 147 179 12 122 134 219 160 87 75 101 63 212 197 108 211 196 182 154 109 136 119 137 183 164 132 156 167 144 81 244
-252 244 165 143 136 153 141 88 47 60 99 190 99 83 115 2 75
-393G5
##PAGE=	F1=-7649
##FIRST=	17614.246348710370512,	4405.4455391999963467,	0
##DATA TABLE=	(F2++(Y..Y)), PROFILE
4405 86 38 137 48 88 118 179 194 118 151 161 101 138 103 156 164 111 220 166 215 173 187 175 198 102 147 193 107 184 197 206 165 180 168 216 166 127
4067 127 134 162 217 194 198 191 230 152 270 102 194 177 325 205 275 201 174 182 108 114 195 139 122 130 98 237 160 206 260 210 196 229 118 224
3748 224 189 218 150 295 172 166 166 256 209 151 187 110 237 140 204 218 281 245 165 259 317 308 203 251 209 329 203 145 210 271 183 203 171
3438 171 226 288 294 170 261 209 233 244 277 246 262 297 311 359 226 287 245 300 327 285 270 281 317 388 250 298 250 296 297 288 333 265 337 239 176
3110 176 301 376 406 356 350 255 292 372 352 343 256 320 279 409 327 437 428 398 384 334 452 565 541 432 459 450 341 488 401 383 424 464 471
2800 471 411 442 436 427 459 490 483 457 419 147 287 717 615 501 613 609 628 505 563 558 622 601 719 594 570 682 830 642 677 676 664 775
2499 775 727 730 823 916 747 886 943 899 800 919 951 895 976 992 1055 1359 1232 1112 1112 1169 1243 1370 1419 1413 1543 1801 1966 1568 1741 1884
2218 1884 2114 2547 1850 2095 2395 2669 2904 3079 3323 3726 4309 5106 5973 7298 9410 13267 22286 51500 53287 22409
2030 22409 12007 4625 7304 5998 4930 3827 3208 3964 3348 3275 3351 2811 2537 2631 2368 2130 1909 1708 1702 2053 1822 1743
1823 1743 1650 1482 1471 1368 1236 1270 1245 1220 1275 1227 1209 1178 1240 1277 1116 1025 1087 1183 1058 1106 1185 1208 1107 1065 1261 1405 1444 1548 1686
1551 1686 1925 2220 2640 3423 4581 7163 11865 24368 12516 5679 3803 2860 2305 1836 1682 1473 1446 1182 1090 989 1056
1354 1056 766 746 774 745 740 793 748 621 673 782 592 589 591 582 486 569 466 543 415 622 445 474 477 396 494 433 487 424 417 452 434 459 434
1044 434 303 330 358 354 397 376 411 454 407 456 400 415 350 236 296 390 377 387 328 328 267 397 411 257 278 201 312 254 150 317 239 270
743 270 263 309 256 229 334 277 331 309 339 313 324 258 278 215 257 181 196 204 283 195 110 217 216 266 305 268 133 173 318 307 265 176 205 278 314
415 314 182 228 275 280 252 189 334 260 271 199 266 248 190 173 95 172 202 190 248 114 121 179 248 161 211 179 172 209 138 170 138 170 153 223 160
86 160 122 138 154 214 208 61 129 257 91 86 109 240 231 174 66 116 66 178 237 114 207 219 219 184 129 189 117 164 225 204 200 163 200 189 75
-243 75 238 240 158 190 184 196 178 88 26 102 161 125 105 117 38 34
-393C4
##PAGE=	F1=-7719.77
##FIRST=	17614.246348710370512,	4405.4455391999963467,	0
##DATA TABLE=	(F2++(Y..Y)), PROFILE
4405 53 18 159 98 133 168 211 263 163 213 220 208 205 143 224 216 130 290 255 296 233 259 245 292 195 216 266 167 244 278 285 220 258 224 265 267 219
4067 219 220 213 270 236 259 251 298 219 353 173 246 238 419 283 336 289 289 279 186 186 277 249 209 223 147 303 258 247 336 310 276 340 167 302
3748 302 257 327 177 360 265 242 259 348 343 260 272 175 291 249 281 303 364 350 251 315 395 414 301 335 303 440 313 252 306 379 314 296
3448 296 284 305 381 429 275 366 315 329 361 410 319 372 380 426 493 360 370 364 401 470 441 388 380 445 522 396 470 386 427 453 437 483 397 478 366
3119 366 318 412 507 522 533 540 400 425 529 499 484 421 497 441 566 515 572 590 549 558 586 614 704 681 582 648 635 512 667 581 587 611 662 665
2800 665 613 654 626 605 649 681 683 611 573 178 456 957 876 784 867 862 873 773 815 802 895 858 990 899 857 981 1152 987 968 982 968 1115
2499 1115 1104 1066 1148 1259 1120 1200 1317 1311 1198 1330 1388 1354 1416 1445 1500 1860 1784 1593 1642 1743 1774 1927 2034 2085 2218 2521 2764 2281
2236 2281 2449 2684 2970 3387 2763 3120 3522 3894 4262 4491 4817 5484 6275 7375 8649 10603 13643 19276 32344 75324
2049 75324 78194 33028 18285 7600 9890 8464 7069 5666 5088 5459 4764 4607 4511 3953 3596 3664 3275 2903 2609 2327
1861 2327 2265 2785 2445 2314 2205 2025 1964 1846 1659 1654 1605 1651 1686 1590 1558 1480 1487 1502 1302 1261 1329 1386 1228 1279 1318 1355 1225 1152 1282 1402
1579 1402 1444 1495 1608 1838 2101 2456 3123 4158 6552 10804 22502 11821 5420 3710 2816 2322 1924 1758 1604 1541 1369
1382 1369 1234 1123 1225 950 864 938 938 871 935 883 814 778 942 770 759 725 796 619 738 638 688 561 752 616 601 650 554 660
1119 660 591 608 586 565 597 556 618 617 478 494 502 478 528 520 520 567 556 568 537 568 499 369 384 505 498 505 484 477 377 493 524 405 417 314 472
790 472 443 297 419 388 377 374 422 379 321 438 397 449 423 467 409 457 419 412 339 373 324 301 302 405 319 232 253 289 352 357 334 233 248 347 410
462 410 349 291 253 358 402 278 309 330 342 338 239 414 372 360 306 369 355 320 266 215 211 316 274 341 212 174 268 335 238 299 284 237 313 224
142 224 250 236 245 213 304 229 193 224 222 295 336 151 164 344 209 147 114 273 310 305 146 175 134 164 311 180 225 276 291 237 182 259 170
-167 170 219 281 282 295 221 272 250 151 256 324 214 274 255 265 278 195 39 148 170 159 160 138 79 25
-393B5
##PAGE=	F1=-7790.53
##FIRST=	17614.246348710370512,	4405.4455391999963467,	0
##DATA TABLE=	(F2++(Y..Y)), PROFILE
4405 16 34 177 149 196 223 262 327 226 287 276 318 280 208 314 293 178 359 359 388 315 335 329 388 285 311 355 242 319 385 374 305 346 306
4096 306 338 365 329 312 312 339 305 341 317 377 297 432 268 316 307 511 374 390 371 396 385 270 298 369 354 310 325 251 393 374 322 413 405
3786 405 379 441 298 398 355 445 261 428 361 339 365 463 477 392 382 265 369 368 395 399 474 462 380 403 492 524 423 427 419 554 426 384
3485 384 429 501 447 407 418 409 501 566 411 505 441 450 499 561 428 501 486 548 629 503 474 505 516 623 606 536 498 586 665 547 645 548 581
3175 581 623 632 640 572 641 517 478 573 675 648 713 739 580 582 721 673 646 596 706 639 762 721 773 779 730 757 861 865 890 819 746 839 838 711
2856 711 858 777 801 827 880 876 837 884 852 807 864 899 908 783 745 446 808 1301 1189 1114 1181 1161 1169 1062 1114 1102 1206 1170 1286 1231 1196 1336
2556 1336 1517 1372 1309 1325 1326 1488 1521 1472 1541 1642 1545 1582 1730 1758 1652 1797 1874 1871 1934 1962 2048 2434 2387 2132 2233 2395 2397 2560 2715
2283 2715 2833 3000 3340 3654 3069 3235 3562 3910 4248 3763 4292 4797 5262 5793 6103 6478 7452 8497 9921 11650 14294 18360
2077 18360 25944 43478 101749 105911 44744 25132 11690 12988 11307 9506 7804 7344 7111 6345 6116 5817 5244
1917 5244 4846 4885 4308 3779 3386 3023 2892 3579 3133 2933 2794 2594 2488 2352 2130 2080 1972 2107 2118 1971 1918 1800 1749 1727 1498
1682 1498 1521 1571 1574 1388 1439 1424 1458 1284 1195 1244 1317 1351 1340 1398 1595 1812 2091 2648 3540 5794 9731 20974 11507 5493 3906
1448 3906 3055 2578 2235 2061 1919 1824 1698 1549 1420 1539 1291 1120 1219 1255 1176 1225 1127 1118 1014 1189 1022 1008 957 1063 860 969
1203 969 886 927 801 944 849 807 867 771 877 829 790 784 776 792 740 803 818 680 706 716 660 726 717 701 737 741 731 707 748 676 541 533 669 649
884 649 651 660 650 524 623 637 550 561 450 642 638 489 571 554 547 527 565 529 459 573 548 599 580 621 545 601 588 561 487 504 474 421 440 551
565 551 464 378 349 410 470 453 412 364 374 433 536 457 420 345 472 505 396 420 440 423 435 314 489 486 451 417 487 465 446 365 336 294 437
255 437 392 441 313 265 382 443 339 403 397 334 427 322 360 343 352 299 404 313 266 336 308 390 459 262 259 430 323 265 185 330 384 440
-45 440 259 258 224 205 399 277 285 347 390 311 253 338 258 299 345 373 396 307 359 314 242 315 407 291 363 345 341 371 305 116 215 228 197 227
-365 227 175 123 71
-393G1
##PAGE=	F1=-7861.3
##FIRST=	17614.246348710370512,	4405.4455391999963467,	0
##DATA TABLE=	(F2++(Y..Y)), PROFILE
4405 29 60 187 192 255 269 310 369 278 355 320 402 338 272 393 366 243 414 450 467 389 395 403 467 354 396 437 304 381 480 446 387 418 384 420
4086 420 440 430 386 406 399 370 418 373 450 364 486 355 384 368 580 448 429 433 472 471 342 404 448 433 395 411 351 474 471 401 471 472 468 508 434
3758 434 480 446 540 355 477 439 427 461 562 580 503 483 342 451 469 502 479 569 551 492 486 580 607 530 503 525 644 517 504 544 608 556
3457 556 503 528 504 606 672 530 638 554 562 624 689 532 614 583 649 733 616 565 629 618 751 739 666 604 703 777 672 784 686 708 764
3166 764 813 768 734 785 654 621 733 819 750 852 899 739 719 889 828 789 742 887 815 939 888 963 946 889 931 1094 1113 1049 912 879
2884 879 981 998 880 1007 937 967 1010 1057 1045 1026 1075 1041 972 1046 1085 1101 933 902 771 1185 1622 1456 1395 1450 1411 1427 1302 1366 1367 1470
2603 1470 1437 1529 1504 1487 1640 1817 1693 1601 1613 1634 1789 1863 1820 1877 1960 1897 1915 2069 2123 2038 2193 2275 2305 2376 2398 2531 2922 2887 2581 2730
2321 2730 2949 2927 3093 3278 3460 3662 4024 4390 3719 3874 4274 4663 4873 4625 5308 5881 6412 7085 7486 7874 9111 10373 12059
2105 12059 14174 17396 22309 31498 52733 123799 129150 54494 30778 15609 15800 13814 11631 9732 9392 8445 7658
1945 7658 7373 6879 6359 5957 5986 5213 4528 4040 3607 3421 4234 3703 3444 3276 3053 2915 2761 2526 2437 2264 2478 2466 2273 2198
1720 2198 2050 1952 1894 1667 1759 1763 1700 1506 1552 1478 1502 1278 1181 1143 1158 1160 1078 1058 1187 1321 1514 1994 2773 4951 8809 20031 11468
1466 11468 5748 4241 3417 2931 2607 2437 2257 2149 2025 1869 1717 1851 1608 1397 1501 1553 1495 1537 1360 1403 1255 1429 1253
1250 1253 1232 1187 1296 1090 1170 1107 1156 1032 1127 1054 1010 1058 968 1070 1048 961 950 969 968 909 963 977 842 888 912 826 907 892 877 897 902 883 853
941 853 891 822 692 682 829 793 783 809 796 660 745 720 661 676 568 774 797 659 708 691 715 660 693 653 584 683 680 722 724 757 674 727 726 684
621 684 606 616 590 519 553 669 586 498 457 524 569 534 477 490 503 536 650 555 531 440 578 594 496 514 557 502 517 391 543 575 518 501 581
311 581 553 542 438 434 376 533 499 521 397 355 476 532 427 494 481 421 519 403 460 428 455 376 491 380 326 433 386 475 548 363 365
20 365 499 408 374 281 399 434 547 362 334 306 272 477 366 360 401 482 386 317 406 342 378 400 451 476 383 433 360 314 385 475 358 430 421
-290 421 404 441 390 193 279 292 226 286 209 161 115
-393A15
##PAGE=	F1=-7932.06
##FIRST=	17614.246348710370512,	4405.4455391999963467,	0
##DATA TABLE=	(F2++(Y..Y)), PROFILE
4405 65 80 182 219 294 294 333 378 300 398 343 445 364 317 436 414 297 439 506 509 433 425 447 507 387 444 489 336 405 533 482 437 451 435
4096 435 487 477 497 422 461 427 409 463 402 497 403 500 410 426 402 607 483 441 464 502 513 385 473 493 470 443 460 417 517 521 452 493 493 518
3776 518 526 532 521 503 588 419 489 482 483 524 615 628 562 541 382 506 526 566 520 614 591 553 528 630 636 590 538 591 686 562 580 618 669 620 559
3448 559 585 561 661 718 600 722 619 633 702 760 594 677 640 701 777 672 613 702 679 822 807 738 664 765 827 740 855 765 770 837 932
3157 932 833 835 869 743 716 846 891 794 915 980 835 797 985 922 874 824 989 924 1047 971 1075 1046 980 1031 1231 1275 1117 928 942 1039
2875 1039 1069 971 1068 1014 1039 1105 1142 1124 1132 1181 1138 1052 1141 1187 1213 1024 1009 1069 1479 1812 1590 1548 1591 1533 1568 1430 1496 1516 1613 1581 1647 1647 1651
2565 1651 1808 1965 1866 1759 1766 1804 1932 2040 2009 2053 2120 2079 2097 2235 2305 2250 2405 2480 2537 2616 2626 2808 3182 3152 2815 2999 3255 3210 3377
2293 3377 3570 3799 4021 4379 4765 4054 4184 4620 5012 5080 5150 5900 6485 7035 7797 8269 8632 10027 11397 13213 15546 19083
2086 19083 24435 34460 57649 135650 141802 59736 33788 18302 17555 15327 12888 10960 10680 9079 8346 8028 7388
1926 7388 7010 6637 6682 5758 4949 4401 3923 3712 4578 4001 3713 3524 3290 3140 2972 2745 2626 2405 2673 2641 2423 2332 2167 2043
1701 2043 1964 1777 1924 1861 1737 1564 1600 1473 1494 1233 1138 1031 998 950 795 698 703 677 803 1302 2096 4214 8136 19443 11325
1466 11325 5857 4428 3634 3150 2833 2674 2440 2336 2208 2049 1870 2021 1773 1574 1673 1718 1696 1748 1481 1565 1390 1563 1382 1348
1241 1348 1325 1421 1223 1268 1225 1287 1173 1225 1162 1134 1160 1080 1177 1176 1056 1029 1078 1065 1001 1045 1050 916 984 1024 916 1007 987 982 985 986 967 928 949 890
922 890 774 774 931 886 860 890 875 745 816 744 712 733 638 832 887 766 782 765 828 731 765 714 655 727 750 776 806 833 748 801 800 747 662 676
602 676 644 567 605 722 654 562 533 592 611 560 514 578 596 609 717 612 594 500 640 640 550 563 632 546 560 442 559 620 542 539 620 595 587 463
283 463 491 421 584 564 557 444 414 523 574 476 543 511 469 567 443 520 467 520 417 537 407 357 488 431 528 581 430 445 537 446 440 363
-17 363 460 442 601 430 380 362 323 521 421 412 417 535 437 353 444 395 431 427 497 518 422 476 375 348 431 513 389 458 456 435 470 431 248
-327 248 321 329 239 320 224 187 146
-393A46
##PAGE=	F1=-8002.83
##FIRST=	17614.246348710370512,	4405.4455391999963467,	0
##DATA TABLE=	(F2++(Y..Y)), PROFILE
4405 94 91 160 224 303 293 323 350 283 400 336 440 349 336 432 424 319 425 512 505 435 415 450 498 380 443 499 334 384 530 472 438 433 442 517
4086 517 466 513 416 460 414 410 463 392 506 405 466 420 427 397 583 470 419 457 483 500 388 490 488 458 445 464 436 512 512 457 471 461 518 490
3767 490 570 510 509 580 432 457 478 493 539 607 609 555 541 374 510 526 568 511 590 569 541 515 624 597 588 520 595 665 551 592 628 663 624 560
3448 560 576 566 650 689 602 729 619 642 711 760 591 672 637 690 751 658 605 704 679 819 795 732 659 751 797 732 843 767 746 821 956 817
3147 817 851 870 763 738 878 870 764 886 962 850 794 981 932 876 823 984 939 1054 952 1074 1050 975 1029 1238 1299 1066 855 916 997
2875 997 1034 960 1021 985 998 1086 1110 1090 1130 1180 1120 1023 1123 1176 1214 1031 1039 1273 1621 1817 1550 1531 1564 1489 1548 1412 1466 1503 1594 1559 1603 1620
2574 1620 1646 1796 1917 1846 1737 1741 1791 1874 2004 1992 2018 2075 2045 2074 2180 2255 2234 2377 2433 2503 2586 2581 2798 3135 3110 2770 2968 3232 3166 3328
2293 3328 3509 3762 3982 4304 4675 3983 4077 4502 4857 4803 5211 5914 6447 6966 7742 8243 8547 9960 11296 13070 15397 18904
2086 18904 24167 34036 56910 134156 140527 59100 33405 19084 17763 15442 12942 11164 10860 8825 8218 7897 7193
1926 7193 7023 6703 6789 5801 4933 4372 3884 3680 4514 3945 3664 3468 3241 3105 2932 2733 2590 2353 2639 2596 2379 2284 2120 1995
1701 1995 1918 1793 1967 1838 1675 1551 1574 1412 1441 1179 1098 972 938 853 673 602 484 126 466 1062 1981 3923 7842 18993
1476 18993 10879 5644 4305 3565 3106 2809 2663 2384 2294 2175 2021 1816 1981 1731 1584 1681 1700 1710 1790 1444 1547 1368 1540
1260 1540 1372 1319 1322 1400 1226 1228 1203 1277 1185 1202 1143 1139 1140 1072 1162 1181 1040 999 1072 1049 988 1021 1018 881 967 1023 903 998 972 984 968 966 954 908 905
931 905 859 762 778 941 896 859 881 865 755 812 694 692 717 646 798 888 792 771 759 858 723 762 695 656 686 736 743 802 828 743 804 796 737 641
612 641 671 628 555 581 695 656 555 552 594 583 515 518 611 631 623 718 612 598 510 638 627 543 555 640 536 549 447 529 613 513 522 591 574 572
293 572 430 494 414 579 573 539 447 427 512 559 472 539 479 463 558 436 521 452 526 408 531 382 351 489 430 530 552 447 479 532 432
2 432 448 409 492 404 588 447 383 378 336 521 431 421 385 533 452 351 438 402 442 412 499 513 412 479 355 341 432 512 374 438 439 427 451
-308 451 418 270 328 325 227 323 213 195 160
-393A60
##PAGE=	F1=-8073.59
##FIRST=	17614.246348710370512,	4405.4455391999963467,	0
##DATA TABLE=	(F2++(Y..Y)), PROFILE
4405 115 93 122 207 278 265 282 293 231 359 298 393 300 324 381 395 307 372 466 455 396 366 410 440 338 394 466 302 321 470 422 392 367 402
4096 402 502 412 474 373 407 358 374 417 345 474 375 391 386 387 351 510 416 365 416 426 438 353 453 434 400 402 424 408 462 447 418 408 385 470
3776 470 410 543 450 463 521 392 383 429 461 507 543 532 487 483 322 461 469 509 457 502 491 461 446 560 497 524 449 534 585 485 538 571 588
3466 588 567 507 507 520 579 593 538 656 551 586 646 690 522 601 572 620 661 581 540 637 620 744 712 649 590 661 696 648 755 699 645 718 882
3157 882 723 779 786 713 684 823 762 663 770 849 787 715 880 856 794 743 871 859 960 843 960 958 878 928 1119 1179 909 707 808 867
2875 867 900 854 878 859 856 959 967 949 1018 1073 997 892 995 1052 1105 949 982 1340 1588 1641 1349 1352 1378 1290 1371 1255 1289 1330 1417 1379 1406 1430
2574 1430 1473 1611 1685 1643 1541 1545 1600 1631 1765 1776 1782 1836 1804 1852 1917 1983 1995 2115 2148 2210 2297 2274 2502 2788 2771 2455 2647 2890 2807 2959
2293 2959 3113 3360 3560 3820 4145 3526 3579 3951 4237 4106 4797 5352 5781 6222 6939 7421 7640 8935 10102 11667 13766 16909
2086 16909 21576 30340 50711 119717 125682 52767 29760 17798 16364 14136 11771 10291 9902 7737 7304 7005 6328
1926 6328 6387 6135 6275 5329 4481 3958 3497 3330 4052 3541 3303 3114 2914 2817 2651 2489 2332 2109 2380 2335 2146 2059 1913 1812
1701 1812 1755 1690 1864 1689 1515 1457 1472 1296 1338 1113 1055 965 972 899 764 804 755 634 981 1472 2422 4158 7895 18565 10211
1466 10211 5158 3890 3225 2805 2545 2416 2105 2030 1937 1802 1575 1741 1500 1427 1525 1512 1538 1659 1269 1356 1197 1359 1230 1159 1180
1232 1180 1240 1108 1063 1047 1131 1071 1061 1008 1023 1007 947 1027 1069 914 869 956 922 878 896 893 751 844 910 792 885 853 884 847 848 846 799 772 736 663
912 663 691 855 817 779 788 771 692 736 577 606 633 597 679 801 739 682 676 804 642 687 601 590 567 643 630 712 745 657 732 720 664 551 601
602 601 556 494 490 597 599 486 510 537 490 410 494 583 603 572 652 555 543 470 574 559 482 497 581 470 487 405 453 560 441 461 504 489 501
293 501 350 445 352 523 529 471 411 393 449 494 416 485 396 403 497 387 466 387 471 349 478 310 309 441 385 481 471 412 462 486 371 398 410
-17 410 484 331 513 413 344 353 306 477 398 385 312 473 426 313 388 362 406 353 455 466 354 444 304 300 385 475 320 375 375 379 392 359
-318 359 256 299 283 193 296 179 184 158
-393A58
##PAGE=	F1=-8144.36
##FIRST=	17614.246348710370512,	4405.4455391999963467,	0
##DATA TABLE=	(F2++(Y..Y)), PROFILE
4405 127 89 76 172 229 217 216 222 160 281 234 316 230 290 298 334 268 291 378 371 330 295 337 347 273 313 398 256 237 371 346 314 270 324 443 333
4077 333 389 308 320 272 316 340 271 408 326 289 320 316 277 401 333 289 350 351 346 291 377 346 311 329 353 350 385 348 353 317 290 391 310 463 363
3748 363 379 432 313 286 345 397 442 446 424 385 385 244 369 372 406 381 377 377 334 338 457 362 415 348 420 465 381 433 465 459 463 415 395 435 477 451 432
3401 432 521 434 482 522 574 408 483 460 507 532 463 436 520 517 618 585 519 475 517 552 506 616 584 501 551 731 573 642 639 609 574 699 599
3091 599 519 596 670 666 586 713 719 651 606 682 708 792 677 765 799 717 761 913 957 694 520 645 683 707 686 676 669 649 760 750 737 825 890
2781 890 807 694 787 842 911 796 848 1269 1415 1349 1051 1065 1092 991 1085 1004 1021 1044 1130 1093 1109 1126 1182 1305 1330 1316 1230 1232 1289 1269 1385
2490 1385 1421 1410 1469 1427 1491 1519 1564 1601 1694 1706 1739 1829 1785 2000 2227 2226 1955 2121 2324 2231 2364 2486 2698 2874 3057 3324 2809 2821 3115
2218 3115 3318 3156 4021 4371 4667 5005 5604 6033 6151 7230 8142 9382 11089 13635 17360 24358 40703 96170 101217
2039 101217 42419 23831 14848 13737 11794 9695 8591 8112 6097 5841 5585 5000 5255 5076 5269 4464 3713 3269 2861
1861 2861 2748 3308 2886 2716 2547 2388 2342 2198 2077 1913 1729 1954 1914 1773 1708 1585 1526 1500 1470 1626 1438 1272 1283 1301 1123 1181
1617 1181 1010 975 945 991 966 874 977 1015 1018 1422 1909 2867 4531 7991 17971 9481 4572 3328 2744 2355 2139 2040 1707 1633
1391 1633 1579 1472 1232 1377 1156 1157 1260 1221 1234 1404 1026 1053 930 1073 1001 923 943 990 916 829 805 891 870 846 805 826 806 746 810 880
1110 880 717 678 769 720 707 705 715 565 653 720 619 703 664 715 659 665 676 631 588 555 506 536 698 668 642 640 617 577 615 425 477 505 511 509 649
781 649 628 548 538 688 517 568 463 486 402 497 463 561 606 509 603 595 555 422 488 451 410 359 456 503 379 420 443 362 273 449 507 529 474
471 474 536 459 449 398 467 456 387 409 479 369 390 331 346 478 346 377 395 360 393 244 358 252 431 451 373 353 326 353 403 328 399 290
171 290 306 400 315 377 294 375 256 395 215 240 359 313 394 365 336 402 409 287 306 372 438 250 396 342 276 298 247 403 339 322 221
-121 221 369 367 256 304 285 335 265 377 393 262 384 235 246 304 413 250 288 282 306 311 276 216 241 219 140 250 135 159 142
-393A42
##PAGE=	F1=-8215.12
##FIRST=	17614.246348710370512,	4405.4455391999963467,	0
##DATA TABLE=	(F2++(Y..Y)), PROFILE
4405 129 80 30 126 169 164 140 155 97 184 157 225 155 245 206 256 221 208 266 272 253 222 253 240 202 221 311 212 161 255 267 230 169 227 353 259
4077 259 277 238 232 171 251 252 191 323 281 183 242 233 195 276 242 212 271 281 247 226 287 251 212 246 271 283 303 242 290 216 205 301 221 357 278
3748 278 279 341 227 196 242 319 369 354 317 290 281 172 263 262 289 310 266 262 203 217 344 232 286 250 280 336 266 306 343 309 337 308 272 332 383
3419 383 303 318 367 293 361 368 443 279 349 330 379 395 338 317 389 397 473 454 384 347 356 409 337 461 456 374 362 550 404 478 468 483 447 545 433
3091 433 370 405 467 516 450 532 561 495 454 468 528 596 505 544 618 542 583 689 711 488 337 469 495 505 506 470 472 432 546 514 512 597 678 608
2772 608 484 554 599 678 608 672 1100 1181 1038 753 752 797 676 769 729 746 724 813 781 798 788 854 966 945 958 893 889 948 896 966 1023 1004 1072
2462 1072 1018 1091 1095 1110 1162 1232 1234 1217 1313 1246 1429 1596 1622 1404 1531 1689 1595 1700 1798 1949 2112 2215 2436 2030 2003 2218 2343 2169
2199 2169 3095 3252 3412 3646 4092 4468 4482 5305 5951 6833 8081 9963 12647 17682 29542 69741 73596 30770 17168
2020 17168 11070 10571 9120 7295 6555 6049 4331 4217 4008 3529 3909 3801 4032 3433 2827 2486 2139 2086 2472 2146 2050 1910
1814 1910 1791 1794 1692 1604 1442 1304 1471 1438 1341 1312 1207 1194 1204 1175 1311 1143 988 1056 1097 912 986 861 845 864 929 965 899 1004 1103
1541 1103 1172 1599 2107 3041 4704 7876 17114 8816 4070 2817 2298 1916 1734 1687 1343 1243 1232 1149 918 1007 808 861 970
1326 970 932 898 1109 806 743 653 760 751 695 685 719 716 606 554 628 644 618 600 610 608 531 577 675 511 482 573 501 532 504 537 384 455 511
1016 511 436 507 463 529 458 467 494 452 413 364 343 352 511 487 485 481 445 444 487 283 337 366 417 343 470 495 416 383 552 388 444 328 385 234
696 234 340 287 384 452 338 443 449 443 287 362 339 334 229 307 395 273 309 346 240 138 394 410 440 360 404 351 342 321 349 350 293 314 376
387 376 269 283 255 229 389 253 300 312 223 275 153 254 139 321 365 268 295 253 248 314 236 309 203 198 294 245 286 204 275 152 305
95 305 132 160 264 238 296 273 236 321 325 211 195 313 367 194 266 261 198 230 179 318 277 259 151 246 291 201 214 196 248 171 282 316 157
-214 157 316 159 199 209 344 195 200 186 227 232 197 164 177 160 79 194 95 124 117
-393A17
##PAGE=	F1=-8285.89
##FIRST=	17614.246348710370512,	4405.4455391999963467,	0
##DATA TABLE=	(F2++(Y..Y)), PROFILE
4405 122 68 17 78 118 121 67 104 79 88 84 136 88 204 135 176 184 157 158 179 178 168 188 148 138 140 226 181 127 152 208 171 97 141 250 220 160 175
4058 175 175 76 193 182 134 235 254 100 180 162 131 160 156 152 193 231 165 184 206 180 127 173 193 231 236 156 249 127 159 224 174 258 223 191 272
3729 272 171 146 141 243 305 296 238 241 207 143 181 175 186 260 224 190 142 110 254 172 161 194 153 227 172 195 243 188 219 216 174 228 322 192 233
3401 233 257 159 260 220 326 176 233 215 262 278 244 210 277 294 344 353 298 241 227 308 182 323 345 320 200 391 261 329 318 366 351
3110 351 416 320 259 240 294 366 342 395 429 384 340 306 363 424 372 359 458 402 452 524 530 347 204 327 358 354 369 324 334 264 379 323 341 387
2790 387 489 460 330 359 392 459 436 499 901 973 803 553 502 582 434 514 500 550 463 550 529 565 508 581 684 637 663 627 614 672 633
2499 633 625 684 675 744 699 759 762 751 807 856 868 798 897 807 950 1053 1120 955 1029 1162 1066 1136 1231 1301 1472 1505 1717 1408 1336 1491 1572 1352
2199 1352 2277 2313 2362 2520 2799 3164 3090 3672 4127 4710 5547 6880 8704 12095 20188 47413 50088 20855 11482 7494
2011 7494 7619 6917 5269 4789 4358 2902 2871 2696 2280 2682 2641 2878 2499 2046 1815 1521 1517 1761 1508 1464 1365 1275 1302 1260 1200 1050
1767 1050 942 1058 1030 953 974 866 890 939 887 1003 882 724 824 912 712 805 701 700 740 802 895 862 926 1054 1167 1560 2091 2973
1504 2973 4648 7579 16198 8305 3756 2505 2017 1630 1455 1463 1142 989 1013 942 755 751 575 635 748 741 651 860 675 551
1279 551 458 514 542 551 488 502 564 472 388 421 456 442 448 442 477 377 407 512 370 337 425 331 404 356 410 269 319 349 298 351 316 388 311 308 355
950 355 310 301 220 227 190 337 318 345 356 298 325 384 200 215 249 334 244 311 373 329 251 438 296 348 246 330 133 222 171 218 321 191
649 191 281 310 346 176 256 241 277 153 186 301 204 217 269 176 34 340 326 372 273 294 258 247 265 253 266 232 235 313 217 192 210 128 313
340 313 186 252 288 144 184 124 157 60 211 291 181 252 205 161 250 178 236 165 114 202 195 224 153 221 74 225 106 85 179 182 217 232 135
30 135 243 254 173 92 255 296 177 153 196 136 167 130 240 230 223 145 130 214 167 151 135 166 106 190 255 61 260 86 171 122 278 175
-271 175 139 115 161 177 151 123 142 136 29 139 73 88 87
-393H7
##PAGE=	F1=-8356.65
##FIRST=	17614.246348710370512,	4405.4455391999963467,	0
##DATA TABLE=	(F2++(Y..Y)), PROFILE
4405 106 58 44 36 89 101 41 67 93 27 34 63 33 178 115 106 159 153 87 111 113 138 167 96 89 85 158 156 126 88 182 145 82 100 161 221 65 120 154
4049 154 16 145 148 122 160 241 79 148 123 109 81 85 121 121 197 109 171 147 151 78 119 130 202 186 105 225 69 142 174 169 194 200 129 226 161
3720 161 142 69 179 256 271 191 231 175 154 163 138 120 223 236 174 175 45 206 193 61 180 110 158 132 134 186 156 140 164 135 134 288 158
3410 158 196 241 70 205 127 239 132 163 146 179 198 203 137 205 226 254 295 278 181 173 258 115 218 263 323 133 297 190 227 224 277 309
3110 309 349 292 205 149 200 234 268 330 351 340 300 273 246 313 289 254 343 314 384 451 460 271 149 249 297 282 297 269 290 198 290 230 281 248
2790 248 366 387 275 257 295 302 332 376 744 841 673 480 371 477 318 389 362 462 341 394 387 452 359 431 518 474 487 483 475 513 534 467
2490 467 484 498 546 547 561 587 573 630 648 686 597 685 586 690 723 827 718 733 872 763 800 916 907 1080 1067 1299 1084 964 1080 1163
2208 1163 859 1760 1778 1765 1896 2019 2418 2310 2698 3083 3502 4080 5085 6428 8880 14758 34336 36113 14931 8053
2020 8053 5024 5380 5638 4118 3747 3448 2113 2117 1964 1557 1854 1876 2075 1871 1525 1391 1142 1161 1331 1117 1075 1032 949 962 984
1786 984 951 833 721 810 791 695 773 645 680 769 704 780 720 547 640 790 586 694 592 600 634 679 806 831 847 972 1127 1440 1989
1513 1989 2815 4498 7279 15493 7967 3599 2379 1889 1515 1326 1349 1090 893 922 866 732 655 494 531 634 667 574 705
1297 705 608 522 394 402 398 496 406 378 469 427 353 321 345 353 354 350 420 316 347 425 332 268 343 255 336 295 347 232 275 285 238 267 258 326 264 223
959 223 287 235 261 161 185 121 212 201 246 282 214 241 316 187 128 177 262 228 218 281 290 174 369 259 285 225 321 159 176 179 94 239 131
649 131 145 198 259 102 192 163 225 148 113 228 171 179 210 171 30 302 277 341 243 242 201 177 237 197 214 208 177 298 218 133 200 73 260
340 260 155 225 299 173 152 147 86 91 115 230 119 225 199 108 212 171 189 155 92 135 163 191 144 227 82 162 116 31 114 149 173 231 52
30 52 183 209 166 32 217 258 182 78 156 114 122 112 177 201 212 169 55 152 152 136 134 109 97 117 214 21 221 24 153 58 220 168 113
-280 113 86 117 144 132 100 146 144 42 89 69 58 56
-393E6
##PAGE=	F1=-8427.42
##FIRST=	17614.246348710370512,	4405.4455391999963467,	0
##DATA TABLE=	(F2++(Y..Y)), PROFILE
4405 82 50 59 8 80 95 76 35 96 49 37 30 12 163 126 56 135 163 86 80 58 112 176 89 57 51 116 126 119 68 180 135 87 108 116 236 70
4067 70 73 136 53 103 142 137 105 228 107 140 117 117 76 37 110 62 169 75 169 112 145 74 80 78 184 149 77 196 66 120 147 170 168 189 90
3739 90 189 162 141 68 134 216 249 161 220 155 160 190 140 100 182 238 175 210 48 183 218 22 170 153 123 139 134 151 179 114 153 143 54 252
3419 252 169 181 271 86 179 130 180 126 139 127 143 147 198 113 160 188 198 259 281 170 179 225 168 136 199 317 156 260 187 172 186 209 291
3110 291 327 304 183 147 190 134 204 302 315 326 310 331 175 268 235 217 262 253 339 423 453 256 149 219 275 253 259 258 292 202 249 201 293 204
2790 204 313 362 281 231 303 231 305 318 664 766 603 460 325 425 276 362 291 423 338 314 325 401 318 379 444 419 399 409 434 433 502
2499 502 449 417 440 447 507 470 513 518 594 564 624 556 626 535 619 599 699 649 623 780 645 665 799 764 888 863 1084 964 827 898 1006
2208 1006 677 1519 1563 1535 1672 1696 2110 2037 2298 2663 3034 3520 4359 5529 7643 12613 29251 30562 12561 6678 3895
2011 3895 3848 4952 3668 3324 3095 1804 1842 1705 1331 1468 1532 1665 1550 1252 1176 976 987 1139 956 872 879 800 775 834 834 761 618
1757 618 700 698 575 692 560 579 690 650 660 648 476 522 722 548 658 558 569 587 620 735 828 830 936 1132 1358 1909 2678 4351
1495 4351 7048 14982 7706 3487 2310 1806 1465 1271 1261 1062 857 860 834 727 633 467 509 589 639 597 631 546 541 399 395 302 468
1241 468 400 325 400 400 369 294 293 326 282 296 378 297 333 392 338 248 292 237 290 277 317 218 259 282 228 229 243 315 275 193 261 206 250 149 168 148
903 148 156 157 181 240 188 196 271 194 72 142 190 220 191 218 265 144 327 255 231 212 317 207 168 228 57 197 154 77 130 174 48 162
602 162 120 162 150 81 170 141 181 151 167 52 284 254 329 249 246 185 122 222 174 178 194 130 298 233 102 194 73 229 151 194 300 221
302 221 168 168 61 134 52 172 72 198 212 99 179 181 166 135 110 88 138 161 140 243 118 114 110 24 75 125 151 228 29 143 182 158 54
-8 54 198 261 191 51 126 119 97 108 131 178 203 178 53 116 140 142 160 90 112 71 182 64 192 30 131 38 166 147 105 83 86 115 109 85
-327 85 154 152 69 46 64 39 31
-393C1
##PAGE=	F1=-8498.19
##FIRST=	17614.246348710370512,	4405.4455391999963467,	0
##DATA TABLE=	(F2++(Y..Y)), PROFILE
4405 58 47 63 17 74 88 105 5 81 61 50 49 45 150 134 37 109 162 112 77 20 75 183 94 40 25 97 87 92 55 179 125 73 120 121 245
4077 245 126 66 98 73 67 140 149 66 206 127 133 123 129 108 36 103 24 143 65 156 101 142 101 46 37 159 125 64 152 87 80 129 157 159 180 57
3739 57 143 147 121 92 111 182 217 134 194 129 140 213 151 110 129 204 159 207 59 161 211 58 138 184 98 147 151 110 186 112 157 150 14 198
3419 198 173 160 284 129 151 163 142 116 134 120 143 108 197 125 124 157 154 223 270 180 190 185 229 63 140 274 172 237 195 139 169 143 257
3110 257 304 309 158 170 196 102 128 264 290 299 320 400 133 262 192 204 196 190 283 391 448 340 166 195 244 216 215 229 282 201 217 161 297
2800 297 200 289 345 284 210 323 220 307 301 649 715 543 430 298 378 226 344 237 376 355 245 277 341 288 338 396 379 335 331 401
2518 401 363 439 432 394 404 374 473 402 449 460 579 501 572 525 586 505 577 543 603 603 563 730 578 583 722 712 756 743 897 860 746 749 872
2208 872 600 1359 1408 1372 1521 1504 1887 1869 2064 2370 2720 3180 3886 4949 6863 11250 26184 27300 11197 5919 3402
2011 3402 2701 4232 3323 3034 2809 1564 1650 1526 1225 1266 1348 1430 1350 1082 1015 874 862 1008 866 745 770 706 658 715 747 721 547
1757 547 621 635 506 639 529 528 638 647 588 605 453 443 663 540 644 553 564 574 610 677 819 843 937 1158 1339 1867 2566 4203
1495 4203 6819 14444 7419 3345 2213 1700 1393 1223 1170 993 818 768 779 678 606 417 494 554 600 606 602 469 523 397 413 236
1250 236 427 407 305 337 353 367 277 258 319 211 239 315 262 296 372 332 244 241 220 235 251 292 200 216 269 224 199 211 304 284 180 234 188
941 188 243 126 130 166 151 160 132 200 174 178 242 201 48 118 118 179 174 175 229 123 288 257 174 173 287 225 152 250 88 167 172 98 122 98 15 139
602 139 121 89 123 60 123 94 183 93 135 63 275 227 310 250 263 194 67 204 168 141 173 81 283 235 92 171 77 210 162 146 276 240
302 240 189 176 73 154 56 114 31 162 220 120 138 182 161 106 121 46 121 115 119 234 134 86 80 34 56 98 130 201 54 118 160 136 69 181
-17 181 279 208 63 89 125 81 101 95 153 185 167 65 104 124 139 176 103 120 41 151 85 165 65 103 64 115 107 95 93 55 85 66 65 140 143 80
-355 80 23 52 33 28
-393B8
##PAGE=	F1=-8568.95
##FIRST=	17614.246348710370512,	4405.4455391999963467,	0
##DATA TABLE=	(F2++(Y..Y)), PROFILE
4405 45 47 56 22 65 78 117 26 56 47 46 61 66 135 130 47 90 149 133 86 40 29 177 107 36 4 91 40 56 33 166 113 40 115 136 242 165 106
4058 106 43 72 49 131 150 36 171 126 124 122 135 134 56 94 42 123 86 127 109 139 141 26 48 122 118 84 104 101 35 111 128 146 174 43 88 114
3720 114 84 97 106 164 181 115 162 114 95 216 164 131 71 147 125 174 58 132 177 79 84 181 73 140 160 57 159 101 154 140 62 132 156
3410 156 127 265 151 113 178 127 90 131 101 154 76 188 145 102 123 116 178 237 190 193 142 271 17 88 205 161 208 190 117 155 81 197
3110 197 254 290 124 183 187 138 43 206 259 254 306 452 113 272 171 204 156 136 218 350 436 487 194 158 192 158 159 168 250 178 199 93
2809 93 265 180 257 325 272 169 312 221 300 292 667 691 494 389 275 352 169 302 188 313 361 183 230 268 238 277 350 322 282 237
2527 237 346 291 333 366 364 357 297 417 331 379 365 535 429 502 463 528 456 505 489 488 530 495 651 514 488 621 663 632 645 698 716 660 582
2218 582 694 509 1178 1219 1160 1315 1287 1609 1640 1821 2016 2343 2766 3341 4269 5928 9671 22612 23619 9701 5125 3003
2011 3003 1885 3264 2826 2648 2448 1260 1393 1276 1059 1058 1144 1195 1138 928 837 759 723 850 757 634 641 597 553 581 636 663 470
1757 470 528 544 427 561 487 476 572 629 516 553 423 374 584 509 612 534 547 552 603 616 775 832 927 1153 1336 1838 2451 4033 6560
1485 6560 13816 7114 3177 2100 1583 1290 1168 1113 900 783 676 699 601 565 371 457 512 551 571 591 402 465 372 418 214 375
1241 375 408 316 292 305 350 271 226 318 175 192 246 211 229 341 306 247 200 203 174 206 271 197 145 226 216 171 155 275 277 171 203 167 246 104
922 104 75 149 159 171 92 159 147 168 233 217 78 100 85 113 135 150 182 96 242 256 137 123 229 217 121 244 112 139 167 123 149 83
621 83 59 109 142 43 73 35 99 33 165 74 88 88 260 179 270 228 265 211 32 173 168 103 149 28 244 220 99 128 64 190 172 88 233
311 233 227 192 173 94 157 76 82 45 120 213 147 95 171 169 97 121 4 119 61 85 200 128 90 51 27 49 71 107 155 64 108 137 108 65 155
-17 155 285 234 101 42 118 68 94 67 128 162 149 60 100 108 127 176 127 124 19 125 88 139 83 76 99 75 77 82 115 23 70 9 37 99 114 73
-355 73 39 35 32 40
-393D0
##PAGE=	F1=-8639.72
##FIRST=	17614.246348710370512,	4405.4455391999963467,	0
##DATA TABLE=	(F2++(Y..Y)), PROFILE
4405 46 46 44 18 52 72 118 53 30 19 25 56 69 121 120 62 83 137 150 98 68 31 163 137 42 35 87 15 47 37 141 105 12 97 137 225 178 148
4058 148 30 64 57 119 143 29 128 103 117 113 136 153 70 85 67 114 119 86 118 136 182 40 87 74 121 120 80 101 41 93 91 125 170 70 28
3729 28 69 46 83 107 163 155 102 144 132 40 196 178 151 20 96 89 133 52 108 140 90 24 147 52 117 154 35 108 77 139 115 93 69 127
3410 127 89 224 150 81 166 127 63 128 71 162 60 175 160 112 92 96 133 185 184 191 113 293 70 57 138 137 178 176 114 145 62 129 178 248 90
3081 90 182 164 176 39 139 224 208 263 477 119 286 178 221 157 119 172 315 418 616 221 113 139 99 120 89 207 145 211 71
2809 71 203 137 205 298 250 133 271 215 278 279 691 702 471 348 260 364 161 242 164 257 356 182 200 214 191 211 320 266 255 170 280
2518 280 252 227 264 323 310 231 357 273 330 260 465 368 434 399 471 419 429 455 385 451 437 559 474 405 518 615 548 587 555 575 599 465
2218 465 522 417 1013 1052 964 1100 1094 1343 1406 1623 1704 2010 2384 2876 3674 5097 8319 19508 20491 8463 4506 2743 1740
2002 1740 2248 2286 2243 2129 988 1147 1036 882 873 941 973 922 799 668 648 598 699 639 552 517 488 469 457 510 598 412 447 449 342
1729 342 462 431 415 499 591 444 499 386 315 499 455 563 497 518 512 583 556 707 789 891 1109 1316 1808 2344 3859 6312 13230
1476 13230 6863 3023 2013 1492 1182 1114 1109 823 767 637 622 542 525 368 408 474 512 511 585 365 397 330 397 237 325 398 348 274
1213 274 283 339 289 203 315 199 191 212 166 171 300 277 249 194 203 137 156 260 224 85 163 203 152 108 232 258 165 190 143 255 121 53 105
903 105 159 175 78 127 111 153 236 237 124 96 123 65 76 142 140 70 199 255 148 116 158 194 87 224 129 118 152 125 172 128 98 78 150 73
584 73 47 10 106 26 133 111 73 120 231 114 210 186 242 219 77 128 170 72 134 30 184 191 113 76 40 160 170 51 179 193 171 159
283 159 111 154 75 102 91 77 191 162 70 159 176 119 116 33 132 62 52 161 115 109 70 9 43 49 93 103 60 110 113 93 50 122 272 255 149
-45 149 19 100 56 93 45 114 141 143 49 95 94 116 167 149 128 11 118 85 121 83 65 129 65 95 74 141 21 83 53 11 43 72 52 56 29
-374 29 30 46
-393D6
##PAGE=	F1=-8710.48
##FIRST=	17614.246348710370512,	4405.4455391999963467,	0
##DATA TABLE=	(F2++(Y..Y)), PROFILE
4405 47 43 28 14 38 73 114 74 16 38 8 44 54 115 108 75 78 130 161 108 84 74 153 176 51 65 79 45 73 69 107 99 50 71 123 197 164 172 81
4049 81 65 76 108 131 55 86 62 116 102 129 165 79 77 81 110 146 38 114 126 209 59 117 23 121 149 98 87 76 77 52 100 160 103 26 20 30
3711 30 60 102 167 149 82 139 159 35 158 189 165 13 82 66 116 47 99 133 99 40 96 46 86 132 75 48 45 113 80 103 40 99 55 176
3391 176 129 84 131 127 46 127 36 159 61 160 165 136 82 99 107 124 154 182 102 297 113 52 108 115 155 158 122 136 102 94 95 190 65 166 136 188
3053 188 99 80 186 180 196 463 132 289 187 236 174 131 157 285 384 671 231 78 118 79 135 18 165 116 236 144 122 80 135
2781 135 259 217 129 214 194 250 257 697 729 474 311 241 383 206 183 163 219 331 231 188 194 167 168 314 232 246 176 218 257 175 161 272
2480 272 269 186 305 243 306 192 382 327 374 350 427 401 376 449 330 389 413 475 457 359 439 567 516 551 509 480 566 450 409 346 912 954
2180 954 863 927 971 1160 1228 1495 1524 1808 2134 2618 3305 4589 7536 17666 18696 7774 4182 2653 2049 1559 1882 1947
1973 1947 1937 834 987 892 758 782 806 839 756 711 557 568 525 608 539 516 437 411 424 381 395 544 392 403 395 293 366 386 358 440 555
1682 555 389 459 361 280 431 406 516 462 494 468 564 512 647 736 840 1052 1278 1775 2271 3701 6097 12774 6685 2902 1960
1448 1960 1436 1087 1052 1123 773 750 645 560 514 482 365 386 457 495 459 578 348 345 284 343 266 275 367 369 264 283 335 314 194 300 236
1156 236 223 226 147 164 262 260 240 209 214 147 116 250 259 108 106 181 137 107 184 234 152 204 117 254 163 89 51 146 165 94 102 81 125 228 245 159
818 159 104 167 80 20 141 113 48 163 250 180 157 105 173 58 206 146 109 144 110 176 170 122 63 135 101 90 14 122 68 98 144 107 139
509 139 194 71 138 138 197 212 125 77 167 59 127 80 108 150 118 37 13 115 149 74 121 149 127 129 114 149 53 136 126 40 156 156 75 149 173
180 173 140 107 60 145 114 39 147 113 118 103 25 36 38 89 64 49 115 91 91 34 95 244 259 192 60 78 43 92 28 111 122 146 49 90 76
-149 76 112 155 157 131 16 127 91 113 68 70 147 76 133 72 157 43 98 101 26 38 37 29 61 39 24 42
-393D2
##PAGE=	F1=-8781.25
$$ [...]
-393E4
##END NTUPLES=	nD NMR SPECTRUM
##END=	
##END=	
