##TITLE=	IgziZHW6T0SSs5lXLUP9tg.11.ser
TM-VI-221 cosy

##JCAMP-DX=	6.0	$$ MestReNova 14.3.1-31739
##DATA TYPE=	LINK
##BLOCK_ID=	1
##BLOCKS=	2    
##ORIGIN=	Mestrelab Research S.L.
##OWNER=	hrzepa
##$MNOVA/LINK_BLOCK_TYPE=	ITEM	$$ NMR Spectrum
##$MNOVA/ITEM/POLYGON=	(XY..XY)
5321,5835
8722,5835
8722,8208
5321,8208
5321,5835
##$MNOVA/ITEM/Z=	0
##$MNOVA/ITEM/ANGLE=	0
##TITLE=	IgziZHW6T0SSs5lXLUP9tg.11.ser
##JCAMP-DX=	6.0	$$ MestReNova 14.3.1-31739
##BLOCK_ID=	2
##DATA TYPE=	MNOVA NMR VIEW DATA
##DATA CLASS=	MNOVA VIEW DATA
##$MNOVA/2D/THRESHOLD=	112.75579071044921875
##$MNOVA/ITEM/ZOOM/X=	-0.98135677571250334861,	11.004809999983093505
##$MNOVA/ITEM/ZOOM/Y=	-0.98135677571250334861,	11.004809999983093505
##END=	
##TITLE=	IgziZHW6T0SSs5lXLUP9tg.11.ser
##JCAMP-DX=	6.0	$$ MestReNova 14.3.1-31739
##BLOCK_ID=	3
##DATA TYPE=	nD NMR SPECTRUM
##DATA CLASS=	NTUPLES
##NUMDIM=	2
##ORIGIN=	Bruker BioSpin GmbH
##OWNER=	nmr
##.OBSERVE FREQUENCY=	400.32200160000002143
##.OBSERVE NUCLEUS=	^1H
##.SOLVENT NAME=	CDCl3
##.PULSE SEQUENCE=	cosygpqf
##LONGDATE=	2022/01/13 15:44:45.000
##.ACQUISITIONMODE=	SIMULTANEOUS (DQD)
##$ORIGINAL FORMAT=	Bruker XWIN-NMR
##$MNOVA/SCALES_VERSION=	9
##$PARAMETER FILE=	(acqu2s, ASCII, /private/var/folders/f6/rjf_tdyn2v98c5c0wvkgn4s80000gn/T/IgziZHW6T0SSs5lXLUP9tg/11/acqu2s, 0)
$$ ##TITLE= Parameter file, TOPSPIN		Version 3.2
$$ ##JCAMPDX= 5.0
$$ ##DATATYPE= Parameter Values
$$ ##NPOINTS= 129	$$ modification sequence number
$$ ##ORIGIN= Bruker BioSpin GmbH
$$ ##OWNER= nmr
$$ $$ 2022-01-13 15:54:17.602 +0000  nmr@CZC2524DW0
$$ $$ /opt/topspin/data/agmb/nmr/Jan13-2022/11/acqu2s
$$ $$ process /opt/topspin3.2/prog/mod/go
$$ ##$ACQT0= 0
$$ ##$BF1= 400.32
$$ ##$FnMODE= 1
$$ ##$NUC1= <1H>
$$ ##$NusJSP= 0
$$ ##$NusT2= 1
$$ ##$NusTD= 128
$$ ##$O1= 2001.60000002825
$$ ##$SFO1= 400.3220016
$$ ##$SW= 12.009563022959
$$ ##$SW_h= 4807.69230769231
$$ ##$TD= 128
$$ ##END=
$$ 
##$PARAMETER FILE=	(acqus, ASCII, /private/var/folders/f6/rjf_tdyn2v98c5c0wvkgn4s80000gn/T/IgziZHW6T0SSs5lXLUP9tg/11/acqus, 0)
$$ ##TITLE= Parameter file, TOPSPIN		Version 3.2
$$ ##JCAMPDX= 5.0
$$ ##DATATYPE= Parameter Values
$$ ##NPOINTS= 12	$$ modification sequence number
$$ ##ORIGIN= Bruker BioSpin GmbH
$$ ##OWNER= nmr
$$ $$ 2022-01-13 15:54:21.049 +0000  nmr@CZC2524DW0
$$ $$ /opt/topspin/data/agmb/nmr/Jan13-2022/11/acqus
$$ $$ process /opt/topspin3.2/prog/mod/shimcntl
$$ ##$ACQT0= 1000000
$$ ##$AMP= (0..31)
$$ 100 100 100 100 100 100 100 100 100 100 100 100 100 100 100 100 100 100
$$ 100 100 100 100 100 100 100 100 100 100 100 100 100 100
$$ ##$AMPCOIL= (0..19)
$$ 0 0 0 0 0 0 0 0 0 0 0 0 0 0 0 0 0 0 0 0
$$ ##$ANAVPT= -1
$$ ##$AQSEQ= 0
$$ ##$AQ_mod= 3
$$ ##$AUNM= <au_zg>
$$ ##$AUTOPOS= <51 >
$$ ##$BF1= 400.32
$$ ##$BF2= 400.32
$$ ##$BF3= 400.32
$$ ##$BF4= 400.32
$$ ##$BF5= 400.32
$$ ##$BF6= 400.32
$$ ##$BF7= 400.32
$$ ##$BF8= 400.32
$$ ##$BYTORDA= 0
$$ ##$CAGPARS= (0..11)
$$ 0 0 0 0 0 0 0 0 0 0 0 0
$$ ##$CFDGTYP= 0
$$ ##$CFRGTYP= 9
$$ ##$CHEMSTR= <none>
$$ ##$CNST= (0..63)
$$ [...]
$$ 0 0 0 0
$$ ##$ShimPowMaxUC= (0..63)
$$ 130000 130000 130000 130000 130000 130000 130000 130000 130000 130000 130000
$$ 130000 130000 130000 130000 130000 130000 130000 130000 130000 0 0 0 0
$$ 0 0 0 0 0 0 0 0 0 0 0 0 0 0 0 0 0 0 0 0 0 0 0 0 0 0 0 0 0 0 0 0 0 0 0 0
$$ 0 0 0 0
$$ ##$ShimPowMaxUG= (0..63)
$$ 524287 524287 524287 524287 524287 524287 524287 524287 524287 524287 524287
$$ 524287 524287 524287 524287 524287 524287 524287 524287 524287 0 0 0 0
$$ 0 0 0 0 0 0 0 0 0 0 0 0 0 0 0 0 0 0 0 0 0 0 0 0 0 0 0 0 0 0 0 0 0 0 0 0
$$ 0 0 0 0
$$ ##$ShimPowRcbType= 3
$$ ##$ShimPowRes= (0..63)
$$ 1e-20 1e-20 1e-20 1e-20 1e-20 1e-20 1e-20 1e-20 1e-20 1e-20 1e-20 1e-20
$$ 1e-20 1e-20 1e-20 1e-20 1e-20 1e-20 1e-20 1e-20 0 0 0 0 0 0 0 0 0 0 0 0
$$ 0 0 0 0 0 0 0 0 0 0 0 0 0 0 0 0 0 0 0 0 0 0 0 0 0 0 0 0 0 0 0 0
$$ ##$ShimPowRng0= (0..63)
$$ 1 1 1 1 1 1 1 1 1 1 1 1 1 1 1 1 1 1 1 1 0 0 0 0 0 0 0 0 0 0 0 0 0 0 0 0
$$ 0 0 0 0 0 0 0 0 0 0 0 0 0 0 0 0 0 0 0 0 0 0 0 0 0 0 0 0
$$ ##$ShimPowRng1= (0..63)
$$ 1 1 1 1 1 1 1 1 1 1 1 1 1 1 1 1 1 1 1 1 0 0 0 0 0 0 0 0 0 0 0 0 0 0 0 0
$$ 0 0 0 0 0 0 0 0 0 0 0 0 0 0 0 0 0 0 0 0 0 0 0 0 0 0 0 0
$$ ##$ShimPowRng2= (0..63)
$$ 1 1 1 1 1 1 1 1 1 1 1 1 1 1 1 1 1 1 1 1 0 0 0 0 0 0 0 0 0 0 0 0 0 0 0 0
$$ 0 0 0 0 0 0 0 0 0 0 0 0 0 0 0 0 0 0 0 0 0 0 0 0 0 0 0 0
$$ ##$ShimPowRng3= (0..63)
$$ 1 1 1 1 1 1 1 1 1 1 1 1 1 1 1 1 1 1 1 1 0 0 0 0 0 0 0 0 0 0 0 0 0 0 0 0
$$ 0 0 0 0 0 0 0 0 0 0 0 0 0 0 0 0 0 0 0 0 0 0 0 0 0 0 0 0
$$ ##$ShimSysFunc= (0..63)
$$ 1 2 3 4 5 7 9 11 15 16 8 10 12 14 6 17 13 18 19 20 0 0 0 0 0 0 0 0 0 0
$$ 0 0 0 0 0 0 0 0 0 0 0 0 0 0 0 0 0 0 0 0 0 0 0 0 0 0 0 0 0 0 0 0 0 0
$$ ##$ShimSysMatrix= 0
$$ ##$ShimSysType= 1
$$ ##$TFXNUM= 0
$$ ##$TRIPLO2= 0
$$ ##$VTU= 2
$$ ##$VTUETH= <149.236.99.20>
$$ ##$VTUTY= <no>
$$ ##$WBREFAM= (0..15)
$$ 132.2 106.2 100 100 100 100 100 100 100 100 100 100 100 100 100 100
$$ ##$WBREFLM= (0..15)
$$ 0 0 0 0 0 0 0 0 0 0 0 0 0 0 0 0
$$ ##$WBREFPH= (0..15)
$$ 77.55 -65.76 0 0 0 0 0 0 0 0 0 0 0 0 0 0
$$ ##$WBSGU= (0..15)
$$ 0 0 0 0 0 0 0 0 0 0 0 0 0 0 0 0
$$ ##$XFAC= 2
$$ ##END=
$$ 
##$DECIM=	4160
##$DSPFVS=	20
##.ACQUISITIONSCHEME=	NOT PHASESENSITIVE
##NTUPLES=	nD NMR SPECTRUM
##VAR_NAME=	FREQUENCY1,	FREQUENCY2,	SPECTRUM
##SYMBOL=	F1,	F2,	Y
##.NUCLEUS=	1H,	1H
##.OBSERVE FREQUENCY=	400.32200160000002143,	400.32200160000002143
##VAR_TYPE=	INDEPENDENT,	INDEPENDENT,	DEPENDENT
##VAR_FORM=	AFFN,	AFFN,	ASDF
##VAR_DIM=	512,	512,	262144
##UNITS=	HZ,	HZ,	ARBITRARY UNITS
##FIRST=	4405.4455391999963467,	4405.4455391999963467,	0.099706009030342102051
##LAST=	-392.85674445383250486,	-392.85674445383250486,	0.088936850428581237793
##MIN=	-392.85674445383250486,	-392.85674445383250486,	9.5090887043625116348e-05
##MAX=	4405.4455391999963467,	4405.4455391999963467,	36201.23046875
##FACTOR=	1,	1,	0.002318231555774787761
##PAGE=	F1=4405.45
##FIRST=	4405.4455391999963467,	4405.4455391999963467,	0.099706009030342102051
##DATA TABLE=	(F2++(Y..Y)), PROFILE
$$ [...]
##PAGE=	F1=-871.748
##FIRST=	4405.4455391999963467,	4405.4455391999963467,	0
##DATA TABLE=	(F2++(Y..Y)), PROFILE
518 4194 4424 4005 1943 204 298 135 139 97 143 153 102 162 131 80 100 52 40 108 113 126 127 56 40 17 97 48 137 62 124 26 37 9 87
208 87 91 115 76 51 36 52 55 92 99 104 66 58 80 26 78 46 95 128 86 37 48 24 56 118 72 64 121 42 26 6 59 151 68 81 83 43 27 46 56
-158 56 140 82 100 64 31 76 73 16 129 146 95 83 13 74 92 70 216 104 48 141 82 25 109 124 168
-393A68
##PAGE=	F1=-890.528
##FIRST=	4405.4455391999963467,	4405.4455391999963467,	0
##DATA TABLE=	(F2++(Y..Y)), PROFILE
4405 43 48 61 57 98 149 53 103 95 90 6 63 71 105 51 55 60 51 70 84 76 127 42 69 17 58 105 67 55 54 135 56 68 40 53 60 83 66 63 14 19 7 71
4011 71 0 89 37 37 26 10 45 18 56 64 25 11 39 35 33 31 60 61 60 19 99 66 29 13 77 48 32 84 47 33 83 44 29 25 28 28 24 4 32 90 61
3626 61 60 36 60 47 31 51 69 60 17 48 38 9 117 37 37 19 44 24 6 39 43 51 40 51 65 35 78 28 58 32 46 41 12 40 84 28 98 44
3269 44 20 78 63 64 83 65 20 79 67 67 25 25 52 68 110 44 36 33 67 30 93 15 100 208 73 134 10 110 138 247 47 304 246 285
2950 285 322 1508 717 2683 7991 3807 1101 255 164 187 351 125 447 343 44 425 64 177 208 68 111 518 231
2734 231 435 500 2458 2698 740 357 773 328 66 407 69 50 129 72 99 133 60 102 22 86 50 81 49 44 119 20 69 26 63
2462 63 23 67 69 17 37 57 120 59 71 26 74 113 18 58 23 74 56 58 110 74 110 144 529 527 786 530 1662 2672 6132 3207 112
2171 112 579 327 259 422 148 139 156 513 658 529 793 2593 8788 6794 2404 2216 1713 1368 116 535 495 550 593 559
1945 559 713 536 807 509 606 531 497 383 815 696 741 1003 1424 381 752 772 972 4483 14555 11199 1297 1159 1623
1729 1623 1078 814 1808 3529 3866 2135 424 144 165 243 200 116 106 298 30 169 315 227 601 816 620 271 1624 4111
1504 4111 4088 16344 10405 5110 2277 1358 618 632 885 330 1152 117 353 469 160 327 334 242 60 139 101 99 289 146
1279 146 150 90 103 106 101 90 85 98 164 79 85 99 68 88 82 122 125 16 86 65 95 87 67 84 68 102 95 76 41 100 67 77 45 57 79 46 157 43
922 43 123 80 32 82 40 124 59 119 111 199 91 567 402 92 52 48 69 83 47 71 24 99 148 97 93 66 97 76 62 145 87 37 287 114
602 114 79 163 314 97 262 365 1520 2427 5885 4890 3915 1875 322 300 166 203 159 101 160 73 82 78 72 121 68 56 66 80 53
330 53 101 35 84 40 80 48 66 33 73 71 45 12 75 48 50 52 23 63 54 56 81 53 49 78 15 37 62 73 3 15 67 53 51 50 48 29 68 57 92 82
-45 82 76 41 31 69 93 14 20 15 59 31 61 42 81 27 25 33 72 105 25 49 76 51 61 14 73 102 39 60 117 64 121 12 81 86 84 73 81
-393H1
##PAGE=	F1=-909.308
##FIRST=	4405.4455391999963467,	4405.4455391999963467,	0
##DATA TABLE=	(F2++(Y..Y)), PROFILE
4405 205 210 182 151 202 189 142 83 237 171 131 152 107 154 58 48 169 154 74 153 98 114 56 146 77 104 156 97 26 79 113 153 53 104 86
4086 86 69 113 50 38 82 93 68 113 13 105 66 70 55 76 94 26 52 46 66 58 29 101 69 53 54 100 53 63 78 105 49 26 89 14 49 31 85
3739 85 84 101 54 29 21 52 82 70 46 42 120 33 14 47 116 87 51 27 47 31 74 44 63 33 118 34 27 49 79 62 58 20 70 48 22 63 81 39
3382 39 86 31 74 36 40 35 50 69 84 4 91 37 50 52 77 34 108 61 22 25 34 106 28 51 48 69 64 27 56 33 64 55 77 14 123 191 59 84
3025 84 31 154 108 179 82 226 216 179 221 1329 619 2733 9268 4727 944 252 166 130 505 112 441 419 162 411 131
2790 131 231 225 126 134 546 53 436 446 3146 2830 1354 328 666 318 165 458 99 34 130 40 128 80 57 105 11 89 47 95
2527 95 55 107 81 45 80 51 80 70 117 86 33 52 102 149 32 131 43 137 90 91 112 75 168 124 162 172 183 250 281 476 595 826 538
2218 538 1535 6957 12051 4076 328 918 434 228 370 116 285 415 717 866 578 851 3277 23620 24941 2105
2030 2105 2368 2406 1575 920 794 1326 5775 3115 1218 329 1052 1351 427 766 589 448 398 1123 778 941 662 1317 209
1814 209 755 695 717 3552 12423 9835 1522 1360 2510 2769 3204 2704 805 1011 937 107 347 534 253 370 243 35
1607 35 490 315 456 631 317 765 294 691 929 1994 4983 8322 13773 36277 27824 2289 1367 361 649 1137
1419 1137 1644 1629 605 396 313 261 218 480 152 219 231 102 153 275 172 184 208 150 144 88 105 165 177 161 134 115 87 81 96 161 128
1128 128 152 61 66 97 105 70 127 141 113 112 94 56 69 120 127 80 80 71 81 42 184 9 159 93 49 67 69 124 109 148 144 191 101 590 420 126
790 126 102 84 127 103 50 107 14 129 193 164 123 72 105 130 140 235 165 106 351 143 178 341 321 251 439 748 3027 4113 9794
518 9794 7347 6534 2392 408 691 420 382 278 104 193 150 118 180 181 173 97 90 45 128 78 169 99 148 59 26 103 78 133 38 157
236 157 63 43 36 30 42 154 102 102 77 32 74 31 56 176 57 30 67 43 72 79 76 105 100 69 47 39 9 107 196 83 126 47 31 98 29 109 108
-111 108 103 98 34 64 84 57 146 88 95 123 104 61 123 119 85 164 89 137 133 44 176 68 224 238 123 159 167 131 176 167
-393A67
##PAGE=	F1=-928.088
##FIRST=	4405.4455391999963467,	4405.4455391999963467,	0
##DATA TABLE=	(F2++(Y..Y)), PROFILE
4405 294 291 235 195 242 183 222 160 311 222 199 182 103 163 128 122 233 200 99 174 108 92 115 197 137 132 182 94 4 96 108 217 88 131 100
4086 100 47 129 62 72 118 139 96 119 5 113 106 96 91 132 109 39 34 29 110 101 71 130 73 53 36 128 80 79 91 130 51 16 90 45 85 41 106
3739 106 104 94 50 48 58 77 111 109 68 46 139 14 54 86 138 93 86 24 24 40 116 65 85 44 102 25 39 93 114 85 83 16 80 31 57 90 92 88
3382 88 87 34 68 57 55 68 84 86 82 3 71 28 102 36 101 42 101 47 29 31 26 135 56 57 58 60 44 25 105 63 73 60 41 23 144 174 77 71 58
3016 58 157 88 91 108 191 246 78 80 928 418 3792 9989 4795 645 393 170 149 591 140 340 443 215 388 175 273 182
2772 182 200 172 480 135 569 317 4252 3399 3098 451 548 374 276 498 127 48 126 52 145 78 54 136 19 99 65 104 67 145
2509 145 72 67 91 91 96 113 148 110 25 100 111 165 68 158 62 155 87 113 154 113 191 153 209 178 243 292 316 448 555 786 503 1163 8937
2199 8937 14123 4246 628 1016 436 212 309 117 316 464 761 750 385 858 2693 24584 27412 3206 1530 2045
2011 2045 1066 1145 963 1895 7404 3636 1261 154 1537 1470 284 537 413 298 449 1326 867 956 284 977 57 735
1804 735 580 567 2449 9195 7598 1648 1557 3427 4999 7134 8859 9255 6738 2909 1107 518 1145 536 423 280
1617 280 87 662 590 622 878 532 922 381 744 1516 2589 4130 8960 15127 60132 40210 4647 1485 82 622
1429 622 1259 1935 1586 844 451 264 388 181 529 409 304 267 145 188 315 221 274 269 190 176 128 148 229 216 192 158 131 106 118
1156 118 141 211 164 170 77 83 113 144 108 151 160 142 121 105 90 117 155 165 93 87 84 115 77 209 42 179 113 61 55 123 152 147 196 136 204 81
818 81 620 378 170 130 129 152 124 16 179 92 178 232 200 159 143 134 229 243 343 253 212 416 272 352 607 381 496 671 1333 5105
537 5105 5780 17846 15274 15165 4552 823 1297 802 623 443 334 340 335 305 338 304 249 169 180 156 246 194 267 161 201 101
293 101 80 185 177 227 79 213 78 105 49 117 121 227 163 120 103 55 105 83 130 243 88 36 45 15 148 150 129 147 119 69 43 102 66
-17 66 151 267 100 145 29 18 132 73 177 156 150 100 31 59 129 106 223 134 110 137 63 120 168 175 152 221 107 155 134 99 252 132
-318 132 307 281 179 185 194 173 252 253
-393B53
##PAGE=	F1=-946.868
##FIRST=	4405.4455391999963467,	4405.4455391999963467,	0
##DATA TABLE=	(F2++(Y..Y)), PROFILE
4405 281 267 202 164 217 122 262 179 292 197 191 145 81 135 162 149 228 172 80 141 116 81 139 183 153 109 159 72 28 101 104 223 84 111 78
4086 78 4 126 78 82 112 135 83 89 22 113 118 81 89 144 89 23 34 31 126 104 70 115 44 39 35 133 91 54 86 122 29 12 81 64 95 47 89 85 71
3720 71 40 72 70 75 100 109 63 52 147 26 77 104 118 58 101 47 32 55 125 61 74 30 64 25 54 115 113 79 71 4 72 17 81 97 76 98 61
3373 61 27 50 73 56 88 79 64 63 12 51 19 120 26 95 35 65 25 31 71 25 131 52 40 50 48 74 24 123 66 67 40 9 34 145 184 74
3035 74 66 64 125 90 84 102 186 307 46 170 410 694 5720 9818 3902 276 557 220 211 598 140 145 370 180 358 188 297
2781 297 83 236 241 337 244 776 335 5039 4243 5276 819 549 459 377 503 138 69 114 52 149 78 27 176 2 94 53 82
2527 82 36 135 82 56 94 87 63 101 135 109 34 100 81 141 51 134 29 117 53 81 133 91 141 113 181 124 210 222 316 385 441 641 453 672
2208 672 8077 12005 3501 842 861 359 197 243 140 272 365 605 418 152 1158 1173 13298 15278 3523 457 919
2011 919 374 706 688 1382 4852 2027 790 487 1335 903 302 119 182 181 479 1304 938 793 482 804 78 681 421 428
1786 428 1430 5596 5001 1664 1766 4202 7364 12012 18039 22256 18247 8580 2618 785 1532 740 301 171 257 780
1598 780 667 525 794 378 1067 101 731 1783 2255 2315 3491 9194 43687 32868 3336 1346 561 531 1153 1244 1027
1401 1027 583 323 338 477 233 368 576 231 177 138 187 286 230 298 197 140 174 149 178 250 200 179 144 115 87 184 145 219 162 147
1119 147 102 105 134 203 160 134 113 128 142 161 145 181 171 200 97 98 120 204 156 226 103 163 152 123 119 204 201 182 243 130 258 128 648 253
800 253 216 158 188 160 196 152 287 207 259 276 251 251 291 264 374 370 473 391 406 537 528 592 930 518 847 1012 2092 7468 7103 29663
518 29663 27725 28100 7746 2000 1914 1217 888 648 644 547 543 497 478 407 337 282 305 282 356 291 334 206 240 170 186 262 251 285 116
246 116 230 100 185 114 189 170 245 188 114 127 121 147 126 174 256 86 37 55 64 205 176 151 144 104 41 85 157 98 158 276 96 126 12
-64 12 59 150 113 200 144 149 64 48 62 147 135 234 123 71 110 17 159 166 179 167 206 66 126 104 139 259 165 287 234 161 148 176 179 259 259
-393B59
##PAGE=	F1=-965.648
##FIRST=	4405.4455391999963467,	4405.4455391999963467,	0
##DATA TABLE=	(F2++(Y..Y)), PROFILE
4405 213 184 145 113 187 62 276 162 213 148 141 76 111 97 171 152 178 99 48 74 141 105 126 121 154 58 100 82 53 103 105 177 63 65 55 60
4077 60 109 80 69 92 95 70 41 50 108 103 42 60 128 56 14 67 40 115 77 34 85 33 26 56 117 76 43 64 94 10 42 64 62 82 52 47 45 58 34
3711 34 91 56 62 67 86 40 64 139 36 73 112 70 13 103 70 44 53 108 45 45 3 13 31 57 114 80 58 55 19 55 28 83 84 39 83 17 48 38
3354 38 77 41 92 45 17 37 38 47 10 101 29 68 7 17 11 27 87 12 97 28 49 26 39 94 20 111 61 50 9 57 47 121 208 45 53 63 88
3006 88 97 170 67 167 365 104 289 190 1522 7702 8916 2449 76 670 341 272 533 132 139 232 83 309 287 301 44
2772 44 234 323 220 273 935 622 4887 5068 7160 1316 631 525 455 459 133 82 112 39 167 73 26 204 25 80 25 62 33
2518 33 93 110 30 106 50 21 52 97 112 98 64 38 105 14 93 53 50 47 17 86 40 60 31 99 55 117 96 295 374 355 414 430 492 5574 7359
2189 7359 2141 978 553 262 176 193 282 248 350 464 318 421 1674 2036 3709 12455 5522 2115 510 698 56 218
1983 218 267 260 640 157 527 570 244 291 329 261 124 494 1063 923 526 506 846 185 611 252 245 679 2377 2598 1631 1957
1739 1957 4674 9417 16987 28652 37847 32458 15687 4643 1907 1494 724 293 502 533 864 568 311 528 275
1560 275 1063 963 711 1844 689 2618 6397 6918 27890 16863 1469 2525 1364 577 974 1774 253 478 565
1382 565 640 641 386 156 660 396 389 347 250 369 297 358 211 270 311 264 277 304 267 260 263 255 189 293 192 260 199 222 258 207 237 301 244
1072 244 189 166 181 253 276 229 270 206 296 203 220 224 326 268 259 221 192 254 266 255 305 273 246 310 238 373 272 672 146 278 244 295 251
762 251 341 330 415 340 377 369 381 410 488 454 538 513 626 584 667 739 841 858 1259 730 1292 1460 2913 9683 7878 43490 42563 43292
499 43292 11239 4033 2380 1595 1147 874 973 748 733 663 582 487 432 407 435 396 432 361 364 244 276 245 288 317 287 307 144 219
236 219 138 265 173 238 187 215 186 112 148 186 181 161 181 225 69 59 118 112 237 161 141 105 79 9 144 193 103 139 232 87 84 63 115 152
-83 152 132 189 90 122 44 80 95 146 143 192 77 23 65 92 180 133 145 159 139 58 84 81 181 218 186 197 140 128 102 172 186 233 215
-393B15
##PAGE=	F1=-984.428
##FIRST=	4405.4455391999963467,	4405.4455391999963467,	0
##DATA TABLE=	(F2++(Y..Y)), PROFILE
4405 179 143 150 129 208 115 283 166 152 165 105 66 169 94 180 160 139 65 63 9 169 142 103 66 167 39 37 114 68 119 122 117 66 41 73
4086 73 103 95 76 70 100 55 96 1 68 110 81 57 42 109 46 43 97 48 98 53 10 81 71 25 73 96 53 92 57 65 36 65 47 56 64 79 17 34
3729 34 69 34 106 33 74 51 71 20 73 117 45 58 118 34 62 97 84 45 43 88 54 38 19 35 30 54 103 39 46 72 32 37 44 75 70 16 68 27
3373 27 76 48 72 41 92 11 41 28 60 58 10 62 55 48 20 21 16 27 83 9 59 24 82 9 33 89 24 87 74 37 19 91 54 81 222 18 59
3025 59 79 91 91 253 75 131 406 191 292 532 2346 8857 7689 1766 323 710 473 320 405 172 390 102 100 243 427
2790 427 285 156 215 373 246 233 963 914 3728 5897 8195 1770 664 526 487 364 123 77 125 34 188 75 54 204
2565 204 42 74 32 78 81 53 133 11 121 12 73 23 68 131 145 22 37 92 70 77 111 43 99 39 82 40 72 50 8 47 28 62 250
2255 250 585 350 169 484 690 3130 2920 757 993 261 199 142 161 370 219 380 441 528 598 1968 3442 13761 23377
2039 23377 7197 3034 1274 954 644 453 778 4199 2882 328 298 323 843 151 521 352 41 479 706 796 269
1842 269 261 847 256 560 121 107 268 545 987 1615 2044 4742 10768 21053 38569 53160 46786 22809 7147 4269
1654 4269 1473 482 578 986 782 876 453 424 601 804 753 2098 725 1985 1724 3649 13343 25649 83706 35675
1466 35675 7110 3988 1874 758 1054 3138 553 1105 1063 955 830 576 442 741 713 705 589 395 558 419 504 422
1260 422 500 495 403 411 405 418 417 438 436 340 385 304 353 298 364 425 320 360 405 335 311 314 292 380 386 309 356 274 413 337 360 334 427 371 307 345 289
912 289 364 406 385 389 349 328 388 374 493 414 681 222 352 363 415 385 486 490 524 457 499 495 542 567 667 628 678 640 772 775 906 968 1104
602 1104 1093 1511 977 1751 1904 3628 11282 8078 56814 57072 58164 14448 6878 2586 1887 1366 1090 1265 907 885 799
405 799 662 555 529 519 545 486 474 414 376 292 318 310 370 350 295 314 183 211 185 330 220 267 188 172 176 143 163 236 209 193 170 184 77
95 77 92 184 146 253 132 125 58 84 57 194 215 101 124 165 97 41 109 158 155 146 172 49 107 96 107 139 145 153 137 52 69 49 160 196 110 118
-243 118 168 68 123 85 107 225 180 214 113 100 146 125 213 222 236 193
-393A93
##PAGE=	F1=-1003.21
##FIRST=	4405.4455391999963467,	4405.4455391999963467,	0
##DATA TABLE=	(F2++(Y..Y)), PROFILE
4405 170 135 159 147 235 160 274 180 138 187 80 90 196 113 183 166 131 68 64 33 179 165 91 68 170 29 2 127 66 142 137 84 56
4105 56 31 84 120 94 79 77 115 39 111 12 70 125 67 84 51 89 41 57 116 52 98 45 20 85 90 23 83 87 47 120 61 35 51 76 48 59 52
3758 52 97 17 45 74 40 120 27 91 44 65 20 71 86 57 52 115 27 84 83 92 44 46 84 57 44 21 69 20 63 90 15 41 79 29 20 58 76 67
3401 67 19 57 45 88 72 67 50 102 3 65 30 66 78 23 33 81 35 26 36 11 38 75 10 40 31 94 18 27 67 27 75 74 29 13 104 46 38 220
3044 220 20 72 125 110 69 319 159 106 418 311 159 698 3015 8718 6424 2724 513 680 559 352 236 239 568 50
2819 50 203 194 519 257 217 182 356 296 164 841 1080 2380 6874 8247 2043 609 453 462 237 116 46 125 58 176 68
2584 68 64 170 30 63 28 79 91 31 125 9 114 17 94 42 55 128 143 20 32 80 102 57 124 60 114 59 92 54 101 94 48 60 29 93
2265 93 296 822 347 79 597 709 1486 1884 766 850 240 197 81 103 310 131 270 348 590 540 1797 3574 14692 23269
2039 23269 6719 2628 1303 886 756 584 1131 5735 3639 430 83 894 1048 133 465 278 67 406 370 587 115
1842 115 171 715 261 506 64 221 164 1420 984 1575 1944 4398 11178 23316 45543 64952 58199 28318 9963
1664 9963 7803 2768 362 725 1232 859 713 366 507 686 1054 383 2711 685 2044 3419 2827 12910 36361
1485 36361 112849 51464 10021 4184 1625 826 1145 3350 828 1355 1261 1014 850 647 631 777 821 810 652 493 606
1288 606 451 579 527 602 557 431 462 441 494 483 510 513 409 388 370 398 345 427 497 351 413 446 369 380 397 343 430 422 330 387 310 463 398
978 398 427 379 453 417 323 407 352 404 470 450 411 390 370 424 438 541 487 659 279 403 442 483 466 558 576 570 519 572 584 645 648 764 722 754
659 754 712 857 889 1026 1144 1224 1239 1604 1181 2105 2190 4063 11895 7823 66923 68316 69940 16980 10283 2517 2068 1512
452 1512 1260 1474 1009 996 910 734 620 614 599 624 554 498 473 400 350 365 357 429 373 300 334 240 230 230 370 260 290 198 162 182 194 172 265
142 265 236 223 173 171 115 114 235 168 266 122 129 37 114 104 224 230 102 134 115 104 17 142 179 169 158 173 48 119 137 118 172 154 168 106
-177 106 44 89 62 197 213 109 103 174 29 153 103 137 248 166 220 79 105 163 151 240 246 253 195
-393A95
##PAGE=	F1=-1021.99
##FIRST=	4405.4455391999963467,	4405.4455391999963467,	0
##DATA TABLE=	(F2++(Y..Y)), PROFILE
4405 141 92 116 106 221 170 243 190 147 162 55 69 179 123 173 178 148 20 29 36 165 174 97 96 152 31 26 109 51 169 147 93 25 25 60 109
4077 109 102 99 72 125 76 86 19 59 150 62 86 104 69 12 52 123 56 116 69 12 82 81 16 87 94 70 119 66 27 62 76 66 77 67 105 36 30
3729 30 62 45 135 48 100 22 52 34 61 61 76 67 114 29 62 64 94 49 68 105 45 54 37 87 10 94 87 24 57 50 50 11 74 95 73 39 51 36 77
3363 77 97 75 32 127 40 60 47 58 105 49 35 115 41 33 38 18 68 78 47 50 63 85 18 41 49 44 87 35 59 27 107 31 49 210 68 72 195
3016 195 111 56 363 254 112 395 442 129 670 3482 7398 5208 3678 750 603 575 363 157 310 637 186 257 205 546
2790 546 244 212 120 268 295 113 634 1085 2451 7705 7601 2075 525 352 387 114 111 18 91 121 115 53 75 113 17 31 18 38
2527 38 50 16 79 49 69 39 59 65 51 84 89 35 17 35 100 40 81 32 73 38 65 76 68 106 56 92 7 76 424 908 299 177 696 460
2208 460 354 2101 1422 594 360 223 17 39 100 153 36 123 491 314 1180 2515 7970 12062 4311 1134 710 833 375
1992 375 302 715 4152 2755 240 374 916 680 256 246 111 133 308 143 362 94 390 511 214 387 169 374 265
1776 265 1668 1225 1414 1655 3752 10597 23251 47895 70528 64077 30884 12773 12087 5120 931 552 996 703
1607 703 406 183 249 303 745 904 2287 575 1590 3389 376 3947 30237 83270 40805 7677 2635 577 802
1429 802 811 1975 728 890 934 703 596 505 512 662 583 597 451 459 408 318 468 413 487 434 286 369 336 413 380 415 428 344 274 320 328
1138 328 271 350 425 266 355 382 306 335 355 288 361 356 262 330 264 394 345 381 329 387 378 269 366 324 338 424 427 352 367 333 380 389 477 470 587
809 587 233 400 433 459 445 520 563 535 502 559 583 636 614 746 707 745 696 833 883 975 1201 1164 1266 1498 1277 2260 2194 4108 11369
537 11369 7284 71600 73857 76321 18675 13772 2299 2122 1555 1354 1568 1057 1067 996 793 672 667 634 669 604 522 541 440
321 440 401 402 381 466 401 321 379 307 265 263 383 300 324 240 205 205 236 175 282 267 256 214 197 159 122 264 187 287 153 172 64 145 139 232
2 232 247 123 174 123 101 42 160 180 195 179 215 31 150 146 114 184 181 196 125 21 67 62 199 233 123 115 172 64 128 96 147 249 178 214
-318 214 62 77 130 125 223 246 263 208
-393B08
##PAGE=	F1=-1040.77
##FIRST=	4405.4455391999963467,	4405.4455391999963467,	0
##DATA TABLE=	(F2++(Y..Y)), PROFILE
4405 206 147 129 43 199 201 245 259 231 165 136 28 134 147 176 241 214 81 76 13 141 186 136 168 163 123 54 73 45 202 182 139 111 90
4096 90 21 85 112 138 95 168 153 32 53 43 177 87 103 194 91 30 38 119 76 149 141 71 113 68 12 88 116 115 141 104 80 80 72 88 112 122
3758 122 141 95 20 44 48 154 90 130 75 63 57 48 51 108 103 153 78 18 54 87 61 101 153 84 94 81 95 17 137 111 76 110 11 99 29 91
3419 91 128 99 104 86 40 59 117 95 16 164 105 68 85 57 131 90 64 163 103 76 64 42 109 90 110 96 127 88 20 72 59 90 125 39 119
3091 119 85 125 51 119 201 150 76 269 94 104 378 334 123 348 538 412 566 3690 5474 4127 4045 1038 525 529 348 310
2847 310 393 618 389 252 250 543 270 161 24 156 290 113 516 972 3114 7788 6722 1921 478 303 286 55 103
2631 103 63 52 193 29 78 110 76 80 33 91 52 24 56 14 100 6 90 19 126 85 20 25 57 92 52 105 125 26 31 5 48 44 141 19 124
2302 124 61 160 59 148 480 814 234 191 736 124 1661 1519 1767 335 428 236 130 167 182 298 215 207 337 181 338 1008
2058 1008 7213 6192 2287 693 367 842 259 229 415 723 937 126 510 488 129 264 61 182 134 286 94 203 203
1842 203 427 337 230 221 346 527 441 1290 1064 1110 1295 3002 9143 20863 45064 68555 63004 29930 15165 16325
1654 16325 7781 1799 601 227 385 526 422 297 495 76 1327 912 591 551 1358 1966 10630 10599 13497 9146 2082
1457 2082 1756 1076 983 157 554 727 175 287 296 189 303 143 452 151 241 179 313 181 92 222 182 223 247 98 181 119 218
1203 218 183 215 239 232 109 170 177 108 189 255 132 218 239 178 199 228 192 217 238 131 208 143 231 222 251 220 264 276 155 238 226 200 294 346
884 346 235 289 225 269 252 325 405 459 164 343 337 360 346 398 477 436 416 462 489 530 487 639 602 666 594 699 771 772 1126 964 1183 1229
584 1229 1241 2189 1889 3768 9822 6576 69744 72426 76098 19562 16718 2209 2040 1474 1352 1534 1051 1082 1030 807
396 807 684 665 616 677 629 543 591 469 422 412 380 479 431 357 427 361 287 274 372 337 369 301 265 227 253 173 294 301 296 273 240 192 113 267
77 267 216 316 216 242 110 170 155 225 273 178 239 174 112 78 164 177 234 224 296 51 191 131 102 188 239 254 197 80 52 46 185 264 176
-233 176 202 210 149 66 65 161 264 248 275 149 126 88 81 198 273 321 293
-393B93
##PAGE=	F1=-1059.55
##FIRST=	4405.4455391999963467,	4405.4455391999963467,	0
##DATA TABLE=	(F2++(Y..Y)), PROFILE
4405 317 251 214 93 226 266 293 352 329 225 223 64 103 191 208 316 284 165 137 16 131 208 180 243 200 195 69 50 63 233 224 184
4114 184 195 139 36 72 121 174 139 220 214 18 84 35 195 129 141 269 121 57 21 102 104 181 207 118 159 72 20 86 140 149 188 143 119 91
3795 91 68 104 146 170 187 139 51 34 52 170 125 167 132 86 69 28 49 135 132 200 126 53 51 67 75 123 202 136 130 111 90 22 169 138 121 153
3457 153 56 133 47 99 156 127 164 122 61 55 117 109 63 185 158 100 111 68 145 126 95 197 161 108 90 54 142 96 160 139 178 107 19 95 77
3128 77 129 157 100 160 129 148 88 183 175 221 84 307 65 168 349 377 103 291 546 661 598 3577 3675 3312 3844 1246 485 448
2865 448 305 471 467 579 557 212 280 534 319 111 86 129 333 135 591 812 2909 6748 5934 1769 418 299 189 64
2640 64 94 86 81 227 51 105 135 82 129 72 147 115 72 88 35 129 59 134 82 181 113 57 70 76 153 109 131 201 71 71 76 84 82 189 85 140
2302 140 92 203 105 249 389 617 193 166 721 279 2497 1475 1860 201 442 239 220 280 421 360 341 419 209 327 425
2067 425 305 11349 14046 2952 2012 812 657 715 693 1192 2517 817 268 451 275 620 198 182 271 124 307 201
1861 201 156 327 305 233 308 176 469 627 562 678 747 764 1024 2310 7053 16670 37800 59471 55212 25841 16752 19515
1654 19515 10128 2924 1723 956 97 831 811 715 1238 868 1101 1247 650 651 1801 2000 20834 28260 93048 36573
1466 36573 9035 4015 2018 1239 887 2308 850 1120 701 608 328 420 279 429 472 430 443 201 440 200 205 301 204 321
1241 321 295 137 116 151 233 204 161 304 96 104 141 117 184 172 168 132 122 121 118 183 206 159 192 82 123 44 97 191 147 160 181 185 79 105 162
912 162 125 177 281 136 204 111 174 146 172 374 300 190 267 207 251 254 274 384 327 309 329 355 401 348 518 466 566 445 519 626 516
621 516 957 729 1027 899 1100 1951 1366 3160 7611 5722 61686 64302 69469 19725 18503 2480 1844 1278 1253 1372
433 1372 974 1011 974 733 631 594 544 638 601 525 575 446 392 378 349 457 431 368 430 364 274 254 336 345 392 330 294 218 233 159 301 314
133 314 318 298 258 193 85 245 242 327 260 286 136 170 151 206 291 228 282 207 127 97 157 182 265 261 359 86 213 110 90 194 292 305 259
-177 259 129 77 23 178 293 232 293 262 216 21 46 197 302 330 359 243 216 117 117 219 339 407 392
-393C92
##PAGE=	F1=-1078.33
##FIRST=	4405.4455391999963467,	4405.4455391999963467,	0
##DATA TABLE=	(F2++(Y..Y)), PROFILE
4405 323 259 238 129 264 288 295 359 327 227 238 93 101 210 205 311 275 175 137 44 135 207 174 248 184 192 40 68 81 232 212 170 209
4105 209 123 46 89 116 167 138 218 205 24 94 48 185 134 135 273 98 42 28 69 108 173 210 106 164 66 43 75 135 133 193 132 107 74
3795 74 70 95 140 162 191 125 55 21 54 159 117 160 137 70 50 6 38 125 117 196 124 69 26 28 74 105 207 137 115 96 73 8 165 125 113
3466 113 142 61 125 47 84 152 117 171 109 48 62 87 97 82 158 156 103 95 70 128 131 93 178 167 91 79 38 143 71 157 131 175 96 12 89 71
3128 71 120 139 110 144 132 144 113 202 103 231 63 274 53 206 272 356 62 211 431 789 801 3119 2540 2799 3226 1257 475
2875 475 358 239 558 480 571 586 168 273 519 352 127 160 165 387 138 673 634 1731 4707 5258 1826 250 257 136 63
2640 63 94 53 92 181 63 79 113 68 126 62 137 121 55 69 33 100 66 124 85 172 81 69 75 62 153 101 115 201 69 53 94 68 76 159 91
2311 91 105 77 172 77 271 171 416 149 216 688 341 2569 2684 1793 263 412 253 226 304 524 293 320 491 185 378 865
2067 865 973 8027 11855 3026 2361 798 363 767 809 1552 3851 1612 263 231 637 785 158 184 179 108 219 237 75
1851 75 343 135 120 274 181 413 562 544 151 579 515 814 1648 4639 11561 27909 45344 42520 19837 17275 20759
1654 20759 11626 4331 3388 2174 559 671 826 646 1334 1182 634 2431 546 1284 3972 1568 19908 48525 133518
1476 133518 52194 13806 4659 1590 1243 1203 2336 501 1353 937 752 427 441 382 419 621 541 537 215 512 224 262
1269 262 381 280 385 369 169 176 208 301 263 181 397 51 186 173 159 235 203 201 150 119 139 154 212 228 198 199 126 130 80 118 229 136 163
959 163 179 162 102 78 171 156 154 255 120 168 88 165 170 122 388 169 183 229 129 209 237 226 329 260 238 236 257 338 276 445 359 496 316
649 316 419 541 332 768 558 846 629 882 1658 798 2470 5218 4728 49083 51234 57951 19183 18698 2992 1604
462 1604 1017 1079 1102 809 831 800 551 505 459 424 539 491 425 456 342 300 299 281 379 357 305 344 288 218 199 269 293 345 276 247 150 177 122
152 122 282 267 274 240 211 144 41 197 228 279 229 248 104 125 127 167 265 219 244 169 96 85 143 170 248 228 337 60 185 107 83 180 279
-158 279 281 243 109 81 8 175 279 219 297 244 210 62 62 217 300 329 347 240 233 150 165 235 357 409 384
-393C84
##PAGE=	F1=-1097.11
##FIRST=	4405.4455391999963467,	4405.4455391999963467,	0
##DATA TABLE=	(F2++(Y..Y)), PROFILE
4405 184 140 190 116 247 209 176 219 177 159 175 100 87 163 115 178 155 102 74 81 124 149 83 139 85 108 46 99 89 172 107 68 135 33 40 116
4077 116 81 90 56 147 106 28 100 66 129 72 48 180 27 38 68 18 76 103 122 40 123 34 75 40 82 47 116 67 33 28 84 52 67 74 141
3748 141 35 39 24 43 106 48 83 70 35 30 55 33 56 49 111 65 37 43 34 55 47 142 60 33 41 61 34 106 48 29 77 34 70 31 54 93 58 101
3391 101 26 26 91 28 42 56 77 79 79 28 73 72 92 51 92 95 13 33 13 99 3 85 47 100 48 82 49 42 43 58 42 79 98 96 132 149 34 150
3035 150 92 155 139 190 198 252 195 117 220 757 1006 2335 2202 2770 2302 1072 444 270 167 558 403 577 430 146 226 519
2790 519 337 200 172 147 410 108 623 470 892 2164 4543 2051 78 166 185 136 139 65 26 78 37 47 79 16 62 20 55 47
2527 47 50 50 42 15 29 35 21 69 41 63 15 69 73 14 59 98 37 76 67 31 35 29 13 85 35 84 64 178 96 302 59 331 677 140 3451
2199 3451 5131 1741 404 344 250 109 222 464 201 285 426 276 237 887 1845 4427 4779 2448 1859 321 491 444 497
1983 497 1291 2845 1382 251 94 711 463 74 76 121 34 71 163 159 253 58 215 39 60 115 321 477 267 599 406 466
1739 466 869 2297 6559 17648 29249 27788 13570 16652 19598 11953 5926 5341 3125 1450 376 213 415 388
1570 388 807 1705 2475 1157 1430 3360 8009 10864 44069 81890 23322 11280 2735 1195 1588 552 461 736 652
1391 652 502 710 522 261 223 183 394 389 265 377 205 233 149 247 239 316 229 188 102 232 175 198 214 333 300 192 154 104 194 191 158
1100 158 189 170 148 175 171 197 200 178 134 141 134 104 199 143 172 196 181 92 98 192 159 166 244 125 197 106 206 184 120 395 118 70 268 162 251
772 251 253 240 302 245 232 230 241 345 260 412 290 466 285 451 571 248 629 450 671 498 573 1418 364 1859 3103 3660
527 3660 34435 35944 43914 17869 17202 3447 1419 804 878 769 576 567 537 314 344 313 281 388 301 231 247 168 178 209 189
293 189 236 199 152 156 136 152 128 174 172 202 133 108 30 134 57 220 143 136 90 87 80 67 125 151 143 103 108 39 40 100 98 169 123 99 42 18 69 126 116
-74 116 151 94 197 56 104 135 70 112 162 150 116 55 89 32 144 189 96 171 132 112 129 75 177 196 191 188 106 169 166 160 176 257 255 207
-393B07
##PAGE=	F1=-1115.89
##FIRST=	4405.4455391999963467,	4405.4455391999963467,	0
##DATA TABLE=	(F2++(Y..Y)), PROFILE
4405 224 193 218 125 158 54 53 101 157 254 174 122 39 46 83 67 135 157 107 117 80 43 87 79 159 124 154 119 109 82 86 125 115 129 82 129 32
4067 32 57 104 171 81 116 127 80 37 54 126 45 158 126 113 70 89 94 38 159 135 55 103 26 78 107 76 126 91 39 114 71 68 86 139 111
3739 111 89 71 33 65 101 100 82 142 99 115 86 69 123 80 104 62 127 105 80 126 76 83 100 95 94 101 6 89 119 133 120 61 48 94 19 119 45
3391 45 116 125 149 75 54 97 136 72 141 79 117 23 77 124 100 38 117 89 91 75 117 101 100 68 107 181 61 99 110 125 91 142 127 28 180 31
3053 31 211 37 230 61 275 117 271 83 419 183 247 595 1103 1308 2386 3681 1159 862 370 184 116 484 280
2837 280 553 179 154 158 560 271 293 133 83 408 54 444 501 2408 577 3824 2215 450 192 305 270 242 218 113 214
2603 214 167 184 186 125 114 163 162 122 216 189 159 153 152 121 169 120 206 174 141 183 105 178 197 84 192 241 153 184 185 184 171 252 205 164 254 78
2265 78 303 450 124 453 696 320 5320 7792 1815 481 292 191 132 181 303 342 377 279 305 107 585 2909 15571
2049 15571 16711 3655 1209 456 725 483 321 622 350 868 374 469 640 321 166 338 493 304 446 343 522 406
1842 406 354 541 397 408 402 459 697 603 759 555 312 262 974 2693 9008 14375 14091 8590 14957 16237 11097 7416 7236
1626 7236 3638 2692 1815 999 1615 1503 1460 2728 3127 2561 3149 1746 14573 26267 11309 75636 50332 7968
1457 7968 4337 4497 3099 1525 3916 2367 1895 1439 1560 1352 1032 1032 922 985 990 723 841 622 790 672 702 714 653 507
1232 507 591 500 591 446 515 601 262 828 320 450 431 443 415 410 411 398 376 379 333 406 360 339 305 300 348 279 308 316 326 317 304 219 273 347 293
903 293 285 321 222 310 219 351 262 226 418 68 219 382 298 390 332 328 326 287 292 297 308 410 293 412 252 459 369 504 708 187 565
612 565 358 522 545 191 1288 153 1385 1564 2647 20391 21393 29911 15708 14294 3608 1329 748 715 468 411
424 411 358 358 309 269 288 193 265 178 101 202 150 177 199 168 83 144 114 96 134 171 119 112 118 15 170 104 150 187 38 141 101 73 161 98
105 98 159 153 71 50 70 139 121 164 99 100 67 34 101 133 151 145 110 113 78 42 128 35 222 83 173 67 15 45 88 94 194 164 49 65 23 127
-233 127 60 176 85 211 66 68 6 86 143 177 193 212 102 46 75 63 151
-393A51
##PAGE=	F1=-1134.67
##FIRST=	4405.4455391999963467,	4405.4455391999963467,	0
##DATA TABLE=	(F2++(Y..Y)), PROFILE
4405 497 405 324 156 24 206 309 370 429 443 280 132 43 110 283 321 338 311 207 119 44 134 270 296 341 264 235 122 168 143 293
4124 293 307 252 259 131 119 104 216 272 323 242 190 160 99 115 201 301 184 296 196 140 160 189 237 207 309 226 106 119 112 199 257 231
3823 231 249 202 90 152 175 222 246 245 251 153 119 78 164 240 252 207 253 161 169 161 209 266 236 220 137 207 177 161 262 181 229 224 188 143 174 139
3485 139 228 277 267 225 146 98 185 149 254 185 251 221 207 170 163 211 288 212 247 175 183 126 173 259 246 177 236 180 170 170 240 252 257 192 208 276
3147 276 142 202 269 285 234 277 223 113 249 119 381 206 370 234 404 63 432 139 639 343 533 442 1054 964 2628 5486
2903 5486 979 861 357 102 104 352 259 485 321 149 107 594 176 369 106 104 401 15 257 718 3897 2584 3590 2155
2678 2155 810 353 429 399 359 370 274 412 318 322 330 246 263 315 344 283 376 336 273 305 305 288 340 313 362 309 287 310 268 359 379 270 353
2368 353 407 289 344 350 392 349 427 389 309 438 246 398 721 286 561 700 717 6431 9196 1821 393 364 108 403 350 202
2124 202 542 446 188 182 539 288 3570 22400 24947 5139 1209 927 911 932 901 185 2099 1148 495 801 809 930 482
1908 482 692 818 647 837 705 888 750 721 835 859 848 921 946 1085 935 1038 929 915 1065 1738 1608 3172 3224 4017 5723
1673 5723 12362 11515 9339 8355 8565 3787 3975 3514 2395 2776 3628 3110 2783 6053 4053 6106 7995 17683 45506
1495 45506 37943 243914 137088 18762 9353 7831 5036 3886 7337 3996 4011 3080 2732 2368 2064 2066 1942 1986 1890
1316 1890 1571 1418 1394 1437 1354 1415 1347 1203 1056 1084 1002 1079 948 1010 1074 480 1392 584 860 846 847 765 769 709 698 690 684 651 732 634 610 559
1016 559 552 618 567 577 565 550 511 501 438 520 584 524 476 482 394 468 406 564 440 415 494 68 441 518 479 562 478 467 416 372 395 403 424 524
696 524 387 457 269 467 500 512 879 231 558 305 420 698 434 1257 48 1015 675 1813 9120 10165 18020 12740 10567
480 10567 3351 1252 781 624 356 521 400 474 528 324 391 245 307 348 319 416 327 290 272 274 189 350 319 323 310 251 190 194 289 234
199 234 378 291 285 267 145 167 298 276 367 255 262 230 139 167 280 346 326 291 192 139 176 179 277 354 325 265 162 123 195 222 342 262 370
-111 370 164 188 124 172 274 302 299 336 236 53 61 167 355 298 368 226 259 43 85 243 355 412 409 318 252 37 166 236 364 465
-393D65
##PAGE=	F1=-1153.45
##FIRST=	4405.4455391999963467,	4405.4455391999963467,	0
##DATA TABLE=	(F2++(Y..Y)), PROFILE
4405 619 464 319 107 124 373 468 533 564 498 304 72 139 239 418 468 436 362 220 72 126 251 384 421 420 317 236 134 242
4143 242 239 427 399 323 295 148 118 190 328 368 407 318 203 168 137 224 298 402 278 349 202 144 241 271 339 298 377 274 120 137 189
3851 189 292 339 326 298 248 117 184 264 335 336 308 315 178 154 136 262 325 342 266 295 171 206 220 310 349 335 271 161 251 236 231 349 267
3542 267 309 279 228 180 226 248 308 372 338 273 206 139 259 246 335 270 314 260 234 244 245 294 381 289 298 220 230 210 259 350 331 253 290 229 223 265
3204 265 319 354 351 265 251 334 205 277 379 383 315 351 290 203 294 228 476 336 434 358 475 165 549 296 773 442 738 500 867
2931 867 2221 2555 7762 2695 965 588 36 98 169 338 401 557 86 85 537 110 380 96 169 388 6 272 844 4940
2706 4940 4272 4145 1852 1040 504 501 473 436 450 382 519 405 383 415 320 363 410 451 377 448 417 326 394 406 391 434 432 427 384 378 377 374 458
2396 458 482 371 431 494 368 443 440 508 446 505 497 369 528 367 376 870 379 614 613 924 5837 8480 1527 145 513 117 608
2142 608 523 238 638 388 360 110 986 482 3563 20411 21786 5411 1326 975 1227 1082 1231 468 3203 1291 585
1945 585 979 997 1251 730 934 942 888 1055 941 1083 959 1000 940 1151 1120 1220 1239 1298 1118 1223 1224 1373 1625 2174 2151 766 3426
1692 3426 2738 4395 9112 6637 7113 8322 8791 3831 4902 4796 3385 2986 5008 4252 2227 8663 5095 8605 14037
1513 14037 15126 48172 77897 349829 193145 27174 11877 9563 6537 5787 8385 4937 5181 4078 3362 2999
1363 2999 2776 2725 2652 2565 2388 2088 1813 1849 1824 1783 1862 1713 1518 1410 1390 1326 1388 1254 1314 1345 653 1756 755 1128 1097 1099 970
1110 970 979 892 893 890 878 854 915 800 782 725 732 787 758 752 711 676 632 643 592 685 729 665 584 585 519 576 536 708 554 532 541 222 538 588 603 645
772 645 562 539 478 432 476 480 497 593 443 485 300 472 595 481 974 323 567 275 367 810 887 1228 101 714 331 1212 2522
518 2522 4717 9426 9194 6767 2664 1069 743 557 392 718 479 605 646 338 468 325 402 496 456 531 407 345 321 380
293 380 313 490 433 428 398 294 252 290 420 367 483 380 330 303 240 257 437 382 464 317 289 275 231 279 412 458 430 327 226 195 282
2 282 304 385 467 396 299 181 164 317 357 455 386 408 189 171 208 298 427 415 393 365 241 95 183 306 488 420 444 268 219 99 224
-290 224 411 520 543 494 333 199 99 315 405 552 625
-393F25
##PAGE=	F1=-1172.23
##FIRST=	4405.4455391999963467,	4405.4455391999963467,	0
##DATA TABLE=	(F2++(Y..Y)), PROFILE
4405 461 271 119 69 253 413 431 459 443 329 188 89 239 286 403 412 332 248 123 117 213 283 359 366 322 234 156 204 291 247 414 331
4114 331 255 202 172 174 230 336 328 338 256 181 167 185 272 290 362 233 281 169 154 286 278 332 252 316 238 121 179 227 298 300 288 238 208 152
3795 152 199 294 351 302 264 266 173 186 173 293 304 312 222 245 133 224 239 323 319 322 218 109 255 270 252 336 248 278 234 200 210 234 290 279
3476 279 350 308 240 234 167 282 265 310 249 271 221 230 277 266 290 362 262 257 207 244 251 277 347 301 230 249 224 238 301 315 352 331 251 212 344
3147 344 228 284 387 369 293 324 300 263 283 248 447 354 379 385 461 270 563 352 764 438 780 675 617 3529 2058 10040 4674
2894 4674 932 963 28 114 64 370 397 612 114 121 370 115 302 38 214 400 95 389 734 5573 5625 4797 1409 1077
2668 1077 626 483 478 435 412 382 483 382 346 406 326 366 400 424 356 394 406 296 385 408 380 397 431 368 366 390 353 374 419 454 342 385
2368 385 469 349 445 411 478 414 444 486 322 491 360 283 778 361 576 379 841 3817 5939 998 367 637 163 664 641
2133 641 302 609 335 596 412 1345 644 3330 10737 7943 5180 1064 613 1509 822 1090 351 2586 802 629 934
1936 934 866 1109 776 924 802 883 988 888 990 893 1044 784 1122 1063 1138 1148 1175 1034 1126 1224 1416 1616 1786 1785 1130 5320 3952
1682 3952 3416 5550 2724 4869 7192 7619 4034 5262 5178 3470 1856 4973 4346 2714 8592 5476 9317 16017 8505
1504 8505 32365 88906 315611 180805 24405 10138 9312 7137 6254 6537 4682 4623 3828 3060 2958 2822 2613 2668
1335 2668 2331 2158 1989 1814 1763 1747 1700 1772 1581 1393 1377 1350 1304 1332 1167 1236 1248 606 1759 729 1098 1032 1038 885 920 858 876 858
1072 858 829 801 820 744 752 710 737 750 729 697 660 618 596 643 588 658 669 615 522 544 525 565 516 681 488 489 478 348 493 525 588 549 490 466
753 466 435 417 476 460 446 521 372 420 289 453 582 445 904 299 565 184 337 826 1159 1078 151 466 285 858 3461 4814
509 4814 4468 5497 3626 1660 730 592 459 355 810 390 575 588 246 467 362 408 495 428 456 344 317 318 422 331 470
274 470 389 357 361 300 280 323 427 352 410 329 274 294 301 288 442 328 394 256 231 294 288 296 397 398 380 251 215 254 331 316 344 399 326 231 201
-55 201 211 366 366 393 337 292 177 167 274 335 425 348 304 244 197 193 266 327 440 338 319 169 94 215 299 422 468 417 347 164 43
-346 43 213 367 402 494 499
-393D99
##PAGE=	F1=-1191.01
##FIRST=	4405.4455391999963467,	4405.4455391999963467,	0
##DATA TABLE=	(F2++(Y..Y)), PROFILE
4405 96 182 257 340 368 327 201 146 85 170 235 308 325 239 224 153 115 169 196 277 264 215 193 130 132 192 187 307 292 148 245 142 175 136 270
4086 270 254 203 225 168 140 137 282 215 219 239 170 188 131 186 248 210 279 199 215 94 204 217 200 243 210 207 151 143 192 164 238 192 251 262 180
3758 180 188 176 235 232 178 244 181 186 187 190 163 234 211 243 178 252 152 120 254 284 216 227 146 191 185 181 258 200 258 149 223 254 200 282 203 247 206
3410 206 195 169 197 180 247 276 224 194 260 211 195 208 247 254 222 257 199 196 188 223 238 268 232 272 220 233 173 343 235 221 293 270 221 264 305
3081 305 303 234 185 297 286 251 357 388 347 479 298 616 400 687 810 484 4388 1299 11816 6419 739 1323 62 224
2856 224 312 346 516 491 321 282 256 149 191 167 306 489 245 500 423 5849 6749 4812 980 948 748 379 470 370 273 304
2612 304 354 292 315 346 310 289 316 299 275 306 372 277 310 338 289 283 374 284 326 391 289 321 290 358 280 304 400 303 397 333 362 342 342 434 293
2283 293 421 300 198 549 321 477 131 517 1982 2856 795 830 757 295 611 770 480 576 577 788 677 1593 590 3495
2058 3495 6080 10387 6045 514 116 1449 323 552 277 962 186 547 745 454 616 665 653 538 648 708 611 695 663
1842 663 890 539 827 754 780 793 888 834 859 981 1098 1134 933 894 1104 4147 2433 2405 2230 716 3138 5390 5237 4424 5213
1607 5213 4623 2586 2095 4109 4207 2680 6120 5503 7886 11896 6674 38198 85708 177390 97569 16756 8496
1448 8496 9037 7086 5062 5076 3093 2995 2904 2469 2583 2373 1837 2154 1565 1568 1581 1528 1438 1376 1221 1298 1172 1074 1125 1108 1047 1018 841
1194 841 920 925 625 1455 675 846 742 783 656 733 728 725 670 615 583 553 585 624 590 612 569 542 476 539 500 487 547 473 466 466 467 415 438 467 471
865 471 370 510 314 381 386 408 504 364 459 332 334 340 345 385 415 352 301 332 266 320 306 432 443 455 675 141 587 206 354 883 1220
574 1220 781 56 270 256 759 4205 4721 3035 2214 1872 583 282 473 362 198 780 161 461 464 230 432 378 311 359
349 359 290 276 260 313 314 394 253 302 262 193 299 347 291 290 307 229 215 250 248 302 323 233 313 156 230 220 223 314 298 206 246 182 271 215 272 303
11 303 304 207 161 188 251 212 287 239 317 241 179 194 156 289 238 294 261 261 153 124 194 267 302 278 215 212 99 118 201 205 335 292 256 196 53
-318 53 181 235 292 354 329 233 201 99
-393I9
##PAGE=	F1=-1209.79
##FIRST=	4405.4455391999963467,	4405.4455391999963467,	0
##DATA TABLE=	(F2++(Y..Y)), PROFILE
4405 489 632 639 599 456 250 205 267 379 550 522 504 378 171 39 204 374 435 431 413 265 118 108 183 330 407 359 380 246 58
4133 58 2 247 357 344 388 308 125 49 191 201 282 463 288 223 147 75 136 287 298 405 278 228 87 125 201 308 333 312 297 154
3851 154 91 131 194 341 257 338 168 167 129 224 289 268 356 283 160 163 114 192 328 289 281 243 163 146 89 309 275 268 283 286 165 136 174 253
3532 253 301 260 318 164 197 125 152 339 279 369 252 186 155 160 231 292 259 315 267 166 115 235 308 281 285 272 254 160 199 238 313 269 284
3222 284 259 211 153 263 202 332 275 373 272 138 194 242 279 327 368 343 229 177 96 285 263 389 338 418 370 240 416 458 604 893
2941 893 597 4695 604 12654 7502 559 1535 116 369 514 334 642 373 498 477 398 179 212 367 445 598 388
2734 388 631 346 5747 7643 4169 658 769 850 246 529 321 169 301 333 284 433 351 345 252 291 278 304 394 432 376 289 315
2480 315 277 313 423 378 391 467 314 365 295 399 396 390 431 367 408 385 380 437 417 503 416 482 369 173 641 418 448 454 140 2318 752
2189 752 1112 1236 929 544 624 930 749 692 913 931 839 1774 420 3705 15696 25111 7417 183 289 971 293 200
1983 200 709 914 822 339 678 530 320 686 412 561 550 627 607 648 717 834 683 681 719 763 810 1000 940 945 918 930 913 1018 1325
1711 1325 1245 1981 558 1536 1185 1314 2545 3947 2370 4669 5062 3666 1277 5134 4745 5730 1169 11461 5624
1532 5624 5559 3748 8469 70328 127073 272183 54126 31288 14587 10889 7161 3432 7570 661 3593 3518
1382 3518 3181 2748 2307 1555 2165 1739 1923 1864 1500 1680 1376 1144 1298 1347 1319 1224 1164 1047 998 970 1021 974 1024 1202 894 805 732
1128 732 848 806 839 832 738 670 637 654 627 705 706 631 589 561 553 518 682 632 552 548 487 400 483 551 573 515 509 464 346 430 435 497 485 445 703 353
790 353 408 386 427 459 402 451 402 312 314 322 419 401 433 455 242 521 454 199 683 440 453 1075 1246 530 165 252 159 754 3640 3669
509 3669 3449 646 1780 467 268 558 366 105 721 252 520 523 423 437 412 224 268 310 354 394 422 360 343 208 192 335
264 335 319 391 452 310 246 170 255 287 377 390 365 320 153 179 243 311 394 357 346 279 95 161 179 380 386 402 326 230 86 152 240 412 374
-45 374 396 233 201 93 222 324 367 464 327 261 117 84 292 340 452 428 376 225 54 131 338 410 462 419 416 244 24 171 397
-318 397 539 593 570 482 293 214 282 405
-393D05
##PAGE=	F1=-1228.57
##FIRST=	4405.4455391999963467,	4405.4455391999963467,	0
##DATA TABLE=	(F2++(Y..Y)), PROFILE
4405 800 887 839 709 460 280 431 539 669 801 682 576 369 174 234 446 594 607 562 455 226 131 264 398 521 560 455
4161 455 382 183 176 177 432 504 492 431 308 48 92 356 367 421 564 311 200 64 191 293 434 417 492 305 161 104 204 349
3898 349 455 429 359 312 112 129 259 342 461 339 386 137 118 100 356 401 390 424 297 142 143 211 312 442 388 356 238 142 160
3626 160 201 418 379 363 305 278 155 197 279 361 410 328 346 168 174 253 233 443 359 426 281 150 190 247 337 414 335 368 258 155 179
3335 179 318 413 385 337 297 265 167 249 355 426 365 335 281 190 169 343 300 424 373 404 316 120 224 315 385 429 430 363 278 295 82 380
3035 380 388 464 332 498 312 334 310 549 652 957 781 4593 622 12377 7641 493 1496 261 463 586 298 643
2828 643 416 521 590 506 177 277 491 528 584 423 722 672 5195 8110 3665 364 660 840 139 598 321 223 388 420
2603 420 335 547 399 381 297 335 373 383 519 509 459 325 357 342 419 511 489 470 538 369 454 406 507 518 501 493 451 446 481 484 559 522 612
2293 612 506 561 460 142 941 493 510 701 197 2704 856 1235 1488 1062 750 724 986 936 828 1087 1016 855 1872 345
2067 345 3248 20194 30528 7763 834 509 328 474 579 866 1253 1104 257 741 924 556 822 568 713 744 806
1870 806 867 859 934 926 918 846 977 1069 1120 1295 1136 1243 1088 1116 1249 1614 2049 1496 1527 2418 943 2282 1777 2491 3452 192 4226
1617 4226 4683 3058 673 7354 6499 8607 11051 24710 5734 4283 9218 9188 79069 188501 445224 125290
1466 125290 48244 20416 12487 7467 3575 8328 2753 5208 4814 4225 3208 2767 2220 2747 2490 2630 2439 1800 2110
1288 2110 1703 1554 1741 1822 1749 1534 1428 1286 1274 1342 1384 1286 1320 1244 1096 1024 985 1125 1097 1072 1034 885 841 846 896 892 923 892 767 696
1006 696 715 749 739 888 821 686 641 614 544 669 731 768 661 600 543 478 530 649 664 609 497 838 507 483 598 599 628 508 534 447
725 447 385 448 476 589 528 531 476 166 534 441 343 783 567 545 1174 1370 517 359 352 139 606 2963 2663 3856 1612 1972 898
471 898 616 639 410 226 716 435 679 659 545 453 436 258 348 438 530 530 505 401 311 259 316 475 497 497 509 313 239 198 389 482
189 482 504 504 405 303 159 224 409 474 527 446 353 256 143 287 372 530 512 479 308 172 171 321 436 557 487 439 199 104 177 424
-92 424 497 538 541 360 199 60 218 491 534 624 509 378 145 141 347 573 627 613 518 419 204 225 422 678 792 783 698 519 296
-365 296 379 561 730
-393G30
##PAGE=	F1=-1247.35
##FIRST=	4405.4455391999963467,	4405.4455391999963467,	0
##DATA TABLE=	(F2++(Y..Y)), PROFILE
4405 708 748 712 579 313 195 387 475 601 699 573 465 280 125 222 418 525 519 490 369 168 101 278 368 466 502 390 301 143
4143 143 194 168 411 441 450 352 261 58 103 364 328 369 503 246 172 65 212 292 388 378 439 267 123 132 208 308 446 383 288 290 108
3851 108 149 247 331 413 295 349 105 136 126 345 352 383 376 250 134 160 216 304 387 363 324 208 146 179 192 410 319 334 276 256 156 214
3551 214 250 348 375 301 316 173 183 263 231 414 321 397 252 144 206 233 333 402 303 347 228 165 195 330 370 367 285 288 262 170 273 356
3250 356 395 340 303 262 197 182 344 313 391 357 380 312 136 261 310 384 423 407 339 298 390 75 428 420 466 282 575 261 477 350
2969 350 529 714 1004 969 4232 1394 11093 6828 347 1182 529 447 478 137 451 413 318 521 420 151 204 442 513 341
2743 341 268 665 908 4152 7851 3922 221 593 628 103 565 288 233 391 380 303 497 365 324 281 294 350 353 478 471 392 290
2490 290 328 315 377 469 427 430 490 325 430 385 466 456 450 427 412 408 433 457 501 448 589 425 479 395 233 1001 359 589 634 403 2780
2199 2780 2400 945 1523 954 764 704 803 932 789 944 990 695 1777 599 2146 18255 25864 6666 1368 1103 415
2002 415 228 541 520 348 953 356 631 953 476 717 624 623 754 746 825 816 864 805 846 823 924 1010 1052 1216 970 1214 1000 1035 1214
1729 1214 1517 1923 1653 1584 3088 692 2043 1818 1746 2826 1223 2776 3648 3008 1295 7082 6820 12046 27258 39634
1541 39634 5825 2602 14231 24892 44517 203094 401331 102329 46561 19704 10938 7297 4208 4890
1410 4890 5690 4776 4558 4079 3027 2788 2471 2524 2413 2486 2265 1841 1915 1640 1541 1682 1746 1639 1458 1367 1232 1244 1275 1335 1245 1153
1166 1153 1237 949 1011 957 1070 1030 1008 987 833 806 804 854 842 869 872 700 695 668 748 696 833 761 638 622 594 537 631 687 714 631 563 523 466
856 466 541 601 617 526 526 769 534 473 590 542 581 472 502 431 387 434 447 545 495 483 412 240 396 464 248 781 430 531 916 1343
574 1343 367 388 352 300 231 2638 2053 3722 1571 1822 761 729 510 356 199 735 345 688 614 453 408 394 269 359 402
340 402 491 479 450 362 280 250 339 432 464 448 440 272 228 219 376 478 434 458 362 266 174 233 372 445 466 389 305 242 156 306 355 494 450
30 450 425 253 158 186 313 416 493 427 372 162 101 215 402 460 483 442 310 152 116 218 457 482 553 431 301 99 129 342 527
-243 527 547 531 431 334 121 248 381 589 696 656 582 398 189 309 497 646
-393F46
##PAGE=	F1=-1266.13
##FIRST=	4405.4455391999963467,	4405.4455391999963467,	0
##DATA TABLE=	(F2++(Y..Y)), PROFILE
4405 495 427 369 250 18 145 269 404 447 422 309 232 148 119 248 337 380 367 304 194 132 108 360 293 357 363 232 175 185 194 249 353
4114 353 349 295 216 206 153 202 343 292 276 349 155 173 188 277 288 293 319 316 201 146 208 271 247 380 305 151 271 152 208 272 289 331 219
3804 219 277 110 225 267 299 287 352 278 174 175 234 262 287 287 320 234 198 197 234 216 389 229 273 250 251 204 249 231 361 272 271 285 186 272
3485 272 244 282 361 268 337 190 216 265 231 372 334 256 297 209 245 238 359 280 316 239 294 276 224 351 336 316 279 261 244 258 281 326 356
3175 356 352 312 344 282 250 322 333 388 384 343 343 308 467 157 498 437 429 234 646 206 612 525 464 686 1014 1249 3595 2534 9070
2903 9070 5356 398 727 879 361 311 312 290 274 270 245 175 299 137 275 581 128 83 420 1089 2837 6752 4110 691
2678 691 521 273 336 436 292 336 382 330 411 351 319 308 281 315 346 444 392 425 278 310 338 381 358 453 378 424 436 366 401 410 419 401 412
2368 412 388 408 472 403 483 445 449 563 397 409 387 636 786 412 864 240 853 3586 4313 613 1399 516 690 585 576 876 678
2114 678 560 894 624 1499 1194 1711 12753 15094 4691 1635 2060 770 470 518 282 2038 548 622 694 868 609
1917 609 604 707 829 820 764 794 869 891 781 968 975 973 992 1064 1204 1020 1245 1129 1155 1276 1450 1586 2095 309 2831 1560 1417
1664 1417 2064 1719 2155 2263 1956 2738 3914 3576 3798 5372 16398 47384 52808 7280 4900 10015 44713 43909 136777
1485 136777 171285 126526 28129 15020 8042 7339 5498 8939 8527 4453 3801 3558 2972 2833 3010 1845 2634 2354
1316 2354 1903 2018 1738 1709 1708 1702 1675 1514 1423 1354 1287 1324 1267 1265 1261 997 1246 932 1027 1057 1017 984 981 941 827 846 824 872 819 858 861 629 806
1006 806 668 801 691 790 682 640 658 625 613 638 693 649 621 572 569 488 683 502 605 494 586 791 498 582 546 504 525 507 499 469 465
715 465 487 451 525 492 445 402 413 366 585 339 747 249 475 443 842 435 434 475 556 384 2193 1509 2954 640 1382 161 585
462 585 260 252 69 797 88 637 464 269 392 343 292 365 384 370 390 365 301 290 289 353 387 359 372 313 263 270 316 377 406 323 347 313 245
152 245 216 297 322 394 340 298 255 283 226 352 307 429 321 290 220 213 244 337 326 376 298 260 162 209 353 286 402 322 289 223 165 244 281
-158 281 401 385 348 286 181 170 203 344 394 333 375 211 183 99 282 372 363 465 371 289 116 132 253 355 446
-393D46
##PAGE=	F1=-1284.91
##FIRST=	4405.4455391999963467,	4405.4455391999963467,	0
##DATA TABLE=	(F2++(Y..Y)), PROFILE
4405 1150 953 625 317 424 688 886 1111 1071 881 573 261 239 494 751 870 873 759 432 100 222 467 797 773 776 607
4171 607 319 81 340 493 707 737 714 443 268 190 348 563 681 715 598 410 209 230 428 606 655 632 579 378 195 248
3927 248 471 620 627 608 514 227 304 300 488 632 602 596 397 291 188 422 583 600 600 565 359 182 306 452 580 588 566 510 291
3654 291 274 350 477 552 649 522 427 328 318 384 520 559 655 446 423 352 299 492 512 603 600 463 400 240 398 510 535 675 516 428
3373 428 363 306 453 503 624 538 503 423 394 390 453 634 585 544 457 392 346 436 558 564 641 586 469 424 362 495 556 623 637 566 430 471
3072 471 430 627 499 750 651 549 398 714 391 775 831 642 634 984 1620 2745 3828 6721 3713 1028 622 1198 402
2856 402 549 784 730 371 781 143 317 572 476 470 898 684 511 246 1384 2264 5190 3375 1162 599 459 664 469
2640 469 530 695 641 684 798 539 522 573 553 667 717 856 687 659 534 614 646 770 755 806 749 720 678 723 702 815 792 794 775 727 730
2349 730 836 784 911 855 922 864 775 792 813 1155 770 1037 1366 532 1495 4306 5214 1154 1386 459 973 812 977 1106 966
2114 966 779 1035 1128 1398 1917 2533 7341 4829 2733 1743 2923 1266 1285 1240 1203 3997 220 1276 1450 1449 1464 1319 1412
1898 1412 1704 1602 1616 1631 1708 1728 1633 1880 1934 1995 2031 2127 2199 2125 2184 2272 2415 2636 2868 2845 3072 2258 3470 3096 3360 3629 4293
1645 4293 4038 4389 4444 4370 6048 6964 1818 5754 21213 66315 62246 10778 15727 16627 51359 126047 71355 584912
1476 584912 383563 49749 20651 11509 9915 10100 19584 11553 9156 6920 5582 4889 4647 5239 4117 5007 4307
1316 4307 3475 3293 3233 3098 3278 3245 3042 2735 2491 2350 2353 2438 2442 2312 2260 1946 1893 1872 1855 2035 1898 1845 1746 1557 1483 1581 1608 1676 1604
1044 1604 1554 1394 1173 1395 1334 1461 1408 1391 1207 1148 1124 1152 1232 1285 1288 1166 1063 978 1006 987 1266 1050 1122 992 837 1264 811 1102
781 1102 1032 1046 971 910 806 792 878 976 970 993 881 739 686 750 828 1039 957 901 760 614 1012 337 1417 912 937 909 928 1375 1202
509 1202 1798 635 925 832 504 547 426 460 1021 692 910 706 544 568 482 565 700 819 742 695 551 411 466 614 718 805
264 805 701 629 404 406 495 678 771 743 677 512 419 339 458 671 750 773 602 476 318 435 551 733 729 771 545 315 275 404 596
-8 596 765 715 701 487 292 232 467 758 700 812 597 463 197 272 552 752 861 802 581 379 85 372 637 849 876 763
-252 763 638 260 98 447 753 1023 1005 966 710 367 252 621 905 1086 1193
-393 1193
##PAGE=	F1=-1303.69
##FIRST=	4405.4455391999963467,	4405.4455391999963467,	0
##DATA TABLE=	(F2++(Y..Y)), PROFILE
4405 1753 1455 958 571 794 1211 1495 1752 1649 1360 845 369 482 883 1225 1385 1339 1105 589 91 420 835 1213 1221 1165
4180 1165 848 420 59 556 840 1106 1113 1043 628 322 237 581 908 1044 1079 875 531 240 346 683 930 1003 958 804 476
3945 476 226 400 753 946 973 855 713 313 365 491 776 966 905 856 544 334 291 637 865 927 886 765 464 221 465 685
3701 685 884 877 848 681 388 369 528 732 853 921 784 577 401 422 578 804 864 918 642 553 434 463 708 810 874 852 637
3448 637 486 363 581 763 822 946 728 577 465 446 658 769 885 811 691 577 496 533 684 906 842 802 636 523 476 624
3204 624 811 837 899 812 634 527 508 715 800 899 873 771 550 596 595 803 782 985 863 700 566 729 657 902 1075 870 613
2950 613 883 1886 2342 4910 5051 2421 1637 858 1314 547 927 1148 1207 605 1155 403 581 763 774 803 1183 1058 777
2734 777 479 1709 3125 4092 1760 1358 757 780 876 652 792 1030 925 1045 1090 817 735 830 838 999 1082 1192 1013 905 817
2499 817 904 959 1119 1129 1146 1091 992 958 1052 1044 1204 1173 1161 1112 1044 1047 1169 1171 1322 1266 1329 1184 1102 1183 1209 1533 1051 1544 1729 1054 1955
2208 1955 3911 4335 1813 1563 1061 1373 1166 1485 1416 1392 1355 1342 1632 1592 2356 2779 3446 4477 1641 1908 3204 1846 1820
1992 1820 1787 1748 4760 839 1904 2118 2090 2115 2041 2127 2413 2379 2414 2435 2469 2497 2444 2690 2811 2960 3025 3107 3144 3082 3102 3323 3591 3943
1729 3943 4187 4172 3841 4215 4584 4315 5278 5261 6356 6091 6136 6442 6357 7922 9520 6332 8261 23839 77281 67864 15161
1532 15161 29140 44407 42489 161283 212846 1042560 604792 86159 28520 16097 13837 15362 26081 13747
1401 13747 13385 10318 7868 6887 6766 7426 6893 7142 6190 5158 4576 4783 4513 4799 4770 4400 3945 3550 3382 3428 3538 3597 3382
1185 3382 3209 2869 2622 2766 2723 2960 2782 2677 2488 2198 2154 2321 2383 2449 2349 2214 1923 1739 1963 2008 2106 2081 1978 1734 1625
950 1625 1599 1696 1818 1904 1833 1676 1486 1378 1450 1492 1792 1602 1588 1422 1074 1732 1234 1593 1549 1546 1397 1242 1111 1127 1289 1440 1453
696 1453 1422 1222 1015 971 1056 1252 1460 1436 1055 1185 813 1694 1488 2344 1406 1316 1147 1196 565 1405 972 1578 908 1468 740
462 740 891 673 831 1281 1184 1246 1034 825 736 702 882 1070 1238 1134 992 744 566 691 953 1102 1206 1054 870 543 568
227 568 755 1036 1164 1108 1002 699 532 501 741 1038 1158 1135 861 636 407 630 889 1109 1125 1107 765 398 368 646 955 1165
-17 1165 1100 1013 673 345 367 757 1143 1138 1194 877 615 195 460 876 1193 1308 1181 859 467 120 637 1062 1335 1366 1174 867
-261 867 366 279 814 1230 1608 1604 1464 1041 563 578 1090 1519 1781 1898
-393 1898
##PAGE=	F1=-1322.47
##FIRST=	4405.4455391999963467,	4405.4455391999963467,	0
##DATA TABLE=	(F2++(Y..Y)), PROFILE
4405 1420 1081 629 556 982 1394 1529 1631 1402 1055 496 255 727 1048 1249 1292 1125 809 270 203 644 978 1199 1111 958
4180 958 558 138 289 737 940 1067 968 831 367 100 406 720 959 990 929 656 297 159 508 789 933 916 801 586 293
3945 293 318 535 835 924 866 672 531 171 451 608 822 918 780 689 350 330 394 716 857 879 733 592 335 234 568 737
3701 737 868 769 714 503 316 442 612 760 805 802 641 435 366 500 620 818 802 784 473 435 419 565 727 813 759 722 485 392
3438 392 435 630 786 773 831 593 423 441 513 694 765 807 696 544 453 491 569 701 879 735 693 494 447 493 668 804 790 791 667
3166 667 527 481 556 729 780 817 731 653 453 561 629 801 729 862 723 571 504 614 754 804 972 728 479 664 1836 2832
2922 2832 5446 5330 1978 1811 713 1076 571 1071 1169 1378 480 1072 267 598 691 788 838 1090 930 585 498 1872 3868
2706 3868 4008 92 1217 597 626 768 592 846 1042 857 977 931 741 653 799 840 971 1028 1062 913 792 763 898 951 1068
2471 1068 1042 1017 961 889 902 1041 1034 1157 1078 1027 977 948 1007 1127 1127 1249 1163 1185 1084 990 1156 1157 1503 875 1425 1520 1033 1834 2959
2199 2959 2497 1870 1410 1132 1272 1029 1437 1293 1363 1344 1245 1447 1352 1995 1739 1851 4985 2258 1694 2595 1887 1657 1553 1377
1973 1377 3719 1284 1867 2007 1956 1912 1997 2097 2235 2290 2264 2267 2256 2320 2338 2548 2664 2811 2812 2835 2858 2858 2892 3184 3461 3772 3811 3741 3275
1701 3275 4355 4086 4179 5114 5006 5787 5476 5384 5775 6118 7531 8769 6753 7212 20844 73808 71531 20887 40445
1523 40445 73162 102365 98509 321267 1011747 583472 79421 20283 15025 16044 16502 23220 11837 11561 9201
1382 9201 6891 6645 6837 7116 7150 6415 5495 4690 4279 4680 4391 4582 4461 3986 3555 3261 3242 3335 3364 3371 3096 2880 2644 2467 2685
1147 2685 2626 2795 2539 2412 2267 2030 2075 2261 2285 2260 2132 1997 1731 1660 1899 1968 1956 1901 1751 1545 1488 1565 1675 1739 1771 1604 1482
894 1482 1334 1311 1439 1472 1672 1458 1359 1235 872 1717 1301 1548 1458 1377 1217 1060 1045 1135 1294 1368 1336 1232 1033 878 964 1056 1227
640 1227 1352 1294 765 1060 777 1808 2383 2524 1381 1141 910 975 523 1550 1124 1712 908 1412 687 897 735 952 1239
424 1239 1151 1090 878 662 681 793 954 1064 1157 986 815 612 599 787 1003 1079 1084 901 670 457 626 852 1070 1107 973 809
180 809 524 507 629 839 1040 1068 968 642 449 468 748 979 1077 1006 920 532 290 492 789 1008 1096 948 782 439 264 559
-64 559 888 1157 1065 1003 617 338 313 662 972 1194 1176 942 586 190 384 844 1165 1290 1207 899 501 139 567 1006 1276
-299 1276 1522 1393 1156 651 396 808 1277 1594 1724 1706
-393 1706
##PAGE=	F1=-1341.25
##FIRST=	4405.4455391999963467,	4405.4455391999963467,	0
##DATA TABLE=	(F2++(Y..Y)), PROFILE
4405 584 878 1129 1243 1166 1073 628 304 333 603 932 1005 1014 782 468 132 237 523 816 878 818 658 397 62 271 606 755
4161 755 782 768 539 258 101 352 635 691 727 625 457 213 185 422 641 656 692 580 373 147 241 442 627 701 595 527 311
3908 311 141 401 446 634 680 566 429 268 222 385 541 709 552 546 339 308 274 451 633 577 591 467 357 215 309 478 596
3654 596 644 555 424 266 250 358 536 651 631 429 394 292 339 442 560 570 614 453 390 235 347 522 567 604 514 467 318 333
3391 333 441 514 603 596 526 381 362 312 506 493 634 558 413 468 315 365 506 572 561 577 444 345 416 391 592 619 604 534 429 370
3110 370 393 497 627 611 596 661 165 383 453 546 576 638 646 517 464 375 811 888 1576 3172 5426 6221 2614 1298 213 815
2865 815 735 833 925 1267 344 747 665 665 568 555 544 616 399 379 466 2068 3471 4227 840 1550 244 507 765 400 867 685
2621 685 556 488 605 709 723 697 660 614 557 605 692 757 698 775 735 691 586 648 628 858 736 853 773 757 672 734 723 814 882 874 767
2330 767 784 772 743 1022 884 950 786 1348 569 714 1021 820 1207 3950 3264 1108 636 754 987 819 951 1027 1172 564
2105 564 1159 735 648 557 1227 3408 2588 4044 263 1997 1498 1583 1448 1028 1329 1324 1504 1645 1706 1531 1709 1668 1619 1703 1627
1870 1627 1762 1755 1943 1938 2032 1932 2044 1916 2059 2206 2446 2453 2490 2505 2536 2468 2610 2915 3781 2829 3721 3421 3303 3539 3714 4547 5076
1617 5076 5452 5678 4681 3440 6702 14952 51990 76515 31649 45229 89359 247678 207543 371327 425344
1476 425344 188607 29011 27466 22571 17789 10901 16909 4500 6102 6742 6365 6614 5607 4322 4895 3849 3915
1316 3915 3886 3751 3915 3369 3009 2789 2779 2814 2797 2736 2603 2305 2143 2076 2152 2191 2172 2120 1880 1834 1594 1696 1869 1814 1740 1623 1556 1354
1053 1354 1436 1534 1596 1493 1502 1359 1177 1200 1250 1307 1321 1371 1249 1115 1024 1001 1110 1219 1234 1191 1043 956 851 940 1049 684 1374 1144
790 1144 963 831 779 953 1000 1033 1026 928 721 741 742 911 912 1010 879 751 687 649 991 813 1038 2665 3350 1906 794 663 697
537 697 957 355 1667 960 1257 127 1223 312 1093 893 842 770 492 574 668 684 855 879 708 550 462 445 665 770 856 777
293 777 633 496 372 534 634 801 775 730 593 428 447 475 733 826 789 634 449 329 373 605 658 817 750 636 403 243 422
39 422 651 788 796 716 528 281 270 445 669 747 799 670 507 168 300 592 691 853 788 599 394 132 375 599 826 886 846
-214 846 640 293 103 505 807 919 1011 842 535 302 268 565 963 1158 1237 1089 815 494 347
-393C47
##PAGE=	F1=-1360.03
##FIRST=	4405.4455391999963467,	4405.4455391999963467,	0
##DATA TABLE=	(F2++(Y..Y)), PROFILE
4405 4265 4306 3893 3101 2012 1481 2042 2914 3579 3686 3405 2562 1469 649 1455 2335 2934 3033 2732 1944 891 334 1378
4199 1378 2228 2638 2749 2287 1491 552 531 1529 2216 2484 2457 1922 1152 257 777 1610 2169 2383 2212 1611 880 281 1076 1746
3974 1746 2152 2213 1970 1387 629 492 1229 1844 2193 2005 1769 1137 541 752 1414 1904 2063 1962 1613 880 562 943 1548
3758 1548 1987 2000 1861 1310 732 652 1184 1741 1916 1940 1628 1167 702 886 1389 1765 1914 1836 1546 1041 694 988 1532 1838
3532 1838 1966 1717 1274 918 813 1207 1683 1845 1913 1600 1177 785 940 1434 1716 1917 1825 1460 1075 896 1126 1563 1819 1951
3307 1951 1673 1378 1024 904 1293 1731 1809 1888 1613 1196 1009 1071 1449 1787 1863 1852 1554 1179 1070 1234 1633 1897 1864 1830 1432
3072 1432 1164 1330 1347 1727 1914 1903 1660 1442 1081 1367 1526 1931 2257 2152 2105 2570 5517 5616 3972 1123 1922 1930 1698 857
2847 857 1635 1954 1933 2112 2299 1626 1537 1333 1442 1723 1992 2109 1711 2992 1781 4556 319 3234 1912 2322 2110 1569
2640 1569 1789 1481 1926 1962 2283 2276 2120 1800 1669 1749 1940 2233 2382 2349 2071 1864 1852 1994 2199 2436 2385 2473 2064 2004 2008 2202 2442
2387 2442 2663 2558 2460 2272 2154 2239 2409 2679 2721 2888 2633 2427 2273 2793 2912 2725 3009 2857 2491 6463 5268 2444 2516
2171 2516 2951 3225 3085 2761 2932 3172 2728 3564 3465 3371 2790 4476 2238 3625 6919 3316 4610 3959 4248 4358 4293 4119
1964 4119 3227 4388 4613 4838 4635 4630 4501 4713 4940 5188 5531 5551 5636 5475 5550 5634 6084 6369 6806 7011 7082 7020 6869 7089 7626
1729 7626 8496 9216 9438 9713 9239 9341 9710 10689 12460 13929 15031 14918 14203 13501 14590 18706 26031 31216 12283 86290
1541 86290 50408 43475 82586 445808 615081 642751 2158482 903007 209967 102178 55576 29266
1429 29266 19595 37552 25352 28563 25044 20773 16745 13419 12579 13380 14242 13955 12697 10809 9835 9013 9036 9336 9606
1250 9606 9205 8347 7396 6878 6845 7034 7265 7190 6693 6065 5566 5391 5621 5828 5912 5732 5245 4690 4366 4597 4801 5049 4980 4745
1025 4745 4156 3808 3750 4016 4345 4457 4254 3840 3404 3194 3384 3663 3968 3900 3666 3230 2855 2838 3099 3462 3681 3527 2826 2654
800 2654 2553 2567 2970 3253 3388 3172 2688 2317 2182 2433 2876 3104 3127 2757 2340 1989 2012 2436 2774 3374 2775 2626 6328 6815
574 6815 4095 2602 2863 2848 2717 1375 2577 724 2635 1927 3324 2245 2589 1911 1494 1578 2063 2554 2701 2488 2085
377 2085 1592 1269 1645 2087 2503 2594 2313 1853 1253 1184 1711 2240 2517 2476 2153 1469 1028 1186 1826 2386 2500 2406 1918 1260 881
142 881 1322 2032 2404 2570 2183 1654 892 832 1560 2184 2484 2537 2102 1369 640 992 1778 2389 2611 2437 1865 1091 357 1129
-83 1129 2024 2556 2765 2401 1739 765 424 1423 2323 2838 2805 2421 1587 535 696 1870 2703 3213 3166 2506 1633 615 1393
-299 1393 2458 3399 3755 3801 3169 2280 1510 1844 2832 3691
-393 3691
##PAGE=	F1=-1378.81
##FIRST=	4405.4455391999963467,	4405.4455391999963467,	0
##DATA TABLE=	(F2++(Y..Y)), PROFILE
4405 9541 9126 7709 5668 3628 3658 5592 7367 8295 8033 6774 4598 2151 2081 4255 5933 6776 6509 5300 3260 898
4218 898 1861 4033 5499 6006 5690 4309 2305 59 2215 4151 5282 5524 4947 3519 1592 707 2650 4199 5100
4039 5100 5138 4344 2830 1067 1288 3104 4346 4925 4695 3795 2258 864 1830 3378 4447 4792 4220 3275 1757 1081
3851 1081 2340 3690 4441 4523 3920 2832 1402 1496 2760 3865 4500 4257 3567 2288 1250 1908 3155 4119 4324 4025 3077
3654 3077 1955 1443 2407 3496 4159 4210 3699 2804 1756 1772 2725 3732 4201 4133 3390 2343 1662 2132 3106 3963 4156 3923
3448 3923 3091 2105 1745 2469 3496 4023 4127 3692 2762 1980 2067 2885 3720 4127 4079 3390 2550 2030 2328 3216 3996 4068 3903 3165
3222 3165 2296 2144 2726 3532 4070 4090 3740 2988 2284 2446 3033 3856 4231 4000 3598 2785 2374 2851 3392 4046 4211 3966 3332
3006 3332 2764 2380 3117 3710 4324 4409 4015 3803 1540 6695 2769 5641 3235 4354 3898 3264 2177 3430 3938 4245 4584
2809 4584 4601 3216 3233 3036 3412 4054 4577 4554 3742 4743 1929 5769 2819 5691 4352 4950 4259 3486 3559 3535 4340 4619
2603 4619 4995 4764 4297 3775 3669 4053 4574 5055 5157 4868 4334 3937 4070 4551 5051 5409 5249 5078 4410 4282 4465 5015 5505
2387 5505 5798 5526 5183 4762 4665 5048 5504 5967 6045 5972 5489 5172 5107 5730 6389 6400 6577 6233 5619 9067 6248 6319 6235 6822 7037
2152 7037 6689 6235 6300 6805 6667 7645 7953 7742 7012 8341 4455 7467 11247 8630 9194 8779 8655 8863 9091 9352 7737
1955 7737 9683 9896 10152 9849 9836 9817 10326 10917 11472 11984 11977 11958 11720 11944 12445 13427 14170 14871 15117 14975 14881 14907 15730 17167 18894
1720 18894 20129 20095 20420 19981 19784 21791 24359 28017 30632 31836 30942 29557 29519 34672 43883 56067 65901 39954 102476
1541 102476 75719 46732 54441 664453 1150425 1296211 5210509 2358025 495792 208925 102548 54247
1429 54247 51815 73679 64482 63978 54563 43493 34181 29230 29536 31194 32052 30445 27137 23065 20780 19833 20556 21201
1260 21201 21140 19757 17665 15747 14999 15374 15927 16157 15588 14259 12814 12042 12040 12705 13098 12967 12203 11003 10013 9760 10360 10934
1053 10934 11174 10738 9883 8741 8246 8498 9192 9755 9714 9020 8039 7166 7100 7744 8418 8807 8427 7643 6665 6126 6412 7218 7843
837 7843 8016 7442 6140 5558 5460 6022 6879 7341 7256 6550 5466 4817 4970 5811 6606 6890 6558 5612 4645 4268 4744 5779 6386
621 6386 6847 5913 5131 12145 13803 9614 6237 6450 6156 5398 3671 4250 2938 5629 5167 6731 5279 4917 3628 3179
433 3179 3895 5054 5802 5817 5127 3981 2981 3004 4129 5098 5696 5498 4583 3383 2451 3064 4321 5338 5573 5150 4075
236 4075 2640 2228 3265 4597 5465 5469 4792 3483 2126 2224 3633 4976 5506 5374 4309 2821 1547 2454 4116 5233
48 5233 5575 5176 3877 2141 1304 2967 4589 5553 5683 4879 3336 1433 1446 3459 5078 5877 5794 4687 2829 627 2023
-149 2023 4131 5712 6337 5847 4515 2374 317 2790 5070 6485 7006 6357 4579 2363 1649 4174 6412 7968 8278
-327 8278 7677 5884 3873 3354 5158 7328 8875
-393 8875
##PAGE=	F1=-1397.59
##FIRST=	4405.4455391999963467,	4405.4455391999963467,	0
##DATA TABLE=	(F2++(Y..Y)), PROFILE
4405 15525 14512 11909 8458 5612 6544 9837 12543 13686 12920 10473 6748 2969 4082 7602 10115 11152 10389 8094
4236 8094 4586 1005 3800 7172 9282 9828 8949 6480 3066 686 4288 7228 8806 8956 7696 5204 1947 1755
4067 1755 4914 7229 8453 8226 6675 4090 1257 2689 5525 7363 8085 7459 5773 3145 1388 3530 5920 7442
3898 7442 7735 6690 4887 2410 2013 4282 6351 7355 7294 6075 4132 2028 2800 4926 6573 7356 6792 5431 3331
3720 3331 2028 3507 5491 6862 7064 6344 4663 2841 2500 4270 5962 6908 6806 5770 4172 2620 3148 4815 6295
3542 6295 6899 6563 5237 3532 2653 3773 5372 6586 6788 6167 4735 3182 2995 4346 5909 6674 6634 5762 4223 3082
3354 3082 3548 4993 6232 6764 6474 5296 3875 3271 4068 5505 6608 6653 6162 4897 3582 3575 4719 5977 6702 6610 5858
3157 5858 4604 3620 4131 5190 6435 6893 6431 5576 4324 3856 4708 5792 6725 6836 6306 5220 4269 4052 5192 6267
2969 6267 7053 6888 6102 5885 2962 8756 2533 7243 6047 7102 6106 5079 4021 5552 6474 6938 7398 7177 5070 5194
2781 5194 5070 5775 6785 7513 7318 6134 6773 5307 7814 6900 8325 7203 7905 6693 5698 5683 6023 7160 7720 8089 7616
2584 7616 6778 6076 6055 6782 7665 8308 8348 7743 6933 6387 6708 7564 8368 8836 8527 8051 7137 6978 7389 8327 9064 9397 8920 8308
2358 8308 7665 7631 8353 9132 9782 9862 9518 8761 8379 8438 9282 10346 10664 10670 10131 9283 11760 6837 11097 10650 11411 11462 10844 10286
2133 10286 10234 11095 11306 12469 13132 12763 11785 12117 14081 12178 16718 14898 14402 14447 13716 13896 14466 14844 13741 15975 16083
1936 16083 16263 15845 15894 16081 16880 17943 18811 19460 19406 19266 18995 19432 20425 22009 23239 24190 24466 24111 23993 24325 25885 28335
1729 28335 30898 32638 32563 32752 32140 32252 35869 40497 46001 49785 51022 49151 47298 48547 58246 73496 90971 105993
1560 105993 95359 123121 102944 69181 58858 862293 1709674 2177432 8813169 4069730 833581 329524
1448 329524 151905 87038 93229 110316 114799 104201 88393 69430 54549 48245 49722 52567 52648 49425 43745
1307 43745 37478 33517 32702 34138 35045 34475 31895 28430 25518 24590 25406 26314 26470 25265 22986 20680 19652 19888 21006
1128 21006 21533 21106 19658 17654 16249 16142 17140 18073 18254 17366 15781 14075 13489 14125 15243 16030 15755 14481 12869 11597
941 11597 11749 12885 13961 14369 13615 12200 10650 10013 10663 12047 12920 12971 11899 9964 9000 8986 10127 11450 12047 11670 10372
743 10372 8663 7790 8328 9784 10937 11220 10450 8839 7322 7006 7985 9672 10540 10790 9438 8040 19124 23518 16641
565 16641 10616 10623 9975 8409 6443 6143 5978 9016 9176 10396 8887 7481 5616 5292 6723 8548 9541 9363 8078 6110
377 6110 4669 5187 7099 8607 9347 8776 7112 5104 3998 5391 7416 8912 9061 8141 6190 4000 3838 5804 7849
199 7849 9004 8824 7438 5195 3209 4003 6396 8391 9049 8510 6636 4081 2555 4526 7137 8754 9087 8103 5790
20 5790 2961 2471 5383 7871 9187 9131 7568 4886 1804 3011 6251 8633 9662 9176 7154 3918 682 4013 7340
-158 7340 9619 10297 9227 6744 3092 1238 5344 8823 10836 11275 9858 6776 3074 3329 7525 11024 13196 13382
-327 13382 11943 8814 5695 5847 9180 12608 14853
-393 14853
##PAGE=	F1=-1416.37
##FIRST=	4405.4455391999963467,	4405.4455391999963467,	0
##DATA TABLE=	(F2++(Y..Y)), PROFILE
4405 21013 19373 15630 10887 7499 9417 13913 17409 18671 17356 13748 8567 3745 6120 10831 14047 15184 13888
4246 13888 10542 5640 1333 5753 10177 12820 13336 11867 8352 3604 1524 6341 10148 12087 12087 10144 6628 2132
4077 2132 2871 7121 10092 11556 11022 8727 5127 1443 4118 7850 10194 10998 9944 7497 3856 2025 5217 8346
3908 8346 10229 10426 8911 6270 2944 3014 6174 8862 10061 9812 7984 5236 2616 4115 7006 9118 9980 9085 7066
3729 7066 4222 2835 5084 7711 9418 9580 8421 6053 3626 3574 6071 8286 9457 9172 7619 5360 3431 4500
3560 4500 6821 8699 9382 8764 6872 4581 3633 5369 7530 9024 9202 8186 6184 4163 4221 6161 8180 9128 8925
3382 8925 7610 5524 4123 4984 7010 8584 9192 8643 6994 5063 4451 5746 7671 9034 9035 8199 6444 4761 4957 6622
3194 6622 8282 9139 8907 7760 6055 4879 5739 7249 8839 9337 8651 7348 5710 5270 6476 8066 9214 9252 8434 6922
3006 6922 5630 5688 7149 8671 9555 9196 7984 7712 5382 10594 7888 8430 8750 9621 8094 6746 5871 7469 8868 9510
2819 9510 9946 9481 6840 6992 6985 8024 9341 10188 9857 8391 8520 8562 9766 11283 10566 9900 10577 8893 7736 7676 8387 9795
2612 9795 10622 10925 10230 9040 8202 8305 9351 10564 11316 11285 10372 9314 8672 9190 10389 11459 12006 11538 10759 9657 9492
2415 9492 10146 11431 12377 12710 12031 11175 10351 10402 11449 12523 13326 13376 12771 11760 11348 11557 12659 13978 14627 14409 13716 12662
2208 12662 14639 8136 15720 14805 15731 15538 14674 14037 13906 15110 15677 17000 17901 17357 16180 15330 24001 16682 22152 20650
2020 20650 19221 19629 18356 18425 19315 19742 19825 21876 21857 21855 21372 21480 21917 22989 24502 25645 26368 26262 25994 25733 26406 27866
1814 27866 29992 31661 32797 33076 32542 32402 33082 35364 38734 41999 44127 44225 43966 43165 44029 48933 55654 62656 67374
1635 67374 68519 65682 63540 66390 80378 101395 123549 142371 143005 143091 126109 102892 125682 997615 2172024
1495 2172024 3081907 12234938 5691374 1157160 440020 191448 120464 134677 139651 166824 140979 119329
1382 119329 93120 73481 66232 68841 72687 71773 66965 59005 50919 45266 44866 46887 47947 46817 43065 38352 34596
1222 34596 33570 34801 36003 36036 34188 31022 27971 26741 27254 28758 29373 28621 26515 23778 22048 22130 23489 24722 24804
1044 24804 23462 21189 19012 18389 19416 20898 21859 21315 19487 17296 15723 16124 17711 19127 19503 18373 16367 14318
875 14318 13655 14672 16568 17639 17522 15962 13483 12186 12338 13993 15726 16399 15703 13835 11584 10568 11514 13517 14965
696 14965 15197 13989 11753 9774 9584 11035 13295 14365 14401 12586 10754 26062 34438 23738 14850 14539 13522 11158
527 11158 8984 7882 9001 12067 13141 13484 12281 9707 7425 7318 9434 11823 13004 12607 10729 8013 6256 7305
358 7305 9931 11894 12711 11752 9373 6639 5504 7641 10353 12236 12266 10836 8054 5234 5434 8254 10918 12279 11882
180 11882 9796 6685 4248 5776 9045 11584 12313 11338 8680 5160 3606 6566 10008 12037 12306 10719 7441 3649
11 3649 3717 7732 10967 12560 12255 9956 6188 2143 4613 8942 11977 13150 12226 9298 4773 1132 6000 10414 13263
-167 13263 13922 12255 8650 3580 2338 7856 12386 14886 15160 12956 8642 3622 5091 10779 15377 18034 18037 15728
-337 15728 11352 7345 8338 13068 17613 20427
-393 20427
##PAGE=	F1=-1435.15
##FIRST=	4405.4455391999963467,	4405.4455391999963467,	0
##DATA TABLE=	(F2++(Y..Y)), PROFILE
4405 24771 22614 18034 12401 8837 11602 16902 20874 22132 20340 15861 9643 4287 7724 13219 16846 17965 16221
4246 16221 12092 6182 1759 7284 12377 15317 15742 13786 9500 3796 2280 7913 12255 14387 14213 11738 7468 2100
4077 2100 3794 8777 12143 13712 12894 10035 5702 1585 5251 9558 12201 13006 11588 8575 4225 2573 6506 10110
3908 10110 12180 12256 10379 7110 3228 3821 7586 10658 11949 11509 9215 5887 3019 5129 8536 10923 11778 10618
3739 10618 8098 4754 3453 6278 9314 11209 11303 9785 6924 4120 4397 7397 9944 11231 10773 8825 6091 3987
3570 3987 5512 8286 10400 11087 10235 7922 5244 4352 6555 9086 10726 10850 9520 7105 4810 5129 7497 9793 10831
3391 10831 10479 8814 6362 4848 6038 8473 10245 10863 10093 8097 5834 5287 6976 9220 10728 10672 9550 7449 5554
3213 5554 5960 8002 9921 10829 10461 9012 7004 5760 6891 8743 10521 11011 10155 8506 6617 6281 7745 9700 10947
3035 10947 10911 9861 8043 6529 6898 8538 10384 11257 10814 9233 8811 7133 11302 12274 8968 10711 11352 9433 7875
2856 7875 7285 8733 10495 11418 11656 10970 8184 8204 8336 9646 11145 11986 11607 9996 9556 10828 10912 14785 11890 11828 12352
2659 12352 10348 9129 9063 10083 11639 12667 12858 12003 10562 9660 9897 11169 12611 13394 13294 12152 10928 10262 10939 12380
2471 12380 13620 14197 13597 12580 11389 11240 12099 13613 14687 14984 14148 13126 12198 12339 13623 14902 15787 15786 14981 13800
2283 13800 13393 13752 15067 16472 17387 16939 16151 15001 17157 9463 19075 17696 18756 18299 17290 16625 16477 17909 18764
2105 18764 20162 21136 20437 19271 17569 30223 18594 26032 24356 22651 23066 21505 21460 22528 23169 24395 25972 25885 25636
1926 25636 25179 25293 25962 27254 29072 30395 31113 30968 30590 30370 31257 33051 35531 37499 38718 38969 38318 38165 39149 41976
1739 41976 45973 49674 51983 52331 51478 50588 52329 58020 66302 74190 79375 80286 76753 74515 78914 96047 121140 146288
1570 146288 166687 173338 156061 139583 133669 197655 1039865 2429477 3794000 14700603 6855566 1394647
1457 1394647 516077 210787 146989 166270 157940 206914 166169 140154 109093 86588 78916 82476 86656 85112
1326 85112 79093 69396 60141 53372 53511 55865 56948 55344 50708 45145 40875 39858 41394 42778 42656 40310 36514 32996
1156 32996 31668 32438 34178 34823 33789 31195 27958 26063 26339 27943 29359 29326 27624 24860 22405 21810 23149 24864 25907
978 25907 25123 22885 20297 18581 19209 21113 22736 23036 21610 19181 16815 16202 17512 19747 20921 20634 18698 15850 14400
800 14400 14724 16727 18733 19405 18429 16143 13548 12496 13786 16157 17765 17914 16361 13679 11423 11394 13189 15817 16981
621 16981 16856 14617 12653 31659 44521 29375 17995 17316 15979 13043 10623 9190 11222 14176 16098 15364 14579
462 14579 11098 8624 8771 11407 14138 15408 14812 12477 9250 7357 8862 11978 14217 15025 13750 10848 7624 6600
293 6600 9295 12465 14561 14463 12622 9240 6046 6628 10056 13112 14546 13953 11329 7608 4982 7123 10980 13837 14563
114 14563 13219 9977 5804 4419 8106 12083 14341 14505 12431 8451 4038 4718 9481 13183 14913 14348 11501 6944
-55 6944 2367 5882 10928 14357 15554 14253 10632 5198 1681 7541 12662 15824 16397 14248 9801 3725 3311 9765
-224 9765 14960 17722 17784 14954 9756 3886 6510 13206 18493 21394 21194 18182 12924 8438 10232 15943 21219 24344
-393 24344
##PAGE=	F1=-1453.93
##FIRST=	4405.4455391999963467,	4405.4455391999963467,	0
##DATA TABLE=	(F2++(Y..Y)), PROFILE
4405 25909 23466 18550 12645 9295 12569 18093 22116 23248 21164 16310 9725 4449 8506 14198 17844 18834 16837
4246 16837 12376 6084 2092 8027 13251 16178 16474 14249 9653 3597 2776 8629 13047 15160 14828 12096 7524 1858
4077 1858 4300 9487 12890 14409 13394 10290 5676 1627 5813 10239 12903 13631 11999 8751 4161 2869 7087 10793
3908 10793 12830 12786 10745 7204 3183 4227 8176 11310 12568 11980 9471 5926 3123 5591 9150 11556 12323 11023
3739 11023 8277 4797 3713 6798 9916 11807 11823 10109 7064 4195 4756 7927 10537 11807 11226 9097 6185 4141
3570 4141 5936 8859 10991 11608 10624 8133 5357 4619 7043 9665 11287 11339 9851 7274 4955 5494 8031 10361 11377
3391 11377 10923 9084 6528 5070 6451 9027 10814 11376 10474 8340 5996 5566 7459 9778 11282 11172 9889 7667
3222 7667 5758 6331 8524 10499 11365 10899 9312 7217 6040 7303 9313 11075 11511 10578 8766 6819 6639 8206 10300
3044 10300 11508 11414 10238 8309 6743 7380 9023 11003 11742 11352 9549 8912 7671 10476 14144 8817 11462 11878 9821
2865 9821 8186 7907 9052 10916 12221 12140 11270 8834 8512 8784 10254 11763 12452 12154 10557 9660 11625 10999 16527 11959
2678 11959 12504 12797 10706 9536 9497 10700 12241 13359 13418 12502 10972 10094 10438 11794 13315 14041 13889 12647 11379 10765
2490 10765 11526 13054 14330 14879 14209 13066 11911 11792 12771 14347 15434 15670 14759 13687 12757 12971 14345 15695 16568 16513
2302 16513 15610 14387 14018 14493 15895 17243 18277 17656 16840 15761 18466 9466 20287 18583 19728 19054 18044 17420 17321
2124 17321 18795 19809 21158 22034 21238 20387 18456 30346 16675 27201 24986 23908 23923 22385 22297 23315 24382 26184
1955 26184 27230 27179 26686 26348 26404 27224 28632 30533 31894 32541 32378 31932 31773 32792 34714 37276 39334 40515 40711 40023
1767 40023 39872 41037 44108 48295 52076 54313 54821 53496 52662 55055 60955 69821 77817 82888 83453 79684 77549 83056
1598 83056 101473 127900 153578 173143 180850 156817 139705 151196 248290 978749 2419540 4135084 15615882
1476 15615882 7281632 1489671 540190 204873 160173 179427 166219 220711 174119 145777 113425 90579
1363 90579 83038 87253 90857 89465 82887 72384 62704 55943 56483 58866 59863 57988 52969 47144 42808 41904 43568 44992
1194 44992 44720 42143 38118 34515 33224 34168 35943 36558 35354 32556 29168 27305 27740 29412 30855 30723 28837 25892
1025 25892 23420 22907 24408 26176 27191 26250 23846 21135 19464 20246 22257 23911 24110 22541 19953 17525 17021 18483
856 18483 20813 21969 21554 19439 16456 15130 15546 17662 19740 20338 19185 16732 14067 13094 14585 17063 18657 18714 16987
678 16987 14142 11854 11981 13922 16626 17743 17553 15028 13276 34813 51637 32266 19307 18283 16734 13612 10933
518 10933 9808 12055 14925 17216 15785 15095 11377 8920 9293 12165 14942 16180 15447 12904 9519 7693 9477 12746
349 12746 15023 15739 14293 11183 7815 7002 9953 13243 15332 15125 13073 9459 6227 7119 10773 13908 15259 14544 11666
171 11666 7739 5213 7710 11737 14611 15261 13701 10215 5851 4775 8771 12863 15117 15161 12829 8575 4023 5214
2 5214 10208 13989 15684 14910 11834 6971 2399 6509 11736 15205 16303 14773 10844 5090 2089 8268 13550 16693
-167 16693 17134 14730 9925 3492 3921 10616 15933 18670 18522 15378 9855 3806 7240 14228 19632 22479 22105 18722
-337 18722 13160 8705 11065 17119 22569 25676
-393 25676
##PAGE=	F1=-1472.71
##FIRST=	4405.4455391999963467,	4405.4455391999963467,	0
##DATA TABLE=	(F2++(Y..Y)), PROFILE
4405 24154 21731 17061 11562 8756 12085 17198 20841 21750 19633 14991 8799 4178 8278 13532 16803 17582 15591 11326
4236 11326 5374 2199 7804 12589 15195 15357 13145 8773 3056 2892 8316 12333 14217 13785 11129 6782 1461 4266
4067 4266 9078 12149 13479 12401 9428 5054 1522 5669 9730 12127 12722 11077 7980 3676 2820 6819 10228 12022
3898 12022 11885 9918 6529 2807 4121 7799 10660 11769 11112 8688 5336 2883 5382 8698 10862 11481 10202 7556
3729 7556 4334 3537 6513 9372 11063 11014 9313 6435 3819 4553 7528 9917 11047 10420 8365 5613 3840 5661 8397
3551 8397 10324 10816 9831 7455 4885 4354 6708 9123 10567 10549 9096 6644 4552 5217 7631 9740 10633 10143 8352
3373 8352 5974 4721 6118 8532 10151 10605 9690 7659 5501 5210 7072 9207 10560 10411 9132 7041 5315 5972 8059
3194 8059 9872 10612 10115 8584 6636 5641 6865 8816 10365 10717 9815 8058 6260 6249 7745 9716 10756 10637 9465
3016 9465 7652 6214 7007 8483 10382 10882 10677 8854 8004 7037 8232 12854 8177 10819 11049 9170 7597 7558 8366 10009
2828 10009 11716 11309 10307 8661 7804 8200 9692 11035 11441 11358 9933 8845 10817 10115 16190 10725 11741 11798 9876
2650 9876 8856 8857 10087 11447 12526 12461 11595 10160 9390 9787 11065 12499 13094 12916 11727 10550 10047 10797 12239 13409
2462 13409 13880 13222 12088 11085 11005 11988 13444 14426 14594 13708 12711 11879 12131 13425 14700 15469 15375 14494 13367 13059 13590
2265 13590 14902 16105 17078 16389 15610 14768 18053 7834 19000 17235 18397 17604 16739 16221 16216 17532 18549 19726 20375
2086 20375 19559 19317 17699 24614 12495 25342 22378 22658 22038 20751 20720 21465 23040 24714 25328 25396 24736 24575 24528 25384
1898 25384 26757 28514 29755 30288 30128 29670 29578 30604 32426 34777 36699 37730 37855 37204 37080 38256 41213 45116 48594
1720 48594 50531 51001 49538 48876 51454 57004 65313 72622 77037 77217 73717 71865 77740 95288 119965 143490 160181
1560 160181 165530 143134 125900 150010 263602 827445 2144858 4015449 14753590 6863821 1419009
1457 1419009 507093 176481 156351 169485 171953 198374 163399 134912 104953 84239 77370 81891 84163 83714
1326 83714 77365 67203 57800 52374 52946 55103 55953 54075 49263 43819 39874 39162 40753 42075 41698 39211 35413 32125
1156 32125 30995 31991 33596 34132 32914 30242 27085 25441 25967 27515 28829 28637 26790 24009 21782 21391 22865 24499
987 24499 25382 24408 22119 19588 18133 18963 20846 22354 22450 20927 18477 16254 15893 17333 19493 20514 20047 17987 15145
809 15145 14197 14579 16553 18495 18964 17772 15448 12996 12198 13700 16002 17410 17391 15702 13014 10943 11181 13044 15519
631 15519 16446 16313 13703 12453 34909 54143 31738 18466 17197 15584 12698 9862 9525 11301 14171 16058 14902
471 14902 13581 10549 8242 8751 11526 14043 15133 14359 11905 8744 7169 8995 12045 14115 14679 13246 10289 7152
302 7152 6599 9450 12495 14362 14090 12074 8650 5722 6776 10229 13113 14242 13512 10719 7037 4865 7384 11130
133 11130 13717 14239 12664 9332 5279 4571 8397 12160 14174 14115 11812 7780 3593 5074 9735 13191 14685 13805 10875
-45 10875 6261 2202 6340 11171 14313 15217 13657 9884 4471 2224 8005 12862 15662 15956 13585 8993 2940 4022
-214 4022 10204 15073 17502 17195 14126 8919 3402 7101 13601 18520 21034 20553 17225 12007 8076 10629 16317 21341
-383 21341 24105
-393 24105
##PAGE=	F1=-1491.49
##FIRST=	4405.4455391999963467,	4405.4455391999963467,	0
##DATA TABLE=	(F2++(Y..Y)), PROFILE
4405 19945 17840 13933 9420 7351 10278 14449 17374 18014 16127 12228 7090 3527 7105 11395 13986 14520 12793 9198
4236 9198 4224 2034 6680 10560 12616 12670 10743 7075 2304 2608 7059 10294 11795 11342 9071 5422 994 3707
4067 3707 7658 10107 11151 10158 7660 3980 1261 4857 8159 10066 10502 9048 6448 2879 2426 5773 8558 9956
3898 9956 9773 8101 5246 2176 3527 6550 8871 9750 9118 7052 4251 2342 4553 7296 9015 9457 8353 6104
3729 6104 3468 2959 5493 7818 9159 9075 7592 5183 3072 3831 6298 8236 9140 8551 6803 4505 3143 4749 7019
3551 7019 8565 8904 8047 6048 3934 3610 5631 7594 8745 8674 7435 5363 3685 4361 6396 8083 8784 8329 6793
3373 6793 4827 3876 5115 7107 8418 8740 7929 6218 4462 4297 5909 7647 8737 8576 7459 5718 4321 4964 6721
3194 6721 8194 8754 8300 7005 5396 4652 5681 7375 8562 8821 8050 6548 5068 5198 6474 8090 8875 8769 7726
3016 7726 6228 5067 5861 7051 8677 8880 8951 7321 6326 5758 5093 8808 7455 8938 9036 7631 6245 6294 6848 8016
2828 8016 9991 9393 8337 7718 6210 6701 8087 9126 9171 9399 8269 7332 8563 8539 14037 8470 9709 9599 8062 7255
2640 7255 7287 8398 9444 10368 10213 9496 8316 7710 8094 9154 10363 10779 10608 9603 8636 8275 8922 10131 11080 11439 10874
2443 10874 9875 9103 9063 9934 11123 11905 12012 11248 10425 9772 10015 11080 12159 12753 12645 11894 10978 10739 11258 12305 13329
2246 13329 14083 13452 12762 12262 15962 5630 15498 14001 15097 14306 13689 13312 13412 14421 15296 16227 16586 15818 16359 15229
2058 15229 15580 9690 21048 17282 19153 17932 16974 17064 17416 19361 20446 20755 20957 20253 20267 20112 20892 22061 23508 24489
1870 24489 24895 24756 24340 24305 25205 26732 28635 30227 31031 31084 30525 30446 31466 33986 37202 40056 41536 41782 40563 40113 42372
1673 42372 47097 53882 59848 63233 63082 60253 58817 64219 78968 99277 118403 130961 132637 116645 100882 130134
1523 130134 240477 618739 1672204 3461828 12326199 5705166 1200005 425346 137093 135676 137434
1419 137434 191109 142223 137185 110555 85642 68794 63120 67626 68336 69162 63785 55085 46576 43487 43665 45455
1269 45455 46150 44530 40461 35936 32748 32259 33603 34713 34316 32205 29027 26381 25493 26414 27693 28120 27051 24798 22191
1091 22191 20902 21434 22696 23761 23563 21969 19646 17871 17611 18879 20232 20909 20033 18109 16014 14896 15660 17209 18440
912 18440 18449 17152 15098 13295 13077 14330 16103 16904 16473 14683 12265 11804 12042 13659 15294 15610 14524 12589 10580 10009
725 10009 11339 13227 14322 14264 12806 10557 8895 9176 10760 12762 13390 13440 10953 10369 31968 51365 27938 15669
556 15669 14313 12802 10482 7733 8271 9212 12087 12716 13082 10334 8868 6767 7283 9654 11667 12524 11811 9718 7103
377 7103 5901 7532 10047 11720 12107 10864 8378 5786 5476 7910 10406 11892 11609 9865 7001 4641 5678 8557
208 8557 10928 11742 11109 8714 5664 4004 6222 9311 11377 11747 10358 7541 4213 3846 7079 10148 11746 11625 9624
30 9624 6251 2834 4327 8180 10990 12161 11301 8852 4981 1791 5422 9377 11905 12567 11173 7986 3485 2043
-139 2043 6824 10774 12988 13154 11094 7230 2201 3598 8643 12599 14510 14129 11505 7176 2765 6135 11488 15440
-308 15440 17421 16922 14057 9749 6701 9039 13747 17848 20030
-393 20030
##PAGE=	F1=-1510.27
##FIRST=	4405.4455391999963467,	4405.4455391999963467,	0
##DATA TABLE=	(F2++(Y..Y)), PROFILE
4405 14288 12717 9906 6721 5414 7597 10518 12555 12933 11484 8673 4999 2641 5282 8309 10075 10379 9110 6488
4236 6488 2899 1637 4938 7658 9064 9055 7608 4954 1509 2008 5170 7427 8472 8078 6403 3756 546 2770 5577
4058 5577 7255 7982 7197 5398 2698 878 3583 5909 7213 7501 6394 4509 1947 1779 4207 6188 7128 6948 5724
3880 5724 3650 1421 2587 4734 6372 6992 6471 4944 2916 1610 3306 5283 6458 6732 5915 4258 2390 2111 3986
3701 3986 5630 6547 6467 5347 3597 2116 2761 4535 5897 6542 6061 4775 3110 2202 3418 5058 6132 6325 5689 4243
3513 4243 2719 2558 4068 5448 6252 6160 5257 3726 2550 3127 4625 5783 6269 5907 4770 3350 2723 3682 5093 6026
3326 6026 6224 5603 4352 3114 3037 4247 5474 6244 6104 5263 4003 3003 3545 4830 5865 6231 5884 4943 3781 3301
3138 3301 4029 5334 6097 6273 5699 4586 3518 3732 4694 5818 6314 6251 5428 4370 3572 4211 5074 6299 6212 6582 5321
2941 5321 4280 4636 1845 3949 7083 6265 6273 5557 4441 4389 4851 5453 7412 6863 5877 6254 4061 4621 5802 6473 6161
2743 6161 6719 5953 5464 5262 6738 10725 5741 6893 6727 5697 5114 5150 6043 6706 7401 7200 6699 5870 5446 5757 6513 7417
2537 7417 7642 7507 6769 6086 5859 6342 7226 7891 8129 7718 6940 6426 6421 7093 7930 8468 8530 7956 7360 6927 7118 7858 8673 9060
2311 9060 8966 8417 7775 7595 8043 8715 9554 10004 9543 8976 8832 12648 4708 10619 9694 10628 9952 9616 9375 9557 10199 10837
2105 10837 11510 11592 10905 12223 11328 6742 8731 15491 11067 14179 12610 11925 12126 12112 14085 14581 14637 14908 14295 14417 14189
1908 14189 14817 15644 16708 17345 17637 17526 17190 17192 17862 18974 20299 21449 21995 21990 21550 21526 22266 24133 26425 28464 29437 29380
1701 29380 28660 28386 29975 33542 38268 42506 44735 44384 42421 41454 45668 56375 70792 84248 92358 90908 82413
1541 82413 69853 96608 186525 395441 1111174 2608046 8917104 4084178 885021 314515 105699
1438 105699 102080 90493 239887 93859 102184 79051 59969 47536 43575 47815 47405 49121 45249 38861 31796
1297 31796 31249 30785 32194 32761 31586 28608 25323 23083 22801 23794 24629 24315 22759 20447 18620 17997 18741 19623 19935 19141
1110 19141 17494 15623 14743 15202 16087 16845 16691 15508 13814 12593 12450 13385 14381 14827 14151 12753 11246 10504 11112 12200
922 12200 13095 13047 12102 10603 9335 9229 10181 11443 11993 11669 10297 8546 8474 8525 9659 10894 11068 10199 8818 7375 7035
725 7035 8058 9392 10123 10067 8975 7341 6181 6429 7607 9008 9287 9622 7420 7501 26630 43817 21782 11569 10308
546 10308 9048 7451 5116 6208 6379 9128 7809 10694 6206 6707 4856 5247 7009 8385 8973 8409 6856 4970 4183
368 4183 5443 7232 8412 8635 7707 5890 4024 3895 5705 7480 8511 8271 6963 4889 3228 4085 6162 7878 8353
189 8353 7904 6114 3930 2820 4505 6721 8152 8380 7323 5256 2889 2769 5140 7315 8416 8280 6778 4340 1903
11 1903 3157 5924 7916 8714 7993 6240 3423 1237 3987 6793 8560 8984 7906 5593 2352 1594 5020 7794 9315
-167 9315 9393 7845 5043 1443 2769 6322 9110 10414 10051 8132 5030 2032 4586 8411 11139 12511 12081 9968
-337 9968 6914 4900 6689 10041 12938 14432
-393 14432
##PAGE=	F1=-1529.05
##FIRST=	4405.4455391999963467,	4405.4455391999963467,	0
##DATA TABLE=	(F2++(Y..Y)), PROFILE
4405 8444 7495 5865 4052 3378 4669 6305 7475 7644 6735 5106 2974 1708 3244 4983 5955 6084 5356 3787 1679
4227 1679 1113 2991 4546 5339 5316 4428 2872 840 1251 3091 4383 4994 4717 3710 2140 195 1683 3315 4241 4677
4039 4677 4175 3133 1480 442 2148 3495 4210 4387 3699 2579 1071 1029 2486 3655 4171 4036 3311 2081 689 1523
3851 1523 2768 3728 4113 3754 2822 1613 840 1927 3118 3770 3911 3424 2416 1325 1183 2338 3303 3810 3767 3072 2017
3654 2017 1150 1588 2639 3426 3835 3504 2722 1725 1216 1969 2961 3573 3653 3274 2430 1497 1429 2372 3170 3647 3564 3039 2085 1390
3429 1390 1791 2721 3358 3651 3412 2726 1860 1512 2138 2947 3509 3615 3223 2466 1746 1707 2463 3179 3636 3543 3026 2269 1648 2030
3204 2030 2814 3408 3604 3404 2849 2140 1881 2281 3151 3520 3641 3279 2599 1947 2171 2802 3417 3644 3642 3079 2482 2059 2426 3000
2978 3000 3783 3480 4096 3312 2300 4227 1817 6004 7177 3429 3338 3394 2582 2257 2807 2950 4522 4281 3593 4711 1797
2781 1797 2409 3325 3654 3072 3887 3484 3606 1809 5468 7023 3203 3938 3825 3304 2906 2913 3557 3842 4290 4089 3821 3360
2574 3360 3092 3294 3730 4318 4380 4298 3844 3461 3331 3629 4171 4553 4685 4451 3928 3643 3662 4096 4576 4877 4917 4557 4184 3968
2349 3968 4077 4472 5018 5209 5152 4824 4464 4316 4657 4946 5595 5748 5525 5096 5247 8737 5027 5507 5310 5995 5516 5418 5278
2133 5278 5492 5805 6175 6643 6514 5907 7814 6654 3501 6842 9922 5248 8843 7228 6706 6942 6705 8299 8594 8358
1945 8358 8601 8178 8305 8059 8506 8933 9630 9916 10117 10034 9794 9805 10208 10875 11620 12314 12620 12582 12259 12286 12695 13843 15179 16380
1720 16380 16898 16601 16409 16235 17054 19321 21977 24444 25630 25248 24117 23581 26198 32552 40919 48650 52860 49889 47358
1541 47358 38973 57635 117008 198668 580476 1651710 5296076 2366732 544972 199019 97277 62157
1429 62157 44802 316656 150653 66666 48060 33679 24838 23078 26872 26316 27916 25769 22067 16941 18168
1288 18168 17177 18272 18741 18086 16296 14299 12998 12869 13499 14048 13909 12949 11556 10545 10153 10671 11175 11387 10930 9933 8818
1091 8818 8319 8650 9153 9617 9538 8831 7789 7105 7044 7600 8246 8482 8061 7225 6325 5924 6328 6929 7509 7439 6890 5977 5239 5196
865 5196 5807 6550 6870 6692 5792 4854 4906 4807 5440 6271 6343 5748 4957 4080 3924 4587 5351 5746 5727 5047 4067 3389 3544 4286 5090
631 5090 5041 5712 3888 4476 19967 33069 14667 7068 6067 5161 4256 2639 3720 3523 5928 2864 8462 3686 4491
452 4491 2943 3112 4199 4937 5268 4905 3940 2800 2390 3201 4239 4934 5032 4468 3360 2240 2208 3335 4378 4979 4812
255 4812 4000 2768 1783 2358 3591 4651 4831 4605 3484 2204 1565 2628 3949 4763 4884 4225 2972 1584 1582 3026 4302
58 4302 4929 4822 3895 2455 985 1836 3484 4663 5113 4610 3605 1916 644 2375 4010 5032 5269 4573 3221 1304
-130 1304 998 3019 4603 5469 5509 4553 2901 829 1750 3785 5396 6134 5862 4746 2942 1341 2828 5080 6591
-308 6591 7403 7104 5855 4120 3065 4123 6055 7727 8572
-393 8572
##PAGE=	F1=-1547.83
##FIRST=	4405.4455391999963467,	4405.4455391999963467,	0
##DATA TABLE=	(F2++(Y..Y)), PROFILE
4405 3556 3185 2582 1911 1643 2102 2665 3143 3187 2804 2211 1392 912 1429 2093 2445 2476 2264 1611 786 615 1257 1854 2183 2186
4180 2186 1812 1234 441 534 1258 1773 2045 1913 1512 886 151 693 1342 1667 1886 1684 1303 568 46 861 1405 1654 1774
3964 1774 1490 1028 434 352 970 1468 1669 1601 1337 836 127 562 1055 1464 1679 1495 1097 599 176 704 1239 1485 1544 1365
3739 1365 937 476 364 889 1301 1491 1504 1207 751 357 554 993 1315 1548 1382 1044 612 371 695 1153 1393 1412 1275 963
3513 963 499 449 886 1216 1442 1394 1211 750 433 621 1069 1286 1442 1330 1056 642 481 792 1100 1364 1425 1256 923 622
3288 622 566 914 1220 1424 1397 1183 847 517 721 1076 1311 1387 1349 1125 788 667 788 1260 1340 1438 1263 969 666 825 1173
3053 1173 1378 1395 1453 1136 922 837 878 1248 1632 1233 1977 1716 730 4286 4286 11690 7436 1227 830 1562 1074 338 1154 1143
2828 1143 1900 2135 2202 3652 251 501 1127 1213 517 1444 1349 2028 3382 5487 3567 1457 1490 1461 1344 1057 1012 1439 1413
2612 1413 1654 1483 1432 1275 1103 1190 1356 1678 1631 1609 1404 1274 1183 1323 1568 1722 1782 1710 1427 1294 1334 1536 1721 1837 1878 1714
2368 1714 1515 1476 1489 1589 1915 1956 1950 1813 1689 1552 1767 1761 2208 2150 2177 1890 2317 4899 4896 1613 1718 2102 1871 1908 1823 2015 2095
2114 2095 2226 2577 2325 1849 3968 2125 6937 6883 5306 1396 4255 2774 2337 2522 2220 3372 3731 3144 3304 3106 3124
1917 3124 2921 3195 3268 3670 3671 3815 3754 3608 3593 3760 4033 4311 4626 4754 4712 4481 4543 4639 5145 5684 6187 6390 6012 6152 6041 6190
1673 6190 7230 8252 9230 9683 9431 8916 8686 9659 12258 15648 18714 20184 17411 18305 13755 21923 49667 60839 175039
1495 175039 792999 2187445 895686 248087 100910 101531 23370 43581 402362 252422 38670 24158
1382 24158 13834 5141 5739 8941 9972 9655 9122 7917 5153 6626 5578 6431 6819 6654 5908 5012 4457 4410 4740 5043
1194 5043 5126 4682 4091 3730 3495 3785 4009 4150 4022 3589 3100 2886 3062 3254 3495 3504 3237 2745 2478 2452 2663 3033 3120 2952 2603
959 2603 2211 2053 2249 2434 2779 2725 2535 2123 1807 1769 2072 2387 2546 2510 2061 1936 1791 1621 1833 2335 2360 2040 1758 1338 1282
725 1282 1612 1897 2051 2094 1792 1381 1061 1084 1450 1784 1489 2469 1148 1886 13196 21291 8071 3050 2427 1919 1539 943
518 943 1322 1359 3168 5224 8684 6853 3106 1419 1313 1795 2003 2126 1976 1523 1004 870 1259 1668 1973 1999 1774 1269
311 1269 769 751 1278 1719 1989 1907 1549 1043 581 850 1362 1889 1866 1853 1328 820 481 979 1555 1881 1946 1660 1132 559 530
77 530 1172 1714 1975 1924 1537 955 243 652 1359 1878 2065 1808 1457 760 132 938 1595 2022 2147 1822 1328 553 421 1247
-149 1247 1848 2212 2261 1855 1212 482 795 1563 2201 2518 2378 1998 1310 798 1244 2177 2705 3102 2963 2505 1890 1539 1878
-365 1878 2600 3257 3607
-393 3607
##PAGE=	F1=-1566.61
##FIRST=	4405.4455391999963467,	4405.4455391999963467,	0
##DATA TABLE=	(F2++(Y..Y)), PROFILE
4405 431 499 587 586 498 388 250 215 303 403 481 486 408 277 121 77 186 426 390 347 355 234 64 153 226 268 409 356 246 134 25
4124 25 122 223 321 319 298 187 202 84 132 305 335 301 284 166 120 147 195 271 284 302 257 131 39 102 170 314 234 302 179 146 77 159
3823 159 178 273 288 287 163 88 94 159 247 293 222 224 158 74 188 160 253 266 228 196 147 117 88 272 271 233 226 205 91 106 205 256 273 232 232 162
3485 162 120 150 167 274 221 277 202 71 117 168 199 256 226 259 146 158 147 171 266 236 234 212 159 110 150 192 236 185 274 181 112 155 137 286
3166 286 206 223 165 233 57 131 184 195 221 323 170 166 218 155 177 261 130 305 333 150 241 271 560 824 380 4276 6592 16451
2903 16451 7455 1308 1144 439 621 1052 647 883 425 721 1952 3366 1578 828 461 486 1133 468 544 835 6865
2706 6865 6577 801 773 624 53 230 233 273 78 221 190 249 334 284 262 273 264 156 246 300 408 298 318 314 227 258 285 265 372 337
2424 337 377 229 281 241 333 327 367 340 286 395 267 324 365 383 288 471 283 345 328 388 360 474 1231 1813 3941 2386 577 508
2161 508 653 443 582 520 385 427 361 420 1359 1248 1479 9153 10875 2415 2165 1362 590 713 871 823 2487 658 463
1945 463 763 711 541 846 592 809 635 790 835 833 923 865 865 863 905 965 1050 1102 1133 1117 1094 1056 1200 1225 1475 1641 1248 1761 1451 1529
1664 1529 1706 1895 2256 2455 2460 2327 2295 2647 3214 3861 4697 5287 5848 5025 5248 7780 43075 76621 181798 178785 120874
1466 120874 44968 34476 99698 8788 72395 472520 335737 24926 11028 14467 9966 5979 3181 7412
1335 7412 2999 2391 1997 2951 1768 2172 1550 1245 1197 1308 1522 1380 1340 1213 1071 917 1024 1168 1024 1073 915 878 808 811 862
1100 862 893 865 768 763 703 727 686 799 767 712 712 559 628 603 697 714 646 544 633 492 555 630 633 623 607 500 476 514 425 703 627 495 551
790 551 621 378 409 547 564 607 555 413 454 472 486 563 586 546 583 474 532 907 426 1115 338 7376 10648 3286 151 386 495
537 495 615 1005 678 1091 1598 10606 12920 12092 4084 714 187 195 48 55 155 144 275 171 82 100 78 119 242 250 263 244 155
283 155 92 122 187 269 301 257 242 171 54 162 249 288 339 270 209 87 89 197 249 333 352 237 140 51 119 174 356 301 282 268 150 48
-17 48 160 229 331 369 281 237 94 89 165 326 385 328 267 186 126 111 298 330 361 389 292 178 51 179 299 408 451 458 286 235 73
-308 73 312 373 516 560 529 411 290 225 310
-393C10
##PAGE=	F1=-1585.39
##FIRST=	4405.4455391999963467,	4405.4455391999963467,	0
##DATA TABLE=	(F2++(Y..Y)), PROFILE
4405 1164 924 554 162 355 699 1077 1156 1163 965 551 253 344 635 884 1016 1016 755 520 238 419 699 888 921 845 682 464
4161 464 374 486 696 832 858 806 637 419 392 491 749 879 851 741 541 421 461 576 742 878 778 637 523 416 510 633
3917 633 752 777 760 622 396 462 521 709 791 730 682 604 468 509 600 688 765 755 648 548 421 510 638 717 820 705 618 521 463
3645 463 544 691 776 692 713 621 489 506 642 671 764 785 694 525 503 557 673 736 740 712 621 543 550 606 621 767 745 699 587 534 586 609
3344 609 744 782 719 691 587 527 578 675 715 773 710 622 523 596 615 673 786 777 698 560 562 561 686 688 773 714 697 599 645 582 545 667 784
3035 784 691 740 549 486 805 474 559 777 313 536 923 3978 8960 19582 6993 1902 2075 520 993 1734 1007 1135
2828 1135 1231 223 1974 3407 2268 1443 1317 1334 1776 1289 1285 78 9629 8001 1580 786 1144 619 554 784 863 642
2621 642 961 926 993 913 785 865 921 993 950 1038 1022 1056 868 975 994 1024 1085 1089 995 1020 1029 1035 1021 1143 1140 1147 1084 1132 1032 1084 1279 1170 1262
2311 1262 1222 1194 1032 1248 1157 1263 1322 1426 1154 1237 1731 668 2738 3455 1513 1686 1592 1467 1597 1602 1517 1645 1431 1611 2484
2077 2484 408 3399 8929 13002 1994 2716 1046 1829 1926 2167 2128 4042 626 1890 2056 1910 2032 2265 2083 2375
1889 2375 2264 2505 2492 2509 2571 2613 2649 2808 2945 3057 3129 3155 3247 3205 3364 3545 3851 4010 4186 4301 4103 4459 4505 5052 5459 6006
1645 6006 6275 6274 6335 6278 7171 8479 9968 11390 12275 12308 12238 11999 18384 31213 61534 151201 161725 973158 582125
1466 582125 70313 10550 85810 28956 89659 505649 376642 23724 9286 23097 17709 11084 8475
1344 8475 11252 8686 7458 6299 5649 6005 5553 5198 4963 4626 4348 4223 3963 3955 3917 3847 3514 3439 3283 3043 3099 3065 3046 2975 2773
1110 2773 2652 2543 2491 2513 2580 2532 2466 2243 2213 2129 2119 2254 2143 2189 2031 1970 1874 1801 1809 2032 1892 1883 1788 1681 1607 1659 1668 1748 1738 1597 1657
818 1657 1037 1505 1564 1752 1581 1547 1552 1408 1373 1382 1362 1544 1555 1478 1415 1276 1220 1359 1364 1494 1901 748 1718 902 3238 2719 1888
565 1888 1412 1407 1328 1441 1385 1753 1677 1570 15586 19048 17768 6438 993 474 624 895 998 844 785 761 629 718 910 951
340 951 952 849 775 672 709 831 930 937 932 837 678 605 733 901 874 1000 837 764 633 635 757 862 961 930 817 677 593 607 765 876
58 876 926 892 791 547 504 682 830 899 937 868 670 533 478 689 872 966 884 860 591 394 502 683 961 972 929 743 475 378
-205 378 538 782 1031 1010 990 622 420 355 650 865 1149 1091 1016 705 294 209 641 984 1232 1269
-393 1269
##PAGE=	F1=-1604.17
##FIRST=	4405.4455391999963467,	4405.4455391999963467,	0
##DATA TABLE=	(F2++(Y..Y)), PROFILE
4405 1155 863 439 26 521 867 1211 1253 1188 915 447 131 444 759 1000 1069 1021 706 446 201 493 809 970 952 842 637
4171 637 380 390 568 782 887 895 795 587 383 433 567 818 912 874 699 505 394 503 650 807 902 777 590 488 437 560
3927 560 694 816 789 759 582 373 460 578 761 830 756 666 583 446 525 659 747 789 750 626 510 434 543 690 766 843 710 594
3664 594 503 488 578 738 803 717 687 599 478 536 690 709 792 784 673 507 514 580 734 773 759 709 605 535 556 656 673 795 767 687 565
3373 565 516 609 666 766 819 724 673 573 541 597 725 735 801 713 601 509 588 654 709 820 792 677 550 569 597 684 764 771 714 690 569
3081 569 634 621 612 654 778 693 711 534 460 838 469 595 619 378 336 1250 3407 11398 20997 6050 1868 2288 593 1125
2856 1125 1757 1044 1010 1435 237 1789 3228 2344 1455 1518 1463 1624 1478 1574 750 11328 9279 3134 1563 1096 540 548
2650 548 844 887 657 976 927 967 893 775 896 954 1012 996 1040 1017 1070 861 1016 1019 1065 1115 1110 1018 1003 1048 1066 1059 1198 1159 1173 1095 1158 1065
2349 1065 1121 1316 1207 1295 1242 1225 1043 1265 1225 1231 1443 1468 1186 1182 1796 1203 1925 3235 1408 1738 1515 1479 1616 1725 1556 1703
2105 1703 1507 1613 2488 777 3657 6145 10678 2221 2145 941 2028 1887 2241 2162 4252 602 1949 2064 1877 2062
1917 2062 2306 2137 2381 2326 2525 2531 2544 2593 2669 2674 2879 2987 3119 3178 3189 3282 3252 3418 3645 3955 4085 4235 4199 4270 4539 4571 5261 5582
1654 5582 6126 6303 6218 6375 6420 7521 8864 10267 11513 12126 11421 12249 12780 20901 36626 48634 118765 221985 1061464
1476 1061464 615963 86566 13927 63775 37692 89768 489319 367318 24365 15374 28678 19656 10965
1354 10965 7601 10397 8381 7327 6607 5596 6362 5310 5301 5088 4692 4389 4264 4015 4018 4001 3915 3590 3472 3292 3109 3153 3155 3096
1128 3096 3026 2798 2666 2568 2531 2595 2638 2575 2510 2254 2208 2172 2175 2319 2211 2232 2024 1981 1902 1841 1862 2087 1936 1886 1793 1680 1631 1707 1732 1800
847 1800 1763 1621 1631 1017 1566 1616 1793 1637 1566 1517 1402 1365 1439 1417 1601 1556 1481 1403 1256 1227 1398 1404 1509 1818 864 1537 1053 1425
584 1425 1876 2404 1773 1574 1363 1623 1391 2093 1861 1745 19740 24892 23158 8782 1438 572 718 957 1098 847 788
387 788 761 640 772 962 990 975 840 776 678 721 895 973 957 944 817 669 610 777 952 936 997 831 731 627 671 813 916 999
124 999 941 793 626 599 654 836 924 954 899 749 517 519 744 894 951 966 834 635 519 509 772 942 1011 897 821 547 384 592
-139 592 765 1039 994 931 687 406 385 647 871 1126 1030 967 526 337 421 794 998 1216 1119 984 601 154 360 802 1138 1356
-383 1356 1338
-393 1338
##PAGE=	F1=-1622.95
##FIRST=	4405.4455391999963467,	4405.4455391999963467,	0
##DATA TABLE=	(F2++(Y..Y)), PROFILE
4405 382 159 143 348 585 670 761 649 488 274 149 284 497 583 627 540 439 243 200 306 478 606 583 462 338 225 243
4161 243 412 486 536 498 441 341 276 311 423 442 535 502 433 306 282 336 443 471 504 487 355 264 265 407 456 471 495 384 368 319 254
3870 254 374 436 499 474 384 298 359 343 411 480 468 431 356 315 295 354 411 466 464 474 356 332 338 406 410 485 463 365 342 347 338 415 491 424 447 417
3532 417 362 319 382 421 512 471 412 361 334 364 407 487 425 465 431 358 335 328 445 476 456 489 380 372 356 400 409 494 417 457 386 329 309 393 453
3204 453 435 490 445 355 303 389 421 414 504 398 369 379 309 430 416 403 292 396 353 387 290 284 569 177 280 95 175 378 1554 2637
2922 2637 13534 20905 4808 1622 2066 486 1064 1321 804 675 1128 126 1507 2674 2005 1086 1279 1153 1052 1231
2734 1231 1496 1346 11919 10019 4240 2676 705 350 278 650 627 338 577 517 518 553 467 611 626 624 604 601 588 718 545 704
2490 704 658 668 675 666 637 617 688 718 663 776 674 718 677 773 712 719 865 731 798 771 802 641 835 808 701 963 928 703 653 1417 1455
2199 1455 1700 2366 771 1175 876 958 1069 1257 994 1148 981 996 1791 675 2637 4295 6414 1841 1084 260 1501
2002 1501 1154 1498 1495 3274 97 1242 1282 1116 1209 1517 1331 1473 1432 1550 1579 1593 1658 1730 1670 1837 1844 1959 1987 2009 2122 2089 2188
1748 2188 2330 2521 2512 2641 2557 2859 2960 2971 3445 3530 3818 3890 3888 4154 4366 5173 5901 6478 6943 7207 6745 8454 10162 16369 27124
1513 27124 23213 46995 133719 635025 400704 53307 14387 41350 36775 75830 423873 313286 22761
1391 22761 23860 31489 17665 8006 5407 8942 3908 3958 4534 4417 3808 3020 3395 3102 2774 2681 2761 2627 2607 2568 2417 2205
1185 2205 2140 2112 2044 2079 2045 1928 1864 1701 1673 1676 1665 1709 1681 1587 1572 1388 1406 1457 1450 1526 1401 1392 1212 1265 1304 1254 1212 1363 1197 1144 1122 1093
884 1093 1122 1174 1152 1147 1085 984 1071 706 1022 1108 1204 1028 956 909 932 934 1057 958 1066 944 926 928 880 879 1017 959 981 1138 685 988 877
593 877 1600 3443 2248 1385 1179 981 1492 1210 1899 1747 1629 22644 28951 27294 10464 1834 631 552 578 728 385
396 385 417 464 384 478 568 524 499 402 458 460 459 588 551 474 477 419 437 422 532 598 523 499 401 384 443 505 553 541 546 471 388 356 465 491 558 518
58 518 486 438 395 338 421 561 570 523 486 366 337 427 423 579 577 540 406 375 355 358 529 516 639 472 421 279 265 404 562 580 671 455
-243 455 399 163 248 501 671 646 633 455 310 110 283 510 668 761 754 609
-393F09
##PAGE=	F1=-1641.73
##FIRST=	4405.4455391999963467,	4405.4455391999963467,	0
##DATA TABLE=	(F2++(Y..Y)), PROFILE
4405 507 606 680 664 638 510 403 266 335 446 604 526 486 374 233 193 240 421 419 430 397 319 156 126 245 350 394 414 324 221
4133 221 85 108 215 350 384 367 241 190 4 104 281 319 366 332 207 122 47 177 336 214 379 287 163 85 140 121 362 279
3870 279 285 220 152 31 130 183 311 338 256 228 109 121 133 252 241 307 223 159 76 74 163 289 267 331 181 150 81 108 216 238 279 263
3570 263 217 65 72 107 262 258 264 235 201 118 136 140 228 302 247 268 100 95 132 234 285 219 243 225 90 117 152 256 261 292 186 201 60 128
3250 128 210 273 248 208 191 118 90 168 235 225 274 220 133 164 119 159 230 219 261 194 160 146 58 217 190 198 210 232 177 222 464 255 696
2941 696 1866 1801 14907 19605 3497 1751 1752 503 973 738 502 320 888 207 1284 1862 1495 599 869 715 490
2743 490 869 1259 1839 11540 9821 4924 3554 466 619 88 505 507 248 171 365 194 457 332 366 307 245 270 287 298 454
2509 454 396 403 323 279 292 321 427 391 397 380 308 346 266 367 384 488 437 320 414 316 337 435 491 408 469 362 216 442 473 255 420
2218 420 965 2104 1707 1937 236 658 394 598 565 744 478 732 548 553 959 646 1047 8008 8745 1403 365 574 800
2002 800 672 551 826 1980 782 647 861 760 451 797 634 734 634 742 816 828 939 921 831 891 841 991 1019 1097 1214
1767 1214 1149 1151 1129 1242 1199 1403 1433 1699 1590 1635 1681 1780 1874 2111 2374 2491 2824 2890 3069 2964 3437 4206 4772 6708 7879 10136
1523 10136 12806 13117 53468 95531 261623 157579 27061 21178 25657 29811 54084 322384 230310 19061
1391 19061 30289 31845 13965 4899 14232 21676 2477 2127 2750 3178 2765 971 1338 1004 1111 1335 1471 1360 1153
1213 1153 1055 936 962 1031 1220 1051 1055 900 789 810 807 930 936 853 778 699 649 776 766 799 799 712 693 614 632 669 676 831 739 549 597 511
912 511 616 625 664 702 638 543 512 509 534 744 551 502 540 576 431 531 512 629 580 655 472 516 399 534 645 669 591 612 497 490 526
621 526 728 728 824 1673 3067 1722 870 849 804 1429 1049 1503 1542 1363 23803 30306 29199 11122 2077 833 591 388
415 388 439 185 133 108 66 126 141 103 70 129 200 267 132 183 23 106 118 192 316 249 197 139 13 93 244 219 317 292 197 64 21 129
114 129 253 327 332 263 182 44 78 159 334 317 307 288 149 24 106 223 327 419 288 297 104 63 180 280 415 374 380 180 187 150 213
-177 213 372 420 398 388 277 127 223 270 525 405 514 486 267 208 321 446 591 628 623 550 472 338 351
-393C51
##PAGE=	F1=-1660.51
##FIRST=	4405.4455391999963467,	4405.4455391999963467,	0
##DATA TABLE=	(F2++(Y..Y)), PROFILE
4405 1029 1034 950 768 603 489 558 656 852 852 864 610 397 297 326 571 672 725 608 458 278 146 327 505 605 635 515 365
4152 365 163 158 332 466 548 562 451 284 64 202 344 451 531 461 403 228 14 188 383 485 559 330 347 148 79 215 452
3898 452 404 545 349 243 66 111 291 403 439 423 392 148 99 173 353 438 449 348 313 98 104 209 307 403 444 315 310 73 108
3626 108 279 368 439 364 331 190 85 212 294 345 465 335 245 198 53 209 369 372 379 378 194 171 144 271 323 454 409 290 160
3354 160 142 250 263 373 441 355 295 157 156 260 330 405 447 358 226 84 219 235 364 433 369 322 204 247 163 398 379 415 377 283
3072 283 249 174 441 357 454 371 361 288 215 395 488 807 450 914 2088 1413 15265 17300 2272 2137 1541 605 915 546
2847 546 323 184 1146 276 1091 1010 1034 206 539 401 334 680 1019 2242 10350 8427 5092 3853 538 819 186 533
2640 533 669 473 354 648 457 654 502 418 375 382 458 509 521 537 544 418 418 392 486 508 611 553 503 394 469 402 519 546 540 594 529
2349 529 402 463 517 490 605 617 592 555 370 351 605 670 411 727 738 2739 1354 2340 518 737 700 804 641 687 625 906
2105 906 696 846 637 802 406 10890 12774 1830 846 893 539 990 227 750 1462 1214 812 1249 1164 890 931 934 1031 940
1880 940 1085 1150 1140 1221 1158 1129 1157 1226 1360 1419 1469 1513 1472 1477 1448 1631 1784 1954 1979 1988 2030 1916 1999 2362 2607 2989 3151 3036 3238 2961
1598 2961 3449 3882 5235 6316 6473 7985 7409 7149 6948 20779 81384 177296 457447 147348 47768 26165 18206
1438 18206 20701 31203 206548 139044 14117 31871 29461 10318 3643 28419 44032 8802 5510 4093
1307 4093 2507 6676 2236 1457 1968 2303 2246 1988 1727 1407 1356 1489 1581 1598 1656 1297 1259 1144 1167 1265 1285 1332 1185 1023 903
1072 903 924 994 1104 1149 1081 906 784 793 844 913 1068 886 936 839 676 682 767 945 880 849 784 661 598 693 764 837 941 688 642 474
790 474 577 601 805 785 777 631 576 483 578 631 741 807 766 609 528 493 575 671 861 915 952 1459 2180 1341 819 913 946 1445 1001 1164
509 1164 1408 1047 22886 28709 28312 10647 2071 968 710 572 504 518 356 162 166 216 332 459 445 456 327 290 174 124
283 124 349 494 479 447 392 267 73 209 353 484 545 420 338 196 85 286 387 483 517 491 269 134 132 354 453 495 551 403
20 403 242 89 174 382 487 546 514 447 174 79 239 445 545 577 541 383 217 122 310 559 580 640 562 343 212 301 337 656
-243 656 666 793 506 434 350 311 619 796 896 907 759 610 500 545 684 868
-393H68
##PAGE=	F1=-1679.29
##FIRST=	4405.4455391999963467,	4405.4455391999963467,	0
##DATA TABLE=	(F2++(Y..Y)), PROFILE
4405 1046 1009 860 631 423 372 578 700 920 849 807 512 240 229 365 643 741 720 578 380 142 109 413 578 646 661 472
4161 472 271 88 207 410 538 612 572 413 205 69 280 440 528 547 457 375 174 136 282 488 540 576 335 297 126 189 309
3908 309 532 463 560 329 232 132 225 394 471 483 428 392 135 175 266 433 519 478 361 303 125 223 313 390 459 466 311 295 149 217
3626 217 378 436 488 397 347 192 180 310 381 413 527 333 247 253 178 289 455 433 409 402 203 194 237 369 395 517 426 326 188 212
3344 212 362 356 432 499 375 294 229 250 339 423 458 490 389 278 163 308 342 439 481 401 344 268 349 267 489 435 469 426 325 347 220
3053 220 523 433 522 435 424 315 336 440 573 858 489 949 2118 2037 14659 14089 1431 2311 1380 604 862 838 294 528
2828 528 1465 263 837 332 748 61 441 323 326 673 833 2616 8452 5865 4584 3473 517 750 142 590 790 529
2621 529 483 755 543 714 568 484 478 495 575 601 616 598 594 486 526 491 609 595 690 620 599 456 597 495 654 636 609 668 604 504
2340 504 572 634 602 674 691 668 632 440 375 863 821 470 825 773 2840 281 2715 643 883 893 959 756 823 778 1048 831 1093
2086 1093 835 879 1219 10072 12407 2528 1135 651 736 1153 451 863 1650 1275 966 1414 1309 1125 1101 1161 1210 1154 1297 1365
1861 1365 1337 1404 1375 1325 1405 1496 1614 1676 1683 1713 1707 1743 1749 1966 2137 2260 2219 2210 2461 2153 2423 2790 3068 3419 3433 3360 3521 3381 4052 4640
1579 4640 6036 6973 6720 8022 7063 7115 10392 20854 70814 201056 522094 180336 53907 24025 13356 12566
1429 12566 12344 99923 58824 9393 28168 24402 7538 3984 43705 69559 13757 7661 6225 2501 9077
1288 9077 3087 1945 2807 3115 2878 2527 2203 1892 1897 1984 2086 2010 1986 1649 1590 1548 1542 1622 1595 1605 1426 1281 1209 1242 1288 1348 1382 1288
1025 1288 1095 1010 1054 1091 1143 1269 1059 1045 999 895 909 973 1123 1036 986 898 822 780 902 935 1006 1027 860 712 618 746 756 946 914
753 914 862 704 635 618 744 794 850 886 794 666 597 617 697 826 845 989 994 1160 1902 1126 948 971 992 1341 1001 912 1330 691 19954
480 19954 24584 24733 9185 1803 904 645 588 487 576 413 260 252 303 434 561 528 530 388 343 293 242 469 588 580 518 408
236 408 326 204 345 455 579 614 471 349 229 225 408 485 572 571 525 230 184 264 463 539 567 592 398 217 166 290 488 579 603
-36 603 534 414 141 86 361 551 607 626 518 348 125 216 400 645 640 646 545 260 61 328 442 723 713 767 452 284 220 332
-299 332 708 841 916 865 635 449 355 498 734 919
-393I19
##PAGE=	F1=-1698.07
##FIRST=	4405.4455391999963467,	4405.4455391999963467,	0
##DATA TABLE=	(F2++(Y..Y)), PROFILE
4405 684 650 520 358 149 137 380 444 646 542 521 306 92 103 242 456 536 478 387 254 50 127 320 427 443 484 314 172
4152 172 144 170 322 389 466 412 293 163 150 236 347 394 373 328 293 168 189 253 396 389 424 234 236 164 204 247 429 341 423 237 220
3861 220 190 231 328 362 350 316 329 152 218 224 355 415 351 274 254 163 242 283 291 349 354 234 256 174 214 327 339 371 313 299 185 217 275 307
3542 307 313 438 238 218 270 196 235 383 334 307 344 189 188 216 322 320 418 327 282 189 241 331 296 334 413 294 240 241 265 267 356 358 397 320 258
3213 258 183 269 306 351 377 316 287 278 336 255 400 335 374 353 300 350 186 429 337 425 362 374 279 330 360 495 681 390 844 1904 2933
2922 2933 13298 10152 1893 2094 1154 480 795 1044 339 915 1563 308 523 143 622 40 452 359 158 656 693 2983
2715 2983 6048 2449 3331 2538 357 481 42 609 766 437 455 655 438 600 489 446 449 439 523 500 513 516 490 440 499 420 540
2462 540 484 592 519 538 402 549 421 577 518 497 573 539 436 511 536 513 532 584 566 524 347 245 920 735 327 670 929 2569
2199 2569 1365 2682 530 800 835 890 648 836 699 942 772 1126 922 866 1304 6098 7857 3005 1114 265 850 1031
1992 1031 374 824 1795 1059 900 1201 1096 967 949 1047 1004 1003 1097 1177 1133 1199 1203 1109 1236 1287 1383 1426 1397 1446 1461 1517 1520 1711 1803 1874 1825
1701 1825 1836 2210 1817 2096 2385 2551 2803 2727 2793 2979 2969 3519 3862 4846 5431 5229 6093 5889 6605 10204 16390 36181 155499
1485 155499 363555 127563 38466 16240 7596 7132 296 21598 2963 7017 20795 17589 5563 5028 56968
1344 56968 92484 16702 7848 8034 3089 7497 2989 1783 2704 2989 2653 2413 2107 1831 1871 1829 1982 1824 1788 1582 1503
1147 1503 1498 1428 1472 1421 1438 1299 1204 1169 1168 1163 1190 1227 1153 1014 972 1006 1004 1015 1099 935 919 942 854 857 872 977 895 882 820 804 741 851 814 891
828 891 862 988 448 614 707 646 814 771 743 615 603 597 711 697 715 757 651 606 578 601 624 697 730 831 866 824 1840 889 879 821
546 821 845 1060 940 664 1159 453 15539 18851 19224 7072 1349 664 400 391 291 419 304 228 219 259 362 433 385 403 313
311 313 325 291 232 396 455 462 404 322 328 218 319 362 443 477 366 296 251 246 353 370 444 433 427 173 240 271 383 404 419 462 298 196 251
2 251 261 393 439 449 399 321 162 147 321 430 439 464 366 285 164 212 304 489 456 444 403 206 83 234 343 514 493 524 296 147
-280 147 44 237 512 564 614 561 347 222 103 272 480 603
-393F03
##PAGE=	F1=-1716.85
##FIRST=	4405.4455391999963467,	4405.4455391999963467,	0
##DATA TABLE=	(F2++(Y..Y)), PROFILE
4405 235 201 125 210 164 238 266 248 298 150 177 148 172 173 238 247 278 166 156 172 133 241 243 263 169 242 146 137 209 176 264 202 268 199 165 162 212
4067 212 199 220 216 140 166 204 172 228 236 248 179 219 99 190 189 204 169 299 159 234 142 200 221 227 220 207 160 167 243 159 233 157 261 247 170 155
3729 155 187 179 230 226 138 193 192 134 201 174 190 248 198 202 185 222 156 219 206 202 168 286 115 175 251 171 166 273 186 155 248 155 152 182 247 211 253
3382 253 188 203 159 244 248 186 204 268 171 159 217 245 159 236 217 251 211 194 185 187 240 203 223 192 194 249 275 203 236 196 219 231 241 290 164 275
3044 275 195 261 242 276 237 238 261 357 429 236 683 1453 3542 11329 5878 3161 1540 854 308 729 1065 440 1220 1442 397
2809 397 226 212 555 74 423 393 95 570 598 3250 3929 1311 1799 1321 279 204 187 599 634 340 392 464 304 416 350
2574 350 362 360 324 413 351 331 374 326 336 427 296 401 315 427 359 393 317 426 307 427 320 330 402 420 298 393 365 370 326 413 400 336
2274 336 241 258 867 537 202 409 1076 2455 2920 2319 318 562 660 691 433 749 502 691 621 1059 839 834 869 4632 5953
2039 5953 3387 945 834 821 908 381 739 1991 767 788 830 747 674 651 798 674 754 749 843 782 851 859 772 925 920 977 988 939 1011
1767 1011 1027 1125 1111 1241 1227 1252 1235 1255 1612 1335 1488 1713 1722 1836 1711 1926 2105 2235 2646 2694 3119 3213 3314 3480 4389 5705
1523 5705 8582 13665 10866 79278 140256 85426 14474 7210 2118 4418 5395 24667 25904 6788 12398 10515
1372 10515 3992 6301 65212 107274 17485 6412 9777 9155 2929 2013 1585 2163 2304 1884 1877 1644 1500 1516 1415 1540
1185 1540 1335 1296 1270 1188 1201 1090 1091 1025 1049 973 946 943 910 865 861 882 847 783 792 800 766 737 768 668 670 767 679 675 656 697 616 664 635 673 587 685
847 685 585 650 587 1061 108 532 559 444 577 511 523 440 500 501 580 494 477 531 426 473 491 508 484 412 641 556 632 465 1365 707
565 707 659 544 605 692 765 418 822 593 10510 12655 12964 4732 835 355 111 128 100 199 142 142 160 214 278 235 195 214 191 269
302 269 234 225 288 271 273 221 200 293 190 266 245 242 269 206 219 243 232 259 236 258 231 278 110 275 241 277 226 211 273 168 171 300 230 270 245
-27 245 232 210 216 186 214 277 262 226 229 177 229 222 226 214 301 206 176 229 207 203 197 268 256 203 218 155 180 145 307 299 246 217 185 102 183 216 276 285 262
-393B62
##PAGE=	F1=-1735.63
##FIRST=	4405.4455391999963467,	4405.4455391999963467,	0
##DATA TABLE=	(F2++(Y..Y)), PROFILE
4405 229 150 162 330 346 437 384 384 238 146 91 194 265 303 359 270 221 65 43 177 193 341 294 253 110 66 98 168 242 241 309 182 177
4105 177 86 103 170 243 238 186 188 30 66 157 167 254 264 184 109 69 9 175 194 216 177 270 46 100 110 175 238 240 182 137 55 57 172 161 234
3776 234 150 243 131 58 72 129 183 229 208 110 111 64 62 152 171 190 226 128 104 81 158 125 213 178 176 120 161 31 147 219 152 166 222 96
3457 96 37 164 130 118 188 225 156 120 78 137 128 237 195 124 166 149 74 92 197 221 135 154 144 133 122 128 194 147 211 97 117 103 113 213
3138 213 230 165 102 120 91 129 193 215 180 193 128 135 153 200 231 144 212 258 262 189 537 846 3849 8792 1948 4420 822 560 178
2865 178 683 973 539 1382 1201 414 18 69 487 208 339 377 267 461 573 3260 3738 4830 2521 323 380 248 262
2650 262 553 456 327 359 297 279 266 239 292 286 259 332 282 196 262 208 246 382 234 303 234 300 247 254 278 329 262 324 186 226 271 333 204
2340 204 328 271 293 221 297 274 219 260 333 799 375 260 220 1098 2440 3622 1796 121 301 506 475 279 638 328 439
2105 439 470 1001 695 756 351 8745 10771 3802 871 1283 682 943 528 670 2145 620 713 551 478 486 438 610 482 618
1880 618 521 613 544 608 589 589 722 705 700 681 649 715 716 873 857 930 854 867 830 935 1078 1058 1121 1300 1239 1239 1088 1372 1451 1751 2189 2159
1579 2159 2266 1956 2047 1654 3268 5282 8593 11798 23393 28558 137065 119344 9571 1204 1498 3063 5913
1419 5913 35155 30583 5882 5435 4596 2531 6923 66361 110198 16255 4023 11821 21375 13629 398 2038
1269 2038 1950 1551 996 1211 1080 1192 1087 1122 1051 875 794 917 869 895 791 769 679 679 652 693 714 676 627 597 559 563 558 611 611 553 514 503
969 503 428 437 594 508 519 493 473 374 470 450 527 437 537 425 436 373 1036 336 447 420 326 392 308 323 285 390 410 458 339 292 334 227
668 227 333 395 407 388 146 581 302 393 192 578 690 460 269 376 365 498 239 414 767 5815 7065 7181 2577 376
443 376 113 170 121 206 87 38 77 165 243 289 155 164 102 111 215 198 256 261 215 160 86 109 254 181 269 232 166 121 97 166 222 229 232 248 174
114 174 96 161 72 292 223 266 196 140 130 77 152 317 258 254 188 105 63 145 200 263 298 232 175 64 45 197 247 275 256 274 113 37 113
-196 113 219 281 276 319 230 132 23 139 262 279 440 329 259 111 97 235 303 414 471 417 340
-393C40
##PAGE=	F1=-1754.41
##FIRST=	4405.4455391999963467,	4405.4455391999963467,	0
##DATA TABLE=	(F2++(Y..Y)), PROFILE
4405 317 262 262 389 399 483 409 419 273 236 196 238 278 338 373 295 227 151 100 189 192 360 310 236 160 45 112 194 233 254 307 191 157 139
4096 139 105 169 229 253 154 203 86 43 154 149 238 250 162 129 12 39 181 177 197 172 259 28 59 124 145 234 220 163 109 68 22 136 162
3786 162 214 136 221 83 70 56 98 172 217 182 131 77 25 44 121 156 174 205 93 81 39 128 98 194 156 160 110 99 12 150 181 136 151 195
3466 195 60 15 121 130 83 180 203 109 60 22 112 110 207 163 87 159 100 48 54 191 182 129 106 111 86 82 88 191 131 176 46 70 80 69 183
3138 183 203 137 41 78 26 79 183 161 159 197 114 117 122 169 253 120 189 248 222 352 440 443 4266 5852 2951 5456 134 360 142
2865 142 653 877 583 1397 940 367 153 193 410 296 229 295 299 364 601 2896 4751 7571 4787 964 480 353 221 454
2640 454 275 312 307 180 277 174 174 228 234 226 262 239 135 190 153 182 339 202 240 199 218 186 161 245 272 225 257 130 162 203 279 151 290
2330 290 236 233 183 238 200 185 271 293 718 318 273 235 945 2112 3110 1200 91 126 444 316 233 553 261 266 348 984 583 592
2067 592 598 11384 13784 4068 1047 1355 507 948 503 553 1883 612 596 418 313 354 335 469 378 505 390 464 398 455
1842 455 419 479 569 578 518 493 495 535 525 705 688 727 629 657 571 821 713 856 911 1026 956 946 790 1093 1050 1417 1853 1781 1813 1500 1467
1551 1467 963 2630 4793 8118 7554 20240 32055 170683 123332 15419 1211 2009 2285 3908 24555 21088
1401 21088 3396 1280 633 1139 6266 60003 100532 13380 1359 14110 38022 30615 3729 3273 2383 1159
1250 1159 487 542 553 931 691 902 641 544 404 589 592 641 555 548 438 406 400 483 511 487 454 416 322 360 377 448 461 371 355 355 263 260 442
941 442 366 389 363 321 212 332 297 394 306 400 322 271 260 853 359 333 296 254 254 202 189 184 293 309 346 233 180 203 99 216 299 293 303
631 303 28 477 160 220 281 247 676 368 81 213 162 212 143 187 727 2204 2888 2842 986 38 137 265 182 253 75 32 68
377 68 186 258 288 149 171 72 83 183 192 247 233 203 124 41 80 225 170 259 217 160 57 65 157 196 206 209 258 144 58 121 72 279 186 253
58 253 199 148 75 62 143 294 254 238 185 72 39 118 204 256 280 239 171 35 67 185 232 278 263 267 121 112 96 209 296 295 315 251 170 113
-261 113 157 283 320 448 354 294 197 210 307 337 467 511 455 393
-393C93
##PAGE=	F1=-1773.19
##FIRST=	4405.4455391999963467,	4405.4455391999963467,	0
##DATA TABLE=	(F2++(Y..Y)), PROFILE
4405 211 207 219 341 340 388 287 283 166 174 187 217 222 276 263 205 134 132 106 172 140 300 235 131 101 47 91 193 187 198 223 113 121 181 110 155
4077 155 184 208 64 147 87 15 163 121 178 176 98 74 47 28 188 145 135 115 187 40 29 147 110 208 157 107 50 29 31 127 159 181 81
3767 81 142 75 56 81 93 144 184 141 86 19 70 60 114 124 129 154 20 33 68 124 77 160 111 97 44 90 21 172 137 124 84 144 54 43 117
3438 117 150 45 134 140 59 41 46 126 104 154 115 59 111 125 88 34 194 133 84 78 45 108 95 78 170 112 123 19 39 117 77 164 174 143 30
3110 30 58 60 85 206 139 86 200 150 180 155 164 289 150 199 305 231 550 413 910 5112 3272 6552 6288 388 297 174 635
2856 635 830 565 1316 723 397 330 446 330 325 130 183 248 256 607 2172 4966 9192 6640 1484 585 350 102 320 111
2631 111 234 208 78 228 107 142 148 179 171 186 152 96 144 112 127 269 153 178 128 160 151 105 194 230 146 200 79 103 157 242 110 237
2330 237 191 174 115 202 189 144 215 192 607 356 187 374 679 1989 2141 559 235 134 459 258 212 531 291 192 280 979
2086 979 507 423 1064 11446 13578 3939 1345 1180 549 782 268 428 1187 572 394 312 175 180 221 288 235 314 235 294 229
1851 229 303 273 307 361 397 319 305 318 375 342 497 477 494 369 403 365 676 436 644 615 691 573 642 518 919 770 1041 1321 1136
1579 1136 1077 968 1490 1052 2307 3697 5432 3456 6084 15406 98230 80654 9896 2626 1725 2305 1852 10259 8708
1401 8708 226 346 1383 827 4384 47606 80771 9443 1136 16064 56011 49022 8410 5118 3075 1358
1250 1358 875 172 376 686 419 586 320 248 94 307 352 427 315 327 234 198 212 299 325 300 272 246 127 226 225 300 310 199 191
978 191 231 192 137 295 240 249 223 172 101 232 192 280 175 247 191 146 178 491 143 180 180 127 109 108 133 116 220 187 222 138 78 142 69 142
659 142 203 172 182 46 317 165 134 461 653 554 304 81 164 111 33 199 218 471 441 1134 976 697 167 200 248 134 218 72
396 72 65 100 178 225 228 105 102 60 82 172 185 184 150 126 86 38 109 203 131 204 140 98 27 47 181 170 152 138 187 72 37 138 98 236 124
67 124 172 132 89 106 82 138 239 185 152 113 37 84 114 199 199 182 186 85 25 102 175 188 219 179 176 54 95 112 177 259 220 213 156 101 112 152
-271 152 243 273 326 248 172 136 188 267 279 387 388 314 259
-393B59
##PAGE=	F1=-1791.97
##FIRST=	4405.4455391999963467,	4405.4455391999963467,	0
##DATA TABLE=	(F2++(Y..Y)), PROFILE
4405 47 135 142 242 228 236 120 85 16 119 156 166 134 171 115 69 43 123 112 136 70 208 130 68 40 89 74 166 130 125 132 28 135 206 108
4086 108 129 147 139 87 70 142 49 163 93 105 106 57 27 115 33 179 111 71 88 91 121 31 171 70 174 99 83 85 62 62 124 152 165 68 47
3758 47 132 47 114 99 106 155 142 21 94 121 77 124 102 103 130 75 53 112 124 69 132 91 67 45 112 63 189 100 137 42 102 125 93 124 170
3429 170 60 93 86 124 66 92 150 110 111 76 129 76 171 134 29 198 119 91 124 35 152 128 84 154 133 129 91 73 170 111 155 153 197 89
3110 89 129 118 118 234 136 41 201 248 247 216 166 325 191 256 375 294 692 440 1535 6068 3165 9835 6916 697 357 214
2865 214 622 789 494 1220 576 527 529 594 255 329 71 123 335 137 539 1319 4132 9720 7453 1550 738 284 93 197
2640 197 26 139 109 13 178 87 144 77 137 122 155 64 103 147 98 98 204 143 162 86 154 185 73 174 214 97 199 95 138 142 233
2349 233 141 210 169 212 106 214 239 136 162 165 533 424 85 554 444 2896 2988 272 354 207 485 258 218 543 333 192
2105 192 263 937 408 385 1456 10412 12441 3428 1600 1039 835 505 79 465 926 525 166 216 211 226 150 119 215 162 199
1870 199 225 197 285 261 215 255 286 290 309 282 391 321 393 401 427 401 409 408 632 436 618 503 606 560 705 673 1021 799 889 1074 1057 1194
1570 1194 1356 1921 1995 2243 2455 2351 5887 17640 22153 90556 51811 6448 6005 3093 2696 1705 15734 7216 2382
1391 2382 888 2050 1743 1913 32087 55750 5277 3065 16931 71300 65053 13391 7179 3771 1965 1428 764
1232 764 739 592 372 320 185 105 194 262 319 338 192 161 168 171 220 227 260 226 190 198 104 222 175 243 218 191 144 144 256 155 197 191 178 199
912 199 91 143 193 193 222 128 163 89 162 140 18 473 135 188 69 136 46 168 106 196 119 136 155 73 178 132 143 133 134 102 81 174 226
602 226 102 589 745 391 234 152 199 148 174 366 266 187 1113 1674 1475 1042 269 220 208 102 209 156 128 143 153 186 176 129
340 129 60 132 115 172 174 138 104 67 104 94 154 187 80 156 85 77 113 62 204 160 99 77 99 76 95 166 129 184 110 74 90 16 166 101 132
11 132 182 101 72 46 116 125 114 189 137 48 139 36 108 130 156 142 142 71 89 92 80 120 135 205 105 113 14 51 106 144 172 186 160 85 24 103 134
-337 134 181 185 248 211 101 55
-393E5
##PAGE=	F1=-1810.75
##FIRST=	4405.4455391999963467,	4405.4455391999963467,	0
##DATA TABLE=	(F2++(Y..Y)), PROFILE
4405 102 134 104 144 133 133 106 53 113 140 145 123 61 102 92 20 111 134 108 95 49 142 88 132 91 113 71 125 93 104 115 83 164 204 95 97 145
4067 145 93 157 62 190 69 146 76 67 105 91 83 148 43 151 96 59 129 57 159 48 175 43 145 92 111 134 109 73 109 140 168
3776 168 109 38 169 57 124 98 68 148 165 52 147 147 70 132 105 110 143 126 98 131 105 73 116 107 111 104 113 86 180 84 153 88 90 168 123 116 170
3429 170 94 94 90 181 80 107 157 117 104 63 191 84 184 157 30 189 129 147 159 83 169 145 86 144 167 166 125 98 191 129 141 141 231 124
3110 124 170 146 134 243 127 90 211 320 270 246 156 332 228 287 400 380 733 473 2071 6568 4784 12139 7148 860
2884 860 472 214 607 695 357 1177 493 613 687 595 198 354 62 111 546 259 422 1158 3897 9617 7064 1218 909
2668 909 222 194 127 109 120 75 56 162 92 145 58 113 106 158 73 120 158 107 88 169 169 171 116 157 232 39 187 200 112 214 132 187 146 225
2349 225 187 210 170 266 150 231 259 171 165 152 579 445 69 709 374 3939 4614 785 417 281 457 218 238 499 313 183
2105 183 226 824 244 376 1775 9795 12613 2977 1716 998 1084 293 302 558 1508 570 70 180 317 370 195 133 295 208
1880 208 272 282 284 363 331 260 319 312 372 408 356 471 396 426 457 506 577 574 471 689 590 649 626 731 787 915 889 1138 900 911 1243 1418
1579 1418 1754 1902 1953 2600 2109 1748 3530 7099 25778 54447 176378 77280 15076 8117 3838 2812 1827 20333
1410 20333 9442 3342 1812 2066 2239 648 16893 31051 2487 4332 16204 80096 75175 17527 8914 4386
1260 4386 2767 1906 1203 1024 625 428 387 260 305 376 366 414 335 238 157 222 242 301 256 299 270 223 243 197 258 205 255 207 255 206
978 206 121 313 204 177 203 190 261 113 202 181 229 202 167 181 121 209 148 453 873 229 252 156 227 77 189 121 187 141 123 211 108
687 108 207 172 162 107 168 124 110 158 245 70 632 688 291 204 172 196 169 252 500 519 362 1206 1724 1469 1044 300 218 212 144 226 206
396 206 156 160 129 169 174 184 98 179 133 160 158 147 148 105 127 125 172 168 49 159 102 124 159 74 196 164 83 89 87 125 130 167 143 150 148 72 122 61 186
30 186 101 118 147 81 104 84 166 131 100 178 114 58 144 100 154 133 122 122 105 67 124 153 93 106 90 173 48 123 87 104 111 128 117 120 77 43 135
-318 135 145 103 104 104 137 129 60 93
-393I3
##PAGE=	F1=-1829.53
##FIRST=	4405.4455391999963467,	4405.4455391999963467,	0
##DATA TABLE=	(F2++(Y..Y)), PROFILE
4405 79 87 63 75 108 115 125 57 100 95 117 118 46 98 113 7 99 92 67 64 71 119 78 117 74 86 43 89 85 102 102 77 137 160 72 75 142 68 146 56 171
4030 171 50 118 70 59 96 79 74 126 23 110 95 54 141 51 127 19 150 52 118 80 101 113 101 53 74 120 160 108 31 141 49 98 84
3720 84 38 140 146 49 132 131 29 123 106 93 129 114 91 114 67 72 92 95 116 101 68 79 138 77 136 89 60 147 111 92 141 99 88 78 171 47
3382 47 78 135 108 95 29 197 62 143 149 33 159 111 163 131 78 138 132 73 118 165 157 98 77 161 117 111 115 205 105 138 125 112 222 99
3063 99 94 205 314 231 223 127 298 244 241 357 424 674 496 2482 6317 5918 12750 6699 1001 553 176 574 552 168 1183
2828 1183 464 577 745 497 161 394 136 70 724 509 379 1926 5649 9463 5725 644 1061 203 240 84 162 132 62
2612 62 65 129 60 107 49 74 82 118 61 87 121 86 50 127 153 131 100 110 228 35 169 148 83 170 111 168 124 175 172 173 138 236 128 194 202 167
2274 167 159 134 675 385 61 783 421 4292 5367 1180 448 355 345 111 215 356 209 149 140 641 49 300 2031 9128
2049 9128 12982 3271 1669 840 1149 279 342 506 1743 601 148 165 310 375 189 143 260 222 233 244 259 331 303 205 297
1814 297 253 307 352 283 395 330 357 376 428 524 506 320 605 557 480 552 623 680 786 738 932 714 678 1136 1242 1590 1662 1259 2284
1541 2284 1561 1178 4390 4736 20406 63728 185164 79020 17383 7424 2884 2479 1242 16199 7059 2556
1391 2556 2227 1796 2094 1969 5060 11294 3442 4862 13870 80089 77077 19804 9847 4830 3592 2249 1356 1064
1222 1064 593 626 501 290 442 475 357 396 241 206 112 197 235 290 224 266 234 162 195 202 227 184 209 154 204 180 54 281 178 152
941 152 163 140 235 84 172 122 212 146 156 148 112 186 121 759 1020 252 233 147 211 69 143 94 140 121 84 185 58 164 155 142 71 147
640 147 98 73 191 198 26 562 651 254 191 120 120 143 294 553 798 534 1040 1338 1149 788 283 182 207 132 182 172 135 132 100 137
358 137 158 170 69 154 109 126 127 136 150 94 83 97 145 138 33 154 71 108 133 44 147 159 65 72 73 102 97 128 132 130 150 69 102 46 137 78 100
11 100 114 79 101 62 139 96 68 162 98 93 129 75 127 102 80 119 91 63 122 130 69 62 52 157 55 109 81 76 70 95 113 105 69 57 127 100 67 63
-346 63 59 115 131 79 89
-393H9
##PAGE=	F1=-1848.31
##FIRST=	4405.4455391999963467,	4405.4455391999963467,	0
##DATA TABLE=	(F2++(Y..Y)), PROFILE
4405 58 102 119 92 151 131 78 79 56 59 111 160 61 98 78 92 1 77 72 60 72 118 60 17 12 89 18 76 86 73 71 58 83 97 67 76 113 73 62
4049 62 72 98 57 98 61 44 53 11 31 89 27 74 95 26 125 23 72 50 104 67 89 34 62 33 56 58 32 91 126 64 35 60 80 56 63 37
3711 37 113 82 19 65 93 36 95 87 35 84 55 41 88 39 59 51 53 69 61 23 57 77 60 82 41 41 72 70 82 91 71 55 34 106 24 35 96 79 60
3344 60 42 155 34 65 129 57 116 56 131 56 66 71 106 48 69 118 101 40 66 94 83 74 63 129 43 51 82 64 181 62 44 174 237 168
3025 168 167 90 232 237 123 278 407 576 523 2729 5445 6169 11271 5424 1175 534 226 521 416 289 1170 486 431 684
2800 684 451 144 406 252 114 809 710 478 2690 7542 9323 4020 139 1191 226 244 30 213 100 86 128 66 45
2584 45 40 49 28 69 30 29 39 40 28 24 59 98 36 21 54 176 132 105 81 35 80 72 86 87 87 95 106 103 125 43 126 88 112 119 286 706 274 110
2227 110 759 521 3849 4981 1367 523 413 171 112 141 177 54 190 133 433 184 372 2228 7423 11854 4172 1510
2020 1510 468 1013 287 220 276 1412 488 186 176 189 296 121 112 109 206 108 103 168 173 202 56 181 99 124 160 52 179 113 143
1748 143 132 175 260 193 8 360 306 179 219 247 250 308 252 414 253 178 595 476 700 681 97 1158 662 469 2931 466 6058
1495 6058 46511 108816 43178 11646 4321 976 1818 863 7408 3387 694 1740 1354 1446 2379 2902 1116 4770
1326 4770 4656 10422 71213 70362 19694 9732 4960 4231 2423 1196 885 582 895 771 230 576 549 264 280 80 163
1128 163 138 218 239 230 150 151 125 64 175 165 214 142 123 39 94 114 96 200 124 115 83 60 115 133 111 66 163 45 106 54 71 184 106 828
809 828 877 179 126 44 102 113 77 23 57 33 15 78 64 63 106 102 5 59 17 71 185 166 72 413 565 256 148 12 6 118 294 560
509 560 888 504 924 997 927 479 238 105 149 58 66 82 118 79 56 66 98 95 27 77 73 90 77 71 86 45 30 42 93 102 21 109 54 38 66
180 66 43 75 135 24 0 60 23 23 67 104 102 100 3 18 55 44 67 84 71 41 31 26 53 99 31 135 58 67 102 32 50 84 53 112 66 24 65
-167 65 93 57 44 53 129 29 57 16 51 48 90 128 118 28 63 25 68 120 106 88 147 123 42 68
-393F8
##PAGE=	F1=-1867.09
##FIRST=	4405.4455391999963467,	4405.4455391999963467,	0
##DATA TABLE=	(F2++(Y..Y)), PROFILE
4405 222 238 231 151 201 189 107 225 189 194 164 210 72 106 91 211 118 172 148 68 63 138 104 105 113 161 73 76 90 52 116 136 122 84 86 90 65 123
4058 123 46 139 52 114 95 44 59 73 72 98 114 74 57 95 64 124 85 119 119 68 67 68 24 92 59 77 100 16 60 83 50 116 36 139 58 45
3720 45 58 82 48 73 57 86 92 58 60 56 87 46 51 94 61 41 32 62 12 75 101 53 33 35 24 33 105 23 49 97 44 30 54 60 47 94 71 72 42 21
3344 21 122 102 104 41 124 85 87 13 76 69 113 4 98 25 32 55 61 81 121 44 47 60 4 41 44 65 85 42 137 43 42 131 143 158 131 73 170 218
2988 218 80 229 353 523 543 2746 4416 5685 7902 3473 1301 423 383 454 313 618 1086 532 244 538 556 136 361
2772 361 352 230 786 785 619 3115 8074 8647 2648 493 1310 261 250 71 276 38 179 221 94 121 59 106 89 133 90 126
2527 126 95 51 55 100 61 87 75 77 128 125 221 37 116 138 103 119 28 101 52 7 120 143 51 90 138 47 85 82 463 634 193 209 664 658
2208 658 3055 3934 1367 651 433 47 243 100 214 100 287 230 267 313 620 2305 4996 9412 4920 1333 145 745
2002 745 229 264 70 1124 303 218 228 148 341 164 190 138 294 187 161 252 64 227 223 219 234 252 200 225 194 168 172 218 232 247 234
1711 234 308 323 104 353 268 264 384 298 316 228 323 561 171 485 486 523 1068 222 414 1438 920 3519 10712 14234 5395 12838
1466 12838 3437 1300 2131 1078 1572 3477 3993 1237 693 992 619 1981 5036 6095 4922 3806 6659 55644
1297 55644 56672 17318 8595 4634 4467 2410 895 638 771 916 1310 179 757 600 250 240 244 281 316 360 326 249 185
1081 185 127 171 231 327 182 308 179 173 133 208 182 244 180 155 146 132 186 65 253 179 152 162 94 123 124 140 274 186 692 619 55 25
781 25 99 74 210 136 63 62 82 113 67 192 48 99 104 73 46 130 181 151 237 136 304 352 313 133 107 97 165 233 576 712 302 766
480 766 877 755 289 180 20 61 83 69 93 152 70 11 22 49 88 132 62 83 86 20 19 18 114 128 87 67 74 53 54 170 86 91 99 48 98 64
142 64 88 140 86 96 48 72 62 30 93 85 139 74 85 77 72 45 64 132 47 170 22 101 33 55 140 144 76 124 54 98 83 113 95 170 120 88 82
-205 82 91 69 131 134 168 131 127 131 143 112 162 158 209 217 174 147 192 175 182 225
-393B25
##PAGE=	F1=-1885.87
##FIRST=	4405.4455391999963467,	4405.4455391999963467,	0
##DATA TABLE=	(F2++(Y..Y)), PROFILE
4405 313 308 287 174 216 241 166 315 274 274 194 226 76 122 146 274 190 226 187 62 70 157 142 182 172 201 101 68 92 73 167 189 175 98
4096 98 92 101 23 158 120 174 87 149 88 33 92 121 120 150 141 97 50 98 109 130 138 169 154 59 51 63 60 141 114 125 113 28 35 52 84 170 93 167 84
3729 84 37 70 62 87 106 110 102 119 23 43 126 124 75 89 109 76 28 60 102 40 112 147 56 50 12 50 70 144 85 53 106 41 26 89 102 68 130 102
3373 102 73 13 45 174 75 157 86 124 92 88 58 40 129 149 39 102 10 56 36 82 124 160 59 24 65 48 37 89 131 107 64 104 41 97
3053 97 88 110 182 123 81 140 202 206 234 307 530 515 2474 3708 4747 3444 1356 1264 377 521 392 216 889 947 552 113 428
2800 428 676 129 254 387 308 672 706 742 3115 6818 6931 1991 700 1404 281 279 136 326 55 257 275 159 169 103
2574 103 159 142 188 157 198 134 108 105 142 122 122 143 142 185 122 258 65 173 214 170 159 79 124 97 74 182 173 137 161 188 102 123 53 540
2255 540 483 177 254 547 763 2601 3059 1227 764 409 175 308 158 351 174 336 273 191 323 807 2159 3057 6804
2039 6804 5021 1180 516 453 146 475 353 1569 418 247 252 284 447 256 269 263 383 303 285 372 192 317 361 332 385 419
1795 419 349 398 365 341 351 416 449 465 521 458 532 343 557 574 562 745 694 682 608 659 975 647 1133 1261 1347 1664 1154 917 2349
1523 2349 2916 4905 18779 17622 95232 49767 9030 3075 3414 519 2155 6348 4512 2271 620 964 100
1363 100 1232 3849 5807 4000 2522 3388 37076 39187 13370 6697 3811 4163 2215 1047 597 963 510 1866
1194 1866 401 935 540 306 268 390 358 411 437 366 291 242 194 261 336 423 213 370 218 257 216 320 239 324 200 194 186 200 282 152
912 152 300 256 215 189 173 159 203 195 332 254 474 516 66 105 189 155 257 195 114 109 160 165 149 259 99 126 126 116 112 205 239 126 295
602 295 168 293 157 358 177 177 132 211 149 574 333 102 461 733 475 212 120 67 28 151 161 153 171 104 40 92 72 153 186 112
321 112 101 93 25 91 76 176 184 135 73 57 78 48 254 143 138 120 90 59 110 143 204 133 155 69 45 30 40 163 146 186 132 91 74 122 83
-8 83 128 192 95 217 24 72 69 91 172 212 127 155 55 89 121 178 147 237 154 105 102 68 118 201 204 238 174 143 114 158 186 219 259 291 255 203
-346 203 178 212 232 277 322
-393C22
##PAGE=	F1=-1904.65
##FIRST=	4405.4455391999963467,	4405.4455391999963467,	0
##DATA TABLE=	(F2++(Y..Y)), PROFILE
4405 278 262 253 143 179 236 146 292 247 251 162 195 70 116 146 242 177 198 163 39 80 145 119 173 156 173 90 51 81 75 160 167 169 69 71 107
4077 107 21 145 123 142 82 144 64 35 99 122 106 141 117 88 38 98 116 106 148 154 137 57 36 54 52 143 103 134 81 30 25 38 86 168 94 143
3739 143 92 37 64 40 90 87 114 99 105 4 45 159 121 51 82 100 63 24 67 104 35 106 139 50 59 2 64 58 129 98 29 100 55 38 96 99
3401 99 68 113 90 74 7 62 174 72 159 86 102 72 88 64 49 134 137 35 91 26 70 47 82 108 150 56 9 60 66 43 95 133 92 65 83
3072 83 30 107 39 118 165 97 97 126 191 283 256 299 535 406 1926 3377 3790 1780 1365 1007 539 565 352 207 1021 862 537
2819 537 83 494 691 125 108 331 318 502 501 852 2724 4211 4231 1880 667 1445 266 313 169 337 96 275 266 174 160
2584 160 102 176 148 187 155 207 110 111 111 128 139 113 139 141 172 123 225 81 169 217 165 134 73 101 91 87 191 129 160 156 185 88 129 19 486
2255 486 315 153 202 452 778 2882 3160 1045 805 357 248 271 209 410 152 296 226 151 233 852 1810 2089 4911 4432
2030 4432 1009 748 201 85 570 520 2005 684 248 223 357 432 267 254 265 364 295 285 375 210 302 350 322 382 416 336 391
1776 391 376 348 365 418 466 476 567 384 575 426 503 613 566 755 730 691 635 664 992 710 1180 1345 1450 1522 1280 854 2417 3865
1513 3865 3546 16533 31916 119270 56523 12689 3662 3165 297 2235 4907 2755 2093 1088 960 353 567 1056
1344 1056 3365 2485 1113 1206 19547 21662 8864 4441 2607 3338 1885 1771 860 941 1000 2178 686 1101 325 275
1156 275 185 383 294 353 364 279 247 200 170 238 297 361 189 310 176 252 192 309 185 294 156 157 168 184 270 147 234 247 201 171 181
865 181 130 188 166 288 262 314 490 132 107 186 149 218 180 112 96 166 135 149 229 73 119 110 103 105 190 196 128 260 156 249 266 325 178 169
546 169 93 196 227 501 97 277 97 443 151 98 64 91 47 148 168 143 136 112 56 110 65 162 155 110 84 78 41 113 85 168 162 132 57
236 57 34 73 47 264 130 122 91 109 30 113 134 202 104 152 59 27 26 54 173 132 163 126 63 69 150 77 127 174 77 206 18 59 80 91 136
-92 136 199 112 148 52 87 124 177 127 224 132 79 106 70 117 192 183 220 150 115 86 142 187 180 254 260 205 175 161 177 217 261 294
-393B94
##PAGE=	F1=-1923.43
##FIRST=	4405.4455391999963467,	4405.4455391999963467,	0
##DATA TABLE=	(F2++(Y..Y)), PROFILE
4405 144 128 154 74 98 169 47 167 125 142 106 132 61 79 86 125 95 107 87 21 75 93 39 90 79 98 49 38 49 44 93 84 106 5 40 110
4077 110 27 84 62 60 38 108 26 37 72 72 40 76 54 62 32 93 82 71 120 82 77 53 48 28 29 96 33 106 33 44 27 32 67 117 69 83 92 47 47
3711 47 27 44 28 69 89 60 6 65 150 71 27 34 81 30 24 52 65 24 67 87 63 49 5 39 1 66 67 27 103 57 31 69 63 28 59 43 70
3363 70 5 54 129 93 123 45 61 31 74 43 85 88 84 15 61 62 63 32 59 48 112 25 8 65 52 2 93 80 58 44 75 43 69 20 102 97 36 117
3006 117 98 187 290 292 321 503 237 1279 3167 3733 5530 2757 583 742 493 346 395 1014 960 579 80 645 586 143
2781 143 50 190 285 325 287 958 2084 2314 1476 2513 623 1409 224 335 172 301 107 226 208 136 112 68 153 115 131 92
2537 92 153 36 68 79 64 108 54 72 85 107 101 132 67 110 154 89 63 30 45 30 48 141 34 106 83 130 86 80 129 344 230 112 68 401
2218 401 707 3756 4361 1051 762 313 248 154 227 404 72 189 109 86 249 829 1591 1711 4538 3634 826 741 38 101
1992 101 495 565 1980 855 222 206 316 277 189 143 149 231 169 163 254 115 168 204 179 232 251 165 222 231 202 218 234 288 271 376 162
1701 162 405 335 225 384 295 433 423 389 338 367 635 374 661 769 911 808 660 294 1611 2862 1829 6511 26548
1485 26548 75229 31163 10385 2188 1655 392 1915 1962 2098 991 871 725 265 125 1588 2495 953 93 616
1307 616 6427 7348 4815 2263 1290 2183 1505 2558 1248 715 2586 2102 820 1330 288 132 29 236 117 165 167 100
1100 100 110 64 49 108 136 158 125 146 62 160 75 180 42 177 49 51 101 90 157 55 83 160 130 98 125 43 87 77 159 228 284 335 149
790 149 44 106 57 115 100 77 33 104 34 74 119 15 88 55 42 33 96 63 171 140 110 117 307 227 99 100 23 129 386 382 436 433 173 182
471 182 145 72 49 63 20 77 97 71 71 86 52 73 21 106 52 56 64 43 40 78 53 100 77 86 14 7 39 47 203 69 54 50 96 11 69 66 136 30
114 30 98 20 23 26 25 122 63 83 67 18 65 137 23 63 88 52 145 44 51 51 45 37 118 47 114 57 85 82 114 52 140 89 26 101 71 68 106 84 129
-252 129 84 60 52 93 112 60 155 137 105 106 106 92 127 141 161
-393A61
##PAGE=	F1=-1942.21
##FIRST=	4405.4455391999963467,	4405.4455391999963467,	0
##DATA TABLE=	(F2++(Y..Y)), PROFILE
4405 88 50 78 10 6 81 82 41 54 28 116 77 60 45 54 36 64 52 4 20 55 27 63 57 20 67 5 33 6 28 20 79 26 80 30 108 41 8 45
4049 45 70 55 69 8 28 23 20 48 8 66 53 37 87 33 105 86 54 14 57 65 11 86 28 58 75 77 68 34 48 94 54 98 45 96 60 46 66 24
3692 24 53 14 103 9 14 93 113 25 111 32 86 11 32 49 21 85 76 24 91 44 11 16 76 32 29 92 124 53 34 37 70 43 50 25 76 18 41 73
3335 73 132 102 15 37 28 61 63 127 43 59 62 36 97 68 21 87 61 94 53 18 103 26 65 124 34 83 23 79 80 43 76 67 25 36 132 63 194
2988 194 254 338 337 455 109 1095 2999 5147 8246 3470 440 850 330 379 606 963 1212 747 175 746 418 195 163 28
2762 28 271 195 317 1046 1564 4454 2462 3918 868 1286 202 334 159 228 103 138 143 72 79 51 113 80 53 31 69 58 21
2509 21 47 21 63 46 23 56 85 74 17 82 71 72 35 79 89 86 53 59 81 124 15 27 106 183 36 245 223 270 129 124 386 608 4842
2199 4842 5988 1344 656 300 204 42 233 388 133 88 47 54 480 882 1890 2484 5364 3464 766 562 296 173 306
1983 306 597 1657 929 200 251 195 167 88 13 23 45 10 14 78 58 21 16 22 57 23 74 55 67 9 5 69 49 32 68 184 211 227 133 43
1664 43 109 83 37 95 196 89 166 355 176 226 334 170 406 580 361 587 3833 5034 8590 4417 10090 4427 637
1448 637 749 650 1532 5285 4011 472 255 434 88 263 2992 3064 242 812 679 3138 1887 2021 536 221 1019
1250 1019 1174 3106 1658 693 4322 1658 787 1684 712 128 266 77 83 66 91 163 61 101 108 75 102 110 93 99 79 45 77 22
987 22 151 61 106 84 91 48 25 89 91 98 92 5 54 95 50 104 88 199 338 234 154 106 81 71 77 29 76 74 29 90 52 20 117 93 29 57 63
640 63 62 103 267 86 58 131 200 152 57 82 78 84 486 352 627 513 254 332 233 234 90 10 55 56 17 57 85 43 46 12 78 21 78 33 98
311 98 23 56 12 75 62 46 41 45 45 28 99 120 79 61 95 71 22 16 36 45 111 55 22 31 31 37 44 79 26 30 44 68 93 52 28 24 125 68 73 40 15
-74 15 24 88 42 63 85 64 81 19 62 93 56 101 42 95 66 42 49 50 16 80 48 27 30 2 94 56 11 105 36 44 38 47 24 59
-393E9
##PAGE=	F1=-1960.99
##FIRST=	4405.4455391999963467,	4405.4455391999963467,	0
##DATA TABLE=	(F2++(Y..Y)), PROFILE
4405 185 141 101 47 62 70 177 135 151 88 150 76 58 62 113 138 125 101 65 11 30 55 140 138 76 109 19 29 34 61 69 161 26 131 28 103
4077 103 61 69 114 141 91 47 27 12 35 68 109 65 117 64 38 85 49 152 68 120 50 62 68 44 142 27 127 65 121 80 45 68 143 45
3758 45 143 73 95 67 59 105 81 98 42 122 30 33 113 71 70 171 76 101 28 45 72 53 131 117 30 101 56 14 61 133 83 30 134 138 50 57 56
3410 56 112 80 90 63 86 33 50 63 148 118 51 47 63 63 106 149 71 93 93 34 115 93 43 133 118 102 94 12 142 18 115 155 80 124 20 74
3072 74 99 91 113 39 71 86 129 52 216 215 347 313 433 144 1617 2868 7265 9620 3372 951 825 143 448 727 999 1476
2828 1476 952 321 750 322 263 219 200 309 156 485 1094 1767 7063 4166 5475 1241 1083 287 309 142 148 99 51 98 38
2593 38 91 65 92 83 48 84 11 118 34 57 96 63 107 97 106 135 64 75 122 121 76 115 139 145 155 115 116 82 220 62 103 148 265 93 317
2265 317 212 335 164 262 380 544 5616 7194 1681 516 305 161 127 237 373 253 97 192 151 726 1001 2432 3413
2049 3413 5316 3999 861 368 573 238 122 682 1472 981 196 281 143 317 109 139 142 120 129 145 65 158 178 149 175 172 168 251
1786 251 214 181 172 168 276 197 263 194 339 324 269 398 278 403 429 412 366 516 399 391 772 786 875 694 756 1133 1201 817 1694 5124
1504 5124 11887 12313 72402 44136 2231 2607 2030 873 1405 7142 4400 1356 707 470 341 656 2941 2551 675
1326 675 976 498 4984 5750 1093 528 532 470 970 3257 2038 1150 5724 1136 1141 2127 1146 365 390 168 216 227 257 304 183
1091 183 216 219 203 254 287 114 225 173 90 187 148 270 92 195 177 144 136 126 186 196 154 129 62 74 182 150 185 187 180 347 335 173 185
781 185 152 165 146 88 104 146 80 179 126 125 180 123 83 123 133 157 225 371 194 27 260 157 168 173 157 106 110 481 421 699 548 167
480 167 446 235 330 128 48 109 135 95 122 134 11 53 67 134 50 173 79 134 41 80 58 122 116 116 47 80 76 67 148 90 136 123 141 55 42
152 42 73 109 44 186 82 40 33 51 88 36 146 82 74 73 78 50 111 99 106 179 32 84 40 57 74 177 82 118 73 55 78 60 105 169 87 124
-186 124 76 97 64 99 132 138 61 120 76 41 17 100 197 116 111 171 14 30 112 119 150 151
-393A51
##PAGE=	F1=-1979.77
##FIRST=	4405.4455391999963467,	4405.4455391999963467,	0
##DATA TABLE=	(F2++(Y..Y)), PROFILE
4405 198 145 97 66 91 94 197 167 166 97 134 99 44 73 138 170 132 97 81 38 13 93 158 160 76 113 16 38 58 70 86 192 27 134 2
4086 2 93 67 100 134 157 80 46 25 13 67 89 120 72 124 70 29 81 77 155 48 145 61 64 54 59 160 48 145 61 122 74 54 68 162 56
3758 56 150 77 77 62 58 119 105 95 45 121 39 54 109 40 85 179 81 98 23 52 84 69 136 124 43 79 61 8 85 145 96 23 134 131 40 74
3419 74 77 123 75 96 70 84 39 61 72 118 122 55 42 76 63 124 134 85 104 87 31 106 110 49 146 131 90 107 33 154 13 123 153 98 132
3091 132 29 48 84 115 123 6 87 97 111 53 257 186 286 243 456 124 2192 2597 9309 9800 2531 1493 692 90 541 707
2847 707 1130 1626 1077 450 671 408 320 215 352 351 163 578 1101 2542 8729 4586 6622 1501 830 446 264 124 116
2631 116 89 7 44 56 87 55 107 86 74 112 38 133 25 61 136 75 122 121 127 153 57 119 138 156 100 150 144 149 183 135 140 90 246 92 128 166
2293 166 282 128 313 216 362 161 316 360 534 5643 7343 1841 372 309 157 190 235 317 339 120 362 256 899 1040
2067 1040 2818 3761 3356 4483 919 341 800 297 97 744 1497 1041 189 243 264 416 148 187 177 196 156 183 119 183 239
1833 239 196 221 227 231 299 268 229 218 215 362 259 328 294 335 420 282 473 388 485 554 538 423 609 502 551 900 1011 1096 786 936 1326
1541 1326 1404 1369 2871 4354 11199 21646 95860 55363 4879 3444 2419 936 1413 5651 2894 1473 1107 534
1372 534 441 907 1924 1139 621 687 366 3716 5518 1064 897 673 839 938 2984 2355 1647 6420 1294 2164 2572 1467
1166 1467 625 283 190 245 265 304 322 212 234 234 238 307 318 129 232 193 122 210 207 284 97 204 199 156 156 167 210 204 183 143 78 102 206
856 206 174 198 229 132 198 237 184 194 162 182 156 101 102 174 105 199 138 159 174 128 106 148 145 191 251 425 235 33 275 265 189 224 192 72
537 72 111 378 436 692 537 94 393 280 345 147 68 124 164 121 134 138 20 56 104 142 71 196 85 136 45 88 92 126 132 131 51 82 86
227 86 88 157 95 141 133 142 55 54 110 135 70 194 101 24 21 67 108 60 158 87 79 71 84 51 127 121 128 170 48 76 57 83 84 199 92 121 60 26 70
-139 70 97 128 179 101 100 76 106 63 125 165 151 71 119 74 74 30 147 212 140 119 172 25 42 145 148 191 163
-393A63
##PAGE=	F1=-1998.55
##FIRST=	4405.4455391999963467,	4405.4455391999963467,	0
##DATA TABLE=	(F2++(Y..Y)), PROFILE
4405 115 68 39 88 94 75 145 109 95 52 75 118 18 57 114 123 77 32 56 82 12 101 117 115 25 67 27 62 59 45 62 161 21 98 44 77 53
4067 53 89 98 119 30 75 18 31 72 67 81 30 86 79 26 66 76 110 40 120 39 74 26 52 135 51 112 65 83 59 55 45 142 55 121 50 63 49
3720 49 34 107 96 46 22 96 28 70 78 25 57 138 50 77 14 50 70 50 99 89 41 41 52 14 77 108 69 11 95 108 24 73 78 95 30 63 45
3373 45 70 32 60 53 45 91 35 21 65 44 107 84 57 81 49 31 70 103 35 123 96 70 90 85 134 20 83 125 75 109 65 19 35 90 117 49
3035 49 52 75 116 37 319 151 188 183 494 73 2488 2259 10829 9122 1046 1883 513 188 642 555 1248 1584 1061 538 554
2800 554 567 346 170 436 354 147 557 1078 3332 9318 3811 7130 1529 580 603 214 132 172 69 27 41 78 53 29 132
2565 132 60 60 108 31 125 18 37 141 57 85 95 110 121 60 110 120 150 77 136 95 104 167 122 120 60 202 79 102 135 232 121 242 172
2255 172 349 152 270 323 563 4859 6300 1756 274 301 181 209 232 203 387 105 563 347 972 907 2927 4206 2263
2039 2263 4503 815 400 912 385 126 697 1383 1069 171 163 379 383 137 151 127 179 84 123 81 134 199 140 150 165 166 211 185 163
1767 163 142 135 302 167 215 215 190 347 163 358 294 336 419 401 246 452 384 413 677 785 809 393 723 936 1160 1297 2536 2144
1504 2144 4405 17961 68692 41383 3976 2996 1881 879 1263 1932 814 880 993 358 343 888 772 556 438 269
1316 269 357 1144 3229 729 732 410 1016 1039 2395 2578 1937 6241 2080 3386 2938 1668 949 107 104 209 189 233 223 161
1091 161 159 164 181 258 254 153 152 145 85 146 176 202 43 136 157 120 104 122 158 130 145 124 41 87 167 119 141 187 80 207 173 172 133 96 126 95
753 95 65 67 154 77 150 82 127 105 106 95 125 106 152 180 400 189 72 189 274 177 185 168 27 61 228 345 595 452 188 259 330 301
452 301 151 51 91 132 88 92 99 31 47 98 99 41 145 51 110 39 75 84 82 93 89 46 56 72 87 120 68 88 92 104 58 54 107 107 56 136 98 17
95 17 10 68 90 42 109 40 43 46 82 61 95 89 91 102 53 69 71 78 49 153 45 72 56 17 52 98 99 122 58 40 55 118 54 108 131 90 38 81 50
-271 50 102 19 134 140 92 46 109 67 54 129 107 145 79
-393G9
##PAGE=	F1=-2017.33
##FIRST=	4405.4455391999963467,	4405.4455391999963467,	0
##DATA TABLE=	(F2++(Y..Y)), PROFILE
4405 18 57 45 116 96 25 83 10 16 85 48 129 3 24 82 41 23 65 27 111 30 90 44 33 46 31 54 79 45 13 68 97 81 64 90 55
4077 55 24 52 36 54 62 111 31 45 52 23 20 37 28 96 38 42 55 53 78 67 31 92 8 33 85 77 62 87 31 51 50 19 97 77 93 35 79 33 18
3711 18 86 85 23 59 65 41 75 31 30 26 73 24 57 47 42 37 22 47 33 64 50 44 32 41 42 46 52 37 86 28 63 69 56 33 17 23 61 21 53 24 49 41
3316 41 37 42 37 9 65 22 18 59 5 55 21 80 35 97 38 101 69 136 90 60 20 114 54 87 106 64 34 26 113 117 30 67 160 56 386 114 217
2969 217 219 507 347 2420 2850 11623 8073 1018 2063 353 296 729 331 1273 1328 910 593 453 704 332 106 452 309
2753 309 116 442 1044 3861 9039 2688 7193 1293 401 706 181 189 251 67 55 138 102 49 74 150 22 37 118 38 144 74
2509 74 23 130 22 32 55 96 73 85 77 84 128 29 115 59 57 128 121 81 26 128 73 75 76 157 90 155 103 315 197 151 308 611 3646 4518
2189 4518 1484 271 270 198 215 237 64 409 83 761 422 959 618 2796 5026 5226 4049 595 360 877 477 194 545
1973 545 1013 1032 158 137 431 274 125 76 73 105 54 13 41 109 111 54 19 43 42 68 36 95 20 23 172 6 8 61 9 174 52 143 115
1664 115 62 203 161 130 314 197 97 265 298 373 233 503 385 691 1082 1115 242 4095 8255 12863 12995 2126 2360 1320
1438 1320 872 889 1863 1771 219 515 7 240 612 456 1250 546 430 331 1711 1429 428 303 29 942 1138 1683 2663
1222 2663 1962 5266 2857 4365 3152 1798 1384 697 340 183 86 117 94 138 72 110 77 164 393 224 299 78 11 38 117
987 117 94 97 36 96 89 17 34 69 32 88 114 23 44 99 20 51 98 138 606 693 151 84 22 68 9 72 43 109 40 72 17 77 12 88 73
659 73 72 86 75 56 313 115 124 197 183 158 156 115 92 21 125 193 402 303 199 235 285 231 149 36 38 67 35 41 67 49 29 62 35 19 53
330 53 18 83 50 55 45 29 29 28 61 47 43 81 54 19 12 32 59 58 49 73 61 50 48 101 62 29 53 45 26 29 40 41 17 69 52 36 28 26 24 60 79 75 50
-74 50 17 70 31 6 76 50 23 71 40 35 35 68 37 123 37 63 57 22 84 67 47 112 46 83 26 29 71 27 115 77 90 37 66 44
-393D4
##PAGE=	F1=-2036.11
##FIRST=	4405.4455391999963467,	4405.4455391999963467,	0
##DATA TABLE=	(F2++(Y..Y)), PROFILE
4405 111 129 91 120 94 24 91 79 99 139 85 122 10 6 87 53 69 137 42 111 54 73 22 42 87 79 64 77 27 45 106 42 120 75 118 29
4077 29 13 15 56 6 120 128 48 51 21 19 31 92 18 106 49 14 29 76 103 29 59 100 42 31 47 109 56 101 34 53 42 44 55 106 101 58 97 20
3720 20 61 78 100 77 102 45 72 71 16 40 68 18 60 45 76 32 0 46 43 28 88 84 61 43 7 22 72 77 32 75 52 53 64 65 82 33 45 71
3363 71 26 50 55 124 19 56 70 8 36 25 24 55 68 43 77 36 53 56 103 22 147 66 165 47 98 64 131 79 89 131 110 94 50 107 169
3035 169 87 95 206 125 430 137 353 288 467 690 2015 4631 11715 7278 3410 2029 260 457 778 176 1191 904
2828 904 682 636 403 781 277 30 419 239 210 280 1005 4036 8237 2800 7275 841 332 735 171 264 306 90 97 209
2603 209 121 91 132 157 52 69 154 73 182 113 60 116 52 63 59 114 73 102 72 62 125 51 125 102 80 89 151 63 67 97 98 97 48 128 65 136
2265 136 54 289 257 29 366 646 2610 2852 1158 299 210 187 218 244 76 411 96 897 475 891 281 2489 4995 6580
2039 6580 3227 463 162 714 496 317 356 557 923 165 167 413 224 146 64 105 45 157 84 111 153 97 93 115 77 91 126 128 163
1767 163 116 138 134 161 175 174 159 149 245 65 181 190 289 264 330 524 202 261 204 236 595 725 647 682 439 1329 699 1460 9662 14808
1485 14808 40701 13351 4057 2644 1625 941 453 3781 2233 768 345 341 358 223 419 1217 617 630 360 2723
1297 2723 1925 595 137 398 774 1112 1064 2557 1789 3774 3353 4781 3158 1909 1909 1391 775 279 104 119 134 216 122
1081 122 178 16 99 714 353 591 55 55 59 114 99 171 55 83 107 80 56 37 66 109 128 79 18 62 76 32 29 212 875 1062 131
790 131 129 95 109 75 132 65 67 78 51 89 81 71 93 71 23 132 19 49 221 105 163 321 198 145 258 100 135 87 133 75 170 148 113
480 113 307 144 149 142 66 60 36 65 66 83 67 16 30 44 63 41 42 76 70 51 16 68 49 53 74 77 10 87 19 48 58 50 56 54 44 33 68 74 43 109
105 109 88 46 32 15 61 42 97 87 10 50 30 27 31 34 79 67 89 75 18 66 19 84 57 91 66 14 35 16 55 95 120 29 115 26 24 17 95 136
-252 136 84 64 97 77 33 79 62 151 47 132 89 60 54 63 137
$$ [...]
-393C8
##END NTUPLES=	nD NMR SPECTRUM
##END=	
##END=	
