##TITLE=	Mar09-2022.21.fid
TM-VI-295 13C

##JCAMP-DX=	6.0	$$ MestReNova 14.3.1-31739
##DATA TYPE=	LINK
##BLOCK_ID=	1
##BLOCKS=	2    
##ORIGIN=	Mestrelab Research S.L.
##OWNER=	hrzepa
##$MNOVA/LINK_BLOCK_TYPE=	ITEM	$$ NMR Spectrum
##$MNOVA/ITEM/POLYGON=	(XY..XY)
5321,5835
8722,5835
8722,8208
5321,8208
5321,5835
##$MNOVA/ITEM/Z=	0
##$MNOVA/ITEM/ANGLE=	0
##TITLE=	Mar09-2022.21.fid
##JCAMP-DX=	6.0	$$ MestReNova 14.3.1-31739
##BLOCK_ID=	2
##DATA TYPE=	MNOVA NMR VIEW DATA
##DATA CLASS=	MNOVA VIEW DATA
##$MNOVA/ITEM/ZOOM/X=	-31.150195598113686657,	251.15679998888273872
##$MNOVA/ITEM/ZOOM/Y=	-283.49371528625488281,	3221.088958740234375
##END=	
##TITLE=	Mar09-2022.21.fid
##JCAMP-DX=	6.0	$$ MestReNova 14.3.1-31739
##BLOCK_ID=	3
##DATA TYPE=	NMR SPECTRUM
##DATA CLASS=	XYDATA
##NUMDIM=	1
##ORIGIN=	Bruker BioSpin GmbH
##OWNER=	nmr
##.OBSERVE FREQUENCY=	100.64143946071199309
##.OBSERVE NUCLEUS=	^13C
##.SOLVENT NAME=	CDCl3
##.PULSE SEQUENCE=	zgpg30
##LONGDATE=	2022/03/09 22:57:00.000
##.ACQUISITIONMODE=	SIMULTANEOUS (DQD)
##$ORIGINAL FORMAT=	Bruker XWIN-NMR
##$MNOVA/SCALES_VERSION=	9
##$PARAMETER FILE=	(acqus, ASCII, /private/var/folders/f6/rjf_tdyn2v98c5c0wvkgn4s80000gn/T/9XJaOC3qTVasi2pfN3g4Ew/21/acqus, 0)
$$ ##TITLE= Parameter file, TOPSPIN		Version 3.2
$$ ##JCAMPDX= 5.0
$$ ##DATATYPE= Parameter Values
$$ ##NPOINTS= 11	$$ modification sequence number
$$ ##ORIGIN= Bruker BioSpin GmbH
$$ ##OWNER= nmr
$$ $$ 2022-03-09 22:57:31.841 +0000  nmr@CZC2439F63
$$ $$ /opt/topspin/data/agmb/nmr/Mar09-2022/21/acqus
$$ $$ process /opt/topspin3.2/prog/mod/shimcntl
$$ ##$ACQT0= -1.90126054427203
$$ ##$AMP= (0..31)
$$ 100 100 100 100 100 100 100 100 100 100 100 100 100 100 100 100 100 100
$$ 100 100 100 100 100 100 100 100 100 100 100 100 100 100
$$ ##$AMPCOIL= (0..19)
$$ 0 0 0 0 0 0 0 0 0 0 0 0 0 0 0 0 0 0 0 0
$$ ##$ANAVPT= -1
$$ ##$AQSEQ= 0
$$ ##$AQ_mod= 3
$$ ##$AUNM= <au_zg>
$$ ##$AUTOPOS= <52 >
$$ ##$BF1= 100.63037
$$ ##$BF2= 400.2
$$ ##$BF3= 100.63037
$$ ##$BF4= 100.63037
$$ ##$BF5= 100.63037
$$ ##$BF6= 100.63037
$$ ##$BF7= 100.63037
$$ ##$BF8= 100.63037
$$ ##$BYTORDA= 0
$$ ##$CAGPARS= (0..11)
$$ 0 0 0 0 0 0 0 0 0 0 0 0
$$ ##$CFDGTYP= 0
$$ ##$CFRGTYP= 9
$$ ##$CHEMSTR= <none>
$$ ##$CNST= (0..63)
$$ 1 1 145 1 1 1 1 1 1 1 1 1 1 1 1 1 1 1 1 1 1 1 1 1 1 1 1 1 1 1 1 1 1 1 1
$$ 1 1 1 1 1 1 1 1 1 1 1 1 1 1 1 1 1 1 1 1 1 1 1 1 1 1 1 1 1
$$ ##$CPDPRG= (0..8)
$$ <waltz16> <> <waltz16> <> <mlev> <mlev> <mlev> <mlev> <mlev>
$$ ##$D= (0..63)
$$ 0 1 0.00345 0 0 0 0 0 0 0.06 0 0.03 2e-05 3e-06 0 0 0.0002 0 0 0 0 0 0
$$ 0 0 0 0 0 0 0 0 0 0 0 0 0 0 0 0 0 0 0 0 0 0 0 0 0 0 0 0 0 0 0 0 0 0 0 0
$$ 0 0 0 0 0
$$ ##$DATE= 1646866650
$$ ##$DE= 6.5
$$ ##$DECBNUC= <off>
$$ ##$DECIM= 704
$$ ##$DECNUC= <off>
$$ ##$DECSTAT= 4
$$ ##$DIGMOD= 1
$$ ##$DIGTYP= 12
$$ ##$DQDMODE= 0
$$ ##$DR= 21
$$ ##$DS= 4
$$ ##$DSPFIRM= 0
$$ ##$DSPFVS= 20
$$ ##$DTYPA= 0
$$ ##$EXP= <c13>
$$ ##$F1LIST= <111111111111111>
$$ ##$F2LIST= <222222222222222>
$$ ##$F3LIST= <333333333333333>
$$ ##$FCUCHAN= (0..9)
$$ [...]
$$ 90 74 58 42 26 10 0 0
$$ ##$Sgu3PowerLevels= (0..7)
$$ 0 0 0 0 0 0 0 0
$$ ##$Sgu4PowerLevels= (0..7)
$$ 0 0 0 0 0 0 0 0
$$ ##$Sgu5PowerLevels= (0..7)
$$ 0 0 0 0 0 0 0 0
$$ ##$Sgu6PowerLevels= (0..7)
$$ 0 0 0 0 0 0 0 0
$$ ##$Sgu7PowerLevels= (0..7)
$$ 0 0 0 0 0 0 0 0
$$ ##$Sgu8PowerLevels= (0..7)
$$ 0 0 0 0 0 0 0 0
$$ ##$SguType= 3
$$ ##$ShimPowMaxUA= (0..63)
$$ 130000 130000 130000 130000 130000 130000 130000 130000 130000 130000 130000
$$ 130000 130000 130000 130000 130000 130000 130000 130000 130000 0 0 0 0
$$ 0 0 0 0 0 0 0 0 0 0 0 0 0 0 0 0 0 0 0 0 0 0 0 0 0 0 0 0 0 0 0 0 0 0 0 0
$$ 0 0 0 0
$$ ##$ShimPowMaxUC= (0..63)
$$ 130000 130000 130000 130000 130000 130000 130000 130000 130000 130000 130000
$$ 130000 130000 130000 130000 130000 130000 130000 130000 130000 0 0 0 0
$$ 0 0 0 0 0 0 0 0 0 0 0 0 0 0 0 0 0 0 0 0 0 0 0 0 0 0 0 0 0 0 0 0 0 0 0 0
$$ 0 0 0 0
$$ ##$ShimPowMaxUG= (0..63)
$$ 524287 524287 524287 524287 524287 524287 524287 524287 524287 524287 524287
$$ 524287 524287 524287 524287 524287 524287 524287 524287 524287 0 0 0 0
$$ 0 0 0 0 0 0 0 0 0 0 0 0 0 0 0 0 0 0 0 0 0 0 0 0 0 0 0 0 0 0 0 0 0 0 0 0
$$ 0 0 0 0
$$ ##$ShimPowRcbType= 3
$$ ##$ShimPowRes= (0..63)
$$ 1e-20 1e-20 1e-20 1e-20 1e-20 1e-20 1e-20 1e-20 1e-20 1e-20 1e-20 1e-20
$$ 1e-20 1e-20 1e-20 1e-20 1e-20 1e-20 1e-20 1e-20 0 0 0 0 0 0 0 0 0 0 0 0
$$ 0 0 0 0 0 0 0 0 0 0 0 0 0 0 0 0 0 0 0 0 0 0 0 0 0 0 0 0 0 0 0 0
$$ ##$ShimPowRng0= (0..63)
$$ 1 1 1 1 1 1 1 1 1 1 1 1 1 1 1 1 1 1 1 1 0 0 0 0 0 0 0 0 0 0 0 0 0 0 0 0
$$ 0 0 0 0 0 0 0 0 0 0 0 0 0 0 0 0 0 0 0 0 0 0 0 0 0 0 0 0
$$ ##$ShimPowRng1= (0..63)
$$ 1 1 1 1 1 1 1 1 1 1 1 1 1 1 1 1 1 1 1 1 0 0 0 0 0 0 0 0 0 0 0 0 0 0 0 0
$$ 0 0 0 0 0 0 0 0 0 0 0 0 0 0 0 0 0 0 0 0 0 0 0 0 0 0 0 0
$$ ##$ShimPowRng2= (0..63)
$$ 1 1 1 1 1 1 1 1 1 1 1 1 1 1 1 1 1 1 1 1 0 0 0 0 0 0 0 0 0 0 0 0 0 0 0 0
$$ 0 0 0 0 0 0 0 0 0 0 0 0 0 0 0 0 0 0 0 0 0 0 0 0 0 0 0 0
$$ ##$ShimPowRng3= (0..63)
$$ 1 1 1 1 1 1 1 1 1 1 1 1 1 1 1 1 1 1 1 1 0 0 0 0 0 0 0 0 0 0 0 0 0 0 0 0
$$ 0 0 0 0 0 0 0 0 0 0 0 0 0 0 0 0 0 0 0 0 0 0 0 0 0 0 0 0
$$ ##$ShimSysFunc= (0..63)
$$ 1 2 3 4 5 7 9 11 15 16 8 10 12 14 6 17 13 18 19 20 0 0 0 0 0 0 0 0 0 0
$$ 0 0 0 0 0 0 0 0 0 0 0 0 0 0 0 0 0 0 0 0 0 0 0 0 0 0 0 0 0 0 0 0 0 0
$$ ##$ShimSysMatrix= 0
$$ ##$ShimSysType= 1
$$ ##$TFXNUM= 0
$$ ##$TRIPLO2= 0
$$ ##$VTU= 2
$$ ##$VTUETH= <149.236.99.20>
$$ ##$VTUTY= <no>
$$ ##$WBREFAM= (0..15)
$$ 135.5 97.7 100 100 100 100 100 100 100 100 100 100 100 100 100 100
$$ ##$WBREFLM= (0..15)
$$ 0 0 0 0 0 0 0 0 0 0 0 0 0 0 0 0
$$ ##$WBREFPH= (0..15)
$$ 72.26 -67.22 0 0 0 0 0 0 0 0 0 0 0 0 0 0
$$ ##$WBSGU= (0..15)
$$ 0 0 0 0 0 0 0 0 0 0 0 0 0 0 0 0
$$ ##$XFAC= 2
$$ ##END=
$$ 
##$DECIM=	704
##$DSPFVS=	20
##XUNITS=	HZ
##YUNITS=	ARBITRARY UNITS
##FIRSTX=	25274.001712016048259
##LASTX=	-3134.6557087493106337
##DELTAX=	-0.43348832563920586258
##XFACTOR=	1
##YFACTOR=	0.081698585893854439033
##FIRSTY=	38.46630096435546875
##MINY=	9.3325481414794921875
##MAXY=	2928.2626953125
##NPOINTS=	65536
##XYDATA=	(X++(Y..Y))
$$ [...]
13112E55prlkj0k4l5k8j0QJ7K4L0K8J3KMJ6K0J6PKMJ6K9L2K0Ojqj8k7k2j0mmjOJ2J0jj8l7
13094E98m4l5j7%RJ6K3K7K3J2KjJlj3j5KK3L1K7K4K1Pj6l2l2k4j2%J0J1Jj3l1n3o3m5j4J4
13077D19L5N3N4K9LMK5K2jj2MQj6l9l5j8j0JJ9K9L1L7L9J3k3j9K6N4M1L4N8O7L4J6N1R5J05
13061A233J17J69K21K48L26M97O89R00J276J795J955J192l30j670k054j611j030p28n99m57
13052B139l15k45k09j52j11j06r7n2j7k1k8qJ1ol0l3l0l8m0j6J3J8J4K0K3J0qrooolpj6qJ5
13037F40K3Jj4LK7K1lqJ8M3M6L0Rqj5j9k3k9l5m3n4n6k8K1N2L9Nj2oKLJ%kkJjqqLRpk1rJ9
13017F05M3N8P7R4Q1L5mjM4R9J48J87K16K23J93J16Pj00j74j99j91j68j48j38j30j09p1k8
13005G65%J1Nok1l0l2k7k9l5l5k9k5k3j3OK4K2%k2k9j7njmlkj0k5k7oK7M6M2L0K5K5J6kj6
$$ y = [555, 548, 539, 536, 534, 524, 500, 465, 437, 427, 435, 452, 476, 506, 534, 547, 549, 553, 569, 589, 605, 612, 614, 618, 634, 663, 695, 715, 721, 720, 712, 694, 667, 645, 635, 631, 627, 626, 632, 644, 654, 653, 635, 598, 554, 519, 502, 502, 511, 527, 550, 577, 600, 612, 614, 613, 614, 611, 598, 583, 585, 608, 639, 666, 690, 711, 718, 702, 670, 638, 614, 602, 602, 612, 623, 624, 611, 580, 527, 464, 419, 405, 419, 454, 507, 561, 590, 593, 597, 622, 644, 643, 631, 635, 643, 627, 588, 553, 535, 525, 526, 545, 574, 605, 642, 681, 694, 671, 652, 678, 732, 773, 807, 865, 932, 966, 982, 1033, 1128, 1233, 1350, 1519, 1740, 1988, 2314, 2811, 3500, 4400, 5676, 7471, 9426, 10618, 10288, 8618, 6564, 4953, 3923, 3195, 2596, 2139, 1824, 1579, 1370, 1218, 1107, 1001, 904, 852, 835, 814, 786, 778, 789, 783, 753, 720, 690, 652, 612, 596, 609, 627, 641, 661, 684, 694, 686, 677, 671, 665, 659, 656, 649, 633, 625, 640, 663, 664, 650, 653, 680, 701, 698, 690, 708, 751, 797, 827, 836, 828, 813, 794, 771, 742, 707, 664, 610, 554, 526, 547, 599, 638, 643, 631, 625, 627, 630, 631, 631, 629, 627, 628, 627, 619, 611, 614, 623, 616, 595, 586, 605, 648, 706, 783, 877, 958, 993, 989, 988, 1032, 1131, 1279, 1466, 1682, 1905, 2098, 2214, 2221, 2121, 1947, 1748, 1557, 1389, 1241, 1103, 973, 864, 793, 765, 765, 776, 781, 775, 754, 724, 692, 665, 636, 601, 566, 537, 512, 489, 476, 482, 506, 528, 528, 506, 477, 460, 455, 454, 450, 447, 445, 435, 410, 383, 377, 404, 450, 492, 522, 547, 572, 588, 586, 570]
12988E70j4%RLj6l0k5rJ1K2K3K1K4L4L4Qk9m0j9Llk4k6j2j0k8m2k9kJ1OooLJ3K1K2J2oj9j9
12970D36p%j0k8l9k8LL5N3M8K6Kj3qRK4K0lk7k3J0N2P2N7K3j3k9k1KJ8J1rk1j5pm%NPlj1m
12952E90RJ1qk7l3j5J3L8M5L7K2Jk3m1l5j7j0j8k4j8j8k5k4jK6L7L9M7N4N0M0L3K9K3L5P2
12936I14J27K06L35M75M82K57j03l65m07l23k52k15j59q4m0m1m5l6k7k6j8nj0k9l6k1m%mj1
12923E35k5l7l2j8rlK2O1P5N0J0opj1k3k8k4j7pPJ6J8J3J2K2L8M9M4K5MKK5N1N7K9j5n9p8
12907G66o7l9k3k0j6lMj1l5m4m0l3l0k1JJ7J2j3l7k9J7O2O2K2j5k1j3j6k7k4j1nrj1qj2j4
12891C16mJ2K1J8K0K9L0K0K2L2L0Jk9k8kJ5J3Jj1k0k2j6j4j5j0J2L4L5J6KmnrkJ1J0rk2j4
12874D64J%j1j3JJ8L0L3J6j4l9l8j7jORJ4J5PJkjMJ9L3L0J0qj1poojQRkj4j5nkj5l9m6k3J0
$$ y = [570, 556, 556, 565, 568, 552, 522, 497, 488, 499, 521, 544, 565, 589, 623, 657, 665, 636, 596, 577, 580, 577, 553, 527, 515, 505, 477, 435, 406, 404, 415, 421, 415, 409, 412, 425, 446, 468, 480, 474, 455, 436, 429, 429, 419, 391, 352, 324, 327, 362, 415, 463, 489, 491, 478, 470, 479, 503, 523, 520, 493, 470, 480, 532, 604, 661, 684, 671, 642, 621, 623, 641, 652, 643, 622, 607, 600, 596, 596, 601, 608, 605, 594, 590, 599, 610, 602, 575, 542, 527, 540, 578, 623, 660, 682, 683, 660, 619, 584, 567, 557, 539, 515, 497, 479, 454, 430, 429, 455, 492, 531, 578, 632, 682, 722, 755, 784, 807, 842, 914, 1041, 1247, 1582, 2057, 2539, 2796, 2693, 2328, 1921, 1598, 1346, 1131, 972, 888, 848, 807, 762, 726, 699, 673, 655, 650, 640, 611, 575, 554, 550, 550, 546, 535, 510, 473, 441, 423, 414, 411, 433, 494, 569, 619, 629, 623, 616, 605, 582, 554, 530, 513, 506, 513, 529, 547, 560, 572, 594, 632, 681, 725, 750, 754, 756, 781, 832, 889, 918, 903, 844, 766, 699, 660, 637, 617, 601, 598, 602, 591, 556, 512, 472, 439, 409, 388, 389, 406, 418, 405, 368, 339, 356, 418, 480, 502, 487, 466, 453, 437, 410, 386, 375, 370, 361, 350, 342, 330, 316, 312, 324, 345, 363, 383, 412, 442, 462, 484, 516, 546, 547, 518, 490, 488, 503, 516, 517, 506, 486, 464, 448, 434, 419, 409, 421, 455, 490, 506, 508, 504, 499, 490, 488, 499, 509, 500, 478, 464, 465, 465, 454, 441, 442, 460, 490, 523, 539, 525, 486, 448, 431, 430, 436, 445, 459, 474, 481, 482, 480, 479, 483, 502, 535, 565, 575, 567, 556, 549, 543, 537, 536, 544, 553, 551, 537, 522, 517, 515, 500, 461, 415, 392, 402]
12854D02K4J3PK0M0M0K1JnkRK3L1K0ok3k6j4JJ1J6J2%qKK5M1L6Qk8n3o0n0l7l2l5l7k5LK3
12837C88J7nj0J2M1M6L0J1Jrk0k8k0JK8M9N2L4Kk7m6n8n6k9J2L6K6LqkLLQJ5Pj8l9l4j4pj6
12819C79k3rJ5L0K4J0KMJ1Qj1l1l3j4J4K6K3J2Lrk2k2rQJ4J6K6L6K8OpjRnl8n8m1kK6K9J4
12801D38OOjj7k5j6lkoOL4N3M8K3rm0o1o0l8pK0L3L5K1jj1kQ%k4l5k6q%NK2M6N5L5Jk2k0j
12783D60J9L2M2L9J5k1m0k8kJ1O%lj8m8o5n2j7J9M3N8N9L2j3m6m2j3ON%J3L4L6J3j0j0J0K4
12766E48J8%j2j4j5j6j5j0mqj8k1j2LJ2J6K3K8J9JkJ8L5J8j6l3j7Jnj8j8qj2k5k1MK4K1MJ
12749D74J5K4K0Lj5k4k1qL%j3j7nJ3K2J6MomJ6M1N1L1jk0j5PK3K5Pj6k6k1r%RK0K3Lk5l1j0
12731E63QMj0j3nqj6j7mPMpj1lJ1J3Mlmkj3k1oL5O3N3K1PQlk9m3l0rkmlkjRL4N6N1J9j1k6
$$ y = [402, 426, 439, 446, 466, 506, 546, 567, 568, 563, 561, 570, 593, 624, 644, 638, 615, 589, 575, 576, 587, 603, 615, 615, 607, 609, 634, 675, 711, 719, 691, 638, 578, 528, 491, 459, 424, 387, 362, 365, 388, 405, 400, 390, 402, 443, 489, 519, 530, 531, 522, 502, 474, 454, 455, 483, 532, 584, 618, 620, 593, 547, 489, 433, 404, 416, 452, 478, 481, 473, 471, 474, 477, 485, 500, 507, 489, 450, 416, 402, 395, 379, 356, 347, 362, 392, 416, 426, 428, 432, 443, 451, 440, 409, 376, 362, 376, 402, 425, 437, 440, 431, 409, 387, 378, 386, 400, 416, 442, 478, 506, 512, 505, 504, 513, 508, 470, 412, 371, 369, 395, 424, 438, 444, 450, 449, 432, 407, 391, 388, 386, 380, 386, 420, 473, 521, 544, 535, 495, 434, 374, 336, 329, 349, 382, 417, 438, 437, 426, 424, 432, 432, 408, 373, 347, 339, 339, 344, 366, 412, 467, 502, 503, 481, 461, 460, 479, 511, 553, 592, 607, 586, 546, 518, 516, 527, 533, 533, 530, 512, 464, 399, 347, 330, 349, 392, 450, 509, 541, 528, 482, 440, 427, 433, 438, 438, 451, 485, 521, 534, 524, 514, 524, 548, 566, 566, 554, 540, 525, 509, 494, 484, 480, 472, 454, 433, 421, 424, 436, 452, 475, 503, 522, 523, 521, 539, 574, 592, 576, 543, 526, 527, 522, 504, 486, 478, 466, 441, 420, 424, 448, 469, 473, 474, 489, 513, 533, 536, 521, 497, 476, 468, 471, 471, 458, 441, 436, 449, 471, 487, 491, 485, 481, 497, 538, 589, 620, 619, 599, 584, 591, 614, 639, 646, 630, 604, 583, 574, 574, 583, 603, 626, 629, 604, 573, 563, 571, 575, 565, 552, 547, 539, 523, 506, 502, 509, 513, 506, 495, 492, 503, 516, 520, 517, 513, 511, 498, 477, 471, 506, 569, 622, 643, 650, 658, 655, 626, 583, 553, 544, 542, 538, 535, 533, 532, 541, 575, 631, 682, 701, 690, 664]
12711F64k7k5k3j7qLJ0J0PQJ1jk3l7k4KJ1JplJj1k8l4k2kJ5K0J4OOJ6K6K7J3qk9m2m4l8k7
12693C91j0J1K4K5J8J8K2K0Nj0j3kNQJ1K1K4J3loNJ3Pkjol0o0o4l2OK2J8J3J2J3J7K5K9J7
12676E74JrqmLJ8K7J2j8l3k1jJqj0ork0k2qJ8L5L7J9nj9j4NJ7J3mj9k1j4omj1j7k1k4l1l0
12657C63j4J3L4L2K1J7L3M7M2J7pj3j7l3n4n0j8J8L0J9RJ2K2L3L1Rk2m2l6j5OJ6J5Kj6k5j4
12641D65MJ1QPJ3J6J2RRjk3l8l3k2j4qOK0J8kj6j0J2K6K9K0Kj9l5l2rJ7K9K2J1N%j4l2l9k5
12624C99KL1M4M2L4L4M6N3L8Kk9m1l3k0q%J%mj1k7m0m2l0k4k6k2lK1L2L4L8L9K8Orqk%JJj
12605E46qj1j0j1j5j2KK2K7J6mk0k9l3k4%K4L0J1j6k1kK5L5K6J1Jlnrj0lJ4K5J5j6m7n6m0
12588D25k1kJ2K2K1J6J7K0J0j3k0NM3N7L5%k2k8k2rPJ3Kk1l3l0j9rkJ0J9J6OOJ8K7J5mj4j3
$$ y = [664, 637, 612, 589, 572, 564, 567, 577, 587, 594, 602, 613, 612, 589, 552, 528, 530, 541, 542, 535, 532, 533, 522, 494, 460, 438, 436, 451, 471, 485, 491, 497, 513, 539, 566, 579, 571, 542, 500, 456, 418, 391, 381, 392, 416, 441, 459, 477, 499, 519, 524, 514, 501, 499, 504, 512, 523, 544, 568, 581, 578, 572, 577, 590, 597, 595, 594, 588, 558, 498, 434, 402, 408, 430, 448, 461, 473, 486, 503, 528, 557, 574, 575, 566, 558, 554, 557, 575, 602, 614, 596, 563, 542, 541, 542, 534, 524, 518, 509, 489, 467, 459, 477, 512, 549, 568, 563, 544, 530, 535, 552, 565, 561, 542, 521, 507, 501, 497, 486, 469, 448, 424, 393, 363, 349, 362, 396, 428, 449, 466, 499, 546, 588, 605, 598, 585, 568, 535, 481, 431, 413, 431, 461, 480, 489, 501, 523, 556, 587, 596, 574, 532, 496, 481, 487, 503, 518, 520, 504, 479, 465, 469, 480, 488, 495, 508, 524, 536, 545, 554, 553, 530, 492, 459, 437, 423, 415, 421, 441, 459, 457, 441, 431, 443, 469, 498, 518, 520, 501, 466, 434, 425, 442, 471, 493, 504, 509, 509, 495, 463, 424, 399, 401, 432, 476, 518, 552, 586, 632, 685, 723, 725, 696, 655, 622, 602, 594, 594, 595, 595, 591, 580, 553, 513, 471, 441, 417, 391, 369, 366, 387, 419, 453, 491, 530, 558, 564, 555, 547, 545, 545, 546, 547, 546, 538, 527, 517, 506, 491, 479, 481, 503, 530, 546, 542, 522, 493, 460, 436, 436, 460, 490, 501, 485, 464, 462, 487, 522, 548, 559, 560, 557, 552, 543, 533, 530, 544, 569, 584, 568, 521, 465, 425, 404, 402, 414, 436, 457, 473, 490, 510, 520, 507, 487, 492, 535, 592, 627, 627, 605, 577, 555, 546, 553, 566, 568, 547, 514, 484, 465, 456, 454, 464, 483, 499, 505, 511, 529, 556, 571, 567, 553, 540]
12571E40j9l6m7m0j8LJ8K1Oj4k9l3m4n5m2JM8O6N5L8K4Oj3j9j5j6j4mRQjLK5M0K7N%J2K8L3
12554E57K9J6jqmNJj2k5l0k6j1NJ2QPJ7K5J3j5l2k8lK5M0K9Mj7j7oKjj0k3k8j4ROl0o3m8l
12536C55K3J9J8L9N6M1Qj5k2k3j3OJ5NroNJj5j8%K2K9K4J1kqLK1K9K4J9K1J2j5l9l5kK7L7
12518F48K3Jk4l9m1k6nJ5K3J3pj8j1LLj1j7j0jKNJ4J7Lj5j9oJ1J9J9J2pl7n5m9k5nMPJ4J9
12500D47K5K6J8KrnOQkpJPmk2k7k0j2rjN%j2j1RK7K9K5K2J8Jj9k5j9j6j9pK3M6M3K1Mrk3k9
12481E06j1J7L0J4j0k4k9l2k4jK0K4J2PJ1J0mj5pRJ5J0QK0L6M1K8Pj2j8j7j4j6k9l9l9k6j0
12465D48%KOJ0OjjKmk4l5k6nRRP%j3k3j3J3L3L7L3L0K1Jj2j1nmjJ0K5K7J8jk7n2n7l5%K8M5
12446D70N3M2Nl0m2k9k0j5oJ2J6NkRK7M2N5N4L0j3m1k8mnk6l4j4Mkj9j8nKrj7oK0L3J1k8m7
$$ y = [540, 521, 485, 438, 398, 380, 383, 401, 422, 428, 414, 385, 352, 308, 253, 211, 212, 260, 326, 381, 419, 443, 449, 436, 417, 402, 386, 372, 368, 377, 385, 384, 387, 412, 452, 479, 484, 484, 496, 524, 557, 586, 602, 601, 593, 589, 594, 595, 583, 558, 528, 502, 491, 496, 508, 516, 523, 540, 565, 578, 563, 531, 503, 500, 525, 565, 594, 598, 581, 564, 558, 560, 559, 549, 526, 498, 484, 493, 499, 469, 406, 358, 355, 378, 397, 415, 454, 510, 551, 559, 544, 522, 499, 486, 492, 507, 512, 503, 497, 502, 503, 488, 470, 470, 492, 521, 545, 556, 554, 546, 549, 570, 599, 623, 642, 663, 675, 660, 621, 586, 584, 611, 648, 671, 672, 648, 609, 568, 542, 537, 552, 575, 588, 581, 563, 552, 555, 558, 547, 530, 520, 519, 521, 526, 540, 557, 560, 545, 526, 520, 531, 550, 569, 581, 574, 537, 482, 433, 408, 403, 407, 414, 428, 447, 472, 498, 516, 518, 509, 504, 510, 518, 516, 509, 510, 517, 513, 491, 464, 444, 432, 423, 422, 427, 427, 415, 404, 413, 440, 469, 494, 516, 534, 535, 516, 491, 472, 456, 437, 430, 453, 499, 542, 563, 567, 558, 535, 506, 495, 512, 542, 556, 546, 522, 493, 461, 437, 436, 456, 480, 492, 499, 510, 520, 516, 501, 494, 503, 518, 528, 536, 556, 592, 633, 661, 668, 656, 638, 621, 607, 591, 562, 523, 484, 458, 448, 448, 450, 456, 466, 472, 471, 470, 472, 468, 444, 409, 383, 378, 387, 396, 403, 403, 390, 367, 354, 367, 400, 437, 470, 500, 521, 522, 510, 499, 494, 490, 489, 499, 524, 551, 569, 568, 541, 489, 432, 397, 397, 425, 470, 523, 565, 570, 540, 498, 469, 449, 434, 428, 440, 456, 461, 459, 468, 495, 537, 592, 646, 676, 663, 622, 594, 590, 585, 559, 525, 511, 515, 513, 494, 476, 471, 473, 464, 447, 441, 461, 494, 505, 477, 430]
12428D30k2J7L3J5pq%rl2m4l2j2JNK0M2N6M4Rk5l4j9OJ6Pnj1oJOJ6K4K5K0J3Lqj7j5kOJ%R
12409E17K3K7K4K3J8lk3j8J4L2J2k5m9m9m3l8l0j5JRJ2J5K1K6K4J2LJ6L9N0L7J3%pj3j5oj
12392F33j6l8l2JK8K7Q%NPJook%%J%MJ0J8K1Rj7n0o9n7l0j5j9k3rJ5K7J7%oLJ7K6J9NnmMP
12373E09RJ5K4K4J5MNJ8L0K5%l2n1m4j7OJ2Moj1j1j0pj0j6k0j3jLlrj0j1j5j3RL3L5J7%jN
12354D91RPNok0k2lK6L9L6K2Qj2l3m1l5j9jQMj3k3j2J1K4J3jjO%k0l1j8J0L4L8K9J5Nrk8m2
12336D50m0k5j0kJjrj6j1MJ4J9K9M0L6J6MJ3K2J1KJ6L8K8j6n0m3j5%KQJ4Oj7l4l3k5j6pPJ7
12318D27J8J4RPPMrk0j6RL6M4K7kk8l5k3KJ7J4MPK0K2%k5k8nJ8K1Nj1j2oKM%j0k0k4k1j7k1
12300D05k7j7OK9L3K3J4J4J5Qpj9k2j6qpoLJ9K8K3J4J3J5Rrk2j9qnj4j6lJ8L1K9J6Mjkmj0
$$ y = [430, 408, 425, 458, 473, 466, 458, 458, 449, 417, 373, 341, 329, 330, 335, 355, 397, 453, 497, 506, 481, 447, 428, 434, 450, 457, 452, 441, 435, 436, 442, 458, 482, 507, 527, 540, 543, 535, 518, 503, 501, 507, 508, 508, 517, 540, 567, 591, 614, 632, 629, 606, 588, 602, 634, 646, 621, 572, 523, 480, 442, 412, 397, 398, 407, 419, 434, 455, 481, 505, 517, 520, 536, 575, 625, 662, 675, 675, 668, 655, 640, 634, 633, 617, 579, 547, 548, 576, 603, 611, 611, 616, 623, 624, 618, 612, 610, 610, 610, 611, 611, 615, 625, 643, 664, 673, 656, 606, 537, 480, 450, 435, 416, 393, 384, 399, 426, 443, 443, 437, 440, 457, 483, 502, 507, 502, 498, 502, 509, 518, 533, 557, 581, 596, 600, 605, 623, 653, 678, 678, 646, 595, 551, 534, 540, 552, 556, 550, 539, 528, 518, 511, 501, 485, 465, 452, 451, 454, 451, 442, 432, 421, 406, 393, 402, 435, 470, 487, 487, 486, 491, 500, 507, 512, 506, 486, 464, 461, 487, 526, 562, 584, 592, 580, 547, 506, 471, 452, 451, 459, 463, 450, 427, 415, 426, 450, 463, 462, 461, 467, 467, 447, 416, 398, 408, 442, 480, 509, 524, 529, 520, 492, 450, 410, 385, 375, 373, 374, 373, 364, 348, 337, 341, 355, 374, 403, 443, 479, 495, 499, 512, 534, 545, 547, 563, 601, 629, 613, 563, 520, 505, 505, 507, 515, 529, 535, 518, 484, 451, 426, 410, 403, 410, 427, 445, 459, 468, 475, 482, 486, 477, 457, 441, 450, 486, 530, 557, 555, 527, 492, 469, 471, 488, 502, 506, 513, 533, 555, 555, 530, 502, 497, 515, 536, 541, 530, 518, 512, 514, 518, 518, 508, 488, 464, 443, 426, 405, 378, 361, 367, 396, 429, 452, 466, 480, 495, 503, 496, 477, 455, 439, 431, 424, 418, 421, 440, 468, 491, 505, 518, 533, 542, 533, 511, 492, 484, 479, 465, 449, 446, 464, 495, 524, 540, 544, 543, 541, 537, 527]
12281E27j8j8mJ3K1Oj7k9j3K0M0K7j0l9l8j1J7L3L5K9J8PQJ7J7ol8m9l2qLJQK3L0J8pl0l9
12265E12l3j9rj2j7j5%J0J1OLnk0k4oJ8K1ol3l6j3J8M2N2M4K3M%J1K1J9Ompj0k0k4qK6M5L2
12247F03Mj2j4k5m7m9j7K2L4J8Lmj7l3l2oK1K6J7J5K2K0kl0m5m3k6mJ3J7J4J3K0L0L7L3K0
12231E96Kj5k4k8k7k0kK2M1M4K9Mj8k3j3LP%j1j3oJok5l7k7JJ6J4J1K6M2L4J1KJ2J4pk9k4
12213E77lJk1m0l6k1j7j4OL8N2L4Qmkpk2l1k4j2nl%KLNJ5K0J3Ljnj2j8rJ2K6J9MlJL%mqj2
12193E08j6j8j2%Mlj2nK0M3M6L1Rj7m3n6l6LL4L9L6L6L8K8J6J0Onk3l9n0n1l8j6KM%PK0K6
12176E26K2J3J0J0PNMmj7l4l8k5kJ8K6K6K4K5K5K3J9Qrk4k7j8q%NRKj2k0j4oppJJ2Pj8l6k9
12158D72kJ8J9Mqpjkj3j6rlnq%J3J9J4Kj1j9j3OK2J7MKRQknOK1K7K6K1J1mj4j2lNLnj7k4k2
$$ y = [527, 509, 491, 487, 500, 521, 527, 510, 481, 468, 488, 528, 555, 545, 506, 468, 457, 474, 507, 542, 571, 589, 596, 604, 621, 638, 632, 594, 545, 513, 505, 508, 509, 517, 540, 570, 588, 581, 551, 512, 479, 460, 451, 439, 422, 407, 407, 417, 428, 434, 437, 432, 412, 388, 382, 400, 421, 415, 382, 346, 333, 351, 393, 445, 489, 512, 516, 516, 527, 548, 567, 573, 569, 562, 552, 532, 508, 500, 526, 571, 603, 607, 595, 581, 556, 509, 460, 443, 465, 499, 517, 520, 516, 499, 466, 434, 428, 449, 475, 492, 507, 529, 549, 547, 517, 472, 429, 403, 399, 412, 429, 443, 456, 476, 506, 543, 576, 596, 598, 583, 559, 531, 504, 484, 482, 504, 545, 589, 618, 622, 604, 581, 568, 571, 578, 578, 567, 554, 548, 549, 543, 518, 481, 454, 455, 471, 485, 496, 522, 564, 598, 609, 611, 623, 637, 630, 601, 577, 574, 575, 554, 514, 478, 457, 440, 426, 432, 470, 522, 556, 564, 560, 558, 551, 529, 498, 474, 462, 457, 454, 454, 456, 459, 464, 479, 499, 512, 515, 514, 509, 497, 479, 470, 482, 508, 527, 531, 528, 529, 532, 532, 528, 520, 508, 492, 474, 462, 462, 466, 463, 451, 446, 466, 509, 555, 586, 595, 578, 535, 479, 443, 446, 480, 519, 555, 591, 629, 657, 673, 683, 689, 684, 661, 622, 572, 521, 483, 467, 469, 473, 473, 480, 500, 526, 548, 561, 571, 581, 588, 593, 597, 593, 576, 542, 504, 479, 477, 495, 521, 547, 571, 596, 621, 644, 663, 671, 662, 638, 611, 593, 585, 585, 590, 599, 601, 589, 569, 555, 549, 542, 535, 536, 548, 555, 537, 501, 472, 470, 488, 507, 511, 503, 496, 495, 493, 480, 464, 455, 452, 447, 439, 439, 452, 471, 485, 487, 476, 457, 444, 450, 472, 489, 493, 495, 504, 512, 510, 505, 511, 532, 559, 585, 606, 617, 613, 599, 587, 584, 589, 592, 587, 570, 546, 524]
12137E24j8j7k2k1j3%J3K1J4lj2%K0K4J3J6L2L9J8j1k3k5l0l7l6k9k5j8lJ3J5OJNPONORQR
12119D81OkpmLlj6j7lK0L4L4K4J1Jrk1l2l3k2j2roJ0K6K4QjMRM%LJ2J8J9J9J3QONKnj2j6k5
12099E49l3k9j9j7k2j3J1L0K6Qnnkjmj2k8l5k4%J8K5K5K0J2J2K4L1J2j9l7k7pRJ8K1J2qk1
12083D95j2PK1J8Lj5k7j8J6N2N8L1Kj4k2l5l9j7K0L9K3nj7oPJ1J3J5J7Mk2m0l4mK3K4Pqrp
12065E55j0j1jJ0J4QPRPjpJJ3J7J2jj3k1k7k2nJ6K4Rk0m0m2l3k2qPJ7K3L1L9L2Mk8l4j4ON
12047E06rj8j9j6j3mJ3L2L7J8j3l3k3OK7K1Kqojjl%OLj3k8k3JJ9K0J4J9K9K7J3PJ8L0K6J0
12029F73qk2k9k3rNRNjj2j7pJ3J7j0m7o0m4j2J6L0J8qk5j7mloJJ4J4J1K1L8M1K4J6K3K5J0
12012F60qj1j4l0m5m3l0k2j7nOLj3j3OK2J8NNJ8K4J7QJ1J9J3pk2j9KK3L7L7J8j0k9l0j9rp
$$ y = [524, 506, 489, 467, 446, 433, 433, 446, 467, 481, 478, 466, 466, 486, 510, 523, 539, 571, 610, 628, 617, 594, 569, 539, 502, 466, 437, 412, 394, 391, 404, 419, 425, 426, 431, 438, 444, 449, 455, 464, 472, 481, 487, 485, 478, 474, 477, 474, 458, 441, 438, 458, 492, 526, 550, 561, 562, 553, 532, 500, 467, 445, 433, 424, 418, 428, 454, 478, 486, 485, 489, 498, 502, 502, 505, 517, 535, 554, 573, 586, 594, 600, 605, 607, 602, 590, 574, 549, 516, 487, 468, 451, 429, 416, 427, 457, 483, 491, 486, 481, 479, 478, 474, 462, 434, 399, 375, 375, 393, 418, 443, 463, 475, 487, 511, 542, 554, 535, 498, 471, 464, 473, 491, 512, 524, 516, 495, 483, 490, 511, 529, 532, 517, 490, 472, 488, 540, 598, 629, 631, 617, 595, 560, 521, 504, 524, 563, 586, 581, 564, 558, 565, 576, 589, 604, 621, 625, 603, 563, 529, 525, 548, 572, 579, 571, 562, 555, 545, 534, 533, 543, 557, 565, 572, 581, 588, 587, 580, 581, 594, 611, 623, 622, 609, 588, 561, 539, 534, 550, 574, 583, 563, 523, 481, 448, 426, 418, 425, 442, 465, 496, 535, 567, 571, 543, 509, 495, 501, 506, 497, 479, 460, 444, 431, 427, 440, 472, 509, 527, 514, 481, 458, 464, 491, 512, 514, 506, 500, 499, 498, 495, 495, 501, 504, 491, 463, 440, 441, 460, 480, 494, 513, 542, 569, 582, 589, 607, 637, 663, 673, 665, 643, 614, 591, 582, 587, 596, 601, 600, 588, 571, 564, 577, 594, 584, 537, 477, 433, 421, 437, 467, 485, 477, 452, 435, 431, 428, 422, 423, 437, 451, 462, 483, 521, 562, 586, 602, 625, 650, 660, 652, 641, 627, 597, 552, 509, 479, 457, 440, 435, 441, 444, 431, 418, 424, 446, 464, 469, 474, 492, 516, 533, 541, 552, 571, 584, 577, 555, 536, 538, 561, 598, 635, 653, 643, 614, 584, 565, 556, 549]
11995E49lK%rj9k4k5k6k1j3p%PJ2Nj2k2j5LJ8K7K9K1Lj0rKJ5K2K2J6J0J1J1Jk4l8k6JJ5Nj1
11976D93j2jJ0RL%MJ0Onj4j8k0j8oPRoj4mROlMK2K7J4KKjj5k6k1nRK1K2Ll5o0n1j6J4K5K2
11957D02J3JmMJ9K5J9J5J4Prj8j0NQlj6k3k2j3m%j0j9j3J4N1P2O3L2ml6n9o6n2j9J3K6K6K5
11939D54K7K0ml2l9j8J4L4K8Kk2k9j8LK1L1L5L8L9L4J9Jj8l6n4o7n9l1jQNJ0L0M7L9J9Jj1
11923E20k0k2rJ2K2J5Lpk2l5l7k5j6j4rKMqj5LL2L9K4J7L1M2K7lk1k5k4k2j0J2L4M2L3J3o
11906E77j3qMJ4K0J8J1PJ1J9J8jj7k4k7l4l3j3J5K7J4ln%NLqk4l8k9JL1M2L6K6J2pk2k7k3
11889E55j9j2lPNlroklmoj1j5j0LRKj1j8j7j2pMJ4J5NkKJ1J4Onj6j8j1LJ5J5RRJ4J4OjKPM
11868E29%QK1J8ok9k7nJ7K0Pj1k0j3OJ9J2rk6l1k9l3l6k7jL5N6N3K7ok8l2k4qRK4K9J6ok2
$$ y = [549, 546, 548, 548, 539, 520, 496, 471, 445, 424, 411, 404, 404, 411, 423, 428, 416, 394, 379, 382, 400, 427, 456, 477, 480, 470, 461, 463, 478, 500, 522, 538, 548, 559, 570, 571, 547, 509, 483, 484, 499, 504, 493, 481, 480, 490, 499, 502, 502, 506, 516, 522, 517, 503, 485, 465, 447, 441, 448, 457, 451, 437, 433, 442, 448, 445, 449, 471, 498, 512, 514, 516, 515, 500, 474, 453, 448, 457, 478, 500, 503, 468, 408, 357, 341, 355, 380, 402, 415, 416, 412, 416, 435, 460, 479, 494, 508, 515, 506, 488, 478, 483, 491, 488, 472, 449, 427, 414, 410, 410, 400, 381, 368, 382, 433, 505, 568, 600, 596, 560, 501, 435, 383, 364, 377, 403, 429, 454, 481, 501, 497, 465, 426, 408, 422, 456, 484, 486, 464, 435, 417, 420, 441, 472, 507, 545, 584, 618, 637, 638, 620, 584, 530, 463, 404, 373, 372, 380, 385, 395, 425, 472, 511, 530, 531, 520, 500, 478, 469, 481, 503, 518, 521, 514, 492, 457, 420, 395, 379, 365, 356, 358, 362, 354, 339, 342, 374, 413, 437, 454, 485, 527, 554, 551, 530, 505, 481, 459, 449, 461, 495, 537, 570, 583, 577, 564, 556, 560, 574, 594, 612, 623, 630, 641, 660, 678, 677, 660, 636, 609, 575, 542, 529, 544, 571, 585, 582, 577, 577, 582, 585, 577, 553, 515, 486, 487, 518, 560, 596, 622, 634, 627, 605, 578, 555, 536, 524, 521, 528, 533, 530, 521, 515, 513, 510, 506, 500, 489, 474, 464, 467, 476, 478, 467, 449, 432, 420, 413, 417, 431, 446, 451, 449, 451, 462, 476, 482, 477, 461, 443, 432, 435, 450, 465, 474, 483, 497, 511, 517, 516, 518, 525, 529, 529, 537, 558, 576, 570, 541, 514, 509, 526, 546, 553, 542, 522, 509, 515, 534, 546, 537, 511, 480, 451, 418, 382, 355, 354, 389, 445, 498, 525, 519, 491, 459, 435, 427, 436, 460, 489, 505, 499, 477]
11851D77k2j8k0k7j9NK6L3L0K5K1J2L%%klJJ1J1Lpj5k1k5k1j1j0j7j3J3L6K9ql9m6l7k9j7
11834C09OK9M1L7K9J8Kj5k4k2j6j1nJ2L1L8K6OrpKPNLNJ0J2J1J2Q%j2j9j6nOJ5J9J6jk5m2
11815D86m2k5lJ4K6L0K8K2J7J3Nrj7j4mJoj5j8j4j3j3j4j1pjOJ3J6Rkj1j1j0rj1j3j4j0MK1
11798C94K4Rj1rNJ1NMJ9L3K3pk8l1j7%J1Ork0j1LQJkJ0K3K9K4J4NNRJ1Kj2j5j0j1k0j7%J0
11779D68mk8k8jK6L5K7Qj9l6l0%K6L2K6K3J5rm1n4l9j6m%KQJ0JrpMJ8K4J8QMJ0K0K5K0J0%
11761E43j0k0k8k5j3jKjnqj0qQK4K9J5JNJ7K2J2jJJ3J9J1LQK6L5K2ok1rJ3J3j8n0n4k8%Oj
11742E31kJ0K1J8%j8k4j6onrj0jJ1J5J2Mrk4l4k8j0QJ3J1Jj5k2j0J5K7K0LnqqjJ8L3L0J5P
11724E58Rjl0n7o4n2l4j6KJ3J1KJJ1K6L5L5L4L1K3J0rk6k7j4J0K9L2K2Mj5k2k0j1%RJ0Kqo
$$ y = [477, 455, 437, 417, 390, 371, 376, 402, 435, 465, 490, 511, 523, 526, 526, 526, 524, 521, 522, 533, 544, 547, 540, 525, 504, 479, 458, 447, 437, 420, 407, 420, 456, 485, 477, 438, 392, 355, 326, 309, 315, 344, 385, 422, 451, 469, 471, 456, 432, 410, 394, 383, 378, 390, 421, 459, 485, 491, 482, 475, 477, 484, 489, 492, 497, 507, 519, 530, 542, 550, 550, 538, 519, 503, 498, 504, 519, 538, 554, 553, 528, 486, 444, 419, 416, 430, 456, 486, 514, 536, 553, 566, 571, 562, 545, 531, 527, 528, 522, 507, 489, 475, 462, 449, 435, 424, 417, 416, 422, 435, 451, 460, 458, 447, 436, 426, 417, 406, 393, 379, 369, 373, 394, 418, 427, 416, 407, 412, 423, 428, 432, 451, 484, 507, 500, 472, 441, 424, 424, 435, 441, 432, 412, 401, 404, 412, 413, 411, 421, 444, 473, 497, 511, 516, 521, 530, 541, 543, 531, 516, 506, 495, 475, 458, 458, 468, 464, 436, 408, 407, 433, 468, 495, 503, 484, 448, 418, 418, 444, 476, 502, 525, 540, 531, 490, 436, 397, 381, 377, 377, 379, 387, 397, 398, 389, 382, 386, 404, 428, 446, 454, 458, 468, 488, 513, 533, 543, 543, 533, 513, 485, 460, 447, 446, 448, 447, 442, 434, 424, 416, 424, 448, 477, 492, 493, 498, 515, 537, 549, 548, 549, 562, 581, 592, 595, 603, 629, 664, 686, 680, 659, 650, 663, 676, 658, 608, 554, 526, 526, 532, 531, 529, 539, 560, 578, 578, 560, 536, 520, 514, 509, 500, 490, 489, 500, 515, 527, 531, 522, 498, 464, 436, 426, 434, 447, 458, 459, 444, 422, 412, 427, 454, 474, 477, 472, 464, 456, 455, 473, 506, 536, 551, 558, 567, 566, 536, 479, 415, 363, 329, 313, 315, 328, 339, 341, 342, 353, 379, 414, 449, 483, 514, 537, 547, 538, 512, 485, 471, 481, 510, 542, 564, 568, 553, 531, 511, 500, 500, 509, 519, 521, 513, 507]
11707E07MJ1MlKJ8L0L6L8L5K1Konj1k7l6k3oj2l3m1k8nJ1K0K8K7J5MOJ0ml4n3m1j4MRPMJK
11688D74PQlj4lK6L6Rl5n4l4jJ9K0J5J1J2J9K2K4K4K2J4nk6l1k4j6j4nJ2K0J3JjLMOJ4J7M
11670E90k2l1j6OJ6J1kj6k7k5qJ2K4K1J0%OK5M0L2jl4m9m2k4nJ3K4K4J8J3Mj0k0j7mLK%%k
11652E39pj3j1qokMPrl3m7l4jL5M9L6Lk5k6nJ0kk2k4%J8J0j3k2pJ0J5J3J3J8K1J3rl4m1j8
11635C95J5L5L3K4J6Mj1j7qMMj4l4n0n0k8KK1J9J3J5K0J6RPLj2k1rJ1J1qj0J2K7J3j2j7kR
11617D35J0RQ%pkJ2K0J3mj7k0rPJ5Mj6k8k2lK0L9M2K6Jj5k0j8j2jJ4K5K9K7J7nl3m7l4qQM
11599D64nnLJ0J0RJ2J2KplQQko%Jj5l2k4QL2L0Qj5k6k1oPPkpoqj8k5j6PL7N4N4L9K5J7Lj8
11579F00l2k6rkj0j4lJ7L4L6J7k2n2n2k6MJ8J6RKm%QQLNJ5K0J2KNQ%k0l5l3k1lJ1J1lk6m3
$$ y = [507, 511, 522, 526, 523, 525, 543, 573, 609, 647, 682, 703, 705, 699, 694, 683, 656, 620, 597, 591, 579, 546, 505, 477, 472, 483, 503, 531, 558, 573, 577, 583, 593, 589, 555, 502, 461, 447, 451, 460, 467, 471, 472, 474, 481, 489, 486, 472, 469, 495, 531, 540, 505, 451, 417, 416, 435, 455, 470, 481, 493, 512, 534, 558, 582, 604, 618, 613, 587, 556, 532, 516, 502, 497, 509, 529, 542, 543, 542, 545, 549, 555, 569, 586, 590, 568, 537, 521, 527, 543, 554, 552, 536, 509, 484, 476, 488, 512, 533, 543, 543, 549, 574, 614, 646, 645, 611, 562, 520, 496, 491, 504, 528, 552, 570, 583, 587, 577, 557, 540, 536, 539, 541, 541, 541, 539, 532, 519, 508, 500, 494, 492, 496, 503, 494, 461, 414, 380, 379, 414, 463, 499, 502, 477, 451, 446, 456, 454, 432, 408, 408, 426, 436, 423, 401, 394, 404, 419, 432, 445, 463, 484, 497, 488, 454, 413, 395, 410, 445, 478, 502, 518, 522, 511, 494, 486, 490, 494, 480, 446, 396, 346, 318, 320, 341, 360, 373, 388, 408, 424, 433, 440, 443, 431, 410, 401, 412, 423, 415, 405, 417, 444, 457, 445, 428, 426, 435, 445, 454, 462, 462, 455, 453, 465, 485, 498, 494, 477, 457, 448, 455, 470, 474, 458, 430, 408, 405, 425, 464, 506, 532, 533, 518, 498, 480, 468, 467, 481, 506, 535, 562, 579, 574, 541, 494, 460, 452, 460, 464, 459, 454, 457, 467, 477, 486, 498, 510, 512, 505, 502, 510, 518, 516, 510, 510, 511, 496, 464, 440, 448, 480, 510, 518, 503, 477, 456, 450, 457, 464, 462, 455, 449, 441, 423, 398, 382, 389, 426, 480, 534, 573, 598, 615, 618, 600, 568, 542, 533, 531, 521, 507, 504, 521, 555, 591, 608, 586, 534, 482, 456, 460, 478, 494, 503, 505, 501, 501, 509, 517, 520, 525, 540, 560, 572, 574, 579, 587, 587, 567, 532, 499, 478, 475, 486, 497, 494, 468, 425]
11561D25m5k8jK1K6J7OMJ0J6J2lj7pK0L4K0koPJ1jj2j3j7k8k8j2K%oMK4L0J8lj4j4ojkm%J3
11542D50K3K9K6K0J2ORJ4Oj0j9j9j9j9nJ8K2qm0m0j1J4K3K6K7K5J1qk5l3k7j1KJ0J4J7J3Q
11525E31QJ7K0J0nj4k7l8l1kL1M5M3L3J0k6n2m9l2k5k4j1RK0K9M4N7N5L9K5Ok1m0k8KK5L0
11509F64L1L4K7Lk7n0o1n2k7pjmklmNK6L0Jl0k4NJ9J2J2J6J2KOJ9J5KKJ3J7K6O1J01R4L9j4
11491I88l8l7k4LK0J1LK2M3L2K0N2J03J14J10J42J90K07K58M19O32Q23J159J819K451K252
11480A1774R02q55j909j925j479j158j000q08o05n04m56l43j98j30j17p3k0k8p3o9k8k1m2
11470H35k8J6K5jKL6L7j5n7n4l6l6l0%K6K0rl4m8m7l1j0lpmOKj5k0j2orj1poj2j6j0jJ2K6
11452D68K3Jj9j2PJ7K4M6O2M4Kk0j1j0k7k9LL3K5j2m0m7m0k3%J3Qpj6j8j8j5oQJ8K3J4j2l6
$$ y = [425, 380, 352, 351, 372, 398, 415, 421, 425, 435, 451, 463, 460, 443, 436, 456, 490, 510, 508, 502, 509, 520, 519, 507, 494, 477, 449, 421, 409, 411, 411, 405, 409, 433, 463, 481, 478, 464, 450, 444, 443, 441, 437, 437, 450, 473, 502, 528, 548, 560, 566, 575, 589, 595, 585, 566, 547, 528, 509, 504, 522, 544, 536, 496, 456, 445, 459, 482, 508, 535, 560, 571, 563, 538, 505, 478, 467, 469, 479, 493, 510, 523, 531, 539, 556, 576, 586, 581, 567, 540, 502, 471, 469, 500, 545, 588, 621, 631, 605, 553, 504, 472, 447, 423, 412, 421, 441, 470, 514, 571, 626, 665, 690, 696, 675, 635, 607, 609, 634, 664, 695, 729, 756, 759, 732, 682, 621, 569, 542, 535, 534, 530, 528, 525, 521, 526, 552, 582, 583, 553, 529, 534, 553, 565, 577, 593, 605, 607, 613, 632, 647, 649, 651, 664, 681, 707, 768, 869, 963, 1002, 988, 950, 913, 889, 892, 912, 923, 926, 948, 991, 1023, 1043, 1095, 1198, 1312, 1422, 1564, 1754, 1961, 2219, 2638, 3270, 4093, 5252, 7071, 9522, 11774, 12676, 11821, 9912, 7987, 6508, 5350, 4350, 3542, 2937, 2433, 1977, 1634, 1436, 1306, 1189, 1116, 1096, 1068, 995, 926, 898, 877, 835, 807, 823, 848, 847, 849, 885, 922, 907, 850, 796, 760, 724, 694, 694, 720, 740, 731, 697, 649, 602, 571, 561, 558, 551, 547, 553, 555, 540, 520, 508, 502, 493, 482, 475, 469, 457, 441, 431, 430, 442, 468, 491, 492, 473, 461, 468, 485, 509, 555, 617, 661, 663, 643, 632, 622, 595, 566, 569, 602, 627, 615, 575, 528, 488, 465, 465, 478, 486, 479, 463, 445, 427, 412, 406, 414, 432, 455, 469, 457, 421]
11435D21l4nK3L2L2L3K7Oj5k3k1k2j4KJ7J1pk0j7nQJ7K4L1L6L5K1Jj1rj3k5l0j2J4K3J6J5
11419E62K0Rj9l4j6J1J1j3l0j5K0M8N5M0J7rk8l5l5l1k2j0KOQJ9M1N0L3Mj4j5j6k4k9k2j3
11403E26j2j1qorj2lQRj0k7k7j1PJ9K8K8J0k9n7m4NM8N2L4J9J3lk6l1j5OJ1NMMlj8k8l0k5
11385C91j6kJ5K9L3L0K5K3J9Kk5l5j8RJ4oj9nJ7K6K4K0J4jj9k8k8k4j7oLjj3j7rLJ0J5K4L2
11368D89L4L4K9K0Lk0l7m2l0mK5M8N5L8nm7n5k1K3L8K4NLPJk0m3m5k8nKkqlKNQJ4J3OKQPj3
11349E15l4l1pJ1J0QJ3J6QLNMj1l3l5j3QJ6J3J0Noj5j0NJ5RJKLoj6j5kONKLkj2j3%J8K4J9
11329D96Pj1k3j7J1L7L6J6LNJ7K8K8J4j0k7k4j3j6l4m4l2qJ3K3K6J7KrrmkmlLJ3K2K1J0%J
11311E59%j4l4l2oK3K8J1nrnKQJ6K1K1J3Klkj2l5n4m4qK3K6Oj7k8k6j4NK4M2N2L6pm9n0j1
$$ y = [421, 387, 382, 405, 437, 469, 502, 529, 535, 520, 497, 476, 454, 440, 442, 459, 470, 463, 443, 426, 421, 429, 446, 470, 501, 537, 572, 593, 594, 583, 574, 561, 536, 506, 494, 508, 531, 547, 562, 582, 591, 572, 538, 522, 533, 544, 531, 501, 486, 506, 554, 609, 649, 666, 657, 629, 594, 559, 528, 506, 496, 498, 504, 512, 531, 572, 622, 655, 659, 645, 630, 614, 590, 561, 539, 526, 514, 503, 495, 489, 480, 468, 465, 473, 482, 472, 445, 418, 407, 414, 433, 461, 489, 499, 470, 413, 369, 374, 422, 474, 508, 527, 540, 537, 511, 480, 465, 471, 482, 487, 491, 495, 492, 474, 446, 416, 391, 375, 373, 388, 417, 450, 480, 505, 528, 547, 549, 524, 489, 471, 480, 494, 488, 469, 464, 481, 507, 531, 551, 565, 564, 545, 517, 489, 465, 448, 442, 445, 444, 431, 414, 405, 408, 418, 433, 457, 489, 523, 557, 586, 606, 609, 589, 552, 510, 480, 476, 501, 549, 604, 642, 637, 590, 535, 514, 537, 575, 599, 604, 607, 614, 615, 595, 552, 507, 479, 474, 476, 474, 466, 463, 465, 470, 478, 492, 505, 511, 513, 521, 528, 515, 481, 450, 443, 454, 464, 472, 485, 501, 509, 512, 517, 521, 510, 477, 442, 429, 437, 453, 466, 476, 481, 475, 460, 450, 455, 470, 479, 480, 482, 485, 479, 463, 448, 446, 452, 457, 459, 462, 460, 448, 435, 435, 453, 477, 496, 503, 492, 469, 452, 463, 500, 536, 552, 555, 560, 577, 605, 633, 647, 637, 610, 586, 573, 557, 523, 479, 447, 439, 452, 475, 501, 518, 520, 511, 502, 498, 496, 492, 489, 492, 505, 527, 548, 558, 558, 559, 559, 545, 511, 479, 473, 496, 524, 535, 530, 521, 516, 518, 526, 542, 563, 584, 597, 599, 596, 594, 582, 547, 493, 449, 441, 464, 490, 496, 479, 451, 425, 411, 416, 440, 482, 534, 570, 563, 514, 464, 453]
11294D53K7L4K2J1Lj2k7k3kJ3Mj8l7m2l4k0lJ3K5K8J9RNRJ0PRK1L0J8j5m1m2k0MJ8K2K5K3
11277E26J2pk0j8qJKLKjlMJ6K3J7Mqj6j1QK2J9%j4k3k8k5mK1K2%j3QL7L9Rk0k5j0NNj2l0k4
11258D85OL2L1J0kjjj5k8k1%J4J2OPJ0Kk1l6k9qKLNJ2Rnj2oJ%RL4N3L3j6m7m3k3oRK1K6J1
11239E23j6l7l8k3jJ2J5J4J4J1Mmk%km%MJpkJ0J5Kj4j9j3pooomjLJ2K0K0OokQOrj6nKj2k4
11218D16j1J6K4Rqj3oJ2L3M3L5K5L2L7J9j1k6j8j8l0l2j3NP%mj4l1l9l0k6l5l7j3K1M2M0K9
11201D30J4kj4k1k9l9l1LM0N5N3M8M2K5KroJNOLj2l2m8m6k1J4L8L3J1oj0j4j6qMjk3k8oJ4
11183D19Kj7j1J3K5J9J4J7J5J2J9K7J7pk3k6k8l8l2j0Qjk4k7kK9L8K2KkRJ3Kj2j4oomNJ7J3
11166D67%qj0j5j8nJ8L0K9K7K4Kk6l7j9KJ3K1L0K0j0l1j7J3K4J1nkJ2K0J4mj8j3NJ5J1NNM
$$ y = [453, 480, 514, 536, 547, 550, 538, 511, 488, 486, 499, 503, 485, 448, 406, 372, 352, 349, 362, 387, 415, 434, 443, 448, 457, 467, 474, 483, 504, 534, 552, 537, 496, 454, 434, 438, 456, 478, 503, 526, 538, 531, 511, 493, 485, 486, 488, 491, 493, 492, 489, 493, 509, 532, 549, 553, 545, 529, 518, 526, 548, 567, 567, 553, 530, 502, 477, 473, 494, 516, 516, 503, 511, 548, 587, 596, 576, 551, 541, 546, 551, 539, 509, 485, 491, 523, 554, 564, 562, 561, 560, 545, 517, 496, 496, 510, 522, 528, 535, 545, 547, 526, 490, 461, 453, 455, 458, 463, 475, 484, 479, 467, 461, 462, 462, 471, 505, 558, 591, 575, 528, 485, 462, 456, 465, 486, 512, 523, 507, 470, 432, 409, 408, 420, 435, 449, 463, 474, 478, 474, 472, 472, 470, 466, 466, 470, 471, 464, 462, 472, 487, 489, 475, 456, 443, 436, 430, 424, 418, 414, 413, 416, 428, 448, 468, 474, 468, 466, 474, 480, 471, 455, 450, 452, 440, 416, 405, 421, 445, 454, 446, 433, 427, 439, 472, 515, 550, 575, 607, 644, 663, 652, 626, 608, 590, 560, 528, 515, 520, 527, 527, 523, 509, 478, 439, 409, 383, 348, 311, 298, 319, 361, 401, 430, 444, 442, 428, 407, 378, 339, 308, 311, 351, 406, 459, 507, 549, 574, 576, 567, 561, 562, 567, 573, 576, 564, 532, 484, 438, 417, 431, 469, 502, 513, 507, 497, 483, 467, 459, 463, 462, 439, 411, 405, 419, 421, 404, 393, 406, 431, 450, 464, 481, 496, 508, 527, 554, 571, 564, 541, 515, 487, 449, 417, 407, 415, 414, 390, 363, 361, 390, 428, 450, 452, 450, 459, 472, 474, 462, 448, 442, 436, 432, 437, 454, 467, 467, 459, 449, 434, 416, 411, 429, 459, 488, 515, 539, 541, 515, 478, 459, 461, 474, 495, 525, 545, 535, 504, 487, 500, 524, 535, 530, 528, 540, 560, 574, 570, 552, 539, 544, 559, 570, 575, 580, 584]
11148E84kooj3k4k6nJ8K1J0KNMLQK1K5J0j1j7pNKj6l0j6J6M2L6Qk2l9m4m0k5j0LRRlj2qJk
11129D58k0k7j0J4K1K1K8L1Ol4n4l5jJ8J6OklRK5L3K3P%jjrj7k0j6nPJ4J2jk0l2k9j3OJ5J6
11111D36J4J2J3J8J9J4LLK1L9M2L0J2ok7m5m7l2j2OK3M4N4M0Nl3n0m0j4PJ2N%mm%J0J8J9J6
11094F21J7J9J5PLkj2k7l1j8%MkmNJ6J2rk8k9j1RJ9K1Rk2n2n0pM0M7J9mppj5k5k7k6k5j5N
11076D33K8L5K7Pj7k7qK3L6J8j9m6n4m1j1J9L0K0MljPJ5K2K1J2%nk%Llj9l6m1k5KK5L4L4K5
11058E22J8J3Lj4k5j5MQKMK0K3Lj5j1k%LJ8K8J3j0j6rqj9k1j9k6m2m7k9oRJ1RK%%jppJ0L5
11039D09M2K5QLLKJQJ5J7J4Rkj5k1j6lONok1k1jK1J4rj9jK1K3J4J1J3Nqj3%J7K2J0rj5JK2
11020E81K4Oj0j5j9k7k6qJ2J4mk0k2rJ9M8O0M1Qk2l7l9k7nOok8k7lK5L5L4K6J2pj1NK4J5j6
$$ y = [584, 582, 576, 570, 557, 533, 507, 502, 520, 541, 551, 553, 558, 562, 565, 573, 594, 619, 629, 618, 601, 594, 599, 601, 585, 555, 539, 555, 597, 633, 641, 619, 580, 536, 496, 471, 461, 464, 473, 482, 479, 467, 459, 460, 458, 438, 411, 401, 415, 436, 457, 485, 516, 522, 488, 434, 399, 398, 416, 432, 438, 436, 433, 442, 467, 500, 523, 530, 530, 529, 528, 519, 502, 482, 466, 461, 468, 482, 494, 493, 473, 441, 412, 399, 405, 420, 436, 450, 462, 475, 493, 512, 526, 529, 532, 553, 592, 634, 664, 676, 670, 643, 598, 551, 519, 507, 513, 536, 580, 634, 674, 679, 646, 596, 556, 542, 549, 561, 566, 566, 562, 558, 558, 568, 586, 605, 621, 638, 657, 672, 679, 682, 680, 668, 641, 610, 592, 592, 596, 594, 590, 595, 611, 623, 614, 586, 557, 546, 555, 574, 595, 604, 582, 530, 480, 473, 513, 560, 579, 575, 568, 561, 546, 521, 494, 468, 443, 428, 433, 461, 496, 523, 530, 513, 486, 478, 501, 537, 555, 536, 490, 436, 395, 384, 403, 433, 453, 457, 454, 453, 460, 475, 497, 518, 530, 530, 525, 523, 523, 526, 523, 504, 468, 427, 402, 404, 429, 463, 497, 522, 540, 553, 556, 542, 517, 502, 506, 514, 516, 520, 540, 563, 566, 551, 540, 538, 538, 541, 559, 587, 600, 590, 574, 565, 557, 538, 517, 498, 472, 430, 383, 354, 348, 357, 368, 377, 379, 379, 379, 378, 371, 364, 374, 409, 451, 476, 484, 487, 490, 492, 493, 501, 516, 533, 547, 556, 554, 539, 518, 502, 499, 505, 510, 504, 483, 462, 461, 482, 496, 487, 468, 467, 488, 511, 525, 536, 549, 554, 546, 533, 533, 550, 572, 582, 573, 558, 559, 581, 605, 611, 601, 586, 567, 540, 514, 506, 518, 532, 528, 508, 486, 477, 496, 544, 604, 645, 653, 631, 594, 555, 528, 523, 529, 523, 495, 468, 465, 490, 525, 559, 585, 597, 590, 579, 584, 608, 623, 607]
11002F07l7k8MK5J9Jrrrj4j2LJ3Kj7k4j3pj1j1JRLrj3qpj1j3j3k0l0k9k0qjRL0M8N2L7J8O
10984E04LKkj1k4l5l6k6j6rnKQOmrJJ9K8K5J8Nj0k1j5RL3L7J8qk0j4mmj1j2PL5M7L2Lj7j9
10965E10j4j4k2k5j6OK4L0K7K1J9J1krnlj5l7m6l5j6lJMJ0J1OjnjJ1J6J1JlLPOKLJ1J9K4K0
10946E42MrnJ6K8J2j4k5j4ooj1j3j3j3lJ1J7OoqmonJOLmnnj5k9k6mJ4J1oj5KL5O3O7M5Qk9
10926E92n8o4l8J0N0N6K9nk8m0m3l9l2k6j8jJ4J3kj4oJ2L1M4L8Qk6l7k0mpj4KK8L3J6lj1p
10909D33NK7M2K9j0m0m2k7k0k4k4pJ3J9RlkJ1K0J7RJmmPK5L6K5MqlMPNJoj8k7k4j3%OOjkJ2
10890D64L0L4K3RNKqj3nOMj1k0j8j4j7j4lJ0J5J0K%lqrmKLNJ6L0L2J1j1k0j5k0l0l6k8k3k9
10871C54l1j3K1M9N9N3L8K3Prk1k3j4mkoJJ3Qj7m3m2k0%NPJ4K0K5K6K3J5Mmj4k5k4qJ5J8O
$$ y = [607, 570, 542, 546, 571, 590, 591, 582, 573, 564, 550, 538, 541, 554, 556, 539, 515, 502, 495, 484, 473, 474, 483, 486, 477, 464, 456, 449, 438, 425, 412, 392, 362, 333, 313, 305, 304, 313, 343, 391, 443, 480, 498, 504, 507, 509, 507, 496, 472, 437, 401, 375, 359, 350, 345, 347, 355, 361, 357, 348, 349, 368, 396, 421, 439, 444, 434, 413, 398, 407, 440, 477, 495, 487, 467, 453, 449, 445, 434, 422, 429, 464, 511, 543, 546, 529, 510, 496, 482, 460, 435, 419, 425, 449, 479, 506, 527, 546, 557, 555, 546, 541, 538, 523, 486, 440, 405, 389, 386, 387, 391, 401, 412, 418, 417, 412, 411, 422, 438, 449, 450, 447, 450, 457, 463, 465, 468, 479, 498, 522, 542, 546, 537, 532, 548, 576, 588, 574, 549, 535, 529, 523, 512, 499, 486, 473, 470, 481, 498, 504, 498, 490, 486, 480, 475, 476, 482, 485, 481, 476, 471, 456, 427, 401, 397, 411, 422, 416, 401, 403, 438, 501, 568, 613, 621, 592, 534, 470, 432, 442, 492, 548, 577, 572, 544, 504, 461, 422, 390, 364, 346, 345, 359, 372, 370, 356, 350, 362, 393, 437, 475, 483, 457, 420, 400, 396, 389, 375, 377, 405, 438, 454, 451, 440, 433, 438, 465, 507, 536, 526, 486, 444, 417, 397, 373, 349, 342, 355, 374, 383, 380, 378, 389, 409, 426, 435, 436, 432, 428, 435, 460, 496, 521, 525, 517, 514, 518, 525, 530, 531, 525, 507, 480, 456, 443, 443, 449, 455, 454, 452, 464, 494, 528, 551, 560, 565, 567, 559, 546, 541, 547, 551, 540, 520, 502, 488, 471, 457, 454, 464, 479, 489, 491, 491, 488, 480, 471, 467, 469, 472, 477, 493, 523, 555, 566, 555, 535, 520, 500, 470, 434, 406, 383, 354, 323, 310, 331, 380, 439, 492, 530, 553, 560, 551, 530, 507, 493, 489, 487, 481, 482, 495, 503, 486, 443, 401, 381, 381, 386, 393, 407, 427, 452, 478, 501, 516, 520, 516, 502, 477, 453, 445, 460, 478, 484]
10853D84mLQjoNK4K6Rlnj1k9l4j1K1K9Mj9j5LJ2J0J3K6K8Qk0l3k4kJ5J9J0nj7k4k8k5oK3L9
10835D97L2J5J4J9Lk9m5j9K5N3M7K1lj0mkj7l6l0%K2J1j6k6j4KMLMPJ3J7J1j3l4l6k1j4k1
10818D30j8RL5K9rm3m2j5J7L4L3K1J4J4J1mk3k7j7j1j9k5j4RK0J2MJ1K5K9J3j1k7k8k2j5j7
10802C83j9j5nMQJ1K0K6K4J6Pkk2m0l5nK1K6K0K3K3Jl3m2k1NJ0KJJ4K7L6K9Rj6k2mJ8K0QN
10784E16J3J7J2J2K5L8K7Lj7j9nRJ4P%kLLnj6l0m7n7m0oK0K1J3J1J4QLJ3L0L0J0j0j4j3k0
10767E71l5m7n1m2k4nLLNJ6L3M6N2M3K0oj5pnj8k5j1J0J7RORPJNK2K5Jl4m6l3j5pqoKJ1J6
10748D93J2%j0j2j1qmJ1K7K8J0rrRK3J7nk1k3k1l1m5m3k0OJ8K2K4K1Kk0k5rNM%J1K3J7lj3
10730D41oPOmpLJ8K1J2KOJ8K1Qmm%j1l8n5n0l1j4nkkmkNPJo%J4K6K4J6J3J6J9J8J2NjmkKK
$$ y = [484, 480, 483, 491, 490, 484, 489, 513, 539, 548, 545, 540, 529, 500, 466, 455, 476, 505, 509, 490, 475, 478, 490, 500, 513, 539, 567, 575, 555, 522, 498, 496, 511, 530, 540, 535, 518, 494, 466, 441, 435, 458, 497, 529, 544, 558, 577, 580, 551, 506, 487, 512, 565, 612, 633, 630, 620, 616, 614, 597, 561, 531, 531, 553, 564, 548, 522, 508, 510, 514, 517, 521, 528, 541, 558, 569, 556, 522, 486, 465, 451, 430, 412, 421, 456, 485, 476, 433, 391, 376, 393, 427, 460, 481, 495, 509, 520, 516, 493, 466, 449, 438, 419, 394, 380, 389, 409, 421, 425, 436, 461, 490, 503, 492, 465, 437, 415, 400, 383, 364, 349, 344, 348, 356, 367, 387, 413, 437, 453, 460, 458, 436, 396, 361, 356, 377, 403, 423, 446, 469, 470, 437, 395, 374, 379, 389, 391, 392, 406, 433, 469, 498, 507, 491, 469, 465, 483, 503, 511, 516, 529, 546, 558, 570, 595, 633, 660, 663, 646, 627, 622, 631, 645, 652, 652, 650, 653, 656, 651, 635, 605, 558, 501, 461, 455, 475, 496, 509, 520, 534, 542, 545, 558, 588, 618, 628, 618, 604, 591, 571, 536, 489, 438, 396, 372, 367, 370, 373, 378, 394, 427, 473, 525, 568, 588, 582, 567, 560, 555, 537, 512, 501, 511, 528, 537, 543, 552, 559, 560, 565, 587, 612, 613, 579, 533, 500, 485, 478, 470, 464, 466, 477, 493, 505, 505, 495, 483, 472, 464, 460, 471, 498, 526, 536, 527, 518, 527, 550, 567, 562, 541, 518, 497, 466, 421, 378, 358, 364, 382, 404, 428, 449, 451, 431, 406, 397, 402, 406, 406, 417, 440, 457, 454, 441, 435, 442, 448, 444, 437, 440, 458, 479, 491, 493, 499, 517, 538, 546, 542, 538, 538, 527, 489, 434, 384, 353, 339, 334, 332, 330, 326, 324, 329, 336, 337, 331, 331, 345, 371, 395, 411, 424, 440, 459, 477, 489, 494, 493, 489, 487, 489, 491]
10710D91j0l5n6n0j4K7M4L3J8J0J2J4K0K8K6J3joqj7k6k5j3lOJ8K4J5LPK4K5om4n2k8jQMn
10692D70qpRL0M4L5J1j4l0l2k7j7pkPJ7K3J5%j5k0j8j1omnkPJ5J0jlJ0K1J8RMO%qj4j2j0j4
10673D74k0k2k4l2l5k8pJ7L1K8J3LJ1K8M0L9L0J3j7m8n4k4J9M3L7K1J1MK%%rk1k2j2jkkMJ4
10656E02J6Qlj4k0j8lJ1J1rl1m2l6k1j1lOJ8K9K1lk3k4pQJ3J3J2Kj3k7k4oJ4K8L3L2K4J3L
10639D79KJ0J4Mj5k8k6j1NJ6J5QjmmmlkLJ0K4L6L4Ok3k6JJ8Kk9m5l8k9k0rMjk3l7k9kK8M7
10620C57N3M2K3OKJ0J7J6NnjJ0J6Q%MQrm0o0n5l6k4j4LK2L0J7mj9j2J4L8M0K6J7K3K8J4nj4
10602E51qjjnj2j8j6oNJ2J7K6L0J9nk1j9qjjjMQLj1k1j2QK3K7L0L3K3ql9n4n1m5l6j5OJ6J2
10584D38J1J5J4Mnpj0k1l1l0j5QK7L1K3J4J5J9Pj3k3j3MJ7K7L3K3%j5rLml1m9m4k7j6j0jJ5
$$ y = [491, 481, 446, 390, 340, 326, 353, 397, 430, 448, 458, 470, 484, 504, 532, 558, 571, 570, 564, 556, 539, 513, 488, 475, 472, 478, 496, 520, 535, 538, 545, 569, 594, 588, 544, 492, 464, 463, 471, 475, 470, 462, 455, 464, 494, 538, 573, 584, 570, 540, 508, 481, 464, 457, 455, 462, 479, 502, 517, 517, 502, 482, 464, 453, 447, 443, 438, 436, 443, 458, 468, 467, 464, 474, 495, 513, 522, 526, 532, 532, 524, 510, 498, 488, 474, 454, 432, 408, 376, 341, 313, 306, 323, 354, 382, 395, 398, 409, 437, 477, 516, 546, 559, 542, 494, 440, 416, 435, 478, 515, 536, 547, 551, 553, 553, 553, 544, 523, 501, 489, 488, 486, 484, 488, 502, 518, 526, 523, 509, 489, 471, 468, 479, 490, 481, 450, 408, 372, 351, 340, 337, 343, 361, 390, 411, 408, 385, 361, 354, 362, 375, 388, 400, 402, 389, 362, 338, 332, 346, 374, 407, 439, 463, 476, 479, 481, 491, 505, 509, 494, 466, 440, 429, 434, 450, 465, 473, 472, 468, 464, 460, 457, 455, 458, 468, 492, 528, 562, 568, 545, 519, 520, 538, 540, 511, 466, 428, 399, 379, 370, 374, 373, 350, 313, 284, 282, 310, 357, 410, 452, 475, 481, 483, 493, 510, 526, 531, 526, 525, 535, 551, 559, 559, 563, 571, 562, 522, 462, 407, 371, 347, 333, 336, 358, 388, 405, 401, 382, 370, 384, 422, 462, 488, 505, 528, 556, 570, 565, 551, 543, 542, 541, 536, 524, 506, 490, 484, 489, 501, 518, 544, 574, 593, 588, 567, 548, 540, 539, 538, 537, 541, 549, 552, 541, 520, 508, 516, 539, 566, 596, 629, 652, 644, 605, 551, 500, 455, 419, 404, 410, 426, 438, 449, 464, 478, 482, 477, 470, 460, 439, 408, 378, 363, 371, 398, 429, 452, 466, 481, 500, 507, 494, 471, 458, 462, 479, 506, 539, 562, 562, 547, 538, 541, 537, 506, 457, 413, 386, 370, 360, 359, 374]
10566C74L0L3K8K4K9L1J6mj0OJ8Qj2k3k3k6k7j4J4L5L2Rj9l5k7jK3J9qk9k1NK0J5lj1lJ3J3
10549D99j0l8m4k6j2j9k7j3K4N2M9J9j5l5k8nJ7K3J5J0J1Pj1l3l9k5JK3L4L3K9K7L2L9M8N4
10534F66M8K2j7m1m3l9m1m0j9J2J8lk4j8JQL%%j0k6l1j7KK1L7N0M3J2k6m9n4m6l0qJ0J7J5
10517D03J4J5Qj0k9l6k7j6j3j1lJ1J9J6Lj1j9j9nJ7L5L8K6J8K0K2J4Jljlj3j8j2LK0K6K2L
10500E05k2l5k8j0nj2j6qLOMRK0K7K4K1K2K6K0Ommkj0k2k6j5KJ1J0Jmqj5k7l2k0OL0L8K6J
10482D93k6m2l3KL6N2M0J2j4k8k7j6mMJ1J0Mn%J3J2j4m2m5k2jORJ6J7J0LRJ7J1qk3k5j4MK7
10464D29M3M1K0%oLJ5K1J6Kj4k0j6qj3l3m9l9pK0K4J1lj1j7j7j0JMlpkLJlNK6L9L5J6%nKO
10445E00mj9k7k3j6j4j4pMJ2J5K0K2J3%plOJ3K0L0L1K1QQK1K4Ll0m9m2k3oQK5L5K8Mj7k7l2
$$ y = [374, 404, 437, 465, 489, 518, 549, 565, 561, 551, 557, 575, 583, 571, 548, 525, 499, 472, 458, 472, 507, 539, 548, 529, 494, 467, 466, 489, 508, 500, 471, 450, 455, 475, 490, 487, 476, 473, 486, 499, 489, 451, 407, 381, 369, 350, 323, 310, 334, 386, 435, 454, 439, 404, 376, 371, 388, 411, 426, 436, 447, 454, 443, 410, 371, 346, 347, 370, 404, 437, 466, 493, 525, 564, 612, 666, 714, 736, 719, 678, 635, 596, 555, 515, 496, 508, 526, 523, 499, 481, 482, 490, 493, 493, 493, 483, 457, 426, 409, 411, 432, 469, 519, 562, 574, 548, 499, 445, 399, 369, 361, 371, 388, 403, 417, 432, 440, 430, 401, 365, 338, 322, 309, 298, 295, 306, 325, 341, 344, 333, 314, 295, 290, 307, 342, 380, 406, 424, 444, 466, 480, 481, 478, 477, 474, 461, 443, 431, 434, 454, 480, 502, 505, 483, 448, 420, 410, 405, 393, 377, 369, 372, 378, 382, 391, 411, 438, 462, 483, 505, 531, 551, 557, 553, 549, 547, 537, 515, 489, 474, 476, 487, 497, 498, 494, 486, 471, 444, 412, 392, 398, 428, 466, 492, 493, 467, 425, 392, 394, 430, 482, 522, 534, 520, 492, 465, 449, 445, 449, 460, 470, 474, 469, 469, 482, 494, 480, 438, 393, 371, 370, 376, 385, 401, 418, 428, 431, 440, 457, 468, 460, 437, 412, 398, 402, 429, 472, 513, 533, 533, 527, 530, 545, 566, 582, 584, 570, 550, 534, 526, 513, 480, 431, 392, 385, 405, 429, 440, 437, 426, 409, 392, 382, 383, 387, 384, 377, 375, 378, 379, 376, 381, 407, 446, 481, 497, 497, 492, 494, 500, 496, 477, 450, 427, 411, 397, 383, 376, 380, 392, 407, 427, 449, 462, 462, 455, 452, 458, 471, 491, 521, 552, 573, 581, 589, 610, 634, 637, 607, 558, 516, 493, 487, 495, 520, 555, 583, 587, 570, 543, 511]
10427E11m0l9k3JK0K0J1LQK3L1K0lj3nNJpjQJj8k4j2KO%oj4k4j9QL5M3L5K6J5mk7l4k1qkN
10408D94J6K2J4nj9k5k6j8kJ7J9PonMPMjnlJROrk3k4j5j0q%J5J9OolJ1J4Onj0j1kJ9L5L0R
10388E43rj4j1kJ0J5Pj3k5k6k1j3MK3K9J4kokjnnnj0j1j0opnKPMKMKmoNJ5J3MKKlj0oKLQK6
10367E08M5L9Mk6l2k4j4lRJ1%j1nQJ3J0J0J3J2PMMPQJ0Njnoj2k4k9j6%%j6l0l4k9j8oLORJ7
10347D21J8%k3k8qK3M4N1M7K8PjMKk0m1l6oJ2Nj1pJ1J7Orj3j0j2j7j3oqk1k6j5k%JJ3L0L5
10329D42K4J2J2K1K5K5K5K0J5Olj1j6j8j6j5j0mkrj8k0j6j4j1lJ5K8K9J4rl3m8m0k0jQJ7K3
10312D24K2J0%OK1K9K3J0jnMK6M2L0Kk2k4k2k6l5l9k7rLO%nokLJ1K2K8K2J0ML%rj8k3k4k7
10294D37k6j7KK2L6L3J8OJ2K1J4j0k5k3j8k8l9k1J9M7M0K2K1L2L1Rj8l1l2k1kJ2Mk2l9l4j5
$$ y = [511, 471, 432, 409, 410, 430, 450, 461, 464, 472, 495, 526, 546, 543, 530, 525, 530, 531, 524, 523, 531, 532, 514, 490, 478, 480, 486, 486, 480, 466, 442, 423, 431, 466, 509, 544, 570, 585, 581, 554, 520, 499, 491, 489, 494, 510, 532, 546, 541, 522, 497, 471, 453, 451, 468, 487, 494, 488, 483, 487, 494, 498, 497, 492, 489, 490, 499, 505, 496, 473, 449, 434, 424, 416, 416, 431, 450, 456, 450, 447, 458, 472, 478, 473, 463, 452, 450, 469, 504, 534, 543, 534, 520, 509, 507, 517, 532, 539, 526, 501, 475, 454, 441, 445, 468, 497, 511, 509, 503, 501, 500, 495, 490, 485, 475, 464, 454, 448, 441, 436, 438, 445, 449, 451, 455, 457, 453, 447, 452, 467, 480, 484, 486, 488, 485, 475, 469, 471, 474, 482, 508, 553, 592, 596, 570, 538, 514, 500, 497, 506, 517, 517, 506, 501, 509, 522, 532, 542, 555, 567, 574, 578, 582, 589, 597, 607, 612, 611, 606, 600, 588, 564, 535, 519, 519, 519, 503, 473, 439, 410, 392, 386, 389, 395, 404, 421, 439, 439, 416, 388, 380, 403, 447, 498, 545, 573, 580, 579, 583, 585, 565, 524, 488, 482, 494, 499, 488, 481, 492, 509, 515, 506, 493, 483, 471, 454, 441, 435, 427, 406, 380, 365, 363, 363, 364, 377, 407, 442, 466, 478, 490, 511, 536, 561, 586, 606, 621, 627, 624, 613, 597, 579, 563, 548, 538, 534, 532, 523, 505, 485, 469, 455, 444, 441, 456, 484, 513, 527, 518, 485, 437, 397, 377, 376, 384, 401, 424, 446, 456, 456, 462, 483, 512, 535, 545, 544, 539, 543, 569, 611, 641, 643, 621, 597, 575, 549, 514, 475, 448, 439, 442, 448, 448, 443, 437, 435, 438, 449, 471, 499, 521, 531, 535, 538, 538, 529, 511, 488, 464, 437, 411, 394, 396, 418, 454, 487, 505, 511, 523, 544, 558, 548, 523, 500, 482, 454, 415, 394, 413, 460, 500, 522, 543, 575, 606, 615, 597, 566, 534, 513, 511, 523, 527, 505, 466, 432, 417]
10277D17nkJ2K8K7J1KJ4K2J0olJ5J8jj9k1k3l1l6j7J1K7K4J4POJ1K2K3Oj8k5j2QJ9K1J6Pl
10260E76kJ1K1J8Mj4k9l0j5%%k0k9j5MJ1PNKj3l3l5k3j6k1k0lPql5l8j1J8K4J4QJ9L6M3L0
10243D48Pj0j4mJ2K5L6M1L3J4j1l0l8l1j6nnj4k1k4k7k4j0J2K8L2L1L1L0J7kj4j1rj4k4k6
10227D13j2J4M5O6N9K5j0k2j5qj4j4nMKlm%%llj0k4l5k3kN%RL5M7K6pj3%Pj%QJk5m2k2K3N4
10207E26N3L0Kj6j0J6L8L3Nk2k9k3j5j7k5l0k5j0K%j9l8m3l0pJ8L6N1N8M9K0qj7pkj6l0k2
10191D76jQKNK1K9J0j9l5l7l8l5j7J7M2M4L2K2J5Mj4k7j9JJ1Jj5j7j0j2k7l2nL8N7L8OoOJ7
10173E36J2nj2qmppJ3L8M7K7Lnjj0l4m7l4jK5K4Lj8j2J5L6L2Oj2j4j4k7l9l7k5j6j3jK2L8
10156D74L0kk8k9j0Nmk2k0PL1K4pl7m5l4j4%PRJ5K8L6L7M0M9N3L8Nk4l7l4k7j7j1nPK1L0K0
$$ y = [417, 412, 410, 422, 450, 477, 488, 490, 504, 526, 536, 530, 527, 542, 560, 559, 540, 519, 496, 465, 429, 412, 423, 450, 474, 488, 495, 501, 512, 534, 557, 563, 545, 520, 508, 516, 535, 556, 572, 579, 576, 574, 585, 606, 624, 628, 614, 585, 555, 540, 540, 540, 520, 491, 476, 480, 491, 498, 503, 505, 492, 459, 424, 401, 385, 364, 344, 341, 348, 340, 305, 267, 256, 274, 298, 312, 320, 339, 375, 418, 448, 455, 445, 431, 427, 439, 464, 500, 541, 574, 588, 577, 547, 509, 478, 462, 457, 452, 438, 417, 393, 366, 342, 332, 344, 372, 404, 435, 466, 496, 513, 511, 497, 486, 477, 463, 439, 413, 401, 415, 460, 526, 585, 610, 600, 578, 563, 555, 541, 527, 522, 526, 528, 525, 521, 521, 521, 518, 515, 505, 481, 446, 423, 421, 426, 426, 435, 470, 517, 543, 536, 523, 523, 530, 529, 529, 537, 538, 513, 471, 449, 472, 526, 579, 609, 611, 595, 585, 601, 639, 672, 677, 655, 626, 603, 588, 571, 546, 516, 491, 481, 483, 483, 464, 426, 383, 353, 346, 364, 400, 451, 509, 558, 578, 570, 553, 546, 544, 528, 498, 476, 475, 483, 485, 490, 511, 540, 550, 531, 496, 459, 421, 386, 369, 386, 428, 472, 504, 526, 541, 545, 531, 504, 485, 486, 497, 498, 483, 466, 456, 444, 417, 385, 380, 418, 475, 513, 519, 513, 519, 536, 548, 543, 531, 523, 519, 512, 505, 518, 556, 603, 630, 633, 628, 627, 617, 583, 536, 502, 501, 526, 550, 553, 535, 523, 538, 574, 606, 612, 600, 586, 572, 545, 506, 469, 444, 428, 415, 414, 436, 474, 504, 502, 474, 445, 435, 440, 436, 414, 394, 401, 432, 456, 449, 412, 367, 333, 319, 319, 326, 335, 350, 378, 414, 451, 491, 540, 593, 631, 636, 612, 575, 541, 514, 497, 486, 481, 488, 509, 539, 559]
10139E59JnQK2K0Qj0k4l1k5lJ3Qj4k7j9KJ4QllJ4K5J6qk7l3l1k9k0rJNRJ5J7J5J9K4J9Moj
10120E18RJ2J9K7K1j1l9m0k5k4l7l9k5j2pNK1K7J7RJ0J0JkNRkpMJ4Nj0rLMoqMJ5J5J1RQNK
10101E16kolJ4K9K7Lk3l6m0l7k5j3qj1pJ1K7K8J6QOPOMmj7l3l6k3MK5K5Lj8j7%J2J9K6K5J0
10082D92j5k3nJ8K3Ok3m8n9n0k5%J7K9L6K8J1jkOJ7L2L4J2k0k8nJ6K1J7J7Ok0l6k4qj4k0L
10065D15M0M4J4qmMmpPK3J6mj3j2j3j6rPK3K8J6pk7k7mJ6J5JqolLJ7L5M3L1Qj6l3m0l8l0k5
10047D52k4k8k9j7J2L8M0J5j6k9k2lK3M0K9rm3m7k4%J4J9J8Kj6k1mJ9L1L1K6J8RMORJ0MLJ4
10030E54L2M3L4Pk4m2m4l3k1j0qj6k3k1j3mPK0L1K5Jl0m7l7oK6L8K4Mm%MRJ9L2L4J7j5m5n2
10012D66k9QL4K9J0nj3j8j8lJ3Qj8m4m1j1K8N6N9L9Qj4k3k4k2j2LJ7K7L3K7Jl1m7m1k8j8p
$$ y = [559, 560, 555, 563, 585, 605, 613, 603, 579, 548, 523, 520, 533, 541, 527, 500, 481, 483, 497, 505, 502, 499, 513, 538, 554, 546, 519, 486, 455, 426, 406, 397, 398, 403, 412, 427, 444, 459, 478, 502, 521, 525, 519, 518, 527, 539, 558, 585, 606, 595, 556, 516, 491, 467, 430, 391, 366, 354, 347, 352, 373, 400, 417, 426, 436, 446, 447, 445, 450, 459, 457, 450, 454, 468, 473, 463, 454, 457, 461, 455, 447, 451, 466, 481, 492, 501, 509, 514, 516, 514, 508, 505, 519, 548, 575, 578, 555, 519, 479, 442, 417, 404, 396, 385, 378, 389, 416, 444, 460, 468, 474, 481, 487, 491, 487, 470, 437, 401, 378, 382, 407, 432, 435, 417, 400, 400, 412, 431, 457, 482, 492, 477, 454, 449, 467, 490, 496, 473, 425, 366, 316, 291, 291, 308, 337, 373, 401, 412, 411, 409, 415, 432, 464, 498, 510, 490, 462, 457, 473, 494, 511, 528, 534, 514, 478, 454, 446, 432, 412, 415, 455, 499, 513, 505, 501, 505, 501, 494, 501, 524, 540, 536, 523, 511, 498, 482, 473, 480, 503, 531, 547, 540, 513, 486, 482, 498, 513, 514, 506, 500, 497, 500, 517, 552, 595, 626, 634, 618, 585, 545, 507, 477, 452, 428, 400, 371, 354, 366, 404, 444, 459, 443, 414, 392, 389, 412, 452, 481, 472, 429, 382, 358, 358, 372, 391, 409, 411, 395, 374, 370, 389, 420, 451, 477, 495, 504, 508, 514, 523, 533, 537, 540, 554, 586, 629, 663, 670, 646, 604, 560, 527, 506, 496, 488, 472, 449, 428, 415, 411, 418, 438, 469, 494, 495, 465, 418, 381, 375, 401, 439, 463, 467, 463, 463, 467, 476, 495, 527, 561, 578, 563, 518, 466, 437, 445, 479, 508, 518, 513, 500, 482, 464, 461, 474, 482, 464, 420, 379, 368, 396, 452, 511, 550, 558, 544, 521, 497, 475, 463, 466, 483, 510, 543, 570, 571, 540, 493, 452, 424, 406, 399]
9996C99J3K8L0K4K0J8Rmj2j4j1LK3L5K3pk9l0rJ9L6K3j3m2m6l1j6kJ6L2L0J1j0j3kJ3K3K2
9979E59J4J5L2M4L5Pj1j4j7l2n1n4m3l3l3l4l1j9pKJ6L2L8K6N%K0L8K8kk1k6k8l7m2l1rJ2
9963C48K6K7J5Lloj3j1QL7M8M1L4L3K2kj9j8j0okJ5K6J8kj6k2l1l7l1j0NPok2l4k9pJ6L5M1
9945D68L5J0k2l2j0J1jk7l0jK5K5J3J0J1QKmj0j4qMJk0l3j9J1K8K9K8K2Mj7k2qNMoj0kJ0J6
9927D84J6J1J0J4Rqk7l0j5KQQQMrj9j6jJ0PnqNK3K4Mj5j6nLj%J3L1L8K8J0mj3j7j0MJ9K1R
9907F04j2k7k9k5k4k6k3j4l%jMJ3J7QlrrmjNJ2J4QRK3L9L4Ll4n0l7j0J0J8J6J3Mqk0k4j9j0
9889D32lkjNJ5K1J7Nmnjmj5l2m7m9k7OK3Qj5j8MK4K6K5L2L0Lk1j4K1M5M0K5K0J5%k5m5n2m4
9870D18k1NJ8J5J6K6L5L2K1J4J0QJ0J7J7Pmnrk3l8l3j6mLJ2J8J2Jpj4k3k0RL8L3mk9k0pj5
$$ y = [399, 412, 440, 470, 494, 514, 532, 541, 537, 525, 511, 500, 503, 526, 561, 584, 577, 548, 518, 509, 528, 564, 587, 574, 532, 486, 455, 439, 437, 453, 485, 515, 526, 516, 503, 501, 514, 537, 559, 573, 588, 620, 664, 699, 706, 695, 681, 664, 632, 581, 527, 484, 451, 418, 384, 353, 334, 327, 329, 345, 377, 415, 441, 446, 446, 466, 504, 532, 530, 509, 483, 455, 418, 376, 345, 336, 348, 374, 401, 416, 419, 416, 410, 397, 386, 394, 431, 479, 520, 554, 587, 609, 607, 588, 570, 560, 554, 552, 567, 593, 611, 609, 593, 571, 540, 503, 472, 462, 467, 474, 468, 446, 412, 383, 376, 392, 427, 468, 503, 513, 491, 459, 449, 460, 459, 432, 402, 401, 426, 451, 464, 474, 485, 493, 495, 491, 481, 467, 459, 463, 464, 444, 411, 392, 403, 431, 460, 488, 510, 514, 497, 475, 467, 472, 476, 470, 460, 458, 468, 484, 500, 511, 521, 535, 544, 536, 509, 479, 464, 466, 474, 482, 490, 494, 485, 466, 450, 449, 459, 466, 461, 453, 458, 481, 505, 509, 494, 478, 473, 476, 475, 475, 488, 519, 557, 585, 595, 591, 578, 561, 551, 555, 574, 595, 604, 592, 565, 536, 511, 487, 461, 438, 424, 421, 421, 420, 424, 437, 454, 462, 459, 450, 441, 437, 436, 441, 453, 467, 475, 484, 507, 546, 580, 583, 549, 499, 462, 452, 462, 480, 496, 509, 513, 505, 485, 461, 442, 432, 429, 427, 426, 431, 446, 467, 484, 489, 485, 480, 479, 475, 460, 428, 381, 332, 305, 311, 334, 342, 327, 309, 313, 337, 363, 388, 420, 450, 453, 432, 418, 439, 484, 524, 549, 569, 584, 584, 559, 514, 462, 418, 397, 402, 420, 435, 451, 477, 512, 544, 565, 579, 589, 597, 607, 624, 641, 648, 644, 639, 630, 607, 569, 536, 520, 516, 519, 531, 549, 561, 562, 555, 541, 518, 498, 507, 545, 578, 574, 545, 525, 518, 503]
9853E03k5j4J0J8RMJ1J6J5Lj4l1l3j4RJ1nj8j6rlkpj7j9qPMrj0J2L5M2L0J9J1Olj4k4j9JK2
9834D84K6J4OJ1J8J6J5K0K5J5rk7k5j2kkoj1j6j6j0jN%j3k5k2mK0L2K9J5mj9k3j7qnmKJ4J7
9816E03Oj1k0j4j0p%J5K8K3Oj1j8k5l3l4k6j1PK3K9J7pj6jK1K9K5K4K4J2qj2KJ4J3Kqj7j8
9798E16nJ7K8J7KjNKopljjMJ1J6J6J6J6Qlj2j8k3j8jJ4Rj0k2j4QK3K4J5Jnl%j0k0j7mOQJ6
9779E94K9K5ol7m2k3omj1j2j2j4j5mJ8M0M5K5kj8k1k3k8k1JK7L3K1Lj0j4rMQj0l7m8l6j3J
9761C98PPLmj0JK2M1L8J6j1k7k6j6lQJ8J8Oj1k5l3l4k2LL2M6L8J5jjJ5K4Ol2n6l8JK7K7J9
9743D86J5Oj4k3oK4L4J2j4k2rOQ%kJ0L1M1L3J2j0k8l2j6ORj7m8n4k8NK0J1j2k2j1J3K5J2q
9726D43j5j0lMJ2J0nj9jM5Q2P7L9Lj3j7k2k4k1j1j%k%NQJpmK%j1k5l2l0j6J0L0K6Kj3pJj0
$$ y = [503, 478, 464, 474, 492, 501, 505, 516, 532, 547, 550, 536, 505, 472, 458, 467, 478, 473, 455, 439, 430, 427, 425, 418, 401, 382, 374, 381, 385, 376, 366, 378, 413, 455, 485, 504, 515, 521, 518, 504, 480, 461, 462, 484, 510, 524, 530, 541, 559, 575, 590, 610, 635, 650, 641, 614, 589, 577, 575, 573, 567, 556, 540, 524, 514, 513, 518, 518, 505, 480, 458, 454, 474, 506, 535, 550, 546, 527, 504, 487, 479, 474, 470, 472, 486, 503, 509, 498, 478, 464, 454, 447, 447, 462, 490, 513, 519, 508, 490, 465, 432, 398, 372, 361, 368, 391, 420, 437, 430, 414, 413, 434, 463, 488, 512, 536, 548, 540, 528, 530, 544, 557, 559, 551, 534, 516, 511, 528, 556, 573, 575, 574, 579, 581, 575, 568, 565, 564, 563, 567, 578, 594, 610, 626, 642, 650, 647, 635, 617, 594, 576, 575, 589, 598, 588, 566, 552, 560, 583, 607, 622, 623, 618, 615, 615, 605, 585, 568, 564, 570, 578, 594, 623, 648, 642, 605, 563, 540, 534, 530, 519, 507, 495, 481, 466, 462, 480, 520, 565, 590, 588, 570, 549, 526, 498, 477, 478, 505, 538, 559, 562, 552, 538, 529, 533, 541, 531, 494, 446, 410, 397, 398, 405, 412, 415, 411, 401, 402, 424, 465, 503, 519, 508, 481, 455, 439, 436, 444, 462, 480, 486, 475, 450, 417, 383, 361, 364, 396, 442, 480, 495, 494, 493, 508, 532, 538, 506, 450, 412, 413, 440, 467, 486, 501, 507, 493, 470, 464, 488, 522, 534, 520, 498, 489, 495, 503, 503, 501, 511, 542, 583, 616, 628, 618, 590, 558, 542, 548, 557, 540, 492, 438, 410, 415, 435, 446, 434, 412, 401, 414, 439, 451, 443, 428, 418, 415, 419, 431, 441, 436, 417, 416, 461, 543, 620, 659, 662, 649, 632, 610, 586, 565, 554, 553, 553, 551, 551, 556, 564, 565, 558, 554, 556, 556, 545, 520, 488, 458, 442, 452, 482, 508, 510, 497, 490, 491, 481]
9707D81k6k4jK4L7L1J6KKJ9L1J9j7n3o2m5k4j4j7j9oJ9L9M4L6L1K6K2J2Kj0j7j7j2j2j8j8
9691D81%K1K6Oj6k7k0nPNj0k4k1mRRRJ8L3M2L4J5kqnqj8k8j7RK9K5Mj3j9k0k4k8j9OL6N0M0
9672E78J9Jrj9k6j8JJ0Mqj1qjOJ0kk1k2JL0L6J8%qqpmKL%mnrj5k0j9rKOlk1k9k1oNPJ2K0K4
9651D62K2J6Q%jOOok0k0oLOJ2J9J4nj3jRjj6nK5L9K3Jpkpj9k2rPJ0jrpjjpj2j2oJRJ9K4J6
9630E41jj7j6LL2N2M4J3k2m3m4l3j8j1n%NPNOK0L3K9Mk1l2l0j7MK9M0L1Rpj2j4j9l2m3m4k7
9612C99JJ9J7PLMLNJ3J8Rnj0lQJ8L2M0K3pk4j5mj2k5k4j8k9n2n4k9nqj8qJ8L1K0L%NQJ3K4
9593C91L1J8pk2j5jQJ4J9J8Q%J5L8N0L6J1j4k7l2l0l0l2l2j9%J2J3J1J2J3RJkjMMrl1m2k9
9575C61jK3M1N7N8L0j3k7nJ9J5kkRKk5l9k8mJ2J2jj6j7NL3L6J7jj1j8k8k6j5j0j8j6PK9K6
$$ y = [481, 455, 431, 430, 454, 491, 522, 538, 540, 542, 561, 592, 611, 594, 541, 479, 434, 410, 396, 379, 360, 354, 373, 412, 456, 492, 523, 549, 571, 583, 585, 575, 558, 541, 529, 517, 499, 481, 481, 502, 528, 534, 518, 491, 471, 466, 473, 478, 468, 444, 423, 419, 428, 437, 446, 464, 497, 539, 573, 588, 586, 578, 573, 565, 547, 519, 502, 511, 540, 565, 569, 556, 537, 517, 493, 465, 446, 452, 488, 538, 578, 597, 598, 589, 570, 544, 526, 527, 537, 541, 533, 522, 514, 513, 519, 529, 527, 506, 484, 485, 515, 551, 569, 569, 561, 553, 546, 542, 544, 547, 547, 543, 538, 529, 514, 494, 475, 466, 468, 474, 471, 450, 421, 400, 394, 399, 406, 418, 438, 462, 484, 500, 508, 508, 507, 513, 519, 513, 493, 473, 467, 470, 476, 488, 507, 521, 516, 503, 502, 511, 510, 494, 489, 514, 553, 576, 577, 570, 568, 561, 542, 520, 511, 518, 528, 527, 518, 511, 510, 509, 502, 490, 478, 472, 473, 482, 501, 525, 541, 540, 523, 507, 510, 542, 594, 638, 651, 629, 586, 542, 509, 491, 480, 475, 475, 480, 487, 492, 498, 518, 551, 580, 584, 563, 531, 501, 484, 488, 517, 557, 588, 597, 590, 578, 564, 545, 513, 470, 426, 399, 400, 419, 436, 443, 446, 450, 453, 458, 471, 489, 498, 493, 483, 480, 488, 506, 538, 578, 601, 594, 570, 555, 551, 539, 514, 490, 472, 443, 391, 337, 308, 303, 295, 277, 269, 287, 318, 338, 341, 341, 346, 354, 367, 391, 422, 440, 433, 411, 396, 395, 403, 417, 436, 454, 462, 462, 477, 515, 565, 601, 612, 598, 571, 539, 509, 479, 447, 415, 396, 396, 408, 421, 432, 444, 457, 466, 467, 465, 464, 468, 472, 463, 432, 390, 361, 360, 383, 424, 481, 539, 569, 556, 529, 524, 543, 558, 556, 554, 563, 565, 540, 501, 473, 469, 481, 493, 492, 476, 459, 464, 497, 533, 550, 549, 538, 520, 492, 466, 451, 441, 423, 407, 414, 443, 469]
9558D69Jj7j7nPJ1Plj3j3romMJ2J3RMKopLK3L6L8K8Rj3k9l1k9k7k1j0mqj2KK7M0K9Rj2l5n6
9538C96n4k9mLMJ9M0M5L4J8PlrrkjkKJ3J6PmqjJ5L3M4L1ol4l6j5jJlpj7k4j9nlk2m2l9j4R
9518C24J5J1J2J8K2J7J1QJ1J4J4J2RN%rj1mRJ4J0NMnk0k9k2j1j3j9j1J2K6J6LJ0J8Lk4k2J6
9501D49M4K7j1j9%J3KmJ4L1J9j1l2l4l2k7j0J2J5nk6k7j5nJJ0J7J3ORJ5J1qk3k1nORRQNLk
9482D31rj4j3jJ1Qj3m1n1l8j3OJ9L0M3M9M2L5L4L4K4J0MPKj0j7pMMpj5j2mJLOJ0J0OlqkOK
9463E63j8l1j7J2K4K0J5J2ll4n3l5LK3J5mj1rj1j6j9j8j1rj1j3%K8N3N3L5K0J5Lk5m6l6MM4
9446E12N5M0J6%nrj6j9rQK1J8%k0l5l8k8oJ4K2K1J8J9J8J0rl4m8m4k5mJ1K2K7J8lj8j8j4j8
9428D50k4j7%J5J6Opk2l1j9JRLjJ0J9J5KPK2K7J5MLNJmoj0j8k6k2j3j1j4j1opj5j4KJ7K0J5
$$ y = [469, 470, 453, 436, 431, 438, 449, 456, 453, 440, 427, 418, 412, 408, 412, 424, 437, 446, 450, 452, 446, 439, 442, 465, 501, 539, 567, 576, 563, 534, 503, 474, 447, 426, 416, 412, 404, 392, 394, 421, 461, 490, 499, 487, 452, 396, 342, 313, 309, 312, 316, 335, 375, 420, 454, 472, 479, 476, 467, 458, 456, 455, 453, 455, 468, 484, 491, 487, 479, 478, 493, 526, 570, 601, 595, 561, 525, 510, 509, 510, 507, 500, 483, 459, 440, 435, 432, 410, 368, 329, 315, 324, 339, 350, 362, 380, 402, 419, 430, 438, 449, 463, 477, 489, 498, 503, 503, 494, 483, 479, 488, 502, 512, 517, 521, 516, 496, 467, 445, 434, 421, 402, 391, 403, 429, 445, 448, 458, 476, 479, 455, 433, 449, 493, 520, 509, 490, 490, 503, 505, 501, 515, 546, 565, 554, 522, 488, 456, 429, 419, 431, 446, 441, 415, 388, 373, 368, 369, 379, 396, 409, 415, 424, 439, 450, 442, 419, 398, 393, 399, 408, 417, 425, 430, 433, 431, 422, 408, 395, 394, 405, 413, 400, 359, 308, 270, 257, 263, 282, 312, 355, 404, 446, 481, 515, 549, 573, 583, 587, 594, 596, 586, 569, 562, 566, 570, 563, 548, 536, 532, 533, 536, 542, 552, 562, 568, 565, 557, 555, 561, 563, 545, 514, 497, 509, 533, 553, 568, 580, 577, 543, 490, 455, 458, 481, 496, 492, 481, 472, 461, 445, 426, 408, 397, 388, 377, 364, 364, 392, 445, 498, 533, 553, 568, 571, 546, 500, 464, 468, 512, 567, 607, 623, 623, 618, 609, 593, 574, 565, 573, 594, 612, 612, 592, 557, 519, 491, 485, 499, 521, 542, 560, 579, 597, 607, 598, 564, 516, 472, 447, 443, 454, 476, 503, 521, 518, 500, 482, 468, 450, 426, 409, 409, 424, 440, 446, 439, 417, 386, 367, 368, 377, 380, 379, 389, 408, 423, 425, 432, 454, 481, 496, 500, 503, 508, 509, 505, 499, 489, 471, 445, 423, 410, 399, 385, 374, 368, 361, 346, 332, 334, 351, 371, 386]
9409C86J1Qpk2j4J5L5K4kj2lJjOK4L0Nk7l5j7k%JJ2K2K2J0jrj1qLJ8K9L1J8pk9l1j7rj6k1
9391D10j4lKQK5M0L1%k6k4oMknQL5N7N3K5j0k8k5j8j4rLJ5J6Noj0j0nNJ2QmqlJj0k2k0mMl
9371D78j1LL2M7L0lk4k2nKpk0k2j2NK1L1L5K7J8J0Npj9k7k9l0l1j8J1L1K0j0l1k6j6j2mRJ8
9353D47J0KJ5M2N2L5Lk0k2qPJ0jj5j6j3j7k5k8k0j0MK3M6N0L4J4J1J8J8Lj6l3m3m0k3JJ4%
9336E09l3n9n3k2QK6L4L8K7Jk3k5j3rj0jJ4J6%j0mlj7l1k8j2OK4L8L0Mj0LJ7Kk1j2K1K9kk7
9319D22j1K3L4J2j9l5k7JK8L3J3mJJ6K2J1KJQJ5K0K0J5Opl0n5o1m0kK8L7K6Oj3j4lM%JJ3K5
9300E22J7mj7rMOnj9k5j9lJ2J5J2J5K2K3J1nj4j6qLJ7K3J5ok8l7l0j8j9k5k4rQJ6J6J9J9J1
9283D66%lLKlkRJ5J3J1J5K1J3mk0j7MK4K1pl2l1j1MPPJ1J2ORJ9J8jj8j4klj3j7mJ6L0L1J8
$$ y = [386, 397, 405, 398, 376, 362, 377, 412, 436, 434, 422, 419, 420, 419, 425, 449, 479, 484, 457, 422, 405, 403, 403, 404, 416, 438, 460, 470, 469, 460, 449, 441, 444, 462, 491, 522, 540, 533, 504, 473, 456, 447, 431, 410, 396, 393, 395, 403, 428, 468, 499, 499, 473, 449, 443, 447, 445, 440, 448, 483, 540, 593, 618, 608, 580, 555, 537, 523, 514, 517, 532, 548, 553, 547, 537, 527, 522, 527, 539, 547, 543, 535, 532, 533, 523, 501, 481, 477, 481, 478, 467, 470, 502, 549, 579, 576, 552, 530, 525, 527, 520, 500, 478, 466, 471, 492, 523, 558, 585, 603, 613, 618, 611, 592, 565, 536, 506, 475, 457, 468, 499, 519, 509, 478, 452, 436, 424, 420, 429, 447, 457, 459, 474, 516, 568, 603, 606, 586, 564, 556, 563, 573, 572, 557, 541, 528, 511, 486, 458, 438, 428, 432, 455, 501, 551, 585, 599, 610, 628, 646, 649, 633, 600, 557, 517, 494, 495, 509, 509, 476, 417, 364, 342, 350, 376, 410, 448, 475, 476, 453, 428, 415, 406, 396, 395, 409, 425, 425, 415, 411, 408, 391, 360, 332, 320, 326, 350, 388, 418, 422, 412, 415, 432, 434, 413, 401, 422, 451, 449, 422, 411, 434, 468, 480, 461, 426, 399, 400, 428, 461, 474, 470, 471, 487, 509, 520, 522, 523, 531, 546, 566, 586, 601, 607, 600, 570, 515, 454, 414, 412, 440, 477, 503, 509, 496, 482, 479, 483, 483, 484, 497, 522, 539, 535, 518, 509, 513, 519, 514, 495, 470, 451, 448, 460, 475, 487, 502, 524, 547, 558, 553, 539, 523, 515, 518, 535, 558, 573, 567, 539, 502, 472, 454, 435, 410, 386, 377, 385, 401, 417, 436, 455, 466, 466, 463, 466, 468, 465, 463, 472, 487, 500, 511, 526, 547, 560, 556, 536, 519, 523, 547, 568, 561, 529, 498, 487, 491, 498, 505, 516, 528, 534, 543, 562, 580, 579, 561, 547, 545, 542, 529, 512, 508, 524, 554, 585, 603]
9264F03%qnlplJ8L7L2J2mj2k1l4l4j3J2K3J7LpmLJj5l3l4k1oPJ6J2qk5k0jNoj8j9j2kJ7L5
9244D78L1Jk3k1njlMJ6J7J2J5K5K5PplPJ0NNQRJj1k2k9k9k3j6j3j6j7qJNlj2j3oJPJ7L1L8
9225D95L3K8K8K2ll1l6j9qj5k7k3j0prmJ4K5K1OmpqrqmNJ0Rkj3j2JPok7l4k0mlpOL7O1N4K5
9205E27oj9j6pNJ0Lj5k9k3jK2K8K5J7%l0m8l4ML0K2Joj%nkRJ0KjKkj3j4PK8K8J5OJnj2j5j6
9185D82k2k0lJ0Nj0pJ4K3J3%NJ5Rj2l6m9m8k7LK3K1Q%lqj8j6LL5N8O3M5J9ok9m8n8n1l8k3
9167C22rJ6L8M1K3QRJ6J2MMRRRK1K9K0%j0qpr%J0%k1k5%J9J2rj5rj0j4mJ4K0J4J3K6L8L2O
9148F44k1l1k0OK2J6mj6j2kJlj4k5l0k2nJ1J8J2krmJ1K1J6J1J1J1kj4oJ1Kl0m7k8JJ1RJ4K1
9130E33Ok2l3k4j5j5qQJ0j0k2%L2L3Kk8l0j4JJ3K4L1K9J9J5J7K2K4J4rl9o0o0m0j2QJ2QNQ
$$ y = [603, 603, 595, 590, 587, 580, 577, 595, 632, 664, 676, 672, 660, 639, 605, 571, 558, 570, 593, 610, 613, 606, 602, 605, 606, 591, 558, 524, 503, 497, 504, 520, 532, 524, 499, 479, 478, 483, 477, 459, 440, 428, 426, 443, 478, 509, 510, 487, 466, 461, 460, 457, 461, 477, 494, 506, 521, 546, 571, 578, 571, 568, 575, 585, 590, 595, 603, 612, 613, 602, 580, 551, 522, 499, 483, 470, 454, 437, 429, 430, 435, 432, 420, 407, 401, 402, 409, 426, 457, 495, 528, 556, 584, 606, 603, 572, 536, 517, 509, 494, 467, 444, 434, 427, 418, 414, 428, 453, 474, 480, 476, 469, 461, 452, 444, 440, 445, 455, 464, 462, 449, 437, 438, 445, 439, 412, 378, 358, 354, 351, 344, 350, 387, 448, 502, 527, 521, 502, 486, 479, 484, 494, 497, 482, 453, 430, 429, 451, 479, 504, 521, 521, 491, 443, 409, 413, 443, 465, 466, 460, 459, 459, 454, 452, 461, 471, 473, 472, 474, 472, 459, 445, 452, 480, 508, 523, 529, 530, 525, 513, 498, 482, 460, 440, 437, 447, 452, 442, 435, 449, 472, 485, 485, 490, 505, 514, 502, 466, 417, 369, 342, 345, 368, 389, 397, 397, 394, 386, 368, 352, 355, 390, 448, 511, 556, 575, 569, 540, 492, 434, 383, 345, 322, 313, 329, 367, 408, 431, 439, 448, 464, 476, 480, 484, 493, 502, 511, 532, 561, 581, 581, 571, 563, 556, 547, 547, 557, 557, 536, 511, 511, 530, 542, 533, 518, 509, 499, 485, 481, 495, 515, 529, 542, 568, 606, 638, 644, 623, 592, 572, 578, 600, 616, 612, 596, 584, 582, 583, 580, 566, 541, 511, 489, 484, 495, 513, 525, 523, 514, 510, 521, 542, 558, 569, 580, 591, 589, 575, 569, 580, 582, 552, 505, 477, 478, 489, 498, 512, 533, 539, 517, 484, 460, 445, 430, 422, 430, 440, 430, 408, 408, 440, 473, 475, 447, 417, 403, 404, 417, 441, 472, 501, 520, 535, 552, 574, 598, 612, 603, 564, 504, 444, 404, 392, 400, 412, 420, 425, 433]
9113D33OjkJ5L0K0j2l0j3J5K2QnpnrrkPJ2J4J4Qmj5j8j4%J9L4L1K1J8K5K5kl6m9l7j8j0qk
9094D69jj0k0j5MRj0l5l2jK4K4J0QJ3Prj2LJ6J1LQJ8J5nk0j3PJ8J3oj8j3JNrk5j9JJ8K6K8
9075D86K5J2rj7j1moj0j2j4j4kK3L9L1Pj3k0j8oMlj9j8J4M8N7M2L3L2L0K3K1K8K8K7L4M4L3
9059I25PmJ1K2nm6n9m5l3l8m8m5l4k8k2j4ponJJ0J1Lj3k5k7k3k0j7oK0L8K8ml3m2l6k3nJ6
9041C79K9K8J8J0PPRJ0J0PPPNoj7k2k0j7j7j8j8j8j1MJ4J1%ojRJ6K1K4J4pl3m7m3l4k4j2N
9023B80K4L3L1K2J5J5K0K1J6RLLLnj7j8lJ2Nj5k6j8pj0k6l8l0jL8O4O1L4NkMNljJ4K5J2j9
9005E35l7k4OK3J6oj7j8k7m1m3j9J0J6lj8j0PJ8K3L1L0J5j0k2j8qKJ1J7J8J2OJoj2j4j2oJ1
8987D37L8N6N1K6Nnk4n3p5o1j8K0K9J9Okj4k5k2JK3K1rl8m1k5j4j1ML1N1M1J5jMJ2J5J0Mq
$$ y = [433, 439, 438, 436, 451, 481, 501, 489, 459, 446, 461, 483, 491, 486, 479, 474, 465, 456, 454, 461, 473, 487, 501, 509, 505, 490, 472, 458, 458, 477, 511, 542, 563, 581, 606, 631, 629, 593, 544, 507, 489, 479, 471, 469, 468, 458, 438, 423, 427, 436, 426, 391, 359, 358, 382, 406, 416, 424, 437, 444, 435, 423, 426, 442, 453, 456, 464, 482, 497, 492, 472, 459, 466, 484, 497, 491, 473, 460, 461, 466, 457, 432, 413, 414, 432, 458, 486, 511, 523, 514, 497, 486, 482, 476, 466, 454, 440, 426, 424, 447, 486, 517, 524, 511, 491, 473, 467, 471, 468, 449, 431, 445, 493, 550, 592, 625, 657, 687, 710, 731, 759, 787, 814, 848, 892, 925, 932, 928, 939, 961, 956, 910, 851, 806, 773, 735, 687, 642, 608, 580, 558, 544, 537, 531, 526, 527, 537, 548, 551, 538, 513, 486, 463, 443, 426, 420, 440, 478, 506, 502, 469, 427, 391, 368, 363, 379, 408, 436, 454, 464, 471, 478, 487, 497, 507, 514, 521, 528, 533, 527, 510, 488, 468, 451, 434, 416, 398, 380, 369, 373, 387, 398, 398, 392, 391, 400, 416, 437, 461, 475, 468, 435, 388, 345, 311, 287, 275, 280, 304, 337, 368, 390, 405, 420, 440, 461, 477, 486, 489, 492, 495, 490, 473, 455, 452, 464, 469, 454, 428, 410, 403, 393, 367, 329, 299, 298, 336, 400, 461, 495, 500, 498, 502, 507, 504, 503, 517, 542, 554, 535, 498, 474, 480, 503, 519, 513, 496, 478, 451, 410, 367, 348, 358, 374, 371, 353, 343, 350, 368, 391, 422, 452, 467, 457, 435, 417, 409, 411, 422, 439, 457, 469, 475, 476, 470, 458, 444, 432, 426, 437, 475, 531, 582, 608, 613, 608, 584, 531, 456, 395, 377, 397, 426, 445, 451, 449, 435, 410, 388, 389, 412, 433, 424, 386, 345, 320, 306, 295, 299, 330, 381, 422, 437, 436, 440, 452, 467, 477, 481, 473]
8970D73k2k8k0mPRL%lrj6k0j2OK3K6K4K4L0K6Mk0k7j5%Jj4k5k3oPJ4K0L2M0K7MmJ3K9K3Nj1
8951E91k0l4m3l0KK3J9LjOJ2J0Joj1pKOMKLmk6m2l3nJ2Mj1qPJ9K5K8K2kl1m1k5nkj2j5nNJ0
8931C97J5K1J9Opj0mkqj5j3o%jjMJ5K5K7K3J7Qlj7k1j1MQLKJ3K5L1L1K5Pj8l5l6l0k5j4J4
8913D63L8L5Lk4k1pmj6k4j8nJ1K5L4L0Mk7l7j6J8M0L9K8K1J3ok6k6lJ9J6ok5l4n0p3q2n5n
8896B47L5M3L2K6K7K2QqrNJ9K0J5J4K3L5L6J3j9l7k1OJ4qk8k1OK6K0Lj7l1l8l2j3JRRQLnj1
8878D27j3j8k6k7k0j0JK6N9P3M9J0j0o%j1k1j4QK0J2jj5k2k6k0kJ5K2J6PL%j4k7k1QL2K7N
8860D96pnpk1k7j1J0J3L%J3K1J7Nnj4k4j9KK5K8J8QJ2J7J5JqpLJ2J1PNMpl0m4l3rQJ4J2J0
8841E12Kj3k1j0RJ6Mj1j4j0j3k7l6k3J2M0M6L3K3K2K2J0jJJ1J3jj6k1j4ojMJ3J8Rj4m0m9l1
$$ y = [473, 451, 423, 403, 399, 406, 415, 418, 418, 415, 406, 390, 370, 358, 364, 387, 413, 437, 461, 491, 517, 521, 501, 474, 459, 459, 460, 446, 421, 398, 392, 399, 413, 433, 465, 505, 532, 536, 532, 545, 574, 597, 602, 591, 571, 537, 494, 464, 466, 489, 508, 511, 510, 516, 528, 538, 539, 533, 522, 515, 517, 523, 527, 529, 532, 528, 502, 460, 427, 422, 434, 438, 427, 419, 426, 445, 470, 498, 520, 518, 487, 446, 421, 416, 414, 402, 387, 382, 387, 397, 412, 433, 452, 458, 451, 441, 437, 435, 427, 412, 399, 393, 393, 392, 391, 395, 410, 435, 462, 485, 502, 510, 507, 490, 469, 458, 462, 470, 473, 475, 488, 513, 544, 575, 600, 607, 589, 554, 518, 488, 463, 449, 463, 501, 536, 539, 515, 494, 487, 483, 467, 443, 425, 420, 431, 456, 490, 520, 524, 497, 460, 444, 462, 502, 541, 569, 590, 603, 597, 571, 545, 542, 561, 577, 571, 546, 512, 462, 389, 307, 252, 247, 282, 325, 357, 383, 410, 432, 440, 432, 423, 428, 447, 467, 482, 496, 519, 554, 590, 603, 584, 547, 526, 532, 546, 538, 510, 489, 495, 521, 541, 544, 527, 496, 458, 426, 413, 414, 423, 432, 440, 443, 438, 427, 414, 396, 370, 343, 323, 313, 314, 340, 399, 472, 521, 531, 521, 515, 515, 504, 483, 469, 477, 497, 509, 508, 493, 471, 445, 425, 423, 438, 460, 476, 483, 486, 486, 472, 445, 424, 432, 464, 491, 496, 489, 484, 477, 456, 429, 418, 428, 441, 444, 444, 457, 478, 495, 500, 495, 481, 457, 438, 440, 465, 493, 511, 519, 531, 548, 563, 564, 556, 549, 552, 564, 575, 582, 587, 591, 584, 554, 510, 477, 468, 476, 490, 502, 512, 514, 501, 480, 470, 479, 495, 499, 488, 474, 464, 451, 424, 388, 365, 377, 417, 463, 496, 519, 541, 563, 573, 572, 573, 584, 597, 596, 580, 559, 545, 539, 538, 542, 555, 573, 582, 568, 528, 479, 448]
8824D48lJ0pl2l8k1kJ1K0L1K8J0qlK3M4M7L9L1J8mk6l2k7k3k0qJ0K0J5QNKllMOj2l8n0l7j7
8806D16plOJ1Lj8k2JL3M2J5j4j9lNkoRK8K4%k3k8k1mJ9M2M7K2j7m0l9k8k0j8j7j3%J6K6K1
8788D24Lj2j5j2j0mPK0K2RmnMJ5J9K0J8J3Lpj2j6k0k4k3j8j2mRJ7J7O%KJ1J7K0J8Qrk2j7J
8769D57J6J9J5P%qj2j2nMRJj7k7j6J0J8Oj3j1MJ2Kj2j6lJ1Pj2k5rK1L2J6npLlk3l0j5NJ3Q
8750D15KkKJ8M3N4M1J2orj2k2l0k6j5nmon%MMRK1K9J8j7m9n5l5j1jOJ7K4J5kj6j5j0j0j2j0
8732C49kQJ3J0PJ0K5L7L4J2qj4qmj0j2pknj2rJP%j6k3j1OJ9K1J7J0J0J3J9J9J3Mjqj9k9k4
8713D40j1%kj0rjJ2K1K5K4K0K0K5K1Kk2l4l6l7l1qL0N4N0L0Rqk3k1KK7L0J0norl0m9l7LM1
8695E07M6J9rj7qMN%mqj7k1j7rj4k6k6j1KKrj6qQK2L1L4L5L8M0L1Qj3k8l9n0n2l2MK8K7Oj0
$$ y = [448, 445, 455, 448, 416, 378, 357, 355, 366, 386, 417, 445, 455, 447, 444, 467, 511, 558, 597, 628, 646, 642, 616, 584, 557, 534, 514, 506, 516, 536, 551, 559, 564, 566, 563, 560, 564, 570, 558, 520, 470, 433, 416, 409, 406, 412, 423, 426, 408, 386, 387, 420, 462, 477, 463, 444, 441, 446, 444, 438, 447, 475, 499, 499, 476, 448, 427, 423, 442, 484, 531, 553, 536, 496, 457, 429, 409, 391, 374, 361, 361, 377, 403, 424, 427, 415, 400, 388, 378, 374, 381, 401, 423, 432, 428, 423, 427, 442, 461, 481, 499, 512, 515, 508, 496, 480, 460, 436, 413, 395, 383, 379, 388, 405, 422, 428, 428, 430, 441, 458, 478, 496, 504, 495, 473, 456, 457, 473, 492, 507, 514, 514, 506, 494, 482, 477, 481, 490, 491, 474, 447, 431, 441, 459, 465, 452, 441, 445, 457, 459, 447, 431, 428, 439, 446, 434, 409, 400, 421, 453, 469, 464, 457, 460, 457, 434, 404, 389, 394, 407, 415, 417, 415, 417, 435, 478, 532, 573, 585, 579, 570, 558, 536, 506, 480, 465, 460, 456, 450, 445, 445, 449, 453, 462, 483, 512, 530, 513, 464, 409, 374, 363, 362, 368, 385, 409, 424, 422, 406, 391, 381, 371, 359, 349, 347, 355, 368, 378, 385, 395, 420, 457, 491, 503, 495, 481, 473, 469, 459, 447, 440, 438, 433, 421, 412, 413, 420, 420, 404, 381, 370, 376, 395, 416, 433, 443, 453, 466, 485, 504, 517, 521, 520, 512, 493, 464, 440, 429, 429, 427, 417, 408, 407, 419, 440, 465, 489, 509, 529, 554, 575, 577, 555, 521, 485, 448, 417, 409, 439, 493, 543, 573, 582, 574, 551, 530, 532, 559, 589, 599, 594, 588, 579, 549, 500, 463, 466, 507, 553, 572, 563, 546, 538, 542, 547, 547, 543, 535, 518, 497, 480, 471, 457, 431, 405, 394, 396, 398, 389, 373, 365, 373, 395, 426, 460, 495, 533, 573, 604, 612, 599, 571, 532, 482, 430, 398, 402, 430, 457, 463, 453]
8677D53j1mlj5k2qJ5K8K4K4M0N5M9K7J1Lj2l1l6l0k8l9m1k1OJ6RNJ3J9J0oj6j6pLQJ0J3K2
8659E17K6K4J5PLpk0k6j7KJ3Rqk2j8KK2J9kk3k3pNNlmLJ4K0K0J1mj2j1qj4k4k6j5qj3j4%K3
8640D31L2K3J0PLprMJ9J6lj6j8j7j5oPJ5RNJ1J9J2nj0NJ8Mk7m7l8j2J0K0K5L1K9J2rj8j2O
8622E14K0K5K3J6J4J5J0ok3k4j4qj1j0jjk0l8l2mJ7J0j3k7k0ojrj4oLJj4k3qK0L8L4K0J1J8
8604D76L1L6K5Jj7j8j0oj6k9l6l5j9PL5N0M3J8nj6j6j3j6k2k3j1MPMLN%j0j3nQJ4J3Jj9l4
8586C92l0rJ2J5NMJ2K0K4K6K2Kk6l5j2J8L1K0Ook4m6n1k8KJ1pk2j2J6L2K0pk6k4pQJ2PLJ0
8569C58J9J8QLQK2L3L3J9Jj5j7j1pj2j4pOJ3J4J6K1K1J3%j2j8j7j2rj4k3k4j1MMj4k3j1K2
8551C85M7M7K6kk0k2j3KJ0RJlnlJJ2K1K4K0J2%k1l2j9J3L4L0J7Mpj9j7OL1L8K5J0j1l7n2l0
$$ y = [453, 442, 438, 435, 420, 398, 390, 405, 433, 457, 481, 521, 576, 625, 652, 663, 666, 654, 623, 587, 557, 529, 490, 449, 428, 434, 450, 459, 464, 477, 496, 506, 500, 484, 468, 461, 464, 472, 482, 495, 517, 543, 567, 582, 589, 592, 585, 565, 539, 522, 524, 537, 546, 538, 516, 498, 500, 522, 541, 539, 516, 493, 486, 491, 496, 493, 489, 492, 506, 526, 546, 557, 553, 541, 530, 522, 508, 484, 458, 443, 435, 422, 408, 408, 431, 463, 486, 496, 503, 506, 499, 490, 494, 513, 529, 526, 510, 492, 475, 460, 454, 461, 476, 485, 490, 501, 520, 532, 527, 517, 522, 540, 544, 517, 470, 432, 420, 430, 450, 475, 506, 535, 547, 538, 520, 508, 514, 534, 559, 582, 598, 612, 627, 637, 631, 608, 584, 570, 562, 551, 541, 540, 539, 519, 481, 449, 445, 462, 472, 459, 432, 412, 406, 405, 396, 382, 376, 379, 380, 366, 343, 335, 355, 393, 427, 447, 458, 476, 507, 543, 568, 569, 552, 534, 524, 518, 502, 473, 437, 402, 383, 390, 425, 475, 518, 536, 531, 515, 499, 486, 470, 448, 425, 414, 418, 425, 429, 432, 437, 437, 427, 414, 409, 417, 431, 444, 445, 426, 392, 362, 353, 365, 380, 385, 389, 401, 421, 445, 471, 493, 495, 469, 434, 422, 440, 471, 491, 497, 491, 467, 421, 370, 342, 344, 355, 348, 326, 314, 330, 362, 382, 375, 349, 325, 318, 326, 338, 345, 348, 358, 377, 395, 403, 406, 414, 436, 469, 502, 521, 522, 507, 490, 479, 472, 460, 446, 439, 445, 458, 472, 488, 509, 530, 543, 543, 531, 513, 496, 484, 475, 461, 438, 414, 403, 407, 411, 397, 374, 363, 385, 432, 479, 505, 503, 483, 461, 448, 450, 460, 469, 470, 467, 462, 459, 460, 472, 493, 517, 537, 549, 549, 528, 496, 477, 490, 524, 554, 571, 575, 568, 549, 532, 538, 569, 607, 632, 642, 631, 594, 542, 512]
8534E12LOk4m2k4OJ3nj7j5roqj1j7j5%J8L3M0M3L7K7J8J7J0nk4l4m1m8m1k1%%rj1mkjMJ6K3
8515C92K3K2J8Mj2k1k9m3n1l0J4M5M5K7J8J6J5J3J5J9K0J6Poj7j4jJ3J7J4NmmLKj6m1m3k0
8498D31JJ0J8K9L0J0j0j5j2j9l0k9j9j1JK0L3K5J2K1M5N0K8Kj4l0n4o8n1j2J7K1J0nj0jOM
8482D34nnOJ4J0Jrj4j4ojnk1k9k2q%OJ0J1NJMJ3K2L0L2J7mj1LJ7J0qj0%%j1j4JJ6J9J5J9K4
8462E43K0Lj7l8n3n2l3j5qrjJ5K2J5QJ3K7L2K8J2j0l3m7m0j7OJ3J4J6J7Oj2j5PL8N4M3J4j0
8445E56j1jQLlKRPjnJOK%%lj7k9k4mRNrj9k3j6KK3L3K4RK%j0k8l2j9l%j1j5j0LJ5K2L0L2K9
8424E39K5K3J8Ppk2k8l2k9k2j1jMNRJ1Noj4j0OJ8J8QJnj4k8l0j2J7L9M3K6pm1n3l1J2M1M3
8407E15K4%j2pJ3K9J9j0k8j6PJ0mj1jJ8K6K5K2J9J2lk0k8k6j6j0rj1j0n%RJ8K0J1mj6k3j7
$$ y = [512, 515, 521, 497, 455, 431, 437, 450, 445, 428, 413, 404, 398, 390, 379, 362, 347, 347, 365, 398, 438, 481, 518, 545, 563, 580, 590, 585, 561, 527, 486, 438, 397, 376, 376, 376, 367, 356, 352, 350, 349, 353, 369, 392, 415, 437, 455, 459, 447, 426, 397, 354, 303, 273, 287, 332, 377, 404, 422, 438, 453, 466, 481, 500, 520, 536, 543, 537, 520, 506, 505, 518, 535, 549, 554, 550, 546, 549, 551, 535, 494, 451, 431, 432, 442, 460, 489, 519, 529, 519, 504, 492, 473, 443, 414, 395, 384, 385, 405, 438, 463, 475, 496, 541, 591, 619, 621, 607, 577, 523, 455, 404, 392, 409, 430, 440, 435, 425, 424, 430, 434, 429, 424, 430, 444, 454, 455, 446, 432, 418, 412, 411, 406, 385, 356, 334, 326, 326, 332, 342, 353, 358, 359, 363, 376, 398, 428, 460, 477, 473, 462, 465, 482, 492, 484, 474, 474, 474, 463, 449, 450, 466, 485, 500, 519, 543, 563, 566, 549, 511, 458, 406, 373, 358, 350, 341, 340, 355, 377, 392, 400, 413, 440, 472, 500, 512, 502, 469, 422, 382, 365, 371, 384, 398, 414, 431, 437, 425, 410, 417, 455, 509, 552, 566, 556, 545, 544, 552, 555, 552, 554, 563, 570, 569, 564, 565, 571, 573, 573, 573, 570, 553, 524, 500, 496, 505, 510, 501, 482, 459, 443, 445, 468, 501, 525, 534, 536, 536, 526, 498, 466, 447, 444, 444, 433, 418, 408, 411, 426, 448, 478, 510, 539, 564, 587, 605, 612, 605, 583, 555, 523, 494, 472, 461, 460, 464, 469, 478, 489, 494, 488, 474, 464, 470, 488, 506, 514, 515, 510, 496, 468, 438, 426, 443, 482, 525, 551, 544, 503, 450, 419, 431, 472, 515, 539, 539, 527, 520, 533, 562, 581, 571, 543, 527, 534, 544, 540, 529, 528, 546, 572, 597, 619, 638, 650, 647, 627, 599, 573, 557, 547, 538, 527, 517, 512, 512, 521, 539, 559, 570, 566, 550, 527, 510]
8389E10%J7J3j8m8m3qK3K3KqMJ7Rj6l3j9J4L5J9rj4J1L6L6J2j2j8qjpk0k0mJ0RJNJ5J8J3J0
8371E56Kk5o1o9l3J7M1M1L0J5j4m8o2n1k2QL4M7M3K4Jj9k5j1J7M0L8J4j1k5k9k6j7j2j4j7
8355C77pJ7L6L9K6J3L%PJ8J8ml4n3m8k2J2L4L0Nj6j8o%loMK7M8N1L4Nk4l6k9j0Jqk3k6j0P
8337D29OloJ%pr%J0QOJ5L6N2N2L3Kk2l1k0nJoj3j4lJ4K1J1oqPRj1l2k4LJ5kj7j1OJ0mj7j6
8317D60nPK0K8K6J4oj4nJ7K7J4j4l4l4j9%J1J1kj4j3KJ2Nj4k0oJ7K9K2LqjJ2J3lj8j8mJ0J8
8299E26J7Pj1k3j8njj1k0j5nLNMkpo%LLJ5L0K6nm1n1l9k4j0J9N1N9L3jj8j6j1onqj1jJ5J8
8280D63Lj2r%JJJ1K6K2LpKJ2PmrKJ0Qnj1jJ2Rj1k4j1J0Qrj5KJ4PooJLPJ9K9K1KoLMj4l5l5
8259D92j6PJ9J8J1jj0j9k3k1j4lNLlo%PP%nJJ1J1M%KMNMNlj4j9j4qpKK4M3M4K7RkooJJ4K5
$$ y = [510, 510, 527, 540, 522, 474, 431, 423, 446, 469, 471, 463, 467, 484, 493, 477, 444, 425, 439, 474, 493, 484, 470, 481, 517, 553, 565, 553, 535, 527, 526, 519, 499, 479, 475, 485, 494, 495, 500, 515, 533, 546, 556, 558, 533, 472, 403, 370, 387, 428, 469, 499, 514, 500, 452, 390, 339, 317, 325, 359, 406, 449, 473, 474, 455, 430, 419, 436, 476, 514, 528, 517, 492, 463, 437, 420, 408, 394, 377, 370, 387, 423, 462, 488, 501, 504, 504, 511, 529, 547, 543, 509, 456, 408, 386, 398, 432, 462, 467, 451, 433, 427, 427, 424, 418, 422, 449, 497, 548, 582, 587, 563, 527, 498, 488, 489, 481, 458, 432, 422, 429, 435, 432, 426, 427, 427, 420, 411, 411, 421, 429, 435, 450, 486, 538, 590, 623, 625, 603, 572, 552, 547, 548, 542, 529, 515, 512, 526, 547, 558, 552, 544, 551, 560, 549, 517, 493, 496, 511, 509, 492, 481, 487, 497, 493, 476, 460, 455, 462, 482, 510, 536, 550, 544, 530, 525, 542, 569, 583, 569, 535, 501, 482, 482, 493, 504, 502, 488, 475, 477, 489, 494, 480, 460, 454, 471, 500, 522, 525, 517, 516, 528, 541, 538, 520, 502, 498, 508, 526, 543, 550, 539, 516, 498, 493, 492, 481, 461, 446, 441, 444, 449, 453, 451, 444, 438, 438, 441, 444, 459, 489, 515, 510, 469, 418, 379, 355, 345, 364, 415, 474, 507, 506, 488, 472, 461, 455, 450, 442, 431, 430, 445, 463, 466, 454, 445, 445, 446, 447, 458, 484, 506, 509, 502, 504, 516, 523, 519, 510, 512, 522, 530, 525, 514, 513, 525, 534, 523, 499, 488, 498, 506, 497, 482, 484, 498, 505, 499, 493, 494, 497, 504, 523, 552, 573, 575, 569, 572, 576, 562, 527, 492, 476, 483, 502, 520, 531, 530, 520, 501, 478, 457, 443, 440, 445, 448, 445, 439, 439, 446, 453, 453, 448, 449, 460, 471, 475, 475, 477, 481, 486, 490, 495, 492, 478, 459, 445, 437, 430, 432, 456, 499, 543, 570, 579, 577, 571, 565, 566, 580, 605]
8237F05L1K2rm6n3k5Lkk2j8QK2J9K5M2L5ol9k6QJ8KpJOjj1j3j5j9k1j4olmrj2pKJ0Jj1j3l
8218D45ONjj0j9k2j4kNOJ0J8J8ONJ5J4j0m1m7l0j3kJ8M2M8K6ok2j4LK0K9K7Rj4l5n3o9o7l4
8201B50J6N1N0L3J6Jk0l3k2LJ6J3RJ6K5K6K8K9J9%nJ6M0L8J1j2j8j7k1k8l0k5oK4M4L2%j9
8184E50j3mrj5qkj2k9l0j8j6k6k8rJ6K6K3J3MJMJ2K0K2K0J4kj8k1KL4M4K7kk0j5NJ9J5rl1
8166E34l8l5l4l4k5kJ5Qj9m0l7j5OLj3k3j1J6K7J7lqLJ8K2K0J4OKLNLj0k3k9k8k0nJ7L6L9
8149C62K3PJMQLpj7j3QL4M4L0Nj3k3k5j1J2K5J1j7k6j1%qj4jJ8J5nj7pRK0K3J5pl1l4j2J3
8130C91J8Noj2j5j1jOLmmMRJ1J5J5Lj5j6MJ8J3mj4j0%J9L9N2M1J0k2l8l7l1k6k6k3j5LJ9L1
8112C99L3K5Nj7k8k7k5k4rK1M6M5L1K5L2K5ol4l4j1J1J9J4MlOK7M1K9OmQJ5Jk2k9k3k0j9j6
$$ y = [605, 636, 658, 649, 603, 550, 525, 528, 526, 504, 486, 494, 516, 535, 560, 602, 637, 631, 592, 566, 574, 592, 594, 587, 588, 594, 593, 582, 569, 554, 535, 514, 500, 494, 491, 487, 478, 466, 459, 461, 471, 472, 461, 448, 445, 451, 456, 455, 445, 426, 404, 390, 388, 393, 399, 409, 427, 445, 451, 456, 471, 485, 475, 434, 387, 357, 344, 342, 360, 402, 450, 476, 470, 448, 434, 437, 457, 486, 513, 522, 508, 473, 420, 351, 284, 250, 266, 317, 367, 400, 416, 417, 397, 364, 342, 345, 361, 374, 383, 399, 424, 450, 478, 507, 526, 526, 521, 537, 577, 615, 626, 614, 596, 579, 558, 530, 500, 475, 469, 493, 537, 569, 569, 550, 537, 533, 524, 509, 501, 499, 487, 458, 428, 410, 394, 368, 340, 331, 347, 373, 396, 409, 413, 414, 418, 430, 450, 472, 492, 506, 504, 486, 465, 467, 501, 545, 572, 570, 550, 535, 540, 559, 574, 565, 534, 496, 461, 427, 393, 368, 366, 381, 389, 370, 330, 293, 278, 284, 287, 274, 251, 240, 256, 283, 300, 297, 289, 292, 310, 332, 352, 366, 372, 374, 377, 382, 385, 375, 352, 323, 295, 275, 270, 287, 323, 362, 385, 392, 393, 397, 405, 408, 401, 384, 371, 379, 413, 457, 487, 492, 479, 456, 431, 420, 432, 457, 468, 451, 425, 414, 414, 406, 392, 391, 409, 424, 419, 402, 395, 404, 424, 447, 462, 455, 424, 390, 378, 391, 409, 414, 408, 396, 381, 370, 369, 375, 378, 374, 370, 374, 383, 394, 409, 424, 427, 412, 396, 400, 418, 431, 427, 413, 403, 403, 422, 461, 513, 554, 564, 542, 504, 467, 436, 410, 384, 361, 346, 349, 368, 399, 432, 457, 462, 445, 417, 390, 365, 341, 332, 353, 399, 444, 475, 500, 532, 557, 551, 517, 483, 472, 483, 502, 516, 520, 517, 523, 550, 591, 620, 626, 622, 630, 645, 646, 624, 595, 572, 552, 533, 517]
8095E17j1j8l3m5l7j3J5M1N0M1K0Nmk1m4n2k7J2L5L4K6K4J6%j2qklrmNNknNJ1Onj8l1m0l8
8077C86j4J4K6K0QNRJ4Qlj8k4k0nQJ2QKjMJ2J8J5kj8j7MK1J5j3l4k6kJ3J4J5J9J7QQK1K2l
8058E46l6l8j0J2J0lnjnqJ0M4N9K7l2o8n8j8J7K3J1JKMok2k7j4JMklJLNJ2K2J9mk7l1k7l2
8039C56l8j7K8O2N4J8j0j6qjOPKkQK9L9K2ok2k2k1l0l0rK1L1J0j9l0j7PK8L7L3K0QJmj1j6
8022D98j4onj6l1m0l1j0J5L0K9J8QMNM%oj2j4j3rjJ0K0J7Noojnj5j4mPMjNJ7J6KpjJ1J9K0
8002D96J7Nj2k1k0j9k6k8j0J9L4L0K2J8RoqJ3L1K0j3l0j5J0K1J8J4Pmj0rj3k7l5j4K1L3J5
7985E33nJK3K7%l6n7n1l0qPJ6K3L0K5J3ORJ2Lj4k4k2j3oKJ0OmqLJ5J8J2OO%j8l2k1QK9K5Q
7966E27npkMPLqrPK5J8j0l4l7l0j9%K3K7Qj3j4ooj1pPRJMK7M5L5Jk3k3j2j0j9k4j2NRkj6j5
$$ y = [517, 506, 488, 455, 410, 373, 360, 375, 416, 466, 507, 527, 532, 528, 507, 463, 411, 384, 396, 431, 465, 491, 515, 531, 531, 519, 511, 509, 506, 497, 493, 498, 503, 501, 496, 501, 512, 518, 513, 495, 464, 424, 386, 372, 386, 412, 432, 440, 445, 454, 468, 476, 473, 455, 431, 411, 406, 414, 426, 434, 436, 435, 439, 451, 469, 484, 482, 464, 447, 451, 472, 487, 474, 440, 414, 412, 425, 439, 454, 473, 490, 498, 506, 527, 549, 546, 510, 472, 462, 474, 484, 481, 476, 475, 470, 462, 472, 516, 575, 602, 570, 502, 444, 426, 443, 466, 477, 478, 480, 484, 478, 456, 429, 415, 416, 420, 418, 415, 416, 419, 424, 436, 458, 477, 473, 446, 415, 388, 356, 318, 301, 329, 391, 445, 463, 453, 437, 429, 428, 434, 441, 443, 441, 449, 478, 517, 539, 533, 511, 489, 468, 438, 408, 399, 420, 451, 461, 442, 412, 395, 402, 430, 467, 500, 520, 528, 529, 525, 514, 498, 484, 478, 473, 457, 426, 386, 355, 345, 360, 390, 419, 437, 445, 449, 454, 458, 458, 452, 440, 426, 413, 404, 403, 413, 433, 450, 455, 449, 443, 442, 437, 422, 408, 404, 411, 415, 414, 419, 436, 452, 454, 447, 446, 457, 476, 496, 513, 518, 506, 485, 465, 446, 420, 392, 382, 401, 435, 465, 487, 505, 514, 508, 500, 513, 544, 564, 551, 521, 506, 516, 537, 555, 569, 576, 572, 562, 553, 540, 513, 478, 464, 485, 518, 533, 528, 529, 552, 579, 579, 543, 486, 435, 405, 397, 404, 420, 443, 473, 498, 511, 517, 526, 538, 541, 527, 503, 481, 468, 462, 464, 474, 480, 476, 468, 471, 486, 504, 516, 522, 528, 528, 510, 478, 457, 465, 494, 519, 527, 522, 515, 513, 517, 524, 527, 519, 510, 517, 542, 560, 550, 516, 479, 449, 430, 430, 453, 480, 488, 475, 461, 455, 449, 438, 431, 438, 447, 448, 452, 479, 524, 559, 560, 537, 514, 502, 492, 473, 449, 437, 442, 451, 449, 433, 418]
7946D18jJ8L5L7J7j3k8k0rj6l1l8l4l2k4JL4M5L2J8J8K8L6L5K3LpKOj7n2n4j5K4L3K1J4Rp
7929E09k2j8JJ6K2K0Jl1n6m3mK5K9K1J9K2K4K5K0Mj7k5j8j0j0j5j8j3lJ1J8Nk0m2m6l6j5K1
7913C51N5N6J5k9l1J1M8L9ll5l6j8lMMMQK0L3L4K0OKkj5k8k1ojqj4j2j3k1k1j5j5k5k3jK1
7895C35K2J3J2J6J5J2K0L6L7K4RKNJ6K6K3Lj5k0k7m6n7l1J4M0L3J7J2Nj2k2j3jjj1k0k9l6
7879D06k4PL7L8J7nj2j2j6k3k8k8j5OK7L5L1K5K5K6K2J1jpnKOMnj6k4k2j6j9k5k0lJ0J3J6
7861D38K4J9rl7l4j1mj7j8KJ7J2MJ5K9K8K2K2K9K8K3J7Qnj0nqk5l9k6jRMlj0k7m1l4j1MOL
7843C88PRJ0J9L9N1M1J4j5l1k5%K2L4L7L4K0mk3j9mLlj2j8k3k2nJ2J0knJ2L4M2L7K2jj6qJ1
7825F72J6Ooj1j3j5qOJ0Kqj1j2j4j7k4m3o1n5k2J3K8L1L2L7L7L8M0M2L5K1J4J2J5J3J0NQJ6
$$ y = [418, 417, 435, 470, 507, 524, 511, 483, 463, 454, 438, 407, 369, 335, 303, 279, 280, 314, 359, 391, 409, 427, 455, 491, 526, 549, 552, 545, 547, 553, 536, 484, 430, 415, 439, 472, 493, 507, 516, 509, 487, 469, 470, 486, 508, 528, 529, 498, 442, 399, 395, 420, 449, 470, 489, 511, 535, 560, 580, 584, 567, 542, 524, 514, 504, 489, 471, 458, 455, 466, 484, 489, 469, 427, 381, 345, 330, 351, 406, 462, 477, 448, 417, 428, 476, 515, 512, 477, 441, 423, 420, 424, 428, 432, 440, 460, 493, 527, 547, 553, 555, 553, 538, 510, 489, 483, 482, 474, 460, 448, 435, 414, 393, 378, 363, 338, 315, 314, 335, 357, 370, 382, 398, 413, 425, 445, 481, 518, 542, 551, 553, 558, 574, 600, 623, 626, 611, 591, 564, 518, 461, 430, 444, 484, 517, 534, 546, 551, 539, 517, 504, 503, 502, 491, 471, 442, 406, 382, 389, 426, 464, 481, 476, 464, 452, 436, 413, 385, 357, 342, 348, 375, 410, 441, 466, 491, 517, 539, 550, 549, 542, 537, 539, 545, 549, 544, 528, 504, 482, 466, 447, 422, 402, 399, 409, 422, 438, 462, 481, 472, 435, 401, 390, 386, 369, 351, 353, 370, 382, 386, 401, 430, 458, 480, 502, 531, 559, 582, 599, 607, 602, 592, 587, 579, 554, 515, 489, 488, 497, 501, 498, 488, 461, 420, 386, 375, 379, 385, 388, 395, 404, 414, 433, 472, 523, 564, 578, 563, 532, 507, 507, 529, 563, 600, 634, 654, 650, 627, 608, 604, 607, 604, 592, 574, 551, 529, 524, 536, 546, 544, 539, 551, 585, 627, 664, 686, 685, 669, 661, 672, 688, 694, 688, 677, 664, 649, 641, 647, 657, 659, 651, 640, 628, 614, 597, 573, 530, 469, 414, 392, 405, 433, 464, 496, 533, 570, 608, 648, 690, 725, 746, 760, 772, 787, 800, 810, 815, 823, 839]
7808H39K0J3Krj9k9k3nMnj4jK1K5K1K6L8L1J8K4M6N3M0L4M3M6M1M6N7N2M3O5J11J40J43J56
7793B093J90K15K27K62L29M02M79O04P90J022J327J775K374L098L965M881N296M350J731j686
7784C3724m365n377m987m050l133k359j723j267r77p62n80m47l64k85k13j78j76j60j07m6
7775B168LM6P4O8K3l8j01j47j56j28j04j12j27j08o4l1j0J8M0L5K0K9O6R2R1P5N0K1J3L7P0
7762A913R2J15J59J93J98K09K70L56M33N33O93Q90J101J411J911K581L370M293N173N308L852
7753C5054P88k670m969n494m801l783k896k173j597j190r26p26n62m50l73l00k41k08j91j60
7744B132j25j04r0o8m7m1m4m6m9m9k9OK2OqlMnj4kJ8K2J7K2L0K5J9K4L7N4Q4J23J36J20J08
7729B285J26J50J70K16L01L88M60N59P18R14J158J536K100K799L611M534N253M977L033k27
$$ y = [839, 859, 872, 874, 865, 846, 817, 794, 789, 793, 788, 774, 773, 794, 819, 840, 866, 904, 935, 953, 977, 1023, 1076, 1116, 1150, 1193, 1239, 1280, 1326, 1383, 1435, 1478, 1543, 1654, 1794, 1937, 2093, 2283, 2498, 2725, 2987, 3316, 3718, 4197, 4801, 5591, 6613, 7940, 9715, 12089, 15187, 19152, 24033, 29329, 33679, 35410, 33724, 29359, 23982, 18995, 14945, 11812, 9453, 7730, 6463, 5486, 4724, 4144, 3697, 3333, 3048, 2835, 2657, 2481, 2321, 2214, 2168, 2171, 2217, 2291, 2359, 2382, 2344, 2243, 2096, 1940, 1812, 1708, 1596, 1469, 1361, 1297, 1266, 1256, 1274, 1314, 1349, 1369, 1398, 1464, 1556, 1647, 1722, 1772, 1793, 1806, 1843, 1913, 2005, 2120, 2279, 2472, 2670, 2879, 3149, 3505, 3938, 4471, 5164, 6054, 7155, 8566, 10477, 13058, 16428, 20721, 25894, 31202, 35054, 35842, 33172, 28203, 22709, 17908, 14125, 11229, 9056, 7459, 6269, 5343, 4617, 4055, 3605, 3232, 2932, 2691, 2483, 2292, 2132, 2007, 1903, 1813, 1745, 1698, 1657, 1613, 1567, 1518, 1469, 1440, 1446, 1468, 1474, 1466, 1463, 1467, 1462, 1448, 1446, 1464, 1486, 1503, 1525, 1555, 1580, 1599, 1623, 1660, 1714, 1798, 1921, 2057, 2177, 2285, 2411, 2561, 2731, 2947, 3248, 3636, 4096, 4655, 5373, 6287, 7445, 8981, 11081, 13880, 17491, 22025, 27278, 32255, 35288, 35061]
7720C5061l414n191n318m509l528k674j969j441j105q75o71n05m07l45k85k42k32k22j79j30
7712A819j09j03q4p3q4q9n3jJ7ok3j7j5l3o0p4o7m8l0k4k5k2qMP%j4l9o5p1m7nK6L9M2L2J1
7696G08nrlkoponkOQjpj%j5l0k0LJ7K0K4K4Nk1k7j0%nj1rpj5k2k1j6j4j1nOJ8K7K4Qrj3j5
7675E48k4l4k0J1L0J5j3k3j3jRJ4Qj1l3l5j8OJ8J8J0OJ3K7K9J3mj4j9k5k8j2J7L4L0J3Jj0
7659E33k1k4j4JJ2J0N%llKJ2J6Jk7m2k5J2L9L7K1J1J6K4K2Nj9l5l4j7kJnj0qorj5j7j0QK5
7641D67L1K3Qkoj6l1m4m0j8PJ6PkjOQJ1J9K8J8ok1k0j4j5j6pKLqj3oJ0K8L4J8oj7pJ1J5J1
7622D65J1J4Oj2k6k2qRJ3Kj2j1J2M0M9L6K1J6J4Kk1m5n4m0j2J3K6K7L2L7L1Rj4k7l1l2k6j3
7605D79JRPjnrq%J3K8K7Rj4k1j3jNQJ2J5K0K9L5K9J2PK4L4J9qj9j3j9l6m2k1mj0k0j2OMk4
$$ y = [35061, 31647, 26456, 21138, 16629, 13101, 10427, 8458, 7017, 5912, 5037, 4366, 3861, 3454, 3109, 2824, 2582, 2350, 2128, 1949, 1819, 1710, 1607, 1523, 1450, 1366, 1277, 1224, 1223, 1240, 1234, 1211, 1194, 1179, 1146, 1086, 1012, 945, 897, 867, 843, 818, 796, 788, 792, 799, 799, 785, 746, 681, 610, 563, 558, 584, 623, 665, 697, 708, 703, 694, 691, 689, 683, 676, 670, 665, 663, 669, 677, 676, 669, 668, 668, 653, 623, 603, 606, 623, 643, 667, 691, 696, 675, 648, 638, 638, 633, 622, 613, 606, 591, 569, 548, 532, 518, 507, 502, 508, 526, 553, 577, 585, 576, 563, 548, 524, 490, 470, 481, 511, 526, 513, 490, 477, 476, 485, 499, 507, 496, 463, 428, 410, 416, 434, 452, 462, 468, 481, 508, 537, 550, 546, 532, 513, 488, 460, 448, 465, 499, 529, 542, 543, 533, 512, 488, 474, 475, 487, 497, 502, 502, 499, 496, 498, 510, 526, 527, 500, 458, 433, 445, 484, 521, 542, 553, 569, 593, 615, 620, 601, 566, 532, 515, 513, 514, 509, 499, 491, 485, 476, 461, 444, 434, 442, 467, 498, 521, 529, 527, 521, 505, 474, 430, 390, 372, 379, 395, 402, 400, 399, 405, 413, 424, 443, 471, 489, 483, 462, 442, 428, 413, 397, 390, 392, 395, 387, 374, 368, 378, 406, 440, 458, 452, 435, 428, 439, 454, 465, 476, 490, 496, 484, 458, 436, 428, 437, 450, 452, 440, 429, 441, 481, 530, 566, 587, 603, 617, 619, 598, 553, 499, 459, 447, 460, 486, 513, 545, 582, 613, 622, 608, 581, 550, 518, 492, 479, 480, 489, 496, 495, 490, 481, 473, 473, 486, 514, 541, 550, 536, 515, 502, 501, 506, 514, 526, 541, 561, 590, 625, 654, 666, 673, 697, 731, 750, 742, 723, 710, 691, 655, 613, 592, 588, 578, 558, 546, 552, 556, 532]
7587E32m7m6k6pMjj3k1j4NJ3kk0j7PK7K7J6RJ3J4Pnrokpj7k1j0OJ0kj4oJ3K6K6K5K5K0Lj3
7568E02j3%NMLOP%ljmj2k2k2j4mK%j5l3m6m7l5j5J1L4M0K7J1%pj7k3j6%J4J7J1JmjRJ7K2K3
7549D12K1J5QMLlk0l6l4j2J9L8L4J2qj0KJ0NjJNjj2j6j3qm%ORJ4J8J8Qlooj4k8l3j9JJ3J3
7529D02NJLJ2K3K7K1J0kj1j3j2j3j5j2mORKjLJ1K0K3K6K7K8K3Oj3k0j6j6k7l3k0%J1QMmj7
7511D62k2rJ6K3J2JKQJ2J6J5Jk0l6l6l3l1k0nLKNJ7K1J9J6J5ml7m7j9J5J2pnK1L1Rj6j7jJ2
7493D01J9K0J5NNR%k0k6mJ2%k4k1J0L7L8K1M%PK3K7Nk9l6j0J6J5krJPMORKk4l9k5J1L9M2K7
7474E68Pj2k7l1k3j3mjlj3k1j5JJ4Rlj2qOJ9K5J5pk0j9pKRJ5J6PkNK6L7J9k1n4n9l3OL5L5
7455D68J4nlJ4K6J8Lljkj2k2k0jJ9K4J6jj6k3k0pQK0K0Rqk1j9rj2k9m0k0K2M6L1Jj6j4pop
$$ y = [532, 485, 439, 413, 406, 410, 409, 396, 375, 361, 366, 379, 377, 357, 340, 347, 374, 401, 417, 426, 439, 453, 460, 455, 446, 440, 438, 431, 414, 393, 383, 389, 399, 397, 383, 377, 390, 416, 442, 467, 492, 512, 515, 502, 489, 489, 494, 498, 501, 507, 514, 514, 511, 510, 506, 494, 472, 450, 436, 432, 434, 434, 419, 386, 340, 293, 258, 243, 254, 288, 328, 355, 366, 366, 359, 342, 319, 303, 303, 317, 334, 345, 346, 342, 341, 350, 367, 389, 412, 433, 448, 456, 460, 463, 460, 440, 404, 370, 358, 377, 415, 449, 461, 453, 443, 445, 455, 460, 459, 460, 465, 464, 452, 436, 423, 415, 411, 411, 417, 426, 440, 458, 476, 484, 481, 475, 469, 455, 427, 394, 375, 376, 389, 402, 407, 408, 411, 423, 446, 473, 494, 504, 502, 491, 478, 466, 453, 438, 426, 422, 428, 437, 439, 438, 441, 452, 472, 495, 521, 548, 576, 599, 605, 592, 572, 556, 540, 513, 480, 460, 460, 471, 479, 483, 479, 462, 440, 431, 447, 470, 482, 483, 485, 493, 505, 521, 536, 537, 517, 481, 445, 412, 381, 361, 356, 359, 361, 366, 383, 404, 423, 439, 454, 450, 413, 366, 347, 362, 374, 367, 362, 383, 414, 423, 407, 390, 389, 401, 420, 440, 455, 460, 465, 474, 474, 454, 428, 424, 436, 436, 412, 391, 401, 438, 476, 497, 501, 501, 508, 531, 558, 563, 534, 498, 488, 504, 519, 517, 508, 509, 516, 520, 526, 535, 537, 513, 474, 449, 460, 499, 541, 568, 575, 563, 536, 505, 482, 469, 465, 464, 461, 448, 427, 412, 413, 427, 436, 433, 421, 413, 419, 438, 463, 478, 471, 451, 432, 425, 427, 436, 451, 467, 474, 472, 477, 503, 540, 559, 538, 484, 425, 392, 398, 433, 468, 482, 477, 474, 488, 514, 532, 535, 532, 531, 529, 517, 495, 475, 474, 493, 517, 533, 532, 516, 493, 473, 466, 474, 494, 514, 523, 515, 494, 475, 466, 454, 425, 385, 365, 387, 433, 464, 465, 449, 435, 428, 422, 415]
7436D15opj1rKJ6J5kk0j8RL6M2K9K0K8L9L8J9mk4l4l4k3qpk2l4k4JJ7J2jlNRKkKJ2J3OklM
7417D93RPnj9j6PK5J5j8m7m1oK7L6J2k7n2m3pK2K8K4L0M1L7J1j3j8j4j8k7l0k1j5j3j0MJ8
7400C86J9Kj8k2oJ5K2J8J2J5J8J0oj7j8j6j5qOJ7J7J1MJKNPOLNQjj7k4j1RJ7OmjPjk6m8n0
7381C39k5QK5J7L%QPlqPK8M3M5M3L3J5nk4l5m0l3j2QJ4ROJ0QjnQK9L9L2J9Mj2l3n2n6l6mK2
7362D45K6K0J7K1K1J3NMQJ4J5Lk6n4n8l3jJ0PJ1K4L3K9K4J8Kl2o1n7k6KMo%J8L3L1K0J0jj5
7344E18k7l3l4k4kJ9K5J0qj2qpjJ7M0M6L0J3%j1k5l3k8j1PJ6J3joJ1L7L7J0j4j6nqj8k1j8
7327D78j8j6mQPqj8pOQmj8k1qJ0J9J4J1K4M1M0K1QJ0J1lk4l6l1j7jJ4J2lj6j5nnrq%LjLK1
7307D73L1Ol9p2o1j8K3L6K5J7K2L4L5K8J3lj9k7k1kJ1Qln%nl3o2o2k4J9L0J5mp%PJ2J3Oj%
$$ y = [415, 409, 402, 391, 382, 384, 400, 415, 413, 393, 375, 384, 420, 462, 491, 511, 539, 578, 616, 635, 631, 607, 573, 539, 516, 508, 501, 479, 445, 421, 422, 439, 451, 450, 447, 452, 461, 463, 461, 463, 475, 488, 494, 492, 489, 493, 502, 509, 504, 485, 469, 476, 501, 516, 498, 451, 410, 404, 431, 467, 479, 452, 400, 357, 350, 372, 400, 424, 454, 495, 532, 543, 530, 512, 498, 480, 453, 423, 402, 387, 374, 364, 368, 386, 405, 407, 389, 367, 361, 376, 398, 416, 428, 443, 461, 471, 465, 448, 430, 414, 399, 391, 397, 414, 431, 442, 446, 447, 449, 454, 461, 467, 470, 475, 483, 482, 465, 441, 430, 439, 456, 462, 458, 457, 464, 463, 437, 389, 339, 314, 322, 347, 364, 367, 367, 375, 382, 379, 371, 378, 406, 449, 494, 537, 570, 585, 580, 556, 521, 481, 448, 436, 444, 458, 467, 473, 483, 491, 490, 485, 493, 522, 561, 593, 612, 616, 604, 571, 519, 463, 427, 423, 445, 471, 491, 508, 529, 550, 563, 568, 572, 580, 594, 609, 612, 586, 532, 474, 441, 440, 450, 457, 468, 492, 525, 554, 578, 596, 598, 566, 505, 448, 422, 424, 428, 422, 422, 440, 473, 504, 524, 534, 533, 518, 491, 458, 424, 400, 398, 417, 442, 452, 444, 432, 424, 417, 416, 433, 473, 519, 549, 562, 562, 551, 526, 493, 465, 454, 461, 477, 490, 489, 483, 494, 531, 568, 578, 564, 548, 543, 535, 517, 496, 478, 460, 444, 440, 448, 455, 447, 429, 422, 428, 436, 432, 414, 393, 385, 395, 414, 428, 439, 463, 504, 544, 565, 573, 583, 594, 591, 567, 531, 500, 483, 482, 496, 508, 505, 489, 474, 469, 464, 455, 447, 447, 450, 449, 452, 473, 504, 510, 471, 399, 338, 320, 343, 379, 404, 421, 443, 477, 512, 540, 553, 550, 531, 504, 483, 481, 492, 500, 497, 492, 492, 487, 454, 392, 330, 306, 325, 355, 370, 366, 359, 359, 366, 378, 391, 397, 396, 396]
7289C96J1J9J6J2J6K3K0QnrojLJ0K2L3L2J4j2l3l8l2k1j0mmj1j7k1j8nJ3K3J3npMJ2Kj0qJ
7271D26MPJ5K5J7kj1lOQOMnj9k2oJ7K4J3jj0j3j3n%%l%QJ2Jj6k5j8mNQNMKJJPJ1Npj5j0NK0
7249D59K8K3J1joj0j7k0qRPk2n0m2%M1N0L3J7J3J5Qlj4j3oOJ4K1J7Kj9l3l5l2k5rPQj3l6k9
7231C46JJ8Pj8l1k8j4MK2K8J7Km%OJ8L7M6L0%k1k1j3nMJ6J8J0QJ2Pj5k9j5J7L5L0K0J6Nj6
7213E50k9k2kRRNKlmKJ0Jk2m5n0k8QL0K6OmKJ4J1lr%J5J9J2JmKJ7K6K6J7Qmj8l3m4m6l9k2
7194C97jJ1J5J7K4K4J3JOK0K8K2J0%j2k3k4j2PK6L3K0j5n0n8l1JJ0mj9k1pJ2J6Lj3j0J3K7
7177D56J9NJOjj5j5NK4K4J2LLJ1K3K8J8nk6l2k5j3%OKoj0j1j6k4j5RL2L2K0J5K3K0jk2k0m
7159E36%j0j8j2ljJQJ6J0pk0k5k5k3j3NK2K3J5%j9l0k0PK6J5pj8j2rj5j7jJ6K2J5Npj6k0q
$$ y = [396, 407, 426, 442, 454, 470, 493, 513, 521, 516, 507, 501, 500, 503, 513, 535, 568, 600, 614, 602, 569, 531, 499, 478, 468, 464, 460, 449, 432, 411, 393, 388, 401, 424, 437, 432, 425, 429, 441, 443, 433, 425, 426, 430, 437, 452, 477, 494, 492, 481, 478, 484, 492, 498, 502, 497, 478, 456, 450, 467, 491, 504, 503, 493, 480, 467, 462, 462, 462, 459, 459, 467, 479, 480, 464, 439, 421, 417, 422, 430, 435, 439, 441, 442, 443, 450, 461, 466, 459, 444, 434, 439, 459, 487, 510, 521, 520, 514, 504, 487, 467, 459, 468, 475, 453, 403, 361, 361, 402, 452, 485, 502, 515, 530, 538, 535, 521, 508, 502, 508, 522, 543, 560, 562, 543, 510, 475, 443, 418, 409, 416, 424, 411, 375, 346, 347, 365, 372, 354, 323, 295, 281, 285, 307, 335, 352, 354, 350, 350, 356, 374, 411, 457, 487, 487, 466, 445, 432, 427, 431, 447, 465, 475, 483, 495, 502, 487, 458, 443, 460, 495, 525, 545, 561, 566, 550, 521, 499, 497, 506, 515, 520, 522, 519, 515, 517, 527, 528, 506, 461, 411, 383, 391, 421, 447, 453, 449, 451, 465, 476, 473, 464, 464, 479, 498, 510, 511, 507, 509, 526, 552, 578, 595, 603, 599, 581, 548, 504, 458, 419, 397, 396, 407, 422, 439, 463, 487, 500, 501, 507, 527, 555, 577, 587, 587, 575, 552, 528, 516, 523, 549, 582, 602, 587, 537, 479, 448, 449, 459, 455, 436, 415, 408, 420, 436, 439, 426, 416, 429, 456, 475, 480, 481, 487, 486, 471, 456, 461, 485, 509, 521, 524, 527, 538, 561, 589, 607, 602, 576, 544, 519, 506, 506, 512, 514, 508, 498, 487, 471, 447, 432, 441, 473, 505, 525, 540, 563, 583, 582, 560, 540, 536, 536, 526, 508, 496, 493, 492, 493, 501, 517, 527, 520, 500, 475, 450, 427, 414, 419, 441, 464, 479, 479, 460, 430, 410, 417, 443, 458, 451, 433, 421, 412, 397, 380, 379, 395, 417, 432, 437, 430, 414, 394, 386]
7140C86J0J8Prj6rOJ6J5J2J3J6J7J1KkJRJ9K3J7jk0l0k5nJ6K7K3Qnj6k4j7LJ8Pk3m0k7LK4
7122D58K6Rj7m2m9k5J5M4M4K0j3l8m1k4LJ9J8Mrj4j1%J6K8K9J8lk0k9k6j5jOJrj1KJ1Lj3j2
7104C52MJ0NOK2L4K3NJJ0J4J2J4J8J1pk5l5l9l0j3OJ3J9K9L6K1pj7JK2K7J1oj9k1j7k1l7n3
7087C79m2nK8K8Nj5k0j2PK4K9K3J3Qlj7j6LK2J6nj2jJ4K4K7K1Kj9k5j8j4j4j4j1j1j0JJ6J9
7070D25Mj5j7pLJ0K1L1K8J1oqJ4L9L9J5j2j9j7k5m8o0n1l0j7j1nNK1L8N0M3K4Norj1r%RJ1
7052D63J3J5J5Poj9l2m2l8j3K0L9M0K9J5J0J6K7K7Pk1l6l2k0rKRQLKJ3K8L4K6Ll0n2n0k8p
7035D36kjOJ9K0OmjQRknPK2J8jj4j4j0j1j8j9j6j3rkJqj9k1nJ2K0J6J0NJrj6qK1M9M8J8j2
7015E12j6pnj8k5rK2M5M7K7ml1m3m0l3k5j1LJ0PMNNlqOL2N1M6K4J0J6K8J8j2l8l7rK0K9J0
$$ y = [386, 396, 414, 421, 412, 396, 387, 393, 409, 424, 436, 449, 465, 482, 493, 495, 493, 494, 503, 522, 545, 562, 561, 541, 511, 486, 481, 497, 524, 547, 555, 550, 534, 510, 493, 496, 514, 521, 498, 458, 431, 434, 458, 484, 493, 476, 434, 385, 360, 375, 419, 463, 483, 470, 432, 391, 367, 370, 389, 407, 411, 402, 388, 377, 377, 393, 421, 450, 468, 465, 445, 416, 390, 375, 374, 380, 381, 372, 361, 363, 374, 377, 364, 352, 356, 366, 371, 377, 399, 433, 456, 461, 462, 472, 486, 498, 512, 530, 541, 534, 509, 474, 435, 405, 392, 398, 411, 430, 459, 495, 516, 509, 492, 493, 515, 542, 553, 547, 528, 507, 490, 469, 432, 379, 337, 332, 360, 388, 393, 378, 358, 346, 353, 377, 406, 429, 442, 450, 447, 430, 414, 417, 439, 455, 450, 438, 437, 451, 475, 502, 523, 525, 506, 481, 463, 449, 435, 421, 410, 399, 389, 390, 406, 425, 429, 414, 397, 390, 393, 403, 424, 455, 483, 494, 488, 480, 494, 533, 572, 587, 575, 556, 539, 514, 466, 406, 355, 325, 308, 297, 292, 297, 318, 356, 406, 449, 473, 478, 472, 463, 452, 443, 443, 452, 463, 476, 491, 506, 513, 507, 488, 456, 414, 376, 363, 383, 422, 462, 491, 506, 516, 532, 559, 586, 593, 572, 536, 504, 484, 475, 477, 486, 494, 497, 499, 512, 540, 574, 600, 603, 573, 521, 471, 443, 436, 434, 433, 439, 458, 478, 484, 480, 479, 487, 496, 494, 489, 496, 518, 536, 535, 521, 507, 497, 486, 468, 449, 433, 420, 411, 409, 410, 402, 383, 362, 357, 369, 389, 405, 415, 420, 421, 412, 396, 388, 409, 458, 506, 524, 512, 496, 489, 484, 466, 441, 432, 454, 499, 546, 573, 569, 538, 495, 455, 422, 397, 386, 389, 399, 406, 410, 415, 420, 417, 409, 415, 447, 498, 544, 568, 578, 594, 622, 640, 628, 590, 553, 544, 564, 593, 603]
6997F03k1m2l4pJ8J8OKLqk8l9l2j8j1lRJ8J8K1L8N0M4K0Jpj0rkN%j0j4oMNQJ1J0rl7n6n6l6
6978D17j1QJ3J2J1RJmnmlJRJ6J0lj1j5k8m3l7NN5O7L3j1l2k8k3k6k4lK6L7L1K8L5K7pm5n3
6960D35k9LK0K1K0J8J6Qok3k5oK3L6K9J4%j6l1l2j7JJ1K1L6M2K7Kj9k9l4l2j8lkj4k6k5j0
6944C86J3L0K7Jl1m2k5lNlnJ0K9K7Kj8j1J4K1J1NJ3J0j5l8l3j1%jRK4K3KqJK0K8K3J0j4m1
6926D45m8k6NK4K9L1K8J7RJ1J8J8Qnj8k3j4KRjj0pkj1k4k2nRJ7K1J9Qj2k4j9kJ5K0Oj1j2L
6908D76J4P%QK0Ok6m6l6j2MPMJLPOlkJ7L4K1j1l2l1l1n0o7n4k0RK0K0J5J2J5J7J6J4J7K2J3
6889D04pj3PK7K4PJ1L8M9K5j2k6j2J3K4J6j4m4n8m6j7OJ8Rj2k4j2J5L0J8krlLOJ4K4K3J7J6
6872E33K2K7J9Ppk9n2n7l2PK6J6nj9k9l6l2j5J1K2J8J2J1Qkj1nRJ3Kqj1j5k6k9j5KMqqPK0
$$ y = [603, 582, 540, 506, 499, 517, 535, 541, 543, 546, 538, 510, 471, 439, 421, 410, 407, 416, 434, 452, 473, 511, 561, 605, 625, 626, 619, 609, 600, 598, 603, 603, 593, 579, 573, 577, 582, 590, 601, 611, 602, 565, 509, 453, 417, 406, 414, 427, 439, 450, 459, 460, 456, 451, 447, 444, 445, 454, 470, 480, 477, 466, 451, 423, 380, 343, 348, 403, 470, 503, 492, 460, 432, 409, 383, 359, 356, 382, 419, 450, 478, 513, 540, 533, 488, 435, 406, 409, 429, 450, 470, 488, 504, 512, 506, 483, 458, 452, 475, 511, 540, 554, 554, 538, 507, 475, 458, 459, 470, 491, 527, 569, 596, 598, 579, 550, 516, 484, 466, 463, 461, 447, 421, 396, 386, 399, 429, 456, 457, 426, 384, 359, 356, 361, 358, 353, 363, 392, 419, 421, 403, 392, 406, 427, 438, 443, 456, 466, 451, 413, 380, 369, 369, 368, 377, 401, 424, 426, 418, 419, 439, 467, 490, 500, 486, 445, 397, 371, 376, 400, 429, 460, 488, 505, 514, 525, 543, 561, 569, 564, 546, 523, 509, 511, 520, 519, 509, 502, 500, 489, 465, 443, 438, 447, 464, 485, 504, 512, 500, 476, 457, 455, 470, 490, 496, 485, 473, 476, 490, 497, 497, 505, 525, 531, 505, 459, 423, 411, 415, 422, 426, 427, 430, 437, 443, 440, 438, 455, 489, 510, 499, 467, 436, 405, 355, 288, 234, 214, 223, 243, 263, 278, 290, 305, 322, 338, 352, 369, 391, 404, 397, 384, 391, 418, 442, 449, 460, 498, 547, 572, 560, 534, 522, 535, 559, 575, 561, 517, 459, 413, 396, 402, 420, 429, 417, 393, 381, 396, 426, 444, 442, 433, 430, 433, 439, 453, 477, 500, 517, 533, 555, 582, 601, 608, 601, 572, 520, 463, 431, 438, 464, 480, 475, 456, 427, 391, 359, 344, 355, 377, 395, 407, 418, 426, 424, 413, 408, 417, 430, 432, 424, 413, 398, 372, 343, 328, 330, 334, 326, 318, 325, 345]
6854C45K1K0K9L9L0J3NRMj9l8k6J1M1L6J0j2j0%Jj4l0l4k4j4lOJ2Nqj2oJnj2nJ0J6OJJ2K7
6836D38L1J9Lj5k7l3k5j4roKJ7K4K5K6L0K7J7PJ0J6J6J2Nnj3qQJ5jj5j0Mml3m7m1l3l1k0N
6818C67J5nk4qK9M5K8Mnlpj2nJ6L8M8L6Lk6l6k7k0j8j0MJ3J1J0J4J6J0NQRjj4j9j8j6j0KJ4
6800D61K2L1L9L4Lk7l2j4KMKJkrqJLmj4k3l4m3l5pJ9K1J3J5K9M0L8K8J6KnMK1L2K6Rj3l6n6
6781E54o3n0k6lPMnj1rjRJ3J6J7J6Qlj0%J8K7K2J3Qkk9o0n8k2K0L5K6J6J2J0Krk0l3l4rK9
6763D25M5K1j2k1nkk4m7m2j2J6K8L0K8K1Pnj1j6j3ML1M0J6j8l6l3k7k3rJ6K9K3QMMLOK0L2
6745E01K8J0pj5j6j7j1kOQNqk6l9l6k0JJ3J9J7J2J1J5J6Q%jNOLLQJ0NjjMJ2J7Oj4k7j9LJ7
6726E09K6L8M8L6J0kJ1K1Qj4k1j5j7k2j6JQmk0k4k3j8j2qqpJROrj7r%kqm%rk6l4k5j5j6k2
$$ y = [345, 366, 386, 415, 454, 484, 497, 502, 511, 515, 496, 458, 432, 443, 484, 520, 530, 518, 508, 508, 509, 495, 465, 431, 407, 393, 390, 396, 408, 413, 405, 393, 387, 388, 383, 371, 366, 376, 392, 398, 399, 411, 438, 469, 488, 491, 476, 449, 416, 391, 377, 368, 362, 364, 381, 405, 430, 456, 486, 513, 530, 537, 547, 563, 579, 591, 596, 591, 578, 570, 578, 593, 592, 577, 567, 571, 567, 534, 487, 446, 413, 382, 362, 367, 382, 377, 353, 345, 374, 419, 447, 451, 446, 443, 436, 424, 419, 435, 473, 521, 557, 560, 534, 498, 471, 451, 433, 423, 427, 440, 451, 461, 475, 491, 501, 506, 514, 523, 522, 508, 489, 471, 455, 445, 447, 461, 483, 514, 553, 587, 590, 563, 531, 517, 519, 523, 525, 526, 524, 515, 507, 508, 511, 507, 493, 470, 436, 393, 358, 351, 370, 391, 404, 419, 448, 488, 526, 554, 570, 572, 567, 571, 592, 624, 650, 659, 646, 610, 554, 491, 441, 415, 412, 419, 423, 418, 407, 398, 397, 406, 419, 435, 452, 468, 476, 473, 463, 463, 481, 508, 530, 543, 551, 549, 520, 460, 402, 380, 400, 435, 461, 477, 489, 499, 501, 492, 472, 439, 405, 396, 425, 470, 491, 479, 458, 453, 451, 427, 380, 338, 326, 342, 370, 400, 428, 449, 456, 451, 440, 424, 411, 415, 446, 486, 502, 484, 448, 415, 388, 365, 356, 372, 401, 424, 432, 436, 440, 443, 449, 469, 501, 529, 539, 532, 517, 501, 484, 473, 471, 477, 485, 490, 482, 456, 417, 381, 361, 362, 375, 394, 411, 423, 434, 449, 465, 473, 473, 472, 477, 483, 486, 489, 497, 507, 512, 511, 510, 514, 526, 543, 549, 535, 508, 489, 492, 509, 535, 573, 621, 657, 667, 665, 676, 697, 705, 691, 670, 655, 638, 616, 600, 601, 609, 605, 585, 561, 538, 520, 508, 500, 492, 485, 486, 495, 501, 492, 475, 466, 466, 464, 456, 452, 452, 443, 417, 383, 358, 343, 327, 305]
6707C05k2j2kOJ6K3K2J4J1J7K1J3llJ6L6L6K1Pjj0j6j5KJ8K3J6Mj6m0m8k8RL1K2nk5k3oJ2
6689D26J7Mk0l6l3j4JJ0J3J7J7J1PJ1K5L2K3OlJLok8m5m3l2k2k0j6pMPOKlj2qJ3L7L7J6MR
6671D11J2ol0k7JK8M0M8M6K3j6l6j0L3M6K1rj1LRJokJqk3k7oK5M2K9%k0j9j0qj5j9j8j2LK5
6653E09M1L2kl3l3j6j3k9l9k1QK2K4K5K9K0Kj2j2j0qlJ2J9J3MQK7L7K5lk2k4j4qj1j7j8j8
6636D91k2l3m3m4l3j0J5L2K7RqrOK3L0K2J0J3K8L9L4J5jj5k7l1k0jQ%j0k0l0l0j0K1K7nm4
6619D04n3k9%J5K1K7L0K6J9J5Plj0nPQqk6l0j5PJ9J5Jj5k4j4J0K9K1lj2MJ7J1MJ6L5L8J8L
6601E80LJ2J8J5Mj4l2l9l3k3j4j2j8k9k5nJ1jk3k0J2L6L2J9J7J6Jj1o%k0n6o5l3PJ8J1J5L5
6584C83M9M1K1Mnq%RLk3m5l5nJ1mk7l0j5mLJ8L9M3K5J1J4K5J9jk0k7k4j4kJ0J5J9L0M1M2K8
$$ y = [305, 283, 271, 269, 275, 291, 314, 336, 350, 361, 378, 399, 412, 409, 406, 422, 458, 494, 515, 522, 521, 511, 495, 480, 482, 500, 523, 539, 543, 527, 487, 439, 411, 420, 451, 473, 468, 443, 420, 414, 426, 443, 447, 427, 391, 358, 344, 345, 355, 368, 385, 402, 413, 420, 431, 456, 488, 511, 517, 514, 515, 518, 512, 484, 439, 396, 364, 342, 322, 306, 299, 303, 310, 316, 318, 315, 303, 295, 308, 345, 382, 398, 402, 411, 423, 417, 387, 360, 361, 389, 429, 477, 523, 546, 530, 494, 484, 517, 563, 584, 575, 564, 567, 576, 577, 571, 569, 570, 562, 539, 512, 506, 531, 573, 602, 602, 582, 563, 553, 545, 530, 511, 493, 481, 484, 509, 550, 582, 580, 547, 514, 498, 485, 456, 417, 396, 404, 426, 450, 475, 504, 524, 526, 514, 502, 492, 484, 481, 493, 512, 525, 529, 537, 564, 601, 626, 623, 601, 577, 563, 555, 544, 527, 509, 491, 469, 436, 393, 349, 316, 306, 321, 353, 380, 389, 381, 372, 378, 401, 431, 453, 463, 476, 504, 543, 577, 592, 591, 576, 549, 518, 498, 497, 505, 505, 495, 475, 445, 415, 405, 426, 453, 448, 404, 351, 322, 322, 337, 358, 385, 415, 441, 460, 475, 482, 479, 469, 464, 471, 479, 471, 445, 415, 400, 407, 426, 441, 442, 427, 403, 389, 399, 428, 449, 446, 434, 438, 455, 466, 470, 486, 521, 559, 577, 580, 583, 595, 613, 628, 632, 618, 586, 547, 514, 491, 477, 465, 447, 418, 393, 388, 399, 398, 375, 355, 367, 403, 435, 454, 471, 487, 488, 477, 471, 471, 451, 395, 330, 297, 304, 322, 333, 348, 383, 432, 473, 494, 498, 493, 485, 485, 494, 497, 474, 429, 394, 389, 400, 396, 369, 339, 324, 320, 323, 341, 380, 423, 448, 459, 473, 498, 517, 516, 496, 469, 445, 431, 429, 439, 454, 473, 503, 544, 586, 614]
6566F14Jl0m7m0qJ9K2PJMLj1k5k6j7qJQRMKJ1K2K1Poj1qqoLK0K7J8ol0m1l7k0KJ6J4jqJJ1
6546D74J2KkMJ4J5J4J6K9M0L4Ll3m3k4%Mj1k3k3j7rLJ5J3jj3j8k0k3k4j5LJ5J5LppPJ6Pj6
6528D29k3nK3L1Ol9p1p4m4JL6N2N4M3K0qk3j9j1j1j2oJ3K8L7L5K6J5J4K6L1J6j1k8l0l0l0
6512D61j9MK4K9K4J4ol5n7n3l3j7j2pOK0J9Qoj2qKJ3K1J9Pj4k6j9JJ6J8J4J2PKNK0L0J8j0
6494D80k9k7qJ3K8K8J1rj8j6j2j1mRJ1mk1k1lJ5K9M0M9M4K5Mj3k4l0k8k0j8k3j9KK1J4pj3
6478D45KK0J7QJ1K6L3K2Moqj7l9n6n0k5%MjLJ0Ppj4oOJ1RRQMMJ6K6J8mj7oJ7K6J8NPJ9J8j0
6458E67n1p1n4k7j9l4m0k6jJ4J5J2J6K9M1L7J6nKK8M4L1LrKJ8K2J6J2J3Rmk2l1k4rlooMJ2
6440E21OoqNJ9K3K1J9J2kj3j2LJ5J2pk9m0l4j9lOJ3J7J3MkJJ1J1ok9l5j8Kjk5m6m4l1k2j7
$$ y = [614, 615, 585, 538, 498, 490, 509, 531, 538, 539, 543, 546, 535, 510, 484, 467, 459, 460, 468, 477, 481, 483, 494, 516, 537, 544, 538, 527, 519, 511, 505, 508, 528, 555, 573, 567, 537, 496, 459, 439, 441, 457, 471, 470, 462, 463, 474, 486, 488, 486, 490, 504, 519, 533, 549, 578, 618, 652, 655, 622, 579, 555, 555, 559, 548, 525, 502, 485, 476, 479, 494, 507, 506, 493, 475, 455, 432, 408, 393, 396, 411, 426, 429, 422, 415, 422, 438, 445, 429, 406, 401, 424, 455, 461, 422, 351, 277, 233, 234, 270, 322, 376, 419, 439, 431, 408, 389, 378, 367, 355, 349, 362, 390, 427, 462, 488, 503, 517, 543, 574, 590, 579, 551, 521, 491, 461, 442, 446, 470, 499, 523, 537, 531, 496, 439, 386, 353, 336, 324, 317, 323, 343, 362, 370, 364, 352, 344, 346, 359, 380, 399, 406, 392, 366, 347, 348, 364, 382, 396, 408, 415, 417, 422, 442, 472, 490, 480, 451, 424, 416, 429, 457, 485, 496, 487, 469, 453, 441, 430, 426, 435, 446, 442, 421, 400, 397, 412, 441, 481, 530, 574, 599, 603, 590, 566, 536, 508, 488, 470, 447, 428, 430, 451, 465, 458, 445, 447, 467, 484, 492, 503, 529, 562, 584, 588, 582, 574, 557, 518, 462, 412, 387, 387, 391, 390, 393, 403, 410, 403, 389, 383, 389, 400, 409, 418, 426, 430, 434, 450, 476, 494, 490, 473, 467, 484, 510, 528, 533, 540, 559, 577, 567, 516, 445, 391, 364, 345, 311, 271, 245, 244, 258, 273, 285, 301, 330, 371, 408, 424, 419, 421, 449, 493, 524, 527, 518, 520, 538, 560, 576, 588, 601, 610, 606, 584, 553, 529, 520, 517, 511, 505, 509, 521, 527, 521, 513, 518, 537, 560, 581, 600, 612, 610, 597, 585, 588, 603, 615, 608, 579, 539, 505, 486, 483, 489, 502, 519, 532, 536, 534, 535, 546, 557, 551, 522, 487, 469, 471, 470, 445, 399, 355, 324, 302, 285]
6422B85mRJ3J7L1M9M7K5J3K7M3L4%l1m9n3l9qK4K7Nj6j6mjqj4k2l0l0j5OJ4NmKJ6K4K1K0K2
6404D35K6K1PmlQJ9K2J3lj8k7k5j4mMPLknnj1k4l3k8j4%RJ5J4jj8j9LK0J5lnJ7M0M5L4K1R
6385E41%rj4j2j5k8l5k1J2L1J5k2m3l0mJ7K6L3L4K2RLlj1k0j3NJ6J4Lqj5j5oKrl2m2k5KJ3
6367C66Nj0j8j3LK6L6K2nj9pJ7L3L0Rj6k7j8jJ1J5K1K4J9OoqkK%qj4pQJ2MmjJ0J4Nj3l3m8
6348D20l7JM1N5L8Qk0l9m6k8jJ5J0QK1L0K0ok1j6JJ4J0pk0oK1L1Ol0m1k6mPJ3J6Nj4k6j8J
6330C86J5K0J9J4Jj3k0k0j7j4qKPNkKJ5K2J6LjKJlJJ3K1J4Kj%%oj3j9j9mJ8L6L9L2J9ol9n5
6311D65m2j3J1K6L5L8L1J6lk7n0m9j6K0K7RLJ2J3kj3q%MNLj1l0l3j4jpqPK2J2j3k2rJ1K4K6
6292D49J4j1l1k9j0PJ6J7J3NKQJ0mj8j3QK3K6K1Pj7m0l7j2OQNPQlj5j9j7j7qRK1J4jmJ1L0
$$ y = [285, 281, 290, 303, 320, 351, 400, 447, 472, 485, 512, 555, 589, 589, 558, 509, 456, 417, 409, 433, 460, 465, 449, 433, 429, 428, 420, 406, 384, 354, 324, 309, 315, 329, 334, 330, 332, 348, 372, 393, 413, 435, 461, 482, 489, 485, 482, 490, 509, 531, 544, 541, 523, 496, 471, 457, 453, 457, 464, 467, 465, 460, 455, 444, 420, 387, 359, 345, 345, 354, 369, 383, 382, 364, 345, 348, 368, 383, 380, 375, 392, 432, 477, 511, 532, 541, 541, 532, 518, 506, 491, 463, 428, 407, 419, 450, 465, 443, 400, 370, 366, 383, 409, 442, 476, 498, 507, 510, 507, 496, 476, 463, 468, 484, 498, 501, 493, 478, 463, 457, 459, 450, 418, 376, 351, 353, 366, 371, 361, 343, 330, 333, 359, 395, 417, 412, 393, 386, 403, 436, 466, 475, 459, 432, 414, 413, 424, 439, 460, 484, 503, 509, 503, 495, 493, 495, 495, 487, 473, 466, 474, 486, 490, 486, 485, 495, 509, 514, 501, 468, 420, 383, 384, 425, 480, 518, 526, 506, 467, 421, 393, 392, 407, 417, 425, 446, 476, 496, 490, 469, 453, 454, 468, 478, 471, 451, 445, 466, 497, 503, 473, 432, 406, 402, 409, 422, 438, 443, 429, 403, 385, 386, 401, 421, 440, 454, 455, 442, 422, 402, 385, 371, 363, 365, 372, 377, 375, 377, 392, 414, 430, 433, 432, 434, 435, 432, 433, 446, 467, 481, 483, 482, 482, 482, 476, 463, 444, 425, 421, 439, 475, 514, 546, 565, 559, 520, 465, 423, 410, 421, 447, 482, 520, 551, 567, 564, 537, 487, 438, 422, 442, 469, 478, 481, 493, 506, 504, 491, 483, 483, 487, 492, 495, 484, 454, 421, 407, 406, 399, 391, 398, 420, 432, 419, 397, 388, 399, 423, 449, 463, 452, 421, 392, 382, 389, 405, 422, 435, 440, 442, 450, 460, 456, 438, 425, 433, 456, 482, 503, 510, 493, 453, 416, 404, 410, 418, 423, 430, 438, 435, 420, 401, 384, 367, 359, 368, 389, 403, 402, 398, 409, 439]
6274D39L3J5qj7lJ9K9J9M%LLkj3k7l7k8kK0J9ORL2M9L8Nk3l8m5m3k9jK0K5K1J9J8Mj9k7j3
6256D74RJ1lj1pkljJ0K5L4L4K2MpjOpl5n4m9l6k8j6OK9K1j1l8l4nK0K5J9K2L7M4K3j1k7k0
6238D69j5k2k3lJ5Oj9k7j1NPjm%PJ5K6L3L6L8L0J0qoN%k5m4m5l5k8qK0L6K4J2K6N2N2J9k0
6220E99l1j7JJ6J4nl5n4m5j0K3L3J7oj8j2npj6k1j4KJ5K0J3KmJQPknnmqj6j4JK5L7K6jj4N
6201D96L6M2K0mmMj0m5o6n0k1n%J4M0M9J7l5o3m9j9%Jmpo%J0J4QKQK4L6L0J8J5K3L3L3J4k1
6183E78n5p0n6k4%J0QLjpq%J9L5L3J4mqMJ7J4MjLOqk5k7rJ1K0J7Mj4l0l1j6kjn%QJ3J3J6K1
6163D69K3K7L4K8Kk7l0j3mj4j4NK2J2j0k2k1k0j1OJ8Rj4k3j6j2rNL2N1M3J6j7m5n5l8lJ9J9
6146D22J0J4K9M2M4K9Lj7j6kKppJ4K9J3j7l3k4q%lpj2j5j7j8j6oQJ6J0MPJ8J7Mj0j3mJ3L1
$$ y = [439, 472, 487, 479, 462, 459, 478, 507, 526, 530, 530, 533, 536, 534, 521, 494, 457, 429, 427, 447, 466, 472, 481, 513, 562, 600, 605, 582, 544, 499, 456, 427, 426, 446, 471, 492, 511, 529, 533, 514, 487, 474, 483, 494, 491, 480, 473, 471, 468, 467, 477, 502, 536, 570, 592, 596, 589, 588, 594, 587, 552, 498, 449, 413, 385, 369, 375, 404, 425, 414, 376, 342, 337, 357, 382, 401, 423, 460, 504, 527, 516, 489, 469, 454, 432, 409, 406, 421, 427, 408, 381, 370, 375, 382, 381, 377, 377, 384, 399, 425, 458, 494, 532, 562, 572, 564, 558, 563, 563, 538, 494, 449, 414, 386, 378, 398, 434, 458, 470, 496, 548, 600, 619, 599, 568, 551, 552, 568, 582, 577, 542, 488, 443, 433, 456, 489, 506, 500, 482, 470, 465, 458, 442, 421, 407, 409, 424, 444, 457, 459, 455, 456, 464, 471, 469, 464, 459, 455, 447, 431, 417, 418, 443, 480, 506, 505, 491, 496, 532, 574, 594, 590, 586, 590, 580, 535, 469, 419, 398, 393, 393, 407, 447, 496, 513, 478, 415, 366, 347, 347, 348, 344, 337, 331, 331, 341, 355, 363, 365, 373, 397, 433, 463, 481, 496, 519, 552, 585, 599, 578, 523, 453, 397, 373, 373, 383, 391, 394, 393, 386, 378, 378, 397, 432, 465, 479, 475, 467, 471, 488, 502, 506, 505, 508, 514, 506, 481, 454, 445, 456, 476, 493, 497, 483, 453, 422, 406, 404, 403, 398, 398, 406, 419, 432, 448, 469, 492, 519, 553, 581, 583, 556, 526, 513, 509, 495, 481, 486, 508, 520, 510, 488, 467, 447, 436, 442, 460, 469, 455, 432, 416, 404, 395, 400, 432, 483, 526, 542, 525, 480, 425, 387, 384, 403, 422, 432, 446, 475, 517, 561, 590, 593, 576, 560, 558, 560, 553, 546, 560, 589, 602, 585, 552, 528, 520, 520, 517, 510, 498, 483, 466, 448, 432, 426, 434, 450, 460, 464, 471, 489, 506, 510, 500, 487, 483, 496, 527]
6128E27L4J6j5l4l0j4kjJJ0J9J6%j4j7j2j5j5mJ7K5J2njJ4K8L1L5L8L5K6J3ok9m0k1J4L0J2
6111F78k2m5m5l2k0rMJ6K1J2jkQQj0k8k2kOmj6k3l2l9k0J8M0L0J2J3K7K8Mk8m9m7k3KJ1Jq
6093D12lkj3k2lK7L4J4pq%MNJ7L1L7K9J2pj6j2lLKLO%j8l1k4rrk4k9j6jKKJ1J9Mk4l7k1OJ8
6074C59J7J5J5RKMQ%j9k8j7J0L2M2L1Jk7k5J2M3L7Kk7l6m1m8m6k6lRQJ3K6M4N1M4K2kj7k0
6056D74j8j3kJ0J1nk6l8m1l5k4mJ8L0K5J7J5K0K0Nj6k6k0kJ2J3OklPK7L8K7Jj6j5pj5l3m5
6039C70l1jK3L1K8K4J7Orj9j8j4j0KJ6L0L2K5Rpj8j4m%pj2qj1l6o2n9k3J0J8J1J2K2L0L5L5
6021D23K2rl8l9j1K2L9L6K5J4Ojpj2j4j5j4j4oQJ9K3K3K2J9Poj0kJ5K8L3K5QpqKJ3J5Oj1k7
6003F02l7l3j7m%rk5l8m5m4l7k4j1JPJ2K2L3L7L0J2kj0nJ0K3J9NnJJ0RK%OJ0J0QLpk0k0r%
$$ y = [527, 561, 577, 562, 528, 498, 484, 482, 481, 482, 492, 511, 527, 527, 513, 496, 484, 469, 454, 450, 467, 492, 504, 499, 498, 512, 540, 571, 606, 644, 679, 705, 718, 712, 683, 643, 622, 636, 666, 678, 656, 611, 566, 534, 514, 505, 509, 525, 546, 558, 557, 555, 563, 571, 561, 533, 511, 509, 515, 511, 495, 472, 440, 401, 381, 399, 439, 469, 481, 494, 521, 549, 553, 525, 476, 429, 406, 408, 419, 420, 412, 409, 407, 394, 372, 369, 396, 430, 444, 437, 429, 429, 433, 438, 455, 486, 523, 552, 564, 557, 541, 529, 526, 529, 531, 534, 540, 540, 522, 491, 467, 458, 449, 425, 396, 380, 379, 381, 383, 394, 413, 417, 393, 356, 335, 341, 359, 376, 391, 406, 415, 417, 421, 429, 429, 410, 382, 365, 375, 407, 449, 480, 481, 454, 429, 441, 484, 521, 523, 496, 460, 419, 371, 325, 299, 296, 305, 313, 326, 352, 396, 447, 491, 513, 511, 494, 474, 456, 443, 441, 451, 462, 457, 431, 393, 352, 317, 293, 289, 307, 337, 362, 379, 394, 414, 434, 439, 423, 397, 377, 375, 387, 400, 406, 404, 401, 408, 435, 473, 500, 501, 485, 470, 463, 448, 415, 370, 339, 338, 361, 392, 420, 444, 461, 467, 458, 439, 421, 407, 397, 399, 415, 445, 477, 502, 511, 504, 486, 472, 468, 468, 461, 449, 441, 430, 394, 332, 273, 250, 260, 278, 289, 301, 323, 353, 388, 423, 445, 436, 398, 359, 348, 370, 409, 445, 470, 484, 490, 489, 482, 470, 456, 441, 427, 413, 407, 415, 434, 457, 480, 502, 521, 528, 522, 512, 510, 525, 553, 586, 611, 619, 612, 604, 606, 619, 634, 640, 629, 602, 565, 532, 515, 511, 511, 502, 477, 439, 394, 350, 313, 289, 278, 279, 286, 298, 320, 353, 390, 420, 432, 430, 420, 415, 425, 448, 467, 472, 467, 468, 478, 487, 489, 489, 495, 505, 515, 523, 526, 519, 499, 479, 470, 470]
5984D70j2m0n9m9j7RJ5J1J3K3L4L3K2Oj3k6k0nKpj3mJ0J2KkQK2K9K4Roj1qlllKKklLQJoJJ1
5964D70%j9j9LJ7Mj8k4j2KRNj2l4m2k9j4pkJ2K8L8M0M1L5K1J3J4J1lj1kJ1Jj7j8lLlkJ1J2
5946E10rk5j3J5L0K2Mj3k4k5rJ2K0Pj2j8mJ5K6K3Rnj1pnonlJLKKM%j2j6kK0L2K4J5J9K7K8
5927F46K5J9Pj4l3l9l7m0m3k7MK7K7J3jj2j7j3%PPNJ1J2%j2j0%Jj1k0j6mLkj5l1m1m2l0qJ6
5908C12K8K3J1PJ1J1jrkJ2J8K0K4L7M5L6J2j4l2l4l0k8k5j7oKQJ6K5K3QmLJ1Ooq%QJ2J3Nj7
5890E14l9m4l3k3j4kJ2J3NNK5M0L3J1rj7j7r%mk3l9l5j5JKrk0k6k5j6kJ1K2K6J7MJJ2K6K6
5872C85J6Kj4l0l2j6PJ6PkkJLJ2L6N7N3J8k7n1m6k2%J1J3J5J5J0kj1j4oJ2K5K1Jj9k7k2j5
5855C78roppKJ5K0Oj2kL1N6M6J5j1j5oPJ5J2Lmjjj4l1l3j7mmj4k4k5j7JK5L8K7Lj6k4k5k4
$$ y = [470, 458, 418, 359, 310, 293, 302, 317, 328, 341, 364, 398, 431, 453, 459, 446, 420, 400, 395, 397, 390, 377, 373, 383, 395, 397, 395, 403, 425, 454, 478, 487, 481, 470, 462, 459, 456, 453, 455, 457, 455, 452, 455, 463, 464, 458, 459, 470, 470, 451, 432, 435, 452, 456, 438, 414, 402, 404, 413, 418, 406, 372, 330, 301, 287, 280, 278, 290, 318, 356, 396, 437, 472, 493, 506, 520, 531, 528, 517, 515, 526, 527, 510, 492, 489, 492, 489, 487, 498, 510, 501, 476, 463, 478, 508, 530, 534, 521, 497, 472, 463, 475, 495, 502, 490, 472, 468, 483, 509, 532, 541, 536, 525, 518, 513, 507, 502, 499, 500, 503, 505, 507, 511, 511, 499, 483, 481, 501, 533, 557, 572, 591, 618, 646, 671, 690, 697, 683, 650, 611, 574, 534, 491, 464, 468, 495, 522, 535, 534, 522, 505, 492, 492, 499, 506, 511, 522, 534, 534, 522, 512, 512, 513, 502, 482, 466, 462, 465, 463, 448, 417, 376, 334, 304, 296, 312, 340, 363, 374, 381, 392, 403, 402, 393, 391, 403, 421, 441, 465, 502, 547, 583, 595, 581, 549, 515, 485, 457, 432, 415, 409, 411, 419, 435, 460, 483, 491, 487, 490, 501, 507, 501, 493, 493, 501, 513, 526, 531, 514, 475, 431, 398, 375, 361, 359, 371, 384, 389, 394, 419, 459, 492, 503, 494, 477, 460, 451, 451, 447, 424, 385, 350, 335, 336, 338, 329, 309, 283, 258, 242, 240, 251, 273, 299, 316, 320, 321, 333, 359, 385, 401, 403, 389, 359, 327, 311, 318, 334, 341, 339, 337, 338, 341, 353, 389, 446, 499, 517, 490, 439, 393, 371, 371, 382, 395, 410, 425, 435, 433, 422, 408, 402, 414, 439, 460, 461, 442, 415, 393, 378, 369, 363, 356, 349, 351, 366, 386, 392, 380, 378, 409, 465, 511, 526, 515, 500, 494, 501, 516, 528, 531, 527, 526, 525, 511, 480, 447, 430, 426, 422, 408, 384, 359, 342, 343, 368, 406, 433, 436, 420, 396, 371, 347]
5836C47j9oJ1K1K4K3K0K0J8Rnj7j5mNLmkKKkkNOKorojNJ4J4%j9k0J0M4N1K3j1k2j2JNOJ1J3
5816E33PjkLJ0J6J7J1NNNrm1o7o4m0j8nORkj6j3J4L8L3Qj4j7pQJ9J7OprlPJ2RlrKK1K0jj6
5795D77qM%j5j8pJQJ7K4J5oj7j0%Mkoj2j3qlqj8j4%OloOJ7J5NjmppMJ2J5J3J6J0qk0oJ9K2
5774D83lk3j1K1L8K3pk5k2j0moqqomKPKmOL2N2M8K7Oj2k6k3KK9K6om1n2m2k4kJ7K4J8%j8l1
5755D45k4jJ4Jk6l0%M0N1L2Qqj4j9j9nJ5L1L2K1Pqk6l5l1j2KLJJ3L0K6Jk4k6j1MJ1J3J2J1
5738E05J4J8J7Oqj9k2j7j2j1j0JJ9K8J7kj1j7k9l7k2PJ2j3l2k2jJ0J7L2M0K4JJJ5J4j1k5j5
5721D62NJ1LmjJ1J8Nk1l7l2k2k7l2j5J4K0mk6k6j7j2JK7M2L6K7L9N0L7Nj4j1mlmnj0j1LJ6
5703D94Pj4j7%J4Lj3j4lJoj1j2j7k2k2j4kJ5L4M4L1Nj3j7j2j4k1k1j0NJ4J1LjLJ6K6K8J7l
$$ y = [347, 328, 322, 333, 354, 378, 401, 421, 441, 459, 468, 463, 446, 431, 427, 432, 435, 431, 429, 431, 433, 431, 429, 434, 440, 442, 436, 427, 421, 420, 425, 439, 453, 453, 434, 414, 424, 468, 519, 542, 531, 509, 497, 498, 503, 509, 520, 533, 540, 539, 537, 540, 550, 566, 583, 594, 599, 604, 609, 600, 559, 492, 428, 388, 370, 365, 371, 380, 378, 362, 349, 363, 401, 434, 442, 428, 411, 404, 412, 431, 448, 454, 447, 438, 435, 442, 454, 463, 460, 451, 453, 474, 494, 493, 477, 469, 473, 473, 458, 440, 433, 434, 442, 459, 483, 498, 492, 475, 465, 465, 469, 467, 461, 449, 436, 428, 425, 417, 399, 385, 385, 391, 388, 382, 388, 405, 420, 425, 424, 420, 413, 406, 410, 422, 437, 450, 466, 476, 468, 448, 442, 461, 483, 480, 457, 446, 467, 505, 528, 521, 496, 474, 464, 460, 454, 446, 438, 432, 428, 430, 437, 439, 435, 441, 473, 525, 573, 600, 606, 594, 568, 545, 547, 576, 602, 596, 555, 503, 461, 437, 435, 452, 476, 494, 494, 476, 445, 421, 420, 434, 435, 409, 379, 379, 419, 470, 502, 510, 502, 488, 469, 450, 445, 460, 491, 523, 544, 551, 543, 517, 482, 451, 439, 441, 444, 445, 458, 488, 514, 515, 491, 465, 454, 458, 469, 482, 494, 505, 519, 537, 554, 560, 552, 533, 511, 494, 482, 471, 461, 462, 481, 509, 526, 524, 513, 496, 467, 430, 408, 415, 427, 414, 382, 360, 359, 369, 386, 418, 458, 482, 483, 484, 499, 513, 502, 477, 462, 467, 478, 481, 477, 476, 487, 505, 510, 489, 452, 420, 398, 371, 339, 324, 338, 358, 354, 328, 302, 285, 273, 274, 301, 343, 379, 406, 445, 495, 532, 537, 523, 512, 508, 505, 501, 496, 486, 475, 478, 494, 501, 487, 470, 470, 484, 487, 474, 460, 457, 458, 452, 441, 429, 412, 390, 368, 354, 352, 367, 401, 445, 476, 481, 468, 451, 439, 425, 404, 383, 373, 378, 392, 403, 406, 405, 408, 424, 450, 478, 495, 492]
5685D92k0l2l5l8l4j8J1L7M8L8K2PlmLJ3J4lk3k4jK6L0Lk7l9k9k1k5l0k1jRRJ1K6L6K8Orq
5667D24kJJnj0j0JJ5J9Qjjkj1k9l8l5j9QL4M6M1K9K3J4lk1k7k0j2mRJ4PnlQPj7n0o1m3rK5
5648B96L8K5lj3KK6L6L2K8K7K6K0Rlpnmj6l7l8oL0L2Nj6lK3L0J1qj3j0j5k8k9j6jMKPJ0Lq
5630D43oKJj3rJ9L4J1k8l9k0KQRJ3J2LMJ9K7J2j1k2k0k1k2j0J2K4J4koJlk2m0l2JL0L0Prp
5611C96PJ6J9J2LokJ7L5L7K1%qnlmmMJ5J5Mj0k1l3m1l3j1QJ1QJ4K1J4nj4kJ2J5kl2n8n6k0
5592C34K6N2N7M9L1Nj4qPMj8k6nK5L3K5J3%j1j9k4k7k9j8LJ3J0QJ8J9Nj0nKql1l7j7J7M1M2
5575E32K6J8K5L3K1ORK9L5L2L7L8J2k2mO8J28J62K30L49M52N46P59J098J239Q21n8q49j115
5562D657r42o96n64m66l28k06j55j49j35j11r2o3l0j9l3l8j8KJj2j9k0j6oJrk9l2j3NRQJ1
$$ y = [492, 472, 440, 405, 367, 333, 315, 326, 363, 411, 449, 471, 478, 475, 471, 474, 487, 501, 498, 475, 451, 450, 476, 506, 509, 482, 443, 414, 393, 368, 338, 317, 316, 325, 334, 345, 371, 407, 435, 441, 432, 424, 422, 423, 424, 419, 409, 399, 400, 415, 434, 442, 441, 440, 438, 427, 398, 360, 325, 306, 314, 348, 394, 435, 464, 487, 501, 498, 477, 450, 430, 418, 414, 423, 437, 444, 439, 436, 444, 451, 434, 384, 323, 280, 271, 296, 334, 359, 356, 343, 345, 371, 407, 439, 467, 494, 520, 540, 549, 546, 539, 534, 530, 514, 477, 439, 433, 463, 495, 500, 484, 481, 504, 534, 545, 537, 524, 514, 499, 471, 442, 426, 425, 429, 431, 438, 448, 451, 443, 437, 439, 440, 427, 418, 437, 471, 482, 454, 415, 395, 397, 405, 414, 427, 439, 442, 446, 465, 492, 504, 493, 471, 451, 430, 408, 398, 410, 434, 448, 446, 440, 441, 438, 416, 376, 344, 345, 375, 405, 412, 403, 396, 403, 419, 438, 450, 453, 447, 445, 462, 497, 534, 555, 555, 547, 542, 539, 535, 531, 535, 550, 565, 569, 559, 538, 505, 464, 431, 420, 428, 439, 447, 461, 482, 496, 491, 477, 475, 487, 502, 500, 468, 410, 354, 334, 360, 412, 469, 518, 549, 554, 540, 532, 539, 543, 525, 499, 494, 519, 552, 577, 590, 590, 579, 560, 536, 509, 480, 462, 465, 478, 488, 496, 514, 533, 538, 528, 523, 525, 517, 486, 449, 432, 449, 490, 532, 558, 576, 601, 634, 655, 661, 670, 699, 734, 766, 803, 841, 853, 831, 827, 895, 1023, 1185, 1415, 1764, 2216, 2762, 3521, 4619, 5858, 6679, 6621, 5772, 4657, 3715, 3019, 2455, 1989, 1661, 1455, 1300, 1151, 1016, 905, 813, 750, 720, 701, 668, 630, 612, 614, 615, 603, 584, 564, 548, 542, 543, 534, 505, 473, 460, 465, 474, 482, 493]
5548D93J5J0Lknqmok4m8m7k1MRMPOnj7j4NK0L1M4N8O6O3M9K2j3l9m0k3mNLnj1j1ork1k7j5
5529D92PJ2JnOJ7PrpJ5K4Kl2l7j1J8K5J3jj5k8l6l5l5l7k7PM2M5K2PJ4J9Pj1j6j0rj1lJ4K3
5510D64J5mk0k0oRPnqOK4K3J0OJ1J3QK%lj2k1k6k5k0j1njJNJ3J8J8J7J3J3J3J3Noj8k5k8k5
5491D38j5jM%nrj3j2KK2K1ql8l6rJ4J8J3Pj0l1l7j7RJ8J5J5K4L6L9L0J3LQJ8J1j3l6m0l0k2
5474C96j5lJ1J5Mj1j7j3lQRkj6j3J0L9M4K3nj6oPJ0MkoojJ1J9J2pk1k0j0jPJ8J9Mj7l2l7m0
5454C50l2lM5Q4Q4N0Pk5m2m7m5l8k6j4nkmrqjNNJPK7L8K9Qpqrj0rpj0j5oJ5L4K8Nj8k6j6k
5435C78J3J8J3J0J3J7J2lj8k2j8j2j3j6j8j2mKlrmOJ5J6J8K2K6K4J7Pnj0mK%nOK9L7J9j2k7
5417E05k2j5pJOnk2k6j4j1j9j7OK8J7j6k7jL5M9L5J3pk0k0j0MOJloj6l2l6j4J6K9J0j1j0P
$$ y = [493, 508, 518, 521, 519, 514, 506, 502, 496, 472, 424, 377, 356, 360, 369, 373, 380, 386, 381, 364, 350, 355, 375, 406, 450, 508, 574, 637, 686, 708, 695, 656, 616, 593, 589, 594, 597, 592, 581, 570, 564, 555, 534, 507, 492, 499, 511, 512, 507, 513, 530, 537, 528, 521, 536, 560, 562, 530, 493, 482, 500, 525, 538, 537, 522, 494, 458, 423, 388, 351, 324, 331, 373, 418, 440, 447, 461, 480, 487, 476, 460, 450, 441, 430, 427, 441, 464, 479, 475, 455, 435, 429, 438, 445, 440, 432, 438, 462, 485, 495, 501, 512, 525, 533, 535, 535, 532, 520, 499, 473, 448, 428, 417, 412, 411, 412, 417, 430, 448, 466, 483, 496, 509, 522, 535, 540, 534, 516, 491, 463, 438, 423, 422, 426, 426, 421, 412, 399, 387, 389, 411, 432, 424, 386, 350, 341, 355, 373, 386, 393, 383, 352, 315, 298, 307, 325, 340, 355, 379, 415, 454, 484, 497, 500, 508, 526, 537, 524, 488, 448, 418, 396, 381, 378, 389, 404, 408, 397, 380, 367, 364, 372, 381, 379, 363, 350, 360, 399, 443, 466, 461, 445, 439, 446, 456, 460, 458, 452, 446, 445, 456, 475, 487, 480, 459, 439, 429, 428, 435, 453, 472, 476, 459, 427, 390, 350, 318, 315, 360, 444, 528, 578, 585, 560, 518, 471, 426, 388, 362, 348, 343, 341, 337, 328, 320, 319, 324, 329, 330, 337, 364, 402, 431, 439, 432, 424, 415, 405, 396, 389, 379, 364, 358, 373, 407, 435, 440, 422, 396, 380, 378, 391, 409, 422, 432, 445, 462, 474, 471, 453, 431, 413, 401, 388, 372, 354, 342, 338, 340, 337, 328, 324, 330, 345, 361, 379, 401, 427, 451, 468, 475, 470, 460, 456, 458, 458, 453, 459, 488, 525, 544, 532, 505, 483, 468, 461, 462, 468, 463, 441, 415, 401, 390, 371, 354, 360, 388, 405, 389, 362, 361, 396, 445, 480, 493, 486, 466, 446, 436, 440, 446, 447, 444, 438, 422, 390, 354, 340, 356, 385, 395, 384, 374, 381]
5399C81J4NJ2M4P1N2%l2k0J1K3J2kj5k6l1j6PK4K1Lj9k9k0NK6K2Lj5j8j4oMJ2J0pk2k0kJ9
5382D67K6J9Nklmj5k2j9rjLRJ6J7QkqqJJ6K4J5kj1j2j8k8l2k4j6j4qNJ9L1M1M4K8nk2j2QR
5363E14qk0j7rj3k2k7k9k6j7lJ5K9L6L7L0K5J9%l1n2m6j5J1K0K0J8Qrj7%K6L6J8rk3k1j1l
5346D34%%pj6j7jK1L3K7J5J1RKj0j6j4kJ1J0j0l4l5j0Pj5n0n1rM0N5L9K1J3OjlMPJrj1kJ2
5327D55J8J3L%ONjkJ5M1N0L1jk1k1j5j1j4j9k1k3j9j4j4j8k4k0oOJ2J4J4Olnoj4k8l0j0PL
5309C39j2j0OJ6J5J1J3J0nk2l1l0j5J2L7M4K7OjNK0L1K6Oj2j2JNjjKrl3m6l0nJj5l1l4j3K4
5291B89O2P3N3K6Ork3k4j2qk4l4k1MJ6K1M4P0O1J4l3m9l8j9njqj4nKnj6pJ6J7pk4j3PJ5J5
5273D12K3K9K1Nmqj5k0j3omjQJ5QlkLpk7l1j5JMKKJnqJJ7K3J4nj7j1LJ0PQK0K6J0j6k5j0J7
$$ y = [381, 395, 400, 412, 456, 527, 579, 579, 547, 527, 538, 561, 573, 571, 556, 530, 499, 483, 490, 514, 535, 538, 519, 490, 470, 475, 501, 523, 526, 511, 493, 479, 473, 477, 489, 499, 492, 470, 450, 448, 467, 493, 512, 517, 515, 512, 508, 493, 471, 452, 443, 442, 445, 454, 470, 487, 495, 493, 485, 477, 478, 494, 518, 533, 531, 520, 508, 490, 462, 430, 406, 390, 376, 368, 373, 392, 423, 464, 508, 536, 531, 509, 497, 505, 514, 506, 486, 469, 460, 447, 425, 398, 369, 343, 326, 323, 338, 367, 403, 440, 470, 495, 514, 514, 483, 431, 385, 370, 381, 401, 421, 439, 447, 438, 421, 421, 447, 483, 501, 492, 469, 448, 437, 434, 434, 434, 427, 411, 394, 393, 414, 447, 474, 489, 500, 509, 511, 501, 485, 471, 469, 480, 490, 480, 446, 411, 401, 408, 393, 343, 292, 283, 323, 378, 417, 438, 451, 457, 456, 453, 457, 464, 465, 456, 445, 443, 455, 473, 486, 489, 489, 495, 500, 499, 497, 512, 553, 603, 634, 633, 612, 591, 576, 565, 551, 532, 511, 488, 469, 455, 441, 423, 399, 379, 373, 379, 391, 405, 419, 425, 422, 417, 411, 397, 369, 339, 329, 336, 339, 327, 317, 323, 339, 354, 365, 378, 388, 383, 361, 330, 300, 285, 297, 334, 378, 405, 411, 410, 415, 435, 466, 492, 498, 486, 474, 475, 480, 479, 478, 480, 471, 438, 392, 362, 357, 358, 343, 312, 278, 265, 289, 351, 424, 477, 503, 509, 500, 477, 453, 441, 433, 409, 375, 354, 358, 374, 395, 439, 509, 570, 584, 551, 502, 464, 445, 440, 439, 431, 417, 412, 414, 409, 393, 386, 402, 419, 412, 388, 375, 382, 397, 412, 435, 464, 485, 490, 486, 478, 463, 443, 430, 424, 420, 419, 427, 442, 450, 447, 445, 448, 441, 414, 383, 368, 369, 373, 375, 377, 378, 373, 365, 366, 383, 406, 420, 415, 398, 387, 390, 400, 407, 415, 435, 461, 471, 455, 430, 420, 437]
5252D37L8M3L1%k8l1j3jqk0j9j4j5j9j2KQLjKQJ2K2K9J7j8m2l6j1LMJ7M2N4L8J4QJ7K5K7K5
5235F38J6pk9k9j6j3k4l1k3j7k5k9j5MKj4k2pJ8L2K5J0PK0L6K9Lj6j6rrj1k%j7l8k7J1M0L0
5217D75OKK1L1J4j8k9rK4L8K7Mj0j4k0k9k9j9rpj0j2j0oJLnj5j0NRpj8jL1M0J5j4k1oOPQR
5198D48OJkoj5k5j3K1M6L6PmJ0J9Lj4nK2L1J3j1k1j6jJ3J2j1l5l7j8lmnlpj2mK1L6K1OJ5K8
5180E43J2k3l6j8KKn%QQPJ3J7Prj8k1k0j2RL0K8Mj7k0j2j3k5l4k8j5m%kllk%jLJ0K0L2M0M5
5160D99L7J6mj2mMKJMKj4l4l4j3J2K5L2L9L4J4oj2j1k4m2l7nK7L1J4nj3j7k2k2j7qkLPQKp
5142D48j6j9j4lRJ9K5K4J4NNJ1PkqnjmlLOql2n0m7l1rJ2K8L1J9MkMJ5K4L0L4L1J5lj3j2j2
5122E29k1k7j4J1K3J1oj0j0k2l4k4QK6J7LRK4J9ok4k1qkj%JjOK1K4%l2l3mK3K0Jj2j4j5k0
$$ y = [437, 475, 518, 549, 549, 521, 490, 477, 476, 468, 448, 429, 415, 400, 381, 369, 371, 379, 382, 381, 383, 391, 403, 425, 454, 471, 453, 411, 375, 364, 367, 371, 388, 430, 484, 522, 536, 544, 561, 586, 613, 638, 654, 647, 618, 589, 573, 560, 536, 505, 482, 465, 440, 411, 396, 400, 402, 388, 366, 359, 377, 409, 434, 444, 451, 471, 507, 536, 539, 523, 507, 498, 489, 478, 476, 476, 459, 421, 394, 405, 445, 475, 481, 483, 504, 535, 549, 531, 502, 493, 517, 555, 582, 586, 576, 562, 542, 513, 484, 465, 456, 449, 439, 427, 417, 411, 412, 415, 410, 395, 385, 390, 399, 392, 374, 373, 404, 444, 459, 445, 424, 418, 424, 431, 439, 448, 454, 455, 453, 447, 432, 407, 394, 415, 461, 497, 504, 500, 510, 529, 532, 518, 513, 535, 566, 579, 568, 547, 531, 530, 543, 555, 544, 509, 472, 454, 451, 447, 442, 439, 432, 420, 416, 437, 473, 494, 500, 515, 543, 555, 532, 496, 478, 480, 482, 477, 477, 485, 493, 500, 513, 530, 537, 528, 510, 489, 469, 457, 466, 496, 524, 528, 511, 491, 479, 466, 441, 407, 379, 364, 360, 360, 358, 355, 352, 350, 350, 349, 352, 362, 382, 414, 454, 499, 536, 552, 548, 536, 532, 536, 538, 539, 543, 545, 531, 497, 463, 450, 462, 487, 519, 558, 592, 606, 600, 588, 577, 553, 511, 474, 469, 496, 527, 541, 536, 523, 506, 484, 462, 445, 437, 435, 438, 445, 453, 455, 448, 432, 413, 399, 396, 405, 424, 449, 473, 487, 492, 497, 508, 515, 513, 505, 500, 499, 495, 492, 495, 501, 493, 461, 411, 364, 333, 324, 336, 364, 395, 414, 418, 416, 420, 435, 459, 489, 523, 554, 569, 566, 553, 541, 529, 508, 481, 467, 478, 501, 512, 506, 496, 486, 464, 430, 406, 414, 440, 457, 460, 469, 493, 512, 506, 482, 461, 453, 451, 450, 450, 451, 450, 456, 477, 501, 501, 469, 436, 432, 455, 475, 476, 464, 450, 435, 415]
5104D15k4k6k0oJ5L0L5L2L1K5J6PQJ4Qoj6j3olJQPkrnLjk0l3k6kK9M3L7J7kj5k6k9k0pnj5
5085D44j9mJ3J3MNJ3J2%j0rqj5j9nJ2J8J5J5K2K3J4%k0m7o3m1J7O2O0J6j8k4j3oJJ3J8Pj4
5068D82k3j3LJ3RKJJ0J8J1mj0nmj5k2oK1L2J5qj7j8j7j1KJ6K4K5K1J0nj5j2pqj2nRJ9J9K1
5050E46L0K8Kl5n7n1k9j1oqrrmMJ5K1J9J5J3J3Pmj9l1l5k1NL3M1K8Mj6k7k0lJ2J0lpMJ4J3
5031D72J2J9K5J3mpJ1K1J3oj0lPRLllJMlj5j8j0nj5l1k7ML7M4K0j1k9k8j8p%K%MJ0J0rl3l6
5012D10j2K0L4L2K3J1nj6j0M%k1l7k4J1L6L2J1orlok4l8l4j3PJ8K2J7Kj9k9j6NJ2PJ%%JOJ0
4993D10OlkJ6L2L1Pj8l1k9k3j6oRJ8Qj0j5lJ3J2M%KLLJ2K3J9kk0j9pJklNJ9K8K6J3rk7l4l2
4974D09k5j8pJ0K6K9K0jk4l3k1MJ2ok9k3J3M2L3Kj4kJ4J1moLJ4J3QJrj8j9nOJ0J1K2M2N6M8
$$ y = [415, 391, 365, 345, 339, 354, 384, 419, 451, 482, 507, 523, 530, 538, 552, 560, 554, 538, 525, 519, 516, 517, 525, 532, 530, 521, 516, 519, 518, 498, 465, 439, 437, 466, 509, 546, 563, 561, 546, 520, 491, 471, 464, 459, 444, 425, 421, 434, 447, 451, 456, 469, 481, 481, 471, 462, 454, 439, 420, 415, 427, 445, 460, 475, 497, 520, 534, 534, 514, 467, 404, 363, 380, 442, 502, 518, 500, 476, 463, 457, 458, 471, 489, 496, 482, 459, 446, 449, 462, 471, 473, 474, 484, 502, 513, 509, 499, 494, 490, 475, 453, 447, 468, 500, 515, 507, 490, 472, 455, 444, 446, 462, 486, 511, 532, 542, 537, 522, 510, 503, 495, 483, 478, 487, 506, 525, 546, 576, 604, 606, 571, 514, 463, 434, 423, 417, 409, 400, 391, 387, 391, 406, 427, 446, 461, 474, 487, 494, 490, 471, 440, 405, 384, 389, 422, 463, 491, 495, 479, 452, 432, 429, 441, 451, 448, 441, 445, 459, 472, 484, 503, 528, 541, 537, 530, 541, 562, 575, 569, 559, 556, 563, 572, 575, 572, 569, 570, 574, 571, 556, 538, 528, 523, 508, 477, 450, 454, 491, 535, 555, 544, 515, 487, 469, 462, 462, 464, 464, 468, 478, 488, 479, 446, 410, 398, 418, 452, 484, 507, 518, 513, 497, 487, 491, 491, 470, 433, 409, 420, 456, 488, 499, 493, 484, 481, 475, 451, 413, 379, 366, 373, 391, 413, 430, 432, 413, 384, 368, 373, 385, 392, 393, 393, 393, 394, 400, 410, 416, 413, 411, 427, 459, 490, 497, 479, 448, 419, 396, 380, 374, 383, 401, 409, 399, 384, 381, 394, 406, 410, 410, 412, 415, 418, 430, 453, 472, 470, 450, 431, 424, 425, 423, 420, 425, 444, 472, 498, 511, 502, 475, 441, 409, 384, 366, 359, 369, 395, 424, 444, 443, 419, 386, 365, 369, 381, 375, 346, 323, 336, 378, 411, 413, 399, 397, 411, 422, 418, 412, 415, 429, 442, 450, 451, 442, 424, 405, 400, 406, 416, 427, 449, 491, 547, 595]
4956E95J8j1k5k6k8l9m9m3j5J9L7L3J8MmLK0L4K9Nj6k4j8qmnqoNJ2Jj8k0jJ5QpnNnk7l2pK5
4936D35L6L0K1Qj2k3j0QPrj0RK6K6J7Rnk2k9k8l4n1o1m1nK4L5L5K7RplJ4K3Rj8l3k8j3lmj6
4918C43k1qJ7L6L4K3J5J1Jk0l1k0RK5J0j1j4LJ4Mj2j1RK5K7J8J1J1J2Rlj2pRJ6Q%OJ3Pnmj
4900E46j3l5m4k3QK8L2K1ml0l3rPql6l9oL3N1M4J7j7m1l6j0K0L4L6L1J8nk2j9%J7J8J3RJ5
4883E68K8M5N7N8M7L9M2N5O4N4L3J2nk1m3o0o5n5l7k7k7l7m5m5l3j3Jkj4k6k0kJ3J0pk0j9
4867E03pNNjojJ3K5K1lk8l8k6pORQQOkj0j1onj1j1JJ4Qj7l6l1j5qj2j0RL2M3L9L0J7mk2k3
4847D51oRNj0j0QK1J4pj6j0QK3K8J6ok1j8oLRJ2J2QLJ%noQK3J8mj6pOPjrj6k7l6l4k0oLLJ
4826D03JRJ7J1pk5k6rJ8M0M1J3j8k5oKj6l5k6jKj7k6qK6N3O5O0M1J5oj1mONj3l6l9j1K2K4
$$ y = [595, 613, 602, 577, 551, 523, 484, 435, 392, 377, 396, 433, 466, 484, 488, 484, 487, 507, 541, 570, 575, 559, 535, 517, 509, 505, 500, 492, 486, 491, 503, 504, 486, 466, 465, 480, 488, 481, 476, 481, 476, 449, 417, 410, 435, 471, 501, 522, 530, 518, 495, 485, 493, 500, 491, 481, 490, 516, 542, 559, 568, 563, 541, 512, 484, 450, 399, 338, 297, 292, 316, 351, 386, 413, 422, 415, 412, 426, 449, 458, 440, 407, 379, 366, 363, 359, 343, 322, 314, 331, 367, 401, 424, 439, 450, 451, 431, 400, 380, 389, 414, 424, 413, 399, 402, 416, 420, 408, 397, 406, 431, 458, 476, 487, 498, 510, 519, 516, 504, 497, 506, 522, 530, 530, 536, 549, 556, 551, 547, 546, 533, 498, 454, 431, 439, 467, 499, 520, 516, 486, 453, 444, 451, 443, 407, 368, 362, 395, 446, 490, 507, 490, 449, 413, 403, 423, 457, 493, 524, 542, 537, 515, 496, 496, 513, 531, 544, 553, 568, 596, 641, 698, 756, 803, 842, 884, 939, 1003, 1057, 1090, 1102, 1097, 1076, 1033, 973, 908, 853, 816, 789, 762, 725, 680, 635, 602, 589, 590, 588, 574, 548, 528, 526, 539, 549, 542, 522, 503, 496, 501, 506, 505, 499, 498, 511, 536, 557, 554, 526, 488, 462, 455, 461, 470, 478, 486, 492, 490, 480, 469, 463, 458, 447, 436, 437, 451, 459, 442, 406, 375, 360, 352, 340, 330, 339, 371, 414, 453, 483, 500, 496, 474, 451, 445, 454, 459, 449, 439, 447, 468, 482, 475, 459, 449, 457, 480, 508, 524, 518, 497, 479, 473, 476, 485, 497, 509, 517, 520, 521, 521, 516, 510, 518, 541, 559, 555, 539, 532, 538, 545, 544, 535, 519, 492, 456, 422, 402, 396, 399, 402, 403, 404, 413, 430, 441, 434, 409, 383, 374, 392, 432, 473, 486, 468, 443, 437, 439, 423, 388, 362, 361, 363, 346, 320, 312, 338, 391, 456, 516, 557, 572, 566, 555, 551, 557, 562, 549, 513, 474, 463, 485, 509]
4809E09Jk0k2j8j6j5mJ0K0J9J0lmRK2K3J5J2J5J3J4K6K9Qk2k3%J0ok2j8qj3k4j8JJ7J7Pj1
4791E40k5k7j7j4j3ML7N7M2RrnQJ8K3K3K6M1N7N8M9N9Q5J05J26J93L03M07N09O82Q92R00M95
4777E638j95p63r26p78n79m55l61k59j82j45j17p8n1m2l4k0j8k8l0j0J0J0pk5m2m4k1J1J9
4764D78lj7ML4M0J7jOK3K3%l5o2o7n2k7mQO%QK6L6K1nqJ8M1L2Mj6j7j9k7l0j4K1M8M7J9j3
4747E43k9k2rnj2k2k7k6j7nLONjrrQK6K2pl7l2NL7L0j0m4m4j3J3J7ONJ3J6J2QJ5K5L5M2M4
4728E56K7mk7k1%Pnj8j0J1K3J4j5m2m4k3jlk6m3l7j4J2K9K8Lk3k0K0O2P1L8qm4n5l9jL4M4
4711D56K7LlRK4K3Lj7j4J2L1K0j5m0l4pJ9K8J9Jk1l5l4k4oNMnpOK1J4j5m1m5l1j7mQJ3Plj
4693C34J9L2L1J7Ojrj6j7j0l%mqrlQJ8K7L3L5L4L2L2L1K1Kj6k9l3l3l0k8k7k4j9j2pJRJ4Q
$$ y = [509, 510, 490, 468, 450, 434, 419, 415, 425, 445, 464, 474, 471, 467, 476, 498, 521, 536, 548, 563, 576, 590, 616, 645, 653, 631, 608, 608, 618, 612, 590, 572, 564, 551, 527, 509, 510, 527, 544, 551, 540, 515, 488, 471, 457, 444, 448, 485, 542, 584, 593, 584, 579, 587, 605, 628, 651, 677, 718, 775, 833, 882, 941, 1026, 1131, 1257, 1450, 1753, 2160, 2669, 3351, 4243, 5143, 5638, 5443, 4680, 3754, 2976, 2397, 1942, 1581, 1322, 1140, 995, 878, 800, 749, 707, 673, 653, 635, 607, 577, 567, 577, 587, 580, 555, 513, 469, 448, 459, 478, 475, 458, 462, 496, 536, 553, 552, 558, 581, 604, 604, 569, 507, 440, 388, 361, 357, 365, 371, 371, 379, 405, 441, 462, 457, 449, 467, 508, 540, 544, 528, 511, 492, 465, 435, 421, 442, 490, 537, 556, 543, 514, 492, 483, 478, 466, 444, 417, 391, 374, 369, 372, 378, 383, 382, 373, 364, 372, 398, 420, 413, 376, 344, 349, 386, 416, 406, 362, 318, 305, 318, 335, 341, 346, 359, 375, 387, 395, 410, 435, 470, 512, 556, 583, 579, 552, 531, 531, 538, 533, 515, 505, 516, 539, 553, 538, 496, 452, 429, 428, 425, 399, 356, 319, 305, 317, 346, 374, 377, 354, 334, 354, 416, 487, 525, 517, 473, 418, 379, 378, 412, 456, 483, 486, 483, 492, 516, 539, 542, 525, 511, 523, 554, 574, 559, 519, 485, 478, 497, 525, 544, 545, 524, 489, 455, 431, 425, 430, 434, 429, 422, 428, 449, 463, 448, 407, 362, 331, 314, 310, 318, 331, 338, 335, 334, 353, 385, 416, 433, 439, 438, 429, 413, 396, 386, 383, 383, 379, 371, 362, 359, 367, 385, 412, 445, 480, 514, 546, 578, 609, 630, 632, 616, 587, 554, 521, 491, 463, 436, 412, 393, 381, 374, 375, 384, 398, 406]
4675D06NJ4K8K6Nj4j8j3rqooj3j4jJ2J4MQK7L8K9J0%jrk9m2l5j2RJ3ORK4L5K8Rnj0j1j2rk
4656D80mj6k5j9nlj7k2oJ7J9Kj4oJ8K9J3j0j6oJjKJ8L1K0ok5k4j6qkKLjjJ3L0L7K4Lj5k1j7
4636D56j5k4m0m7l1nJ1Opj2mRJ9K8L2L2K1Rjoj2j9k5k7k6k4j6jJ6K7K5J2nj5j1NJ9K5K7K7
4619D33K6K1J0Joj7k5k3j0PJ4J2RPLmnJ0L0L3J2j6k7j3J1K7K6Kk7l9j8K1M0K2j2l3l2k3j5
4602D32plnpJJ7K2Rqj5j0pqoLJ1J5J4J0Ojrj7j9j2OK1K5J8J2J2K2L7M7M4K3j0l9n2n1m2l6
4584D43k6j0J4K9K2LmPJ7Oj4k3j7j6j9j3%Lqj4jJ8K2J1mj2rJ0M1N3K9rk1LK6K0ok3k1j6k3
4566D68l2k6LL4M1J7j2j3PJ9Oj5j8nKj0k6l5k8rJ2K0J4Lmqj9k4j6NJ7J3LjLJ1K5M3M6K5rl3
4548D94l4k1kJ7K8K5Pj5l1m1m2l4j2J4L6M4M0K4kk4k6j4jnj2j1%QPOJ1J5Mj6k6j9mQJ8K8L6
$$ y = [406, 411, 425, 453, 479, 484, 470, 452, 439, 430, 422, 416, 410, 397, 383, 382, 394, 408, 412, 420, 447, 485, 514, 524, 524, 523, 514, 485, 443, 408, 396, 405, 418, 424, 433, 457, 492, 520, 529, 524, 514, 503, 491, 482, 480, 476, 460, 435, 416, 411, 408, 391, 369, 363, 380, 399, 401, 387, 381, 399, 428, 441, 431, 415, 409, 410, 409, 411, 429, 460, 480, 474, 449, 425, 409, 401, 399, 401, 404, 403, 402, 415, 445, 482, 506, 509, 494, 473, 456, 441, 417, 377, 330, 299, 294, 305, 311, 304, 292, 288, 297, 316, 344, 376, 408, 429, 438, 437, 431, 419, 400, 375, 348, 322, 298, 282, 281, 297, 324, 349, 361, 356, 341, 330, 335, 354, 379, 406, 433, 459, 480, 490, 491, 485, 468, 443, 420, 410, 417, 431, 443, 452, 459, 462, 458, 453, 463, 493, 526, 538, 522, 495, 482, 493, 520, 546, 548, 521, 482, 464, 485, 525, 547, 535, 502, 470, 447, 432, 425, 422, 417, 410, 411, 428, 450, 459, 451, 436, 426, 419, 411, 405, 408, 419, 434, 448, 458, 464, 463, 454, 437, 418, 406, 412, 433, 458, 476, 488, 500, 522, 559, 606, 650, 673, 663, 624, 572, 521, 479, 443, 417, 407, 421, 450, 472, 475, 471, 478, 495, 501, 487, 464, 447, 431, 412, 399, 399, 402, 394, 380, 379, 397, 419, 430, 426, 414, 405, 415, 456, 509, 538, 529, 508, 511, 537, 557, 551, 528, 507, 491, 468, 436, 410, 413, 447, 488, 505, 493, 480, 487, 506, 512, 497, 479, 474, 476, 466, 440, 405, 377, 368, 380, 400, 414, 417, 413, 405, 386, 362, 346, 351, 368, 381, 384, 383, 386, 397, 422, 465, 511, 536, 527, 494, 460, 439, 437, 454, 482, 507, 514, 499, 468, 427, 385, 351, 339, 353, 389, 433, 473, 497, 495, 471, 445, 431, 430, 425, 413, 402, 402, 410, 417, 423, 434, 449, 453, 437, 411, 392, 388, 396, 414, 442, 478]
4530D78M0M4M6L5Qk1l4k2ojj5l0l0j8pj1k2k2oJ1J8J6J3J3J7K2K3Rj2j9j3pj5k0j4pj6k8k1
4513C76LJ9J2%mpj0mJ3K7K2J0KLLQJ5K0J3MK%j1k4j4RK0Kk0k3pJ0J8J7QlnLNj1l5m0k0LJ0
4494D19QJ1J8K5K4J8Jk0k9j0J9L0J5JMJ1Kj8k7k4k5k5rK3L9J9j6k6mK5L1J4kmMRQK%jmmPK1
4475E60K2Qpj6l0n2o6n1j6N%j9k7j4J4L6M1K7J1J0K0K9K7K1J2j0l6n1m2k3j3j0%J6K3J4jm
4458D08PJ5J0nj4oRK0J6Nj1k9m4m4j5K4M9M6K5Kj2rJ2M0N1L2Kj9k3k6l4l6k3o%j2k4k4j2J
4441C46J4K3L1K9J9J0PNkj6k5k2j2ooj0j1nJMNQPpk4k4LL0L2J4OJ9K8J3j7l5l3j7MJ8K2J3
4423D39QJ3K7K9J6jrj4j8j4JK4L0J3j2k5j4RJ9Nj9k8k1lJ2K1J8ol8m9k0L0N4L4kj8oPLj7l2
4405D46l1j9j1oOK2K5Oj3lL0M5K4j2k6j9j2j3j5j4k0k8k7j7rpMK4M0L4J1j1k6l3l2j7mnj7
$$ y = [478, 518, 562, 608, 643, 651, 630, 596, 574, 568, 567, 552, 522, 492, 474, 467, 456, 434, 412, 406, 417, 435, 451, 464, 477, 494, 516, 539, 548, 536, 517, 504, 497, 482, 462, 448, 441, 425, 397, 376, 379, 398, 410, 410, 406, 399, 389, 385, 398, 425, 447, 457, 459, 462, 465, 473, 488, 508, 521, 525, 527, 527, 516, 492, 478, 487, 507, 509, 489, 466, 459, 469, 487, 504, 512, 509, 504, 507, 512, 501, 466, 426, 406, 409, 419, 427, 438, 456, 481, 505, 523, 524, 504, 475, 465, 484, 514, 529, 530, 534, 545, 547, 529, 502, 478, 453, 428, 419, 442, 481, 500, 484, 458, 454, 479, 510, 524, 522, 518, 522, 531, 539, 541, 541, 540, 536, 532, 539, 560, 582, 590, 583, 567, 537, 485, 419, 368, 352, 357, 357, 338, 311, 297, 311, 347, 388, 415, 426, 436, 456, 485, 512, 533, 545, 535, 499, 448, 406, 383, 370, 360, 360, 376, 399, 413, 412, 408, 415, 430, 440, 435, 421, 415, 424, 444, 460, 465, 454, 425, 381, 337, 322, 346, 395, 441, 466, 468, 456, 447, 459, 499, 550, 582, 584, 565, 542, 516, 482, 446, 423, 417, 417, 405, 381, 357, 345, 346, 360, 383, 414, 443, 462, 472, 479, 484, 482, 466, 441, 419, 407, 401, 395, 385, 374, 369, 370, 374, 379, 387, 394, 387, 363, 339, 342, 372, 404, 418, 424, 443, 471, 484, 467, 432, 399, 382, 386, 404, 426, 439, 447, 460, 487, 516, 532, 531, 522, 508, 490, 476, 477, 501, 531, 544, 532, 507, 493, 502, 521, 526, 507, 479, 458, 455, 467, 488, 506, 500, 462, 413, 393, 423, 477, 511, 509, 491, 485, 492, 495, 478, 446, 415, 396, 385, 379, 385, 407, 432, 438, 425, 422, 452, 497, 521, 509, 483, 464, 452, 439, 424, 410, 390, 362, 335, 318, 309, 302, 306, 330, 370, 404, 415, 404, 378, 345, 313, 296, 292, 287, 270]
4388B70j6OL5N8O9O5M0Rq%Rkk5l2j6kmk2l9m6l7j1K3M2L1J0PK2L0J2j6k8k5k1k2j9mRRnk0
4370C36k1qRK1K8L0K8J7NLJ6K6J1j9l6j8J4L3L5L0K4J3knNJ2jk3l9l6k1oMLlj0j5j1mjpk1
4352C96k3mJ9K8J8JnKJ9M0N0M7L4K4Rj1l1l5l1l3m4m1j2J9L2K9K9K9J6lj2j4j7k3j8jPmj9
4335D67j8jJ4J5Lj3j4KJ1kl4m3j7J5K3RmjRJ5J2QMMPKj8l7l3nK0J5j0k9l3k0%K2L3K5J0J3
4317D26L6M8L0ok8l0k7l4l8l1k6k5k2pQJ2NOJ0QOJ8M0M3K3lj3j2rmRRrk8k7nROlmJQJ3J5J4
4298D12J2Oqk8l8k5KK1J8%j4j2MK1K5J1jopj1j5j0npj2rj%KK0M7N4K9j0l6l9k5LK7K6Kj8j7
4279C88ork0j6RL9N1M0J6lp%Moj2pLKjMJ5J9J3J1J6J9J1jj2k4l3l1j8mJklnj3k5l7m0l4j4
4260B78PK2K3J6Q%ooOK0K8K4J5RLmj3j4rlnmJ1L7M6K4j4m0l8j5J5L1K0j4m2l9rJ9L1L7M0L7
$$ y = [270, 254, 260, 295, 353, 422, 487, 527, 536, 528, 528, 537, 535, 510, 478, 462, 460, 456, 434, 395, 349, 312, 301, 324, 366, 397, 407, 414, 436, 466, 478, 462, 434, 409, 388, 366, 347, 343, 352, 361, 356, 336, 315, 307, 316, 337, 365, 395, 423, 440, 445, 448, 464, 490, 501, 482, 446, 428, 442, 475, 510, 540, 564, 577, 575, 570, 575, 587, 586, 563, 524, 488, 467, 461, 465, 468, 465, 455, 440, 429, 425, 424, 417, 396, 373, 369, 388, 416, 434, 435, 430, 432, 451, 491, 541, 588, 622, 646, 655, 644, 613, 578, 547, 514, 470, 429, 417, 436, 468, 497, 526, 555, 571, 568, 556, 542, 525, 502, 484, 483, 490, 486, 467, 449, 448, 462, 477, 480, 467, 453, 455, 466, 464, 430, 387, 370, 385, 408, 417, 413, 412, 421, 436, 448, 456, 460, 464, 471, 473, 455, 418, 385, 380, 400, 415, 405, 376, 343, 323, 323, 345, 378, 403, 413, 426, 462, 510, 540, 534, 506, 476, 449, 415, 377, 346, 320, 295, 273, 266, 274, 286, 291, 297, 307, 315, 321, 339, 379, 422, 445, 442, 429, 417, 408, 404, 413, 422, 413, 385, 358, 353, 362, 368, 365, 361, 362, 370, 383, 398, 412, 424, 430, 422, 394, 356, 331, 333, 354, 372, 372, 358, 346, 350, 371, 396, 407, 406, 400, 393, 382, 367, 357, 352, 345, 333, 324, 323, 323, 325, 345, 392, 446, 475, 465, 429, 390, 365, 368, 395, 421, 423, 405, 388, 382, 373, 353, 337, 346, 385, 436, 476, 492, 489, 482, 482, 486, 480, 468, 461, 464, 466, 465, 469, 484, 503, 516, 527, 543, 562, 573, 572, 560, 536, 503, 472, 454, 450, 451, 449, 446, 441, 428, 403, 366, 326, 292, 278, 285, 307, 330, 346, 354, 354, 348, 342, 348, 368, 396, 420, 435, 444, 447, 443, 430, 416, 407, 404, 399, 395, 406, 443, 489, 513, 499, 459, 421, 406, 421, 452, 472, 458, 416, 377, 368, 387, 418, 455, 495, 532]
4242E32J7krooolOJ1QKmj3k4k5j4kKnj0j5k7m3m6j9K4N3N2L8K4J3mj8j4JNrk5k1ML1M4L1n
4223E23m5o3n2k4LJ9K4K0J4J5J8J2mj6rPJ6J3Mjpj2j5j5j3oQJ7J4OQJ8K5J3j1l4l9k3NK8L4
4205D75K9J8jk8m5l6rJ1J1LjKPJ4J8J4QOJ6K0Mj8k9k4j4rj2k1k7j8J0L9M4K3krPK7L3J9kk1
4187E32l2l0j9rqj1jK5M9M6J8nmPRjojNPJ0J2Nj1l0l7l1j5LK0K5J2j4l5l6j8LJ9K8L1K4J1
4168E47Joj4l0m3m2j8J2L1K7Qj2k1j5NL1M6L7J1qoRJ2MKJ4K1Pj6l0l1k8k5k3k0j6j0KNmj1
4151D03mJ3J8Qj1k4k6j3RK4J4k%K7M4L6J2mj3j6j0OJ4Lj2j3JJ2J7J9J4LojRQnj8k4k5k9l5
4132D23m0l2qK2L3J6rj6oJ1K7L4K7Prp%mj2oJ0J9J4J0J1J0mk1l2l0j0K4N1M4J0k5l1j7jRP
4115D99rk5k2KK3K1Nrk3l4k9mJ7J6NJ0K5K7Oj3j2mjrj6k0j5kJ1J1jrlJ2K1J9J2jj5k9l4l0
$$ y = [532, 549, 547, 538, 532, 526, 520, 517, 523, 534, 542, 544, 540, 527, 503, 478, 464, 462, 464, 459, 449, 434, 407, 364, 318, 299, 323, 376, 428, 466, 490, 503, 499, 481, 467, 468, 473, 464, 439, 418, 422, 453, 497, 528, 523, 478, 415, 363, 339, 342, 361, 385, 405, 419, 434, 452, 464, 460, 444, 435, 442, 458, 471, 475, 474, 467, 455, 440, 425, 412, 406, 414, 431, 445, 451, 459, 477, 502, 515, 504, 470, 431, 408, 413, 441, 475, 504, 522, 521, 493, 448, 412, 403, 414, 425, 428, 427, 429, 436, 450, 468, 482, 490, 496, 512, 532, 536, 518, 489, 465, 451, 442, 430, 409, 382, 364, 374, 413, 457, 480, 478, 469, 476, 503, 536, 555, 553, 532, 500, 470, 451, 442, 434, 423, 422, 447, 496, 542, 560, 555, 551, 558, 567, 566, 560, 559, 564, 571, 581, 593, 598, 587, 557, 520, 489, 474, 477, 497, 522, 534, 520, 485, 449, 431, 434, 453, 481, 512, 536, 547, 548, 542, 528, 498, 455, 413, 395, 407, 438, 465, 473, 461, 440, 425, 430, 461, 507, 544, 555, 547, 541, 550, 562, 566, 568, 582, 603, 610, 594, 564, 533, 505, 480, 457, 437, 421, 411, 413, 418, 414, 403, 399, 412, 430, 438, 427, 403, 377, 364, 373, 397, 411, 409, 409, 436, 480, 516, 528, 524, 511, 495, 485, 491, 505, 508, 496, 483, 484, 496, 513, 532, 546, 549, 543, 542, 551, 559, 554, 536, 512, 487, 458, 423, 383, 351, 343, 365, 398, 414, 405, 389, 383, 394, 421, 455, 482, 489, 480, 473, 473, 469, 457, 451, 461, 480, 494, 504, 515, 525, 521, 500, 468, 438, 428, 452, 503, 547, 557, 532, 501, 484, 483, 492, 499, 490, 465, 443, 445, 468, 489, 494, 485, 462, 428, 399, 395, 412, 428, 433, 443, 468, 495, 501, 488, 476, 472, 471, 462, 446, 426, 411, 409, 420, 431, 430, 421, 418, 430, 451, 470, 482, 481, 466, 437, 403, 373]
4096C73j9mJ4K9L7L0J9Lj1k8l6l1j4OJ5J4PmrKK6M0K7jj5lJ2J5J2J0jk5m5l5kK1K2J2Mlj8
4079D46k8k2LL1M5L9K0JjJ4L2L0Kl5n2m4k2j2j8k3j1PJ3Kr%J6J7j2m2m6j6J7K3PoJK0L4L1
4061D52K1J3J1J0Kj3k3k3k0k1j3J1L7L3Lk6k4oM%%RJ7J6Mj1j9j4ooqjJ1J4Mpj2j5k4k1oQP
4043C68lnJQJ7L0L5J8j0k5j8lJ0K3L1K3J0RJ9K5J7Mrk8m0l2qN%j2j5j0QL9O3N2Ol7n0m4l1
4025D41j8KJ3J1NLlj6j7kJk1m7m1j3J3K3L1L5L1J8Qkj8k7k0oJJJ4L1L9L7M6N9M7Pl4m8m2l6
4007E06l2j4J5L9M4L0Prj5j5k2l9n3n4l6j0J5K9L0L0L1L2L1L3L1J4j4k9k0mpj9j9mMK%Mpl5
3990D70n1l8oJ9L0L3L1K2J4J0Mnj1kJ5K0Lk0l0j7J1L1L6K6J5POJ5L5N2N8N7N0L9L1N0R1J22
3973A223J44J93K92M00M88O11P84Q42N55o8o91r68q68o27m44l31k33j49r9p2n3n3p6r0p5m6
$$ y = [373, 354, 350, 364, 393, 430, 460, 479, 482, 471, 443, 407, 376, 362, 368, 383, 397, 404, 400, 391, 393, 419, 459, 486, 485, 470, 467, 479, 494, 506, 516, 515, 490, 445, 410, 408, 429, 451, 463, 467, 464, 446, 418, 396, 399, 430, 475, 514, 534, 535, 534, 548, 580, 610, 612, 577, 525, 481, 459, 447, 429, 406, 395, 402, 415, 417, 408, 408, 424, 441, 429, 387, 341, 325, 342, 365, 372, 366, 367, 387, 421, 452, 473, 486, 497, 507, 509, 496, 473, 450, 430, 409, 396, 407, 444, 477, 480, 454, 430, 424, 428, 428, 428, 437, 454, 470, 474, 463, 444, 430, 424, 418, 410, 409, 420, 434, 438, 431, 419, 404, 380, 359, 353, 361, 368, 365, 360, 361, 369, 386, 416, 451, 469, 459, 434, 416, 413, 423, 446, 477, 500, 510, 519, 538, 563, 580, 584, 575, 547, 507, 475, 467, 472, 472, 460, 445, 435, 443, 482, 545, 597, 603, 566, 516, 472, 441, 423, 425, 438, 449, 454, 457, 454, 438, 421, 419, 420, 399, 352, 311, 298, 311, 334, 365, 400, 431, 449, 457, 455, 437, 410, 390, 384, 385, 386, 400, 431, 470, 507, 553, 612, 659, 666, 632, 584, 542, 506, 474, 460, 475, 514, 558, 588, 595, 586, 571, 556, 534, 495, 442, 388, 352, 342, 357, 386, 416, 446, 477, 509, 540, 573, 604, 618, 604, 575, 555, 551, 544, 525, 506, 502, 506, 508, 508, 512, 505, 470, 419, 381, 375, 394, 424, 457, 488, 510, 524, 534, 538, 533, 522, 520, 535, 555, 558, 538, 508, 491, 502, 533, 569, 595, 610, 617, 623, 638, 673, 725, 783, 840, 890, 929, 960, 1010, 1101, 1223, 1367, 1560, 1852, 2252, 2740, 3351, 4135, 4977, 5532, 5464, 4773, 3805, 2937, 2310, 1866, 1535, 1302, 1153, 1054, 982, 929, 876, 800, 710, 635, 589]
3962E89l0j9%J0Kj2j1k%kmqk2l7l6k5j1NJ9K1R%QK0J9Lj4k4k7j3J2L3K4ol3l5j5J6M2M8L3
3944E27J0kmpj2j3j4k5l9l4nJ8J8ORK3K7J1kQK5K4%k5k8rJ0J6RMJ2K6K9J2ornrk5k5nJ1kk9
3925E01l7j7LJ3J9K2J2j2k6j0J5J7pl0l2j9n%oj4j7%K3L1J6oqNK0J6lk3l1l0k4j7kK2M7O2
3908D68M8Ql5n2l4kMj6l8l7k2rMK5M9N4L3Mj1j2onqj0oKJ2K3L5M3L9K2jj3j6j6j9j9rJ2K7
3890E16K7Qj2k3k5k4k1j2kOOKnk0l2k9nK7M3M1K9J4JkRK1J8Mrj2j2j6k1k0j7j3rkJjrj4j4
3871C92j2j5k0j6%J9K7K3K4L2L0J1j6l0l6l7l2pK8M6L5J1JRJ7Rrk3k4j8j5j0MK2J8j3m4m2
3855C39j4OJ0QJ1J0QK5N5O4L0j9m5m2l2k2pRJ3PjprnRK2J8jj1LK5L0J2j2j9pJ3K3J5NOJ6K1
3836E60J0j5m0n1l8j0RQmkQJ3QMMKrj9j4%J0J0Kqj2q%nk0k9j9kJ1J0MmpkJ8L8M3K5lk3l3l1
$$ y = [589, 559, 540, 540, 550, 552, 540, 529, 527, 527, 525, 521, 513, 491, 454, 418, 393, 382, 387, 406, 427, 436, 436, 444, 464, 483, 486, 472, 448, 421, 408, 420, 453, 477, 471, 438, 403, 388, 404, 446, 494, 527, 537, 535, 531, 524, 512, 499, 485, 460, 421, 387, 382, 400, 418, 424, 433, 456, 483, 494, 492, 500, 525, 549, 549, 524, 496, 487, 497, 513, 522, 526, 538, 564, 593, 605, 599, 590, 585, 576, 551, 526, 521, 532, 530, 501, 464, 447, 450, 463, 482, 504, 516, 504, 478, 468, 483, 500, 493, 463, 431, 412, 407, 407, 401, 387, 370, 370, 393, 424, 440, 434, 426, 431, 451, 467, 464, 441, 410, 380, 356, 339, 337, 359, 406, 468, 516, 524, 489, 437, 403, 401, 405, 389, 351, 314, 292, 283, 287, 312, 361, 415, 448, 452, 441, 429, 423, 418, 410, 400, 394, 396, 408, 431, 466, 509, 548, 570, 569, 556, 540, 524, 505, 486, 477, 489, 516, 543, 551, 539, 516, 491, 467, 446, 434, 432, 438, 444, 446, 441, 421, 389, 360, 355, 382, 425, 466, 495, 509, 510, 508, 517, 538, 556, 560, 551, 539, 527, 511, 490, 470, 453, 440, 431, 429, 430, 429, 420, 406, 392, 380, 365, 345, 329, 329, 348, 375, 398, 422, 454, 484, 495, 479, 449, 413, 376, 344, 337, 365, 411, 446, 457, 458, 467, 484, 493, 484, 461, 437, 419, 404, 394, 398, 420, 438, 425, 381, 339, 325, 331, 341, 349, 360, 370, 378, 403, 458, 522, 552, 533, 488, 446, 414, 392, 385, 394, 407, 414, 413, 406, 397, 392, 401, 423, 441, 440, 429, 432, 457, 487, 499, 487, 468, 461, 474, 497, 512, 517, 523, 539, 560, 570, 555, 515, 464, 426, 416, 425, 433, 429, 427, 435, 448, 456, 460, 464, 466, 457, 438, 424, 424, 434, 444, 446, 438, 426, 418, 418, 413, 393, 364, 345, 343, 354, 364, 368, 364, 357, 355, 373, 411, 454, 479, 476, 453, 420, 389]
3816C89j7OK7K7Qj6k1j0PJ5K2L0L6K7Kk1k2jK2K6Kk9m4l3jK6K8Ok3l8l1j9j5j4KK9M9M6L0
3799E07J9J4LmJQ%k2l4j7PJ3OMQQ%noj5k8l1j7%OJlJNMjmlPJ5J4Jj2j5mPJ1QNKjnj6l0l6k7
3777C49mJ9K9K6K1K0J7J0kj0j4j0mkj1k3k4rLOJ0L1N5N5K2j4j9ljk2m4l7rJ3J6J1J2J6J7J5
3760E11J7J3lk4l3k4j6j7j7j1lJJ4M1N8L9rm0l1lJ1JrmJ5L1L2J4j2l5n1o2o7n8l8j9j6j9j4
3743A63KK2L1L0K0J1QQJ0J8L3M8M8K9QJKpk3k7j6NJ5J0klJ4L7L8J2k0k7j3NJ3J1Mqj8j9j7
3725D56j5j1mJJLPJj8k8oK4K4j4m3m1k0o%QJ1LKK1M1L7J2j1j0OK3K9J8mk0k1j6j3pJ0J6Jk4
3707D23k6pJ2J3QLmk1l2k0J0L5L3Ok1k7qJ2J2NRK3K6J2JJM%%QQlj5j7k1l2m2l5j5%PNmj5j0
3687C01J7N2O1M1J3JNJ7J9Kk1k9k0j0j7l1k4lOpk3k6k1j9j6pLJ0J0RRNOPjj2j0J5M0M7L3K1
$$ y = [389, 372, 378, 405, 432, 440, 424, 403, 393, 400, 415, 437, 467, 503, 530, 532, 511, 489, 488, 510, 536, 538, 509, 465, 432, 431, 457, 485, 491, 468, 430, 399, 380, 365, 351, 353, 382, 431, 477, 507, 526, 540, 543, 539, 540, 548, 548, 526, 492, 475, 482, 495, 501, 505, 513, 521, 521, 516, 510, 495, 467, 436, 419, 419, 425, 426, 423, 424, 429, 433, 432, 428, 425, 432, 447, 461, 462, 450, 435, 431, 438, 449, 457, 462, 464, 463, 458, 442, 412, 376, 349, 345, 364, 393, 419, 440, 460, 477, 487, 485, 475, 461, 451, 447, 445, 434, 411, 387, 378, 381, 387, 397, 428, 483, 538, 560, 546, 527, 524, 523, 501, 457, 420, 411, 424, 440, 451, 463, 479, 496, 511, 528, 541, 538, 514, 481, 457, 441, 424, 407, 396, 393, 394, 408, 449, 507, 546, 537, 497, 466, 463, 474, 475, 466, 462, 477, 508, 540, 554, 542, 507, 456, 394, 327, 269, 231, 212, 196, 177, 163, 165, 187, 218, 248, 268, 279, 287, 295, 305, 323, 356, 404, 452, 481, 489, 490, 492, 485, 462, 435, 419, 424, 439, 449, 447, 444, 458, 495, 533, 545, 525, 498, 485, 490, 503, 514, 518, 510, 492, 473, 456, 441, 430, 426, 427, 428, 431, 438, 439, 421, 393, 387, 411, 435, 421, 378, 337, 317, 311, 311, 319, 330, 333, 335, 356, 397, 434, 446, 435, 425, 431, 454, 483, 501, 497, 477, 456, 440, 427, 420, 430, 446, 447, 423, 397, 390, 402, 415, 423, 426, 422, 401, 369, 349, 359, 394, 427, 433, 412, 385, 377, 389, 401, 406, 415, 438, 464, 476, 477, 478, 482, 482, 482, 490, 498, 495, 480, 463, 442, 410, 368, 333, 318, 318, 325, 330, 326, 311, 301, 318, 370, 431, 472, 485, 486, 491, 508, 527, 529, 508, 479, 459, 449, 432, 401, 377, 374, 380, 373, 350, 324, 303, 284, 268, 261, 264, 274, 284, 293, 302, 307, 313, 320, 319, 307, 297, 312, 352, 399, 432, 453]
3669D53J6Ppj2LK4K6Lk1k5j2jJNK4L8K4j0l5l3k0j8j9j0OJ2Onrr%J1Qj2l0k5nQPRJ7J5kj1
3650C92qmpML3N6M5J6kpk0m2l9nK8K7Lj6k3k6k1ML6M4K0j0j4JJ6J2ok3l2l3l4l3k4JK6L3K3
3632C91J1J3J8J3MPJ8J4ql3l5j8JRQOKlol%LKJQK0K8K0Jj5j4qj1k0j5LK3K7J9J0J4K6L3K2
3613E86qm0n3m0k2j2j0nKRJ5K0K2K2J7J1mk7l9k7mKqj3LK2K0MokPPJ0J6J6Lj9l2k7j5ponM
3594C87J8K1Oj0oJ3K7J4j0k4j9j0qj1jK0L2K4Jj4kK5L8K3j0l5l5j8nkJRK2K6J7QRK0K4Rj6
3576E58l0k1nMNOOOJJMlk0l5l0oK2L6L3J6j%J4K0Lk1k1%J7Roolj5l5l5j2J2J7Pnk0l1k9qJ3
3556D12J4kj4pOJ3J2Kj4l3l8j6J7L3K3lk2k2oK0M3M8K5qk6j9lLj3l4m8l9j4J0K0J2LPJ5K1
3539C78K2J8Nj5k0mK3L4K9K7M0M4L1J0%j0l4o1o5l1J0K9K0LpmPJ9K4J9Nj7l9m7l9k1pqj3j8
$$ y = [453, 469, 476, 469, 457, 460, 484, 510, 513, 492, 467, 455, 454, 455, 460, 484, 522, 546, 536, 501, 468, 448, 430, 411, 401, 407, 419, 425, 420, 411, 402, 402, 413, 421, 409, 379, 354, 349, 357, 364, 373, 390, 405, 403, 392, 384, 380, 373, 377, 410, 466, 511, 527, 525, 518, 498, 456, 417, 412, 440, 467, 470, 454, 431, 405, 384, 388, 424, 468, 488, 478, 464, 465, 481, 493, 487, 464, 432, 399, 365, 332, 308, 309, 335, 368, 391, 402, 415, 433, 446, 450, 457, 475, 489, 481, 448, 413, 395, 396, 405, 413, 419, 421, 418, 412, 409, 409, 412, 414, 415, 423, 443, 471, 491, 492, 477, 463, 455, 444, 424, 409, 412, 435, 462, 481, 491, 505, 531, 564, 586, 578, 538, 485, 445, 423, 411, 401, 396, 398, 407, 422, 442, 464, 486, 503, 514, 510, 483, 444, 417, 413, 415, 407, 394, 397, 419, 439, 443, 437, 435, 442, 449, 459, 475, 491, 494, 475, 443, 416, 401, 394, 388, 383, 387, 405, 426, 432, 422, 416, 429, 456, 470, 460, 436, 417, 407, 399, 388, 387, 407, 439, 463, 464, 450, 448, 473, 511, 534, 524, 489, 454, 436, 431, 429, 430, 439, 461, 487, 504, 512, 521, 541, 565, 574, 558, 528, 507, 502, 506, 511, 517, 523, 529, 530, 531, 535, 532, 512, 477, 447, 441, 463, 499, 532, 548, 547, 547, 561, 581, 584, 563, 542, 542, 559, 568, 562, 556, 553, 538, 503, 468, 456, 468, 485, 492, 487, 467, 436, 407, 399, 412, 426, 424, 410, 403, 409, 422, 434, 436, 422, 389, 351, 335, 352, 385, 408, 405, 383, 361, 355, 375, 418, 466, 491, 483, 457, 438, 435, 438, 425, 391, 343, 304, 290, 300, 320, 332, 335, 342, 357, 378, 400, 418, 423, 408, 388, 384, 407, 441, 470, 497, 537, 581, 612, 622, 622, 612, 578, 517, 452, 421, 431, 460, 480, 483, 476, 472, 479, 498, 522, 541, 546, 529, 490, 443, 404, 383, 376, 368, 355, 337]
3522C37j2QK7L2J4poJ7L7L4J2opJOmk7m2l7j4joj0OL5N0L9K7L5N1M3Mm5p6p7n7l2oJ3K6L7
3504D19M3M0K9J8Rlj7k5j9oJMJ2J7Pj5k2j0%rk7k7j2molJ0J9J6O%npkPPlj1pOK1L3L3J5j7
3484E15l6k8pQJ2J7K1J1oj2ooj9l6l7k0LJ6J0qj7mJ6K3J2MJ3K2J5mj8k0j5qlJ%JMPKrj9j6
3465C79pLJ2J8K0J9J8J4Lj5k7k0LK0J5mj3mRJ7J8J7J3O%jrk8l9k1J8M5L6Nk3l5l6l3k7j6L
3447C53K4L4K2qk9k3mJj0k1j8mJ0K3L0L5L7L0J2j4k4rJ9L5L0J4jj4k7l4k7j2kkj2j8j8j1p
3431C60njOQOOJ3K3K9K8K4K1J7J5K1K3J4mk3l0k9k6k1j6j4j2rmmjJ4L4M1K9Mj6k5k6k5k4k1
3413D00pJ2K3J8Nj%oj3j0LP%jJ4K6J9Jnloj2oJ0J8J1%qj3j5j8j7j0kPJ1QMQJ0PJjkorjNrl1
3391D16l3qJ6J8J1RNqj6j0%LPK3L3J6j5k5qJ2J3O%pj6j8kJ6K3J9K6L9M5L2J2MOOnj9k3j6j2
$$ y = [337, 325, 333, 360, 392, 406, 399, 393, 410, 447, 481, 493, 487, 480, 481, 487, 483, 456, 414, 377, 363, 362, 356, 346, 352, 387, 437, 476, 503, 538, 589, 632, 636, 591, 515, 438, 381, 349, 343, 356, 382, 419, 462, 502, 531, 549, 558, 555, 538, 513, 494, 488, 489, 493, 505, 522, 529, 514, 492, 482, 482, 473, 446, 419, 407, 403, 397, 394, 404, 423, 439, 445, 445, 440, 433, 431, 438, 445, 442, 431, 424, 430, 451, 484, 517, 532, 515, 479, 451, 444, 452, 464, 481, 502, 513, 507, 495, 489, 483, 464, 428, 391, 371, 374, 390, 400, 392, 375, 371, 387, 410, 422, 426, 439, 461, 476, 472, 454, 434, 419, 411, 408, 409, 409, 410, 414, 421, 423, 414, 395, 379, 372, 375, 387, 405, 425, 444, 462, 476, 479, 464, 437, 417, 420, 440, 455, 451, 438, 434, 443, 460, 478, 495, 508, 514, 514, 513, 504, 476, 437, 416, 434, 479, 515, 520, 497, 462, 426, 393, 366, 350, 353, 377, 411, 433, 425, 396, 373, 369, 370, 360, 339, 321, 317, 327, 350, 380, 415, 452, 482, 494, 480, 456, 447, 466, 501, 531, 545, 544, 530, 503, 469, 442, 430, 428, 426, 414, 396, 378, 367, 360, 355, 354, 360, 368, 374, 380, 393, 416, 445, 473, 497, 518, 535, 550, 571, 594, 608, 604, 581, 551, 522, 496, 475, 459, 445, 433, 424, 420, 416, 415, 429, 463, 504, 533, 537, 521, 496, 470, 445, 421, 400, 393, 405, 428, 446, 451, 450, 450, 444, 431, 421, 424, 431, 431, 430, 444, 470, 489, 490, 485, 482, 476, 464, 458, 468, 486, 497, 497, 489, 476, 461, 443, 426, 416, 414, 421, 432, 440, 444, 452, 462, 469, 470, 469, 467, 461, 452, 451, 456, 447, 416, 383, 375, 391, 409, 420, 429, 434, 426, 410, 400, 400, 403, 410, 433, 466, 482, 467, 442, 434, 446, 459, 465, 465, 458, 442, 424, 422, 438, 461, 480, 506, 545, 590, 622, 634, 638, 644, 650, 645, 626, 603, 587, 575]
3372E75j5k3k3j9j0kPJ3J3QJj1k1j8%K2K0KnJ8M5M4J4j4k3k0j6j0LJ2Pornlj2k1k2j7j1nL
3354D66J0Kj2k2j5NJ9K3J7MqrPK5K5%k4k4pNJlMJ1Prk0k3k5j9%L1M6L0kk2k4k1k3k3j3KJ6
3336D08K8L7L7K9J6Mj7l9m4k1QK1J4PRjk7m5l1QL3K7Nqj1j6k1k0j1oj3k3k2j0KJ2K7M7N5L5
3318D83jk5l3l7m0k4J7N6O0M3K9K0ll9n4k5K1M3L7K7K8K8J6mk5m3n6n1k4J3L4K7Jk2l4l5k7
3302C81j5%QOkrpllpplJ1K7L5K4mk8k5mJ2Kk2k7jL3L6Pk6k3J0L7L0Mj1nMKqj5j9j8j3j1j6
3283C37k0rJ3K9K6J7J3J5J3J0Pmk2l2j8J2L1K7J0nj5j9j9j4plLJ3J9K0K0K6K7K0J0NKpj5k0
3265D96j6qRK5K5Mk3l0j8qqqMJ8K5K5K0Mk4m1l2lJ2jj6rJ1J6Jj2jK2K9J5mj6k3k7k6j6nKJ
3247C89NJ7K7K9K7J9J0pk7m0m1l6l4l7l6k1NL0M4M0K5Ol%Njj9l1k4rJLNJ1J4RMkj1k2k5j3
$$ y = [575, 560, 537, 514, 495, 485, 483, 490, 503, 516, 524, 525, 514, 493, 475, 475, 497, 517, 519, 514, 532, 577, 621, 635, 621, 598, 578, 562, 552, 555, 567, 574, 568, 559, 554, 551, 539, 518, 496, 479, 468, 463, 466, 476, 478, 466, 444, 429, 434, 453, 476, 493, 497, 489, 480, 487, 512, 537, 537, 513, 489, 482, 487, 488, 485, 489, 500, 507, 498, 478, 455, 430, 411, 411, 442, 488, 518, 516, 494, 470, 449, 426, 403, 390, 392, 408, 436, 473, 510, 539, 555, 559, 542, 503, 459, 438, 446, 467, 481, 488, 497, 496, 469, 424, 393, 401, 434, 461, 466, 458, 447, 431, 410, 390, 379, 373, 360, 337, 315, 305, 307, 319, 346, 393, 448, 483, 482, 457, 424, 387, 347, 323, 340, 396, 456, 499, 528, 548, 545, 506, 452, 427, 448, 491, 528, 555, 583, 611, 627, 623, 598, 555, 499, 448, 424, 437, 471, 498, 499, 477, 443, 408, 381, 366, 366, 374, 380, 378, 369, 362, 359, 356, 349, 342, 339, 350, 377, 412, 436, 432, 404, 379, 375, 387, 389, 367, 340, 339, 372, 408, 415, 389, 366, 376, 413, 443, 447, 436, 431, 435, 437, 429, 414, 395, 377, 364, 353, 337, 317, 308, 321, 350, 376, 393, 406, 421, 434, 444, 451, 447, 425, 393, 375, 387, 418, 445, 455, 450, 435, 416, 397, 383, 376, 373, 376, 389, 408, 428, 448, 474, 501, 521, 531, 536, 538, 531, 516, 496, 480, 472, 481, 506, 531, 535, 512, 482, 464, 456, 448, 440, 444, 462, 487, 512, 532, 536, 512, 471, 439, 436, 448, 447, 431, 422, 433, 449, 450, 438, 437, 459, 488, 503, 499, 483, 460, 433, 407, 391, 386, 388, 389, 394, 411, 438, 467, 494, 513, 523, 516, 489, 449, 408, 372, 338, 301, 265, 244, 249, 279, 323, 363, 388, 394, 391, 391, 396, 395, 376, 345, 321, 312, 313, 316, 321, 332, 346, 355, 359, 357, 346, 324, 299, 286]
3229B86PK5L3K5Nj9k9j7OK6L3K5Pj3k1j3LJ8K9L0J6pk4k3j4qpMJ8K2J2LRJ9J1j0k5j9lL%m
3210D19mnj2j8j9j0QL0M0K8jk1j8mJj0k3k7l0l1j8J0L4L4J7MQK1K8K3Qj1k3j9nLNRK5L8L2
3193E16J5MMjj9m1m2k2LJ7K3L0L7K9Jk8l3j3RJ5Jj7k5j7LK7L7K0j1l5l1kK5L3J9ok2k7k2j7
3175D37j3j1rlJ1K3K1Kk1l4k5jK0K3Qj4l0k8j4LJ1P%JJ3K3J9RNRLj8l7l2j0PQKPK5L9L5J6
3157D87mj0pj2k6l1j7NJ9L0M5N3M1J3omkj5m4o6o2l4LK7L0K3J7J4Kj6k3nJ4J5Lmnqj5j2JO
3138D20NJ5L8N0L0KnJ4K4Qj6k1lJ4Rk5o4p9n3pK2K0NKJ0J2jj3nJ7L0J8pk3j7lmj8j9ML2M0
3120D58K6J1jj4k5k3qMMRK9M4L8J7LPJ3J3Q%k0m3m9l1j6k3l9l6j0J8K9K5K2J7J2Kj1k2k6j6
3103C96mkj3k1j0RK7L1K7J4jlOJ5Qj4l6m0k7nJ9L6L6K0%j8k5k4j5okljPJ4J6Oj0k4k8j8KJ9
$$ y = [286, 293, 318, 351, 376, 381, 362, 333, 316, 322, 348, 381, 406, 413, 400, 379, 366, 369, 387, 416, 446, 462, 455, 431, 408, 394, 386, 379, 383, 401, 423, 435, 438, 447, 466, 477, 467, 442, 423, 420, 423, 423, 419, 415, 410, 398, 380, 361, 351, 359, 389, 429, 457, 456, 435, 417, 413, 414, 404, 381, 354, 324, 293, 275, 285, 319, 353, 370, 374, 382, 403, 431, 454, 462, 451, 428, 409, 404, 407, 412, 421, 446, 484, 516, 531, 535, 539, 538, 519, 478, 436, 414, 417, 434, 457, 487, 524, 553, 554, 526, 493, 480, 489, 504, 505, 488, 463, 446, 449, 476, 513, 533, 522, 487, 456, 454, 479, 512, 531, 525, 503, 476, 454, 437, 424, 413, 404, 401, 412, 435, 456, 458, 437, 403, 378, 377, 397, 420, 428, 414, 384, 356, 342, 345, 356, 363, 363, 364, 377, 400, 419, 428, 433, 442, 445, 427, 390, 358, 348, 355, 363, 365, 372, 397, 436, 471, 487, 483, 473, 466, 454, 428, 397, 380, 385, 404, 434, 479, 532, 573, 586, 580, 576, 574, 559, 515, 449, 387, 353, 356, 383, 413, 436, 453, 467, 469, 453, 430, 425, 439, 454, 457, 453, 448, 440, 425, 413, 414, 420, 425, 440, 478, 528, 558, 560, 555, 569, 593, 601, 585, 564, 561, 575, 584, 559, 495, 416, 363, 356, 378, 398, 403, 405, 415, 427, 426, 413, 408, 425, 455, 473, 466, 443, 426, 423, 419, 401, 382, 386, 418, 458, 484, 495, 494, 480, 455, 432, 424, 428, 432, 441, 470, 514, 552, 569, 572, 579, 592, 605, 613, 613, 593, 550, 501, 470, 454, 431, 392, 356, 346, 364, 393, 418, 440, 457, 469, 471, 460, 438, 412, 396, 392, 390, 377, 356, 346, 355, 382, 413, 440, 454, 453, 450, 456, 471, 479, 465, 429, 389, 362, 357, 376, 412, 448, 468, 468, 450, 425, 401, 386, 380, 378, 375, 374, 381, 395, 411, 417, 407, 383, 355, 337, 339, 358]
3084C58K4K0J6J1Nj1k6l0j8KJ5J9J9K3L0L0K0J0MORKj7l5l8k3lOKmpojJ5L0L0Ok0j6J6M5M3
3066E61Qk9m3l6k5j5oJ0J8J2PK1L9L0ol1j9J0J5kr%Kj9l7l1lJ7K2J9J2M%PJ4Lk1m1m8m2l3
3048C35j5J2L1K9J2LJ3K8K8Mk2l2j5QK0J5J4K9N2N6L4%k1k4k1k2k0j2jMKmj2j6j0LNmj5j1
3031D60LPjrj2j1lJ1K3J8MkJ2J9Nk0l7l7l1k4j6qprnJNJnlJ1L0M1L0J1NK4M0L3J0oj6l1m7
3012D64m2j8NRJ1K3L3K3lk5k6j3%ON%moj1j6k0k0j7oJ1K2J5KlJmj8j6JJ2kj7oJ8K3J0%LMn
2992D03pKOqk6k3JK9M0L0J6QJ6K4K1J3RMj2k7l1k1j6k0k1j8k2l3k9nJ5J0mML0L8J9jlRJ4J0
2974D44NJmqqj3j8j8pOMj4k8k6j4mNJ7K9L1K1J3J4J7Qj2k2j1RJ9J3MJLkqmJ4K5J8%pjO%j2
2954D86j8j4j1j3j9k3j9mJ3K2J9Q%j2k4k5nJ3J4%njmj4j4%Kj8l6k6LK6L2K7J8Mpljj3l0k7
$$ y = [358, 382, 402, 418, 429, 434, 423, 397, 367, 349, 351, 366, 385, 404, 427, 457, 487, 507, 517, 521, 527, 536, 538, 521, 486, 448, 425, 422, 428, 430, 426, 419, 413, 412, 427, 457, 487, 493, 473, 457, 473, 518, 561, 569, 540, 497, 461, 436, 421, 415, 425, 443, 455, 462, 483, 522, 552, 546, 515, 496, 506, 521, 519, 510, 510, 512, 493, 456, 425, 422, 439, 461, 480, 492, 496, 496, 503, 517, 520, 499, 458, 410, 368, 335, 320, 332, 363, 392, 404, 407, 420, 448, 476, 480, 458, 426, 411, 419, 439, 454, 468, 497, 549, 605, 639, 639, 618, 594, 573, 551, 531, 519, 518, 522, 524, 520, 508, 492, 482, 485, 490, 486, 471, 460, 463, 470, 469, 460, 448, 437, 434, 445, 468, 486, 490, 488, 500, 519, 524, 504, 467, 430, 399, 375, 359, 351, 344, 335, 330, 331, 336, 337, 332, 329, 340, 370, 411, 441, 452, 457, 481, 521, 554, 564, 558, 542, 511, 464, 422, 404, 409, 418, 429, 452, 485, 508, 505, 480, 454, 441, 441, 447, 452, 452, 448, 442, 431, 415, 395, 375, 358, 352, 363, 385, 400, 402, 399, 400, 396, 378, 362, 363, 375, 373, 356, 350, 368, 391, 401, 401, 404, 408, 403, 396, 398, 404, 396, 370, 347, 348, 377, 417, 447, 463, 471, 487, 511, 532, 545, 554, 558, 546, 519, 488, 467, 451, 431, 410, 392, 370, 337, 308, 303, 318, 328, 324, 328, 358, 396, 415, 414, 411, 420, 434, 444, 449, 450, 446, 438, 430, 417, 399, 381, 374, 380, 384, 370, 342, 316, 302, 298, 303, 320, 349, 380, 401, 414, 428, 445, 453, 441, 419, 408, 417, 436, 449, 453, 454, 457, 455, 447, 443, 457, 482, 500, 500, 493, 492, 498, 498, 486, 468, 454, 443, 430, 411, 388, 369, 365, 378, 400, 419, 427, 427, 415, 391, 366, 361, 374, 388, 388, 383, 382, 378, 364, 350, 350, 352, 334, 298, 272, 275, 301, 333, 360, 378, 382, 375, 372, 371, 358, 328, 301]
2936C01kJ6J3LLMnj9j8jJ9L5M0K9Mj3nJ7L3L1K2J5J1RJ3J2ll0m5m3l4k9k6j2KMpj6j4mQK0
2918C38K8K4J7J8K6K4jk7l0j2kqj7j6j0j1j5kK3L9L1Oj2j5oKLMMPPMkj2k3l1k5nJ6K8L0K7
2900D24K6J9QKLNkj1qNJ1jk3l7l1j2KJplJ7L0J8j6l3k0KNj2j9nJ3K0K0K3K2Nj3pJ4J8ol5l5
2880C77j0RMk1m0m4k8kK3M2M8M8L8K2Kj2j3%K3L6K4lk0nK1K8Rj5j9nJ6K7K3Nj7l3m0m4m9m7
2863C58l3j0QJ3J0PJ4L3N2O2N3K8%k0l2l3k7j0RK4K2%k9m5l8k2rmKMnj4j3lMJkknj9k9k3k
2844B75J1QLJ2L0M4M2K5jk0k4j2OJ3Rlj1j0OL2M8M0J2j8l4l7l7l8l3j9jRRNJ1K1K4Nj9k5r
2827C49RJ1N%qk1l1k3pJkn%PJ3J9J8Oj1j4JJ6J8J6K4L3L0J7NOJ0Pnj3j5j4j6k0j6JJ7K2J4
2808D54QNlj8k7j8%J3J4RM%kMN%j0j0MK0J9Nj4k4k3j1KPNjlJJrk5k4KL7N2L1mk4j8lJ1J3R
$$ y = [301, 299, 315, 328, 331, 334, 338, 333, 314, 296, 295, 314, 349, 389, 418, 422, 409, 404, 421, 454, 485, 507, 522, 533, 542, 555, 567, 564, 534, 489, 446, 412, 383, 357, 345, 347, 351, 344, 328, 314, 310, 318, 338, 366, 390, 407, 425, 451, 475, 474, 447, 417, 405, 403, 395, 378, 362, 352, 341, 326, 324, 347, 386, 417, 423, 411, 396, 390, 392, 395, 399, 403, 410, 417, 421, 419, 407, 384, 353, 328, 323, 339, 367, 397, 424, 450, 469, 477, 479, 482, 487, 485, 474, 466, 471, 482, 481, 458, 421, 390, 378, 380, 381, 374, 371, 388, 418, 436, 420, 387, 367, 369, 374, 362, 343, 338, 351, 371, 391, 414, 436, 441, 428, 421, 435, 453, 447, 412, 377, 367, 376, 380, 359, 319, 275, 247, 245, 268, 310, 358, 406, 444, 466, 468, 456, 443, 443, 466, 502, 526, 523, 503, 498, 519, 547, 556, 541, 522, 517, 533, 560, 583, 588, 571, 538, 498, 454, 405, 358, 325, 315, 323, 336, 346, 353, 367, 400, 452, 514, 567, 595, 595, 575, 543, 510, 483, 473, 482, 506, 528, 528, 499, 454, 416, 394, 385, 381, 383, 387, 382, 368, 355, 352, 356, 357, 355, 353, 348, 329, 300, 277, 275, 286, 294, 297, 309, 339, 383, 425, 450, 449, 429, 405, 393, 399, 412, 421, 418, 407, 397, 403, 435, 483, 523, 535, 517, 483, 446, 409, 371, 338, 319, 318, 327, 336, 341, 352, 373, 397, 402, 383, 358, 349, 358, 369, 374, 374, 366, 345, 314, 291, 284, 285, 283, 278, 278, 285, 298, 317, 335, 341, 330, 316, 317, 333, 351, 367, 391, 424, 454, 471, 476, 482, 492, 499, 494, 481, 466, 452, 436, 416, 400, 401, 418, 440, 454, 462, 467, 464, 446, 419, 401, 401, 414, 428, 437, 441, 441, 439, 443, 448, 448, 438, 428, 432, 452, 471, 476, 462, 438, 415, 404, 406, 413, 418, 417, 414, 415, 416, 407, 382, 358, 360, 397, 449, 480, 476, 452, 434, 431, 442, 455, 464]
2788D64PJ6K5J6qk5k1ppk1k8k1j3j3qPJ9K0J1PJ1J4J6J5Oj0k1k0j2j0j2nK0M6N0K9%j4j0r
2770E04j9l3k6KK9L3J3mj1rrj3j6j5qKJ1Oj0k5k9k1rJJ4K9L5K1j1l6l9k4r%LPJ0J4J6J2LJ
2752C90J1K0J4lj0kKj3k9k3KK5L0K1J9K8L4K2ol0l3k5j5kK4M7M1Rj8j6%Kqj2rrj7k0j7oJ0
2734D28L7N8N7L2ll0m2l8k2j3k4m4m1j3J7J8mk5l4l2k2nJ6L0L4K3RkmJLOJ2K1K0Nj3pJ6L3
2717D58K4jj8j8j2j6k2j2RK7K5J1jml%RK0K1J4RJ1J8J8J5J2Mqj5j0krl1m2k7MK0Qj2j9rmj3
2698D29k6j7J0K7J5j2k7j8orj7j0J4L9M1K4%j7k8l1k1%J9K1J1KOJ5J2nk5l1j5PK3K9L3K8P
2681D97k6m5l7j5oj2j6j1%jj1k6l6l0nK2L4K6J5Lj2k5k3jK5M2N2N0L0lk8l0k0r%QKk0l2j5
2664C11J4K1ROJ6K2J2kj0j4j3LL0M1K3nj4njllKNMMKkjJ3K9K2j0m1m2j5J7L5L3J8mk1k4j9
$$ y = [464, 471, 487, 512, 528, 520, 495, 474, 467, 460, 439, 411, 390, 377, 364, 356, 363, 382, 402, 413, 420, 431, 445, 461, 476, 482, 472, 451, 431, 419, 409, 397, 392, 412, 458, 508, 537, 537, 523, 513, 504, 485, 452, 426, 428, 457, 490, 503, 499, 488, 479, 470, 457, 441, 426, 418, 420, 431, 437, 427, 402, 373, 352, 343, 344, 358, 387, 422, 443, 432, 396, 357, 333, 324, 324, 327, 334, 344, 358, 374, 386, 389, 390, 401, 421, 435, 432, 422, 420, 422, 409, 380, 357, 359, 384, 414, 435, 454, 482, 516, 538, 532, 502, 469, 444, 429, 427, 451, 498, 539, 548, 530, 514, 514, 516, 508, 496, 487, 478, 461, 441, 424, 418, 428, 465, 523, 580, 612, 609, 579, 537, 499, 477, 464, 440, 396, 355, 342, 359, 377, 373, 348, 314, 282, 260, 255, 271, 301, 335, 358, 367, 365, 361, 362, 365, 371, 383, 404, 424, 429, 416, 409, 425, 458, 482, 481, 463, 445, 433, 417, 395, 383, 392, 419, 444, 455, 454, 450, 447, 447, 456, 476, 497, 511, 520, 531, 549, 567, 582, 594, 598, 590, 575, 565, 563, 554, 523, 481, 454, 458, 478, 486, 474, 455, 446, 442, 429, 403, 386, 396, 423, 438, 426, 399, 381, 375, 366, 349, 339, 353, 392, 433, 457, 457, 440, 412, 381, 360, 360, 379, 400, 411, 413, 419, 434, 446, 441, 416, 385, 370, 377, 400, 429, 462, 490, 497, 471, 426, 389, 374, 368, 356, 340, 329, 329, 328, 317, 291, 255, 225, 220, 242, 276, 302, 317, 320, 308, 283, 260, 259, 284, 326, 378, 428, 458, 455, 427, 397, 377, 368, 368, 376, 378, 358, 326, 311, 325, 346, 355, 361, 377, 399, 411, 409, 399, 385, 372, 375, 405, 446, 469, 464, 450, 445, 444, 441, 438, 440, 445, 449, 453, 455, 453, 452, 465, 494, 516, 506, 465, 423, 408, 425, 460, 493, 511, 507, 486, 462, 443]
2645D43k0l0l2j4J2K3J6PRJ2Lj5k8k7j5kM%j1qRK6K1%rKRqk8k5JK2K3J3PJ0J6K2K0Nj1j7j9
2627D16k8m2m3k5%J2J7K7M2N0M5L3J9Lj1k3l2l4k6rQJ1OPJ3J3MkOJ8J4mj8k0j2%PNj6m0m5
2609C46j9J2K2RMJ5K7K2Jj3j3j1j2j3nPJ6J3QOMJjNJ1J2QRJ6J5lk5k8j1MLqj3j3j6k2k1j3
2590C36n%J2K2K1OnMK5M1M2L1Rk1m2l5j0Koj4nJ3J3rk7k4pPJ5K4L1K7Oj9l3k8nJ7K3J6OLL
2572D60LNOMqk1k7k7k4j9j3qnKJ6J8NqkJ7K4J9J5J7Rj0j5LK4J8mk0k3j8rJ1K4J5pj2PK6K6
2553D94J3JnqjQJk4m1l6k5l2m1k3J3K7Qj5j0J3J9PnJJ7K9L0K0Kj7l0k6j0LKpoJ7L9M2K4J1
2535D79RRok6k8pJ3J4NJRQj7m7n2k3J9M0L3J8Plj8l8m6l7j9lOPQJ3K3L7N1N5M5K9J5Plj8l0
2516E39l1k4k1k3j6NK0J5K%PQMOJ9J6j5m7n0k4prj5pOQPJ3J7Oj5k1lK0K7J7J0QKqj8j7rll
$$ y = [443, 423, 393, 361, 347, 359, 382, 398, 405, 414, 426, 429, 414, 386, 359, 344, 342, 346, 346, 335, 327, 336, 362, 383, 383, 374, 376, 385, 377, 349, 324, 325, 347, 370, 383, 390, 400, 416, 438, 458, 463, 452, 435, 416, 388, 346, 303, 278, 278, 290, 307, 334, 376, 426, 471, 504, 523, 526, 515, 492, 460, 426, 400, 391, 399, 410, 416, 423, 436, 449, 453, 451, 457, 475, 489, 485, 467, 447, 435, 435, 442, 447, 431, 391, 346, 327, 339, 361, 370, 374, 389, 416, 438, 439, 426, 413, 402, 390, 377, 372, 379, 395, 408, 416, 422, 426, 427, 426, 431, 442, 454, 462, 471, 487, 502, 499, 474, 446, 435, 439, 442, 434, 421, 408, 392, 370, 349, 336, 331, 331, 343, 365, 386, 392, 387, 391, 416, 457, 499, 530, 539, 518, 476, 441, 431, 433, 427, 413, 408, 421, 434, 425, 398, 374, 367, 374, 389, 413, 444, 471, 477, 458, 425, 397, 392, 409, 432, 448, 454, 457, 460, 463, 468, 474, 478, 470, 449, 422, 395, 371, 352, 339, 331, 326, 328, 344, 362, 367, 359, 357, 374, 398, 417, 432, 449, 458, 448, 433, 436, 460, 478, 474, 454, 431, 413, 404, 415, 439, 454, 447, 435, 442, 468, 494, 507, 508, 503, 495, 494, 502, 503, 479, 438, 402, 377, 345, 304, 281, 294, 321, 329, 314, 304, 317, 336, 343, 338, 339, 356, 385, 415, 435, 437, 420, 390, 364, 354, 357, 359, 352, 346, 363, 402, 444, 468, 479, 488, 497, 491, 465, 437, 430, 443, 457, 462, 463, 472, 480, 463, 416, 364, 341, 360, 400, 433, 451, 458, 455, 437, 399, 353, 316, 297, 294, 300, 307, 315, 328, 351, 388, 439, 494, 539, 568, 583, 590, 587, 569, 539, 508, 484, 463, 440, 424, 429, 449, 464, 466, 466, 473, 481, 485, 491, 510, 526, 511, 464, 414, 390, 383, 374, 359, 352, 358, 366, 373, 386, 403, 409, 394, 373, 370, 390, 417, 434, 444, 452, 454, 446, 428, 411, 402, 399, 396]
2497C96j5k2j4J1L1K4kk1j9rnLK3M2M0J6qj9k1k1j9j4mQK2L0K2OjQJ8J5PJ1J6Nk7n0l6KL0
2479D59L5K3J1ok6l7l0j0J0K3L5M6N0L7J7Jmj0k0k7l0l3m0m4l6k0nJ%jQK2K8J1j0j2RK5K2
2462D72J4K0K5Nl0m5k8nJMJ0J4KoKJ2J2LNJ0Jj7k1oRMj0j8j8j6j5oKMKPJ3J1%pmOJ1Lqj8r
2442C97J3L4K9ll7m8l6j7lNJ6J5Jj9j8NK5K3PnlMJ0J3J2OJNJ4J3KlQK1K4J5NLPJ2Rqk8l1j7
2422D78j0k7m4l7j0Nkj3j5j5k6k9oL4O8P5N4K0rj8kK0K6J5NJpk3l9l8k6j3orj4j5JK5L5K2
2405D31Konqj7j6ojoqjOLJRJ8J5%p%J1J3J0PPOOOkj2j6roj3k8l4k8j5lLMlj3j6rJ2K9L1J4
2384C56mqKJ1J3RLlmLJ7K4J7Ml%PJ2J1Kpqllj1j3j0oroLJ2J1Koj3j3jJ6J9kl1m5m3k7oK2M3
2363C34L8K0QJ3K4K6K2J9J8J6J8J7Pj6l3k9j2OJ5J1jk2l9m3l3j7lQK8N2O1M4Qj3j0%nj6rJ2
$$ y = [396, 381, 359, 345, 356, 387, 411, 409, 388, 369, 360, 355, 358, 381, 423, 463, 479, 471, 452, 431, 410, 391, 377, 373, 381, 403, 433, 455, 461, 460, 468, 486, 501, 508, 519, 535, 540, 513, 463, 427, 429, 459, 494, 517, 528, 522, 496, 459, 429, 419, 429, 452, 487, 533, 583, 620, 637, 638, 634, 624, 604, 577, 547, 514, 474, 430, 394, 374, 369, 370, 370, 369, 377, 399, 427, 438, 428, 416, 425, 450, 472, 486, 506, 531, 536, 506, 461, 433, 428, 429, 433, 443, 457, 459, 453, 455, 467, 479, 482, 487, 497, 498, 481, 460, 454, 463, 467, 457, 439, 421, 405, 390, 384, 386, 390, 392, 399, 412, 423, 423, 416, 412, 418, 429, 432, 424, 406, 397, 410, 444, 473, 470, 433, 385, 349, 332, 329, 334, 350, 365, 366, 347, 329, 334, 359, 382, 389, 384, 381, 385, 395, 408, 420, 426, 427, 432, 446, 459, 461, 458, 466, 487, 511, 526, 531, 534, 541, 553, 562, 554, 526, 495, 478, 468, 441, 397, 360, 350, 355, 353, 340, 325, 310, 284, 255, 249, 283, 351, 426, 480, 500, 491, 473, 471, 491, 517, 532, 537, 538, 531, 508, 469, 431, 405, 392, 386, 377, 363, 348, 349, 374, 409, 431, 433, 427, 422, 414, 397, 381, 375, 374, 368, 360, 359, 365, 368, 369, 378, 396, 411, 411, 404, 404, 415, 428, 438, 445, 452, 458, 464, 470, 468, 456, 440, 431, 425, 412, 384, 350, 322, 307, 304, 307, 311, 308, 295, 279, 270, 282, 311, 342, 356, 352, 344, 346, 357, 370, 379, 382, 379, 375, 378, 395, 419, 436, 440, 437, 437, 444, 456, 467, 469, 462, 454, 451, 448, 437, 424, 414, 408, 399, 393, 396, 408, 419, 421, 415, 402, 389, 388, 404, 423, 421, 390, 345, 302, 275, 269, 291, 334, 372, 392, 400, 413, 437, 463, 485, 504, 522, 538, 556, 573, 580, 564, 531, 502, 490, 496, 511, 522, 521, 499, 460, 417, 384, 367, 364, 372, 400, 452, 513, 557, 565, 552, 542, 542, 537, 521, 512, 524]
2346E24K4Ok6m7m2k1LJ2J2J7L0L3J2j7k3lJ7J9J0%j1j5kK0K6Nj7j8rj1k7l5l0k7l4m0l1nK4
2329C03M5N2N0M1K9Rqj1jkj8l4l1k0j5j5oJ7L5M0L7L1J1j6l8m7m3l5k0jJ3J3RRJ4J0pk5k6
2312C49nK1L0J5j0k5k0kJ5K1K0K3K5J3j9n2n8l8j2%J3L0M1K9Ppnnj2j5rKRJ8K5K6K3J8J6J1
2294E06NJlpj3j4pNJ4J0lj6j2OJ7J4QRJ2QJJ%j7l8m5l2j7nRK7L7L4K6J6KqpJJj2k1j8lRJ2
2274D93%k2l6k3QK8K5J2RPkj7k8l0k7j7lORJ4K6L2K3J6J6J5Jj9j9lJ3J0qk7l4l1k6k3k2j1
2257C35KKmJK2L7L1J3Jrj9k1rLkj3j2JK0L9M8L5Pj1jJ3Jk9n5o1n1k0K6N1K8j6l0j0P%%K3M8
2238D21M7K5OnkJ3L2K8nl6l8k1pJJ4K4J1j9m2l8j9%OJrj6j1NK3M0M7M1K1%j4k1k6k4j9j6j6
2221D02j1JJ2J0nk3l1k2mQKj5j6NK1K4K0K8M0M0K5Nj1k4k6j8pnqkLLl%J1J1ql2m0k9pJ0J6
$$ y = [524, 548, 554, 528, 481, 439, 418, 421, 433, 445, 462, 492, 525, 537, 520, 497, 494, 511, 530, 540, 540, 529, 514, 512, 532, 558, 563, 546, 528, 519, 508, 481, 446, 416, 389, 355, 315, 284, 279, 303, 348, 400, 450, 491, 520, 529, 521, 510, 509, 507, 489, 455, 424, 404, 389, 374, 368, 385, 420, 460, 497, 528, 539, 523, 485, 438, 395, 360, 340, 339, 352, 365, 374, 383, 397, 407, 400, 375, 349, 344, 365, 395, 410, 400, 375, 355, 353, 368, 389, 409, 432, 457, 470, 451, 399, 341, 303, 291, 291, 304, 334, 375, 404, 411, 404, 399, 394, 382, 367, 358, 360, 369, 387, 412, 438, 461, 479, 495, 506, 511, 512, 509, 502, 489, 475, 468, 473, 487, 497, 494, 478, 466, 472, 489, 503, 511, 520, 532, 540, 541, 542, 542, 525, 487, 442, 410, 393, 388, 397, 424, 461, 495, 521, 537, 539, 531, 524, 525, 526, 514, 493, 475, 472, 481, 493, 493, 471, 435, 412, 420, 448, 473, 485, 494, 501, 499, 482, 454, 424, 397, 380, 377, 383, 392, 406, 432, 464, 487, 503, 519, 534, 535, 516, 497, 494, 507, 517, 509, 482, 448, 417, 391, 368, 346, 335, 337, 339, 335, 336, 358, 395, 426, 439, 440, 431, 412, 391, 382, 385, 383, 370, 358, 359, 379, 418, 466, 501, 508, 497, 496, 509, 510, 481, 426, 365, 314, 294, 320, 371, 399, 383, 353, 343, 350, 350, 350, 373, 421, 468, 493, 499, 494, 492, 505, 537, 565, 560, 524, 486, 465, 458, 459, 473, 497, 508, 489, 447, 409, 390, 390, 396, 397, 388, 372, 361, 366, 389, 429, 476, 517, 538, 538, 524, 503, 477, 453, 434, 418, 402, 391, 392, 404, 414, 409, 386, 355, 333, 329, 337, 339, 324, 308, 313, 334, 358, 378, 406, 446, 486, 511, 516, 505, 481, 455, 437, 430, 425, 417, 415, 418, 421, 418, 418, 429, 440, 432, 400, 360, 331, 324, 334, 350]
2202C50J6J5J2PLJ1K9L8L4K2J2Jj4j5jQqm1n1k8J2M1M5L3K0K4M1M4J2l1m9l1lPLj0k6l7l2
$$ y = [350, 366, 381, 393, 400, 403, 414, 443, 481, 515, 537, 549, 550, 536, 521, 520, 528, 520, 479, 428, 400, 412, 453, 498, 531, 551, 575, 616, 660, 672, 641, 592, 561, 558, 565, 568, 558, 532, 495, 463]
$$ [...]
-3135C52
##END=	
##END=	
