##TITLE=	Mar09-2022.20.fid
TM-VI-295

##JCAMP-DX=	6.0	$$ MestReNova 14.3.1-31739
##DATA TYPE=	LINK
##BLOCK_ID=	1
##BLOCKS=	2    
##ORIGIN=	Mestrelab Research S.L.
##OWNER=	hrzepa
##$MNOVA/LINK_BLOCK_TYPE=	ITEM	$$ NMR Spectrum
##$MNOVA/ITEM/POLYGON=	(XY..XY)
5321,5835
8722,5835
8722,8208
5321,8208
5321,5835
##$MNOVA/ITEM/Z=	0
##$MNOVA/ITEM/ANGLE=	0
##TITLE=	Mar09-2022.20.fid
##JCAMP-DX=	6.0	$$ MestReNova 14.3.1-31739
##BLOCK_ID=	2
##DATA TYPE=	MNOVA NMR VIEW DATA
##DATA CLASS=	MNOVA VIEW DATA
##$MNOVA/ITEM/ZOOM/X=	-4.0107147498308073352,	16.011019999997905927
##$MNOVA/ITEM/ZOOM/Y=	-850.02776193618774414,	9383.69720458984375
##END=	
##TITLE=	Mar09-2022.20.fid
##JCAMP-DX=	6.0	$$ MestReNova 14.3.1-31739
##BLOCK_ID=	3
##DATA TYPE=	NMR SPECTRUM
##DATA CLASS=	XYDATA
##NUMDIM=	1
##ORIGIN=	Bruker BioSpin GmbH
##OWNER=	nmr
##.OBSERVE FREQUENCY=	400.20240119999999706
##.OBSERVE NUCLEUS=	^1H
##.SOLVENT NAME=	CDCl3
##.PULSE SEQUENCE=	zg30
##LONGDATE=	2022/03/09 10:27:00.000
##.ACQUISITIONMODE=	SIMULTANEOUS (DQD)
##$ORIGINAL FORMAT=	Bruker XWIN-NMR
##$MNOVA/SCALES_VERSION=	9
##$PARAMETER FILE=	(acqus, ASCII, /private/var/folders/f6/rjf_tdyn2v98c5c0wvkgn4s80000gn/T/s6JG4ktNTOOky1uVZG$oSw/20/acqus, 0)
$$ ##TITLE= Parameter file, TOPSPIN		Version 3.2
$$ ##JCAMPDX= 5.0
$$ ##DATATYPE= Parameter Values
$$ ##NPOINTS= 11	$$ modification sequence number
$$ ##ORIGIN= Bruker BioSpin GmbH
$$ ##OWNER= nmr
$$ $$ 2022-03-09 10:27:43.535 +0000  nmr@CZC2439F63
$$ $$ /opt/topspin/data/agmb/nmr/Mar09-2022/20/acqus
$$ $$ process /opt/topspin3.2/prog/mod/shimcntl
$$ ##$ACQT0= -2.36344537815126
$$ ##$AMP= (0..31)
$$ 100 100 100 100 100 100 100 100 100 100 100 100 100 100 100 100 100 100
$$ 100 100 100 100 100 100 100 100 100 100 100 100 100 100
$$ ##$AMPCOIL= (0..19)
$$ 0 0 0 0 0 0 0 0 0 0 0 0 0 0 0 0 0 0 0 0
$$ ##$ANAVPT= -1
$$ ##$AQSEQ= 0
$$ ##$AQ_mod= 3
$$ ##$AUNM= <au_zg>
$$ ##$AUTOPOS= <52 >
$$ ##$BF1= 400.2
$$ ##$BF2= 400.2
$$ ##$BF3= 400.2
$$ ##$BF4= 400.2
$$ ##$BF5= 400.2
$$ ##$BF6= 400.2
$$ ##$BF7= 400.2
$$ ##$BF8= 400.2
$$ ##$BYTORDA= 0
$$ ##$CAGPARS= (0..11)
$$ 0 0 0 0 0 0 0 0 0 0 0 0
$$ ##$CFDGTYP= 0
$$ ##$CFRGTYP= 9
$$ ##$CHEMSTR= <none>
$$ ##$CNST= (0..63)
$$ 1 1 145 1 1 1 1 1 1 1 1 1 1 1 1 1 1 1 1 1 1 1 1 1 1 1 1 1 1 1 1 1 1 1 1
$$ 1 1 1 1 1 1 1 1 1 1 1 1 1 1 1 1 1 1 1 1 1 1 1 1 1 1 1 1 1
$$ ##$CPDPRG= (0..8)
$$ <> <> <> <> <mlev> <mlev> <mlev> <mlev> <mlev>
$$ ##$D= (0..63)
$$ 0 1 0 0 0 0 0 0 0 0.06 0 0 0 0 0 0 0.0002 0 0 0 0 0 0 0 0 0 0 0 0 0 0 0
$$ 0 0 0 0 0 0 0 0 0 0 0 0 0 0 0 0 0 0 0 0 0 0 0 0 0 0 0 0 0 0 0 0
$$ ##$DATE= 1646821662
$$ ##$DE= 6.5
$$ ##$DECBNUC= <off>
$$ ##$DECIM= 2496
$$ ##$DECNUC= <off>
$$ ##$DECSTAT= 4
$$ ##$DIGMOD= 1
$$ ##$DIGTYP= 12
$$ ##$DQDMODE= 0
$$ ##$DR= 22
$$ ##$DS= 2
$$ ##$DSPFIRM= 0
$$ ##$DSPFVS= 20
$$ ##$DTYPA= 0
$$ ##$EXP= <proton>
$$ ##$F1LIST= <111111111111111>
$$ ##$F2LIST= <222222222222222>
$$ ##$F3LIST= <333333333333333>
$$ ##$FCUCHAN= (0..9)
$$ 0 2 0 0 0 0 0 0 0 0
$$ ##$FL1= 90
$$ ##$FL2= 90
$$ ##$FL3= 90
$$ ##$FL4= 90
$$ [...]
$$ ##$Sgu3PowerLevels= (0..7)
$$ 0 0 0 0 0 0 0 0
$$ ##$Sgu4PowerLevels= (0..7)
$$ 0 0 0 0 0 0 0 0
$$ ##$Sgu5PowerLevels= (0..7)
$$ 0 0 0 0 0 0 0 0
$$ ##$Sgu6PowerLevels= (0..7)
$$ 0 0 0 0 0 0 0 0
$$ ##$Sgu7PowerLevels= (0..7)
$$ 0 0 0 0 0 0 0 0
$$ ##$Sgu8PowerLevels= (0..7)
$$ 0 0 0 0 0 0 0 0
$$ ##$SguType= 3
$$ ##$ShimPowMaxUA= (0..63)
$$ 130000 130000 130000 130000 130000 130000 130000 130000 130000 130000 130000
$$ 130000 130000 130000 130000 130000 130000 130000 130000 130000 0 0 0 0
$$ 0 0 0 0 0 0 0 0 0 0 0 0 0 0 0 0 0 0 0 0 0 0 0 0 0 0 0 0 0 0 0 0 0 0 0 0
$$ 0 0 0 0
$$ ##$ShimPowMaxUC= (0..63)
$$ 130000 130000 130000 130000 130000 130000 130000 130000 130000 130000 130000
$$ 130000 130000 130000 130000 130000 130000 130000 130000 130000 0 0 0 0
$$ 0 0 0 0 0 0 0 0 0 0 0 0 0 0 0 0 0 0 0 0 0 0 0 0 0 0 0 0 0 0 0 0 0 0 0 0
$$ 0 0 0 0
$$ ##$ShimPowMaxUG= (0..63)
$$ 524287 524287 524287 524287 524287 524287 524287 524287 524287 524287 524287
$$ 524287 524287 524287 524287 524287 524287 524287 524287 524287 0 0 0 0
$$ 0 0 0 0 0 0 0 0 0 0 0 0 0 0 0 0 0 0 0 0 0 0 0 0 0 0 0 0 0 0 0 0 0 0 0 0
$$ 0 0 0 0
$$ ##$ShimPowRcbType= 3
$$ ##$ShimPowRes= (0..63)
$$ 1e-20 1e-20 1e-20 1e-20 1e-20 1e-20 1e-20 1e-20 1e-20 1e-20 1e-20 1e-20
$$ 1e-20 1e-20 1e-20 1e-20 1e-20 1e-20 1e-20 1e-20 0 0 0 0 0 0 0 0 0 0 0 0
$$ 0 0 0 0 0 0 0 0 0 0 0 0 0 0 0 0 0 0 0 0 0 0 0 0 0 0 0 0 0 0 0 0
$$ ##$ShimPowRng0= (0..63)
$$ 1 1 1 1 1 1 1 1 1 1 1 1 1 1 1 1 1 1 1 1 0 0 0 0 0 0 0 0 0 0 0 0 0 0 0 0
$$ 0 0 0 0 0 0 0 0 0 0 0 0 0 0 0 0 0 0 0 0 0 0 0 0 0 0 0 0
$$ ##$ShimPowRng1= (0..63)
$$ 1 1 1 1 1 1 1 1 1 1 1 1 1 1 1 1 1 1 1 1 0 0 0 0 0 0 0 0 0 0 0 0 0 0 0 0
$$ 0 0 0 0 0 0 0 0 0 0 0 0 0 0 0 0 0 0 0 0 0 0 0 0 0 0 0 0
$$ ##$ShimPowRng2= (0..63)
$$ 1 1 1 1 1 1 1 1 1 1 1 1 1 1 1 1 1 1 1 1 0 0 0 0 0 0 0 0 0 0 0 0 0 0 0 0
$$ 0 0 0 0 0 0 0 0 0 0 0 0 0 0 0 0 0 0 0 0 0 0 0 0 0 0 0 0
$$ ##$ShimPowRng3= (0..63)
$$ 1 1 1 1 1 1 1 1 1 1 1 1 1 1 1 1 1 1 1 1 0 0 0 0 0 0 0 0 0 0 0 0 0 0 0 0
$$ 0 0 0 0 0 0 0 0 0 0 0 0 0 0 0 0 0 0 0 0 0 0 0 0 0 0 0 0
$$ ##$ShimSysFunc= (0..63)
$$ 1 2 3 4 5 7 9 11 15 16 8 10 12 14 6 17 13 18 19 20 0 0 0 0 0 0 0 0 0 0
$$ 0 0 0 0 0 0 0 0 0 0 0 0 0 0 0 0 0 0 0 0 0 0 0 0 0 0 0 0 0 0 0 0 0 0
$$ ##$ShimSysMatrix= 0
$$ ##$ShimSysType= 1
$$ ##$TFXNUM= 0
$$ ##$TRIPLO2= 0
$$ ##$VTU= 2
$$ ##$VTUETH= <149.236.99.20>
$$ ##$VTUTY= <no>
$$ ##$WBREFAM= (0..15)
$$ 135.5 97.7 100 100 100 100 100 100 100 100 100 100 100 100 100 100
$$ ##$WBREFLM= (0..15)
$$ 0 0 0 0 0 0 0 0 0 0 0 0 0 0 0 0
$$ ##$WBREFPH= (0..15)
$$ 72.26 -67.22 0 0 0 0 0 0 0 0 0 0 0 0 0 0
$$ ##$WBSGU= (0..15)
$$ 0 0 0 0 0 0 0 0 0 0 0 0 0 0 0 0
$$ ##$XFAC= 2
$$ ##END=
$$ 
##$DECIM=	2496
##$DSPFVS=	20
##XUNITS=	HZ
##YUNITS=	ARBITRARY UNITS
##FIRSTX=	6407.6102040000005218
##LASTX=	-1605.0880428824991668
##DELTAX=	-0.12226593800080109986
##XFACTOR=	1
##YFACTOR=	0.02045004612138848557
##FIRSTY=	10.268212318420410156
##MINY=	3.0356535911560058594
##MAXY=	8530.6337890625
##NPOINTS=	65536
##XYDATA=	(X++(Y..Y))
$$ [...]
3428 566 587 644 708 748 750 723 681 637 610 616 646 671 674 665 666 674 677 679 695 719 726 714 711 738 777 794 783 760 743 735 729 710 666 611 583 607 654 674 654 626 620
3423 620 631 639 633 625 625 636 654 669 675 675 673 663 637 603 581 578 585 592 610 649 703 746 760 748 721 687 649 610 580 575 601 642 664 646 605 576 581 611 645 668 676
3418 676 669 658 654 665 681 693 698 700 702 704 701 696 692 695 705 704 681 651 650 682 705 685 653 670 737 790 789 758 731 705 676 673 714 757 751 714 709 744 767 758 750 762 755 703
3413 703 647 638 669 694 699 698 700 705 726 763 783 762 724 707 703 676 634 620 648 686 715 745 775 772 726 681 679 711 737 745 752 769 792 811 821 816 795 763 729 702
3408 702 694 709 738 756 754 740 729 736 769 823 868 875 852 834 837 845 842 828 813 797 789 793 797 781 758 761 780 768 717 681 698 728 716 684 689 729 751 740 734 758 787
3403 787 793 783 780 789 810 831 828 787 735 718 740 762 763 766 790 809 794 759 736 734 744 764 791 808 801 789 800 832 850 835 798 764 748 745 742 726 702 694 709 720
3398 720 702 678 686 730 758 734 676 633 629 651 675 691 702 707 702 693 688 691 698 706 719 741 757 750 722 692 667 634 596 583 612 651 657 635 630 667 721 754 757 750 750 763
3393 763 785 803 806 806 816 817 768 665 573 547 573 593 598 627 690 742 747 724 708 696 668 641 649 694 740 758 752 730 697 668 664 680 692 694 708 740 758 740 712
3388 712 716 752 780 773 747 729 728 734 737 735 734 747 770 787 788 783 793 816 831 824 799 769 746 737 746 758 758 750 751 761 759 738 720 731 764 784 775 759 766 803 845 856 825 772
3383 772 734 733 760 787 781 736 680 661 703 772 810 787 719 651 618 632 677 716 720 693 669 680 721 755 747 696 639 628 679 750 783 766 736 727 732 730 720 712 705
3378 705 697 700 720 743 755 767 793 812 781 697 610 572 589 629 665 688 695 692 692 706 728 735 724 713 716 722 711 687 686 726 786 831 847 847 835 807 773 756 766 786
3373 786 792 782 765 751 741 736 731 720 710 717 738 743 715 678 669 698 738 760 751 713 664 633 640 673 707 723 717 686 644 626 658 716 753 751 726 694 659 628 616 620
3368 620 624 627 653 705 757 790 812 833 842 825 796 778 774 776 772 755 720 691 702 750 770 721 643 615 651 697 712 712 726 749 764 767 763 741 704 679 687 714 732 736
3363 736 742 759 780 802 816 810 779 747 743 765 787 802 821 843 840 805 772 769 782 783 780 801 831 821 754 680 658 691 742 781 806 823 826 811 785 760 750 761 780
3359 780 786 773 755 749 746 729 701 680 671 673 687 709 720 708 693 701 719 717 699 704 738 759 747 744 779 813 796 743 714 720 718 686 658 663 686 696 691 689 701 725 744 741
3354 741 719 709 734 770 770 731 703 714 731 717 677 647 641 652 675 700 717 731 771 836 868 824 746 723 776 835 837 802 788 803 805 770 721 695 697 707 719
3349 719 746 788 814 792 742 724 758 791 767 711 692 723 741 720 712 761 822 817 750 703 719 757 766 753 747 740 706 658 646 689 753 786 780 765 760 754 737 725 740
3344 740 774 796 794 788 794 798 778 736 695 666 654 666 703 747 776 795 817 830 809 751 686 633 599 597 638 695 721 712 716 750 764 722 674 690 757 800 789 770
3340 770 778 794 789 769 755 753 763 781 788 764 721 706 731 757 757 756 781 809 804 777 769 788 809 818 828 836 829 811 807 823 839 838 825 808 780 747 729 746 792 844 872
3335 872 855 797 735 713 725 732 717 710 731 756 759 754 769 794 798 777 761 761 763 758 764 790 813 812 800 798 805 807 798 789 778 758 725 680 631 600 618 690 764 781 747 723
3329 723 744 782 797 790 784 778 760 753 780 816 806 742 681 666 681 690 692 698 705 712 740 793 826 801 747 724 738 744 720 703 718 745 751 743 745 763 783 797 805 800 784 774
3324 774 787 815 833 822 783 734 703 707 735 760 776 796 821 821 782 727 685 669 678 712 760 781 754 708 705 761 837 880 868 825 795 804 830 827 788 757 772 811
3320 811 832 831 835 839 820 787 782 818 854 859 844 832 821 803 789 793 808 814 805 788 768 758 772 803 823 814 790 773 766 759 746 736 735 741 743 721 678 651 673 727 763 769
3315 769 779 808 820 782 724 697 714 752 795 825 816 771 743 783 859 899 883 852 831 806 781 782 805 806 768 730 720 719 712 720 751 766 745 737 783 831 804 728
3310 728 703 756 806 790 743 729 747 753 732 701 670 646 656 709 768 782 746 704 684 677 666 649 636 640 675 739 790 780 717 670 683 721 724 691 675 705 750
3305 750 765 750 733 732 746 764 776 776 764 756 763 779 791 802 818 823 797 747 716 734 780 807 800 786 785 795 806 825 848 851 819 778 770 794 810 792 763 755 761 756 741
3300 741 742 770 809 844 874 894 887 843 784 751 760 792 808 788 753 746 779 819 830 820 831 867 882 841 775 746 766 798 807 802 807 826 848 865 876 878 870 856 836
3296 836 813 791 774 761 746 728 707 679 650 639 656 680 682 671 683 725 758 754 740 760 805 821 786 737 718 731 744 747 763 801 836 835 808 801 834 872 870 826
3291 826 775 738 715 708 732 773 789 765 729 713 706 689 678 697 731 749 752 759 760 730 692 697 746 782 770 754 780 835 870 873 861 843 821 812 819 814 779 743 755 804
3286 804 839 841 842 854 845 798 753 761 812 852 850 825 812 817 816 792 759 754 789 828 823 774 730 720 719 693 658 665 722 787 822 836 852 860 831 768 714 705 724 731 715 704
3281 704 723 760 789 806 827 852 860 839 802 769 743 717 691 677 678 686 694 713 756 809 836 819 784 772 789 791 754 708 700 727 747 738 725 729 741 746 747 750 742 722 707
3276 707 713 728 728 707 679 654 647 670 718 764 788 809 844 873 866 826 785 757 727 699 702 741 778 781 765 758 755 734 703 696 732 786 821 825 816 815 826 835 833 822 809 799
3271 799 790 788 790 788 773 755 745 739 725 712 721 754 787 803 817 838 855 853 838 824 811 795 785 797 823 836 824 802 797 813 837 845 829 808 810 839 862 857 841 844 867
3266 867 879 863 831 796 764 751 778 833 866 838 770 726 740 783 800 775 739 731 755 783 793 784 769 757 751 759 780 800 802 791 790 806 817 803 775 759 772 807
3261 807 843 858 839 791 743 725 747 783 800 790 776 784 815 846 851 829 797 783 808 862 904 893 832 769 748 772 814 839 833 799 760 750 778 819 837 816
3257 816 771 728 711 725 751 758 736 717 737 787 822 823 809 803 802 790 763 729 694 672 676 709 757 808 859 892 884 835 784 767 778 781 763 740 730 732 733 727 713 705
3252 705 726 782 844 875 868 847 831 817 802 797 806 808 787 759 755 776 785 755 711 701 742 801 839 847 845 849 857 863 861 848 825 808 811 838 874 903 916 906 872 833 816
3247 816 824 824 792 750 742 771 794 779 745 728 738 758 772 784 803 826 847 862 861 840 810 791 797 817 833 841 848 855 852 838 833 851 879 884 864 850 865 893 897 874 856
3242 856 863 880 878 856 838 838 833 806 777 784 826 851 818 756 727 745 773 779 778 789 798 787 770 767 766 749 729 740 776 802 810 832 884 934 945 924 893 857 812 776
3237 776 767 777 781 775 772 780 790 798 806 815 825 834 840 826 786 745 728 728 716 695 702 753 810 830 810 777 748 733 747 793 835 831 787 757 772 806 817 799 783 789 805 809
3232 809 795 782 793 831 870 887 886 892 908 911 883 846 827 822 806 785 786 817 849 855 844 831 812 780 747 738 755 778 794 804 817 832 848 864 875 874 861 845 831
3227 831 831 855 891 904 871 816 783 785 796 800 806 820 819 784 742 729 746 762 758 749 755 774 792 800 801 796 785 773 766 769 781 789 784 769 764 775 791 794 786 780 783 783 777 772 778 795 813
3221 813 829 844 857 863 858 841 815 792 783 790 804 813 811 791 760 747 776 839 890 891 855 821 809 809 810 814 830 851 868 878 888 903 923 938 932 897 845 802 779 772 777
3216 777 802 838 855 827 780 767 810 878 929 949 945 917 868 828 828 862 886 868 832 826 860 898 900 871 848 843 838 823 819 840 856 829 778 762 797 837 844 837 842 835
3211 835 789 740 746 803 844 842 833 851 871 860 838 838 847 834 802 787 803 825 834 833 833 843 863 887 891 862 820 803 822 856 874 872 868 886 922 948 931 880 834 818
3206 818 814 799 788 807 840 849 827 805 796 783 755 722 697 668 642 648 700 754 757 706 655 654 701 754 777 773 774 795 817 818 808 816 836 839 820 805 806 797 768 755 786
3201 786 835 854 838 821 822 830 831 833 839 843 843 837 817 773 719 682 675 687 698 694 675 656 667 712 755 769 777 824 898 930 884 803 753 744 750 757 777 814 854 875 867 837
3196 837 807 799 820 852 878 897 901 880 844 826 840 856 843 814 804 819 837 847 862 886 918 956 992 992 940 882 886 943 970 921 845 817 844 878 897 911 928
3192 928 941 949 950 928 868 795 748 736 742 757 786 814 819 809 815 844 867 869 871 892 907 891 856 838 844 857 861 853 837 822 818 822 823 825 843 871 871 822 762 737 746 757 758
3187 758 772 802 833 853 866 877 887 903 923 921 880 824 800 815 832 832 827 825 813 792 790 816 843 848 844 851 856 837 800 776 777 799 826 838 815 770 753 794 857 874
3182 874 838 805 817 852 859 829 799 809 855 906 926 912 888 881 892 889 846 779 742 774 846 889 873 838 823 817 794 772 791 836 853 836 836 869 890 877 877 924
3177 924 960 921 852 846 901 918 856 786 784 826 840 816 801 824 864 883 864 819 777 772 811 869 909 919 916 924 944 948 914 857 817 810 808 792 778 791 811 804 773
3172 773 751 751 761 771 786 799 803 816 855 901 916 905 898 890 860 828 835 862 841 775 758 835 924 935 897 893 930 943 915 885 874 864 851 852 859 850 843 870 910 906
3167 906 858 831 853 879 868 849 858 875 864 835 826 847 880 912 933 928 896 864 856 863 867 868 865 837 783 748 770 817 831 811 814 863 917 934 930 936 945 935 920 933 959
3162 959 951 896 840 832 864 895 907 909 900 867 814 769 752 757 774 798 821 827 819 818 842 878 902 903 880 837 795 788 821 859 874 878 894 910 897 868 865 899 936 941 926
3157 926 914 906 893 880 877 880 875 858 838 832 844 865 881 883 874 858 831 808 816 863 911 919 899 894 909 905 869 834 831 844 843 835 843 861 859 823 778 769 821 912 983 990 953 925
3152 925 925 917 879 842 843 868 878 867 862 874 875 846 810 809 853 910 937 925 906 907 916 914 911 929 949 933 882 837 819 810 802 815 844 840 787 747 774 828 835 802 795 836
3147 836 882 895 889 876 849 811 783 775 775 786 820 861 873 858 861 898 935 939 925 924 934 935 924 914 912 916 925 939 954 967 971 943 875 804 783 815 853 865 863 860 845
3142 845 819 818 860 915 950 965 974 969 950 937 947 961 958 940 920 889 844 809 804 815 817 823 848 883 909 939 986 1030 1042 1032 1021 998 947 907 930 995 1022 988
3137 988 953 966 995 993 973 973 987 969 916 872 872 900 922 930 952 1003 1059 1074 1038 994 986 1003 996 942 866 805 782 806 870 927 925 858 788 772 806 849 883 911
3132 911 930 925 898 862 828 806 809 836 864 864 837 815 823 850 864 849 815 789 792 819 853 888 926 954 951 918 888 886 902 914 920 928 935 935 937 948 948 910 841 786 779 808
3127 808 840 855 857 860 880 918 960 984 982 961 932 906 891 882 867 837 802 780 779 800 842 896 946 981 1005 1020 1007 960 916 920 971 1015 1008 959 906 884 904 952
3123 952 993 1000 979 964 958 935 888 854 865 908 940 944 935 924 909 889 867 845 830 832 850 872 889 906 923 919 884 838 803 779 767 786 843 885 856 777 738 771
3118 771 821 830 815 816 824 798 747 725 765 842 922 981 1003 981 936 902 883 860 833 837 884 928 924 879 835 810 791 781 801 849 882 873 848 848 870 882 878 888 930
3113 930 977 999 998 992 971 913 840 804 823 860 874 874 890 923 946 950 947 939 911 865 839 859 910 951 965 964 961 955 945 941 954 970 972 955 941 947 965 974 967 955 951 954 960
3108 960 972 987 988 966 928 893 873 879 918 987 1061 1108 1112 1075 1007 936 903 918 941 930 902 906 939 946 904 861 865 896 909 899 893 898 898 897 904 914 914 915 935 961 966 955
3103 955 957 971 969 951 952 986 1027 1056 1082 1101 1077 998 918 897 919 925 896 871 889 953 1036 1099 1110 1066 1012 989 989 974 944 943 990 1038 1032 978 941 966 1021 1046
3098 1046 1021 988 989 1006 989 938 912 952 1019 1039 1001 957 946 956 962 958 944 923 915 955 1032 1084 1067 1007 964 963 988 1019 1049 1071 1076 1075 1081 1075 1027 947 882 869 901
3093 901 939 961 967 975 995 1014 1009 985 977 1000 1019 987 918 875 888 923 944 951 962 970 963 951 954 974 1003 1032 1044 1021 968 921 907 905 891 880 896 923 929 924 944 982
3089 982 987 949 920 946 997 1018 996 967 961 971 980 987 1004 1040 1076 1073 1020 965 965 1012 1040 1016 980 974 979 966 953 976 1018 1027 990 946 922 914 919 942 958 934 889 891 960
3084 960 1029 1036 1007 1007 1043 1068 1059 1050 1069 1092 1081 1036 990 960 933 896 864 859 874 879 868 869 901 938 947 938 955 1003 1041 1042 1023 1011 1003 992 989 991 972 916 863 860 898 926
3078 926 920 903 895 884 859 835 841 887 956 1020 1053 1052 1039 1034 1035 1025 1001 979 974 988 1010 1024 1013 982 958 957 968 978 995 1031 1068 1076 1062 1048 1035 1005 975 982 1017 1023
3074 1023 976 926 926 960 981 983 990 997 977 938 915 920 922 905 894 914 955 990 1007 1012 1015 1018 1019 1017 1008 998 998 1012 1026 1025 1008 992 998 1035 1083 1113 1106 1074 1044 1032 1033 1040 1057
3068 1057 1087 1109 1098 1057 1021 1022 1044 1042 997 949 955 1015 1075 1087 1055 1023 1025 1058 1094 1112 1109 1099 1088 1061 1012 965 952 973 996 1011 1040 1087 1107 1070 1011 994 1027
3064 1027 1062 1068 1062 1066 1074 1071 1058 1047 1037 1028 1025 1032 1037 1032 1017 997 974 955 949 954 959 971 1011 1068 1097 1067 1009 969 956 941 921 920 943 963 965 968 985 998 984 965 980 1025
3059 1025 1054 1047 1040 1072 1124 1143 1118 1082 1061 1039 998 963 971 1013 1051 1069 1087 1120 1149 1158 1149 1125 1069 980 908 906 961 1006 1002 984 1005 1057 1089 1077 1053 1055 1080 1102
3054 1102 1110 1117 1127 1127 1108 1079 1060 1056 1060 1067 1080 1100 1112 1103 1076 1053 1048 1056 1065 1074 1089 1112 1132 1140 1136 1121 1092 1059 1041 1040 1036 1016 1001 1020 1062 1088 1079 1063 1065 1081 1089 1080 1060 1040
3049 1040 1039 1068 1115 1146 1151 1154 1174 1192 1189 1180 1186 1194 1180 1154 1139 1132 1116 1095 1086 1072 1029 981 976 1009 1022 994 969 980 996 990 993 1037 1082 1078 1041 1030 1050 1051 1021 1003 1020
3044 1020 1048 1065 1090 1127 1136 1090 1019 975 971 984 1011 1057 1107 1128 1107 1072 1055 1059 1073 1086 1099 1111 1123 1125 1106 1066 1026 1012 1025 1031 1009 977 975 1009 1047 1066 1093
3039 1093 1156 1229 1247 1190 1119 1104 1142 1171 1152 1108 1086 1102 1137 1159 1155 1136 1128 1142 1158 1151 1125 1116 1147 1197 1226 1213 1173 1140 1137 1154 1167 1161 1150 1150 1158 1160 1161 1176 1202
3034 1202 1223 1236 1248 1253 1235 1198 1171 1161 1145 1104 1061 1046 1062 1088 1113 1137 1157 1167 1168 1155 1124 1090 1086 1113 1124 1086 1036 1039 1099 1153 1160 1142 1137 1143 1140 1133 1140 1167 1199
3030 1199 1223 1240 1248 1243 1229 1209 1186 1161 1146 1149 1157 1152 1141 1146 1173 1195 1196 1196 1222 1253 1247 1196 1154 1163 1205 1229 1222 1209 1197 1170 1132 1124 1173 1242 1277 1266 1239 1219 1204 1190
3025 1190 1196 1233 1282 1310 1299 1269 1261 1298 1364 1415 1422 1395 1363 1342 1330 1328 1339 1358 1383 1415 1448 1466 1465 1464 1476 1488 1481 1468 1471 1484 1486 1479 1482 1491 1485 1465 1464 1496 1540 1580 1623
3020 1623 1665 1680 1658 1636 1640 1647 1625 1586 1567 1568 1568 1566 1572 1576 1553 1516 1499 1504 1499 1482 1490 1539 1589 1598 1580 1577 1590 1588 1557 1521 1498 1490 1505 1562 1655 1744 1798 1829 1872 1920 1930
3015 1930 1886 1837 1846 1910 1962 1954 1912 1899 1930 1974 1995 1992 1974 1953 1945 1968 2014 2046 2034 1988 1945 1933 1948 1964 1958 1937 1921 1921 1912 1871 1814 1783 1788 1799 1795 1798 1828 1860 1860 1840
3010 1840 1842 1878 1913 1915 1892 1869 1861 1860 1861 1859 1860 1876 1912 1953 1975 1966 1940 1915 1910 1935 1983 2021 2017 1976 1936 1918 1916 1921 1935 1947 1936 1897 1865 1868 1895 1920 1935 1936 1911 1865 1834
3005 1834 1846 1875 1875 1847 1838 1859 1870 1843 1801 1780 1775 1764 1750 1746 1751 1751 1752 1768 1792 1799 1787 1779 1793 1821 1847 1855 1839 1807 1787 1798 1832 1859 1863 1857 1862 1880 1903 1924 1950 1990 2035
3000 2035 2061 2050 2019 1998 1992 1973 1946 1959 2032 2107 2111 2052 2002 1993 1998 2001 2021 2054 2051 1995 1935 1914 1902 1854 1788 1765 1790 1813 1804 1778 1758 1749 1747 1742 1718 1679 1661 1699 1764
2995 1764 1798 1787 1760 1724 1664 1606 1610 1682 1745 1739 1689 1659 1660 1662 1652 1638 1624 1611 1606 1609 1602 1582 1575 1588 1592 1573 1569 1602 1628 1600 1550 1539 1557 1544 1495 1475 1507 1541 1542 1543
2990 1543 1572 1588 1552 1497 1489 1529 1567 1573 1570 1585 1618 1650 1660 1644 1623 1623 1635 1621 1577 1554 1581 1617 1616 1600 1624 1669 1671 1626 1605 1648 1709 1735 1743 1764 1783 1767 1730 1717
2985 1717 1736 1749 1731 1702 1687 1690 1701 1713 1723 1729 1736 1748 1758 1757 1746 1738 1736 1739 1746 1761 1780 1790 1784 1776 1784 1810 1832 1823 1780 1737 1733 1774 1824 1846 1843 1839 1842 1832 1796 1757 1751 1787 1845
2980 1845 1895 1925 1943 1956 1957 1939 1908 1883 1868 1852 1829 1811 1804 1795 1771 1752 1768 1811 1844 1840 1812 1783 1764 1752 1752 1770 1801 1836 1862 1866 1845 1817 1811 1842 1894 1941 1972 1984
2975 1984 1978 1959 1944 1940 1941 1943 1952 1963 1955 1918 1880 1871 1886 1895 1894 1896 1904 1906 1899 1900 1912 1925 1943 1975 2005 2007 1993 2008 2056 2081 2058 2036 2071 2137 2171 2169 2173 2189 2179 2139 2113 2116 2115 2096
2970 2096 2098 2144 2188 2178 2126 2084 2065 2055 2057 2084 2115 2107 2059 2016 2010 2025 2038 2055 2085 2110 2108 2090 2077 2069 2053 2034 2049 2118 2214 2274 2268 2226 2205 2221 2247 2271 2311 2377
2965 2377 2427 2412 2353 2314 2329 2364 2384 2393 2408 2428 2446 2473 2512 2545 2556 2561 2591 2645 2693 2710 2692 2649 2600 2575 2586 2610 2623 2630 2649 2673 2666 2624 2592 2608 2658 2691
2961 2691 2681 2656 2654 2683 2712 2719 2714 2724 2757 2789 2802 2799 2793 2786 2771 2759 2766 2791 2818 2841 2864 2886 2893 2884 2877 2887 2908 2922 2925 2926 2938 2965 2994 3009 3008 3008 3039 3109 3192 3245 3239 3191
2956 3191 3151 3154 3188 3216 3237 3281 3353 3400 3386 3346 3342 3373 3394 3397 3422 3474 3505 3498 3502 3553 3608 3601 3547 3518 3543 3587 3618 3651 3696 3738 3766 3797 3841 3873 3863 3825 3803
2951 3803 3816 3854 3902 3954 4004 4047 4079 4102 4109 4092 4063 4053 4084 4146 4209 4248 4262 4272 4301 4353 4400 4413 4396 4394 4439 4508 4545 4538 4534 4572 4625 4644 4640 4665 4730 4791 4827
2947 4827 4869 4939 5005 5036 5060 5118 5196 5247 5270 5302 5349 5384 5407 5461 5557 5639 5663 5661 5692 5758 5817 5854 5892 5946 6004 6054 6104 6160 6221 6286 6356 6423 6475 6518 6566
2943 6566 6617 6664 6721 6817 6951 7089 7202 7303 7411 7518 7605 7682 7779 7899 8013 8107 8201 8320 8458 8587 8698 8805 8926 9066 9218 9373
2939 9373 9520 9662 9810 9959 10086 10194 10323 10511 10733 10932 11095 11267 11477 11702 11915 12133 12376 12615 12816 13006 13243 13532 13819
2937 13819 14088 14380 14725 15092 15443 15792 16169 16575 17002 17467 17985 18530 19061 19583 20132 20721 21336 21974 22662 23411 24206 25021 25853
2934 25853 26717 27629 28603 29643 30737 31869 33048 34301 35637 37038 38484 39973 41517 43132 44836 46633 48510 50464
2932 50464 52520 54713 57051 59526 62142 64917 67845 70904 74107 77488 81047 84723 88444 92167 95847 99416 102808
2930 102808 105985 108919 111543 113769 115537 116840 117696 118127 118144 117749 116945 115762 114266 112530 110603 108524 106342 104111
2927 104111 101864 99618 97384 95174 92993 90842 88723 86639 84606 82663 80845 79155 77570 76098 74786 73656 72681
2925 72681 71841 71180 70757 70569 70571 70756 71161 71799 72626 73600 74741 76091 77659 79421 81356 83466 85750 88194 90771 93455
2923 93455 96248 99167 102217 105364 108567 111830 115191 118660 122193 125742 129304 132871 136393 139804 143069 146176 149075
2921 149075 151681 153934 155824 157346 158468 159157 159438 159388 159089 158597 157958 157234 156508 155860 155362 155081 155073 155363 155946 156818 157999
2918 157999 159510 161331 163402 165662 168071 170593 173183 175783 178330 180758 183014 185067 186872 188325 189277 189629 189363 188479
2916 188479 186924 184627 181582 177845 173479 168530 163068 157208 151067 144731 138270 131751 125241 118800 112503 106421 100597
2914 100597 95041 89770 84820 80197 75858 71753 67888 64296 60975 57875 54961 52250 49764 47476 45325 43284 41376
2912 41376 39623 38007 36487 35047 33695 32429 31231 30093 29017 28005 27037 26107 25227 24403 23618 22857 22137 21484 20883
2909 20883 20298 19726 19197 18719 18260 17796 17342 16921 16521 16118 15726 15377 15069 14760 14426 14091 13798 13556 13334 13095 12828 12556 12316
2907 12316 12132 11994 11862 11694 11476 11235 11020 10859 10741 10635 10516 10382 10239 10101 9977 9872 9776 9685 9607 9549 9497 9423 9324 9227 9156 9102
2903 9102 9042 8965 8881 8809 8755 8706 8643 8565 8495 8450 8417 8370 8309 8256 8215 8165 8107 8073 8079 8096 8086 8046 7998 7956 7934 7945 7978 7994 7981 7989 8061 8163 8217 8214 8220 8280
2899 8280 8360 8416 8454 8504 8562 8602 8624 8657 8717 8798 8886 8975 9061 9139 9214 9294 9390 9504 9625 9736 9828 9914 10010 10126 10261 10414 10584 10758 10922 11089
2895 11089 11273 11470 11661 11851 12066 12318 12591 12876 13182 13515 13859 14201 14553 14920 15294 15661 16032 16426 16855 17319 17804 18276 18713
2893 18713 19131 19581 20079 20590 21081 21560 22043 22514 22947 23343 23721 24089 24449 24807 25154 25463 25724 25960 26189 26390 26546 26689 26860
2890 26860 27051 27215 27335 27428 27513 27593 27672 27743 27777 27760 27723 27701 27675 27613 27538 27498 27472 27392 27251 27124 27062 27032 26991 26951 26941 26952 26970 27015 27115 27256
2886 27256 27413 27585 27790 28029 28287 28551 28815 29082 29376 29715 30055 30321 30500 30669 30883 31092 31218 31272 31321 31374 31379 31304 31179 31029 30844
2883 30844 30618 30368 30112 29842 29548 29225 28869 28489 28122 27795 27483 27131 26730 26328 25954 25589 25207 24823 24473 24165 23883 23612 23347
2880 23347 23091 22858 22660 22488 22327 22190 22112 22100 22119 22134 22161 22244 22393 22580 22772 22964 23167 23394 23650 23935 24250 24587 24931 25270 25616
2877 25616 25992 26388 26763 27099 27424 27757 28067 28316 28522 28728 28928 29073 29146 29180 29184 29119 28953 28703 28393 28031 27631 27230 26833 26403
2874 26403 25917 25400 24876 24320 23710 23074 22455 21859 21276 20729 20227 19717 19137 18512 17919 17377 16828 16246 15668 15124 14585 14026 13487
2871 13487 13009 12576 12140 11697 11274 10883 10507 10148 9824 9529 9230 8916 8612 8344 8104 7866 7624 7399 7201 7013 6815 6613 6429
2869 6429 6272 6121 5956 5787 5636 5511 5391 5250 5082 4906 4757 4658 4601 4540 4440 4311 4193 4108 4043 3981 3922 3872 3824 3761 3675 3584 3516
2865 3516 3479 3451 3401 3325 3242 3168 3106 3064 3051 3046 3006 2925 2852 2828 2828 2801 2751 2721 2710 2674 2608 2561 2556 2557 2529 2496 2497 2523 2533 2509 2460 2390 2312 2264 2269 2298 2297 2256
2861 2256 2215 2197 2183 2149 2093 2036 2006 2024 2081 2132 2130 2086 2048 2043 2051 2055 2071 2111 2150 2145 2084 2008 1962 1960 1973 1962 1923 1896 1914 1958 1982 1971 1947 1927 1892 1831 1768
2856 1768 1744 1768 1821 1870 1889 1868 1832 1830 1880 1941 1962 1940 1919 1918 1917 1903 1895 1916 1966 2016 2048 2061 2066 2067 2069 2079 2108 2157 2208 2238 2255 2290 2345 2379 2360 2321 2328 2383
2852 2383 2425 2417 2399 2430 2508 2574 2588 2558 2514 2477 2456 2454 2466 2488 2519 2558 2583 2574 2544 2536 2571 2617 2630 2610 2598 2622 2663 2676 2642 2596 2597 2669 2778 2861 2887 2875
2847 2875 2866 2890 2952 3039 3121 3179 3228 3307 3425 3546 3636 3705 3787 3896 4014 4126 4234 4337 4426 4504 4588 4683 4768 4821 4844 4855 4863 4875 4901 4947 4999 5036
2843 5036 5050 5056 5065 5073 5067 5056 5058 5073 5081 5062 5026 4990 4943 4851 4711 4564 4455 4379 4292 4176 4055 3964 3908 3872 3835 3784 3711 3618 3520 3435 3371 3329 3304 3285 3257
2839 3257 3213 3154 3084 3014 2951 2894 2840 2796 2775 2768 2737 2662 2578 2536 2531 2516 2467 2415 2387 2367 2331 2282 2234 2186 2146 2135 2158 2183 2184 2175 2173 2164 2135 2110 2118 2135 2113 2061
2834 2061 2027 2028 2031 2017 2008 2020 2030 2019 2005 2014 2033 2039 2032 2027 2025 2014 1999 1991 1998 2023 2057 2072 2039 1974 1933 1948 1980 1975 1937 1918 1938 1966 1965 1940 1916 1907 1905 1905 1905 1904 1902 1899 1888 1858
2829 1858 1812 1761 1725 1713 1720 1725 1706 1664 1626 1623 1658 1712 1765 1795 1781 1724 1659 1630 1633 1627 1594 1561 1567 1610 1661 1693 1698 1683 1665 1667 1699 1738 1753 1732 1690 1648 1618 1609 1621
2824 1621 1643 1654 1645 1626 1606 1591 1587 1601 1634 1677 1721 1765 1798 1795 1750 1704 1715 1792 1878 1913 1900 1883 1888 1900 1900 1891 1880 1867 1858 1872 1921 1986 2032 2051 2058 2067 2079 2093 2108
2819 2108 2116 2108 2094 2097 2125 2162 2196 2227 2261 2288 2292 2282 2283 2310 2344 2359 2345 2318 2294 2282 2281 2283 2267 2220 2157 2115 2113 2124 2109 2067 2031 2017 2003 1980 1971 1998 2039 2047 2013
2815 2013 1971 1945 1919 1878 1840 1837 1864 1885 1884 1882 1903 1933 1942 1930 1926 1946 1966 1960 1935 1921 1926 1931 1935 1959 2008 2054 2075 2088 2120 2163 2185 2180 2167 2159 2164 2186 2228 2274 2305 2326
2810 2326 2344 2348 2326 2310 2338 2389 2392 2319 2230 2190 2197 2212 2217 2218 2213 2196 2177 2159 2123 2069 2045 2095 2191 2254 2249 2208 2166 2124 2081 2057 2063 2085 2104 2113 2109 2094 2094 2141 2213 2250
2805 2250 2225 2182 2170 2180 2172 2149 2145 2174 2214 2245 2259 2249 2205 2137 2073 2036 2031 2052 2083 2106 2114 2120 2130 2128 2102 2076 2089 2134 2172 2182 2184 2192 2193 2178 2164 2170 2188 2203 2207 2201
2800 2201 2189 2185 2204 2229 2226 2192 2157 2132 2100 2064 2081 2176 2282 2312 2260 2200 2176 2166 2143 2118 2110 2110 2102 2095 2092 2082 2067 2070 2101 2138 2156 2159 2158 2141 2098 2051 2034 2058 2097
2795 2097 2121 2120 2103 2088 2092 2110 2125 2132 2143 2152 2131 2082 2043 2044 2057 2049 2031 2031 2044 2049 2067 2134 2221 2248 2188 2111 2091 2123 2152 2164 2182 2221 2266 2295 2303 2291 2264 2234 2212
2790 2212 2202 2201 2208 2217 2231 2265 2324 2368 2351 2293 2279 2352 2456 2504 2492 2481 2492 2492 2468 2462 2506 2575 2628 2661 2698 2741 2771 2784 2798 2830 2886 2950 2998 3016 3011 3013 3032
2786 3032 3046 3025 2976 2943 2954 2985 2992 2961 2938 2971 3049 3109 3112 3081 3066 3076 3089 3096 3115 3149 3178 3191 3202 3227 3266 3303 3323 3315 3284 3262 3276 3307 3312 3288 3279 3307 3334
2781 3334 3327 3316 3343 3390 3403 3375 3362 3400 3465 3514 3534 3542 3560 3604 3675 3746 3779 3767 3740 3728 3738 3775 3851 3962 4065 4120 4142 4169 4211 4239 4238 4222 4217 4236 4289
2777 4289 4371 4451 4490 4489 4490 4527 4582 4626 4660 4705 4757 4797 4824 4865 4935 5013 5081 5153 5252 5369 5470 5535 5572 5607 5658 5724 5786 5824 5849 5899 5999 6127 6241
2773 6241 6336 6445 6577 6694 6763 6798 6841 6914 7016 7139 7266 7363 7424 7504 7661 7875 8056 8157 8229 8349 8525 8707 8871 9034 9205 9370
2770 9370 9529 9715 9956 10236 10508 10740 10937 11127 11349 11623 11934 12242 12527 12803 13102 13441 13825 14254 14713 15169 15607 16051 16540
2767 16540 17081 17648 18235 18868 19566 20299 21024 21747 22525 23413 24411 25471 26554 27673 28871 30166 31524 32901 34301 35766
2765 35766 37319 38947 40629 42370 44182 46066 48024 50085 52279 54609 57062 59649 62396 65319 68427 71742 75287
2762 75287 79041 82955 87004 91185 95456 99712 103849 107824 111609 115131 118285 121000 123239 124950 126064 126559 126479 125887
2760 125887 124832 123362 121549 119471 117177 114702 112079 109345 106531 103680 100851 98086 95371 92663 89945 87253 84633
2758 84633 82109 79685 77366 75161 73082 71147 69366 67744 66293 65034 63985 63131 62437 61895 61534 61387 61458 61738 62227
2756 62227 62918 63784 64799 65970 67313 68822 70465 72231 74130 76155 78274 80464 82731 85069 87442 89830 92264 94773
2754 94773 97327 99855 102328 104751 107095 109267 111170 112773 114082 115065 115643 115735 115297 114329 112857 110921 108552 105781 102658
2751 102658 99257 95651 91908 88101 84314 80608 77005 73511 70148 66939 63886 60987 58259 55712 53319 51035 48847
2749 48847 46773 44819 42966 41199 39517 37901 36319 34763 33268 31865 30544 29280 28076 26940 25856 24791 23743
2747 23743 22746 21835 21012 20251 19516 18790 18086 17444 16885 16380 15882 15377 14887 14433 14011 13603 13204 12824 12473 12156 11868 11595 11322
2744 11322 11035 10742 10465 10228 10026 9827 9606 9384 9205 9081 8973 8839 8678 8517 8369 8229 8092 7955 7814 7681 7582 7523 7469 7376
2741 7376 7257 7167 7131 7111 7057 6969 6882 6823 6779 6722 6643 6566 6518 6500 6487 6463 6447 6455 6474 6467 6428 6380 6336 6295 6264 6260 6277 6285 6281 6290 6320 6343 6341 6345 6380 6422 6438 6450
2737 6450 6506 6608 6711 6785 6839 6879 6905 6935 6996 7078 7138 7168 7214 7304 7417 7524 7641 7791 7959 8119 8273 8437 8599 8734 8855 8988 9129
2734 9129 9247 9347 9476 9655 9840 9979 10077 10186 10345 10548 10761 10954 11126 11303 11525 11802 12100 12383 12647 12917 13208 13510 13809
2731 13809 14109 14432 14791 15184 15603 16039 16494 16971 17467 17977 18500 19039 19601 20196 20833 21499 22155 22771 23363 23974 24622 25272 25886
2728 25886 26456 26999 27521 28016 28477 28886 29211 29424 29541 29591 29581 29495 29346 29176 29003 28792 28500 28137 27755 27384 27009 26596 26133 25639
2725 25639 25147 24686 24262 23861 23458 23031 22583 22139 21738 21397 21088 20768 20428 20115 19874 19696 19536 19378 19248 19176 19157 19174 19217 19278
2722 19278 19344 19414 19514 19670 19870 20076 20272 20483 20743 21050 21376 21698 22021 22363 22728 23096 23434 23726 23990 24263 24560 24853 25094
2719 25094 25257 25347 25389 25408 25410 25369 25238 25006 24714 24406 24069 23651 23140 22584 22017 21424 20793 20162 19568 18977 18322 17613 16931 16332 15785
2716 15785 15243 14707 14203 13718 13222 12711 12210 11733 11282 10874 10523 10207 9879 9528 9185 8870 8561 8231 7889 7575 7309 7083 6869
2713 6869 6641 6395 6154 5949 5786 5638 5481 5319 5172 5032 4878 4706 4544 4421 4337 4267 4185 4074 3937 3795 3674 3584 3515 3457 3405
2710 3405 3356 3295 3221 3158 3128 3110 3058 2964 2869 2810 2761 2683 2589 2537 2539 2545 2504 2434 2380 2350 2315 2256 2195 2155 2145 2154 2162 2141 2077 2006 1988 2039 2099 2094 2019 1942 1914
2706 1914 1914 1885 1816 1749 1721 1718 1708 1692 1691 1703 1703 1682 1667 1670 1670 1644 1605 1580 1567 1541 1499 1472 1478 1495 1493 1461 1424 1407 1420 1441 1444 1425 1409 1415 1430 1440 1455 1484 1506
2701 1506 1497 1470 1459 1460 1439 1383 1326 1296 1291 1303 1332 1364 1373 1353 1333 1331 1324 1295 1264 1250 1235 1204 1187 1226 1296 1330 1307 1277 1280 1305 1321 1336 1364 1381 1349 1268 1194 1176
2696 1176 1209 1244 1250 1238 1230 1226 1217 1210 1230 1280 1331 1362 1375 1378 1370 1358 1357 1368 1369 1360 1373 1419 1456 1449 1421 1413 1427 1427 1411 1394 1373 1329 1285 1283 1318 1330 1295 1250 1237 1249 1263
2691 1263 1274 1278 1262 1237 1233 1247 1235 1189 1167 1213 1279 1294 1257 1233 1249 1271 1270 1254 1248 1255 1268 1279 1279 1261 1231 1208 1203 1221 1261 1307 1330 1321 1306 1311 1316 1291 1250 1240 1272
2687 1272 1309 1321 1317 1321 1333 1335 1321 1299 1288 1297 1313 1308 1279 1254 1256 1267 1263 1264 1314 1404 1471 1475 1442 1426 1443 1477 1509 1530 1534 1523 1509 1504 1517 1552 1596 1614 1589 1554 1553 1581
2682 1581 1592 1579 1580 1613 1641 1639 1635 1661 1700 1712 1695 1673 1660 1658 1669 1679 1652 1587 1536 1546 1590 1609 1587 1554 1522 1486 1462 1473 1500 1500 1475 1466 1483 1487 1456 1416 1391 1377
2677 1377 1374 1392 1412 1396 1352 1337 1373 1406 1387 1345 1334 1345 1337 1308 1286 1271 1240 1207 1212 1253 1288 1300 1317 1353 1385 1402 1429 1484 1538 1549 1519 1489 1483 1487 1482 1472 1484
2673 1484 1522 1559 1553 1497 1429 1394 1402 1429 1441 1423 1382 1345 1338 1357 1372 1368 1365 1381 1398 1393 1378 1376 1377 1348 1291 1241 1209 1177 1145 1137 1153 1167 1176 1200 1226 1209 1144 1092 1084 1069
2668 1069 994 905 886 935 967 938 893 890 933 987 1028 1041 1022 992 984 1002 1012 986 940 903 887 884 883 879 868 865 890 937 957 917 840 782 773 797 826 850 875 901
2663 901 920 922 910 895 885 872 847 821 816 828 835 825 821 842 876 889 870 835 816 835 891 953 981 955 895 837 808 814 849 893 918 917 911 914 915 896 871 876 918 963
2658 963 969 931 884 867 891 933 958 953 942 947 962 965 956 954 960 953 920 877 845 820 785 753 757 809 868 889 871 852 857 872 875 871 874 875 864 860 893 950 980 965 951 989
2653 989 1059 1095 1072 1029 1009 1010 1010 998 982 968 955 950 963 997 1038 1063 1059 1038 1017 1001 980 959 963 997 1020 992 937 920 963 1015 1035 1037 1060 1106 1144 1154 1136 1097
2648 1097 1045 1000 978 975 976 986 1012 1039 1040 1017 997 988 973 943 911 888 868 856 874 927 972 973 950 952 981 993 970 960 1003 1067 1089 1062 1041 1058 1079 1058 1003
2644 1003 968 981 1024 1062 1075 1052 1001 950 944 993 1059 1096 1098 1095 1107 1125 1126 1100 1048 982 929 919 957 1003 1014 991 974 983 998 990 967 964 987 1012 1017 1011 1009 1002 979 946
2639 946 929 941 964 972 950 909 875 872 899 928 939 941 956 985 999 985 971 988 1027 1041 1000 934 904 936 985 996 964 934 928 916 875 823 799 806 818 821 827 837
2634 837 840 832 834 860 902 944 976 990 984 975 977 977 950 904 878 889 907 893 846 798 774 780 815 863 899 913 917 921 919 905 886 870 851 825 806 810 828 847 872 911 956
2629 956 983 986 970 942 918 921 959 997 998 962 926 904 888 871 869 887 910 923 921 902 867 826 800 799 816 843 870 884 878 872 890 917 918 881 846 851 897 958 1009 1023
2624 1023 977 884 799 772 802 852 892 912 910 898 901 924 931 888 820 794 842 918 958 943 909 897 914 938 947 941 930 918 904 898 916 950 971 960 941 949 978 984
2620 984 945 885 841 818 801 790 804 854 912 940 926 890 866 870 891 903 892 868 857 871 899 920 925 922 926 944 968 983 973 935 895 887 911 930 917 895 907
2615 907 956 994 986 949 922 916 907 885 866 867 885 904 918 923 915 890 858 837 840 863 894 928 953 960 952 952 969 983 969 941 939 967 988 976 962 975 992 968 915 897
2610 897 939 991 995 956 927 931 942 924 883 855 870 914 947 956 960 975 982 959 919 896 890 872 835 810 827 881 943 986 997 980 958 952 959 957 944 937 934 913 881 875 902
2605 902 919 897 862 850 858 865 875 899 926 932 920 908 903 904 919 947 967 969 974 992 994 959 909 888 895 908 922 949 975 979 973 973 956 906 869 902 974 991 930 872 873
2600 873 892 870 825 816 855 904 933 933 913 891 898 935 974 990 995 1004 1005 991 980 979 965 929 900 903 926 949 983 1032 1059 1024 952 897 872 858 860 901 963 992 979
2595 979 963 972 987 985 973 966 965 968 981 1004 1020 1016 991 951 915 918 975 1040 1045 989 939 947 984 1001 990 972 952 920 888 889 929 984 1028 1051 1049 1027 1007 1011 1041 1070 1068
2590 1068 1038 1013 1026 1072 1101 1070 1003 967 991 1041 1078 1104 1126 1122 1076 1027 1024 1052 1053 1016 983 977 967 937 921 955 1011 1036 1026 1012 1009 1006 1004 1015 1026 1009 970 946
2586 946 952 964 965 976 1017 1062 1078 1070 1064 1065 1054 1027 1007 1010 1039 1080 1111 1106 1059 1002 972 975 983 985 983 977 956 935 943 987 1037 1066 1076 1074 1050 1013 996 1020 1056 1066 1059 1072
2581 1072 1111 1142 1138 1107 1067 1022 984 973 990 1004 998 996 1029 1077 1088 1054 1031 1065 1124 1138 1098 1061 1060 1059 1024 987 994 1030 1042 1024 1021 1054 1083 1074 1042 1022 1016 1015 1024 1047
2576 1047 1070 1078 1079 1083 1083 1071 1060 1058 1055 1047 1058 1092 1111 1091 1066 1089 1151 1192 1180 1147 1129 1130 1140 1147 1141 1120 1106 1115 1131 1123 1095 1083 1097 1107 1089 1056 1027 1008 999 1007 1026
2571 1026 1044 1065 1100 1130 1118 1066 1022 1013 1020 1017 1020 1051 1090 1104 1082 1041 997 973 993 1048 1087 1072 1035 1032 1071 1103 1094 1063 1053 1078 1111 1114 1078 1034 1018 1036 1062 1085
2566 1085 1115 1146 1145 1102 1060 1062 1091 1095 1066 1047 1070 1111 1134 1135 1137 1153 1171 1174 1163 1154 1156 1157 1143 1129 1136 1163 1180 1172 1154 1136 1109 1072 1046 1050 1066 1080 1112 1171 1223 1219 1169
2561 1169 1128 1127 1141 1147 1150 1162 1170 1164 1147 1131 1119 1121 1156 1217 1262 1247 1177 1108 1087 1113 1149 1161 1144 1115 1091 1084 1101 1130 1147 1137 1122 1134 1164 1169 1136 1108 1127 1182
2556 1182 1234 1271 1297 1300 1276 1247 1243 1254 1252 1237 1235 1243 1238 1221 1218 1228 1224 1205 1199 1212 1205 1165 1131 1153 1219 1276 1296 1288 1269 1245 1223 1212 1216 1230 1248 1267 1289 1316 1344 1356
2552 1356 1338 1302 1280 1286 1299 1293 1266 1240 1232 1248 1282 1317 1333 1326 1310 1301 1303 1313 1321 1317 1298 1279 1273 1282 1301 1331 1368 1387 1365 1316 1273 1251 1231 1203 1173 1147 1135 1156 1219
2547 1219 1287 1312 1296 1287 1307 1313 1271 1207 1165 1150 1149 1169 1217 1260 1253 1204 1170 1180 1203 1198 1171 1156 1171 1197 1213 1223 1240 1253 1241 1208 1193 1218 1250 1244 1205 1182 1192
2542 1192 1205 1190 1158 1125 1098 1093 1132 1200 1233 1200 1147 1134 1155 1167 1162 1173 1200 1208 1191 1185 1216 1259 1277 1258 1222 1190 1177 1185 1202 1213 1211 1202 1197 1201 1216 1229 1220 1190 1170
2538 1170 1187 1227 1260 1279 1305 1348 1388 1403 1394 1378 1368 1368 1372 1368 1353 1330 1301 1266 1244 1253 1283 1304 1316 1350 1409 1439 1406 1346 1313 1300 1265 1216 1202 1235 1275 1294 1306
2533 1306 1333 1365 1389 1406 1415 1407 1385 1371 1371 1370 1351 1316 1279 1255 1265 1311 1364 1387 1379 1366 1351 1321 1293 1298 1333 1355 1343 1328 1339 1369 1397 1421 1444 1460 1468 1478 1487 1472
2528 1472 1432 1394 1376 1369 1357 1346 1347 1353 1359 1359 1348 1323 1305 1323 1367 1399 1404 1404 1409 1396 1361 1335 1339 1346 1334 1318 1323 1338 1343 1342 1352 1372 1390 1405 1407 1391 1378 1405 1458 1471 1419
2523 1419 1356 1333 1332 1325 1339 1401 1466 1482 1473 1494 1530 1528 1503 1513 1545 1526 1458 1426 1468 1519 1523 1517 1543 1574 1562 1523 1495 1471 1425 1388 1410 1475 1516 1500 1465 1447 1432
2519 1432 1401 1369 1374 1424 1491 1536 1545 1536 1529 1526 1512 1479 1438 1409 1406 1421 1435 1435 1431 1454 1514 1582 1622 1630 1627 1616 1582 1535 1506 1516 1548 1571 1564 1527 1473 1429 1419 1441 1481 1530
2514 1530 1573 1582 1545 1506 1518 1569 1592 1555 1495 1460 1452 1456 1468 1481 1470 1441 1433 1462 1492 1499 1523 1604 1700 1732 1686 1631 1616 1626 1626 1617 1609 1597 1580 1576 1594 1610 1594 1550 1507
2509 1507 1485 1484 1492 1495 1484 1464 1456 1478 1517 1540 1534 1522 1524 1532 1525 1511 1524 1567 1598 1589 1574 1601 1651 1658 1599 1540 1539 1581 1610 1608 1594 1575 1542 1516 1531 1581 1610 1590 1557 1558 1583
2504 1583 1595 1592 1603 1634 1652 1638 1615 1607 1613 1618 1627 1650 1671 1664 1628 1594 1577 1567 1557 1561 1577 1579 1560 1549 1571 1611 1637 1653 1671 1677 1653 1628 1646 1691 1702 1677 1671 1705 1725
2499 1725 1687 1627 1604 1615 1624 1622 1615 1588 1540 1521 1574 1660 1700 1688 1693 1743 1789 1785 1753 1746 1769 1789 1782 1752 1715 1691 1688 1700 1711 1726 1756 1791 1805 1795 1784 1789 1802 1810 1819 1827
2494 1827 1817 1780 1741 1725 1730 1730 1718 1707 1712 1724 1729 1719 1707 1706 1716 1730 1745 1766 1784 1774 1731 1687 1681 1704 1717 1704 1692 1706 1728 1731 1716 1712 1739 1782 1810 1799 1762 1740
2490 1740 1757 1794 1818 1825 1831 1829 1805 1780 1800 1861 1896 1863 1800 1779 1813 1856 1873 1872 1871 1875 1879 1883 1885 1878 1860 1846 1846 1854 1860 1858 1849 1830 1800 1777 1784 1817 1832 1800 1756 1771 1856 1935
2485 1935 1945 1912 1900 1914 1908 1876 1866 1898 1923 1903 1866 1855 1862 1860 1854 1860 1863 1836 1805 1822 1889 1939 1922 1864 1833 1852 1889 1906 1904 1904 1906 1886 1840 1808 1831 1893 1935 1926 1893
2480 1893 1869 1850 1823 1800 1806 1840 1882 1916 1933 1929 1918 1933 1986 2040 2052 2025 1990 1967 1955 1959 1982 2004 2003 1995 2004 2017 2002 1967 1957 1979 1996 1987 1985 2015 2048 2045 2015 2002 2017
2475 2017 2029 2016 1992 1976 1957 1912 1855 1833 1870 1929 1960 1960 1964 1980 1979 1951 1930 1937 1941 1919 1909 1954 2022 2036 1990 1949 1953 1973 1978 1979 1992 1996 1969 1929 1909 1917 1941 1971 1997
2470 1997 2010 2016 2030 2049 2053 2041 2042 2059 2063 2043 2023 2015 1996 1959 1941 1966 1997 1995 1982 2004 2054 2086 2092 2095 2094 2071 2034 2023 2041 2056 2057 2075 2117 2140 2108 2043 1999 2003 2037 2066
2466 2066 2062 2031 2009 2022 2054 2069 2058 2057 2086 2130 2153 2142 2110 2085 2085 2101 2101 2068 2017 1978 1947 1916 1908 1955 2033 2080 2076 2064 2074 2085 2082 2090 2126 2164 2176 2175 2181 2174 2143 2133
2461 2133 2181 2248 2260 2214 2183 2203 2233 2228 2202 2189 2184 2160 2118 2085 2077 2082 2082 2078 2088 2134 2200 2236 2209 2153 2140 2191 2244 2234 2166 2095 2057 2047 2046 2048 2063 2098 2151 2201
2456 2201 2226 2224 2221 2231 2239 2222 2189 2164 2154 2141 2124 2129 2170 2217 2216 2159 2092 2070 2104 2166 2227 2273 2297 2286 2244 2204 2203 2242 2286 2301 2290 2280 2286 2298 2299 2284 2270 2274 2300
2451 2300 2340 2377 2394 2379 2338 2295 2271 2265 2256 2248 2265 2316 2367 2379 2354 2330 2331 2344 2346 2330 2303 2282 2285 2321 2365 2385 2376 2361 2349 2332 2315 2323 2354 2374 2365 2351 2360 2368 2339 2287
2446 2287 2258 2268 2289 2304 2328 2372 2412 2419 2389 2343 2305 2294 2312 2332 2329 2306 2288 2278 2267 2268 2305 2365 2403 2401 2395 2417 2452 2474 2477 2465 2435 2397 2386 2411 2438 2433 2409 2394
2442 2394 2385 2370 2366 2385 2394 2357 2310 2321 2388 2435 2413 2354 2310 2290 2285 2302 2337 2350 2317 2280 2295 2354 2387 2360 2315 2313 2363 2425 2464 2478 2474 2443 2382 2318 2293 2314 2341
2437 2341 2345 2343 2363 2396 2412 2407 2399 2389 2363 2336 2342 2377 2391 2362 2326 2328 2365 2403 2424 2434 2434 2424 2410 2403 2407 2428 2468 2504 2504 2473 2454 2464 2475 2471 2487 2545 2594 2570 2502 2472
2432 2472 2505 2537 2516 2468 2452 2474 2494 2480 2442 2409 2408 2439 2482 2517 2550 2590 2627 2637 2614 2577 2544 2523 2524 2541 2542 2498 2433 2401 2425 2475 2509 2512 2489 2459 2459 2511 2572
2428 2572 2581 2541 2515 2532 2544 2512 2468 2459 2476 2485 2492 2509 2511 2469 2419 2417 2457 2481 2470 2462 2488 2524 2542 2545 2546 2547 2552 2569 2587 2586 2578 2595 2635 2647 2607 2562 2561 2590 2598 2573 2542 2527
2423 2527 2522 2523 2530 2533 2522 2509 2524 2569 2609 2611 2582 2559 2557 2563 2559 2553 2579 2648 2723 2748 2719 2685 2691 2711 2691 2623 2567 2570 2611 2638 2634 2629 2636 2637 2607 2561 2531 2528 2539 2551 2565 2576
2417 2576 2573 2559 2553 2572 2606 2640 2677 2722 2753 2735 2677 2631 2637 2672 2686 2657 2612 2586 2590 2608 2618 2611 2602 2612 2641 2666 2666 2646 2626 2608 2578 2543 2530 2554 2592 2613 2612 2610 2627
2413 2627 2655 2678 2689 2698 2712 2720 2707 2677 2661 2683 2722 2730 2690 2643 2632 2645 2637 2594 2552 2539 2538 2529 2527 2557 2606 2631 2621 2609 2617 2622 2602 2572 2568 2586 2596 2589 2592 2617 2637 2621
2408 2621 2586 2573 2592 2610 2602 2583 2586 2620 2658 2673 2658 2631 2612 2606 2604 2595 2584 2592 2623 2658 2677 2693 2724 2747 2719 2640 2569 2555 2581 2604 2624 2664 2714 2728 2701 2674 2669 2657
2403 2657 2614 2573 2574 2601 2611 2598 2596 2615 2633 2637 2647 2682 2732 2762 2747 2693 2638 2618 2632 2639 2612 2576 2569 2590 2615 2635 2657 2674 2672 2661 2666 2683 2686 2673 2676 2701 2719 2709 2685
2398 2685 2662 2635 2608 2607 2632 2645 2623 2597 2606 2639 2658 2656 2653 2652 2644 2640 2659 2693 2710 2703 2692 2686 2675 2664 2673 2694 2693 2661 2637 2648 2673 2669 2643 2634 2662 2696 2694 2649 2593 2573 2601
2393 2601 2648 2672 2664 2653 2666 2698 2723 2725 2714 2710 2718 2722 2701 2652 2598 2561 2543 2534 2533 2541 2551 2556 2563 2584 2618 2653 2674 2676 2655 2620 2594 2592 2602 2608 2621 2662 2715 2736 2708 2665 2641
2388 2641 2632 2616 2597 2595 2614 2634 2633 2597 2539 2498 2506 2544 2560 2539 2517 2521 2526 2499 2457 2446 2477 2517 2542 2555 2564 2571 2567 2544 2505 2468 2460 2476 2482 2468 2472 2511 2545 2535 2517 2554
2383 2554 2619 2629 2564 2501 2493 2495 2453 2391 2369 2389 2407 2414 2430 2459 2479 2482 2485 2494 2499 2505 2519 2527 2506 2474 2472 2512 2551 2561 2558 2560 2556 2531 2508 2520 2562 2600 2619 2632 2642 2634 2610
2378 2610 2591 2583 2573 2557 2554 2571 2585 2574 2555 2553 2562 2556 2538 2536 2557 2576 2574 2575 2593 2603 2572 2517 2484 2484 2482 2456 2426 2420 2428 2425 2408 2398 2404 2413 2415 2415 2435 2484 2548 2587 2574 2533 2510
2373 2510 2517 2520 2492 2462 2469 2503 2522 2514 2507 2512 2512 2503 2508 2537 2558 2551 2534 2525 2505 2454 2392 2359 2357 2360 2362 2383 2419 2441 2435 2421 2421 2425 2420 2413 2417 2427 2426 2413 2401 2407 2438 2485 2520 2507 2448
2368 2448 2381 2347 2346 2350 2337 2308 2275 2257 2272 2318 2374 2416 2440 2450 2441 2411 2383 2384 2405 2417 2411 2406 2409 2398 2361 2324 2318 2340 2362 2376 2393 2413 2421 2412 2405 2421 2447 2447 2408 2363
2363 2363 2353 2385 2428 2459 2488 2527 2558 2545 2485 2416 2378 2380 2410 2447 2462 2434 2371 2310 2283 2285 2298 2314 2329 2331 2309 2286 2295 2347 2407 2428 2397 2348 2327 2341 2353 2336
2358 2336 2318 2340 2382 2376 2309 2256 2281 2347 2378 2365 2356 2356 2320 2247 2205 2238 2309 2364 2395 2417 2415 2380 2344 2344 2362 2360 2349 2364 2394 2386 2341 2325 2375 2439 2445 2393 2338 2317
2354 2317 2314 2303 2279 2254 2240 2238 2250 2268 2283 2285 2277 2262 2244 2233 2234 2245 2250 2241 2228 2236 2271 2300 2291 2255 2237 2257 2285 2286 2270 2258 2245 2203 2142 2107 2114 2128 2106 2057 2031 2059
2349 2059 2131 2204 2239 2230 2210 2215 2236 2241 2226 2215 2213 2183 2116 2060 2066 2112 2140 2133 2121 2124 2135 2152 2183 2207 2189 2141 2119 2147 2184 2187 2174 2176 2188 2194 2209 2251 2284 2264 2217
2344 2217 2210 2249 2261 2208 2138 2115 2133 2142 2134 2135 2156 2173 2167 2140 2103 2076 2085 2131 2171 2165 2137 2143 2187 2214 2189 2143 2122 2134 2154 2170 2174 2157 2132 2132 2162 2177 2143 2092 2075
2339 2075 2091 2104 2109 2128 2149 2129 2071 2042 2086 2163 2199 2175 2132 2111 2115 2122 2116 2104 2113 2153 2194 2187 2131 2076 2059 2061 2048 2032 2047 2088 2112 2090 2034 1987 1979 2009 2043 2050 2036
2335 2036 2034 2058 2075 2059 2027 2006 1990 1969 1961 1986 2020 2019 1991 1975 1974 1946 1888 1855 1891 1967 2018 2018 1990 1963 1951 1960 1993 2041 2085 2103 2084 2044 2019 2029 2050 2042 2004 1973
2330 1973 1970 1983 2001 2023 2037 2018 1973 1941 1935 1927 1904 1900 1933 1964 1959 1949 1977 2024 2040 2023 2015 2030 2045 2053 2056 2041 1995 1957 1975 2021 2010 1926 1849 1849 1892 1904 1873 1846 1846
2325 1846 1856 1861 1873 1899 1930 1950 1953 1942 1928 1923 1925 1923 1921 1934 1959 1972 1961 1938 1916 1899 1891 1901 1926 1936 1918 1888 1863 1837 1817 1835 1896 1954 1963 1935 1917 1928 1943 1945 1945
2320 1945 1948 1937 1895 1823 1741 1684 1686 1743 1807 1834 1827 1813 1803 1796 1802 1831 1862 1863 1839 1814 1792 1765 1748 1770 1807 1809 1770 1739 1743 1745 1714 1672 1660 1680 1709 1736 1754 1740 1695
2316 1695 1670 1705 1777 1825 1834 1842 1867 1882 1856 1800 1753 1740 1755 1778 1790 1788 1778 1759 1719 1667 1636 1650 1688 1714 1717 1720 1731 1740 1745 1757 1773 1770 1735 1687 1661 1672 1701 1717
2311 1717 1709 1698 1712 1743 1751 1723 1703 1727 1767 1771 1747 1753 1800 1825 1777 1696 1647 1643 1649 1652 1674 1720 1754 1744 1699 1663 1663 1685 1690 1661 1628 1637 1689 1738 1754 1750 1747 1726 1669 1608
2306 1608 1597 1636 1672 1673 1662 1674 1709 1740 1745 1705 1627 1551 1529 1560 1592 1591 1586 1616 1661 1671 1638 1605 1598 1600 1587 1562 1543 1541 1556 1581 1604 1613 1612 1615 1618 1608 1594 1606 1641 1668
2301 1668 1667 1660 1664 1647 1584 1512 1499 1551 1602 1606 1587 1585 1598 1605 1610 1635 1674 1695 1684 1662 1647 1640 1631 1608 1571 1534 1521 1549 1599 1636 1641 1628 1619 1621 1627 1626 1614 1601 1609 1634 1646 1617
2296 1617 1566 1541 1557 1584 1596 1603 1617 1615 1576 1525 1518 1562 1601 1596 1571 1579 1622 1654 1647 1622 1609 1604 1585 1545 1502 1471 1460 1479 1528 1587 1622 1627 1629 1650 1676 1675 1636 1584 1553
2291 1553 1565 1615 1666 1672 1620 1551 1513 1513 1521 1525 1533 1550 1555 1538 1509 1494 1512 1572 1657 1715 1701 1643 1616 1647 1674 1641 1582 1568 1605 1641 1654 1669 1699 1712 1694 1676 1685 1702
2287 1702 1700 1684 1669 1649 1618 1603 1625 1660 1676 1677 1686 1696 1678 1647 1645 1679 1700 1681 1651 1648 1657 1650 1632 1640 1682 1724 1731 1703 1669 1656 1670 1686 1679 1653 1637 1647 1664 1664 1652 1645
2282 1645 1643 1638 1638 1644 1636 1589 1525 1487 1487 1491 1484 1493 1536 1575 1565 1517 1488 1510 1561 1592 1577 1527 1473 1440 1428 1422 1420 1429 1442 1430 1390 1359 1370 1410 1439 1445 1448 1461 1472 1478 1483 1487 1479
2276 1479 1461 1442 1426 1413 1428 1487 1552 1563 1514 1467 1459 1460 1432 1395 1392 1418 1432 1416 1392 1385 1395 1415 1437 1455 1472 1490 1503 1496 1475 1469 1475 1449 1375 1307 1307 1358 1404 1430
2272 1430 1463 1499 1497 1453 1409 1391 1385 1396 1456 1541 1563 1481 1371 1329 1350 1365 1356 1369 1420 1458 1443 1399 1363 1339 1308 1277 1267 1293 1342 1388 1404 1385 1353 1341 1359
2268 1359 1391 1414 1420 1413 1408 1420 1446 1454 1422 1367 1334 1337 1341 1314 1271 1256 1288 1338 1373 1381 1377 1378 1385 1390 1396 1408 1413 1389 1334 1296 1324 1399 1443 1409 1337 1301 1325 1374 1411 1431 1443
2263 1443 1450 1459 1484 1514 1518 1480 1431 1410 1419 1429 1422 1412 1408 1413 1431 1461 1483 1466 1427 1417 1462 1518 1539 1538 1557 1597 1617 1607 1592 1589 1590 1593 1605 1618 1613 1609 1648 1713 1732 1680 1626
2258 1626 1633 1665 1653 1606 1596 1638 1683 1697 1701 1716 1729 1737 1762 1815 1874 1921 1955 1978 1992 2011 2053 2096 2107 2101 2129 2202 2276 2329 2382 2454 2528 2589 2652 2722 2779 2828
2253 2828 2915 3052 3182 3260 3314 3390 3468 3503 3502 3508 3524 3521 3499 3490 3506 3534 3574 3626 3664 3657 3627 3617 3616 3584 3523 3485 3483 3470 3420 3362 3322 3285 3229 3157 3073 2966
2249 2966 2849 2761 2699 2616 2491 2378 2314 2261 2164 2044 1966 1947 1951 1952 1945 1913 1848 1783 1755 1758 1753 1731 1708 1675 1617 1559 1545 1560 1549 1512 1511 1567 1614 1598 1552
2244 1552 1539 1552 1543 1516 1513 1530 1517 1462 1417 1417 1429 1416 1391 1384 1381 1356 1330 1352 1416 1453 1424 1377 1374 1409 1420 1379 1322 1289 1280 1272 1263 1254 1238 1205 1169 1157 1175 1206 1231
2240 1231 1247 1256 1258 1253 1246 1245 1258 1281 1309 1329 1335 1320 1279 1218 1161 1138 1155 1185 1198 1189 1178 1182 1203 1223 1221 1192 1159 1147 1159 1173 1181 1193 1213 1221 1212 1210 1233 1253 1238 1200 1179
2235 1179 1183 1185 1170 1162 1182 1220 1251 1258 1242 1214 1194 1189 1188 1176 1164 1174 1206 1242 1267 1277 1256 1203 1151 1142 1178 1213 1214 1193 1177 1173 1178 1185 1180 1153 1122 1113 1122 1122 1114 1120 1132 1118 1091
2229 1091 1110 1182 1232 1198 1129 1108 1144 1184 1203 1216 1220 1198 1170 1179 1217 1228 1189 1142 1128 1142 1160 1173 1181 1171 1135 1084 1037 1013 1023 1055 1075 1071 1075 1115 1156 1147 1113
2225 1113 1126 1190 1228 1199 1157 1163 1199 1217 1221 1242 1273 1276 1254 1242 1254 1265 1255 1233 1220 1230 1262 1295 1300 1271 1233 1206 1191 1192 1221 1267 1282 1249 1206 1186 1166 1118 1076
2220 1076 1089 1135 1147 1118 1098 1114 1134 1135 1143 1175 1207 1214 1210 1211 1203 1170 1129 1105 1097 1098 1107 1121 1123 1112 1111 1141 1181 1194 1173 1142 1124 1128 1150 1178 1190 1175 1149 1141 1161 1191 1204
2215 1204 1194 1178 1178 1192 1202 1196 1190 1192 1185 1154 1124 1126 1149 1157 1156 1188 1246 1275 1253 1233 1250 1261 1218 1155 1146 1194 1228 1211 1185 1201 1251 1291 1289 1241 1165 1102 1082 1098 1119
2211 1119 1136 1163 1198 1216 1215 1225 1258 1278 1252 1203 1180 1196 1220 1225 1210 1186 1158 1140 1150 1182 1206 1201 1180 1170 1167 1158 1148 1158 1183 1191 1177 1179 1221 1266 1267 1226 1182 1146
2206 1146 1109 1091 1119 1165 1162 1110 1089 1144 1208 1207 1163 1141 1143 1126 1110 1146 1214 1231 1177 1126 1128 1149 1149 1156 1193 1221 1191 1129 1094 1093 1094 1088 1088 1087 1064 1035 1035 1065 1094 1112
2201 1112 1141 1190 1238 1262 1258 1236 1209 1190 1183 1178 1170 1177 1202 1214 1181 1128 1112 1151 1202 1234 1259 1300 1348 1375 1371 1341 1303 1274 1262 1253 1228 1199 1190 1198 1197 1190 1210 1267 1313 1309
2196 1309 1281 1272 1277 1263 1233 1226 1251 1273 1271 1262 1265 1274 1274 1268 1260 1250 1249 1273 1305 1300 1248 1197 1189 1193 1163 1119 1123 1178 1211 1189 1167 1199 1247 1244 1210 1215 1271 1316 1315 1305 1314 1316 1291 1283 1332
2191 1332 1401 1421 1392 1368 1375 1387 1385 1373 1346 1294 1256 1289 1382 1448 1439 1406 1410 1435 1426 1398 1406 1453 1473 1431 1369 1341 1352 1374 1406 1456 1509 1536 1529 1518 1537 1586 1633 1640
2186 1640 1598 1542 1519 1543 1584 1600 1590 1583 1596 1613 1613 1601 1597 1609 1625 1639 1658 1686 1706 1695 1664 1662 1713 1781 1799 1758 1717 1740 1813 1872 1876 1846 1824 1827 1852 1896 1957
2181 1957 2015 2044 2040 2024 2015 2013 2016 2033 2059 2074 2065 2052 2056 2075 2094 2117 2158 2208 2246 2277 2321 2375 2406 2399 2384 2397 2439 2486 2522 2546 2571 2620 2705 2804 2875 2912 2956 3030
2177 3030 3102 3141 3164 3204 3251 3288 3332 3417 3525 3610 3672 3749 3849 3943 4028 4135 4255 4339 4381 4447 4577 4725 4839 4954 5128 5345 5537 5687
2173 5687 5838 6013 6193 6383 6611 6876 7138 7383 7644 7939 8238 8518 8811 9158 9545 9931 10311 10715 11159 11621 12077 12526 12984
2171 12984 13471 13991 14532 15074 15609 16139 16659 17149 17597 18013 18411 18795 19166 19526 19864 20163 20424 20668 20894 21061 21149 21205 21293 21410
2168 21410 21493 21502 21456 21392 21315 21213 21087 20939 20763 20553 20322 20070 19776 19419 19006 18564 18109 17635 17139 16631 16133 15661 15205 14734 14227
2165 14227 13710 13228 12790 12355 11901 11453 11048 10672 10283 9877 9493 9153 8838 8521 8207 7916 7646 7383 7123 6876 6650 6436 6227
2162 6227 6022 5826 5638 5458 5296 5158 5035 4907 4766 4633 4527 4428 4295 4126 3967 3861 3790 3709 3605 3509 3441 3388 3333 3283 3243 3200
2159 3200 3139 3066 3008 2980 2980 2987 2975 2926 2851 2785 2746 2717 2675 2614 2550 2491 2446 2429 2431 2412 2348 2267 2217 2196 2156 2087 2038 2044 2074 2073 2030 1973 1925 1885 1857 1854 1864
2154 1864 1861 1836 1805 1789 1797 1827 1865 1880 1848 1785 1734 1706 1675 1628 1593 1601 1631 1642 1627 1610 1600 1576 1532 1496 1499 1533 1565 1565 1528 1473 1431 1418 1414 1392 1357 1342 1359
2150 1359 1387 1405 1420 1444 1464 1456 1424 1390 1358 1321 1281 1259 1262 1274 1278 1267 1250 1241 1246 1249 1228 1191 1182 1225 1283 1302 1278 1259 1267 1280 1282 1288 1311 1326 1309 1266 1223 1197 1200 1236
2145 1236 1281 1286 1240 1186 1171 1186 1189 1172 1153 1148 1147 1137 1110 1064 1013 994 1023 1072 1101 1106 1107 1107 1096 1083 1080 1070 1035 995 996 1040 1077 1082 1083 1104 1129 1131 1112 1090 1067 1043
2140 1043 1024 1022 1039 1075 1120 1148 1131 1083 1051 1055 1074 1086 1100 1116 1111 1074 1042 1051 1081 1094 1095 1118 1154 1164 1134 1098 1085 1083 1070 1047 1030 1029 1045 1069 1083 1072 1051 1048
2135 1048 1070 1090 1087 1076 1076 1086 1084 1062 1032 1013 1008 1005 1002 995 982 957 928 916 937 977 1013 1044 1073 1089 1076 1055 1061 1090 1089 1041 995 999 1028 1028 993 964 963 985 1022 1059
2130 1059 1063 1017 961 949 974 979 953 939 961 984 972 937 905 883 874 889 914 921 910 917 954 977 957 920 910 921 925 924 939 955 950 938 958 1009 1053 1067 1058 1034 995
2125 995 957 940 940 935 921 919 933 946 954 968 984 974 933 897 902 936 958 950 919 882 857 858 883 912 925 921 908 889 868 847 828 802 778 781 830 897 937 934 917 914
2121 914 911 881 838 823 854 898 918 915 913 918 924 938 969 1001 1003 970 935 914 895 867 854 874 911 935 940 929 902 874 878 914 936 911 876 889 940 967 950 929 932
2116 932 934 912 885 874 870 860 855 868 892 915 939 954 940 902 874 876 888 887 886 897 899 871 838 842 879 905 904 899 911 938 972 1000 996 944 867 814 806 816 809 784 761
2111 761 763 796 845 882 893 889 884 868 825 779 772 811 857 877 883 894 911 917 910 892 866 842 843 874 913 928 912 876 837 809 812 850 899 916 884 822 775 771 811 865
2106 865 900 906 897 885 877 872 875 885 897 912 932 949 957 964 988 1015 1003 945 888 872 883 889 899 939 984 976 909 848 841 868 889 907 939 961 933 872 844 876 925 931
2101 931 894 856 849 868 893 911 920 921 911 882 845 829 853 897 919 902 870 852 843 824 800 794 813 845 879 915 950 973 982 986 993 995 992 1001 1033 1069 1078 1053 1016 987 962
2096 962 929 884 839 805 791 800 826 856 875 877 869 857 844 830 831 857 895 913 896 872 871 889 890 862 830 816 810 792 775 793 842 883 887 870 862 867 869 866 872 893 914
2091 914 917 907 899 899 901 906 918 927 911 861 808 784 792 807 826 873 944 992 977 921 879 873 883 897 918 938 926 876 823 804 811 812 803 803 815 827 844 885 945 982 972
2086 972 946 954 1000 1042 1053 1052 1062 1074 1071 1056 1046 1032 992 933 904 938 1015 1092 1148 1177 1173 1134 1094 1098 1145 1182 1168 1123 1090 1091 1114 1139 1146 1117 1066 1035 1058 1109
2081 1109 1132 1113 1092 1099 1121 1124 1100 1075 1065 1063 1060 1049 1029 1007 996 1018 1071 1126 1146 1124 1085 1066 1075 1090 1085 1059 1027 1004 995 1004 1027 1055 1076 1085 1086 1075 1051 1022 1009
2077 1009 1023 1047 1060 1057 1046 1030 1019 1034 1077 1116 1108 1062 1032 1050 1085 1089 1058 1024 1006 994 994 1023 1069 1087 1051 996 974 992 1008 989 942 900 889 919 970 1002
2072 1002 995 974 986 1034 1073 1067 1027 991 979 987 1004 1013 996 963 949 978 1028 1061 1067 1062 1047 1006 942 893 897 939 973 965 922 875 856 878 924 956 951 926 916 930 943
2067 943 931 902 876 867 880 920 976 1017 1014 981 955 948 930 887 849 857 895 911 886 858 865 904 939 945 916 871 845 864 913 948 955 954 954 936 898 886 928 977 960
2063 960 883 828 849 905 935 932 931 944 946 923 903 922 983 1052 1084 1064 1020 989 981 973 952 930 922 917 899 871 858 881 935 986 992 942 876 858 901 951 950 908 883
2058 883 904 948 974 971 954 947 964 1004 1039 1046 1033 1028 1038 1036 1011 988 992 1001 976 918 873 875 906 930 945 970 1003 1015 989 952 936 940 935 909 889 906 953 994 1008 1010
2053 1010 1022 1038 1037 1017 1003 1005 1008 989 952 929 940 971 990 980 955 945 967 1012 1050 1059 1043 1019 997 977 964 977 1024 1079 1104 1089 1064 1065 1092 1118 1117 1089 1049
2048 1049 1017 1002 1007 1024 1039 1035 1009 977 966 991 1041 1091 1114 1099 1067 1056 1091 1149 1183 1181 1178 1202 1239 1256 1249 1234 1210 1170 1139 1167 1268 1386 1447 1424 1356 1302
2044 1302 1289 1304 1306 1272 1224 1208 1234 1272 1292 1303 1324 1345 1338 1296 1249 1234 1258 1303 1338 1339 1302 1253 1225 1232 1267 1314 1350 1351 1313 1266 1244 1254 1271 1274 1273 1279 1292 1298 1302
2039 1302 1314 1339 1361 1367 1363 1363 1380 1407 1426 1423 1397 1367 1358 1374 1392 1390 1380 1395 1437 1465 1446 1413 1421 1467 1493 1483 1492 1558 1640 1675 1667 1667 1693 1718 1729 1740 1753 1745 1707 1665
2034 1665 1643 1649 1684 1738 1775 1766 1731 1726 1767 1812 1831 1839 1850 1847 1823 1810 1837 1875 1882 1866 1869 1902 1942 1973 2003 2021 2015 2000 2014 2062 2104 2114 2111 2129 2176 2234 2278 2287 2252
2030 2252 2197 2172 2204 2269 2325 2357 2382 2419 2463 2501 2527 2544 2562 2583 2598 2598 2588 2589 2620 2677 2730 2760 2772 2790 2823 2861 2899 2946 3007 3066 3107 3142 3194 3252 3289
2025 3289 3302 3324 3372 3432 3494 3575 3677 3761 3791 3795 3825 3896 3980 4062 4156 4265 4374 4468 4549 4620 4690 4786 4919 5047 5114 5136 5187 5302 5440 5552 5656
2022 5656 5795 5972 6153 6314 6453 6575 6702 6868 7089 7325 7527 7693 7864 8065 8282 8486 8678 8894 9170 9506 9854 10161 10431
2019 10431 10716 11047 11403 11767 12159 12588 13021 13435 13868 14370 14926 15484 16049 16665 17325 17970 18594 19271 20051 20887 21705 22512 23363
2016 23363 24266 25186 26118 27106 28169 29259 30318 31346 32394 33493 34622 35728 36778 37780 38765 39738 40667 41506 42234
2014 42234 42859 43394 43845 44208 44472 44621 44642 44533 44310 43995 43599 43110 42505 41785 40990 40168 39320 38407 37419 36398 35390 34397
2011 34397 33387 32353 31320 30314 29342 28398 27474 26565 25674 24811 23981 23184 22426 21716 21040 20357 19649 18961 18355 17827 17314
2008 17314 16776 16245 15769 15348 14943 14539 14155 13809 13490 13178 12870 12577 12312 12079 11870 11677 11498 11331 11175 11036 10926 10853 10802
2006 10802 10748 10688 10653 10664 10703 10739 10766 10804 10863 10944 11054 11199 11356 11489 11595 11710 11849 11973 12046 12087 12132 12168 12145 12058 11948 11827 11651 11397
2002 11397 11115 10861 10627 10364 10071 9785 9516 9241 8953 8678 8417 8144 7868 7638 7461 7273 7029 6778 6590 6450 6290 6091 5905
1999 5905 5760 5635 5509 5401 5319 5235 5127 5016 4923 4831 4725 4627 4561 4508 4441 4362 4295 4235 4168 4103 4059 4030 3996 3961 3947 3946 3936 3928 3939 3949 3921 3884
1995 3884 3908 3996 4061 4045 4004 4012 4046 4040 3998 3981 4004 4015 3996 3992 4024 4045 4014 3960 3927 3907 3860 3779 3690 3602 3511 3429 3378 3349 3302 3220 3120 3028 2959 2915 2900
1991 2900 2901 2896 2868 2823 2775 2737 2722 2733 2755 2758 2732 2689 2647 2617 2596 2579 2552 2515 2491 2504 2546 2570 2540 2476 2427 2419 2439 2451 2440 2421 2417 2425 2406 2331 2233 2184 2215
1987 2215 2282 2319 2309 2287 2282 2291 2297 2288 2259 2219 2186 2172 2169 2168 2164 2151 2125 2093 2086 2110 2130 2106 2051 2011 2005 2013 2020 2038 2072 2102 2114 2128 2161 2199 2217 2216 2225 2262 2310 2342 2343
1982 2343 2327 2325 2348 2383 2415 2452 2501 2537 2534 2509 2506 2531 2544 2527 2516 2541 2575 2576 2551 2528 2505 2456 2388 2337 2321 2326 2331 2325 2301 2261 2226 2212 2205 2185 2161 2148 2124 2066
1977 2066 1996 1960 1952 1926 1877 1850 1866 1886 1873 1842 1821 1799 1768 1746 1750 1764 1777 1806 1851 1870 1830 1763 1716 1691 1666 1656 1678 1709 1703 1666 1642 1647 1657 1667 1694 1729
1973 1729 1731 1701 1686 1713 1752 1761 1738 1706 1677 1661 1667 1685 1688 1661 1618 1583 1573 1600 1661 1712 1706 1648 1595 1581 1590 1593 1580 1548 1499 1469 1505 1589 1638 1609 1560 1555 1583 1592 1586
1968 1586 1596 1605 1574 1513 1487 1522 1576 1606 1607 1597 1588 1586 1588 1584 1570 1571 1595 1609 1575 1513 1474 1468 1468 1474 1513 1574 1610 1606 1598 1604 1597 1571 1561 1585 1597 1561 1515 1518 1565 1603 1605 1586
1963 1586 1569 1566 1588 1629 1664 1680 1691 1708 1712 1680 1630 1588 1556 1531 1535 1582 1632 1640 1624 1638 1681 1700 1676 1647 1642 1640 1620 1596 1587 1588 1592 1613 1651 1683 1695 1710 1752 1798 1811
1958 1811 1789 1758 1735 1722 1725 1745 1763 1761 1751 1757 1773 1775 1757 1741 1748 1773 1801 1817 1817 1814 1835 1892 1954 1986 1994 2011 2035 2030 1994 1976 2002 2028 2010 1970 1964 1992 2009 2006 2026 2090
1953 2090 2159 2190 2190 2180 2165 2151 2159 2189 2198 2157 2107 2107 2150 2184 2198 2232 2292 2337 2354 2385 2458 2526 2539 2513 2507 2541 2584 2614 2636 2663 2697 2739 2781 2807 2815 2831 2875
1948 2875 2927 2964 2996 3047 3099 3118 3113 3136 3201 3269 3311 3340 3375 3408 3436 3466 3500 3521 3536 3575 3640 3681 3675 3674 3732 3824 3882 3894 3913 3957 3981 3954 3912 3923 3995 4080
1944 4080 4129 4138 4137 4155 4192 4230 4256 4283 4325 4376 4407 4407 4400 4411 4446 4493 4548 4612 4676 4723 4754 4790 4849 4920 4972 4998 5022 5058 5096 5133 5191 5289 5402 5487 5544 5609
1940 5609 5689 5746 5764 5779 5828 5899 5961 6025 6117 6222 6306 6373 6455 6561 6665 6766 6900 7085 7287 7459 7588 7690 7793 7916 8068 8232 8390
1936 8390 8546 8720 8908 9086 9250 9421 9606 9790 9969 10162 10375 10589 10804 11051 11343 11647 11938 12234 12558 12885 13176 13457 13795
1934 13795 14209 14648 15071 15485 15922 16389 16871 17356 17839 18322 18831 19402 20046 20741 21461 22195 22942 23697 24478 25317 26226 27188 28195
1931 28195 29277 30456 31718 33032 34415 35913 37543 39270 41063 42942 44957 47149 49523 52063 54751 57592 60632
1929 60632 63941 67556 71462 75635 80087 84862 89996 95518 101459 107846 114668 121890 129498 137511 145939 154752 163893
1927 163893 173292 182865 192505 202093 211491 220511 228931 236565 243289 248988 253501 256676 258441 258783 257671 255080 251087
1924 251087 245871 239612 232426 224437 215839 206849 197623 188266 178901 169681 160714 152046 143699 135705 128091 120874 114068
1922 114068 107687 101711 96094 90806 85852 81244 76949 72914 69114 65573 62314 59306 56471 53756 51183 48812 46648
1920 46648 44631 42700 40857 39129 37513 35971 34482 33057 31713 30462 29319 28280 27300 26322 25343 24421 23592 22825 22077
1918 22077 21354 20691 20088 19496 18885 18279 17720 17220 16764 16334 15923 15517 15103 14680 14272 13910 13607 13335 13052 12732 12401 12106 11868
1915 11868 11649 11397 11103 10810 10560 10345 10132 9909 9701 9528 9373 9206 9021 8837 8668 8518 8380 8245 8102 7947 7797 7676 7590
1912 7590 7516 7424 7301 7160 7017 6884 6760 6652 6565 6488 6392 6266 6141 6058 6006 5929 5802 5672 5591 5544 5478 5376 5277 5214 5169 5106 5016 4916
1909 4916 4825 4741 4658 4581 4534 4530 4538 4494 4374 4231 4136 4094 4058 4001 3939 3892 3851 3804 3743 3663 3564 3475 3438 3448 3456 3435 3405 3382 3342 3266 3184 3137 3128 3138 3151
1905 3151 3156 3128 3059 2980 2927 2894 2855 2815 2797 2802 2808 2801 2781 2745 2697 2655 2631 2610 2582 2570 2593 2621 2610 2562 2527 2534 2566 2596 2607 2591 2557 2534 2541 2556 2543 2503 2468
1900 2468 2450 2442 2445 2458 2452 2409 2366 2367 2392 2381 2336 2316 2333 2328 2282 2249 2268 2298 2296 2289 2303 2296 2228 2151 2145 2196 2223 2202 2178 2170 2153 2122 2107 2110 2093 2052 2028 2029 2004 1936
1895 1936 1887 1913 1972 1982 1937 1904 1935 1996 2025 1999 1953 1936 1955 1970 1940 1879 1839 1842 1861 1872 1892 1940 1985 1981 1937 1912 1938 1982 1991 1960 1933 1940 1963 1971 1952 1920 1876
1891 1876 1815 1757 1746 1796 1852 1846 1779 1719 1709 1720 1705 1664 1629 1611 1599 1595 1612 1643 1666 1669 1656 1632 1599 1573 1564 1559 1535 1494 1474 1499 1551 1593 1613 1619 1621 1614 1596 1573
1886 1573 1558 1563 1588 1616 1626 1609 1577 1550 1530 1512 1499 1497 1506 1517 1519 1508 1483 1451 1427 1424 1435 1435 1410 1382 1379 1399 1405 1377 1340 1338 1378 1428 1454 1452 1440 1435 1440 1448 1445 1426 1402
1881 1402 1392 1398 1403 1395 1378 1361 1340 1312 1281 1256 1238 1226 1223 1231 1243 1251 1264 1291 1319 1323 1300 1277 1275 1288 1293 1272 1236 1211 1219 1250 1273 1269 1262 1281 1313 1309 1248 1174 1143 1167 1212
1876 1212 1247 1262 1260 1246 1231 1227 1237 1253 1266 1274 1278 1282 1287 1285 1267 1239 1227 1249 1286 1308 1307 1301 1302 1299 1284 1264 1243 1219 1193 1174 1161 1150 1144 1162 1203 1235 1238 1240 1270 1312 1320 1289
1871 1289 1269 1299 1351 1367 1321 1250 1211 1230 1288 1342 1362 1361 1372 1406 1445 1455 1423 1365 1314 1304 1338 1383 1399 1390 1393 1423 1447 1430 1383 1342 1317 1298 1279 1271 1278 1287 1294 1310
1866 1310 1336 1353 1345 1313 1278 1263 1273 1295 1296 1268 1237 1236 1260 1271 1248 1212 1195 1202 1215 1219 1217 1221 1237 1255 1255 1238 1226 1233 1236 1214 1191 1204 1235 1226 1175 1158 1213 1273 1266 1221
1861 1221 1223 1276 1306 1288 1283 1332 1384 1379 1334 1316 1352 1411 1448 1437 1380 1314 1299 1361 1459 1528 1551 1566 1599 1638 1656 1648 1627 1604 1591 1594 1614 1645 1683 1716 1734 1743 1761
1857 1761 1787 1806 1818 1862 1963 2088 2175 2210 2232 2264 2291 2301 2318 2360 2407 2430 2429 2421 2407 2379 2345 2322 2317 2320 2318 2294 2238 2164 2102 2065 2030 1980 1934 1913 1898 1854
1852 1854 1783 1718 1670 1616 1558 1527 1527 1517 1467 1404 1374 1379 1391 1397 1400 1394 1368 1333 1309 1296 1281 1261 1248 1234 1199 1139 1084 1068 1094 1134 1152 1133 1102 1100 1130 1149 1123
1848 1123 1069 1028 1011 1004 1010 1046 1089 1092 1049 1019 1046 1094 1104 1075 1059 1086 1127 1141 1120 1087 1066 1062 1069 1076 1078 1084 1103 1123 1123 1096 1061 1042 1041 1036 1012 977 962 980 1011 1023
1843 1023 1016 1009 1009 1003 991 995 1022 1047 1053 1058 1075 1080 1049 1004 986 993 996 991 1002 1018 997 926 856 841 874 905 908 890 871 864 873 897 927 955 969 959 933 914 911 912 900 891 899
1838 899 905 882 852 862 907 928 906 894 927 958 932 882 872 903 915 889 856 837 816 793 793 820 848 864 886 915 920 892 870 878 887 869 855 882 927 933 899 872
1833 872 871 860 817 784 806 853 860 819 781 786 808 809 803 825 875 911 914 908 912 911 898 896 919 936 917 879 862 864 847 813 799 819 828 796 752 743 770 800 815 820 820 815 816
1828 816 839 878 910 917 903 876 846 822 812 812 818 832 859 893 921 933 930 913 887 863 846 837 840 861 890 897 862 806 771 770 785 793 786 773 768 788 837 890 914 904
1823 904 890 892 897 888 878 891 915 905 838 757 724 748 780 781 770 781 803 797 763 746 777 827 849 828 792 766 758 765 787 814 830 824 800 775 772 800 830 822 767 715
1818 715 718 773 831 846 817 770 730 709 705 707 718 743 780 817 848 880 905 904 887 889 922 946 929 891 868 853 827 808 827 865 875 851 833 831 821 800 796 813
1813 813 817 810 841 918 973 959 920 911 915 885 838 823 840 845 832 829 817 749 649 613 679 762 774 737 727 750 744 691 652 681 746 782 782 790 821 839 810 755 721
1809 721 719 724 721 722 735 744 729 696 676 690 741 801 830 806 754 733 762 804 817 803 791 782 761 731 711 701 686 669 674 707 747 768 766 747 728 730 761 794 794 767
1804 767 753 770 785 773 759 777 808 802 749 700 708 768 829 849 825 788 767 767 772 766 754 753 770 792 800 786 763 750 753 767 789 814 827 813 780 758 764 778 779 776
1799 776 790 814 824 815 806 807 805 789 763 738 721 719 728 728 705 677 673 687 698 704 719 726 697 654 654 706 747 737 715 727 747 725 670 644 668 709 741 771 796 791 749
1794 749 705 692 713 745 763 755 736 741 788 850 886 889 888 889 869 819 764 731 713 700 698 708 712 692 664 665 709 771 812 814 789 768 765 767 761 752 745 734 707 682 684 710
1789 710 728 725 720 729 733 719 701 703 731 765 785 776 740 706 698 709 706 680 662 683 729 759 761 755 750 736 704 664 642 648 674 698 708 718 740 766 777 776 792 838 883
1784 883 887 849 799 763 746 742 745 749 747 741 734 733 738 737 713 670 649 683 742 757 707 651 653 707 756 760 732 703 692 699 707 691 649 609 599 610 617 614 609 606 607 624 660 686
1778 686 674 644 640 667 695 708 728 759 764 712 633 589 605 647 662 638 608 608 641 679 703 717 721 702 664 644 670 718 740 731 725 740 755 749 728 696 653 617
1774 617 620 659 685 669 639 643 679 701 691 672 673 688 694 687 688 714 747 760 754 761 795 828 837 840 866 894 878 821 775 779 814 849 863 841 777 710 691 719 737 721
1769 721 720 765 812 801 748 704 677 645 624 653 726 787 798 768 722 684 682 723 768 770 742 729 743 747 730 711 696 667 633 626 641 641 626 639 688 714 677 624
1764 624 615 641 660 668 686 700 678 631 597 584 573 570 603 662 689 657 607 588 602 615 618 624 643 675 721 773 806 793 745 707 714 751 769 742 701 696 737 779
1760 779 776 730 679 660 676 700 704 674 631 601 587 572 555 563 607 660 691 701 708 711 706 707 728 753 751 725 704 688 651 594 565 596 657 698 703 690 672 648 634
1755 634 656 710 755 753 711 668 659 690 735 768 775 768 755 737 708 677 662 666 672 666 659 671 696 704 680 649 644 658 654 617 578 575 603 634 656 674 685 673 642 622 632
1750 632 658 674 677 688 717 735 709 640 574 559 599 653 678 670 654 654 675 697 691 651 607 594 615 635 640 648 669 683 676 674 710 757 762 723 689 684 672 625 574 570
1745 570 616 673 705 703 673 640 630 643 649 625 591 584 607 625 614 582 556 553 582 643 716 770 773 723 652 604 599 614 619 624 655 698 706 671 643 660 688 680 644 628
1740 628 648 680 712 743 758 737 695 673 674 662 632 618 628 625 590 561 570 594 596 588 604 638 656 654 662 693 723 734 732 727 718 700 686 689 704 716 711 692 677 688 722
1735 722 746 737 706 684 679 674 664 653 648 644 645 663 701 728 713 649 576 545 575 629 654 634 606 605 620 622 607 603 619 631 620 601 597 606 608 597 594 618 656 672 639
1730 639 576 535 543 576 593 587 583 596 614 622 615 601 586 579 574 565 560 585 641 678 657 614 619 672 706 685 648 633 622 594 581 617 662 658 620 617 667 714 713 684 666
1725 666 661 647 615 578 551 551 581 617 625 597 560 536 523 513 511 517 521 526 546 579 594 574 553 571 623 665 677 682 708 744 756 729 688 676 697 713 692 648 622
1720 622 612 584 530 496 526 595 639 630 600 595 627 670 685 663 633 635 664 676 648 604 578 576 595 637 691 718 701 680 691 714 709 691 708 751 753 679 580 519
1716 519 509 525 554 588 610 615 618 629 632 609 572 548 554 587 631 662 669 662 668 686 691 675 663 672 687 685 665 636 594 544 514 532 581 622 636 638 648 664 676 676 669
1711 669 657 636 598 555 540 571 612 619 599 603 642 661 630 599 626 689 725 714 687 659 619 584 600 665 722 735 741 775 799 757 665 598 592 602 581 554 575
1706 575 640 684 658 593 553 558 578 592 616 654 677 660 632 636 679 725 741 714 652 586 563 602 667 700 688 653 619 596 602 638 666 652 624 638 685 700
1702 700 655 600 582 585 576 568 582 604 613 620 648 678 675 646 630 636 643 638 634 638 636 622 611 614 621 615 600 590 593 604 609 606 607 627 663 688 680 633 567 516 515 566 620 628 599 583
1696 583 597 607 598 603 646 688 681 636 597 578 569 572 601 633 634 613 609 626 632 620 617 634 637 607 568 551 549 542 525 506 492 499 547 631 701 711 669 625 621 655 692 694
1691 694 655 609 586 584 575 553 541 551 581 625 676 707 694 652 621 611 594 555 528 545 597 648 674 670 646 628 640 671 680 655 634 636 636 602 556 543 575 625
1686 625 666 678 656 620 612 639 653 617 562 545 564 574 558 543 549 560 571 604 660 706 710 685 656 627 591 562 563 592 616 615 606 620 658 682 664 628 616 638
1682 638 657 657 663 699 738 738 698 653 629 632 658 698 719 697 649 613 605 612 637 689 743 750 703 647 621 616 615 627 661 689 677 635 602 602 626 655 672 668 649 635
1677 635 640 661 690 724 755 764 743 713 698 696 692 683 687 713 745 761 751 731 724 741 772 791 788 777 781 809 847 877 892 903 923 953 976 984 987 996 1002 990 967 959 971 994
1672 994 1026 1083 1158 1217 1242 1258 1305 1380 1446 1470 1455 1441 1469 1551 1643 1687 1679 1673 1709 1766 1803 1814 1821 1830 1828 1816 1805 1783 1738 1688 1666 1666 1650 1609 1580 1578 1564 1505
1667 1505 1428 1392 1404 1423 1418 1399 1387 1389 1404 1430 1454 1462 1466 1503 1577 1642 1654 1631 1631 1671 1726 1777 1842 1930 2013 2079 2161 2287 2425 2529 2620 2754 2924 3070
1663 3070 3183 3329 3537 3728 3820 3842 3880 3947 3978 3947 3900 3863 3798 3670 3515 3393 3303 3200 3062 2912 2783 2677 2582 2489 2403 2332 2280 2240
1659 2240 2201 2158 2107 2046 1985 1951 1957 1972 1955 1908 1879 1899 1934 1947 1951 1994 2081 2163 2200 2213 2251 2332 2435 2541 2655 2793 2944 3081 3184 3264 3344 3442
1655 3442 3567 3710 3853 3967 4040 4079 4093 4081 4042 3986 3919 3827 3691 3530 3383 3267 3159 3040 2925 2842 2784 2719 2626 2511 2395 2301 2238 2191
1652 2191 2130 2035 1925 1831 1758 1691 1631 1599 1594 1573 1504 1423 1394 1423 1448 1426 1388 1397 1459 1526 1562 1572 1566 1545 1530 1555 1618 1672 1688 1696 1735 1796 1840 1858 1873 1889
1648 1889 1895 1895 1906 1920 1903 1847 1772 1695 1622 1559 1516 1473 1399 1312 1258 1244 1224 1180 1151 1164 1177 1147 1105 1105 1133 1124 1064 1010 1008 1033 1040 1025 1016 1022 1024 997 944 894 874
1643 874 881 884 857 813 780 766 753 729 697 671 665 686 727 764 777 771 759 744 721 706 723 763 785 758 699 652 639 654 679 696 703 699 683 653 625 627 664 702
1638 702 699 663 634 641 677 720 761 791 800 786 757 721 687 668 665 657 631 599 589 602 613 614 619 632 639 635 639 648 630 575 527 531 568 593 597 616 656 674 641 583 554
1633 554 563 580 576 564 576 625 682 714 715 708 707 706 691 662 626 587 551 535 553 595 632 641 622 590 566 568 601 653 700 725 726 709 682 650 621 601 594 601 613 619 613
1628 613 598 582 566 551 537 526 518 517 529 550 566 569 561 550 536 524 536 585 650 696 705 686 648 595 545 533 571 630 667 676 678 678 662 627 598 585 573 547 530
1623 530 550 600 644 656 644 622 609 623 663 685 645 572 547 601 667 677 647 635 649 657 655 669 689 674 628 604 616 614 571 530 535 553 538 511 528 585 619
1619 619 599 560 545 556 573 586 603 630 663 688 688 660 625 604 605 625 660 683 652 568 502 517 581 609 585 573 610 651 649 638 673 739 774 754 715 688
1614 688 665 630 585 533 480 445 455 506 560 590 608 632 654 652 628 599 565 518 473 469 515 573 598 592 586 599 622 647 672 686 671 632 595 574 557 536 529
1610 529 560 614 656 668 664 665 673 677 669 646 627 639 689 742 755 720 667 630 624 651 700 741 749 733 728 745 753 726 670 618 595 610 651 691 710 715 727 746 756 751
1605 751 742 732 711 684 676 698 733 757 762 747 713 681 677 698 718 728 749 780 787 756 733 764 836 902 937 945 926 888 863 871 883 862 826 823 854 885 914 973 1054
1600 1054 1098 1087 1071 1097 1144 1182 1226 1299 1364 1375 1352 1363 1440 1545 1644 1734 1811 1848 1848 1870 1960 2088 2190 2254 2331 2444 2544 2575 2562 2570 2619 2661 2649
1596 2649 2594 2534 2478 2414 2343 2277 2203 2096 1963 1850 1790 1774 1770 1757 1728 1682 1622 1557 1492 1431 1375 1332 1302 1270 1222 1162 1107 1079 1084 1106 1117 1105 1082 1060
1592 1060 1032 985 929 889 874 872 872 878 884 870 830 791 783 804 830 842 838 831 835 849 849 820 783 780 815 838 809 752 714 713 732 760 793 820 833 847 871 877 836 768
1587 768 732 739 738 690 628 615 668 747 805 830 834 834 834 816 764 690 643 653 697 717 696 669 671 702 728 729 722 738 782 824 831 809 798 817 837 826 802 809 847 869
1582 869 850 828 842 874 878 857 853 886 930 964 998 1037 1058 1039 1000 978 980 985 976 962 955 961 978 995 996 981 973 992 1026 1053 1071 1097 1130 1150 1152 1147 1129 1077 1009 990
1577 990 1052 1140 1172 1132 1078 1065 1084 1101 1098 1081 1063 1053 1054 1064 1072 1066 1040 1005 983 992 1022 1044 1036 997 945 898 878 896 937 966 969 966 964 949 913 899 942 1012 1029
1573 1029 959 852 783 783 834 906 969 1000 995 979 976 982 979 962 944 942 962 984 979 946 920 930 950 933 891 887 945 999 984 924 884 883 883 865 855 862 860 830 794 777
1568 777 779 794 826 869 896 894 890 913 942 937 897 862 856 868 879 888 902 922 946 965 969 951 932 936 957 962 946 945 985 1029 1027 992 984 1021 1050 1025 975 959 984 1004 992
1563 992 971 971 992 1017 1052 1101 1137 1131 1098 1091 1129 1171 1173 1147 1136 1149 1159 1154 1156 1179 1199 1188 1158 1149 1183 1238 1279 1281 1240 1178 1129 1117 1140 1185 1235 1268 1262 1219 1184
1558 1184 1198 1245 1277 1277 1271 1282 1292 1279 1255 1249 1271 1311 1357 1396 1419 1434 1456 1488 1512 1521 1532 1550 1557 1539 1519 1524 1551 1585 1615 1631 1615 1579 1562 1584 1613 1623 1643
1553 1643 1704 1772 1784 1750 1732 1745 1745 1723 1727 1779 1838 1870 1897 1938 1966 1965 1965 1989 2004 1985 1975 2027 2112 2160 2162 2163 2183 2205 2232 2285 2352 2387 2383 2389 2442 2526 2617 2708
1549 2708 2792 2843 2850 2846 2865 2921 3005 3100 3173 3194 3175 3171 3217 3290 3352 3391 3422 3448 3467 3485 3519 3581 3663 3736 3767 3751 3728 3741 3785 3821 3828 3833 3868 3935 4011 4079 4131
1544 4131 4168 4201 4236 4261 4267 4277 4318 4388 4457 4523 4603 4678 4701 4680 4692 4785 4906 4981 5015 5065 5145 5219 5274 5339 5423 5507 5580 5655 5734 5805 5872 5958 6066 6170
1540 6170 6251 6323 6406 6500 6604 6721 6854 6986 7097 7187 7280 7399 7547 7696 7818 7928 8072 8274 8506 8729 8942 9170 9406 9620 9801
1537 9801 9975 10172 10402 10658 10927 11198 11470 11765 12087 12403 12685 12954 13259 13612 13986 14359 14734 15112 15499 15925 16410 16917 17386
1534 17386 17830 18318 18871 19430 19965 20532 21187 21897 22606 23322 24085 24886 25686 26502 27383 28332 29302 30288 31345 32513 33760 35033
1532 35033 36333 37705 39188 40794 42522 44361 46299 48335 50482 52770 55241 57929 60831 63905 67130 70548 74227
1529 74227 78203 82486 87112 92144 97627 103573 109999 116940 124431 132514 141265 150766 161050 172106 183963 196693
1527 196693 210328 224812 240065 256034 272631 289667 306881 324009 340768 356788 371643 384946 396367 405580
1526 405580 412256 416147 417144 415245 410523 403161 393466 381825 368629 354248 339034 323322 307406 291548 275978
1524 275978 260874 246351 232474 219291 206847 195167 184244 174038 164498 155585 147283 139587 132462 125845 119670
1522 119670 113899 108514 103499 98827 94465 90382 86563 83004 79686 76565 73596 70778 68146 65704 63396 61170 59034
1520 59034 57023 55135 53340 51639 50062 48607 47224 45874 44572 43345 42184 41069 40014 39046 38154 37297 36462 35680
1518 35680 34973 34325 33708 33105 32516 31949 31423 30961 30558 30175 29785 29398 29049 28758 28523 28324 28131 27922 27702 27496 27309 27113 26895
1515 26895 26689 26533 26408 26266 26099 25945 25827 25718 25594 25475 25398 25370 25371 25387 25411 25438 25474 25553 25694 25874 26042 26195 26381 26642 26971 27329
1512 27329 27700 28096 28533 29016 29543 30112 30719 31368 32074 32856 33707 34587 35460 36330 37237 38216 39273 40390 41547 42732 43952
1509 43952 45235 46607 48068 49586 51145 52768 54496 56338 58277 60294 62377 64510 66675 68871 71103 73342 75519
1507 75519 77590 79555 81414 83118 84583 85753 86618 87186 87454 87402 87003 86231 85087 83622 81899 79963 77837 75556 73164
1505 73164 70681 68107 65470 62844 60293 57823 55389 52977 50620 48362 46212 44152 42185 40337 38619 37010 35473
1503 35473 33999 32606 31308 30102 28976 27920 26917 25946 25008 24123 23304 22537 21803 21104 20439 19790 19146 18530 17981 17497
1500 17497 17038 16578 16129 15708 15302 14896 14498 14129 13786 13453 13131 12836 12576 12328 12069 11799 11538 11293 11053 10812 10589 10408 10263
1498 10263 10113 9933 9745 9578 9428 9273 9116 8977 8849 8693 8503 8321 8190 8091 7972 7820 7672 7564 7492 7423 7343 7261 7192 7129 7053
1494 7053 6960 6872 6804 6747 6687 6629 6581 6528 6454 6377 6333 6315 6270 6176 6080 6031 6021 6008 5982 5959 5941 5913 5869 5811 5736 5644 5554 5489 5445 5415 5408 5434 5459 5443 5391
1490 5391 5351 5345 5351 5346 5335 5331 5334 5341 5342 5312 5242 5168 5147 5185 5220 5194 5115 5029 4961 4911 4865 4815 4755 4689 4616 4524 4420 4351 4360 4411 4407 4302 4152 4036 3970 3919 3869
1486 3869 3833 3800 3749 3688 3650 3645 3646 3633 3616 3604 3586 3548 3500 3470 3474 3502 3521 3492 3419 3350 3336 3372 3401 3375 3304 3237 3209 3214 3217 3192 3140 3087 3054 3044 3047 3048 3034 3001
1481 3001 2958 2923 2906 2905 2917 2941 2967 2977 2961 2926 2876 2820 2777 2774 2803 2821 2806 2780 2774 2789 2811 2841 2871 2867 2808 2729 2681 2671 2670 2662 2655 2648 2633 2623 2634 2651 2643 2618 2612
1476 2612 2633 2651 2643 2616 2586 2559 2544 2546 2548 2539 2547 2601 2659 2646 2558 2481 2469 2484 2470 2440 2435 2443 2423 2376 2346 2352 2379 2411 2436 2429 2380 2324 2307 2326 2330 2298 2262 2255 2265 2257
1471 2257 2223 2184 2165 2167 2176 2182 2188 2198 2192 2155 2109 2095 2112 2119 2105 2108 2142 2157 2109 2040 2011 2017 2015 2007 2027 2049 2012 1925 1880 1921 1981 1983 1946 1941 1988 2052 2102 2128 2119 2078 2037
1466 2037 2022 2012 1977 1931 1916 1941 1966 1962 1939 1929 1941 1967 1979 1952 1891 1834 1822 1852 1895 1937 1986 2031 2035 1987 1921 1890 1912 1961 1998 1996 1964 1930 1917 1918 1910 1887 1868
1462 1868 1863 1870 1892 1938 1995 2021 1990 1929 1896 1912 1952 1978 1984 1977 1964 1950 1949 1963 1972 1953 1914 1887 1890 1903 1904 1896 1901 1927 1958 1976 1983 1992 2018 2053 2070 2048 1999 1962 1967 2001 2029
1457 2029 2036 2044 2073 2120 2160 2178 2182 2195 2239 2310 2383 2434 2466 2496 2531 2561 2586 2622 2679 2749 2819 2892 2976 3072 3175 3282 3386 3480 3566 3653 3736 3786 3784 3751 3726
1453 3726 3716 3695 3639 3559 3478 3403 3328 3249 3168 3080 2985 2894 2832 2803 2773 2698 2579 2467 2397 2357 2306 2242 2194 2179 2174 2150 2106 2060 2029 2019 2029 2038 2016 1956
1448 1956 1890 1843 1810 1775 1749 1750 1769 1781 1775 1762 1750 1730 1706 1688 1677 1666 1655 1651 1649 1638 1615 1597 1594 1605 1619 1625 1608 1574 1556 1575 1607 1611 1589 1583 1602 1611 1592 1583 1620
1444 1620 1682 1714 1701 1666 1631 1594 1555 1518 1487 1469 1483 1536 1593 1604 1575 1555 1565 1573 1548 1515 1517 1551 1580 1587 1595 1619 1643 1648 1637 1631 1634 1637 1636 1638 1642 1633 1609 1588 1598 1641
1439 1641 1688 1702 1674 1625 1595 1602 1631 1650 1644 1628 1627 1649 1689 1733 1771 1796 1812 1833 1865 1891 1902 1915 1956 2021 2081 2121 2149 2170 2172 2162 2179 2247 2339 2403 2426 2435 2453
1434 2453 2479 2510 2564 2640 2700 2701 2655 2624 2657 2728 2770 2740 2659 2583 2542 2522 2503 2484 2476 2476 2456 2391 2284 2167 2079 2037 2022 1995 1942 1884 1858 1866 1881 1872 1836 1794
1430 1794 1763 1744 1720 1677 1623 1576 1547 1531 1521 1510 1504 1503 1506 1509 1498 1461 1411 1382 1396 1434 1458 1454 1432 1398 1347 1294 1275 1301 1330 1318 1286 1296 1362 1421 1412 1359 1337
1425 1337 1377 1432 1454 1443 1424 1402 1373 1349 1344 1347 1337 1314 1299 1300 1305 1312 1327 1340 1337 1332 1357 1407 1436 1413 1356 1296 1243 1201 1196 1233 1274 1281 1271 1271 1261 1204 1120 1077 1102
1421 1102 1152 1181 1196 1212 1214 1186 1156 1159 1186 1196 1175 1158 1170 1200 1221 1227 1230 1237 1230 1196 1147 1120 1127 1146 1139 1104 1066 1047 1044 1057 1095 1147 1182 1181 1164 1164 1186 1208 1203 1171
1416 1171 1138 1144 1194 1250 1263 1233 1198 1186 1183 1182 1204 1253 1289 1272 1224 1192 1187 1175 1147 1126 1134 1151 1158 1157 1158 1163 1156 1130 1084 1038 1023 1048 1086 1106 1117 1146 1184 1197 1188 1193
1411 1193 1218 1215 1161 1103 1089 1095 1065 998 951 956 992 1033 1078 1111 1101 1053 1022 1050 1106 1128 1102 1068 1058 1071 1095 1124 1147 1150 1130 1109 1101 1099 1092 1090 1110 1153 1187 1180 1139
1406 1139 1099 1095 1121 1149 1159 1158 1156 1144 1107 1053 1016 1017 1044 1075 1097 1106 1091 1057 1033 1045 1080 1105 1120 1154 1204 1223 1178 1108 1077 1092 1106 1097 1094 1116 1131 1108 1071 1061
1401 1061 1075 1075 1058 1062 1102 1140 1147 1152 1188 1228 1212 1132 1049 1022 1045 1083 1112 1125 1115 1080 1046 1040 1062 1089 1107 1111 1098 1072 1053 1062 1083 1083 1052 1020 1010 1020 1039 1073
1397 1073 1125 1173 1201 1210 1210 1201 1184 1174 1172 1158 1119 1077 1059 1058 1053 1044 1047 1054 1051 1054 1089 1134 1141 1113 1112 1159 1202 1188 1150 1143 1156 1140 1095 1082 1130 1202 1253 1274 1265 1215 1132 1061
1392 1061 1031 1015 980 941 947 1008 1076 1104 1093 1084 1101 1127 1133 1112 1093 1108 1154 1194 1205 1192 1168 1144 1141 1176 1232 1261 1246 1240 1287 1356 1377 1347 1335 1378 1432 1442 1428
1387 1428 1449 1523 1610 1676 1722 1766 1813 1859 1898 1930 1964 2018 2099 2184 2240 2256 2251 2254 2277 2307 2321 2305 2273 2251 2250 2246 2217 2173 2138 2114 2087 2054 2024 1997 1960 1912
1383 1912 1872 1842 1806 1760 1724 1711 1702 1671 1616 1553 1494 1449 1429 1429 1415 1366 1301 1264 1270 1298 1318 1321 1311 1298 1283 1257 1213 1167 1156 1189 1224 1217 1172 1133 1124 1136 1152
1378 1152 1166 1168 1146 1107 1076 1068 1081 1113 1160 1194 1184 1145 1122 1129 1132 1107 1083 1095 1124 1137 1135 1141 1150 1143 1134 1152 1187 1194 1161 1128 1119 1107 1066 1024 1026 1069 1108 1111 1090 1070 1065
1373 1065 1068 1067 1056 1044 1051 1085 1117 1117 1098 1108 1163 1223 1233 1188 1128 1085 1062 1059 1084 1123 1135 1101 1057 1059 1113 1170 1185 1162 1130 1117 1133 1176 1229 1258 1244 1205 1182
1369 1182 1197 1228 1231 1185 1124 1102 1129 1158 1145 1109 1101 1121 1121 1092 1091 1145 1186 1140 1041 985 1004 1037 1039 1036 1063 1104 1127 1137 1151 1153 1120 1071 1054 1082 1124 1146 1142 1124
1364 1124 1110 1116 1139 1153 1134 1099 1087 1106 1126 1127 1130 1157 1185 1174 1122 1077 1076 1112 1149 1167 1167 1152 1121 1088 1077 1095 1118 1128 1132 1142 1148 1139 1126 1133 1158 1176 1183 1195 1217
1359 1217 1224 1205 1178 1168 1164 1150 1129 1116 1106 1087 1074 1092 1132 1158 1153 1138 1139 1149 1153 1152 1155 1159 1145 1114 1091 1101 1136 1164 1160 1133 1117 1132 1169 1203 1222 1214 1175 1123 1102
1354 1102 1130 1174 1182 1150 1120 1124 1141 1143 1131 1128 1144 1178 1231 1289 1317 1290 1223 1161 1128 1122 1132 1153 1175 1183 1177 1172 1177 1179 1166 1146 1145 1169 1204 1227 1236 1247 1277 1320 1343 1329
1349 1329 1304 1309 1344 1356 1319 1279 1298 1368 1421 1426 1426 1454 1477 1449 1397 1388 1438 1501 1537 1552 1558 1549 1527 1515 1518 1518 1510 1526 1579 1632 1647 1640 1643 1648 1638 1634 1667 1709 1694 1619 1567
1344 1567 1594 1658 1684 1664 1644 1658 1697 1739 1769 1783 1788 1800 1822 1836 1838 1856 1909 1976 2024 2054 2090 2133 2157 2149 2127 2115 2123 2149 2187 2233 2289 2356 2410 2417 2384 2372 2422
1340 2422 2501 2543 2537 2536 2574 2628 2670 2707 2747 2777 2787 2791 2807 2829 2848 2872 2905 2929 2931 2930 2952 2989 3019 3034 3040 3037 3020 3002 2999 3013 3041 3083 3132 3170 3190 3222 3299 3399
1335 3399 3459 3455 3424 3420 3465 3547 3639 3711 3741 3742 3754 3798 3857 3912 3971 4041 4096 4121 4144 4207 4307 4400 4457 4495 4532 4567 4595 4632 4693 4771 4864 4984 5131 5271
1331 5271 5365 5427 5501 5606 5716 5818 5931 6065 6197 6307 6421 6568 6728 6859 6972 7118 7307 7491 7649 7825 8049 8276 8450 8592
1328 8592 8772 9002 9229 9424 9630 9885 10176 10467 10755 11045 11333 11623 11950 12337 12747 13129 13482 13852 14265 14700 15140 15597 16088
1325 16088 16600 17118 17656 18245 18894 19582 20288 21014 21779 22600 23476 24393 25344 26339 27398 28530 29746 31057 32461 33941 35493
1323 35493 37158 38986 40976 43081 45289 47653 50228 53009 55964 59114 62519 66212 70185 74448 79046 84015 89352
1321 89352 95055 101160 107705 114685 122076 129865 138045 146568 155347 164303 173358 182405 191295 199886 208063 215720 222728
1319 222728 228970 234372 238868 242362 244754 246030 246259 245510 243777 241017 237227 232468 226827 220401 213308 205679 197633
1317 197633 189271 180720 172138 163661 155349 147221 139316 131721 124521 117750 111384 105371 99678 94318 89334 84735 80468
1315 80468 76447 72626 69018 65648 62515 59604 56899 54370 51973 49685 47530 45546 43711 41960 40255 38626 37123
1312 37123 35746 34445 33179 31956 30808 29750 28763 27820 26915 26063 25269 24517 23779 23057 22374 21742 21145 20559 19983 19434 18928
1310 18928 18462 18023 17590 17151 16723 16334 15987 15646 15277 14896 14551 14257 13978 13675 13361 13079 12853 12665 12480 12267 12019 11761 11532
1307 11532 11345 11164 10952 10712 10487 10306 10157 10016 9875 9741 9617 9503 9395 9282 9147 8986 8824 8695 8604 8527 8439 8333 8217 8106
1304 8106 8006 7911 7802 7659 7488 7327 7221 7181 7169 7128 7033 6904 6775 6661 6555 6458 6373 6288 6186 6067 5956 5873 5806 5735 5663 5598 5534 5453
1301 5453 5370 5316 5302 5292 5250 5173 5088 5020 4968 4926 4887 4841 4774 4690 4617 4579 4562 4524 4450 4373 4332 4316 4285 4229 4186 4179 4185 4173 4156 4155 4147 4097 4024 3991 4025 4073
1296 4073 4072 4016 3941 3874 3823 3790 3768 3738 3693 3660 3670 3698 3694 3648 3610 3609 3614 3582 3520 3475 3467 3468 3456 3441 3436 3426 3395 3355 3333 3327 3308 3265 3217 3190 3180 3170 3157 3145
1292 3145 3135 3133 3154 3201 3246 3253 3215 3152 3084 3028 3001 3010 3032 3033 3013 2994 2977 2940 2890 2868 2894 2930 2934 2908 2886 2875 2867 2866 2878 2883 2863 2828 2808 2805 2797 2778 2765 2763 2763 2760 2758
1287 2758 2747 2708 2654 2618 2605 2589 2562 2557 2603 2674 2720 2720 2690 2655 2632 2629 2637 2635 2613 2591 2586 2587 2573 2548 2538 2561 2610 2658 2674 2645 2586 2528 2491 2465 2435 2404 2381 2361
1282 2361 2336 2302 2267 2245 2252 2288 2321 2308 2253 2203 2193 2199 2187 2169 2176 2205 2224 2225 2233 2257 2270 2256 2230 2210 2192 2161 2118 2082 2078 2119 2188 2238 2237 2198 2156 2120 2083 2059
1277 2059 2070 2093 2077 2020 1980 1991 2016 2010 1992 1996 2008 1987 1950 1947 1980 1994 1965 1942 1965 1996 1975 1910 1865 1876 1914 1940 1947 1949 1950 1940 1918 1881 1831 1782 1760 1780 1823
1273 1823 1851 1849 1830 1815 1804 1793 1785 1779 1767 1752 1751 1771 1793 1795 1786 1793 1819 1837 1835 1828 1822 1803 1766 1733 1724 1723 1713 1709 1732 1762 1761 1736 1735 1769 1790 1763 1724 1730 1781 1828 1843 1838 1831
1268 1831 1823 1822 1841 1862 1841 1769 1696 1673 1688 1688 1655 1620 1608 1613 1614 1606 1593 1585 1600 1652 1710 1718 1656 1583 1567 1614 1676 1717 1734 1737 1730 1720 1707 1680 1636 1597 1584 1582 1559 1515
1263 1515 1485 1488 1510 1536 1572 1610 1622 1597 1562 1544 1540 1533 1526 1529 1543 1560 1576 1586 1581 1573 1583 1609 1616 1593 1578 1587 1584 1546 1522 1565 1629 1626 1568 1557 1628 1699 1698 1663 1655 1657 1627
1258 1627 1587 1588 1611 1598 1556 1545 1578 1600 1583 1579 1624 1680 1693 1665 1635 1616 1605 1609 1633 1654 1650 1638 1642 1653 1656 1676 1750 1852 1912 1903 1866 1848 1852 1865 1890 1930 1971 2008
1253 2008 2051 2099 2132 2146 2168 2209 2241 2240 2236 2275 2355 2438 2513 2594 2662 2673 2622 2568 2567 2611 2657 2676 2675 2669 2668 2675 2682 2683 2674 2651 2610 2554 2502 2463 2413 2329 2241 2198 2202 2197
1248 2197 2153 2101 2072 2050 2013 1982 1976 1959 1892 1799 1746 1748 1760 1753 1744 1751 1752 1730 1697 1671 1648 1616 1585 1578 1603 1643 1674 1677 1656 1631 1610 1580 1537 1508 1518 1539 1519 1455
1243 1455 1404 1407 1438 1448 1428 1403 1393 1397 1413 1439 1470 1495 1505 1496 1471 1440 1406 1368 1339 1343 1384 1420 1414 1383 1364 1352 1314 1267 1268 1324 1370 1360 1321 1296 1281 1263 1263 1297
1239 1297 1342 1369 1390 1418 1430 1403 1372 1385 1429 1456 1453 1443 1423 1376 1326 1316 1337 1342 1327 1333 1369 1381 1342 1293 1283 1301 1310 1308 1310 1314 1307 1293 1282 1272 1260 1257 1267 1275 1274 1275
1234 1275 1284 1286 1271 1252 1245 1255 1281 1324 1358 1350 1303 1267 1272 1293 1293 1284 1293 1316 1315 1282 1247 1239 1256 1279 1288 1271 1238 1214 1210 1211 1202 1191 1200 1237 1287 1323 1319 1270 1206 1171 1173 1179 1169
1229 1169 1165 1182 1197 1185 1169 1174 1183 1164 1138 1148 1180 1178 1125 1072 1063 1085 1110 1133 1158 1169 1157 1146 1165 1205 1229 1216 1179 1146 1137 1150 1163 1160 1151 1153 1160 1153 1138 1139 1160 1175
1224 1175 1173 1177 1203 1230 1231 1217 1218 1243 1274 1290 1280 1247 1207 1183 1179 1177 1165 1156 1170 1196 1215 1222 1221 1210 1195 1198 1227 1247 1222 1171 1140 1138 1126 1091 1075 1121 1205 1261 1256 1214
1219 1214 1176 1156 1142 1121 1106 1115 1142 1154 1132 1103 1110 1157 1198 1201 1182 1182 1208 1233 1239 1226 1208 1197 1209 1240 1264 1260 1248 1266 1316 1353 1343 1304 1269 1240 1201 1167 1165 1193
1214 1193 1215 1212 1193 1172 1150 1130 1125 1138 1147 1148 1158 1181 1192 1176 1163 1186 1227 1238 1208 1167 1135 1105 1082 1084 1108 1124 1118 1107 1109 1119 1128 1147 1178 1194 1179 1149 1126 1107
1210 1107 1080 1056 1049 1053 1058 1071 1097 1111 1093 1070 1084 1131 1167 1172 1168 1167 1154 1128 1117 1135 1151 1139 1120 1128 1152 1147 1104 1063 1060 1091 1130 1158 1166 1153 1126 1108 1115 1138 1147 1125
1205 1125 1084 1052 1048 1063 1080 1094 1109 1122 1118 1092 1061 1052 1078 1126 1161 1159 1135 1134 1169 1198 1173 1110 1069 1064 1054 1020 1010 1065 1138 1152 1109 1085 1112 1139 1121 1081 1069
1200 1069 1088 1108 1122 1140 1160 1168 1174 1193 1214 1212 1183 1146 1104 1053 1009 1004 1030 1039 1002 954 946 986 1035 1070 1094 1112 1119 1119 1134 1173 1209 1203 1142 1064 1017 1022 1054 1081 1102
1195 1102 1136 1180 1192 1153 1100 1091 1130 1159 1136 1084 1055 1072 1116 1162 1198 1221 1218 1184 1145 1142 1186 1244 1265 1239 1203 1188 1180 1152 1107 1076 1065 1055 1044 1056 1091 1120
1191 1120 1125 1128 1144 1155 1136 1111 1119 1157 1177 1146 1085 1046 1067 1139 1211 1222 1165 1098 1082 1108 1124 1117 1118 1135 1138 1111 1093 1128 1201 1259 1273 1250 1206 1154 1113 1098 1107 1120
1186 1120 1125 1129 1137 1139 1120 1086 1069 1096 1148 1161 1101 1018 993 1035 1070 1046 997 982 1008 1044 1077 1105 1105 1060 1003 989 1016 1031 1011 994 1014 1047 1051 1027 1008 1012 1037 1075
1182 1075 1112 1126 1109 1077 1057 1052 1051 1044 1034 1024 1022 1034 1055 1062 1049 1038 1055 1093 1118 1119 1112 1108 1101 1090 1091 1111 1125 1109 1075 1053 1053 1056 1053 1057 1070 1068 1035 1001 1006 1044 1068 1060 1055
1176 1055 1081 1111 1103 1064 1035 1030 1027 1015 1014 1027 1030 1008 986 992 1010 1009 991 979 975 966 960 989 1045 1083 1077 1061 1076 1109 1113 1084 1061 1071 1093 1093 1075 1063 1062 1063 1063 1065 1055 1019 973
1171 973 958 984 1014 1010 987 985 1014 1045 1055 1044 1025 1010 1012 1032 1051 1052 1039 1034 1029 1002 959 935 950 982 1002 1015 1026 1020 987 958 968 1002 1008 974 940 945 980 1013 1032
1166 1032 1040 1036 1014 977 944 935 955 990 1015 1022 1022 1034 1061 1083 1085 1076 1074 1087 1107 1121 1121 1112 1100 1083 1049 1001 966 968 1001 1041 1077 1115 1142 1124 1050 958 900 895 918 943
1162 943 961 971 968 951 929 918 932 967 1005 1027 1037 1050 1064 1062 1034 998 982 995 1023 1050 1061 1050 1022 1003 1018 1063 1104 1114 1098 1082 1078 1077 1062 1038 1026 1043 1065
1157 1065 1054 1008 975 996 1047 1066 1036 1001 1002 1025 1035 1029 1034 1052 1058 1039 1019 1021 1037 1047 1051 1066 1088 1095 1075 1047 1033 1038 1048 1055 1054 1047 1037 1037 1046 1045 1021 999 1016 1056 1057 989
1152 989 904 875 903 925 905 884 909 965 1003 1015 1024 1037 1028 995 964 948 927 885 853 866 907 931 929 931 948 952 927 899 899 916 924 924 935 957 966 955 933 906 872
1147 872 849 864 918 976 1009 1025 1040 1033 978 894 837 833 856 864 852 853 885 934 966 960 923 888 889 937 1003 1045 1041 1008 978 966 959 946 938 946 958 951 934 936 966 995 1007
1142 1007 1023 1061 1086 1059 1002 975 983 973 930 915 973 1057 1088 1062 1042 1056 1064 1039 1008 1000 995 972 943 933 940 949 965 995 1008 981 946 958 1015 1057 1040 991 955
1138 955 933 909 888 891 919 952 975 991 1004 1011 1008 998 981 963 962 984 1014 1023 1008 991 991 1006 1021 1027 1020 1002 979 960 952 963 983 990 965 920 890 893 906 902 891 900 927
1133 927 946 943 936 944 966 996 1024 1034 1011 972 964 1000 1043 1046 1011 974 958 960 975 993 995 970 937 920 923 931 941 957 970 964 943 929 923 911 887 875 890 919 943 962
1128 962 984 999 995 976 959 941 914 880 850 821 783 747 747 806 897 966 983 952 904 862 848 869 916 956 962 931 892 866 860 870 893 920 943 960 970 964 938
1123 938 915 928 978 1021 1020 991 969 967 968 969 976 969 923 856 823 853 913 957 983 1008 1029 1027 996 956 924 905 900 906 908 892 867 858 878 912 931 919 886 863 873 913
1118 913 955 982 996 1006 1013 1013 1001 971 924 887 887 912 919 893 871 887 912 904 888 915 976 997 947 888 893 952 994 991 971 965 974 986 991 983 958 937 944 980 1012 1019 1007
1113 1007 995 987 986 998 1020 1034 1024 1000 985 979 963 928 891 873 875 886 895 899 899 899 907 923 927 906 873 858 866 875 868 859 867 890 905 905 898 893 888 883 884 892 889 859 814 789 804 838
1108 838 856 855 862 893 921 914 880 857 864 887 918 964 1015 1031 995 945 934 961 982 973 953 940 930 915 917 950 997 1022 1010 983 970 976 988 986 966 932 894 858 840
1103 840 852 879 890 871 849 858 890 903 873 828 810 835 882 921 935 937 953 998 1041 1045 1005 956 925 905 883 869 879 904 918 907 885 872 868 859 842 846 895 969
1098 969 1007 978 930 928 974 1002 975 923 891 880 867 849 839 843 862 894 923 922 888 860 863 864 826 774 778 852 923 916 838 763 750 793 840 858 854 854 865 868 860 856 863
1093 863 867 867 895 966 1035 1046 1004 954 915 865 806 776 788 817 840 864 890 893 865 838 849 890 928 940 919 868 814 799 835 877 882 859 847 860 889 924 959
1089 959 969 943 904 889 889 877 860 879 939 987 989 966 954 941 905 869 886 954 1004 980 915 889 928 980 979 924 863 832 829 839 856 877 886 878 869 873 885 892 890 884
1084 884 874 867 881 922 965 970 931 880 849 850 872 897 911 913 911 913 913 906 901 907 905 879 842 826 838 859 877 898 904 867 807 793 853 916 898 811 753 779 839 865 852
1079 852 839 841 836 805 766 754 779 826 864 879 883 898 925 939 922 889 870 874 878 865 846 842 857 872 878 882 890 896 884 852 816 801 825 883 940 955 924 887 889 924
1074 924 946 933 910 900 887 853 823 840 895 929 918 898 910 939 944 930 937 977 1010 1002 961 922 908 918 939 949 936 914 911 933 953 948 930 919 918 915 917 935 967
1069 967 1000 1030 1056 1057 1020 976 970 995 998 957 914 907 904 858 787 752 764 772 755 757 817 905 955 937 884 841 832 854 883 895 888 887 902 915 908 898 910 933 933 905 880
1064 880 885 907 920 915 894 863 829 807 805 810 809 799 789 788 805 850 915 961 954 911 889 915 951 937 858 768 738 790 875 919 895 847 830 843 843 812 790 804 829
1059 829 828 821 850 904 920 879 841 865 927 960 952 948 977 1019 1044 1046 1023 965 888 843 863 914 941 931 912 900 884 863 862 896 938 957 954 953 957 956 955 971 997 1002 976
1054 976 943 931 926 905 874 872 915 975 1006 990 944 903 889 898 905 882 829 771 732 714 709 717 742 783 818 830 818 808 825 863 892 894 888 895 903 881 833 810 841 893
1049 893 910 886 863 871 895 900 878 849 840 861 896 913 893 851 824 828 850 865 867 868 880 912 962 1007 1009 955 883 851 876 914 915 893 898 943 975 949 903 906 960 999
1045 999 983 950 949 958 936 900 903 955 1004 1013 1000 980 942 887 850 857 877 873 851 842 839 818 792 802 866 940 978 977 978 1012 1068 1110 1101 1043 974 935 933 943 943 935 932 929 915
1039 915 897 896 915 922 885 826 800 831 878 900 902 915 935 942 941 955 971 949 904 894 935 965 938 892 888 910 907 881 877 902 909 882 864 887 920 917 874 836 834 859
1034 859 879 881 883 915 962 964 894 804 773 812 861 872 854 835 828 838 876 932 971 969 938 904 873 844 821 810 805 799 791 785 790 812 841 850 841 855 918 986 991 940 901
1029 901 901 893 857 840 876 915 897 837 786 748 707 687 722 780 792 756 736 763 791 781 764 781 822 853 870 895 926 938 919 885 861 864 886 899 875 821
1025 821 771 746 745 768 812 851 847 805 777 796 823 810 772 761 788 816 831 859 912 948 937 903 886 874 836 791 794 850 891 869 818 796 808 822 839 889
1021 889 956 982 943 883 846 822 790 760 750 744 727 716 733 760 774 785 824 878 902 882 845 815 798 806 844 883 883 862 877 930 956 920 871 863 878 861 810
1016 810 766 747 740 747 782 829 846 825 808 820 843 850 846 846 838 810 783 794 845 888 888 863 865 917 977 987 933 866 840 859 882 879 856 835 818 794 762 740 741 757
1011 757 773 787 805 819 817 811 828 860 861 813 764 767 808 821 792 768 773 772 746 742 802 880 897 851 819 843 886 903 901 906 907 881 842 830 856 886 882 840 796 788 820
1006 820 856 858 835 826 848 876 879 859 839 828 815 801 797 809 822 825 820 820 825 835 846 862 887 919 943 931 879 825 819 868 919 919 871 823 809 826 856 888 911 916
1001 916 900 877 862 856 854 853 849 834 811 795 796 806 819 842 870 872 836 802 817 858 860 819 803 843 884 872 839 851 897 910 875 845 849 854 835 821 846 886 900
996 900 888 880 875 851 811 782 771 763 755 767 799 818 799 767 759 771 768 736 711 724 764 797 811 821 837 850 856 861 872 885 896 896 869 807 742 721 754 794 804 803
992 803 821 848 846 810 773 753 738 724 723 731 724 696 680 699 732 755 775 811 846 852 827 796 778 778 800 843 880 884 863 851 856 850 823 809 830 855 838 793 782 826
987 826 877 880 837 792 768 756 746 741 743 745 751 775 816 842 827 781 740 727 745 779 810 822 823 838 872 893 881 863 880 928 961 948 897 830 770 740 753 784
982 784 799 806 834 870 864 812 780 819 897 949 957 935 888 821 761 736 741 766 825 916 970 925 814 743 765 831 881 909 931 943 938 925 917 906 891 893 915 926
977 926 905 880 882 899 894 864 842 841 846 840 827 819 822 833 845 854 864 886 912 919 903 895 911 922 892 848 850 905 949 940 909 915 955 979 957 913 884 871 853 819 789 783
972 783 803 819 813 793 790 813 841 845 820 781 746 736 770 831 860 813 730 698 750 821 836 810 816 875 928 918 873 854 874 884 844 777 735 734 746 741 727 732 755
968 755 761 738 724 765 852 921 925 880 829 795 780 789 814 835 838 840 857 874 872 863 876 905 913 886 848 832 841 863 883 893 890 892 912 931 913 861 821 825 858 890 907
962 907 906 884 855 846 864 877 854 800 745 709 696 715 758 800 818 813 803 793 794 813 840 845 821 806 823 840 813 764 750 785 828 849 864 885 900 905 914 925 913
958 913 869 825 805 801 793 793 821 867 901 906 897 892 906 940 973 974 941 902 890 896 893 868 831 796 776 784 810 825 809 783 782 807 822 802 768 751 764 800 851 903 933
953 933 929 903 882 877 871 842 792 749 740 758 771 756 730 731 783 869 935 934 877 827 839 883 880 809 746 760 821 846 823 813 850 894 908 914 948 988 985 931 869 828
948 828 807 799 806 812 801 775 760 763 762 747 746 774 798 774 715 685 718 772 778 728 679 684 731 771 783 786 803 830 855 881 906 906 860 790 740 729 735 744 768 820 875
943 875 899 885 861 855 864 869 852 815 777 759 776 821 873 905 906 888 879 890 897 875 843 834 850 856 842 833 838 829 795 783 829 895 919 905 904 919 907 866 852 885 915
938 915 903 890 912 928 884 811 790 834 881 891 887 889 882 856 840 846 846 813 774 770 796 804 770 729 734 791 848 850 799 761 795 879 932 912 862 845 861 859 815 761
933 761 740 762 813 875 931 959 948 907 869 860 876 890 883 863 856 868 880 876 858 843 839 840 839 828 801 764 741 755 796 833 849 858 875 896 909 908 889 843 778 733
928 733 751 820 877 889 886 910 941 926 864 813 804 802 773 741 747 774 766 715 677 690 726 745 750 763 778 770 745 735 752 771 777 788 825 864 862 820 792 821 891 944
923 944 950 927 899 865 818 776 769 795 824 825 802 785 797 836 868 864 838 831 862 898 901 871 835 804 778 766 776 796 798 786 784 794 788 755 722 712 721 732 738 738 733 736
918 736 765 805 817 792 772 797 860 917 943 940 916 876 831 793 770 769 789 808 810 808 837 888 907 868 813 799 830 874 908 920 895 842 814 847 907 934 922
913 922 904 885 848 816 830 873 882 843 812 827 849 827 778 752 763 781 789 794 810 845 894 932 927 875 816 788 780 764 737 733 778 854 921 951 949 930 891 827 760
909 760 738 770 802 780 729 715 746 770 761 760 800 845 844 803 761 744 748 764 782 784 767 753 761 786 821 866 906 916 897 886 900 903 859 792 748 731 723 727 754 785
904 785 786 766 764 793 825 842 848 847 840 838 855 879 882 861 842 849 876 902 904 860 776 700 689 743 803 821 796 758 738 747 783 831 875 905 913 891 848 811 791 770 744
899 744 746 798 866 901 905 910 914 894 866 866 889 893 875 868 875 862 831 828 858 869 841 826 858 889 866 814 780 752 705 672 703 775 818 816 813 828 826 792 763 770 795 814
894 814 828 847 861 866 873 897 932 962 973 959 926 900 898 901 885 866 884 936 965 941 894 864 846 816 781 770 785 804 809 803 796 799 828 879 924 932 901 853 813 799
889 799 820 864 889 862 808 782 800 820 811 797 822 879 920 922 912 915 917 892 847 815 808 812 816 830 849 849 821 800 820 864 880 844 793 773 788 806 800 789 802 847
884 847 896 911 885 842 815 813 822 819 792 752 723 725 753 787 804 793 761 730 728 760 798 807 789 779 797 820 823 812 803 799 794 800 836 884 912 920 941 982 1006 985 943
879 943 926 938 941 912 880 884 926 963 960 929 907 907 914 915 917 925 926 904 868 839 827 830 847 872 884 864 826 794 779 770 763 760 758 758 777 819 847 823 766 732 742 757 756
874 756 773 834 901 916 876 820 772 733 717 743 789 809 789 755 738 743 766 804 837 836 809 793 807 829 831 822 824 836 850 872 901 917 905 884 880 876 843 803 807
869 807 857 891 870 827 803 787 754 736 776 855 900 887 858 841 810 756 723 747 792 806 797 812 852 870 851 832 839 853 858 872 908 940 936 898 849 796 749
864 749 729 746 781 811 836 859 854 805 752 750 794 819 794 758 754 774 786 796 825 863 874 858 841 834 819 797 797 827 856 856 849 862 882 876 851 848 873 885 860 837
859 837 864 923 957 934 877 820 783 773 786 797 786 763 760 785 809 809 802 811 832 849 857 865 868 858 838 821 816 825 848 880 903 897 858 810 785 803 845 864 832 769
855 769 724 723 750 778 800 816 813 783 750 749 783 826 845 838 828 839 872 900 900 883 878 889 887 857 821 810 827 853 875 883 858 799 738 714 730 755 772 791 822
850 822 856 874 864 826 781 761 781 825 857 860 840 815 809 839 889 923 920 905 902 905 894 888 916 969 1004 996 963 931 911 911 937 972 985 972 962 974 997 1017 1025 1021
845 1021 1009 1015 1054 1099 1101 1059 1026 1042 1095 1160 1230 1305 1371 1423 1466 1491 1476 1438 1434 1490 1567 1619 1659 1723 1808 1883 1949 2033 2140 2248 2342 2425 2511 2615 2741
841 2741 2869 2961 3009 3052 3120 3190 3222 3223 3220 3214 3179 3113 3028 2923 2802 2696 2637 2606 2558 2485 2412 2343 2265 2186 2126 2074 2002 1929 1909 1938 1946 1892 1821 1782 1760
836 1760 1723 1688 1685 1700 1692 1662 1644 1648 1654 1653 1659 1672 1673 1663 1668 1704 1753 1784 1786 1779 1788 1827 1889 1965 2053 2142 2208 2232 2223 2216 2233 2274 2338 2431 2546 2664 2775 2886 2997
832 2997 3096 3183 3286 3424 3588 3767 3974 4220 4487 4753 5027 5330 5659 5993 6343 6746 7224 7763 8334 8913 9487 10061 10657 11286
829 11286 11918 12496 12990 13414 13785 14086 14276 14328 14249 14066 13802 13456 13025 12527 11994 11450 10897 10346 9823 9341 8887 8442 8012 7610
826 7610 7227 6851 6494 6172 5871 5581 5322 5117 4945 4761 4569 4405 4259 4082 3868 3685 3576 3494 3379 3236 3114 3023 2930 2834 2766
823 2766 2734 2704 2647 2569 2492 2424 2378 2365 2371 2353 2289 2203 2135 2086 2023 1930 1839 1800 1820 1854 1850 1803 1745 1708 1698 1701 1695 1664 1614 1578 1584 1617 1635 1619 1588 1568 1555
818 1555 1543 1542 1551 1547 1513 1467 1440 1426 1402 1369 1351 1353 1357 1365 1393 1436 1452 1415 1346 1283 1238 1209 1198 1209 1228 1228 1195 1143 1104 1110 1174 1264 1328 1342 1328 1317 1297 1239 1155
813 1155 1102 1114 1161 1188 1177 1156 1152 1155 1144 1118 1096 1082 1065 1040 1036 1071 1122 1131 1079 1008 975 975 966 932 912 936 976 987 970 969 1006 1054 1083 1094 1092 1065 1007 956 961
809 961 1016 1054 1029 961 913 914 948 987 1016 1036 1044 1035 1005 966 938 930 924 903 877 872 891 903 887 868 875 897 900 877 851 845 852 860 861 855 852 869 902 923 912 884 864 855 858
803 858 899 992 1076 1068 982 926 961 1018 998 907 835 826 843 849 855 881 915 931 921 893 859 833 829 844 864 884 907 931 946 942 917 876 846 859 908 932 888 816
799 816 796 841 889 890 865 851 841 815 784 772 788 819 856 888 899 893 894 915 936 935 922 913 902 876 841 810 786 775 797 847 879 867 855 895 953 951 881 824
794 824 831 860 850 811 794 815 837 837 823 804 778 752 748 780 831 866 860 822 793 798 817 815 792 787 808 821 801 780 796 828 820 765 721 733 783 824 841 857 887
789 887 916 920 898 882 897 929 940 917 898 920 976 1023 1038 1028 1001 952 895 864 870 878 851 796 751 734 737 754 787 827 844 827 798 786 797 809 809 806 806 802 791
784 791 783 792 810 814 796 777 779 798 811 800 769 736 722 741 783 814 807 774 756 778 819 836 817 790 781 786 788 785 793 820 858 892 909 899 869 847 862 908 940 937 922
779 922 923 925 896 839 791 770 766 780 828 889 913 881 839 826 831 823 813 819 822 797 776 809 883 924 897 845 819 814 806 799 801 801 787 777 793 821 842 857 869 865 841 831
774 831 861 894 872 809 783 827 888 899 861 823 811 811 804 787 768 753 751 764 774 766 743 722 713 712 709 696 678 671 690 724 749 758 770 795 814 810 793 787 798 816 836
769 836 860 883 894 891 872 832 776 739 742 765 772 764 772 783 754 688 656 697 762 783 772 776 794 782 743 728 754 780 785 791 806 801 769 758 797 851 879 896 920 919
764 919 866 808 810 861 897 901 911 936 940 913 893 899 901 879 860 868 888 896 887 870 850 842 856 868 853 844 902 1001 1044 990 921 914 935 916 871 855 865 858 839 845 868 856
759 856 806 762 740 723 721 758 807 810 775 773 820 850 826 789 778 772 753 763 824 877 859 796 758 755 750 740 760 810 851 867 869 861 832 793 776 792 825 861 891
755 891 892 851 801 782 789 782 758 753 781 818 850 885 903 854 746 669 697 790 848 833 796 789 805 812 809 826 873 915 912 871 843 858 889 895 873 858 854 827 770 730
750 730 756 836 907 922 891 846 808 775 742 720 729 772 821 841 838 842 854 841 789 738 734 768 790 777 749 729 716 709 713 730 744 748 752 771 796 806 795 775 753
745 753 719 672 643 661 716 763 781 798 844 899 925 908 874 839 799 765 757 771 773 751 731 731 740 742 752 784 814 806 767 731 711 701 702 718 737 743 754 798 859
740 859 884 845 774 717 688 685 707 749 785 786 755 714 691 696 723 748 754 756 784 833 862 845 803 777 772 767 748 723 711 717 728 728 713 707 733 776 791 766 742 753
735 753 771 756 717 701 717 730 724 727 760 796 798 772 748 740 744 758 779 788 763 716 686 691 714 727 724 716 717 729 751 773 783 791 826 888 938 928 863 794 760 756 762 781
730 781 816 850 855 831 804 790 780 768 765 781 807 830 847 863 865 834 773 711 683 700 746 787 801 797 804 835 862 856 825 804 805 809 798 786 793 810 804 769 745 767
725 767 818 841 811 763 738 729 700 651 632 676 754 808 813 782 736 699 697 737 791 821 821 821 833 839 830 827 850 882 889 863 824 792 768 740 699 649 613 616 657 697
720 697 707 699 701 718 727 724 732 760 784 782 765 755 750 732 702 684 693 711 717 719 746 797 833 818 771 739 745 761 758 742 739 746 737 709 692 707 734 743 738 747 776 799 790 753 705
715 705 653 603 577 600 662 723 748 746 751 776 799 794 764 731 708 692 677 676 698 734 750 727 684 662 676 697 696 691 718 778 827 831 806 790 803 829 852 860 848
710 848 824 803 798 803 812 826 841 843 826 809 812 822 816 795 784 788 785 762 732 714 722 762 819 846 812 760 761 822 871 857 823 824 845 834 798 780 785 780 766 779 812 812
705 812 772 747 776 818 824 806 804 807 781 736 721 744 762 743 703 677 679 706 740 764 768 764 772 787 789 778 778 787 775 733 700 714 758 780 760 729 727 756 783 783 769
700 769 767 777 772 742 715 718 732 718 680 668 704 746 752 737 744 780 813 830 842 846 817 758 708 696 705 705 701 715 744 758 739 704 688 708 749 776 760 713 681 691
695 691 719 727 720 737 784 818 805 765 742 742 738 722 722 760 815 845 841 830 837 856 861 844 823 821 841 863 867 843 796 754 749 785 827 830 793 752 733 729 722 715 720 736 757
690 757 785 820 843 840 825 823 838 849 850 862 897 932 931 891 851 843 858 859 827 794 802 848 879 854 800 775 793 814 807 788 785 790 781 760 751 764 780 781 768 768 802 856
685 856 888 863 798 745 738 760 774 765 747 745 773 823 864 861 820 784 781 799 817 834 857 868 858 858 891 922 897 821 756 734 738 747 772 805 809 773 740 751 783 789
680 789 761 737 737 750 764 774 769 741 707 696 723 773 825 857 857 832 810 809 812 792 750 713 699 709 739 777 793 767 714 668 650 652 665 686 705 712 717 738 767
675 767 772 747 717 703 696 686 688 708 728 729 726 743 765 756 717 694 723 776 799 773 732 711 705 685 644 610 611 641 673 692 694 677 647 627 642 685 722 732 723 711
670 711 705 711 738 774 789 773 750 754 788 825 851 873 892 893 861 808 765 752 757 759 746 734 732 737 741 750 771 791 796 790 790 793 782 766 767 785 784 754 726 736 768 786 778 756
665 756 732 720 739 788 831 838 825 825 834 819 773 730 718 736 765 790 796 778 756 752 764 768 760 766 794 818 809 777 752 747 751 753 759 779 804 816 804 786 788 806 809 782 747
659 747 732 737 739 731 718 704 693 701 735 766 754 699 649 644 680 728 757 751 721 707 739 788 799 764 731 741 778 806 811 795 762 730 726 750 774 786 803 832 850
655 850 846 840 844 830 783 745 754 790 807 792 771 753 741 748 780 806 796 772 771 789 793 781 770 753 719 703 748 825 860 832 800 799 809 812 830 864 879 868 880 928
650 928 953 913 859 861 903 918 892 871 873 871 850 826 804 773 744 736 752 775 802 839 871 875 862 857 854 832 796 784 800 807 788 772 787 820 840 837 818 793 771 762
645 762 764 768 776 795 815 809 779 755 751 752 751 757 773 784 790 806 828 819 773 742 764 803 803 767 748 762 774 765 760 778 799 795 781 781 799 820 838 855 868 865 845 817 790
640 790 768 762 775 795 804 800 800 806 806 794 793 824 870 894 888 877 873 859 826 805 814 832 824 803 804 826 840 845 875 919 916 848 778 772 807 818 799 796 817 816 772 729 733 768
634 768 789 770 719 659 626 649 707 734 688 609 571 597 640 654 648 657 698 753 790 786 748 714 716 747 777 786 785 783 767 731 706 724 773 805 794 767 757 756 736
629 736 691 645 615 594 585 606 659 703 694 647 630 682 764 805 786 750 738 748 758 768 786 803 799 781 779 794 795 774 766 792 812 779 721 712 765 819 831 824 829 831
625 831 816 810 833 850 814 750 717 722 717 697 706 759 801 790 762 773 817 845 839 821 801 775 756 767 803 824 800 746 701 694 723 763 788 795 808 840 866 860 836
620 836 841 880 911 897 857 829 821 811 795 796 822 847 846 823 812 832 872 903 903 873 838 828 849 878 892 896 911 930 923 884 853 855 861 832 787 785 835 882 885 866 860
615 860 862 850 840 863 910 946 963 979 999 1006 1004 1017 1048 1066 1042 997 974 985 1009 1023 1023 1014 1004 993 982 972 962 957 966 998 1042 1065 1043 998 988 1038 1099 1108 1058
610 1058 996 966 973 1007 1049 1072 1067 1057 1073 1099 1098 1073 1072 1107 1134 1119 1089 1077 1075 1058 1041 1052 1073 1057 1003 967 993 1056 1102 1102 1072 1041 1025 1015 995 964 940 939
605 939 957 982 1003 1012 1001 973 940 916 905 911 947 1012 1079 1119 1129 1128 1124 1115 1103 1100 1104 1105 1099 1090 1083 1080 1078 1069 1041 998 966 965 980 988 986 984 983 980 979 979 964 926 888 875 869 847 826
600 826 848 900 918 873 807 773 766 757 748 757 780 795 798 797 786 756 722 715 747 796 824 813 784 786 843 916 929 864 791 783 836 889 909 905 889 866 847 847 855 839 796
595 796 759 754 771 789 805 815 815 804 796 801 809 811 814 829 846 842 811 777 776 808 839 835 808 799 825 860 875 872 860 826 775 757 810 883 887 809 730 715 745 771 778 776 757
589 757 728 730 790 867 897 870 826 787 744 703 689 707 736 766 802 840 861 866 869 861 818 758 738 779 837 865 877 900 918 900 866 860 888 913 916 918 936 965 992
585 992 1017 1024 997 948 923 947 996 1038 1065 1088 1106 1120 1147 1198 1253 1286 1304 1329 1366 1401 1437 1483 1528 1553 1570 1612 1687 1764 1822 1876 1949 2039 2124 2182 2203 2193
580 2193 2180 2197 2239 2264 2242 2188 2134 2090 2050 2010 1963 1902 1838 1800 1790 1756 1663 1556 1508 1511 1487 1401 1315 1301 1332 1331 1267 1187 1139 1128 1125 1114 1099 1091 1099 1121 1143
576 1143 1155 1159 1162 1164 1158 1141 1108 1062 1012 981 983 1003 1015 1002 959 896 841 826 855 885 874 832 807 825 856 864 852 849 859 864 852 842 858 896 921 908 869 844 861
571 861 910 956 963 927 876 853 872 898 880 815 756 747 776 801 809 816 828 829 816 804 801 794 776 761 770 805 849 886 899 889 880 892 906 882 816 762 764 807 846 862
566 862 866 860 850 857 890 916 893 834 804 830 870 877 866 877 903 897 848 796 780 787 778 755 754 792 836 841 811 797 826 870 887 871 843 814 787 782 818 872 891 865
561 865 841 853 876 876 857 845 847 855 877 917 946 931 892 887 928 967 966 938 918 914 922 948 987 1008 988 951 939 953 958 935 902 887 891 905 928 958 980 971 937 912
556 912 928 979 1023 1029 1011 1002 1003 980 931 904 932 975 969 909 850 827 824 814 802 801 810 825 850 873 874 861 873 915 942 917 876 874 898 893 852 828 854 898 917 914 906
551 906 888 847 798 778 803 860 924 971 986 971 950 938 935 932 936 950 959 952 944 954 981 1009 1035 1066 1089 1081 1045 1014 1010 1023 1028 1013 983 949 922 909 912 930 960 988
546 988 993 962 914 884 888 916 955 991 1012 1006 984 965 953 938 934 974 1059 1129 1131 1085 1062 1099 1163 1208 1224 1224 1217 1205 1195 1199 1211 1216 1208 1195 1186 1190 1202 1209 1198 1172 1156 1163
541 1163 1177 1161 1110 1062 1050 1064 1070 1062 1068 1096 1113 1082 1024 994 1021 1075 1103 1085 1046 1024 1031 1050 1052 1032 1013 1018 1040 1058 1065 1069 1070 1055 1033 1032 1064 1096 1096 1081 1101 1162
536 1162 1213 1208 1157 1115 1109 1117 1108 1083 1066 1071 1090 1117 1155 1199 1222 1205 1176 1173 1195 1203 1190 1201 1259 1319 1323 1281 1246 1232 1220 1214 1242 1301 1341 1337 1321 1323 1328 1324 1326 1343 1349 1326
531 1326 1311 1339 1386 1407 1415 1453 1517 1556 1552 1542 1544 1535 1504 1480 1481 1486 1481 1489 1517 1535 1528 1536 1590 1653 1674 1671 1700 1761 1801 1795 1780 1781 1781 1766 1767 1808 1873 1928 1963 1981 1975 1951 1940
526 1940 1965 2010 2053 2099 2155 2206 2232 2245 2276 2324 2370 2404 2436 2467 2498 2552 2639 2725 2767 2784 2848 2981 3117 3196 3236 3297 3394 3499 3597 3701 3812 3917
522 3917 4019 4137 4284 4453 4634 4821 4997 5147 5284 5438 5605 5746 5844 5921 6006 6083 6111 6070 5976 5867 5777 5715 5652 5546 5399 5266 5193
519 5193 5160 5107 5024 4960 4949 4965 4963 4940 4927 4943 4970 4993 5021 5081 5183 5310 5433 5533 5616 5702 5812 5949 6110 6294 6501 6722 6938 7153 7402
515 7402 7710 8053 8379 8681 9016 9433 9905 10362 10778 11187 11623 12076 12519 12953 13384 13787 14116 14353 14522 14650 14747 14802 14807 14772 14719
512 14719 14666 14619 14569 14509 14430 14312 14147 13962 13805 13681 13541 13353 13147 12970 12798 12573 12295 12028 11798 11552 11241 10900 10598 10344 10094
509 10094 9828 9564 9309 9049 8789 8571 8415 8296 8182 8078 7999 7932 7850 7761 7711 7720 7751 7740 7673 7594 7558 7567 7573 7530 7448 7366 7299 7211 7061 6843
505 6843 6592 6345 6121 5925 5752 5578 5376 5152 4947 4804 4713 4621 4493 4337 4180 4033 3892 3756 3632 3519 3418 3336 3280 3230 3166
502 3166 3098 3056 3043 3027 2986 2939 2905 2875 2825 2758 2690 2623 2550 2485 2441 2405 2350 2280 2232 2215 2204 2182 2162 2160 2166 2167 2167 2167 2145 2091 2032 2001 1995 1976 1929 1873 1839 1837
498 1837 1858 1882 1893 1894 1906 1936 1955 1934 1888 1860 1859 1853 1821 1789 1782 1785 1764 1727 1711 1722 1728 1700 1662 1654 1684 1715 1717 1695 1676 1675 1679 1676 1668 1663 1649 1612 1570 1559 1583 1603 1595 1581
493 1581 1596 1622 1618 1587 1575 1595 1603 1568 1519 1500 1507 1499 1474 1463 1474 1485 1485 1492 1513 1532 1530 1516 1500 1481 1459 1449 1454 1445 1398 1334 1298 1309 1345 1377 1382 1359 1322 1304 1318 1343
488 1343 1347 1334 1326 1328 1317 1285 1248 1225 1212 1208 1216 1235 1248 1244 1233 1221 1198 1168 1159 1192 1241 1266 1257 1243 1240 1239 1232 1230 1240 1237 1200 1143 1104 1102 1113 1112 1100 1101 1117 1123 1104 1075 1072 1100
482 1100 1136 1157 1163 1162 1153 1136 1123 1134 1171 1217 1249 1260 1248 1219 1178 1134 1106 1102 1112 1114 1100 1083 1081 1089 1093 1088 1075 1041 982 930 931 979 1015 1000 972 981 1023 1055 1063 1070 1084
477 1084 1082 1056 1037 1051 1076 1074 1039 999 982 987 1006 1030 1052 1055 1021 962 918 922 959 979 958 922 905 910 919 932 955 970 951 911 900 937 984 990 960 944 965 1000 1011
472 1011 989 963 959 973 978 961 939 938 956 970 967 957 957 970 988 1004 1017 1029 1046 1060 1050 1013 980 984 1017 1041 1035 1013 993 975 958 948 948 947 947 967 1010 1048 1055 1037
468 1037 1018 1002 982 961 950 953 964 977 979 964 946 956 994 1018 996 953 934 947 965 974 987 1008 1020 1005 971 942 943 977 1019 1029 996 958 957 983 996 986 976
463 976 973 958 930 919 943 974 977 956 935 919 899 881 892 937 989 1007 977 926 896 902 924 935 938 945 952 944 928 928 946 948 921 892 895 925 950 962 977 999 1003 968 908
458 908 868 876 919 961 984 1000 1022 1037 1024 998 998 1040 1093 1113 1091 1051 1017 1003 1008 1019 1017 993 963 949 952 960 965 978 1003 1032 1050 1052 1041 1029 1022 1016 1007 996 994 1001 1009 1013 1013
453 1013 1011 1006 1001 1010 1031 1043 1024 985 953 949 968 993 1003 995 979 972 978 980 966 934 897 873 876 902 929 939 942 964 1009 1048 1059 1046 1026 1005 986 980 995 1015 1020 998 951
448 951 893 852 852 882 909 922 940 965 957 898 837 834 874 895 879 864 871 878 869 864 878 890 883 876 890 905 893 862 841 835 830 829 849 886 918 936 951 967 971 956 933 913
443 913 903 906 922 936 927 896 873 881 907 915 902 898 922 948 940 900 868 875 905 924 921 909 897 882 861 840 823 810 809 820 831 822 802 793 803 815 815 813 816 809 784 759 769
437 769 816 867 894 894 880 856 829 819 842 883 904 888 859 859 888 907 886 850 835 839 835 823 832 876 920 924 893 855 830 820 821 830 832 813 784 766 771 793 822 849
432 849 860 848 825 805 789 768 755 771 811 843 846 829 808 780 738 700 704 762 841 891 892 858 810 757 704 674 696 771 859 913 922 913 912 922 926 914 895 890 906
428 906 929 941 935 913 876 822 771 754 780 816 825 810 798 804 815 824 833 846 854 847 824 793 765 761 783 809 810 794 792 816 844 862 881 908 916 876 806 764 776 812 827
423 827 817 814 839 876 899 899 877 837 791 763 764 771 750 711 701 737 775 771 748 762 819 861 854 830 833 861 883 893 897 887 847 796 780 806 830 818 794 798 829 837
418 837 796 731 695 706 740 762 768 783 824 868 882 859 829 823 840 856 859 858 868 881 876 840 793 772 797 849 882 875 843 812 790 775 774 793 819 825 805 785 777 765
413 765 737 703 674 649 628 642 702 764 766 714 689 746 847 906 889 832 786 763 746 727 710 701 691 674 660 674 714 749 756 758 778 798 783 748 750 796 828
408 828 814 800 830 869 850 782 737 751 788 807 811 818 831 845 864 877 858 798 730 698 710 743 762 750 718 688 673 668 676 711 767 799 788 776 811 864 863 803
404 803 749 733 712 662 626 651 718 786 845 886 872 803 745 760 815 838 819 815 848 880 878 849 813 775 753 765 794 800 785 793 843 899 921 909 889 869 845
399 845 812 771 726 694 694 723 757 785 812 835 835 812 793 803 824 823 783 728 697 714 756 781 769 755 773 807 824 828 848 869 840 754 672 650 673 694 698 700
395 700 718 757 809 844 840 817 823 858 870 830 776 761 779 797 812 831 841 826 809 824 855 858 824 786 763 757 773 811 839 818 765 738 758 787 795 795 800 793 762
390 762 726 706 695 681 675 689 715 736 746 746 730 706 701 728 768 797 808 803 783 760 758 790 829 849 851 851 843 818 799 814 845 846 805 766 769 798 814 808 799 797 790 770
385 770 748 736 733 737 758 800 838 837 789 734 716 740 774 794 810 837 860 851 810 773 774 808 837 831 798 772 781 818 855 866 851 828 809 799 801 812 823 827 829 837 846
380 846 835 805 782 792 822 839 830 820 837 874 900 899 878 847 809 777 765 773 778 767 762 788 836 870 873 857 836 810 782 766 771 789 802 803 800 803 826 873 925 946
375 946 922 880 859 870 885 881 859 844 851 868 868 845 829 856 916 962 959 926 899 886 875 866 877 912 951 976 984 981 972 964 957 945 928 925 949 971 954 908 892 933 985
370 985 992 969 967 999 1022 1010 989 990 1017 1057 1106 1156 1189 1203 1227 1273 1309 1304 1283 1289 1322 1335 1305 1259 1227 1216 1227 1269 1322 1336 1298 1260 1276 1324 1339 1298 1242 1209
365 1209 1199 1199 1198 1181 1142 1111 1137 1222 1308 1342 1333 1322 1328 1344 1362 1379 1382 1375 1382 1417 1455 1460 1438 1432 1465 1514 1545 1561 1591 1646 1690 1671 1585 1493 1462 1491 1518 1507 1479
360 1479 1468 1464 1439 1391 1340 1293 1257 1253 1288 1329 1345 1349 1359 1355 1313 1273 1295 1361 1387 1338 1272 1247 1251 1253 1260 1279 1279 1238 1196 1193 1209 1194 1159 1156 1195 1238 1260 1267 1267 1251 1230
355 1230 1228 1241 1244 1229 1214 1203 1189 1186 1211 1233 1198 1119 1082 1129 1198 1215 1190 1178 1189 1190 1172 1162 1168 1174 1179 1195 1213 1209 1187 1175 1187 1201 1200 1190 1176 1157 1138 1140 1163 1175
350 1175 1141 1068 999 968 974 987 980 954 928 915 919 949 1010 1077 1098 1067 1046 1084 1139 1130 1066 1033 1065 1093 1056 993 970 989 1006 1016 1042 1076 1075 1032 993 988 1008 1037
346 1037 1072 1101 1096 1056 1016 1000 999 1001 1013 1035 1043 1027 1009 1008 1008 992 976 982 999 1000 991 992 995 970 926 909 943 997 1030 1035 1023 999 979 994 1048 1097 1101 1079 1079 1100 1102 1074
341 1074 1056 1071 1079 1050 1014 1017 1043 1041 1007 997 1032 1073 1078 1058 1044 1034 1014 1000 1009 1027 1025 1003 982 972 967 972 988 990 959 921 923 953 960 933 926 965 1009 1011 985 970 965 949
336 949 937 957 990 989 954 927 920 901 855 818 827 864 895 918 946 970 968 943 922 916 913 903 897 901 903 889 867 865 892 931 948 932 904 891 902 917 912 882 845 826 838
331 838 867 888 888 876 871 878 884 879 862 846 846 868 899 915 903 871 846 840 850 859 857 852 870 920 977 998 977 956 965 984 980 959 951 950 930 892 868 869 871 858 847 859 883
325 883 900 910 914 904 877 857 856 853 833 812 813 829 839 849 874 905 912 889 858 834 812 795 793 805 814 812 810 811 802 786 780 786 777 738 695 685 715 762 809 858 906 935
320 935 924 879 831 817 855 912 934 898 842 826 864 912 925 904 880 871 859 834 810 815 845 868 858 829 810 813 818 799 757 723 727 760 789 796 803 830 859 858 837
315 837 838 879 924 932 908 871 826 780 760 781 812 815 806 823 863 884 873 869 893 924 939 951 968 966 923 860 821 817 834 861 894 916 915 901 899 918 944 959 953 934
310 934 926 943 955 920 843 784 782 809 822 821 832 846 833 802 797 832 874 894 894 883 860 828 804 794 783 770 768 783 806 841 894 946 959 930 894 878 866 847
306 847 840 861 891 907 917 929 920 881 848 862 900 908 882 861 857 843 815 812 841 858 839 816 825 843 835 818 835 886 922 916 891 881 897 942 1004 1048 1034 965 891
301 891 852 843 842 847 862 872 864 847 840 835 808 774 780 834 884 875 828 810 848 895 897 867 854 870 878 861 853 887 933 926 864 815 829 871 873 832 802 811 818 784 731 711 729
296 729 749 755 764 787 802 797 791 807 833 838 824 815 822 824 807 784 773 772 775 784 801 825 849 864 861 837 816 831 885 934 933 891 859 866 898 921 911 867 809 771 783 837
291 837 899 942 961 953 912 853 820 844 902 945 950 933 918 905 891 881 880 881 872 848 813 789 791 818 842 831 789 754 758 794 826 833 826 830 857 897 932 949 940 909 872
286 872 847 849 868 886 889 881 874 870 874 890 916 930 918 891 876 886 904 903 875 836 806 802 831 886 944 979 987 984 989 1003 1012 997 955 902 860 839 837 845 863 884 900 901 887
280 887 873 880 913 952 967 949 916 899 903 913 914 900 876 861 878 925 962 957 931 934 970 978 916 828 794 833 887 905 892 882 881 873 853 832 819 812 807 813 833 863 893
275 893 920 946 956 928 863 795 770 789 818 832 840 862 898 934 964 981 975 950 929 934 951 950 921 885 860 853 864 885 897 883 858 853 874 888 872 847 852 895 944
271 944 966 964 968 992 1003 968 905 879 915 962 961 931 935 982 1001 943 846 788 795 832 861 873 879 885 892 891 875 853 847 869 905 935 956 968 967 946 917 897 893 899 903 894 872
265 872 865 907 989 1047 1040 997 974 975 966 940 930 952 979 991 1002 1032 1066 1073 1047 1005 965 940 936 944 951 951 956 976 997 1002 995 1000 1031 1079 1113 1110 1077 1044 1036 1047 1053 1045 1030 1011
260 1011 991 979 984 989 970 936 917 921 920 902 893 907 916 899 882 901 941 959 953 953 965 963 948 956 987 995 958 926 951 1001 999 930 857 840 874 927 979 1016 1016 976 932
255 932 925 952 979 985 979 972 962 955 968 1003 1030 1021 990 972 980 1000 1023 1049 1070 1073 1065 1071 1094 1105 1078 1035 1005 987 966 947 956 986 1002 987 966 967 982 989 982 975 973 974 980 999
250 999 1023 1027 998 944 895 874 894 941 987 1003 989 976 991 1023 1040 1022 990 971 962 942 917 918 958 999 1000 977 977 1016 1053 1055 1039 1038 1050 1049 1025 991 961 946 957
245 957 993 1032 1051 1053 1051 1041 1015 982 964 960 952 941 946 974 1008 1033 1054 1078 1102 1124 1144 1150 1132 1109 1111 1129 1120 1073 1042 1074 1134 1154 1122 1090 1092 1103 1089 1053 1016 999
240 999 1012 1052 1096 1118 1120 1126 1137 1136 1120 1105 1100 1088 1065 1049 1050 1065 1094 1136 1161 1133 1068 1029 1047 1081 1095 1107 1133 1142 1108 1079 1109 1164 1162 1098 1051 1066 1100 1106 1098 1107
235 1107 1121 1120 1117 1130 1147 1155 1158 1157 1134 1084 1047 1070 1138 1188 1182 1136 1090 1079 1107 1150 1172 1168 1172 1202 1236 1239 1213 1184 1163 1152 1158 1183 1197 1172 1130 1114 1124 1130 1123 1122 1127 1118
230 1118 1104 1125 1179 1209 1182 1138 1135 1167 1191 1198 1207 1219 1209 1174 1136 1111 1096 1101 1139 1194 1221 1198 1152 1118 1100 1101 1141 1225 1305 1326 1289 1241 1210 1187 1177 1207 1280
225 1280 1347 1356 1322 1294 1288 1283 1266 1257 1269 1285 1286 1279 1280 1294 1319 1345 1351 1313 1244 1195 1193 1209 1205 1199 1227 1270 1266 1205 1147 1139 1150 1132 1093 1083 1116 1159 1182 1187 1185 1179 1183 1213 1265
220 1265 1307 1320 1308 1288 1270 1263 1275 1295 1303 1297 1295 1310 1329 1334 1325 1316 1309 1312 1339 1388 1424 1414 1360 1297 1247 1215 1206 1223 1245 1246 1233 1238 1269 1297 1305 1316 1344 1359 1325 1261 1219
215 1219 1212 1211 1207 1228 1283 1333 1337 1305 1273 1257 1251 1248 1248 1248 1251 1281 1350 1422 1444 1407 1361 1345 1344 1322 1286 1268 1277 1279 1252 1219 1218 1250 1280 1285 1280 1290 1311 1318 1305 1281 1256 1227 1203
210 1203 1201 1222 1244 1254 1260 1273 1287 1296 1296 1281 1238 1185 1162 1187 1225 1244 1257 1288 1314 1291 1232 1201 1232 1277 1283 1259 1245 1244 1232 1205 1190 1201 1217 1217 1211 1223 1257 1286 1284
205 1284 1256 1234 1241 1261 1261 1233 1203 1200 1227 1258 1262 1232 1205 1223 1275 1298 1245 1156 1114 1133 1154 1133 1101 1101 1121 1127 1120 1124 1140 1142 1132 1137 1166 1191 1186 1160 1149 1170 1205 1213 1185
200 1185 1156 1165 1201 1208 1169 1131 1141 1181 1203 1205 1220 1249 1258 1236 1215 1207 1184 1126 1062 1037 1058 1101 1148 1193 1227 1233 1215 1190 1170 1155 1139 1121 1110 1113 1124 1122 1093 1054 1042
195 1042 1076 1123 1137 1105 1068 1075 1130 1186 1189 1140 1086 1066 1066 1053 1023 1003 1006 1020 1029 1031 1030 1022 1011 1000 989 978 978 1002 1037 1054 1044 1028 1025 1039 1079 1142 1192 1176 1091 1010
190 1010 994 1028 1052 1034 989 936 892 877 898 928 937 939 968 1018 1036 1003 964 962 979 976 960 971 1014 1047 1039 1013 1005 1009 994 954 922 923 944 960 972 994 1025 1044 1045
186 1045 1034 1014 980 939 920 935 969 998 1015 1022 1020 1011 1007 1007 996 968 946 959 999 1027 1017 982 946 928 935 964 994 998 971 937 918 908 892 870 855 858 874 886 895
181 895 915 952 985 980 937 901 905 931 937 911 882 869 868 877 910 962 997 986 948 921 909 887 850 836 872 940 991 992 955 918 920 966 1021 1041 1018 990 986 988 958 909
176 909 895 929 958 934 888 873 884 874 849 878 978 1061 1040 948 901 948 1023 1051 1031 1006 995 980 945 901 866 852 858 868 863 853 873 934 1000 1025 1007 984
172 984 973 955 921 898 914 944 935 880 825 802 792 761 729 746 810 861 855 820 801 801 792 771 758 760 769 790 828 859 846 792 751 762 816 872 902 891 845 792
167 792 767 771 768 743 727 749 793 829 855 885 907 901 879 863 848 821 798 817 860 865 811 766 793 867 903 867 799 752 736 736 749 772 798 825 858 893 905 885
162 885 859 853 852 825 781 766 792 818 812 799 809 814 770 702 690 763 857 902 902 896 890 858 798 747 736 758 786 800 798 792 801 823 834 819 794 782 773 752 739 767 815
157 815 829 794 758 765 794 807 806 815 827 813 772 742 753 793 830 843 827 794 763 743 723 700 690 715 767 808 814 798 779 757 722 680 653 659 694 728 741 738
153 738 737 741 724 676 628 627 671 717 738 743 747 741 726 723 736 736 706 679 690 726 742 731 722 726 731 740 773 815 824 791 759 749 736 705 692 733 797 827 814 794 787 786 788
147 788 794 786 741 675 630 623 631 638 651 668 679 687 714 750 761 742 728 743 758 747 724 712 706 697 707 759 824 852 829 787 752 724 698 683 689 716 756 793 806 795
142 795 785 792 792 758 703 674 690 719 731 732 734 729 706 678 673 693 717 733 750 772 778 750 716 721 774 822 819 779 751 741 709 647 604 621 671 693 679 673 705 752
138 752 774 756 720 706 733 780 806 793 771 773 785 763 701 642 627 657 709 761 800 816 814 805 792 772 752 748 756 761 756 746 727 687 639 621 652 712 763 792 799
133 799 779 731 682 669 704 755 776 744 679 631 630 670 711 723 703 672 651 645 631 593 562 582 647 681 639 572 567 626 675 670 648 655 676 673 645 621 624 649 680
128 680 697 698 700 718 736 731 717 726 754 760 737 720 724 720 694 682 709 743 748 744 762 789 794 782 775 769 749 725 714 703 680 670 701 746 759 735 704 676 651 658 718 793
123 793 819 797 779 777 752 698 669 679 679 638 609 644 709 735 715 708 748 803 827 813 783 765 772 791 796 774 739 716 718 739 771 802 816 803 770 731 700 686
118 686 689 693 684 664 644 629 620 635 687 747 763 726 688 706 768 818 818 790 772 778 785 769 734 711 717 735 744 742 741 734 714 704 732 790 827 814 774 745 745 764 780 771
113 771 732 688 665 664 669 683 710 724 698 654 649 688 716 708 706 749 800 805 772 753 765 787 800 798 770 706 634 601 624 674 716 736 744 757 780 795 776 721 661
108 661 623 617 633 658 667 646 621 631 660 649 591 558 601 673 704 700 709 731 734 721 725 742 735 707 692 699 701 695 701 709 685 641 625 646 658 644 641 662 664 623 583 593
103 593 640 675 688 694 694 679 657 645 645 656 679 702 697 667 656 691 746 774 764 734 696 656 631 636 658 680 705 736 757 755 739 726 713 703 712 735 731 680 634
98 634 649 705 731 708 687 691 685 639 587 572 590 611 627 649 674 701 745 807 841 805 729 683 681 670 623 586 604 646 653 631 630 656 665 645 639 667 686 668 654
94 654 682 717 705 665 662 697 706 670 644 665 690 666 609 573 576 601 626 644 646 636 636 655 672 664 638 614 605 609 628 653 672 681 695 718 733 730 724 724 717 690 657 638
89 638 638 664 718 773 780 726 663 638 636 631 636 672 713 722 711 718 734 725 699 698 725 743 742 750 772 781 773 780 802 800 761 723 705 680 631 594 605 641 650 628 608 613 638 668
83 668 684 677 658 656 673 683 671 657 667 692 706 698 673 636 598 571 563 565 578 601 624 627 619 625 636 611 541 482 485 538 594 631 651 654 642 633 639 655 665 665 652 616
78 616 575 563 584 593 573 569 622 690 710 688 677 683 660 609 588 622 668 685 687 695 692 656 611 588 586 580 566 554 552 570 621 694 737 704 620 562 575 626 650 624
73 624 585 583 625 669 673 639 605 592 591 590 597 621 649 663 662 656 647 630 610 597 595 608 639 688 737 754 729 690 675 702 747 764 730 665 619 613 626 631 636 665 717 752
68 752 743 701 665 652 655 663 672 673 660 640 631 636 636 628 640 685 725 708 643 595 605 648 688 723 754 753 705 648 632 655 676 672 656 642 632 638 673 721 744 733 712 694
63 694 668 642 645 680 708 702 689 699 712 693 648 613 605 610 620 631 632 617 603 614 637 638 607 579 585 620 657 673 658 620 587 588 621 651 647 627 629 661 686 675 645
58 645 633 645 648 617 567 531 524 541 580 634 674 673 642 618 612 608 606 633 684 706 673 633 644 685 685 627 570 571 625 688 726 732 712 693 698 727 751 749 723 683 638
53 638 599 585 598 619 633 642 654 670 683 689 688 684 685 690 690 676 656 636 607 569 553 595 678 739 745 713 669 619 572 559 592 636 647 627 608 599 586 562 542 536 546
48 546 570 602 625 633 632 629 620 601 594 617 650 654 631 623 661 714 722 664 578 529 547 606 654 667 667 675 682 674 667 695 749 785 768 712 643 585 554 566 609 646 649 626 598
43 598 584 594 627 654 646 619 626 686 737 717 647 607 628 655 628 560 505 495 515 543 572 609 654 698 734 755 760 745 707 655 619 630 687 750 774 748 708
38 708 695 714 730 717 688 679 686 678 643 619 639 683 702 678 646 646 675 701 695 656 609 586 597 618 618 588 550 525 522 538 567 591 598 598 608 629 642 647 659 680 689
33 689 671 648 646 655 650 631 615 610 614 624 640 645 622 591 588 611 619 593 566 576 608 623 609 593 599 612 611 600 608 644 683 691 670 656 672 690 665 595 527 492 484 485 504
28 504 553 609 634 626 620 631 628 583 521 498 538 610 671 699 702 687 664 643 628 611 581 547 541 576 631 666 665 642 621 615 620 619 608 608 636 669 658 595 539 549 602
23 602 628 607 593 630 690 726 733 739 743 723 676 627 593 575 571 582 593 590 580 586 610 624 613 601 613 642 667 673 666 654 647 655 672 678 661 638 635 654 670 664 645 644 674
18 674 714 727 707 677 661 642 605 576 599 665 707 684 626 590 587 588 574 552 531 522 540 587 639 669 681 685 667 616 567 563 589 589 558 556 613 667 651 593 573
13 573 605 635 640 659 711 749 721 648 594 583 589 586 577 566 549 535 558 621 673 658 581 515 518 573 616 615 593 588 611 637 640 607 552 512 517 564 614 641 649 654 647 617
8 617 588 604 657 682 646 591 586 632 671 668 654 663 687 691 663 626 616 651 712 744 716 654 623 642 668 660 637 632 633 611 578 574 603 629 640 661 694 699 663 631 647
3 647 684 697 688 690 695 668 619 606 647 687 676 634 614 624 638 639 638 635 617 585 563 561 562 547 531 552 623 702 740 727 697 680 668 641 607 590 587 570 545 555 618
-2 618 689 712 683 645 623 606 586 580 595 617 632 647 666 669 639 595 577 600 641 660 645 613 595 603 623 637 647 666 686 681 652 635 652 676 668 628 595 583
-7 583 565 525 501 538 625 693 694 648 615 621 644 652 646 636 618 584 553 550 578 607 618 626 649 673 677 656 624 589 554 539 559 594 605 585 568 580 610 628 622 604
-12 604 587 584 598 619 636 655 690 727 731 698 674 685 702 683 648 648 681 694 662 616 592 585 581 582 594 608 614 617 619 613 593 571 556 547 549 563 567 537 488 476 518 555
-17 555 532 477 455 473 480 453 443 490 573 632 646 636 632 641 652 654 651 656 674 683 664 622 589 584 598 612 612 592 564 553 574 604 609 595 602 638 664 657 648 670 697 677
-22 677 616 571 580 622 656 663 648 626 618 643 692 731 733 708 677 649 617 582 558 559 578 599 602 586 564 553 554 560 563 556 543 535 541 559 570 567 564 568 570 554 532 517 502
-27 502 476 456 472 515 546 548 549 571 605 642 688 731 730 677 624 617 628 606 567 570 622 659 642 612 613 629 616 585 582 616 651 650 621 596 596 622 655 671 661 641
-32 641 625 610 588 570 572 589 593 577 561 564 572 570 573 599 635 645 621 603 627 671 678 628 568 558 601 649 663 656 663 687 697 666 606 555 543 565 596 616 622 613 582
-37 582 537 500 490 492 486 477 491 528 556 560 567 589 597 568 539 559 607 624 599 589 622 660 665 652 645 630 586 539 536 580 631 662 668 647 609 585 602 640 653 641
-42 641 644 679 713 716 702 688 668 630 589 576 597 629 646 629 578 514 473 473 499 525 546 563 571 571 582 614 653 671 673 680 692 684 644 603 595 617 637 645 659 688
-47 688 705 682 627 575 551 551 569 593 604 584 552 560 621 683 691 645 585 523 464 439 480 562 610 600 572 564 565 560 566 591 604 582 550 543 551 549 549 570 596 599 585
-52 585 582 586 585 599 648 702 707 665 632 631 632 610 589 597 623 642 641 620 586 565 575 605 622 628 651 685 689 649 597 565 543 518 502 496 476 439 423 447 477 479 478 522
-57 522 601 659 664 636 606 592 603 630 642 620 584 566 561 546 530 542 586 631 654 656 637 602 574 580 615 647 667 695 729 732 693 652 646 656 640 587 531 505
-62 505 518 551 584 602 601 590 577 568 565 576 604 642 678 700 709 710 703 672 609 542 512 526 548 555 573 620 661 649 602 582 607 639 650 654 667 670 652 629 614 588
-67 588 552 544 582 624 632 633 671 719 715 659 622 638 661 648 621 622 638 628 597 582 590 591 571 551 548 542 523 517 553 613 650 651 642 639 623 577 523 503 528 582 635 668
-72 668 667 631 584 555 559 583 594 565 500 445 458 537 616 638 615 596 595 586 571 583 633 689 723 739 744 724 674 626 612 621 621 602 579 569 573 589 606 617 628
-77 628 652 681 692 681 674 684 683 644 585 544 529 529 545 593 656 694 689 664 651 659 676 681 666 641 622 614 608 609 628 650 635 579 535 547 586 598 576 552 539 534
-82 534 558 632 715 741 709 685 696 694 650 612 624 651 632 578 550 570 602 618 630 651 671 666 621 547 485 487 554 619 619 566 519 509 517 531 565 617 651 636
-86 636 594 569 580 606 625 627 619 605 586 567 567 596 630 628 582 537 534 560 571 551 520 497 492 511 555 593 587 541 507 517 543 542 509 475 459 456 460 473 493 518
-91 518 542 564 584 602 621 630 617 584 549 535 545 570 598 610 601 590 609 660 704 706 670 617 555 491 455 477 532 563 557 555 580 600 583 550 537 539 529 519
-96 519 545 597 617 587 553 559 584 583 556 534 525 511 494 502 535 562 572 581 591 573 517 471 488 557 617 632 620 608 602 590 564 523 481 465 492 548 599 631
-100 631 648 660 662 651 623 582 540 519 532 567 591 589 574 562 559 568 591 622 647 663 671 669 654 636 629 630 615 582 564 580 602 593 561 551 582 632 674 704 723
-105 723 721 699 673 652 625 593 582 610 647 644 593 546 547 581 605 612 632 673 693 659 602 585 620 656 654 632 632 650 650 613 574 570 605 641 645 616 575 542 518
-110 518 497 482 489 526 580 624 641 626 591 566 585 642 679 649 581 551 585 630 640 635 648 656 616 553 540 595 653 658 636 636 659 670 657 637 616 595 594 633
-115 633 678 673 610 544 520 521 508 477 455 459 492 550 619 666 673 657 645 646 653 673 706 729 710 657 619 630 669 686 662 626 621 651 674 649 582 521 498 498 496
-119 496 497 513 534 541 541 557 579 577 543 511 506 516 524 536 566 607 635 645 647 649 643 623 599 592 606 621 612 591 591 624 658 667 665 670 667 630 586 585 615 615 572 542 557 574
-125 574 553 528 552 607 637 640 649 659 625 554 509 523 552 551 538 560 620 670 671 633 599 603 641 675 676 659 651 649 628 589 562 570 590 595 581 565 554 550 560 588
-130 588 621 642 649 645 635 623 613 604 593 580 568 560 549 537 536 553 580 608 633 649 651 647 661 699 736 737 691 623 570 552 559 562 549 532 530 539 546 554 577 607 619 608
-135 608 602 611 618 606 588 574 554 526 518 551 599 618 609 608 619 613 572 527 522 559 604 625 626 638 679 728 748 721 671 626 593 569 562 578 601 611 609 611 611 598 586
-140 586 606 651 673 636 571 536 555 598 622 611 585 571 577 592 597 585 562 550 569 609 628 593 538 533 602 684 698 636 547 480 458 490 565 630 629 572 523
-144 523 524 552 570 578 589 602 606 612 626 630 599 544 510 525 569 601 597 560 517 489 477 473 473 477 481 483 495 523 553 559 549 555 587 622 636 636 640 655 680 703 698 653 598
-150 598 589 629 660 642 605 598 608 595 567 566 589 584 538 496 489 498 498 506 537 563 552 518 503 519 534 534 537 563 600 617 604 577 559 554 548 535 525 539 568 580 554
-155 554 509 492 520 571 610 622 615 601 589 581 575 567 559 558 571 596 620 633 634 640 663 695 711 691 650 621 624 640 651 660 680 698 679 629 595 605 623 608 579 586
-160 586 619 620 575 539 547 567 559 548 571 609 615 592 587 611 630 627 626 638 642 630 624 637 653 666 693 723 715 659 613 620 635 590 503 454 474 509 509 494 503 526 533 521
-165 521 508 497 478 466 488 537 567 554 527 532 572 617 644 658 664 659 637 609 585 571 575 606 656 694 698 677 654 636 620 614 633 660 659 612 543 491 474 492
-169 492 536 581 593 565 530 518 525 528 531 554 597 633 641 632 626 624 617 596 569 548 545 558 573 572 550 522 510 523 548 566 573 586 617 649 640 584 524 514 552 592 594
-174 594 565 538 532 537 536 530 534 551 561 554 551 577 613 605 542 486 496 552 589 583 570 581 616 660 699 705 668 622 615 643 659 644 636 655 664 635 602 602 609 577 524 514
-179 514 560 605 605 578 563 563 565 567 573 580 582 581 572 554 546 578 642 685 672 636 634 665 679 644 583 537 526 542 574 609 641 674 714 751 759 726 673 630 615 619 625 621
-185 621 605 592 597 618 636 634 619 609 610 613 606 587 562 548 557 590 629 653 654 636 606 574 552 546 550 552 549 551 559 566 566 561 553 549 562 592 614 607 586 584 600 597 562 531 537 553
-190 553 538 516 549 640 711 694 612 544 536 569 599 595 561 535 550 589 597 551 504 515 571 605 583 551 561 604 630 617 590 585 606 632 642 636 624 611 589
-195 589 561 544 549 565 571 564 563 574 584 583 582 591 599 585 550 515 499 498 505 520 547 576 587 575 557 555 570 581 572 545 521 521 548 587 612 612 595 577 571 575 583 587 583 571
-200 571 551 523 491 465 461 485 523 555 574 584 585 572 546 523 510 501 495 498 511 520 521 529 550 564 554 537 541 566 585 586 580 573 561 544 532 526 511 481 452 441 460
-205 460 508 567 602 593 560 546 563 583 595 619 662 686 655 595 564 581 614 632 628 606 568 537 546 595 635 625 591 586 610 609 562 525 553 615 637 603 566
-210 566 561 557 520 473 455 464 471 476 497 527 544 552 570 591 589 580 611 676 710 676 612 583 597 617 615 581 528 491 499 537 551 530 522 549 570 548 520 534 565 554
-215 554 512 505 549 596 613 614 607 571 517 494 516 538 534 538 580 631 649 639 628 614 580 537 512 513 532 567 602 602 560 524 547 614 664 664 634 605 595 611 645
-219 645 664 640 594 574 594 626 647 657 657 645 629 626 624 595 540 503 504 514 503 490 513 568 609 610 591 580 576 559 529 511 522 548 562 552 529 507 478 439
-224 439 409 420 485 572 621 599 537 498 512 545 544 515 502 526 552 543 510 486 484 503 544 589 598 559 520 536 587 614 604 599 619 635 627 623 639 649 630 606
-229 606 609 626 625 609 598 584 551 513 501 508 504 493 507 548 575 566 549 554 570 574 566 568 584 608 629 638 620 583 564 589 640 665 642 600 572 563 568 595 646 682 654
-234 654 572 511 527 585 607 574 542 551 577 579 565 564 574 570 567 602 672 716 691 626 576 559 556 552 553 562 577 597 618 625 607 578 560 551 534 504 481 485 515 557 587
-239 587 582 547 518 525 555 568 557 552 576 610 624 616 603 595 592 598 616 624 604 561 520 491 464 433 411 407 419 445 488 537 569 576 582 608 641 656 646 625 607 592
-244 592 573 543 499 462 463 508 549 546 524 541 600 626 574 502 493 544 580 575 585 651 720 725 690 694 756 802 763 663 579 551 556 557 548 546 566 597 614 606 590 592
-248 592 610 615 598 587 603 621 611 583 571 581 592 592 592 598 607 623 649 657 617 553 534 575 615 601 559 550 582 621 644 647 627 591 574 597 619 582 498 444 459
-253 459 505 532 549 576 606 615 609 617 643 664 653 607 547 509 512 539 556 553 553 565 565 542 513 499 497 499 514 549 583 597 595 590 582 570 570 585 589 563 527 518 539 561
-258 561 568 563 549 529 519 533 550 537 504 497 536 589 611 593 558 536 539 551 544 520 511 536 568 577 576 599 639 658 652 647 645 620 567 520 495 475 452 449 480 525 565
-263 565 600 616 590 544 540 595 647 638 592 569 577 585 585 589 593 582 567 571 580 561 515 480 472 485 519 580 640 661 647 644 662 666 636 600 579 557 525 515 553 605 617
-268 617 589 566 575 599 608 594 564 528 499 487 496 527 573 616 629 603 564 544 552 565 567 559 554 558 566 565 549 526 519 540 572 576 541 498 491 527 572 587 572 546 531
-273 531 535 562 598 611 582 538 526 558 599 618 621 615 582 520 474 491 552 589 579 558 559 570 568 565 577 598 614 625 633 620 578 529 510 532 567 579 556 514
-278 514 485 496 534 558 545 522 518 529 528 510 499 506 515 512 510 532 577 620 641 635 606 565 529 513 515 514 501 501 540 606 648 644 621 612 605 575 532 511 516 519 515 528 561
-283 561 576 549 515 516 536 530 498 487 521 569 584 561 540 548 572 578 558 538 534 527 511 520 586 671 704 676 652 673 697 673 620 592 600 621 648 674 674 632 582
-288 582 570 589 601 606 624 639 622 593 606 651 658 615 587 613 648 642 625 634 634 571 473 416 424 454 474 495 524 552 584 639 697 700 633 548 502 497 501 502 504 504 497
-293 497 503 544 601 627 606 575 571 588 590 564 535 529 551 589 628 650 639 601 563 541 525 501 478 472 481 489 503 537 576 589 576 569 579 579 542 480 421 388 402
-298 402 480 585 634 585 493 442 455 491 531 583 631 632 586 558 593 656 676 643 611 615 633 619 569 524 523 559 593 594 570 543 527 520 520 523 518 505 498 512 537
-303 537 555 562 568 572 567 554 540 525 506 500 527 576 609 606 585 571 564 556 547 546 561 599 645 668 639 578 542 554 585 599 594 591 596 597 583 552 506 468 473 520 559 552 524
-308 524 524 543 533 486 454 474 522 557 572 592 626 660 681 678 645 586 530 504 509 525 535 537 525 496 465 462 492 527 531 501 462 441 448 477 513 537 541 538 542 550
-313 550 545 521 496 481 470 450 424 407 408 434 488 554 592 585 568 598 674 734 723 650 563 502 476 480 498 508 504 502 519 554 596 635 655 636 590 560 577 622
-317 622 652 650 624 583 544 540 591 660 686 656 622 628 662 682 668 636 612 618 651 680 677 649 624 606 580 549 541 555 553 530 522 554 588 587 574 582 587 548 488 476
-322 476 525 569 563 531 514 514 515 516 516 503 483 491 537 572 556 521 519 546 550 524 515 552 601 621 617 617 624 626 620 608 582 544 520 536 582 617 618 598 578 562 547 542 558
-328 558 589 612 616 611 609 599 569 533 524 547 565 544 504 497 537 580 588 571 559 562 564 557 560 589 635 667 657 605 545 514 520 544 568 588 596 578 538 503 481 456 419
-333 419 410 467 564 626 614 556 499 468 472 513 567 587 561 524 505 492 463 435 439 469 492 501 520 558 596 612 606 587 560 530 510 504 504 508 528 571 620 645 638
-337 638 618 613 623 614 567 509 486 500 509 492 480 495 503 465 416 430 518 608 642 628 597 558 510 481 497 536 551 527 492 473 474 485 493 489 477 473 478 478 472 492
-342 492 549 595 579 531 528 577 600 545 468 451 489 507 482 471 512 560 553 500 464 477 513 538 547 549 542 531 529 535 531 508 489 494 515 526 521 514 512 514 524 548 570
-347 570 565 535 513 523 553 575 574 549 508 476 472 488 492 480 487 531 580 593 573 556 559 566 571 589 624 656 659 635 602 580 579 597 627 654 664 646 608 571 557 558
-352 558 553 540 541 563 581 581 589 622 649 642 624 632 645 609 529 471 467 479 467 453 471 502 505 484 475 494 517 527 523 516 513 515 522 529 539 565 599 607 582 558 566 575 544 492
-357 492 484 530 566 541 496 512 598 680 693 645 593 568 548 510 472 472 510 544 544 530 529 534 526 518 534 569 594 603 611 618 598 549 513 525 563 583 569 541 521 514
-362 514 520 536 551 554 547 540 532 515 492 484 511 563 608 614 588 567 575 596 598 579 565 564 555 532 519 533 552 554 549 556 564 553 532 531 542 538 518 518 549 577 569 547 554 596 638
-368 638 654 650 637 621 608 604 608 610 604 592 582 584 605 638 655 633 583 546 542 547 529 496 489 524 575 604 609 618 649 686 701 685 662 653 661 668 657 631 607 596 594 585 561
-373 561 530 506 489 471 454 453 476 509 542 586 646 694 686 622 559 543 562 570 553 541 554 577 587 579 562 536 501 475 478 506 536 549 548 543 540 545 564 604 657
-378 657 698 705 679 648 634 640 653 659 649 614 555 502 490 518 544 540 522 522 538 547 552 573 608 623 603 579 584 602 591 549 527 563 634 674 657 614 595 606 616
-383 616 602 579 565 561 563 573 592 606 604 602 614 626 612 582 569 582 603 617 631 634 597 529 484 503 557 589 581 555 530 512 512 535 563 575 580 597 609 581 525
-387 525 502 541 591 594 557 535 549 563 543 502 478 489 524 562 590 599 591 582 595 623 630 589 530 508 536 569 568 551 552 561 540 494 468 482 500 489 461 453 473
-392 473 500 524 546 561 555 526 492 471 477 507 542 556 546 536 552 590 623 633 619 597 584 591 614 632 637 637 637 630 615 605 610 614 599 572 561 577 615 665 714
-397 714 736 713 662 614 575 541 526 547 580 583 552 534 552 574 567 550 553 574 589 593 587 560 516 491 516 563 587 592 610 639 640 612 601 626 645 619 566 524
-402 524 501 487 480 488 504 520 540 557 545 504 479 504 548 562 544 536 547 551 540 536 542 536 516 515 540 555 538 516 520 538 541 537 552 582 593 565 513 463 442 470
-407 470 538 602 631 635 641 642 616 584 586 612 602 534 452 407 391 379 384 431 502 550 557 545 537 535 539 550 561 562 557 564 577 583 585 609 650 668 634 580 562 592 627 622
-412 622 584 556 560 572 562 531 510 517 537 550 559 577 594 590 560 520 474 417 368 373 446 539 585 565 515 468 440 438 470 525 570 590 601 620 630 608 558 514
-416 514 494 489 485 486 497 506 498 477 467 483 523 567 594 589 560 529 517 519 520 517 522 542 564 570 560 549 553 572 593 594 574 551 547 555 553 535 515 506 498 482 469 469 470 462 461 487
-422 487 521 531 527 547 594 617 584 535 528 556 574 575 589 619 618 564 503 492 520 532 514 504 520 529 506 483 507 558 575 542 519 555 617 636 605 581 603
-426 603 646 654 617 572 551 547 531 495 471 488 530 548 518 472 456 475 500 517 540 577 611 625 618 603 592 597 623 652 656 632 608 604 607 600 589 585 585 578 566 554
-431 554 540 531 545 580 606 601 588 597 610 592 549 529 547 571 574 572 581 593 600 604 602 576 525 486 485 501 502 497 507 524 517 491 482 504 523 514 492 488 501 504 489 481 508 564
-437 564 603 582 512 452 450 487 509 493 480 511 576 625 633 613 593 585 588 593 579 536 483 454 460 473 476 487 521 552 542 506 495 521 543 531 507 496 481 443
-441 443 401 390 399 405 420 479 566 612 581 509 457 451 494 566 626 627 576 534 539 567 582 593 616 626 597 555 548 572 575 531 474 452 474 512 537 544 556 590 626
-446 626 622 577 546 561 581 557 510 495 515 528 527 539 558 552 543 590 679 704 616 501 466 497 502 455 421 447 504 539 531 499 473 479 513 544 550 548 560 565 541
-451 541 513 526 570 592 574 560 585 627 650 648 639 638 642 643 631 609 593 589 570 514 451 435 460 472 448 431 459 507 536 550 573 586 563 522 512 540 559 540
-456 540 515 526 566 592 583 555 533 524 516 509 514 533 546 536 509 486 477 478 490 511 530 534 526 524 528 522 500 488 499 513 503 479 470 485 504 500 474 449 450 484 527 546
-461 546 527 493 478 499 540 565 547 499 471 488 517 507 463 439 463 498 510 511 522 531 525 524 547 567 553 523 518 536 542 536 548 581 595 577 560 568 584 579 561
-465 561 545 526 491 456 451 485 532 552 526 475 448 472 523 554 556 554 564 570 559 539 522 507 492 483 485 498 528 566 586 571 554 577 620 622 572 526 516 509 470
-470 470 434 448 490 500 471 446 436 418 394 402 449 487 484 468 488 532 551 534 532 578 629 611 517 434 436 502 553 554 535 521 505 490 494 503 473 406 373 413
-475 413 470 472 431 410 424 444 466 506 543 543 526 538 574 589 579 586 609 600 556 533 560 593 602 614 650 673 648 609 602 621 635 648 664 650 588 530 538 596
-480 596 635 623 584 545 512 498 510 522 504 474 482 524 548 531 512 530 571 593 576 532 492 483 505 517 488 442 433 468 502 508 508 527 540 509 445 404 422
-484 422 480 526 529 504 491 507 527 521 502 506 537 562 555 533 512 491 462 439 442 468 498 519 522 499 457 420 414 436 472 512 553 582 587 565 524 483 466 489 540
-489 540 586 600 585 559 539 531 529 516 484 455 454 475 485 479 488 527 563 566 548 541 539 528 526 568 638 677 655 601 554 519 489 473 479 488 480 466 476 512 544 544 524
-494 524 514 527 546 545 523 498 494 519 561 604 637 650 632 583 520 471 458 477 513 559 610 653 677 676 660 636 611 599 616 654 685 686 657 601 526 460 447
-498 447 499 568 598 584 562 549 535 522 526 535 527 508 514 545 558 537 522 533 535 496 451 456 500 533 536 531 527 511 492 498 523 536 529 525 530 529 533 565 605 583 481 374
-503 374 344 387 442 476 500 523 533 529 531 549 573 593 605 603 577 530 484 460 457 464 473 485 503 534 579 620 630 604 567 550 552 546 523 513 541 584 600 588 586
-508 586 598 587 536 492 502 544 564 560 570 590 575 525 501 538 600 644 676 702 693 632 562 540 562 575 561 545 545 550 543 525 504 493 507 541 560 546 532
-513 532 551 576 555 491 446 455 494 528 552 561 544 513 506 539 573 569 536 508 493 486 491 509 518 500 467 443 427 413 413 447 500 531 521 496 484 482 470 449 441 455
-518 455 470 461 427 396 395 418 447 477 514 548 556 537 521 530 547 544 523 504 495 495 501 505 487 445 418 442 502 552 580 605 630 626 589 554 544 540 518 498 516 566
$$ [...]
-1605D85
##END=	
##END=	
